##TITLE=Analysis number 321642
Compound Code cc 17412
Project Code adrs
Chemist Name fudan
##JCAMPDX= 6.0         $$ Bruker NMR JCAMP-DX V2.0
##DATA TYPE= NMR SPECTRUM
##DATA CLASS= NTUPLES
##ORIGIN= Bruker BioSpin GmbH
##OWNER= nmr
$$ XWIN-NMR		Version 3.5
$$ Mon Aug 21 09:24:55 2006 GMT Daylight Time (UT+1h)  MAYBRIDGE\nmr@NMR_250MHZ
##.OBSERVE FREQUENCY= 250.131544655141
##.OBSERVE NUCLEUS= ^1H
##.ACQUISITION MODE= SIMULTANEOUS (DQD)
##.ACQUISITION SCHEME= undefined
##.AVERAGES= 16
##.DIGITISER RES= 18
##SPECTROMETER/DATA SYSTEM= dpx250
##.PULSE SEQUENCE= zg30
##.SOLVENT NAME= DMSO
##.SHIFT REFERENCE= (INTERNAL, DMSO, 0, 16.522)
##AUDIT TRAIL= $$ (NUMBER, WHEN, WHO, WHERE, WHAT)
$$ ##TITLE= Audit trail, XWIN-NMR		Version 3.5
$$ ##JCAMPDX= 5.01
$$ ##ORIGIN= Bruker BioSpin GmbH
$$ ##OWNER= nmr
$$ C:\u/data/dgb/nmr/ADRS/1240/pdata/1/auditp.txt
$$ ##AUDIT TRAIL=  $$ (NUMBER, WHEN, WHO, WHERE, WHAT)
(   1,<2006-08-21 09:24:32.63 +100>,<MAYBRIDGE\nmr>,<NMR_250MHZ>,
      <created by zg, POWCHK disabled, PULCHK disabled
       configuration hash MD5:
       E2 DF 36 D8 04 B2 41 60 5A D7 A3 38 5A 4B D0 FE
       data hash MD5: 64K
       E3 EA 17 58 94 60 7A 38 AF 76 0B 59 D6 B0 BF 0F>)
(   2,<2006-08-21 09:24:45.68 +100>,<MAYBRIDGE\nmr>,<NMR_250MHZ>,
      <Start of raw data processing
       ef LB = 0.3 FT_mod = 6 PKNL = 1 SI = 32K 
       data hash MD5: 32K
       7A 17 C3 80 2B F1 B2 8E C1 48 44 51 07 06 CF 11>)
(   3,<2006-08-21 09:24:47.46 +100>,<MAYBRIDGE\nmr>,<NMR_250MHZ>,
      <apk 
       data hash MD5: 32K
       0A F3 61 86 8E 92 CE 82 CB B0 A6 98 1F 88 C3 C1>)
(   4,<2006-08-21 09:24:48.26 +100>,<MAYBRIDGE\nmr>,<NMR_250MHZ>,
      <abs ABSG = 5 
       data hash MD5: 32K
       2D 09 54 B0 97 10 4A BF B7 39 71 77 BD 07 50 C3>)
$$ ##END=
$$ 
$$ hash MD5
$$ AA C9 3E 97 A7 59 1A BC D1 80 3C 18 EF 50 0A 35
##$RELAX= 
##$RELAX= 
##$RELAX= 
##$RELAX= 
##$RELAX= 
##$RELAX= 
##$RELAX= 
$$ Bruker specific parameters
$$ --------------------------
##$DU= <C:\u>
##$EXPNO= 1240
##$NAME= <ADRS>
##$PROCNO= 1
##$TYPE= <nmr>
##$USER= <dgb>
##$AMP= (0..31)
100 100 100 100 100 100 100 100 100 100 100 100 100 100 100 100 100 100 
100 100 100 100 100 100 100 100 100 100 100 100 100 100 
##$AQSEQ= 0
##$AQ_mod= 3
##$AUNM= <au_zg>
##$AUTOPOS= <30 >
##$BF1= 250.13
##$BF2= 250.13
##$BF3= 250.13
##$BF4= 250.13
##$BF5= 500.13
##$BF6= 500.13
##$BF7= 500.13
##$BF8= 500.13
##$BYTORDA= 1
##$CFDGTYP= 0
##$CFRGTYP= 5
##$CHEMSTR= <none>
##$CNST= (0..31)
1 1 145 1 1 1 1 1 1 1 1 1 1 1 1 1 1 1 1 1 1 1 1 1 1 1 1 1 1 1 1 1 
##$CPDPRG= <>
##$CPDPRG1= <>
##$CPDPRG2= <>
##$CPDPRG3= <>
##$CPDPRG4= <mlev>
##$CPDPRG5= <mlev>
##$CPDPRG6= <mlev>
##$CPDPRG7= <mlev>
##$CPDPRG8= <mlev>
##$CPDPRGB= <>
##$CPDPRGT= <>
##$D= (0..31)
0 1 0 0 0 0 0 0 0 0.06 0 0 0 0 0 0 0.0002 0 0 0 0 0 0 0 0 0 0 0 0 0 0 
0 
##$DATE= 1156148671
##$DBL= (0..7)
120 120 120 120 120 120 120 120 
##$DBP= (0..7)
150 150 150 150 150 150 150 150 
##$DBP07= 0
##$DBPNAM0= <>
##$DBPNAM1= <>
##$DBPNAM2= <>
##$DBPNAM3= <>
$$ [...]
##$SUBNAM6= <"">
##$SUBNAM7= <"">
##$SUBNAM8= <"">
##$SUBNAM9= <"">
##$SW= 20.6930455092707
##$SWIBOX= (0..15)
0 0 3 0 0 0 0 0 0 0 0 0 0 0 0 0 
##$SW_h= 5175.983436853
##$TD= 65536
##$TD0= 1
##$TE= 295.16
##$TE2= 300
##$TE3= 300
##$TEG= 300
##$TL= (0..7)
0 120 120 120 120 120 120 120 
##$TP= (0..7)
150 150 150 150 150 150 150 150 
##$TP07= 0
##$TPNAME0= <>
##$TPNAME1= <>
##$TPNAME2= <>
##$TPNAME3= <>
##$TPNAME4= <>
##$TPNAME5= <>
##$TPNAME6= <>
##$TPNAME7= <>
##$TPOAL= (0..7)
0.5 0.5 0.5 0.5 0.5 0.5 0.5 0.5 
##$TPOFFS= (0..7)
0 0 0 0 0 0 0 0 
##$TUNHIN= 0
##$TUNHOUT= 0
##$TUNXOUT= 0
##$USERA1= <user>
##$USERA2= <user>
##$USERA3= <user>
##$USERA4= <user>
##$USERA5= <user>
##$V9= 5
##$VALIST= <valist>
##$VCLIST= <CCCCCCCCCCCCCCC>
##$VD= 0
##$VDLIST= <DDDDDDDDDDDDDDD>
##$VPLIST= <PPPPPPPPPPPPPPP>
##$VTLIST= <TTTTTTTTTTTTTTT>
##$WBST= 1024
##$WBSW= 4
##$XGAIN= (0..3)
0 0 0 0 
##$XL= 0
##$YL= 0
##$YMAX_a= 310381
##$YMIN_a= -485351
##$ZGOPTNS= <>
##$ZL1= 120
##$ZL2= 120
##$ZL3= 120
##$ZL4= 120
##$ABSF1= 16.522
##$ABSF2= -4.171173
##$ABSG= 5
##$ABSL= 3
##$ALPHA= 0
##$AQORDER= 0
##$ASSFAC= 0
##$ASSFACI= 0
##$ASSFACX= 0
##$ASSWID= 0
##$AUNMP= <proc_1d>
##$AZFE= 0.1
##$AZFW= 0.1
##$BCFW= 0
##$BC_mod= 0
##$BYTORDP= 0
##$COROFFS= 0
##$CY= 12.5
##$DATMOD= 1
##$DC= 0
##$DFILT= <>
##$DTYPP= 0
##$F1P= 14.0000005364418
##$F2P= -0.99999901652339
##$FCOR= 0.5
##$FTSIZE= 32768
##$FT_mod= 6
##$GAMMA= 0
##$GB= 0
##$INTBC= 1
##$INTSCL= 1
##$ISEN= 128
##$LB= 0.3
##$LEV0= 0
##$LPBIN= 0
##$MAXI= 10000
##$MC2= 0
##$MEAN= 0
##$ME_mod= 0
##$MI= 0
##$NCOEF= 0
##$NC_proc= -4
##$NLEV= 6
##$NOISF1= 0
##$NOISF2= 0
##$NSP= 0
##$NTH_PI= 0
##$NZP= 0
##$OFFSET= 16.522
##$PC= 1
##$PHC0= 138.593
##$PHC1= 4.170785
##$PH_mod= 1
##$PKNL= yes
##$PPARMOD= 0
##$PSCAL= 4
##$PSIGN= 0
##$REVERSE= no
##$SF= 250.13
##$SI= 32768
##$SIGF1= 0
##$SIGF2= 0
##$SINO= 400
##$SIOLD= 32768
##$SREGLST= <1H.DMSO>
##$SSB= 0
##$STSI= 32768
##$STSR= 0
##$SW_p= 5175.98343685301
##$SYMM= 0
##$S_DEV= 0
##$TDeff= 65536
##$TDoff= 0
##$TI= <Analysis number 999999
Compound Code 99
Book Reference 9
Project Code 9>
##$TILT= no
##$TM1= 0
##$TM2= 0
##$TOPLEV= 0
##$USERP1= <user>
##$USERP2= <user>
##$USERP3= <user>
##$USERP4= <user>
##$USERP5= <user>
##$WDW= 1
##$XDIM= 32768
##$YMAX_p= 328712966
##$YMIN_p= -144904
$$ End of Bruker specific parameters
$$ ---------------------------------
##NTUPLES= NMR SPECTRUM
##VAR_NAME=  FREQUENCY,     SPECTRUM/REAL,   SPECTRUM/IMAG
##SYMBOL=    X,             R,               I
##VAR_TYPE=  INDEPENDENT,   DEPENDENT,       DEPENDENT
##VAR_FORM=  AFFN,          ASDF,            ASDF
##VAR_DIM=   32768,         32768,           32768
##UNITS=     HZ,            ARBITRARY UNITS, ARBITRARY UNITS
##FACTOR=    0.157963299565203, 1,           1
##FIRST=     4132.6476996994, 0,             0
##LAST=      -1043.33573715361, 0,           0
##MIN=       -1043.33573715361, -144904,     0
##MAX=       4132.6476996994, 328712966,     0
$$ Real data points
##PAGE= N=1
##DATA TABLE= (X++(R..R)), XYDATA
$$ [...]
17632I85987O452k6854k0488k248K2131j755M7779M8091J8692N3161O5462j5226
17620A181184k876M6073M1953K6606J4154o179j5840K5631M7459j3402J7775J7494
17608A380032M7696J4809K8583M6541M7325m97L6560K3874l8317O732N2334m37
17596A645235J7371K3110j4535r007J3281l27K673J1513M1721M8426Q446K7147
17584A815054N0147O3194K3467r766L3122R1174O5570N5977O2705Q9710J31051
17573B471405J40134J42922J41915J60019J64071J49571J76243K97175L00541
17564D143996K98537L40526M10634M37703N19945O35884P35307P59609Q52235
17555I134376R37542R61186J021801J063529J132781J169674J287431J521724
$$ y = [985987, 992439, 965585, 945097, 942849, 964980, 963225, 1011004, 1059095, 1077787, 1130948, 1196410, 1181184, 1178308, 1224381, 1266334, 1292940, 1307094, 1300915, 1285075, 1310706, 1358165, 1344763, 1362538, 1380032, 1427728, 1442537, 1471120, 1517661, 1564986, 1564489, 1601049, 1624923, 1586606, 1593338, 1645672, 1645235, 1662606, 1685716, 1671181, 1662174, 1675455, 1675128, 1677801, 1689314, 1731035, 1779461, 1787907, 1815054, 1865201, 1928395, 1951862, 1942096, 1975218, 2066392, 2131962, 2187939, 2250644, 2340354, 2471405, 2611539, 2754461, 2896376, 3056395, 3220466, 3370037, 3546280, 3843455, 4143996, 4442533, 4783059, 5193693, 5631396, 6151341, 6787225, 7522532, 8282141, 9134376, 10071918, 11033104, 12054905, 13118434, 14251215, 15420889, 16708320, 18230044]
17547A8230044J840527K300652K968486L670444M523082N371012N902319N907614
17539E0714180N454260M748475L967539K953236J469275j70080j612385k535691
17531F4988809k967832l106267l084040k974932k856942k751925k623999k447517
17523D2175355k388772k381775k360005k259351k176367k064529j903345j698793
17515B4942418j521048j378984j143497r88842q11442o37510n11427l48627k11268
17506A7389773m2382J15491L17244M69280O89307R49543J151058J358305J571524
17497B3969143J701502J850816J955952K073683K167166K239318K428517K626720
17489D1012817K961850L303774L688478M051902M078930L650934K785522J721723
$$ y = [18230044, 20070571, 22371223, 25339709, 29010153, 33533235, 38904247, 44806566, 50714180, 56168440, 60916915, 64884454, 67837690, 69306965, 69136885, 67524500, 64988809, 62020977, 58914710, 55830670, 52855738, 49998796, 47246871, 44622872, 42175355, 39786583, 37404808, 35044803, 32785452, 30609085, 28544556, 26641211, 24942418, 23421370, 22042386, 20898889, 19910047, 19098605, 18461095, 17949668, 17601041, 17389773, 17347391, 17462882, 17780126, 18249406, 18938713, 19888256, 21039314, 22397619, 23969143, 25670645, 27521461, 29477413, 31551096, 33718262, 35957580, 38386097, 41012817, 43974667, 47278441, 50966919, 55018821, 59097751, 62748685, 65534207, 67255930]
17481F7255930O49913m19551j699909l053084m204715m782291m770446m515352
17473D4460495m068115l577861l098345k655979k210384j915727j714228j523436
17465B3696420j425123j319618j256058j225400j140515j118822r63816r10938
17457A4336130q79966p68011p08939o56345n94055n47188n02695m29137m21459
17448H828335l66796l36606l45511k69896l01737k91115j93656k02124k12988
17439F307906j95823k10020k06862j90960j78626j66620j42466j37000j38880
17430D740649j28668j18422j60075j34282j25329j11935j20268j04634j01421
17421C635615n4290r3447j29295j15596p4782r8500r3784l9361q4726o0314m7292
$$ y = [67255930, 67905843, 67486292, 65786383, 62733299, 58528584, 53746293, 48975847, 44460495, 40392380, 36814519, 33716174, 31060195, 28849811, 26934084, 25219856, 23696420, 22271297, 20951679, 19695621, 18470221, 17329706, 16210884, 15247068, 14336130, 13456164, 12688153, 11979214, 11322869, 10728814, 10181626, 9678931, 9249794, 8828335, 8461539, 8124933, 7779422, 7509526, 7207789, 6916674, 6723018, 6520894, 6307906, 6112083, 5902063, 5695201, 5504241, 5325615, 5158995, 5016529, 4879529, 4740649, 4611981, 4493559, 4333484, 4199202, 4073873, 3961938, 3841670, 3737036, 3635615, 3581325, 3487878, 3358583, 3242987, 3168205, 3069705, 2975921, 2936560, 2851834, 2791520, 2744228]
17410B744228j08381j02844l4912n5284r2740q9527l5781j497l4726o6466k6034
17399B096036n0679j03763n0500l6795j2190p804l1201j9266j2909p6342m1184
17388A653403K372m2085K483K5124j3366K4364R963j0570l9243m0124L6185N2333
17376A660839J277m3149n6827m4499m2161p7460p1214o0744l1441n3272j5968
17365A165381l5446o9613m6356j4380j545k3009k5370K729n4598r4684l911r562
17353G89636k6544j9734M4005K2856J0173m4300m5106l3822N902m50M1044L6148
17341G79808m483j8731k1681K0262J6546k8254j0692n707Q5k839j0432J733K940
17328G18555j3831L5930J8794j8541J4068k934J5560k3591M0214j9764K6609n312
$$ y = [2744228, 2635847, 2533003, 2498091, 2442807, 2350067, 2260540, 2224759, 2223262, 2188536, 2122070, 2096036, 2045357, 1941594, 1891094, 1854299, 1842109, 1834305, 1803104, 1783838, 1770929, 1694587, 1653403, 1655775, 1613690, 1616173, 1641297, 1627931, 1652295, 1662258, 1651688, 1612445, 1572321, 1608506, 1660839, 1662116, 1618967, 1562140, 1517641, 1475480, 1398020, 1326806, 1266062, 1234621, 1181349, 1165381, 1129935, 1060322, 1013966, 999586, 998041, 975032, 949662, 952391, 897793, 803109, 799198, 789636, 763092, 743358, 787363, 810219, 820392, 776092, 730986, 697164, 703066, 702616, 743660, 779808, 775325, 756594, 734913, 755175, 771721, 743467, 732775, 727068, 727153, 724314, 713882, 715615, 718555, 704724, 740654, 759448, 740907, 754975, 752041, 767601, 744010, 784224, 764460, 791069, 785757]
17316G85757k0068j3406j8519m7139m9276n9000j9566l9107l7592j5713j4557
17305D51814J045K0503j2777o625K6671j7138K199l1757m1275j6134k508l363
17293C70655j0312m65k7017m8819k1956j1819K6716N2609k3145q122L4116L8471
17281C70912l8570m4861l0112q815L42L8129L5640k7873j7289n713k4704M2226
17269B89312J2679l5919K17j7748l1215K0342O012n2447M947J9057j7829j1002
17257A86406K2305K4789j0337l6064j203N4631J7940k9663n3492k440L6619L932
17245B13423l378l4915r344K3742K8269K3549k0528K046K1222m236o584j350J8131
17232B50047m742M0134p473l3885k4142n1237j8434K6386M251N3368O255j8233
$$ y = [785757, 765689, 752283, 733764, 686625, 637349, 578349, 558783, 519676, 482084, 466371, 451814, 452859, 473362, 460585, 453960, 480631, 463493, 465692, 433935, 392660, 376526, 374018, 370655, 360343, 359878, 332861, 284042, 262086, 250267, 276983, 329592, 306447, 298325, 332441, 370912, 332342, 287481, 257369, 248554, 248896, 287025, 322665, 294792, 277503, 271790, 247086, 289312, 301991, 266072, 266289, 248541, 217326, 237668, 243680, 191233, 196180, 215237, 197408, 186406, 208711, 233500, 223163, 187099, 185896, 240527, 258467, 228804, 175312, 172872, 209491, 213423, 210045, 175130, 165786, 189528, 217797, 241346, 220818, 222864, 244086, 239850, 233266, 231916, 250047, 245305, 285439, 277966, 244081, 219939, 168702, 150268, 176654, 180905, 234273, 240528, 222295]
17220B22295N489m780K2481P900J3488L679P881n592P146K0607K7515l0908l8157
17207B59044L0879L4801k7778l566M3748K167k8524j8097p521m3381J4214M5185
17195C01171k2004k8776O178J9465q044J6969j2206J0844q697l0459k0322R613
17183B33732K966Q859K5364J1435j4636m4501l2468j9149J314J4748K1409k9555
17171A79518j112K979r051j3955o71J9749K0993L4475L3271K1112J0965k0241
17159B78032j3577j9547j3018J4773K5234K1249l4386k822j19L3135R930m6797
17147B52087l5819j4089p456j3761j2656R400K2611J914o449m839K5052j6502
17135A99493n7587q698N2052L9649K2756j1868j5290j5264m8199m1826K5269K2028
$$ y = [222295, 227784, 223004, 245485, 253385, 266873, 270552, 278433, 272841, 279987, 300594, 328109, 297201, 259044, 289923, 324724, 296946, 293380, 337128, 339295, 310771, 292674, 285153, 241772, 255986, 301171, 279167, 250391, 256569, 276034, 267990, 284959, 272753, 283597, 274900, 244441, 224119, 233732, 236698, 245557, 270921, 282356, 267720, 223219, 190751, 171602, 172916, 187664, 209073, 179518, 178406, 181385, 172334, 158379, 157708, 177457, 198450, 232925, 266196, 287308, 298273, 278032, 264455, 244908, 231890, 246663, 271897, 293146, 258760, 255938, 255819, 288954, 298884, 252087, 216268, 202179, 194723, 180962, 168306, 177706, 200317, 202231, 195782, 190943, 215995, 199493, 141906, 133208, 185260, 224909, 247665, 235797, 220507, 205243, 157044, 115218, 140487, 162515]
17123A62515k717j4402K3317j1262n0695J7505k1655Q32K6818J748j171J7017
17111A47850J1692l0517k4326p073J9316n986J4690j673k9530l3809J9046M3481
17099A23161L9377k2265j6462k6438N524K0705J6537O106P508m058P97j773m5722
17086A02997j3102R87M8594j7952m5375K6398J7373Q435K2587J1297j240L708
17074A64707J7606o6074q073q127K9880L8716q189k0133k853M6168J2323K4829
17062B20780m0087k4873P082J1830j8974k6001J3283J1789M895M0991N6099k521
17050B54293L1584r025k4258p43N36L0180J9356j1745j3679J1864J0508J333J9633
17037C19837K8157j2504p676M9186K8120n1021j7168L3849J8454j0835j2033R261
$$ y = [162515, 159798, 145396, 168713, 157451, 106756, 124261, 102606, 103438, 130256, 132004, 130833, 147850, 159542, 129025, 104699, 97626, 116942, 110956, 125646, 123973, 94443, 60634, 79680, 123161, 162538, 140273, 123811, 97373, 102897, 123602, 140139, 146245, 153753, 149695, 150492, 148719, 102997, 89895, 90882, 139476, 121524, 76149, 102547, 119920, 128355, 150942, 162239, 160999, 164707, 182313, 116239, 108166, 100039, 129919, 168635, 160446, 140313, 137460, 183628, 195951, 220780, 180693, 155820, 162902, 174732, 155758, 129757, 143040, 154829, 159724, 200715, 256814, 254293, 285877, 276852, 252594, 251851, 252387, 282567, 301923, 290178, 276499, 288363, 298871, 300204, 319837, 347994, 335490, 327814, 377000, 405120, 354099, 336931, 370780, 389234, 378399, 366366, 375627]
17025C75627N956P11r088j244R548l4629k1076M9737M4176j8108K9400K3007L4381
17012D88398K596o03R5996J59676J54202J77840K44705L36311N20998O89506P92476
17001C662101O51583L79424K50562L36191K24939j60417n01234o61238n51124
16992C630787m75472m08138l53509k61415k50959k24398j45900j21178j24893
16983A264925q1505r1590p3929l2901o8276l0176M1223r731l1353o5771q2519
16972G38397l5265l9748m7961k9623k0941r590p404k2734n3645p675Q485K5102
16960D97398j1816l8698l4502l8777l2497j3650L4407J3313n6108l5626J2102
16949B95546L4303k9803j6137m7941k0819l9256J2068J4475K55K1481L952N596
$$ y = [375627, 381583, 382294, 373206, 371962, 381510, 346881, 325805, 375542, 419718, 401610, 431010, 454017, 488398, 490994, 490391, 586387, 746063, 900265, 1078105, 1322810, 1659121, 2180119, 2869625, 3662101, 4313684, 4693108, 4943670, 5279861, 5504800, 5344383, 4843149, 4181911, 3630787, 3155315, 2747177, 2393668, 2132253, 1881294, 1656896, 1510996, 1389818, 1264925, 1183420, 1091830, 1017901, 985000, 916724, 886548, 927771, 918040, 886687, 820916, 738397, 703132, 663384, 615423, 585800, 564859, 555269, 547865, 525131, 471486, 463811, 472296, 497398, 485582, 446884, 412382, 373605, 341108, 327458, 361865, 375178, 319070, 283444, 295546, 329849, 300046, 283909, 235968, 215149, 175893, 187961, 202436, 202691, 224172, 228124, 233720]
16937B33720l6994R097J2431k8988j4364K2652J8058L617l1924k0484J9315l903
16925A82233k3490L0690L242j602L922j3667n7991m5168L7663K7600M9200J8046
16913B10678k4005j7975j0227m565O812P318J2982J8226k5472k7796j5292k9036
16901A01648k55j8359L965L6130j0632J6299L323j537J8345K1067K5194m3800
16889A51388j9011m493J2459l1510l2688J4765K5777J4038j286k7181k7341K2440
16877I7357J5218K0962Q859o862k3895j6220j0021k4639k262N7L8450J2197L2003
16864A41204q544j8400k6130k9477j114k3615K5220K5279k9774j6474l3678L063
16852G560k340N0136J017j3191j369L7291J3741m2701K729R773K703j0536J5984
$$ y = [233720, 196726, 205823, 218254, 189266, 174902, 197554, 215612, 219229, 187305, 166821, 186136, 182233, 158743, 189433, 192675, 191073, 194995, 181328, 123337, 78169, 115832, 143432, 192632, 210678, 186673, 168698, 158471, 153906, 160718, 168036, 181018, 199244, 173772, 145976, 130684, 101648, 101393, 83034, 86999, 123129, 112497, 128796, 132119, 130582, 148927, 169994, 195188, 151388, 132377, 127884, 140343, 108833, 76145, 90910, 116687, 130725, 129439, 102258, 74917, 97357, 112575, 133537, 142396, 135534, 111639, 95419, 85398, 60759, 58497, 58554, 97004, 109201, 141204, 132660, 114260, 88130, 58653, 57539, 33924, 59144, 84423, 54649, 38175, 4497, 7560, 5220, 55356, 56373, 43182, 41813, 79104, 92845, 50144, 52873, 62646, 65349, 54813, 70797]
16839G0797J0086l3073m816N036j6536K2168K3797L369O737K2236l489k1033L1603
16826A16882k5583k9351R043n251j2095R249k5303n393k5145J05K4375P261r05
16813C7889k7247J8272L975l21K6663J3549K2105j0768l5547l555K0808m3424
16801B2399J9544Q812m4132J1967K0651j1108j7821k7527J9059K7463Q867P951
16789D6125j0869j5633j6972L936L0951K0841M1223L534K4261k5896j8897m0873
16777D1731J6456L3122j9158L3895J1523J4594J4622J4743j1475o4699j8973M343
16765G0724j051K7429Q561r359n2037K0070J1481O681p04m2145m5301n550J8072
16752F871O030K9832L3492j4594j4546K1188P640m7158L33L759L378k7795J9597
$$ y = [70797, 80883, 47810, 42994, 48030, 31494, 53662, 77459, 80828, 87565, 109801, 106312, 85279, 116882, 91299, 61948, 70991, 65740, 53645, 62894, 37591, 32198, 7053, 7158, 31533, 38794, 37889, 10642, 28914, 32889, 32568, 59231, 72780, 94885, 84117, 48570, 45015, 65823, 22399, 41943, 50755, 6623, 18590, 39241, 28133, 10312, -17215, 1844, 29307, 38174, 46125, 35256, 19623, 2651, 6587, 37538, 58379, 99602, 103136, 127397, 101501, 82604, 41731, 58187, 91309, 72151, 106046, 117569, 132163, 146785, 161528, 150053, 85354, 66381, 70724, 69673, 97102, 105663, 96304, 44267, 64337, 75818, 82499, 81795, 39650, -5651, -11201, 6871, 12901, 42733, 76225, 61631, 47085, 68273, 75913, 28755, 29088, 32847, 36225, 8430, 28027]
16739B8027J9284n392K0787J3187r64j8931k7564L790l0492j6384O545N5960J3602
16726F1455k5046j1822k645K2910K0619M0718j817l9541k9134l8839M5500M9743
16714I2101L801K023k0863Q330j2787n4161l3920L6974K8207j1543j4002R870
16702C4030k7304J5618M3629l4336k2754J6942k902L430l9998n528L7979J5929
16690C4735k3503J5802K5285l920l2769l3458r588n943K9845J0963K9103j8569
16678A7983l9049j3585O0110J3161j2950k671k9104L2566J2394m3087l8506l586
16666d6324L4475p410M616P244k932P884K5613J3805J4296R71l1057K2788J6414
16653F0383K3621P831k0571l8112R949L0114N666P2517L0935J8338L4539J8173
$$ y = [28027, 47311, 41919, 62706, 75893, 74929, 55998, 28434, 32224, 1732, -14652, -8107, 47853, 61455, 36409, 24587, 21942, 44852, 65471, 106189, 104372, 64831, 35697, -3142, 42358, 92101, 95902, 97925, 77062, 85392, 72605, 18444, -15476, 21498, 49705, 38162, 24160, 34030, 6726, 22344, 65973, 31637, 8883, 25825, 22923, 26353, -13645, -19173, 18806, 34735, 11232, 27034, 52319, 48399, 15630, -17828, -27416, -33359, -3514, 7449, 36552, 17983, -21066, -34651, 25459, 38620, 25670, 22999, -6105, 26461, 38855, -4232, -42738, -46324, -11849, -19259, -14643, -7399, -10331, -2447, 23166, 36971, 51267, 52238, 21181, 43969, 60383, 84004, 91835, 71264, 33152, 43101, 73215, 78881, 151398, 182333, 200671, 235210, 253383]
16641B53383L2802P4499M6683J5557j8673j2971n4471m3540l3210k3367l8068
16630A98624k7753j2233j9057N657l302M104k0983m6067q049q268K6482k464J7870
16617A04561k8245k0630L065M0656L940j5868K670J9988j4408k1462l0584J7888
16605F1571l5937j6393J2069K384J5353J7896J4594k0575J398k7100n13L6515
16593F1262L287k425j0720l3650j5375j5371o452q04R443q83J786r552j8086J1280
16579b6260K9241J7007j4702K2717O7150K6055l5918r779M384J281l4397J2952
16567E9731q497n276k3292L862K4979k9190l5860J7353L7336j6223k1856k8188
16555b5121J3758M3020q876l828J0755L4320J3270j5905n3179m4071K0332M6721
$$ y = [253383, 286185, 360684, 407367, 422924, 404251, 391280, 336809, 293269, 260059, 236692, 198624, 170871, 158638, 139581, 145238, 141936, 146040, 125057, 78990, 70941, 62673, 89155, 86691, 104561, 76316, 55686, 58751, 99407, 103347, 87479, 90149, 110137, 95729, 74267, 43683, 61571, 25634, 9241, 21310, 23694, 39047, 56943, 71537, 50962, 52360, 25260, 24747, 61262, 64549, 62124, 51404, 17754, 2379, -12992, -19444, -20248, -10805, -11688, -9902, -19454, -37540, -26260, 2981, 19988, 5286, 28003, 95153, 121208, 85290, 75511, 79895, 81176, 46779, 59731, 51234, 45958, 22666, 26528, 51507, 22317, -13543, 3810, 41146, 24923, 3067, -25121, -11363, 31657, 22781, 18953, 29708, 64028, 77298, 61393, 8214, -35857, -15525, 31196]
16543C1196K018o731J22l7735j1087K3797L6003L905k6276k2353J7365k7623j4869
16530c2268j4484L0656N2359J4783j3073l5657K4307K2715k4630k5915M1192L0428
16518G0413l8628l1781j0623k112j4886P526J977M6830j7737m9891J6553M5942
16506B3583j8184j2797J7593K4875L9145j3164N595J1110n1489m4708k8278K206
16494d4513K7581J3862N3248O6447o880n2763j418j2435J8035j0678l1824J4542
16482C3204j0815l643k7887o648K8528M6870O613m0796m1357j0344j68jj6277
16469d2721R025L1577N871P179j6973J9979K990k9130r459K1025p823k9929n605
16456d3994O603m2645N267L3439Q349J0718k545k8509J3547L6508K1244J1577
$$ y = [31196, 33214, 26483, 26605, -11130, -22217, 1580, 37583, 41488, 15212, -7141, 10224, -17399, -32268, -46752, -16096, 36263, 51046, 37973, 2316, 26623, 49338, 24708, -1207, 39985, 70413, 31785, 4, -10619, -12731, -27617, -20091, -18114, 28716, 10979, -38912, -22359, 23583, 5399, -7398, 10195, 35070, 74215, 61051, 66646, 77756, 26267, -18441, -46719, -44513, -16932, -3070, 50178, 116625, 109745, 56982, 55564, 43129, 61164, 50486, 18662, 33204, 22389, 18746, -9141, -15789, 12739, 59609, 66222, 25426, -15931, -26275, -26443, -26444, -42721, -33696, -2119, 3752, 10931, -6042, 13937, 16927, -12203, -21662, -637, -8460, -38389, -43994, -37391, -80036, -74769, -41330, -32981, -22263, -24808, -53317, -39770, -3262, 17982, 29559]
16444B9559o542k9641k1886L3951K2136K4576k87k9372j7362Q556J9084l3003
16432b31q846K1487j7738j8175J1957K1291j7999l0481K7804L4573o880O194l5574
16419a2618J6715O1920N760j4593l1715J6648l0625m2483L4255j8192k0708M239
16407c1397M2018J2159m6178M797J4051j1391k8792l988n783K0522N2586Q988
16395B7592m6778M486K6195k3176J191J4920P66K7824N190n30l2042o312L29j0761
16381a1106j2179Q699J9168q625p66l4936J3423Q340j1284j9299j2298k5406N366
16368h0903j5327L3806M2149L734R889O5026o4n8882k1306l1352o355J2951K9111
16355a7523K5494J5669j2828o632k7173J024k113J7208p151M193n802r597J3167
$$ y = [29559, 23017, -6624, -28510, 5441, 27577, 52153, 51866, 22494, 5132, 13688, 32772, -231, -9077, 12410, -5328, -23503, -11546, 9745, -8254, -38735, -10931, 23642, 16762, 22956, -12618, 4097, 66017, 71777, 57184, 25469, 42117, 11492, -30991, 3264, -14928, -35636, -31397, 10621, 22780, -23398, -18601, -4550, -15941, -44733, -48721, -54504, -33982, 18604, 27592, -19186, -14700, 11495, -11681, -10490, 4430, 5196, 33020, 38210, 37680, 5638, -674, -345, -11106, -23285, -14586, 4582, -4043, -4809, -39745, -26322, -17982, -29266, -48565, -60863, -86269, -80903, -96230, -62424, -20275, -16541, -6652, 58374, 58310, -572, -21878, -53230, -59585, -46634, -17523, 7971, 23640, 10812, 4180, -22993, -21969, -24082, -6874, -14025, -9832, -15634, -25231, -12064]
16342a2064N258j6228K5901M8643j1926K1986J0313L8449J226q916O901l6817
16330G2726m0290P505O4J7868j0168Q792l741j1544j432K6553O901j7676k6244
16317B9314q584j9371q239M21n954J0192k4744m5667K1727J7895k4156J4509K0948
16304b1709K3151K159r744j0528R302q971o321J1822j5927R381L2110o756j6451
16291h482R900P810R865K605l0330k9553l396K3233O96j9621j2811j1330N654
16278e5760L1959N0558L3462j1177p529l6827l6147j1439l521J7504L9738r110
16266A711L2572K1316K5832j1227o4828l8865L7757j5329k3104M4214J1666m213
16254A7502K0524Q739k4185j1623l2013M651m326J0841K0460q816k5274N536J719
$$ y = [-12064, -6806, -23034, 2867, 51510, 39584, 61570, 71883, 110332, 111558, 102642, 109543, 72726, 32436, 39941, 40005, 57873, 47705, 56497, 52756, 41212, 39780, 66333, 73234, 55558, 29314, 20730, 1359, -6880, -6459, -12413, -2221, -26965, -72632, -50905, -33010, -57166, -42657, -21709, 1442, 3601, -6143, -16671, -7369, -16340, -22661, -10839, -26766, -17385, 14725, 7969, -8482, 1418, 9228, 19093, 21698, -8632, -38185, -41581, -18348, -17652, -37273, -50084, -61414, -55760, -23801, 26757, 60219, 49042, 41513, 4686, -31461, -42900, -46421, -28917, 10821, 1711, 34283, 55599, 81431, 70204, 5376, -33489, 4268, -11061, -34165, 10049, 21715, 17502, 38026, 46765, 22580, 10957, -21056, -16405, -20731, -9890, 10570, 1754, -23520, -17984, -16265]
16241a6265l172J3832J4114L7053J3173l5106l8964m1801N508K9044J0984K0681
16229I081L874l0983k3771J0721K1290O026j1923K260J8720R897Q99M589J9999
16216D0679P360j065m7485k1342j9917j4043n640K7036p922j7245k2090L353k
16203g8323K6370j100K3941j5478l3065N5038l468j1206N8210M404k3094R461
16191A1690P452L656K032n912n859k6359k4591j153K5992M9628q91l0038k9246
16178b3599J210P192L4734K0619l9178m8752M746j611K2260L882R768k0264j614
16165c0607K6684P594J1765j6227L0j1686m092J4369Q498n20J0129J4526q504
16152B1959k9659n5594o839O730N5903L8456j263j0387l565P973Q737j7571O59
$$ y = [-16265, -19437, -5605, 8509, 45562, 58735, 23629, -15335, -57136, -51628, -22584, -11600, 9081, 12955, -18028, -41799, -31078, -9788, -3762, -15685, -13425, 5295, 15192, 16091, 20680, 40679, 48039, 46974, -511, -21853, -41770, -55813, -61453, -34417, -42339, -59584, -81674, -78321, -78323, -51953, -53053, -29112, -44590, -77655, -22617, -26085, -37291, 20919, 25323, 2229, 11690, 19142, 22798, 24830, 18918, 13059, -13300, -37891, -39044, -13052, 36576, 35685, 5647, -23599, -22389, -15197, 19537, 40156, 978, -47774, -43028, -44639, -22379, -18497, -8729, -28993, -30607, -3923, 3671, 15436, -791, -761, -12447, -16539, -2170, 6328, 5808, 15937, 30463, 21959, -7700, -63294, -70133, -63403, -7500, 30956, 29693, 19306, 15741, 23714, 32451, 14880, 15539]
16139A5539P430k0151l8529K70j50J7783J8070j5403J2397p051M852K1192o236
16126A0013j6429l2284K6937M2302p668j226O879l3254k0922k177L1471j795K0946
16113B2793m942k4471j274j8100q657K0185J385J9035J1489R520j5806k6491J0676
16100d658L2089J7485J4756j9856l2566L83J1268L0998p144k0915J7250O345j3472
16087C1963l959l1455L707J3200j7747J4373J9425k6956k9143K1951K5427j666
16075A9120l1448k0881K1452R130J6965q3k4065j546J4867L0828J6837j7642l3130
16062D04r733M325n540J7107j8368J152k7539l703J7945j9834j4273J1239M7078
16049B60R086o058Q395j480j1266m958R272j6206L610J8089K314j414r146k268
$$ y = [15539, 22969, 2818, -35711, -35441, -35591, -17808, 262, -15141, -2744, -9795, -4943, 16249, 10013, -6416, -38700, -11763, 30539, 22871, 21645, 28524, -4730, -25652, -27829, 3642, 1847, 22793, 17851, -6620, -7894, -25994, -34651, -14466, -13081, 5954, 17443, 26963, 11157, -15334, -4658, 27431, 44916, 59672, 39816, 7250, 7633, 18901, 49899, 42755, 21840, 39090, 45435, 31963, 28004, -3451, 256, 13456, -4291, 10082, 29507, 2551, -26592, -4641, 20786, 19120, -12328, -33209, -11757, -2627, 14338, 14255, -9810, -11356, 3511, 34339, 51176, 33534, 404, -9329, -5004, -10544, 6563, -11805, -10653, -38192, -41895, -23950, -43784, -58057, -46818, 260, 9346, 3288, 11683, 10203, -1063, -6021, 3251, -12955, -9345, 8744, 11058, 9644, 498, -1770]
16035a770K814j7313O56o566k805M2200J0402k3874N532m1746l6578K9173K455
16022c7420N6301K0199o736j1762j684Q370k7876J0065J4316k1108J7414j266
16010A8813K2368m061l9220j1395L3830k3091J0452J0858j9334q616M091l4749
15998d0054j852J32L2770J5601j3624l3593n045J1759L680J1765k0086k4964r560
15985g3071P478K1976k0297N3022K7290m6317l3477J0332q950J7079K2050K1485
15973a400K3089J0073n210j0629j7221J1372j1299k266K2118j3862l1426k0560
15961d7221P480K5791k8842q274M5283K1513j6622l4578j7307L5948K0269M898
15949H338j9755J9501K9980K0392%l6253J972n000k0155J8434J8021Q448L1299
$$ y = [-1770, 1044, -16269, -15613, -22179, -24984, 17216, 27618, 3744, 9276, -32470, -69048, -39875, -37420, 18881, 39080, 32344, 20582, 18898, 27268, -608, 9457, 23773, 2665, 20079, 18813, 41181, 37120, -2100, -13495, 20335, -2756, 7696, 18554, -780, -9396, -5305, -40054, -41906, -41774, -9004, 6597, -7027, -40620, -45665, -33906, -30226, -18461, -38547, -63511, -73071, -65593, -43617, -63914, -10892, 16398, -29919, -63396, -53064, -62014, -44935, -22885, -1400, 21689, 31762, 26552, 15923, -1298, 10074, -1225, -3491, 18627, 4765, -26661, -47221, -39741, -13950, -42792, -51066, -5783, 15730, -892, -35470, -52777, -16829, 3440, 8338, -11417, 8084, 38064, 58456, 58456, 22203, 24175, 19175, -980, 17454, 35475, 43923, 75222]
15936G5222l7937m0808J235K0313J867l359j2845l606N435j2383J986J3413J1190
15923A9723j1748J1797J3846J894j3154j6622j0156l895M4139K5245l8683k3402
15911a016K057J1824l5151l963r230J2640J7357J159J2732m2355n6261j0378L7988
15898f2597L0663K6205K7201j0925q974m011J2259L7992j4572k4284M603R254
15886B2814o912j0933k691j629K5043j1275j7125k6292J9905m968l1174j7023
15874f2260K7063M2752k4198l4128l1812j8475M140K5830K9976j7167L7081J6655
15862d543M970K2959R242N718k4261J4976m8283l0478j2636J285L8846J0956L5388
15849B4139J9565J8792N710j4670j9824n2117j058K2398K8470L2323K562k6767
$$ y = [75222, 37285, -3523, -2288, 18025, 19892, 16533, 3688, 82, 5517, -6866, -4880, 8533, 19723, 7975, 19772, 33618, 35512, 22358, 5736, -4420, -8315, 35824, 61069, 22386, -1016, 1041, 12865, -22286, -26249, -35479, -22839, -5482, -4323, 8409, -33946, -90207, -100585, -62597, -31934, -5729, 21472, 10547, 1573, -2438, 9821, 47813, 33241, 8957, 13560, 22814, 15902, 4969, 2278, 649, 25692, 14417, -2708, -29000, -9095, -14063, -45237, -62260, -35197, 7555, -16643, -50771, -82583, -101058, -96918, -71088, -41112, -58279, -21198, -4543, 427, 23386, 32628, 38346, 14085, 29061, -19222, -49700, -62336, -61051, -22205, -11249, 24139, 43704, 62496, 68206, 53536, 33712, -18405, -19463, 2935, 31405, 63728, 66290, 39523]
15837C9523l6824l165M724J6910k0315j4151j4436J0647l88M465p042l9695K1189
15824c8558L0699l1384R823r208l9716K5213J1967J2805O492L8045N8026j8917
15812E5287r4458j8752N103J3629L3557J3816k3367l5868J2560L9489Q553j9030
15800i481P67j5397R45P149j3407j9014j1959K1096L0952j7331k0629k9509J1692
15787f4126P438M4100k2907k1720L3323K4231L9738k6060J1708J8335j1642j3951
15775A8467j6479m449k234O152m585J1766K2951K3927j4759l6777l0886J213L6906
15762A1213J1143k6219L171M602m2539j2568l205J1560l256m142J0704M0666j4397
15749a3267J1440j5299q801k6138r301L0457L3694K5579K9843J2023k5702p008
$$ y = [39523, 2699, -466, 4258, 21168, 853, -13298, -27734, -17087, -17475, -13010, -20052, -59747, -38558, -7859, -39243, -29420, -38628, -78344, -53131, -41164, -28359, -21867, 16178, 74204, 55287, -39171, -57923, -52820, -39191, -5634, 8182, -15185, -51053, -38493, 996, 9549, -9481, -8714, -24111, -23166, -16017, -29424, -48438, -60397, -39301, -8349, -25680, -46309, -75818, -64126, -56688, -12588, -35495, -57215, -23892, 339, 40077, 14017, 25725, 44060, 32418, 18467, 1988, -2461, -4695, 1457, -3128, 8638, 31589, 55516, 40757, 3980, -26906, -25693, 11213, 22356, -3863, -692, 3910, -38629, -51197, -54402, -42842, -46098, -50240, -39536, 1130, -13267, -1827, -17126, -25927, -52065, -61366, -30909, 2785, 28364, 58207, 70230, 44528, 37520]
15737C7520N4774K3939J3790K8332m3258m4798j9898K2112j3285j6359Q341l94
15725E0816N604j2818n4227m9366P759N8577M9692m4928M909J074j3455j6310
15713a2673k0339j1004P021j7338K284j779p435J9625J0823J5384K5449j8856
15701h838J1665J1898p419P974n13j3542p336j4361L640J6681K5094N1991Q289
15688H5223k0716k2986l722j0571J2891k4800n82P936k1010p588J270K7305j2671
15675I979J2974O667l607p899j9467q936j0673L388r732M228k393j7863k512J7265
15661b8581Q403J4416L3707r595m0161m51K7560L1576j4335l2437J1717K2003
15649B3822k5269J2167J7943M32j4983q290l5590k8902R775L8927K7582J3862
$$ y = [37520, 92294, 116233, 130023, 158355, 115097, 70299, 50401, 72513, 59228, 42869, 51210, 50816, 56420, 43602, -10625, -59991, -52232, 6345, 56037, 11109, 16018, 17092, 3637, -12673, -33012, -44016, -36995, -54333, -52049, -53828, -61263, -41638, -30815, -15431, 10018, -8838, 2827, 14725, 7306, 15280, 14767, 1225, -6111, -20472, -16832, -151, 24943, 76934, 85223, 64507, 41521, 37799, 27228, 40119, 15319, 14737, 22673, 1663, -5925, -4655, 22650, 9979, 22953, 29620, 26013, 18114, -1353, -10289, -20962, -17574, -27306, -23078, -25471, -43334, -45846, -28581, -20178, -5762, 27945, 18350, -21811, -22262, 5298, 36874, 22539, -9898, 1819, 23822, -1447, 10720, 28663, 29095, 14112, 5822, -29768, -58670, -48895, -9968, 17614, 31476]
15637C1476K0104m0690r953K5635m9734l3346Q115K7096J3310k276N896J9532
15625A5165L699J3727j3958j7994j4719K5345k4801l3174J8875M3239K3442M0628
15613G9474J7639n2058q0351l4639P765J9434J4016K2408k0133j7429M0971L4125
15601C1222K5262N121q877l3561j2244K9821L0691l1729n6052J3285N984n547
15589f624O184K7167k1968n4260N118J4061J3021K0506o333K1475P986J0536j8180
15576A8689K3198n51l6500Q160J8904j841k7917n4582m0417N053M5600L4569N5461
15563D7826L1935j5653N451K4105j2301j2507m758J8211K2207J3479k5123k6960
15551F5912K3478o760j690j592m5638m1158k6517J6617M905r64j6143j8601P467
$$ y = [31476, 51580, 10890, 937, 26572, -23162, -56508, -48393, -21297, -7987, -10263, -4367, 15165, 18864, 32591, 18633, 639, -14080, 11265, -13536, -46710, -27835, 15404, 38846, 79474, 97113, 45055, -35296, -69935, -62170, -42736, -28720, -6312, -26445, -43874, -2903, 31222, 56484, 61605, 52728, 19167, 6923, 36744, 67435, 35706, -20346, -7061, -1077, -6624, -440, 26727, 4759, -49501, -44383, -30322, -17301, 3205, -3128, 18347, 26333, 36869, 18689, 41887, 41336, 4836, 12996, 31900, 30059, 2142, -52440, -92857, -87804, -42204, -7635, 47826, 79761, 64108, 69559, 93664, 81363, 68856, 64098, 82309, 104516, 117995, 92872, 65912, 89390, 82630, 80940, 79348, 33710, -7448, -33965, -17348, -12443, -13407, -29550, -48151, -40684]
15538d0684L0130j5597k463K4458j881k4820j1899J1426o10o733Q070N1043J1355
15525C1795q427j7495J6549R129k0240J4428m1540l8722K8647J8575j229j443
15513i973R618m1772l2288k1693R672N5042J9283q73j3217J2356L4759j6055M602
15500I461k336m222J9j574K1123J8060j1090l5610J9290P056k3777J0558K9627
15487C6585J8419o1701m1492j8188M2890N4739J8508q753m8475k7080J8400K4429
15475H281J5230k1887m3355o195P998K0680o951n669r354l426L1432M0617j5374
15462A2027J3176k500j2006J9823M6225k3907j4684j0941k1039L154L2529n001
15450C6856k8441q998l870j653L886L6739K530l2626k3067R728N83j4308J6376
$$ y = [-40684, -10554, -26151, -28614, -4156, -6037, -30857, -42756, -31330, -31940, -38673, -30603, 20440, 31795, 23368, 5873, 22422, 31551, 11311, 25739, -15801, -54523, -25876, -7301, -8530, -9973, -355, -42127, -74415, -96108, -86436, -31394, -12111, -12984, -26201, -13845, 20914, 4859, 9461, 7125, 2903, 2922, 1348, 22471, 40531, 29441, -6169, 13121, 20177, -3600, 6958, 36585, 55004, -6697, -48189, -66377, -23487, 31252, 49760, 41007, -7468, -34548, -16148, 8281, 23511, 1624, -41731, -47926, -39928, -19248, -26199, -31868, -41222, -44648, -13216, 27401, 12027, 25203, 22703, 10697, 30520, 76745, 52838, 38154, 27213, 6174, 9328, 41857, 36856, 8415, -583, -4453, -6106, -2220, 34519, 37049, 4423, -18644, -8916, -8333, -22641, -6265]
15437f265M2140n861j9158k1363K3702L1610j8537k1014j7089l5360j1598N2656
15425f137O643l8590P568Q256J6145K9285K5848J647k4239k8113J1014j115P505
15412A5717J6751l608l3609j9999K0701K0557j0955j1100J2279K369j3864j8125
15400b2886j0150Q934K4523J0038k9181k4038o529N1429K2304K285q042N205k2950
15387I42j6496M121K0799o653J3698j2789p513j8758l6359k664L4928k8114l2868
15374h7726J1937N7754M5266K3103l1673k1896K4877j2211L3645J3882r341q3051
15362c5434m8875M0992L1381l0173q355K0608k1734J0450J9620j1292J4887Q18
15350a7107K1709N028J9604r666k3211j7046k5552O063L0725l567k319K915j0037
$$ y = [-6265, 35875, 30014, 10856, -10507, 13195, 44805, 26268, 5254, -11835, -47195, -58793, -6137, 506, -38084, -30516, -22260, -6115, 23170, 49018, 50665, 26426, -1687, 9327, 8212, 15717, 32468, 28860, -4749, -24748, -4047, 16510, 5555, -5545, 6734, 9103, -4761, -22886, -33036, -24102, 421, 10459, -18722, -42760, -49289, 2140, 24444, 26729, 18687, 23892, 942, -15554, -11433, 9366, 2713, 16411, 3622, -3891, -22649, -59008, -61672, -26744, -54858, -87726, -75789, -18035, 27231, 50334, 18661, -3235, 21642, 9431, 43076, 56958, 47617, -35434, -84309, -43317, -11936, -42109, -50464, -29856, -51590, -41140, -21520, -32812, -17925, -17107, 4602, 9630, 29234, 19568, -3643, -20689, -46241, -40178, -9453, -13020, -15339, -12424, -22461]
15337b2461j9845J0171N850j0092M6851J426q988l2956k1383K7960o624R327K8678
15324G914j6180o910k9176l602K0046K3334J8884k0429j7926k0537J7066K501
15312b5015N242K6306N331l1978l2787P20j3115N1897R092j1669K532K0862K1796
15299B9214k1962n3148k6986K264J6504R962j9133J2259j733L0219j3798N216
15287c1122P641j7587J9227K1995J6005j1517j1611J2648j406m3658R82J4960
15275b3443N5599J927n2313j7659J1357K0049L4913K0626j7854j6469l6064j5666
15263c4997L7693J719m658j3475J394k8663J3851j5124N763J1639J942J2994J2659
15250B737J3308m805L1216L7284q226l2190K2611K955k1017o790k74K3245k3947
$$ y = [-22461, -42306, -32135, -26285, -36377, 10474, 11900, 2912, -30044, -51427, -23467, -30091, -20764, 7914, -8266, -15176, -44352, -47954, -27908, -4574, 14310, -6119, -24045, -44582, -27516, -25015, -19773, 6533, 11864, -20114, -52901, -52181, -65296, -13399, -4307, -15976, -13444, 7418, 29214, 7252, -45896, -72882, -70618, -54114, -44152, -63285, -51026, -52759, -22540, -36338, -31122, -23481, -41068, -21841, 154, 16159, 4642, -6969, 5679, 4273, -39385, -38403, -23443, 32156, 34083, -18230, -35889, -24532, -4483, 30430, 51056, 33202, 16733, -19331, -34997, 2696, 4415, -243, -13718, -12324, -40987, -27136, -42260, -36497, -24858, -22916, -9922, 2737, 16045, 11240, 42456, 79740, 71514, 39324, 61935, 64890, 43873, 37083, 36809, 60054, 36107]
15237C6107j8299K5314j6756p626J8715o586l0832Q964j8351j9335L3388K1051
15225B5754j5685l0064k1515J9722K0994n716O981Q56J9628K693k7057k547R717
15212C761K465k542L660o48k9663k8941J5958L1493K0623L687j0026N532K5823
15199D1182l8020j084J3775j3914m0772k3831k2415J9724L3182J8991R877J8691
15187A5386K6107o996j8820m190k0070J3622K7564m932j2286J8013j6785j2758
15175C855k1702L9042K771r552m3452l4188J8883J7283K03N634l648L357M2434
15162B0920J5017k3557k634J857k8162p8428k3197L3662J4307K9736j73o38J4314
15149b6976K34J8757N655R99K1270j3421m3861N813k113k4659M1224M7732j3803
$$ y = [36107, 17808, 43122, 26366, 18740, 37455, 30869, 37, 9001, -9350, -28685, 4703, 25754, 10069, -19995, -41510, -21788, -794, -6510, 471, 1327, 20955, 23648, -3409, -5956, 3761, 6226, 3684, 7344, 6696, -22967, -51908, -35950, -4457, 16166, 19853, 9827, 15359, 41182, 3162, 2078, 15853, 1939, -38833, -62664, -85079, -65355, -32173, -13182, -3305, 15386, 41493, 34497, 15677, 11487, -8583, 5039, 32603, 27671, 15385, 33398, 16613, 3855, -17847, 21195, 23966, 14414, -29038, -63226, -44343, -27060, -26857, -21223, -24871, -21514, 20920, 35937, 12380, 9746, 11603, -16559, -94987, -118184, -84522, -70215, -40479, -40652, -41290, -26976, -26742, -7985, -2330, -1331, 19939, 6518, -37343, -31530, -33643, -58302, -17078, 30654, 16851]
15136A6851l8123l692K5080m967k1375k7463j678L0417P980L2078M259l0599q409
15123a9641K5224K8540k0060l3810L883R212K0093O131J7601Q355j4969n5074
15111b4515J0748L3152k7779N856J877K0j281j1493r051J4673L1753j3474k4295
15098a3809L6338p868j2393R700K365R865K0907K6906L0809k060k9302k7822k7899
15085A5737K1396j8290r99m223j8162l086O376K1338o600M8384p201m1430K213
15072A5453r840j0650Q383Q273m591O971j9261l5740l8696O815J015L1195L1319
15059i354K858J302p61q845O725K6506j3020j3046J6369J8234o298k5145j3278
15046a7753q801M7904O812k0516M294k873j2134J6807L1505p346q202j9530k0975
$$ y = [16851, -21272, -24964, 116, -4851, -26226, -53689, -55367, -24950, -16970, 15108, 19367, -11232, -19641, 5583, 34123, 14063, -19747, -15864, -6652, 13441, 19572, 37173, 45528, 30559, -24515, -13767, 19385, -8394, -2538, -661, -641, -1922, -13415, -22466, -7793, 23960, 10486, -13809, 22529, 14661, 2268, 11968, 14333, 24198, 45105, 72011, 102820, 100760, 71458, 43636, 15737, 37133, 18843, 17844, 13621, -4541, -7627, -1251, 20087, 13487, 61871, 54670, 13240, 15453, 5613, -5037, 3346, 11619, 7028, 13999, -5262, -41002, -79698, -72883, -71868, -40673, -9354, -6496, -5194, -5955, -14800, -8075, 18431, 5411, -7635, 8734, 26968, 20670, -4475, -17753, -26554, 21350, 28162, 7646, 11940, 9067, -3067, 13740, 45245, 37899, 29697, 10167, -10808]
15033a0808p452J1056L6163k8359j6669n520O097K9272M640j9376k5636L2132
15021E540Q832j1068j2401J869J6708l2718l3074L2636j5850j1039O530k467J3478
15008c3024m1461o6782K6044M1559M2069L9288Q020j4138j6240R648K0268j5195
14996E6r248J8357k6897k2608L3915L4696k3414L483j3267o6425k9996O4759N6334
14983A9745N6806J4031R127k9814o0336k398k8031K2342k3573o880K5894J8387
14971A5300k6808K9474Q032q513j2431L069j8444J4055J8975k483l5339k1479
14959c6592k1345m1469J3825N6441P121p2289K9454M054j8689K0410M1057L6246
14947A8224k0124J8354p77Q759J5141q316r577m2203J4040m593J6572J3033J5216
$$ y = [-10808, -18260, -7204, 28959, 600, -16069, -21589, -15492, 13780, 18420, -956, -26592, 5540, 14372, 3304, -9097, -7228, 9480, -23238, -56312, -23676, -39526, -50565, -44035, -46502, -33024, -74485, -141267, -115223, -73664, -31595, 7693, 15713, 1575, -14665, -5017, 15251, 56, -9192, 9165, -17732, -40340, -6425, 28271, 4857, 8340, -4927, -71352, -101348, -36589, 19745, 76551, 90582, 99709, 69895, 9559, 7161, -20870, 1472, -22101, -28981, -3087, 15300, -11508, 17966, 25998, 17485, 5054, 8123, -10321, 3734, 22709, 20226, -15113, -36592, -57937, -99406, -85581, -29140, -22019, -94308, -64854, -60800, -79489, -59079, -18022, 18224, -1900, 16454, 15677, 24436, 39577, 31261, 21684, -20519, -6479, -11072, 5500, 18533, 33749]
14934C3749j962k7266k9208r56M3528l253k5448k7091k9525J8951K0273K4876
14922c332J5675k130j9869r26L5141K8095Q275j834l4768j1675O2068M1448K0932
14909A37100l1637o4876j293j0859j1885q619n4040J3717J9223k0241j5948K848
14897d6510L4228k3313K7450K5126N408l5448K5650m811N122J824k2018m4637
14885e1929j080M5347L2385j1164l7187J5780Q618J547J2534r968L109K4976o439
14872B6529k0045j0043L9704O563k1887l3434r195J8967j3690J7432K5507m2612
14860a6204K4730J3640J1784j989J3782l5400l9769n395J40J6710L665K7288M210
14847A7192j6378l4989Q803K748M8930P865l7437k6920K2472K3598k7649l417
$$ y = [33749, 31787, 4521, -24687, -25643, 17885, 14632, -10816, -37907, -67432, -48481, -28208, -3332, 12343, 10213, -9656, -10582, 24559, 52654, 60929, 59095, 24327, 12652, 74720, 116168, 137100, 105463, 40587, 39294, 28435, 16550, 7931, -46109, -32392, -13169, -33410, -49358, -46510, -12282, -35595, -8145, 16981, 22389, -13059, 12591, 7780, 12902, 14726, -7292, -51929, -53009, -7662, 24723, 13559, -23628, -7848, 770, 2317, 14851, 4883, 7992, 32968, 26529, 6484, -3559, 36145, 42708, 20821, -12613, -21808, -2841, -16531, 901, 26408, -16204, 8526, 22166, 33950, 31961, 45743, 10343, -29426, -34821, -34681, -17971, -14306, 12982, 17192, 814, -34175, -25372, -22624, 26306, 34171, -3266, -30186, -7714, 15884, -11765, -15182]
14835a5182m490L2497M1393j3861j7291J188k6886J5971P763l8179m166J3073
14823h170l1826N41K4297j7732r789N103J2319j4898j449j371K7019M4780K1040
14810D9864k4951j4606M7624j5571Q234K1629j4082o226k2115K395J0331j5031
14798B7495p433O413r421l9153k9967m636L9925m45P778K457K8450p616l236O044
14784A6655q963j1334L399J8984L2858j7238l1759J5078Q120m0454k9071k5843
14772f9568j1950L0722Q217j0230r889R502N140J4480k323J9899R216J7033n144
14759E105l2380k1388l688J4136J8483J1979J2930m1193j1008J1158M850l4392
14747f5408L1160P253k7920K1945O086l5281m948K555M2975K746q449k102J8481
$$ y = [-15182, -19672, 12825, 54218, 40357, 23066, 24254, -2632, 13339, 21102, -17077, -21243, -8170, -39996, -39455, -15158, -32890, -42679, -37576, -25257, -40155, -41604, -42975, -15956, 28824, 49864, 24913, 10307, 57931, 42360, 50594, 72223, 58141, 51915, 29800, 32195, 42526, 27495, 20062, 26475, 17054, -22099, -52066, -56702, -16777, -17222, -9444, -6987, 21463, 13847, 10611, 16655, 7692, -3642, -243, 18741, 51599, 34361, 2602, 17680, 25800, -14654, -43725, -69568, -81518, -50796, -42579, -52809, -62698, -53196, -48056, -33576, -35899, -16000, -6784, 10249, 5105, -27275, -48663, -52351, -38215, -19732, -7753, 5177, -36016, -47024, -35866, -31016, -65408, -34248, -26995, -54915, -32970, -26884, -62165, -67113, -64558, -21583, -18837, -27286, -29388, -10907]
14734a0907K2287j1149J1394L9516J9049j4799r215J4398m6384l7861J2199j7167
14722b8639j3231K6819J2367j9677j4903l1438k930K3006K4739J6753k5100j4040
14710d6274R670K007L909m861Q403J0017K2842L5310l0793j5750J9825K2733l8639
14697a601m4863N287j0497n940q812L965L8902Q244Q141J4907L0207K4878n6020
14684F798m0486l2380J036r505N5165O6454j2461j3354j6328j3711k6478j268
14672c6518L347K3528Q334m4519J997j3048k8736K6558J4731o594p492M5486K5228
14659A2302l1036J3705k2160R240j3425p599L9918j3160q334J1920j3355r410
14647c1394l361J2033J8413J9521l1016M666p092j056J1635j4834K2148K5750
$$ y = [-10907, 11380, 231, 11625, 51141, 70190, 55391, 46176, 60574, 14190, -23671, -11472, -28639, -41870, -15051, -2684, -22361, -37264, -68702, -71632, -48626, -23887, -7134, -32234, -46274, -36604, -34597, -30688, -35549, -27146, -17129, 5713, 41023, 10230, -5520, 14305, 37038, -1601, -46464, -41177, -51674, -57614, -66426, -62461, -23559, -15315, -7174, 7733, 37940, 62818, 6798, -33688, -66068, -65032, -74537, -19372, 47082, 34621, 21267, 4939, -8772, -35250, -36518, -33171, -9643, -1309, -45828, -43831, -56879, -85615, -59057, -44326, -50920, -58412, -12926, 12302, -18734, -5029, -27189, -17949, -31374, -38973, 945, -12215, -20549, -8629, -21984, -31394, -34755, -22722, -4309, 15212, -15804, -11138, -18230, -19286, -7651, -22485, -337, 25413]
14635B5413J5817m206k4410j0212p684J546j2036K9657K3721J6500k5750m1275
14623a2919k9024l7944j3857L3006K9882P937R937K6900r356L4600k0060o2070
14611d2968J5622O640k7452l412L0227O1643J1098k6570l3641M1385K6617j2515
14599D6674k3794M0384K8783l6064k5138k2284k7708l9480J8961K7585k0770k7834
14587f0685j2527K6243J4892l56O597J6537J4785o196j4835J264k7855j7134L6770
14574b2500P139K6663L0726Q819k6694l9634k6511J0160N9130J9643j2079l1700
14562C162K260J7023j2652k4905K6266J9927M445j2279n263l2335l2355J7595
14550b9111L0613L1737K8351j0608q947j4452o558k6684j5021P279m542Q076M99
$$ y = [25413, 41230, 37024, 12614, 2402, -5282, -3736, -15772, 13885, 37606, 54106, 28356, -12919, -41943, -79887, -93744, -60738, -30856, -22919, -12982, 13918, 4562, 39162, 19102, -42968, -27346, -20706, -48158, -51570, -21343, 40300, 51398, 24828, -8813, 32572, 59189, 46674, 22880, 63264, 92047, 55983, 30845, 8561, -19147, -58627, -39666, -12081, -32851, -60685, -73212, -46969, -32077, -32433, -25836, -9299, 5486, -710, -15545, -14281, -42136, -59270, -22500, -15361, 11302, 42028, 50847, 24153, -15481, -41992, -31832, 27298, 46941, 34862, 3162, 5422, 22445, 9793, -15112, 11154, 31081, 35526, 23247, 17984, -14351, -46706, -29111, 1502, 33239, 61590, 50982, 42035, 27583, 21025, -5659, -20680, -13401, -17943, -9867, -9368]
14537i368r678J9823N799M926L180k2587K0177N557j0518k8773J7917m0j0833
14524a4418n73r996O052K5706J8803L839r029q112k0603k0362l9369K1330M9738
14511C006J1459r124j1965JJ316L8691j4968R462k4482k7580J3624l5414L264
14498d2710j1025k412L3187M6597n781M283l9130k8894k7531P86m200J3908K7481
14485c5441L7296J6664j0376r026l1728l0940R33K5242L0113N1193j245j3481
14473B9204k7952O24K0235M16j1646L1000m829k5870j7494O120K6513l4249n4738
14460f2666N54l781j9360J7402O4064K0118p893j2770M915k3358J4205K0626J5612
14447B7668J3435q860J0916k4959k7229k4184J4735L7150K8165n824n4356J8146
$$ y = [-9368, -19046, 777, 6576, 11502, 14682, -7905, 12272, 17829, 7311, -21462, -3545, -3585, -14418, -14991, -24987, -18935, 6771, 25574, 29413, 20384, 12272, -8331, -28693, -68062, -46732, 3006, 14465, 5341, -6624, -6623, -5307, 33384, 18416, 27878, 3396, -24184, -10560, -45974, -42710, -53735, -56147, -22960, 23637, 17856, 22139, -16991, -45885, -73416, -72630, -76830, -62922, -35441, 1855, 18519, 8143, -883, -32611, -63551, -62618, -37376, -7263, 43930, 42685, 29204, 1252, 1876, 22111, 22527, 10881, 41881, 37052, 11182, -6312, -192, 26321, -7928, -62666, -62112, -65893, -85253, -67851, -3787, 16331, 8438, -4332, 583, -22775, -8570, 12056, 27668, 41103, 32243, 43159, 18200, -9029, -33213, -18478, 18672, 46837, 41013, -13343, 4803]
14435D803M8504Q671M330k7368m4507k2334K8420J4716L123j9068o3697k7072
14423i1479J0446R428l3123M2527N2302K473k6424l7596J5695J6522J3209l912
14411b9932O161l2399Q736M2465O116o03l5331O519J0130j6396k1495O740r833
14398e9122K2945J0634J7151L3501J9326j8137k4547P450p510j4750j9923j3717
14386d6699k131K0904K5085K1357l8381K470k214J9392J4019M6871l0353l970
14374B6350Q776l400k5133k3215j1779K2983J754j5497k798j282K3698N758l586
14361B629j4320L9653j5503M079J8643k8039j0564j1811l5414J0749K405k4481
14349f1974K7031m040K1847P483Q073Q74k7448O88K3932N294j5173J022j266j0851
$$ y = [4803, 53307, 61978, 66308, 38940, -5567, -27901, 519, 15235, 18358, -710, -64407, -91479, -81033, -71605, -104728, -62201, -9899, -7426, -33850, -71446, -55751, -39229, -26020, -29932, -23771, -56170, -47434, -4969, 1147, 544, -34787, -28268, -18138, -34534, -56029, -49289, -59122, -36177, -25543, -8392, 25109, 44435, 26298, 1751, 9201, 1691, -13059, -32982, -46699, -48830, -27926, -2841, 18516, -19865, -17395, -19609, -217, 13802, 60673, 30320, 26350, 35126, 31726, 6593, -16622, -28401, -5418, -3664, -19161, -21959, -23241, 457, 6215, 2629, -11691, 27962, 12459, 16538, 35181, 7142, -3422, -15233, -50647, -39898, -37493, -61974, -34943, -38983, -17136, -9653, -1580, -706, -28154, -27466, -3534, 1760, -13413, -12391, -13657, -24508]
14335b4508J9407j8793j3019q311j1722m359K9037K2943P791J9167K8293j4793
14323C1133m1925m2643j8313K4922L4649N6950j4616o522R625J0081j1943k1607
14311I791j753l4276q243k751J1473O0127l788J3530j4701j5156l806m294l9634
14298c3481l7178M2001J8695l1596K1965L3230J7438k689k2640k7973j0333J1613
14286b0948J9165n001l09o630K2180k831j8225J8354L228m4887l3400k0201M2173
14273d7332K5402K0433j1932J2982K9012k4713m4421m0584K5235K9303k41L25
14261b6531j660P493M5823k40j5342j1047j0158K6731J709l9691k7127K2880L346
14248b3814k8064R338J2464P09J4547J9260k9030l3332L268q116J8104J7991j3747
$$ y = [-24508, -5101, -23894, -36913, -45224, -56946, -61305, -32268, -9325, -1534, 17633, 45926, 31133, -10792, -53435, -71748, -46826, -12177, 44773, 30157, 23635, 33260, 43341, 31398, 9791, 8038, -26238, -34481, -37232, -25759, 34368, 30580, 44110, 29409, 14253, 10447, 6153, -33481, -70659, -28658, -9963, -41559, -19594, 13636, 31074, 28385, 5745, -22228, -32561, -20948, -1783, -6784, -7093, -13723, 8457, 5626, -12599, 5755, 8983, -35904, -69304, -89505, -47332, -21930, -1497, -13429, -447, 28565, 3852, -40569, -81153, -55918, -26615, -26856, -26531, -28191, -20698, 25125, 24885, 9543, -1504, -11662, 15069, 16778, -22913, -50040, -27160, -23814, -51878, -42540, -30076, -29367, -14820, 4440, -24590, -57922, -54654, -62770, -44666, -26675, -40422]
14235d0422j1999J8299P500j166j5046K710k0453J9601K2081R549K0143O446l7481
14222b0238J148j668k6449M0448K1722q944P662p405J5522M5455k2633o368j7857
14209B0395M0365M755L592P393K9888j3387L18j9467l4535k4011K919P321K2489
14196D8035k5289q195k9318L988M060M7171K3666j6537l4800m3786q777n72J0027
14183c0327K1391n18k6680L5609r006J9432J4566P422m8063j9986p977k6100L7969
14170c2268j3415k8098k294J767K4960K3284J5662K0533L4796p815o3364k0348
14158d6600L6883k316j886J3824L1582k3069m0617K4002L023K1471K4783k2073
14146A9007j0310j7123k208q597K0012K9438J7937p870l0872l6259j3724J8737
$$ y = [-40422, -52421, -34122, -26622, -27788, -42834, -40124, -60577, -40976, -18895, -9346, 10797, 17243, -20238, -19090, -20758, -47207, -6759, 14963, 6019, 13681, 6276, 21798, 67253, 44620, 38252, 20395, 60760, 65515, 69107, 76500, 106388, 93001, 93319, 73852, 39317, 15306, 18225, 25546, 48035, 22746, 14551, -14767, -10779, -6719, 40452, 64118, 47581, 12781, -31005, -39782, -40354, -30327, -8936, -9454, -36134, -525, -9531, 9901, 24467, 31889, -16174, -36160, -44137, -70237, -32268, -45683, -73781, -76075, -74308, -49348, -26064, -10402, 10131, 44927, 37112, -26252, -46600, -9717, -12033, -13919, -95, 31487, 8418, -32199, -8197, -5174, 16297, 41080, 19007, 8697, -8426, -10634, -19231, 781, 30219, 48156, 40286, 9414, -26845, -40569, -21832]
14134b1832m187l287q218J7557j9909K0445J8810R447K3346l6866J5730K1424
14122C2460m9598p928K139K468K4252K4445m728p54j5409j3294J0442L7889J246
14109D3630j6229r61r034O269l7445n2459l45K9764O64J0530j4546J4347L8991
14096A3176n027o455l682K3188k7047k4651j9603j9151r450J5221L0409n178j012
14083c9262j2498J6389K4006J6723o221J0279K2044k4828j0167l6115m450M649
14071c9451J7370J9263L0863J5334k2165J5324K542k0090l2067l9714J0985Q206
14059c3600K7764K0092j658M664p534k5009j012m58j9743K8863K9874N439k5228
14046B454k352O3043K812P128l9421k3678k837L782J2820j255j2983j982J723
$$ y = [-21832, -26019, -29306, -37524, -19967, -39876, -19431, -621, 8826, 32172, -4694, 11036, 32460, -17138, -25066, -22927, -20459, 3793, 28238, 23510, 22756, 7347, -5947, 4495, 42384, 43630, 27401, 26440, 17406, 23675, -13770, -66229, -66574, -36810, -36146, -25616, -40162, -25815, 13176, 8149, 1694, -1988, 21200, -5847, -30498, -50101, -69252, -78702, -63481, -33072, -38250, -39262, -51760, -35371, -11365, 5358, -863, 9416, 31460, 6632, -3535, -39650, -44100, -39451, -22081, -2818, 28045, 43379, 21214, 36538, 39080, 18990, -13077, -52791, -41806, -33600, -5836, 14256, 12598, 17262, 9728, -15281, -16293, -16751, -36494, -7631, 22243, 27682, 2454, 102, 63145, 65957, 73085, 33664, 9986, 7149, 10931, 23751, 22496, 9513, 7531, 9254]
14033I254M1357j7626r012J1925J5256k5186j1629O431j9581m7534p498K2956
14021c0887J7406l2738l1327p09K6739J8786O448K1923J932R517L845K0349q574
14008B2710l3618q483m211Q651K8613J0332J0520L5394k6294n652l4752k4926
13996b1716k511J9182K8390P440k3633n1703R393r417J5154L4460L188P213K1369
13983C6809j4536k3399J2979J3608n535l1442J1481Q186P503l609N65R702j6741
13970E571n307k2844J2521L758n766J2643J3168n334J1450k3219j1972J7785l197
13957g43k4574J5951J0843J5394M3034R197j3176q544m6741j5080k0776j5305
13945e0520K3903K8453m001J2179R536J9420J6980q146j1486l300k9661j157K0884
$$ y = [9254, 50611, 32985, 23973, 35898, 51154, 25968, 14339, 20770, 1189, -46345, -53843, -30887, -13481, -46219, -77546, -78255, -51516, -32730, -26282, -4359, -2427, 7090, 10935, 31284, 22710, -10908, -19391, -23602, -14951, 13662, 23994, 34514, 69908, 43614, 37962, 3210, -21716, -24227, -5045, 23345, 30785, 7152, -44551, -35158, -44575, -29421, 5039, 8227, 15440, 36809, 22273, -1126, 11853, 25461, 19926, -11516, -35, 8151, 15654, 12045, 12610, 22312, 5571, 264, -22580, -10059, -6301, -12067, 576, 13744, 8410, 19860, -3359, -15331, 2454, -743, -25317, -9366, 1477, 16871, 59905, 69102, 55926, 47382, 641, -14439, -35215, -50520, -26617, 1836, -2165, 10014, 19550, 38970, 55950, 47804, 36318, 33018, 3357, 2200, 23084]
13932B3084J3286l2723k6187J1553r34p483l0961m6685j0431P0925K5059L5931
13920B4434m0234o8104Q586j20M0728L2943J8761K2456l4664n231j0869p8041
13908h9355o145J8403O787N4405M1590l479K543l0470j7216L4497N420J4259n02
13895C0737j9801J9805K8407K0941O231n1281k2185K690m876l1173Q940J8348
13883F783K4914L5444L053J7066j9368m4864m4463l51J6500K891M2905M0326O209
13870H7045n2293L958j0649n7406m403L3793L4327K0345m9346l3428j5489k8874
13858g2420J503K7774k61J3248j659M9755L5133R909j5148l691j4049R188j358
13845C7924m2530j4089l4857M727L591j4979Q701N5023l8664l1248M0252L8894
$$ y = [23084, 36370, 3647, -22540, -10987, -11921, -19404, -50365, -97050, -107481, -36556, -11497, 24434, -15800, -83904, -75318, -75438, -34710, -1767, 16994, 39450, 4786, -445, -11314, -89355, -95500, -77097, -70310, -15905, 25685, 22206, 24749, -5721, -22937, 11560, 16980, 31239, 30737, 10936, 30741, 59148, 80089, 86320, 35039, 12854, 15544, 10668, -20505, -11565, 6783, 31697, 67141, 70194, 87260, 67892, 23028, -21435, -21786, -5286, -2395, 40510, 80836, 87045, 34752, 38710, 28061, -29345, -33748, 45, 34372, 54717, 5371, -28057, -43546, -72420, -70917, -43143, -43404, -30156, -31815, 17940, 53073, 62982, 47834, 44143, 30094, 39282, 37924, -4606, -18695, -53552, -48825, -45234, -60213, -51512, 3511, -35153, -66401, -26149, 12745]
13833A2745j3655j2274n745l4206L842L1943L7484n1305J129j8845L1466M2768
13821B5347l2627k3172K7616L1137j5063n50L8334K3018J0809n7691l4315J0187
13809C030q330Q643K7391O064o871J3558j2199j5471k3285n146K4155K9013j76
13796D0376j2020l3442m0408p371K0594K8553N6423k1283l8675j8646O706L1865
13784A2672l5975J0152J1746K334j0711m8540K2213L5138P688o38K0797J899Q768
13771C7543j7798k063L4727o467k6192m139q310J2173J668m5928M4198N6779J3852
13758I0043k9240j6468k1307l035q190j1206q388k0980l4870k487L1966J3349
13746b0813K285L3624J0952j72n233j0201R993j8531P924j6776k5402K6098J0362
$$ y = [12745, -910, -13184, -18929, -53135, -49293, -17350, 20134, -31171, -30042, -48887, -17421, 25347, -7280, -30452, -2836, 28301, 13238, 12688, 51022, 74040, 84849, 27158, -7157, 3030, -5300, 3343, 30734, 36798, 29927, 43485, 31286, 15815, -7470, -12616, 11539, 40552, 40376, 28356, -5086, -45494, -52865, -32271, -3718, 52705, 31422, -7253, -25899, -19193, 12672, -23303, -13151, -1405, 929, -9782, -58322, -36109, -971, 6717, 6079, 26876, 28775, 37543, 19745, 17682, 52409, 45942, 19750, 15611, 7301, 19474, 21142, -24786, 19412, 76191, 90043, 60803, 44335, 23028, 19993, 11803, 597, -7791, -28771, -63641, -66128, -34162, -20813, -18528, 15096, 26048, 25876, 20643, 10442, 20435, 1904, 9828, -6948, -32350, -6252, 4110]
13733D110m3704J5251J8699k7939j1167K9245O855K955N116J6940j2791o50l126
13720b06l1026j017J9750J3536N118k7836J9510L0841K1751J1445l0875k5877
13708E114M7761J9024k0981R629j7146m8839n6678k6999q978p450O2367N2766
13696I590M5846J4219j747j4450m4600m0498j7856m1017k0094L5555J7647L6125
13684b1280j6467j1294J4986J9928N970J6901L955M774Q040k587J02k2631j4667
13671a4270k676P48q758n747n680O368K6691j7705j0711J6434L3290M061k2005
13658D0k2895K2785O4299j5161k2966k5193M114k0714k537L1739j4929k3302J9052
13645e668q736l517K1186j7301O385L5578o168K0017J1584m858k6242l6545J4015
$$ y = [4110, -39594, -24343, -5644, -33583, -44750, -15505, -8650, -5695, -579, 16361, 3570, 2920, -206, -31232, -32249, -12499, 1037, 6155, -21681, -2171, 28670, 50421, 61866, 30991, 5114, 52875, 71899, 50918, 60547, 43401, -5438, -62116, -89115, -98093, -105543, -43176, 9590, 55436, 69655, 67908, 53458, 8858, -31640, -49496, -90513, -110607, -75052, -57405, -21280, -37747, -49041, -34055, -14127, -8157, 8744, 12699, 17473, 25513, 22926, 23028, 397, -14270, -16946, -16198, -24956, -30703, -36383, -30015, -3324, -21029, -31740, -15306, 17984, 22045, 40, -22855, -70, 64229, 49068, 26102, 909, 5023, -15691, -18228, 13511, -1418, -24720, -5668, -14404, -17921, 3265, -14036, -7651, 27927, 21759, 41776, 53360, 48502, 22260, -14285, -270]
13632b70M5147j1369r199N748N664j0061k0960k0914J4552J361N882k6181j8636
13619c9236Q454q102m501k550K0860J3139j0301L7036l091j4141N7338k1410k8680
13606D815l7950J0472j8562m036K6099L5323J4989K5579l7496l1639k544j8630
13594c3580k0318J44J2512J9138j6519K1962p446J2082J4287J850l4071K0714
13582i245L9072L4526L0561j7298k7789k5823L665K3598m96j2915L896l2785l8705
13569b9738k4977K3638K8187l60j1080K0122j6798M894J9000k6241J3151l545
13557c747J2856J7577k6469k8471K8149L0448K0015j7424R759j7361J3891J2490
13545E1713l1345R417K5720J453j636k439k2492l8530j2880j0532j6155O204K0536
$$ y = [-270, 44877, 33508, 24309, 30057, 35721, 25660, 4700, -16214, -1662, -301, 5581, -20600, -39236, -30782, -38884, -43385, -45935, -25075, -11936, -22237, 14799, 11708, -2433, 54905, 33495, 4815, -33135, -22663, -41225, -45261, -19162, 16161, 31150, 56729, 19233, -12406, -14950, -33580, -53898, -53754, -41242, -22104, -38623, -16661, -24107, -12025, 2262, 4112, -29959, -9245, 29827, 64353, 94914, 77616, 49827, 24004, 27669, 51267, 50771, 37856, 41752, 8967, -29738, -54715, -31077, -2890, -3250, -14330, 5792, -11006, -6112, 12888, -13353, -202, -3747, 9109, 26686, 217, -28254, -105, 30343, 50358, 32934, 42693, 25332, 39223, 51713, 20368, 29785, 55505, 56958, 55322, 52883, 30391, -8139, -21019, -31551, -47706, -41502, -20966]
13532b0966L3764N1375Q580l0459k7070P115L4388O678m1244l4879N173M5480
13520C7935O549k9463j486k7282J1054n228J2836j112k8060j4612J3859n327l5057
13507f5394L2621K0805J3077k703j1536k529J5216j555J7864L2615r487m962K580
13494C6612j4003k1053J3780q41l1074J5154j4134N874l2303J8046o5N801K2184
13481C978K0808J576j0577l7212j6129K392j198L8721L9072j1899o0692j3004
13469d4164K1643J0930K6544M4379j0233l8398J4575L9741l912k5187k0283J3194
13457B8829j9871P440k6909J2946R435J1927k755j3106n1978n920K2838J180L7364
13444A1420l0483j6124N0667j0210J5654L8166j4832l1062k8918N186K2054n28
$$ y = [-20966, 12798, 64173, 72753, 42294, 15224, 22339, 56727, 63405, 22161, -12718, -7545, 37935, 44484, 15021, 13535, -13747, -2693, -7921, 4915, 3803, -24257, -38869, -25010, -30337, -65394, -32773, -11968, 1109, -1594, -13130, -15659, -443, -1998, 15866, 48481, 38994, 34032, 36612, 22609, 1556, 15336, 14495, -16579, -1425, -15559, -9685, -41988, -23942, -24007, -18206, 3978, 24786, 26362, 15785, -21427, -37556, -35164, -36362, 2359, 41431, 29532, -31160, -44164, -22521, -11591, 14953, 59332, 49099, 10701, 25276, 65017, 61105, 35918, 15635, 28829, 8958, 16398, -10511, 2435, 11870, 23797, 21042, 7936, -44042, -49962, -27124, -25944, 11420, -19063, -35187, 15480, 5270, 20924, 59090, 44258, 13196, -15722, -10536, 11518, 10990]
13432A0990l1754k627p787Q646k2248j0575j788L2675J3420l3015n282L5560k529
13419a6314K9572K2790k3718k1367O5K0973J3963j701k2567o54j5914m1252j4000
13406g0124J9788R2001O491J2231J8834k84q831n5447m7859K3389K5375P559J2316
13393C5439K4133J170k8366j4659q957K2411J7285k6240j2619q286q968K8425
13381B0768J5172J0675j9888k9084j3267j557J2221l504J4404j3299L6651L70
13369B9662m1732k9589R260M4523L4052k6003j0537K2019j091p318k2310k6858
13357b5922j1764L4663m125O411j4659P752M4015m438l3489j724O945J863K1557
13344B7085J2833j3812n3975J5801L859L0153K2659k6719j245o925l7916k0593
$$ y = [10990, -20764, -23391, -31178, -22532, -44780, -55355, -57143, -24468, -11048, -44063, -49345, -13785, -16314, 13258, 36048, 12330, -9037, -8972, 12001, 25964, 24263, 1696, 1042, -14872, -56124, -70124, -50336, 41665, 48156, 60387, 79221, 78937, 70106, 14659, -33200, -9811, 15564, 23123, 35439, 59572, 60742, 32376, 17717, 8760, 31171, 48456, 22216, 9597, 1311, -7657, 20768, 35940, 46615, 26727, -2357, -15624, -17181, -4960, -8464, 5940, -7359, 29292, 29662, -12070, -41659, -32399, 12124, 46176, 20173, 9636, 31655, 30564, 23246, 936, -25922, -37686, -3023, -7148, -737, -15396, -7644, 36371, 31933, -1556, -3280, 3665, 5528, 27085, 39918, 26106, -27869, -12068, -8209, 21944, 44603, 17884, 16639, 9714, -28202, -48795]
13332d8795k4108K830K9035L1112R090j97k782J2780J6985r12L8192r412j3991
13319C9827J1948k4869r176q020J0958r316m966K8980j404k5268j83K7236J9180
13306E4927k3754k1888l190k2166K8130j4727j7070p729L3120J0158l9067m585
13294b7841K5666j4665N894M895M2067J5024m2803q795N1933L6753K6144m535
13282A09737m790o808j0651O961l755k969J0580L186k6179l757K017k4405j7507
13269C1660K2087K2812o02o876o388j2650l2073k9833Q577K4982j6794k2215M808
13256a2505J9863J9012K7472j5677r4P416L0042N317K5156N302n1177q0956j612
13243b2441O661L0040L6491K2765M062l1445k3707M440K0489m425J3834l0139
$$ y = [-48795, -72903, -70073, -41038, -9926, -836, -1033, -3815, 8965, 25950, 25038, 63230, 53818, 39827, 51775, 26906, 17730, 9710, 20668, 11352, 6386, 35366, 33962, 8694, 8511, 35747, 54927, 31173, 9285, 6095, -16071, 12059, -2668, -19738, -27467, 5653, 15811, -23256, -27841, -2175, -16840, -10946, -6051, 36016, 51040, 8237, -558, 51375, 88128, 114272, 109737, 104947, 98139, 87488, 94449, 90694, 87725, 98305, 101491, 75312, 71555, 73572, 49167, 31660, 53747, 76559, 75957, 69081, 62693, 50043, 17970, -11863, -3286, 21696, 4902, -17313, -12505, 7358, 26370, 53842, 38165, 38071, 45487, 75529, 80846, 106002, 111304, 60127, -20829, -22441, -15780, 14260, 50751, 73516, 77578, 46133, 22426, 26866, 47355, 42930, 56764, 26625]
13231B6625R444L3520K6458k8809j6860J2183k2869k6380M8775J186j4516n958
13219D2799j0013l6478j9002j7691m78K5166K9162Q476p055L6860K0448K3410
13207I5604O540q848l3468P190J1170N232J5392K1439J177J5164J2318n7049k6237
13194F5624K8906O378n1005k0188P271K3380J4192J7890L497l5898j2142K018
13182D9923J7622j932M856Q16l9242p068K1243K433j5195q244O335L3957k3143
13169D2361J3305K2479L537k8615J1372J6591K309p057l198m3752l5123N718N334
13156E261k5222J3701N23M8359O09q32j4431l8906J3334J9711K2825o9K7094l3951
13142C8006P614L4855k5742J7507j8127l9462J8028M375J1237K944m716L313j6611
$$ y = [26625, 36069, 69589, 96047, 67238, 50378, 62561, 39692, 13312, 62087, 63273, 48757, 42799, 32786, -3692, -22694, -40385, -40863, -15697, 13465, 21941, 14886, 51746, 72194, 95604, 102144, 93296, 59828, 67018, 78188, 83420, 98812, 120251, 121428, 136592, 148910, 91861, 65624, 94530, 100908, 49903, 29715, 36986, 60366, 74558, 92448, 95945, 60047, 47905, 49923, 67545, 65613, 70469, 71285, 32043, 24975, 46218, 48651, 33456, 25212, 31547, 65504, 42361, 55666, 78145, 81682, 53067, 64439, 81030, 83339, 76282, 73084, 29332, -5791, -73, 5261, -19961, -6260, -5737, 42622, 43231, 42399, 27968, -10938, 2396, 22107, 44932, 44863, 71957, 38006, 45620, 80475, 54733, 72240, 54113, 14651, 32679, 37054, 48291, 51235, 46519, 49832, 33221]
13129C3221Q699L0181J5871O908k5316j072o421K5986l0393j119j4112k2179J8559
13116C8813M8116K8370J2189n2866k2113K6096K0365J8954k0528l328Q326k5535
13104G6859l6599O588K6352j275m985K6946J0399R398R788n7555L524O545j3635
13091F2350l0473K816O874M1967L2467k6643j2330K661K7741m59l3244k1022K856
13078E5561l450j6819K5869J9197Q09J8488R110K0058K8090o044l822R332k0494
13065A35885n466K1488p606n736l3733l5433l1638J0310K757K4436P67M624m968
13052G5687O097J7975K3337q518K5518J8035j5899j1524L7472J8309k1678j1835
13040A52976k3476K421P724n995K3705o945k0909R440j9502j5586K1728j016k2401
$$ y = [33221, 41920, 72101, 87972, 94880, 69564, 68492, 62071, 88057, 57664, 56545, 42433, 20254, 38813, 86929, 115299, 127488, 74622, 52509, 78605, 98970, 117924, 97396, 94068, 102394, 76859, 40260, 46848, 73200, 71925, 66940, 93886, 104285, 113683, 123471, 65916, 69440, 75985, 62350, 31877, 34693, 41567, 83534, 116001, 89358, 77028, 79689, 107430, 106971, 73727, 52705, 55561, 52111, 35292, 61161, 80358, 81167, 99655, 108765, 128823, 156913, 150869, 147047, 156379, 135885, 130419, 151907, 144301, 138565, 104832, 69399, 37761, 48071, 50828, 75264, 76031, 80655, 75687, 81784, 99759, 123096, 114578, 140096, 158131, 142232, 130708, 168180, 186489, 164811, 152976, 129500, 131921, 139645, 133650, 157355, 150410, 129501, 138941, 119439, 103853, 125581, 124565, 102164]
13027A02164M0184L7194P3890K9038k1880j4223J7318K4530J7065K4648r133j8731
13015C02064n8581l5604J2457K4582N190K5619M6046N173l2302N342L8877O5637
13003D04500N3599k0640K0107n08o761N87r276J7632n146k0570o243P365R242
12990D43888L5610j2520j5702P191J7655m875k9184L6892O5910K3240m402N7893
12978F21596O5658K2435P9796N0524m3664k3979J4471j2039J1651o788M199k6534
12966G57326n3272m0580r412o600j3778m499k4271j6892k1875j4989J077l0503
12954E21732L85P0028K326l1063l2242k0945m200L3026q697J9371l6025m4979
12942D68717K755M0352K0463O3045j6921m8866k8720K3367J925J8689N786j0070
$$ y = [102164, 142348, 179542, 253432, 282470, 260590, 246367, 263685, 288215, 305280, 329928, 320795, 302064, 243483, 207879, 220336, 244918, 250108, 275727, 321773, 326946, 294644, 299986, 338863, 404500, 458099, 437459, 457566, 457058, 450297, 450884, 441608, 459240, 454094, 433524, 427281, 434646, 443888, 479498, 466978, 451276, 458467, 476122, 471247, 442063, 478955, 544865, 568105, 563703, 621596, 687254, 709689, 789485, 840009, 796345, 772366, 786837, 774798, 786449, 779661, 783860, 757326, 704054, 663474, 654062, 647462, 633684, 629185, 604914, 588022, 566147, 551158, 552235, 521732, 522117, 592145, 594471, 563408, 531166, 510221, 506021, 539047, 530350, 549721, 513696, 468717, 471472, 511824, 532287, 595332, 578411, 529545, 500825, 524192, 526117, 544806, 550592, 540522]
12930E40522j0153l3584l7474q743l9103K87q03l159m6845o2446L361M128q774
12917B97214k3172j4686K2243l7100k1360J4010K5361N015j4788l4234O273k581
12905B22195K3689K3415j2327n4367k2515j4828O598l372k0640L4140K743L596
12893A88327K504L0511l955J1387K0184o823l177l085o1511l2482P516K4491M9739
12880B23626k4934m5972L2188N219j5932j0258K540R391L4392q684P27j1376k7907
12867A63020m088J1447l8509k4631K4238L7999k077j3943m756L1377o166l4137
12855A39774j3526J0319L9975K2298n380K3916L6517O509m2043q596j069k5670
12843A83024o682L9292J4322n777m2593k6876m361m257Q273k0251j1527j6761
$$ y = [540522, 530369, 496785, 459311, 450568, 411465, 411752, 410949, 407790, 360945, 298499, 301860, 305988, 297214, 274042, 259356, 281599, 244499, 223139, 237149, 262510, 267525, 252737, 218503, 224776, 222195, 245884, 269299, 256972, 202605, 180090, 165262, 171860, 168488, 147848, 181988, 184731, 188327, 190831, 221342, 217387, 228774, 248958, 242135, 238958, 235873, 174362, 141880, 149396, 173887, 223626, 198692, 152720, 184908, 190127, 174195, 163937, 166477, 175868, 210260, 201576, 202303, 190927, 163020, 158932, 170379, 131870, 107239, 131477, 169476, 167399, 153456, 148700, 180077, 173911, 139774, 126248, 136567, 176542, 198840, 193460, 217376, 253893, 260402, 218359, 209763, 208694, 183024, 176342, 215634, 229956, 224179, 181586, 154710, 150349, 146092, 154365, 134114, 122587, 105826]
12831A05826K0525K7766K9825j5599j0799j9530q641L1488J0148K3704K2454J292
12819B18459J0723k0354l1191j2908j8584R603M3573J7941j047J5661j3905K909
12807B20880p281K4358K0332l0638j5232K3677P4o24M089j6351L8985J5141L24
12794B77734N89k338L2188k709j5514m1155j108N3675L4505j8282J085m787k7401
12781B86482M0367M4085m2034j0256j0963l0198P795K1335K152J5833J3054J6013
12769C53665L154m97N105N505m971q450j3098K6667j2754j546k7228n634j8166
12756C01752j1426J0958J6270j3355j0333L3002K1392j8809p162K0284O79k2818
12744C20434m10k6791l834J0660J7712l829O4156J0131J6297J1844k2459j4557
$$ y = [105826, 126351, 154117, 183942, 168343, 157544, 138014, 129373, 160861, 171009, 194713, 217167, 218459, 229182, 208828, 177637, 164729, 146145, 155748, 199321, 217262, 216215, 231876, 217971, 220880, 213599, 237957, 258289, 227651, 212419, 236096, 236170, 235546, 239635, 223284, 262269, 277410, 277734, 278323, 275985, 308173, 305464, 289950, 248795, 247687, 301362, 335867, 317585, 318670, 313883, 286482, 326849, 370934, 328900, 318644, 307681, 277483, 285278, 306613, 308765, 324598, 337652, 353665, 356819, 356322, 361427, 366932, 361961, 353511, 340413, 367080, 354326, 352780, 325552, 319918, 301752, 290326, 301284, 317554, 304199, 293866, 326868, 348260, 329451, 322289, 342573, 343252, 320434, 320024, 293233, 289399, 300059, 317771, 313942, 378098, 388229, 404526, 416370, 393911, 379354]
12732C79354L548p537N347j2821k5720J6579L8206J0836j8252j0062Q938n713
12720C82703K2J7492K8578J3005J2559j4112j2383j9349K7184M5837K482J0237
12708D94255j6513k2394M7558M1224k076o9367m8254k7838K7205K6313J6076L30
12696D66519M3238J2005j3086n170M9965J6056N8032K9167p929j5673L80j0780
12684F22724L2077M7558R502J197L2426J2110J8115L5470M5711K5645m115J9685
12672H98105K1487J5862K797J4475M699K1515M5414N349m1772p354K329j6211
12660I66695j9149J2951l8J0088J1887L4544K8754J425K2510M0792P3789K9040
12648A213288l0314R45O361m477k0878K2343Q0355M5596M903k0767J7183M2897
$$ y = [379354, 382902, 375365, 380712, 367891, 342171, 358750, 396956, 407792, 389540, 379478, 388416, 382703, 382725, 400217, 428795, 441800, 454359, 440247, 427864, 408515, 435699, 481536, 484018, 494255, 477742, 455348, 502906, 544130, 542054, 472687, 424433, 396595, 423800, 450113, 466189, 466519, 509757, 521762, 508676, 503506, 553471, 569527, 627559, 656726, 648797, 633124, 633504, 622724, 654801, 702359, 711861, 713058, 745484, 757594, 775709, 811179, 856890, 882535, 878420, 898105, 919592, 935454, 938251, 952726, 957425, 978940, 1024354, 1029703, 987931, 980577, 982906, 966695, 947546, 960497, 960459, 970547, 982434, 1016978, 1045732, 1047157, 1069667, 1110459, 1184248, 1213288, 1182974, 1183919, 1190280, 1185803, 1164925, 1187268, 1267623, 1313219, 1318122, 1297355, 1314538, 1357435]
12636A357435N950L800J7933n734J4992N1554J2266j0997M1473P5817j4389k3377
12624A526723K5233J9657N3831O8182K9322J6010M8657K8907N6320N6813M6400
12613A976055O9638L8964M551J4793n403L6404N3389P2974N6778M1893L8977N9296
12601B458309L0627L8787J10860J07757R9082R2731Q6463R0563J19560J79325
12591C414064J31778P9179J07438J64203J78472J72482J76206J92058J83990J89566
12581D989436K23403K37359K24277K36241K96493L31180L27084L84896M41299
12572G691668M68382N36567O07229O68313P91111Q99582J014024J166260J330578
12563A5173714J540176J791515K044287K362068K764719L246706L795149M263917
$$ y = [1357435, 1363385, 1367185, 1385118, 1379384, 1394376, 1445930, 1458196, 1447199, 1488672, 1564489, 1550100, 1526723, 1551956, 1571613, 1625444, 1693626, 1722948, 1738958, 1787615, 1816522, 1872842, 1929655, 1976055, 2045693, 2084657, 2089208, 2104001, 2098598, 2135002, 2188391, 2261365, 2318143, 2360036, 2399013, 2458309, 2488936, 2527723, 2638583, 2746340, 2845422, 2938153, 3024616, 3115179, 3234739, 3414064, 3545842, 3625021, 3732459, 3896662, 4075134, 4247616, 4423822, 4615880, 4799870, 4989436, 5212839, 5450198, 5674475, 5910716, 6207209, 6538389, 6865473, 7250369, 7691668, 8160050, 8696617, 9303846, 9972159, 10763270, 11662852, 12676876, 13843136, 15173714, 16713890, 18505405, 20549692, 22911760, 25676479, 28923185, 32718334, 36982251]
12555C6982251M792751N205186N341401N177771M743672M176970L337531K332536
12547G2090069J343140K80355o91404j351043j723482j847661j751854j442110
12539F4906010r78276m48923J11254P60851J397298J948523K441463K875088L211374
12530G6224662L468797L584171L574387L568556L531943L383473L178637K838758
12522A03353384K475602J992238J515995R61413M20524r8439o61850j074693j324136
12513A07560038j493879j578760j630880j657648j710700j759484j900696k045650
12505I3782341k235044k331486k345089k311571k108643j812601j427647r22216
12497G8288044k87852L53702J096564J821474K445798K841060K943602K686803
$$ y = [36982251, 41775002, 46980188, 52321589, 57499360, 62243032, 66420002, 69757533, 72090069, 73433209, 73713564, 73022160, 71671117, 69947635, 68099974, 66348120, 64906010, 63927734, 63478811, 63590065, 64350916, 65748214, 67696737, 70138200, 73013288, 76224662, 79693459, 83277630, 86852017, 90420573, 93952516, 97335989, 100514626, 103353384, 105828986, 107821224, 109337219, 110298632, 110719156, 110620717, 109958867, 108884174, 107560038, 106066159, 104487399, 102856519, 101198871, 99488171, 97728687, 95827991, 93782341, 91547297, 89215811, 86870722, 84559151, 82450508, 80637907, 79210260, 78288044, 78000192, 78353894, 79450458, 81271932, 83717730, 86558790, 89502392, 92189195]
12489I2189195K141589J280312K25556r49207k142960l366558m391294n031601
12481G9955032n371745n452516n256073m972785m610533m194550l755209l406589
12473D2935032l058707k718086k354009k072667j920417j685406j576395j381197
12465B6168148j274630j252755j142031j032814r68826r03707q22859p68575p22986
12456A7278965o54152n90434n54802n54229m97891m38526m65016m72949m49568
12447A2601398l89720l72888m06016l55252l17121l32122k53767k98518l15323
12438I560671l05492k74462k42163k15214k23685k38619k29126k48537k22265
12429G361108j71844j92972k19366j64720j57848j52890j39992j37046j60497
$$ y = [92189195, 94330784, 95611096, 95836652, 94887445, 92744485, 89377927, 84986633, 79955032, 74583287, 69130771, 63874698, 58901913, 54291380, 50096830, 46341621, 42935032, 39876325, 37158239, 34804230, 32731563, 30811146, 29125740, 27549345, 26168148, 24893518, 23640763, 22498732, 21465918, 20497092, 19593385, 18770526, 18001951, 17278965, 16624813, 16034379, 15479577, 14925348, 14427457, 13988931, 13523915, 13050966, 12601398, 12211678, 11838790, 11432774, 11077522, 10760401, 10428279, 10174512, 9875994, 9560671, 9255179, 8980717, 8738554, 8523340, 8299655, 8061036, 7831910, 7583373, 7361108, 7189264, 6996292, 6776926, 6612206, 6454358, 6301468, 6161476, 6024430, 5863933]
12420E863933j76110j40721j08895j56291j66165j35274j01124j30517r2432j14974
12410D541430j49165j41165j29109j14717l3659q1334j29706j07970j00076j00787
12400C453742o2412p0903n3651j20310o3869r2960r6714m2588n035l5373o6316
12389B743611r3559r0202n3932o2797m3061l3751p1803m3791o3336m0051n1872
12378B095456k1679J9410n4740p704L3747R763k1479m1280J9615o780k1246O179
12366B009262K5517K6019n5509m1740l7435R56j7731p4010p6967o8259l4692m3736
12354A611675j07163n3549o80R631L507m2819k7132l9978j3125j7650J910j3194
12342A311433j2323m626J803j683L1303O92k0127P707K1857L4119j2230k2774
$$ y = [5863933, 5687823, 5547102, 5438207, 5281916, 5115751, 4980477, 4879353, 4748836, 4656404, 4541430, 4392265, 4251100, 4121991, 4007274, 3973615, 3892281, 3762575, 3654605, 3554529, 3453742, 3391330, 3320427, 3266776, 3146466, 3082597, 2989637, 2892923, 2850335, 2845300, 2809927, 2743611, 2650052, 2559850, 2505918, 2443121, 2400060, 2366309, 2294506, 2250715, 2187379, 2147328, 2095456, 2073777, 2093187, 2038447, 2030743, 2064490, 2074253, 2052774, 2011494, 2031109, 2024329, 2003083, 2009262, 2034779, 2060798, 2005289, 1963549, 1926114, 1927070, 1909339, 1835329, 1758362, 1690103, 1655411, 1611675, 1504512, 1450963, 1450283, 1459914, 1463421, 1420602, 1393470, 1353492, 1340367, 1322717, 1324627, 1311433, 1299110, 1294484, 1296287, 1294604, 1325907, 1326599, 1306472, 1314179, 1336036, 1370155, 1357925, 1335151]
12330A335151k1060m230L3314L2510L7018R5220O6651O8941M0103K091Q550K5504
12318A719763Q134m955n9736j61913j40885o4845j9075q226N001L8523j1691m9377
12306A250718j02105m8421M3625J6665r511J1913k0355q682j8430l3195l1393
12295A050829k8414k0120k9718j2527L0108K8002O6k363J649m6172J5309K6616
12283A013265M17Q839k1181k3744M367L0419J5445k9169n403l2968m9161m4156
12271H66970k5034k2232o2124m8340k2848K3113k359l4038k9141J1513p225l4318
12259F13937k2291N268J3734k8856k1543j1247L1863J0420l0789j46L75j3576
12247E47149P728K3449R79p191j3588J8037N0030J7572j4496j1065j5409k5122
$$ y = [1335151, 1314091, 1309861, 1343175, 1375685, 1412703, 1507923, 1574574, 1643515, 1683618, 1685709, 1694259, 1719763, 1727897, 1722942, 1663206, 1501293, 1360408, 1295563, 1276488, 1268262, 1273263, 1311786, 1300095, 1250718, 1148613, 1100192, 1143817, 1160482, 1150971, 1162884, 1142529, 1133847, 1115417, 1082222, 1050829, 1022415, 1002295, 972577, 960050, 990158, 1018160, 1018226, 1015863, 1017512, 971340, 986649, 1013265, 1013682, 1022521, 1001340, 977596, 981963, 1012382, 1027827, 998658, 993255, 960287, 911126, 866970, 841936, 819704, 757580, 709240, 686392, 709505, 707146, 673108, 643967, 655480, 648255, 613937, 591646, 596914, 610648, 581792, 560249, 549002, 580865, 591285, 560496, 560350, 560725, 547149, 554877, 578326, 579305, 572114, 558526, 576563, 626593, 644165, 629669, 618604, 603195, 578073]
12235E78073j4678n566m4011l4197Q296k888k8953l4552J6641j1621P522j3136
12223D20930j8195j1026K645J8365J2057j0642n837k1226K4468M0932j7087j7104
12211D18280k8170p243j1640n018q418K6116k5122k4798J8735K7728K7305j4685
12199C93070K719K4864k865j8597l443K9111J2642J6482M7877L0555j769m9038
12187D81608l3292n2025m3841J245k5282j4440L7824L761l4066J2648K1726K7978
12175C83844j8483q033L6261K0717J3193j5036J8813K7330j926K4250j8411k4242
12163D38277j1095J9877J2804k3440j0472k5161l2560L615M6999r688k7917K2510
12151D03749K2572j5217j4813L566k6462l7255K2353K1776k054K2442K3722j9406
$$ y = [578073, 563395, 557829, 513818, 479621, 487917, 485029, 456076, 421524, 438165, 426544, 434066, 420930, 402735, 391709, 394354, 412719, 424776, 414134, 408297, 387071, 411539, 452471, 435384, 418280, 390110, 382867, 371227, 366209, 357791, 383907, 358785, 333987, 352722, 380450, 407755, 393070, 395789, 420653, 417788, 399191, 395748, 424859, 437501, 453983, 501860, 532415, 530646, 481608, 448316, 396291, 352450, 353695, 328413, 313973, 351797, 355558, 321492, 334140, 355866, 383844, 365361, 357328, 393589, 414306, 427499, 412463, 431276, 458606, 456680, 480930, 462519, 438277, 427182, 447059, 459863, 436423, 425951, 400790, 368230, 371845, 418844, 409156, 381239, 403749, 426321, 411104, 396291, 399857, 373395, 336140, 358493, 380269, 378215, 400657, 424379, 404973]
12139D04973k2658j1168J3801L632k0387L5338N448Q57J0315J2970j8000m8847
12127C66274l70L7516K1675j608l7697M7447O1420J2973m642r740J2886O418L330
12114E15882M5286q154K2790K4255K3952p609Q041k1446o634M7504L0310K0078
12102F94255L148K0337j2008K4261J5806L171M596L7406l97m521M4k6570j4476
12089G45052j115J545K8279k5659l7509K73M7542L1879k031j05K5100L8197N5463
12076I06911J5433J1467M2127O6697N7152M2486R4745J46316J32261R4042N5212
12065A664849O5468R4384R625j1367n0099n7330q4225o1305l2525N862l2496k3286
12053A487555m645k755k362J1864J2837K8042r262L5841L0239K9886r203Q182
$$ y = [404973, 382315, 371147, 384948, 388580, 368193, 403531, 408979, 409836, 420151, 433121, 415121, 366274, 365904, 403420, 425095, 423487, 385790, 433237, 494657, 507630, 502988, 493248, 506134, 512552, 515882, 561168, 553014, 575804, 600059, 624011, 616402, 624443, 602997, 596363, 643867, 674177, 694255, 697403, 717740, 705732, 729993, 745799, 748970, 753566, 790972, 790575, 786054, 786098, 759528, 745052, 743937, 745482, 773761, 748102, 710593, 710866, 758408, 790287, 788256, 788151, 813251, 851448, 906911, 922344, 933811, 975938, 1042635, 1099787, 1142273, 1237018, 1383334, 1515595, 1609637, 1664849, 1730317, 1824701, 1834326, 1822959, 1772860, 1715530, 1631305, 1570000, 1537475, 1543337, 1510841, 1487555, 1482910, 1480155, 1477793, 1489657, 1502494, 1530536, 1521274, 1557115, 1587354, 1617240, 1608037, 1616219]
12041A616219K6086Q5322K4347j474J1888O006L3552L2376J2261M8653K9086O844
12029A931166p991l0413n2067n0896J9399J8670j7762K3182K5235j4775n1330
12018A792418r544M5693j2118j6197J421N5874J5031p957J0614J4289L8737K532
12006A930793M8541M7461J9244K4332J5063J9918L6518K1535K6855J8823p4332
11995B134751k5671L9364O4074M4821M8474K6057O8758N4486P8928J06085R1425
11984B731552J6989N3678R9587J11614J09472J06029J21695J52614J48985J34937
11974C787152J69011K04862J61511J82244K35377K38457K84436K91987L29110
11965E884147M08828M39754M76877N97475P21406Q65104R77018J106096J269839
$$ y = [1616219, 1642305, 1727627, 1751974, 1750500, 1762388, 1768394, 1801946, 1834322, 1846583, 1895236, 1924322, 1931166, 1923175, 1892762, 1840695, 1789799, 1809198, 1827868, 1810106, 1833288, 1858523, 1843748, 1792418, 1782874, 1828567, 1816449, 1800252, 1801673, 1857547, 1872578, 1864621, 1875235, 1889524, 1928261, 1930793, 1979334, 2026795, 2046039, 2070371, 2085434, 2105352, 2141870, 2163405, 2190260, 2209083, 2134751, 2109080, 2148444, 2212518, 2257339, 2305813, 2331870, 2400628, 2455114, 2534042, 2640127, 2731552, 2748541, 2802219, 2901806, 3013420, 3122892, 3228921, 3350616, 3503230, 3652215, 3787152, 3956163, 4161025, 4322536, 4504780, 4740157, 4978614, 5263050, 5555037, 5884147, 6292975, 6732729, 7209606, 7807081, 8528487, 9393591, 10370609, 11476705, 12746544]
11956A2746544J514340J820978K179298K643851L195399L945088N021417O571794
11948C9638709Q756380J1962578J6822925K3920088L3755262M4134436M7576157
11941B26566535L5669711J9575160J7756990J9949799R194771j4589526l5565085
11934B78558355m1043842l5193048k8155492k4098455k1526539j8364060j5084055
11927I5092864j2203825r813328p896838o364456n208670m360681l819270l267394
11919D2158402k833639k356193k095204j946089j797341j706939j647766j546638
11911B6228593j408043j296370j102773j033008r03027p72108o96031n94033n58516
11902A7864684o12740o20401n88875n76302n19857n27268n21433n13265n03882
$$ y = [12746544, 14260884, 16081862, 18261160, 20905011, 24100410, 28045498, 33066915, 39638709, 48395089, 60357667, 77180592, 101100680, 134855942, 178990378, 226566535, 262236246, 281811406, 299568396, 319518195, 328712966, 314123440, 278558355, 237514513, 202321465, 174165973, 150067518, 128540979, 110176919, 95092864, 82889039, 73075711, 65178873, 58814417, 53605747, 49245066, 45425796, 42158402, 39324763, 36968570, 34873366, 32927277, 31129936, 29422997, 27775231, 26228593, 24820550, 23524180, 22421407, 21388399, 20485372, 19713264, 19017233, 18423200, 17864684, 17251944, 16631543, 16042668, 15466366, 14946509, 14419241, 13897808, 13384543, 12880661]
11893A2880661m75632m76641m77309m32570l51416k67158l04115l09203l08544
11884I478073l18964l03841l13226k73505k47455k57366k25943j78733j70173
11875G188867j74125j45762j67951j61516j25008j42582k11731j75748j60416
11866E724028j77496j41245j35468r8293j29717j61358j56038j45345q4709r7343
11856D397016p4148p4629j19665r1555j03291j16116j08487o2679q4128r0964
11846C471354r9340p3336r5140q9881j8674p1210q2829n5827n2662r3207q3247
11835B656001o7828l7856l6254q5373n2059j7107o2811n4223k2998N1o4030l3890
11823B121623k2438m4329k6310o1917n5875l6499k2170o806l6808j09218l4364
$$ y = [12880661, 12405029, 11928388, 11451079, 11018509, 10667093, 10399935, 10095820, 9786617, 9478073, 9159109, 8855268, 8542042, 8268537, 8021082, 7763716, 7537773, 7359040, 7188867, 7014742, 6868980, 6701029, 6539513, 6414505, 6271923, 6060192, 5884444, 5724028, 5546532, 5405287, 5269819, 5171526, 5041809, 4880451, 4724413, 4579068, 4494359, 4397016, 4322868, 4248239, 4128574, 4037019, 3933728, 3817612, 3709125, 3646446, 3562318, 3471354, 3372014, 3298678, 3203538, 3113657, 3094983, 3023773, 2940944, 2885117, 2832455, 2739248, 2656001, 2588173, 2550317, 2514063, 2428690, 2376631, 2359524, 2296713, 2242490, 2219492, 2219543, 2155513, 2121623, 2099185, 2054856, 2028546, 1966629, 1910754, 1874255, 1852085, 1845279, 1808471, 1699253, 1664889]
11812A664889l6746k502l0431o401n8953m7895j9908l4179m2081n8091m1422J3706
11800A299986L210m0734j7390j6396J3091n052l8505K0732k3102q960k8960k1605
11788A136315k4360m576l0456l1762n1044l035L0097k2829n9622k4584j6575K5141
11776I22710j9739k0545j4710J4279J589K0357j3053k6950Q708j1599K5923O871
11764H93841N2011J1551l2351J5684L2735m4331j2629J2766L6892J2044K7136
11753A005349J4245K638K6222N2595P552P625L9016J9258l359M3913N6269R961
11741A281284J9826J2378L5790O3398N316k373Q795K8399O089J2383L7844J6594
11729A525723k6321k2264l0766K629O419J8393k398P866L0167K5620j7153J395
$$ y = [1664889, 1628143, 1625641, 1595210, 1588809, 1529856, 1481961, 1462053, 1427874, 1385793, 1327702, 1286280, 1299986, 1303196, 1262462, 1245072, 1228676, 1241767, 1236715, 1198210, 1218942, 1195840, 1186880, 1157920, 1136315, 1111955, 1107379, 1076923, 1045161, 994117, 991082, 1021179, 998350, 938728, 914144, 897569, 922710, 902971, 882426, 867716, 881995, 883584, 903941, 890888, 863938, 872646, 861047, 886970, 893841, 945852, 957403, 925052, 940736, 973471, 929140, 916511, 929277, 966169, 978213, 1005349, 1019594, 1022232, 1048454, 1101049, 1108601, 1116226, 1155242, 1174500, 1171141, 1215054, 1271323, 1281284, 1301110, 1313488, 1349278, 1412676, 1417992, 1415619, 1424414, 1452813, 1458902, 1471285, 1509129, 1525723, 1499402, 1477138, 1446372, 1449001, 1455420, 1473813, 1471415, 1479281, 1509448, 1535068, 1517915, 1519310]
11717A519310M8093K134k2435j6582L319K9848o178L769R914j4627p118M1402
11705A590849M3500K0943q933K6070J7483K7038o237o979L2441M0995K0396K8215
11693A825781K9021M3102L1048M5140J4464N3871N1919P809K8016L7632K5282
11682B193085M9606Q0221P4683P17k2345N1080Q8995N1458M3761M1819M8127P8885
11670B780092N5364M2858R8989N7622N6283P6087O6645Q6045O6999R0770J01543
11659C579297Q6021R3046J36626J55111J15158J28606J69058J70251J67784J77667
11649D978625J74948J77827K33674K20850K35958K66557L21338L28942L48120
11640G286839L77961M06889M93935N20572O40600P36340P61473Q26257R85286
$$ y = [1519310, 1567403, 1569537, 1547102, 1530520, 1533839, 1563687, 1557509, 1561278, 1571192, 1556565, 1549447, 1590849, 1634349, 1655292, 1646359, 1672429, 1689912, 1716950, 1710713, 1703734, 1736175, 1777170, 1797566, 1825781, 1854802, 1897904, 1928952, 1974092, 1988556, 2042427, 2094346, 2102155, 2130171, 2167803, 2193085, 2242691, 2322912, 2397595, 2398312, 2375967, 2427047, 2516042, 2567500, 2611261, 2653080, 2701207, 2780092, 2835456, 2878314, 2977303, 3034925, 3091208, 3167295, 3233940, 3319985, 3386984, 3477754, 3579297, 3665318, 3758364, 3894990, 4050101, 4165259, 4293865, 4462923, 4633174, 4800958, 4978625, 5153573, 5331400, 5565074, 5785924, 6021882, 6288439, 6609777, 6938719, 7286839, 7664800, 8071689, 8565624, 9086196, 9726796, 10463136, 11224609, 12050866, 13036152]
11631A3036152J121874J339119J542134J750949K062827K407666K734616L127966
11623B9123303L667441M271177M787863N244782N609476N770280N597868N152977
11615F9225167M384732L464114K406643J199456Q6008q96187j679855k102208
11607G6087870k211932k056759j696872j246064o87438m1150N23612J085639J521693
11598G1278599J806775K009238K233508K286837K302377K328071K339895K394389
11590H8979689K533168K619752K733821K791273K675755K491982K143459J683893
11582A08652792J130456N02054j62705q21137j367133j798083k076808k272052
11574A01787384k464139k603986k676893k823641k923002k946744k878470k741125
$$ y = [13036152, 14158026, 15497145, 17039279, 18790228, 20853055, 23260721, 25995337, 29123303, 32790744, 37061921, 41849784, 47094566, 52704042, 58474322, 64072190, 69225167, 73609899, 77074013, 79480656, 80680112, 80766120, 79869933, 78190078, 76087870, 73875938, 71819179, 70122307, 68876243, 68188805, 68147655, 68671267, 69756906, 71278599, 73085374, 75094612, 77328120, 79614957, 81917334, 84245405, 86585300, 88979689, 91512857, 94132609, 96866430, 99657703, 102333458, 104825440, 106968899, 108652792, 109783248, 110285302, 110122597, 109301460, 107934327, 106136244, 104059436, 101787384, 99323245, 96719259, 94042366, 91218725, 88295723, 85348979, 82470509, 79729384]
11566G9729384k558337k296299j886824j350208q04716j92720M95913J124399
11558G2260592J693930K062586K225822K186774J840841J239718M58755n10402
11550H3458616j512260k477461l335204l974598m376962m510540m453203m340190
11542E4478198m106024l737436l405317l104185k772942k476396k197645j955930
11534C0722323j721045j546885j364767j257081j145223j046595r67050r09852
11526B0763825q88982q07398p23643o51156o44376o40786n54276m87136n02673
11517A4863399m67128m44075m40439m10263m09655l98622m21381l88664l41399
11508A1141773l31726l30094l00791k70575k61175k18841k16943j92826j68006
$$ y = [79729384, 77171047, 74874748, 72987924, 71637716, 70833000, 70640280, 71136193, 72260592, 73954522, 76017108, 78242930, 80429704, 82270545, 83510263, 83969018, 83458616, 81946356, 79468895, 76133691, 72159093, 67782131, 63271591, 58818388, 54478198, 50372174, 46634738, 43229421, 40125236, 37352294, 34875898, 32678253, 30722323, 29001278, 27454393, 26089626, 24832545, 23687322, 22640727, 21673677, 20763825, 19874843, 19067445, 18343802, 17692646, 17048270, 16407484, 15853208, 15366072, 14863399, 14396271, 13952196, 13511757, 13101494, 12691839, 12293217, 11871836, 11483172, 11141773, 10810047, 10479953, 10179162, 9908587, 9647412, 9428571, 9211628, 9018802, 8850796]
11499H850796j71657j76032k00730k25345j85696j71065j66838j93075j92513
11490G167845k04891j33158j18446j48249j62079j49078j03900j51971j29734
11481E866339j69852j67011j50341j26077j31703j49783j50238r9989p5351k1762
11471D624232n0285o6270q8037j25122j08983j00725p8867q5341j49439r3504
11461C677659m4579j03723j07633r7669l7761o8951p7851j1053o1283q3785r0573
11450B892798j02134j29448j02285n8830o5411m6509m5513p4546l1137m5013n1687
11439B140285m8805j7784J8030p0093n7879p0231j9294q525k2859q3454p2133
11428A687258n5363k1874j5465n1500k0849l6515m0308j5477k7704j5310m346
$$ y = [8850796, 8679139, 8503107, 8302377, 8077032, 7891336, 7720271, 7553433, 7360358, 7167845, 6962954, 6829796, 6711350, 6563101, 6401022, 6251944, 6148044, 5996073, 5866339, 5696487, 5529476, 5379135, 5253058, 5121355, 4971572, 4821334, 4721345, 4645994, 4624232, 4573947, 4507677, 4419640, 4294518, 4185535, 4084810, 4005943, 3920602, 3771163, 3677659, 3633080, 3529357, 3421724, 3324055, 3286294, 3217343, 3139492, 3128439, 3067156, 2983371, 2892798, 2790664, 2661216, 2558931, 2500101, 2434690, 2388181, 2342668, 2268122, 2236985, 2191972, 2140285, 2091480, 2073696, 2091726, 2021633, 1963754, 1893523, 1874229, 1865704, 1842845, 1759391, 1687258, 1631895, 1610021, 1594556, 1543056, 1522207, 1485692, 1445384, 1429907, 1402203, 1386893, 1382547]
11417A382547k1903p8521j2462L0164k0477m2920n9352l8052J3413J1426J8612
11406A182475k0437k8666l6106n6488j6256L0373J2335j5944K637M778j7670l5732
11394A005299j9895k6242l0314j3941k7795K5313J0369j9288j1958P422K0047
11383I19017P93L1667k8834l9230l5697k5815P485k4438r085J3221L0214j1183
11371H28115n5502l2512J1127J1648M530k448K7946k6761p553L7361m3911m0507
11359G11533K2422K5596k4475l1406J811J2921m7034K5636j0851j2813k8581J2690
11347F57449k443J5245j0966J8812l1781l2272o946Q803J7714j4453k1159l0878
11335E67125n966K3573J2764j3320q777j9203j7J645K1805l3299o31N895l8749
$$ y = [1382547, 1360644, 1282123, 1269661, 1299825, 1279348, 1236428, 1177076, 1139024, 1152437, 1163863, 1182475, 1162038, 1133372, 1097266, 1040778, 1024522, 1054895, 1067230, 1051286, 1053923, 1058701, 1041031, 1005299, 985404, 959162, 928848, 914907, 887112, 912425, 922794, 903506, 891548, 898970, 919017, 919810, 951477, 922643, 883413, 847716, 821901, 829386, 804948, 795863, 809084, 839298, 828115, 772613, 740101, 751228, 762876, 767406, 764958, 792904, 766143, 758590, 795951, 752040, 711533, 733955, 759551, 735076, 703670, 705481, 718402, 671368, 697004, 686153, 673340, 644759, 657449, 655006, 670251, 659285, 678097, 646316, 614044, 607098, 615901, 633615, 619162, 598003, 567125, 561159, 584732, 597496, 584176, 575399, 556196, 556179, 557824, 579629, 546330, 545699, 551594, 512845]
11322E12845j8351p383K0073j4132J5826n6024j2206L2204J7980j2564k9409L4601
11310D83460L838m844Q407K4138p411l8917J5388L7702R337j3568j1262M2627
11298E48895J9930K0609K4470j5392m4603l987l0997m1941m934L3862J8133N893
11286E29938m641p703R660K289r139j0621n182O678K6996K402Q798j3502j0281
11273E25692J0553j6021k2124j791K7004L6548K4334N399m4794j9762j061r715
11261E14262J1956N82N799j9777j6376K3811N187j1043j5839j5497k0564J8524
11249D81025k3533j3518O532L132J126M6229n948k3741j4311j6060K45K9912L534
11236D74624M7676M1035Q069l0624j0959j2409o326r656l100j3738n3970k0919
$$ y = [512845, 494494, 487111, 507184, 493052, 508878, 452854, 440648, 472852, 490832, 478268, 448859, 483460, 487298, 482454, 490861, 514999, 507588, 468671, 484059, 521761, 531098, 517530, 506268, 548895, 568825, 589434, 613904, 598512, 553909, 549922, 518925, 476984, 472050, 505912, 524045, 529938, 525297, 517594, 527254, 529543, 520404, 509783, 504601, 511279, 538275, 540677, 549475, 535973, 525692, 536245, 520224, 498100, 496309, 523313, 559861, 584195, 589594, 544800, 525038, 523977, 514262, 526218, 526800, 532599, 512822, 496446, 520257, 525444, 514401, 498562, 483065, 462501, 481025, 457492, 443974, 450506, 453638, 454764, 500993, 495045, 471304, 456993, 440933, 441178, 471090, 474624, 522300, 563335, 571404, 540780, 529821, 517412, 511086, 501430, 498330, 484592, 430622, 409703]
11224D09703n279l509J9876m160J7571l2339n2861K5460Q427P210O06k987j5019
11211C72699j0717Q17P718L858n568J8356J7304N63j1491n488J344k90j933L654
11197C90826L244l763j9690J8704J5986l986o073L7680M5476K4734Q213j4865
11185D96486J2393L5395K1593M606M061R730K0185m834k934N272m9870j0644J7954
11172E59393L6502J7265j0166k931J2444M5355K9417j4094j3471m825j7836m7386
11160E89667K6130L0233L5068j0314J7729J0359J6285j0971N047l3118k6378J2341
11148F62078K7032K0731J532k9500m8571m321j7439M833J4178l0900j2442l210
11136E84001P102o908R327k2584n601M701j9279p048q831J3848l8449K2293L6954
$$ y = [409703, 404424, 400915, 420791, 416631, 434202, 401863, 349002, 374462, 382889, 390099, 390705, 387718, 372699, 361982, 362799, 370517, 374375, 368807, 387163, 404467, 405030, 393539, 388051, 389395, 389105, 387172, 390826, 394070, 390307, 370617, 389321, 405307, 401321, 395248, 432928, 478404, 503138, 511351, 496486, 508879, 544274, 565867, 570473, 574534, 584264, 604449, 599615, 596681, 601953, 552083, 541439, 559393, 595895, 613160, 602994, 600063, 612507, 657862, 687279, 673185, 659714, 654889, 637053, 589667, 615797, 646030, 681098, 670784, 688513, 698872, 715157, 704186, 709233, 676115, 649737, 662078, 689110, 709841, 711373, 681873, 633302, 628981, 611542, 616375, 630553, 599653, 587211, 584001, 591103, 584195, 593522, 570938, 565337, 570038, 550759, 543711, 534880, 548728, 510279, 532572, 569526]
11123E69526j292J722q050j9764j0984K2618K6524k9119l7478n3661K499Q498
11111D71039m0119j4484R228K0268k9444j4934n018q539n8701k8048q899N384
11099B97733K5755Q544r31j4919j5976m6421j8447r966J928K2368j2952J5277
11087B51993K184k7531J6090m066q783k6536j0599L1013J004N597L0588n030l5040
11074B20884k8157l8728k3167J6314J6321L4394J8101k9036q679L9434K2981n2281
11062A88381j6739J8640k8539o905k9742k7290p492K7645J3330j1330K8940k537
11050A46362k8487l518l2437n250K5703N873K1795M6378L4891j0041k2171n552
11038A73546J9467N2931J7849n7027n872M9869r587j0693J0782L5900L9493K647
$$ y = [569526, 568234, 569956, 561906, 542142, 531158, 553776, 580300, 551181, 513703, 460042, 462541, 471039, 430920, 416436, 425664, 445932, 416488, 401554, 396536, 387997, 329296, 301248, 292349, 297733, 323488, 332032, 331101, 316182, 300206, 253785, 235338, 225372, 227300, 249668, 236716, 251993, 254177, 226646, 242736, 238670, 229887, 203351, 192752, 223765, 224769, 230366, 260954, 255924, 220884, 192727, 153999, 130832, 147146, 163467, 197861, 215962, 186926, 178247, 217681, 240662, 188381, 171642, 190282, 161743, 154838, 125096, 97806, 90314, 117959, 131289, 119959, 148899, 146362, 117875, 114357, 81920, 76670, 102373, 108246, 130041, 176419, 211310, 201269, 179098, 173546, 193013, 245944, 263793, 206766, 200894, 250763, 241176, 230483, 241265, 277165, 316658, 319305]
11026C19305K863K3664K0738l915k4380l3173K9756k6700n806K7379J2144O566
11014C48441N762K8409m659n1449k5258J1218K0861l948K5455J617j8972k2435
11002C15042N538J0666J5290K806k0111l968l552l4795m4061K0697K0362k6290
10990B57624k5196j195k3752J4057J247k1413p026o174m4140l3587L064L0848
10978A44357M770K7711l0428n1064l994K7997R536J0764R511j9115k9116L0886
10966A31815K6509j4039l7190m6033K6977j60q795l735J8706Q095K2302J2505
10954A36957o532k5269k649K2780R775k4711m7103j4571L8665L7380k7939j2246
10942H4537M0688j7594m9508L9654K1229n760j4240m1606O138j856J1664K7884
$$ y = [319305, 322168, 345832, 366570, 362655, 338275, 305102, 334858, 308158, 302352, 329731, 341875, 348441, 354203, 382612, 377953, 326504, 301246, 312464, 333325, 329377, 354832, 356449, 337477, 315042, 320580, 331246, 346536, 349342, 329231, 325263, 321711, 286916, 242855, 263552, 283914, 257624, 232428, 231233, 207481, 221538, 222785, 201372, 194346, 188172, 144032, 110445, 113509, 144357, 149127, 176838, 146410, 95346, 91352, 119349, 128885, 139649, 149160, 130045, 100929, 131815, 158324, 144285, 107095, 61062, 88039, 87879, 79084, 75349, 94055, 102150, 124452, 136957, 130425, 105156, 102507, 125287, 135062, 110351, 63248, 48677, 87342, 124722, 96783, 84537, 125225, 107631, 58123, 97777, 119006, 113246, 99006, 57400, 63538, 61682, 73346, 101230]
10930A01230J457o422j4779j4852l4376j7730J0653K4738K9010q70k719P839J0888
10917I4067j719R570K1033k4932M129L3697r497k0243l5336j7197J9366J6398
10905H9336r879k0247N506k554Q024q483k8493L3364N8767k117K3522O704j2513
10892A40937j1724J8517L0459l4912q0075k1143l9757j1748N3751M0143q538j2546
10880F3364K5146Q763o471n3207j8516L6717O2858n546l0767k3167j5297K4850
10868F8727N278l3969k7883j5358p1084k907O8084P38K6845N2228M0692q031m986
10855I8374j4508p048O221p122j0777N954L4253P025j3541m2885l2575K5666J4222
10842F3259J0568j5816J0638K4219j6359J0496M4783j4122l789J7327k1088j4440
$$ y = [101230, 102687, 96265, 81486, 66634, 32258, 14528, 25181, 49919, 78929, 78059, 75340, 83179, 94067, 92348, 101918, 122951, 98019, 102148, 135845, 126348, 106105, 70769, 53572, 72938, 89336, 79457, 59210, 64716, 62162, 70186, 61703, 33210, 66574, 125341, 123224, 146746, 153450, 140937, 129213, 147730, 178189, 143277, 63202, 42059, 2302, -9446, 44305, 84448, 75910, 63364, 88510, 97273, 90802, 37595, 19079, 55796, 118654, 113108, 82341, 59174, 43877, 68727, 74005, 40036, 12153, -3205, -74289, -77196, -9112, -8374, 18471, 70699, 111391, 103360, 98374, 83866, 76818, 83039, 75917, 65140, 71094, 105347, 112372, 98831, 55946, 23371, 49037, 63259, 73827, 58011, 68649, 92868, 76509, 87005, 131788, 117666, 113877, 131204, 110116, 95676]
10830I5676J9035N735P204K5969j1419l270l551m0105k5743k153L6329k2513k0204
10817F0990j1035K1455m7030k5375K4187P2762k5271k0449L0252r815m3070J7634
10805D5235J4297L6612M317k3513K8377L9291n47J0488j0620n1586K2100j4436
10793A00015l2806J5929M2629L6530m2208n311p335J26J4837R141m5457Q742K34
10780I5066j9113k8035l619M0182L5172J2240m986J5483j852J3414O24k4585l9547
10767I0444J5K0161K5647L8939j3577Q678J7923j8688L406m723k9848O445K3885
10754A68707J7653q515j023L2494O386r296k144l5020j8062l3089l315j6655n902
10741I2219j808p947n76K2526M7022o217J259N3654M5606j4056m2316k8207o893
$$ y = [95676, 114711, 120446, 127650, 153619, 142200, 138930, 135379, 95274, 69531, 67378, 103707, 81194, 60990, 49955, 71410, 24380, -995, 23192, 95954, 70683, 50234, 80486, 70671, 27601, 45235, 59532, 96144, 100461, 76948, 105325, 144616, 144069, 154557, 143937, 92351, 114451, 100015, 67209, 83138, 125767, 162297, 120089, 114778, 107443, 107569, 122406, 131547, 86090, 94832, 95066, 75953, 47918, 44299, 84481, 119653, 131893, 126907, 142390, 140538, 153952, 154576, 129991, 90444, 90459, 110620, 136267, 175206, 161629, 170307, 188230, 169542, 172948, 168225, 138377, 144822, 168707, 186360, 177845, 176822, 209316, 215702, 206406, 204262, 169242, 151180, 118091, 114776, 98121, 92219, 90411, 82464, 81888, 104414, 151436, 145219, 146478, 200132, 245738, 231682, 189366, 161159, 154266]
10728A54266J4602K161J6369K8530M292l7759M385L0472j7483k5950k7497O458
10716A52846J2629P0833J9535k2796k6289J2390K3409N3078J6084p170k441l6870
10704B65238k8624j0859k7603j7820O322J4973M5286L0643j7334P247P435O554
10692B81458L815j0958R965O174l1655P591J0613L588K6323j9495l0109L664J5913
10679B76887L5353j9396o909J277r049k9502J9651Q053j0252m235q322K4698K7960
10666C06214j9766m888P614K7260O0981J5978j9916j1350R640k7351K0792O5589
10654D30797L1375K225J6892J8696j6402l501J180j5898j1598K5186J0768K3598
10642E13318J8114J0335L310L1816K8716N225M1221M3219K6391J6183K8798P5446
$$ y = [154266, 168868, 171029, 187398, 215928, 220220, 182461, 186846, 217318, 199835, 173885, 146388, 152846, 165475, 236308, 255843, 233047, 206758, 219148, 242557, 295635, 311719, 304549, 302108, 265238, 236614, 225755, 198152, 180332, 186654, 201627, 246913, 277556, 260222, 267469, 274904, 281458, 285273, 274315, 284280, 290454, 258799, 266390, 277003, 280591, 306914, 287419, 257310, 260974, 276887, 312240, 292844, 285935, 287212, 278163, 248661, 268312, 276365, 266113, 261878, 253556, 278254, 306214, 286448, 281560, 289174, 316434, 377415, 393393, 373477, 362127, 371767, 344416, 365208, 430797, 462172, 464397, 481289, 499985, 483583, 480082, 481262, 465364, 453766, 478952, 489720, 513318, 531432, 541767, 545077, 576893, 605609, 610834, 652055, 695274, 721665, 737848, 766646, 842092]
10630H42092Q2756N4890R6992R5008Q9256J07195J44583J93869J21682J52258
10620A980581K10830K62127L32010M42523N16513P07102R00085J055944J274463
10611G682178J445363J424108J357907J296514J227511J161026R88019Q07092
10603A7389718Q93747J149913J556410K035558K317374K232719J953185J730848
10595C1259472J604318J270702Q25479L57424K42020N88124J258665J934870K267358
10586D1608432J984462J504600J175791Q93737L40098n82184j438007j857455
10578D3629474j566515r41561l81369q3250j71327l57654m54855o35895r96798
10569C8040250j576136k050688k190314k005023j610795j252763j080552j022581
$$ y = [842092, 924848, 979738, 1076730, 1171738, 1260994, 1368189, 1512772, 1706641, 1828323, 1980581, 2191411, 2453538, 2785548, 3228071, 3744584, 4451686, 5351771, 6407715, 7682178, 9127541, 10551649, 11909556, 13206070, 14433581, 15594607, 16582626, 17389718, 18283465, 19433378, 20989788, 23025346, 25342720, 27575439, 29528624, 31259472, 32863790, 34134492, 34959971, 35317395, 35559415, 36147539, 37406204, 39341074, 41608432, 43592894, 45097494, 46273285, 47167022, 47507120, 46924936, 45486929, 43629474, 42062959, 41121398, 40740029, 40656779, 40485452, 40127798, 39672943, 39037048, 38040250, 36464114, 34413426, 32223112, 30218089, 28607294, 27354531, 26273979, 25251398]
10561B5251398j026299j038983j035367j141418j359697j534576j587373j528415
10553A4999270j386980j235554j081832r60804q37571o86390o09734n53154m66837
10544G180414m17469l51868l11475k78180k49120k50918k29445k46932k02894
10535D642113j69133j96659j32696j25381j14607j70589j40490j04530q9555j16626
10525C281847j22824q3880p6275p1885o7476j27126p0867p1436o3731p5685o7355
10514B383307m4987j07719l8764p0943m6767q737o4484n8337l4988q8104j03279
10503A716198m6048o6462l7007k5338k8704n0034n321k7759n3740o7688m7768
10492A260329o867Q8l6906n9210k6694m3418o1619J1092l2827l5235n981k4504
$$ y = [25251398, 24225099, 23186116, 22150749, 21009331, 19649634, 18115058, 16527685, 14999270, 13612290, 12376736, 11294904, 10334100, 9496529, 8810139, 8200405, 7647251, 7180414, 6762945, 6411077, 6099602, 5821422, 5572302, 5321384, 5091939, 4845007, 4642113, 4472980, 4276321, 4143625, 4018244, 3903637, 3733048, 3592558, 3488028, 3398473, 3281847, 3159023, 3075143, 2998868, 2926983, 2859507, 2732381, 2661514, 2590078, 2526347, 2450662, 2383307, 2338320, 2230601, 2191837, 2120894, 2074127, 2065390, 2000906, 1942569, 1907581, 1819477, 1716198, 1670150, 1603688, 1566681, 1541343, 1512639, 1462605, 1457284, 1429525, 1375785, 1308097, 1260329, 1253462, 1253550, 1216644, 1157434, 1130740, 1087322, 1025703, 1036795, 1003968, 968733, 962752, 938248]
10480I38248l6515j6374j3247k7456j7192j6744l911j5717l4994k3437m3679j0393
10468F78589j2357m5507m363J0140j1444m5602n2134o8671n2106J6640L0070K675
10456D45930k0654K6618N5395P997m6884m7301l1261l4636K070K043j9289J2111
10444C52139O384l2436j1115l2961j2524j5407n165k3379J8436L6002j5177j8963
10432B45834k5775K594Q602J9854K2603l1753o3911j3575k9384p260N5575P352
10420A90756q894j5625l1445q669L1593k6794J1036j7338n9095j9918L7692M6716
10408A30015J0618j489J9195j3866k1427k8968L696M0850j0319k7553J6896P762
10396A25410l0641K1050K8515j2356j1126m275K9934N403j8955j7970K6174L8440
$$ y = [938248, 901733, 885359, 872112, 844656, 827464, 810720, 806809, 791092, 756098, 732661, 688982, 678589, 666232, 620725, 616362, 626502, 615058, 569456, 517322, 448651, 396545, 413185, 443255, 445930, 425276, 451894, 507289, 515286, 468402, 421101, 389840, 355204, 357274, 359317, 340028, 352139, 358523, 326087, 314972, 282011, 269487, 254080, 248915, 225536, 243972, 279974, 264797, 245834, 220059, 222653, 231255, 251109, 273712, 241959, 178048, 164473, 135089, 127829, 183404, 190756, 181862, 166237, 134792, 126123, 157716, 130922, 141958, 124620, 65525, 45607, 83299, 130015, 140633, 139144, 158339, 144473, 123046, 94078, 97774, 138624, 128305, 100752, 117648, 125410, 94769, 115819, 144334, 131978, 120852, 116577, 146511, 151914, 132959, 114989, 141163, 179603]
10384A79603k9350n7670j7141N941n813K0582K9706K758P565k7244j1495K0888
10372A18330j950k2555Q095j4980J1788J28K0611k5515l629R670p118K660m381
10359I1154q394k7809K0804R108j1479j1673j1631L4050J2034j8350J640K7273
10347A06727J8602J930l5237m989K7797q051K5621K3157j8630o030J7487Q379
10335A56763l8691j2704p299L925k172J211o386k1341j2446J4197K9833j4973
10323H9917j9062k8852M185K9260O645J4904J3388k5334J51M1538k3319j1852
10311I1569k9421M837J5931K5143j7916n2558j3276k963o131m260n715q651J7244
10298A3833J1177K1435k3676l2001J1741k392K5715K2496K717q25o616K883J766
$$ y = [179603, 150253, 92583, 75442, 81383, 75570, 96152, 125858, 128616, 136181, 108937, 97442, 118330, 116380, 93825, 101920, 86940, 98728, 98856, 119467, 93952, 90323, 99993, 92875, 95535, 91154, 82760, 54951, 75755, 84863, 73384, 61711, 50080, 84130, 96164, 77814, 79454, 106727, 125329, 127259, 92022, 87033, 114830, 106779, 132400, 155557, 136927, 130897, 148384, 156763, 118072, 105368, 98069, 101994, 99822, 101033, 94647, 73306, 60860, 75057, 104890, 89917, 70855, 42003, 46188, 75448, 82093, 96997, 110385, 85051, 85202, 126740, 103421, 91569, 62148, 66985, 82916, 108059, 90143, 37585, 24309, 21346, 15215, 10955, 5240, -3411, 13833, 25010, 46445, 22769, -9232, 2509, 117, 25832, 48328, 51045, 50220, 43604, 46487, 48253]
10285D8253q786M391k7117k0009k5625K061j2219M4592L4557j7621j4758J5043
10273B2762j0690k1747o352n310R85L6320J3329j1327o309J4034j081j6476K4901
10260C3039O376j7833j3186J5129J4675p869j6332k8668j0311J1797J7324N9809
10248F3950J2147l830L6795k035l6033k5389l7265j0030j6646J2057K9752j9347
10236D126J4513p344J5410J9922j3496m966J1967M0913K3067K233l452k7990o3586
10223A1317L0250L2576J7585j1418k8201j6590Q243K6795K3118K1839l6851p450
10211G1213J9119J5616j7344k1841p91j7307p543j035k6267l5315J5046L2969
10199B6520P076j7192o516O88K9158j11o670J5829k0243j1386K6192j2087l0991
$$ y = [48253, 39467, 43858, 16741, -3268, -28893, -26832, -39051, 5541, 40098, 22477, 7719, 22762, 12072, -9675, -16027, -21337, -20352, 15968, 29297, 17970, 11661, 25695, 24614, 8138, 33039, 39415, 21582, 8396, 23525, 38200, 30331, 13999, -14669, -24980, -13183, 4141, 63950, 76097, 72267, 109062, 107027, 70994, 45605, 8340, -1690, -18336, -6279, 23473, 4126, 18639, 11295, 26705, 46627, 33131, 28165, 40132, 81045, 104112, 106345, 102893, 74903, 11317, 41567, 74143, 91728, 80310, 52109, 35519, 43762, 70557, 93675, 115514, 78663, 71213, 90332, 105948, 88604, 66763, 65972, 48665, 41122, 40087, 13820, -21495, -6449, 26520, 33596, 16404, 9888, 10576, 39734, 39623, 32953, 48782, 28539, 17153, 43345, 31258, 267]
10186B67R076j8891j6486M4352M4876n15j9419j7381J6975k2094j5919J1420K7876
10173D4137N5713j2105k308J2983K6638O205n519j2179j6690L3923R412J6370
10161A56580J6880o193K9672K753J0445p39k3695j9667P097J4861M5233J4984
10149B48211K0226k0947K4832k1150J2463n480r9P618m7937j2137L6301K2377
10137B64278M726j5027k6353r555q936P48K459p270m6145m3683K3486J5831j6867
10124A37692k892J373l3107q138O819K3869O99l1299K814J2471n2335l3223L1392
10111E6135J6482J3944l2408R428O1317o977p359n4350l5711n554L9902J4555
10099F9404k5973r865k6231P968M494L090m855k8598J7424j1784r302M0534K3296
$$ y = [267, 9343, -9548, -26034, 18318, 63194, 62679, 43260, 25879, 42854, 20760, 4841, 16261, 44137, 99850, 87745, 85437, 98420, 125058, 131263, 125744, 113565, 96875, 130798, 140210, 156580, 173460, 167267, 196939, 199692, 210137, 209398, 185703, 166036, 173133, 187994, 233227, 248211, 268437, 247490, 272322, 251172, 263635, 258155, 258056, 265674, 217737, 205600, 241901, 264278, 269004, 253977, 227624, 218069, 209133, 209881, 212340, 205070, 158925, 115242, 138728, 154559, 137692, 134800, 136173, 103066, 94928, 101747, 125616, 126315, 95016, 97830, 110301, 57966, 24743, 56135, 72617, 86561, 54153, 63581, 124898, 117921, 110562, 56212, 20501, 14947, 54849, 69404, 43431, 33566, 7335, 15303, 19797, 22887, 18032, -10566, 6858, -4926, -14228, 26306, 49602]
10086D9602j6779k8623M3398Q558j3127Q037O088j3087l3700J9303K5332M511
10074E9513j3202l0167O718J1111j2466j2503j1637L321L2042k9356j776Q178
10062I776J3011Q422j2708K5835N7625J3457n6445n5092m9469J52M3l7368k3832
10049a06593J4974M4016N5246J7425k5028L538K2993J1205J6468K5730k1601m1236
10037A7137n1791j468o216j5801K7440K1216P091j385M9337k8251j7824L6716
10025C6201K6492j2481k7430p60O626j3801k8426J3813n545J026q130q203j9973
10012d0591L3513n611J7570K8151J5312r167K6663O804J0406l6310m5050K1201
10000B2891M2209J989j5402p360k8628J3046J7154j5295k4518q782p814J5112
$$ y = [49602, 32823, 4200, 47598, 56156, 43029, 51066, 57154, 44067, 10367, 29670, 55002, 59513, 46311, 16144, 22862, 33973, 21507, 9004, -2633, 688, 32730, 3374, 1598, 9776, 22787, 31209, 18501, 44336, 101961, 115418, 58973, 3881, -45588, -45436, -45393, -82761, -106593, -91619, -47603, 7643, 25068, 40, 3578, 26571, 37776, 54244, 79974, 58373, 17137, -34654, -36122, -42338, -58139, -30699, -9483, -2392, -3777, 45560, 17309, -515, 36201, 62693, 50212, 22782, 22022, 28648, 14847, -13579, 234, -5311, -4285, -12415, -20618, -40591, -7078, -12689, 4881, 33032, 48344, 39177, 65840, 72644, 83050, 46740, 1690, 22891, 65100, 67089, 51687, 44327, 15699, 28745, 45899, 30604, 6086, -2696, -10510, 4602]
9988D602J9317j8335L174L044j5977K0864K787L1019j632l9338j5421J8835Q850
9975B1789j316j6381j2259k8977l8777L161N9427M7258L553r330l7335m1743Q986
9962d1944K0627L2713j2889k7206p563K4298K5819P630Q961j0034k5731J0905
9950E586L1441k4790R32P589O796J2581j7530r882K6853k9123j9937n634l4223
9937d9341L4276L5962J4648k7567n999K6191J8568j3296l3611L2297K5214K2645
9925G9987q976k2617m3914J1426K3666J910k7480l5277k5075K3100O2210k11J0683
9912D9432k4922j8421j7293r638j8258k8083J5590O869J6153K6516M5109J5291
9900E8345n529k5390j6414p657P241j1883K1020J7836K9751m716k8954k0119R725
$$ y = [4602, 23919, 5584, 8758, 11802, -4175, 16689, 19476, 50495, 48863, 9525, -5896, 12939, 21789, 20473, 4092, -8167, -37144, -75921, -72760, -13333, 33925, 37478, 28148, -9187, -50930, -41944, -21317, 11396, -1493, -28699, -36262, -11964, 13855, 21485, 30446, 20412, -5319, 5586, 37027, 12237, 13169, 20758, 27554, 40135, 22605, 12723, 39576, 10453, -9484, -15118, -49341, -15065, 20897, 35545, 7978, 1979, 28170, 46738, 33442, -169, 32128, 57342, 79987, 71011, 48394, 4480, 15906, 39572, 41482, 14002, -21275, -46350, -23250, 38960, 38749, 49432, 24510, 6089, -11204, -20842, -39100, -67183, -51593, -44724, -28571, -2055, 43054, 58345, 52816, 27426, 11012, 3355, 10596, -1287, 19733, 37569, 67320, 62604, 33650, 13531, 23256]
9887B3256L7848L5909p351m1309O901J5308l5687k668k4387k7052J2127J8044
9875A0939L6220q2j6313j0711m3487j3296M033q468J0375M612j151J4703L2429
9862A9803q289J0229J9555k463l0381j8357M017n155l3623q551R448L8312J2810
9849G355p076J2009l1668k2175j3093M8489K9197K863K5120L0212O236k4621J3032
9836G5880l0024Q785k961k2910k1674k8322m5750K8917N347J1193L1398L7002
9824D6881K1079o065n2415k0600J6208O664L2032J1876Q917k7204m6275K5865
9812A6963J1124j0739O807K1241K2428j9324k1056k7662R982n96m170J0732N510
9799B1240J0065n2475k6154K6822L4583K0842j514L1812K9145m4627m5559j3631
$$ y = [23256, 61104, 97013, 89662, 48353, 55254, 70562, 34875, 32207, 7820, -19232, -7105, 10939, 47159, 47077, 30764, 20053, -23434, -36730, -32697, -41165, -30790, -26178, -27329, -12626, 19803, 11514, 21743, 41298, 38835, 8454, -9903, -5886, -11041, -44664, -53215, -43767, -5455, 7355, 279, 12288, -19380, -41555, -54648, -6159, 23038, 25901, 51021, 81233, 87469, 62848, 75880, 45856, 54641, 51680, 28770, 7096, -21226, -66976, -38059, -32712, -21519, 9879, 46881, 67960, 61895, 9480, -11120, 5088, 11752, 43784, 55660, 64577, 37373, -8902, 16963, 28087, 17348, 24155, 45396, 67824, 48500, 27444, -218, 9764, 9168, 4998, 15730, 21240, 31305, -21170, -47324, -20502, 14081, 34923, 33409, 65221, 94366, 49739, 4180, -9451]
9787i451L2357Q781p351j9250k197L049M6919J7466L9164L1590P375L8932N3449
9774B40833R0188R4444O7429O2666N0869N9718L1816p631p2934j16938p8880q8728
9762C32852o7973o731m4606l1058l0912k3730l5588j4345P698p190k0545j6414
9750D1458O977M0462J3216k9901j6944j1057Q13J4280l0062l46j945K9884r645
9737D7190o0758l4721k3463L4962L7268K7293J6931J6493j5051l117p290J2680
9725D8417k5356J6324J0411q531J4278J7315J3864j2572O403l996k4062K559l6350
9712A8704n8251j234L4821L2852j5463J7020J9302r207J5467J9230n2916l7125
9700a6800Q053M3121p712l020p939k2263n776K0136L3352N300j6529J1059J6294
$$ y = [-9451, 22906, 31687, 24336, 5086, 2889, 5938, 52857, 70323, 109487, 141077, 148452, 187384, 240833, 331021, 425465, 492894, 555560, 606429, 666147, 697963, 690332, 617398, 500460, 421580, 332852, 264879, 258148, 213542, 182484, 151572, 127842, 92254, 77909, 85607, 78417, 57872, 41458, 48435, 88897, 102113, 72212, 55268, 44211, 45024, 59304, 29242, 28896, 26951, 56835, 47190, -13568, -48289, -71752, -36790, 478, 27771, 44702, 61195, 46144, 43027, 35737, 48417, 23061, 39385, 49796, 41265, 55543, 72858, 86722, 74150, 80553, 76557, 52495, 55054, 18704, -39547, -40781, -5960, 26892, 11429, 28449, 47751, 38544, 54011, 73241, 20325, -16800, -8747, 34374, 26662, 23642, 15703, -6560, -12336, 7800, 41152, 46452, 29923, 40982, 57276]
9687E7276J7739l715J2491n564m4635n0432l4791k366L5860L1010O722P881J7697
9674D5173k3691j4569M5420J0294n1572j5448l493K157j2856K4746p0q181N00
9661a590k4386j6684K9174K5286J1333l3487J1671L978N484l0026J6492r46l854
9648g555J2576Q265M651n735j781L0765M0340k1677n7250L0994M0538l590M210
9635G4751j0045J1793l2735J598n1103l8662L9428J9938J3514O046j9347n9129
9623d3953k3963M9945L9801K4517R109n451j3136J7487J4159n495J5112r690k6978
9610D1464k6233K1739q622j9141l1537l2749m0635k6989K9441Q1862M8211m0569
9598c758m5689R057L1669N4719J9729n1j1806q780k8608l5012M231j4258l5501
$$ y = [57276, 75015, 71300, 83791, 78227, 33592, -16840, -51631, -53997, -18137, 12873, 19595, 27476, 45173, 21482, 6913, 52333, 62627, 11055, -4393, -7886, -5729, -18585, 6161, 6091, -2090, -1590, -25976, -42660, -13486, 11800, 23133, -10354, 1317, 5295, 10779, -19247, -2755, -3701, -7555, 5021, 13286, 17937, 12202, 10421, 41186, 81526, 59849, 2599, 33593, 74131, 70541, 74751, 64706, 76499, 43764, 45362, -5741, -44403, -4975, 14963, 28477, 34523, 15176, -43953, -67916, -17971, 21830, 46347, 55456, 50005, 36869, 54356, 68515, 63020, 78132, 68442, 41464, 15231, 36970, 28348, 9207, -22330, -55079, -95714, -122703, -93262, -11400, 36811, -3758, -49447, -40390, -8721, 45998, 65727, 65676, 53870, 45090, 16482, -18530, -14299, -28557, -64058]
9585f4058K4736L3111Q427m079N195J660k8130j5922j5620L546M38J8063K5448
9572g185l127k0135K5109K6614k159q586j1160n234j9841o644K3389L5066J1758
9559C7865J796r000L765L4270K3638l4461l8083R14l0218j1260j8224J1251L2228
9546D481N361j4746J192K2280M016j4856K6611L1066j879l0764m307R026M198
9533D1679j0370K4167Q24k3978n1633k2889n37K1214Q200j0909k9283J3658M6164
9520F307n555q726J911M0456K8669j4919l3638K2260N7329q585J787p077j2104
9507F8115J6625J2940l7475m9435k2589P029N79k1789j5033K2004L5488J0637
9495B7096l9211K9807J7538K6759M408k2728k1318N165m3910p57p00L0202L9824
$$ y = [-64058, -39322, -6211, 2216, -1863, 3332, 4992, -23138, -39060, -54680, -51134, -50696, -32633, -7185, -10312, -30447, -5338, 21276, 19117, 10531, -629, -5863, -25704, -32348, -8959, 26107, 37865, 39661, 30661, 34426, 68696, 92334, 57873, 19790, 20704, -9514, -20774, -38998, -27747, 4481, 9842, -4904, -3712, 18568, 22584, 7728, 34339, 65405, 63526, 32762, 28455, 37481, 41679, 31309, 55476, 56300, 32322, -19311, -42200, -42737, -21523, -13323, -24232, -53515, -39857, 6307, 752, -7974, -6063, 34393, 63062, 48143, 14505, 36765, 94094, 85509, 87296, 80219, 68115, 84740, 97680, 60205, 10770, -11819, -4790, -4211, -26000, -41033, -19029, 16459, 27096, -12115, 17692, 35230, 61989, 66397, 43669, 22351, 27516, -16394, -17151, -17851, 12351, 52175]
9482E2175L1964L7991k648l5888j5573P194M1059J7091l6150k6035k2113J420
9470E0487k6754l5179J9959K705K92J7786l54M573K1656N4035J6243N522L591
9457A34562J2268R61J6233n943l9641j9662K9967P5503J3844K8917L5239P285
9445B89533o72J6518O2430M2190J0724k6587l7200o0726k2311J1187l378m9936
9433B31772j5064K1124j5595R167L3679K3663Q7106K4033o660K4401K1694L8660
9421D77980J058j7485k8213J83J4259j7247j000J1238o5748P854L1521M8784N0482
9408E13666M6723O8606N6992J02196P6862L4212N0760O4790K351r683n5124j22470
9396H29881r4772r6412m0263m2200l4017j2569N076O224J7570M5141K8138k7216
$$ y = [52175, 84139, 122130, 119482, 83594, 68021, 75215, 116274, 133365, 97215, 71180, 49067, 50487, 23733, -11446, 8513, 11218, 11510, 29296, 28942, 33515, 55171, 109206, 125449, 130971, 134562, 146830, 147791, 164024, 158081, 118440, 98778, 128745, 204248, 218092, 247009, 282248, 289533, 288861, 305379, 367809, 409999, 420723, 394136, 356936, 296210, 273899, 285086, 281708, 231772, 216708, 237832, 222237, 231404, 265083, 288746, 375852, 399885, 393225, 417626, 439320, 477980, 479038, 461553, 433340, 433523, 447782, 430535, 429535, 440773, 375025, 382879, 414400, 463184, 513666, 560389, 628995, 685987, 788183, 865045, 899257, 950017, 1014807, 1017158, 1007475, 952351, 829881, 735109, 638697, 598434, 556234, 522217, 509648, 514724, 520948, 538518, 583659, 611797, 584581]
9384E84581o7705l0287N155K2155K5744M3584K7357l2659m2436p3020n2475n2375
9372C57619m4110p572q92Pn268L1736J1417P104N3396K4328N133Q362J3258J8878
9358D73396k8874l5851j6403r617k7061J406l366n0147m7113q716j0655k541m3836
9345A90622m3923l9658n0735k6659j5478M87j208L9386J5061M732j5368p626O992
9332E6625K4542j4164J4483l4169n688N2009K07k0555o218Q175M2675K1090l9707
9319I9305k3651Q205K6889K5030l6514l6538j6438J5049J957J042L336l425K9870
9306I4117n386l5287J6929j6336k4030m5190n352P516J7170j988k7342j0540K5271
9293a0448J7223K0679J6058K971L502N592J9990r900L1939j7283m4299l0240J5552
$$ y = [584581, 516876, 486589, 491744, 513899, 539643, 583227, 610584, 577925, 535489, 462469, 409994, 357619, 313509, 305937, 305045, 305052, 299784, 331520, 342937, 350041, 403437, 427765, 432898, 441260, 454518, 473396, 444522, 408671, 392268, 382651, 355590, 356996, 353630, 303483, 256370, 247654, 236999, 234458, 190622, 146699, 107041, 56306, 29647, 14169, 14656, 13448, 52834, 67895, 72627, 57259, 49633, 56625, 81167, 67003, 81486, 47317, 41629, 93638, 93845, 73290, 67072, 75247, 117922, 139012, 99305, 75654, 83859, 110748, 135778, 99264, 62726, 46288, 61337, 63294, 64336, 67672, 64247, 94117, 88731, 53444, 70373, 54037, 30007, -15183, -20535, -13019, 4151, 2163, -25179, -35719, -10448, 6775, 27454, 43512, 46483, 49985, 55577, 75567, 65667, 97606, 80323, 36024, 5784, 21336]
9280B1336J7157j0331O975j097k7615J1529K0370J314p477L711M99k7601k5882
9267a7112M1912M232l3590l0291N223J135J069l3350l168K8004J6388l2661L4273
9254a7936j2100J4399P009P777K6707J280N560k4233p555j647j9356M476k2721
9241c8340j3731J6273L6149K5507L6611k5154l3550n041L9625J324k5460J9493
9229C3706m649j2804l7591K2117L9029k6462j6141j6760o659k6719J5958K761
9217c4214n186M4729K5837P104m919j56j1798m8358k7220K4014M1438L7021K1368
9204F9660n0892n6720J7486O0776K6514j9023n0129l8711Rj3357Q669l35O228
9191c9825L2775J179K981l9357l2289M789K0341L5947Q062k1167k7055j8680L6138
$$ y = [21336, 38493, 28162, 35137, 34040, 6425, 17954, 38324, 39638, 32161, 35872, 36371, 8770, -17112, 24800, 29032, -4558, -34849, -29626, -28491, -27422, -60772, -63940, -35936, -19548, -52209, -17936, -30036, -15637, -8628, -851, 25856, 27136, 32696, 8463, 908, -739, -20095, -15619, -38340, -52071, -35798, 351, 25858, 62469, 37315, 3765, -1276, 38349, 39673, 14213, 33706, 29057, 16253, -21338, 779, 39808, 13346, -2795, -19555, -26214, -52933, -36975, -34214, -39400, 5329, 31166, 38270, 33351, 33195, 21397, -26961, -54181, -30167, 11271, 48292, 69660, 18768, -37952, -20466, 40310, 66824, 47801, -2328, -41039, -41030, -54387, -45718, -46053, -39825, -7050, -5871, -2890, -42247, -74536, -69747, -49406, -13459, -5397, -26564, -53619, -72299, -36161]
9178c6161J4024m2359J951J131M7076P5952N753m4730k7568K6338N20k2312m8021
9165d8406L425N973J4397o224k6925j3393j2503k66j5582M1352P307k0244M9032
9152b2057L5403N606j4576j6196n046j7409M865L1383O656j0009l5680j507r8
9139c8665L528L4021J0927p685j3168J1823O952Q028j8998r296J5361l7818K0148
9126a4842L2311n3934j1597M7914K6135K9932k678K354j7045k1763l2857J0647
9114e423j2874k0134N2358L3899q06M098j5648R171j4197K1119k147j2266P423
9101D4573j9211l6685j1864L1602L4829q825P771K799J3631R740J6487k4057K7292
9088H8082k4977l9701J8892j5997l9476K8707j6280k6517R15J2576m485K451j3362
$$ y = [-36161, -22137, -64496, -62545, -61414, -14338, 61614, 67367, 22637, -4931, 21407, 21927, -385, -48406, -44981, -39008, -24611, -30835, -57760, -71153, -83656, -83922, -99504, -58152, -50845, -71089, -22057, 13346, 18952, 4376, -11820, -16866, -34275, -29410, 1973, 8629, -1380, -37060, -38567, -38665, -35137, -1116, 9811, 2126, -11042, 781, 7733, 15761, -3237, -12533, 2828, -34990, -14842, 17469, -36465, -48062, -148, 25987, 55919, 53241, 55595, 38550, 16787, -16070, -5423, -18297, -38431, 13927, 47826, 47020, 51118, 35470, 44641, 30444, 51563, 49416, 37150, 44573, 25362, -11323, -23187, 8415, 43244, 34419, 42190, 44989, 58620, 68360, 84847, 60790, 88082, 63105, 23404, 42296, 26299, -13177, 15530, -750, -27267, -26352, -13776, -18261, -15810, -29172]
9075b9172p871K7686J3647J8013j5480k4909j2176K874K0100M6164J7251L972
9063F0099l8799j1379r662p7914K38M4888J4353M0163M2504l572n4418k2852J6489
9050A38O598k7306J1860K5486L2613m168n6413j3771M0047J549J8015j0001l1977
9037g330J635N14R815J7415m2919j2306K6123K4134j716p660j9219p095J0636
9024g973J0478L0082K3420p470k4748j7578J3582M7492n359n0180L77Q578M303
9011B5004O401k5342k936k0763k6388J7146M8647J4337n5149j564R267N399k6631
8998c2572q863K9366j7086n528K2156K7877K1688l1907R87J5559Q634n622R504
8985C4193j3264J1343K089o186J6798k648K521O070K827l602j6639j6302l9425
$$ y = [-29172, -37043, -9357, 4290, 22303, 6823, -18086, -30262, -27388, -7288, 38876, 56127, 60099, 21300, 9921, 259, -77655, -77417, -32529, -18176, 21987, 64491, 60919, 6501, -16351, 138, 6736, -20570, -8710, 16776, 49389, 45221, -11192, -24963, 15084, 16633, 34648, 24647, -7330, -5695, -5181, 4634, 22049, -20870, -33176, -7053, 17081, 15365, 7705, -11514, -18609, -7973, 2505, 32587, 56007, 48537, 23789, 6211, 19793, 67285, 61926, 11746, 12123, 20701, 25004, 31405, 6063, 3127, -17636, -44024, -26878, 21769, 36106, -19043, -20607, -11340, -5941, -32572, -41435, -12069, -29155, -34683, -12527, 15350, 37038, 5131, 6118, 21677, 30311, 24689, 34193, 20929, 32272, 34361, 28175, 44973, 42325, 44846, 50916, 53743, 50141, 33502, 17200, -22225]
8972b2225R425N7250Q384r366p33j992m6468m6061k3596K3660N8490k8820l0684
8959e2736K1550J2050J5290J4223k973q198M450j3688k7121j3413J4715P365n642
8946c4128L4777P453n0306m3629q99M9711J4296J3006R790r083M714J9506k3265
8933h057k0954O9419J4705p936J6116O072n4237j7230J1837N0773j7522j8539
8921B4447J5981k7590j9927R974L2063J7938r41k2499n7539l637K9049p704l5191
8908d5576r104k5583J2905J5007M697K8701J3258j2183n0022J7326L2477J1485
8896f612J8449L8592M5177j9600l4318K1383M3437m7627p3317j7081K8253L0309
8884B7045o44l3697J7412R266k3121j3825K5956J3478p479J4413J1952J1716R089
$$ y = [-22225, -12800, 44450, 52834, 43468, 42735, 40743, -5725, -51786, -75382, -51722, 6768, -22052, -52736, -31186, -19136, -3846, 10377, 7404, -794, 3656, -10032, -37153, -50566, -35851, -28486, -34128, 649, 8102, -42204, -85833, -86732, -37021, -22725, -9719, 71, -9012, -4298, 15208, -8057, -29011, 40408, 55113, 47177, 63293, 69365, 15128, -2102, 9735, 60508, 42986, 24447, 40428, 12838, -7089, 2885, 34948, 52886, 51945, 29446, -28093, -31730, -2681, -10385, -45576, -54680, -80263, -67358, -52351, -47654, -18953, -5695, -17878, -67900, -50574, -18097, -6612, 11837, 50429, 95606, 76006, 41688, 63071, 106508, 58881, -14436, -31517, -3264, 27045, 26401, -7296, 10116, 19382, -3739, -17564, 8392, 21870, 14391, 28804, 40756, 52472, 61561]
8871F1561j1815j8770l8419k3662J263j2937O007M7095J0914j4215M63K4200l2772
8858a087m345R549k9025K9581J2864l0802O952J2148L8020j7879k3246j3140k2543
8845c2953M242J2217k999M219J8122k7684j9385M701M1412M8528K052j516n320
8832D5636q319j6498l7972L6250M7230J4365N666l3845l0235j3111J0997J8204
8820C8368K0604l1726J9533l642J540J9588r583r094R378k9135k5085L9102K1162
8807F1010l9694j3362J9874k4496j376L1982M415N086m3899k4230L655m646M2485
8794A6804K1446r176p471j6220l2180L7576J4036j869J9920N387l7685j5432J7846
8781A2982K3013J1915P510k0147o3044k2527K928Q019K9161J5180R883J3642K207
$$ y = [61561, 49746, 30976, -7443, -31105, -29842, -42779, -36772, 10323, 21237, 7022, 7485, 31685, -1087, -5432, 4117, -24908, 4673, 17537, -13265, -6313, 5835, 43855, 25976, 2730, -10410, -32953, -28711, -16494, -19493, -15274, 2848, -24836, -44221, -39520, 1892, 50420, 52472, 50956, 45636, 37317, 20819, -17153, 19097, 66327, 80692, 86358, 52513, 22278, 9167, 20164, 38368, 58972, 27246, 46779, 43137, 44677, 64265, 54682, 45588, 54966, 25831, 746, 39848, 61010, 21316, 7954, 27828, 3332, 1956, 33938, 38353, 43439, -460, -24690, -21035, -25681, 16804, 38250, 29074, 21603, 5383, -26797, 10779, 24815, 22946, 42866, 48253, 10568, -4864, 12982, 35995, 47910, 55420, 35273, -27771, -50298, -47370, -39351, -10190, 4990, 14873, 28515, 30722]
8768C0722R029K410k8172L7650J1340J1491l1375j8551j0120n665J4109n981M096
8755B0983M043j3326J3478K0254j0730q035J818J9075j2871k7692L1701N0757
8743H9455q226k7823k6743q784n882j9607j0422j0432O075k3328P156L7176K626
8730A241K7892L7514J9155k0507k6431q635P628p620j1938n297O080M3721o2275
8717E28q766J9320K5022J3397j1108o882l6450L756l360Q470L645L0910q514K338
8703C2306K3369j1814q358k1425K2975n422r98k4422m3228J0289k0292O812O4895
8690B4687N6933Q665k0894J7874l4950l3160o058j4972j589K2951K2048l078J0697
8677D9154J4933k3203j9108K2567m670j4129K8768o714L887K918K2664j1395l5230
$$ y = [30722, 39751, 42161, 13989, 51639, 62979, 74470, 43095, 24544, 14424, 8759, 22868, 16887, 20983, 25026, 11700, 25178, 45432, 34702, 26667, 28485, 47560, 34689, 6997, 38698, 89455, 81229, 53406, 26663, 17879, 11997, -7610, -18032, -28464, -22389, -45717, -38561, -1385, 1241, 29133, 66647, 85802, 65295, 38864, 30229, 37857, 30237, 18299, 13002, 19082, 62803, 528, -8238, 11082, 36104, 49501, 38393, 31511, -4939, -1183, -4543, 3927, 7572, 38482, 29968, 32306, 55675, 43861, 35503, 14078, 37053, 31631, 30633, 6211, -37017, -26728, -47020, -40208, 24687, 81620, 90285, 69391, 87265, 52315, 19155, 13097, -1875, -3464, 19487, 41535, 38457, 49154, 64087, 40884, 21776, 44343, 39673, 25544, 54312, 47598, 51485, 54403, 77067, 65672, 30442]
8664C0442J5961j0447K9492r784j767l5897j5721l103n728K8920K7681J0258L995
8651F4302j096k9099J4517j0638k6243j7461M7791P72k0266k1228J8775J9403
8639C9529l9996o716K05K862J9953J8223N529K0023J5785L590k7428K2216L228
8626G7003k6436m849L895R929l5215j5376K7913O688L6909Q481M796l9375l9639
8613A4724R040l400K198L8864l4155j7009j9395l364N0834K7096J9641P766O848
8600I9688l6902J9537j9646l2487J3989K5349J8015j8615k6851o1532l1040J0622
8588c9873N7873J7342o961J2604M0708R215Q034j9202J7054J2608o154l5525M0757
8575A08480L3050j4059l7556k1745R551L2460k2437j2338K1381J5395q18j1617
$$ y = [30442, 46403, 35956, 65448, 55664, 53897, 18000, 2279, -824, -6552, 22368, 50049, 60307, 64302, 63206, 34107, 48624, 37986, 11743, -5718, 42073, 42845, 22579, 1351, 20126, 39529, -467, -7183, -6978, -4116, 15837, 34060, 39589, 59612, 75397, 78987, 51559, 73775, 77003, 50567, 45718, 49613, 59542, 24327, 8951, 36864, 43552, 80461, 88942, 93738, 54363, 14724, 23764, 20364, 22562, 61426, 27271, 10262, -9133, -12497, 38337, 65433, 85074, 92840, 99688, 62786, 82323, 62677, 30190, 44179, 69528, 87543, 68928, 42077, -19455, -50495, -39873, 18000, 35342, 28381, 40985, 81693, 90908, 98942, 79740, 96794, 109402, 103248, 67723, 108480, 141530, 127471, 89915, 68170, 77721, 110181, 87744, 75406, 96787, 112182, 111364, 99747]
8563I9747K6027J1215J2254k7182k4055O241l5887j531N390j9490j9937L3407
8551F6199O475j4820J4593J4321l8456k3162M776j472K0039j5043n600k7404K1926
8538B2372m620k7888q308K1602o577l0387l592M6814L5859J8615N4267K5138j266
8525A42029M45J2246K7019m857n0042J5849R829k8337k1799k4789j8884k7167
8513C1542o8828j3274J2350L1403J0602m4130K6478K4945J9502o749j6151p350
8501C40N0342o389J7859K0222j345n0217j9640p233L1646R073k3329k0443K1645
8488B2531K0272j0025M1331k956K2882M7747M0383N7708J4896J5321K8428K8135
8476C26653j1976n5020j9562m2770k6618J8990K6765q912o0940m7062l3451L1834
$$ y = [99747, 125774, 136989, 149243, 122061, 98006, 104247, 68360, 66829, 72219, 52729, 32792, 66199, 72674, 57854, 72447, 86768, 48312, 25150, 29926, 28454, 48493, 33450, 27850, 446, 22372, 17752, -10136, -18444, 3158, -3419, -33806, -37398, 9416, 45275, 63890, 118157, 143295, 142029, 142474, 154720, 181739, 176882, 126840, 142689, 152518, 124181, 102382, 77593, 58709, 31542, -37286, -50560, -38210, -6807, 3795, -40335, -13857, 11088, 30590, 23841, 7690, 340, 50682, 44293, 62152, 82374, 81029, 30812, 11172, 3939, 35585, 44658, 21329, 886, 22531, 42803, 32778, 74109, 71153, 94035, 141782, 182165, 239873, 254769, 270090, 298518, 326653, 314677, 259657, 240095, 197325, 170707, 189697, 216462, 207550, 146610, 99548, 66097, 97931]
8464I7931K4508j687J7632k0892J1237o4805r976K8639k42J6104k3800r786o869
8451E7994j3260j4870j8006K920N837k262j0228L3366K9106K570O277J2154K7471
8438A19069K5161K0596Q872K6331M3467J2329j8888l7241m0904l3792j6702J3818
8426A22116N1987n150k2878k4338l3022j3464r851j0847l514L0071J390j2765
8414F9735k9523j1806K5763j1792R290j6766j9324k9650l610Q854L1903J6302
8402C9376o184j2450l4827m833k413J0493k944l3111K5078L1442N6664K383J8395
8389H7069K894r034N40l1768n628l4054j550q549P838j932j8776k5171M218L4614
8375G11N9973J4806o285k9990j9271M2118J9553m4444k0755j5541L655J3021n274
$$ y = [97931, 122439, 120752, 138384, 117492, 128729, 63924, 53948, 82587, 82345, 98449, 74649, 64863, 57994, 44734, 29864, 11858, 14778, 20615, 18353, 8125, 41491, 70597, 73167, 79444, 91598, 119069, 144230, 164826, 173698, 200029, 243496, 255825, 236937, 199696, 158792, 125000, 108298, 122116, 174103, 168953, 146075, 121737, 88715, 75251, 65400, 54553, 51039, 81110, 82500, 69735, 40212, 28406, 54169, 42377, 51667, 34901, 15577, -14073, -17683, -8829, 23074, 39376, 33192, 20742, -14085, -18918, -21331, -10838, -13782, -46893, -21815, 9627, 66291, 68674, 87069, 89963, 80929, 81469, 49701, 44073, 10019, 8469, -80, 7758, 5826, -12950, -38121, -33903, 711, 60684, 75490, 69205, 39215, 19944, 62062, 81615, 37171, 16416, 875, 4530, 17551, 12277]
8362A2277R960M983k745k4633r977j9174M002Q006m1601l3723n457J054O2966
8349c4062K6220j0506j303O9903J8653j4858r755k1278l820K0101Q222l7024m6673
8336c6180j7495J4068O156R58r616l4126K4392k2561l2961J7664L3169K9892j3346
8323c9986K0313m603N374j882M502j7816L3142M3891M2083j4909j8000l1949k6144
8310e984K0734K1141P543k8488j357L1976L5610j7788k2704J3736n5908k4408
8298b5897J8988J647n084K8117K7760K0959l367q024K8299J4658R867L5073Q403
8285A51399K9927N700j8955l8675j6973k4413J3092L8130l947o215m0756j2103
8273G6211m953k108o515n2116q774N61l4388L4222j7431k0723K859P997M170q578
$$ y = [12277, 22237, 27220, 24475, -158, -10135, -29309, -25307, -17301, -58902, -92625, -98082, -97028, -34062, -7842, -18348, -19651, 50252, 68905, 54047, 44292, 23014, 19194, 39295, 47517, 10493, -36180, -53675, -39607, -33451, -32493, -42109, -76235, -51843, -74404, -107365, -89701, -56532, -26640, -39986, -19673, -24276, -18902, -20784, -16282, -34098, -956, 42935, 85018, 70109, 52109, 20160, -5984, 14750, 35891, 43434, 14946, 13589, 45565, 81175, 63387, 40683, 54419, -1489, -25897, -6909, -5262, -10346, 17771, 45531, 66490, 63123, 55099, 83398, 98056, 107923, 142996, 151399, 181326, 187026, 168071, 129396, 112423, 88010, 101102, 139232, 135285, 129070, 88314, 76211, 71258, 69150, 62635, 10519, 1745, 2306, -32082, 2140, -15291, -36014, -33155, -25158, -20988, -29566]
8259b9566J1154K8297j878k3887K1648j4180O540J7750K7613L6809M7036k779
8247A24557r680J1189K1802M3066n514n3950l9742k2818m46p41m0977l3280O739
8234B05J6944O145K3049j2740K316l2804j3262N782K2050J597J7671j8605m1560
8221b3212l2073k086K9294J5860J2470J5638r199O621P430l061j3392j6606R804
8208b512K2928O113K5311j3620j3470m851m393K6942R658j5428M844j0214L3983
8195F5291J7878q390l5218N907j0862J9837o148j8549k1824k9913k0879K5098
8183a7772K7614J4484K8259J4259k043m5223m6360K7080M3051j923k6246m5564
8171c0384J0369K6479p506r972K8029K4541j349N173M520n963j6796J1234j4495
$$ y = [-29566, -18412, 9885, 8007, -15880, 5768, -8412, -1872, 15878, 43491, 80300, 127336, 124557, 114877, 126066, 147868, 190934, 185420, 131470, 91728, 68910, 68464, 67723, 26746, -6534, 205, 17149, 23294, 46343, 33603, 35919, 3115, -10147, -4365, 17685, 19282, 36953, 18348, -23212, -55285, -57371, -28077, -12217, 253, 15891, 6692, 13313, 20743, 17682, 4290, -12316, -2512, 20416, 26529, 51840, 38220, 24750, 19899, 15506, 42448, 52106, 36678, 41522, 31308, 65291, 83169, 74779, 39561, 45468, 34606, 54443, 48295, 29746, 7922, -21991, -42870, -17772, 9842, 24326, 52585, 66844, 64801, 19578, -26782, 298, 43349, 41426, 15180, -30384, -20015, 6464, -1042, -11014, 17015, 41556, 40207, 45380, 49900, 43937, 27141, 38375, 23880]
8158B3880k881j5692l8053j3650J0235J9927j2178R683j4667k8717j2574k9N2348
8145b2368K9377R098K3138N0671j743n3592K037P286l3367l8574j132N335K9953
8132F119R475P501m9430N850k0273k556L540J4641L4759K3966j3150k3309n750
8119h617J800k0362j3790J479M510n635L788L0160L6105j6426k203Q015J0180
8106B9004j7339j5308n762J9223J8841q978k0400m703J3157N660L797J2178L2796
8093F2166P925k0112m4098j2652k1539j6548K1640J228l599J4564q470Q51J2420
8080f224K5977J0781n907p772j0485k2666K9311k6485k3846o794q299J5829N2291
8067A5711M193j3335j2295L1478L9639K7634l3412k1228j6672j8817L7038J0960
$$ y = [23880, 20999, 5307, -32746, -46396, -36161, -16234, -28412, -18729, -33396, -62113, -74687, -74716, -22368, 7009, 16107, 39245, 89916, 88173, 34581, 36618, 43904, 10537, -28037, -29169, -23834, 6119, 15594, 23095, -26335, -20485, -40758, -43314, -39774, -25133, 9626, 33592, 20442, -2867, -8617, -6817, -27179, -40969, -39490, -34980, -40615, -36827, -6667, 29438, 13012, 10809, 18824, 29004, 11665, -3643, -9405, 9818, 28659, 19681, -719, -5422, 7735, 13395, 17192, 29370, 62166, 70091, 49979, 5881, -6771, -28310, -44858, -23218, -21990, -25589, -11025, -19495, -18644, -6224, 19753, 30534, 24627, 16855, 6370, -16296, 13015, -13470, -37316, -44110, -52409, -36580, 15711, 19904, 6569, -5726, 25752, 65391, 93025, 59613, 38385, 21713, 2896, 39934, 50894]
8055E0894q65k6482l951R31j3957q62R672k8073j4377J7949J5963j1457j484K6850
8041B0751j6063j3506l651N915K1302L3615K0045o976j6227j3937o0921n1493
8029h1146k6822K7596L9669L7828N431j1931J6287N3612r697j5146o408R073O86
8016C9032l6166k3208M2587K4239N702R791j5087R992L3659l481p7856j9494J2036
8003A746K2361Q170K742M392O671J1959j0303l1068R461J024j850O984j0286N038
7989B7041K4000j2520j2060k328J063J7813K2737j5567n371J2928j4731k9440
7977A3565k433N651l8842J717K7546j7626L208L1390o612n659L7440J8961j8862
7964D9444l2632k0785J8758J7147O899L096k4421N790J4100K4593j9168j2871
$$ y = [50894, 50029, 23547, 19596, 20527, 6570, 5708, 15380, -12693, -27070, -9121, 6842, -4615, -6099, 20751, 4688, -8818, -12469, -6554, 14748, 48363, 68408, 61432, 45205, 31268, -29653, -81146, -107968, -80372, -40703, -2875, 2556, -9375, 6912, 60524, 50827, 35681, 29273, 38346, 39032, 2866, -20342, 22245, 46484, 52186, 61977, 46890, 56882, 90541, 87060, 9204, -10290, 1746, 24107, 32277, 35019, 39411, 46082, 58041, 47738, 16670, 26131, 27155, 25305, 32289, 22003, 27041, 51041, 38521, 26461, 24133, 25196, 43009, 65746, 50179, 44808, 57736, 43005, 13565, 11132, 16783, -22059, -20342, 7204, -10422, -7214, 24176, 17564, 11905, 49345, 68306, 49444, 16812, -3973, 14785, 31932, 38831, 41927, 17506, 23296, 37396, 61989, 42821, 29950]
7952B9950k9163m2300j093K0065M9005K6660j5250k6348J7437J5942l631j205
7940D0069J4110Q778j9836k9381K1202L6552O89l7899p888O128j4057n886K0359
7927C2940m809l5287k6285L571N4710K3745j6524J1164k7033n272K0518j3272
7915A8166j2089r708j2738q724m969j7985L419J2552Q100J1773r122l0167k961
7902e4453j433K9150K7589K844m789j3423o066j4237Q006J935J3276l709L456
7889a1854j1632N508k131J9333K9041K449j2108J4703j3065m3902l3925j6457
7877g4040Q042l242L955K3556K8180j3438K8175J497j0081l2368M1460n000j9616
7864b2920j167m6374j1148K4368J8494K4898o041K6231M6047j5847n0712j0480
$$ y = [29950, 787, -41513, -42606, -22541, 26464, 53124, 37874, 11526, 28963, 44905, 41274, 40069, 54179, 62957, 43121, 13740, 34942, 71494, 72183, 34284, 26396, 32524, 18467, 12581, 32940, 28131, -7156, -33441, -29870, 24840, 48585, 32061, 43225, 16192, 10920, 31438, 18166, 6077, -3631, -16369, -25093, -30062, -48047, -44628, -32076, -23976, -12203, -21325, -51492, -54453, -55886, -26736, 853, 3697, -1092, -14515, -20581, -34818, -26812, -24877, -11601, -15310, -11854, -23486, -17978, -20109, -776, 28265, 30714, 18606, 33309, 20244, -23658, -57583, -74040, -65998, -69240, -65285, -41729, -13549, -26987, 1188, 2685, -7396, -39764, 1696, -3304, -22920, -24087, -70461, -81609, -57241, -38747, -13849, -19890, 6341, 52388, 36541, -14171, -24651]
7852b4651L3701l6017P367p081l303J4986k174Q024J8522p646m3076o96R902j3664
7838d5806K1628N837L8863l3229j5110M7006P62j2393j9387j4488j0260J7670
7826a8907J203j2790J5412j2471j6868L0897O660k6376j8863q179L6112K4078
7814i2j4093l4625k1985K1164Q804J7913o11K0364K2395J0599j5214J3742j8259
7801A0102o969k1957n350l309N5529O0987p737l0507L9825k792l1253r699j2488
7788C4382J4482J5473j5778j3529o957j8425l259P168J3325k9586m5450P290J3698
7775b7166J0390J9904L5250P150l1600j032P006o78R666L2417n556n0986l6372
7762c1607m3793l0744L3855O7045M3546r366m4251n532J1510k0491K2346r236
$$ y = [-24651, 9050, -26967, -19600, -26681, -29984, -14998, -17172, -9148, 9374, 1728, -41348, -42044, -32142, -45806, -24178, -18341, 20522, -12707, -27817, 19189, 19951, 7558, -11829, -26317, -36577, -18907, -17704, -30494, -15082, -27553, -44421, -13524, -6864, -33240, -52103, -60282, -24170, -92, -14185, -48810, -70795, -49631, -40827, -22914, -23525, -3161, 19234, 29833, 14619, 28361, 10102, 3133, -18824, -24174, -27483, 28046, 89033, 81296, 50789, 90614, 87822, 56569, 46870, 34382, 48864, 64337, 48559, 35030, 28073, 9648, 6389, 13557, 26882, -2704, -48154, -40864, -27166, -16776, 3128, 38378, 45528, 13928, 12896, 19902, 19224, 28890, 61307, 55751, 4765, -31607, -75400, -106144, -72289, -5244, 38302, 28936, -15315, -20847, -9337, -29828, -7482, -16718]
7750a6718J250M2811J4517k1817k9775L121J5810N624k3603j6028n0910l3476
7738a09194M0191L3628l034l7963J0708K5695q54K1119L9954k0235j7098J6428
7726f55l4905J7742L1631M5882k2187o1315k2803n693L1721L1757l944L7745J1867
7713E6843k4810l0355k1250m415K2797j5966N003K4594J5962N19j027l3416k1466
7700b6987M4984j1369l1036J8266P021O98l6735n6799r671p128l6148N8224N5949
7687c0731m654J7682K0945M1982j331l0893O021J6752j481r766k6346R979j9770
7674a1611J2016j7723J4638O163l1907k008J3432O649L1515m253k8614l1017j3026
7661e5746L0710K1704J3042k712K541P172j8967j0097j1658j2700P277J3294J4062
$$ y = [-16718, -15468, 27343, 41860, 20043, -9732, -6611, 9199, 14823, -8780, -24808, -75718, -109194, -69003, -35375, -38409, -76372, -65664, -39969, -40823, -19704, 20250, 15, -17083, -655, -35560, -17818, 13813, 59695, 37508, -23807, -46610, -52303, -20582, 11175, 7231, 44976, 56843, 32033, 1678, -19572, -23987, -1190, -17156, -12153, 12441, 28403, 28922, 27895, -5521, -26987, 17997, 6628, -24408, -6142, 879, 1577, -35158, -91957, -101628, -108756, -144904, -86680, -30731, -35385, -17703, 3242, 45224, 43893, 13000, 19021, 35773, 34292, 24526, -1820, 8159, -11611, 405, -17318, -2680, 3483, -28424, -30432, -17000, -10351, 21164, 16911, -11703, -42720, -55746, -25036, -3332, 9710, 6998, 9539, 16711, -2256, -12353, -24011, -36711, -29434, -16140, -2078]
7648b078J3212k4562l0655L1158k629m2418O077L103j4787K2009O6794J4811n0719
7635a0684K4106j799K647L710k3101m0854L4868L8546l1202k5225m865J7223N543
7622a1087J3853j9233m7345j3306M6069N0658J4711j2713n9436m8285J7589k3012
7610i1537l872L7458j8167j1290M2159L890j4241L0334J0999m9592k4558K5129
7598f3288L7463L7067p163k5966j5376J5636j686j6511j4291J527J9657K3357
7586i574K4864P076m3719n915M895R298k3021L5800j298l7755l1483J6041K5955
7573b8836P924K9872j2441q952R575J8279J4474k390o355J1639P880J2735M852
7560E8256j1254k0188k74k5848K1689N208N954l2373J6792l609m1565l1777K0721
$$ y = [-2078, 11134, -13428, -44083, -12925, -15554, -57972, -51895, -48792, -63579, -41570, 25224, 40035, -10684, 13422, 11623, 14270, 17980, -5121, -45975, -11107, 27439, -3763, -28988, -33853, -16630, -11087, 2766, -16467, -63812, -77118, -31049, 19609, 34320, 21607, -37829, -86114, -68525, -91537, -95409, -57951, -76118, -87408, -45249, -41359, -55600, -25266, -14267, -63859, -88417, -63288, -25825, 11242, 4079, -21887, -37263, -21627, -23313, -39824, -54115, -52588, -32931, -9574, 15290, 22366, -21353, -27268, -22373, -13075, -36096, -296, -1594, -39349, -70832, -54791, -28836, -20912, 8960, -3481, -12433, -2858, 15421, 29895, 27505, 21150, 32789, 40669, 53404, 58256, 47002, 26814, 26540, 692, 22381, 27589, 33543, 1170, 17962, 14353, -27212, -58989, -38268]
7547c8268K0690l4358o58K3267J4252M2881P233q453l0935k8212Q490k618n498
7534c2187J5209M8844L0898r755k9386m1365q295N4537j841m6263k3767O316K2051
7521a5004K9879m59k9502n26K549k5260o752M9125L9133L9169j6404m1876j9006
7508E066k408j0063j8828l9410n550L2635K6971M426K3147J7173j8819k6532L911
7495h281O58J5708K279j9779j3597J6716J1557k0546M959N469J2530k2314R272
7482e369K4928m0867J400J0113L1138l55j8377k0566o367k3726l9735L5180L8428
7469a4175J481n737K3151k000m4453L303Q71J1195M0451j0427l8672l1006Q737
7456e7281J8122L5746K1169k0828n123O137K1252J5735o6860k9216N6349J9282
$$ y = [-38268, -17578, -51936, -52594, -29327, -15075, 27806, 35039, 26586, -4349, -32561, -24071, -26689, -32187, -16978, 31866, 62764, 53009, 23623, -17742, -26037, 28500, 26659, -19604, -43371, -37055, -15004, 14875, 14416, -15086, -15612, -13063, -38323, -45075, 4050, 43183, 82352, 65948, 24072, 5066, 2658, -7405, -26233, -65643, -71193, -38558, -11587, -7161, 15986, 33159, 14340, -12192, -8281, -7623, 8085, 10364, -9415, -23012, -6296, 5261, -15285, -10326, -4857, 7673, -14641, -5369, 19559, -21308, -19908, -9795, 21343, 20988, 2611, -17955, -24322, -48048, -87783, -52603, -14175, -12694, -18431, 4720, 2720, -41733, -38430, -37559, -26364, 14087, 3660, -35012, -66018, -57281, -39159, -3413, 17756, -3072, -8195, -2058, 19194, 34929, -31931, -61147, -4798, 14484]
7444A4484j8708k8190n1772N1844q857K2268K7027j0866R328K2692j9228j4909
7432d887J0337l208j7260l5839j4196K4049K0635R981p674k6726K4087J6756J8984
7419A5039J6548j6027o7032n544K2399j7960k0705J8972J1837j7516N560j9321
7407g3750K3226k2219L7564K6371P267k7016k7867K392J5443l5656M7650J6856
7395i739k483l383J6928J8782o332J1712q774n565j476L51j3195k7118k1865M7546
7381d611J7582J0478l0500n459O956j0327o100n805O516j8385j419K5399j914
7368a7589k7428k2199k628L1241K1867O095m782J1778k7154k4320M556Q546K6565
7355a5452K5222k4463l4380L0345Q571M858J258K9314j3113j6132R677J196R420
$$ y = [14484, -4224, -32414, -84186, -32342, -41199, -18931, 8096, -2770, 6558, 29250, 10022, -4887, 5450, 2242, -15018, -50857, -65053, -41004, -20369, -10388, -18062, -44788, -20701, -3945, 15039, 31587, 15560, -51472, -57016, -34617, -52577, -73282, -54310, -42473, -59989, -54429, -73750, -50524, -72743, -35179, -8808, -1541, -28557, -56424, -54032, -38589, -74245, -26595, -9739, -12222, -15605, 1323, 20105, 13773, 25485, 16711, 11146, 9670, 10021, -3174, -30292, -52157, -4611, 12971, 23449, -7051, -12510, -5554, -15881, -21981, -27786, -21270, -39655, -41074, -15675, -17589, -45017, -67216, -69844, -38603, -16736, -10641, -15423, -3645, -30799, -55119, -50563, -42017, -15452, 9770, -14693, -49073, -18728, -10157, -5299, -4041, 25273, 12160, -3972, 5705, 6901, 16321]
7342A6321L272J526J0071l0063k6928o76J3783K0087k7587J7082O495k8587J4193
7329a1011p379p858L695J7439r36K4258Q080N73n4017J4593p052n793l075K3199
7315e284K7408j1430m589J1843j2764m5523j0017K5010J3340P962l6174J6534
7303b3684J3545m96O771k9000l3544n73K1376K1496L026K2855l0260j8579J7050
7290c0017R299p137J2401L48j2727Q436N877o151K0721o663k4179k7361l979M2259
7276a8873J8773J01R594O210j8215P001K2260K773j0227k4649m990k1929M576
7263b7595p589m535m528P934j798j2579p081Q170P207j0327k4099J3401Q892o29
7249e5156j5754Q996j5665p153L1008K4534j292j4080N536J5802O045l9162l3859
$$ y = [16321, 19593, 21119, 31190, 1127, -25801, -26477, -12694, 7393, -20194, -3112, 3383, -25204, -11011, -18390, -26248, -22553, -5114, -6050, 18208, 26288, 26861, -27156, -12563, -19615, -25408, -28483, -5284, 22124, 10694, 6105, 17948, 5184, -40339, -50356, -25346, -12006, -4044, -40218, -23684, -10139, -10635, -3864, -32864, -66408, -66981, -45605, -24109, -21083, 1772, -28488, -47067, -30017, -20718, -27855, -15454, -15106, -27833, -19397, -13520, -19671, 1050, -5613, -29792, -57153, -61132, -18873, -100, 1, 9595, 15805, -2410, 4591, 26851, 29624, 19397, -5252, -10242, -32171, -27595, -35184, -39719, -44247, -36313, -38111, -50690, -57771, -49601, -42394, -52721, -76820, -63419, -54527, -55156, -70910, -61914, -77579, -84732, -53724, -29190, -30482, -44562, -39026, -23224, -17179, -56341, -90200]
7236i0200K480J1431j2027K4786L7959Q100N989j7099K5113R558K944j218p940
7223a24k828j1826K4179N5118K6497k0479m1938k3203l4127p552N675L73j2803
7210d3038j8022q361P830J2499J1258J2969j052K9559J6589J3993k0394j5411
7198a581j4270K1315K9578j7841r251j3859K721M464P238l7245l2188o654K5182
7185d2391P659J6061J4278l9407l6815L0159P569j587L2828j2682R555l8316n875
7172e8964J2753O984j2422p805q316j5789j087L0678K6188m732j8887Q253Q592
7159c4554J7085l28J1999o166j0650j1372K5074K9314K7099l979m0785n113j2662
7146a5038m2919L7444k640k5233N0282K3803J8794J2657l739k8446j1911r863
$$ y = [-90200, -87720, -76289, -88316, -63530, -25571, -17471, -11482, -28581, -3468, 6090, 9034, 7816, -124, -2952, -14778, 9401, 64519, 91016, 70537, 28599, 5396, -28731, -36283, -30608, -30235, -43038, -61060, -69421, -61591, -49092, -37834, -24865, -25917, 3642, 20231, 34224, 13830, -1581, -15851, 5464, 35042, 17201, 7950, -5909, -3188, 1276, 8514, -28731, -60919, -67573, -42391, -34732, -18671, -4393, -43800, -80615, -50456, -42887, -44474, -11646, -24328, -14773, -53089, -58964, -46211, -39227, -51649, -59454, -67770, -83559, -84646, -53968, -27780, -32512, -51399, -43146, -34554, -17469, -17797, -5798, -11964, -22614, -33986, -8912, 20402, 47501, 43522, 2737, -2376, -15038, -57957, -20513, -23153, -48386, 1896, 25699, 44493, 57150, 53411, 24965, 13054, 3191]
7134C191m5444k0703K4756J3281k0536J8864N508j5163J7142K6269J3301J8341
7122C8807r435j2793K087J599k0924k2639q432q578J226J9050p982k8174r35M2416
7108a4707k6586l1090j1929O766k195J8915K3566k234q607r022L4434M8971k935
7095B3347K4568J5738l2540l2495j3194J1177P977p480K4958L4468k1766m5093
7083a0335n2219j9612j047K0533K8325O754j9964k555L0735K4055j8534m109L3236
7070A5263j4515j7510j9241Q754K8801j639J28J0752R443N881J3553K0537q241
7057E1966l1548n8005O110M6668j3795j3006J0580K069m1084m1153j7349k010
7045a00557m551R573O0055l507K483K0869K6094j2844j1452q922l1146q840J3852
$$ y = [3191, -42253, -62956, -38200, -24919, -45455, -26591, -21083, -36246, -19104, 7165, 20466, 38807, 29372, 16579, 18666, 20265, -659, -23298, -31730, -40308, -39082, -20032, -28014, -56188, -57123, -14707, -41293, -72383, -84312, -77546, -79741, -60826, -37260, -39494, -48101, -57123, -22689, 26282, 23347, 47915, 63653, 31113, -1382, -14576, -3399, 4578, -2902, 22056, 56524, 34758, -10335, -62554, -82166, -83213, -62680, -34355, -27601, -47565, -50120, -19385, 4670, -13864, -17973, 15263, 748, -16762, -36003, -27249, 1552, -87, 41, 10793, 20236, 26117, 39670, 60207, 51966, 20418, -37587, -31477, 15191, 1396, -11610, -1030, 1039, -40045, -81198, -98547, -100557, -105108, -95535, -35480, -38987, -36504, -15635, 10459, -2385, -13837, -22759, -53905, -62745, -48893]
7032d8893k397J5290j421n5970m431J9558L7433J4140M7307l6681j7078j6680
7020d9823j770M9830J2805K9020K2315q329j3706j4501N29k4620k1915j5558n151
7007d0874l074K3257L2289L9695j0277j6072k2493J4924j2667R534p854l261K0951
6994B4078k7981l0873p269m101N57N826K1292L7509j1684J218m2r707j7326J8556
6980E3L2519k7065n7253Q790K9690J6761m296O32q977R74k0212q382J6017K4046
6966C297N18j6115j904n164k4007P580j1742j3967N7700Q667j8622j2297J8201
6953g855L8909J2389l776j9991k8347j7205K9324q107p95O59o012R139P549m1533
6939c5652n687K1531M9014k5964k440N0694m0513m2465k5429J4058j0922R633
$$ y = [-48893, -51290, -36000, -37421, -93391, -97822, -78264, -40831, -26691, 20616, -16065, -33143, -49823, -51593, -1763, 11042, 40062, 62377, 54048, 40342, 25841, 26370, 1750, -20165, -35723, -40874, -43948, -20691, 11598, 51293, 41016, 24944, 2451, 17375, 4708, 14242, 6388, 3127, 24078, -3903, -34776, -42045, -46146, -45589, -39763, -18471, 19038, 7354, 8572, 8530, -1177, -18503, 53, 32572, 5507, -51746, -42956, -13266, 3495, -801, -169, -9146, -8172, -28384, -36766, -20749, 3297, 3815, -12300, -14204, -19368, -43375, -35795, -47537, -61504, -3804, 4863, -13759, -26056, -7855, 31054, 43443, 39667, 19676, -8671, -25876, 3448, -4659, -5454, -4795, -10807, -1668, 5881, -35652, -41339, -19808, 29206, 3242, 802, 51496, 10983, -31482, -56911, -42853, -53775, -44142]
6927d4142J0271J2830o448J903M1776l847P172l077K8237J6595j5347l0238j3634
6914B051j6230L0035J1035l6610j7177J9587j1847R281k2795j7454p100p683K484
6901f2423L6609L0894J2792L0634k9824l15n3334m3830M0628L8257K2535j6670
6889E953m1533J9885j7100K6994L2842L5629k3695m0941q155L691L4136m2107
6877a4401N405n697J1188M5110J4026O852j9638o5954K164J9688J2651j3037k9817
6864c1460J6062M7554K4487k0753p139n7763k1633N8439L6688M0876J6901m0383
6852F1876l3464k5091l9905K0280K7430k119J1581L6868K1786k5664m9155k2511
6840a8088J2348P271l764M973j794l2659k7734L3991R111N7157k1918j8795J7968
$$ y = [-44142, -33871, -21041, -27489, -25586, 16190, 12343, 19515, 16438, 44675, 61270, 45923, 15685, 2051, -14179, 15856, 26891, -9719, -26896, -7309, -19156, -9875, -32670, -50124, -57224, -64907, -62423, -25814, 5080, 17872, 48506, 18682, 18367, -34967, -78797, -38169, 88, 22623, 5953, -35580, -15695, -32795, -5801, 27041, 62670, 38975, -1966, -10121, -6430, 27706, -14401, -8996, -14693, -3505, 41605, 55631, 62483, 42845, -23109, -20945, -1257, 11394, -1643, -31460, -15398, 32156, 56643, 35890, 28751, -29012, -50645, 7794, 44482, 85358, 102259, 61876, 28412, 3321, -36584, -16304, 11126, 9007, 20588, 57456, 79242, 53578, 4423, -18088, -5740, 1531, -2233, 2740, 946, -31713, -59447, -25456, -16345, 40812, 18894, 99, 18067]
6827A8067J4394j8830L217j6444K7303p165p21Q426J9765k0813J7815Q051P72
6814E3837j3189k864k3391m6181j5199j9526K2487J9787j1226k004m22j1973P900
6801d1964j8874k3215M8961K3911J664m222K8247K3348N286j4303l8044n1115
6789f0320N0032R539J918k933L3704R248k9977l9840j7137J3919J6714K2897J2385
6776B0149q090J0322J8968k3837j9491k5361j0196j0154n1904K4138N7742M114
6764a3600R122m697j8755J7153J2377K5529J9847m6083k9328J6751L1363l5851
6752a6172l1224K7064L870P027L5495p666m3661j2495n603J4337J2053L4220j0916
6739F329m07J0100K6439l3563k3916j1791r145J235O49K173R673j8021J0075J3140
$$ y = [18067, 32461, 13631, 16848, 404, 27707, 20542, 19821, 28247, 48012, 27199, 45014, 53065, 53837, 40648, 37784, 14393, -31788, -46987, -66513, -44026, -24239, -35465, -37469, -37891, -49864, -41964, -60838, -84053, -35092, -11181, -9517, -13739, 14508, 37856, 43142, 28839, -9205, -60320, -10288, -749, 1169, -1764, 31940, 41188, 11211, -28629, -45766, -31847, -15133, 7764, 20149, 12059, 22381, 41349, 17512, -1979, -27340, -37536, -47690, -99594, -75456, -17714, -13600, -4478, -9175, -27930, -10777, 1600, 27129, 46976, 893, -28435, -11684, 19679, -16172, -47396, -20332, -16462, -9435, 26060, 18394, -25267, -37762, -43365, -29028, -16975, 17245, 6329, 5922, 16022, 42461, 8898, -15018, -26809, -35954, -34719, -34070, -31897, -22224, -40245, -30170, -17030]
6725a7030j6425j0836Q380p513J2758L6207J8435J856M483o221k8568k9884k3622
6712e7980J6302J4306o541K8542K0201j0881j1999q728n928n179J397K2439L5811
6699C1762J0985l1199k2546l3202L0878K7437n237j7474l4720L2845N1284l0038
6687A0775m5160J6787L2279n73r435K9185M2062j4019j9535m189j5469k7681N523
6674E50j4036K117L6141R466J0969m1070n7922k1252N708K2773K3127J286j0574
6661c2717J2841K2253K238j950j1633j985L596j3777m2361L8865K9933j6099R295
6648a501l3295k7851K4451K5059j1999K6875M5910K9319K571k7108j9031j7135
6636A6265q871J9660J1529j2436j4448k1660J9084k6165k4343N139j207J0810
$$ y = [-17030, -33455, -44291, -35911, -43424, -30666, 5541, 23976, 25832, 30315, 24094, -4474, -34358, -57980, -41678, -27372, -33913, -5371, 14830, 3949, -8050, -16778, -22706, -27885, -26488, -4049, 31762, 42747, 11548, -10998, -44200, -13322, 14115, 8878, -8596, -43316, -10471, 40813, 10775, -34385, -17598, 14681, 14108, 4673, 33858, 75920, 61901, 42366, 38177, 22708, -4973, 550, -13486, -11369, 24772, 34238, 45207, 4137, -53785, -75037, -69329, -46556, -23429, -22143, -32717, -19876, 2377, 4615, 2665, -8968, -10953, -7357, -21134, -63495, -24630, 5303, -10796, -1501, -34796, -62647, -38196, -13137, -25136, 1739, 47649, 76968, 79539, 52431, 33400, 16265, 7394, 27054, 38583, 26147, 11699, -9961, 9123, -17042, -41385, -36246, -37453, -26643]
6624b6643N945J4693J0779q708j4488L1168q325J7216j4627l2955j7200j9190
6612f2335j2409L8310L6657J2426m0596k2562M918M1506j9919k2097N277Q354
6600c2470J5235j709k9145k407O672n231M576o343N2516L3838q025j4984l1022
6587a8499j0634k5589k1566J9619L0026J7226J4363N959j3329j3168j6156J5557
6575a6191K411l7592q136O469J5297J5634K472P072Q326J0112L233K3338J947
6562C4392m5200J0230J0828N617K564l8154j9728J1396K6833R752k3308J333l977
6549a7422K2787J4884J6437j9418j7679J2934J7120k3625J180L90k1921L5253
6537B0920l8223Q181N506O093Q064l84J0364J2505j4155j4335l528j4364L5928
$$ y = [-26643, -20698, -6005, 4774, -3934, -18422, 12746, 4421, 21637, 7010, -25945, -43145, -62335, -74744, -36434, 223, 12649, -27947, -50509, -45591, -4085, -24004, -46101, -40824, -32470, -17235, -18944, -48089, -50496, -43824, -49055, -44479, -50822, 1694, 35532, 27507, 12523, -18499, -29133, -54722, -76288, -56669, -26643, -9417, 4946, 10905, -2424, -15592, -31748, -16191, -13780, -51372, -59508, -53039, -37742, -22108, -19636, -12564, -4238, 5874, 9107, 32445, 34392, -10808, -578, 10250, 15867, 18431, -19723, -39451, -28055, -1222, 8530, -14778, -13445, -17422, 5365, 20249, 36686, 17268, -411, 12523, 29643, 6018, 7198, 7588, -14333, 20920, -17303, -9122, -3616, 2477, 10541, 10157, 20521, 33026, 18871, 4536, 1008, -13356, 22572]
6524B2572O720j6308J5006K0432J0876R418l2246M995j0186k8212J4868j6678
6512A257j0905L5287k1530k5695k5093j0908K5945P461q072K2096M4460P524n811
6499C6016R359p068j7803l236N823m4537J5947n935J9775R732Q123R477k8356
6486G317k1057K2930K7972O221L0246J2687r927l0454j880l010k56P525p11l6159
6472A1444k3860K836m0394k352L8659l24M68Q385K580M879j0984Q469q093O721
6458a566j0350m4746K2780O6213K3996j150l5592n1804K3667R202l0733k5462
6446e5545J9161j1960J475j7999j7384M398J4872j2868k834j4016M946N938M1570
6433d0246M6849j2339m9143J1537J2908O743j2770J2816K2447k2909q334J4003
$$ y = [22572, 29292, 12984, 27990, 48422, 59298, 68716, 36470, 41465, 31279, 3067, 17935, 1257, -9648, 25639, 4109, -21586, -46679, -57587, -31642, -24181, -32253, -10157, 34303, 41827, 36016, 45375, 38307, 20504, 17268, 23091, -21446, -5499, -11434, 8341, 18073, 26196, 35673, 7317, -13740, 9190, 37162, 43383, 73629, 86316, 76389, 45935, 44055, 41045, 40789, 48314, 47603, 11444, -12416, -9580, -49974, -52326, -13667, -13991, -13523, -5138, -2558, 2321, -8663, -194, -8287, -1566, -11916, -56662, -33882, 32331, 56327, 55177, 19585, -32219, -8552, 650, -30083, -55545, -36384, -48344, -46869, -64868, -82252, -77854, -62982, -75850, -78684, -92700, -87754, -81816, -40246, 6603, -5736, -54879, -43342, -30434, -23691, -36461, -23645, -1198, -24107, -32441, -18438]
6421a8438N3126l5884l7176N268M480Q175K4209J1907p02n032l9745L7285J6173
6408B3646q399j6808k1361k7850N586K0290M6132M825k776l3817q989J1584J9595
6395A1658K5542R59k0759m7351K0996M5541Q887k8424j7492j5748j9332O950Q546
6382b0027m543p878j4464j9382j3029K3069K1197M330j1832l443K0433J3098o29
6369a3100l4885j6521j9654J7506J1966J7891N5750q839l7603k0613k3312J6651
6357e4763K9316k1792l2607O156K0027j4014L1142J9578O946Q548J7545k991l1846
6344a8755J3247l490l1748N640J8331j9538j1224k1045P057M6505J1447K2712
6332A9139R253K1044j7528l2401j7012L1464l96n231M79J6222k7193l733N827
$$ y = [-18438, 34688, -1196, -38372, -33104, -28624, -20449, 3760, 15667, 14965, 9933, -29812, 7473, 23646, 15247, -1561, -22922, -50772, -45186, -24896, 21236, 26061, 23285, -10532, -19521, -7937, 11658, 37200, 38159, 17400, -29951, -8955, 36586, 45473, 17049, -443, -16191, -35523, -28573, -20027, -24570, -32448, -46912, -66294, -79323, -56254, -35057, -30727, -42559, -46002, -25569, -12471, -13100, -47985, -64506, -84160, -66654, -54688, -36797, 18953, 10114, -27489, -48102, -71414, -54763, -25447, -47239, -79846, -73690, -53663, -67677, -36535, -16957, -10011, -1463, 16082, 13091, -18755, -5508, -8998, -40746, -35106, -16775, -36313, -47537, -68582, -61525, -15020, -3573, 19139, 28392, 49436, 31908, -493, -17505, 13959, 13563, 8332, 8811, 25033, -2160, -5893, -66]
6319f6J2640k9740j3047J9718J5619m96J0978M815P488k1002N167k4223J2558
6306D09L3524k914j021L1735M1254j9857l8771K1276J1551l3482o463k897j0029
6293B4315J1147K806K297o5670k9833K0259P6J0034J7843k8076r773J4322L3808
6280C555J1281o0760m331j022J0846j5991j8872k8377j308O8074O2185k7761k162
6267d643k3903r942J6314J0294k6816k071K5776N5463K496m420l6155j6492J2855
6254a244o821J9679n38j1599j7504K4953M2971L831m5257j5154l6126j0862J9044
6241c4627j718r201J0419K7593J276L141Q676p880R082k6123N30k8556j3378J6856
6227d3910J4446j3506J568l2664o985j025K3589L5439K7016j2016j5964K0420
$$ y = [-66, 12574, -17166, -30213, -10495, 5124, 4628, 15606, 20421, 27909, 6907, 12074, -12149, 409, 33933, 31019, 29998, 61733, 102987, 83130, 44359, 65635, 77186, 43704, 37241, 34344, 24315, 35462, 38268, 40565, -25105, -54938, -34679, -34603, -24569, -6726, -34802, -44575, -30253, 3555, 14836, -45924, -50255, -51277, -40431, -56422, -75294, -103671, -104979, -36905, 25280, -2481, -4643, -28546, -38488, -22174, -11880, -38696, -40767, -14991, 40472, 42968, 38548, 2393, -14099, -1244, -8065, 11614, 11076, -523, -18027, 6926, 49897, 53728, 8471, -6683, -42809, -53671, -34627, -36345, -45546, -35127, -7534, -6258, -3117, 5559, -2321, 6761, -19362, -18832, -47388, -60766, -43910, -29464, -42970, -41402, -74066, -81051, -82076, -58487, -23048, 3968, -8048, -24012, -3592]
6215c592K3206K3941r132q555n1150j9121K3874o777k9688J3468j3534r953L3140
6202c3873J365K7351L2546m1299K8657j9040O903J9489j4191K6480j4693O341
6190B6036J6394j3897j5142r562K021P799j1999k4643J4155N334m8684J7312J6285
6177a8591R861j4097k5053J8405J4819j5743J7112M0333j438j4207p926k5425
6165b1950l2716J1490J9851J8625p311p321j914L044J2606N891q647o293k6600
6152d1245J522j3961N4284j0815o8091k8381O166Q08R465L6115l215r417J8429
6139d8336j4364K2873P009j6079K1259K1637K3862j7850j4359m591r265j9728
6127d7932J0755K3976l2278J2753j0474L392K0763M421k694M119J0755K9416J2420
$$ y = [-3592, 19614, 43555, 34423, 25868, -25282, -44403, -20529, -27306, -56994, -43526, -57060, -67013, -33873, -32508, -5157, 27389, -13910, 14747, -4293, 2610, 22099, 7908, 34388, 19695, 26036, 42430, 28533, 13391, 3829, 5850, 13649, 1650, -22993, -8838, -3504, -52188, -34876, -18591, -8730, -22827, -47880, -29475, -14656, -30399, -13287, 27046, 25608, 11401, 3475, -21950, -54666, -43176, -23325, -4700, -12011, -19332, -21246, -18202, -5596, 295, -8352, -14645, -41245, -39723, -53684, 600, -10215, -78306, -106687, -100521, -99713, -90248, -54133, -57348, -66765, -48336, -62700, -39827, -32818, -48897, -27638, -6001, 17861, 11, -14348, -18939, -28204, -47932, -37177, -13201, -45479, -32726, -43200, -39808, -19045, -14624, -17318, -13199, -2444, 26972, 39392]
$$ [...]
##END NTUPLES=NMR SPECTRUM
##END=
