##TITLE=Analysis number 321824
Compound Code cc 17418
Book Reference 309/26
Project Code adrs
Chemist Name nathana
##JCAMPDX= 6.0         $$ Bruker NMR JCAMP-DX V2.0
##DATA TYPE= NMR SPECTRUM
##DATA CLASS= NTUPLES
##ORIGIN= Bruker BioSpin GmbH
##OWNER= nmr
$$ XWIN-NMR		Version 3.5
$$ Wed Aug 30 10:03:32 2006 GMT Daylight Time (UT+1h)  MAYBRIDGE\nmr@NMR_250MHZ
##.OBSERVE FREQUENCY= 250.131544655141
##.OBSERVE NUCLEUS= ^1H
##.ACQUISITION MODE= SIMULTANEOUS (DQD)
##.ACQUISITION SCHEME= undefined
##.AVERAGES= 16
##.DIGITISER RES= 18
##SPECTROMETER/DATA SYSTEM= dpx250
##.PULSE SEQUENCE= zg30
##.SOLVENT NAME= DMSO
##.SHIFT REFERENCE= (INTERNAL, DMSO, 0, 16.522)
##AUDIT TRAIL= $$ (NUMBER, WHEN, WHO, WHERE, WHAT)
$$ ##TITLE= Audit trail, XWIN-NMR		Version 3.5
$$ ##JCAMPDX= 5.01
$$ ##ORIGIN= Bruker BioSpin GmbH
$$ ##OWNER= nmr
$$ C:\u/data/dgb/nmr/ADRS/1850/pdata/1/auditp.txt
$$ ##AUDIT TRAIL=  $$ (NUMBER, WHEN, WHO, WHERE, WHAT)
(   1,<2006-08-30 10:03:06.24 +100>,<MAYBRIDGE\nmr>,<NMR_250MHZ>,
      <created by zg, POWCHK disabled, PULCHK disabled
       configuration hash MD5:
       E2 DF 36 D8 04 B2 41 60 5A D7 A3 38 5A 4B D0 FE
       data hash MD5: 64K
       CC 0B 86 56 06 85 C1 02 10 DC CB A6 8E DD 4E 38>)
(   2,<2006-08-30 10:03:21.28 +100>,<MAYBRIDGE\nmr>,<NMR_250MHZ>,
      <Start of raw data processing
       ef LB = 0.3 FT_mod = 6 PKNL = 1 SI = 32K 
       data hash MD5: 32K
       A1 54 63 8C 84 85 85 8D D0 E2 5F 9E 58 C2 56 DC>)
(   3,<2006-08-30 10:03:23.16 +100>,<MAYBRIDGE\nmr>,<NMR_250MHZ>,
      <apk 
       data hash MD5: 32K
       E7 33 E8 96 CD E2 B7 90 D3 B2 E9 F8 3B 73 94 18>)
(   4,<2006-08-30 10:03:23.89 +100>,<MAYBRIDGE\nmr>,<NMR_250MHZ>,
      <abs ABSG = 5 
       data hash MD5: 32K
       12 F3 33 2E 9D 83 5F 1E AE 39 24 52 97 8B E7 16>)
$$ ##END=
$$ 
$$ hash MD5
$$ 18 ED 44 D4 E5 FA BB A6 B5 6A 7D CA CF B0 A3 B6
##$RELAX= 
##$RELAX= 
##$RELAX= 
##$RELAX= 
##$RELAX= 
##$RELAX= 
##$RELAX= 
$$ Bruker specific parameters
$$ --------------------------
##$DU= <C:\u>
##$EXPNO= 1850
##$NAME= <ADRS>
##$PROCNO= 1
##$TYPE= <nmr>
##$USER= <dgb>
##$AMP= (0..31)
100 100 100 100 100 100 100 100 100 100 100 100 100 100 100 100 100 100 
100 100 100 100 100 100 100 100 100 100 100 100 100 100 
##$AQSEQ= 0
##$AQ_mod= 3
##$AUNM= <au_zg>
##$AUTOPOS= <8 >
##$BF1= 250.13
##$BF2= 250.13
##$BF3= 250.13
##$BF4= 250.13
##$BF5= 500.13
##$BF6= 500.13
##$BF7= 500.13
##$BF8= 500.13
##$BYTORDA= 1
##$CFDGTYP= 0
##$CFRGTYP= 5
##$CHEMSTR= <none>
##$CNST= (0..31)
1 1 145 1 1 1 1 1 1 1 1 1 1 1 1 1 1 1 1 1 1 1 1 1 1 1 1 1 1 1 1 1 
##$CPDPRG= <>
##$CPDPRG1= <>
##$CPDPRG2= <>
##$CPDPRG3= <>
##$CPDPRG4= <mlev>
##$CPDPRG5= <mlev>
##$CPDPRG6= <mlev>
##$CPDPRG7= <mlev>
##$CPDPRG8= <mlev>
##$CPDPRGB= <>
##$CPDPRGT= <>
##$D= (0..31)
0 1 0 0 0 0 0 0 0 0.06 0 0 0 0 0 0 0.0002 0 0 0 0 0 0 0 0 0 0 0 0 0 0 
0 
##$DATE= 1156928584
##$DBL= (0..7)
120 120 120 120 120 120 120 120 
##$DBP= (0..7)
150 150 150 150 150 150 150 150 
##$DBP07= 0
##$DBPNAM0= <>
##$DBPNAM1= <>
$$ [...]
##$SUBNAM7= <"">
##$SUBNAM8= <"">
##$SUBNAM9= <"">
##$SW= 20.6930455092707
##$SWIBOX= (0..15)
0 0 3 0 0 0 0 0 0 0 0 0 0 0 0 0 
##$SW_h= 5175.983436853
##$TD= 65536
##$TD0= 1
##$TE= 295.16
##$TE2= 300
##$TE3= 300
##$TEG= 300
##$TL= (0..7)
0 120 120 120 120 120 120 120 
##$TP= (0..7)
150 150 150 150 150 150 150 150 
##$TP07= 0
##$TPNAME0= <>
##$TPNAME1= <>
##$TPNAME2= <>
##$TPNAME3= <>
##$TPNAME4= <>
##$TPNAME5= <>
##$TPNAME6= <>
##$TPNAME7= <>
##$TPOAL= (0..7)
0.5 0.5 0.5 0.5 0.5 0.5 0.5 0.5 
##$TPOFFS= (0..7)
0 0 0 0 0 0 0 0 
##$TUNHIN= 0
##$TUNHOUT= 0
##$TUNXOUT= 0
##$USERA1= <user>
##$USERA2= <user>
##$USERA3= <user>
##$USERA4= <user>
##$USERA5= <user>
##$V9= 5
##$VALIST= <valist>
##$VCLIST= <CCCCCCCCCCCCCCC>
##$VD= 0
##$VDLIST= <DDDDDDDDDDDDDDD>
##$VPLIST= <PPPPPPPPPPPPPPP>
##$VTLIST= <TTTTTTTTTTTTTTT>
##$WBST= 1024
##$WBSW= 4
##$XGAIN= (0..3)
0 0 0 0 
##$XL= 0
##$YL= 0
##$YMAX_a= 385630
##$YMIN_a= -506430
##$ZGOPTNS= <>
##$ZL1= 120
##$ZL2= 120
##$ZL3= 120
##$ZL4= 120
##$ABSF1= 16.522
##$ABSF2= -4.171173
##$ABSG= 5
##$ABSL= 3
##$ALPHA= 0
##$AQORDER= 0
##$ASSFAC= 0
##$ASSFACI= 0
##$ASSFACX= 0
##$ASSWID= 0
##$AUNMP= <proc_1d>
##$AZFE= 0.1
##$AZFW= 0.1
##$BCFW= 0
##$BC_mod= 0
##$BYTORDP= 0
##$COROFFS= 0
##$CY= 12.5
##$DATMOD= 1
##$DC= 0
##$DFILT= <>
##$DTYPP= 0
##$F1P= 14.0000005364418
##$F2P= -0.99999901652339
##$FCOR= 0.5
##$FTSIZE= 32768
##$FT_mod= 6
##$GAMMA= 0
##$GB= 0
##$INTBC= 1
##$INTSCL= 1
##$ISEN= 128
##$LB= 0.3
##$LEV0= 0
##$LPBIN= 0
##$MAXI= 10000
##$MC2= 0
##$MEAN= 0
##$ME_mod= 0
##$MI= 0
##$NCOEF= 0
##$NC_proc= -5
##$NLEV= 6
##$NOISF1= 0
##$NOISF2= 0
##$NSP= 0
##$NTH_PI= 0
##$NZP= 0
##$OFFSET= 16.522
##$PC= 1
##$PHC0= 142.4043
##$PHC1= 3.724253
##$PH_mod= 1
##$PKNL= yes
##$PPARMOD= 0
##$PSCAL= 4
##$PSIGN= 0
##$REVERSE= no
##$SF= 250.13
##$SI= 32768
##$SIGF1= 0
##$SIGF2= 0
##$SINO= 400
##$SIOLD= 32768
##$SREGLST= <1H.DMSO>
##$SSB= 0
##$STSI= 32768
##$STSR= 0
##$SW_p= 5175.98343685301
##$SYMM= 0
##$S_DEV= 0
##$TDeff= 65536
##$TDoff= 0
##$TI= <Analysis number 999999
Compound Code 99
Book Reference 9
Project Code 9>
##$TILT= no
##$TM1= 0
##$TM2= 0
##$TOPLEV= 0
##$USERP1= <user>
##$USERP2= <user>
##$USERP3= <user>
##$USERP4= <user>
##$USERP5= <user>
##$WDW= 1
##$XDIM= 32768
##$YMAX_p= 424873638
##$YMIN_p= -485152
$$ End of Bruker specific parameters
$$ ---------------------------------
##NTUPLES= NMR SPECTRUM
##VAR_NAME=  FREQUENCY,     SPECTRUM/REAL,   SPECTRUM/IMAG
##SYMBOL=    X,             R,               I
##VAR_TYPE=  INDEPENDENT,   DEPENDENT,       DEPENDENT
##VAR_FORM=  AFFN,          ASDF,            ASDF
##VAR_DIM=   32768,         32768,           32768
##UNITS=     HZ,            ARBITRARY UNITS, ARBITRARY UNITS
##FACTOR=    0.157963299565203, 1,           1
##FIRST=     4132.6476996994, 0,             0
##LAST=      -1043.33573715361, 0,           0
##MIN=       -1043.33573715361, -485152,     0
##MAX=       4132.6476996994, 424873638,     0
$$ Real data points
##PAGE= N=1
##DATA TABLE= (X++(R..R)), XYDATA
$$ [...]
17228d3537J98760Q9474o8652k1203J0718J1911M3857m938M307j10421r1584N3812
17216G2504n6662q557K6272j53743l415J14310O7634K3896m6869j5093O941m1743
17204a4525n323M6266N1050K6920J1019m0012j58332R954M7276r668q0670j4020
17192a30065O2195k4801l3175j5426J05459J03146j7143J5751N1725l7992r1552
17181a1878m3494n2290N3946P8949l6926q7295j04R4362R968L1027R5578n9334
17169G2509l4890J33918M7756p4360o1886j18178J73457J72352M117N555q1040
17158B39310o7211M6780N678K4625j14151l0209L0769q312k5259l6968m7221K8411
17146D6242L4234q588R58l8910m6297P3173r119l2146j0810P3146P6415k5014
$$ plain form
17228 -43537 155223 244697 176045 154842 165560 177471 221328 216390 220697 110276 18692 72504
17216 72504 15842 7285 33557 -120186 -123601 -9291 58343 82239 35370 20277 27218 -14525
17204 -14525 -19848 26418 77468 104388 115407 75395 -82937 -72983 -25707 -35375 -116045 -130065
17192 -130065 -67870 -92671 -125846 -141272 -35813 67333 50190 65941 117666 79674 -11878
17181 -11878 -55372 -107662 -53716 25233 -11693 -98988 -99092 -4730 5238 36265 131843 72509
17169 72509 37619 171537 219293 144933 83047 -35131 138326 310678 314795 320350 239310
17158 239310 172099 218879 224557 249182 135031 104822 135591 127279 102020 65052 17831 46242
17146 46242 80476 71888 72846 33936 -12361 60812 51693 19547 8737 81883 158298 133284
17134A33284o5876j25084j7705Q6295O2294K0164j52808j3127N4039j40781n638
17123a64943r22j7995J07532L3775k8842Q3261L0035j0235j1160L4581o9770J20093
17111A05410Q8322l4766k7860R3816R9140O0555J00823M3652O1231O1413K1367
17100F73103o1655M6900j57981k0073p1290o194l3426n7263K0714N4238R5033
17089D82106J47608K7515k8024p119O5079j18102o2784P8360N0902j28024j32296
17078C75221p0397o1777j90074j6056K7676M2479K4253K1646k5544J9354M7581
17067A94362k180P1915P0863J8017l1314l1964j28636l9029L4901R4713M2124
17056B93772j2077R8106o6456P1718J20087M904p4214R3387K00780n0834j08227
$$ plain form
17134 133284 67408 -57676 -75381 10914 73208 93372 -59436 -72563 -18524 -159305 -164943
17123 -164943 -165865 -183860 -76328 -42553 -71395 11866 41901 31666 20506 55087 -14683 105410
17111 105410 193732 158966 131106 224922 324062 384617 485440 529092 590323 651736 673103
17100 673103 611448 658348 500367 480294 409004 402810 369384 312121 332835 387073 482106
17089 482106 629714 657229 629205 622086 687165 569063 506279 584639 635541 507517 375221
17078 375221 304824 243047 52973 36917 64593 107072 131325 152971 127427 146781 194362
17067 194362 192182 264097 334960 352977 321663 289699 161063 122034 156935 251648 293772
17056 293772 281695 379801 313345 385063 505150 510054 435840 529227 730007 679173 570946
17045E70946J10023N2812k6232l8518j03888j20220J1419O0260o4317o2959j11154
17034B78172q9568K0630J07581L376o8965J37100n0820k4739L4044q404L6342
17023C74749o7097k288k86j50225m4331J45215r218k451p9259p6931M7957L9681
17011A75516P9347n4138L2217O5874Q1692m6949j38931L2717L0029k6199q8372
17000A42803l4064Q587j08778Q353N2732L5766l0104l6076n0154l3083P3616J41019
16988A70617r6325n0835j06047K4867L8895N5266j2612P099o8239q951L8912K9189
16976B1836N1253m4682j36179j11988R5286k0628P9008O6752O4702J18256j10987
16965G2629q1089J08605L0088o1620l0485j0890n0479P1523O4952o2350j33192
$$ plain form
17045 570946 680969 733781 707549 669031 565143 444923 456342 516602 452285 389326 278172
17034 278172 188604 209234 316815 320191 251226 388326 337506 312767 346811 338407 374749
17023 374749 307652 305364 305078 154853 110522 255737 246519 244068 164809 87878 135835 175516
17011 175516 254863 200725 232942 298816 380508 333559 194628 227345 257374 231175 142803
17000 142803 108739 117326 8548 16901 69633 105399 75295 39219 -10935 -44018 29598 170617
16988 170617 74292 23457 -82590 -57723 -18828 36438 23826 30925 -37314 -46265 -7353 21836
16976 21836 73089 28407 -107772 -219760 -124474 -145102 -66094 658 65360 183616 72629
16965 72629 -8460 100145 130233 68613 38128 27238 -23241 48282 113234 50884 -82308
16954h2308J7751K5662o9142l0860j2085n263J74219K4221m9745r420o7415q9193
16942a73578n2448P505O5164J3874L2026p7197J09409J28279j00538o0296K3937
16931h3863j5379k6241m9101q0778J23770O2499M5829Q0486j85441p3998R4765
16920a07452N2061N2244N8155p7118q1246N4754K6515J19515M8705p2383j71039
16909i7289k8472O6075M5238p2285p9225J8367R0583k5413j00739J54760j6323
16898d4723l2098p8206m6467L369j18570K7375R6667J26822l6114N0871J36348
16887H5274o6156k9220j2198l9958L3419J39672n3109r9279M9284N5932j9122
16876D4539o1979K4379N4740m817j4365j2153q97q3529j19648r07Q5638L1307
$$ plain form
16954 -82308 -64557 -38895 -108037 -138897 -150982 -156245 17974 42195 -7550 -16970 -84385 -173578
16942 -173578 -226026 -218521 -153357 -139483 -107457 -184654 -75245 53034 -47504 -107800 -83863
16931 -83863 -99242 -125483 -174584 -255362 -131592 -69093 -23264 57222 -128219 -202217 -107452
16920 -107452 -55391 -3147 55008 -22110 -103356 -48602 -22087 97428 146133 73750 -97289
16909 -97289 -125761 -59686 -14448 -86733 -165958 -147591 -57008 -82421 -183160 -28400 -44723
16898 -44723 -76821 -155027 -201494 -198125 -316695 -289320 -192653 -65831 -101945 -51074 85274
16887 85274 19118 -10102 -22300 -62258 -28839 110833 57724 -41555 7729 63661 44539
16876 44539 -17440 6939 61679 56862 42497 30344 29447 -54082 -173730 -174637 -88999 -57692
16864e7692j00802P0780O8044j9433J1408m6335r3500L1862P1704L7280p7250
16853a03934j06428p6596R1123R4696K9899q9701L3897M7807j5630J9914N5298
16842a9655r813K0299k4628o5668J2872O6753l6435p883r5835l3905N8702L8896
16830i6300p302N1764o137m2280K1104l3061N3080r495n2782J6740J57134J00172
16818A52637O567n6913m369p0849r4298Q510n3339k3751j3434J15474J56047p8772
16806D3510j58289l8705J6040R0770J3087o7525n9341l618K8722M1288K1718j30400
16794b02743p0394k9193L0413j190o367O7133J9119q1854K612M5738m1942k7610
16782b96278N9924O2327P8952P3733Q6047N995m241j04903n5136M1246J18016
$$ plain form
16864 -57692 -158494 -87714 -19670 -39103 -27695 -74030 -167530 -135668 -63964 -26684 -103934
16853 -103934 -210362 -286958 -195835 -101139 -71240 -160941 -127044 -79237 -94867 -74953 -19655
16842 -19655 -29468 -9169 -33797 -99465 -86593 -19840 -56275 -64158 -159993 -193898 -135196 -96300
16830 -96300 -103602 -51838 -57975 -100255 -79151 -112212 -59132 -68627 -121409 -104669 52465 152637
16818 152637 159204 102291 97922 27073 -67225 -58715 -112054 -135805 -149239 -33765 122282 43510
16806 43510 -114779 -153484 -137444 -46674 -33587 -101112 -160453 -164071 -135349 -94061 -72343 -202743
16794 -202743 -273137 -302330 -271917 -273107 -279474 -212341 -193222 -275076 -272464 -226726 -268668 -296278
16782 -296278 -236354 -174027 -95075 -21342 64705 70700 66459 -38444 -93580 -52334 65682
16771F5682J07482j34757r7237M2069Q932K679J54523r3900r9960J3763J06517
16760G5793n3682p5399J23481M6383q3524n4725j1959q538o5888j51412Q7424
16749a72046J16037l787j28659p992K0511M1002m8867j61672O0922P3584Q3718
16738a27249O7563k7178L7094R283k7621l9432j2099L0683Q8699M4900k7224R0236
16726A07655q812p0852j89932j12202Q2477O264j6652N0019O1526j7829l3474
16715a41812n2042r7599Q2953J24317j376n2540J5515K8266m825J62587n757r1965
16703c4278k8070N133L3488p5981J50734K9256j03208r918j50733j48001p198
16692c38776J44590R4581J8545k53j4704J63384J2012j9646l4559l6515j4190
$$ plain form
16771 65682 173164 38407 -58830 -16761 -7829 -5150 149373 55473 -44487 -30724 75793
16760 75793 22111 -53288 70193 116576 33052 -21673 -33632 -42170 -108058 -259470 -172046
16749 -172046 -56009 -59796 -188455 -196447 -175936 -134934 -183801 -345473 -284551 -210967 -127249
16738 -127249 -59686 -86864 -49770 -40487 -68108 -107540 -119639 -88956 -257 44643 17419 107655
16726 107655 98843 27991 -161941 -274143 -191666 -185402 -202054 -152035 -90509 -108338 -141812
16715 -141812 -193854 -291453 -208500 -84183 -85559 -138099 -122584 -94318 -99143 63444 57687 -34278
16703 -34278 -62348 -57215 -23727 -99708 51026 80282 -22926 -32844 -183577 -331578 -338776
16692 -338776 -194186 -99605 -81060 -81313 -96017 67367 79379 59733 25174 -11341 -25531
16681b5531M028k7202M276J18021N718q8673k08106q4433J23245J12059Q3100
16670A6502J3635j22639m9270R9806J30725J32559L7178j80465o5177J08591P3954
16659A95399j06575j52438q5340k3674J75960K8232l357o6289k6316J9713m7172
16648i1857K5795j60574n9250J45950O6694q579J316J2803P3269R0490j67m2414
16636E3476n1935q217J3831m2248j54328R8001R7705k6028r2364O479N7675n2450
16624a00403n5484P49J5042P1355P8045k0126p3455p9133m2177P8633Q3926M3096
16612F8j5541J05279n6724k8655l6032k4368Q942J0761N6068o1664O7507K9905
16600E5546R55L3290p799j3058J132j26734l7718R4859m0487Q8625j13212K2233
$$ plain form
16681 -25531 -21503 -48705 -44429 73592 79310 -9363 -217469 -301902 -178657 -66598 16502
16670 16502 30137 -92502 -141772 -41966 88759 221318 258496 78031 12854 121445 195399
16659 195399 88824 -63614 -148954 -172628 3332 31564 28207 -38082 -64398 -44685 -91857
16648 -91857 -66062 -226636 -285886 -139936 -73242 -81821 -80505 -67702 5567 96057 95890 53476
16636 53476 1541 -6676 7155 -35093 -189421 -91420 6285 -19743 -112107 -105628 -47953 -100403
16624 -100403 -155887 -155138 -140096 -68741 9304 -10822 -84277 -163410 -205587 -126954 -43028 68
16612 68 -15473 89806 33082 4427 -31605 -55973 -47031 -36270 19798 -41866 25641 55546
16600 55546 56501 89791 81992 68934 70066 -56668 -94386 473 -40014 48611 -64601 -42368
16588d2368J20501M951K4227k2339M016M2263j25329p9879o3039l2410J05126
16577f4280J02956l9419l8425K0219K3063m0692N5341m3783l625k9336r5216K6272
16565a26925M3317n6285K939O4182N8875P5422M797n1264r9603l8973M4530K5345
16553e3643L8666k1142J7314j09301n1311j10496P1749J42832R7614j3599m9111
16542d0428J4913J6665l2726R786k105l7648R002o85p174Q5232k3217P794J11011
16529A10420k5411R143j56187o0235P1916L6006m3968J01166p0598r5168k9779
16518a52695J08762J30247L1493p0829l1598K4895m7982n7747n3797K468l8926
16507a55709O878M9263j3916P2479O414M1236J05509l6499k31935M4161J28148
$$ plain form
16588 -42368 78133 83084 107311 84972 88988 131251 5922 -73957 -136996 -169406 -64280
16577 -64280 38676 -743 -39168 -18949 4114 -36578 18763 -25020 -28645 -57981 -153197 -126925
16565 -126925 -83608 -139893 -136954 -72772 -13897 61525 66322 15058 -84545 -123518 -78988 -53643
16553 -53643 -14977 -36119 -18805 -128106 -179417 -289913 -218164 -75332 22282 8683 -40428
16542 -40428 -25515 -8850 -41576 -31790 -33895 -71543 -62541 -63226 -70400 14832 -8385 -591 110420
16529 110420 85009 94152 -62035 -122270 -50354 -14348 -58316 42850 -27748 -122916 -152695
16518 -152695 -43933 86314 117807 46978 15380 40275 -7707 -65454 -119251 -116783 -155709
16507 -155709 -148831 -99568 -113484 -41005 -34591 6645 112154 75655 -156280 -112119 16029
16496A6029Q974n5075M80q5875J3496J14939q9239j0536J30972Q6818l9287l7154
16484E4542n7525o1122Q591r4661J37665K6207J0609O1471O9499q016j09207n1126
16472a3073j9566k823N089l9189l7591N0940N7480K0400j69779j31880n0944N9557
16460b71379j8188j3200J46704J06378J0684M1502M5554k825O6811Q344j530j8133
16448A00722k2046j7211n1616Q0781L9332J474o1004q1021j1303N330Q632l9000
16436d6930q2357n5012J14270L0029K7507m6911p23r925j14200k8544P1386N2235
16424h9175j7512L6101J6886j6192J5267l3586o4764O9931o7410n7189o9276J17664
16412a59255N9357m9298j39048L0602j383O5044N7266m6378P1811J8288o5770
$$ plain form
16496 16029 25003 -30072 -29592 -115467 -101971 12968 -76271 -86807 44165 130983 91696 54542
16484 54542 -2983 -64105 -55514 -150175 -12510 13697 24306 85777 155276 147260 38053 -13073
16472 -13073 -32639 -35462 -30373 -69562 -107153 -56213 1267 21667 -148112 -279992 -330936 -271379
16460 -271379 -289567 -302767 -156063 -49685 -39001 2501 48055 45230 112041 120385 118855 100722
16448 100722 78676 61465 9849 90630 129962 131436 70432 -10589 -21892 -16562 -7930 -46930
16436 -46930 -129287 -184299 -70029 -40000 -12493 -59404 -60127 -70052 -184252 -212796 -141410 -89175
16424 -89175 -106687 -70586 -53700 -69892 -54625 -88211 -152975 -83044 -150454 -207643 -276919 -159255
16412 -159255 -99898 -149196 -288244 -257642 -259025 -193981 -136715 -183093 -111282 -92994 -158764
16401a58764R575O5982o7589m5238O9258j2811N1017l1387J6987l08j3489k3402
16389a40169K0866M5821q2974k5895J63312P3530N6584m9377j46263q0270J43770
16378b1065J29564k6175k7190k8440j11198o4707p0867K5618J40462L1424o5369
16367h7943L1689P261J9997l7362k9075k1580N8491J1449m6546J26028Q3964j37507
16355b1134k0195J0389O8557q2922q8035J09825L7987J28843o109j38645j24519
16344a25958l8781K1016l6274P2775R2549Q6898j45716J1311O3736j677k905P8465
16332G5439j04460o4299Q8121p8896N3461N6580j21573m8215L0293L0903J03126
16321B0480k0465l5518M4626q6733m1417j51L2055L9597k2822o2990l5092l7107
$$ plain form
16401 -158764 -149189 -83207 -150796 -196034 -126776 -139587 -88570 -119957 -102970 -103278 -116767 -140169
16389 -140169 -119303 -73482 -156456 -182351 -19039 54491 111075 61698 -84565 -164835 -21065
16378 -21065 108499 82324 55134 26694 -84504 -149211 -220078 -194460 -53998 -22574 -87943
16367 -87943 -56254 -48993 -28996 -66358 -95433 -117013 -58522 -47073 -93619 32409 116373 -21134
16355 -21134 -41329 -30940 37617 -45305 -133340 -23515 14472 143315 137206 -1439 -125958
16344 -125958 -164739 -143723 -179997 -107222 -14673 72225 -73491 -62180 1556 -121 -3026 75439
16332 75439 -29021 -93320 -5199 -84095 -30634 25946 -95627 -143842 -113549 -82646 20480
16321 20480 15 -35503 9123 -77610 -119027 -119178 -87123 -47526 -70348 -133338 -168430 -205537
16309b05537M6781M7118J29959M8257j4425O683o3190l6791p9431L5986P0270
16298a4320N9147p9705j34704K6983M3392n6634N0502p254n3392Q7084J4546O1276
16286c079m7063p2658N2132K18419K7742J4552k7819k6354O7163q4458j9791P2408
16274A71194p8960j13010O7229K9312K5307M738l4800L0407o6717o3057M1751
16263A3394N845p9377l5117O422q9545K8251N6677p6114N0218L7389N4080M7971
16251B0094p8945R0470M4404r7517j06145q1638P8827J47871L9803k0220n4504
16240a7500K0758M3203J2010r881K4353k8732m9667m5250q07K0016J3259L02q8723
16227a06659j00993o5004Q5284O0184k8809R8759K6373M9034j6205l4958P4468
$$ plain form
16309 -205537 -158756 -111638 18321 66578 52153 58836 -4354 -41145 -120576 -84590 -14320
16298 -14320 44827 -34878 -169582 -142599 -99207 -155841 -105339 -112593 -165985 -78901 -64355 -3079
16286 -3079 -50142 -122800 -70668 147751 175493 190045 162226 135872 203035 118577 98786 171194
16274 171194 92234 -20776 46453 75765 101072 105810 71010 101417 34700 -28357 13394
16263 13394 19239 -60138 -95255 -88833 -178378 -150127 -93450 -169564 -119346 -81957 -27877 20094
16251 20094 -58851 31619 76023 -21494 -127639 -209277 -130450 17421 57224 37004 -17500
16240 -17500 3258 46461 58471 48590 72943 44211 -5456 -50706 -51513 -31497 -18238 -17936 -106659
16227 -106659 -207652 -272656 -187372 -127188 -155997 -57238 -30865 18169 1964 -32994 41474
16216D1474R4712M9507j17871p6851L5307M4201O6346k745n8005O326k9661j46015
16204i3275k3404p9052p851J38499N5792J2556l8557m857j49212j9837J07727
16193a01471j33109J04472K5288Q7204N0402k9294j32797j8096J47894j3200p7745
16182i0452j15486K0940R324M0967P5830l2239k2108j38169o6165P9858J17588
16171a20112K3899N3330K4022O485p0496j5855J8423J3608Q7669k1763j78857
16160a79647r8851K7522O5711J34023Q7672j500P1318L1922j69904o0093M2973
16149d8854p6898M7830P832m0413R2389R3453N2278m5324k5157k4135j0641l0977
16137h617m2485o6324J1616O6498L6396R93l6822l0542j22999J66178J46289l1859
$$ plain form
16216 41474 136186 185693 67822 -9029 26278 70479 136825 134080 76075 82401 52740 -93275
16204 -93275 -116679 -195731 -203582 -65083 -9291 3265 -35292 -40149 -189361 -209198 -101471
16193 -101471 -234580 -130108 -104820 -17616 32786 3492 -129305 -147401 493 -12707 -90452
16182 -90452 -205938 -184998 -175674 -134707 -58877 -91116 -113224 -251393 -317558 -237700 -120112
16171 -120112 -96213 -42883 -18861 -12376 -82872 -98727 -80304 -66696 20973 -790 -179647
16160 -179647 -278498 -250976 -185265 -51242 36430 34930 106248 138170 -31734 -91827 -48854
16149 -48854 -125752 -77922 -70090 -110503 -18114 75339 127617 82293 57136 33001 22360 -8617
16137 -8617 -51102 -117426 -105810 -39312 -2916 -1923 -38745 -69287 -192286 -26108 120181 88322
16125H8322q9625m2627o628J942j27700n6276j24453O2040J26679n934n9783j13301
16113c47344J59000J45228l4602n6799N5896R0538M6905o8444n1454j45871K9224
16102a77723K5581M7697K2045L3776Q5794J8748J0620k5745n3216q315j4460J0365
16090b4833m9897j03430m0382P87O6212m824R24o566P3059p965r0037l7595j4620
16077b39167J31260O2517q3081P0700P0392M2308M3810j0897o3026j52966L5635
16066i2515J42034K33J4082J0015j65361r2475L5523Q0358L4634j11157K3999
16055a20630J11072M8930j9717r4998p1034l9271J24873J13929p9855P5393q2024
16044c3332k20641m4872L0878R9497Q7830m7740j46632J2593J13112L8760j7644
$$ plain form
16125 88322 -1303 -43930 -50558 -48616 -176316 -232592 -357045 -295005 -168326 -174260 -234043 -347344
16113 -347344 -188344 -43116 -77718 -134517 -78621 11917 58822 -9622 -61076 -206947 -177723
16102 -177723 -152142 -104445 -82400 -48624 37170 55918 66538 40793 -12423 -20738 -35198 -24833
16090 -24833 -74730 -178160 -218542 -217755 -151543 -156367 -155443 -162009 -88950 -96915 -186952 -224547 -239167
16077 -239167 -107907 -45390 -128471 -57771 12621 54929 98739 87842 24816 -128150 -92515
16066 -92515 49519 49752 63834 73849 -91512 -183987 -148464 -68106 -33472 -144629 -120630
16055 -120630 -9558 39372 19655 -75343 -146377 -185648 -60775 53154 -26701 48692 -33332
16044 -33332 -253973 -298845 -267967 -168470 -80640 -128380 -275012 -262419 -149307 -110547 -128191
16033a28191K3802J53364N466o2118l3334r8415N0136j5186Q9247p9329p3802
16022a68360m6185K7991L5450j33O604R0007q3179p4939n8949m4904k421K11713
16010a07305Q9418L1089M4163k8899j23225m17o5682J23052J17383M4876j39964
15999a5511o8970p3444m2441L2418N4614M9723R0644M3927j56645n1453P9797
15988e7341K3129J8802K8158n1220q9523r746r316o7842P6931P0032r8426O9038
15976i7324L9736n8736k4698Q9778J08301n6637J1541j34554n6670R9565P8537
15965a161M2064P1260j08366j26932j13591J57121M3193J679L2969R5851Q170
15954A02257j02198o1903n5941K4307N1145n528J0288J1816K3919M8344J7565
$$ plain form
16033 -128191 -104389 48975 54441 -7677 -41011 -139426 -89290 -104476 -15229 -94558 -168360
16022 -168360 -214545 -186554 -151104 -151237 -144633 -54626 -137805 -212744 -271693 -316597 -319018 -107305
16010 -107305 -17887 13202 57365 28466 -94759 -95176 -160858 -37806 79577 124453 -15511
15999 -15511 -84481 -157925 -200366 -167948 -113334 -63611 27033 70960 -85685 -137138 -57341
15988 -57341 -34212 -15410 12748 -38472 -127995 -137741 -147057 -214899 -137968 -67936 -166362 -97324
15976 -97324 -57588 -116324 -141022 -51244 57057 420 11961 -122593 -179263 -79698 -1161
15965 -1161 40903 112163 3797 -123135 -236726 -79605 -36412 -34733 -1764 94087 102257
15954 102257 59 -61844 -117785 -93478 -42333 -47861 -37573 -25757 -1838 46506 64071
15943F4071K8260l1309q9457j6057M1249L0028N1403o3990n7419p0784M4536j5663
15931h5132n6645q2342j30989j9427J09823L2159O8158R4050K7699k5123N9522
15920h247J3557K7868K6231j8482l5149Q730k0236L7976N4316m7694n6391k7676
15908d5197m5572p6327p7816J32532N4750o1522o9585Q6277P0392P0746j07942
15897f9264o3064R6825J26346N2323n7174m2807r8430r3272l1519K9851M1870
15886a08315M1039P4663N0436l5929p7092L8973j8556J02337L6261M4369k7114
15875A21072j44073k17691j02698P0805J12361K00634J47361l4427p0059k1837
15865F1448j2957p0339j20844N9349N7513m8155n4177N9810M1483R5804N2737
$$ plain form
15943 64071 92331 61022 -28435 -44492 -3243 26785 78188 14198 -43221 -114005 -69469 -85132
15931 -85132 -141777 -224119 -355108 -374535 -264712 -232553 -164395 -70345 -42646 -67769 -8247
15920 -8247 5310 33178 59409 40927 5778 14508 -5728 32248 86564 38870 -17521 -45197
15908 -45197 -90769 -167096 -244912 -112380 -57630 -119152 -188737 -102460 -32068 38678 -69264
15897 -69264 -132328 -35503 90843 143166 85992 43185 -55245 -148517 -180036 -150185 -108315
15886 -108315 -67276 7387 57823 21894 -55198 -16225 -34781 67556 103817 148186 121072
15875 121072 -23001 -240692 -343390 -272585 -160224 40410 187771 153344 83285 61448
15865 61448 48491 -21848 -142692 -83343 -25830 -73985 -128162 -68352 -26869 68935 121672
15854A21672J3594q0753J9217K4761J5837j27983o3634l5743O7188J33576l4188
15843E3544L029R1060l1736J5931J0060r7450m9311N2163o174m4862j7372O4658
15831D3540j3878k126j26838K7356J5908M976n6469L2378L5350j4184l3949l2292
15819a20228j5228M7062R6100J7129j0350n8703P706J38290J22165m9465o4676
15808A09802o1754k6557J4407o451q3680j5670P8602q1570n0205O7061J306J5009
15796c9700Q4034K7512p2753l5650r2922J8k1506J03893k6590J01718J6554j7591
15784B7017n8119j32725N535J26913n5658j09045o0626M4016M4243N1250N5799
15773f1400P5769O3568j17612M2442q0649m3314K5499N9778N1959O916k6736m7105
$$ plain form
15854 121672 135266 54513 73730 98491 114328 -13655 -77289 -113032 -45844 87732 53544
15843 53544 56573 147633 115897 131828 141888 44438 -4873 47290 41116 -3746 -21118 43540
15831 43540 29662 27536 -99302 -71946 -56038 -51062 -107531 -75153 -39803 -53987 -87936 -120228
15819 -120228 -135456 -88394 7706 24835 14485 -44218 -36512 101778 223943 174478 109802
15808 109802 48048 21491 35898 29447 -54233 -69903 8699 -72871 -123076 -56015 -54709 -39700
15796 -39700 44334 71846 -907 -36557 -129479 -129461 -150967 -47074 -73664 28054 44608 27017
15784 27017 -31102 -163827 -158292 -31379 -87037 -196082 -256708 -212692 -168449 -117199 -61400
15773 -61400 14369 77937 -39675 2767 -77882 -121196 -95697 -35919 16040 22956 -3780 -50885
15761e0885l1661J45987N3698p8888n4478m5450m6901j07951j02146K6468J60231
15750a31976K1079k6942M2075L607l9594M1209k2287j33139M4049J03707R0608
15739g604M5325M7233q7444o2812j01465j02007J84037P5930j00663j81276N478
15728b85268J04364j0290m0177J47530M0174J10432K6870q2065j6819q1526j18189
15717b04964p6784N5269J11963J44398j8346j1513L1402M1588N6997j6449j16408
15706b847r1090L4829M6401o7040J16582O4118j1544q0439j34213L8143Q8214
15695A114J60825P2001q0517j38872l4152n6773k1061k9221q4893l1406P6490
15684a66465M6502K7049P2923j80290q6691j504J50992L6315M2425M0552J5106
$$ plain form
15761 -50885 -82546 63441 117139 38251 -16227 -61677 -108578 -216529 -318675 -292207 -131976
15750 -131976 -110897 -137839 -95764 -92157 -131751 -90542 -112829 -245968 -201919 -98212 -7604
15739 -7604 37721 84954 -2490 -65302 -166767 -268774 -84737 -8807 -109470 -290746 -285268
15728 -285268 -180904 -191194 -231371 -83841 -43667 66765 93635 11570 -5249 -86775 -204964
15717 -204964 -281748 -226479 -114516 29882 11536 23 31425 73013 130010 113561 -2847
15706 -2847 -93937 -59108 -12707 -79747 36835 100953 89409 8970 -125243 -87100 1114
15695 1114 161939 233940 153423 14551 -19601 -76374 -97435 -126656 -211549 -242955 -166465
15684 -166465 -119963 -92914 -19991 -200281 -286972 -288476 -137484 -101169 -58744 -18192 -3086
15673c086o3107j2987l7496L0503P9801j1116m510n2694M640M6716l7344m6250
15661a06930m1993L6518L8188K0110K4378M0676K4135l9293j34856r9588k0664
15650b59319j3969J4647K61233J8384r2829R0828N6277J3117l6694j15526K8150
15639c5701j33518P6341O3339n6978j78143J65640N9192p8873o4640L0133k4624
15628a77832o2886L1060J13278K7326o9048K6602K0854o8230j05933K2527J10438
15617a31844J944p8293Q6354k1504Q6357R0574L3203q522j09994n8803R3491K0234
15605C197M3748J37164j45523p1182l2815J2510M9980j7507L3791K9827m0110
15594C080j64839j12995P417q5932J47614J23440l1198J4818j5518P1607k0131
$$ plain form
15673 -3086 -66193 -79180 -116676 -86173 -6372 -17488 -21998 -74692 -70052 -23336 -60680 -106930
15661 -106930 -148923 -112405 -74217 -54107 -29729 10947 35082 -4211 -139067 -238655 -259319
15650 -259319 -273288 -258641 2592 20976 -71853 18975 75252 88369 51675 -63851 -35701
15639 -35701 -169219 -92878 -29539 -86517 -264660 -99020 -39828 -118701 -183341 -153208 -177832
15628 -177832 -240718 -209658 -96380 -69054 -138102 -111500 -90646 -158876 -264809 -242282 -131844
15617 -131844 -129900 -208193 -121839 -143343 -56986 33588 66791 58269 -51725 -110528 -17037 3197
15605 3197 46945 184109 38586 -32596 -65411 -52901 -2921 -20428 13363 43190 3080
15594 3080 -161759 -274754 -267337 -353269 -205655 -82215 -113413 -98595 -114113 -42506 -62637
15583f2637p7639O354N1758k2087R7206M9804q8427j34909j5582J11684j4781
15572i9256m9718N4818N9603j06565N7514Q1925K4168l0458m5046J0333J8523
15561b4159r9859r638R7512N4122r0745m8460O1178N1664n8880n5135J38231n3485
15549c7654j05525q7300N2880K05888J66346k5634r2483q8279m7061M1572r6431
15538a13681k3017R080p6800R2127J52016j7724M4353P627n6847j70200k8387
15527a81453P3250q4060q2923J47001J53554Q5958j8501q8230M9859R1757m0409
15516A05803j01591J7760q1811m2940J31923J613j21845r7980j4639Q1892K3280
15505i8535n1900J6224J27804J13280n5224L3484J3566J0077m1639r9287o0126
$$ plain form
15583 -62637 -140276 -133922 -82164 -104251 -7045 42759 -45668 -180577 -196159 -84475 -99256
15572 -99256 -148974 -94156 -34553 -141118 -83604 -1679 22489 -7969 -53015 -42682 -24159
15561 -24159 -124018 -133656 -36144 17978 -72767 -121227 -60049 -8385 -67265 -122400 15831 -37654
15549 -37654 -143179 -230479 -177599 28289 194635 169001 76518 -11761 -58822 -17250 -113681
15538 -113681 -136698 -127618 -204418 -112291 39725 22001 66354 73981 17134 -153066 -181453
15527 -181453 -108203 -192263 -275186 -128185 25369 111327 92826 4596 54455 146212 105803
15516 105803 4212 21972 -59839 -102779 29144 30757 -91088 -189068 -203707 -121815 -98535
15505 -98535 -150435 -134211 -6407 106873 51649 85133 98699 108776 67137 -32150 -92276
15494i2276Q9358j07695l3550N7506J9783k2560j00123j19790R2275J06847J5772
15483i4453N2314R546n9669q3796P6751R9748M5169K7409O4331j12548n1501o927
15471c3626p8509M8725k2540Q5313J48914J7993o7780L1502p710j59549P886k2236
15459e1617j8418J15835J5871J01066j3407k5781q9694K7782j7439K0964J41440
15448B06602n4820j10861o0033r5247m3643R7179J02773k2611j28805K3869J3038
15437g2559n0924p238K1542N9290J72565Q2795m5181N188P382j09164N3979N7222
15425A74897j31055P9094L0348k6650l2836o9353k8599J31340K6944n7467j17002
15414b0339k2659O6473J4467r0566O255k6840M6953r634j7063J38593K0147l0444
$$ plain form
15494 -92276 -2918 -110613 -144163 -86657 -66874 -89434 -189557 -309347 -217072 -110225 -94453
15483 -94453 -42139 -32593 -92262 -176058 -99307 441 45610 73019 137350 24802 -26699 -33626
15471 -33626 -112135 -63410 -85950 -637 148277 166270 98490 129992 122282 -37267 -29381 -51617
15459 -51617 -70035 45800 61671 162737 149330 123549 33855 61637 44198 65162 206602
15448 206602 151782 40921 -19112 -114359 -158002 -60823 41950 19339 -109466 -85597 -72559
15437 -72559 -123483 -130721 -109179 -49889 122676 205471 160290 165478 172860 63696 117675 174897
15425 174897 43842 122936 153284 126634 93798 24445 -4154 127186 154130 96663 -20339
15414 -20339 -42998 23475 37942 -52624 -46369 -73209 -26256 -35890 -52953 85640 105787 75343
15402G5343J8545j7657r2447n3023r9184k176l5536J6063k4448P4169L180L8430
15390i8741k9027l4556J1532k4874J12455J40883o8651k7024r6654R4676l8333
15379e8314j30324L0833J68285M6613q8796M0316M510j00868k9641J36236k4179
15368e329k8501P2252k7593k9801r224j02333o0417R2301q7019J2315P2258j4008
15356a15099K5532J50440J41421o3656p4059J2135l3738l3818n9277k8729K078
15345g6770m221J30l496L2623O2915O5448l6131j25010l5545j4681n4991o5047
15333b54776j5763J08640N3444k0633n594R1091J441O2883r0870J08494L6552
15322G4909k7925j39761o2925j28R666K5160J2150m5332L5277N8577M7551N7794
$$ plain form
15402 75343 93888 76231 -16216 -69239 -168423 -170599 -206135 -190072 -214520 -140351 -137171 -98741
15390 -98741 -127768 -162324 -150792 -175666 -63211 77672 9021 -18003 -114657 -19981 -58314
15379 -58314 -188638 -157805 10480 57093 -31703 8613 13123 -87745 -117386 18850 -5329
15368 -5329 -33830 38422 10829 -18972 -28196 -130529 -190946 -98645 -185664 -173349 -101091 -115099
15356 -115099 -89567 60873 202294 138638 64579 76714 42976 9158 -50119 -78848 -76770
15345 -76770 -80991 -80861 -84357 -51734 11181 76629 40498 -84512 -120057 -134738 -189729 -254776
15333 -254776 -270539 -161899 -108455 -129088 -134682 -43591 -42150 20733 -70137 38357 74909
15322 74909 46984 -92777 -155702 -155830 -146164 -121004 -108854 -154186 -118909 -60332 -12781 45013
15310D5013P027K1272m8001o4121m1798j24447r4880J47672J09568r450J24067
15299G1922q91j31337p4205J10900O126K7799K8542n6936q5412Q4440K4801k3106
15287a7357J5077k283k5191j24686l1004M8132J09468J25310n472o4051l5507
15276g564Q4386l2726j05995r1700n8711j25961N3369L3693O1165N9538P0957
15265e9549m4060P1444M6022j6013j04730J01993J52440r331j67790p8475L4239
15254g3810k5322l2664O0625J2755O2089k4545j04422M5751J9036N0921J42092
15243A32506k4215p7240K8522P0370N5494l7063p6503q5810l240J02676r3269
15232g772j55002N7925O1454k4269m8029K5527M3266N5794k4209j45334N0177
$$ plain form
15310 45013 52040 73312 25311 -38810 -80608 -205055 -299935 -152263 -42695 -52145 71922
15299 71922 71031 -60306 -134511 -23611 -17485 10314 38856 -18080 -103492 -19052 5749 -17357
15287 -17357 -2280 -4563 -29754 -154440 -185444 -137312 -27844 97466 91994 27943 -7564
15276 -7564 76822 44096 -61899 -153599 -212310 -338271 -284902 -251209 -190044 -130506 -59549
15265 -59549 -103609 -32165 13857 -2156 -106886 -4893 147547 138216 -29574 -108049 -73810
15254 -73810 -99132 -131796 -71171 -58416 3673 -20872 -125294 -79543 -60507 -9586 132506
15243 132506 108291 31051 59573 129943 185437 148374 71871 -13939 -17179 85497 -7772
15232 -7772 -162774 -104849 -43395 -67664 -115693 -90166 -46900 8894 -15315 -160649 -110472
15221a10472M2541l4527l3754j1555Q3204m8793M7394O58J242p045K2373j30832
15209a79566p5698P0755L4278J16953L0000L4137k4180j27330n249R4818l995
15198c5077l9961J50912r1121r0879P958o7847O3500q0384o1928J25681J58536
15187C9390Q8719j7173j23338J0757Q97r0867L8953m0629j13191j2548J22406
15176i6624O9069L8183l1089m7083O5186p2572N538J23886j3282K4600M4454j20087
15164i821L0403m506J7430k2205l3297R0256L611j11794Q812J9434Q5552Q6563
15152A60438P7839m8260j00998r6933l0894p6750M482Q5570K2601n1014k8393
15141h2312j37257P8320L0632L8179K8951N0142l3581n5736j2362M0315O7568
$$ plain form
15221 -110472 -67931 -102458 -136212 -147767 -64563 -113356 -65962 -65304 -64062 -71107 -48734 -179566
15209 -179566 -255264 -184509 -150231 -33278 -3278 30859 6679 -120651 -125900 -31082 -35077
15198 -35077 -75038 75874 -15247 -106126 -98168 -166015 -102515 -182899 -244827 -119146 39390
15187 39390 128109 110936 -12402 -1645 -748 -91615 -52662 -93291 -206482 -219030 -96624
15176 -96624 -27555 10628 -20461 -67544 -2358 -74930 -69392 54494 41212 65812 110266 -9821
15164 -9821 20582 16076 33506 11301 -21996 68260 71871 -39923 -31111 -11677 73875 160438
15152 160438 238277 190017 89019 -7914 -38808 -115558 -111076 -25506 -2905 -53919 -82312
15141 -82312 -219569 -141249 -110617 -72438 -43487 6655 -26926 -82662 -95024 -54709 12859
15130A2859k0261j31983N3638J51603R0155j08036r7253l417J24238m5069j34595
15119a08121P4454J1666j8671R616p8929k8696l0583N8028J11230j06745m3538
15108a50289k9508j1901K9602k114O6854j6563n0370k2953M3416J3408O0552n9569
15096a29435j18954r5850P3121J10394q636o3337N1611j5733j8700O6811L3205
15085a15503k4698P2203l8678N7135N3772P9779o9586L8974J54230K9729K3664
15074B61021q3409j11915P8833N5892q6767Q541j8957k7860n2485J07732k8565
15063A02061l8878r5204n8733J6938j20129R8641J60730j34354m4207n1342j08261
15052b72738m5668J00562J00990Q2468m5309P519P8328l5929k9752o2485j04588
$$ plain form
15130 12859 -7402 -139385 -85747 65856 156011 47975 -49278 -52695 71543 26474 -108121
15119 -108121 -33667 -22001 -40672 -31056 -109985 -138681 -169264 -111236 -6 -106751 -150289
15108 -150289 -179797 -191698 -162096 -164210 -97356 -113919 -164289 -187242 -143826 -130418 -69866 -129435
15096 -129435 -248389 -344239 -271118 -160724 -169360 -232697 -181086 -196819 -215519 -148708 -115503
15085 -115503 -140201 -67998 -106676 -49541 4231 84010 14424 53398 207628 237357 261021
15074 261021 177612 65697 144530 200422 113655 122196 103239 75379 22894 130626 102061
15063 102061 63183 -32021 -90754 -73816 -193945 -95304 65426 -68928 -113135 -164477 -272738
15052 -272738 -318406 -217844 -116854 -34386 -79695 -72176 6152 -29777 -59529 -122014 -226602
15041b26602k0805O0289M9764Q2357r565L0560N6842m0231M9843J27096k4254
15030A35294j44071j2372N9904N2673K0203k3272j15975K2923J22795N2236K102
15019A72440n2584Q456j91450q7272N9471j9011Q6508k6700r9730j0776N536N4128
15007a00984L4885o8136j6947Q5746O9790m2269j02682j7436O5135R2994n9292
14996e9196j79592k46364L5380K30001J86023Q8259O8333k6113N763j27302n0292
14985g5100Q5678k7582m6780M9352l3945n1455j8228J14125J3884r06k0059P1268
14973F0252L3790m4283p2296n8129L0681J1687j4296J16201N1093L7094R525r6556
14961F4763o4376M2587P5625j49076r3647P0851j20526M9690Q7615R4218n4509
$$ plain form
15041 -226602 -247407 -187118 -137354 -54997 -64562 -34002 22840 -17391 32452 159548 135294
15030 135294 -8777 -21149 38755 91428 111631 88359 -27616 -4693 118102 170338 172440
15019 172440 119856 128312 -63138 -150410 -90939 -109950 -23442 -50142 -149872 -160648 -155112 -100984
15007 -100984 -66099 -134235 -151182 -65436 4354 -37915 -140597 -158033 -92898 96 -59196
14996 -59196 -238788 -485152 -449772 -219771 -33748 54511 122844 96731 102494 -24808 -75100
14985 -75100 10578 -17004 -63784 -14432 -48377 -99832 -118060 -3935 9949 9043 -11016 60252
14973 60252 94042 49759 -22537 -80666 -49985 -38298 -52594 63607 114700 151794 161319 64763
14961 64763 387 42974 118599 -30477 -124124 -53273 -173799 -124109 -36494 57724 3215
14950C215k4387l4701l8832o426j2941J2825K311Q0305K8018q463n5945j43981
14938a99002j41257p8523J72987J74720J11340r6025j08864M1046M015J03483
14928a6080P8707n46Q7070L2969j98197k2829l2777K2267N4802m552P1057j42287
14916g0396J7719J568n7328j0890j1187P7848p5147j05107R5034O2329l7920p56
14904a14233L7254r5378j25760K22539J25083j7231k6051p8689P3158M5754j06443
14893e9997r1452Q8499M8892j3885r799O9070J14066j1025m5691k4404R6923J20963
14881B82160j49117j30639k5702j402J19358o6526j05386K1771J43559m406n184
14870G8486r1705P9672J07918o8635R5053j02830k0425m6615j81696l1280n632
$$ plain form
14950 3215 -21172 -55873 -94705 -101131 -114072 -101247 -98936 -18631 9387 924 -55021 -199002
14938 -199002 -340259 -418782 -245795 -71075 40265 -55760 -164624 -123578 -119563 -16080
14928 -16080 62627 62081 149151 182120 -16077 -38906 -71683 -49416 5386 834 71891 -70396
14916 -70396 -52677 -51109 -108437 -119327 -130514 -52666 -127813 -232920 -137886 -75557 -113477 -114233
14904 -114233 -76979 -172357 -298117 -75578 49505 32274 6223 -72466 692 46446 -59997
14893 -59997 -151449 -62950 -14058 -27943 -37742 31328 145394 134369 88678 64274 161197 282160
14881 282160 133043 2404 -23298 -24700 94658 28132 -77254 -55483 88076 83670 78486
14870 78486 -13219 66453 174371 105736 200789 97959 77534 30919 -150777 -182057 -187689
14859a87689q0603M3779J17255J03037O7259j71317j78724L1318M5400L9953J38195
14848c2137M0107q8660K0225J65290l7274k16922o0066N6349J09733P9425q5183
14837d9113j5781o3244l1284n8795K7103J86477o6472k3008P0285m3350j2504
14826g9686J06176J02264p8825p2012J5448R459l035k0499l0605o2919N8315R1489
14814C5570p8152j01705P9824N8226J7481M9405J8558J3445R966N0248l5794m4507
14802G2565j29059O000O9446j3177K425q906l6603J7336J700k3756p3303m2368
14790a57700R2604J47233K9470p547l6622O6306q4064j55824K3084Q2404k1988
14779b2644L6084m3364k7322O7230P1180P4176k3918J28176j64797j55302r9325
$$ plain form
14859 -187689 -268292 -224513 -107258 -4221 63038 -108279 -287003 -255685 -210285 -170332 -32137
14848 -32137 7970 -80690 -60465 104825 67551 -149371 -209437 -153088 -43355 36070 -49113
14837 -49113 -64894 -128138 -159422 -218217 -191114 -4637 -71109 -94117 -23832 -67182 -79686
14826 -79686 26490 128754 49929 -22083 -6635 2824 -211 -20710 -51315 -114234 -55919 35570
14814 35570 -42582 -144287 -64463 -6237 11244 60649 79207 92652 102618 152866 117072 72565
14802 72565 -56494 -50494 18952 5775 8200 -706 -37309 -19973 -18273 -42029 -115332 -157700
14790 -157700 -65096 82137 111607 104060 67438 133744 49680 -106144 -83060 -656 -22644
14779 -22644 13440 -29924 -57246 9984 81164 155340 131422 259598 94801 -60501 -159826
14768a59826o46L8918K8573l2741J09358N9634K1087R780r0967o9185L3527L8054
14756a4434N4684p684n431N5540J4744o8223n041Q305L253M3424L6526m7418n4965
14743A3280L5865M2907l8213p3753j6298l5187r8923m7831M678J09427m7670P8202
14731g3516N4053R741L6070k8751q9901K1679K6871p050j8436r526k467J55766
14719G4533R0571l6076j18815n6660j01565P8180P6071J6636j1726Q2057R389
14708A02595j23038L7339M9799j41118j21635l99J7985q8917J16776k3882m2307
14697b16802J43972M2666p7790K7065J07710p92N5901L0530q7214k0323J14259
14686A19182j6751k23926J9271P89M3308l3729J47776K07980m1223k27758n5555
$$ plain form
14768 -159826 -160472 -121554 -92981 -125722 -16364 43270 64357 74137 -16830 -86015 -52488 -14434
14756 -14434 40250 32566 27135 82675 97419 29196 24155 32460 35713 79137 115663 68245 13280
14743 13280 49145 92052 53839 -19914 -36212 -71399 -170322 -218153 -213475 -104048 -151718 -73516
14731 -73516 -19463 -9722 26348 -2403 -92304 -70625 -43754 -50804 -69240 -78766 -81233 74533
14719 74533 165104 129028 10213 -46447 -148012 -69832 6239 22875 11149 93206 102595
14708 102595 -20443 16896 66695 -74423 -196058 -196457 -178472 -267389 -150613 -174495 -216802
14697 -216802 -72830 -30164 -107954 -80889 26821 26029 81930 112460 25246 4923 119182
14686 119182 102431 -121495 -102224 -101435 -58127 -91856 55920 263900 222677 -5081 -60636
14675f0636N5196L6502P1678n4290n4935Q048M6261O7403k983j66464j31482m0105
14663b25807K8898M2205Q9499o5095q5809J86899J67995J10390p0650q4530n9061
14652C4934j64599n0678m1232Q7520N7335j2745k5648p842R1062P8311o7157l6879
14640e7618O5422l7821j30902L918Q8560K4960n487J29789O9419j44720o2893
14629e7373k6306n8883J9428Q1262J0680m5960N4510M319M1178j24673m3229L8080
14617a06967J16239M4752J1456k6067n3797r1659K8067R845k7745R6349J35349
14606A35822J19688k5941j14495k3379N79j6517r6182m8786q549l8461N5318R0846
14594B9943P6688k96m0141L4634o78n4210J7398N4085n9880K3670n6341j6690
$$ plain form
14675 -60636 -5440 31062 102740 48450 -6485 1563 47824 115227 112244 -54220 -185702 -225807
14663 -225807 -196909 -154704 -65205 -130300 -216109 -29210 138785 249175 178525 93995 34934
14652 34934 -129665 -180343 -221575 -134055 -76720 -89465 -115113 -122955 -31893 46418 -20739 -57618
14640 -57618 7804 -30017 -160919 -157001 -68441 -43481 -48968 80821 150240 5520 -57373
14629 -57373 -83679 -142562 -123134 -41872 -31192 -77152 -22642 -18323 22855 -101818 -145047 -106967
14617 -106967 9272 54024 65480 39413 -14384 -106043 -77976 -68131 -95876 473 135822
14606 135822 255510 229569 115074 91695 92274 75757 -20425 -69211 -77760 -116221 -60903 29943
14594 29943 106631 106335 66194 100828 100150 45940 63338 117423 57543 81213 24872 8182
14582H182j16546K8930J4977O8717J06888j3391n1150n2301K9118N5981J02657
14571A82062o6060m2517k0930R304j35842K5747j6196l8324k8876N8965K9208
14560d3459K1380R8238n5747p7985j2424q2332p7124k9251P8399O1880Q0340J00907
14548F2822r531j4246l7588r0055l3913M3186J6247m5896j55959J9283l93Q684
14536b37359L8781O0625P4162J07127O627L2098l2767p8601p340J07163K4114
14525I4630j10962l7977j002L0874N607M728j07l1685Q6096M1275J21263p1276
14513A31464j85380J5906q3591o1847J18907J34886L1089m3101q4609M9220O4277
14502H7221j46305j8677j9378R7189o9977l7544o9790l5678N4028L0316p7155
$$ plain form
14582 8182 -108364 -79434 -64457 4260 111148 97757 46607 -5694 23424 79405 182062
14571 182062 116002 73485 52555 61859 -73983 -48236 -64432 -102756 -131632 -72667 -43459
14560 -43459 -22079 76159 20412 -57573 -69997 -152329 -229453 -258704 -180305 -118425 -38085 62822
14548 62822 53291 39045 1457 -88598 -122511 -79325 -63078 -108974 -264933 -245650 -246043 -237359
14536 -237359 -198578 -137953 -63791 43336 49963 82061 49294 -29307 -36647 70516 94630
14525 94630 -16332 -54309 -55311 -24437 -18830 -14102 -14209 -45894 40202 81477 202740 131464
14513 131464 -53916 -38010 -121601 -183448 -64541 70345 101434 58333 -26276 22944 87221
14502 87221 -59084 -77761 -97139 50 -69927 -107471 -177261 -212939 -158911 -128595 -205750
14491b05750K2967L810J37841J34040K8950k023m6220j3397o2146o5828m7615
14480a15371p7537L8586J6164j3833l0890Q8209M4798P1331j472m5252m4326k8701
14468i8294J9698l4141j06851r961N7349R1389J59262j9858j00863o2287Q0467
14457b4090J54462l5416k8070M39o9201l6123m2716M8401o0356k1282K706J08079
14445c167J318o2301O253L6309n1738J3894J15318R6924m9979k6111j6533r8090
14433c7903j30389R3053J6768j06415J00578R779P4565L3885K4607P2656Q7105
14422B38289j3750K7435j27983j26674m2432k8298L1237N9139J6438O858n5609
14411a5350j37466N0322J24178M5052R8079J18492r6604j10113o817J09612J53917
$$ plain form
14491 -205750 -182783 -178973 -41132 92908 121858 119835 73615 60218 -1928 -67756 -115371
14480 -115371 -192908 -154322 -138158 -151991 -182881 -94672 -49874 21457 19985 -25267 -69593 -98294
14468 -98294 -78596 -112737 -219588 -229549 -172200 -80811 78451 58593 -42270 -104557 -24090
14457 -24090 130372 94956 66886 67325 -1876 -37999 -80715 -32314 -92670 -113952 -111246 -3167
14445 -3167 -1849 -64150 -57897 -21588 -73326 -59432 55886 152810 102831 76720 60187 -37903
14433 -37903 -168292 -75239 -58471 -164886 -64308 -54529 20036 53921 78528 151184 238289
14422 238289 224539 251974 123991 -2683 -45115 -73413 -42176 16963 33401 40259 -15350
14411 -15350 -152816 -102494 21684 66736 164815 283307 186703 76590 69773 179385 333302
14400C33302J643J9905k5566k36421q8934P4786j01587m146k5364J3385K2185
14389a6812M0836R096Q7852J75359q6169o7949j15051o0977m8315J34964N9815
14378A12649m1540R9850N1016j67107n1435Q635M0735Q2140J1299K9657M310j09271
14366G0938j7048N600j73366l2773M6641J30441J44921N6583n7930o1677o4151
14355D8179Q7793j6782r6275o422J01961J8527n5652J4177m8135J4961j04405
14344d2073O5390L1744l8293P1778L7349n4960o2117M0217j07580j17447L1147
14333a44845j7337J08516Q8626j5090k58k5144k6778l2792r485M1434R942M6893
14321B3682L6887r0652l8843Q6406M8965m8244L6373J0651j32336n0342K2731
$$ plain form
14400 333302 334945 354850 329284 92863 3929 78715 -22872 -27018 -52382 -38997 -16812
14389 -16812 24024 33120 120972 296331 210162 142213 27162 -33815 -82130 52834 112649
14378 112649 71109 170959 221975 54868 3433 12068 52803 134943 146242 175899 180209 70938
14366 70938 53890 59490 -113876 -146649 -100008 30433 175354 231937 174007 112330 48179
14355 48179 135972 119190 22915 16493 118454 136981 81329 95506 47371 62332 -42073
14344 -42073 23317 55061 16768 88546 125895 70935 8818 49035 -58545 -175992 -144845
14333 -144845 -162182 -53666 34960 19870 19612 -5532 -32310 -65102 -74587 -33153 -23211 23682
14321 23682 60569 -30083 -68926 17480 66445 18201 54574 65225 -67111 -117453 -94722
14310i4722L7219l2999m4006J07880J1932J411L6730L3978j4114J8741p8044n9865
14298g5859Q7428P9856M6565n944r131q7563j19407L4201Q83p8019p7365Q4949
14286a19406j6603L8204k1546L2915P3173j8122K681J12093K09584k2007j39024
14275A31942K0842k7918o7038p0564j9052q6328M0508N8026N0025n505j10163
14264h5225j04485N9813J09573o8663l4744J19253K3366O6413J01126o891j30207
14253D9329q9843m6257M8663k3740m8080l0218j13385j7620P1392L9942J31490
14242b8327l558L3923Q8521M7329M7463M0233J3564j23686j34473M7039m2193
14231a4165M628j41205j24465L6584P9395M5210l1927K9407O2353l9078l7782
$$ plain form
14310 -94722 -57503 -90502 -134508 -26628 -14696 -13285 23445 57423 43309 62050 -15994 -75859
14298 -75859 11569 91425 137990 132046 122915 35352 -84055 -49854 -48971 -126990 -204355 -119406
14286 -119406 -136009 -97805 -119351 -86436 -13263 -31385 -28704 83389 292973 270966 131942
14275 131942 152784 124866 57828 -12736 -31788 -118116 -77608 -19582 30443 24938 -85225
14264 -85225 -189710 -129897 -20324 -88987 -123731 -4478 18888 85301 186427 179536 49329
14253 49329 -40514 -86771 -38108 -61848 -109928 -140146 -253531 -271151 -199759 -159817 -28327
14242 -28327 -31885 2038 90559 137888 185351 225584 239148 115462 -19011 28028 -14165
14231 -14165 -9537 -150742 -275207 -238623 -159228 -114018 -145945 -116538 -54185 -93263 -131045
14220a31045L5518R1296R1453L8438p9848j2379O9492J3162m2311J7915L0616
14209A22307q9428J3770P52k418J3186k2863J1054k9353R3951m9177j94904M4584
14197h8539Q7196K564j36504l0366O5461Q2463l9729m8142l8287l4091J61465
14186a6509N5357o9842o5161J5204j22076O1632q2948N451R939N0185O9970L3765
14174e5033j1124n5310L3533R0113M1943m2231l0059n1841N1775L4855N4173M3455
14162A04249j2653j71642m7056l6977O45L490p708R2336r9194O4069L6131J36402
14150F2092Q2510P74J01775k0241j12014j49985m3955Q7319N2116l4683J9406
14139D5114p9391O5452M1970J2287R5937o4528j08977K7223n9330p4181M035K2401
$$ plain form
14220 -131045 -95527 -4231 87222 125660 45812 33433 102925 116087 73776 91691 122307
14209 122307 32879 46649 47401 44983 58169 35306 46360 17007 110958 61781 -133123 -88539
14197 -88539 -1343 1221 -135283 -165649 -100188 -17725 -57454 -105596 -143883 -177974 -16509
14186 -16509 38848 -30994 -96155 -80951 -203027 -141395 -224343 -218892 -208953 -158768 -88798 -55033
14174 -55033 -66157 -121467 -87934 2179 44122 1891 -28168 -80009 -28234 6621 60794 104249
14162 104249 91596 -80046 -127102 -164079 -163434 -159944 -167652 -75316 -174510 -110441 -74310 62092
14150 62092 144602 145376 247151 226910 114896 -35089 -79044 8275 60391 25708 45114
14139 45114 -34277 31175 73145 85432 181369 116841 7864 35087 -24243 -98424 -94389 -71988
14127g1988J4383k6725K2804J48707J21956j26544k56039L4991R4007O8883J1785
14116C6220M3821P8536M105l7752M6635J7464J691O973k7424q9371j8638k2354
14104C9906k2961L7802J7392p9364N713N519N6454K2937m0197n9218o6283o5632
14092a47932O9701R8520P7068m3322P225p4831n7332q9128N9939P0315L4780N5261
14080F0264M3678l7246q6023J300p3198p8733q7087R6826J43900m6099k1596p2777
14068a56791K6457J3630m4592M8718J59013J52047j78483r0963j0635k8757L5191
14057g5165J5406P2423K7536P9288j6429L092j3444J6392J30777M73m5976M0484
14045B34857j0853j12387p1076j07996N4612K8534j05188L9061M2317J3108K1914
$$ plain form
14127 -71988 -57605 -84330 -61526 87181 209137 82593 -173446 -138455 -44448 24435 36220
14116 36220 80041 158577 162682 124930 171565 189029 190720 197693 170269 80898 62260 39906
14104 39906 16945 54747 72139 -7225 -1512 4007 60461 83398 43201 -16017 -82300 -147932
14092 -147932 -78231 20289 97357 54035 61260 -13571 -70903 -160031 -100092 -29777 5003 60264
14080 60264 103942 66696 -19327 -18027 -91225 -169958 -257045 -160219 -16319 -62418 -84014 -156791
14068 -156791 -130334 -116704 -161296 -112578 46435 198482 19999 -70964 -81599 -110356 -75165
14057 -75165 -59759 12664 40200 119488 103059 106151 92707 109099 239876 240349 194373 234857
14045 234857 224004 111617 40541 -67455 -12843 15691 -89497 -50436 -8119 4989 26903
14034B6903o8300J38809J01311j02691r3069N1884J18094Q742n2307j42734J270
14023a2088m2561K1392Q5755M8505l844j0677J15927M8489n7372j6815r8077m0037
14011C8597j4984K7878J53138q0465j18048K7074N9524l1306o0507r6562j0568
14000a06229o7J7274Q0905K06011J0981r9422m8545m304k1013P508L461q2525
13988c5965Q8905L24r5616K8064j6077j19218L4619j02885k9576J16047N8150
13977g3228M390O514J37654O3975M2266n3427j36788q7313P5966m2962n2406J08694
13965f665O3469L8267m1465r9736j3492n05j0277J2902l6851m088M2924N9729
13953D212L6219P280N2089j2944n8770q8384L5478J5697n909L5974n8060k682
$$ plain form
14034 26903 -41397 97412 198723 96032 2963 54847 172941 181683 129376 -13358 -12088
14023 -12088 -54649 -33257 52498 101003 97159 86482 202409 250898 193526 176711 78634 38597
14011 38597 23613 51491 204629 124164 6116 33190 92714 61408 901 -95661 -106229
14000 -106229 -106296 -89022 -8117 197894 208875 109453 60908 56604 35591 43099 46560 -35965
13988 -35965 52940 53264 -42352 -14288 -30365 -149583 -114964 -217849 -247425 -131378 -73228
13977 -73228 -68838 -62324 75330 139305 181571 128144 -8644 -95957 -19991 -62953 -115359 -6665
13965 -6665 56804 95071 53606 -46130 -59622 -60127 -70404 -57502 -94353 -98441 -55517 4212
13953 4212 40431 47711 99800 86856 28086 -60298 -24820 -9123 -15032 20942 -37118 -39800
13941c9800J25764L3526n7606n5503q346m9358p14J03223M3182q8689l4010M7751
13929A9420m2096M340j2907J56660R6508J0408n2833k3917K6320q0508n7176l163
13917D1056n7475N4691j7516j00991L159r55O4082O7791J2086M392m591M2988
13905A08717j6522l9178M2882K5162m8682n0246J3233N4891O492j53656r2448
13894a49355L1307R1305N0843J1309n3572m8812m9464J0638P6131J26891O8379
13883A65600o5096M7783m8485K1020m9583j3054J6241J55058l1469n7934l1064
13872A09017m1499j04616k4159Q5652N0105p1579n4465M0790O936j05315K7335
13861h1798N7564L8103r9508K32242N1762k27885L7803J9392n8176J3465J74525
$$ plain form
13941 -39800 85964 119490 61884 6381 -1965 -51323 -52037 51186 94368 5679 -28331 19420
13929 19420 -22676 -18336 -31243 125417 221925 232333 179500 155583 181903 101395 44219 41056
13917 41056 -16419 38272 20756 -80235 -77076 -78031 -13949 53842 65928 70320 65729 108717
13905 108717 92195 53017 95899 121061 72379 22133 35366 90257 96749 -56907 -149355
13894 -149355 -118048 -26743 24100 35409 -18163 -66975 -116439 -105801 -29670 97221 165600
13883 165600 100504 148287 99802 120822 71239 58185 74426 229484 198015 140081 109017
13872 109017 67518 -37098 -61257 24395 74500 2921 -51544 -10754 -3818 -109133 -81798
13861 -81798 -24234 13869 -85639 146603 198365 -29520 8283 27675 -30501 -17036 157489
13850A57489M870l6174j04087K8364K7595j0266K2764j46101J6455k4821o4546
13839a28458o9033L5871J33975J1031n5497K4814O9179l385n2737J4844j16990
13828a36386j46628Q8541J14373J08824K9426L3994J7841M9605j8458J9508j7239
13817A43401m9816L344j20937n3683J4958J03419J18373q6141k1680Q1297n6645
13806G5890j45190o6397N9079P0277J21767J170O536L7240K5088n7983l9654p7221
13794A0602L3323q8953j19596J01834R0910j6258O2457L1321m8427m8597r1545
13783h2929o599Q4419O6675L641m848K135Q0692l5526p01J37176l4443q4596r0383
13770C4713M4395j1030j04591j17569j6443O4140J0367l732J45443Q4026K2248
$$ plain form
13850 157489 162359 126185 22098 50462 78057 67791 90555 -55546 -39091 -63912 -128458
13839 -128458 -197491 -161620 -27645 -16614 -72111 -47297 21882 18497 -34240 -19396 -136386
13828 -136386 -283014 -194473 -80100 28724 58150 92144 109985 159590 141132 160640 143401
13817 143401 93585 96929 -24008 -77691 -62733 40686 159059 72918 51238 132535 75890
13806 75890 -69300 -135697 -76618 -6341 115426 116596 123132 160372 185460 127477 87823 10602
13794 10602 43925 -45028 -164624 -62790 28120 11862 74319 105640 57213 8616 -82929
13783 -82929 -89528 -5109 61566 65207 60359 62494 143186 107660 106959 244135 209692 125096 34713
13770 34713 79108 68078 -36513 -154082 -170525 -106385 -96018 -99750 45693 129719 151967
13759A51967k2944o7748j0637p638R3630L8101K5579k45J5946K7413m8820l7047
13747A57557J0268o3116j3164j21091j7562N7696J20890J34429l226k9867p3201
13736A59613o0728l8342J4362Q5908p168n1647M0478m1341m9604l4143o7660j06100
13724a56372L1255P7511J4642p2064J14655J36081J0593p5904K3389K4343o1493
13713F6636l18o6278L4373l9480M3223p6939P7824N7579j3232J21526l6424r1003
13701G7487k0483R2047J06190K4107j24937q8560k9439k5414l9158J06892J07208
13690A85940J07046m0978l5588l8866m7888K1694J75800N3119j23294j64893n6470
13679C5622M3194J410L2552K6027n1887j14240q8578R9727M3270r7825l7314m8170
$$ plain form
13759 151967 129023 61275 50638 43000 136630 174731 200310 200065 216011 243424 194604 157557
13747 157557 167825 104709 91545 -29546 -47108 10588 131478 265907 262681 232814 159613
13736 159613 98885 60543 74905 160813 153645 101998 142476 101135 51531 17388 -50272 -156372
13724 -156372 -125117 -47606 -32964 -105028 9627 145708 156301 80397 103786 128129 66636
13713 66636 66318 40 34413 -5067 38156 -38783 39041 96620 83388 204914 168490 77487
13701 77487 57004 149051 255241 279348 154411 65851 36412 10998 -28160 78732 185940
13690 185940 292986 252008 216420 177554 129666 151360 327160 380279 256985 92092 35622
13679 35622 78816 80226 112778 138805 86918 -27322 -115900 -16173 27097 -70728 -108042 -156212
13667a56212J0632R0276k7351k9989N2130l4023J34843J23089n5043r073o3181
13656C6098K5358k4196K1395k2787K4707J04301m4081J40K3959j1215j8354l6936
13644G8389p8206o0505o4424l6116N1381K1978O7268J19156L1745k0569j2090
13633I8007j9741n8194l0743k6706Q2379J2178O6065Q9977q3883p9256m6930J34083
13621A37236m240j07077k7421P9993M3447M9723J4410j66299r4780J0347L2779
13610c1882N5957q7991j5534J4323j6396K5335J49250j04720p3023P0578J75391
13599A61288K4434j09884r9828N7792J00288j3229n7465M6284K2925l1961J12277
13588B12921M0381q8744J9201m3104k387M5703P1404n8506j0156m5252p8337l3042
$$ plain form
13667 -156212 -145580 -55304 -82655 -112644 -60514 -94537 40306 163395 108352 99279 36098
13656 36098 61456 37260 58655 35868 60575 164876 120795 120935 144894 133679 115325 78389
13644 78389 183 -60322 -124746 -160862 -109481 -87503 -20235 98921 130666 110097 98007
13633 98007 78266 20072 -10671 -37377 45002 57180 123245 213222 129339 50083 3153 137236
13621 137236 132996 25919 -1502 78491 121938 171661 186071 19772 -75008 -64661 -31882
13610 -31882 24075 -63916 -79450 -65127 -81523 -56188 93062 -11658 -84681 -14103 161288
13599 161288 185722 75838 -23990 33802 134090 120861 63396 109680 132605 100644 212921
13588 212921 253302 164558 183759 140655 138268 183971 255375 196869 186713 141461 63124 30082
13576C0082L3367M9288Q3153K8013Q7992l0767q2316J29385r5515j29164K6853
13565A30371R2387J01638J5932q9550q9903m670M4966j2415m2181J362J6096j9943
13553A44090J1217o2142o932j12206o6282K8551L0285Q9689O5893L160J40367
13542B65690K468j05435p5345J4611L3549q0773p0473K9848P6330J4440l3205
13531G1705J2155P756l082k3790o3002n981K7992o8386p868m3587l265J84606
13519H5253P3730k4052J8496j23837m0736K0772l2886M7684J06411k170l0908
13508I7757m5845M6739J8237k1168q3990J8756J50191N2999l5067p0032m6857
13497H1720l1120n7770k3945j61741K7102J52762j2776m5057P3257J11205k7209
$$ plain form
13576 30082 63449 112737 195890 223903 311895 281128 198812 328197 232682 103518 130371
13565 130371 222758 324396 340328 250778 160875 156205 201171 188756 146575 147937 164033 144090
13553 144090 155307 93165 86233 -25973 -92255 -63704 -33419 56270 122163 125323 265690
13542 265690 268158 162723 87378 101989 135538 54765 -15708 14140 90470 104910 71705
13531 71705 83860 91616 88534 64744 1742 -4239 23753 -44633 -52501 -96088 -99353 85253
13519 85253 158983 134931 153427 29590 -11146 9626 -23260 24424 130835 128665 97757
13508 97757 51912 98651 116888 95720 11730 30486 180677 233676 198609 128577 81720
13497 81720 50600 -7170 -31115 -192856 -165754 -12992 -25768 -70825 2432 113637 86428
13486H6428J17378L0474j42290L1481Q42n8175j9619p675N3805p5229j07005J7304
13474g2281L7010k124O4433m9923r7767p555k5354N1922M5513L5942K0756K3400
13462B3972N6820m0290l8162n0963l8942k4699P2434N784l6574j24060n2651R5890
13450a51441K07661L5175L6527L7071k0952j16184o9935R6758K6228N0277l1151
13439A00034M9889R4440j11189j66889o5743M911K2533L7296J5506P0189l8636
13428A2341P475J3916L3848L1709J3193j8016o6982P6256m3258K6544O8466P4228
13416B29720m75n3441j30676m1109n6051Q5303J49571l4268o2639o4621P456Q4798
13404A13568L4229N9714K7365l3992L2579j22644l9564l7672j02280K0276K1403
$$ plain form
13486 86428 203806 234280 91990 123471 124313 66138 46519 38844 92649 17420 -89585 -72281
13474 -72281 -35271 -37395 27038 -22885 -120652 -128207 -153561 -101639 -56126 -20184 572 23972
13462 23972 80792 40502 2340 -48623 -87565 -112264 -39830 -34046 -70620 -194680 -247331 -151441
13450 -151441 56220 91395 127922 164993 144041 27857 -42078 54680 80908 131185 100034
13439 100034 149923 244363 133174 -33715 -99458 -94547 -72014 -34718 -19212 50977 12341
13428 12341 19816 33732 67580 99289 112482 94466 27484 103740 60482 87026 155492 229720
13416 229720 229245 175804 45128 4019 -52032 33271 182842 148574 85935 21314 28770 113568
13404 113568 147797 207511 234876 200884 233463 110819 71255 33583 -68697 -48421 -27018
13393b7018m0717R9499J1225m6004J03681L6598j11667n3731L6869Q8273n9485
13382C7523l5984q0032j1701J02860N6614k8078L8021J67759J23996j19870p7477
13371A73631j5561l036j8880J5735Q3034m2563l7619K5685J12872O2048K9806
13360C85152o8431r7493n6984k5369n7531J04591o72n5778M7839l1782p5784l8979
13348B8779p5903L900N0621K4849p377L3762K0301n1187k1053Q6982Q1670j18350
13336E6994Q4710l8022R920K7803l6926O7695K2641l8890n5991j12455J8589l9794
13324c3726j51487Q262J85392K02467j06070n4967M1229M5935o5646j6934J9949
13313G4404J2639m0034j4083M5896J24433J8045o632j9960o6814m2067P5655M9681
$$ plain form
13393 -27018 -67735 31764 42989 -3015 100666 137264 25597 -28134 8735 97008 37523
13382 37523 1539 -78493 -90194 12666 69280 41202 79223 246982 370978 251108 173631
13371 173631 158070 155034 136154 151889 234923 192360 154741 180426 293298 355346 385152
13360 385152 316721 219228 162244 136875 79344 183935 183263 127485 175324 143542 67758 28779
13348 28779 -47124 -43224 7397 32246 24869 58631 78932 27745 6692 93674 175344 56994
13336 56994 141704 103682 113602 141405 104479 172174 194815 155925 99934 -12521 6068 -33726
13324 -33726 -185213 -176951 8441 210908 104838 49871 91100 137035 71389 54455 74404
13313 74404 87043 47009 32926 78822 203255 221300 214668 194708 127894 85827 161482 211163
13301B11163K8116J00831J6114n4426m2231n9562m5644l8586l8252j47180k8000
13290i7657J54526N3132J24564Q1186j20654j38786k1983Q419M204N5752K2254
13279A24957o0998J6323Q188J4431J0975n7018q9210q0672M0427K05046R6382
13268B28831L9941n8816n8638j27207j11210P9952J06390R3453L1235k1779P9323
13257B81475q8070j39412k4413R7917r8628j4438J26658K4783L9525j9425j08863
13246G7109Q469J17153j901m2671J1301K5229J9109j20046j6994J50219J83031
13235D10008o1457p6911k1184k3329j3791r3478n4112J12495J89519m4301j17931
13224B05528N2329p3545k1725m8314o3962M0146O639R4390K5945o5776j5753k4088
$$ plain form
13301 211163 239279 340110 356224 301798 259567 200005 154361 115775 77523 -69657 -97657
13290 -97657 56869 110001 234565 315751 195097 56311 34328 42747 46951 102703 124957
13279 124957 63959 80282 88470 102901 113876 56858 -32352 -113024 -72597 132449 228831
13268 228831 268772 209956 151318 24111 -87099 -7147 99243 192696 223931 202152 281475
13257 281475 193405 53993 29580 127497 28869 14431 141089 165872 205397 185972 77109
13246 77109 85578 202731 200830 158159 169460 194689 213798 93752 76758 226977 410008
13235 410008 348551 271640 250456 227127 213336 119858 65746 178241 367760 323459 205528
13224 205528 257857 184312 162587 114273 50311 90457 97096 191486 217431 151655 135902 111814
13212A11814j06928k9979O6079m5094J11438r34P0793j9300k5463J7801J14979
13201B65206J610j11974n9116r330R8250J01536l6061Q9575l5809q3283p8646
13190A41958n6880N465J22878M1995L5134j4644n9226j3409k971m633M7174N6953
13178B99794j36572r2846j2777m1594k4946P0785J31905K0112L9071j25541j00113
13167B7278N7744L9440J63639l1689J13475m5526m6886j09305j5237J62733O0402
13156C76068o9280j9936M4465J7848J9805r109j2939J03567P1223j91857k5269
13145C04586J7956K8850J26465j44320j28665k6362J17253J28450J6986j06283
13135C34916m4282K9382L8487n9522q2459m6284m0248N8049N7165R0989p1698
$$ plain form
13212 111814 4886 -25093 40986 -4108 107330 106396 177189 157889 132426 150227 265206
13201 265206 266816 154842 95726 86396 184646 286182 250121 339696 303887 220604 141958
13190 141958 85078 90543 213421 255416 290550 275906 216680 203271 200300 195667 242841 299794
13178 299794 163222 70376 57599 16005 -8941 61844 193749 213861 252932 127391 27278
13167 27278 85022 124462 288101 256412 369887 324361 277475 168170 152933 315666 376068
13156 376068 306788 286852 331317 349165 368970 359861 346922 450489 521712 329855 304586
13145 304586 322542 351392 477857 333537 204872 178510 295763 424213 441199 334916
13135 334916 290634 320016 358503 298981 216522 170238 129990 188039 245204 336193 264495
13124B64495M777M4093K6094m2610o8426m6535L3613m7144j7316j16104L3538
13113F8475J26036J48024J9543k7107N5048J9553m5973J3318j55717q7750N1492
13102A84942L800m1234K726J08624N1391l7172j19967p1575m9218K824O9031M0953
13090A45125J09637j4223P3520k4363q5805n017J20434J2474p7482o0J5810k5007
13078B45043O0311l6988m2328l4581L3630k9639l6828N6080n44J0708O3755j07551
13066A81068Q657P5812N9111r4757o6767M9728l2138M7852M3176n474L0879Q1100
13054C78247P488r4391n3548p6979o5296O152J68703p7687q0595J5177O6373O8750
13042B62394m0460O3076m0742l0476J03075J17903Q8969j48048n3626O5227q0579
$$ plain form
13124 264495 269272 313365 339459 296849 228423 181888 215501 168357 151041 34937 68475
13113 68475 194511 342535 362078 334971 390019 409572 363599 376917 221200 133450 184942
13102 184942 188742 147508 150234 258858 310249 273077 153110 81535 32317 35141 104172 145125
13090 145125 254762 240539 314059 289696 203891 198874 319308 331782 254300 254240 270050 245043
13078 245043 305354 268366 226038 191457 225087 195448 158620 214700 214156 224864 288619 181068
13066 181068 189725 265537 324648 229891 163124 212852 180714 228566 271742 266268 297147 378247
13054 378247 385735 291344 237796 160817 95521 101673 270376 192689 112094 127271 193644 262394
13042 262394 221934 285010 244268 213792 316867 434770 523739 375691 322065 387292 306713
13031C06713p6408Q9802m3146M2755J00343K6063N9889Q4397n5291r5339l0226
13020D09552q8767r2240Q6743J02240P4079J23284j1110m9457P1590J78534R1537
13009H95985M1840O3156M2904k9780p9078K048l5199k620J83364J51316J7941
12998A251877j15949p7185K4771o7626L7555R5939L7552J06080l9156r516N6289
12987A300631j8204p5758J8642K28405M0050l3203m0867l1674N8352R8318k0297
12976A524395m9573p0674k7164o9383k0590J936J7842J32195m1443k38914q7949
12965A070678N8699L0883j0556L8615M4149K124n6027k8640P1617k5683p5761
12954A120098l7046P0525M4720n6617J08663O7677J7685j06251p0389J2593P8723
$$ plain form
13031 306713 230305 320107 276961 319716 420059 446122 506011 590408 535117 439778 409552
13020 409552 320785 228545 315288 417528 491607 614891 603781 554324 625914 804448 895985
13009 895985 937825 1000981 1043885 1014105 935027 937075 901876 899256 1082620 1233936 1251877
12998 1251877 1135928 1058743 1083514 1015888 1053443 1149382 1186934 1293014 1253858 1244342 1300631
12987 1300631 1282427 1206669 1225311 1453716 1493766 1460563 1419696 1388022 1446374 1544692 1524395
12976 1524395 1474822 1404148 1376984 1307601 1287011 1288947 1306789 1438984 1397541 1158627 1070678
12965 1070678 1129377 1160260 1149704 1188319 1232468 1234592 1178565 1149925 1221542 1195859 1120098
12954 1120098 1083052 1153577 1198297 1141680 1250343 1318020 1335705 1229454 1159065 1171658 1250381
12943A250381N1160j22616j08202m7677j9006o941N3817J4301j13386K8393O451
12932I86675j36583m2098n0109K4k5177L8789O3151k0915o2634p7781L8164J09232
12920H20738q8453j2655J04924k9748m8161q0188N117p2021j48336n3078P334
12909D05473j16418L7139Q1333O1612j8195J9180J17980o3326r6758O8832K4941
12898E21793j03566r5594K8580R5522O4190m1405Q5206N1957l1407n3304j17077
12887D04895m203R3257J46705k7154o7002m3507M8764L9234J1249j45333o4570
12876C92335L2222j9912O0633n8476k7617P2750k8376Q9215L225j01834P3668
12865D87833r34L4207r3328J1369L1606j5560k5598M767P512Q8968J26261O2960
$$ plain form
12943 1250381 1301541 1178925 1070723 1023046 1004040 997099 1050916 1065217 951831 980224 986675
12932 986675 850092 807994 757885 757909 732732 771521 834672 813757 751123 673342 711506 820738
12920 820738 732285 719630 824554 794806 746645 666457 671574 599553 451217 398139 405473
12909 405473 289055 326194 407527 469139 450944 470124 588104 524778 428020 496852 521793
12898 521793 418227 322633 351213 446735 510925 469520 554726 606683 575276 521972 404895
12887 404895 400692 493949 640654 613500 546498 502991 551755 590989 602238 456905 392335
12876 392335 424557 404645 465278 406802 379185 451935 423559 512774 515999 414165 487833
12865 487833 486899 521106 427778 439147 470753 455193 429595 434362 441874 530842 657103 720063
12853G20063n8862o8849m6073r8468j3775l1143J7644O1380r2631M3294L9928
12842D72508j25768m8585J74233N5092L4048l3436p0044M1324L7444P3886k1303
12831E89399J5517k9738L380k6148m494R013K4316M433p7244P75O8558j5079q5394
12818D77294O81J46117L6243m9194R6858j472p2259P6230K7433p8678O8850O7345
12806G95448q6729p2384p654J16810J32533n5547p9165p5596Q731N5205p007l6870
12794F87775k3531l8324N8396m399l4857n2352Q9184N8597n1822J0949J0007m6203
12782F63420n1230K6856P2327M0924J01044o3366p2862j1916n8513k5972j0882
12771F09830J15667Q4975p1322p5281L090j01752P1779p951p8540R8211K1109
$$ plain form
12853 720063 661201 592352 546279 447811 434036 402893 420537 481917 389286 432580 472508
12842 472508 346740 298155 472388 527480 561528 528092 458048 499372 536816 610702 589399
12831 589399 604916 575178 578558 552410 547916 556929 581245 585678 508434 509209 577767 562688 477294
12818 477294 477975 624092 660335 611141 707999 706527 634268 710498 737931 659253 728103 795448
12806 795448 708719 636335 628681 745491 878024 822477 743312 667716 676447 731652 724645 687775
12794 687775 664244 625920 684316 679917 645060 592708 681892 740489 688667 699616 709623 663420
12782 663420 612190 639046 711373 752297 853341 789975 717113 705197 646684 620712 609830
12771 609830 725497 810472 739150 663869 666959 565207 636986 629035 550495 648706 669815
12760F69815N6246M0087k4095j13582J5595R256P0257K2578Q8000q0461n1394
12749G02302J9491M7637L4851J6225j04546O2710L8540K6738N6188O2147N639
12738I67922Q1442Q787j14041j72006p1670L9924q801O6703j5745q402Q3965n7846
12726H00232n8342j4866l0110K243n2194R8770o982R331L9085j8692J26571k2945
12714H72101r3387p3979R1463P6991o2126j42609l1228j065j0344J62031J28111
12703I15959J57850J606j07784l6938k9687J22194K3839J71857R2042O3139r2489
12692A281588r5853k5357m3255P6914L3128q3368R9220J37525J13119J81605J53172
12681A828438m5339k14247l2289J23308Q7295j1584P3052J35347M1183k1460K0756
$$ plain form
12760 669815 726061 766148 742053 628471 644066 653322 723579 746157 834157 753696 702302
12749 702302 721793 769430 804281 820506 715960 778670 817210 843948 900136 962283 967922
12738 967922 1049364 1058151 944110 772104 700434 740358 731557 798260 782515 774113 858078 800232
12726 800232 741890 727024 696914 699157 646963 745733 738751 748082 787167 768475 895046 872101
12714 872101 778714 704735 796198 873189 811063 668454 637226 636161 625817 787848 915959
12703 915959 1073809 1075415 967631 930693 901006 1023200 1047039 1218896 1310938 1374077 1281588
12692 1281588 1185735 1160378 1117123 1194037 1227165 1143797 1243017 1380542 1493661 1675266 1828438
12681 1828438 1783099 1568852 1536563 1659871 1747166 1735582 1808634 1943981 1985164 1963704 1984460
12670A984460P4086M9911o9376j21120l1875J24301O7511N7245Q1733J4305L3591
12659B264772P7121L9150n3222k2367j00489k3556J25994J55160J33441Q530l1917
12648B572617J4379R1856p4085J1973K8904L3664L1011M0974l8441M9261l2396
12637B729717o96N2234J16673J23291P2711n495K8937M5398q592L7351N8174P4251
12625C323954J32744J64726n9643K9665J84351K06913m1606m7201J48758Q1578
12615D124239J30925O593R8472R353P6306J44352J58219J01851J35890J61133
12605E147333m2103O7642J47268J80352K21971K74392K27352K33746J61977J79087
12595F799017K42019J54544K00716J83767L14834M30892L10915L69254L89293
$$ plain form
12670 1984460 2058546 2108457 2039081 1917961 1886086 2010387 2077898 2135143 2216876 2231181 2264772
12659 2264772 2341893 2381043 2327821 2305454 2204965 2181409 2307403 2462563 2596004 2604534 2572617
12648 2572617 2586996 2678852 2604767 2616740 2645644 2679308 2710319 2751293 2712852 2762113 2729717
12637 2729717 2729021 2781255 2897928 3021219 3093930 3088435 3117372 3162770 3154178 3191529 3249703 3323954
12625 3323954 3456698 3621424 3561781 3591446 3775797 3982710 3941104 3893903 4042661 4124239
12615 4124239 4255164 4261757 4360229 4369582 4445888 4590240 4748459 4850310 4986200 5147333
12605 5147333 5105230 5172872 5320140 5500492 5722463 5996855 6224207 6457953 6619930 6799017
12595 6799017 7041036 7195580 7396296 7580063 7894897 8325789 8636704 9005958 9395251
12586I395251N64390N61196N70329N45371Q17573R39811J034581R59841J042540
12577A6430883J154073J329010J602678K033843K241716K515349K724286L388436
12569C3420274M077748M831093N688068O946152Q456123J0035907J1620581J3024496
12561I8100442J3889742J3943938J3021716J0925777P944115M565899J149996
12554A63541625j876095m113167n384209n784810n554767n218159m265815k856677
12546A28487926j343904M2673J557714K830839M240618N328510O357722P337481
12538A54839579Q211642Q825376R393514R488065R323840R275720Q962546Q327417
12530B26647699P564330O405756M914650L064256R63557q61506k545296l514967
$$ plain form
12586 9395251 9959641 10520837 11091166 11636537 12454110 13393921 14428502 15388343 16430883
12577 16430883 17584956 18913966 20516644 22550487 24792203 27307552 30031838 33420274
12569 33420274 37498022 42329115 48017183 54963335 63419458 73455365 85075946 98100442
12561 98100442 111990184 125934122 138955838 149881615 157825730 162391629 163541625
12554 163541625 161665530 157552363 152168154 146383344 140828577 135610418 131344603 128487926
12546 128487926 127144022 127186695 128744409 131575248 135815866 141144376 147502098 154839579
12538 154839579 163051221 171876597 181270111 190758176 200082016 209357736 218320282 226647699
12530 226647699 234212029 240617785 245532435 248596691 249560248 248698742 246153446 242638479
12522B42638479m086485m273731m022357l929256l961116m157203m587843m956708
12514B08663780n337321n658533n915546n794024n713675n329588m581393l754917
12506A66578783k623068j397856N00796K615616M700575O793486Q625123R773279
12498A95566734J0001300Q864812O531118L124165j044727n371255q966800j1543369
12490A97161978j2980465j3644462j3723857j3083386j2004426j0920846r719417
12483A11085119q699233p748386o677260n745503n233414m726068m256414l816130
12475F4182711l523185l194484k955605k786869k553686k317555k273646k056710
12467D2520971j867328j633208j607504j510795j429946j295176j084042j124655
$$ plain form
12522 242638479 238551994 234278263 230255906 226326650 222365534 218208331 213620488 208663780
12514 208663780 203326459 197667926 191752380 185958356 180244681 174915093 170333700 166578783
12506 166578783 163955715 162557859 163058655 165674271 170374846 177168332 185793455 195566734
12498 195566734 205568034 214432846 220963964 224088129 223043402 217672147 208705347 197161978
12490 197161978 184181513 170537051 156813194 143729808 131725382 120804536 111085119
12483 111085119 102385886 94637500 87960240 82214737 76981323 72255255 67998841 64182711
12475 64182711 60659526 57465042 54509437 51722568 49168882 46851327 44577681 42520971
12467 42520971 40653643 39020435 37412931 35902136 34472190 33177014 32092972 30968317
12459C0968317j097476j025963j048288q97037p09979q35893q43429q25476p13857
12450B2970919p10475o79957p84601o03727m49041o72022o14478m55785m35182
12441A7565651n47675n51916m00147l88933k95314m09168n10742k71209k61295
12432A3929252l94776l50299m09291k26983k92658m34622l66221l14851k98248
12423A0841303k82617k95034k88780j66156j48763k40024k55743l57345k27665
12414H579176r3562o4666j60172j56851k61571j07120m1322k34008k19081k51547
12404F989276k2573j30193k45359j95657l5043k10067j84000K5123L8702k39477
12394E790732j81887j69545k19108n4973j06175k15948o6969R4334J3829j53320
$$ plain form
12459 30968317 29870841 28844878 27796590 26899553 26189574 25353681 24510252 23684776 22970919
12450 22970919 22260444 21580487 20795886 20192159 19743118 19071096 18456618 18000833 17565651
12441 17565651 17017976 16466060 16065913 15676980 15381666 14972498 14461756 14190547 13929252
12432 13929252 13534476 13184177 12774886 12547903 12255245 11820623 11454402 11139551 10841303
12423 10841303 10558686 10263652 9974872 9808716 9659953 9419929 9164186 8806841 8579176
12414 8579176 8485614 8420948 8260776 8103925 7842354 7735234 7693912 7459904 7240823 6989276
12404 6989276 6966703 6836510 6591151 6395494 6360451 6150384 5966384 5991507 6030209 5790732
12394 5790732 5608845 5439300 5220192 5165219 5059044 4843096 4776127 4870461 4884290 4730970
12384D730970j24565o9530q6243Q4548q2725j14530j8582j7028k2213K3897n8276
12373D245723J2735K927r3078q8080j12764k11325j71377j16178j67294p7839
12363C223450M3420j15789k8995K4176n2627j4158J04485o0409j77553j08755
12353B837245p2522m612M7691j11087j66966o9899n9762N9345M4751j34073q7291
12342B282820j33246N3982J5782q6687j18314n3364N1021L5477l3948K0840m4833
12331A989530p8639n5197k9700J7213O0260m4213j9355N7489L398j05028L7187
12320A832945q62j17508k8070K3715Q0563j99640o6442K453J9466r658o1581p5251
12308A400130n4275q3145k5049J05133N3544M4226k7013p1919p5985M9557M761
$$ plain form
12384 4730970 4606405 4536875 4450632 4535180 4452455 4337925 4319343 4302315 4280102 4303999 4245723
12373 4245723 4258458 4261385 4168307 4080227 3967463 3756138 3584761 3468583 3301289 3223450
12363 3223450 3266870 3151081 3122086 3146262 3093635 3079477 3183962 3123553 2946000 2837245
12353 2837245 2764723 2760111 2807802 2696715 2529749 2459850 2400088 2459433 2504184 2370111 2282820
12342 2282820 2149574 2203556 2219338 2132651 2014337 1960973 2011994 2047471 2013523 2034363 1989530
12331 1989530 1910891 1855694 1825994 1843207 1903467 1859254 1839899 1897388 1900786 1795758 1832945
12320 1832945 1832083 1714575 1686505 1710220 1790783 1591143 1524701 1527154 1546620 1536962 1475381 1400130
12308 1400130 1345855 1262710 1237661 1342794 1396338 1440564 1413551 1341632 1265647 1315204 1319965
12297A319965j11772q2317L198Q3553m8397N3461m3809K659R1452L0601p3959
12286A224635M464j21389j60453n1475k3695q9700N9697J42087L0050m2664J4309
12275I85866O0375n5371m1509J1558P4598l0818l8900J9127J1627p8622j14094
12264H03837q5899O2865M7990p4595J1521J94993J06805j01209m2601l9953J14834
12253I98588J4342k840r7497J9682K280n5596r6768j7447K0364J54894J42929
12242A082931L0685K3912j74869j13839r296J10682N8055p4563j46897o7379n0774
12231F68648l5394J73862J40262l4461p6515k2093m0313R9133m423m0000j1841
12220H16865M2866l6289j3866o4776K00353K14711p4375k75917J99061J51923
$$ plain form
12297 1319965 1208193 1125876 1129074 1212627 1164230 1217691 1173882 1176541 1267993 1298594 1224635
12286 1224635 1229099 1107710 947257 895782 872087 782387 842084 984171 1014221 971557 985866
12275 985866 1046241 990870 949361 960919 1035517 1004699 965799 984926 996553 917931 803837
12264 803837 717938 780803 828793 754198 765719 960712 1067517 966308 923707 883754 998588
12253 998588 1012930 1010090 912593 932275 934555 878959 782191 764744 785108 940002 1082931
12242 1082931 1113616 1137528 962659 848820 839524 950206 1008261 933698 786801 719422 668648
12231 668648 633254 807116 947378 912917 836402 814309 773996 873129 868706 828706 816865
12220 816865 859731 823442 809576 744800 945153 1159864 1085489 809572 1008633 1160556
12210A160556M7400q3061l6033J17157N72m7050J93635P1605J49508q9625l4227
12199A450437O6554m8168r6418k4204O5973R01P4180O3515o5476O7495j7808l9825
12187A497156k8649P841K437k1557q9439K0710J86693Q3688r720L7735Q9472p2327
12175A704040k3455K1507Q5290J0212J793J03943N1412j16369M9644n7675j30785
12164A699557K7904O6267Q4367M0175P0685n6899k094k6554l2881k32166p0095
12153A568266m485p3256j39028n3648r4460N2483J14428j8723j4534j22566j14103
12142A100374P0988K40711J52332l6187m0857j3136J31648L33j42017j18727j20201
12131A225261n4296J12587p5743j0425J8348J0471k9935j16739M5844O7698j42323
$$ plain form
12210 1160556 1207956 1124895 1088862 1206019 1206591 1159541 1353176 1424781 1574289 1484664 1450437
12199 1450437 1516991 1468823 1372405 1348201 1414174 1415075 1489255 1552770 1487294 1554789 1536981 1497156
12187 1497156 1468507 1476348 1478785 1457228 1367789 1388499 1575192 1658880 1649160 1686895 1776367 1704040
12175 1704040 1680585 1702092 1787382 1797594 1799387 1903330 1954742 1838373 1888017 1830342 1699557
12164 1699557 1727461 1793728 1878095 1918270 1988955 1932056 1929962 1903408 1870527 1638361 1568266
12153 1568266 1563781 1490525 1351497 1297849 1203389 1255872 1370300 1351577 1337043 1214477 1100374
12142 1100374 1171362 1412073 1564405 1528218 1487361 1474225 1605873 1606206 1464189 1345462 1225261
12131 1225261 1170965 1283552 1207809 1197384 1215732 1226203 1196268 1079529 1125373 1193071 1050748
12120A050748j62198p2087K9298j8432K3463j4221j44R314J54582o6955l6933
12109H96435K6870l4903j2231o573K587M2733J8885Q6157J9499K16759K14229
12098A470447J24817j9286j09519m8833N2141J1232r4242K8831N4092m1644R1995
12087A520031N8854n6381M7316R7621R557q4309o4467P8607J02364J25527l0627
12076A804093P6310J99800l1458m7824M9140m2144M320R7623j5939j04179l8209
12065A951533n6725K7565L0624P0132K4945J18096M9430m7056j15431j51386N2787
12054A954514j1463M9279J2027l5480J19973J25769n0119K7365J28470M8937j2237
12043B357035M9125n3550O2506N1319p41M7337J0587k3337k1706K6972q7308j09037
$$ plain form
12120 1050748 888550 816463 845761 827329 850792 836571 836427 845741 1000323 933368 896435
12109 896435 923305 888402 876171 869598 872185 914918 933803 1019960 1039459 1256218 1470447
12098 1470447 1595264 1575978 1466459 1417626 1469767 1480999 1386757 1415588 1469680 1428036 1520031
12087 1520031 1578885 1522504 1569820 1667441 1676998 1592689 1528222 1606829 1709193 1834720 1804093
12076 1804093 1880403 2080203 2048745 2000921 2050061 2007917 2012237 2109860 2093921 1989742 1951533
12065 1951533 1894808 1922373 1952997 2023129 2048074 2166170 2215600 2168544 2053113 1901727 1954514
12054 1954514 1943051 1992330 2004357 1968877 2088850 2214619 2164500 2191865 2320335 2369272 2357035
12043 2357035 2406160 2352610 2415116 2466435 2465694 2513031 2523618 2500281 2478575 2505547 2418239 2309202
12031B309202j84036o6601l7232j10208M397O609O1241l5426k4053R222Q7026
12020B020141M2938Q8376m0705j07975j98103K0238N5391n9282k6487k8671r9575
12009A666286k2081N3843R24n6823m5999R4556J90151q044K8232J03585o792o7307
11997A930531r3J36107J17674N2837j31499q6300r082k9498J576P4829M076J00768
11985B161926L8282K8506P7445l1120p5182J4520J19869J24780K2543J22587L7700
11974B641856m7836q4847K2083M1905n6804o8746R4992P1385M2148l8337p1897
11963B545902J09568J97203K59863J94568J65580L7841J25598K2241J03122J03001
11953C864487J22565J50692J66939J66356J85391J56159J59842K24096J37114
$$ plain form
12031 2309202 2125166 2058565 2021333 1911125 1915522 1922131 1983372 1947946 1923893 1933115 2020141
12020 2020141 2063079 2151455 2110750 2002775 1804672 1824910 1880301 1821019 1794532 1765861 1666286
12009 1666286 1644205 1698048 1698972 1642149 1596150 1690706 1880857 1872813 1901045 2004630 1997838 1930531
11997 1930531 1930438 2066545 2184219 2237056 2105557 2019257 2010175 1980677 1982253 2057082 2061158 2161926
11985 2161926 2200208 2228714 2306159 2275039 2199857 2214377 2334246 2459026 2481569 2604156 2641856
11974 2641856 2594020 2509173 2531256 2573161 2516357 2447611 2542603 2613988 2656136 2617799 2545902
11963 2545902 2655470 2852673 3112536 3307104 3472684 3510525 3636123 3658364 3761486 3864487
11953 3864487 3987052 4137744 4304683 4471039 4656430 4812589 4972431 5196527 5333641
11944E333641J69572K41617L70693L62566L83257L61443M05520N85690O78661
11935H892660Q73782Q45219R32236J174542J315006J561886J796028K301984K494868
11926B2188211L022369L792284M615456N980241P957107J0696141J4907624K1832210
11918I4991643L3185296N0620612P0934156P6607567N5241915L0053877J3238572
11911D24873638r891875l9704416n4518700m9764827l9650115l3093648k9303278
11904A68946779k5094125k0461696j6362657j3070620j0408411q276034o625486
11897F8647750n510601m722810m170160l675925l115181k844039k571721k225602
11889C9811711j895609j889472j763678j561350j469736j383328j283412j236527
$$ plain form
11944 5333641 5503213 5744830 6115523 6478089 6861346 7222789 7628309 8213999 8892660
11935 8892660 9766442 10611661 11543897 12718439 14033445 15595331 17391359 19693343 22188211
11926 22188211 25210580 29002864 33618320 39598561 47555668 58251809 73159433 94991643
11918 94991643 128176939 178797551 249731707 326339274 381581189 411635066 424873638
11911 424873638 414981763 375277347 320758647 270993820 231343705 198250057 168946779
11904 168946779 143852654 123390958 107028301 93957681 83549270 75273236 68647750
11897 68647750 63137149 58414339 54244179 50568254 47453073 44609034 42037313 39811711
11889 39811711 37916102 36026630 34262952 32701602 31231866 29848538 28565126 27328599
11881B7328599j064234j106364p81192p24157o42009n39895o15316o22705o27966
11872B0604761o43640o24762o60044n76151n30176m74025m98666n49044m14464
11863A5633789m52740l32907j94075k59785k67007l66120l12820j92447j81429
11854A3074459q8827j75744o5147j80533j98001k05959j56602p8084L2177l1475
11844A1926264N963J5651Q920L8136o8149k6674j82063k20163j85292j01958k31905
11833A0978730k40472j06618j39864r6375q2444j9683L0461P7113L4930p358J07543
11822A0535963Q1674J66168K37335J80305O1141J08886K10794L33987K19103J33204
11812A2268560K87716L29863K52343K87135L15719L78570M45461K60386L36610
$$ plain form
11881 27328599 26264365 25158001 24376809 23652652 23010643 22470748 21855432 21232727 20604761
11872 20604761 19961121 19336359 18676315 18100164 17569988 17095963 16597297 16048253 15633789
11863 15633789 15181049 14848142 14654067 14394282 14127275 13761155 13448335 13255888 13074459
11854 13074459 12985632 12809888 12744741 12564208 12366207 12160248 12003646 11925562 11957739 11926264
11844 11926264 11932227 11947878 11956798 11994934 11926785 11900111 11718048 11497885 11312593 11210635 10978730
11833 10978730 10738258 10631640 10491776 10395401 10312957 10293274 10323735 10400848 10435778 10428420 10535963
11822 10535963 10617637 10783805 11021140 11201445 11262586 11371472 11582266 11916253 12135356 12268560
11812 12268560 12556276 12886139 13138482 13425617 13741336 14119906 14565367 14825753 15162363
11803A5162363N82102N63101N40960O97184Q54246Q88421R72175J043364J166125
11794B2470041J499808J548607K062412K332614K807956L297445L668545M322803
11786D4010231N187292O070182P211693Q568380R972854J1748808J3407884J4899660
11778A21076984J5543662J5110150J3729678J1269110P857287M044654K40088
11771A88871613k980750n421931o713733p237176o938110o103347m905529l325859
11763A45245178j632293p240J352896K531009L332100M185896M692003M848517
11755A64548066N233808N609131N629330N617966N695594N953186O496512P098226
11747B11881819P606984P739540P626768O966748N308515L375840J319940n50333
$$ plain form
11803 15162363 15744465 16307566 16848526 17545710 18399956 19288377 20260552 21303916 22470041
11794 22470041 23969849 25518456 27580868 29913482 32721438 36018883 39687428 44010231
11786 44010231 49197523 55267705 62479398 71047778 81020632 92769440 106177324 121076984
11778 121076984 136620646 151730796 165460474 176729584 184586871 188631525 188871613
11771 188871613 185890863 180468932 173755199 166518023 159579913 153476566 148571037 145245178
11763 145245178 143612885 143605645 144958541 147489550 150821650 155007546 159699549 164548066
11755 164548066 169781874 175391005 181020335 186638301 192333895 198287081 204783593 211881819
11747 211881819 219488803 227228343 234855111 241821859 247130374 250506214 251826154 251275821
11739B51275821k462099l899518n078032n976240o437571o954377p336333p571391
11731B05560260p570911p572050p388677p180823o817064o234345n379209m660231
11723A52756950l399839j947314m28461J057638K918268M601874O026127P132673
11715A68717916P372680O857566N260392K760065j73818l438872o365977q671746
11707A72318206j0295067j1040414j1156271j0774079j0305697r462831q564268
11700A00719579p701289o724084o028207n428933m834132m360444l815389l481191
11692E8345910l184921k886155k643929k332478k177759k041289j789177j671162
11684C9619040j615106j622941j340625j335780j260005j161434j174927r59317
$$ plain form
11739 251275821 248813722 244914204 239836172 233859932 227422361 220467984 213131651 205560260
11731 205560260 197989349 190417299 183028622 175847799 169030735 162796390 157417181 152756950
11723 152756950 149357111 147409797 146981336 148038974 150957242 155559116 161585243 168717916
11715 168717916 176090596 182948162 188208554 190968619 190794801 187355929 180989952 172318206
11707 172318206 162023139 150982725 139826454 129052375 118746678 109283847 100719579
11700 100719579 93018290 86294206 80265999 74837066 70002934 65642490 61827101 58345910
11692 58345910 55160989 52274834 49630905 47298427 45120668 43079379 41290202 39619040
11684 39619040 38003934 36380993 35040368 33704588 32444583 31283149 30108222 29148905
11676B9148905r47695r02560r48448p84167q18257q77414p69160o39353q39464
11667B1622387p26571n73210n86874n94044n51858l80878m30415n09461o79079
11658A6589997n75025m26542l00315m74107m19574l89801l54255l61867l16141
11649A2972370k85388l68889k95097k08412j98285k94458k96971l27030k48613
11640A0449227k57786l08261k46082j65649k15909j82094k55583k26356k74888
11631H316619j70765k60059j43231r5321j7056k15633j52971j66065k20523k42597
11621F632398j95421j57668j54697r1059j37135L2065r2301j75668k49768p5368
11611E335378j68510j17035p1947j06305k2958j51902J5465l45k04343k27139
$$ plain form
11676 29148905 28201210 27298650 26350202 25566035 24747778 23870364 23101204 22461851 21622387
11667 21622387 20895816 20322606 19735732 19141688 18589830 18208952 17778537 17269076 16589997
11658 16589997 16014972 15588430 15288115 14814008 14394434 14004633 13650378 13288511 12972370
11649 12972370 12686982 12318093 12022996 11814584 11616299 11321841 11024870 10697840 10449227
11640 10449227 10191441 9883180 9637098 9471449 9255540 9073446 8817863 8591507 8316619
11631 8316619 8145854 7885795 7742564 7647243 7630187 7414554 7261583 7095518 6874995 6632398
11621 6632398 6436977 6279309 6124612 6033553 5896418 5928483 5836182 5660514 5410746 5335378
11611 5335378 5166868 5049833 4977886 4871581 4848623 4696721 4712186 4711841 4507498 4280359
11601D280359j30171o1022J8098L7124j0530k0564k68402j12334L8728M5924O5344
11590C882554n2059p2782j19766j2517j87994p7689o6555r3924p7727j0160q1803
11579C029578r4589o5454j77441p7598K4448p5237j33375k9144Q26n7253o5972
11568B278789o9798j22482p1507J4985J10401r7794j22542M7356L3297o4582k6913
11557A909210J07904m9759q9199k4759j2419n0626J972j40374n394Q2844O1082
11546A790482r3877r1996L5243M4298M5755j45598o3492K2800P554r4284o3895
11535A392990n922N796k4962J2361j34590j05708j5644R8152Q6441j553o3031
11524A244330l3051o2372n8968l0430J75261Q1874j39515k9013M3756j9712q3350
$$ plain form
11601 4280359 4150188 4089166 4107264 4144388 4133858 4113294 3844892 3732558 3771286 3817210 3882554
11590 3882554 3830495 3757713 3637947 3625430 3437436 3359747 3293192 3199268 3121541 3111381 3029578
11579 3029578 2934989 2869535 2692094 2614496 2638944 2563707 2430332 2401188 2402014 2344761 2278789
11568 2278789 2208991 2086509 2015002 2029987 2140388 2042594 1920052 1967408 2000705 1936123 1909210
11557 1909210 2017114 1967355 1878156 1853397 1840978 1790352 1792324 1651950 1646556 1729400 1790482
11546 1790482 1696605 1604609 1639852 1684150 1729905 1584307 1520815 1543615 1551169 1456885 1392990
11535 1392990 1387068 1392864 1367902 1380263 1245673 1139965 1124321 1222473 1308914 1307361 1244330
11524 1244330 1211279 1148907 1089939 1059509 1234770 1316644 1177129 1148116 1191872 1172160 1088810
11513A088810j68549J578J26513k3814q2756O1800q1152k4045J9764K9840P5149
11502A023138Q3103l2627j09637j2115J3915j04250K2582J34893k7060j30656
11492H61286K7258Q815j04357o4115K2j19574m6942J4672M8947K442m3066L661
11480E89049J4330N2268J68779Q5846m5761k10396j63495L1031J41788j08502
11470E54937p7120R7779m203r699L4592M1355m6439j9481L411o4036j42423N2421
11458D21094J59414M8491N2697J4696q437q5140k0892q4248j31067j00786k3153
11447B42669K5955K8646R8982Q7726O84l1682j25729o1488P8961J03734q0018
11436C68440j22049n7852o521J10648J4677j22288J22176K41866j23014p8728
$$ plain form
11513 1088810 920261 921839 1048352 1024538 941782 1003582 922430 898385 918149 947989 1023138
11502 1023138 1106241 1073614 963977 951862 965777 861527 884109 1019002 991942 861286
11492 861286 888544 897359 793002 728887 728909 609335 562393 577065 626012 628454 585388 589049
11480 589049 603379 655647 824426 910272 864511 654115 490620 521651 663439 554937
11470 554937 477817 575596 571393 561694 596286 637641 591202 571721 575132 511096 368673 421094
11458 421094 580508 628999 681696 696392 687955 602815 581923 497675 366608 265822 242669
11447 242669 268624 297270 396252 483978 484662 452980 327251 265763 344724 448458 368440
11436 368440 246391 188539 182018 292666 307343 185055 307231 549097 426083 347355
11426C47355O4429j9379j32365q6380K9810L155k9236l6027L4670P5596J10204
11415C61832r0359j65141j5390j7400J03695O1171k282k6086k3885J8725K8560
11404B33440L5114m3493r4882N7575M1632r3493l2688J27582N2431K3536p5551
11393B31203l737Q8867J5692J314M3116j52653o4065J71461J19753M0797l1038
11382D60710N8144l9703j76574r9425j05155J6682L6345j8816N8289k2872Q9992
11371B57617k2452j02765M0202L2486M60o783J06314K8474q114m033R642J09904
11359D40952J8865l4788r8387K6794R1179L0875P8952M1027j23382K2821J1684
11348E06592J25989K6475M2283M3436N3448R6051K4819L1268J21462J54906J5876
$$ plain form
11426 347355 411784 392405 260040 173660 203470 206625 177389 141362 176032 251628 361832
11415 361832 271473 106332 90942 73542 177237 238408 236126 210040 186155 204880 233440
11404 233440 268554 225061 130179 187754 229386 135893 103205 230787 283218 306754 231203
11393 231203 227466 316333 332025 333339 376455 223802 159737 331198 450951 491748 460710
11382 460710 518854 479151 302577 203152 97997 114679 151024 132208 190497 167625 257617
11371 257617 235165 132400 172602 205088 205548 198765 305079 333553 325439 321406 331048 440952
11359 440952 459817 425029 326642 353436 444615 475490 554442 595469 472087 494908 506592
11348 506592 632581 659056 701339 744775 798223 894274 919093 950361 1071823 1226729 1242605
11337A242605j04709o8020j3139J36208o30k64146r9560N8294J52502o0909j44606
11326H33890j1852J14339J13164L6172l7016j11430J05564Q6397P3885j8198J1275
11315A196190j70842j2146J37450K8263Q7057Q4890J8127j2458N7477L1990p3629
11304A372369j3901o2976p9232J49557k6515k4793q4937j8700j03191p7546M8638
11293A078773l8459l2355k942J7910l2989M5434m9695p5981L078l2004J3935j6538
11281H78167o8901L5840N309j9730P1786J6843q6511j7795m3206n5670l064j00963
11269F12105q6392L2315K678O8443o6307j03784J9440k9690m5906k4960k5169
11258C52773q4066j34423l0347K05815L9249k2343j06927n5957J11335L5886q6156
$$ plain form
11337 1242605 1137896 1069876 1056737 1192945 1192315 928169 828609 886903 1039405 978496 833890
11326 833890 822038 936377 1049541 1085713 1048697 937267 1042831 1129228 1203113 1184915 1196190
11315 1196190 1025348 1013202 1150652 1178915 1265972 1350862 1368989 1356531 1414008 1445998 1372369
11304 1372369 1358468 1295492 1216260 1365817 1339302 1314509 1229572 1210872 1107681 1030135 1078773
11293 1078773 1040314 1007959 1005017 1022927 989938 1035372 985677 909696 912774 880770 894705 878167
11281 878167 809266 845106 850415 830685 902471 919314 832803 815008 771802 716132 713068 612105
11269 612105 525713 558028 560706 629149 562842 459058 478498 448808 402902 377942 352773
11258 352773 268707 134284 103937 309752 349001 326658 219731 163774 275109 310995 224839
11247B24839Q7323L4184j08259p0671k01k6295l3281O2640L3301o0406o6551k10449
11235a33826j2132J42053J41508P9528q384j61795M0387O4114K5340K4242m1079
11224A59956q9612k8537J323o9964N2875J05359N5961J6981j07742K7071J3754
11213A37425M2988l1027n3562Q7978J3127m1873p0209J15146M5173M0992Q3133
11202C69291j8339l9312k7796J23943J64619P3529N8004o1927l5896j04703O3804
11191E65217m2341j7665j62428j39828O8199Q2123q6450p7203l3984p0013n4198
11180C1429m8085L3337m9407J06555K4652k0621n1945l3532q0275O7811J16331
11169I6250M7637K8730l7142O791j01630j63210L503J777M4279N2698M3919R5821
$$ plain form
11247 224839 312162 346346 238087 167416 167215 140920 107639 170279 203580 143174 76623 -133826
11235 -133826 -145958 -3905 137603 217131 208747 46952 87339 151453 176793 201035 159956
11224 159956 70344 41807 43130 -26834 26041 131400 187361 204342 96600 123671 137425
11213 137425 180413 149386 95824 183802 196929 155056 84847 199993 245166 286158 369291
11202 369291 350952 311640 283844 407787 572406 645935 703939 642012 606116 501413 565217
11191 565217 522876 505211 342783 202955 271154 353277 266827 189624 155640 85627 31429
11180 31429 -16656 16681 -32726 73829 98481 77860 25915 -7617 -87892 -20081 96250
11169 96250 143887 172617 135475 142266 40636 -122574 -119071 -117294 -73015 -20317 23602 119423
11157A19423J22873n8522l6580l9640j9451n5062J410p7148n0035l9206N1432
11146h0506K3645K913M6061R275L1120q6936K6932J31259n7003O8400m7538n580
11134F2042R7130J5455k1089r2489o4010J17724P8125n6110M0775O0078q2810
11123A54821J3973k3316O1606J2377l1188j18061r5500J20625j2993l5132n9987
11112a2775m9848J0692J44136Q9558M7290R8081q3814r4334j06952j35093m5290
11101a38349J07647M6043J14093j4854K3677j02110n8893P5465J38786k6355J6191
11090A81341p1690l851j3193m475L2716L2481j5939o7329j21565o6046n7962M8629
11078a26883J80707M4259L7279m6594j5035m5066k3667L8909N4113L8611O8242
$$ plain form
11157 119423 242296 183774 147194 107554 88103 33041 34451 -42697 -92732 -131938 -80506
11146 -80506 -56861 -53948 -7887 1388 32508 -54428 -27496 103763 46760 115160 67622 62042
11134 62042 159172 174627 153538 61049 -2961 114763 192888 136778 177553 237631 154821
11123 154821 168794 145478 207084 219461 188273 70212 -25288 95337 82344 47212 -12775
11112 -12775 -62623 -51931 92205 181763 229053 327134 243320 148986 42034 -93059 -138349
11101 -138349 -30702 15341 129434 114580 138257 36147 -22746 52719 191505 165150 181341
11090 181341 109651 105800 92607 88132 120848 153329 137390 70061 -51504 -117550 -175512 -126883
11078 -126883 53824 98083 135362 88768 73733 28667 5000 43909 98022 136633 204875
11067B04875j23992j00577m7320j4788O9759M1077o0658m7969M3067J17427Q6533
11056A67434K7580M2678O4914k2161L2446j1165Q670J7111L0913q3948j05098
11045A69374n9862n3690L6205J36669M2038K0516k5846N7701J07712Q457J6513
11034D55787M8601m305K1041L0658k1838Q6876N1699l8414k3283M9741j2935j1380
11022F32248n7046k5064Q3441Q9541K2959J09032N6826q8410m3740n9387O384
11011G26784J07956M487q0400o5975O702o7612L1585O9751P5219Q790K1700k9447
10999H09540o9223r1973j01653o3570n4724Q8318R5769j96650k33495O0089Q9722
10988C32150P5243q6280j02160o4542N4819M1235N8582P305m3933k5843K6866
$$ plain form
11067 204875 80883 -19694 -67014 -81802 -12043 29034 -31624 -79593 -36526 80901 167434
11056 167434 195014 237692 302606 280445 312891 301726 310396 327507 358420 274472 169374
11045 169374 109512 55822 92027 228696 270734 291250 265404 323105 430817 439274 455787
11034 455787 504388 500083 521124 551782 529944 616820 668519 630105 606822 656563 643628 632248
11022 632248 575202 550138 633579 723120 746079 855111 911937 823527 779787 720400 726784
11011 726784 834740 839227 758827 692852 699554 631942 663527 733278 808497 817287 838987 809540
10999 809540 740317 648344 546691 483121 428397 516715 612484 415834 182339 242428 332150
10988 332150 407393 321113 218953 154411 209230 250465 309047 316352 272419 246576 273442
10977B73442M2975L4174l7556j40461r3499k8503R4137R200r8480p4157K4429
10966E701J5916Q7522L2305j7816o0806p9672q5586j9059J27810M4133J8298j1682
10954E7064J9804l8170l8768k3959q1377J96452O6300R6440O5228J35228j2920
10943D41322M3014p1322j51663n9497j15299m0440J0516q7742l615J48221N3015
10932A66510M4145r0848L1142M143O9818k426j08916J6153o0905q5588J37758
10921A20986Q0233k0992J072l8520M8774r9564J859k7262j62106L2352K03462
10910A40294N1235o4847J8269N0331p1379r4200L1582L2743K1350j13837O5345
10899F6886l1204O2977M4085o2163r6097l7289k9431r1778L9083K07515J01270
$$ plain form
10977 273442 316417 350591 313035 172574 79075 50572 144709 153909 55429 -18728 5701
10966 5701 21617 109139 141444 123628 62822 -16850 -102436 -121495 6315 50448 68746 57064
10954 57064 76868 38698 -70 -24029 -105406 91046 157346 253786 319014 454242 441322
10943 441322 484336 413014 261351 201854 86555 46115 56631 -31111 -34726 113495 166510
10932 166510 210655 119807 150949 155092 224910 222484 113568 129721 68816 -16772 120986
10921 120986 201219 180227 181299 142779 191553 91989 93848 66586 -95520 -63168 140294
10910 140294 191529 126682 144951 195282 123903 29703 61285 94028 115378 1541 66886
10899 66886 35682 98659 142744 80581 -15516 -52805 -82236 -174014 -134931 72584 173854
10888A73854J6359j4835m5579K4698j02248j6795J9823J8376k8057n8235Q4181
10877G1542r7433j06004j08684k3095Q2678J89887j5538q2955R5922M7269N2104
10866A05693J50694l4561q4158j7294K0190j1351l0220m4280p0274K4768N1518
10855F0725k6936l4618j9798j8522J12845O6350o5832j64623K1498J61543J44292
10844B36924k8977j1629j5091N2491l0710J251j15476j7608J61656K4595o3886
10833A93540j7169j4420m6351L7789O9035l4670j03396K0402j5970p0799P3331
10822I1322K3365R9968J02733M9802l9161q3369q6714J1151j4545n7374m2814
10811E4364J6416p7983l0901R9823R5445m3040j39065q2817M5777O0558J50436
$$ plain form
10888 173854 190213 175378 129799 154497 52249 35454 55277 73653 45596 -12639 71542
10877 71542 -25891 -131895 -240579 -263674 -180996 8891 -6647 -89602 6320 53589 105693
10866 105693 256387 221826 137668 120374 140564 129213 98993 54713 -15561 9207 60725
10855 60725 33789 -829 -20627 -39149 73696 140046 74214 -90409 -68911 92632 236924
10844 236924 207947 196318 181227 233718 203008 204259 88783 71175 232831 257426 193540
10833 193540 176371 161951 115600 153389 222424 187754 84358 104760 88790 17991 91322
10822 91322 114687 214655 317388 367190 328029 244660 157946 169097 154552 97178 54364
10811 54364 70780 -7203 -38104 61719 157164 114124 -24941 -107758 -61981 -1423 149013
10800A49013l087j22386k8234Q4965R0701O4655p8115l0139R5823N5977j31130
10789A48043p9142j5019o852p8360j3408O0302N1692n1377o0660j7545P9090j25795
10777a09031K1407J59845J8910n2236J2098J17807J27085j07451o1787O622J3981
10766A47250o9633o9692K1471O9522N6607p4179R1876M9856M5567J3012q7059
10755A94598n9984o2152N4817P7733k3191M839j71107J3556J30594m2501n6695
10744F0507L5611J49196N1959M2354J22117J45702o6571k21618o6605P9735M3038
10733C75425o1982k6581N7918O6991k4946l9872j4417n2589R312R9762m7133R333
10721C51221J52750N2924p3931k3095J9699L014P3470R9040r4399j6073K506L79
$$ plain form
10800 149013 145926 23540 -4694 80271 170972 235627 157512 127373 223196 279173 148043
10789 148043 68901 53882 47030 -31330 -44738 15564 67256 15879 -44781 -62326 16764 -109031
10777 -109031 -87624 72221 91131 38895 50993 168800 295885 188434 126647 133269 147250
10766 147250 77617 7925 29396 98918 155525 81346 173222 223078 268645 281657 194598
10755 194598 134614 72462 127279 205012 181821 186660 15553 29109 159703 117202 60507
10744 60507 96118 245314 297273 339627 461744 607446 540875 319257 252652 332387 375425
10733 375425 313443 286862 344780 411771 386825 346953 332536 279947 289259 389021 341888 351221
10721 351221 503971 556895 482964 459869 479568 482582 556052 655092 560693 544620 547126 547505
10709E47505R5173q130m6511k9010j11897j3530J04706N1909J1352k4365N112
10698E82314K5660R307j0734O3968K9010Q8636J78710J9586j16545j46153q6680
10687F37079J433N9716J8641L5546J29955J89391o5837O239l3776r2989J3430
10676H98828L1200n3301k4075K7718n378L929M1283N930j0862q5658Q7643q882
10664I08375M6488n6799O543J03886K3434k8706l8609R1032P7629m222m2877q350
10652A077824O0984L9354k14R3775L4928J1056J05735J1439l3913R0520O9488
10641A560976J27321K4691l673M7179j7267O1803J66205Q2054J83306K47358J74564
10630B654517R2963J09670K44567J42400K80503M00413L49448M33979M57861M84852
$$ plain form
10709 547505 642678 634548 588037 559027 447130 433600 538306 590215 601567 577202 582314
10698 582314 607974 617281 606547 670515 699525 788161 966871 986457 869912 723759 637079
10687 637079 638512 698228 716869 752415 882370 1071761 1005924 1012163 978387 885398 898828
10676 898828 930028 876727 852652 880370 874992 878921 920204 926134 915272 829614 917257 908375
10664 908375 954863 898064 904607 1008493 1031927 1003221 964612 1055644 1133273 1129051 1086174 1077824
10652 1077824 1138808 1178162 1177948 1271723 1306651 1317707 1423442 1434881 1400968 1491488 1560976
10641 1560976 1688297 1712988 1709315 1756494 1739227 1801030 1967235 2049289 2232595 2479953 2654517
10630 2654517 2747480 2857150 3101717 3244117 3524620 3925033 4274481 4708460 5166321 5651173
10620E651173O39077Q82337J047357J294688J608322K053186K881278L835494
10612A9892912M710975N414878N552876N110715M282672L190412K077169J226321
10604E1458930J284591K030456L477906N583694P880959R544964R691667Q110021
10596I9063188N738224L268843N57087j412965j744181l93468K088707N379617
10588A12545052Q660476J0739278J0422344P578795L844948j82214m221201p324703
10580A42062775q056211o726848m210927j524095J085820K683379K450987Q21981
10572A28586861j449975l858276o507894q188367q329608p012379n472923m025693
10564H3741746k670911j718998j576842k220255l085070m013666m868222n503393
$$ plain form
10620 5651173 6290250 7172587 8219944 9514632 11122954 13176140 16057418 19892912
10612 19892912 24603887 30018765 35571641 40682356 44965028 48155440 50232609 51458930
10604 51458930 52743521 54773977 58251883 63835577 71716536 81261500 90953167 99063188
10596 99063188 104801412 108070255 108627342 107214377 105470196 105076728 107165435 112545052
10588 112545052 121205528 131944806 142367150 149945945 153790893 153608679 149387478 142062775
10580 142062775 134006564 127279716 123068789 121544694 122630514 125313893 127764880 128586861
10572 128586861 127136886 123278610 116770716 108582349 100252741 93240362 87767439 83741746
10564 83741746 81070835 79351837 77774995 75554740 72469670 68456004 63587782 58084389
10556E8084389n458611n193780m712495m046058l299519k908165k570033k153347
10548B7742381j805415j611908j471820j384799j163583j168485q82714q23495
10540A7430162q03171o73166n55163o15778o33761n50065n56548m43413m25771
10531A2173326l68899m07269l59841l32403k61142k89347m43037k77030k61329
10522I173029k66944l11571k20113j61465l10642j98691r6253j81678p7328j88453
10512G159891k87414k84469j92952q3427r7946k67600k21967q6665q6889k17898
10502E332664j97597l8950r7966k49763p9159j2687r2412k91068j19462j69744
10492C983856k01669l7626q0227j51539j79042l7723J6184k07250j37088j24627
$$ plain form
10556 58084389 52625778 47431998 42719503 38673445 35373926 32465761 29895728 27742381
10548 27742381 25936966 24325058 22853238 21468439 20304856 19136371 18253657 17430162
10540 17430162 16626991 15953825 15398662 14782884 14149123 13599058 13042510 12599097 12173326
10531 12173326 11804427 11397158 11037317 10704914 10443772 10154425 9711388 9434358 9173029
10522 9173029 8906085 8594514 8374401 8212936 7902294 7703603 7607350 7425672 7348344 7159891
10512 7159891 6872477 6588008 6395056 6311629 6213683 5946083 5724116 5637451 5550562 5332664
10502 5332664 5135067 5096117 4998151 4748388 4669229 4656542 4564130 4273062 4153600 3983856
10492 3983856 3782187 3744561 3664334 3512795 3333753 3296030 3312214 3104964 2967876 2843249
10482B843249L1008K3802q6242J0601j21207j20900J30604n0341k42141j79322
10472B239111j74105j70209J4519M7846q1391j06855m2096l5011m9518j03407
10462A538884J47997j7884j27334k2609l964K886N2875m5732q0379j5627P9242
10451A508355j9284M106J0377j00006j25962j5422m0539n2812l7227n0976K0230
10440A100840O8586n0928N3415P9642m823m0118L8270Q47m6247j66885p9716j12659
10428H40224o527n7280R3191n4984q2327R842m2713K4087o4899j60020j2303K7306
10416E13597j33767M7787Q6392l6919l9816m125m1641O420J8761k4362R2675K2980
10404E07982q4347j19417l3691j6151j8087J13019R6967k2262N0898o3951j382
$$ plain form
10482 2843249 2874257 2898059 2811817 2822418 2701211 2580311 2710915 2660574 2418433 2239111
10472 2239111 2065006 1894797 1909316 1957162 1875771 1768916 1726820 1691809 1642291 1538884
10462 1538884 1686881 1668997 1541663 1519054 1515090 1517976 1570851 1525119 1444740 1429113 1508355
10451 1508355 1489071 1493177 1503554 1403548 1277586 1262164 1221625 1168813 1131586 1080610 1100840
10440 1100840 1169426 1118498 1171913 1251555 1246732 1206614 1244884 1245731 1199484 1032599 952883 840224
10428 840224 833697 776417 869608 814624 732297 742139 699426 723513 658614 498594 486291 513597
10416 513597 379830 427617 514009 477090 437274 433149 391508 397928 416689 392327 485002 507982
10404 507982 423635 304218 270527 254376 236289 349308 446275 424013 474911 410960 409578
10393D09578L3484L689L9047k9157j33336J05122L3075l8496j22010K180K042
10382C05218M2780j8796j5126P7917J7947k1292r5417L0833r1212K1303k3762
10371B30393j14937p372k3119R6038R7141J1966p3363J464J35493j8320k2478
10360C12906J1590j13015k534L1092j01638j4924j8913J01646P4998k3071K7281
10349B85418q9235j31245n7106j8619J9730J9263P9651P9689r2122j52424R1383
10338C4383K0241N0493O0754K9509J9266N2688P2618j632p6064j2332K5855j13072
10326A62707n3882k0514l5105q6170l9579K00571R279k0005o3261J6732K4770
10315I5543p3179Q4855Q4867j29558L262MP6071k1363M3874K1665J2839l5115
$$ plain form
10393 409578 443062 446751 485798 456641 323305 428427 461502 423006 300996 303176 305218
10382 305218 347998 329202 314076 391993 409940 388648 293231 324064 232852 254155 230393
10371 230393 115456 108084 84965 181003 278144 290110 216747 218211 353704 335384 312906
10360 312906 324496 211481 208947 240039 138401 123477 104564 206210 281208 258137 285418
10349 285418 196183 64938 7832 -10787 8943 28206 107857 187546 95424 -57000 34383
10338 34383 54624 105117 165871 195380 214646 267334 339952 338320 262256 249924 275779 162707
10326 162707 108825 88311 53206 -32964 -72543 128028 137307 117302 54041 70773 95543
10315 95543 22364 107219 192086 62528 65790 65794 141865 120502 164376 186041 198880 163765
10303A63765r9772m037j0600l1328L0733j9351N4636k3476j00333k6334P8695
10292A2598J55602k3258p1880M5837r464j1929J3167j1389j22455l779M5144M5245
10280F3439L3520N4198P9235O6733j97211j11182J87835j00178L603Q0640m1402
10269A19230O7317j06421o3316o1410j3728Q3044P1202j9219P1858k0314o7939
10258F0304J3435J0510m8906N0326L552M2944N8332n7602J1378q3702r9131M1278
10246B718m5167r5587k3587N3625J45566Q8014K4406J05784l5077j14530j03364
10235B801o0535k543o6463m5760N2936J29986j8362J4987j0765O8230j9812j31170
10223h6470J70583J01574m7302j27391m5431m506Q283m8720N1038n596o5340r4734
$$ plain form
10303 163765 63993 59956 49356 18028 48761 29410 84046 60570 -39763 -66097 12598
10292 12598 168200 144942 73062 118899 109435 97506 110673 99284 -23171 -26950 18194 63439
10280 63439 96959 151157 230392 297125 99914 -11268 176567 76389 79992 160632 119230
10269 119230 186547 80126 16810 -44600 -58328 24716 95918 76699 148557 128243 60304
10258 60304 73739 84249 35343 85669 89221 132165 190497 132895 144273 60571 -38560 2718
10246 2718 -42449 -138036 -161623 -107998 37568 125582 149988 255772 220695 106165 2801
10235 2801 -57734 -60277 -126740 -172500 -119564 10422 -7940 7047 -3718 64512 44700 -86470
10223 -86470 84113 185687 138385 10994 -34437 -38943 -30660 -79380 -28342 -33938 -99278 -194012
10211a94012J17849J01410l803j05924r9576o1745J44486J15119n8029n9768N3043
10200e0950N5924m1250l1229k0925j7357q0041l7658J42517P0296p7501n4323
10189a42497K0108L6250J33713M1660p6893L5288M5543M6164j36765j51812k4514
10178a73755J6429J80667Q2739M8228k1342r092J00946N0564m8551r9903L23L7177
10166A64430L3343Q5500l6408J43927m6067J49419J01828m2801n5983j3120N4723
10155E38791j212J1811M3742N4519N7861J699m3686K5286O8326N8940L5565m7486
10143H04156M9260m0530j12381l6004p9170l6752J03349R4881j01059n4339P1340
10132F62751k3222j18369l7421k3735N9152k5586o9727l6687j07650m1281j8209
$$ plain form
10211 -194012 -76163 25247 21444 -84480 -184056 -245801 -101315 13804 -44225 -103993 -50950
10200 -50950 4974 -36276 -67505 -88430 -105787 -185828 -223486 -80969 -10673 -88174 -142497
10189 -142497 -122389 -86139 47574 89234 12341 47629 93172 139336 2571 -149241 -173755
10178 -173755 -157326 23341 106080 154308 132966 123874 224820 275384 226833 126930 127253 164430
10166 164430 197773 283273 246865 390792 344725 494144 595972 553171 497188 484068 538791
10155 538791 537579 549390 593132 647651 705512 707211 663525 688811 757137 816077 851642 804156
10143 804156 853416 812886 700505 664501 585331 548579 651928 746809 645750 591411 662751
10132 662751 639529 521160 483739 460004 519156 493570 423843 387156 279506 238225 220016
10121B20016J6749l6547j48970p0252O6599O9094M820m7701R3412j5133k21690
10110f9603k5186L7195J0985m6396l6721N922K2893P817O8585P3571n6613j54857
10098a62408R0252O7189p8457p5869L9672P6041M6911P9515N9336p9771m4430
10087A7981n7639L7235P9093J05693k5529p97j8595m5311j30414k973L0418k7809
10075c8647o8990j15552P4046J22891J09007P9053l5402j42891q7143m7663q9972
10064b41263o9529J01972M9100j07795L9833P9432J06245l2244p6901O3435p0502
10053a58217k3992n0155O0978K5965K3684N8154J788N2681j47031J3046J20318
10042b2781P0568L5544J8665n4262j67908q7641J11371l0638j66408P8383J67862
$$ plain form
10121 220016 236765 200218 51248 -19004 47595 116689 121509 73808 167220 152087 -69603
10110 -69603 -94789 -57594 -46609 -93005 -129726 -123804 -100911 -93094 -24509 49062 -7551 -162408
10098 -162408 -72156 -4967 -83424 -159293 -119621 -43580 3331 82846 142182 62411 17981
10087 17981 -39658 -2423 76670 182363 156834 156037 137442 92131 -38283 -41256 -10838 -38647
10075 -38647 -107637 -223189 -149143 -26252 82755 161808 126406 -16485 -103628 -151291 -241263
10064 -241263 -310792 -208820 -159720 -267515 -227682 -148250 -42005 -74249 -151150 -87715 -158217
10053 -158217 -182209 -232364 -171386 -145421 -121737 -63583 -61795 -9114 -156145 -143099 -22781
10042 -22781 47787 83331 101996 47734 -120174 -207815 -96444 -127082 -293490 -215107 -47245
10031d7245m542l8312N2057J34687J5380j58447O0674M4356o7909o2086Q8412
10020A7025l2490j27023n9727R0910J6392J11114O5635o2805n1640k21N9456k144
10008B4482J02568O5174j44147j76386n9929j7473m2589R2671O4622o380M5976
9997e1411J41347j6189n5047n0893Q8166J41975p4334j35878l8746J51954n6994
9986D3950j74297p1764R538Q9352Q6053L312n8314M8505J8232m7584M6600J3267
9974F850o8686n5064j5327L5675R3478n9353m597J393j862N4804K6911P6209J0934
9961A01365m2615n3738o1373j26927J5070J20452l988J03225K5680o6212p8130
9950f7191J5929L0328p0311N7292L2349j2330m3657l4736M2144p6443R625L8813
$$ plain form
10031 -47245 -51787 -90099 -38042 96645 112025 -46422 14252 58608 -9301 -71387 17025
10020 17025 -15465 -142488 -202215 -111305 -94913 16201 81836 19031 -32609 -32830 26626 24482
10008 24482 127050 192224 48077 -128309 -188238 -205711 -248300 -155629 -91007 -97387 -51411
9997 -51411 89936 73747 18700 -32193 55973 197948 123614 -12264 -51010 100944 43950
9986 43950 -130347 -202111 -192573 -103221 -17168 -13856 -72170 -23665 -5433 -53017 -6417 6850
9974 6850 -61836 -116900 -132227 -96552 -3074 -62427 -67024 -65631 -67493 -12689 14222 90431 101365
9961 101365 58750 5012 -56361 -183288 -168218 -47766 -51754 51471 77151 10939 -67191
9950 -67191 -51262 -20934 -91245 -33953 -1604 -13934 -57591 -92327 -50183 -126626 -117001 -78188
9938g8188r7429J28894J20691O165o8767p8548L8945m1898k3031J72149O4485
9927A43468k0079j2464p0804n1783J28365j9586o4268o8157P160M7719o4342n2241
9915i7012N1423K7710O6019N2217P5662P5180O6679O086j01169p7720m1969j16702
9903a3596P2319m1394L7179o9362o6420j5847n1366Q3138J37857m9591o9410o9502
9891a15995n5376L236N5349K4546r963n7142j9556m0693L5374R7042R9753j13345
9879i6770q4523O9884j9912n4703n0326n8110M8155O6187R2368k0052Q7107j6417
9867c7112r3350j77102N6861J20841J42136J25113m4749q1610K6930N9333q7757
9856I534o4409O4937q2028R697P7282N4632l2428p4053j5261J6167M0510J04768
$$ plain form
9938 -78188 -175617 -46723 73968 80133 11366 -67182 -28237 -70135 -93166 78983 143468
9927 143468 123389 110925 40121 -11662 116703 97117 32849 -35308 -28148 19571 -44771 -97012
9915 -97012 -45589 -17879 48140 100357 176019 251199 317878 323964 222795 145075 103106 -13596
9903 -13596 58723 17329 54508 -14854 -81274 -97121 -148487 -65349 72508 22917 -46493 -115995
9891 -115995 -171371 -168135 -112786 -88240 -98203 -155345 -174901 -215594 -180220 -83178 16575 -96770
9879 -96770 -181293 -111409 -131321 -186024 -236350 -294460 -246305 -180118 -87750 -107802 -20695 -37112
9867 -37112 -130462 -307564 -250703 -129862 12274 137387 92638 11028 37958 97291 9534
9856 9534 -54875 10062 -71966 -62269 15013 69645 37217 -36836 -52097 -35930 4580 109348
9844A09348K7565r1112j4701O9452m8196j9139l0365q5541R564p3542R3902O6552
9832A3787k7972n1185M1620J8492M8504k3766o7367r63m7135l63Q2135J9256l3019
9819b7976P4503j0841r6310q1414K2954J0447l3107O3330J07346N6069j5436K6129
9807I5694o2625K0140L0639K6499o279J5382o238J7990q2226j02904j679k6495
9795h2102J4506K3121M0205M2506J16223L0853j07022l385j17030j18714k473
9784a63312k2181l4900K1624L6169K2790J1735J20288P3713o9106n6629L3831
9773b5978j6177k233q8246L7502R8198Q6364J48051J3956j79777m4730L6253n4644
9761H539p8184k11296k9683J06072J07774r4878M0299K03493J22446m1601m8797
$$ plain form
9844 109348 136913 45801 31100 100552 52356 33217 2852 -82689 -73125 -146667 -52765 13787
9832 13787 -14185 -65370 -23750 -5258 43246 19480 -47887 -48850 -95985 -96348 -14213 5043 -27976
9819 -27976 46527 35686 -60624 -142038 -119084 -108637 -141744 -78414 28932 85001 69565 95694
9807 95694 33069 53209 83848 110347 104068 119450 113212 131202 48976 -53928 -55607 -82102
9795 -82102 -67596 -44475 -4270 38236 154459 185312 78290 74905 -42125 -160839 -163312
9784 -163312 -185493 -220393 -198769 -162600 -139810 -128075 -7787 65926 -3180 -59809 -25978
9773 -25978 -42155 -44388 -132634 -95132 3066 89430 237481 251437 71660 26930 63183 8539
9761 8539 -69645 -280941 -310624 -204552 -96778 -191656 -151357 52136 174582 132981 84184
9750H4184j00209n0586L8672n4339j1454J7583l0158N3136J09875m8522j17308
9739a09126l6444K322m2753K1698j8609Q7885L22896k4412k20266n8550J5178
9728f0181M5059Q816J5634M1003k9425j53p1863q8812m6228J0399Q1105J8105
9716g6541K5248P4654Q8023O5058K0608j17535j75653p8781J04375O6973o4690
9705f8261j9746k2679o2665J21019J82315q3497j58221p0973J8952k2512o330
9694a92598N6231N4439n093J4158p899O5523m4058j6828l96k214q8663q3101O3104
9681a87395J72242q8599j0920L8066M123p543R7252m5614j23176L5216o4596n5170
9669b36114P4497Q9361K5315p028K3001J11869M1459J3253m8595l9556Q1494N2
$$ plain form
9750 84184 -16025 -66611 -27939 -82278 -93732 -76149 -106307 -53171 56704 8182 -109126
9739 -109126 -145570 -143248 -186001 -164303 -182912 -95027 227869 203457 -16809 -75359 -60181
9728 -60181 -15122 -6306 9328 50331 20906 20753 -51110 -139922 -186150 -175751 -94646 -76541
9716 -76541 -51293 23361 111384 176442 197050 79515 -96138 -174919 -70544 -3571 -68261
9705 -68261 -88007 -110686 -173351 -52332 129983 46486 -111735 -182708 -163756 -186268 -192598
9694 -192598 -136367 -81928 -87021 -72863 -80762 -15239 -59297 -76125 -76521 -78735 -167398 -250499 -187395
9681 -187395 -15153 -103752 -114672 -76606 -72483 -80026 17226 -28388 -151564 -116348 -180944 -236114
9669 -236114 -161617 -72256 -46941 -53969 -30968 80901 122360 135613 87018 47462 128956 129008
9657A29008o0083J366r443j07481R1501l4310q1446O7595R1458J34233p368o2704
9645A52326J32107n566j07805j01014q0758r9015M7390J37950P9472k7561j13789
9634A3737k5877o0205N9575P4360P5678J3702k1009j68637q1681j03592n1997
9623b75946Q5666M9233Q9169P5289j1629J2548p0525q6221l0481k1539N8877J8766
9611a06793M1631L7269l1884n216R8001J03010l5576j23204p4891n7490P6045
9600g9098L9760m8753J128M4111Q8565j08416N8948m5675R4071O5879o7739j15540
9588g2759o3514R4382M4651p7747J5934Q1364L4606n2689k0834m4065n6340J21566
9576D555J6320j23019Q707k0013K4936L7506p7343J5501O6719J18875o0121o6566
$$ plain form
9657 129008 68925 70291 60848 -46633 44868 10558 -70888 -3293 88165 222398 215030 152326
9645 152326 284433 278867 171062 70048 -10710 -109725 -62335 75615 155087 127526 13737
9634 13737 -12140 -72345 -12770 61590 137268 150970 129961 -38676 -120357 -223949 -275946
9623 -275946 -190280 -141047 -51878 23411 11782 24330 -46195 -132416 -162897 -184436 -125559 -106793
9611 -106793 -65162 -27893 -59777 -64993 33008 136018 100442 -22762 -97653 -155143 -79098
9600 -79098 -39338 -88091 -86963 -42852 45713 -62703 -3755 -49430 44641 110520 42781 -72759
9588 -72759 -136273 -41891 2760 -74987 -59053 22311 56917 4228 -16606 -60671 -117011 4555
9576 4555 20875 -102144 -93437 -113450 -88514 -51008 -128351 -112850 -46131 72744 12623 -53943
9564e3943k6003P3241J1213L2305r4981p3180J93698O5561q7732o2260K5944j8616
9552a4753l4996K2510L1716k0623Q7781J1929o9378k9812K4587R6439L1250Q1016
9540B17666j3081j34093j63727k83448M3620L9585Q1722j0197M8895m9726J02167
9529a20617N5143m0132J6518P9349O3755j17540N902J81165L7599j07890m1382
9518A1870m8546J2200q7482o3177L6248k0215m1773L3687K1170J3138k5328l931
9506a62139n1L8533M0931J16549o085j41058j74151L4836J07747j7372l9574M6096
9494a55738n0572N2769J08585J11970O0910j08858j23094r2981Q4648n8578l9096
9483b10035O648m0456J39758J29361J1254o1996J7180J1330p4939K5707M8677
$$ plain form
9564 -53943 -79946 -6705 4508 36813 -58168 -131348 62350 127911 40179 -22081 3863 -14753
9552 -14753 -49749 -27239 4477 -16146 71635 83564 14186 -15626 8961 105400 136650 217666
9540 217666 204585 70492 -93235 -376683 -333063 -293478 -211756 -221953 -173058 -222784 -120617
9529 -120617 -65474 -105606 -89088 -9739 54016 -63524 -57622 123543 161142 53252 11870
9518 11870 -36676 -24476 -111958 -175135 -138887 -159102 -200875 -167188 -146018 -132880 -158208 -162139
9506 -162139 -162190 -123657 -82726 33823 27738 -113320 -287471 -252635 -144888 -162260 -201834 -155738
9494 -155738 -206310 -153541 -44956 67014 127924 19066 -104028 -197009 -112361 -170939 -210035
9483 -210035 -203387 -243843 -104085 25276 36530 -25466 -8286 3044 -71895 -46188 2489
9472B489J10007q7281M5450P5522L5166j15173K2419O7879l6454j13314k10109
9461b03399O8394J52318m791O381l2125N2728N9331L3376o7386j73981p9408L130
9449a85432j3059j263J26721M9207m3420J6329M923P412M2356O7975j38568J4124
9437e2695L9862R303P758L182O3073l8727N9172K7470n112o540j70668m5008j5808
9424a24738P748O6134k5231r818J5494N6611l5754O9713m0732j13960O3390Q4310
9412A3167j45493m1208M961J1192J2708n7392P8218L4171J0719M0178J07015k118
9400F6118j2921O1596L0451j7900O947j8029j23158o1857R0778N4059m1659K0616
9388E5041O6696K190j32285j70012L1815J17982L6904o4662O1019p1441j43977
$$ plain form
9472 2489 112496 25215 70665 146187 181353 66180 88599 156478 120024 6710 -203399
9461 -203399 -135005 17313 12522 18903 -13222 39506 98837 132213 64827 -109154 -188562 -185432
9449 -185432 -198491 -199754 -73033 -23826 -67246 -50917 -45994 -38582 3774 71749 -66819 -52695
9437 -52695 -12833 -3530 4228 7410 70483 31756 90928 118398 113286 106746 -63922 -108930 -124738
9424 -124738 -116990 -50856 -76087 -85905 -70411 -13800 -49554 20159 -20573 -134533 -71143 13167
9412 13167 -132326 -173534 -168573 -157381 -144673 -202065 -123847 -89676 -78957 -38779 68236 66118
9400 66118 53197 114793 145244 127344 134291 116262 -6896 -68753 22025 76084 34425 55041
9388 55041 121737 123927 -8358 -178370 -146555 -28573 8331 -56331 4688 -66753 -210730
9377b10730o0512O0025J42554Q556k5144O2557L0836R76M728l6882K3615N5520
9365E6099J0336r3532j87687N3185J36323k6492j38058r9580J07872M6961J7984
9354a16589J23196O8798J8313k6308o9698l1773p030l9015o1684j0141J26829
9343b5102J09207j05819j51655J14142J72297j27907n933j3540p6647P7694p154
9332d0417m0131O695j3752l1167M6045n1901q8955O733N124l0701Q614L3394L2223
9319a58196r3515m5700P6564J10409j8362k5439o6540P882j1596O920m2959j1647
9307b72179R4846P5903o0440j4082O7167J16691M1609m6017j1491q5787q3658
9296a77438Q4985l2581o9434k0628Q8384O3793j92939K808J01000J35947O95m6744
$$ plain form
9377 -210730 -271242 -211217 -68663 -60107 -85251 -22694 8142 9118 13846 -23036 579 56099
9365 56099 66435 -27097 -214784 -161599 -25276 -51768 -189826 -289406 -181534 -134573 -116589
9354 -116589 6607 75405 93718 67410 -2288 -34061 -41091 -80106 -141790 -151931 -25102
9343 -25102 84105 -21714 -173369 -59227 113070 -14837 -20770 -34310 -110957 -33263 -40417
9332 -40417 -80548 -73853 -87605 -118772 -72727 -124628 -213583 -206850 -201726 -232427 -223813 -190419 -158196
9319 -158196 -251711 -297411 -220847 -110438 -128800 -154239 -220779 -212897 -224493 -217573 -260532 -272179
9307 -272179 -177333 -101430 -161870 -175952 -108785 7906 49515 3498 -7993 -93780 -177438
9296 -177438 -92453 -125034 -194468 -215096 -126712 -62919 -255858 -253050 -152050 -16103 -15408 -62152
9284f2152m371N8953J8647j4652M7906k4224m5438o879K9233j6711O3768P3500
9272A17580l3276k8365J1615o4382k3696O2178m3983r7041N3736N0352P5831Q8814
9260A69363j35157j51238M2723j9708j9833p1617R7738P3735J0829L8810J75923
9249B11568p4754j96768o8014J12404j3985j04418M9159l4375l1757J18582Q1420
9238D9062K698K865j40424o1937N2588r9531M3399P8459N229q9774K7597k8050
9226a57819J01232J568j05604j3844J11874J9518N3286Q821J16412J4627q3512
9215F6559j43185Q920R3807p9204l0630P4436m1008K7512J43216o372j33188m4745
9203f3882O254l3803j7481l604K818j4688L3480J60161J45379r9581j97755m3926
$$ plain form
9284 -62152 -66523 -7570 11077 -3575 44331 20107 -25331 -32210 -2977 -19688 44080 117580
9272 117580 84304 55939 67554 3172 -20524 41654 -2329 -99370 -45634 4718 80549 169363
9260 169363 34206 -117032 -74309 -94017 -113850 -185467 -87729 -13994 -3165 35645 211568
9249 211568 136814 -59954 -127968 -15564 -29549 -133967 -84808 -119183 -150940 -32358 49062
9238 49062 51760 54625 -85799 -147736 -95148 -194679 -151280 -72821 -67592 -157366 -129769 -157819
9226 -157819 -56587 -55019 -160623 -174467 -62593 -43075 10211 19032 135444 150071 66559
9215 66559 -76626 -67706 26101 -53103 -83733 -9297 -50305 -22793 120423 114051 -19137 -63882
9203 -63882 -57628 -91431 -108912 -112516 -109698 -124386 -90906 69255 214634 115053 -82702 -126628
9191a26628j57954l5656R2989Q8321Q368k3846o913l1975K5427j0797Q0387Q6954
9179a1323J6561j78790N4900J66125L1475R826k0693m1070k5945N2852j7267l1947
9167D704o1357p2413P3443q5357l7180n5001K930K8702L6767J6553P8130R6370
9155B6291o2631j19458P3204N3899j2587n2409q8663L349N9721n2215O108L5255
9143a30136R6664p8783j4248Q9728o4612o412k1074J18203J40728r1957n8447
9132b0346R0344K18704N1209n5874l4395q8259l8132o6951r9851j9472O1959L372
9120B308M1834o9539P294J58402P1708p5037j3543j12302j4627L880J41102Q7660
9108B29140k2612j74055L7865K9506j26530p9638N9317Q7876P2508l8390l3798
$$ plain form
9191 -126628 -284582 -320238 -227249 -138928 -130560 -154406 -161319 -193294 -167867 -178664 -98277 -11323
9179 -11323 5238 -173552 -118652 47473 78948 88774 68081 27011 1066 53918 36651 4704
9167 4704 -56653 -129066 -55623 -140980 -178160 -233161 -230231 -201529 -164762 -148209 -70079 26291
9155 26291 -36340 -155798 -82594 -28695 -41282 -93691 -182354 -179005 -119284 -171499 -165391 -130136
9143 -130136 -33472 -112255 -126503 -36775 -101387 -107799 -128873 -10670 130058 38101 -20346
9132 -20346 69998 288702 339911 284037 249642 161383 123251 56300 -43551 -63023 -1064 2308
9120 2308 44142 -25397 -18103 140299 212007 136970 123427 11125 -3502 378 141480 229140
9108 229140 206528 32473 70338 99844 -26686 -106324 -47007 40869 113377 74987 41189
9097D1189n8237Q6518K5039o6056j5593Q3711n0414n821R216J1330J4190J2704
9085H7776l1777P6544j381j35597r6791p3507J5296L6115l8287l8206l8096m6494
9073b84405J9333O4603P0468O6360K5438l0162l5101O9797J14564P1793j92710
9062d0022M1330R7460K9847M0293n9217n4889L2020L6926r4414q6874k02737j339
9050b61616j7042J28916J06268K8251M6961K0145p1547j34113r4082K9802K2885
9039a95172k6602n737O5960J48458L102k29957K4367J5873R2186J5206O0872P8051
9027D6607M0476q1990o0578k2460m1411J32930l9671k3939n8317o3862m9146J62865
9015e8496J37544p9006j59670m2007P3913O5736Q3119K6620N0097n1490Q040O0667
$$ plain form
9097 41189 -17048 69470 94509 28453 12860 96571 46157 40336 49552 60882 75072 87776
9085 87776 55999 132543 131162 -4435 -101226 -174733 -159437 -123322 -161609 -199815 -237911 -284405
9073 -284405 -265072 -200469 -130001 -63641 -38203 -68365 -103466 -33669 80895 152688 -40022
9062 -40022 1308 98768 128615 168908 109691 54802 86822 123748 29334 -57540 -260277 -261616
9050 -261616 -278658 -149742 -43474 -15223 31738 51883 -19664 -153777 -247859 -218057 -195172
9039 -195172 -221774 -227511 -161551 -13093 -9991 -239948 -215581 -199708 -107522 -92316 -31444 46607
9027 46607 87083 5093 -55485 -77945 -119356 13574 -26097 -50036 -108353 -172215 -221361 -58496
9015 -58496 79048 42 -159628 -201635 -127722 -61986 21133 47753 97850 46360 54400 115067
9003A15067J25778K4561j10936j5418m443r6140R5335l2515r5687O0098K2387
8992H8087K6786o0929p4760j7025p9955j34226J9732O0666J78104N3580k8422
8981C1638r7993o3511O4739L2258N1278J56172L1660n2163l9426J1498L6087k5553
8969A36684m1047j14938j06564Q9108R5450k4613p9796q9467k1274J8742J8386
8958a19329M815O1226l8170k0191k7205K2715O3468J427l0833k7236j9191N6480
8946g2024l0314j04207J6407N1468j9751j5441q7074j6020M5956o4996Q8818J06338
8934a00840Q870M9394n1760q4337M7883j6702n666J6883J14490P9173j8072n0041
8922a0725o1368k043K9008q9806n9926K372J80545N4450n3754j15330j3432R2225
$$ plain form
9003 115067 240845 265406 154470 139052 134609 38469 133804 101289 5602 65700 88087
8992 88087 114873 53944 -20816 -37841 -117796 -252022 -232290 -171624 6480 60060 31638
8981 31638 -66355 -129866 -65127 -32869 18409 174581 206241 154078 114652 126150 162237 136684
8969 136684 95637 -19301 -125865 -36757 58693 34080 -45716 -135183 -156457 -137715 -119329
8958 -119329 -114514 -53288 -91458 -111649 -138854 -116139 -52671 -51244 -82077 -109313 -128504 -72024
8946 -72024 -102338 -206545 -190138 -138670 -158421 -173862 -260936 -276956 -231000 -295996 -207178 -100840
8934 -100840 -91970 -42576 -94336 -178673 -130790 -147492 -153158 -136275 -21785 57388 39316 -10725
8922 -10725 -72093 -74136 -45128 -134934 -194860 -192488 -11943 42507 -11247 -126577 -140009 -47784
8910d7784K03791N4170m5116j14715J2518N6774j2175Q720J8231L0476j39328
8899B5562j51602p4471M6542p771n8607k3616k3352M2242J87989J43328L5718
8888A41962m0386j03558m9928p0717M112J48000M041j32141m0065k6220J1580
8877a53320J3596l3358L4853J33948N2229R5265J0133k8092r6118j29502J0936
8866h9430J16487m5583j45346q1851j1240Q8460Q0693o2769m9741p054P8187O1857
8854f7330R3102L1738k5350j73903L9842J78925J7467o4157P5813j7333k8272
8843F0542n1713k1952J6690N6866M3221P2204O3133m9579j74480r3197P4727K15419
8831B11881J08505k3334j52366j17787m0343j2961o1080P7484J5981l3570N508
$$ plain form
8910 -47784 156007 210177 165061 50346 62864 119638 107463 116183 134414 164890 25562
8899 25562 -126040 -200511 -153969 -161740 -220347 -243963 -267315 -225073 -37084 106244 141962
8888 141962 101576 -1982 -51910 -122627 -118515 29485 33526 -98615 -138680 -164900 -153320
8877 -153320 -139724 -173082 -138229 -4281 47948 143213 153346 125254 29136 -100366 -89430
8866 -89430 27057 -18526 -163872 -245723 -256963 -168503 -87810 -150579 -200320 -207374 -129187 -67330
8854 -67330 25772 57510 32160 -141743 -101901 77024 94491 30334 106147 88814 60542
8843 60542 8829 -13123 3567 60433 103654 175858 238991 189412 14932 -78265 -3538 211881
8831 211881 320386 297052 144686 26899 -13444 -26405 -87485 -10001 5980 -27590 -22082
8820b2082j10451r585K5492O30j0700j3940L3837r8763Q0286O4295n2519J46237
8808C2737o22l0849k9392N7301j01250K6332Q6194j8189l6283o0840Q2315o179
8796A275l2195l7066o418O4746J50338O9827l8571j1189j376j34413j41471o2126
8784a78639m3478J09928M5823O806J35021J05852r3338k2473n5663q9047j7447
8773i6655o8075j763R8705P6949N7095M693j03079J05875K5784j02025q231R4456
8761H3729o5970O1192p3012k8551M5877J418L5112Q0886M0053n3684m6132N5485
8749A36403O0944J6735j06785p8836m2280K7694m1604o6319J33504L9821m8544
8738C0733J8668M0108J736J8805M1052j03132k0717O4451r7719M7865K5435m2033
$$ plain form
8820 -22082 -132533 -142118 -116626 -115996 -126696 -140636 -106799 -205562 -125276 -60981 -113500 32737
8808 32737 32115 1266 -28126 29175 -72075 -45743 40451 22262 -14021 -74861 7454 1275
8796 1275 -30920 -67986 -74404 -9658 140680 210507 171936 160747 159371 24958 -116513 -178639
8784 -178639 -222117 -112189 -66366 -59560 75461 181313 87975 65502 9839 -79208 -96655
8773 -96655 -164730 -166493 -67788 9161 66256 70949 -32130 73745 99529 -2496 -10727 83729
8761 83729 17759 78951 5939 -22612 23265 24683 59795 140681 180734 127050 80918 136403
8749 136403 197347 214082 107297 28461 -13819 13875 -27729 -94048 39456 79277 30733
8738 30733 49401 89509 91245 110050 151102 47970 27253 91704 -6015 41850 67285 25252
8726B5252O7547k8440j83973M2808R2052m6242j565L8308J2455j18121k3454l2079
8714a55452O8096P7529k5565L587R2877o9928M059M1385p2337m4968J6425n6829
8702a21121J19805J49177O3586m1024K3854j57792n7091o326j7816J33639P4733
8691A63624m3584p6163k113O9965q2277K3213R5924Q1726n9494m3515l7894L5113
8679A24525N690j37981j00533j0121M2115J16973p9614n6873P1979L6766R6014
8668A08940n7226J0499J9026k6887O2903o486N7933P1101j39739q5852L929n7935
8656c9794P2479O0957K3390q3163j68524L9299Q4455N549q767p4878K1494K23377
8644A55874N5266j35138m8402O4059o1063o1963M7317n7426k7385K1628k5326
$$ plain form
8726 25252 92799 64359 -119614 -76806 15246 -30996 -32561 5747 18202 -99919 -123373 -155452
8714 -155452 -87356 -9827 -35392 -31805 61072 -8856 -4797 36588 -35749 -80717 -64292 -121121
8702 -121121 -1316 147861 211447 170423 194277 36485 -20606 -26932 -44748 88891 163624
8691 163624 120040 43877 41764 111729 29452 52665 148589 230315 170821 127306 89412 124525
8679 124525 130215 -7766 -108299 -118420 -76305 40668 -38946 -95819 -23840 12926 108940
8668 108940 51714 62213 81239 54352 117255 110769 168702 239803 100064 14212 18141 -39794
8656 -39794 32685 93642 117032 33869 -134655 -95356 -10901 -5352 -14119 -88997 -67503 155874
8644 155874 211140 76002 27600 91659 30596 -31367 15950 -41476 -68861 -47233 -72559
8633g2559n3568L1974K8781q280J8114m8350l3158k2065P8049o5526L652j1731
8621a54667L1609J39925O4407k8773p2034R9708J73008J6301j15449j60136r303
8610a5404j5318k2946q0205r903J0643N7333K7096j98276m6143j5950R4955J64927
8598d9191J60975N4330r4689k2062p6443M2358J25562k5101k2837r9158n9387
8587f5643q4677L5733Q6190N1867j243l5136r0028j8566n9515Q8634R3754N7724
8575E9094J54044m657k5199l3031N8772j6936p0620J6960o1293j1051n8281R3017
8563A00819N5956L9405r7206N6881M0284o8005j76111m3084J28493K7653M1888
8552A06973R0290O8399j33401o7668j7331k9132n9830J3565p0621n2521j6443
$$ plain form
8633 -72559 -126127 -94153 -65372 -73652 -55538 -103888 -137046 -159111 -81062 -146588 -142936 -154667
8621 -154667 -123058 16867 81274 52501 -19533 80175 253183 269484 154035 -6101 -15404
8610 -15404 -30722 -53668 -133873 -143776 -133133 -75800 -48704 -246980 -293123 -309073 -214118 -49191
8598 -49191 111784 166114 71425 49363 -27080 15278 140840 115739 92902 -6256 -65643
8587 -65643 -150320 -114587 -28397 23470 22227 -12909 -102937 -121503 -181018 -92384 1370 59094
8575 59094 213138 208481 183282 150251 209023 192087 121467 138427 77134 66083 7802 100819
8563 100819 156775 196180 98974 155855 196139 128134 -47977 -91061 37432 65085 106973
8552 106973 197263 265662 132261 64593 47262 18130 -41700 -28135 -98756 -151277 -167720
8541a67720J1381J1931L8104J2388O6954J0388M0806o0321j32311m121J64828
8530g693j0199k0339J56599k5405M3819l3791o2223j5444N7297J9480k6698J2621
8518H8024j08053m7327l5225l6368n054L6613o4912j3566P5678J9218k1152Q5683
8506b6441J9679M451m7104L9713O8713P694j383l1282K963M8730p7678K1008m4298
8493a5235q2843O4054L2375n5292j1278N1422M0438N8203k7575k4870j08236J7612
8481f1225j3372m5857L9296P6596P3141k6548P183m9645j09034k6209J90222J20641
8469A75189R3917j9025j6691k8422j26419j40423k503J14919n0959m3338n0231
8458i3986j1171J06034J7538m4036O4924P1616m7658r0504j17423k2236K2464
$$ plain form
8541 -167720 -156339 -144408 -106304 -93916 -26962 -16574 24232 -36089 -168400 -172521 -7693
8530 -7693 -17892 -38231 118368 92963 136782 102991 40768 25324 82621 102101 75403 88024
8518 88024 -20029 -67356 -102581 -138949 -144003 -107390 -172302 -185868 -110190 -90972 -112124 -26441
8506 -26441 -6762 -2311 -49415 -9702 59011 66705 65322 34040 37003 85733 8055 29063 -15235
8493 -15235 -98078 -34024 -1649 -56941 -68219 -16797 23641 81844 54269 29399 -78837 -61225
8481 -61225 -74597 -120454 -81158 -4562 68579 42031 49214 -431 -109465 -135674 54548 175189
8469 175189 269106 250081 233390 204968 78549 -61874 -64377 50542 -417 -43755 -93986
8458 -93986 -105157 877 18415 -25621 39303 110919 63261 -27243 -144666 -166902 -144438
8447a44438O0234N7685l3273p420L8235j883O1216J3172k7551O7093M3636J18201
8435B44907j001j27267o5306j1592p9022K5420J11177q6395l6450L5296J01421
8424A11188k8038l3133p5176L1482M6467j6684N8185R418o0504J9243Q3302K2538
8412A68288n5359m5329j1084o118O9355O302q7473q6838K1323Q3460m4704p4529
8400f2706L6313J8474L0782K3137M5083j4265N1955P1527k0921n6603j6326r7084
8388I366L7782P6311K9667M3321p8544r899j6666P1716R166n3207r8751r8716
8376g8454M264N6500k4490j49024n10M8714K1354L2058K7822J733q7654K8873
8364a18814K1485l2501P6846O3338l321j9270J2798M857K0875N1599K1562j30699
$$ plain form
8447 -144438 -84204 -26519 -59792 -67212 -28977 -30860 30356 43528 15977 83070 126706 244907
8435 244907 243906 116639 51333 39741 -39281 -13861 97316 10921 -25529 9767 111188
8424 111188 83150 50017 -25159 6323 52790 36106 94291 103709 43205 62448 145750 168288
8412 168288 112929 67600 56516 50398 119753 126055 38582 -48256 -26933 56527 11823 -62706
8400 -62706 -26393 -7919 22863 46000 91083 76818 128773 200300 179379 122776 106450 9366
8388 9366 47148 123459 153126 196447 117903 108004 91338 163054 172220 119013 20262 -78454
8376 -78454 -74190 -17690 -42180 -191204 -191714 -143000 -121646 -89588 -61766 -60033 -147687 -118814
8364 -118814 -97329 -129830 -52984 10354 7033 -12237 561 5418 26293 77892 99454 -31245
8352c1245p3652J51592J30571q5231j19538K9353J06563m5526l9107n5539j9042
8341e0801K677l5523m7978K1555J33581o393p7300N1846Q2479l2645n2364q6633
8329i7499Q2002n092J3212O9120o909Q1553N166j0044l3839p1630k3036j13184
8317a10180J51657P9782n0090Q337j18224o5094J14457J52595o3473r8461o3215
8306f1909O9310L0652N450p1394j2131N9148R6954N7583j13414j4395J00436l2722
8294A13568J3819N611k1525m9668p5110l8783r3122L9019j723K2308P1003L9241
8282B4638M0353k0355K6593L0842k5005p0447K235K7725R557l0645L1439J8255
8270F5185q368R9950k6091p0101J7789o1348l2372j00006p0140L4227N7214R918
$$ plain form
8352 -31245 -104897 46695 177266 92035 -27503 1850 108413 62887 23780 -31759 -50801
8341 -50801 -48124 -83647 -131625 -110070 23511 17118 -60182 -8336 74143 41498 -10866 -97499
8329 -97499 -15497 -20589 -7377 61743 54834 136387 141553 131509 97670 26040 3004 -110180
8317 -110180 41477 121259 71169 79506 -38718 -103812 10645 163240 99767 1306 -61909
8306 -61909 7401 38053 43503 -27891 -40022 19126 116080 173663 60249 45854 146290 113568
8294 113568 127387 132998 111473 61805 -13305 -52088 -145210 -106191 -107914 -85606 -14603 24638
8282 24638 64991 44636 71229 102071 77066 6619 8854 36579 46136 15491 46930 65185
8270 65185 56817 156767 130676 60575 78364 17016 -15356 -115362 -185502 -151275 -94061 -84143
8258h4143O9473O6967P2137n4882n5929K4534l0712j8341J7603j67120n678L5697
8246a30394m3012N3739M3758J7873j0712l0645L0241K4728K3333K9476K4866m4547
8234a1296j3294J896Q0686K9005r3990j50757k7331O3809J3968L3106N9513J20291
8222A05606j1450O9650L0444O6683j08140n3576q2168j1856J66000N2365K7o6355
8210A57230n9058l0778j090k9207k8974q3072j9955K3107L3920k0888J5719j9286
8198f2332J12900j7322p5022q6423K6145L3289L1419P4271m0121l5451N4226k5696
8186a0117o9160J4781J44420n9807n5048l5251n5838O792N4873N3840L7306j10774
8174h3983j21871k9937R8319R8357j37215K785J01155m2172p545N9453L3273m9484
$$ plain form
8258 -84143 -14670 52297 124434 69552 13623 38157 7445 -10896 6707 -160413 -166091 -130394
8246 -130394 -173406 -119667 -75909 -58036 -68748 -99393 -69152 -44424 -21091 8385 33251 -11296
8234 -11296 -24590 -22694 57992 86997 -6993 -157750 -185081 -121272 -107304 -74198 -14685 105606
8222 105606 94156 163806 194250 260933 152793 99217 17049 5193 171193 223558 223585 157230
8210 157230 98172 67394 66304 37097 8123 -74949 -94904 -71797 -37877 -58765 -43046 -62332
8198 -62332 50568 33246 -41776 -128199 -102054 -68765 -37346 36925 -3196 -38647 15579 -10117
8186 -10117 -79277 -64496 79924 20117 -34931 -70182 -126020 -119228 -64355 -10515 26791 -83983
8174 -83983 -205854 -235791 -137472 -39115 -176330 -173545 -72390 -114562 -122107 -62654 -29381 -78865
8162g8865o0941Q9596m712j13811n4513J27090m8304n8045j07935o9755j9885
8151d00080P8692P3300P8711J13598Q8869r7235o1996N6244K0627L5245P7038
8140F3013P1850p7617q2582k8234k7816M1083K3354j064r5623J9696J5561m3084
8128a21463n2870n4023n278j9805L0824l9536M5225N8234k260M0908M2717m923
8116h2250J14346K0395L8065Q7450r7868l1591l5146M60L8417o8321l1448j16688
8104a64179m818J15373l0156n2818r7070J16213K32882M7232m2225m4359r1457
8093a5382l2946j0267R963O1240M8305K5613K9924k42021o4795J10539O4207N5225
8081C9605L4444M7672O8210K3497r3551p3903p808j81348j28260L5087k7117M4025
$$ plain form
8162 -78865 -139806 -50210 -54922 -168733 -223246 -96156 -144460 -202505 -310440 -380195 -400080
8151 -400080 -321388 -248088 -169377 -55779 33090 -64145 -126141 -69897 -49270 -14025 63013
8140 63013 134863 57246 -25336 -53570 -81386 -40303 -16949 -18013 -113636 -93940 -78379 -121463
8128 -121463 -174333 -228356 -233634 -253439 -222615 -262151 -216926 -158692 -160952 -120044 -77327 -82250
8116 -82250 32096 52491 90556 178006 80138 48547 13401 13861 52278 -16043 -47491 -164179
8104 -164179 -168997 -53624 -83780 -136598 -233668 -117455 115427 162659 120434 76075 -15382
8093 -15382 -48328 -58595 -48632 12608 60913 86526 116450 -125571 -190366 -79827 -15620 39605
8081 39605 74049 121721 189931 213428 119877 45974 38166 -143182 -271442 -236355 -263472 -219447
8069b19447r297J43446P5468J14585k0903j42236r5504J9779J64551N0438j31068
8058e0188l0734j1015L9906P135J1490p0805k3046k2669J50370q3599m5929Q2240
8046d6844K0468m0549N3875L5418j7503J2856l4754L1587N4190L7222L6213q9036
8034E3143k28531k4830L4342O0024L9311M2043j6973O7848k8973n3535J4595J3038
8022b8498J8822Q9029j5966J1571J07307j14791j32651r2305q3676J28955J79432
8011F7229j16604m8345o00r682J52996R4957p2132o1392j50760M844M5568q2252
7999a76173O872o9990N8191J93061Q3445k7690l9249J7766j1579N4858k3289j14771
7987d8548j01774N675Q6285R3117k0119K6354J2265O2769n6971l7008K3374O7191
$$ plain form
8069 -219447 -228744 -85298 -9830 104755 83852 -58384 -153888 -134109 30442 80880 -50188
8058 -50188 -80922 -91937 -52031 -44896 -33406 -104211 -127257 -149926 444 -83155 -129084 -46844
8046 -46844 -26376 -66925 -13050 22368 4865 17721 -17033 14554 68744 105966 142179 53143
8034 53143 -175388 -200218 -165876 -105852 -66541 -24498 -41471 26377 -2596 -56131 -41536 -28498
8022 -28498 -9676 79353 63387 74958 182265 67474 -65177 -157482 -241158 -112203 67229
8011 67229 -49375 -97720 -98320 -108002 44994 139951 67819 6427 -144333 -139489 -93921 -176173
7999 -176173 -169301 -239291 -181100 11961 95406 67716 28467 46233 34654 89512 66223 -48548
7987 -48548 -150322 -144647 -58362 34755 14636 40990 53255 116024 59053 22045 45419 112610
7975A12610J04608r1422Q76k2262k5290r8085n9868N9052l1553n1482K5076J64579
7963H6839j0276n7658K4312q7557j203J3959J38191j07165p9472M3625J20692
7952H4287M4715p9242l7951n4005k5884N7595q4523j13839q146N8301J48659m1584
7940e1617k1255M9754M2902Q1580J3504j46833k6875N0647l4926R4855J9053O4766
7928A35555J4723l7195J9730o2447n8m7326Q2306L212j1259J3743l2823n0466
7916B7695j08169k725J56972m7470n6096R4920R6378o228N784p5303l2128O2796
7904A16426K9246n9289o5503J1557k9788m9362p721r073L7551K4500j09j1084
7892a2649q7214j5556K8597l2361J7381J28370l648J394L4529M372k1227J56238
$$ plain form
7975 112610 217218 125796 126672 104410 79120 -18965 -78833 -19781 -51334 -102816 -77740 86839
7963 86839 76563 18905 43217 -44340 -45543 -31584 106607 -558 -80030 -36405 84287
7952 84287 129002 49760 11809 -42196 -68080 -10485 -95008 -208847 -216993 -158692 -10033 -51617
7940 -51617 -72872 -23118 19784 101364 114868 -31965 -58840 -8193 -43119 51736 70789 135555
7928 135555 150278 113083 132813 70366 70308 22982 105288 108500 97241 110984 78161 27695
7916 27695 -80474 -83199 73773 26303 -29793 65127 161505 155277 161061 85758 53630 116426
7904 116426 145672 86383 20880 32437 2649 -46713 -54434 -63507 -25956 -1456 -1565 -12649
7892 -12649 -99863 -115419 -86822 -119183 -101802 26568 22920 24314 58843 63215 41988 198226
7880A98226P7934L0725l1627p4597m2542q2439L3113N5639N617o0815m5083k9085
7868C5066r9795o2329N2948K2510P6517O9338J0657O582j11632r6859j966K1412
7856g7551m6888j22077n355q232k1324o0555N7916O3661J18473J55397M9407J20023
7844B22895j1082o1943p627j64573l8647L4117j00409r4968R2246N3811O5670
7833a0510J6948p8830l2787M2202R4155l2139m9731P477J03790J12071j1420J6719
7821A77945l2091j46269K785K3691p5711n8591l3497O7770m1501J44643K7329
7810E6503K2038m3262m4175n0045o6113q5804M8030J3127K8558Q867J79995Q9115
7798A56834J6620k7729o5380N2975N1809l4650n4686o8786M3692o169L4245M0161
$$ plain form
7880 198226 276160 306885 275258 200661 158119 75680 108793 164432 170049 109234 64151 35066
7868 35066 -64729 -127058 -74110 -51600 24917 94255 104912 111494 -138 -96997 -98963 -77551
7856 -77551 -124439 -246516 -251871 -260103 -281427 -341982 -284066 -220405 -101932 53465 102872 222895
7844 222895 211813 149870 142243 -22330 -60977 -26860 -127269 -222237 -129991 -76180 -10510
7833 -10510 6438 -72392 -105179 -62977 31178 -961 -50692 -43215 60575 172646 161226 177945
7821 177945 145854 -415 2370 26061 -49650 -108241 -141738 -73968 -115469 29174 56503
7810 56503 78541 35279 -8896 -58941 -125054 -210858 -162828 -149701 -121143 -112276 67719 156834
7798 156834 173454 145725 80345 133320 185129 150479 95793 27007 70699 64530 98775 138936
7786A38936j25383M8171P3959R180Q2412p2356j33461r0822L5823O2002j8413
7775A0048m5449J5274Q0292J15310Q2851o4534m4523p7872j25565j22268m8633
7764b25069K1515o335N8285J00395j4967K813Q475j02026J1009K2053K8968n4646
7752a49530j8616O7375J64895n0072L242M8957m7473j39085q312L5193O1725o535
7740c8236J6774R608O6970j7129j11192j24323n4232J16247J30957O094J44951
7729A46489o5708j84294p0525m2498J45286K5652j02605L9069J72338Q9881o3247
7718H9838l9590o4867r3753Q494j12629L3368p2118M7446M2737L2234j784j15917
7706b46541P8387O037o6369Q624j2406J74388L5631j3144J3755j8029Q3195j8814
$$ plain form
7786 138936 13553 61724 135683 144863 227275 154919 21458 -69364 -33541 28461 10048
7775 10048 -35401 -20127 60165 175475 258326 193792 149269 71397 -54168 -176436 -225069
7764 -225069 -203554 -209889 -151604 -51209 -66176 -63363 -54888 -156914 -145905 -123852 -94884 -149530
7752 -149530 -168146 -100771 64124 14052 17294 66251 18778 -120307 -128619 -93426 -31701 -38236
7740 -38236 -21462 -11854 55116 37987 -73205 -197528 -251760 -135513 -4556 1538 146489
7729 146489 80781 -103513 -174038 -216536 -71250 -45598 -148203 -109134 63204 153085 89838
7718 89838 50248 -14619 -108372 -99878 -212507 -179139 -251257 -203811 -161074 -128840 -130624 -246541
7706 -246541 -168154 -162117 -228486 -219862 -232268 -57880 -22249 -35393 -21638 -39667 43528 24714
7694B4714l6980N7745j49942j41127Q0945k1864L7173j11575n4855K4705O5967
7683b25094M6293J10209J9575j10859L4832J4499M5143Q5182O7873n5972j27174
7672i5493J01617j579J03171j3242p6111p1659r9572O0983J15240J05229N3125
7661A81709O1483k4448K128q098l2084P105k9934n2143p1116m3015r4642j8808
7649a21863Q1577q8309m3192L3967P5736J8044m2738j9486o3410M5880J17195
7638f599N4214j12316P898j7338m7548L4970J47964o3483j41102p1871j488M5641
7626a71058M6494M0279J00259k1118L8059q6407j77l3349j42440l0609M3655K3788
7614a92624P5703p2390j00577K865O0825j8106K3380J57682L6346r6385j12954
$$ plain form
7694 24714 -12266 45479 -104463 -245590 -164645 -186509 -149336 -260911 -315766 -291061 -225094
7683 -225094 -178801 -68592 -49017 -159876 -125044 -110545 -65402 19780 87653 31681 -95493
7672 -95493 6124 4545 107716 94474 18363 -53296 -152868 -91885 23355 128584 181709
7661 181709 243192 218744 220872 212774 180690 187795 157861 105718 34602 -8413 -103055 -121863
7649 -121863 -40286 -128595 -171787 -137820 -62084 -44040 -86778 -106264 -169674 -123794 -6599
7638 -6599 47615 -64701 -56803 -74141 -121689 -86719 61245 -2238 -143340 -215211 -216699 -171058
7626 -171058 -124564 -84285 15974 -5144 32915 -53492 -53669 -87018 -229458 -260067 -216412 -192624
7614 -192624 -116921 -189311 -289888 -287023 -226198 -244304 -220924 -63242 -26896 -123281 -236235
7603b36235j824M8527J14929Q540J5855J502J00586L955j18817L9936N311o0551
7591g8286l1784M8137l9794l8693M6467J01818P5741K8537j8292j9867j04028
7580c0044j5170P2783j1005r2441o3780Q1233l06j14234K2456m565o4947L0028
7568a89992K4881M5994J66968Q3467p2572r9399j9248J10313P1637o58k3789M8498
7556A46100L4986N5175l7409j44062j93265L2532P5406N3285M8336k3366j26416
7545g8698p1100P834K9104p2412K2329L0240J06117J05529J1202m6892k12417
7534a69164K716J18180J43994K9442p1480l7279j1560Q5516j27014p3535j0615
7523a20799j10910K9223N5473K8227R5487Q6980m5876R1910M0523j53829q6582
$$ plain form
7603 -236235 -238059 -189532 -74603 -66063 -50208 -48706 51880 55835 -62982 -23046 -17735 -78286
7591 -78286 -110070 -61933 -101727 -140420 -93953 7865 83606 112143 93851 73984 -30044
7580 -30044 -45214 27569 16564 -75877 -139657 -58424 -58730 -172964 -150508 -155073 -220020 -189992
7568 -189992 -165111 -119117 47851 131318 58746 -40653 -59901 50412 122049 121391 97602 146100
7556 146100 181086 236261 198852 54790 -138475 -105943 -30537 22748 71084 47718 -78698
7545 -78698 -149798 -141964 -112860 -185272 -162943 -132703 -26586 78943 90145 43253 -169164
7534 -169164 -166448 -48268 95726 125168 53688 16409 4849 90365 -36649 -110184 -120799
7523 -120799 -231709 -202486 -147013 -118786 -23299 63681 17805 109715 150238 -3591 -90173
7512i0173N899L7419n6351p346R0984n7299j38705j122K5669j8772Q7676l5168
7500a57289M1462J23061L9209J8367O0168Q34j77089j14654r6421j3504J77329
7489i8527M1059K551P4915m2431J9704l7261K3403n891N8384r648R6129n1035
7477G1352j3546l1721m7360j38760R2619O6525P2782M417j9074m2422N787l6593
7465a5994M1406J36416m5965M148L004j06533l8420q695R3597j4911q6739J1309
7453b7377M63K8809k1141k0739M3441n8550m0595J08644J41r2140N3063O5111
7441C9130j04959M838J41611J488j15420r8979l3714L6829J03871J19326M8574
7430A42595P3231N5504K1812q318j27184l0648J71719o8819o1030n1153q132p7907
$$ plain form
7512 -90173 -84274 -46855 -103206 -110552 -19568 -76867 -215572 -216694 -191025 -209797 -122121 -157289
7500 -157289 -115827 7234 46443 64810 124978 125812 -51277 -165931 -262352 -275856 -98527
7489 -98527 -57468 -54917 19998 -22433 -2729 -39990 -16587 -22478 35906 26258 122387 71352
7477 71352 57806 26085 -21275 -160035 -67416 -891 71891 76308 57234 14812 20599 -15994
7465 -15994 25412 161828 115863 120011 123015 16482 -21938 -30633 62964 48053 -38686 -27377
7453 -27377 -26914 1895 -19246 -39985 3456 -55094 -95689 12955 13096 -79044 -25981 39130
7441 39130 -65829 -60991 80620 82108 -33312 -132291 -166005 -129176 -25305 94021 142595
7430 142595 215826 271330 293142 284824 157640 126992 298711 229892 168862 117709 109577 31670
7418C1670m8480Q7859P6707k1125r5498j27121m883j3427k1929P510L6318J27810
7406C5411j0601o9786J43760J02928j12259j37057N4181Q6061R7835p6876p4171
7395C9426J00027M9956n8224p4474M4895q9180L5569Q313j08400p8989m4141K1461
7383a53761O0643J33272O9054J2636M891m4522l3100o9040l0086n709k8364j4040
7371i8126M1188k5793j6603M3905N014p842k4011M5448k7476O7624o9836n1772
7359a18280J14755l527j01566M9996K3659m0435n564O8078J0202l2167o4871L0358
7347f9362l6268k942K8096J09198J9351O993k06335k11409O8308K30183J17441
7336E3254L8547K0592j8098l0931R976q2218K6510J3505M6221o2276m1641J3519
$$ plain form
7418 31670 -16810 71049 147756 126631 31133 -95988 -100871 -114298 -136227 -128717 -92399 35411
7406 35411 24810 -44976 98784 201712 89453 -47604 6577 92638 190473 113597 39426
7395 39426 139453 189409 131185 56711 101606 12426 47995 56308 -52092 -131081 -175222 -153761
7383 -153761 -93118 40154 109208 121844 126735 82213 49113 -19927 -50013 -55722 -84086 -98126
7371 -98126 -56938 -82731 -99334 -55429 -50415 -58257 -82268 -36820 -64296 3328 -66508 -118280
7359 -118280 -3525 -7052 -108618 -58622 -34963 -75398 -80962 -12884 -2682 -34849 -99720 -69362
7347 -69362 -105630 -108572 -80476 28722 48073 55066 -151269 -362678 -294370 -64187 53254
7336 53254 91801 112393 94295 63364 73340 -8878 17632 31137 77358 15082 -26559 -13040
7324a3040N8889Q0082l0510j11427j4745N9134k7657j3618P7065j9570K3149l725
7312F4027L753j8153K5258n7408r9058r7601K2973M3986k3675J27051M2377N1042
7300H4572J4971R0616m8103p0435n7050k6595L8139J4377k7231j02028j0522R5164
7288d125K6895n2523J08036M9671j04484r5639l4121m386Q3627p4358l2230Q1697
7276e1940Q0230M393L5582O5373K3404m5993j54610j0891K6169n683q9505l7251
7264a60722j4156J9391K5237Q4515N0479L984k0067L1976o0407o187k683N1925
7252C285J02205M0325L5070o1741p281l895j61542j14812J15749M0355l135J2305
7240c112J9583l1784j18689L8199R6402l6223N0405J49768R1889p4373P6238P4560
$$ plain form
7324 -13040 45849 125931 95421 -16006 -30751 28383 726 -12892 64173 44603 67752 64027
7312 64027 67780 49627 74885 17477 -81581 -179182 -156209 -112223 -135898 -8847 33530 84572
7300 84572 99543 190159 142056 71621 14571 -12024 26115 40492 13261 -88767 -99289 -4125
7288 -4125 22770 -29753 78283 127954 23470 -72169 -106290 -110676 -27049 -101407 -133637 -51940
7276 -51940 28290 32683 68265 133638 157042 111049 -43561 -54452 -28283 -33966 -123471 -160722
7264 -160722 -174878 -155487 -130250 -45735 4744 8728 -11339 20637 -39770 -45957 -48640 3285
7252 3285 105490 145815 180885 119144 111863 107968 -53574 -168386 -52637 -12282 -15417 -3112
7240 -3112 16471 -15313 -134002 -95803 599 -35624 14781 164549 256438 182065 258303 332863
7228C32863j19655j25932q9038Q315R213j34766K6274Q7383K6912n4106Q8817
7217E6280M9175j05813K6284q7208q0447O2776M6337N1946l9294O913j4470l4962
7205f2483J2567r237k4368M1994N8240J2888P0442R7358j14150J6870k626j3346
7193H4149q1952k0523L0760j18101P0039m6910N291M3368M7943N056Q3190q3600
7181A8710j3979K8073Q3054K0135l9249J1955K9098j9474K2300j4515j21679o270
7169a841K5311O4630M4728q326q0561J528j6816n4333P1293p2485J2189Q181o2380
7156f8882J5255L146M1171O9846j2075m3052j5013n5890P0905j2836J0840j06573
7144a03158m6849o3625o7761J42641J45948L7618r8803r182J41227K786M9435
$$ plain form
7228 332863 213208 87276 -1762 6553 15766 -119000 -92726 -5343 21569 -32537 56280
7217 56280 105455 -358 25926 -61282 -141729 -78953 -32616 19330 -19964 -13051 -27521 -62483
7205 -62483 -49916 -59153 -83521 -41527 16713 29601 100043 197401 83251 100121 97495 84149
7193 84149 2197 -18326 12434 -105667 -35628 -82538 -77247 -33879 14064 19120 102310 18710
7181 18710 4731 32804 115858 135993 96744 108699 137797 118323 140623 126108 4429 -1841
7169 -1841 23470 88100 132828 124502 43941 45469 28653 -25680 45613 -26872 -14683 -6502 -68882
7156 -68882 -53627 -50481 -9310 60536 48461 5409 -9604 -65494 5411 -7425 3415 -103158
7144 -103158 -150007 -213632 -281393 -138752 7196 44814 -53989 -63171 78056 80842 130277
7133A30277N0207o5509m1350N3868M943o281k4419K2422J6544M0330m0905J7486
7121A57613r0210q8862o6067N207M7184J39439K7432j94511j09286j589N4793
7110a18857q6675l1645O8769l8326N3782O3272K2544Q9609R4244O0364l6643L5732
7098A76170j44644j66600q9944m2316K5845K08433M1127q1785o2900R0627R3076
7087D7089k2469j02011N6953N4157r9742o7715j0422O5422R1247P855n0072n8105
7075h7813p856O4405o359N4574n6757O4871N009J1752k489K5126L2447N2193K7123
7062A76226l7747j45143O1335L5113j5427K4654P7145l5830o6189o2801l5398
7051b4062p1817r3920R0758O6589j1570j4921j9054n3909j5691k5986p4186J39654
$$ plain form
7133 130277 180484 114975 73625 127493 132436 126155 101736 124158 140702 181032 140127 157613
7121 157613 67403 -21459 -87526 -82319 -35135 104304 131736 -62775 -172061 -173650 -118857
7110 -118857 -205532 -237177 -168408 -206734 -152952 -89680 -67136 22473 116717 177081 140438 176170
7098 176170 31526 -135074 -225018 -267334 -241489 -33056 8071 -73714 -136614 -45987 47089
7087 47089 24620 -77391 -20438 33719 -66023 -133738 -144160 -78738 12509 20364 -29708 -87813
7075 -87813 -95669 -31264 -37623 16951 -39806 25065 30074 41826 39337 64463 96910 149103 176226
7062 176226 138479 -6664 54671 89784 74357 99011 176156 140326 74137 11336 -24062
7051 -24062 -95879 -189799 -99041 -32452 -44022 -58943 -77997 -131906 -147597 -173583 -247769 -108115
7039a08115P9945M0806l6188j16153K1696o4744O9254P1817p8205j05733J22452
7028a03168L9129n4360K6508j4151O5971j1788k7673K0105K5434M0793k3291o992
7016b3483q8340l1824Q003P0231J6363J07941p978r6422L5308l930q3122Q767
7004h8486L687n3990J28878O0406N58K2626Q7462m3951n1755l7460J6370K7736
6992G2081K1270J6523m5852q5167K6086R465J8141j04269r3116L6939N3333O767
6980f7799n3029P3556J06555n4617o7754k7065n1211J23374L4166N1924R4320
6969A62420k4449j02568k2382J09458L5690j1127r0177L75o6335p8744p0734n8131
6957b16704n8954J26655K29044Q459K1224J49274q2082l9745l8193j14797o7289
$$ plain form
7039 -108115 -28170 12636 -23552 -139705 -118009 -182753 -113499 -41682 -119887 -225620 -103168
7028 -103168 -64039 -118399 -91891 -106042 -40071 -51859 -79532 -59427 -33993 6800 -16491 -23483
7016 -23483 -111823 -143647 -135644 -65413 -49050 58891 50913 -45509 -10201 -14131 -97253 -88486
7004 -88486 -84799 -138789 -9911 50495 51053 73679 161141 117190 65435 27975 44345 72081
6992 72081 93351 109874 64022 -21145 4941 14406 32547 -71722 -164838 -127899 -74566 -67799
6980 -67799 -120828 -47272 59283 4666 -63088 -90153 -141364 -17990 16176 68100 162420
6969 162420 137971 35403 13021 122479 158169 147042 56865 57240 -9095 -87839 -158573 -216704
6957 -216704 -275658 -149003 80041 88500 109724 258998 176916 137171 98978 -15819 -83108
6946h3108r9787J15437J15219K8015M2746L7819j00441l1156N7614m0797m6364
6935d803J2928n3862L5055j152j01996J14384J42872m5204O766J86675J5686j23754
6923A83595n8567j9609j13450m2557J28181k9090J3784J1926K784j05043j02788
6912a30834p041J9511O628O0348Q8021o460M9804m5667j89524n2374Q2815J15955
6900h818K725K0552J9410P0901M9015N9772j06257q8115P4009o7470k1710R27
6888D941j1474O8376L255k5123J08368k0807M457k7736q036n8384k5610j02713
6876i0486K8583l6234O5057Q8349Q8819r8680q2179q429J7713R8072M6459j85394
6864f8350L3057Q4108J0032q528M1188K5989L1232r1034q1477q7608m8172J1768
$$ plain form
6946 -83108 -182895 -67458 47761 75776 118522 156341 55900 24744 82358 41561 -4803
6935 -4803 8125 -45737 -10682 -11834 -113830 554 143426 98222 104988 291663 307349 183595
6923 183595 125028 105419 -8031 -50588 77593 48503 62287 74213 76997 -28046 -130834
6912 -130834 -137875 -118364 -111736 -51388 36633 30173 79977 34310 -155214 -207588 -124773 -8818
6900 -8818 -6093 14459 33869 104770 153785 213557 107300 19185 93194 25724 4014 4941
6888 4941 -6533 61843 65098 39975 148343 127536 131993 104257 96221 37837 12227 -90486
6876 -90486 -61903 -98137 -33080 55269 144088 45408 -36771 -45200 -27487 70585 117044 -68350
6864 -68350 -35293 48815 58847 50319 91507 117496 148728 57694 -23783 -111391 -159563 -147795
6852a47795L9233J49829J4712q6077l2298J08245p7962R963J48948n2419p6216
6841a837j11556k2516R530J1812J07641J24570O4481k5640n8228o1860o5158j1043
6829c9804q9862K1894J88995j4053j08839J09561N209j0541j55414J7544J8007
6818e7303O7129j9130j3804m4694Q1278o3503P2853P2J9074l6793j5741r2456
6806a03018k4479J4141J3578M6990l4490O5783O9183R66K9216j1727N9325p5435
6794E0033R603P8631K3197M7912q5842p5232K893M9196P2652L4843k8692k4182
6782A55012o3337n6249L387M8565j9711n51L2068m6283r099O4907J07424K1606
6770B37739r5390n350J0057p5511j34637k1811r425O7794N2638l4322j57374l000
$$ plain form
6852 -147795 -108562 41267 55979 -30098 -62396 45849 -32113 -22150 126798 74379 -1837
6841 -1837 -113393 -135909 -126379 -114567 -6926 117644 182125 156485 98257 36397 -28761 -39804
6829 -39804 -129666 -107772 81223 67170 -41669 67892 73101 62560 -92854 -75310 -57303
6818 -57303 9826 -9304 -23108 -67802 13476 -50027 22826 22898 41972 5179 -10562 -103018
6806 -103018 -127497 -113356 -99778 -52788 -87278 -21495 47688 48654 77870 66143 125468 50033
6794 50033 59636 138267 161464 209376 123534 48302 51195 100391 173043 207886 179194 155012
6782 155012 91675 35426 38813 87378 67667 67116 99184 52901 43802 108709 216133 237739
6770 237739 142349 136999 147056 71545 -63092 -84903 -94328 -26534 26104 -8218 -165592 -168592
6758a68592Q0911K4413N0930K289N5226j7503j78648l5713J11632L045o1592N409
6746a28193J09414R1592j220n5045j21070R7563O1732k7992J0904P1708J7318
6735A26711k1517J7525N5023n5516n8773K4749J3947l7452j1341r0493n2387N4073
6723c5451J5532j02621J385O8512J08201M9375n8140J0879l3614J4726o4734j6790
6711d2740R1859J7257P3784J01075o7185p1814k4282Q9990o8714L7688k6916k2473
6699H7529J10624m9097k0387J9227r0315n3948o4792m9266M041k8008K7802R7151
6687i439K3051O9162j8236n0514J8162K0422M2766K0189n1907p6217n1470N5134
6675h897p2694j20651J13077R1439P9875j6865m0724k1317J1859j0173l8549j52367
$$ plain form
6758 -168592 -87681 -63268 -12338 -10049 45177 27674 -150974 -186687 -75055 -72010 -133602 -128193
6746 -128193 -18779 72813 71593 16548 -104522 -6959 54773 26781 37685 109393 126711
6735 126711 105194 122719 177742 122226 63453 88202 102149 64697 53356 -37137 -89524 -35451
6723 -35451 -19919 -122540 -121155 -52643 55558 104933 46793 57672 24058 38784 -25950 -42740
6711 -42740 49119 66376 140160 241235 174050 102236 77954 167944 99230 136918 110002 87529
6699 87529 198153 149056 128669 147896 57581 3633 -61159 -110425 -106384 -134392 -106590 -9439
6687 -9439 13612 82774 64538 14024 32186 52608 95374 115563 63656 -12561 -64031 -8897
6675 -8897 -81591 -202242 -89165 2274 82149 65284 24560 3243 15102 4929 -33620 -185987
6663a85987O6306J09404R3119m9585p7138k4668K4985P3013p0613p1578Q642O483
6651i7617J89729N8938L605n2425O2114l3170M0236J62542K8368j7844j46778
6640A97698n0508k8787j14688l5354K4091k4336J6532J31182J0856p0651p7673
6629b1638O6631R7201l8706n8844J06147o2200q3912L3750j9203J1146J27745
6618A58117M7060p8117j44631K4509J08282j23119j27412l6807k4963R0223k3049
6607a29907j04k1325O4607J6441j23968N6509J07853J15233J246l6453j3471k593
6595C4068q6410n6538J10893p4824J07924P8874j35236K0044J25841q1752o4346
6584b1462p05M2488l0726q8204l167L506M2296J15249N5045P4582r628o2837R2117
$$ plain form
6663 -185987 -119681 -10277 82842 33257 -43881 -68549 -43564 29449 -41164 -112742 -104100 -97617
6651 -97617 92112 151050 154655 102230 164344 131174 171410 333952 362320 344476 197698
6640 197698 147190 118403 3715 -31639 -7548 -31884 -15352 115830 126686 56035 -21638
6629 -21638 44993 142194 103488 44644 150791 88591 4679 38429 19226 30372 158117
6618 158117 205177 127060 -17571 6938 115220 -7899 -135311 -172118 -197081 -106858 -129907
6607 -129907 -130011 -151336 -86729 -70288 -194256 -137747 -29894 85339 86585 50132 36661 34068
6595 34068 -52342 -108880 2013 -72811 35113 113987 -21249 -1205 124636 42884 -21462
6584 -21462 -22167 20321 -10405 -98609 -101776 -98270 -55974 59275 114320 188902 179274 116437 208554
6571B08554k1826r4493J6911L3579K333n7580J514N2330J1525r44r7518m627P0574
6558A20332L0760p0794j31156R0138O5127o5405n5213j22071J0578P6132J00326
$$ plain form
6571 208554 186728 92235 109146 142725 145058 87478 88992 141322 152847 151903 54385 49758 120332
6558 120332 151092 80298 -50858 39280 104407 39002 -16211 -138282 -127704 -51572 48754
$$ [...]
##END NTUPLES=NMR SPECTRUM
##END=
