##TITLE=Analysis number 321292
Compound Code cc 17503
Project Code adrs
Chemist Name af chempharm
##JCAMPDX= 6.0         $$ Bruker NMR JCAMP-DX V2.0
##DATA TYPE= NMR SPECTRUM
##DATA CLASS= NTUPLES
##ORIGIN= Bruker BioSpin GmbH
##OWNER= nmr
$$ XWIN-NMR		Version 3.5
$$ Thu Aug  3 09:26:16 2006 GMT Daylight Time (UT+1h)  MAYBRIDGE\nmr@NMR_250MHZ
##.OBSERVE FREQUENCY= 250.131544655141
##.OBSERVE NUCLEUS= ^1H
##.ACQUISITION MODE= SIMULTANEOUS (DQD)
##.ACQUISITION SCHEME= undefined
##.AVERAGES= 16
##.DIGITISER RES= 18
##SPECTROMETER/DATA SYSTEM= dpx250
##.PULSE SEQUENCE= zg30
##.SOLVENT NAME= CDCl3
##.SHIFT REFERENCE= (INTERNAL, CDCl3, 0, 16.522)
##AUDIT TRAIL= $$ (NUMBER, WHEN, WHO, WHERE, WHAT)
$$ ##TITLE= Audit trail, XWIN-NMR		Version 3.5
$$ ##JCAMPDX= 5.01
$$ ##ORIGIN= Bruker BioSpin GmbH
$$ ##OWNER= nmr
$$ C:\u/data/dgb/nmr/ADRS/120/pdata/1/auditp.txt
$$ ##AUDIT TRAIL=  $$ (NUMBER, WHEN, WHO, WHERE, WHAT)
(   1,<2006-08-03 09:25:57.03 +100>,<MAYBRIDGE\nmr>,<NMR_250MHZ>,
      <created by zg, POWCHK disabled, PULCHK disabled
       configuration hash MD5:
       E2 DF 36 D8 04 B2 41 60 5A D7 A3 38 5A 4B D0 FE
       data hash MD5: 64K
       47 ED CB 1C 25 81 E7 37 37 9E E9 D4 7D E6 A1 0E>)
(   2,<2006-08-03 09:26:08.11 +100>,<MAYBRIDGE\nmr>,<NMR_250MHZ>,
      <Start of raw data processing
       ef LB = 0.3 FT_mod = 6 PKNL = 1 SI = 32K 
       data hash MD5: 32K
       DE C6 FE 53 11 68 AC 79 D5 FD 3A 77 C4 B9 24 75>)
(   3,<2006-08-03 09:26:09.71 +100>,<MAYBRIDGE\nmr>,<NMR_250MHZ>,
      <apk 
       data hash MD5: 32K
       F5 D2 1B 85 08 3E 3C 12 F0 CD 81 FB CD 0B E5 FF>)
(   4,<2006-08-03 09:26:10.55 +100>,<MAYBRIDGE\nmr>,<NMR_250MHZ>,
      <abs ABSG = 5 
       data hash MD5: 32K
       64 C9 ED 96 FD FD B0 2C A5 40 CC 07 DC 78 EA 86>)
$$ ##END=
$$ 
$$ hash MD5
$$ D6 AC 6F EF 55 8B 83 7C B3 F3 7B 43 16 D5 5D 03
##$RELAX= 
##$RELAX= 
##$RELAX= 
##$RELAX= 
##$RELAX= 
##$RELAX= 
##$RELAX= 
$$ Bruker specific parameters
$$ --------------------------
##$DU= <C:\u>
##$EXPNO= 120
##$NAME= <ADRS>
##$PROCNO= 1
##$TYPE= <nmr>
##$USER= <dgb>
##$AMP= (0..31)
100 100 100 100 100 100 100 100 100 100 100 100 100 100 100 100 100 100 
100 100 100 100 100 100 100 100 100 100 100 100 100 100 
##$AQSEQ= 0
##$AQ_mod= 3
##$AUNM= <au_zg>
##$AUTOPOS= <6 >
##$BF1= 250.13
##$BF2= 250.13
##$BF3= 250.13
##$BF4= 250.13
##$BF5= 500.13
##$BF6= 500.13
##$BF7= 500.13
##$BF8= 500.13
##$BYTORDA= 1
##$CFDGTYP= 0
##$CFRGTYP= 5
##$CHEMSTR= <none>
##$CNST= (0..31)
1 1 145 1 1 1 1 1 1 1 1 1 1 1 1 1 1 1 1 1 1 1 1 1 1 1 1 1 1 1 1 1 
##$CPDPRG= <>
##$CPDPRG1= <>
##$CPDPRG2= <>
##$CPDPRG3= <>
##$CPDPRG4= <mlev>
##$CPDPRG5= <mlev>
##$CPDPRG6= <mlev>
##$CPDPRG7= <mlev>
##$CPDPRG8= <mlev>
##$CPDPRGB= <>
##$CPDPRGT= <>
##$D= (0..31)
0 1 0 0 0 0 0 0 0 0.06 0 0 0 0 0 0 0.0002 0 0 0 0 0 0 0 0 0 0 0 0 0 0 
0 
##$DATE= 1154593555
##$DBL= (0..7)
120 120 120 120 120 120 120 120 
##$DBP= (0..7)
150 150 150 150 150 150 150 150 
##$DBP07= 0
##$DBPNAM0= <>
##$DBPNAM1= <>
##$DBPNAM2= <>
$$ [...]
##$SUBNAM7= <"">
##$SUBNAM8= <"">
##$SUBNAM9= <"">
##$SW= 20.6930455092707
##$SWIBOX= (0..15)
0 0 3 0 0 0 0 0 0 0 0 0 0 0 0 0 
##$SW_h= 5175.983436853
##$TD= 65536
##$TD0= 1
##$TE= 295.16
##$TE2= 300
##$TE3= 300
##$TEG= 300
##$TL= (0..7)
0 120 120 120 120 120 120 120 
##$TP= (0..7)
150 150 150 150 150 150 150 150 
##$TP07= 0
##$TPNAME0= <>
##$TPNAME1= <>
##$TPNAME2= <>
##$TPNAME3= <>
##$TPNAME4= <>
##$TPNAME5= <>
##$TPNAME6= <>
##$TPNAME7= <>
##$TPOAL= (0..7)
0.5 0.5 0.5 0.5 0.5 0.5 0.5 0.5 
##$TPOFFS= (0..7)
0 0 0 0 0 0 0 0 
##$TUNHIN= 0
##$TUNHOUT= 0
##$TUNXOUT= 0
##$USERA1= <user>
##$USERA2= <user>
##$USERA3= <user>
##$USERA4= <user>
##$USERA5= <user>
##$V9= 5
##$VALIST= <valist>
##$VCLIST= <CCCCCCCCCCCCCCC>
##$VD= 0
##$VDLIST= <DDDDDDDDDDDDDDD>
##$VPLIST= <PPPPPPPPPPPPPPP>
##$VTLIST= <TTTTTTTTTTTTTTT>
##$WBST= 1024
##$WBSW= 4
##$XGAIN= (0..3)
0 0 0 0 
##$XL= 0
##$YL= 0
##$YMAX_a= 537970
##$YMIN_a= -562258
##$ZGOPTNS= <>
##$ZL1= 120
##$ZL2= 120
##$ZL3= 120
##$ZL4= 120
##$ABSF1= 16.522
##$ABSF2= -4.171173
##$ABSG= 5
##$ABSL= 3
##$ALPHA= 0
##$AQORDER= 0
##$ASSFAC= 0
##$ASSFACI= 0
##$ASSFACX= 0
##$ASSWID= 0
##$AUNMP= <proc_1d>
##$AZFE= 0.1
##$AZFW= 0.1
##$BCFW= 0
##$BC_mod= 0
##$BYTORDP= 0
##$COROFFS= 0
##$CY= 12.5
##$DATMOD= 1
##$DC= 0
##$DFILT= <>
##$DTYPP= 0
##$F1P= 14.0000005364418
##$F2P= -0.99999901652339
##$FCOR= 0.5
##$FTSIZE= 32768
##$FT_mod= 6
##$GAMMA= 0
##$GB= 0
##$INTBC= 1
##$INTSCL= 1
##$ISEN= 128
##$LB= 0.3
##$LEV0= 0
##$LPBIN= 0
##$MAXI= 10000
##$MC2= 0
##$MEAN= 0
##$ME_mod= 0
##$MI= 0
##$NCOEF= 0
##$NC_proc= -4
##$NLEV= 6
##$NOISF1= 0
##$NOISF2= 0
##$NSP= 0
##$NTH_PI= 0
##$NZP= 0
##$OFFSET= 16.522
##$PC= 1
##$PHC0= 139.8325
##$PHC1= 8.162535
##$PH_mod= 1
##$PKNL= yes
##$PPARMOD= 0
##$PSCAL= 4
##$PSIGN= 0
##$REVERSE= no
##$SF= 250.13
##$SI= 32768
##$SIGF1= 0
##$SIGF2= 0
##$SINO= 400
##$SIOLD= 32768
##$SREGLST= <1H.CDCl3>
##$SSB= 0
##$STSI= 32768
##$STSR= 0
##$SW_p= 5175.98343685301
##$SYMM= 0
##$S_DEV= 0
##$TDeff= 65536
##$TDoff= 0
##$TI= <Analysis number 999999
Compound Code 99
Book Reference 9
Project Code 9>
##$TILT= no
##$TM1= 0
##$TM2= 0
##$TOPLEV= 0
##$USERP1= <user>
##$USERP2= <user>
##$USERP3= <user>
##$USERP4= <user>
##$USERP5= <user>
##$WDW= 1
##$XDIM= 32768
##$YMAX_p= 365813198
##$YMIN_p= -213765
$$ End of Bruker specific parameters
$$ ---------------------------------
##NTUPLES= NMR SPECTRUM
##VAR_NAME=  FREQUENCY,     SPECTRUM/REAL,   SPECTRUM/IMAG
##SYMBOL=    X,             R,               I
##VAR_TYPE=  INDEPENDENT,   DEPENDENT,       DEPENDENT
##VAR_FORM=  AFFN,          ASDF,            ASDF
##VAR_DIM=   32768,         32768,           32768
##UNITS=     HZ,            ARBITRARY UNITS, ARBITRARY UNITS
##FACTOR=    0.157963299565203, 1,           1
##FIRST=     4132.6476996994, 0,             0
##LAST=      -1043.33573715361, 0,           0
##MIN=       -1043.33573715361, -213765,     0
##MAX=       4132.6476996994, 365813198,     0
$$ Real data points
##PAGE= N=1
##DATA TABLE= (X++(R..R)), XYDATA
$$ [...]
$$ plain form
18289 101697 35578 -35809 -40706 -35719 -27732 -19398 32412 53826 64319 79375 65806 -16739
18277 -16739 -29587 -28919 -75728 -91273 -59281 -52159 -49167 4041 32932 20236 15972 26929 9457
18264 9457 -15970 8936 2015 11230 81541 78729 22662 46343 68836 29987 16504 5404
18252 5404 -42753 -27725 -4988 -25490 10733 1649 43397 98515 146201 102974 87579 66581
18240 66581 76781 67313 103352 119040 177309 184243 146891 92808 87842 74747 69685 92244
18228 92244 80265 45337 88970 64354 36590 108850 105514 104089 70074 56604 66938 60901
18216 60901 15748 26152 29138 54038 81212 61098 77874 33059 -32475 10999 26245 2053
18204 2053 -5334 34496 57816 8765 -34967 -42267 -40684 -39648 20058 8301 36845 89005 71330
$$ packed form
18289A01697o6119p1387m897M987P987Q334N1810K1414J0493J5056j3569q2545
18277a6739j2848O68m6809j5545L1992P122K992N3208K8891j2696m264J0957j7472
18264I457k5427K4906o921R215P0311k812n6067K3681K2493l8849j3483j1100
18252E404m8157J5028K2737k0502L6223r084M1748N5118M7686m3227j5395k0998
18240F6581J0200r468L6039J5688N8269O934l7352n4083m966j3095n062K2559
18228I2244j1979l4928M3633k4616k7764P2260l336j425l4015j3470J0334o037
18216F0901m5153J0404K986K4900K7174k0114J6776m4815o5534M3474J5246k4192
18204B053p387L9830K3320m9051m3732p300J583J036N9706j1757K8544N2160j7675
$$ plain form
18191 71330 67720 107102 111740 110933 61666 37191 56459 85724 76608 75710 103680 102216 109811
18178 109811 95991 71850 91628 47375 -7022 6225 74141 151956 174546 150950 207601
18167 207601 262323 231933 139140 115435 123018 161335 165238 96884 130041 140498 99610 82981
18155 82981 79680 98471 156040 142992 153729 145438 120217 92281 107160 119351 111679 155135
18143 155135 210611 240016 208318 252680 346966 339608 357036 387941 409697 486384 550057 575833
18131 575833 553873 551343 576432 643662 694479 728183 769876 874131 1029863 1236566 1373803
18120 1373803 1525889 1751479 2020457 2300993 2620077 3088913 3720545 4675431 6069276
18111 6069276 8281587 12199685 19053668 29785365 41014951 46438190 47345879 47435925
$$ packed form
18191G1330l610L9382M638q07m9267k4475J9268K9265r116q98K7970j464P595
18178A09811j3820k4141J9778m4253n4397J3247O7916P7815K2590k3596N6651
18167B07601N4722l0390r2793k3705P583L8317L903o8354L3157J0457m0888j6629
18155H2981l301J8791N7569j3048J0737q291k5221k7936J4879J2191p672M3456
18143A55135N5476K9405l1698M4362R4286p358J7428L0905K1756P6687O3673K5776
18131E75833k1960k530K5089O7230N0817L3704M1693J04255J55732K06703J37237
18120A373803J52086K25590K68978K80536L19084M68836O31632R54886J393845
18111F069276K212311L918098O853983J0731697J1229586N423239R07689R0046
$$ plain form
18103 47435925 48280924 50123398 49185761 37799524 24042240 15897230 11660599 9208069
18095 9208069 7672525 6631282 5868466 5318062 4822764 4391894 4074068 3853584 3599171
18086 3599171 3379384 3189771 3044145 2871800 2752332 2666622 2560267 2439791 2347578 2193377
18076 2193377 2014187 1964478 1882083 1826660 1795640 1753289 1680483 1636215 1622875 1594658 1545748
18065 1545748 1481359 1392706 1340350 1274587 1195647 1197997 1091146 1045423 980426 928831 887849
18054 887849 907784 890931 829707 805983 774973 787252 824260 845524 887669 895170 870546 829695
18042 829695 788990 777574 764129 705802 660852 639770 609227 600718 592033 510072 472364 472471
18030 472471 422512 426652 411613 342525 282224 241314 223850 216944 245422 250899 250571 242040 261427
$$ packed form
18103D7435925Q44999J842474r37637j1386237j3757284q145010m236631k452530
18095I208069j535544j041243p62816n50404m95298m30870l17826k20484k54413
18086C599171k19787j89613j45626j72345j19468q5710j06355j20476r2213j54201
18076B193377j79190m9709q2395n5423l1020m2351p2806m4268j3340k8217m8910
18065A545748o4389q8653n2356o5763p8940K350j06851m5723o4997n1595m0982
18054H87849J9935j6853o1224k3724l1010J2279L7008K1264M2145P501k4624m0851
18042H29695m0705j1416j3445n8327m4950k1082l0543q509q685q1961l7708J07
18030D72471m9959M140j5039o9088o0301m0910j7464o906K8478N477l28q531J9387
$$ plain form
18017 261427 239939 229368 225782 214900 191757 200940 184080 241303 252431 249118 275656 242679
18005 242679 200924 159748 152813 208218 182100 170974 171935 213508 275432 287811 324409 280128
17993 280128 216622 170460 159157 228671 288041 243063 287708 334293 328686 311422 300606 305464
17981 305464 342966 401293 459307 462922 444648 516259 538610 492410 468622 434431 387686 336108
17969 336108 301918 296557 300763 222262 185471 151732 139664 114040 103744 165681 214582 164670
17957 164670 101195 61469 71758 49599 45316 99021 124923 73418 38063 12746 33581 37394
17945 37394 51830 121156 172988 151033 154090 175833 185705 194907 178631 140417 88332 90750
17933 90750 108787 75038 112996 96968 143317 187365 174695 148062 134188 203247 259456 224624
$$ packed form
18017B61427k1488j0571l586j0882k3143R183j6860N7223J1128l313K6538l2977
18005B42679m1755m1176o935N5405k6118j1126R61M1573O1924J2379L6598m4281
17993B80128o3506m6162j1303O9514N9370m4978M4645M6585n607j7264j0816M858
17981C05464L7502N8327N8014L615j8274P1611K2351m6200k3788l4191m6745n1578
17969C36108l4190n361M206p8501l6791l3739j2068k5624j0296O1937M8901m9912
17957A64670o3475l9726J0289k2159m283N3705K5902n1505l5355k5317K0835L813
17945C7394J4436O9326N1832k1955L057K1743R872R202j6276l8214n2085K418
17933I0750J8037l3749L7958j6028M6349M4048j2670k6633j3874O9059N6209l4832
$$ plain form
17921 224624 157601 142137 141164 159457 157413 142807 98866 94744 93793 56118 39029 83775 160226
17908 160226 141885 85964 44483 55588 81875 75859 69209 84743 91794 65802 43795 38430
17896 38430 23111 20423 29085 19705 -32887 -95 55111 28516 -8674 -13706 -26685 -28862 -27769
17883 -27769 -36455 -50698 -49044 -24081 27354 9444 17980 -28390 -74581 -78465 -49853 -46453 -52448
17870 -52448 -29547 -25507 16487 38076 16219 96952 99598 47235 8402 4593 11526 13608 -10602
17857 -10602 13200 42803 31860 32098 73884 56040 2128 -28927 -34622 -53918 -21641 -14170
17845 -14170 -4025 2942 4179 -7767 -4203 6045 -5157 -20039 11054 -15820 -34504 -47855
17833 -47855 -48882 4206 -7592 7679 42180 27268 -18159 -46364 -39409 -56595 -61886 -4420
$$ packed form
17921B24624o7023j5464r73J8293k044j4606m3941m122r51l7675j7089M4746P6451
17908A60226j8341n5921m1481J1105K6287o016o650J5534P051k5992k2007n365
17896C8430j5319k688Q662r380n2592L2792N5206k6595l7190n032j2979k177J093
17883b7769q686j4243J654K4963N1435j7910Q536m6370m6191l884K8612L400n995
17870e2448K2901M040M1994K1589k1857Q0733K646n2363l8833l809O933K082k4210
17857a0602K3802K9603j0943K38M1786j7844n3912l1055n695j9296L2277P471
17845a4170J0145O967J237j1946L564J0248j1202j4882L1093k6874j8684j3351
17833d7855j027N3088j1798J5271L4501j4912m5427k8205O955j7186n291N7466
$$ plain form
17821 -4420 2241 -51067 -75063 -80933 -92090 -117222 -70832 -35332 3174 5818 17418 -4372
17809 -4372 -12506 -41202 -4102 -10595 -24957 -32260 48499 45818 30656 46325 74030 98292 75718
17796 75718 33403 45787 45773 14943 -3226 7032 8402 29650 26977 -24286 -57136 -79231 -86042
17783 -86042 -85163 -68365 -9612 12356 -11121 -35967 -68270 -61133 -12358 -3582 31323 -8250
17771 -8250 -38061 -53158 -33273 -14563 1911 40830 61795 54987 1058 5288 34410 21888
17759 21888 -48395 -46357 23951 18918 -30617 -39126 -67647 -47469 12185 55046 39068 49849
17747 49849 59572 15448 -57118 -50826 -29248 21565 63742 36351 8273 31510 8550 -61786
17735 -61786 -72203 -14201 -17964 -31420 -30428 19507 25573 41608 48424 -30353 -66017 -41895 20983
$$ packed form
17821d420O661n3308k3996n870j1157k5132M6390L5500L8506K644J1600k1790
17809d372q134k8696L7100o493j4362p303Q0759k681j5162J5669K7705K4262k2574
17796G5718m2315J2384j4l0830j8169J0258J370K1248k673n1263l2850k2095o811
17783h6042Q79J6798N8753K1968k3477k4846l2303P137M8775Q776L4905l9573
17771h250k9811j5097J9885J8710J6474L8919K0965o808n3929M230K9122j2522
17759B1888p0283K038P0308n033m9535q509k8521K0178N9654M2861j5978J0781
17747D9849R723m4124p2566O292K1578N0813M2177k7391k8078K3237k2960p0336
17735f1786j0417N8002l763j3456R92M9935O066J6035O816p8777l5664K4122O2878
$$ plain form
17722 20983 46054 -33699 -37099 -12885 -54575 -35855 -14968 -32293 -96244 -66555 3197 -51126
17710 -51126 -89812 -58054 -30876 -32536 -35592 -44404 -48331 -433 37053 -3338 52473 37915
17698 37915 54339 14551 -13527 26667 67968 113888 77537 81519 15565 -23898 -43895 -60358
17686 -60358 -50900 -12558 -6570 -42719 -66012 -90090 -99924 -108893 -40046 -21831 -26435 25310 80484
17673 80484 54895 59940 76796 79372 89449 95971 108403 91027 105100 189011 257682 329398
17661 329398 372764 475760 546253 622853 568683 503756 450035 430205 440373 355407 293019
17650 293019 188576 129829 91926 58571 88302 103924 83958 67293 57546 58933 49344 46788
17638 46788 2630 -1791 3010 37420 68080 18887 -26592 -5356 22784 -17040 -12899 28229
$$ packed form
17722B0983K5071p9753l400K4214m1690J8720K0887j7325o3951K9689O9752n4323
17710e1126l8686L1758K7178j660l056q812l927M7898L7486m0391N5811j4558
17698C7915J6424l9788k8078M0194M1301M5920l6351L982o5954l9463j9997j6463
17686f0358R458L8342N988l6149k3293k4078r834q969O8847J8215m604N1745N5174
17673H0484k5589N045J6856K576J0077O522J2432j7376J4073Q3911O8671P1716
17661C29398M3366J02996P0493P6600n4170o4927n3721j9830J0168q4966o2388
17650B93019j04443n8747l7903l3355K9731J5622j9966j6665r747J387r589k556
17638D6788m4158m421M801L4410L0660m9193m5479K1236K8140l9824M141M1128
$$ plain form
17626 28229 25632 16243 37615 71660 84840 63483 35607 -7616 21559 -39015 -66550 -40854
17614 -40854 -3714 96862 126040 123597 119982 100080 99304 109528 158760 200868 297828 311170
17602 311170 343814 376453 467481 531486 537347 521931 494466 504778 508968 427418 302060 216255
17590 216255 144940 124998 167307 169461 126499 97245 160134 179715 126180 39879 7541 63064
17578 63064 112727 84917 63380 46720 21699 39412 60306 97594 65439 34420 58492 65833
17566 65833 44455 14496 -5785 -38839 -16055 -8237 -29846 -1523 6505 -18557 7972 10602
17554 10602 -12750 -24014 -17024 37220 19712 26557 60018 54347 64914 74287 96327 104770 95528
17541 95528 102560 100488 64800 -25312 -63898 -53122 -46876 -43923 -58188 -111363 -124593 -87329
$$ packed form
17626B8229k597r389K1372L4045J3180k1357k7876m3223K9175o0574k7535K5696
17614d0854L7140J00576K9178k443l615j9902p76J0224M9232M2108R6960J3342
17602C11170L2644L2639R1028O4005N861j5416k7465J0312M190q1550j25358q5805
17590B16255p1315j9942M2309K154m2962k9254O2889J9581n3535q6301l2338N5523
17578F3064M9663k7810k1537j6660k5021J7713K0894L7288l2155l1019K4072P341
17566F5833k1378k9959k0281l3054K2784P818k1609K8323Q028k5062K6529K630
17554A0602k3352j1264O990N4244j7508O845L3461n671J0567R373K2040Q443r242
17541I5528P032k072l5688r0112l8586J0776O246K953j4265n3175j3230L7264
$$ plain form
17529 -87329 -66607 10293 72550 74877 70937 63887 41712 21755 -12043 -42458 -52171 -19739
17517 -19739 8161 9992 30948 56791 58926 21979 9382 36799 23186 -43150 -78717 -63164
17505 -63164 -40052 -20772 -41122 -80774 -78709 1276 64963 26684 17891 25540 4062 -22970
17493 -22970 23143 23865 15446 20211 62028 48137 40799 70138 50003 -6221 5025 -19540 -58663
17480 -58663 -30612 -40083 -3243 34180 48119 84325 75108 34598 49425 41802 -4954 29949
17468 29949 -631 -41817 5767 39869 10444 4676 39129 74051 48695 51055 48378 18169
17456 18169 867 39627 48673 21838 16879 10724 35878 73485 78550 62615 53264 63441 128772
17443 128772 141217 184100 232990 286421 317083 315968 218330 195691 261731 249611 197858 140712
$$ packed form
17529h7329K0722P6900O2257K327l940p050k2175j9957l3798l0415r713L2432
17517a9739K7900J831K0956K5843K135l6947j2597K7417j3613o6336l5567J5553
17505f3164K3112J9280k0350l9652K065P9985O3687l8279q793P649k1478k7032
17493b2970M6113P22q419M765M1817j3891p338K9339k0135n6224J1246k4565l9123
17480e8663K8051r471L6840L7423J3939L6206r217m0510J4827p623m6756L4903
17468B9949l0580m1186M7584L4102k9425n768L4453L4922k5356K360k677l0209
17456A8169j7302L8760R046k6835m959o155K5154L7607N065j5935r351J0177O5331
17443A28772J2445M2883M8890N3431L0662j115r7638k2639O6040j2120n1753n7146
$$ plain form
17431 140712 106215 111328 116610 76559 11306 52222 73837 77632 90702 70977 44148 72699
17419 72699 96398 95790 102321 116602 171376 209978 116729 54338 83715 58661 -1683 -26411
17407 -26411 3288 35198 34190 -17392 -67354 -56501 -36105 -26850 2773 20322 56116 112476
17395 112476 150689 146822 176960 199092 123726 82341 35949 8642 33920 148668 149836 58555
17383 58555 41591 95834 138816 153063 154536 109189 110061 91485 22767 58896 89590 109554
17371 109554 84708 37211 47258 62739 58900 6105 14342 70447 118561 110372 78678 95443
17359 95443 86268 88978 137126 134900 81590 112243 103976 78765 94181 101975 78460 74566 48563
17346 48563 36486 59307 7105 19236 62595 83017 96951 106145 87379 92517 78225 74687
$$ packed form
17431A40712l4497N113N282m0051o5253M0916K1615L795J3070j9725k6829K8551
17419G2699K3699o08O531J4281N4774L8602r3249o2391K9377k5054o0344k4728
17407b6411K9699L1910j008n1582m9962J0853K0396R255K9623J7549L5794N6360
17395A12476L8213l867L0138K2132p5366m1385m6392k7307K5278J14748J168r1281
17383E8555j6964N4243M2982J4247J473m5347Q72j8576o8718L6129L0694J9964
17371A09554k4846m7497J0047J5481l839n2795Q237N6105M8114q189l1694J6765
17359I5443r175K710M8148k226n3310L0653q267k5211J5416P794k3515l894k6003
17346D8563j2077K2821n2202J2131M3359K0422J3934R194j8766N138j4292l538
$$ plain form
17334 74687 90337 52046 26067 67546 89358 56602 78408 77665 111465 87147 35733 18101
17322 18101 23958 11082 45034 156848 186980 202198 188650 206989 148076 143607 134588 95318
17310 95318 122569 125814 159002 208165 197226 162232 165210 165101 181803 126984 117081 163282 209763
17297 209763 169671 222221 223778 172685 168461 178447 148818 140679 127028 174219 158330 184968
17285 184968 177881 185765 159590 130208 168224 148522 97838 107543 99857 81320 68385 106913
17273 106913 97660 114155 181061 213218 214124 224930 237149 250143 294610 314436 283235 249481
17261 249481 210037 220517 269259 335672 350292 328883 325238 357366 356122 330884 289514 301674
17249 301674 251799 206266 195873 203323 191607 271474 276925 250861 263977 281680 299559 312847
$$ packed form
17334G4687J5650l8291k5979M1479K1812l2756K1806p43L3800k4318n1414j7632
17322A8101N857j2876L3952J11814L0132J5218j3548J8339n8913m469r019l9270
17310I5318K7251L245L3188M9163j0939l4994K978j09J6702n4819r903M6201M6481
17297B09763m0092N2550J557n1093m224R986k9629q139j3651M7191j5889K6638
17285A84968p087P884k6175k9382L8016j9702n0684R705p686j8537j2935L8528
17273A06913r253J6495O6906L2157R06J0806J2219J2994M4467J9826l1201l3754
17261B49481l9444J0480M8742O6413J4620k1409l645L2128j244k5238m1370J2160
17249C01674m9875m5533j0393P450j1716P9867N451k6064J3116J7703J7879J3288
$$ plain form
17237 312847 290873 248553 221654 225437 221756 262231 287747 270458 262503 268384 298921 336129
17225 336129 354189 372802 343982 330612 334164 305086 318225 344514 373514 380460 383493 370155
17213 370155 336276 325402 365472 373468 378889 482868 582547 588285 569769 549951 612739 639595
17201 639595 657072 691403 670414 654842 665623 683456 695920 700325 702615 645817 636000 641712
17189 641712 643840 677731 666007 710812 729826 740553 732609 711303 722229 697366 714691 766416
17177 766416 814308 832999 909775 958190 1026461 1092499 1197479 1216169 1283070 1414719 1539310
17166 1539310 1682291 1845400 2087437 2263424 2458325 2708913 2948302 3121593 3288126
17157 3288126 3486157 3773281 4043553 4354459 4685311 5185167 5935615 6825161 7984408
$$ packed form
17237C12847k1974m2320k6899L783l681M0475K5516j7289p955N881L0537L7208
17225C36129J8060J8613k8820j3370L552k9078J3139K6289K9000O946L033j3338
17213C70155l3879j0874M0070P996N421J03979R9679N738j8516j9818O2788K6856
17201F39595J7477L4331k0989j5572J0781J7833J2464M405K290n6798r817N712
17189F41712K128L3891j1724M4805J9014J0727p944k1306J0926k4863J7325N1725
17177G66416M7892J8691P6776M8415O8271O6038J04980J8690O6901J31649J24591
17166A539310J42981J63109K42037J75987J94901K50588K39389J73291J66533
17157C288126J98031K87124K70272L10906L30852M99856P50448Q89546J159247
$$ plain form
17148 7984408 9521644 11622772 14565721 18948442 25583097 35102820 47220476 60107412
17140 60107412 71883215 82774226 93959723 104870356 112310970 112874404 106343065 96598191
17132 96598191 87244055 77904989 66219883 52693418 40489581 31474355 25355058 21201037
17124 21201037 18260082 16097550 14466271 13177403 12143659 11380540 10745542 10192113
17116 10192113 9714323 9338577 9003811 8713709 8509338 8274563 8031742 7794213 7641360
17107 7641360 7517862 7360827 7248555 7158498 7170935 7146351 7113334 7128884 7179903 7223408 7265971
17096 7265971 7350485 7535509 7748795 8073331 8570127 9200709 10063579 11253246 12967823
17087 12967823 15539931 19265844 24946420 33114349 43971333 56201772 67658633 77889435
$$ packed form
17148G984408J537236K101128K942949M382721O634655R519723J2117656J2886936
17140F0107412J1775803J0891011J1185497J0910633P440614N63434o531339r744874
17132I6598191r354136r339066j1685106j3526465j2203837r015226o119297m154021
17124B1201037k940955k162532j631279j288868j033744p63119o34998n53429
17116A0192113m77790l75746l34766k90102k04371k34775k42821k37529j52853
17107G641360j23498j57035j12272r0057J2437k4584l3017J5550N1019M3505M2563
17096G265971Q4514J85024K13286L24536M96796O30582Q62870J189667J714577
17087A2967823K572108L725913N680576Q167929J0856984J2230439J1456861J0230802
$$ plain form
17079 77889435 88132467 98557574 106618161 108904495 104086649 94846252 85356073 76551269
17071 76551269 66244101 53621332 41316536 31845615 25429560 21091742 18111285 15911531
17063 15911531 14308799 13043575 11974923 11082722 10409993 9860525 9387323 8982135 8622954
17054 8622954 8274680 7929386 7590308 7244648 6941503 6639634 6352251 6088911 5781368
17045 5781368 5546011 5366631 5167679 4984257 4818946 4660315 4442908 4248613 4090004
17036 4090004 3940531 3781597 3658170 3451528 3308737 3168816 3001783 2925454 2798683 2653782
17026 2653782 2594573 2465346 2370212 2297693 2240741 2176968 2107056 2005575 1839933 1760007 1764625
17015 1764625 1725862 1754390 1742736 1697923 1640481 1553660 1406927 1329048 1308131 1313333 1287431
$$ packed form
17079G7889435J0243032J0425107Q060587K286334m817846r240397r490179q804804
17071G6551269j0307168j2622769j2304796r470921o416055m337818k980457k199754
17063A5911531j602732j265224j068652q92201o72729n49468m73202m05188l59181
17054H622954l48274l45294l39078l45660l03145l01869k87383k63340l07543
17045E781368k35357j79380j98952j83422j65311j58631k17407j94295j58609
17036D090004j49473j58934j23427k06642j42791j39921j67033p6329j26771j44901
17026B653782n9209j29227r5134p2519n6952o3773o9912j01481j65642p9926M618
17015A764625l8763K8528j1654m4813n7442q6821j46733p7879k0917N202k5902
$$ plain form
17004 1287431 1228318 1195416 1123922 1066786 999120 964791 940138 924136 904418 880245 879418 858405
16992 858405 808376 783036 757396 680160 641464 638095 681337 706055 731566 741209 664090 558765
16980 558765 534551 571098 609117 586952 579202 577632 571650 521740 457634 487929 515067 493017
16968 493017 419564 384272 360934 356311 355127 401066 407930 365399 295394 273064 251886 257325
16956 257325 279789 302963 308350 296062 239432 229989 187148 175775 166738 123508 138346 163225
16944 163225 148847 101285 81932 127028 112289 89429 84465 106793 122942 114932 97181 109036
16932 109036 130164 113806 82907 83234 8525 28275 75468 113055 51417 21235 77539 51422
16920 51422 14003 61886 45060 1313 -4863 26906 43540 79344 69257 70137 51313 -15271
$$ packed form
17004A287431n9113l2902p1494n7136o7666l4329k4653j6002j9718k4173q27k1013
16992H58405n0029k5340k5640p7236l8696l369M3242K4718K5511R643p7119j05325
16980E58765k4214L6547L8019k2165p750j570n982m9910o4106L0295K7138k2050
16968D93017p3453l5292k3338m623j184M5939O864m2531p0005k2330k1178N439
16956B57325K2464K3174N387j2288n6630r443m2841j1373r037m3230J4838K4879
16944A63225j4378m7562j9353M5096j4739k2860m964K2328J6149q010j7751J1855
16932A09036K1128j6358l0899L27p4709J9750M7193L7587o1638l0182N6304k6117
16920E1422l7419M7883j6826m3747o176L1769J6634L5804j0087Q80j8824o6584
$$ plain form
16908 -15271 -2144 66757 104134 127950 113678 56116 5273 8728 42190 48846 63029 34763
16896 34763 46532 46343 22445 24565 26072 61797 114207 101119 111660 121853 107248 48875
16884 48875 17579 21880 27933 -3439 40871 57539 44379 45977 47007 21174 56663 92355
16872 92355 64395 83215 27777 -30452 -60224 -14940 10813 -48750 -64115 -59418 -89634 -68272
16860 -68272 -49706 -29231 8924 1736 -4352 26621 18234 15454 36778 41730 24855 13780 17208
16847 17208 -16426 -43741 8828 14005 1750 -11873 -5589 30152 52853 86943 118606 119375
16835 119375 83521 55415 24903 -23230 14054 28097 31202 23817 -11422 -41338 -76737 -55378
16823 -55378 7531 30311 58101 27931 22296 428 -35129 -40022 -67686 -52669 -46534 -10636
$$ packed form
16908a5271J3127O8901L7377K3816j4272n7562n0843L455L3462O656J4183k8266
16896C4763J1769j89k3898K120J507L5725N2410j3088J0541J0193j4605n8373
16884D8875l1296M301O053l1372M4310J6668j3160J598J030k5833L5489L5692
16872I2355k7960J8820n5438n8229k9772M5284K5753n9563j5365M697l0216K1362
16860f8272J8566K0475L8155p188o088L0973q387k780K1324M952j6875j1075L428
16847A7208l3634k7315N2569N177j2255j3623O284L5741K2701L4090L1663P69
16835A19375l5854k8106l0512m8133L7284J4043L105p385l5239k9916l5399K1359
16823e5378O2909K2780K7790l0170n635k1868l5557m893k7664J5017O135L5898
$$ plain form
16811 -10636 3510 -8442 13543 -27161 -49328 -60065 -101418 -97177 -86517 -53595 -76013 -57335
16799 -57335 -8692 -24096 -59403 -90236 -90486 -47801 -44464 -36262 -33885 -54817 -50196 23268 67492
16786 67492 50502 -42 -3282 -20864 -38425 -6913 -28818 -2703 -46586 -99274 -67183 -36637
16774 -36637 -87798 -81242 -50191 -36805 1064 -21520 -61875 -72403 -94775 -94389 -71747 -76369
16762 -76369 -119164 -114127 -65933 29322 48879 -32007 -64857 -62373 -15627 -3800 34913 61786
16750 61786 36679 -4975 -2024 37167 14469 11620 9374 14882 -22854 -28495 -27730 -68883 -53934
16737 -53934 -52945 -86582 -53069 -21810 -484 25997 -10152 -55991 -51810 -79402 -75372 -34467
16725 -34467 2476 38563 65972 102941 3672 -79897 -124040 -127068 -162796 -110029 -81284 -47799
$$ packed form
16811a0636J4146j1952K1985m0704k2167j0737m1353M241J0660L2922k2418J8678
16799e7335M8643j5404l5307l0833k50M2685L337Q202K377k0932M621P3464M4224
16786F7492j6990n0544l240j7582j7561L1512k1905K6115m3883n2688L2091L0546
16774c6637n1161O556L1051J3386L7869k2584m0355j0528k2372L86K2642m622
16762g6369m2795N037M8194R5255J9557q0886l2850K484M6746J1827L8713K6873
16750F1786k5107m1654K951L9191k2698k849k246N508l7736n641P65m1153J4949
16737e3934R89l3637L3513L1259K1326K6481l6149m5839M181k7592M030M0905
16725c4467L6943L6087K7409L6969r9269q3569m4143l028l5728N2767K8745L3485
$$ plain form
16713 -47799 -100712 -95172 -70020 -9649 -2397 -55934 -31064 -35344 -40255 -104170 -146298 -88821
16701 -88821 1301 9439 -21414 -35678 12119 31001 45228 17438 -36475 -84147 -78691 -94807
16689 -94807 -89352 -53437 -42333 -26291 -10386 50390 71383 50849 39154 27800 -34647 -40655
16677 -40655 -20147 13310 22464 19648 51833 29557 2691 3804 2535 -2108 -80815 -164932 -164489
16664 -164489 -112150 -83561 -7457 -11214 -63362 -93384 -108145 -79393 -105269 -93476 -25346 -37892
16652 -37892 6770 -2015 -8469 -8685 -449 -954 18250 35094 26912 -19574 -52146 -45763 59285
16639 59285 71229 25665 1514 50326 69921 121039 60636 44977 67679 54863 47708 38991
16627 38991 -8252 -49013 -52527 -36883 -44524 1784 23272 84 55253 128700 184139 180184
$$ packed form
16713d7799n2913N540K5152O0371P252n3537K4870m280m911o3915m2128N7477
16701h8821R0122Q138l0853j4264M7797J8882J4227k7790n3913m7672N456j6116
16689i4807N455L5915J1104J6042J5905O0776K0993k0534j1695j1354o2447o008
16677d0655K0508L3457R154k816L2185k2276k6866J113j269m643p8707q4117M43
16664a64489N2339K8589P6104l757n2148l0022j4761K8752k5876J1793O8130j2546
16652c7892M4662q785o454k16Q236n05J9204J6844q182m6486l2572O383J05048
16639E9285J1944m5564k4151M8812J9595N1118o0403j5659K2702j2816p155q717
16627C8991m7243m0761l514J5644p641M6308K1488k3188N5169P3447N5439l955
$$ plain form
16615 180184 203777 258264 290809 309926 376081 496570 580052 557274 490348 388093 315731
16604 315731 310128 282167 226813 178703 154523 98533 147016 218471 126868 45478 56953 85252
16592 85252 140686 145770 104612 91070 131109 106827 74939 17712 58869 57592 92109 110443
16580 110443 61404 -8538 -35822 -30052 -47867 -78506 -55726 -101497 -95532 -74244 -88750 -39355
16568 -39355 -4743 -34999 -30417 -33599 -28275 -34406 -10868 14064 35905 75761 151610 212594
16556 212594 214858 222320 303299 317981 358091 405261 483142 510932 438567 369352 339150 289910
16544 289910 262901 231727 183257 119570 106010 98316 51179 19841 41227 68783 52099 63453
16532 63453 68766 100782 115401 61855 82750 112626 50887 31593 39789 65614 81922 77111
$$ packed form
16615A80184K3593N4487L2545J9117O6155J20489Q3482k2778o6926j02255p2362
16604C15731n603k7961n5354m8110k4180n5990M8483P1455r1603q1390J1475K8299
16592H5252N5434N084m1158j3542M0039k4282l1888n7227M1157j277L4517J8334
16580A10443m9039o9942k7284N770j7815l0639K2780m5771N965K1288j4506M9395
16568c9355L4612l0256M582l182N324o131K3538K4932K1841L9856P5849O0984
16556B12594K264P462Q0979J4682M0110M7170P7881K7790p2365o9215l0202m9240
16544B89910k7009l1174m8470o3687j3560p694m7137l1338K1386K7556j6684J1354
16532F3453N313L2016J4619n3546K0895K9876o1739j9294Q196K5825J6308m811
$$ plain form
16520 77111 53611 4075 25988 82441 31462 -27228 -24888 -5521 13192 -58075 -102470 -105191
16508 -105191 -113270 -86133 -39785 -85001 -114595 -148908 -141309 -103500 -36220 -20088 -27347 -13900
16496 -13900 2944 54102 60335 37561 -62594 -123521 -83817 -80558 -82159 -81722 231 42352
16484 42352 45501 33303 -17982 -104574 -127671 -99227 -99475 -98409 -45142 -2757 -586 20100 -2376
16471 -2376 -32709 -6025 69079 37311 -44379 -71548 -43316 -34043 -30361 23737 8843 -59389
16459 -59389 -44015 -18392 -22081 -9159 -49562 -102424 -91113 -74206 -7497 -45042 -27007 22468
16447 22468 20549 -25522 -30075 -24373 7473 -17124 25902 23530 -23827 20451 27252 -17669 -20138
16434 -20138 -30006 -106182 -117077 -60872 -35957 -6641 10978 -37211 -44962 -2731 16235 -16077
$$ packed form
16520G7111k3500m9536K1913N6453n0979n8690K340J9367J8713p1267m4395k721
16508a05191q079K7137M6348m5216k9594l4313P599L7809O7280J6132p259J3447
16496a3900J6844N1158O233k2774j00155o0927L9704L259j601M37Q1953M2121
16484D2352L149j2198n1285q6592k3097K8444k48J066N3267M2385K171K0686k2476
16471b376l0333K6684P5104l1768q1690k7169K8232R273L682N4098j4894o8232
16459e9389J5374K5623l689J2922m0403n2862J1311J6907O6709l7545J8035M9475
16447B2468j919m6071m553N702L1846k4597M3026k372m7357M4278O801m4921k469
16434b0138r868p6176j0895N6205K4915K9316J7619m8189p751M2231J8966l2312
$$ plain form
16422 -16077 -2423 17562 30883 35501 6112 -27758 -39968 31062 35235 9466 -35734 -85076
16410 -85076 -86154 -40859 -48388 -67527 -137559 -139516 -93992 -50186 -39700 -40393 -38274 -50952 -24902
16397 -24902 -13752 -33625 -17590 -6952 -48805 -141186 -134977 -82320 -42925 -38322 -68329 -74421
16385 -74421 -51150 -31711 -18251 -33903 -42812 -17456 35931 74852 35018 -4880 -70689 -88376
16373 -88376 -97777 -80933 -27159 -13086 17309 2472 -27492 -55501 -114706 -107693 -72162 -111357
16361 -111357 -152443 -112203 -71866 -64734 -98404 -105717 -76011 -137160 -132382 -67022 -6849 43475
16349 43475 44725 65591 65106 40425 -10551 -38523 -49650 -26481 51342 109094 73323 -9502
16337 -9502 -43457 -56115 -89604 -96708 -57802 -34396 -5719 -26455 -23221 -11538 9502 9370 -20036
$$ packed form
16422a6077J3654J9985J3321M618k9389l3870j2210P1030M173k5769m5200m9342
16410h5076j078M5295p529j9139p0032j957M5524M3806J0486o93K119j2678K6050
16397b4902J1150j9873J6035J0638m1853r2381O209N2657L9395M603l0007o092
16385g4421K3271J9439J3460j5652q909K5356N3387L8921l9834l9898o5809j7687
16373h8376r401J6844N3774J4073L0395j4837k9964k8009n9205P013L5531l9195
16361a11357m1086M0240M0337P132l3670p313K9706o1149M778O5360O0173N0324
16349D3475J250K0866m85k4681n0976k7972j1127K3169P7823N7752l5771q2825
16337i502l3955j2658l3489p104L8906K3406K8677k0736L234J1683K1040j32k9406
$$ plain form
16324 -20036 -21068 -49408 -52716 -34712 -14964 2240 -9193 5637 5289 -7283 26193 18402 -46857
16311 -46857 -71105 -81266 -107599 -159828 -105284 -100910 -84690 -76185 -40597 -6873 12740 7664
16299 7664 -41526 -164328 -172607 -101057 -99578 -99596 -58159 -19431 -37029 -53988 -11164 18360 32873
16286 32873 18886 25448 -10066 -56261 -54041 -45133 -16897 47734 -13768 -29969 9641 40358
16274 40358 23569 -2843 -13881 59135 91701 16191 -2286 -31566 -70330 2766 -14656 -56648
16262 -56648 -91297 -89363 -64063 -44886 -34642 -31753 -17997 -4452 -24797 -11455 16800 43047
16250 43047 79228 103552 106191 92974 115331 46770 -64663 -69724 -30728 -25604 -32568 -58989
16238 -58989 -96680 -113179 -105187 -71957 -67684 -79960 -114484 -114514 -68795 -57113 -43828 -17464 30296
$$ packed form
16324b0036j032k8340l308J8004J9748J7204j1433J4830l48j2572L3476p791o5259
16311d6857k4248j0161k6333n2229N4544M374J6220Q505L5588L3724J9613n076
16299G664m9190j22802q279P1550J479j8M1437L8728j7598j6959M2824K9524J4513
16286C2873j3987O562l5514m6195K220Q908K8236O4631o1502j6201L9610L0717
16274D0358j6789k6412j1038P3016L2566p5510j8477k9280l8764P3096j7422m1992
16262e6648l4649J934K5300J9177J0244K889J3756J3545k0345J3342K8255K6247
16250D3047L6181K4324K639j3217K2357o8561j11433n061L8996N124o964k6421
16238e8989l7691j6499P992L3230M273j2276l4524l0M5719J1682J3285K6364M7760
$$ plain form
16225 30296 19615 6822 -58057 -79693 -60605 -51284 -4480 -3930 -13913 5602 31406 13358
16213 13358 -1665 -24448 -53103 -73205 -57095 -67129 -138189 -123912 -49710 -74986 -77886 -91979
16201 -91979 -101997 -132940 -149884 -180635 -136407 -120602 -117479 -119909 -91126 -115980 -141462 -110149
16189 -110149 -95913 -83418 -91207 -84639 -58708 -29843 12819 -15005 -42003 -45069 -25705 -15757
16177 -15757 -28190 3200 -29311 -1759 42362 22221 30132 32384 12216 15143 51047 76126
16165 76126 53957 31576 43308 381 -55356 -39449 -5435 -12959 -6682 -22880 -38421 -80034
16153 -80034 -72793 -35758 -56774 -32486 -32636 -23622 -34641 -30088 -42953 -38995 6576 41002 26281
16140 26281 -18413 41697 58362 4625 -46525 -50836 -64290 -40468 -42369 -53133 -69112 -68521
$$ packed form
16225C0296j0681j2793o4879k1636J9088R321M6804N50r983J9515K5804j8048
16213A3358j5023k2783k8655k0102J6110j0034p1060J4277P4202k5276k900j4093
16201i1979j0018l0943j6944l0751M4228J5805L123k430K8783k4854k5482L1313
16189a10149J4236J2495p789O568K5931K8865M2662k7824k6998l066J9364R948
16177a5757j2433L1390l2511K7552M4121k0141P911K252k0168K927L5904K5079
16165G6126k2169k2381J1732m2927n5737J5907L4014p524O277j6198j5541m1613
16153h0034P241L7035k1016K4288j50R014j1019M553j2865L958M5571L4426j4721
16140B6281m4694O0110J6665n3737n1150m311j3454K3822j901j0764j5979N91
$$ plain form
16128 -68521 -32390 -45140 -105112 -35661 -57719 -69655 -44645 -52466 -118048 -122336 -92213 -57918
16116 -57918 -42617 -90589 -68504 -63226 -115211 -134403 -124523 -33153 -13672 5700 40038 15621
16104 15621 -33436 -57197 -39127 49 -9530 -3908 11336 -2052 -12563 -49139 -79556 -80914
16092 -80914 -80442 -78446 -60402 -12609 -41000 -74895 -106743 -137684 -171567 -151546 -82586 -41414
16080 -41414 -60475 -87497 -60879 -42172 -73762 -68194 -81392 -34882 3299 -34023 -92205 -60280
16068 -60280 -100504 -104852 -70923 -50146 -12112 -24270 972 10130 -21332 -36498 -6575 22890
16056 22890 22521 -16905 -42204 -37575 4336 -3904 -71423 -102216 -16692 8158 53035 69015
16044 69015 80289 44650 14940 -5378 -37466 -45816 -43375 -10625 16739 20695 -20170 -29534
$$ packed form
16128f8521L6131j2750n9972O9451k2058j1936K5010p821o5582m288L0123L4295
16116e7918J5301m7972K2085N278n1985j9192R880R1370J9481J9372L4338k4417
16104A5621m9057k3761J8070L9176r579N622J5244j3388j0511l6576l0417j358
16092h0914M72J996J8044M7793k8391l3895l1848l0941l3883K0021O8960M1172
16080d1414j9061k7022K6618J8707l1590N568j3198M6510L8181l7322n8182L1925
16068f0280m0224m348L3929K0777L8034j2158K5242R158l1462j5166K9923K9465
16056B2890l69l9426k5299M629M1911q240o7519l0793Q5524K4850M4877J5980
16044F9015J1274l5639k9710k0318l2088q350K441L2750K7364L956m0865r364
$$ plain form
16032 -29534 -10377 3050 -8061 -58470 -54556 -90019 -94580 -53501 7103 26971 4207 19877
16020 19877 15616 21422 -25045 -33290 -680 13675 -20654 25611 38010 84466 59894 -8202
16008 -8202 -14807 -19096 -54080 -83095 -91028 -64976 -65524 -40165 -82786 -61998 -70910 -82204 -63210
15995 -63210 -80003 -111701 -112564 -75635 -61897 -67246 -37983 13605 -6302 -71837 -24636 22998
15983 22998 52208 17988 56655 -7957 -50816 -20383 -62548 -77432 -21611 44241 57630 14829
15971 14829 -58047 -121333 -123125 -103872 -93221 -49931 -39595 -60540 -83610 -88411 -20372 32233
15959 32233 22695 39505 -646 -31571 -21701 19018 -6424 20845 29731 -7711 -9177 50147
15947 50147 13842 -13778 -30913 -43120 -42995 -23040 1978 -7311 6110 25773 19067 -76007
$$ packed form
16032b9534J9157J3427j1111n0409L914l5463m561M1079O0604J9868k2764J5670
16020A9877m261N806m6467q245L2610J4355l4329M6265J2399M6456k4572o8096
16008h202o605m289l4984k9015p933K6052n48K5359m2621K0788q912j1294J8994
15995f3210j6793l1698q63L6929J3738n349K9263N1588j9907o5535M7201M7634
15983B2998K9210l4220L8667o4612m2859L0433m2165j4884N5821O5852J3389m2801
15971A4829p2876o3286j792J9253J0651M3290J0336k0945k3070m801O8039N2605
15959C2233r538J6810m0151l0925R870M0719k5442K7269Q886l7442j466N9324
15947E0147l6305k7620j7135j2207J25J9955K5018r289J3421J9663o706r5074
$$ plain form
15935 -76007 -64018 -60782 -54677 -27895 25412 35282 42634 16971 2236 -42878 -75132 -75730 -61502
15922 -61502 -6448 -42925 -52074 24897 64347 5527 -6608 20794 55960 46327 21719 19382
15910 19382 10100 -20104 -213 5257 8600 -27033 -5842 57164 12971 -47142 -11638 -4798
15898 -4798 -28992 -14014 2677 -23310 -71444 -101627 -95969 -41434 11159 24352 -66108 -62368
15886 -62368 6360 31144 -20786 -48590 -21062 -23299 20317 6157 -2651 -45002 -91006 -68387
15874 -68387 -141634 -128967 -119254 -80047 -60034 -63945 -31335 -29437 -37974 -22564 -41547 -28645
15862 -28645 -65553 -100977 -117791 -41056 -12591 -21891 10198 -3608 -4325 -23755 -54092 -49239
15850 -49239 -28691 28819 49512 -16683 -53215 -66892 -108375 -82032 3794 26375 -1305 2731
$$ packed form
15935g6007J1989L236O105K6782N3307R870P352k5663j4735m5114l2254n98J4228
15922f1502N5054l6477r149P6971L9450n8820j2135K7402L5166r633k4608k337
15910A9382r282l0204J9891N470L343l5633K1191O3006m4193o0113L5504O840
15898d798k4194J4978J6691k5987m8134l0183N658N4535N2593J3193r0460L740
15886f2368O8728K4784n1930k7804K7528k237M3616j4160q808m2351m6004K2619
15874f8387p3247J2667R713L9207K0013l911L2610J898q537J5410j8983J2902
15862b8645l6908l5424j6814P6735K8465r300L2089j3806p17j9430l0337M853
15850d9239K0548N7510K0693o6195l6532j3677m1483K6343Q5826K2581k7680M036
$$ plain form
15838 2731 -3170 5298 -2702 -63137 -67444 -35536 -31677 -19590 -34349 -61591 -99484 -92570 -30601
15825 -30601 253 172 -23270 -24638 -37455 -22137 -36908 -26489 -44510 -73603 -94353 -79645
15813 -79645 -82812 -71207 -66347 -110417 -98226 -53598 -30693 -12760 2602 51087 29373 13374
15801 13374 -52523 -92067 -31773 15736 -6433 -38127 -34237 -8133 31065 5795 -16191 -47540
15789 -47540 -93871 -110791 -24185 13743 -4959 -35985 -13181 18463 -9124 -28190 -50340 -63757
15777 -63757 -50137 13884 -1322 8239 28762 -13767 -43212 -74897 -80607 -78857 -62381 -9804
15765 -9804 -8341 -36069 -70534 -23497 8728 -12912 -8222 -5813 -14658 -39600 -84975 -82121 -71049
15752 -71049 -80950 -86417 -121017 -58616 -34442 -35103 -38568 -27293 -44617 -58051 -32732 -52989 -82270
$$ packed form
15838B731n901Q468q000o0435m307L1908L859J2087j4759k7242l7893O914O1969
15825c0601L0854q1k3442j368j2817J5318j4771J0419j8021k9093k0750J4708
15813g9645l167J1605M860m4070J2191M4628K2905J7933J5362M8485k1714j5999
15801A3374o5897l9544O0294M7509k2169l1694L890K6104L9198k5270k1986l1349
15789d7540m6331j6920Q6606L7928j8702l1026K2804L1644k7587j9066k2150j3417
15777f3757J3620O4021j5206R561K0523m2529k9445l1685n710J750J6476N2577
15765i804J463k7728l4465M7037L2225k1640M690K409q845k4942m5375K854J1072
15752g1049r901n467l4600O2401K4174o61l465J1275j7324j3434K5319k0257k9281
$$ plain form
15739 -82270 -87797 -43295 4690 30425 -12310 -46273 -68215 -65554 -83604 -77200 -38489 18610
15727 18610 18462 -9663 -58691 -119362 -150174 -107283 -36348 937 16547 31293 2316 -8559
15715 -8559 7384 -29758 -59848 -81359 -34737 -1741 58458 929 -33802 -38618 -31380 -46526
15703 -46526 -82036 -76239 -18233 -26093 -22613 25589 2515 -2053 -25577 -18477 -29795 -66694 -57026
15690 -57026 -8608 1762 -6427 10287 22321 14418 -47486 -113424 -99202 -65552 -40684 -11238
15678 -11238 -27595 -35746 -23472 7699 -16121 4558 -26458 -65644 -102544 -90378 -135087 -116567
15666 -116567 -63526 -88683 -46175 -42493 -52347 -20679 -18789 -31807 -21685 24334 25243 -8681
15654 -8681 -37398 -53048 -62980 -77021 -25983 33059 50981 30132 -22118 -16085 13891 -24573
$$ packed form
15739h2270n527M4502M7985K5735m2735l3963k1942K661j8050O404L8711N7099
15727A8610j48k8125m9028o0671l0812M2891P0935L7285J5610J4746k8977j0875
15715h559J5943l7142l0090k1511M6622L2996O0199n7529l4731m816P238j5146
15703d6526l5510N797N8006p860L480M8202k3074m568k3524P100j1318l6899R668
15690e7026M8418J0370q189J6714J2034p903o1904o5938J4222L3650K4868K9446
15678a1238j6357q151J2274L1171k3820K0679l1016l9186l6900J2166m4709J8520
15666a16567N3041k5157M2508L682r854L1668J890j3018J0122M6019R09l3924
15654h681k8717j5650r932j4041N1038N9042J7922k0849n2250O033K9976l8464
$$ plain form
15642 -24573 -47481 -71899 -41588 -48356 -29490 4084 -664 -1379 4208 29416 17334 -23795 -43258
15629 -43258 -48562 -46697 -36994 -6589 60225 66048 -26181 -104523 -133322 -127226 -138958 -128944 -93272
15616 -93272 -69910 -43278 -94095 -114021 -107009 -48750 -72720 -59927 -69651 -74249 -54898 -51268
15604 -51268 1025 56168 97405 160737 129901 55760 58866 44781 -26320 -45543 -47508 -49781
15592 -49781 -27398 -12604 -750 39687 36219 -1868 -53929 -62889 -37911 -7939 -60327 -19716
15580 -19716 -1948 -50409 -107490 -83944 -14203 -36544 -46214 -39565 -30648 -28578 -1180 28388
15568 28388 30672 -46390 -101715 -60096 -48216 -91877 -32272 6873 27405 911 -49610 -7816
15556 -7816 -25268 -85251 -102149 -65373 -36772 2504 -4413 -9303 -75876 -50627 23654 6134
$$ packed form
15642b4573k2908k4418L0311o768J8866L3574m748p15N587K5208j2082m1129j9463
15629d3258n304J865R703L0405O6814N823r2229p8342k8799O096j1732J0014L5672
15616i3272K3362K6632n0817j9926P012N8259k3970J2793r724m598J9351L630
15604e1268N2293N5143M1237O3332l0836p4141L106j4085p1101j9223j965k273
15592d9781K2383J4794J1854M0437l468l8087n2061q960K4978K9972n2388M0611
15580a9716J7768m8461n7081K3546O9741k2341r670O649Q917K070K7398K9568
15568B8388K284p7062n5325M1619J1880m3661N9605L9145K0532k6494n0521M1794
15556g816j7452n9983j6898L6776K8601L9276o917m890o6573K5249P4281j7520
$$ plain form
15544 6134 -72642 -79095 -33145 -55084 -62135 -79115 -126625 -113014 -73754 -82784 -53375 5522
15532 5522 7204 28118 18713 -39555 -71543 -123243 -76673 -41411 -70715 -88475 -32266 -32178 -54973
15519 -54973 -56501 -89818 -88223 -66456 -44954 -66028 -50111 -53449 -47698 -41708 -28872 -13286 -40553
15506 -40553 -54099 -47591 -77755 -106665 -115945 -108968 -122525 -66490 -42355 -19839 -45015 -86666
15494 -86666 -23768 41063 21500 -10226 -30721 -18547 15982 -35233 -33372 -19386 -23365 -40517
15482 -40517 -31366 -4499 -3296 3670 -4203 9618 38217 45594 10310 -858 -7061 23570 63729
15469 63729 31007 7584 -1048 -11163 -7146 -28859 -40111 -26717 9349 33815 26172 51311
15457 51311 53644 24225 1099 -7482 21310 27117 -15165 -30976 -56548 -23976 1953 14323
$$ packed form
15544F134p8776o453M5950k1939p051j6980m7510J3611L9260r030K9409N8897
15532E522J682K0914r405n8268l1988n1700M6570L5262k9304j7760N6209Q8k2795
15519e4973j528l3317J595K1767K1502k1074J5917l338N751N990J2836J5586k7267
15506d0553j3546O508l0164k8910r280O977j3557N6035K4135K2516k5176m1651
15494h6666O2898O4831j9563l1726k0495J2174L4529n1215J861J3986l979j7152
15482d0517R151K6867J203O966p873J3821K8599P377l5284j1168o203L0631M0159
15469F3729l2722k3423q632j0115M017k1713j1252J3394L6066K4466p643K5139
15457E1311K333k9419k3126q581K8792N807m2282j5811k5572L2572K5929J2370
$$ plain form
15445 14323 42994 58345 27722 53129 61326 39591 2912 1132 3800 3160 -55298 -46554 -27173
15432 -27173 -56430 -39601 -88353 -90429 -75213 -99934 -78575 -78790 -102535 -75798 -12927 3856
15420 3856 -13127 -24365 -71177 -29998 41903 36100 52364 11983 -30509 -62024 -27572 -4809
15408 -4809 26144 5467 -35542 -16687 667 -980 4407 -30264 -12871 13220 37171 1300
15396 1300 -35445 -14306 34920 63844 62461 21376 -16566 -19940 -27204 -17693 10249 -7159 -13749
15383 -13749 -26331 -47757 24952 69313 28401 38739 91946 29038 -50979 -97198 -131948 -109161
15371 -109161 -96339 -121301 -114712 -83168 -43806 -31522 10318 25968 -22971 -28708 4051 16387
15359 16387 -37353 -90568 -35721 -34679 -66638 -31338 15844 21094 76048 97874 82828 21129
$$ packed form
15445A4323K8671J5351l0623K5407Q197k1735l6679j780K668o40n8458Q744J9381
15432b7173k9257J6829m8752k076J5216k4721K1359k15k3745K6737O2871J6783
15420C856j6983j1238m6812M1179P1901n803J6264m0381m2492l1515L4452K2763
15408d809L0953k0677m1009J8855J7354j647N387l4671J7393K6091K3951l5871
15396A300l6745K1139M9226K8924j383m1085l7942l374p264R511K7942j7408o590
15383a3749j2582k1426P2709M4361m0912J0338N3207o2908q0017m6219l4750K2787
15371a09161J2822k4962O589L1544L9362J2284M1840J5650m8939n737L2759J2336
15359A6387n3740n3215N4847J042l1959L5300M7182N250N4954K1826j5046o1699
$$ plain form
15347 21129 9036 26362 61940 55499 -9264 -87172 -64588 -30402 -9458 -35846 883 17357
15335 17357 -33065 -52162 -40945 -66586 -59296 33562 34979 -6191 2999 48646 64197 10975
15323 10975 -30729 -53000 -80410 -67662 -48214 7294 9533 13773 29501 37513 46273 -4067
15311 -4067 -31703 -24492 -34525 -44430 -56222 -88637 -151523 -108569 -66593 -69052 -24535 -32119 7177
15298 7177 22579 75052 76736 62429 57134 33207 -7327 -32963 -11905 -14235 -20498 -72205 -81988
15285 -81988 -37730 14088 22097 28902 11915 -4356 1811 38698 26881 2263 10120 33700
15273 33700 52500 31776 3508 31895 52912 88400 66192 32633 -1113 10835 19553 -8446
15261 -8446 -5120 9470 28304 -35821 -70602 -88034 -94993 -92326 -49102 33859 55180 68579
$$ packed form
15347B1129j2093J7326L5578o441o4763p7908K2584L4186K0944k6388L6729J6474
15335A7357n0422j9097J1217k5641P290R2858J417m1170R190M5647J5551n3222
15323A0975m1704k2271k7410J2748J9448N5508K239M240J5728Q012Q760n0340
15311d067k7636P211j0033r905j1792l2415o2886M2954M1976k459M4517p584L9296
15298G177J5402N2473J684j4307n295k3927m0534k5636K1058k330o263n1707r783
15285h1988M4258N1818Q009O805j6987j6271O167L6887j1817k4618P857K3580
15273C3700J8800k0724k8268K8387K1017L5488k2208l3559l3746J1948Q718k7999
15261h446L326J4590J8834o4125l4781j7432o959K667M3224Q2961K1321J3399
$$ plain form
15249 68579 81296 74500 54125 57643 12291 -30040 -21617 2591 -13793 14358 13086 8377 -15618
15236 -15618 -62666 -59815 -76888 -44664 -59270 -70256 -13473 18862 32778 47693 59066 40085
15224 40085 -12933 -46655 -77439 -44460 -62443 -57569 -110146 -125340 -140413 -140125 -71427 -49460
15212 -49460 -42055 -41357 -36649 24949 52067 94880 42941 -73248 -132632 -82793 -63731 -25026
15200 -25026 -9185 -47390 -18670 -17650 -62271 -87590 -32508 26555 36911 51630 25443 12367
15188 12367 6259 45652 55745 -6928 34758 62334 53531 62187 74131 27956 -3840 -33336
15176 -33336 -28496 623 20087 38345 65279 37078 -6663 -30134 -8501 4252 287 -26056
15164 -26056 9813 48821 68358 56053 -25132 -18674 -55409 -78980 -44841 -28401 -47343 -64937
$$ packed form
15249F8579J2717o796k0375L518m5352m2331Q423K4208j6384K8151j272m709k3995
15236a5618m7048K851j7073L2224j4606j0986N6783L2335J3916J4915J1373j8981
15224D0085n3018l3722l0784L2979j7983M874n2577j5194j5073K88O8698K1967
15212d9460P405O98M708O1598K7118M2813n1939j16189n9384M9839J9062L8705
15200b5026J5841l8205K8720J020m4621k5319N5082N9063J0356J4719k6187j3076
15188A2367o108L9393J0093o2673M1686K7576q803Q656J1944m6175l1796k9496
15176c3336M840K9119J9464J8258K6934k8201m3741k3471K1633J2753l965k6343
15164b6056L5869L9008J9537j2305q1185O458l6735k3571L4139J6440j8942j7594
$$ plain form
15152 -64937 -69170 -80213 -99288 -83131 -91956 -45235 -12221 6842 -11289 52322 55775 -11240
15140 -11240 -28259 19364 13020 -21913 -12153 16460 16755 16579 29838 -11850 -11240 46997 61519
15127 61519 72377 76844 52794 99566 104530 32319 -33631 -51921 -19583 13097 22123 -26070
15115 -26070 -45084 -25642 -20123 2617 -12047 -36048 37211 54483 7834 -29829 -49756 -39900
15103 -39900 -652 20088 -5093 -66732 -108855 -118976 -100680 -33491 481 -28449 3340 57841
15091 57841 46288 8907 -31294 -27698 -12980 -12631 23089 19893 9434 1762 8056 -29190 -78876
15078 -78876 -80697 -69797 -69723 -77434 -99957 -119945 -108948 -85310 -43229 -25122 -30986 -22024 36532
15065 36532 33627 24824 -2427 24171 35127 33222 54604 71715 30053 42743 74334 52737
$$ packed form
15152f4937m233j1043j9075J6157q825M6721L3014J9063j8131O3611L453o7015
15140a1240j7019M7623o344l4933R760K8613K95j76J3259m1688O10N8237J4522
15127F1519J0858M467k4050M6772M964p2211o5950j8290L2338L2680R026m8193
15115b6070j9014J9442N519K2740j4664k4001P3259J7272m6649l7663j9927R856
15103c9900L9248K0740k5181o1639m2123j0121J8296O7189L3972k8930L1789N4501
15091E7841j1553l7381m0201L596J4718L49L5720l196j0459p672O294l7246m9686
15078g8876j821J0900P4p711k2523j9988J0997K3638M2081J8107n864Q962N8556
15065C6532k905q803k7251K6598J0956j905K1382J7111m1662J2690L1591k1597
$$ plain form
15053 52737 -2896 -30268 -29847 5273 -2725 -52564 -81977 -72705 -93608 -78678 -27388 49003
15041 49003 9183 -3858 -17908 -12532 -44782 -42063 -16902 -18546 -50527 -33559 -21392 -3627
15029 -3627 -40442 -50793 -61536 -77992 -88831 -93916 -116844 -148819 -137637 -66143 -51912 -27539
15017 -27539 -88839 -72553 -24122 -45850 -16478 -4453 30564 1247 1637 24333 26117 -23416
15005 -23416 -18638 -32898 -77603 -108115 -113702 -26735 76706 75600 31693 44688 1097 9121
14993 9121 93155 100532 136889 99532 78071 75104 71397 76787 97961 60277 -19903 -65891 -46725
14980 -46725 12338 55478 47603 60019 63006 21959 32428 2970 -9877 -52383 -79538 -72789
14968 -72789 -71168 -78319 -14533 12790 10808 20343 23470 -19769 11642 -35719 -41286 -44165 -41194
$$ packed form
15053E2737n5633k7372M21L5120p998m9839k9413R272k0903J4930N1290P6391
15041D9003l9820j3041j4050N376l2250K719K5161j644l1981J6968J2167J7765
15029c627l6815j0351j0743j6456j0839n085k2928l1975J1182P1494J4231K4373
15017b7539o1300J6286M8431k1728K9372J2025L5017k9317L90K2696J784m9533
15005b3416M778j4260m4705l0512n587Q6967J03441j106m3907J2995m3591Q024
14993I121Q4034P377L6357l7357k1461k967l707N390K1174l7684q0180m5988J9166
14980d6725N9063M3140p875J2416K987m1047J0469k9458j2847m2506k7155O749
14968g2789J621p151O3786K7323j982R535L127m3239L1411m7361n567k879K971
$$ plain form
14955 -41194 -59066 -57455 -55769 -106988 -55286 -54342 -56198 -29441 -52245 -69183 -21989 -45874 -82247
14942 -82247 -110707 -39842 -28408 -26912 35939 76450 22155 -49326 -92026 -60429 13 -187
14930 -187 -28771 -29822 -19595 18777 32284 25009 -30424 -4359 9640 -15588 4802 10290 -9287
14917 -9287 10851 30442 9076 -33275 -53336 -70681 -75344 -87647 -53266 -47026 -105118 -115540
14905 -115540 -105813 -57835 -60408 -25381 -1333 -37026 -62319 5595 21019 51760 79543 87156
14893 87156 29907 17941 31982 48020 92195 119624 35445 -16366 -18914 -38490 -13515 27723
14881 27723 24834 45237 -1369 -46031 -64513 -68022 -21154 18712 3840 -36145 -53823 -52682
14869 -52682 -65090 -66047 -17858 -27908 -40542 -57893 -87127 -17885 47855 49687 34592 16915
$$ packed form
14955d1194j7872J611J686n1219N1702R44j856K6757k2804j6938M7194k3885l6373
14942h2247k8460P0865J1434J496O2851M0511n4295p1481m2700L1597O0442k00
14930a87k8584j051J0227L8372J3507p275n5433K6065J3999k5228K0390N488j9577
14917i287K0138J9591k1366m2351k0061j7345m663j2303L4381O240n8092j0422
14905a15540R727M7978k573L5027K4048l5693k5293O7914J5424L0741K7783P613
14893H7156n7249j1966J4041J6038M4175K7429q4179n1811k548j9576K4975M1238
14881B7723k889K0403m6606m4662j8482l509M6868L9866j4872l9985j7678J141
14869e2682j2408r57M8189j0050j2634j7351k9234O9242O5740J832j5095j7677
$$ plain form
14857 16915 22755 17369 63768 65697 9441 5309 -4668 -38311 -40509 1475 28787 52827 19570
14844 19570 48147 15528 -20269 -17785 -12748 -19477 -75268 -28592 -44571 -70740 -39305 20652
14832 20652 18071 4209 50293 50571 16642 1408 -9660 11758 9835 31773 7808 -29208
14820 -29208 -11092 -45707 -72126 -56428 -58717 -44599 -105641 -117291 -94340 -13212 32200 45057
14808 45057 71219 75598 57982 9892 -14841 -19258 -10254 -19081 -30770 -21296 -5039 -47170 -25911
14795 -25911 19133 31425 16664 -20638 -14033 39382 62572 77185 2429 -14110 14878 27369
14783 27369 -13605 -28152 22671 -12629 -15180 5924 18236 38460 26203 32681 94743 118562
14771 118562 60237 -1719 17862 -1973 -24731 -39305 -8435 30314 10711 4053 -14009 9894
$$ packed form
14857A6915N840n386M6399J929n6256m132r977l3643k198M1984K7312K4040l3257
14844A9570K8577l2619l5797K484N037o729n5791M6676j5979k6169L1435N9957
14832B0652k581j3862M6084K78l3929j5234j1068K1418j923K1938k3965l7016
14820b9208J8116l4615k6419J5698k289J4118o1042j1650K2951Q1128M5412J2857
14808D5057K6162M379j7616m8090k4733m417R004q827j1689R474J6257m2131K1259
14795b5911M5044J2292j4761l7302O605N3415K3190J4613p4756j6539K8988J2491
14783B7369m0974j4547N0823l5300k551K1104J2312K0224j2257O478O2062K3819
14771A18562n8325o1956J9581j9835k2758j4574L0870L8749j9603o658j8062K3903
$$ plain form
14759 9894 28353 67872 62679 18110 19073 16994 73898 76569 70320 70181 54785 23349 654
14746 654 17546 -24882 -36629 -15815 1422 -6731 44498 91473 119594 113874 47419 7864
14734 7864 20957 47349 49532 60521 -13821 -13655 18928 34230 22321 18197 37396 42778 23417
14721 23417 -15923 -36967 -1577 9639 28446 -13629 2690 -5754 -10036 22117 26009 42754
14709 42754 -24044 -55402 -8345 40870 32554 -31825 -54872 -16829 49991 41226 23142 72557
14697 72557 42984 -17582 29957 8567 -4190 -19679 -44250 -63543 -35950 -27695 -8277 -17760
14685 -17760 -34467 -24237 -38323 -44858 -51172 -35487 12662 37855 84397 88825 88010 50763 -5530
14672 -5530 79 38986 48371 43528 21996 -2492 22931 42531 26092 13097 29102 13277
$$ packed form
14759I894J8459L9519n193m4569R63k079N6904K671o249j39j5396l1436k2695
14746F54J6892m2428j1747K0814J7237q153N1229M6975K8121n720o6455l9555
14734G864J3093K6392K183J0989p4342J66L2583J5302j1909m124J9199N382j9361
14721B3417l9340k1044L5390J1216J8807m2075J6319q444m282L2153L892J6745
14709D2754o6798l1358M7057M9215q316o4379k3047L8043O6820q765j8084M9415
14697G2557k9573o0566M7539k1390j2757j5489k4571j9293K7593Q255J9418r483
14685a7760j6707J0230j4086o535o314J5685M8149K5193M6542M428q15l7247n6293
14672e530N609L8907R385m843k1532k4488K5423J9600j6439j2995J6005j5825
$$ plain form
14660 13277 -14290 -1508 -43556 -93779 -87436 -90414 -90505 -37353 -24113 -61399 -24082 38001 32791
14647 32791 50030 36232 43182 -14518 -26388 -22372 6860 26823 44010 34829 -1715 -43180
14635 -43180 -2358 -3512 6068 55018 34777 9075 -21743 -28635 18134 -6979 -46520 -26187
14623 -26187 56613 17660 -21582 -9712 25924 21017 65139 52042 -34509 -84302 -54141 -20505
14611 -20505 576 52128 71592 58790 62866 78447 82869 90673 20239 19186 10274 -29821 -14333
14598 -14333 -9885 -3283 2016 -5070 -5034 13286 22991 8733 1025 -25200 -17274 -29750 -52876 -71856
14584 -71856 -68769 -79803 -107322 -112466 -45777 -18403 -28949 -3791 -6819 -62792 -104780 -74562
14572 -74562 -80943 -33781 -48445 -80781 -103840 -113988 -70305 -48752 -34237 -52537 -52656 -99838
$$ packed form
14660A3277k7567J2782m2048n0223O343k978r1N3152J3240l7286L7317O2083n210
14647C2791J7239j3798O950n7700j1870M016K9232J9963J7187r181l6544m1465
14635d3180M0822j154R580M8950k0241k5702l0818o892M6769k5113l9541K0333
14623b6187Q2800l8953l9242J1870L5636m907M4122j3097q6551m9793L0161L3636
14611b0505K1081N1552J9464j2802M076J5581M422P804p0434j053q912m0095J5488
14598a4333M448O602N299p086L6J8320R705j4258p708k6225P926j2476k3126j8980
14584g1856L087j1034k7519n144O6689K7374j0546K5158l028n5973m1988L0218
14572g4562o381M7162j4664l2336k3059j0148M3683K1553J4515j8300j19m7182
$$ plain form
14560 -99838 -110295 -101198 -67389 -29535 -18959 -22502 -27956 -426 -8966 25463 8521 2490 -29908
14547 -29908 -31658 -8194 18363 64100 73069 -17205 -37365 -47221 -52825 -64381 -48036 11975
14535 11975 6573 -4819 -5666 24329 35307 26207 7533 39905 41780 50244 53719 -8926 -54955
14522 -54955 -92227 -90298 -71599 -56118 -67383 -6223 2664 -41619 -62983 -61604 -5758 3220
14510 3220 -27654 -19400 -2042 37749 78759 81290 85056 48710 -36266 -34684 -45180 -24520 13425
14497 13425 22768 42920 31707 28994 -3073 -36421 -3470 23455 81474 81422 74352 52784 4755
14484 4755 -24869 2677 35530 29534 -11134 -13038 -37557 24332 15655 43777 104463 16887
14472 16887 -34503 -69369 -58341 -52696 -39905 784 11668 59332 93637 51237 -2231 -5284
$$ packed form
14560i9838j0457R097L3809L7854J0576l543n454K7530q540L4429j6942o031l2398
14547b9908j750K3464K6557M5737Q969r0274k0160r856n604j1556J6345O0011
14535A1975n402j1392q47K9995J0978r100j8674L2372J875Q464L475o2645m6029
14522e4955l7272J929J8699J5481j1265O1160Q887m4283k1364J379N5846Q978
14510C220l0874Q254J7358L9791M1010K531L766l6346q4976J582j0496K0660L7945
14497A3425R343K0152j1213k713l2067l3348L2951K6925N8019n2p070k1568m8029
14484D755k9624K7546L2853n996m0668j904k4519O1889q677K8122O0686q7576
14472A6887n1390l4866J1028N645J2791M0689J0884M7664L4305m2400n3468l053
$$ plain form
14460 -5284 -9936 -23640 13910 -27178 -53424 5472 56012 69455 84462 104499 158786 148155
14448 148155 77579 21053 42141 75715 88805 55144 16751 -78756 -108773 -31780 -16389
14437 -16389 -76063 -83430 -22136 16193 17616 10648 -7079 -20361 -35492 -20646 -61875 -62203 -85660
14424 -85660 -104038 -83150 -49226 13017 70786 45963 -8604 -20127 -15984 11020 40797 11757
14412 11757 15941 16158 36023 45485 26699 27963 48153 48838 68336 65137 61309 71402 93544
14399 93544 62447 -16205 -19550 -66825 -139307 -122977 -97877 -42515 -2781 49267 86039 8549
14387 8549 -10535 21458 39853 39851 21163 22100 47790 45180 49341 73224 56161 21839 824
14374 824 -60917 -45171 -2716 20589 35749 51245 37359 9554 8737 27620 31857 915 22375
$$ packed form
14460e284m652j3704L7550m1088k6246N8896N0540J3443J5007K0037N4287j0631
14448A48155p0576n6526K1088L3574J3090l3661l8393r5507l0017P6993J5391
14437a6389n9674p367O1294L8329J423o968j7727j3282j5131J4846m1229l28k3457
14424h5660j8378K0888L3924O2243N7769k4823n4567j1523M143K7004K9777k9040
14412A1757M184K17J9865R462j8786J264K0190O85J9498l199l828J0093K2142
14399I3544l1097p8652l345m7275p2482J6330K5100N5362L9734N2048L6772p7490
14387H549j9084L1993J8395kj8688R37K5690k610M161K3883j7063l4322k1015
14374H24o1741J5746M2455K3305J5160J5496j3886k7805q17J8883M237l0942K1460
$$ plain form
14361 22375 59735 74297 11267 -19240 2624 17361 -15945 -94673 -18052 22638 12003 -1985
14349 -1985 -9666 -40725 -51631 -6444 29903 29304 -15816 -20989 -5097 54483 69143 69489 60082
14336 60082 71708 43140 3065 24151 44050 104249 133466 72700 33755 62182 47213 68346
14324 68346 58990 -666 1723 -33435 -39191 -7693 -55882 -73430 -28095 8149 16487 -16065
14312 -16065 -28849 33096 21207 -46487 -12099 36617 62449 74733 52892 -5818 -9416 -20915
14300 -20915 20354 -19285 -45451 -10665 -8693 -13940 50990 -5136 -10808 -10407 -35887 -18620 -6806
14287 -6806 -11890 11687 44031 65378 50320 -11038 -3346 -15176 52343 50112 2182 20675
14275 20675 15907 39868 92198 83348 71345 37237 22542 60619 124175 103536 69752 35993
$$ packed form
14361B2375L7360J4562o3030l0507K1864J4737l3306p8728P6621M0690j0635j3988
14349a985p681l1059j0906M5187L6347n99m5120n173J5892N9580J4660L46r407
14336F0082J1626k8568m0075K1086J9899O0199K9217o0766l8945K8427j4969K1133
14324F8346r356n9656K389l5158n756L1498m8189j7548M5335L6244Q338l2552
14312a6065j2784O1945j1889o7694L4388M8716K5832J2284k1841n8710l598j1499
14300b0915M1269l9639k6166L4786J972n247O4930n6126n672M01k5480J7267J1814
14287f806n084K3577L2344K1347j5058o1358P692j1830O7519k231m7930J8493
14275B0675m768K3961N2330q850j2003l4108j4695L8077O3556k0639l3784l3759
$$ plain form
14263 35993 76454 119748 87378 64227 4660 -12342 10364 40169 73172 69493 42069 -21090
14251 -21090 -77251 -45860 -38049 -43020 -91626 -103724 -55227 -6468 23109 19381 9626 -6215
14239 -6215 -37401 -30491 -15735 -47872 -60039 5812 52170 60219 47938 35720 57234 112026
14227 112026 92773 62802 9423 10675 -29856 -61899 -26544 -274 68487 98000 101943 62503
14215 62503 10783 -31566 37908 63448 86892 54413 23654 21448 47803 55943 -2935 8284
14203 8284 4114 -25646 -1840 61457 91506 98813 69805 56802 43682 -37641 -60152 -30178
14191 -30178 29957 52607 65901 71009 39685 16178 63876 121216 116214 70437 101540 83046
14179 83046 36793 26384 32369 -7230 25231 100113 83650 21891 -19687 -27759 -60623 -76711
$$ packed form
14263C5993M0461M3294l2370k3151n9567j7002K2706K9805L3003l679k7424o3159
14251b1090n6161L1391P811m971m8606j2098M8497M8759K9577l728r755j5841
14239f215l1186O910J4756l2137j2167O5851M6358Q049j2281j2218K1514N4792
14227A12026j9253k9971n3379J252m0531l2043L5355K6270O8761K9513L943l9440
14215F2503n1720m2349O9474K5540K3444l2479l0759k206K6355Q140n8878J1219
14203H284m170k9760K3806O3297L0049P307k9008j3003j3120q1323k2511K9974
14191c0178O0135K2650J3294N108l1324k3507M7698N7340n002m5777L1103j8494
14179H3046m6253j0409N985l9599L2461P4882j6463o1759m1578q072l2864j6088
$$ plain form
14167 -76711 -70744 -66391 -60696 19045 64163 22588 6341 4563 -32610 -32035 -7693 25933 111284
14154 111284 144904 109982 56503 31455 732 -34985 -8096 77293 45973 27656 17789 10464
14142 10464 28625 72332 46632 -11578 -36173 -41853 -91289 -129007 -90779 -21591 -23954 -24178
14130 -24178 39391 41700 -16564 -19129 -35966 -19344 12067 74893 51442 -49806 -78538 -99407
14118 -99407 -80654 -39597 -5152 -6020 25245 81279 134092 54211 5966 23367 41412 67375
14106 67375 62541 39845 43092 77971 79354 83044 57356 20363 813 -7863 3790 15246 -745
14093 -745 -24687 38008 74803 84294 64853 60684 49213 -6082 -13089 7583 29102 59057 69376
14080 69376 64575 33772 16647 -8054 20256 26979 60287 90156 78159 96914 105941 102014
$$ packed form
14167g6711N967M353N695P9741M5118m1575j6247j778l7173N75K4342L3626Q5351
14154A11284L3620l4922n3479k5048l0723l5717K6889Q5389l1320j8317r867p325
14142A0464J8161M3707k5700n8210k4595n680m9436l7718L8228O9188k363k24
14130b4178O3569K309n8264k565j6837J6622L1411O2826k3451j01248k8732k0869
14118i9407J8753M1057L4445q68L1265N6034N2813p9881m8245J7401J8045K5963
14106F7375m834k2696L247L4879J383L690k5688l6993j9550q676J1653J1456j5991
14093g45k3942O2695L6795R491j9441m169j1471n5295p007K0672K1519K9955J0319
14080F9376m801l0803j7125k4701K8310O723L3308K9869j1997J8755R027l927
$$ plain form
14068 102014 89346 56731 71182 84105 48062 26621 50820 101450 100997 69862 19467 -8978
14056 -8978 52550 46395 39045 58215 48500 28755 59564 126426 175012 106944 90269 98004 107876
14043 107876 74484 11236 -13069 16971 -7803 -31077 -36122 15571 30438 -633 -3342 28853
14031 28853 46108 45667 42177 42617 33245 40189 27456 -85459 -107719 -105714 -82081 -48569 8567
14018 8567 49183 65107 46772 39951 48608 34878 41191 10661 46792 102096 51636 42424 40731
14005 40731 44297 111965 96332 58377 67917 65054 115477 124515 86398 64533 98213 59751
13993 59751 28969 33172 11498 39822 78648 9944 8699 29083 -7141 14009 37836 -21407
13981 -21407 10236 45329 -1957 -33102 -36369 -11306 27704 -1501 -2065 -12516 -61 19146
$$ packed form
14068A02014j2668l2615J4451J2923l6043k1441K4199N0630m53l1135n0395k8445
14056h978O1528o155p350J9170r715j9745L0809O6862M8586o8068j6675P735R872
14043A07876l3392o3248k4305L0040k4774k3274n045N1693J4867l1071k709L2195
14031B8853J7255m41l490M40r372O944j2733j12915k2260K005K3633L3512N7136
14018H567M0616J5924j8335o821Q657j3730O313l0530L6131N5304n0460r212j693
14005D0731L566O7668j5633l7955R540k863N0423R038l8117k1865L3680l8462
13993E9751l0782M203k1674K8324L8826o8704j245K0384l6224K1150K3827n9243
13981b1407L1643L5093m7286l1145l267K5063L9010k9205n64j0451J2455J9207
$$ plain form
13969 19146 20806 -31006 -45418 -28357 -51572 -32305 944 -405 19688 70596 99461 56895
13957 56895 -18134 -27685 -34494 -46541 -11567 -57018 -67072 -78872 -87383 -50830 -51815 12191 28801
13944 28801 -70525 -146652 -132433 -65442 -32638 -49005 9611 56730 90361 68571 100797 91153
13932 91153 34548 8354 37912 43546 75718 117769 109797 133572 85035 68115 104014 133337
13920 133337 127231 117946 66679 -10979 -3104 48583 32952 47200 26894 23010 77407 49229
13908 49229 28353 39655 30365 -6437 -6475 5354 25161 59887 54557 58397 54189 41146 51467
13895 51467 110069 98584 44514 -5167 34497 47859 34078 43888 47121 49437 65608 81405
13883 81405 46087 49291 22787 23184 53816 86420 103657 70296 -12647 50434 128222 131964
$$ packed form
13969A9146J660n1812j4412J7061k3215J9267L3249j349K0093N0908K8865m2566
13957E6895p5029r551o809j2047L4974m5451j0054j1800q511L6553r85O4006J6610
13944B8801r9326p6127J4219O6991L2804j6367N8616M7119L3631k1790L2226r644
13932I1153n6605k6194K9558N634L2172M2051p972K3775m8537j6920L5899K9323
13920A33337o106r285n1267p7658P875N1687j5631J4248k0306l884N4397k8178
13908D9229k0876J1302r290l6802l8J1829J9807L4726n330L840m208j3043J0321
13895E1467N8602j1485n4070m9681L9664J3362j3781R810L233K316J6171J5797
13883H1405l5318L204k6504L97L0632L2604J7237l3361q2943O3081P7788L742
$$ plain form
13871 131964 108188 100450 69297 53744 120757 102064 56287 66184 62206 40699 44538 19899
13859 19899 30085 18643 5186 4324 1642 -6053 -66828 -45603 -619 83837 85977 79736 51451
13846 51451 23194 -15163 10333 20562 66980 58300 25694 30315 61342 84176 100846 81340
13834 81340 60893 108560 57789 44848 74494 146209 114448 80868 43648 44457 47005 40404
13822 40404 -49811 -84307 -52525 21286 12662 32719 46524 1287 -58833 -71469 -46200 -25687
13810 -25687 -20821 48261 107092 103761 86310 74174 96562 111017 138744 122370 90299 30932
13798 30932 9039 5021 33809 48720 64520 126396 157047 135422 119258 144746 118874 122273
13786 122273 116798 85301 35398 35845 80661 111249 143150 135450 86588 42791 33554 97083
$$ packed form
13871A31964k3776p738l1153j5553O7013j8693m5777R897l978k1507L839k4639
13859A9899J0186j1442j3457q62k682p695o0775K1225M4984Q4456K140o241k8285
13846E1451k8257l8357K5496J0229M6418q680l2606M621L1027K2834J6670j9506
13834H1340k0447M7667n0771j2941K9646P1715l1761l3580l7220Q09K548o601
13822D0404r0215l4496L1782P3811q624K0057J3805m5237o0120j2636K5269K0513
13810b5687M866O9082N8831l331j7451j2136K2388J4455K7727j6374l2071n9367
13798C0932k1893m018K8788J4911J5800O1876L0651k1625j6164K5488k5872L399
13786A22273n475l1497m9903M47M4816L0588L1901p700m8862m3797r237O3529
$$ plain form
13774 97083 118757 16024 30558 6136 415 44797 71263 62009 86192 70714 92642 36110
13762 36110 18269 -33244 -47506 -15358 19025 77634 25393 1329 29187 38573 30371 41767
13750 41767 62954 35333 19928 7392 44970 103034 94453 96016 67294 30189 13635 2074
13738 2074 -26386 -30434 30308 80696 27345 -15930 2274 37668 12999 -17578 -25386 -37191
13726 -37191 -31767 492 39665 70342 59547 46759 39596 24303 38400 -10681 -10087 37788
13714 37788 61111 38637 -16340 -44335 -21434 35684 92724 105660 111934 87977 98445 108314
13702 108314 106104 71014 64413 67692 75367 62006 38549 34508 60869 35894 24398 19872 81101
13689 81101 40052 -25075 -49210 16236 89985 65895 60411 46574 -6628 320 12527 56250
$$ packed form
13774I7083K1674j02733J4534k4422n721M4382K6466r254K4183j5478K1928n6532
13762C6110j7841n1513j4262L2148L4383N8609n2241k4064K7858R386q202J1396
13750D1767K1187k7621j5405j2536L7578N8064q581J563k8722l7105j6554j1561
13738B074k8460m048O0742N0388n3351m3275J8204L5394k4669l0577p808j1805
13726c7191N424L2259L9173L0677j0795j2788p163j5293J4097m9081N94M7875
13714C7788K3323k2474n4977k7995K2901N7118N7040J2936O274k3957J0468R869
13702A08314k210l5090o601L279P675j3361k3457m041K6361k4975j1496m526O1229
13689H1101m1049o5127k4135O5446P3749k4090n484j3837n3202O948J2207M3723
$$ plain form
13677 56250 97920 120860 122165 154800 119920 48922 39275 57088 45762 2746 -5076 -67232
13665 -67232 -43350 -20548 26781 60300 78234 45903 48878 83950 73553 57734 61340 38406
13653 38406 73471 102379 115076 130794 126187 81174 111736 146313 125753 172947 175693 119397
13641 119397 104442 109143 90212 131454 140566 75085 83673 87175 71877 20105 44513 86896
13629 86896 66882 42128 39397 106077 88923 46080 57521 110555 83008 -7626 15113 28098
13617 28098 15689 22967 18185 73163 98438 73788 95090 157942 200949 156602 114171 69603
13605 69603 25587 18658 463 40078 52240 47339 33044 27217 38488 7646 -4454 24827
13593 24827 36679 92889 69248 68453 124170 112675 94043 81441 66231 6844 39023 35061
$$ packed form
13677E6250M1670K2940J305L2635l4880p0998r647J7813j1326m3016p822o2156
13665f7232K3882K2802M7329L3519J7934l2331K975L5072j0397j5819L606k2934
13653C8406L5065K8908J2697J5718m607m5013L0562L4577k0560M7194K746n6296
13641A19397j4955M701j8931M1242R112o5481Q588L502j5298n1772K4408M2383
13629H6896k0014k4754k731O6680j7154m2843J1441N3034k7547r0634K2739J2985
13617B8098j2409P278m782N4978K5275k4650K1302O2852M3007m4347m2431m4568
13605F9603m4016o929j8195L9615J2162m901j4295n827J1271l0842j2100K9281
13593B4827J1852N6210k3641p95N5717j1495j8632j2602j5210n9387L2179l962
$$ plain form
13581 35061 36300 73371 87024 77421 94188 90856 87498 50637 77595 141788 142098 77547 76000
13568 76000 116655 131769 105282 63516 59569 46096 63523 62323 69649 56194 75764 77539
13556 77539 12672 -42441 18086 79975 85062 46310 35281 13423 19732 66953 76566 103200
13544 103200 66164 55775 74199 68884 111602 162813 200845 211072 133649 97330 47012 10564
13532 10564 12395 22496 49142 93464 135853 93130 8987 -10728 -8506 8413 64376 37725
13520 37725 66621 65218 33335 45404 25258 -12367 -4608 20746 85542 137651 120303 37622
13508 37622 -8726 12619 80489 53581 48981 64217 80535 109086 86622 76668 57959 32954
13496 32954 82079 152834 190945 215661 227520 221738 183829 98736 35412 41545 102591 131224
$$ packed form
13581C5061J239L7071J3653r603J6767l332l358l6861K6958O4193L10o4551j547
13568G6000M0655J5114k6487m1766l947j3473J7427j200P326j3455J9570J775
13556G7539o4867n5113O0527O1889N087l8752j1029k1858O309M7221R613K6634
13544A03200l7036j0389J8424n315M2718N1211L8032J0227p7423l6319n0318l6448
13532A0564J831J0101K6646M4322M2389m2723q4143j9715K222J6919N5963k6651
13520C7725K8896j403l1883J2069k0146l7625P759K5354O4796N2109j7348q2681
13508C7622m6348K1345O7870k6908m600J5236J6318K8551k2464r954j8709k5005
13496C2954M9125P0755L8111K4716J1859n782l7909q5093o3324O133O1046K8633
$$ plain form
13484 131224 72636 101923 146503 116491 119066 133728 125780 134745 114816 71238 54676 101936
13472 101936 96887 72367 71121 88569 94856 75624 55080 41532 31147 44105 64448 94288
13460 94288 103472 117339 111325 80309 95894 110935 91740 80261 96584 104339 104763 104088 142389
13447 142389 129697 93649 143042 139562 107959 123159 109248 98933 119516 105370 73367 81337
13435 81337 55816 67676 101363 113690 112837 70968 70182 56203 62921 93869 149270 154406 143611
13422 143611 152706 125534 90341 77699 54440 83530 102535 82244 86643 78481 92051 145389
13410 145389 151524 176455 187776 121177 95076 118925 129832 129454 85398 79855 72606 121645
13398 121645 138523 91629 77229 94490 117741 97792 132372 175018 129519 98062 94003 119536
$$ packed form
13484A31224n8588K9287M4580l0012K575J4662p948Q965j9929m3578j6562M7260
13472A01936n049k4520j246J7448O287j9232k0544j3548j0385J2958K0343K9840
13460I4288R184J3867o014l1016J5585J5041j9195j1479J6323P755M24o75L8301
13447A42389j2692l6048M9393l480l1603J5200j3911j0315K0583j4146l2003P970
13435H1337k5521J1860L3687J2327q53m1869p86j3979O718L0948N5401N136j0795
13422A43611R095k7172l5193j2642k3259K9090J9005k0291M399q162J3570N3338
13410A45389O135K4931J1321o6599k6101K3849J0907l78m4056n543p249M9039
13398A21645J6878m6894j4400J7261K3251j9949L4580M2646m5499l1457m059K5533
$$ plain form
13386 119536 133366 126496 68233 46046 70220 61438 48761 94240 79776 81233 50356 99874
13374 99874 48130 9439 47723 76180 36131 60405 62784 50343 124444 147378 189346 243546
13362 243546 144925 124568 123582 120592 109497 139448 186557 193091 188925 177417 215222 222843 154762
13349 154762 157917 148535 91029 114688 148318 112361 99177 123240 126543 150796 174150 211273
13337 211273 228472 142830 106741 131526 153921 175717 193946 149852 176085 199770 196626 172866
13325 172866 175643 191858 184234 159921 127599 97733 102976 189516 256832 309590 286954 256567
13313 256567 226989 243300 212154 166998 148264 144846 154526 200053 223105 202820 201640 214978
13301 214978 188915 132879 159657 178243 179712 199902 184071 179379 159318 128452 124135 153200
$$ packed form
13386A19536J3830o870n8263k2187K4174q782j2677M5479j4464J457l0877M9518
13374I9874n1744l8691L8284K8457m0049K4274K379j2441P4101K2934M1968N4200
13362B43546r8621k0357r86k990j1095K9951M7109O534m166j1508L7805P621o8081
13349A54762L155r382n7506K3659L3630l5957j3184K4063L303K4253K3354L7123
13337B11273J7199q5642l6089K4785K2395K1796J8229m4094K6233K3685l144k3760
13325A72866K777J6215p624k4313l2322k9866N243Q6540O7316N2758k2636l0387
13313B56567k9578J6311l1146m5156j8734l418R680M5527K3052k0285j180J3338
13301B14978k6063n6036K6778J8586J469K0190j5831m692k0061l0866m317K9065
$$ plain form
13289 153200 187188 185242 202737 189904 122402 126453 192090 239482 205897 137202 232927 276077
13277 276077 266275 211859 201595 221419 223301 191482 162769 182325 191433 220270 267364 235627
13265 235627 261089 310523 280915 224280 190898 184649 237749 225364 160491 228944 276807 226758
13253 226758 221736 251141 202971 176055 225127 191036 156881 178711 195382 92344 107738
13242 107738 134970 120516 135429 143242 222855 270180 279938 264594 265950 263500 191715 158373
13230 158373 151633 207682 192392 182124 202430 252485 310760 304739 285938 268007 264358 269917
13218 269917 288596 260875 277458 257947 305836 345282 293240 251288 269925 223113 225226 227287
13206 227287 236129 246465 208193 223957 230512 254452 253893 220374 148299 132747 127990 165838
$$ packed form
13289A53200L3988j946J7495j2833o7502M051O5637M7392l3585o8695R5725M3150
13277B76077r802n4416j0264J9824J882l1819k8713J9556R108K8837M7094l1737
13265B35627K5462M9434k9608n6635l3382o249N3100j2385o4873O8453M7863n0049
13253B26758n022K9405m8170k6916M9072l4091l4155K1830J6671j03038J5394
13242A07738K7232j4454J4913P813P9613M7325R758j5344J356k450p1785l3342
13230A58373o740N6049j5290j0268K0306N0055N8275o021j8801j7931l649N559
13218B69917J8679k7721J6583j9511M7889L9446n2042m1952J8637m6812K113K061
13206B27287Q842J0336l8272J5764O555K3940n59l3519p2075j5552m757L7848
$$ plain form
13194 165838 238454 255087 243148 201674 179395 232676 224306 185734 212249 245345 251045 237897
13182 237897 250855 244591 236794 213415 259136 319452 280925 269823 313843 357320 337805 314204
13170 314204 334193 332955 245046 270292 238375 256502 274827 291974 283776 333319 311194 295894
13158 295894 329755 301632 232120 204278 202251 222495 298058 321070 314914 277881 302144 359268
13146 359268 386248 354264 296449 306224 326339 356509 389218 453879 504593 503658 515114 493816
13134 493816 516966 593135 690754 749609 858817 958123 1075192 1145957 1203835 1271622 1289513
13123 1289513 1256915 1134398 1000031 814674 728533 708050 694659 677610 629030 587622 570969
13112 570969 646208 718397 706837 659294 693805 769982 824934 880388 974992 1073068 1210563
$$ packed form
13194A65838P2616J6633j1939m1474k2279N3281q370l8572K6515L3096N700j3148
13182B37897J2958o264p797k3379M5721O0316l8527j1102M4020M3477j9515k3601
13170C14204J9989j238q7909K5246l1917J8127J8325J7147q198M9543k2125j5300
13158B95894L3861k8123o9512k7842k027K0244P5563K3012o156l7033K4263N7124
13146C59268K6980l1984n7815R775K0115L0170L2709O4661N0714r35J1456k1298
13134D93816K3150P6169R7619N8855J09208R9306J17069P0765N7878O7787J7891
13123A289513l2598j22517j34367j85357q6141k0483j3391j7049m8580m1408j6653
13112E70969P5239P2189j1560m7543L4511P6177N4952N5454R4604R8076J37495
$$ plain form
13101 1210563 1310604 1360449 1482278 1679415 1782177 1775388 1790444 1751060 1702838 1633305 1558601
13090 1558601 1462481 1327456 1225249 1154520 1078544 1047989 1024634 1027991 1012720 1004129 978723
13079 978723 937851 904681 853021 819020 868410 893256 938807 947788 966556 1026240 1101508 1243108
13067 1243108 1428059 1566176 1652520 1684566 1657238 1643213 1622922 1534461 1346088 1152637
13057 1152637 975543 863050 755493 751155 719984 723245 689449 633681 654478 622532 568300
13046 568300 583279 589648 584433 568072 519060 526099 540248 544312 539017 574465 593613 624870
13034 624870 653346 688848 717275 760334 761601 822231 865427 912272 986160 1078132 1148988 1200830
13022 1200830 1219168 1187978 1167296 1087484 1014089 995962 954454 944665 901146 863459 857802 858066
$$ packed form
13101A210563J00041M9845J21829J97137J02762o789J5056l9384m8222o9533p4704
13090A558601r6120j35025j02207p0729p5976l0555k3355L357j5271q591k5406
13079I78723m0872l3170n1660l4001M9390K4846M5551Q981J8768N9684P5268J41600
13067A243108J84951J38117Q6344L2046k7328j4025k0291q8461j88373j93451
13057A152637j77094j12493j07557m338l1171L261l3796n5768K0797l1946n4232
13046E68300J4979O369n215j6361m9012P039J4149M064n295L5448J9148L1257
13034F24870K8476L5502K8427M3059J267O0630M3196M6845P3888R1972P0856N1842
13022A200830J8338l1190k0682p9812p3395j8127m1508r789m3519l7687n657K64
$$ plain form
13010 858066 806119 816765 822521 762189 752157 814079 876274 939340 1036919 1147295 1204887
12999 1204887 1287744 1310063 1343945 1460366 1570579 1606488 1644232 1625934 1589101 1589182 1548970
12988 1548970 1452740 1409179 1386559 1319437 1249127 1184378 1103164 1048864 1014688 955371 914543
12977 914543 950396 1010408 1040794 1063602 1059282 1011490 1003748 1022629 1034037 1057914 1175224 1296040
12965 1296040 1385153 1455100 1554993 1575770 1602738 1617726 1506695 1385526 1272485 1227308 1160013
12954 1160013 1074617 981034 877131 833184 745035 696189 681659 684356 683218 648740 672609
12943 672609 676910 649285 637981 656209 694906 714051 708252 685022 610562 580779 614074 592221
12931 592221 660778 691286 692043 624868 617284 663195 686175 713429 658049 675534 667367 614801
$$ packed form
13010H58066n1947J0646N756o0332j0032O1922O2195O3066R7579J10376N7592
12999A204887Q2857K2319L3882J16421J10213L5909L7744j8298l6833Q1m0212
12988A548970r6230m3561k2620o7122p0310o4749q1214n4300l4176n9317m0828
12977I14543L5853O0012L0386K2808m320m7792p742J8881J1408K3877J17310J20816
12965A296040Q9113O9947R9893K0777K6968J4988j11031j21169j13041m5177o7295
12954A160013q5396r3583j03903m3947q8149m8846j4530K697j138l4478K3869
12943F72609M301k7625j1304J8228L8697J9145n799k3230p4460k9783L3295k1853
12931E92221O8557L0508P57o7175p584M5911K2980K7254n5380J7485q167n2566
$$ plain form
12919 614801 647836 605753 596789 644339 643438 632188 630142 655024 700182 675027 665908 648733
12907 648733 608549 595693 601563 685525 676289 646362 651158 676447 723569 705225 676057 639258
12895 639258 626626 660386 663018 682061 734286 732295 754687 753192 731101 738601 736667 770004
12883 770004 828714 811310 749195 726274 681621 734249 812563 855130 816314 796201 803169 884420
12871 884420 966628 984150 955932 966545 940726 898334 824760 725473 736739 776576 766189
12860 766189 752742 724821 685351 717320 744553 657942 656566 756520 821240 793992 804500 784358
12848 784358 782041 812505 852717 852533 870795 905847 932184 987963 1007011 1013552 1000042 996976
12836 996976 1013139 1020465 1031010 1019755 957316 994870 1077279 1071673 1029078 1050394 1061677 1052337
$$ packed form
12919F14801L3035m2083q964M7550r01j1250k046K4882M5158k5155r119j7175
12907F48733m0184j2856N870Q3962r236k9927M796K5289M7122j8344k9168l6799
12895F39258j2632L3760K632J9043N2225j991K2392j495k2091P500j934L3337
12883G70004N8710j7404o2115k2921m4653N2628P8314M2567l8816k0113O968Q1251
12871H84420Q2208J7522k8218J0613k5819m2392p3574r9287J1266L9837j0387
12860G66189j3447k7921l9470L1969K7233q6611j376R9954O4720k7248J0508k0142
12848G84358k317L0464M0212j84J8262L5052K6337N5779J9048O541j3510l066
12836I96976J6163P326J0545j1255o2439L7554Q2409n606m2595K1316J1283r340
$$ plain form
12824 1052337 992008 962436 958414 982263 979711 1005242 1063851 1075437 1133434 1186090 1154196 1134826
12812 1134826 1162794 1163473 1144776 1150358 1189339 1215482 1252670 1309575 1346699 1337441 1305428 1348110
12800 1348110 1349724 1321030 1298510 1331623 1318192 1339669 1364232 1351232 1347611 1372852 1380517 1330404
12788 1330404 1367234 1383388 1353031 1441528 1475140 1486072 1514356 1565530 1644303 1698823 1670573
12777 1670573 1598596 1601816 1711663 1677306 1697173 1751281 1746796 1709458 1693304 1708595 1733494
12766 1733494 1772027 1768232 1776569 1803822 1792615 1786895 1758258 1817055 1893467 1937859 1901313 1859545
12754 1859545 1901647 1996134 2053157 2088428 2140895 2213586 2272523 2290791 2280800 2280704 2301119 2340024
12742 2340024 2406156 2380084 2429035 2528545 2598296 2588461 2593649 2653861 2689694 2682916 2744805 2824827
$$ packed form
12824A052337o0329k9572m022K3849k552K5531N8609J1586N7997N2656l1894j9370
12812A134826K7968O79j8697N582L8981K6143L7188N6905L7124r258l2013M2682
12800A348110J614k8694k2520L3113j3431K1477K4563j3000l621K5241P665n0113
12788A330404L6830J6154l0357Q8497L3612J0932K8284N1174P8773N4520k8250
12777A670573p1977L220J09847l4357J9867N4108m485l7338j6154J5291K4899
12766A733494L8533l795Q337K7253j1207n720k8637N8797P6412M4392l6546m1768
12754A859545M2102R4487N7023L5271N2467P2691N8937J8268r991r6K0415L8905
12742B340024O6132k6072M8951R9510O9751r835N188O0212L5833o778O1889Q0022
$$ plain form
12730 2824827 2827829 2830599 2833305 2901678 2984672 3111097 3230576 3281800 3343554 3493881 3602120
12719 3602120 3674824 3797530 3860728 3898898 3991674 3988793 4020451 4139706 4317086 4448664 4607463
12708 4607463 4774937 4943105 5101183 5276328 5492251 5743149 5977303 6271564 6584420
12699 6584420 6895524 7297765 7831274 8400718 9033403 9840810 10807956 12080584 13759347
12690 13759347 16154569 19476917 24013819 29899839 36677994 43300104 48602519 52436886
12682 52436886 55198264 57381649 58769696 58641656 57054696 55789459 56740261 60512220
12674 60512220 66344084 72389244 77201674 80677249 83365647 85500682 86504591 85567690
12666 85567690 83252457 81949282 83540712 88181371 94364186 100189411 104639860 107868452
$$ packed form
12730B824827L002K770K706O8373Q2994J26425J19479N1224O1754J50327J08239
12719C602120P2704J22706O3198L8170R2776k881L1658J19255J77380J31578J58799
12708D607463J67474J68168J58078J75145K15923K50898K34154K94261L12856
12699F584420L11104M02241N33509N69444O32685Q07407R67146J272628J678763
12690A3759347K395222L322348M536902N886020O778155O622110N302415L834367
12682E2436886K761378K183385J388047j28040j586960j265237R50802L771959
12674F0512220N831864O045160M812430L475575K688398K135035J003909r36901
12666H5567690k315233j303175J591430M640659O182815N825225M450449L228592
$$ plain form
12658 107868452 110400611 112306073 113143410 112864879 112825969 115044361 120004371 126606255
12650 126606255 134080526 142461458 151929097 161557118 169088720 172377111 171670461 169308080
12642 169308080 167518232 167124939 167468112 167636129 167649188 167495156 166797089 165539298 164154281
12633 164154281 162826869 161145929 158388368 154800364 152730360 154798358 161603285 173210606
12625 173210606 190362033 213302839 240267391 267046745 289622220 308277345 326503319
12618 326503319 345405134 360861164 365813198 356721466 337952021 316362017 294634771
12611 294634771 271020577 242907806 210962931 179894612 153614293 133238400 118062526
12604 118062526 106828121 98438362 92207059 87599043 84156038 81722485 80254342 79687492
$$ packed form
12658A07868452K532159J905462Q37337k78531l8910K218392M960010O601884
12650A26606255P474271Q380932R467639R628021P531602L288391p06650k362381
12642A69308080j789848l93293L43173J68017J3059j54032o98067j257791j385017
12633A64154281j327412j680940k757561l588004k070004K067998O804927J1607321
12625A73210606J7151427K2940806K6964552K6779354K2575475J8655125J8225974
12618C26503319J8901815J5456030M952034r091732j8769445k1590004k1727246
12611B94634771k3614194k8112771l1944875l1068319k6280319k0375893j5175874
12604A18062526j1234405q389759o231303m608016l443005k433553j468143n66850
$$ plain form
12596 79687492 80020934 81247737 83438189 86807685 91643759 98211592 106982971 118581362
12588 118581362 133403349 151810227 173539569 197580754 222360558 246561857 269339115
12581 269339115 290017898 307561546 320125674 325792893 324202673 316654221 305172237
12574 305172237 291074329 274585148 255867791 236089708 217100603 200630024 187564923
12567 187564923 177992192 171787437 168718402 168163153 169250764 171090171 173012487 174736196
12559 174736196 176119408 177101016 177409255 176775631 175483901 174038511 172884957 172290878
12551 172290878 172063391 171512206 170029240 167273122 163311774 158679280 153918522 149303404
12543 149303404 145093672 141566671 138905516 137119090 136012271 135008380 133648920 131868375
$$ packed form
12596G9687492L33442J226803K190452L369496M836074O567833Q771379J1598391
12588A18581362J4821987J8406878K1729342K4041185K4779804K4201299K2777258
12581B69339115K0678783J7543648J2564128N667219j590220p548452j1481984
12574C05172237j4097908j6489181j8717357j9778083j8989105j6470579j3065101
12567A87564923r572731o204755l069035n55249J087611J839407J922316J723709
12559A74736196J383212R81608L08239o33624j291730j445390j153554n94079
12551A72290878k27487n51185j482966k756118l961348m632494m760758m615118
12543A49303404m209732l527001k661155j786426j106819j003891j359460j780545
$$ plain form
12535 131868375 129493621 126273286 121985930 116993246 111868207 107413233 104166964 101999091
12527 101999091 100525822 99313832 97945557 96175611 93969938 91236771 88021459 84710430
12519 84710430 81684558 79426202 78073597 77294129 76687434 75801346 74344581 72325280
12511 72325280 69598752 65898071 61281906 56088235 50802383 45889746 41651549 38050429
12503 38050429 35026122 32408948 30218355 28389151 26785304 25305792 24025217 22880661
12495 22880661 21871290 20969652 20216717 19490889 18758438 18082999 17462634 16907808 16382219
12486 16382219 15808226 15235738 14691979 14166283 13708402 13315346 12908704 12546363 12230957
12477 12230957 11928940 11555898 11200951 10813609 10496810 10168645 9839914 9542898 9257546
$$ packed form
12535A31868375k374754l220335m287356m992684n125039m454974l246269k167873
12527A01999091j473269j211990j368275j769946k205673k733167l215312l311029
12519H4710430l025872k258356j352605p79468o06695q86088j456765k019301
12511G2325280k726528l700681m616165n193671n285852m912637m238197l601120
12503C8050429l024307k617174k190593j829204j603847j479512j280575j144556
12495B2880661j009371r01638p52935p25828p32451o75439o20365n54826n25589
12486A6382219n73993n72488n43759n25696m57881l93056m06642l62341l15406
12477A2230957l02017l73042l54947l87342l16799l28165l28731k97016k85352
$$ plain form
12468 9257546 9005117 8734381 8441612 8170942 7951213 7707204 7470241 7292293 7081047
12459 7081047 6871476 6674686 6510878 6371605 6168560 6000118 5860454 5733188 5613978
12450 5613978 5485071 5315850 5152690 4952676 4777064 4675110 4568467 4438088 4341971 4262863
12440 4262863 4155584 4042052 3944245 3798210 3729752 3699173 3629070 3498489 3382095 3277602
12430 3277602 3199905 3117727 3102096 3052740 2943393 2890260 2840544 2780768 2747925 2691921 2605743
12419 2605743 2551080 2527018 2477299 2408692 2390855 2380548 2307865 2226871 2138171 2039800 1994872
12408 1994872 1913555 1848182 1849867 1810250 1745710 1713335 1691439 1652847 1663724 1708010 1686209
12397 1686209 1636611 1544318 1522913 1508174 1504518 1497477 1480457 1433132 1443070 1460002 1464668 1465068
$$ packed form
12468I257546k52429k70736k92769k70670k19729k44009k36963j77948k11246
12459G081047k09571j96790j63808j39273k03045j68442j39664j27266j19210
12450E613978j28907j69221j63160k00014j75612j01954j06643j30379r6117p9108
12440D262863j07279j13532r7807j46035o8458l0579p0103j30581j16394j04493
12430C277602p7697q2178j5631m9356j09347n3133m9716n9776l2843n6004q6178
12419B605743n4663k4062m9719o8607j7837j0307p2683q0994q8700r8371m4928
12408A994872q1317o5373J685l9617o4540l2375k1896l8592J0877M4286k1801
12397A686209m9598r2293k1405j4739l656p041j7020m7325R938J6932M666M00
$$ plain form
12385 1465068 1483592 1412667 1377816 1352054 1302962 1250036 1250503 1232013 1226217 1225320 1161959 1098741
12373 1098741 1088860 1092684 1091712 1069072 1048538 1040098 1096070 1061184 1024922 1090405 1103473 1083643
12361 1083643 1077357 1056536 1032194 1007269 962845 908699 907318 869698 804286 775460 761741 781462
12349 781462 797790 824226 846816 842735 793176 726027 725528 762762 778250 766021 761055 835949
12337 835949 803117 705019 639898 618308 630193 654087 671018 664051 645480 647335 631467 644254
12325 644254 642634 675701 697834 680983 695259 696663 656998 700684 645922 584999 600617 593970
12313 593970 579582 523595 489322 448790 490282 526151 539859 494992 452951 477863 475319 473053
12301 473053 457050 402573 369574 359055 355382 383790 444278 436156 432365 406530 401891 373174
$$ packed form
12385A465068J8524p0925l4851k5762m9092n2926M67j8490n796q97o3361o3218
12373A098741r881L824r72k2640k0534q440N5972l4886l6262O5483J3068j9830
12361A083643o286k0821k4342k4925m4424n4146j381l7620o5412k8826j3719J9721
12349G81462J6328K6436K2590m081m9559o7149m99L7234J5488j2229m966P4894
12337H35949l2832r8098o5121k1590J1885K3894J6931o967j8571J855j5868J2787
12325F44254j620L3067K2133j6851J4276J404l9665M3686n4762o0923J5618o647
12313E93970j4388n5987l4273m0532M1492L5869J3708m4867m2041K4912k544k266
12301D73053j6003n4477l2999j0519l673K8408O0488q122l791k5835m639k8717
$$ plain form
12289 373174 384996 362391 364259 371969 360412 342275 341257 322454 345364 308358 230315 227918
12277 227918 224776 245528 283851 222888 215086 282548 270457 217652 200199 223675 241284 231789
12265 231789 181030 128535 130630 112055 144649 152275 157166 208655 240970 235608 218153 213145
12253 213145 212821 217659 227289 247522 267522 264738 247689 214272 198434 240182 251372 230730
12241 230730 193214 184183 170506 216819 289763 329558 307828 296721 232758 256552 228874 200144
12229 200144 171554 189430 259580 238511 224623 234572 277723 364996 387021 369936 392546 444323
12217 444323 547478 661911 798714 940019 1117194 1260414 1351925 1422929 1529795 1535551
12207 1535551 1485107 1335289 1185998 1027420 876884 805334 832006 803235 785432 773271
$$ packed form
12289C73174J1822k2605J868P710j1557j8137j018j8803K2910l7006p8043k397
12277B27918l142K0752L8323o0963p802O7462j2091n2805j7453K3476J7609r495
12265B31789n0759n2495K095j8575L2594P626M891N1489L2315n362j7455n008
12253B13145l24M838R630K0233K0000k784j7049l3417j5838M1748J1190k0642
12241B30730l7516r031j3677M6313P2944L9795k1730j1107o3963K3794k7678k8730
12229B00144k8590J7876P0150k1069j3888R949M3151Q7273K2025j7085K2610N1777
12217D44323J03155J14433J36803J41305J77175J43220R1511P1004J06866N756
12207A535551n0444j49818j49291j58578j50536p1550K6672k8771j7803j2161
$$ plain form
12197 773271 730402 759718 773498 730925 674912 695761 751676 791508 809963 813281 801767 893451
12185 893451 958402 1043461 1169089 1285814 1395543 1479807 1530319 1537374 1591505 1621229 1621063
12174 1621063 1590664 1517335 1407157 1268244 1141167 925405 850917 746206 688600 680460
12164 680460 681284 636779 595640 563360 554916 590471 633690 650004 668849 722716 859663 988253
12152 988253 1149542 1301283 1431756 1547605 1675745 1803223 1819827 1817857 1809270 1809913 1806256
12141 1806256 1742471 1619059 1468735 1349277 1251204 1176325 1101329 1012082 948778 841440
12131 841440 875120 804107 739098 706114 707142 695783 674305 715092 773801 778122 853461 909295
12119 909295 880939 951075 973295 1027538 1061587 1102744 1228045 1335369 1380680 1432968 1400270
$$ packed form
12197G73271m2869K9316J3780m2573n6013K0849N5915L9832J8455L318j1514R1684
12185H93451O4951Q5059J25628J16725J09729Q4264N0512P055N4131K9724j66
12174A621063l0399p3329j10178j38913j27077k15762p4488j04711n7606q140
12164F80460Q24m4505m1139l2280q444L5555M3219J6314J8845N3867J36947J28590
12152I88253J61289J51741J30473J15849J28140J27478J6604j970q587O43l657
12141A806256o3785j23412j50324j19458r8073p4879p4996q9247o3304j07338
12131H41440L3680p1013o5009l2984J028j1359k1478M0787N8709M321P5339N5834
12119I09295k8356P0136K2220N4243L4049M1157J25301J07324M5311N2288l2698
$$ plain form
12108 1400270 1357040 1314306 1247435 1205394 1128807 1029647 923564 859959 809585 768778 739279
12097 739279 631304 606930 652473 658202 621259 625195 605302 590419 596130 650781 693229 688167
12085 688167 746893 761746 843254 898926 944507 937467 893409 894081 903396 889233 854184 768073
12073 768073 658939 561277 438712 417921 355234 300540 309420 280373 219770 181261 217931
12062 217931 235726 239589 203969 223585 204226 155079 147745 118404 34401 13412 45451 112769
12050 112769 108421 113195 156098 189541 180991 161910 174494 119510 114426 137786 158974 116458
12038 116458 74633 83454 93753 99954 45221 24194 83182 106065 124028 135719 129573 141947
12026 141947 137436 74878 86842 38318 9460 33193 74358 36133 25053 82992 81521 61673
$$ packed form
12108A400270m3230m2734o6871m2041p6587r9160j06083o3605n0374m0807k9499
12097G39279j07975k4374M5543N729l6943L936j9893j4883N711N4651M2448n062
12085F88167N8726J4853Q1508N5672M5581p040m4058O72R315j4163l5049q6111
12073G68073j09134r7662j22565k0791o2687n4694Q880k9047o0603l8509L6670
12062B17931J7795L863l5620J9616j9359m9147p334k9341q4003k0989L2039O7318
12050A12769m348M774M2903L3443q550j9081J2584n4984n084K3360K1188m2516
12038A16458m1825Q821J0299O201n4733k1027N8988K2883J7963J1691o146J2374
12026A41947m511o2558J1964m8524k8858K3733M1165l8225j1080N7939j471j9848
$$ plain form
12014 61673 36062 25168 49955 57991 54495 57617 57430 57709 102526 121577 74077 12955 -38092
12001 -38092 -53382 -22648 20793 871 3477 -26072 -42155 -30550 16812 54239 66681 67297
11989 67297 71384 47829 -27672 -20909 -16069 -23167 -7367 -4620 -41622 -45464 14780 113902 110575
11976 110575 45231 52214 73493 47512 20123 -19047 -8978 -26787 -17729 -1428 26178 -11801
11964 -11801 -34575 -8032 21077 14614 43364 65775 11388 -33259 34841 80232 77882 31550
11952 31550 -15481 -55670 -65627 -71668 -60222 -95555 -109535 -54054 -28980 -34004 -50704 -104914
11940 -104914 -89307 -11754 3447 -25387 -1003 21767 8605 -17393 -39887 -56818 -23807
11929 -23807 -12458 -1109 -12617 -26643 -41133 -77602 -42979 -19431 1275 10486 20299 46704
$$ packed form
12014F1673k5611j0894K4787Q036l496L122j87K79M4817J9051m7500o1122n1047
12001c8092j5290L0734M3441j9922K606k9549j6083J1605M7362L7427J2442O16
11989F7297M087k3555p5501O763M840p098J5800K747l7002l842O0244R9122l327
11976A10575o5344O983K1279k5981k7389l9170J0069j7809R058J6301K7606l7979
11964a1801k2774K6543K9109o463K8750K2411n4387m4647O8100M5391k350m6332
11952C1550m7031m0189r957o041J1446l5333j3980N5481K5074n024j6700n4210
11940a04914J5607P7553J5201k8834K4384K2770j3162k5998k2494j6931L3011
11929b3807J1349J1349j1508j4026j4490l6469L4623K3548K0706R211R813K6405
$$ plain form
11917 46704 28391 -14620 -14139 -29557 -21142 -9668 10214 33830 26165 -22518 -30497 -45161 -30937
11904 -30937 -42382 -97732 -86173 -32091 -76007 -101244 -53192 5032 14671 29277 2913 -52301
11892 -52301 -53878 -6799 20884 15256 -16310 -1763 36995 104845 89074 61529 -10592 -100978
11880 -100978 -130211 -91354 -75047 -65901 -45109 -41859 -11453 24900 1279 -40904 -56255 -30850
11868 -30850 -17772 -31263 -24257 -28811 -27081 -10411 34547 107987 159100 163070 123585 141502
11856 141502 143855 86366 50394 62100 42806 803 -19263 -36657 -71896 -77894 -63869 -84119
11844 -84119 -38344 39158 -39476 -65602 -38249 -35906 -21245 -33799 -64575 -84373 -53750 -43232
11832 -43232 -13093 -13909 -52401 -42648 -28807 -2454 -17452 -17596 -9118 -20820 -4832 -22460 -44413
$$ packed form
11917D6704j8313m3011M81j5418Q415J1474J9882K3616p665m8683p979j4664J4224
11904c0937j1445n5350J1559N4082m3916k5237M8052N8224R639J4606k6364n5214
11892e2301j577M7079K7683n628l1566J4547L8758O7850j5771k7545p2121r0386
11880a00978k9233L8857J6307R146K0792L250L0406L6353k3621m2183j5351K5405
11868c0850J3078j3491P006m554J730J6670M4958P3440N1113L970l9485J7917
11856A41502K353n7489l5972J1706j9294m2003k0066j7394l5239n998J4025k0250
11844h4119M5775P7502p8634k6126K7353K343J4661j2554l0776j9798L0623J0518
11832d3232L0139q16l8492R753J3841K6353j4998j44Q478j1702J5988j7628k1953
$$ plain form
11819 -44413 5068 -9875 16405 13175 25275 -9974 -41229 5065 21868 55233 49350 19337
11807 19337 -18442 -25242 -48941 -28768 -45075 -50751 -44969 -67960 -97851 -58002 -42238 -28105
11795 -28105 11373 33983 39804 -27635 -1306 -2533 24999 -35692 -39217 -23563 31093 66578
11783 66578 29849 42744 30101 31005 -4336 -47464 -36697 -64714 -80539 -76130 -53769 -12571
11771 -12571 67779 149293 157557 95127 31285 24870 14914 -15023 -27360 -56995 -82920 -55288
11759 -55288 -29266 -25700 -31391 -6875 -44087 -56342 -16498 18063 19866 1697 12391 -27522
11747 -27522 -75890 -96698 -22185 19637 -12018 -31502 -16635 -31168 -6953 -11673 -46740 -95798
11735 -95798 -75715 -52980 4410 -6698 -23891 -4598 -5714 -97548 -139005 -94173 -39375 -50281
$$ packed form
11819d4413M9481j4943K6280l230J2100l5249l1255M6294J6803L3365n883l0013
11807A9337l7779o800k3699K0173j6307n676N782k2991k9891L9849J5764J4133
11795b8105L9478K2610N821o7439K6329j227K7532o0691l525J5654N4656L5485
11783F6578l6729J2895j2643R04l5341m3128J0767k8017j5825M409K2361M1198
11771a2571Q0350Q1514Q264o2430o3842o415r956k9937j2337k9635k5925K7632
11759e5288K6022L566n691K4516l7212j2255L9844L4561J803j8169J0694l9913
11747b7522m8368k0808P4513M1822l1655j9484J4867j4533K4215m720l5067m9058
11735i5798K0083K2735N7390j1108j7193J9293j116r1834m1457M4832N4798j0906
$$ plain form
11723 -50281 -14706 -9640 25732 61170 61223 61502 47971 40089 17113 -12914 21759 4500 -55221
11710 -55221 -28397 22935 -14184 -67279 -91174 -36407 -40721 -22758 2191 36201 49960 24449
11698 24449 19873 58904 69165 13579 -17649 -33835 -141191 -115785 -60700 -66625 -6528 14693
11686 14693 3661 14042 12823 -28179 -67995 -43277 -38607 -80328 -123329 -81168 -56076 -25961
11674 -25961 -39881 -55117 -44519 -44755 -43366 -67368 -63386 -79406 -99606 -84702 -64265 -20297
11662 -20297 -889 -8399 36651 57683 18440 -31093 -94289 -63892 -22681 -51328 -71583 -96099
11650 -96099 -88838 -88773 -97365 -76937 -80159 -80287 -44565 -23414 -61395 -46962 48636 123711 112041
11637 112041 42552 16176 20557 -20856 -30683 -22836 -42798 -40753 -96266 -91513 -22971 -25656 20892
$$ packed form
11723e0281L5575N066L5372L5438N3K79j3531p882k2976l0027L4673j7259n9721
11710e5221K6824N1332l7119n3095k3895N4767m314J7963K4949L4010J3759k5511
11698B4449m576L9031J0261n5586l1228j6186j07356K5406N5085n925O0097K1221
11686A4693j1032J0381j219m1002l9816K4718M670m1721m3001M2161K5092L0115
11674b5961j3920j5236J0598k36J389k4002L982j6020k0200J4904K0437M3968
11662b0297J9408p510M5050K1032l9243m9533o3196L0397M1211k8647k0255k4516
11650i6099P261O5q592K0428l222j28L5722K1151l7981J4433R5598P5075j1670
11637A12041o9489k6376M381m1413r827P847j9962K045n5513M753O8542k685M6548
$$ plain form
11624 20892 -12811 -30974 -2773 -31794 -12229 50764 52360 29345 23462 27133 18520 13883 -8080
11611 -8080 11087 32392 23872 -14235 18034 89161 52083 -11463 -60311 -17001 -27282 -44186
11599 -44186 -90059 -80241 -52510 -42117 -56461 -83523 -71602 -52376 -77083 -116881 -184907 -210341
11587 -210341 -213765 -173208 -142734 -56676 18377 -20782 -17334 10002 -21533 -24987 686 43403
11575 43403 20390 -19520 -24046 -12154 -16201 71774 103142 106381 95191 19732 -58742 -50954
11563 -50954 -50759 -64246 -68289 -27047 5492 37455 47337 74601 44697 11247 -42635 -24178
11551 -24178 15976 -5611 -1903 11794 -56049 -145258 -153662 -130914 -68691 -56447 -24942 -18012
11539 -18012 -72207 -68122 18625 7671 17237 70419 54186 -8900 -54987 -39672 -26732 -7810
$$ packed form
11624B0892l3703j8163K8201k9021J9565O2993J596k3015n883L671q613m637k1963
11611h080J9167K1305q520l8107L2269P1127l7078o3546m8848M3310j0281j6904
11599d4186m5873R818K7731J0393j4344k7062J1921J9226k4707l9798o8026k5434
11587b10341l424M0557L0474Q6058P5053l9159L448K7336l1535l454K5673M2717
11575D3403k3013l9910m526J1892m047Q7975L1368L239j1190p5459p8474P788
11563e0954J95j3487m043M1242L2539L1963R882K7264k9904l3450n3882J8457
11551b4178M0154k1587L708J3697o7843q9209q404K2748O2223J2244L1505O930
11539a8012n4195M085Q6747j0954R566N3182j6233o3086m6087J5315J2940J8922
$$ plain form
11527 -7810 -42173 -34861 -44938 -35854 36155 41098 50268 -11886 -73210 -107568 -97493 -39065 -20579
11514 -20579 -42141 -59206 -25102 35207 91773 64394 7676 -23373 2807 -7777 -22140 -32291
11502 -32291 -46325 -78341 -69512 -31315 -55120 -116182 -73403 -36804 -119373 -114292 -66531 -36106
11490 -36106 -33310 -49465 -57776 -103359 -82465 -46873 -26828 -20869 -77299 -64784 43100 102560
11478 102560 67101 4132 13438 16745 -8815 -15665 -26546 9810 9436 23620 19846 12662 12752
11465 12752 -65242 -117771 -77355 -52536 -43948 -14720 -68615 -51260 -22199 -32058 -53031 -35595
11453 -35595 -27654 6773 36966 30612 9079 -13888 -63783 -105558 -95326 -50191 -52724 -50363
11441 -50363 -47639 -11898 -41484 -43022 -44874 -53859 -241 -1075 -44490 -54118 -38122 -61793 -89800
$$ packed form
11527g810l4363P312j0077R084P2009M943R170o2154o1324l4358J0075N8428J8486
11514b0579k1562j7065L4104O0309N6566k7379n6718l1049K6180j0584j4363j0151
11502c2291j4034l2016Q829L8197k3805o1062M2779L6599q2569N081M7761L0425
11490c6106K796j6155q311m5583K0894L5592K0045N959n6430J2515J07884N9460
11478A02560l5459o2969R306L307k5560o850j0881L6356l74J4184l774p184R0
11465A2752p7994n2529M0416K4819Q588K9228n3895J7355K9061r859k0973J7436
11453c5595P941L4427L0193o354k1533k2967m9895m1775J0232M5135k533K361
11441e0363K724L5741k9586j538j852q985N3618q34m3415r628J5996k3671k8007
$$ plain form
11428 -89800 -41320 30815 12017 -47535 -63788 -115277 -131802 -111030 -117329 -74975 -20087 -59614
11416 -59614 -108493 -124117 -88881 -86272 -73099 -14948 20822 27056 -10713 -95683 -115985 -27267
11404 -27267 -16208 -77313 -66247 3998 33587 -944 13915 29532 -13488 -127707 -174237
11393 -174237 -103292 -603 14442 -8665 -33886 -12769 62065 85864 62445 75008 54444
11382 54444 46548 16330 -2090 -16905 12875 1790 -53027 -41535 8898 32293 1105 9836
11370 9836 31494 28171 63518 50556 45843 35545 -9303 -33351 -63287 -53702 -1360 -19160
11358 -19160 -34223 -34271 -46766 16118 45475 17957 -28399 17496 55430 25238 3070 -5222
11346 -5222 -16485 -15884 -57541 -74766 -122940 -153650 -54244 6587 -46794 -114646 -135097 -143734
$$ packed form
11428h9800M8480P2135j8798n9552j6253n1489j6525K0772o299M2354N4888l9527
11416e9614m8879j5624L5236K609J3173N8151L5770O234l7769q4970k0302Q8718
11404b7267J1059o1105J1066P0245K9589l4531J4859J5617m3020j14219m6530
11393a74237P0945J02689J5045k3107k5221K1117P4834K3799k3419J2563k0564
11382E4444p896l0218j8420j4815K9780j1085n4817J1492N0433K3395l1188Q731
11370I836K1658l323L5347j2962m713j0298m4848k4048k9936R585N2342j7800
11358a9160j5063m8j2495O2884K9357k7518m6356M5895L7934l0192k2168q292
11346e222j1263O01m1657j7225m8174l0710R9406O0831n3381o7852k0451q637
$$ plain form
11334 -143734 -119544 -115565 -60060 -19829 605 -42510 -83835 -20439 29302 -7797 -36405 -85686
11322 -85686 -103092 -105220 -95027 -21967 17259 -4759 -32390 -45817 -67618 -36278 -72283 -101164
11310 -101164 -82908 -35765 46288 86565 84900 40912 12110 -345 17682 61590 65878 47122
11298 47122 53206 70364 90981 73001 6035 -14475 -16240 -21576 -3447 -10759 3647 14094
11286 14094 -3320 527 1634 4365 -19936 -1466 7938 -11259 13557 -4616 -53051 -36316
11274 -36316 15112 13637 -19170 -69128 -70951 -91818 -72942 -5704 18324 15156 20332 -51102
11262 -51102 -133720 -164797 -114690 -34030 23575 4496 -3507 55217 64515 22734 9153 1071
11250 1071 -12351 -11241 -30493 22208 23649 181 2717 35835 46024 11103 -61721 -12798
$$ packed form
11334a43734K4190L979N5505M0231K0434m3115m1325O3396M9741l7099k8608m9281
11322h5686j7406k128J0193P3060L9226k2018k7631j3427k1801L1340l6005k8881
11310a01164J8256M7143Q2053M0277j665m3988k8802j2455J8027M3908M288j8756
11298D7122O084J7158K0617j7980o6966k0510j765n336J8129p312J4406J0447
11286A4094j7414L847J107K731k4301J8470R404j9197K4816j8173m8435J6735
11274c6316N1428j475l2807m9958j823k0867J8876O7238K4028l168N176p1434
11262e1102q2618l1077N0107Q0660N7605j9079q003N8724R298m1781j3581q082
11250A071j3422J110j9252N2701J441k3468K536L3118J0189l4921p2824M8923
$$ plain form
11238 -12798 -5045 -1811 23154 22235 -23229 -7933 9954 6148 3615 -24679 -38924 -36635 -31257
11225 -31257 -15531 -8450 -11299 -41373 -16696 -21004 -44789 22894 50810 40222 26351 -29688
11213 -29688 -51815 2599 86771 146158 127727 93394 44845 -13261 -4078 26412 54305 32829
11201 32829 5127 -18535 -12574 -27455 -69941 -55815 -28098 -2012 -1549 23938 43265 -4801
11189 -4801 -13176 -7902 -20398 -12536 -7885 -85266 -68371 -88041 -75168 -49329 -39807 -18799 -30404
11176 -30404 -12284 4449 16746 8022 -29398 -68982 -59516 -40187 -13836 -8875 -14113 -21598 -23989
11163 -23989 -48358 -61507 -86328 -78952 -85373 -83825 -52306 -69837 -40934 -31273 -26229 -49624 -75995
11150 -75995 -120583 -92310 -77727 -80544 -70571 -65982 -34311 -37563 -49057 -57293 -76964 -15191 4513
$$ packed form
11238a2798P753L234K4965r19m5464J5296J7887l806k533k8294j4245K289N378
11225c1257J5726P081k849l0074K4677m308k3785O7683K7916j0588j3871n6039
11213b9688k2127N4414Q4172N9387j8431l4333m8549n8106R183L0490K7893k1476
11201C2829k7702k3662N961j4881m2486J4126K7717K6086M63K5487J9327m8066
11189d801q375N274j2496P862M651p7381J6895j9670J2873K5839R522K1008j1605
11176c0404J8120J6733J2297q724l7420l9584R466J9329K6351M961n238p485k391
11163b3989k4369j3149k4821P376o421J548L1519j7531K8903R661N044k3395k6371
11150g5995m4588K8273J4583k817R973M589L1671l252j1494q236j9671O1773J9704
$$ plain form
11137 4513 -28912 -3060 25038 -49651 -102314 -110548 -92636 -60292 -15206 -5195 14574 41659
11125 41659 37775 53538 69743 57665 15987 -3862 -14352 -41037 -61202 -72725 -88046 -64115
11113 -64115 -39914 -63703 -46160 26744 17959 20374 39511 14978 -55136 -69329 -66303 -47043
11101 -47043 -37398 -76864 -99094 -104895 -173952 -213738 -178803 -148918 -132126 -106411 -82657 -30711
11089 -30711 -18595 -990 70330 102077 64885 85759 79766 96176 86829 9130 -37972 -44974
11077 -44974 -69686 -117531 -129241 -116692 -137517 -121288 -118410 -80175 -88165 -144817 -108513 -25497
11065 -25497 -6432 39622 20628 -4250 -68258 -13684 35815 -511 -1448 23433 18246 9620
11053 9620 5883 -2746 -40261 -65456 -40314 -18890 -19265 -69649 -69588 -69245 -80758 -119855 -49308 4150
$$ packed form
11137D513l3425K5852K8098p4689n2663q234J7912L2344M5086J0011J9769K7085
11125D1659l884J5763J6205j2078m1678j9849j0490k6685k0165j1523j5321K3931
11113f4115K4201k3789J7543P2904q785K415J9137k4533p0114j4193L026J9260
11101d7043R645l9466k2230n801o9057l9786L4935K9885J6792K5715K3754N1946
11089c0711J2116J7605P1320L1747l7192K0874n993J6410r347p7699m7102p002
11077d4974k4712m7845j1710J2549k0825J6229K878L8235p990n6652L6304Q3016
11065b5497J9065M6054j8994k4878o4008N4574M9499l6326r37K4881n187q626
11053I620l737q629l7515k5195K5142K1424l75n0384O1L43j1513l9097P0547N3458
$$ plain form
11039 4150 1238 10689 -6201 -6118 19900 26621 20990 -17182 4704 42756 11897 -42059 4514
11026 4514 5220 -10061 -3510 11683 91338 60474 24376 -24162 16495 51347 1214 250 -45903
11013 -45903 -53627 -39668 -19103 -24672 -53716 -36240 8327 8861 -2226 49255 62049 41144
11001 41144 9426 24223 1363 3473 -18677 -834 2774 -33207 -34730 -18113 -10833 18506
10989 18506 31095 24797 -17630 -19687 -18587 -45493 -51501 -13180 41817 55662 2861 -37107
10977 -37107 -19899 -49724 -18364 34403 29659 -2329 -52926 -101006 -130556 -79580 -16241 2698
10965 2698 -57876 -75147 -6843 19403 -1753 -75289 -87430 -37141 -27142 -71743 -43719 5720
10953 5720 24675 35902 9832 -6537 34050 11035 27161 10329 -108224 -136563 -86477 -47195
$$ packed form
11039D150k912R451j6890Q3K6018O721n631l8172K1886L8052l0859n3956M6573
11026D514P06j5281O551J5193P9655l0864l6098m8538M0657L4852n0133r64m6153
11013d5903p724J3959K0565n569k9044J7476M4567N34j1087N1481J2794k0905
11001D1144l1718J4797k2860K110k2150J7843L608l5981j523J6617P280K9339
10989A8506J2589o298m2427k057J100k6906o008L8321N4997J3845n2801l9968
10977c7107J7208k9825L1360N2767m744l1988n0597m8080k9550N0976O3339J8939
10965B698o0574j7271O8304K6246k1156p3536j2141N0289R999m4601K8024M9439
10953E720J8955J1227k6070j6369M0587k3015J6126j6832j18553k8339N0086L9282
$$ plain form
10941 -47195 -20366 -9531 11556 31378 40681 12010 -35959 -56714 -51017 22199 23092 38210
10929 38210 -7603 -63647 -50363 -35848 -52945 -55899 -11401 -8708 46742 62496 8426 20204
10917 20204 32926 -13469 -45891 -49076 -27131 -37975 12846 16456 4811 13275 -20194 -46925
10905 -46925 16872 57527 73867 8339 5125 18541 3356 14756 -8047 -83295 -143949 -131613
10893 -131613 -107018 -86996 -61774 -77478 -42021 -8379 -24189 -47135 -38255 -47909 51738 98756
10881 98756 31644 -2782 69439 -1092 -55002 -51987 -51426 -39478 -14963 8972 10606 -28751
10869 -28751 -29679 -17639 -33654 -60485 -36039 -36273 -29539 -10146 6019 14476 43320 41025 30826
10856 30826 42940 50077 -8300 -18209 -18189 9968 20058 4160 2853 1738 -1694 -2214 -32691 -43090
$$ packed form
10941d7195K6829J0835K1087J9822R303k8671m7969k0755N697P3216Q93J5118
10929C8210m5813n6044J3284J4515j7097k954M4498K693N5450J5754n4070J1778
10917B0204J2722m6395l2422l185K1945j0844N0821L610j1645Q464l3469k6731
10905d6925O3797M0655J6340o5528l214J3416j5185J1400k2803p5248o0654J2336
10893a31613K4595K0022K5222j5704L5457L3642j5810k2946Q880r654R9647M7018
10881I8756o7112l4426P2221p0531n3910L015N61J1948K4515K3935J634l9357
10869b8751r28J2040j6015k6831K4446k34O734J9393J6165Q457K8844k295j0199
10856C0826J2114P137n8377r909K0K8157J0090j5898j307j115l432n20l0477j0399
$$ plain form
10842 -43090 6825 12739 36979 38805 57965 91871 69644 67996 100339 106387 89846 31098
10830 31098 -7155 -9117 14168 43297 15569 30343 91306 80002 57680 54637 19993 1918
10818 1918 -3880 15084 -9861 17942 61086 28357 14880 33673 45889 71229 82534 46763
10806 46763 -1933 -68616 -35394 -49886 -42426 -42592 -65511 -85564 -86959 -69704 -84454 -106826
10794 -106826 -67380 -46593 -34079 -48750 -42353 4425 -31091 -42857 4246 64962 42795 -5685
10782 -5685 -27517 -23842 -75124 -139733 -147908 -99308 -66877 -19194 -48317 -32658 -75373 -34771
10770 -34771 -4653 22840 -14088 -2154 28212 47658 54507 61864 44786 45716 24788 14229
10758 14229 -38094 -64768 -47462 -38386 27649 41286 -5318 9182 7480 -63413 -20704 55360
$$ packed form
10842d3090M9915N914K4240J826J9160L3906k2227j648L2343O048j6541n8748
10830C1098l8253j962K3285K9129k7728J4774O0963j1304k2322l043l4644j8075
10818A918n798J8964k4945K7803M3144l2729j3477J8793J2216K5340J1305l5771
10806D6763m8696o6683L3222j4492P460j66k2919k0053j395J7255j4750k2372
10794a06826L9446K0787J2514j4671O397M6778l5516j1766M7103O0716k2167m8480
10782e685k1832L675n1282o4609q175M8600L2431M7683k9123J5659m2715M0602
10770c4771L0118K7493l6928J1934L0366J9446O849P357j7078R30k0928j0559
10758A4229n2323k6674J7306R076O6035J3637m6604J4500j702p0893M2709P6064
$$ plain form
10746 55360 80833 25693 45043 45576 46192 5448 -17852 15299 35238 12350 11370 -9957 -88984
10733 -88984 -109042 -50052 7044 391 30572 82424 62062 45289 58910 -8720 -50477 -89029
10721 -89029 -37753 16792 19440 20513 4159 -11292 6005 -69831 -41056 -20062 -66869 -19491
10709 -19491 23224 11479 -14967 -54641 -80827 -87665 -46625 -52286 -40553 -27514 -24013 -37368
10697 -37368 -33332 -4364 42073 39114 38413 27400 37558 61646 89330 88295 90072 79040 -6456
10684 -6456 -40147 -68498 -85199 -27155 21517 16553 9904 8774 -33385 -63404 -59244 -38444 -50352
10671 -50352 -54667 -31872 -24042 -12623 -20264 8110 15403 8190 -26231 -54030 -70673 -40103 -1638
10658 -1638 -21619 -44204 -36195 -27052 31076 16651 28937 3491 25971 50524 27896 27109 18291
$$ packed form
10746E5360K5473n5140J9350N33O16m0744k3300L3151J9939k2888r80k1327p9027
10733h8984k0058N8990N7096o653L0181N1852k0362j6773J3621o7630m1757l8552
10721h9029N1276N4545K648J073j6354j5451J7297p5836K8775K0994m6807M7378
10709a9491M2715j1745k6446l9674k6186o838M1040n661J1733J3039L501j3355
10697c7368M036K8968M6437k959p01j1013J0158K4088K7684j035J777j1032q5496
10684f456l3691k8351j6701N8044M8672m964o649j130m2159l0019M160K0800j1908
10671e0352m315K2795P830J1419p641K8374P293p213l4421k7799j6643L0570L8465
10658a638j9981k2585Q009R143N8128j4425J2286k5446K2480K4553k2628p87q818
$$ plain form
10645 18291 38597 17554 -34123 -1731 -8333 -34063 19587 44956 34000 32030 26732 -32854
10633 -32854 -81958 -104929 -77099 -89593 -84666 -99620 -100107 -69283 -6901 -20219 -57539 -119431
10621 -119431 -126411 -105378 -78408 -43015 -72544 -71196 -20353 914 13833 20524 -9058 -22219
10609 -22219 -35252 -28755 -36149 -18871 -69915 -90043 -51664 -25762 10417 -1812 -58411 -120915
10597 -120915 -76012 -23099 7902 -23819 -76454 -33023 -63835 -57314 -81257 -96991 -117460 -113808
10585 -113808 -88980 -61553 5471 36862 61848 76328 73855 43199 80815 91507 60241 -8372
10573 -8372 -8319 28961 52648 82272 34479 -24846 -42547 -39006 -88053 -46077 -49365 -109833 -122986
10560 -122986 -53459 -35260 -32114 -34286 -5774 55991 47350 23962 5237 -49677 -60467 -47319
$$ packed form
10645A8291K0306k1043n1677L2392o602k5730N3650K5369j0956j970n298n9586
10633c2854m9104k2971K7830j2494M927j4954m87L0824O2382j3318l7320o1892
10621a19431o980K1033K6970L5393k9529J348N0843K1267J2919O691k9582j3161
10609b2219j3033O497p394J7278n1044k0128L8379K5902L6179j2229n6599o2504
10597a20915M4903N2913L1001l1721n2635M3431l0812O521k3943j5734k0469L652
10585a13808K4828K7427O7024L1391K4986J4480k473l0656L7616J0692l1266o8613
10573h372N3L7280K3687K9624m7793n9325j7701L541m9047M1976l288o0468j3153
10560a22986O9527J8199L146k172K8512O1765q641k3388j8725n4914j0790J3148
$$ plain form
10548 -47319 -12965 -1709 22982 37623 34216 4858 -3386 -14276 -4697 -16262 -47258 -62623
10536 -62623 -34624 1766 -31299 -82323 -100265 -107761 -82252 -60722 -42919 -25772 -7764 -10653
10524 -10653 -61027 -44560 -58110 -22755 43425 56373 24755 -58281 -126890 -95904 -20808 -38470
10512 -38470 -23440 -24010 -39660 -22327 -12711 -13833 -46561 -90869 -103219 -64831 -70289 -59958 -70398
10499 -70398 -96015 -56381 -46324 -60724 -80993 -64707 -24532 -47614 -43537 -20456 -3040 -2674
10487 -2674 -72018 -55424 -16734 -27433 -63241 -19688 -30050 -66049 -66691 -15702 1362 46009
10475 46009 8926 -28582 -49508 -122104 -127365 -83128 -76493 -57658 -62850 -32964 -50337 -81351
10463 -81351 -144150 -52947 8476 -17649 -50586 -64776 -60806 -129832 -157121 -95602 -72081 -48928
$$ packed form
10548d7319L4354J1256K4691J4641l407k9358q244j0890R579j1565l0996j5365
10536f2623K7999L6390l3065n1024j7942p496K5509K1530J7803J7147J8008k889
10524a0653n0374J6467j3550L5355O6180J2948l1618q3036o8609L0986P5096j7662
10512c8470J5030n70j5650J7333R616j122l2728m4308j2350L8388n458J0331j0440
10499g0398k5617L9634J0057j4400k0269J6286M0175k3082M077K3081J7416L66
10487b674o9344J6594L8690j0699l5808M3553j0362l5999o42N0989J7064M4647
10475D6009l7083l7508k0926p2596n261M4237O635J8835n192K9886j7373l1014
10463h1351o2799R1203O1423k6125l2937j4190L970o9026k7289O1519K3521K3153
$$ plain form
10451 -48928 -139449 -156673 -124335 -20572 18332 -67634 -124356 -112334 -50198 -39954 -19415
10440 -19415 47942 39339 25803 20036 -6461 -75 -12939 -5776 16876 -25205 -60258 -113414
10428 -113414 -105536 -74760 -99845 -52254 518 8305 -3489 -22977 -10429 -43519 -80771 -73605
10416 -73605 -77297 -28927 -6229 -6463 14462 -17187 -35295 -58045 -89957 -106497 -115347 -44099
10404 -44099 -1753 9173 26380 50705 58991 57865 42886 -9765 -9024 -907 9554 14975 21847
10391 21847 6979 7677 -437 -44773 -79555 -60326 -7907 -30703 -63174 -72692 -37182 27871
10379 27871 -10299 -35970 -17396 51175 99409 50329 -27010 -25275 12793 38333 62681 10927
10367 10927 17732 80164 77153 14890 -34234 -23116 21057 -3044 7963 -2870 -11891 8445
$$ packed form
10451d8928r0521j7224L2338J03763L8904q5966n6722J2022O2136J0244K0539
10440a9415O7357q603j3536n767k6497O386j2864P163K2652m2081l5053n3156
10428a13414P878L0776k5085M7591N2772P787j1794j9488J2548l3090l7252P166
10416g3605l692M8370K2698k34K0925l1649j8108k2750l1912j6540q850P1248
10404d4099M2346J0926J7207K4325Q286j126j4979n2651P41Q117J0461N421O872
10391B1847j4868O98q114m4336l4782J9229N2419k2796l2471r518L5510O5053
10379B7871l8170k5671J8574O8571M8234m9080p7339J735L8068K5540K4348n1754
10367A0927O805O2432l011o2263m9124J1118M4173k4101J1007j0833r021K0336
$$ plain form
10355 8445 51284 27800 21999 -32787 -35631 -40277 -51160 5367 68712 92877 70887 57693
10343 57693 -5779 -59558 -70269 -17358 43295 45421 93277 153351 223265 335794 468469
10332 468469 564049 638509 744306 851716 928581 1023721 1070872 1066309 978231 935256 860708
10321 860708 755891 613856 487068 399574 335237 299174 205552 154990 82964 93088 79645
10310 79645 64013 43061 97784 130906 99059 89239 91561 97146 119676 99255 106316 93448
10298 93448 46074 45294 47777 48160 36510 40469 5968 -23440 -22340 -36803 -30046 -34142 -62303
10285 -62303 -47512 -5417 13677 -4444 -23207 -44601 -55250 1785 25139 57231 9667 -6058
10273 -6058 2071 20239 50655 52307 33214 -5879 -55751 -57406 -20673 -45789 -15341 38979
$$ packed form
10355H445M2839k3484n801n4786k844m646j0883N6527O3345K4165k1990j3194
10343E7693o3472n3779j0711N2911O0653K126M7856O0074O9914J12529J32675
10332D68469R5580P4460J05797J07410P6865R5140M7151m563q8078m2975p4548
10321H60708j04817j42035j26788q7494o4337l6063r3622n0562p2026J0124j3443
10310G9645j5632k0952N4723L3122l1847r820K322N585K2530k0421P061j2868
10298I3448m7374p80K483L83j1650L959l4501k9408J100j4463O757m096k8161
10285f2303J4791M2095J9094j8121j8763k1394j0649N7035K3354L2092m7564j5725
10273f058Q129J8168L0416J652j9093l9093m9872j655L6733k5116L0448N4320
$$ plain form
10261 38979 56294 22030 -20326 -40430 -18435 6148 -9477 15474 -57354 -101542 -92070 -113969
10249 -113969 -67726 -38182 -27628 -24530 -55213 -90920 -99925 -105301 -120377 -91229 -65016 -81755
10237 -81755 -83890 -26653 9705 24115 35560 -4001 -14879 -26936 -53691 -80558 -50850 -46188
10225 -46188 -60956 -2078 22338 36603 24022 -31477 -70661 -73857 -64558 -43371 -12761 25859
10213 25859 89122 125662 47645 -49866 -58892 -84578 -74840 -4775 83784 125998 86739 17508
10201 17508 33286 28938 4637 21075 19921 16088 -4044 6313 8478 -342 -18685 7584 26346
10188 26346 29659 32479 13114 -1783 -16293 36920 66581 47376 -27751 -56134 -25243 5442
10176 5442 -3911 6085 -8819 -58179 -72128 -29765 -24536 17321 63396 107598 111096 29874 17305
$$ packed form
10261C8979J7315l4264m2356k0104K1995K4583j5625K4951p2828m4188R472k1899
10249a13969M6243K9544J0554L098l0683l5707r005n376j5076K9148K6213j6739
10237h1755k135N7237L6358J4410J1445l9561j0878j2057k6755k6867K9708M662
10225d6188j4768N8878K4416J4265j2581n5499l9184l196R299K1187L0610L8620
10213B5859O3263L6540p8017r7511r026k5686R738P0065Q8559M2214l9259o9231
10201A7508J5778m348k4301J6438j154l833k0132J0357K165q820j8343K6269J8762
10188B6346L313K820j9365j4897j4510N3213K9661j9205p5127k8383L0891L0685
10176E442r353R996j4904m9360j3949M2363N229M1857M6075M4202L498q1222j2569
$$ plain form
10163 17305 24169 69955 38314 15796 -35434 -51382 -28032 45254 97175 84447 6351 -4109
10151 -4109 -13337 -47495 -25504 24350 38152 35170 53104 55465 60409 6158 -11992 -35590 5647
10138 5647 -12666 -5441 -22777 -54166 -19869 37490 9961 -34087 -51559 -25866 -9720 -14927
10126 -14927 -5293 -32646 -70181 -60848 -44595 -94954 -62695 -956 36246 -7103 -47621 -36823
10114 -36823 -7220 22112 9227 11975 -26317 -77042 23283 19424 -17125 -11839 40169 64753
10102 64753 50553 18777 -57242 -104870 -116607 -169326 -157182 -141683 -82921 -59831 -91997 -101807
10090 -101807 -79696 -23393 -12167 -54578 -18056 -3845 -30009 -7828 41545 15380 7840 6355
10078 6355 29753 46974 65636 78199 66857 67914 30922 -39608 -14921 -49546 -91452 -17627
$$ packed form
10163A7305O864M5786l1641k2518n1230j5948K3350P3286N1921j2728p8096j0460
10151d109r228l4158K1991M9854J3802k982J7934K361M944n4251j8150k3598M1237
10138E647j8313P225j7336l1389L4297N7359k7529m4048j7472K5693J6146n207
10126a4927R634k7353l7535R333J6253n0359L2259O1739L7202m3349m0518J0798
10114c6823K9603K9332j2885K748l8292n0725J00325l859l6549N286N2008K4584
10102F4753j4200l1776p6019m7628j1737n2719J2144J5499N8762K3090l2166r810
10090a01807K2111N6303J1226m2411L6522J4211k6164K2181M9373k6165p540j485
10078F355K3398J7221J8662J2563j1342J057l6992p0530K4687l4625m1906P3825
$$ plain form
10066 -17627 42646 43720 1418 17722 23945 1895 -22824 -22244 -54579 -91491 -56071 -40878
10054 -40878 -23307 5568 16350 -4030 1955 -32864 -16018 -21444 30000 50006 8899 3136
10042 3136 47304 31824 5987 -25400 -29057 -19127 -52326 -17197 -3967 26861 17026 -2569
10030 -2569 -38491 -27726 3246 -46558 -92530 -44257 -6967 -35543 -32347 -14892 -28584 -69768
10018 -69768 -79092 -81200 -85785 -73270 -71716 -63709 -79904 -92261 -62203 -18112 24979 38194 -6015
10005 -6015 -28622 -12039 46411 46314 6440 5343 -28090 -68384 -17586 15650 -39880 -14069 10732
9992 10732 53730 63215 37905 54415 47206 57738 94885 82261 56988 10608 -16583 30717
9980 30717 -3364 -49388 -103951 -152462 -107078 -38993 -17047 -34533 -21040 -17711 -14501 20148
$$ packed form
10066a7627O0273J074m2302J6304O223k2050k4719N80l2335l6912L5420J5193
10054d0878J7571K8875J0782k0380N985l4819J6846n426N1444K0006m1107n763
10042C136M4168j5480k5837l1387l657R930l3199L5129J3230L0828r835j9595
10030b569l5922J0765L0972m9804m5972M8273L7290k8576L196J7455j3692m1184
10018f9768r324k108m585J2515J554Q007j6195j2357L0058M4091M3091J3215m4209
10005f015k2607J6583N8450r7l9874j097l3433m0294N0798L3236n5530K5811K4801
9992A0732M2998R485k5310J6510p209J0532L7147j2624k5273m6380k7191M7300
9980C0717l4081m6024n4563m8511M5384O8085K1946j7486J3493L329L210L4649
$$ plain form
9968 20148 4230 12561 26474 25768 -18252 -29909 -27349 -21869 -28064 -62334 -42073 25335 20314
9955 20314 -12322 -12928 21773 -2429 -32154 -46441 -68766 -19790 10553 30082 61397 93490
9943 93490 5628 -40940 -66105 -76143 -91820 -88918 -83891 -31225 -39088 -32496 -28586 -53631 -53255
9930 -53255 -20589 -30196 -39601 5733 50392 58689 67511 2428 -14178 -42049 -52008 -61241 -29686
9917 -29686 9458 1944 -29006 -24365 31840 68491 64221 26568 50154 97903 66812 56503
9905 56503 40871 20756 16278 24854 65485 82187 53435 32735 27555 36944 4323 -28963 28324
9892 28324 12013 -14786 19996 38995 30966 9785 32361 -3609 -34018 -19849 21575 -16046
9880 -16046 -36416 -26910 -39577 -74045 -59750 -27292 -7889 9621 39394 89313 47802 -46563
$$ packed form
9968B0148j5918Q331J3913p06m4020j1657K560N480o195l4270K0261O7408n021
9955B0314l2636o06L4701k4202k9725j4287k2325M8976L0343J9529L1315L2093
9943I3490q7862m6568k5165j0038j5677K902N027N2666p863O592L910k5045L76
9930e3255L2666r607r405M5334M4659Q297Q822o5083j6606k7871r959r233L1555
9917b9686L9144p514l0950M641N6205L6651m270l7653K3586M7749l1091j0309
9905E6503j5632k0115m478Q576M0631J6702k8752k0700n180R389l2621l3286N7287
9892B8324j6311k6799L4782J8999q029k1181K2576l5970l0409J4169M1424l7621
9880a6046k0370R506j2667l4468J4295L2458J9403J7510K9773M9919m1511r4365
$$ plain form
9868 -46563 -47948 -15715 -13570 18118 34453 14269 1519 61171 48582 -17496 -72862 -19105
9856 -19105 32536 34270 39587 -5697 -29949 3537 62565 112932 145682 122452 99317 47082
9844 47082 32241 68361 106697 82216 80031 52652 27737 62445 96099 109586 118988 114153
9832 114153 87484 56715 2297 -50457 6595 2052 -35796 6317 -22264 -73770 -96860 -89282
9820 -89282 -67507 -29047 -12049 -23819 2809 27183 36317 37512 -24460 -47614 -47850 -41507 -1913
9807 -1913 39143 -15108 729 3616 5497 -24442 -32869 -65119 -88277 -59038 -76809 -53780 8089
9794 8089 55437 70762 91215 76994 61057 21377 -11124 12160 63494 24260 -39983 -58188
9782 -58188 -39385 -38217 -36510 -39167 -18512 -16865 6174 24643 12148 -24299 -8916 12088 834
$$ packed form
9868d6563j385L2233K145L1688J6335k0184j2750N9652j2589o6078n5366N3757
9856a9105N1641J734N317m5284k4252L3486N9028N0367L2750k3230k3135n2235
9844D7082j4841L6120L8336k4481k185k7379k4915L4708L3654J3487R402m835
9832A14153k6669l0769n4418n2754N7052m543l7848M2113k8581n1506k3090P578
9820h9282K1775L8460J6998j1770K6628K4374R134J195o1972k3154k36O343L9594
9807a913M1056n4251J5837K887J881k9939q427l2250k3158K9239j7771K3029O1869
9794H089M7348J5325K0453j4221j5937l9680l2501K3284N1334l9234o4243j8205
9782e8188J8803J168J707k657K0655J647K3039J8469j2495l6447J5383K1004j1254
$$ plain form
9769 834 19507 15954 41193 27796 35132 44677 -1876 -26823 -43307 -3443 -27710 -73236 -98239
9756 -98239 -24427 -13889 -6785 13319 44046 37669 737 -20362 30300 57022 36682 -25564
9744 -25564 -47303 -76825 -39106 -39858 -40571 30336 53770 27990 38662 42649 30037 1227 42170
9731 42170 114991 153588 108856 24714 24674 44006 24164 3042 18572 -1504 60472 74045
9719 74045 55316 47811 80363 130411 96540 37569 15877 10276 -70431 -82150 -60633 -28474
9707 -28474 7230 -2282 5205 15089 -27222 -24214 58736 59704 66343 72391 70263 7944 57872 78427
9693 78427 63968 65376 15274 -12386 19521 51149 80380 117434 137533 71439 53265 75863
9681 75863 67226 61081 114073 121225 64768 35795 33832 -8106 -10497 12521 28775 29707 5233
$$ packed form
9769H34J8673l553K5239j3397P336R545m6553k4947j6484L9864k4267m5526k5003
9756i8239P3812J0538P104K0104L0727o377l6932k1099N0662K6722k0340o2246
9744b5564k1739k9522L7719p52p13P0907K3434k5780J0672L987j2612k8810M0943
9731D2170P2821L8597m4732q4142m0J9332j9842k1122J5530k0076O1976J3573
9719G4045j8729p505L2552N0048l3871n8971k1692n601q0707j1719K1517L2159
9707b8474L5704r512P487R884m2311L008Q2950R68O639O048k128o2319M9928K0555
9693G8427j4459J408n0102k7660L1907L1628K9231L7054K0099o6094j8174K2598
9681G5863q637o145N2992P152n6457k8973j963m1938k391K3018J6254R32k4474
$$ plain form
9668 5233 35384 35538 50417 37744 56295 62050 21991 14460 26051 39691 50790 21949 45455
9655 45455 -26387 -76831 -52709 -27649 25388 53819 70208 59631 60332 80733 71880 47592
9643 47592 19317 36103 77885 78668 94856 94949 93881 95784 74971 -10612 -49537 30685 31527 14245
9629 14245 4050 70640 63978 51856 40894 62263 40382 54362 68705 99555 118489 119526
9617 119526 58110 17684 38936 23035 -2289 28408 11952 6178 43990 72588 117354 174266
9605 174266 157178 108681 70978 54970 74808 87436 124861 64602 -19065 21747 48726 3237
9593 3237 735 3442 6134 -12361 -16958 -22782 -24129 -57760 -24561 32964 94479 95545 56759
9580 56759 27080 10073 -8352 -65598 -70521 -27569 -10886 -6881 -46543 -64880 -25316 -8400
$$ packed form
9668E233L0151J54J4879j2673J8551N755m0059p531J1591J3640J1099k8841K3506
9655D5455p1842n0444K4122K5060N3037K8431J6389j0577P01K0401q853k4288
9643D7592k8275J6786M1782P83J6188R3j068J903k0813q5583l8925Q0222Q42j7282
9629A4245j0195O6590o662j2122j0962K1369k1881J3980J4343L0850J8934J037
9617A19526o1416m0426K1252j5901k5324L0697j6456n774L7812K8598M4766N6912
9605A74266j7088m8497l7703j6008J9838J2628L7425o0259q3667M0812K6979m5489
9593C237k502K707K692j8495m597n824j347l3631L3199N7525O1515J066l8786
9580E6759k9679j7007j8425n7246m923M2952J6683M005l9662j8337L9564J6916
$$ plain form
9568 -8400 10577 86508 104223 74225 93485 88544 50232 -8048 -55448 -28966 26164 -3213
9556 -3213 -9095 57567 112705 131950 118707 90665 105737 137269 89161 56551 60008 52138 91961
9543 91961 67671 13868 37175 51230 54356 45055 30884 48916 17504 -10284 -99 29086
9531 29086 92126 60395 -2714 15909 -22159 -46193 -39503 -16108 -12625 -14318 27683 21329 14095
9518 14095 -2967 -4641 -33136 -77554 -59567 -46901 22234 80751 84472 73850 63408 86188
9506 86188 115141 71237 21748 -18521 -26171 31394 64956 49244 26218 68624 127771 114652
9494 114652 94162 41301 19581 45282 82731 86305 77624 88593 108236 120020 84325 -2121
9482 -2121 10222 85312 74855 36925 77817 78359 50663 27040 38819 66392 114035 144135
$$ packed form
9568h400J8977P5931J7715k9998J9260m941l8312n8280m7400K6482N5130k9377
9556c213n882O6662N5138J9245j3243k8042J5072L1532m8108l2610L457p870L9823
9543I1961k4290n3803K3307J4055L126r301j4171J8032l1412k7788J0185K9185
9531B9086O3040l1731o3109J8623l8068k4034O690K3395L483j693M2001o354p234
9518A4095j7062j674k8495m4418J7987J2666O9135N8517L721j0622j0442K2780
9506H6188K8953m3904m9489m0269p650N7565L3562j5712k3026M2406N9147j3119
9494A14652k0490n2861k1720K5701L7449L574q681J0969J9643J1784l5695q6446
9482b121J2343P5090j0457l7930M0892N42k7696k3623J1779K7573M7643L0100
$$ plain form
9470 144135 111370 89197 99326 87913 49607 -3464 60539 105158 95671 53735 59945 61628
9458 61628 75239 53246 54747 18683 47280 98080 114360 104739 91898 93676 106589 72077
9446 72077 86997 86134 79117 93422 95853 80767 71895 45586 41799 109182 151384 123256 100478
9433 100478 97969 88728 25941 13203 12641 16990 43324 69423 71928 72459 72898 103446 163986 125218
9419 125218 101563 107506 138033 157017 140984 138288 98849 86788 106780 122734 141500 143576
9407 143576 155627 137728 125198 50121 18427 62342 51581 116083 116770 100147 107897 101649
9395 101649 71039 57337 40060 57522 75846 119368 120684 115056 147520 127616 140896 129521
9383 129521 102000 99921 98494 127679 202350 221610 188258 130384 124102 116688 95772 135122
$$ packed form
9470A44135l2765k2173J0129j1413l8306n3071O4003M4619r487m1936O210J683
9458F1628J3611k1993J501l6064K8597N0800J6280r621j2841J778J2913l4512
9446G2077J4920q63p017J4305K431j5086q872k6309l787O7383M2202k8128k2778
9433A00478k509r241o2787j2738n62M349K6334K6099K505N31M39L0548O0540l8768
9419A25218k3655N943L0527J8984j6033k696l9439j2061J9992J5954J8766K076
9407A43576J2051j7899j2530p5077l1694M3915j0761O4502O87j6623P750o248
9395A01649l0610j3702j7277J7462J8324M3522J316n628L2464j9904J3280j1375
9383A29521k7521k079j427K9185P4671J9260l3352n7874o282p414k0916L9350
$$ plain form
9371 135122 138746 149470 184241 158822 132532 163955 227804 248209 225341 173706 131871 157455
9359 157455 198751 223145 211975 183690 209129 248440 266212 232204 187474 184943 239344 227556
9347 227556 216497 291663 340216 304733 268209 234792 228032 237158 268751 248260 157009 168791
9335 168791 187979 201148 195196 236208 310859 344185 365932 400721 373184 376557 285610 264876
9323 264876 290813 296222 335393 400091 396675 386421 404802 385241 358259 296717 327058 359386
9311 359386 383397 421305 417456 409825 436666 475385 505504 483076 551175 563647 503326 488441
9299 488441 487088 499416 511446 542138 576618 586328 550776 531607 569463 642073 673891 697230
9287 697230 675699 647585 581513 594319 605258 651722 750573 776976 774049 775443 768123 788907
$$ packed form
9371A35122L624J0724L4771k5419k6290L1423O3849K0405k2868n1635m1835K5584
9359A57455M1296K4394j1170k8285K5439L9311J7772l4008m4730k531N4401j1788
9347B27556j1059P5166M8553l5483l6524l3417o760R126L1593k0491r1251J1782
9335A68791J9188J3169n952M1012P4651L3326K1747L4789k7537L373r0947k0734
9323B64876K5937N409L9171O4698l416j0254J8381j9561k6982o1542L0341L2328
9311C59386K4011L7908l849p631K6841L8719L0119k2428O8099J2472o0321j4885
9299D88441j353J2328J2030L0692L4480R710l5552j9169L7856P2610L1818K3339
9287F97230k1531k8114o6072J2806J0939M6464R8851K6403k927J394p320K0784
$$ plain form
9275 788907 779574 752018 775962 804088 836358 850922 912830 920430 920457 925157 996067 1032046 1069417
9262 1069417 1055049 1079969 1087943 1057495 1089474 1098929 1118847 1134922 1190517 1188131 1195316 1285435
9250 1285435 1360968 1439482 1457332 1445390 1525630 1563404 1550428 1582678 1622256 1649258 1660034
9239 1660034 1668321 1721434 1744896 1717338 1713825 1707616 1733939 1763591 1799602 1822451 1818119 1833077
9227 1833077 1869380 1867942 1826306 1839232 1890696 1948189 2012302 2050880 2025350 2006419 2012474 2029604
9215 2029604 2020117 2024137 1946856 1876019 1883410 1918241 1917476 1864050 1950729 1990753 1931025 1908972
9203 1908972 1883834 1804405 1774816 1823898 1794208 1771291 1733229 1695924 1658276 1618875 1587402
9192 1587402 1590446 1612954 1582191 1556385 1517477 1494504 1485475 1485276 1492633 1496543 1451560 1395943 1342965
$$ packed form
9275G88907r333k7556K3944K8126L2270J4564O1908P600K7M700P0910L5979L7371
9262A069417j4368K4920P974l0448L1979R455J9918J6075N5595k386P185R0119
9250A285435P5533P8514J7850j1942Q0240L7774j2976L2250L9578K7002J0776
9239A660034Q287N3113K3462k7558l513o209K6323K9652L6011K2849m332J4958
9227A833077L6303j438m1636J2926N1464N7493O4113L8578k5530j8931O055J7130
9215B029604r487M020p7281p0837P391L4831p65n3426Q6679M0024n9728k2053
9203A908972k5138p9429k9589M9082k9690k2917l8062l7305l7648l9401l1473
9192A587402L044K2508l0763k5806l8908k2973r029j99P357L910m4983n5617n2978
$$ plain form
9179 1342965 1313709 1306574 1281274 1269084 1256985 1229899 1167189 1119047 1114885 1128587 1057322 1041768
9167 1041768 1049020 1030409 969883 970166 963012 926985 914361 984640 957318 888846 879883 878805 864556
9154 864556 832540 826674 858897 861460 831234 798295 815360 814739 812582 779476 718362 729114 706646
9141 706646 712087 728966 688651 639599 586912 562857 582478 564453 607512 612253 565466 569368
9129 569368 597189 633465 615573 580586 518654 482762 516018 508329 485273 459263 454062 460654
9117 460654 463333 447133 403438 417844 418535 399793 416384 431840 435528 417802 399675 448173
9105 448173 492815 495969 441475 400425 396602 415043 469544 499641 410155 317402 333803 332656
9093 332656 325535 322684 313643 312470 330885 366943 333440 274086 301539 328043 322210 373342 402771
$$ packed form
9179A342965k9256p135k5300j2190j2099k7086o2710m8142m162J3702p1265j5554
9167A041768P252j8611o0526K83p154l6027j2624P0279k7322o8472q963j078j4249
9154H64556l2016n866L2223K563l0226l2939J7065o21k157l3106o1114J0752k2468
9141G06646N441J6879m0315m9052n2687k4055J9621j8025M3059M741m6787L902
9129E69368K7821L6276j7892l4987o1932l5892L3256p689k3056k6010n201O592
9117D60654K679j6200m3695J4406O91j8742J6591J5456L688j7726j8127M8498
9105D48173M4642L154n4494m1050l823J8441N4501L0097q9486r2753J6401j147
9093C32656p121k851r041j173J8415L6058l3503n9354K7453K6504n833N1132K9429
$$ plain form
9080 402771 389242 378127 333276 260377 226903 245147 243609 272584 251578 187817 230521 242342
9068 242342 233944 199645 193301 251893 243774 222340 203258 166949 207852 191208 166505 172986
9056 172986 185933 240398 228032 201618 143149 86897 89691 137247 174509 129041 139267 95180
9044 95180 65935 84818 126814 162908 155794 134084 180318 217507 205586 156361 138175 103994
9032 103994 127357 158393 224322 244840 179140 114636 80247 26864 23943 100798 135314 142771
9020 142771 127339 122060 143095 111114 61132 105414 137145 112539 38616 47608 82358 89352
9008 89352 83834 85051 49407 22939 93096 148667 180089 206577 212292 166252 151509 153096 166069
8995 166069 137374 146222 127196 98096 112637 146280 139229 144273 126911 109879 101445 160535
$$ packed form
9080D02771j3529j1115m4851p2899l3474J8244j538K8975k1006o3761M2704J1821
9068B42342q398l4299o344N8592q119k1434j9082l6309M0903j6644k4703O481
9056A72986J2947N4465j2366k6414n8469n6252K794M7556L7262m5468J0226m4087
9044I5180k9245J8883M1996L6094p114k1710M6234L7189j1921m9225j8186l4181
9032A03994K3363L1036O5929K0518o5700o4504l4389n3383k921P6855L4516P457
9020A42771j5432n279K1035l1981m9982M4282L1731k4606p3923Q992L4750O994
9008H9352n518J217l5644k6468P0157N5571L1422K6488N715m6040j4743J587J2973
8995A66069k8695Q848j9026k9100J4541L3643p051N044j7362j7032q434N9090
$$ plain form
8983 160535 162209 126113 107787 69192 56247 83959 58824 45062 62382 81517 44133 34433
8971 34433 44839 43816 79490 171489 181325 176936 123203 128813 179872 200635 204036 182347 167612
8958 167612 156864 143761 108106 92779 43254 73425 159671 228641 234909 183391 179625 151325
8946 151325 86538 52819 87713 136137 112690 83694 64335 6558 38153 82676 52248 95898
8934 95898 101887 118831 95324 89284 80773 87757 82250 67616 60528 26137 6060 8093 18903
8921 18903 55259 86026 93598 112860 67899 9414 27255 -21436 -47284 -3385 40394 88460
8909 88460 54160 -27064 -13683 -15471 -26123 4483 69155 42558 37297 68825 124419 143363
8897 143363 130489 114342 102712 126778 174745 178221 90929 84354 29504 -48094 -18929 -3671
$$ packed form
8983A60535J674l6096j8326l8595j2945K7712k5135j3762J7320J9135l7384r700
8971C4433J0406j023L5674R1999R836m389n3733N610N1059K0763L401k1689j4735
8958A67612j0748j3103l5655j5327m9525L0171Q6246O8970O268n1518l766k8300
8946A51325o4787l3719L4894M8424k3447k8996j9359n7777L1595M4523l0428M3650
8934I5898N989J6944k3507o040q511O984n507j4634p088l4391k0077K033J0810
8921A8903L6356L0767P572J9262m4961n8485J7841m8691k5848M3899M3779M8066
8909H8460l4300q1224J3381j788j0652L0606O4672k6597n261L1528N5594J8944
8897A43363j2874j6147j1630K4066M7967L476q7292o575n4850p7598K9165J5258
$$ plain form
8885 -3671 25941 42487 -6518 -54968 -82790 -38465 85835 88059 61358 7850 -13689 -49322
8873 -49322 -48077 -25643 -51575 -288 -20228 -73833 -69992 -31204 -3106 -15149 -76995 -67449
8861 -67449 -1278 -31265 -742 59789 30634 26408 49588 99961 105353 66394 57363 68383
8849 68383 35253 950 40276 55549 4989 -41597 60254 102744 50162 1613 4033 22812
8837 22812 28399 1258 -15144 9095 16945 -29484 -14121 -10356 -17500 -30676 -35497 -26189 29072
8824 29072 32788 72477 68525 82129 69975 33332 30796 -1963 30202 83851 67410 1027
8812 1027 -7363 5397 -15305 -2271 23624 25828 16303 5732 39091 106226 70086 21828 28975
8799 28975 54442 71561 76034 88573 62936 11016 -1650 -77513 -80370 -26059 -36118 -54357
$$ packed form
8885c671K9612J6546m9005m8450k7822M4325J24300K224k6701n3508k1539l5633
8873d9322J245K2434k5932N1287j9940n3605L841L8788K8098j2043o1846R546
8861f7449O6171k9987L0523O0531k9155m226K3180N0373N392l8959r031J1020
8849F8383l3130l4303L9326J5273n0560m6586J01851M2490n2582m8549K420J8779
8837B2812N587k7141j6402K4239P850m6429J5363L765p144j3176m821R308N5261
8824B9072L716L9689l952J3604j2154l6643k536l2759L2165N3649j6441o6383
8812A027q390J2760k0702J3034K5895K204r525j0571L3359O7135l6140m8258P147
8799B8975K5467J7119M473J2539k5637n1920j2666p5863k857N4311j0059j8239
$$ plain form
8787 -54357 429 32366 40202 41918 28202 12329 20939 10647 -2032 36898 54037 15219
8775 15219 -31221 -48041 16442 48476 94723 103989 65247 83559 88452 23866 741 12118
8763 12118 32997 46509 58646 51436 36873 65653 86122 68839 54265 46849 62728 70321
8751 70321 61676 43251 30530 11618 -15635 6970 31920 23874 -2527 465 49229 49733 -843
8738 -843 25293 19067 43252 29276 -15573 -68200 -39236 -19621 -57048 -56808 -11666 -16243 -27572
8725 -27572 -3352 51892 68114 13 10906 17672 87154 87803 128197 107512 33803 -32319
8713 -32319 -30691 -17833 -12181 52180 52817 -34815 -63944 -76411 -46885 -61931 -67355 14466 68744
8700 68744 89636 107765 80324 77722 60518 44463 45645 59667 56398 11694 -7079 -4634 -7813
$$ packed form
8787e4357N4786L1937P836J716j3716j5873Q610j0292j2679L8930J7139l8818
8775A5219m6440j6820O4483L2034M6247R266l8742J8312M893o4586k3125J1377
8763A2118K0879J3512J2137p210j4563K8780K0469j7283j4574p416J5879P593
8751G0321q645j8425j2721j8912k7253K2605K4950q046k6401K992M8764N04n0576
8738h43K6136o226K4185j3976m4849n2627K8964J9615l7427K40M5142m577j1329
8725b7572K4220N5244J6222o8101J0893O766O9482O49M0394k0685p3709o6122
8713c2319J628J2858N652O4361O37q7632k9129j2467K9526j5046n424Q1821N4278
8700F8744K0892J8129k7441k602j7204j6055J182J4022l269m4704j8773K445l179
$$ plain form
8687 -7813 16257 6351 -64991 -91114 -29875 18458 25851 -13346 -57088 -57593 -68756 -53584 -63069
8674 -63069 -21474 12148 40795 18294 -18158 -3996 62015 107024 112617 99257 87157 38567
8662 38567 10955 52662 69103 59731 63481 55401 80788 94471 47591 -6863 -9333 14620 87018
8649 87018 51114 27512 -18378 -33132 -54335 -37189 -17399 -41459 -79755 -54191 -32117 6735
8637 6735 93033 54218 24010 45424 39003 -495 41130 43160 12157 6650 -55799 -58717 -12748
8624 -12748 -18256 10793 7587 -42483 -80043 -80729 -102104 -33173 -12544 -1672 -42463 -61457 -56938
8611 -56938 15455 28484 -7087 30313 76336 73640 39214 27002 45383 31689 27352 44177
8599 44177 36187 35322 3379 -54432 -40342 -27711 8848 29654 59871 74471 61706 50004
$$ packed form
8687g813K4070r906p1342k6123O1239M8333P393l9197m3742n05j1163J5172r485
8674f3069M1595L3622K8647k2501l6452J4162O6011M5009N593j3360j2100m8590
8662C8567k7612M1707J6441r372L750q080K5387J3683m6880n4454k470K3953P2398
8649H7018l5904k3602m5890j4754k1203J7146J9790k4060l8296K5564K2074L8852
8637F735Q6298l8815l0208K1414o421l9498M1625K030l1003n507o2449k918M5969
8624a2748n508K9049l206n0070l7560o86k1375O8931K0629J0872m0791j8994M519
8611e6938P2393J3029l5571L7400M6023k696l4426j2212J8381j3694m337J6825
8599D4177p990q65l1943n7811J4090J2631L6559K0806L0217J4600j2765j1702
$$ plain form
8587 50004 55821 38487 69191 104973 86178 60800 36809 36216 -18326 -41333 -15214 44351
8575 44351 116925 87289 44230 18706 1497 -10042 35062 27408 39611 97735 116577 163964
8563 163964 179284 152689 133688 146030 149438 155606 168114 165238 171896 133981 117266 119031 120905
8550 120905 104915 99396 51981 33247 52280 63985 91792 69671 50745 30825 -52873 -55542
8538 -55542 -43954 -55944 -21517 24304 41737 28869 41652 25942 6588 -32298 -74963 -61075
8526 -61075 -70461 832 23236 -17719 -28547 21641 81351 98253 39250 -9717 43564 67531
8514 67531 111202 171465 167841 97681 31907 29815 94511 106721 69962 102288 82055 68569
8502 68569 76090 17037 27389 22014 -18149 2648 -29669 -47187 -33898 -19065 7924 20762
$$ packed form
8587E0004N817j7334L0704L5782j8795k5378k3991n93n4542k3007K6119N9565
8575D4351P2574k9636m3059k5524j7209j1539M5104p654J2203N8124J8842M7387
8563A63964J5320k6595j9001J2342L408O168J2508k876O658l7915j6715J765J874
8550A20905j5990n519m7415j8734J9033J1705K7807k2121j8926j9920q3698k669
8538e5542J1588j1990L4427M5821J7433j2868J2783j5710j9354l8886m2665J3888
8526f1075r386P1293K2404m0955j0828N0188N9710J6902n9003m8967N3281K3967
8514F7531M3671O0263l624p0160o5774k092O4696J2210l6759L2326k0233j3486
8502F8569P521n9053J0352n375m0163K0797l2317j7518J3289J4833K6989J2838
$$ plain form
8490 20762 50487 71437 77417 65057 1172 -29242 -74953 -35364 -3921 38230 70129 55656
8478 55656 -2203 10237 18484 35993 55321 46733 27978 30071 73018 -10808 -48442 -65374
8466 -65374 19374 104505 124525 124618 109110 40254 -43517 4930 41039 16055 3770 32989
8454 32989 77374 102780 43980 24923 9025 8155 -16016 22296 64608 70806 107359 66522
8442 66522 16924 25272 55394 76905 61030 73797 73989 93463 95532 95115 31591 347 42695
8429 42695 44304 -8034 -46987 -11215 -58006 -115734 -61167 -16988 -9295 43593 63243 69860
8417 69860 102436 74898 77693 34818 18650 -4223 -21486 -8072 56414 28617 275 -25932
8405 -25932 -54259 -11145 17724 51321 103295 76713 26467 10198 6769 2431 24130 17671
$$ packed form
8490B0762K9725K0950N980j2360o3885l0414m5711L9589L1443M2151L1899j4473
8478E5656n7859J2440Q247J7509J9328q588j8755K093M2947q3826l7634j6932
8466f5374Q4748Q5131K0020R3j5508o8856q3771M8447L6109k4984j2285K9219
8454C2989M4385K5406n8800j9057j5898q70k4171L8312M2312O198L6553m0837
8442F6522m9598Q348L0122K1511j5875J2767J92J9474K069m17o3524l1244M2348
8429D2695J609n2338l8953L5772m6791n7728N4567M4179P693N2888J9650O617
8417F9860L2576k7538K795m2875j6168k2873j7263J3414O4486k7797k8342k6207
8405b5932k8327M3114K8869L3597N1974k6582n0246j6269l429m338K1699o459
$$ plain form
8393 17671 -13814 -31019 -39405 -80518 -64083 -12536 34273 26430 -10395 -4376 44950 73885
8381 73885 66919 59011 47976 81427 66850 11261 -66808 -82729 -50150 -10709 -2033 8579
8369 8579 4267 -9451 -21395 -9312 -13382 39801 60176 97368 56667 28283 20623 2911 -38818
8356 -38818 -109151 -77625 -60844 -57582 -69333 -66092 -48827 -22956 -41508 -77287 20746 29466
8344 29466 -30313 -17418 -50589 -57924 -18717 1486 -5488 -39134 -33418 -29257 -35828 -64317 -77097
8331 -77097 -100892 -9844 51067 46263 47415 41718 47379 37685 5620 -7141 9975 -20013 -10484
8318 -10484 52556 43424 73025 131308 87025 30207 22363 5545 8257 17696 69410 49943 -3975
8305 -3975 -26313 -54278 -103232 -89774 -93182 -38062 -24901 11751 47680 -21419 -77588 -96819
$$ packed form
8393A7671l1485j7205q386m1113J6435N1547M6809p843l6825O019M9326K8935
8381G3885o966p908j1035L3451j4577n5589p8069j5921L2579L9441Q676J0612
8369H579m312j3718j1944J2083m070N3183K0375L7192m0701k8384p660j7712m1729
8356c8818p0333L1526J6781L262j1751L241J7265K5871j8552l5779R8033Q720
8344B9466n9779J2895l3171p335L9207K0203o974l3646N716M161o571k8489j2780
8331g7097k3795R1048O0911m804J152n697N661r694l2065j2761J7116k9988R529
8318a0484O3040r132K9601N8283m4283n6818p844j6818K712R439N1714j9467n3918
8305c975k2338k7965m8954J3458l408N5120J3161L6652L5929o9099n6169j9231
$$ plain form
8293 -96819 -18367 -4280 -31504 -3089 -18161 -43761 -28098 -20305 1395 63923 63853 9629 27298
8280 27298 76694 115225 84393 55947 28363 10964 8062 5164 109994 153308 109911 65825
8268 65825 55779 -8924 -49848 -62668 -59391 -31460 -30309 -71898 -65316 -19724 -26293 -21391 -38393
8255 -38393 -39811 -77872 -93323 -80571 -72008 -41981 16701 66494 96915 67702 6857 -45494
8243 -45494 -53910 -13869 27801 1151 -32455 23438 77672 59876 35329 68218 99807 116399
8231 116399 93731 2829 -7929 23422 -2445 21044 17346 2876 7823 44911 61161 80527
8219 80527 89593 64121 44307 64551 63366 49543 -21928 -41167 -48113 -58516 -120268 -115517 -39255
8206 -39255 -3921 -12422 -5120 9506 -24951 -101813 -151858 -119887 -55038 -8323 21478 -8831
$$ packed form
8293i6819P8452J4087k7224K8415j5072k5600J5663P793K1700O2528p0n4224J7669
8280B7298M9396L8531l0832k8446k7584j7399k902k898J04830M3314m3397m4086
8268F5825j0046o4703m0924j2820L277K7931J151m1589O582M5592o569M902j7002
8255c8393j418l8061j5451J2752Q563L0027N8682M9793L0421k9213o0845n2351
8243d5494q416M0041M1670k6650l3606N5893N4234j7796k4547L2889L1589J6592
8231A16399k2668r0902j0758L1351k5867K3489l698j4470M947L7088J6250J9366
8219H0527R066k5472j9814K0244j185j3823p1471j9239o946j0403o1752M751P6262
8206c9255L5334q501P302J4626l4457p6862n0045L1971O4849M6715K9801l0309
$$ plain form
8194 -8831 -71378 -86251 -23696 2966 31814 27364 12825 -14854 -19290 -31395 -40934 32216 56896
8181 56896 56024 39679 23067 51819 59829 25143 -45596 -27335 -18047 -74443 -65249 -67563 -37145
8168 -37145 -5467 26882 27576 13931 -39980 -44274 -25308 -3184 14596 51906 30706 -36033
8156 -36033 -29473 -37176 -36616 -22072 7788 47535 75194 29592 12732 -4239 -39633 -9842 47404
8143 47404 52292 744 -7428 4898 -60408 -64257 -5807 -11000 -65990 -85628 -61455 -28443 -33084
8130 -33084 -10936 77279 59595 34869 7663 2082 9633 5710 -33175 -32976 -40167 -33460 -8188
8117 -8188 64700 90450 83127 68902 53301 14217 32691 42792 25690 -23389 -42518 -41769 -18936
8104 -18936 34823 41137 37796 1289 -27406 8942 -1195 -12037 4328 45315 108257 128621
$$ packed form
8194h831o2547j4873O2555K6662K8848m450j4539k7679m436j2105r539P3150K4680
8181E6896q72j6345j6612K8752Q010l4686p0739J8261R288n6396R194k314L0418
8168c7145L1678L2349O94j3645n3911m294J8966K2124J7780L7310k1200o6739
8156c6033O560p703N60J4544K9860L9747K7659m5602j6860j6971l5394K9791N7246
8143D7404M888n1548q172J2326o5306l849N8450n193n4990j9638K4173L3012m641
8130c3084K2148Q8215j7684k4726k7206n581P551l923l8885J99p191O707K5272
8117h188P2888K5750p323j4225j5601l9084J8474J0101j7102m9079j9129P49K2833
8104a8936N3759O314l341l6507k8695L6348j0137j0842J6365M0987O2942K0364
$$ plain form
8092 128621 107981 91401 68782 20808 31140 21127 -22273 -1459 2846 -5856 3325 64418
8080 64418 80578 64724 26853 8840 -18246 -26621 20330 7249 -17092 47589 89484 55911
8068 55911 9775 -54633 -5242 -3220 -25681 -1618 44407 9951 -41798 -46440 -45923 15049 51321
8055 51321 14164 -22677 -50329 -82926 -102793 -67546 -72588 -95756 -130623 -182579 -158043 -128529
8043 -128529 -87433 -55816 -34441 -35571 -39239 44963 40161 64585 79820 76046 21492 -7691
8031 -7691 -65 -39120 -35428 -16328 -27528 -38597 -19287 19184 13490 7854 25262 80318 117507
8018 117507 65852 56876 86311 110042 147617 142398 146022 140395 109955 72019 67512 47947 15639
8005 15639 8190 2725 13427 32838 58042 39217 15489 -35681 -49081 -104805 -112364 -65755
$$ packed form
8092A28621k0640j6580k2619m7974J0332j0013m3400K0814M305q702R181O1093
8080F4418J6160j5854l7871j8013k7086q375M6951j3081k4341O4681M1895l3573
8068E5911m6136o4408M9391K022k2461K4063M6025l4456n1749m642N17O0972L6272
8055E1321l7157l6841k7652l2597j9867L5247n042k3168l4867n1956K4536K9514
8043a28529M1096L1617K1375j130l668Q4202m802K4424J5235l774n4554k9183
8031g691P626l9055L692J9100j1200j1069J9310L8471n694n636J7408N5056L7189
8018A17507n1655q976K9435K3731L7575n219L624n627l0440l7936m507j9565l2308
8005A5639p449n465J0702J9411K5204j8825k3728n1170j3400n5724p559M6609
$$ plain form
7993 -65755 -60023 -12326 33063 28640 -31592 -82086 -85351 -12094 -5062 15574 48509 15721 16693
7980 16693 43471 77570 27198 -30071 -46707 -19372 24610 55927 49601 30995 -51043 -85610
7968 -85610 -78655 -31409 -1280 -12642 -46871 -32775 23692 111318 129308 118904 92250 39195
7956 39195 29968 77199 89932 31941 7285 -2956 18035 29259 21727 67868 73603 12508
7944 12508 30613 55498 67702 50453 604 -33714 -36368 29507 61603 70887 15675 -20769
7932 -20769 -16232 7100 -5655 10817 53505 58294 17687 42020 56159 -29596 573 48969
7920 48969 39364 58315 113868 110487 112615 100918 15710 -53103 -41048 7114 -14244 -51528
7908 -51528 -61669 -49259 -63400 -53176 -19515 -39725 -19606 -19198 26281 25447 7408 41691 56899
$$ packed form
7993f5755N732M7697M5389m423o0232n0494l265P3257P032K0636L2935l2788R72
7980A6693K6778L4099n0372n7269j6636K7335M3982L1317o326j8606q2038l4567
7968h5610O955M7246L0129j1362l4229J4096N6467Q7626J7990j0404k6654n3055
7956C9195r227M7231J2733n7991k4656j0241K0991J1224p532M6141N735o1095
7944A2508J8105K4885J2204j7249m9849l4318k654O5875L2096R284n5212l6444
7932b0769M537K3332j2755J6472M2688M789m0607K4333J4139q5755L0169M8396
7920D8969r605J8951N5553l381K128j1697q5208o8813J2055M8162k1358l7284
7908e1528j0141J2410j4141J0224L3661k0210K0119M08M5479q34j8039L4283J5208
$$ plain form
7895 56899 87414 63746 28409 4211 -33421 -68915 -63213 -69638 -49930 -33100 -27934 13147
7883 13147 22262 -15492 17732 -402 -46385 -49495 -28740 -29206 -23000 -50322 -62592 -60686 -102508
7870 -102508 -88859 -88755 -70665 33206 59722 8697 54171 103618 58656 20421 25848 -19266
7858 -19266 -62114 -84511 -35661 -15242 23903 4218 -12181 -29033 -40545 -29531 -13606 40882
7846 40882 78621 112865 92293 67000 71683 68610 61985 44312 10264 17746 40543 35377 5115
7833 5115 26407 40211 15410 11034 -24574 -29094 -34684 8675 37808 25153 62759 82762 59480
7820 59480 5447 -21659 2438 12294 -32161 -24840 2750 26166 18904 7584 -7576 21698
7808 21698 13674 40022 71210 122623 96870 76620 30904 7122 19998 -20698 -42412 -78712
$$ packed form
7895E6899L0515k3668l5337k4198l7632l5494N702o425J9708J6830N166M1081
7883A3147R115l7754L3224j8134m5983l110K0755m66O206k7322j2270J906m1822
7870a02508J3649J04J8090J03871K6516n1025M5474M9447m4962l8235N427m5114
7858a9266m2848k2397M8850K0419L9145j9685j6399j6852j1512J1014J5925N4488
7846D0882L7739L4244k0572k5293M683l073o625j7673l4048P482K2797n166l0262
7833E115K1292J3804k4801m376l5608m520n590M3359K9133j2655L7606K0003k3282
7820E9480n4033k7106K4097R856m4455P321K7590K3416p262j1320j5160K9274
7808B1698q024K6348L1188N1413k5753k0250m5716k3782J2876m0696k1714l6300
$$ plain form
7796 -78712 -35558 21015 31367 29206 -20937 -35446 2409 -9674 -2735 2220 -9454 130 13417
7783 13417 659 -9802 75843 97210 99189 107376 110716 94102 77903 54746 36104 65355
7771 65355 59926 16319 -16041 -53742 -42886 -25126 34309 62763 31932 9251 18989 61352
7759 61352 32241 -33020 1330 30385 28841 34352 52949 44721 -17114 -26078 15291 -6450 -24641
7746 -24641 -14233 -11303 42312 69226 21298 46052 -16962 -60850 -42082 -43088 -20795 -71346
7734 -71346 -48154 9423 10939 -37177 -17944 52237 73447 5741 -80204 -88942 -38971 -18750
7722 -18750 7932 23494 -11800 -34259 12428 21186 28495 33104 -27246 -8173 -6898 13886 10843
7709 10843 -63095 -36945 17759 59113 61305 19713 39799 8698 20298 25849 49306 11812
$$ packed form
7796g8712M3154N6573J0352k161n0143j4509L7855j2083O939M955j1674R584J3287
7783A3417j2758j0461Q5645K1367J979Q187L340j6614j6199k3157j8642K9251
7771F5355n429m3607l2360l7701J0856J7760N9435K8454l0831k2681R738M2363
7759F1352k9111o5261L4350K9055j544N511J8597q228o1835q964M1369k1741j8191
7746b4641J0408K930N3615K6914m7928K4754o3014m3888J8768j006K2293n0551
7734g1346K3192N7577J516m8116J9233P0181K1210o7706q5945q738M9971K0221
7722a8750K6682J5562l5294k2459M6687Q758P309M609o0350J9073J275K0784l043
7709A0843p3938K6150N4704M1354K192m1592K0086l1101J1600N551K3457l7494
$$ plain form
7697 11812 3263 12093 -42037 -59066 -1810 48449 -8376 -49074 -6981 13280 47062 21472
7685 21472 -26652 -30772 570 30018 56993 32301 17790 17445 -22349 10570 -5621 -10930 23819
7672 23819 14459 6623 -39226 -15487 3029 18660 39606 41572 -7640 -23425 -17723 3992 21099
7659 21099 20578 26789 2693 -42110 -112521 -134485 -114713 -126177 -166887 -132503 -104746 -80501
7647 -80501 -23015 2272 12913 -44905 -47036 -22852 -30560 -55664 -66767 -76141 -46604 -1396
7635 -1396 -13155 -4914 14566 71278 29886 -36332 -74872 -66404 -103451 -86455 -95818 -115101 -124161
7622 -124161 -101679 -70857 -68404 -110998 -166591 -137232 -109147 -97058 -79245 -25861 -10143 -12455
7610 -12455 -22544 -30233 -44765 -29607 29267 52906 15339 -35709 -36491 -7854 -3323 -6228 -36187
$$ packed form
7697A1812q549Q830n4130j7029N7256N0259n6825m0698M2093K0261L3782k5590
7685B1472m8124m120L1342K9448K6975k4692j4511l45l9794L2919j6191n309L4749
7672B3819r360p836m5849K3739J8516J5631K0946J966m9212j5785N702K1715J7107
7659B1099n21O211k4096m4803p0411k1964J9772j1464m0710L4384K7757K4245
7647h0501N7486K5287J0641n7818k131K4184p708k5104j1103r374K9537M5208
7635a396j1759Q241J9480N6712m1392o6218l8540Q468l7047J6996r363j9283r060
7622a24161K2482L0822K453m2594n5593K9359K8085J2089J7813N3384J5718k312
7610a2455j0089p689j4532J5158N8874K3639l7567n1048p82K8637M531k905k9959
$$ plain form
7597 -36187 -21895 20029 -29837 -51982 -66631 -87755 -121889 -93800 -46129 -25701 -71735 -75032
7585 -75032 -100 19840 71892 65375 80735 24706 -12661 -62249 -74309 -58813 -87321 -26243
7573 -26243 38854 44558 77331 106005 68013 -12559 -54862 -46008 -39519 -34203 -35020 -44505 -11097
7560 -11097 -7354 -51058 -70033 -104232 -82376 -41785 -54823 -28614 -68237 -77536 -30231 -31301
7548 -31301 10220 33437 10145 26258 81807 132016 85642 36968 66288 73248 63421 83914
7536 83914 41157 18530 4100 13328 11058 -35588 -32336 -35181 -47185 -34593 -27111 -28422 -196
7523 -196 37822 19350 10879 31700 52895 36092 30347 28578 -33361 -55756 -20658 18299 45762
7510 45762 48841 36677 21687 28822 22919 24640 -1897 15794 -20225 -77888 -53131 9766 43018
$$ packed form
7597c6187J4292M1924m9866k2145j4649k1124l4134K8089M7671K0428m6034l297
7585g5032P4932J9940N2052o517J5360n6029l7367m9588j2060J5496k8508O1078
7573b6243O5097N704L2773K8674l7992q0572m2303Q854O489N316q17r485L3408
7560a1097L743m3704j8975l4199K1856M0591j3038K6209l9623r299M7305j070
7548c1301M1521K3217k3292J6113N5549N0209m6374m8674K9320O960r827K0493
7536H3914m2757k2627j4430R228k270m6646L252k845j2004J2592P482j311K8226
7523a96L8018j8472q471K0821K1195j6803n745j769o1939k2395L5098L8957K7463
7510D5762L079j2164j4990P135n903J721k6537J7691l6019n7663K4757O2897L3252
$$ plain form
7497 43018 64373 19442 14888 12635 19969 27968 53375 92812 111145 114064 45964 5469 13655
7484 13655 30534 -2548 -16848 1867 42887 60055 11400 -25038 -17792 -35800 -31984 -1637
7472 -1637 41607 58664 1522 6523 6346 -18379 -19836 3269 21228 19731 -55736 -82781 -55521
7459 -55521 -36236 9815 -50462 -123603 -169409 -181372 -95999 -35530 -22931 -18817 -41229 -44047
7447 -44047 -18286 15910 -27211 -66382 -37602 -26565 18765 69749 66935 35607 4416 8037
7435 8037 37328 31916 11132 25889 8830 -15364 -24520 -28768 17521 42890 14913 3171 40234
7422 40234 14789 -23965 -49169 -47364 -25157 23482 77653 16857 -46936 -8191 -8069 18344
7410 18344 -67933 -83268 -68942 -22861 34007 85127 151195 115982 71932 12068 -92691 -104773
$$ packed form
7497D3018K1355m4931m554k253P334P999K5407L9437J8333K919o8100m0495Q186
7484A3655J6879l3082j4300J8715M1020J7168m8655l6438P246j8008L816L0347
7472a637M3244J7057n7142N001j77k4725j457K3105J7959j497p5467k7045K7260
7459e5521J9285M6051o0277p3141m5806j1963Q5373O0469J2599M114k2412k818
7447d4047K5761L4196m3121l9171K8780J1037M5330N0984k814l1328l1191L621
7435H037K9291n412k0784J4757j7059k4194r156m248M6289K5369k7977j1742L7063
7422D0234k5445l8754k5204J805K2207M8639N4171o0796o3793L8745J22K6413
7410A8344q6277j5335J4326M6081N6868N1120O6068l5213m4050n9864j04759j2082
$$ plain form
7398 -104773 -43902 12470 40851 79316 66744 10316 8923 -28901 -51925 -61717 -44622 -29689
7386 -29689 -911 -11861 -48992 -81588 -108068 -75967 -44671 -16248 52097 55201 34176 50678
7374 50678 68531 20826 -33271 -41699 23074 62274 81216 38943 -11103 -39449 -48809 -3269
7362 -3269 58217 72566 4475 4971 16726 11058 -41328 -60480 -50747 -23354 33970 10530 30250
7349 30250 59596 43282 -18391 -39128 -19339 21792 43530 47626 25352 -12066 3252 -29123
7337 -29123 -40423 16078 62404 12441 -9662 -39668 -66348 -22468 13302 -7691 -14998 -6342
7325 -6342 5766 45471 71270 72617 10740 -17814 -4930 20687 20150 -20618 -30309 13514 -2748
7312 -2748 -13260 -8269 -11581 20935 24344 -3791 11850 16784 56379 92390 80893 57 3227
$$ packed form
7398a04773O0871N6372K8381L8465j2572n6428j393l7824k3024r792J7095J4933
7386b9689K8778j0950l7131l2596k6480L2101L1296K8423O8345L104k1025J6502
7374E0678J7853m7705n4097q428O4773L9200J8942m2273n0046k8346r360M5540
7362c269O1486J4349o8091M96J1755n668n2386j9152R733K7393N7324k3440J9720
7349C0250K9346j6314o1673k0737J9789M1131K1738M096k2274l7418J5318l2375
7337b9123j1300N6501M6326m9963k2103l0006k6680M3880L5770k0993p307Q656
7325f342J2108L9705K5799J347o1877k8554J2884K5617n37m0768r691M3823j6262
7312b748j0512M991l312L2516L409k8135J5641M934L9595L6011j1497q0836L170
$$ plain form
7299 3227 -5494 -53937 -50036 13526 11156 -5615 26148 33483 21018 28779 7761 -3239 10760
7286 10760 55987 42217 20744 14736 15941 -27239 -37182 -49982 -31232 -28016 -2949 21041 -10027
7273 -10027 -15685 24734 57139 63738 45832 13505 9854 -16339 -39778 1228 59078 66906 36324
7260 36324 31889 20813 36290 46777 37819 21252 87521 71172 -8889 -3405 16594 19073 75208
7247 75208 74839 47467 15000 36044 28013 24543 -18459 -21540 -13832 -85413 -29406 18920 54322
7234 54322 77152 54275 48295 4543 -13644 -28723 -32103 -51073 -40692 -60466 -16188 44938
7222 44938 24468 31375 14224 -21674 12861 -37113 -42913 4673 56355 117737 72876 4510
7210 4510 21201 108667 122119 69613 36419 3695 2161 -3034 2729 -24663 -36019 -8097 7385
$$ packed form
7299C227q721m8443L901O3562k370j6771L1763P335j2465P761k1018j1000J3999
7286A0760M5227j3770k1473o008J205m3180r943j2800J8750L216K5067K3990l1068
7273a0027n658M0419L2405O599j7906l2327l651k6193k3439M1006N7850P828l0582
7260C6324m435j1076J5477J0487q958j6567O6269j6349q0061N484J9999K479N6135
7247G5208l69k7372l2467K1044q031l470m3002l081P708p1581N6007M8326L5402
7234E4322K2830k2877n980m3752j8187j5079l380j8970J0381j9774M4278O1126
7222D4938k0470O907j7151l5898L4535m9974n800M7586N1682O1382m4861o8366
7210D510J6691Q7466J3452n2506l3194l2724j534n195N763k7392j1356K7922J5482
$$ plain form
7197 7385 8118 -12534 -64431 -61554 -85412 -81699 -96544 -89143 -84640 -67015 -58467 -52864 -43442 -63875
7183 -63875 3237 26251 -23158 -26169 13261 8585 3604 1526 -12781 -29572 -32702 408 15338
7170 15338 8992 26080 33410 26359 19312 -6366 -51404 -34062 -32908 -34035 -9409 27941 48363
7157 48363 30343 8345 -20547 -52329 -32607 -29429 -104 -40515 -4666 12820 -12268 -38854
7145 -38854 -6607 7673 19062 42330 68524 95730 82745 53617 61624 60606 67466 2165
7133 2165 -19806 -44068 -62407 -10666 64534 80595 -915 8800 22588 53758 -10970 -50390
7121 -50390 -9965 3417 -29647 -115514 -90517 -39188 -34231 -46039 -33145 -52340 -18565 -15298
7109 -15298 24040 56324 -9865 -16404 3051 13079 17636 -505 -51885 16396 83899 104182
$$ packed form
7197G385P33k0652n1897K877k3858L713j4845P401M503J7625Q548N603R422k0433
7183f3875O7112K3014m9409l011L9430m676m981k078j4307j6791l130L3110J4930
7170A5338o346J7088P330p051p047k5678m5038J7342J154j127K4626L7350K0422
7157D8363j8020k1998k8892l1782J9722L178K9325m0411L5849J7486k5088k6586
7145c8854L2247J4280J1389K3268K6194K7206j2985k9128Q007j018O860o5301
7133B165k1971k4262j8339N1741P5200J6061q1510R715J3788L1170o4728l9420
7121e0390M0425J3382l3064q5867K4997N1329M957j1808J2894j9195L3775L267
7109a5298L9338L2284o6189o539J9455J0028M557j8141n1380O8281O7503K0283
$$ plain form
7097 104182 62293 13041 1104 -39430 -66521 -76750 -57389 -73018 -16240 -33675 -15831 -57888
7085 -57888 -48515 -27375 -50556 -42855 -55440 -89394 -97662 -123445 -132819 -128327 -89206 -67092 -81832
7072 -81832 -111373 -114990 -86531 -9461 8745 38248 57960 61964 35116 10601 4472 4178 -50785
7059 -50785 -48527 -22731 -5179 3719 9451 77107 56014 33864 26007 25678 11143 -24418 -50331
7046 -50331 -57784 -44042 -1552 -17655 -41810 -41173 -11302 11051 -3858 -35335 -49111 -64904
7034 -64904 -55749 4388 56982 53687 50528 84317 92219 21120 -31636 -37157 8072 -4581 -71971
7021 -71971 -106154 -65294 -12877 -53869 -27553 -59714 -40515 -42446 -60463 -37881 -18571 -4427
7009 -4427 -15460 12340 -37197 -44090 -9480 29775 -3842 1302 -29768 -78942 -63831 -14607
$$ packed form
7097A04182m1889m9252j1937m0534k7091j0229J9361j5629N6778j7435J7844m2057
7085e7888R373K1140k3181P701j2585l3954q268k5783r374M492L9121K2114j4740
7072h1832k9541l617K8459P7070J8206K9503J9712M004k6848k4515o129k94n4963
7059e0785K258K5796J7552Q898N732O7656k1093k2150p857l29j4535l5561k5913
7046e0331p453J3742M2490j6103k4155O37K9871K2353j4909l1477j3776j5793
7034f4904R155O0137N2594l295l159L3789P902p1099n2756n521M5229j2653o7390
7021g1971l4183M0860N2417m0992K6316l2161J9199j931j8017K2582J9310J4144
7009d427j1033K7800m9537o893L4610L9255l3617N144l1070m9174J5111M9224
$$ plain form
6997 -14607 -53173 -102994 -47518 -3712 -39894 -82901 -112246 -56100 32927 43524 38484 19616
6985 19616 -29902 -111830 -72961 -63729 -47796 5717 24796 -39365 -40173 -30523 -30364 -52457 -28028
6972 -28028 -2120 -12557 -14717 -9945 -3839 -9620 342 38953 59157 22278 2860 -18566 -13733
6959 -13733 6727 -33893 -29532 -849 40100 77653 45355 -4729 24823 72160 101640 45895
6947 45895 -13102 -42073 -51014 -31761 335 -46804 347 -18840 -53457 -49024 -17698 -49786
6935 -49786 -52430 -92241 -80279 -67651 -79407 -33446 26320 31565 9316 30687 20777 -2396
6923 -2396 -53736 -59320 -47885 -44395 -8936 -21195 -31218 -79659 -102598 -40036 -16352 -3462
6911 -3462 65363 86342 30020 35048 69216 79709 68575 72455 112642 63311 12266 -10080
$$ packed form
6997a4607l8566m9821N5476M3806l6182m3007k9345N6146Q9027J0597n040j8868
6985A9616m9518q1928L8869R232J5933N3513J9079o4161q08R650J59k2093K4429
6972b8028K5908j0437k160M772O106n781R962L8611K0204l6879j9418k1426M833
6959a3733K0460m0620M361K8683M0949L7553l2298n0084K9552M7337K9480n5745
6947D5895n8997k8971q941J9253L2096m7139M7151j9187l4617M433L1326l2088
6935d9786k644l9811J1962J2628j1756M5961N9766N245k2249K1371r910k3173
6923b396n1340n584J1435L490L5459j2259j0023m8441k2939O2562K3684J2890
6911c462O8825K0979n6322N028L4168J0493j1134L880M0187m9331n1045k2346
$$ plain form
6899 -10080 -43447 -54415 -86676 -94695 -76494 -32381 11555 53960 -9751 -71234 -54696 37545
6887 37545 52451 22981 -15017 -84177 -40939 -12152 -24394 -4296 4523 44435 58387 59058
6875 59058 59053 92222 31010 -57178 -99907 -111917 -71516 -28098 -19056 -39460 -65705 -123433 -110646
6862 -110646 -85943 -64288 -87860 -77689 -81650 -67530 -48527 -29546 -84941 -125195 -119387 -97402
$$ packed form
6899a0080l3367j0968l2261q019J8201M4113M3936M2405o3711o1483J6538R2241
6887C7545J4906k9470l7998o9160M3238K8787j2242K0098Q819L9912J3952O71
6875E9058nL3169o1212q8188m2729j2010M0401M3418R042k0404k6245n7728J2787
6862a10646K4703K1655k3572J0171l961J4120J9003J8981n5395m0254N808K1985
$$ [...]
##END NTUPLES=NMR SPECTRUM
##END=
