##TITLE=Analysis number 321688
Compound Code cc 21914
Project Code adrs
Chemist Name fudan
##JCAMPDX= 6.0         $$ Bruker NMR JCAMP-DX V2.0
##DATA TYPE= NMR SPECTRUM
##DATA CLASS= NTUPLES
##ORIGIN= Bruker BioSpin GmbH
##OWNER= nmr
$$ XWIN-NMR		Version 3.5
$$ Tue Aug 22 13:08:50 2006 GMT Daylight Time (UT+1h)  MAYBRIDGE\nmr@NMR_250MHZ
##.OBSERVE FREQUENCY= 250.131544655141
##.OBSERVE NUCLEUS= ^1H
##.ACQUISITION MODE= SIMULTANEOUS (DQD)
##.ACQUISITION SCHEME= undefined
##.AVERAGES= 16
##.DIGITISER RES= 18
##SPECTROMETER/DATA SYSTEM= dpx250
##.PULSE SEQUENCE= zg30
##.SOLVENT NAME= CDCl3
##.SHIFT REFERENCE= (INTERNAL, CDCl3, 0, 16.522)
##AUDIT TRAIL= $$ (NUMBER, WHEN, WHO, WHERE, WHAT)
$$ ##TITLE= Audit trail, XWIN-NMR		Version 3.5
$$ ##JCAMPDX= 5.01
$$ ##ORIGIN= Bruker BioSpin GmbH
$$ ##OWNER= nmr
$$ C:\u/data/dgb/nmr/ADRS/1390/pdata/1/auditp.txt
$$ ##AUDIT TRAIL=  $$ (NUMBER, WHEN, WHO, WHERE, WHAT)
(   1,<2006-08-22 13:08:27.80 +100>,<MAYBRIDGE\nmr>,<NMR_250MHZ>,
      <created by zg, POWCHK disabled, PULCHK disabled
       configuration hash MD5:
       E2 DF 36 D8 04 B2 41 60 5A D7 A3 38 5A 4B D0 FE
       data hash MD5: 64K
       8A 8F CF A9 42 E2 13 8B 74 08 62 93 2D 8C E6 5A>)
(   2,<2006-08-22 13:08:40.57 +100>,<MAYBRIDGE\nmr>,<NMR_250MHZ>,
      <Start of raw data processing
       ef LB = 0.3 FT_mod = 6 PKNL = 1 SI = 32K 
       data hash MD5: 32K
       0B 82 6D EB 0E 88 4D 7A 87 CC 34 EB 2F 55 B7 8A>)
(   3,<2006-08-22 13:08:42.35 +100>,<MAYBRIDGE\nmr>,<NMR_250MHZ>,
      <apk 
       data hash MD5: 32K
       4D 1A 78 F5 35 BC 46 8F 2A 59 99 D9 BA 60 C2 72>)
(   4,<2006-08-22 13:08:43.13 +100>,<MAYBRIDGE\nmr>,<NMR_250MHZ>,
      <abs ABSG = 5 
       data hash MD5: 32K
       A4 D8 97 2B 40 BB 1E 17 CD D7 EC E9 13 CF BD 26>)
$$ ##END=
$$ 
$$ hash MD5
$$ 83 60 1B 1E B9 28 EE B0 E2 1B CF C1 43 D5 A7 93
##$RELAX= 
##$RELAX= 
##$RELAX= 
##$RELAX= 
##$RELAX= 
##$RELAX= 
##$RELAX= 
$$ Bruker specific parameters
$$ --------------------------
##$DU= <C:\u>
##$EXPNO= 1390
##$NAME= <ADRS>
##$PROCNO= 1
##$TYPE= <nmr>
##$USER= <dgb>
##$AMP= (0..31)
100 100 100 100 100 100 100 100 100 100 100 100 100 100 100 100 100 100 
100 100 100 100 100 100 100 100 100 100 100 100 100 100 
##$AQSEQ= 0
##$AQ_mod= 3
##$AUNM= <au_zg>
##$AUTOPOS= <33 >
##$BF1= 250.13
##$BF2= 250.13
##$BF3= 250.13
##$BF4= 250.13
##$BF5= 500.13
##$BF6= 500.13
##$BF7= 500.13
##$BF8= 500.13
##$BYTORDA= 1
##$CFDGTYP= 0
##$CFRGTYP= 5
##$CHEMSTR= <none>
##$CNST= (0..31)
1 1 145 1 1 1 1 1 1 1 1 1 1 1 1 1 1 1 1 1 1 1 1 1 1 1 1 1 1 1 1 1 
##$CPDPRG= <>
##$CPDPRG1= <>
##$CPDPRG2= <>
##$CPDPRG3= <>
##$CPDPRG4= <mlev>
##$CPDPRG5= <mlev>
##$CPDPRG6= <mlev>
##$CPDPRG7= <mlev>
##$CPDPRG8= <mlev>
##$CPDPRGB= <>
##$CPDPRGT= <>
##$D= (0..31)
0 1 0 0 0 0 0 0 0 0.06 0 0 0 0 0 0 0.0002 0 0 0 0 0 0 0 0 0 0 0 0 0 0 
0 
##$DATE= 1156248506
##$DBL= (0..7)
120 120 120 120 120 120 120 120 
##$DBP= (0..7)
150 150 150 150 150 150 150 150 
##$DBP07= 0
##$DBPNAM0= <>
##$DBPNAM1= <>
##$DBPNAM2= <>
$$ [...]
##$SUBNAM7= <"">
##$SUBNAM8= <"">
##$SUBNAM9= <"">
##$SW= 20.6930455092707
##$SWIBOX= (0..15)
0 0 3 0 0 0 0 0 0 0 0 0 0 0 0 0 
##$SW_h= 5175.983436853
##$TD= 65536
##$TD0= 1
##$TE= 295.16
##$TE2= 300
##$TE3= 300
##$TEG= 300
##$TL= (0..7)
0 120 120 120 120 120 120 120 
##$TP= (0..7)
150 150 150 150 150 150 150 150 
##$TP07= 0
##$TPNAME0= <>
##$TPNAME1= <>
##$TPNAME2= <>
##$TPNAME3= <>
##$TPNAME4= <>
##$TPNAME5= <>
##$TPNAME6= <>
##$TPNAME7= <>
##$TPOAL= (0..7)
0.5 0.5 0.5 0.5 0.5 0.5 0.5 0.5 
##$TPOFFS= (0..7)
0 0 0 0 0 0 0 0 
##$TUNHIN= 0
##$TUNHOUT= 0
##$TUNXOUT= 0
##$USERA1= <user>
##$USERA2= <user>
##$USERA3= <user>
##$USERA4= <user>
##$USERA5= <user>
##$V9= 5
##$VALIST= <valist>
##$VCLIST= <CCCCCCCCCCCCCCC>
##$VD= 0
##$VDLIST= <DDDDDDDDDDDDDDD>
##$VPLIST= <PPPPPPPPPPPPPPP>
##$VTLIST= <TTTTTTTTTTTTTTT>
##$WBST= 1024
##$WBSW= 4
##$XGAIN= (0..3)
0 0 0 0 
##$XL= 0
##$YL= 0
##$YMAX_a= 297387
##$YMIN_a= -607636
##$ZGOPTNS= <>
##$ZL1= 120
##$ZL2= 120
##$ZL3= 120
##$ZL4= 120
##$ABSF1= 16.522
##$ABSF2= -4.171173
##$ABSG= 5
##$ABSL= 3
##$ALPHA= 0
##$AQORDER= 0
##$ASSFAC= 0
##$ASSFACI= 0
##$ASSFACX= 0
##$ASSWID= 0
##$AUNMP= <proc_1d>
##$AZFE= 0.1
##$AZFW= 0.1
##$BCFW= 0
##$BC_mod= 0
##$BYTORDP= 0
##$COROFFS= 0
##$CY= 12.5
##$DATMOD= 1
##$DC= 0
##$DFILT= <>
##$DTYPP= 0
##$F1P= 14.0000005364418
##$F2P= -0.99999901652339
##$FCOR= 0.5
##$FTSIZE= 32768
##$FT_mod= 6
##$GAMMA= 0
##$GB= 0
##$INTBC= 1
##$INTSCL= 1
##$ISEN= 128
##$LB= 0.3
##$LEV0= 0
##$LPBIN= 0
##$MAXI= 10000
##$MC2= 0
##$MEAN= 0
##$ME_mod= 0
##$MI= 0
##$NCOEF= 0
##$NC_proc= -5
##$NLEV= 6
##$NOISF1= 0
##$NOISF2= 0
##$NSP= 0
##$NTH_PI= 0
##$NZP= 0
##$OFFSET= 16.522
##$PC= 1
##$PHC0= 145.0555
##$PHC1= 12.62849
##$PH_mod= 1
##$PKNL= yes
##$PPARMOD= 0
##$PSCAL= 4
##$PSIGN= 0
##$REVERSE= no
##$SF= 250.13
##$SI= 32768
##$SIGF1= 0
##$SIGF2= 0
##$SINO= 400
##$SIOLD= 32768
##$SREGLST= <1H.CDCl3>
##$SSB= 0
##$STSI= 32768
##$STSR= 0
##$SW_p= 5175.98343685301
##$SYMM= 0
##$S_DEV= 0
##$TDeff= 65536
##$TDoff= 0
##$TI= <Analysis number 999999
Compound Code 99
Book Reference 9
Project Code 9>
##$TILT= no
##$TM1= 0
##$TM2= 0
##$TOPLEV= 0
##$USERP1= <user>
##$USERP2= <user>
##$USERP3= <user>
##$USERP4= <user>
##$USERP5= <user>
##$WDW= 1
##$XDIM= 32768
##$YMAX_p= 492801181
##$YMIN_p= -475099
$$ End of Bruker specific parameters
$$ ---------------------------------
##NTUPLES= NMR SPECTRUM
##VAR_NAME=  FREQUENCY,     SPECTRUM/REAL,   SPECTRUM/IMAG
##SYMBOL=    X,             R,               I
##VAR_TYPE=  INDEPENDENT,   DEPENDENT,       DEPENDENT
##VAR_FORM=  AFFN,          ASDF,            ASDF
##VAR_DIM=   32768,         32768,           32768
##UNITS=     HZ,            ARBITRARY UNITS, ARBITRARY UNITS
##FACTOR=    0.157963299565203, 1,           1
##FIRST=     4132.6476996994, 0,             0
##LAST=      -1043.33573715361, 0,           0
##MIN=       -1043.33573715361, -475099,     0
##MAX=       4132.6476996994, 492801181,     0
$$ Real data points
##PAGE= N=1
##DATA TABLE= (X++(R..R)), XYDATA
$$ [...]
23309D0075M0009O689m6067j35816Q1020N6766Q4552Q1297p4716q3832o1818l285
23297a5126o4289m4417K9668O4483k2722O5642N1008j4793J2490J7841k7719n839
23285D6227m8505r416j3549L728N1581j6581n895k7386k5237L8935n159r257j8688
23272c9202o306K0955R782m6898J1663n9538o5786K7189Q6581Q7180L5524p7412
23260a6268m925L5565J02410P449j16075q9360N9715K8774l5802k8353j4661M8538
23248b2993N7242L8041p756n2320n4105L5944P3134N7462P0972J4296n7821n0730
23236A01366l9358o3607k0011O1153m6789n048N1108L5885j1691j031l1992p4359
23224d4374j9056N7174Q1686l5560M6082L1085q185l7149k8738k2214o0708p5662
$$ y = [40075, 80084, 86773, 40706, -95110, -14090, 42676, 127228, 208525, 133809, 49977, -11841, -15126, -79415, -123832, -94164, -29681, -52403, 13239, 64247, 49454, 61944, 79785, 52066, 46227, -2278, -11694, -25243, -21515, 30066, 13485, 7590, -19796, -45033, -6098, -11257, -20514, -39202, -45508, -24553, -14771, -61669, -50006, -109544, -175330, -148141, -61560, 25620, 61144, -16268, -21193, 14372, 116782, 124231, 8156, -81204, -21489, 7285, -28517, -56870, -71531, -22993, 34249, 72290, 64534, 12214, -41891, -5947, 67187, 124649, 195621, 209917, 152096, 101366, 62008, -1599, -21610, 39543, -7246, -12294, 38814, 74699, 63008, 61977, 29985, -44374, -63430, -6256, 75430, 39870, 85952, 117037, 108852, 71703, 42965, 20751, -39957, -115619]
23212a15619l5188R8455L2886m2611L1371K5528l3385K02j8115P7912L2620k4684
23200B9372K9121J630N4939m8446p6576K2778L4633p0371r158J3394m6169o2171
23188a27024Q52L6823J7155M9278L6770o917l0886n9001K8603Q2719m7319j04234
23176a23181M8912O1367M1137r3145k1906M2022n7702k148q173K8101p284L8823
23164e3177J9003l4788l6332J0186M5082N9946O861m2495l6837p9736j1259L3635
23152a19911R448P603J0225P5896k1862K7914m262l054j4094j08746K8856M1771
23140g0216l3118j7532L4125O4764J727p4946M8809N3045l3082m5401Q04L7926
23128c3095k1989R944K6014P9353N1209l9798n1372M8404k5412o9750q506l2228
$$ y = [-115619, -150807, -52352, -19466, -62077, -30706, -5178, -38563, -38361, -56476, 21436, 54056, 29372, 58493, 60123, 115062, 66616, -9960, 12818, 47451, -22920, -32078, -18684, -64853, -127024, -126172, -89349, -72194, -22916, 13854, 6937, -23949, -82950, -54347, 28372, -18947, -123181, -74269, -12902, 28235, -64910, -86816, -44794, -102496, -104644, -112817, -84716, -92000, -53177, -34174, -68962, -105294, -95108, -50026, 9920, 16781, -25714, -62551, -142287, -153546, -119911, -110463, -102860, -92635, -16739, -38601, -10687, -14949, -18003, -32097, -140843, -111987, -70216, -103334, -120866, -86741, -21977, -20250, -95196, -46387, 6658, -26424, -71825, -71021, -33095, -55084, -45140, -19126, 60227, 111436, 71638, 20266, 68670, 43258, -26492, -34998, -67226]
23116f7226L2607R5045O55J5652J7991l9860P526n2484J0550K5822K7522J3225
23104H7025j2834m9524o6173o646K5959n5148k1203K3417M0897J3411K7481k2794
23092a6132L7041j5380j2790k6244l1247l207Q249P83k2178k4673J1235N9910
23080c4633O4163k2718J2827R411J883k946n9982k7608m7317L9124P2688R229
23068A4121p1356j368K6253o3218M2839L2564j6883N4281P5787o239j9091n8345
23056I345M476o861j9102N2044k5219l0353L6386J7026L2297k0189K6585k5111
23044E1324l7732k1385R823L727R417p28j3901j911O2237q508M453k9682m4313
23031a7179r44J077M3737k8765R353K7889P974o1606o5370n56m617R3642K287
$$ y = [-67226, -34619, 60426, 61081, 76733, 94724, 54864, 62390, 9906, 20456, 46278, 73800, 87025, 74191, 24667, -41506, -48152, -22193, -77341, -98544, -75127, -34230, -20819, 6662, -16132, 20909, 5529, -7261, -33505, -64752, -67959, -59710, -58927, -81105, -105778, -94543, -34633, 29530, 6812, 19639, 29050, 30933, 27987, -31995, -59603, -106920, -67796, 4892, 14121, -57235, -58603, -32350, -95568, -52729, -20165, -37048, 17233, 93020, 86781, 67690, 9345, 13821, 6960, -12142, 39902, 14683, -15670, 20716, 37742, 70039, 49850, 76435, 51324, 13592, -7793, 2030, 5757, 15174, 14446, 545, -1366, 60871, 52363, 56816, 27134, -17179, -18123, -17046, 26691, -2074, 7279, 35168, 43142, -18464, -83834, -84390, -89007, 4635, 6922]
23018F922R795M9416k805r7148K5470R535N7153o6232j0820O8494J2881J935J7734
23005H2330J2345l9598l6970j04694l2764N4579K3661K0106j2453J2970L3076
22994A2588L7237k0979n0293K8532l405l26k6637p6129N56N4230l1529j517l276
22981h0948J411o1958L7306L9444J7042r074P8820k3934L7705q593J5796m9909
22969f892j1437j2950L8794L1048l0317p905l147l1134k4700J5536k7759P514
22957f3349l6072l892N3836Q2945L705l7747l9209p9165k3045K7633r166j8342
22945a41868R129O3032k8479K3074N5222J7858N592m89L537J9478k0949l2650
22933b7513M834n5894J977J00133K1092l6170k0594j5919K2282L7623K646k9144
$$ y = [6922, 16717, 66133, 63328, -33820, -8350, 1185, 58338, -7894, -18714, 49780, 62661, 64596, 82330, 94675, 55077, 18107, -86587, -119351, -64772, -41111, -21005, -33458, -20488, 12588, 49825, 28846, -21447, 7085, 3680, 3354, -23283, -99412, -98856, -44626, -76155, -77672, -80948, -79537, -141495, -104189, -64745, -47703, -56777, 22043, -1891, 35814, 27221, 43017, -6892, -18329, -31279, 7515, 38563, 8246, 341, -2806, -33940, -58640, -43104, -70863, -63349, -99421, -103313, -49477, 33468, 37173, -574, -39783, -118948, -141993, -114360, -123526, -141868, -132739, -69707, -98186, -75112, -19890, -2032, 3560, 3071, 6608, 26086, 5137, -27513, -22679, -78573, -76596, 23537, 44629, 8459, -12135, -28054, -5772, 31851, 34497, 5353]
22921E353j1781J5723O2093K7300j7941P401o65K3304r848J6882l3139m7154k1650
22908A5878p7781l9754M8672R1134O6158K0222J9409n0261P385j6684p0934n7734
22896d4290J4021J0779L4858k3192k774n1385j7160N1195N7314k4588R9116p7109
22884B6785o815l2290q397M4956r753q3404m1021O7841M8547n2581k1042l2469
22872i9643K5072L4689l6523J0885j0986M7876k5299r2775M6262O1073L5356j6978
22860b0991o3833k3101Q92J5246k1269k4213O6751L2987O891o0216K6913Q6275
22848B2332k7673k3015L3364j8067O478k4591K0366m943j0478J4740M443K1740
22836A4696N7103J3202p4346k8796L2533N7390m6644n7797L8649J0403P9794O2456
$$ y = [5353, -6428, 9295, 71388, 98688, 80747, 88148, 87483, 110787, 100939, 117821, 84682, 37528, 15878, -61903, -101657, -52985, 38149, 104307, 124529, 143938, 93677, 101062, 84378, 13444, -44290, -30269, -19490, 15368, -7824, -10598, -61983, -79143, -27948, 29366, 4778, 103894, 26785, 19970, -12320, -20717, 24239, 14486, -68918, -109939, -42098, 6449, -46132, -67174, -99643, -74571, -39882, -76405, -65520, -76506, -28630, -53929, -146704, -100442, -39369, -4013, -20991, -84824, -107925, -107033, -91787, -113056, -137269, -70518, -37531, -30640, -90856, -63943, 22332, -5341, -28356, 5008, -13059, -6581, -31172, -10806, -15749, -26227, -11487, -7044, 14696, 71799, 85001, 10655, -18141, 14392, 71782, 25138, -32659, 5990, 16393, 96187, 158643]
22824A58643o5262j05409K0835j8124o759n1867J248J6198J7780p479k9329N4844
22812a4681J4213m0029N7233O9032J3575l0214m1218k1896L8357J0589j702L5257
22800H8516q405n4909J588p4544j1753O1604n1932R872J0084l3273r424J7879
22788e4697l4200J05418J02637m8749l2950k0r3432J550J25124l3270j9785K7625
22776D5251J8660j3396p751K5949M4787P5492m4152n4404o5306m958J1883O7537
22764I9592p968j4988j7205R259k0944o716O998l4425P2669R3496l2619r0640
22752E6509l2040k3487m4380k7371N5792M2343L5287l7267j4145m4753J8398m1058
22740e6172J06800P0684o056o5727k1899j2266k0252n6774K6377Q2421l6213l4455
$$ y = [158643, 93381, -12028, 8807, -9317, -16076, -67943, -66695, -50497, -32717, -40196, -69525, -14681, -468, -40497, 16736, 85768, 99343, 69129, 27911, 6015, 44372, 54961, 53259, 88516, 80111, 25202, 26790, -47754, -59507, 2097, -49835, -39963, -29879, -63152, -72576, -54697, -88897, 16521, 119158, 70409, 37459, 37439, -55993, -54443, 70681, 37411, 17626, 45251, 63911, 50515, 42764, 68713, 113500, 188992, 144840, 90436, 25130, 20172, 32055, 99592, 91624, 76636, 59431, 68690, 47746, 41030, 48028, 13603, 86272, 179768, 147149, 56509, 24469, 982, -43398, -70769, -14977, 27366, 62653, 25386, 11241, -33512, -15114, -56172, 50628, 121312, 115256, 49529, 27630, 15364, -4888, -61662, -35285, 47136, 10923, -23532]
22728b3532l3413j2607Q6620P2129m6172j8013M1556J6941j3765P621O523m7709
22716C6179n9312K8961K337P633P4790L489m8311Q344n3507M9516O2141k5979
22704H6281k9550K3104l0606l5958O2496N8092L3282r0292o0888J2462k6761o4473
22692f2811n1785J8261j9576N478l049P6708M8661Q7241k6724q005l0500L7610
22680G1509j3311l7436k7934l7480j2306L3864M2586O2503j2284l0745k548K0071
22668E6489k3592n6999J6253k7926q6304j0286J29276J1425m8329j7571l5184
22657i2748N584n2709j0015Q4657K4661l3102k2125J2172K2877N1487l1363M367
22645c6257J11094P5582n8524m5273L721j0798L5167K944j0030p7518k7048M8867
$$ y = [-23532, -56945, -69552, 17068, 89197, 43025, 25012, 66568, 83509, 69744, 77365, 83888, 36179, -23133, 5828, 8165, 15798, 90588, 94077, 45766, 54110, 603, 50119, 112260, 86281, 56731, 79835, 49229, 13271, 75767, 133859, 167141, 76849, 15961, 28423, 1662, -62811, -114596, -96335, -115911, -110433, -113482, -36774, 11887, 99128, 72404, 64399, 33899, 71509, 58198, 20762, -7172, -44652, -56958, -23094, 19492, 81995, 69711, 38966, 36418, 56489, 32897, -24102, -7849, -35775, -122079, -132365, -3089, 8336, -39993, -57564, -92748, -87164, -139873, -149888, -65231, -40570, -73672, -95797, -83625, -60748, -9261, -40624, -36257, 74837, 150419, 91895, 46622, 50343, 39545, 74712, 77656, 67626, -9892, -36940, 11927]
22633A1927M2232n9458m6984L8842k3632n2773J3904l471O9145L7982m6726p6944
22621i5956L5681o613k0775N1648N2026k4927r822J15789k892j1872q733n7350
22609A6204k7372K1305Q982k9064k1041p6692m0778M8536m1984K2387P9822m965
22597d4660n9863k5441M5338k862J3947K7299J8363N1961o030j8146K9895l4349
22585d548l9037k8475J9745M6586R5385L9458m8876k8068j26593k0984Q3915M8268
22573C6776Q1826J791l722r2813o2711o6497N7437O7999O4814J7724J5553k4325
22561I3852j376O1884r2066r0466j38946L951l0750L5404P8499J1937O5012k0580
22549b3645m0162o514K1091r082J3675N1216Q1192K1434k5246k5674K8351K804
$$ y = [11927, 54159, -5299, -52283, -13441, -37073, -89846, -75942, -79413, -10268, 27714, -19012, -95956, -60275, -66888, -87663, -36015, 16011, -8916, -18738, 97051, 94159, 82287, 73554, 16204, -11168, 10137, 19119, -9945, -30986, -107678, -148456, -99920, -141904, -119517, -39695, -44660, -104523, -129964, -84626, -87488, -73541, -46242, -27879, 24082, 18052, -94, 29801, -4548, -43585, -72060, -52315, -5729, 89656, 129114, 80238, 52170, -74423, -95407, -11492, 36776, 118602, 120393, 116671, 23858, -38853, -105350, -47913, 20086, 84900, 102624, 118177, 93852, 92476, 154360, 62294, -28172, -167118, -163167, -193917, -158513, -80014, -68077, -3065, -23645, -63807, -70321, -49230, -58312, -44637, 6579, 87771, 109205, 83959, 58285, 86636, 89440]
22537H9440J7158p0040q0564J6569J0534L0475q2953m7874J3888R3401N0021j8111
22525B1944L4643k3252M9402R362l3468o6254K8040l5282o0671P570J6329k2125
22513g3762m7768Q1926P0088P657k1572k2392P6941j6274o3510q9578N9295O5805
22501B6856M7546M1945k1652n9708j5622j5991K1444n3874k3714L9251J08464
22490I4945l9420m2229L0355K8594O468j3009l0324m0358k1451M537N7759N0971
22478H6838l663k0920j6460o612l1568q7921J789K071O9209P1487n8321q1057
22466g5128J3961J1529M432J2744J02346N026k1417n23J9161o6533K7035m2736
22454a0103n4425M8993O3581k2036m9078k8846L8584p554J2224p183P5265N2133
$$ y = [89440, 106598, 36558, -44006, -27437, -16903, 13572, -69381, -117255, -103367, -9966, 40055, 21944, 56587, 33335, 82737, 92099, 58631, -7623, 20417, -14865, -75536, -67966, -51637, -73762, -121530, -39604, 30484, 38141, 16569, -5823, 71118, 54844, -8666, -98244, -38949, 26856, 74402, 116347, 94695, 34987, 19365, 3374, 24818, -29056, -52770, -13519, 94945, 55525, 13296, 43651, 72245, 78713, 65704, 35380, -4978, -26429, -21892, 35867, 86838, 83175, 62255, 45795, 39183, 7615, -80306, -78517, -76446, -7237, 64250, 5929, -75128, -61167, -49638, -45206, -32462, 69884, 74910, 53493, 52970, 72131, 5598, 32633, -10103, -64528, -15535, 48046, 26010, -23068, -51914, -13330, -20884, -8660, -15843, 59422, 111555]
22442A11555L4562r3460j9465k3353n7387J5599K7690q4651k3140O3940J35781
22431H7671L3429k3363o1952l9146K486J1510r1049K977Q8898M9971o6263p5323
22419h0154n7159j177Q0021N0734k3120L0358L8655n5085q8194Q166P2072R1302
22407F6419K2665L5P9050J4372m2145j10004k3809R9K2245j3764J1467j7953j3000
22394d323r1467J1406J1067j4327O859L3830j3626j3729l8959p0312m717J23955
22382f4343J12565l6410J6511Q5369J23039q771j35959j8076L198r6251j1200
22371c0328k6457k6515O1345R5512j1867P554L5399p1621p3587l836P895K6620
22359i886P3026k9394o9314j1476R4091l3648n2099N2896j791l3215o2782J4924
$$ y = [111555, 146117, 52657, 33192, 9839, -47548, -31949, -4259, -88910, -112050, -48110, 87671, 121100, 97737, 35785, -3361, -875, 10635, -80414, -77437, 11461, 61432, -4831, -80154, -137313, -138490, -58469, -7735, -30855, -497, 38158, -16927, -105121, -96955, -24883, 66419, 89084, 89119, 168169, 182541, 140396, 30392, 6583, 6682, 28927, 15163, 26630, 8677, -4323, -95790, -84384, -73317, -87644, -80785, -46955, -60581, -74310, -113269, -183581, -188298, -64343, 48222, 11812, 28323, 113692, 236731, 227960, 92001, 73925, 77123, -19128, -30328, -56785, -83300, -21955, 73557, 61690, 69244, 104643, 33022, -40565, -44401, -36506, -9886, 63140, 33746, -35568, -47044, 47047, 13399, -38700, 14196, 12405, -20810, -83592, -68668]
22347f8668M8280O3133n9847q492O3176O2733l4649k4923m8564k0874j0420R416
22335b9699n804j7074l1635J6305M7360o648l0513O5787J7069J08977J2161j38450
22323G836J3948O266q5632J5785j6206j1643J8411J8140L3304Q331m1684q1788
22311a14932j0009J06441J8863k3748q506K2593Q0761M0403l1866m8708J9439
22300E0731O6194k2162K252l8430k1904j5369k2074o648K1263P736J128l9235
22288a6518r4249N686O0939r929r815n015N246q5735R381J8466P3030M886k8866
22275g2493Q2138l969k2852Q147l7405q624k3325k4957J063L0461N877K2743m757
22262d7953J7134K6112k915L3876p3796K9656K4236p6867l1908L6447N7512m040
$$ y = [-68668, -20388, 42745, -17102, -25594, 37582, 100315, 65666, 40743, -7821, -28695, -39115, -29699, -35503, -52577, -84212, -67907, -20547, -27195, -57708, 8079, 25148, 134125, 146286, 7836, 21784, 28050, -57582, -41797, -58003, -69646, -51235, -33095, 209, 8540, -33144, -114932, -124941, -18500, 363, -23385, -31891, -9298, 71463, 111866, 80000, 31292, 50731, 116925, 94763, 97015, 58585, 36681, 21312, -762, -7410, 13853, 21589, 22717, -16518, -110767, -105081, -44142, -54071, -63886, -68901, -63655, -149390, -140009, -121543, -48513, -43627, -72493, 9645, 5676, -17176, -9029, -46434, -55058, -78383, -103340, -102277, -71816, -65939, -43196, -47953, -30819, -4707, -7622, 26254, -47542, -17886, 6350, -70517, -102425, -65978, -8466, -12506]
22250a2506L3329j8635p9968O9260J12894j7667m6719m2174m0161r1273j8488
22239a52108M2072P9174R567L1647L361O740P577J6690N785L3061m9787m4976
22227a1197q100l1979l914O5349l065K3464k165M2140o4392j18263O666R8938
22215f518k2167l4975K2307J1457P197k8001J1376K5795o6965m8658O7081m152
22203f6223P447K8905N2019O6412p4457j00627o155j8183j6457k9145k164K8709
22191a29919P6541P2973j1843J8967m6157Q765K9311q7652m122K8901m3055n263
22179i2553k7957O1277O3673m869J8613p8772j27263j0278J47137M2194L8164
22168B9366p557q7398q4299n3609J03571M9914o880N8791L3960K3779o2120l5229
$$ y = [-12506, 20823, 2188, -77780, -8520, 104374, 86707, 39988, -2186, -42347, -133620, -152108, -110036, -30862, -21295, 10352, 13713, 20453, 28030, 44720, 50505, 83566, 33779, -11197, -19297, -51276, -55190, 10159, 7094, 30558, 28393, 70533, 6141, -112122, -105456, -6518, -28685, -63660, -41353, -29896, -22699, -50700, -39324, -13529, -80494, -129152, -62071, -66223, -58776, -29871, 22148, 88560, 14103, -86524, -92679, -110862, -127319, -156464, -158628, -129919, -53378, 19595, 7752, 26719, -19438, -10673, 18638, -69014, -73136, -44235, -87290, -92553, -120510, -59233, 4440, -429, 18184, -60588, -187851, -198129, -50992, -8798, 29366, 21809, -65589, -149888, -203497, -99926, -50012, -56892, 1899, 35859, 59638, -2482, -37711]
22156c7711N341M7088k1337J9823K0455J5489K5651m2117n6984n8426M1164Q3083
22144D1519J0228m0177N9970M4257J0871K2743o7179m5063j9350n368J2613J3127
22132C8191m7634o5071j0896P7374o5868n5841Q7088O5666q213q197J5854l1490
22120i037L4435N3325o8548q3764P3050L6811L0384L833j4989q6752p0500p978
22108a09730O8442N4420K245L2604P62k1498k0226n4016L6055q736r162l6007
22096f4847l8843n8634J4951M3619O434M1132N509O323q60J3887L5337L9882L6810
22083H0700l8705m5954q378K3634o1949p1012m8402L8432K9010K6956l1537M520
22071a02685K9272N4483L6509J7699o3023K2812P5950J5426k5846K115k3435K0446
$$ y = [-37711, -32370, 14718, -6619, 13204, 33659, 49148, 74799, 32682, -24302, -82728, -41564, 41519, 51747, 11570, 71540, 115797, 126668, 149411, 82232, 37169, 17819, 12451, 25064, 38191, -9443, -74514, -85410, -8036, -73904, -129745, -42657, 23009, 14796, 6599, 22453, -9037, 25398, 78723, 10175, -73589, -539, 36272, 66656, 70489, 55500, -31252, -101752, -109730, -41288, 13132, 15377, 47981, 48743, 27245, 7019, -46997, -10942, -19678, -28840, -64847, -103690, -162324, -147373, -103754, -97320, -56188, -50679, -44356, -45216, -31329, 4008, 43890, 80700, 41995, -3959, -12337, 11297, -50652, -121664, -170066, -131634, -102624, -75668, -107205, -102685, -73413, -18930, 17579, 35278, -27745, -4933, 71017, 86443, 60597, 62712, 39277, 59723]
22059E9723N185p4809m1166N4297O9020N244N7469k6785q1318m8620l5124j468
22047e8352o5553q2491J0699J00570K5018K0016J6688l6002l3285o2277R305Q0232
22035g5432L7267K8718L6018m584l500P7768m4338n2036o6535k7964p985k2412
22023a25015L2043J9662L5182N4134K4486K3710L8408R181L691l763k3512j00513
22011a2306L3049L0344K4134K4463O09p064m5249k0313N9607Q429j8720K6093
21999A03076K8605P7862J6050p3770k8272q4944J2647L6751J1798K4852R196L027
21987A36878q7287p4962J915M3840O541K8389J6644M3929L5720n5183j29313n4956
21975h7845N9793J5548N849n3622j8480k0114k1750k024M3663k813K4875M0107
$$ y = [59723, 64908, -9901, -51067, 3230, 72250, 77494, 134963, 108178, 26860, -21760, -56884, -58352, -123905, -206396, -195697, -95127, -70109, -50093, -33405, -69407, -102692, -164969, -155664, -75432, -38165, -9447, 26571, 21987, 18487, 96255, 51917, -119, -66654, -94618, -102603, -125015, -92972, -73310, -38128, 16006, 40492, 64202, 102610, 111791, 115482, 111719, 88207, -12306, 20743, 51087, 75221, 99684, 100293, 93229, 47980, 27667, 87274, 95703, 76983, 103076, 131681, 209543, 225593, 151823, 123551, 38607, 51254, 88005, 99803, 124655, 133851, 136878, 49591, -25371, -23456, 20384, 26925, 55314, 71958, 115887, 151607, 96424, -32889, -87845, -28052, -12504, -6655, -60277, -78757, -98871, -120621, -122645, -78982, -81795, -56920, -16813]
21963a6813M461k1845J3821l1898k2890K9952k0846L6058R5949k3269k658M9638
21951H9660M2619K836k8913m8598o9802j8395J4929L4506j9949M856K1139L3186
21939E8074m0513l0159O4135j8751r3412l6276P4006J6710n3419k218p8206J05751
21927c4278P4300j318P096j02453k6220N7207K7314j5645l0309J3751r4970n7832
21915a83357J7395K8837R466O0300O6406L493M0521J4153j2927p5849n1293J9270
21903f3585J28208L5324q1681l7537l5887m4470L3630l1972J6146N4137M0913
21892A3226k0227k7198o2335J6614J9835l3425J8483K4915N4602k3870p3798K0976
21880g2202J3221N3726J4447M6229k1132r4006o8010L0248j5831O6984L4585j8921
$$ y = [-16813, -12352, -34197, -20376, -52274, -75164, -45212, -66058, -30000, 65949, 42680, 40022, 89660, 132279, 135115, 106202, 57604, -12198, -30593, -15664, 18842, -1107, 3749, 24888, 58074, 17561, -12598, 51537, 32786, -60626, -96902, -22896, -6186, -59605, -61823, -140029, -34278, 40022, 38704, 45800, -56653, -82873, -25666, 1648, -13997, -44306, -30555, -125525, -183357, -165962, -137125, -127659, -67359, -953, 2540, 43061, 57214, 44287, -31562, -82855, -63585, 64623, 99947, 18266, -19271, -55158, -99628, -65998, -97970, -81824, -27687, 13226, -7001, -34199, -96534, -79920, -60085, -93510, -75027, -50112, 4490, -19380, -93178, -72202, -58981, -5255, 9192, 55421, 34289, -59717, -127727, -97479, -113310, -46326, -11741, -30662]
21868c0662o06L3412P1712J1456K5384l8589K5370l943k8405n3577K2104m518
21856B9138m8710O7252k5216j05381K8527J68246J2105p9251j02469L2529M6327
21845B3097O4461k2301J7884m6304o1644m0200n5937L2740N7153J22353k3990
21834F7312n3507m190J3304K3030J2552l2424j1531j0929K3964j17446l5908M1003
21822h4770k5611M4365J4745n9996r974M8571J850j9225j6405J3424k1372O8719
21810d5679J338l4949l3910L0690P5795m2888m759J795K4719L1245j80j0008l6336
21797d3127k754J8456q829p3793q5370P5747M7809N0215J2846k1228q5499j04219
21785b19746o567J23803R6122R228p0946l3315N4088p235m534M1567J6276k2831
$$ y = [-30662, -31268, 2144, 73856, 85312, 110696, 72107, 97477, 93534, 65129, 11552, 33656, 29138, -19572, 47680, 22464, -82917, -54390, 113856, 125961, 46710, -55759, -23230, 23097, 87558, 65257, 83141, 36837, -24807, -65007, -120944, -88204, -31051, 91302, 67312, 13805, 9615, 22919, 45949, 58501, 26077, 14546, 3617, 27581, -89865, -125773, -84770, -110381, -66016, -51271, -111267, -121241, -72670, -70820, -90045, -106450, -93026, -114398, -45679, -44341, -79290, -113200, -82510, -6715, -49603, -54362, -52567, -27848, 3397, 3217, -6791, -43127, -45881, -27425, -36254, -110047, -195417, -119670, -71861, -21646, -8800, -30028, -115527, -219746, -226313, -102510, -6388, 2840, -68106, -101421, -47333, -54568, -59102, -17535, -1259, -24090]
21773b4090J4837L8765l7024M016n7236J4283K1136J3179J4857j6190r71O872
21761g566P3703m7071p5683j0494k137Q970m1487n6706K2142O3719L3217Q0282
21749D0889q116n3635k8622K2948n4959j0491P7156L2856P0589n7303o8265L3676
21737c277j1319J8961O4660l2034R719O9215o4059K1898N4615p9217k7744L4901
21725E6319k0222J2065m0189j04407p2972Q7873Q0O6400Q1688j3331j3933O288
21713D5659p9175k0744j2162J15095j9964l6423L4803o5540k7570M9648n2294
21702f8667l4149J5771L8820r774K1419K1176M3917q697n1358N4281K1775r570
21690C4944l992k4654k3801p576k2385M3953M9210N0680J2570J1068o6867o2855
$$ y = [-24090, -9253, 29512, -7512, -3496, -60732, -46449, -25313, -12134, 2723, -13467, -14438, -7566, 66137, 19066, -56617, -67111, -69248, -60278, -101765, -158471, -136329, -72610, -39393, 40889, 32773, -20862, -49484, -26536, -81495, -91986, -14830, 18026, 88615, 31312, -36953, -3277, -14596, 4365, 69025, 36991, 46710, 115925, 51866, 73764, 128379, 49162, 21418, 56319, 36097, 48162, 7973, -96434, -169406, -81533, -81453, -15053, 66635, 53304, 39371, 45659, -33516, -54260, -66422, 48673, 28709, -7714, 27089, -38451, -66021, -16373, -68667, -102816, -87045, -48225, -57999, -36580, -15404, 28513, 19816, -31542, 22739, 44514, 34944, 30952, 6298, -17503, -25079, -47464, -3511, 45699, 96379, 108949, 120017, 53150, -9705]
21678i705J5696j6737K6480k68l0707m4794O2764J3229l4229J1072j2472K5974
21666F303k0387l6123k6465k9948L3957O0890J3383m495p478m662j0604R1340
21654F5711J25964K0818p3864r1056j0112k4543L7936r76L8758p3024j6778k0722
21642b1888k2784r502k2507N1686O4410m912R5332K7816n5222r0972j6302k2677
21630b7522m5933N696l184n1927j367M6558O7776j8496m294q4J8674O85L9325
21617B5907L2979j3092l3778L2360M350o679k1088n5374K9724o206J0704R5777
21605I5584J03956K0660L4099q1828n0584p3871k7641l5902j8177n7622k6755
21594a18081k4103Q2985Q5419M5832k8423L8322Q0395J1266p336M6876j9748j48029
$$ y = [-9705, 5991, -10746, 15734, 15466, -15241, -60035, 2729, 15958, -18271, -7199, -19671, 6303, -14084, -50207, -76672, -106620, -72663, -11773, 1610, -2885, -10363, -15025, -25629, 65711, 191675, 212493, 138629, 47573, 37461, 12918, 50854, 49878, 88636, 15612, -1166, -21888, -44672, -54174, -76681, -24995, 39415, 34503, 129835, 157651, 102429, 11457, -4845, -27522, -73455, -67759, -70943, -122870, -124237, -77679, -9903, -28399, -32693, -32777, -14103, -13418, 25907, 58886, 45794, 12016, 44376, 48726, 42047, 20959, -34415, -4691, -10897, -193, 95584, 199540, 220200, 254299, 172471, 121887, 48016, 20375, -15527, -33704, -91326, -118081, -142184, -59199, 26220, 72052, 43629, 81951, 162346, 173612, 166276, 213152, 193404, 45375]
21582D5375j26758o1998j8414L7316N1095l2707j4228N7669O8863N8060k4350
21571C9923l4877k2808j569P768J9313L8073m9023o0030P7091L0117l1354q391
21559D233o7311k4162N8986P0636k9799R848K5688M4221m8458K1133M5476k1083
21547H9408l6346p3090O2275k0091k7327j01021M8516P2021M0019o334l9470p2295
21535f3735k3485J9186n665n062N6081o1327j24003k4418M2478P9024P8970J3455
21523a8501j7571r892m829q714l5776j753L2206O612M5118L6238l9379r541P969
21510a7813K568J9956Q8907l9320j9584j9254J6964J5185k0439m391j2560k2043
21498a1824r546K4051O9772n612n631J0366k3723j51226p2905P0893J01415J37635
$$ y = [45375, -81383, -143381, -161795, -124479, -73384, -106091, -120319, -62650, 6213, 64273, 39923, 5046, -17762, -19331, -11563, 7750, 45823, -3200, -63230, 13861, 43978, 12624, 4233, -63078, -87240, -28254, 42382, 12583, 22431, 48119, 92340, 43882, 65015, 110491, 89408, 53062, -20028, 42247, 22156, -5171, -106192, -57676, 14345, 54364, 48030, 8560, -63735, -87220, -68034, -73699, -78761, -22680, -84007, -208010, -232428, -189950, -110926, -31956, -18501, -36072, -45964, -50793, -59507, -95283, -97036, -64830, -58218, -13100, 23138, -16241, -25782, -17813, -15245, 4711, 93618, 54298, 34714, 15460, 32424, 47609, 27170, 22779, 10219, -11824, -21370, 2681, 72453, 66841, 61210, 71576, 47853, -103373, -176278, -105385, -3970, 133665]
21486A33665O9717l2987j06395p3759q3706r103l0094L6078L1330j4588P5414
21475d428Q1m0517N0091r767o1652o0989k7964O7119J99893L6198n5543j5817
21463G6705P382n1219r343J4792j4389p2004o7203M410J06526L0830q2471n5465
21451a11449N3098R0047K3802K5323K087n7348m0981m399k7315N6337N7694n8330
21439H566k0124J5285M1655l9504n7061J6298k728P7364M3487j06588q8673j7577
21427a29600J10554R6194j02843n2887K0085k925n826N954L1414M5009j0348p1318
21415f6537k1047R162L3540R0026j6581m3219q0983J7158O7872L7559j6340r171
21403A439l983N1715O3221k1854m7588o8505r755N6178J3521l1374m525j40259
$$ y = [133665, 203382, 170395, 64000, -9759, -93465, -102568, -132662, -96584, -65254, -79842, -4428, -4347, -44864, 5227, -4540, -66192, -127181, -155145, -88026, 111867, 148065, 92522, 76705, 84087, 32868, 23525, 38317, 23928, -48076, -115279, -110869, -4343, 26487, -55984, -111449, -58351, 31696, 55498, 80821, 82908, 25560, -15421, -19820, -47135, 9202, 66896, 8566, -11558, 3727, 45382, 5878, -51183, -34885, -37613, 39751, 83238, -23350, -112023, -129600, -19046, 77148, -25695, -78582, -58497, -61422, -67248, -61294, -29880, 15129, 4781, -66537, -87584, -78422, -44882, 45144, 28563, -14656, -95639, -78481, -10609, 26950, 10610, 1439, -2544, 49171, 112392, 90538, 42950, -25555, -35310, 20868, 34389, 3015, -1510, -141769]
21391a41769n8688M3347K6908M2982L2424P4750J0652j8065k4574O0076J9544
21380F7587J4980k1466k1480M2681m0450r4139N6003O0459j0502r3363o1529o6302
21368a67521j9577R178M409R0985J20988K5486J0227n1513m969l130L5453J1969
21356F1985L5800m2584j8970K3290m1185o4537O6914Q3013m6473j20298m798K4106
21344d3737P4492L7375J1416l0137O3224k0127j5884m9340L0261M2218l4848o6150
21332a237p3219N3880K7421l4052K0615O3831o504o9099r031N7387k2162M1025
21320D8855l0951J655O8858N4702m238r7267O5343o069j4494N1184l388n0654
21308H3536n6419j6282j8076J1653l1191R471J7521l875J0336m0020J4933J13699
$$ y = [-141769, -200457, -157110, -130202, -87220, -54796, 19954, 30606, 12541, -12033, 48043, 67587, 82567, 61101, 39621, 82302, 41852, -52287, 3716, 64175, 53673, -39690, -101219, -167521, -187098, -177920, -173511, -82526, 38462, 63948, 74175, 22662, 17693, 14563, 50016, 61985, 97785, 55201, 36231, 59521, 18336, -46201, 20713, 103726, 57253, -63045, -67843, -43737, 30755, 68130, 79546, 49409, 112633, 92506, 76622, 27282, 57543, 99761, 64913, -1237, -74456, -20576, 6845, -27207, -6592, 57239, 50735, -18364, -27395, 29992, 7830, 48855, 17904, 19559, 88417, 143119, 138881, 41614, 106957, 100888, 86394, 137578, 134190, 83536, 27117, 10835, -7241, 4412, -26779, -17308, 213, -3662, 6674, -33346, -18413, 95286]
21296I5286K4836q2355q0137l2386P600L1667m9611K5192Q3121J9002J8200j5644
21284D4771l0033q480k6693N64K2299O0928P479o2965q7074j4307j4888j0064
21272a18463n667O0574O4555n2197L3576O3981J1026O3967m5244k4392n5894j3932
21260a8110J01427K8015n8938J2449o5783j6149N3573k2850r106j3804P4497p728
21248E7493m4284r246n597N4370J2817q2449l5755l0261L3437O6338P719o2228
21236c7646K1650j1522j08703k6034K2131J02422k76o2224K6587O6392K7766M1130
21224F1673m9787p7982N0538M6904l4811k973j0176j1698m6130J6186J11793N069
21212E8606P144J6890o1424k1303m2392k6248L7687k1151O452M0348Q9114O5579
$$ y = [95286, 120122, 37767, -42370, -74756, -67156, -35489, -85100, -59908, 23213, 42215, 60415, 44771, 14738, 6258, -20435, -19871, 2428, 63356, 70835, 7870, -79204, -93511, -108399, -118463, -124130, -63556, 999, -51198, -17622, 46359, 57385, 121352, 76108, 51716, -4178, -18110, 83317, 111332, 52394, 64843, -940, -17089, 36484, 13634, 4528, -9276, 65221, 57493, 13209, 3963, -1634, 52736, 65553, -16896, -52651, -82912, -49475, 16863, 24582, -37646, -15996, -27518, -136221, -162255, -140124, -37702, -37978, -100202, -73615, -7223, 20543, 61673, 11886, -66096, -15558, 31346, -3465, -6438, -16614, -28312, -74442, -58256, 53537, 58606, 65750, 82640, 21216, -87, -42479, -68727, -31040, -52191, -45739, -5391, 83723, 149302]
21200A49302L3937n2795j4634l9326l0544r2445o579O3960l4401k5049N8164k1131
21188a1541o3679L2474K7395j0804o2627n6615m4682Q676M9160r190R6251L2744
21176a2438K3946O6180L301p7141j3813P3871L5177r1508K930R4774j202l5854
21164F8223o306k8956K2723m8991n4726J6376N0958l3285K7571J5623N2055O059
21152H7324j8763L9230n9956J83L461k8356n8087k5040P2420N2986R872K865J4833
21139I2972m5382l5691m4902L700k2900m7009M3276J1445M735K6729K7118Q529
21127B2620m6104q4125J1290J6922K0454P9245Q4878M165j09380q6886k7987K2097
21115i2811Q6279k3700o695M646J413p02q4986P9668L5474o672J3505m755R9181
$$ y = [149302, 183239, 130444, 115810, 76484, 45940, -46505, -53084, 10876, -23525, -48574, 9590, -11541, -75220, -42746, -15351, -26155, -88782, -145397, -190079, -181403, -132243, -141433, -45182, -12438, 11508, 77688, 80989, 3848, -9965, 63906, 99083, 7575, 10505, 105279, 104077, 68223, 61917, 32961, 55684, 6693, -48033, -31657, 19301, -13984, 13587, 29210, 81265, 87324, 68561, 107791, 47835, 48018, 51479, 23123, -34964, -60004, 12416, 65402, 75274, 78139, 92972, 47590, 11899, -33003, -29303, -52203, -99212, -55936, -44491, -39756, -13027, 14091, 22620, -23484, -107609, -96319, -79397, -58943, 20302, 105180, 109345, -35, -86921, -114908, -92811, -6532, -30232, -36927, -32281, -30868, -31570, -116556, -36888, -1414, -8086, 5419, 664, 99845]
21102I9845l0424o4904M485J6714n0721R659l1679j6131J9113O4849L6049l2019
21090B4836o848n3098K4137m0959k7070J7092o084m311j4171K5728L4078N2560
21078B5890O5463k3125p635n421m509J4235k5068l9262L654l469M168N6991O7541
21065A29453j6310l5948m5432k6592M1362M7904j37k4832K2539K0696j01666p4151
21053f3114K0028L7974q61l3200J0803M5299L413r925o1413q932m88j480M1252
21040b0644Q3205l9106o3280O1918M2238Q7978J2423j6124q0739j19177L3530
21029a7778J7177J5248K9855N2007L9210k8097l9090N0727k6766K1454l4772m2821
21017C6354j9934k1185J2769N183j1688m0710k0842m7871k0812M1749k9918M9985
$$ y = [99845, 69421, 4517, 9002, 25716, -25005, -15346, -47025, -63156, -44043, 20806, 56855, 24836, 17988, -35110, -10973, -51932, -79002, -61910, -67994, -72305, -86476, -60748, -26670, 25890, 91353, 68228, 60593, 55172, 50663, 64898, 39830, 568, 4222, 753, 4921, 61912, 129453, 113143, 77195, 31763, 5171, 46533, 94437, 94300, 69468, 92007, 112703, 11037, -63114, -43086, -5112, -5973, -39173, -28370, 16929, 20342, 10417, -50996, -59928, -60416, -61896, -20644, 62561, 23455, -39825, 22093, 64331, 152309, 164732, 148608, 67869, -51308, -17778, -601, 14647, 44502, 96509, 135719, 107622, 68532, 119259, 92493, 113947, 79175, 36354, 16420, -4765, 8004, 13187, 1499, -39211, -60053, -107924, -128736, -86987, -116905, -66920]
21005f6920P8002J195N84L951l1684j01775l6994K0406K5730J1863j8779L26N0067
20992f4028Q2039N179l3597J6963P2462m4201J27j6868m8243P750M5478m1251
20980a8190k6365j0974J6134r90N5365M3604J114k3505L5691l7316K303r326k3421
20967D124K1291n3414j770K6234j2104J3524n5875N6696K1257m1167n5303J0418
20955f6089j4148L3848O210L0736q882m7081p5058j5091M0516O0436J4988j8063
20943e7678j2440o4482n8223K2354J83766L8351k7666j8364O4738R0936J0139
20932A71431k8333k6151n3440M2342K7369q3874j9292L2623k6887l4787j0600
20921i599J2947j5712p7743p2619J2250o274o9739O3571J01704N5586l5047k401
$$ y = [-66920, 11082, 12277, 12861, 16812, -14872, -116647, -153641, -133235, -107505, -95642, -114421, -114095, -64028, 18011, 23190, -10407, 6556, 79018, 34817, 34944, 18076, -30167, -22417, 23061, -18190, -44555, -55529, -39395, -40385, 14980, 58584, 59698, 36193, 71884, 34568, 36871, 27545, 4124, 25415, -27999, -29769, -3535, -15639, -2115, -57990, -1294, 19963, -21204, -76507, -66089, -80237, -46389, -40179, -9443, -18325, -65406, -140464, -155555, -115039, -54603, -39615, -57678, -70118, -134600, -192823, -170469, 13297, 51648, 23982, 5618, 70356, 161292, 171431, 143098, 116947, 63507, 105849, 133218, 49344, 30052, 62675, 35788, 1001, -9599, 3348, -12364, -90107, -162726, -150476, -156750, -226489, -162918, -61214, -5628, -40675, -43076]
20909d3076O2408K8029j09106m8710J08512K439k0K6840J9988k2678n4556r019
20897c8949N6139l859k4110k4384K902J5098N9966p2328l3085l8755k1854K6491
20885i6728j3919K8360P8867J8681k566O41m3071J4920j9393O580n669J6029k0536
20872c7804J8092K5444L7007m0647l5516l576N3509K4991n3723m1999m8931j432
20860a04585j4079P9679Q0043K0445n0241K7418J6675l3887J7234l7055m5233
20849d3586k3790J22490P3174J852o8015q2707q4924l215K5664M7286j6436O699
20837d5508O6740m623m2195Q469j1261k9712J3380N9546K0199k1370m3465P1679
20825D1879R8335l0369l6961K7230L3597o0393o4182m2613n039k2996L005N3341
$$ y = [-43076, 19332, 47361, -61745, -110455, -1943, 496, 476, 27316, 47304, 24626, -29930, -38949, 17190, 13331, -10779, -35163, -32261, -17163, 42803, -29525, -62610, -101365, -123219, -96728, -110647, -82287, -3420, 15261, 12695, 13336, -29735, -14815, -34208, -27628, -33297, -17268, -37804, -19712, 5732, 42739, 2092, -33424, -37000, 16509, 41500, -12223, -54222, -103153, -104585, -118664, -38985, 41058, 61503, 11262, 38680, 55355, 21468, 38702, 1647, -43586, -67376, 55114, 128288, 130140, 62125, -20582, -105506, -108721, -83057, -35771, -52207, -45508, 21232, 16609, -25586, -17117, -28378, -58090, -44710, 14836, 35035, 13665, -29800, 41879, 140214, 109845, 72884, 100114, 133711, 73318, 9136, -33477, -38516, -61512, -58507, -5166]
20813e166M368M5870O8870p0579p1943o4308J534Q1149M4745m0859l3989p7899
20801a18207o609N6505O4515j2502o635j9400q1455L1755N7472M3561O848k084
20789A3764K513M8048o0761p9790j3742J3143O7177J21309j9279q7564k3472K1628
20777B974k228K4587Q1599L7587J8384n5656p2276m6412q5717M2367Q7395O4156
20765I6760k7155j6750J1741J2229j2408j1083J6942k1887q1268K4460L005l811
20753i225L1951j236q8782l1135L9087J12640M4142o6504k4876O9899k120k8232
20741D5609O5258L3455n8624P0728q1648r0634j533k8275M5021O3844J4397l32
20729G7266m4677j04309j258J4646K09p8k6713O1883L1352j5499k868l1321j3634
$$ y = [-5166, -798, 45072, 113942, 43363, -28580, -92888, -91354, -10205, 34540, -6319, -40308, -118207, -124816, -68311, -3796, -16298, -22933, -42333, -123788, -92033, -34561, 9000, 15848, 13764, 16277, 64325, 3564, -76226, -89968, -76825, -9648, 111661, 92382, 4818, -18654, 2974, 746, 25333, 106932, 144519, 162903, 107247, 34971, -11441, -97158, -54791, 32604, 96760, 69605, 52855, 64596, 76825, 64417, 53334, 70276, 48389, -32879, -8419, -5414, -9225, 22726, 21490, -67292, -98427, -59340, 53300, 97442, 30938, 6062, 75961, 73841, 45609, 110867, 144322, 85698, 156426, 74778, -15856, -17389, -45664, -643, 63201, 77598, 77266, 32589, -71720, -72978, -58332, -58123, -58201, -84914, -23031, 8321, -7178, -10046, -41367, -55001]
20716e5001P7351K7333Q834K1290l6293m0423M7413J430l0169l0520N1013l1160
20704A1098n3233p1555m9606P7405R3908K8348l7883k6806K9012p4423L485P4990
20692D740j8123J9796M2112K1227J5553j2400N5591O9570o444o4254m3011O310
20680I0667n3529p5928N0114J4696q4889R804N3252L3860j3465m5288j1043O9515
20668C7766K928m3958j0232L6108N4903K9284q5705q9407k6034O3525N3056L6116
20656E8350K7606m1669p5433l2245L2360O1741n1488r5626N1830K1859N4959M9300
20644F1544l3231o4192J7938P006j4734L5409O0997j9091k2782K6122k4911n9820
20632b9745r252K8858K5649j3213k5245j3230l5666j9638K8905K2677P421Q0167
$$ y = [-55001, 22350, 49683, 58517, 79807, 43514, 3091, 50504, 51934, 21765, -8755, 42258, 11098, -42135, -113690, -163296, -85891, 8017, 36365, -1518, -28324, 688, -73735, -70250, 4740, -13383, 6413, 48525, 69752, 85305, 72905, 128496, 198066, 191622, 127368, 84357, 90667, 37138, -38790, 11324, 26020, -58869, -49065, 4187, 38047, 24582, -20706, -31749, 37766, 40694, -3264, -13496, 22612, 77515, 106799, 21094, -68313, -94347, -30822, 22234, 58350, 85956, 44287, -31146, -63391, -31031, 30710, -20778, -116404, -64574, -42715, 12244, 61544, 28313, -35879, -17941, -10935, -25669, 9740, 70737, 51646, 28864, 54986, 30075, -29745, -38997, -10139, 15510, 2297, -22948, -36178, -71844, -91482, -62577, -39900, -32479, 47688]
20620D7688J02272J9237n0633n9039m2060r700Q6088l9052J0260J06157k6856
20609A44362q7549k3170r88l4422p9877q543K2715l6503k9016O3448P3591n246
20597a198k4121K9119J7572m5765O878O517O2318L0468n6025k8926l1645M7882
20585A3074R2733M9322j7280l1678l2986k5556j6853k4044J2528o7693k2930J2126
20573e9237Q3978L6673M1013m5086l6566p1952L148O6441M4287k1246n9943L1919
20561A3429k8871o3224j824M5796L1061m3494K0825J616j3726R721J5016M5272
20549C1597J5034o2377m2242q432R7671M5920l4547p6633N3391L1442J6426J7116
20537H4366k2603n0261j7011M9991J7082n0128J4821J7799k7626k8237l6254J7125
$$ y = [47688, 149960, 169197, 118564, 59525, 17465, 7765, 93853, 54801, 65061, 171218, 144362, 56813, 33643, 32655, -1767, -81644, -90187, -67472, -103975, -132991, -69543, 4048, -1198, -25319, 3800, 21372, -24393, -17515, -10998, 51320, 81788, 25763, -3163, -34808, 13074, 105807, 155129, 137849, 106171, 73185, 47629, 30776, 6732, 19260, -48433, -71363, -59237, 24741, 61414, 102427, 57341, 20775, -51177, -48029, 18412, 62699, 41453, -18490, 13429, -15442, -78666, -80490, -34694, -3633, -47127, -26302, -24686, -38412, -28691, -13675, 31597, 46631, -15746, -57988, -66420, 31251, 77171, 42624, -34009, 19382, 50824, 67250, 84366, 61763, 11502, -5509, 44482, 61564, 11436, 26257, 44056, 16430, -11807, -48061, -30936]
20525c0936r422j0740K0124M145l0628p694N1270L3146M4389j8306q626L5842
20513G2564J2132R868p1104k9599L0943J16972j8789m0900j1735L8736o7272n3677
20501a1861q5975J2188M7719j6277m6742J934K0568M5439o1056j700N5830k8737
20489f8670j0988J8771K7315N3969j7322L4122L4548J1286o4586j5367P5182j4882
20477F3378r1563k5644M8145J6864J2478J6441k4722m0129P3182m6223j0784p3688
20465h2265r980n0066k6205N5282O2094q9258J3014j5550K6112R5542n296j5765
20453d2341J5292K6544L7771j0781p2456K963K0006O8512M7042p6395k8377k0275
20441c2495L0008M2684m0097J4042n4542M0262N3387j4911O4032m1605L1710k5411
$$ y = [-30936, -40358, -51098, -30974, -26829, -57457, -65151, -13881, 19265, 63654, 45348, 36722, 72564, 84696, 94564, 23460, -6139, 24804, 141776, 122987, 82087, 70352, 109088, 41816, -11861, -97836, -85648, -37929, -54206, -100948, -99014, -78446, -33007, -94063, -95763, -39933, -68670, -79658, -60887, -33572, 20397, 3075, 37197, 71745, 83031, 18445, 3078, 78260, 63378, -28185, -53829, -5684, 11180, 23658, 40099, 15377, -24752, 48430, 2207, -8577, -82265, -92245, -142311, -168516, -113234, -51140, -140398, -127384, -142934, -116822, -21280, -26576, -42341, -27049, -505, 37266, 26485, -45971, -43008, -23002, 45510, 92552, 16157, -12220, -32495, -2487, 40197, 100, 14142, -40400, -138, 53249, 38338, 102370, 60765, 92475, 67064]
20429F7064l0029p56M7554P0560j8111m8091r0697m1340Q173r882m4162O7445
20417b2272L1406j3448q9490m6903K5270N1982L6876J1020j5237K9534K2047k2244
20405a459n0887p1504L6404Q9445L5531l6310M8446k2128l9850o9671n4953Q4197
20393e2739L9809j562K4569p6590m9906M8737P4867J0616L5907p4546K9420J5314
20381B3896l6089j9014L4428N2829O2502n3695o1307o285M6975m5459K2089R3340
20369A14210N9195R013p1457k5562M80p5133p1933p44O5461N4618l3770j4295
20357A0083J5749O5305K8799j10067j11016q5855j6006K4629J06288Q5638L6518
20346E0065O7245N0811p9747p6628p4621J7459O329J1340J508N9650L0839m0238
$$ y = [67064, 37035, 36279, 83833, 154393, 136282, 88191, -2506, -43846, -35673, -45555, -89717, -22272, 9134, -4314, -93804, -140707, -115437, -63455, -26579, -15559, -30796, -1262, 20785, -1459, -52346, -123850, -87446, 1999, 37530, 1220, 49666, 27538, -12312, -81983, -136936, -52739, -12930, -14492, 10077, -66513, -116419, -67682, 7185, 17801, 53708, -20838, 8582, 23896, -12193, -31207, 3221, 56050, 118552, 64857, 3550, -2735, 44240, -1219, 20870, 114210, 173405, 182418, 110961, 85399, 85879, 10746, -61187, -61931, 3530, 58148, 24378, 10083, 25832, 91137, 119936, 9869, -101147, -187002, -203008, -178379, -72091, 13547, 50065, 117310, 168121, 88374, 11746, -62875, -45416, -39087, -27747, -26239, 33411, 64250, 24012]
20334B4012n7123M1257O5117m5307m6635N59P224j6721q923P3069L7640p7390
20322c221j27899K4984Q9736J0545l1788M2342M0147n6526n2792L5394j5028L9584
20310d522Q3477O0075p6013m2896j988n6451N4697l8117L3998K9554k9822k1937
20298i945l140N2402k8200q7004q0341J5251J43948N0019n8363l8416N562K751
20286c5476J2665K670m1834p5951M327N1082N7792P3429j7405r6639M096J3061
20274d8183M9602J4860N205o2565L748K8859k290N6465P3169L6964m347k1150
20262A30337o3219j9530m9369r2928K562K5937M4032N8906J07934j2763p1587
20251F0312m3219n5647k8963M7279Q0049N1218l9287m0891J7001K6767k6399J9879
$$ y = [24012, -33111, 8146, 73263, 27956, -18679, -18120, -10896, -27617, -36540, 36529, 74169, -3221, -131120, -106136, -16400, -5855, -37643, 4699, 44846, -11680, -64472, -29078, -44106, -4522, 78955, 139030, 63017, 20121, 18133, -38318, 16379, -21738, 12260, 41814, 11992, -9945, -13085, 39317, 11117, -75887, -156228, -140977, 2971, 52990, -5373, -43789, -38227, -35476, -22811, -20141, -61975, -137926, -133599, -82517, -24725, 48704, 31299, -65340, -61244, -48183, 1419, 16279, 21484, -41081, -37333, -8474, -10764, 45701, 118870, 155834, 151487, 130337, 67118, 47588, -1781, -94709, -92147, -66210, -22178, 36728, 144662, 131899, 60312, 17093, -38554, -67517, -20238, 59811, 111029, 71742, 30851, 47852, 74619, 48220, 68099]
20239F8099Q9988n2602k7995P4895L3856J3964j21479o8437o5444K3063J5408
20228a6684m4941o3205N4698P9737O9757N931l5685k7366k6635q662k5741M303
20216c4493N7507M0320l1899M8578O9888j04431n9619N6644k329q528k7913n0677
20204d6952Q011K4990P065K955K3814q0299k1769n790M8423L4165K5576k5037
20192d848J7135o8863k836k492k103L8333j7207l4597M1516K9605l013m7123j8162
20179g4655K3906J02287J3677n8048l891M6135l75o4450r40M409r761l2596M8509
20166e793M7188M494R1699M6871l8454k8145J37957R6494k1562l9482n1388q0998
20154A58881o5971l2826j9860j0828J25456J6969n0367j939n7792j4474j2214
$$ y = [68099, 158087, 105485, 77490, 152385, 186241, 200205, 78726, 10289, -55155, -32092, -16684, -61625, -124830, -70132, 9605, 79362, 85293, 49608, 22242, -4393, -13055, -38796, -34493, 23014, 63334, 31435, 80013, 149901, 45470, -14149, 42495, 40166, 31638, 3725, -46952, -38941, -13951, -6886, -3931, 19883, -60416, -82185, -87975, -39552, -5387, 20189, -4848, 12287, -56576, -59412, -61904, -64007, -25674, -42881, -77478, -35962, -6357, -9370, -56493, -74655, -50749, 51538, 65215, 7167, 3276, 49411, 49036, -15414, -16354, -11945, -21706, -54302, -5793, 41395, 45889, 137588, 184459, 146005, 117860, 255817, 352311, 330749, 291267, 239879, 158881, 92910, 60084, 40224, 29396, 154852, 171821, 121454, 119515, 61723, 47249, 35035]
20143C5035j4507m906j1866m958L691J1302Q12M9387k0532j4846L9843l0989L3617
20130G1083q891P6477k1117m014p1137r4200l2022P113M4066M0860l5835q6587
20118a14204M1722J6774k0872K8800O1528M6427L0043j15579j25646Q4079N9824
20107g104l118k0837J3069O5874M0673M460R039j1880L998j5482L4075p1553j23664
20094h2450L2190O6029m3982l5648k2952l2034j0930L9438P2357J2431N295m8562
20082d8818k2754J7542M9620l133k5254P5269P7756M9561n5248o5242m7683m0025
20070c8409Q7383j4933m6877K341K8840J0889J8601K6435J9203j8097j6867O8083
20058A26592K6133p9195j4475P4991L979n0091j3052J1409j8412k3606O2226N7516
$$ y = [35035, 20528, 15622, 3756, -1202, 2489, 13791, 14603, 63990, 43458, 28612, 68455, 37466, 71083, 62192, 138669, 117552, 113538, 42401, -51799, -83821, -76708, -32642, 8218, -27617, -114204, -72482, -55708, -76580, -47780, 13748, 60175, 90218, -25361, -151007, -66928, -7104, -10222, -31059, -17990, 47884, 88557, 93017, 102056, 90176, 94174, 78692, 112767, 41214, -82450, -50260, 15769, -28213, -63861, -86813, -118847, -129777, -90339, -17982, -5551, -256, -48818, -71572, -54030, -4410, -7543, -32797, 42472, 120228, 169789, 114541, 49299, 1616, -38409, 48974, 34041, -12836, -10495, 18345, 29234, 47835, 74270, 93473, 75376, 58509, 126592, 152725, 73530, 59055, 134046, 138025, 87934, 74882, 86291, 67879, 44273, 106499, 164015]
20046A64015m8099K6517j1995k0080L5977J4467j4836m0772j2664K1844p7084
20035C7290m5221L726m190M5011J6837q984k7004N6789l274k6456R034K6285j3386
20022F6457l6511p682K8501K9741m9810m6076l7009k1900N2330M5626p530o242
20010I895n687n0605K0592M7287j1016k729P2034k6904n6701J2393N7889O4618
19998A31066K580l7431o8701n8200M0809N9135p3925j6629M7221l1771k2462j1601
19986c9909N119L8976N9834l6989m6267l0710K809K3021j6758j1651p0971j4892
19974a38388P9150L9400N0127o8685j8555L7514L6709O068L086k2019J0450P9812
19962I4669j6370J8725K0113m1036n3798O3773K4433J1055Q8397k0859q3961m3734
$$ y = [164015, 115916, 142433, 130438, 110358, 146335, 160802, 145966, 105194, 92530, 114374, 37290, -7931, -4205, -8395, 36616, 53453, 44469, 17465, 74254, 70980, 44524, 53558, 79843, 66457, 29946, 22264, 50765, 80506, 30696, -15380, -52389, -74289, -21959, 23667, 16137, 9895, 4208, -46397, -25805, 21482, 10466, 7737, 79771, 52867, -3834, 8559, 66448, 131066, 133646, 96215, 27514, -30686, 10123, 69258, -4667, -21296, 25925, -5846, -28308, -39909, -34790, 4186, 64020, 27031, -19236, -49946, -47137, -24116, -40874, -52525, -123496, -138388, -59238, -19838, 30289, -38396, -56951, -19437, 17272, 23340, 26426, 4407, 14857, 94669, 78299, 97024, 117137, 76101, 22303, 86076, 110509, 121564, 209961, 189102, 105141, 61407]
19950F1407l3587Q488M922Q016m3594p5185J3557J8520j04310J5104O5927m497
19938f5232K907K3795O6445O2174m9197j1506M895L5062L7900o0261k8187l2477
19926a3682K3801K8280q680o831m5792n5444L3854J1865j2574j04511P876L8772
19914a03066J8286J5486K4220M0932O1559Q0852J1686j9743k6237m1860k5141
19903C6974N513l7358J2610R244m0961K0667N766O1516p3393j6876J4575J1429
19891I706M4355k0844N2377j9699O344l8826j6786K0440L684Q0073n3454j02193
19879c4823k2547J08742k2982q2464k7075Q8134K8011l8248l5644k5467N9401
19868d962Q3076k7239j5920j222j6291J2079l5896j5315o825L0978N3689m7580
$$ y = [61407, 27820, 36308, 41230, 49246, 5652, -69533, -55976, -37456, -141766, -126662, -60735, -65232, -62325, -38530, 27915, 90089, 40892, 29386, 34281, 69343, 107243, 46982, 18795, -13682, 10119, 38399, 29719, 22888, -22904, -78348, -44494, -32629, -45203, -149714, -141838, -103066, -84780, -69294, -45074, -4142, 57417, 138269, 149955, 130212, 103975, 62115, 36974, 42487, 5129, 17739, 26983, -13978, 6689, 12455, 73971, 578, -16298, -1723, 9706, 54061, 33217, 85594, 65895, 72239, 33413, 16627, 37067, 40751, 120824, 67370, -34823, -57370, 51372, 28390, -54074, -81149, 6985, 34996, -3252, -38896, -64363, -4962, 78114, 50875, 34955, 33733, 17442, 29521, -6375, -21690, -28515, 2463, 56152, 8572]
19856H572j4699K4124K1230J3801k4756l8305K7123p363o2101l7402L3171q571
19844f5176Q1229P0744q2714j2731M4332L3815o7850N2476O6096j7444M3343l6044
19832A10076l7064l4743M0239n6442k3134M4596L5180K6386q6100m2031N2830
19821B9793N702J3857N5495K986k6692m031j2395k7345M964N5397k6109k375K3212
19808I2459L4746n6915n2074j4973P8982N9501n856K4550m1439j5557l4017j0861
19796E8546p7654J6111M2681M6805q6970r1381r9N3255Q924j7275N8932L5652
19784D7527p4279j06815K8705J05067J00682M320j43795m930Q1622m8792K5321
19773A4633M2087m057K5992l3200O252q568o5561j463k7211l0718n16M0463J4002
$$ y = [8572, -6127, 17997, 39227, 53028, 28272, -10033, 17090, 9727, -52374, -89776, -56605, -65176, 16053, 86797, 4083, -8648, 35684, 69499, 1649, 54125, 120221, 102777, 146120, 110076, 73012, 38269, 78508, 22066, -1068, 43528, 78708, 105094, 18994, -23037, 29793, 35495, 49352, 104847, 107833, 81141, 77110, 64715, 37370, 42334, 97731, 71622, 69247, 92459, 127205, 70290, 18216, 3243, 82225, 141726, 135870, 160420, 118981, 103424, 69407, 58546, -19108, -2997, 39684, 86489, -481, -91862, -91961, -38706, -29782, -47057, 11875, 47527, -26752, -133567, -104862, 205, 100887, 105207, -38588, -43518, 38104, -10688, 14633, 56720, 52663, 78655, 45455, 51707, 43139, -22422, -23885, -51096, -81814, -82330, -41867, -27865]
19760b7865j6925q657J05168J13932n701m5740o82l2988K2057m5238k7438O583
19748C6506l4381J8131l572n5599O7364L1926n8470m5563J4775k6598M2088J9376
19736E983k6330l3227o7398j7535k0627M5135J3759M803J1966j1095L5331L7954
19724b1281j5056m0493r325L1973M3071J3750o599l4387O0625L702o45N4129K5472
19711A04936M0963n7482p9705L9584J7230K6042J0236k7650l8429O3535M8336
19700A47596K2944n9661o5859n1588p303O7007P7766M0246n0248n8833k7759J3604
19688D7912K4614k5508R628l9942J7276k6326K680N4474o3569J4609M0284m8067
19676H065q6022k7111P6839P1020N313q1233k7985M1527N3046P1923P3778j2670
$$ y = [-27865, -44790, -53447, 51721, 165653, 159952, 114212, 113530, 80542, 102599, 57361, 29923, 36506, 2125, 20256, 16684, -38915, 28449, 60375, 1905, -43658, -28883, -55481, -13393, 5983, -20347, -53574, -120972, -138507, -159134, -113999, -100240, -95437, -83471, -94566, -59235, -21281, -36337, -76830, -86155, -54182, -11111, 2639, -3960, -38347, 22278, 25980, 25335, 79464, 104936, 145899, 88417, 8712, 48296, 65526, 91568, 101804, 74154, 35725, 99260, 147596, 170540, 110879, 45020, -6568, -13871, 53136, 130902, 171148, 120900, 62067, 34308, 47912, 72526, 47018, 56646, 16704, 33980, 7654, 10334, 64808, 1239, 15848, 56132, 8065, -77957, -105068, -28229, 42791, 48104, -33129, -61114, -19587, 33459, 105382, 179160, 166490]
19664A66490K0904q4739n2133L5286P5889n8605o4812m7353R491L2716j11324
19653g8190m7350L2761j8621L8947K8428K8632L2927O2688N4514l8078l6718N1561
19641A11501o9216k0749M7578R7567j1868m257j25307j1067Q6252k7866k9788
19630D2780k7742L7738L0204j243j2012J3420K5307o0855l3655J0712m4174j7962
19618c7482K4474N6647L6363n3360j8288M7298K8948L671Q92L1244M989M2805
19606A68201N0918r5897j12182m1853J07587J26889k1989q5853J1944K8876m5719
19595I0922q9l9707j7757Q223M1722P9396Q8412K6170j31645l7007L5843J7913
19583A62396J6496l8572l072o7405n9104P12k6078J13065P2618p538m3824m200
$$ y = [166490, 187394, 102655, 50522, 85808, 161697, 103092, 38280, -9073, 418, 33134, -78190, -125540, -92779, -111400, -72453, -44025, -15393, 17534, 80222, 134736, 96658, 59940, 111501, 42285, 21536, 69114, 166681, 154813, 150556, 25249, 14182, 100434, 72568, 42780, 15038, 52776, 82980, 81737, 69725, 83145, 108452, 47597, 13942, 24654, -19520, -37482, -13008, 43639, 80002, 26642, 8354, 55652, 84600, 88271, 89163, 120407, 125396, 168201, 219119, 123222, 11040, -30813, 76774, 203663, 181674, 95821, 107765, 136641, 90922, 90833, 51126, 33369, 41592, 83314, 162710, 251122, 277292, 145647, 108640, 144483, 162396, 178892, 140320, 137248, 69843, 10739, 11451, -14627, 98438, 171056, 163518, 119694, 115494]
19571A15494k1511K1434n8511o2378n3040R56M9002K1547m599k1147k6196J6923
19559b2026j114p9534J4862L3341K3099L7857j8042m8202j4668J917o135M6121
19547c2524M440J9516K1858M6231l4188m7227J4482M1079L8874k8073k3661j9376
19535A431o324O5868N8683P516k4815l7082k8335o158J05960O3474k9287J1307
19523A82238l6398m9979j0745m6000o7507N0630O8802L5368m6462l1302L3630
19512H2275k1521l8956k4513L343K6668l1884j8566M9423j1405J1369p809j1263
19500G161J0326L0769K5473o0007p4682J4706J9825p968n240N2831J8938l5182
19488c050n1917k4092M3907L835m0576n3477q6098J5696J10156J6777j2236P6603
$$ y = [115494, 93983, 115417, 56906, -5472, -58512, -57556, -8554, 12993, 8394, -12753, -38949, -22026, -23140, -102674, -87812, -54471, -31372, 6485, -11557, -59759, -74427, -72510, -78645, -32524, -28084, -8568, 13290, 59521, 25333, -21894, -7412, 33667, 72541, 44468, 20807, 1431, -4893, 60975, 119658, 127174, 102359, 65277, 36942, 30784, 136744, 200218, 170931, 182238, 145840, 95861, 85116, 39116, -28391, 22239, 91041, 126409, 79947, 48645, 82275, 60754, 21798, -2715, 628, 27296, -4588, -23154, 26269, 14864, 26233, 18424, 7161, 17487, 48256, 73729, 13722, -60960, -46254, -26429, -34397, -39637, 13194, 32132, -3050, -54967, -79059, -35152, -31317, -71893, -125370, -211468, -195772, -85616, -68839, -81075, -4472]
19476d472N0634l672m873J6382O385l6612m8385k0641O3753R5481J7164l9915
19464I1229J668K6957J6080j1733m6951m3128M4123K1451K1997L7510K021K9132
19452A90356j0928p8868k2068j678k1288m2600k0783K3610R0712m0031P515j5396
19440E8553k9779p9247q328K2341k5337L2383M2214J5940M3538L920J2150j3782
19428G4566k5379J2565O390N3722J9978p641j5137l503p7011J3936K5894K5717
19416A04097N240J3683o984l6472q7685J9796k8752N1196N23m432O3165n38J4538
19403A07375j0285m0302P7820Q1842L0871n4927k5752M2907n293q3869m6585J0388
19391H4190J01676l3587q3335l251L9973l5984l5213K2812k8638p794M2234L6617
$$ y = [-4472, 46162, 42490, 37617, 53999, 60384, 23772, -24613, -45254, 18499, 113980, 131144, 91229, 92897, 119854, 135934, 124201, 77250, 34122, 78245, 99696, 121693, 159203, 161224, 190356, 179428, 100560, 78492, 76814, 55526, 12926, -7857, 15753, 106465, 66434, 73949, 58553, 28774, -50473, -58801, -36460, -61797, -29414, 12800, 28740, 72278, 76198, 88348, 74566, 49187, 61752, 68142, 121864, 141842, 134201, 119064, 115561, 38550, 52486, 78380, 104097, 109337, 123020, 116036, 79564, -8121, 11675, -17077, 34119, 34642, 30210, 93375, 92837, 107375, 97090, 56788, 134608, 216450, 247321, 192394, 166642, 209549, 204256, 120387, 73802, 84190, 185866, 152279, 68944, 65693, 105666, 69682, 34469, 57281, 28643, 20849, 63083, 99700]
19379I9700K0280J7522l7852K0048l991j552l8864o6032m6288K5240J27084Q760
19367A24055r8878k9854J6514j0001Q7077L7525N3766J00046L3683n1992r2083
19356A69858o7331k4373k6143L409n6579j0823P2122K9589n5808K9232J5801J805
19344H0759k5321Q852K0852K8692R046o86N251M4643m337m3871j1315l8290q4524
19331a0249o019K2639R4742l1682m4158k1021j6812R995L5829L3105K6342J8824
19319A11535N5329K1670L5263Q212p7874m0900m6651L5675j4622r109M0045M8371
19307A66944P351r9147r1684l9184J4329L9961K9191J0931k0359K6621q776j6615
19295A9563m3004o267j3507m2250N3918J23628O6797N1892L1429m3646n0862p2210
$$ y = [99700, 119980, 137502, 99650, 119698, 115707, 114155, 75291, 9259, -37029, -11789, 115295, 124055, 25177, -4677, 11837, 1836, 88913, 126438, 180204, 280250, 313933, 261941, 169858, 102527, 78154, 52011, 55420, -1159, -11982, 60140, 89729, 33921, 63153, 78954, 80759, 55438, 64290, 85142, 113834, 122880, 122194, 127445, 172088, 167751, 123880, 112565, 74275, -10249, -16268, 6371, 101113, 69431, 25273, 4252, -12560, -2565, 33264, 66369, 92711, 111535, 166864, 188534, 223797, 232009, 154135, 113235, 66584, 102259, 87637, 78528, 118573, 166944, 174295, 75148, -16536, -55720, -41391, -1430, 27761, 38692, 18333, 44954, 36178, 19563, -23441, -29708, -43215, -85465, -31547, 92081, 158878, 210770, 242199, 198553, 147691, 75481]
19283G5481M3967M9441r442J5518n5750K5418J079k2242l4962j2M450l1888P085
19270F8143N9000P619p3322N1022N0303j07374q1632O063J4531N7284J27450K9068
19258B08155j09792k0192L0301k2990K2368J7552O8509M9704p3673m2143m4677
19247H3122j13192j4746N0727O2474o315j09745L815N1517P0519N1904J0525k4133
19235A16472l3288q9125k8742L3528M6897p946J05604M7311p818n6022l6639j2676
19223G7556o3096k621q529n9546R3899R9759L5547l2841n4599J11946L5724r0380
19211A42819q0757p1049k2587j1575L911m791R7780L6078l3061j9864M5606Q3305
19199A65815O6328l7480r8372o1427O7240K8384m5540m6693j7385K854l5176K8436
$$ y = [75481, 119448, 168889, 159447, 174965, 119215, 144633, 145712, 123470, 88508, 88496, 92946, 61058, 68143, 127143, 134762, 61440, 112462, 162765, 55391, -26241, -20178, -5647, 51637, 179087, 208155, 98363, 78171, 108472, 85482, 107850, 125402, 193911, 243615, 169942, 127799, 83122, -30070, -44816, 5911, 68385, 62070, -47675, -43860, 7657, 78176, 130080, 140605, 116472, 83184, -5941, -34683, -1155, 45742, 37796, 143400, 190711, 182893, 126871, 90232, 77556, 14460, 11839, 3310, -56236, 37663, 137422, 172969, 140128, 85529, 197475, 233199, 142819, 62062, -8987, -31574, -43149, -39238, -44029, 53751, 89829, 56768, 36904, 82510, 165815, 232143, 194663, 96291, 34864, 102104, 130488, 84948, 38255, 20870, 23724, -11452, 16984]
19187A6984Q1806Q4350L6334n8662r9097l2237o6078m3853M8183L6770J8860j958
19175B1402q142N996O2391R8253K0606n4970k4604l0845l1888m7692J06895K8488
19163A45890j18021j5658J0098Q8361M9229r441K8840P2955L4498j06132l7992
19152A42627l3855j3368L7066J29260j7373m701O671L294o8168J8192J0490n6986
19140A53149m5540J2590M5406l6125M4829J3695q9118J6662O6220n6293r1663
19129C3812l2753J03024k5708p2193m5177P5455K5380m0525K1318J7983J8984
19118G9600K7975m3727o7287J1259O1151P4094k3567J2795J01299j9104r726l1179
19106A73583K6293m0759K102k8714n8487n0072l6503M5890J8683j8405o8341K4326
$$ y = [16984, 98790, 183140, 219474, 160812, 61715, 29478, -36600, -80453, -32270, 4500, 23360, 21402, 13260, 19256, 81647, 179900, 200506, 145536, 120932, 90087, 58199, 10507, 117402, 145890, 27869, 12211, 22309, 110670, 159899, 150458, 179298, 252253, 286751, 180619, 142627, 108772, 95404, 132470, 261730, 244357, 239656, 246327, 249621, 181453, 199645, 210135, 153149, 107609, 120199, 165605, 129480, 174309, 188004, 98886, 115548, 181768, 125475, 33812, 1059, 104083, 78375, 6182, -38995, 36460, 61840, 21315, 42633, 60616, 79600, 107575, 63848, -3439, 7820, 68971, 143065, 119498, 132293, 233592, 214488, 204762, 173583, 199876, 159117, 161219, 132505, 74018, 23946, -12557, 33333, 52016, 33611, -34730, -10404]
19094a0404P8939J573K3179n9780l2416L5785L510Q0026n0612m156k748J4522
19082G7418K3384k4645l1527M660O2085j9614M3704L7506k2606j12280q0751J7625
19070b5041k2618P9333Q0408O8672p705l2024j0915P22K8216j4078l8746j8559
19058H7665m972l3911p583R8157p1978r0417J7534J9586Q1549M9184J2700K0810
19046A78324L3455m2117K6779K7105m2286q764N713J1940k764q3718r146K2713
19034A17234m5570M2097O5910K369m9926k6170M8097L6833q7305p8229L4791P0687
19022A30818P4547M4199k4930o8915n776K466J621L1985o5656k3158m541O8104
19010A60764J3681q6103j7233J0102j6177K5657M2961K274n748o804l0395J1870
$$ y = [-10404, 68535, 70108, 93287, 33507, 1091, 36876, 40386, 120412, 69800, 65644, 62896, 77418, 100802, 76157, 44630, 49290, 111375, 91761, 135465, 172971, 150365, 38085, -42666, -25041, -47659, 31674, 112082, 180754, 173049, 141025, 130110, 130832, 159048, 144970, 106224, 87665, 82693, 48782, 41199, 139356, 67378, -23039, -5505, 14081, 95630, 144814, 157514, 178324, 211779, 169662, 196441, 223546, 181260, 172496, 178209, 190149, 187385, 103667, 94521, 117234, 71664, 113761, 179671, 182040, 132114, 105944, 154041, 190874, 103569, 25340, 60131, 130818, 205365, 249564, 224634, 155719, 149943, 152409, 154030, 186015, 120359, 97201, 92660, 160764, 174445, 88342, 71109, 81211, 65034, 90691, 133652, 135926, 130178, 123374, 92979, 104849]
18998A04849m9582p6962K5940L9521k2834L1228P9801M244k2107o0950l8348N2874
18986F7674N2087o990m5173K0169J1535n379l4690j4622M896P1137n1528J450
18974G0566M4908p0804K0428K3414M0599J7842q8755k5152J3313l4309L5995N4948
18962A02993l2584K953J4982M90o036m295o2136J5227J3352P0314j0348j1583
18950I3329K9548Q5011m611k4216k4958m6631m5140J8574m0255N2679M9328L3787
18938A76445r708l3063j4867N606J9514M7142L8974n9401p039L4383k0504j9190
18926A58292l1562m9867L8980q728l1152K4695K3094L512J5209n199q800M80j983
18913A26971k1734J17396N6028o6414P953j7665n3103N3970o591l7723l284J8090
$$ y = [104849, 55267, -21695, 4245, 43766, 20932, 52160, 131961, 136205, 114098, 53148, 14800, 67674, 119761, 112771, 67598, 87767, 99302, 93923, 59233, 44611, 49507, 120644, 69116, 70566, 115474, 44670, 65098, 88512, 129111, 146953, 58198, 33046, 46359, 12050, 48045, 102993, 70409, 73362, 88344, 88834, 82798, 78503, 16367, 31594, 44946, 115260, 104912, 93329, 122877, 207888, 203277, 179061, 154103, 107472, 62332, 80906, 40651, 93330, 142658, 176445, 166737, 133674, 118807, 124413, 143927, 191069, 230043, 170642, 163603, 197986, 177482, 158292, 126730, 76863, 115843, 107115, 75963, 100658, 123752, 127264, 142473, 137274, 128474, 128954, 126971, 105237, 222633, 278661, 212247, 220200, 202535, 149432, 203402, 196811, 159088, 155804, 173894]
18901A73894m4104n4841r892P9820K2321J01351J5501Q245o5820M079O1758L131
18889B95443j1236n9642j267k3537J049o754K2427o0346j1392k5782o2875J4114
18877G0202M0261l668L6584N1787l3631m7670j072J8943L7267K6981m9275m8166
18865I8543l729P4623K42K2811O692l9678k9594K8849P33N6500K2281k8049L2822
18852B43046o32l5705J421n6746m7288K2594P0091O0365k7327k7660q059r1074
18840A03026p4882R0255N2411N2384J3319r6510Q8909K6383K0088J3010j5884
18829B72509J0996K3589K8812j9239L670J11598R6789k0101K4333K9977Q2385
18818F45318J13013J6417k125l4035L9419l8769q1396m3088p0776n3289R789J0306
$$ y = [173894, 129790, 74949, 65057, 144877, 167198, 268549, 284050, 292295, 226475, 230554, 292312, 295443, 284207, 224565, 223298, 199761, 200810, 194056, 216483, 156137, 144745, 118963, 56088, 70202, 110463, 106795, 143379, 195166, 161535, 113865, 112793, 131736, 169003, 195984, 146709, 98543, 94814, 169437, 169679, 192490, 199182, 159504, 129910, 158759, 159492, 215992, 238273, 210224, 243046, 242414, 206709, 208130, 151384, 104096, 126690, 196781, 257146, 229819, 202159, 194100, 103026, 28144, 118399, 170810, 223194, 236513, 140003, 228912, 255295, 275383, 288393, 272509, 283505, 307094, 335906, 316667, 320337, 431935, 528724, 508623, 532956, 562933, 645318, 758331, 774748, 772623, 738588, 778007, 739238, 657842, 614754, 543978, 490689, 500478, 510784]
18806E10784k6540N7241n4250p0132J3246n3723M4295l187q9829n6068O5810Q9453
18794D27100o6196L928k0328j3969l1919q8634M1731j217J101R6068M2254j04884
18782B85035j01648Q3518Q3437J3110J3814L0480N5537R8809P2840M2834J18878
18771G96644m2938k1379o2401M7258R8444J17779J13395J67189O0771r2192j29622
18760A052948n6152l2022m8978j24348j46531n5672n0194p8844p5394k9692Q3345
18749D38466l4073n0729r4524j14276j7300J20311J32432j2081m4694j7577j1498
18738B94457n0009q6973Q869L0812r195l7128O1856M5996k4246m3962j570j1854
18726A77053N4096Q997j0147m062K2795Q0396o8481o0133K1277J6457Q0151P3005
$$ y = [510784, 484244, 541485, 487235, 417103, 430349, 376626, 420921, 417734, 327905, 271837, 337647, 427100, 360904, 364832, 344504, 330535, 298616, 209982, 251713, 250496, 251597, 347665, 389919, 285035, 183387, 266905, 350342, 363452, 377266, 407746, 463283, 562092, 634932, 677766, 796644, 753706, 732327, 669926, 717184, 815628, 933407, 1046802, 1213991, 1274762, 1182570, 1052948, 996796, 964774, 915796, 791448, 644917, 589245, 539051, 460207, 384813, 355121, 438466, 404393, 353664, 259140, 144864, 127564, 247875, 380307, 368226, 323532, 305955, 294457, 244448, 157475, 166344, 197156, 187961, 150833, 212689, 258685, 234439, 190477, 188907, 177053, 231149, 240146, 229999, 225937, 248732, 329128, 260647, 200514, 221791, 238248, 318399, 391404]
18714C91404O2947L8861l3465M2059N8392n7731k4272J3282l8071Q3834Q6935
18703F24175M0063K6021M0363J09373O8433j44123r5111K7403j2906r063l9278
18692F35350q756j6793m8674j49046l2422L8701m8870p5782Q3168K3716n7721
18681C42871k7325L3945l3261M0171M327J8495p397L1626j6627j8636N6971m8797
18669C76363p7688Q0288P8355J4387O9850j2890K6805N4115M6570K2764j5144
18658F63775K9872j0571J12723Q1693q1393q3177m6677O2200O8060J47378Q3485
18647A027368r7082j26467n0746m0993O6987r183j06084p4598R404o6936j4878
18636E16792p3822j2629O8039l2845p0112K5757L1907r71k7335J771o1918J0335
$$ y = [391404, 454351, 493212, 459747, 501806, 560198, 502467, 478195, 491477, 453406, 537240, 624175, 664238, 690259, 730622, 839995, 908428, 764305, 669194, 696597, 683691, 674628, 635350, 626594, 609801, 561127, 412081, 379659, 418360, 369490, 293708, 376876, 400592, 342871, 315546, 349491, 316230, 356401, 360728, 379223, 371826, 403452, 386825, 368189, 425160, 376363, 298675, 378963, 457318, 471705, 541555, 528665, 555470, 609585, 656155, 678919, 663775, 693647, 683076, 795799, 877492, 796099, 712922, 666245, 728445, 796505, 943883, 1027368, 930286, 803819, 753073, 712080, 779067, 769884, 663800, 589202, 598606, 531670, 516792, 442970, 430341, 498380, 465535, 395423, 421180, 453087, 452116, 424781, 426552, 364634, 374969]
18624C74969P2663j6138p7986j00554p2239M6004J68q6612P6916N3003L8943K9071
18612C38208J9229P0318N6199n4525p754p4731r0968L3554L9390m3422m4366K4561
18600B65693q523j4819J32319L9281p2287p8173O545k2328J4760k7637M1567R3422
18588C69820N5003J4382n056o012m2844q112j7206r17m4665r4143K1654j2988
18576B28916q8755N1666J96193L4490k8314k5255m938r9678o6399J01094J23166
18565D22186j21m7427K2990k4907K2595L8359n8840N6307Q5874O0366o0816J2293
18553E28859K6693J08122K5248L2914J19116R4436M8462l3427j43498j10122k7449
18542F69354q7244k0454Q495n9476o1300K8688l827m1098k3130r175M7702M7198
$$ y = [374969, 447632, 431494, 353508, 252954, 180715, 226719, 226887, 140275, 217191, 270194, 309137, 338208, 357437, 427755, 483954, 429429, 421675, 346944, 255976, 289530, 328920, 285498, 241132, 265693, 257170, 242351, 374670, 413951, 341664, 263491, 270036, 247708, 262468, 234831, 276398, 369820, 424823, 439205, 434149, 428137, 385293, 377181, 359975, 359058, 314393, 220250, 241904, 228916, 140161, 191827, 388020, 422510, 394196, 368941, 364003, 264325, 197926, 299020, 422186, 422065, 374638, 397628, 372721, 395316, 433675, 374835, 431142, 517016, 577382, 516566, 528859, 555552, 663674, 688922, 721836, 840952, 935388, 983850, 950423, 806925, 696803, 669354, 582110, 561656, 570151, 510675, 449375, 478063, 474236, 433138, 410008, 400833, 448535, 495733]
18530D95733l9561M0660L6213j31032l6818k248L1021O787K475n6591K1788L7205
18518D05632l7753k8653R9961Q9437j344L8738k3270n823n136L5293k1387k5398
18506E20297m132O4228R8653L5979L6341K20003K17513J58057K22063J64458J1571
18495A745031j62362k06870j53290j87262j16318O03k9404j31477j17287n0870
18485E90494o5612p6578m3225Q7605O6231j3578j9103l4389J4513L1234p8415
18474D59177J5854O8954j15904q0148J7556N7298L0236O858l9014J8369o396n0660
18462C82180n7276j6090O1474M4899N6282N3497k0507m6334J2491P5695J13581
18451F59892J01048J07516R5239J00207O993n0330n4565j4349m0280q2587j30072
$$ y = [495733, 456172, 496832, 533045, 402013, 365195, 362947, 393968, 400755, 403230, 346639, 368427, 405632, 367879, 339226, 439187, 528624, 527280, 566018, 542748, 536925, 531789, 567082, 545695, 520297, 516165, 580393, 679046, 715025, 751366, 971369, 1188882, 1346939, 1569002, 1733460, 1745031, 1582669, 1375799, 1222509, 1035247, 918929, 919532, 890128, 758651, 641364, 590494, 524882, 448304, 405079, 492684, 558915, 545337, 526234, 491845, 506358, 537592, 459177, 475031, 543985, 428081, 347933, 365489, 422787, 453023, 459881, 420867, 439236, 432840, 382180, 324904, 308814, 370288, 415187, 471469, 524966, 504459, 458125, 470616, 546311, 659892, 760940, 868456, 963695, 1063902, 1070895, 1020565, 966000, 951651, 911371, 828784, 698712]
18440F98712j2353k0896o1158n2637n3847j04338m0706L1306M7409k2902J6998
18429D25588m538o1733L6439L3818l1202k2309M4620J6385k976Q5759j6241m2824
18417D60786J03522P4946l257P082N7822L5825K9557Q8934J37844J38917J29059
18406A261037l95M0061m0223o1810o5468n5163m6350O1282J18684J44695K03025
18395A559375L72099L74905K74868J26600j37246k25213j95647j86995j85915
18386A776831j08663l6469M0874J17231K34420K36204K82119K41236R6333m7112
18376B833004k40614l02666k96810j83038q4680j48329n7640Q345O5394P5081
18366A668047L9414k5564l7189j09280j45125k12306n1718K1027M022l7859j61356
$$ y = [698712, 686359, 665463, 604305, 551668, 497821, 393483, 352777, 384083, 431492, 408590, 425588, 421050, 359317, 395756, 429574, 398372, 376063, 420683, 437068, 434092, 519851, 503610, 460786, 564308, 639254, 635997, 643079, 700901, 736726, 766283, 855217, 993061, 1131978, 1261037, 1260642, 1300703, 1260480, 1198670, 1133202, 1078039, 1031689, 1092971, 1211655, 1356350, 1559375, 1931474, 2306379, 2581247, 2707847, 2570601, 2345388, 2149741, 1962746, 1776831, 1668168, 1631699, 1672573, 1789804, 2024224, 2260428, 2542547, 2783783, 2880116, 2833004, 2592390, 2289724, 1992914, 1809876, 1725196, 1576867, 1519227, 1527572, 1592966, 1668047, 1707461, 1681897, 1644708, 1535428, 1390303, 1177997, 1126279, 1147306, 1151328, 1113469, 952113]
18355I52113n1426r17l7657n769M6461l3056r2055n313l4620p408O6219j15490
18343F81082j16856m342O787R2129M4366l4356l0093p646L6641P348j4217L147
18331F63990R833L4617j5925l3191l7762Q675K1073N3928k2187o1893K2750N6959
18319G00867k7070q5780q937N5481k6223j749l0083o28J05446J9903n8917k7080
18307F15230k5702k2408R1601J2306J06796N6755Q292K1137J1811o4737n5539
18296G55542k6551L4648o0543l0945m4824j4101N4066l2317k3080M1527p4974
18285E78448k5206J27614j8700m4664j5289k8646P560o110L8071N5659k6005j2703
18273F30029j6429K4618N2380m6292k0093L0601j5376j9234L5942k2096k79K2024
$$ y = [952113, 900687, 899770, 862113, 856344, 902805, 869749, 777694, 772381, 737761, 730353, 796572, 681082, 564226, 559884, 566671, 658800, 703166, 668810, 638717, 631071, 667712, 675060, 660843, 663990, 673823, 708440, 692515, 659324, 621562, 630237, 651310, 705238, 683051, 621158, 643908, 700867, 673797, 588017, 579080, 634561, 608338, 606589, 576506, 575878, 681324, 701227, 642310, 615230, 589528, 567120, 658721, 671027, 777823, 834578, 842870, 864007, 875818, 811081, 755542, 728991, 763639, 703096, 672151, 627327, 613226, 667292, 634975, 611895, 653422, 578448, 553242, 680856, 662156, 617492, 602203, 573557, 581117, 575007, 613078, 668737, 642732, 630029, 613600, 638218, 690598, 644306, 624213, 654814, 639438, 620204, 656146, 634050, 633771, 655795]
18261F55795k1316J942P167N4834L9257M6225O1252j9415l1064J7385l7310p928
18249G66824K773k7699p1020l2950J3972J18600R3372q662K046J10462m278N9103
18237A022543J48307J87709J79398J97797J15539o842j34728j16116j31755o7773
18227A394079q9075o9968m4241r3652q5223p5399L9328J6983R8320N7714K7942
18216A176808J50124K14870K12524J28243J18685j0647j12478j82659j53285j46956
18206A395229m6699l508q9276K004l1088m8207r319O7431O9647J8511J52523J02858
18194A580106o9128q2064j57580n8469n3865p8626O990k2862P0702Q1600o0264
18183A156540j9325L6075k1338l3313o5972J1925P8621O885K455L6428K088J0695
$$ y = [655795, 634479, 636421, 643588, 698422, 737679, 783904, 845156, 825741, 794677, 812062, 774752, 766824, 769597, 741898, 670878, 637928, 651900, 770500, 863872, 855210, 857256, 967718, 963440, 1022543, 1170850, 1358559, 1537957, 1735754, 1851293, 1844451, 1709723, 1593607, 1461852, 1394079, 1305004, 1235036, 1190795, 1097143, 1011920, 936521, 975849, 992832, 1091152, 1148866, 1176808, 1326932, 1541802, 1754326, 1882569, 2001254, 1990607, 1878129, 1695470, 1542185, 1395229, 1348530, 1345022, 1255746, 1257750, 1226662, 1178455, 1169136, 1236567, 1306214, 1324725, 1477248, 1580106, 1510978, 1428914, 1271334, 1212865, 1159000, 1080374, 1087364, 1064502, 1135204, 1216804, 1156540, 1137215, 1173290, 1151952, 1118639, 1052667, 1064592, 1143213, 1150098, 1152553, 1188981, 1191069, 1201764]
18171A201764P15m6244M4783M8317J787k3570j8003m2120j17823j0876J78P7414
18159A116322K3191L6932j0226j5180L6667J15558K0719M9826P0915R8186J45064
18148A687974J97686J87717R0502J30104M5954J9446o0205j19439n9917m9149
18138B070673q7089q3155n8200q969k7629J0083P6050L9683P3139R3042J9802
18127B117430J38468J73570J07573J13583J38349K05874J15596J89004L66975
18118C666422L04865M75423N49966O99925Q76781J243667J686658K645589M240065
18109A6389361P379691J2850043J8186634J5367990O193197j145357j1564852
18102F3656707j3608878r794753n703451m363413m400904l845179k921618k217833
$$ y = [1201764, 1202479, 1156235, 1201018, 1249335, 1251122, 1227552, 1209549, 1167429, 1049606, 1038730, 1038908, 1116322, 1139513, 1176445, 1166219, 1151039, 1187706, 1303264, 1323983, 1373809, 1444724, 1542910, 1687974, 1885660, 2073377, 2163879, 2293983, 2339937, 2359383, 2299178, 2179739, 2119822, 2070673, 1983584, 1900429, 1842229, 1833260, 1805631, 1815714, 1891764, 1931447, 2004586, 2097628, 2117430, 2255898, 2429468, 2537041, 2650624, 2788973, 2994847, 3110443, 3299447, 3666422, 3971287, 4446710, 4996676, 5696601, 6573382, 7817049, 9503707, 12149296, 16389361, 23769052, 36619095, 54805729, 70173719, 76366916, 75221559, 63656707, 50047829, 40253076, 34549625, 30186212, 25785308, 21940129, 19018511, 16800678]
18094A6800678j833696j441156j273883j107416q89162p47311n43282l94102l40615
18085H230055k93653k62324j40867o6881j0449l2128n1315m1396r7146k09641
18075G024255k36813k29671j12212j39010o6944O8304J40637P5872J80151J88310
18065F892879J99391K50770L23556M28756O26529P67994R27424J215328J615247
18056A3247874K298593L266214M826012P499983J1581244J6045056J8002582J6244004
18048I3011562J2119274K797872n540978j0266374j3046559j2435182j0077382
18041E6562233p877008o627587n732200m716242l708188k863528k233270j709905
18033B1094305j366772r98752o30262m30752m46612m72102n60543n66858n04769
$$ y = [16800678, 14966982, 13525826, 12251943, 11144527, 10255365, 9508054, 8964772, 8570670, 8230055, 7936402, 7674078, 7533211, 7466330, 7455881, 7423753, 7372438, 7331042, 7233896, 7024255, 6787442, 6557771, 6445559, 6306549, 6239605, 6307909, 6448546, 6524418, 6704569, 6892879, 7092270, 7343040, 7666596, 8095352, 8721881, 9489875, 10417299, 11632627, 13247874, 15546467, 18812681, 23638693, 31138676, 42719920, 58764976, 76767558, 93011562, 105130836, 107928708, 102387730, 92121356, 79074797, 66639615, 56562233, 48685225, 42057638, 36325438, 31609196, 27901008, 25037480, 22804210, 21094305, 19727533, 18728781, 18098519, 17667767, 17221155, 16749053, 16188510, 15621652, 15116883]
18024A5116883m49999l32836k23517j82104j18919L0901J36114K09351K34343
18015A4420217L24745M36166M47376P12680R76976J375243J827898K443500L235016
18006B6199817M447764O215132R049371J3791544K1507688L1898436L9642474
17999A52752226L8720390L2631866J6980785n344636j8846194k7790272k9759977
17992A59344188k5684837j9944809j5964766j3906540j2004145r716969p697523
17985E4424599o014348m861556l833004l027430k508588k020183j707894j598108
17977B8853488j443561j374712j265247j163781j029971q04587n40328l78652
17969B0852649k39479p1024k13012k63785l57961l42260l36570k40544O6793L71360
$$ y = [15116883, 14666884, 14334048, 14110531, 13928427, 13809508, 13840409, 13976523, 14185874, 14420217, 14744962, 15181128, 15628504, 16341184, 17318160, 18693403, 20521301, 22964801, 26199817, 30647581, 36862713, 45912084, 59703628, 81211316, 113109752, 152752226, 191472616, 224104482, 241085267, 235740631, 216894437, 189104165, 159344188, 133659351, 113714542, 97749776, 83843236, 71839091, 62122122, 54424599, 48410251, 43548695, 39715691, 36688261, 34179673, 32159490, 30451596, 28853488, 27409927, 26035215, 24769968, 23606187, 22576216, 21771629, 21231301, 20852649, 20613170, 20542146, 20329134, 20065349, 19707388, 19365128, 19028558, 18788014, 18854807, 19226167]
17959A9226167O57685R53556J227291J765872K660755L972800O310560R773394
17951D6548080J5117010K0886210K2904241K0529204J5026862K775354p988868
17944A35798093j4088867j7476710j6334475j3215847j0222979q541673p557254
17937D8360288o366189n060773m002880l223113k646707k167915j881951j603025
17929B1407735j293434j087643q46434q22600p21415p42190o25093m53323l59705
17920A4455898l05306l04161k49114k63995k64294k94903l75017m56667m16274
17911A1526167m43934m57036l45082l26835k52545k06188k38946k61787k13755
17902H780059j83765j42886o6475j099q2884j27467k22751j43162m6596q4302
$$ y = [19226167, 19883852, 20837408, 22064699, 23830571, 26491326, 30464126, 36774686, 46548080, 61665090, 82551300, 105455541, 125984745, 141011607, 143786961, 135798093, 121709226, 104232516, 87898041, 74682194, 64459215, 55917542, 48360288, 41994099, 36933326, 32930446, 29707333, 27060626, 24892711, 23010760, 21407735, 20114301, 19026658, 18180224, 17357624, 16636209, 15894019, 15268926, 14815603, 14455898, 14150592, 13846431, 13597317, 13333322, 13069028, 12774125, 12399108, 11942441, 11526167, 11082233, 10625197, 10280115, 9953280, 9700735, 9494547, 9255601, 8993814, 8780059, 8596294, 8453408, 8386933, 8385834, 8302950, 8175483, 7952732, 7809570, 7762974, 7678672]
17892G678672j36373k09592k84298k85284k30098k64932k28750j30828r7533j43196
17882E667788j44153m4138k3711j16100n3794m2687m3535k9635K771k9358j14244
17871E029204J2535M5778L4644N8812L5530J06224M8719M9860J27233J25841j5951
17860E658429q0271r207j0358J09936J68372J36194J79605J55296J57184K80099
17850F745279L06070L13730K64309L03447L37167M80439Q49567J060992J150532
17841A1811532R89109P03599L89166J02479L0141R5633L77377O66825R41062J449234
17831A7556157J926652K499636K929660L309721L522402L738948M417342O030329
17823D5930847Q991405J4213422K3265467L7716214N3723191N5739812L5422306
$$ y = [7678672, 7542299, 7332707, 7048409, 6763125, 6533027, 6268095, 6039345, 5908517, 5810984, 5667788, 5523635, 5479497, 5455786, 5339686, 5285892, 5243205, 5199670, 5170035, 5172806, 5143448, 5029204, 5041739, 5087517, 5122161, 5180973, 5216503, 5322727, 5371446, 5421306, 5548539, 5674380, 5658429, 5578158, 5568951, 5558593, 5668529, 5836901, 5973095, 6152700, 6307996, 6465180, 6745279, 7051349, 7365079, 7629388, 7932835, 8270002, 8750441, 9600008, 10661000, 11811532, 12800641, 13504240, 13893406, 13995885, 14026026, 14121659, 14499036, 15165861, 16106923, 17556157, 19482809, 21982445, 24912105, 28221826, 31744228, 35483176, 39900518, 45930847, 54922252, 69135674, 92401141, 130117355, 183840546, 239580358, 275002664]
17816B75002664J2122630j4249462l0380363k7475806j7079348r867150n796279
17809A82276886K162867J6784205L7682796O0613007P3695227O8657194M4622023
17802D86494205O306976l1205977n1525981n5536366m7236122l4739554k3714919
17795B48842262j4250702m919014O761495K3020521L9258729M0717719J9521324
17788C58952334m819236l2458777m8756605m3813019l1222651k2801081k0089261
17781A54991704j8076257j4734994j1535952r228071p875792p153459o537664
17774G9849515n950229n269409m464685l604607l014926k632890k225994j865610
17766E0821165j711196j502662j558415j828971k003083k217868k188363j932277
$$ y = [275002664, 287125294, 272875832, 242495469, 215019663, 197940315, 188073165, 182276886, 184439753, 201223958, 238906754, 299519761, 373214988, 441872182, 486494205, 492801181, 461595204, 410069223, 354532857, 307296735, 272557181, 248842262, 234591560, 229672546, 236434041, 259454562, 298713291, 339431010, 358952334, 354133098, 321674321, 272917716, 229104697, 197882046, 175080965, 154991704, 136915447, 122180453, 110644501, 101416430, 93540638, 86387179, 79849515, 73899286, 68629877, 64165192, 60560585, 57545659, 54912769, 52686775, 50821165, 49109969, 47607307, 46048892, 44219921, 42216838, 39998970, 37810607, 35878330]
17758C5878330j686939j518394j311064j248818j181595j070511r58654p98655
17750B6103700q75679q13441p34230p85083q34120q40747p33156n83088n90318
17741A9313838n62283m81213m54649l59443l51231l67421m28352m59693m69300
17732A5380253m60001n71908n46917m07116m09410l45088l36941k15417j44184
17723A1943271o0136l3879k32972l30686m06264l49135l65180m29408l76174l25227
17713I034210k91089k14755j49926j47323j06403j88145j82874k43887k66228
17704G243580l06599l05532k73581k41655k25301l09817k34872k64505j67409
17695D914309k03083k53629j85256j96926j59408q8243j02845k08052k03760k27712
$$ y = [35878330, 34191391, 32672997, 31361933, 30113115, 28931520, 27861009, 26902355, 26103700, 25228021, 24414580, 23680350, 22895267, 22061147, 21220400, 20487244, 19904156, 19313838, 18751555, 18270342, 17815693, 17456250, 17105019, 16737598, 16309246, 15849553, 15380253, 14920252, 14348344, 13801427, 13394311, 12984901, 12639813, 12302872, 12087455, 11943271, 11883135, 11849256, 11616284, 11285598, 10879334, 10530199, 10165019, 9735611, 9359437, 9034210, 8743121, 8528366, 8378440, 8231117, 8124714, 7936569, 7753695, 7509808, 7243580, 6936981, 6631449, 6357868, 6116213, 5890912, 5581095, 5346223, 5081718, 4914309, 4711226, 4457597, 4272341, 4075415, 3916007, 3827764, 3724919, 3516867, 3313107, 3085395]
17685C085395j47952m2178l8825j07475j88685j52199q0423j52675m8338o3370
17675B063275m3537j42757k05409m7924j861l7170M6139n6158j07121p4350j250
17664A391877L5250n2085J3622m7257r3407k6120Q1036k4965j25172k1781J7860
17653A148858j4212k7174r287K4198K8552n0667K6340L201p811k4261K9331K4304
17641A151372Q970R415n639j7954N419J7073R9151m423j03239k2410L7621o2249
17629A113107m1337P7772Q5927p3520r2683N4822P6985L9112J4209q1257n456
17618A167681L686K4273q5333q0895p8342N9534P0928J8487R042l5925n3897M8731
17606A067970m4036J7124O6357j912j20747q4113Q448n8023n4192L1408N3412
$$ y = [3085395, 2937443, 2895265, 2856440, 2748965, 2560280, 2408081, 2327658, 2174983, 2126645, 2063275, 2019738, 1876981, 1671572, 1623648, 1621787, 1584617, 1630756, 1574598, 1467477, 1393127, 1391877, 1427127, 1375042, 1388664, 1341407, 1248000, 1221880, 1302916, 1277951, 1152779, 1130998, 1148858, 1134646, 1107472, 1098185, 1122383, 1150935, 1100268, 1126608, 1129809, 1121998, 1097737, 1127068, 1151372, 1160342, 1169757, 1164118, 1146164, 1151583, 1168656, 1267807, 1263384, 1160145, 1137735, 1175356, 1113107, 1071770, 1149542, 1235469, 1161949, 1069266, 1124088, 1201073, 1240185, 1254394, 1173137, 1167681, 1171367, 1195640, 1110307, 1029412, 951070, 1010604, 1081532, 1100019, 1109061, 1073136, 1019239, 1067970, 1023934, 1041058, 1107415, 1105503, 984756, 900643, 909091, 851068, 796876, 828284, 881696]
17595H81696O7184p954o2230L323J3484K8198p4790m0480P434K3484k7822J1166
17583H22693r677J9327j0799j5932L0374R2786Q2662k3569j4187J30903Q9994
17572A194575n1697r0645L8264O6437N3422k5073J8708j4526l6857m5199L5893
17561A143302P4757M1875l7097l3435P5936O5562R621p5686o6958l8449K3690
17550A183118K1757R3465m8018l0531N6552l0355J3363J4942j7488o1266j6279
17539A179260N2372L5619K4585K9L6837K3071K0572K7369Q5626J22215n9002q8217
17527A460336M7210l2723K6355K6519O7844L5584j2496j1726j5138J39926J38504
17516A870195M1899L3318r9304l3366k4696j49860j48438j32980J7977K3403N6548
$$ y = [881696, 948880, 940926, 878696, 882019, 895503, 923701, 848911, 808431, 815865, 839349, 811527, 822693, 813016, 832343, 821544, 805612, 835986, 928772, 1011434, 987865, 973678, 1104581, 1194575, 1142878, 1052233, 1090497, 1156934, 1210356, 1185283, 1203991, 1189465, 1152608, 1107409, 1143302, 1218059, 1259934, 1222837, 1189402, 1265338, 1330900, 1340521, 1264835, 1197877, 1159428, 1183118, 1204875, 1298340, 1250322, 1219791, 1276343, 1245988, 1259351, 1274293, 1256805, 1195539, 1179260, 1231632, 1267251, 1291836, 1291865, 1328702, 1351773, 1372345, 1399714, 1485340, 1607555, 1548553, 1460336, 1507546, 1474823, 1501178, 1527697, 1595541, 1631125, 1618629, 1606903, 1591765, 1731691, 1870195, 1912094, 1945412, 1846108, 1812742, 1788046, 1638186, 1489748, 1356768, 1374745, 1398148, 1454696]
17505A454696J14768m4182j00170K1820L2292O020O1363O7019L2213k1783J07004
17494A731060J08355M662l4074m8978j03958o2021K631M1703k6627k710K0021
17483A630064r965J2414J8239M2366m3906Q2081R4987L2286l930n176J9767j2569
17471A856658O8419R6844J284L6094n2632L4412P9330l5639N7943L6064p0660
17460B108117l0212m6083q76L1158R14p1519n7221p5705O9323J83215J06863O3217
17448B281191J61236K10449J10410J14337J12160P3957K5920P174k1874N605k0126
17437C060439k6199n2294j0180J9971N6496K38213K21003J10471P7915Q0487J91058
17426C967380L37776L07786K36996K16062K61712L72368M56207N93475O91713
$$ y = [1454696, 1569464, 1525282, 1425112, 1446932, 1479224, 1485244, 1546607, 1613626, 1645839, 1624056, 1731060, 1839415, 1844077, 1810003, 1761025, 1657067, 1595046, 1597677, 1639380, 1612753, 1610043, 1630064, 1620099, 1632513, 1650752, 1693118, 1649212, 1731293, 1826280, 1858566, 1854636, 1849460, 1869227, 1856658, 1925077, 2021921, 2023205, 2059299, 2006667, 2041079, 2120409, 2084770, 2142713, 2178777, 2108117, 2077905, 2031822, 2030946, 2062104, 2063018, 1991499, 1934278, 1858573, 1927896, 2111111, 2217974, 2281191, 2442427, 2652876, 2763286, 2877623, 2989783, 3063740, 3089660, 3096834, 3074960, 3080565, 3060439, 3034240, 2981946, 2971766, 2991737, 3048233, 3286446, 3507449, 3617920, 3695835, 3776322, 3967380, 4305156, 4612942, 4849938, 5066000, 5327712, 5700080, 6156287, 6749762, 7441475]
17417G441475P88354Q34764J090219J265430J832238K569343L844361N928074
17409B5594258R158304J3094574J5106310J2650635Q095293L714158J759617M703831
17401I3876980P598322N548190N93267m858925p203604l354195M063230J0243902
17393A06507167J0392042N762461J097184k265794m27383M195529M011224j458015
17385A27814415q587649j4866697j5962687j2762182r143727p351187o562657
17378E2577629n710158m798451l836454k906723k453445k122150j843580j460308
17370B7446360j027783p83687n62593m14161l74940o7404J37870O20629J252749
17361B6227040K100212L538337N711787R006255J1914312J1176245P532604L720096
$$ y = [7441475, 8229829, 9064593, 10154812, 11420242, 13252480, 15821823, 19666184, 25594258, 34752562, 47847136, 62953446, 75604081, 83699374, 87413532, 89173149, 93876980, 101475302, 107023492, 107616759, 102757834, 95554230, 92200035, 96263265, 106507167, 116899209, 122661670, 123758854, 121493060, 121065677, 125261206, 129272430, 127814415, 119226766, 104360069, 88397382, 75635200, 66491473, 59140286, 52577629, 46867471, 42069020, 38232566, 35325843, 32872398, 30750248, 28906668, 27446360, 26418577, 25634890, 25072297, 24658136, 24283196, 24215792, 24353662, 24974291, 26227040, 28327252, 31865589, 37577376, 46583631, 58497943, 69674188, 77206792, 80926888]
17353H0926888P71103J805956N129310N229288J863535k346201n586596m024639
17345H3768644J697382Q093858J0282567O822029K360052j679427k233007J863532
17337A10975630M116285P17768n151025j1544656j4577469j2659515r322395p155488
17329E5399135o254135n605232m633644l804096k969357k450379k152195j863286
17321B5666811j616493j323811j066189j044549j036899q83076q31722q02288
17313A7061784o84341o77037n92025o46295n82995n43241m94134m88625m02386
17304A1950705k91829m14394l98706l00923l08277l07465k94363k56724k66538
17295I111486j46768j70600j51580j55316j67904k48877j83433j49007j14462
$$ y = [80926888, 81697991, 83503947, 88633257, 93862545, 95726080, 93379879, 87793283, 83768644, 85466026, 93559884, 103842451, 110664480, 113024532, 111345105, 109112098, 110975630, 115091915, 115809683, 110658658, 99114002, 84536533, 71877018, 62554623, 55399135, 49145000, 43539768, 38906124, 35102028, 32132671, 29682292, 27530097, 25666811, 24050318, 22726507, 21660318, 20615769, 19578870, 18695794, 17864072, 17061784, 16377443, 15700406, 15108381, 14462086, 13879091, 13335850, 12841716, 12353091, 11950705, 11658876, 11244482, 10845776, 10544853, 10236576, 9929111, 9634748, 9378024, 9111486, 8964718, 8794118, 8642538, 8487222, 8319318, 8070441, 7887008, 7738001, 7623539]
17286G623539j31826r5046j25683q7805j10897k09431q6211j7653J6283n1531
17276F723739j19252j51221p1162M582K0502m214K8249J2521J15206J29363R2941
17265F781254K16379K99478L71909M19558N49915N55768M91026N58437P26012
17256A0969736Q53482Q76728J127189J559108K200917K982526M038249N898404
17248C0506339R044793J3630051J8680258K1378059K0424261J6132749O989767
17241A36786277k583453q622205j1572189j0447833o330407j110958M521202J1699986
17233A12340420K1631757L1271595L5504835L2722364K2649485M577242j2573084
17226B48124614k3261534k7987831k6185007k0200972j3791684q484114l122999
$$ y = [7623539, 7491713, 7396667, 7270984, 7183179, 7072282, 6862851, 6776640, 6758987, 6775270, 6723739, 6604487, 6453266, 6382104, 6386686, 6407188, 6402974, 6431223, 6443744, 6558950, 6688313, 6781254, 6997633, 7297111, 7669020, 8088578, 8638493, 9194261, 9685287, 10243724, 10969736, 11823218, 12699946, 13827135, 15386243, 17587160, 20569686, 24607935, 30506339, 39551132, 53181183, 71861441, 93239500, 113663761, 129796510, 136786277, 134202824, 125580619, 114008430, 103560597, 97230190, 96119232, 100640434, 112340420, 133972177, 165243772, 200748607, 233470971, 256120456, 260697698, 248124614, 224863080, 196875249, 170690242, 150489270, 136697586, 128213472, 125090473]
17219A25090473L495920R280760J1392847R887836M184993n029772j1929375j5653952
17211A30719730j6756481j4923071j1919555r353996p850890o976301n981284
17204E6958152n033099m309076l619924l128100k654104k376727k025808j757309
17196C2054005j579468j524457j333346j071935r41599r58396r66444r50038r18906
17187B1809416p72124p23637o99291o10595n26113m42087m61780m19680m30648
17178A6723461m97727m01204l81232m09055n16530n42343m66939l72030k02171
17169A2934230l10913l19183l82370k99235m35931m54942m25999k64494j71406
17160I869757j38096j13356k16971k45766o7101j05012j35421k64080k23104j95432
$$ y = [125090473, 128586393, 137867153, 149260000, 159147836, 163332829, 158303057, 146373682, 130719730, 113963249, 99040178, 87120623, 77766627, 69915737, 62939436, 56958152, 51925053, 47615977, 43996053, 40867953, 38213849, 35837122, 33811314, 32054005, 30474537, 28950080, 27616734, 26544799, 25603200, 24644804, 23678360, 22728322, 21809416, 21037292, 20313655, 19614364, 19003769, 18477656, 18035569, 17573789, 17154109, 16723461, 16225734, 15824530, 15443298, 15034243, 14517713, 13975370, 13508431, 13136401, 12934230, 12623317, 12304134, 11921764, 11622529, 11186598, 10731656, 10305657, 10041163, 9869757, 9731661, 9618305, 9401334, 9155568, 9088467, 8983455, 8848034, 8583954, 8360850, 8165418]
17150H165418k70699l23217k72271k47811k69745k37445j51293k14053k25091
17141E953793k38466j59890j08444j31341p3412r4859j32107j64981r5181n2213
17131D702899m3084j49312k01309k62619j66949j35483j35131j00327j54938j66360
17121C187387j12181q1861p4998k8859q7697r9639q6848p5351j7960j07604q3749
17110B330640n6792j22894l3623r1614q0768N5533n8872j02527r3162J260P2100
17099A819281p1581l5764l7985m0313j4392M4355P9195N989n7521N391m8320K6895
17087A675230P0636K137j5341l4839l4100k2653N5283P125N3758P0073L8697k085
17075A863921J15959O9205K5462M7235J9258R9145L7117j6778J11603J54578J86969
$$ y = [8165418, 7894719, 7571502, 7299231, 7051420, 6781675, 6544230, 6392937, 6178884, 5953793, 5715327, 5555437, 5446993, 5315652, 5242240, 5147381, 5015274, 4850293, 4755112, 4702899, 4659815, 4510503, 4309194, 4046575, 3879626, 3744143, 3609012, 3508685, 3353747, 3187387, 3075206, 2993345, 2918347, 2889488, 2801791, 2702152, 2615304, 2539953, 2521993, 2414389, 2330640, 2273848, 2150954, 2117331, 2025717, 1944949, 2000482, 1941610, 1839083, 1745921, 1747181, 1819281, 1747700, 1711936, 1673951, 1633638, 1619246, 1663601, 1742796, 1748785, 1691264, 1696655, 1648335, 1675230, 1745866, 1748003, 1732662, 1697823, 1663723, 1641070, 1696353, 1703478, 1757236, 1827309, 1866006, 1863921, 1979880, 2049085, 2074547, 2121782, 2141040, 2240185, 2277302, 2260524, 2372127, 2526705, 2713674]
17064B713674R6012J43282K08616J24564J07069J96342J94541J96640K79733L31963
17054D592436L86778L54619K95956M15039N29367O70877Q03446R56807J050688
17045A0056013J327273J928568K781631M077570O194279R641620J4529446J7927521
17037F8463921J5311531R578261M135822J92637L057311P552274N676782k1204
17029A13947335o571226j1289192r193233k816318M086677Q707138Q028045L884370
17021A08783596J18601l066886j176936L183890K830405j894344p646236j3093693
17013H8038397j3371358j0400015p590682o289964n612186m732045l746153k903519
17005C3392475k373680k014611j633856j340442r93183o91343m96378l77826k68858
$$ y = [2713674, 2809686, 2952968, 3161584, 3286148, 3393217, 3589559, 3784100, 3980740, 4260473, 4592436, 4979214, 5333833, 5629789, 6044828, 6574195, 7245072, 8048518, 9005325, 10056013, 11383286, 13311854, 16093485, 20171055, 26365334, 36006954, 50536400, 68463921, 83775452, 93353713, 97489535, 97682172, 100739483, 108291757, 113968539, 113947335, 107376109, 96086917, 86893684, 84077366, 88164043, 96871181, 104899226, 108783596, 108902197, 105835311, 104658375, 107842265, 110672670, 108778326, 101132090, 88038397, 74667039, 64267024, 56676342, 50386378, 44774192, 40042147, 36295994, 33392475, 31018795, 29004184, 27370328, 26029886, 25036703, 24345360, 23848982, 23471156, 23202298]
16996B3202298r3652L27175P97576J453684K351001L690965O067362R892809J4351564
16987F2040782J5541165J0964068O075852R82710l7668M241256O545942K875414
16979A09229521k394257q352579j0158355o305247J34630O132771Q529946N658065
16971A02474495J873627j851568l276703L95091L386119Q75775l893437r620954
16963I0362445j2935398j1544054q572968o509506n689316n046993m137726l387205
16955C2539279k821466k330159j938728j741938j393955j164815j101868r49535
16947A9096815r00446r20896q07852p64742o80664o34484o68165o38253n79130
16938A2502183m62674m49155m21281m24347m37784l36841j93867l70212l37010
$$ y = [23202298, 23108646, 23435821, 24233397, 25687081, 28038082, 31729047, 37796409, 47689218, 62040782, 77581947, 88546015, 94621867, 95604577, 95566909, 99808165, 106354107, 109229521, 106835264, 98482685, 88324330, 82019083, 82153713, 88286484, 96816430, 102474495, 104348122, 102496554, 99219851, 99614942, 103001061, 103876836, 99983399, 90362445, 77427047, 65882993, 57310025, 50800519, 45111203, 40064210, 35926484, 32539279, 29717813, 27387654, 25448926, 23706988, 22313033, 21148218, 20046350, 19096815, 18196369, 17275473, 16467621, 15702879, 15022215, 14387731, 13719566, 13081313, 12502183, 12039509, 11590354, 11169073, 10744726, 10306942, 9970101, 9776234, 9406022, 9069012]
16929I069012k87225k96704l43081k64095l40490l15535j75490j74969j34519
16920F736904k13619k58903k39708j79716k09316j59191m2594j69800k28105j81019
16910D854933j09522m5696p4347j19162j81922k65157j70172o2083J8581j9404
16900C826049j61333j73506q1724m2897l2594m7712j254k655M2711N8615m4980
16889C338720j02881p2854j3980K5059n0250m0990j3212l7199j10411j03608j5592
16878B802802o8589o6250n8254j9217J6664j18032n9273j6524l1532l4451j18784
16867B228560j31242j07960n3382k305n9208j89415q4321M590m3574k6078K0464
16856A556129j1207r4224r2198O847l8311q0073k4670K9872J1180o3210q2117
$$ y = [9069012, 8781787, 8485083, 8142002, 7877907, 7537417, 7221882, 7046392, 6871423, 6736904, 6523285, 6264382, 6024674, 5844958, 5635642, 5476451, 5433857, 5264057, 5035952, 4854933, 4745411, 4699715, 4625368, 4506206, 4324284, 4059127, 3888955, 3826872, 3845453, 3826049, 3664716, 3491210, 3409486, 3366589, 3333995, 3286283, 3285029, 3282374, 3325085, 3383700, 3338720, 3235839, 3162985, 3149005, 3174064, 3123814, 3082824, 3069612, 3032413, 2922002, 2818394, 2802802, 2734213, 2667963, 2609709, 2590492, 2607156, 2489124, 2429851, 2413327, 2381795, 2347344, 2228560, 2097318, 1989358, 1935976, 1933671, 1874463, 1685048, 1600727, 1605317, 1561743, 1535665, 1556129, 1544922, 1450698, 1358500, 1365347, 1327036, 1246963, 1222293, 1252165, 1263345, 1200135, 1118018]
16845A118018m0511K6929N5092j728Q7735O4162K8193M0702o4816O9337J09857
16834A492970O4404R979Q165j12478j47524k6343l7340K0698O8010Q6986R723
16823A437250j12063r9626p0622j6229N1842k8384r4297m8714m2685k3257m7139
16812I06076J4691n2234p3387j3856o0023n507N2100P272j1685N155P013K0358
16800G95973L2790P223m136k1535k8014L4442L6326m8330l7993L7650J0835k3347
16788G91884K3927P7120j7574O0271K5211N3985k8294r1671M0572J672p735M0318
16776I69686j2030j3980Q5857J39648N0347j5223J0020m8467l9096m597K4323
16765A146488j556j3897J07340O7368J3468J08677M2742j7853K7708P1013L3199
$$ y = [1118018, 1077507, 1104436, 1159528, 1157800, 1245535, 1309697, 1337890, 1378592, 1313776, 1383113, 1492970, 1557374, 1567353, 1575518, 1463040, 1315516, 1289173, 1251833, 1272531, 1340541, 1427527, 1437250, 1325187, 1225561, 1154939, 1138710, 1190552, 1162168, 1067871, 1019157, 976472, 953215, 906076, 920767, 868533, 795146, 781290, 721267, 715760, 767860, 775132, 763447, 768602, 775615, 795973, 828763, 835986, 831850, 810315, 782301, 816743, 853069, 804739, 766746, 804396, 815231, 791884, 815811, 892931, 875357, 935628, 960839, 1014824, 986530, 894859, 935431, 937103, 929368, 969686, 957656, 943676, 1029533, 1169181, 1219528, 1204305, 1214325, 1165858, 1126762, 1122165, 1146488, 1144932, 1131035, 1238375, 1305743, 1319211, 1427888, 1470630, 1452777, 1480485, 1551498, 1584697]
16754A584697o3223k2638N9332N8227N2975P6914J89816K19866J14107M4865K92
16743B315230r3203k7593K482j00676Q00J6635j6790J15236K45082K13342K10749
16732B881294J54122M7970K2320j26533j23581r1538q5622j15795q0620j1367
16722B470650N6114O9420J47434J22768M7402l2233K9426p8057j20769j06671
16712B605484M50k0263J7653L1067o047J14480J19030R0138M7895P6399M4261
16701C120547J25506R5471K9030M8389N0061M8261O1781J56622J92926K02167
16691D130761K33056K23176K37066L66452K82715K01184L41895M11462N05784
16682F933551O82013R09855J096628J225104J034249O34205M26221J88039K87022
$$ y = [1584697, 1521474, 1498836, 1558168, 1616395, 1669370, 1746284, 1936100, 2155966, 2270073, 2314938, 2315230, 2222027, 2194434, 2196916, 2096240, 2097040, 2113675, 2096885, 2212121, 2457203, 2670545, 2881294, 3035416, 3083386, 3105706, 2979173, 2855592, 2764054, 2678432, 2562637, 2482017, 2470650, 2526764, 2596184, 2743618, 2866386, 2913788, 2881555, 2910981, 2832924, 2712155, 2605484, 2605934, 2585671, 2603324, 2634391, 2628344, 2742824, 2861854, 2951992, 2999887, 3076286, 3120547, 3246053, 3341524, 3370554, 3418943, 3469004, 3517265, 3579046, 3735668, 3928594, 4130761, 4363817, 4586993, 4824059, 5190511, 5473226, 5674410, 6016305, 6427767, 6933551, 7615564, 8525419, 9622047, 10847151, 11881400, 12515605, 12941826, 13129865, 13416887]
16673A3416887N06573P12758J021827J322033J774816K148606K686328L172135
16665B6761963L636458M040143M868340O309315R198462J3977512K2023051L4360255
16657A25175499M8684524N4036913M0649399J8212161n816530k4845704k7886592
16650B28209670k0346944j2330096o721039N06642J2987128L0536409M9904063
16643B82745833O3968441O5356549M8956237J7182461j7250363m2239691n2305552
16636C66413915m7951888l6763039k5894447j6932251q303378K016650J5471642
16629B48057204K9611056L4601866K1951067J005980k2001114l9519613m0876861
16622B32829585l2127285k3958664j9999261j7837125j5120392j2165725r731927
$$ y = [13416887, 13923460, 14636218, 15658045, 16980078, 18754894, 20903500, 23589828, 26761963, 30398421, 34438564, 39306904, 45616219, 54814681, 68792193, 90815244, 125175499, 173860023, 227896936, 268546335, 286758496, 280941966, 256096262, 228209670, 207862726, 195532630, 188811591, 189318233, 202305361, 232841770, 282745833, 346714274, 412070823, 461027060, 478209521, 460959158, 418719467, 366413915, 318462027, 281698988, 255804541, 238872290, 230568912, 232585562, 248057204, 277668260, 312270126, 334221193, 335227173, 313226059, 273706446, 232829585, 200702300, 176743636, 156744375, 138907250, 123786858, 111621133, 101889206]
16615A01889206q063626p069798o247830n581493m990808m446043l767455l245118
16607E8477035k883802k496103k159863j900870j724236j547400j726758j870243
16599D2167760j904708j924285j844026j837149j644360j452654j284992j182811
16591B9092775r84867q82464r26036r38063p86068q55599q63494p37195p43620
16582B1375369p91389p06123o70618o17694n61927n46112n06213m76656m12749
16573A6085888m35141m77187m91537l96933m43463m80532m49955m79683l83886
16564A2047571k87814l89489l44662l45610k69011k73637k37755k72981k93079
16555I333533k24395k11154k72226k79507k76446k46352j97324k68481k50051
$$ y = [101889206, 93825580, 86755782, 80507952, 74926459, 69935651, 65489608, 61722153, 58477035, 55593233, 53097130, 50937267, 49036397, 47312161, 45764761, 44038003, 42167760, 40263052, 38338767, 36494741, 34657592, 33013232, 31560578, 30275586, 29092775, 28107908, 27225444, 26299408, 25361345, 24575277, 23719678, 22856184, 22118989, 21375369, 20583980, 19877857, 19207239, 18589545, 18027618, 17481506, 16975293, 16498637, 16085888, 15650747, 15173560, 14682023, 14285090, 13841627, 13361095, 12911140, 12431457, 12047571, 11759757, 11370268, 11025606, 10679996, 10410985, 10137348, 9899593, 9626612, 9333533, 9109138, 8897984, 8625758, 8346251, 8069805, 7823453, 7626129, 7357648, 7107597]
16546G107597j93139k18792j89749j77168j93656j03562j88489k29789k28301
16537E384952k86512j96015m8570q0539j33322r6208j20551k24637j98629j35493
16527C864476j04072j36013j61557j81825j22557q2012p5019j83415j28483N775
16517B695298m2767j14526j19159o0154p8537j87384j51572j63052j40118j12260
16507A525769l4538k1288k3221p5415r1929p0480n7764j31565m6066P441j3320
16496I67624K8839j1733j330k2102m2700K3408m9078k603J6936R8293p382O3234
16484A061406R8522O4970O1952M7214J8308m1980o925K4647q472l4035r5256m8445
16472A141906N698J1746J7152N2849K0258L0495J7775o5382j0553K8523l5745
$$ y = [7107597, 6914458, 6695666, 6505917, 6328749, 6135093, 6031531, 5843042, 5613253, 5384952, 5098440, 4902425, 4853855, 4773316, 4639994, 4543786, 4423235, 4198598, 3999969, 3864476, 3760404, 3624391, 3462834, 3281009, 3158452, 3076440, 3001421, 2818006, 2689523, 2695298, 2652531, 2538005, 2418846, 2358692, 2280155, 2092771, 1941199, 1778147, 1638029, 1525769, 1491231, 1469943, 1446722, 1371307, 1279378, 1208898, 1151134, 1019569, 973503, 980944, 967624, 996463, 984730, 983400, 961298, 918598, 942006, 892928, 890325, 907261, 1005554, 998172, 1061406, 1159928, 1224898, 1286850, 1334064, 1352372, 1310392, 1303467, 1328114, 1319642, 1285607, 1190351, 1141906, 1147604, 1159350, 1176502, 1229351, 1249609, 1280104, 1297879, 1232497, 1221944, 1250467, 1214722]
16461A214722q4908l6816n3964r7668J7990K9194j26553o2436l4797m1364L9416
16450G62816J03693m7498j09141J0973J04787M511k9532K9220r5902p6917n9864
16439E97146j09883j61339p6083m0990m2154P3768J53959K6599p0509K0283P0260
16428D41057L1589l5556p4189l4726m553r242j2737O3212M2952l3821q9826K439
16416B86599p1035o051m1653m7015K7589j5548m1576O6464R2216J3576k3597j7989
16404B21980K1938O4039L0536j7168p5187r386m305L4791K561k1163o0461L2743
16392B20918m2795o3159J7197P7521r097j02263L4996J7823l0504l2398l9628
16381D8611K5879K1839L8628J9574q9691K9074L875k8816J9878l3959o8900M7296
$$ y = [1214722, 1129814, 1092998, 1039034, 941366, 959356, 988550, 861997, 799561, 764764, 723400, 762816, 866509, 819011, 709870, 720843, 825630, 830141, 800609, 829829, 733927, 657010, 597146, 487263, 325924, 249841, 208851, 166697, 240465, 394424, 421023, 350514, 370797, 441057, 472646, 437090, 362901, 328175, 323622, 314380, 301643, 364855, 407807, 373986, 284160, 286599, 215564, 209513, 167860, 120845, 148434, 132886, 91310, 157774, 249990, 263566, 239969, 221980, 243918, 307957, 338493, 321325, 246138, 236752, 232447, 267238, 269799, 248636, 188175, 220918, 178123, 114964, 132161, 209682, 200585, 98322, 133318, 151141, 120637, 88239, 48611, 74490, 96329, 134957, 154531, 64840, 93914, 97789, 68973, 88851, 54892, -14008, 33288]
16369C3288K4254M4964j9497p7300l548n0969L6596K7820K6447p4517l2057j1907
16357g6426P632M3890k078l2999K6662j3576q9357l9186p3359m6931R211J5282
16345b71235M510j4476k1540o0744J5330p479r8180R28N9920l847p8286P688n282
16332d72693L3785J03527O1865k2067j1929J2073q894O1228l3060L1857P0425
16321a73883O929n9559q305K2564J6401J3898q1913l3957N6115P5034r056m0759
16309b16491j5761Q412m6114M4784Q3676o0734L5054q29k3477M8072J39495J09973
16297A06060o4917j00564K449L3335k8809p6272L290K9154n7259j4103J9674R1195
16285e6767k6641n2173l1049o0870L5997M4327l3524n34k095j2632L5814o875
$$ y = [33288, 57542, 102506, 83009, 5709, 2161, -48808, -12212, 15608, 42055, -32462, -64519, -76426, -68794, -24904, -26982, -59981, -33319, -46895, -136252, -175438, -248797, -295728, -286517, -271235, -266725, -281201, -302741, -363485, -348155, -355634, -453814, -452886, -392966, -396813, -475099, -467411, -472693, -438908, -335381, -273516, -295583, -307512, -295439, -304333, -243105, -276165, -244308, -173883, -166954, -226513, -234818, -212254, -195853, -181955, -263868, -297825, -241710, -166676, -175732, -216491, -232252, -223840, -269954, -225170, -141494, -202228, -167174, -168003, -191480, -143408, -3913, 106060, 41143, -59421, -56972, -23637, -52446, -128718, -125428, -96274, -153533, -167636, -147962, -56767, -83408, -135581, -166630, -227500, -191503, -147176, -180700, -181234, -183329, -195961, -160147, -167022]
16273a67022Q1388L007m1686l7652n641M4782N9713L4170P4525N082k1417k5339
16261C910K8422k7773n450j1158l0306m068L94N660R957l0979m720J685p3801
16248a38227N1610N4991P0163j890l4829k64m7494l9210m5176N5978Q524J6110
16236d9714p177q5692j4794J06387K9947l0866j187P4625M0127r370m1798l4817
16224b4329K9868j100O234p466m2143q5075k680J7328q546L8361j1349m0961K7402
16211a04456m0914K9888n292l2530j8439K6177R741o669K614J7899N4813m497
16199g1665K2111O741j7852m0819N090L696m547m7027Q2862Q5056n4943k2529
16187e3826M6895o9171K8231L1788j2159j5434k8518M7662N9744K6724m7022k7461
$$ y = [-167022, -85634, -82627, -124313, -161965, -167606, -122824, -63111, -28941, 45584, 50666, 29249, 3910, 32332, 4559, -891, -12049, -42355, -46423, -46029, -40369, -30412, -61391, -66111, -64426, -138227, -86617, -31626, 38537, 36647, 1818, 1554, -45940, -85150, -130326, -74348, -65824, -49714, -56891, -142583, -157377, -50990, -21043, -51909, -53096, 21529, 61656, 52286, 10488, -24329, 5539, 4439, 10673, 3207, -38936, -124011, -126691, -109363, -117909, -79548, -90897, -131858, -104456, -145370, -115482, -120774, -153304, -171743, -145566, -135825, -142494, -139880, -121981, -67168, -71665, -49554, -42813, -60665, -101484, -96394, -92698, -97245, -144272, -61410, 23646, -31297, -53826, -6931, -76102, -47871, -16083, -28242, -43676, -72194, -24532, 35212, 61936, 14914, -12547]
16175a2547L2363J3898m9627J278J659j1877N5710J2639J4070M8249K425k0188
16163H8052p0010j3017L3316J8821p9422j7606J765M4817m7776l8943N474j2267
16151h6796r7791l4095L7524N776K1970P5803j477k2134K3970l0582N3208N8620
16139C996j9793k810k0838K2365m320l4239J4399o9000L0385O2699M7092K7876
16127E7812o221j0897N8787J22224J24471J87099J52200L0975m9976o1909o0658
16116E43907j3478n1291j2996J18108J6420J3354J01017J68109J49043J18657
16106A150850J04505J3444k2249k2575n028K3172L3084L2529m941m86j2938L8200
16094A327567O7366K6928J7736p8102r8548J0502M1533M2451J54160O5212n0n3712
$$ y = [-12547, 19816, 33714, -15913, -14635, -12976, -24853, 30857, 43496, 57566, 105815, 108240, 88052, 18042, 5025, 38341, 57162, -22260, -39866, -38101, 6716, -41060, -80003, -74529, -86796, -184587, -218682, -181158, -175382, -153412, -77609, -79086, -101220, -77250, -107832, -54624, 3996, -15797, -18607, -39445, -17080, -21400, -55639, -41240, -110240, -79855, -17156, 29936, 57812, 51591, 40694, 99481, 221705, 346176, 533275, 685475, 716450, 666474, 604565, 543907, 530429, 479138, 466142, 584250, 600670, 614024, 715041, 883150, 1032193, 1150850, 1255355, 1268799, 1246550, 1223975, 1218947, 1242119, 1275203, 1307732, 1302791, 1302305, 1289367, 1327567, 1394933, 1421861, 1439597, 1361495, 1262947, 1273449, 1314982, 1357433, 1511593, 1576805, 1576755, 1523043]
16082A523043j24958j72933j94670r5596n0840j06853o0125l3089L7862O8942
16072G90783N9180R8440N5402j18000q9572r4106p9057p9374j43317j19102l6429
16061B44848r6750o4261N163j808N4796J7919J007L2091J6963K2104l2243o3920
16049A35909J5044n3767o4480l6234k1323j7360k2568Q7041R8077O6409q8847
16038I7901j1884m612l8324J7552o1959o4265j8901J5340M5283k8728j9006K790
16026f8813l038n3930m3282K4393O0480M6726K9077K804q1747m1393J1577O7349
16014d9797M1708K9764L0537p5164k3727N0599K225m1230k6950K6052j4329j5698
16002f6010M0378j8853m6391k3427M4392O696k6421M9652K6923k9193n1606o718
$$ y = [1523043, 1398085, 1225152, 1030482, 934886, 884046, 777193, 717068, 683979, 721841, 790783, 849963, 948403, 1003805, 885805, 796233, 702127, 623070, 543696, 400379, 281277, 244848, 148098, 83837, 89000, 87192, 141988, 159907, 160914, 193005, 209968, 232072, 199829, 135909, 150953, 97186, 32706, -3528, -24851, -42211, -64779, 22262, 120339, 186748, 97901, 86017, 81405, 43081, 60633, -1326, -65591, -84492, -69152, -23869, -52597, -71603, -68813, -71851, -125781, -169063, -144670, -84190, -37464, -8387, -5583, -87330, -128723, -117146, -49797, -8089, 21675, 52212, -22952, -46679, 3920, 6145, -35085, -62035, -35983, -50312, -66010, -25632, -44485, -90876, -114303, -69911, -63215, -89636, -39984, -13061, -42254, -93860, -100578]
15990a00578j5400k272K3916k9732N0021Q6388l1831l4641K5662K5683m9864o9193
15978a21841n9333l7634o5452J2583n106R1665m2014K021K2028n3670L3296P3343
15966a50114O3550k8122r8863j5435o9492k980Q5267Q1744m934l5170k97K9458
15954a45388J4212K8071l2245N8029P8942K2663o9752r4264R509P5113O3603J01974
15942A10467P9883n2107j84959n4890J3403K5235j6480j6058L3119q2590j16495
15931b61472K1080P2661J01429k2165K4162P5011l2871l7478n1260N4306O6853
15920A0256N5761R670p8945j29540O0636O7398n5429p0685k6050k3583K634l3629
15908b11506l3067j5840P4367O4900J7253o2506r8967K1087O6198P230L1569k6560
$$ y = [-100578, -115978, -118250, -94334, -124066, -74045, 12343, -19488, -54129, -28467, -2784, -52648, -121841, -181174, -218808, -284260, -271677, -276783, -185118, -227132, -225111, -203083, -256753, -223457, -150114, -86564, -114686, -213549, -228984, -298476, -301456, -216189, -134445, -139379, -174549, -174846, -145388, -131176, -103105, -135350, -77321, 1621, 24284, -45468, -139732, -130223, -55110, 8493, 110467, 190350, 138243, -46716, -101606, -88203, -62968, -79448, -95506, -62387, -144977, -261472, -240392, -167731, -66302, -88467, -64305, 10706, -22165, -59643, -110903, -56597, 10256, 66017, 75687, -3258, -132798, -72162, -4764, -60193, -130878, -156928, -180511, -177877, -211506, -244573, -260413, -186046, -121146, -103893, -166399, -265366, -244279, -178081, -170851, -139282, -165842]
15896a65842L854l7848n7594q0850k0502P1064J20595M7938k2298Q3964O0219
15885B700j26169r9751m3820M3200J35678Q2524P118k6447J6646k7927J7910m3838
15873f2176j1168R4656j3827l6904K3023j0437o0233p3420L395N4257j6384l3659
15861a42877p6989p6521N9302O8390j0749K0988K5487J8315J4845j54L6813n3623
15849a16773n6794r5860M4075M3614K6147J6597j9687J1441L1167J9564j8213
15838a14722k6310R1137L1453k5719k7723m6070N207k3309K7759O4877k2263k892
15826f8575M7094o3241k6612o6740m3776L6320R7649R4793k6485p7282K6543n9668
15814a29980q7385k4166R4334M2517l4220n7368j5481J27012J05642k4873n4070
$$ y = [-165842, -161988, -199836, -257430, -338280, -358782, -287718, -167123, -119185, -141483, -57519, 2700, -123469, -223220, -267040, -223840, -88162, -5638, 1480, -24967, -8321, -36248, -18338, -62176, -73344, 21312, 7485, -29419, -6396, -16833, -77066, -150486, -147091, -92834, -109218, -142877, -219866, -296387, -237085, -168695, -179444, -158456, -132969, -114654, -99809, -99963, -63150, -116773, -173567, -269427, -225352, -181738, -155591, -138994, -158681, -147240, -116073, -96509, -114722, -141032, -49895, -18442, -44161, -71884, -117954, -112747, -136056, -108297, -43420, -65683, -68575, -21481, -84722, -111334, -178074, -221850, -185530, -87881, 6912, -19573, -96855, -70312, -129980, -217365, -241531, -147197, -104680, -138900, -196268, -211749, -84737, 20905, -3968, -58038]
15803e8038R271l6684K7461J14963O177n6626k4076j09709q7085K9607j7466n5703
15791b57908L236K4651o9410M6197M0049m3456q1020L9380R7813O2143O3397P0094
15779d834p358L8455k1133j50995p4284K9528n783l0193J7855L8575k7417Q125
15767a89459N5049K4600o123j558M263J6898K506R138J0565m6617k1449L2401
15755a09786m8380q2795P1436O2285m1174l5914N5784M4135m3299O181M8611k8646
15743a01562o440J8031k8054J6187O3641o0478l2951n3616M75j249J8181J9858
15731a47977N8641Q854k1741M3999K9269j5422n1945j3023p7210l4371L3519l4499
15719b21906l0509L9901L90L6880N8965J04320p2454r8004J7630j0797j1656P8276
$$ y = [-58038, -48767, -85451, -57990, 56973, 63150, 6524, -17552, -127261, -214346, -184739, -202205, -257908, -254672, -230021, -299431, -253234, -213185, -256641, -337661, -298281, -200468, -138325, -74928, -4834, -12192, 26263, 5130, -145865, -220149, -190621, -196404, -226597, -208742, -170167, -197584, -189459, -134410, -109810, -115933, -117491, -113228, -96330, -93824, -84686, -74121, -120738, -142187, -109786, -158166, -240961, -169525, -107240, -148414, -184328, -128544, -84409, -127708, -121527, -72916, -101562, -108002, -89971, -118025, -101838, -38197, -98675, -131626, -185242, -184767, -186016, -167835, -147977, -89336, -80482, -102223, -58224, -28955, -44377, -96322, -109345, -186555, -220926, -187407, -221906, -252415, -212514, -212124, -175244, -116279, -11959, -84413, -182417, -164787, -175584, -187240, -108964]
15707a08964J19056O7203n8866m6953j45085j52945k918L4749Q4650N9852N9119
15696i1102J4099n4395o1767n986M8806k8454N7361P9135n0511q6961n8741L4216
15684b04300L7737l7065N7843N1324J9869j3196p7731N5292O7118m5035M348K4570
15672e9226L3658l5806m6397j9979j1180k5472j1231O6374R085j3943k8715Q0087
15660f2745Q7845n7931m9727j3274q7667o500m385J754k2514N2888k7787J8722
15648a71321m3757K992Q7841j8478N720K1956Q893m3804M3105M0087N879k0366
15636h1253l1274M7903q8218p4737M1172P4763J9044o136j0959N8645j7464r2981
15624a61495m1717l940p332q911j03026N3162J52398M0336k8598J4682J02415
$$ y = [-108964, 10092, 77295, 18429, -28524, -173609, -326554, -329472, -294723, -210073, -150221, -91102, -77003, -131398, -193165, -199151, -150345, -178799, -121438, -42303, -92814, -179775, -238516, -204300, -166563, -203628, -145785, -94461, -74592, -87788, -165519, -110227, -43109, -88144, -83796, -59226, -25568, -61374, -107771, -127750, -138930, -164402, -175633, -109259, -100174, -114117, -142832, -62745, 25100, -32831, -82558, -95832, -183499, -189999, -194384, -192630, -215144, -162256, -190043, -171321, -215078, -212086, -124245, -142723, -137003, -115047, -106154, -149958, -106853, -66766, -60887, -81253, -112527, -64624, -152842, -227579, -186407, -111644, -92600, -98736, -109695, -51050, -68514, -161495, -203212, -207152, -214484, -223395, -326421, -273259, -120861, -80525, -109123, -94441, 7974]
15613G974l208o4804k1739p47o1678J0795k8215L6321L0303l2511l8785k7915
15601a94209Q3335Q423K5395K859n280l1918k5151j6533L4380N6480M0539n5059
15589g6739k0755j7257K5472l1984k3737j3506r691R4250N6680p5653q3199K4004
15577a52115Q0904j7576L2963O1211q8442q2528N3599K2263l3489p67L4361J8426
15565g1190j0954M9882l2282o4487r307P2537k0696n1524r24L0361k2824p156
15553a38564M1679Q3408Q481J4894J3843J1431n7603m1885K3687L0830n7329p0966
15541a38094J5264N3577Q716l7817p4655m4802P9281O7094J1537J9936P65J1490
15529b7708n4092l103M021n333q1939l4540J1816K432J8625K0554m9386o3301
$$ y = [7974, 4766, -60038, -81777, -82524, -144202, -133407, -161622, -125301, -94998, -127509, -166294, -194209, -110874, -102451, -77056, -74197, -79477, -111395, -136546, -153079, -118699, -62219, -21680, -76739, -97494, -114751, -89279, -121263, -145000, -158506, -168197, -73947, -17267, -92920, -176119, -152115, -71211, -88787, -55824, 5387, -83055, -165583, -111984, -89721, -123210, -123977, -89616, -71190, -82144, -32262, -64544, -129031, -138338, -65801, -86497, -138021, -138945, -108584, -131408, -138564, -96885, -13477, -4996, 9898, 23741, 35172, -22431, -64316, -40629, -9799, -67128, -138094, -122830, -69253, -60537, -98354, -173009, -217811, -138530, -71436, -59899, -39963, -39198, -27708, -81800, -84903, -80882, -86215, -168154, -202694, -190878, -188446, -169821, -149267, -198653, -261954]
15517b61954J8774p010L1055J01888P6613L1902n5792j8527L7851J3979r9111
15506a30332l1304O41J4582N6359Q2466K2456j6302q2600k0589o041r685p7446
15494a97795K8075O1530K7352J5662K4p3277m7542P1051Q5384Q273k6464J9135
15482b8592M2926J2599q1515J0358M1509L478K0622o1380k8625L3887m0698o0700
15470a36131q349M822k4432K4255M0366L3611n1321J1259L6543r286K8259M2290
15458h114K2382q0873o5672O490l4640O4289K2120j06846j0229K6763r967J198
15446a73099N5382L86M3109M0149n7310p2666N588L6550n127r5483o1850L1627
15434b52744Q1197J8673N2929L2017N695J988k3530L9708N6809o9195q5914K2692
$$ y = [-261954, -243180, -250190, -219135, -117247, -40634, -8732, -64524, -83051, -45200, -31221, -130332, -161636, -160995, -146413, -90054, -7588, 14868, -1434, -84034, -104623, -110664, -120349, -197795, -169720, -108190, -80838, -65176, -65152, -138429, -185971, -114920, -29536, -21263, -47727, -28592, 14334, 26933, -54582, -44224, -2715, 763, 21385, -39995, -68620, -34733, -75431, -136131, -144480, -139658, -164090, -139835, -99469, -65858, -117179, -105920, -69377, -78663, -50404, -8114, 14268, -66605, -132277, -125787, -160427, -96138, -74018, -180864, -191093, -164330, -174297, -173099, -117717, -117331, -74222, -34073, -91383, -164049, -158461, -121911, -127038, -222521, -284371, -252744, -171547, -152874, -99945, -67928, -62233, -60245, -83775, -44067, 12742, -56453, -142367, -119675]
15422a19675N3045R674p7143l2660Q1056l562l2205k7419K2716L6738p8576m2398
15410b10409M7014N2804J0783k8089L5801M436o852L1741o702J4634m6652J8386
15398h3105q3762M6543J3916l3771n6476o9732K3306M7551O792p966J5032j6308
15386a97980K6353M5024n6731O8163J2409k5857K283j9263J8952R591J0035l9250
15374a46271Q625L8832M5545M443J570J6911l6515L3321K7317o295J6105P4781
15362G8369k2879p4138l4958m9263k5414L0464J0178k3606q0968j6225J2041L5680
15350a60719J2650L5525M7064M2902J9711k3539Q5476o683m0527l3826J0064p057
15338a8959j1044l128M8956k2932L0724p0877J79O1948K9429L4606p9313k0808
$$ y = [-119675, -66630, -56956, -134099, -166759, -85703, -89265, -121470, -148889, -126173, -89435, -168011, -210409, -163395, -110591, -99808, -127897, -92096, -87660, -94512, -62771, -69473, -54839, -101491, -83105, -166867, -120324, -106408, -140179, -196655, -266387, -243081, -195530, -188738, -196704, -181672, -197980, -171627, -126603, -183334, -115171, -102762, -128619, -126336, -145599, -126647, -117056, -107021, -146271, -137646, -98814, -53269, -48826, -47256, -30345, -66860, -33539, -6222, -12517, 3588, 78369, 55490, -18648, -53606, -102869, -128283, -97819, -87641, -111247, -192215, -208440, -196399, -160719, -148069, -112544, -65480, -22578, -2867, -26406, 59070, 52387, 11860, -21966, -11902, -18959, -30003, -33131, 15825, -7107, 23617, -47260, -47081, 14867, 44296, 78902, -411, -21219]
15326b1219M1179j9847J7789K8971k9407K2628j4848n4743j39607l6137M8036
15315a57205P2646l6271P8755M4068r4170K6296L7308k2713m4373o5918N1164
15304a10413N0115N749L1684q4281m0249R310O870j8832L7267K2668n9834j9388
15292a69334J2025Q2002J31760M047K1943n3691l9635K0386O9761k6169m2485
15281A0610J5717J3180Q46o9119k5056r012J9465L8933O320J142m9737K0244l739
15268c0206Q236P142j3431m053l6219j1797K0063L0711j6771M0869L6230k1726
15256I048Q251j10469j8516K4962P4527Q60m0330p5337o3399J4113l6181J8421
15244a94050J4537j5068L4270k20l9113K9995J5761l1364N8729O2870K6191L202
$$ y = [-21219, 19960, 113, 17902, 46873, 17466, 40094, 25246, -29497, -169104, -205241, -157205, -84559, -120830, -42075, 1993, -92177, -65881, -28573, -51286, -95659, -161577, -110413, -60298, -54549, -22865, -107146, -147395, -138085, -131215, -150047, -112780, -90112, -149946, -169334, -157309, -75307, 56453, 60500, 82443, 28752, -10883, 9503, 79264, 53095, 10610, 26327, 39507, 40353, -28766, -53822, -62834, -43369, -4436, 1884, 3026, -46711, -26467, -30206, -21970, -14828, -28259, -32312, -68531, -80328, -60265, -29554, -46325, -5456, 30774, 9048, 17299, -93170, -111686, -86724, -12197, -11337, -51667, -127004, -190403, -176290, -212471, -194050, -179513, -194581, -160311, -160531, -199644, -169649, -153888, -185252, -126523, -63653, -37462, -34260]
15232c4260q126j35477n4244P5757M7086R0642p2052o7754N9706M2707m5887m6920
15220a48822O5207N787p5517J2033M0229Q956L0889m2464l1234L1575p164M919
15208a05606N1300P7737k8155l1711q2357q80M2509J26580R5058o899o2958q4157
15196i539p5993l7312l6007l529M9944l9294R179O7789q800N0818l673p6038m1583
15183a54038K8514O106O737J4291j2231O07L5084j6773L0618K1811p5889m9136
15171a64299p4393Q157J32831J35076M4806p2322j02748R7572P0278P619o9654
15160A2923o8359k7065q4782q96O7829O573M6513M0947k4670o2781n7227p3000
15148b23995k3044l7722P3513J36960K9398k0086p4108r165k4185j4688N6J18547
$$ y = [-34260, -42386, -177863, -232107, -156350, -109264, -18622, -90674, -158428, -98722, -56015, -101902, -148822, -83615, -77828, -153345, -141312, -101083, -92127, -61238, -103702, -134936, -103361, -110525, -105606, -54306, 23431, -4724, -36435, -118792, -119672, -77163, 49417, 144475, 137576, 74618, -9539, -85532, -122844, -158851, -162380, -112436, -151730, -142551, -74762, -83562, -32744, -36417, -112455, -154038, -125524, -119418, -112681, -98390, -110621, -110014, -74930, -91703, -61085, -39274, -115163, -164299, -238692, -230535, -97704, 37372, 82178, 9856, -92892, 4680, 74958, 82577, 12923, -55436, -82501, -167283, -168179, -100350, -93777, -47264, -6317, -30987, -93768, -150995, -223995, -247039, -284761, -211248, -74288, -44890, -64976, -139084, -148249, -172434, -187122, -187066, -68519]
15136f8519R851j2622m3903K8195P4702L3644j4269o7031q4075K8879L3089j0241
15124i2300O9145k9479o9559J7576k093M8681M6125j2310q647L4950O1116q4836
15112b1631l7l2329L0703O896n702p495r210o310K1581L7871k4791J3329j6452
15099a3577k4342q1769m8403K1463L7488L6652J8465j1795j1795R362j5497J09268
15087B5520P8167q7633l0971o4051p668K281P3292l0445j03126n8119m229M3540
15075a63442L6400l8697j9155k892O3749P6192o1011L4232J110n1455l6654O6333
15063i5290l1124m1243M1700L9987m7379q337j2617k8204M5373m849K069k3635
15051a63549K6146J08407q394r22K481l4753Q380N7848N0871l2573l9808k6568
$$ y = [-68519, -58668, -71290, -115193, -86998, -12296, 21348, 7079, -59952, -144027, -115148, -82059, -92300, -23155, -52634, -122193, -104617, -106710, -58029, -11904, -24214, -32861, 2089, 63205, -21631, -21668, -53997, -23294, -16398, -22100, -29595, -38805, -45115, -23534, 14337, -10454, 2875, -13577, -37919, -119688, -168091, -146628, -109140, -72488, -54023, -65818, -77613, -68251, -83748, 25520, 103687, 16054, -14917, -78968, -86636, -84355, -11063, -41508, -144634, -202753, -206982, -163442, -127042, -165739, -184894, -187786, -124037, -47845, -108856, -74624, -73514, -124969, -161623, -95290, -126414, -167657, -125957, -85970, -133349, -141686, -154303, -182507, -137134, -141983, -139914, -163549, -137403, -28996, -37390, -38312, -35831, -70584, -62204, -4356, 46515, 13942, -25866, -52434]
15039e2434l9459M0128K0672P1770K3766l9444j6735o8004j15732K6816O5725
15028h2931L2118R122m0068J8017L0842J5683r581K346j8051K851j9399j9286
15016g8337k8409j7276L7703m927k5513K191L4595K4653K5783M8322R1172J2895
15004A22852N5107N6273l9533n6941l1648J2891p3871k2903n6369k9287J5594
14993d7835N288J1215j0936R407j4502p5731J4223l1762m3266R3515M9787j8414
14981e9011j2318K5365m2633l2652P031L4721m0227m4147P3504P7769J5489j8312
14969a5421o797q4872J0246J090n0354p3P414R2434R5399J6015l4770J8647K6258
14956G5216M6524j7020q1186j2372l8964l1625o634L6075n9121k6253K1473m7680
$$ y = [-52434, -91893, -51765, -31093, 40677, 64443, 24999, 8264, -59740, -175472, -148656, -82931, -50813, -41691, -81759, -63742, -32900, -17217, -26798, -24452, -42503, -39652, -59051, -78337, -106746, -124022, -86319, -91246, -116759, -114568, -79973, -55320, -29537, 18785, 109957, 122852, 177959, 234232, 194699, 137758, 106110, 119001, 45130, 22227, -34142, -63429, -47835, -42547, -31332, -42268, -32861, -47363, -123094, -108871, -140633, -183899, -90384, -40597, -59011, -71329, -45964, -88597, -121249, -114218, -79497, -119724, -163871, -90367, -12598, 2891, -15421, -22218, -107090, -96844, -95754, -146108, -146181, -138767, -46333, 49066, 65081, 30311, 48958, 75216, 121740, 104720, 23534, 11162, -27802, -59427, -66061, -29986, -89107, -115360, -93887, -141567]
14944a41567r781Q362j7792M9319k6778L361N5297k7833K4287J10L91j6583k5681
14931a24888P0612K0476o5238j249N7933J8476o9745l8379j8673k9455n8465K6650
14919b11945P1947k4102R9775L1228j0976o6138k077L7422j3890k5455J01058
14908a3153J6190L0138l0415l7264j00128o3616K4572k710L2864K6357M7510K6118
14896d3537k4211L911l6463l2075K0572p637M8622M6114m9210j03496P7212J21912
14884B1714J1652k2781J8298J7236m6126L2556M8415l1219m6149j5896l5322j4429
14872f2051k6075J2913l476L2745N8058j72r6387q4973J5224J25691P2852j7783
14860B6566j00700l7048P076o20k0815j059J7439J7657K2431L9429K4457l9775
$$ y = [-141567, -151348, -142986, -160778, -111459, -138237, -134876, -79579, -107412, -83125, -83015, -82624, -99207, -124888, -54276, -33800, -99038, -100287, -42354, -23878, -93623, -132002, -150675, -180130, -238595, -211945, -139998, -164100, -64325, -33097, -44073, -110211, -112288, -74866, -88756, -114211, -13153, 3037, 33175, 2760, -34504, -134632, -198248, -173676, -176386, -143522, -117165, -69655, -43537, -67748, -63837, -100300, -132375, -111803, -119440, -70818, -24704, -73914, -177410, -100198, 21714, 33366, 10585, 28883, 46119, -7, 32549, 80964, 49745, 3596, -12300, -47622, -62051, -88126, -75213, -78689, -45944, 12114, 11942, -84445, -169418, -154194, -28503, 44349, 26566, -74134, -111182, -104106, -104726, -125541, -126600, -109161, -91504, -69073, -29644, -5187, -44962]
14848d4962J4485J9919r8904O500L4167P2713q612p6504j7109J1293j456l0821
14836a19291rN9993j3618l3221j1796P4407J35084M6696K7187r9097r7490l9681
14824g0836l5547L8919M7263k5532J3668n7972l2145k2260N9803K3439K0469M4277
14812C546n7163p9164o0795R2179L5294K6707O3013j6920p3537p3721k8710K5422
14800a43849J09123O9824k5213q7018n4228Q028P7744K6355K997n176p6694r8552
14788a96659L8937L2602J05916J40575k7168J90l7766l0611j02624j16233K6695
14777a66146O0712M761m5167J7677P5905n2074j11527p59J39387J14224l2581
14766D412k3900l2930m4179J1567P2089N2175N3428k6707K9706M870n1240r5102
$$ y = [-44962, -30477, -10558, -109462, -102962, -68795, 3918, -4694, -81198, -98307, -87014, -88470, -119291, -119300, -59307, -72925, -106146, -117942, -43535, 91549, 138245, 165432, 66335, -31155, -70836, -106383, -67464, -20201, -45733, -32065, -90037, -122182, -144442, -84639, -61200, -40731, 3546, -53617, -132781, -193576, -101397, -66103, -39396, 23617, 6697, -66840, -140561, -169271, -143849, -34726, 35098, 9885, -77133, -131361, -123333, -45589, -19234, -16237, -21413, -98107, -196659, -157722, -125120, -19204, 121371, 94203, 94393, 56627, 26016, -76608, -192841, -166146, -105434, -100673, -145840, -128163, -52258, -104332, -215859, -216618, -77231, 36993, 4412, -19488, -52418, -96597, -85030, -12941, 39234, 92662, 65955, 95661, 100531, 49291, -45811]
14754d5811O50L9131Q3323K2382k3199p2773M1533r859j11765o0676K7533K0090
14742h9441J8204j8766m6826J491K7421M7724n5601O8928L2510J993M5542m7502
14730a4323l6746L230m1626m832O6247O8275K1737l4725k2051q623o4473m837
14718g2747K4030j1096l1513M9053M1738m3314p290J774j0251r163m0386M095
14706a05070L1056Q5324O4594O7679m4042l9647K6142J7692l5449M095J1846j0493
14694G3727j3559m697L0576O187j2378p2698K7574M2244j4873m6328r0599L9671
14682c5153M2204J4977K970M0234j0334n9234k4945O2600M5542q2868m7843p266
14670e9116N0966k0893k7757m0290K535K9451J3326l3k0181j2734K8196J3182
$$ y = [-45811, -45161, -6030, 77293, 99675, 76476, 3703, 45236, 35377, -76388, -137064, -109531, -89441, -71237, -90003, -136829, -135338, -107917, -60193, -115794, -46866, -14356, -12363, 33179, -14323, -51069, -47839, -89465, -94297, -28050, 40225, 61962, 27237, 5186, -3437, -67910, -72747, -48717, -59813, -91326, -42273, -535, -43849, -51139, -49365, -59616, -68779, -109165, -105070, -74014, 11310, 75904, 143583, 99541, 59894, 86036, 103728, 68279, 72374, 84220, 73727, 60168, 55471, 86047, 92234, 79856, 7158, 34732, 76976, 62103, 15775, -74824, -35153, 7051, 22028, 24998, 65232, 54898, -4336, -29281, 33319, 78861, -4007, -51850, -59116, -8150, -29043, -56800, -97090, -94555, -65104, -51778, -51811, -71992, -84726, -56530, -43348]
14658d3348o1889P531O1505J7546j0957j0833k7600K5598O5212m0560j1506J12320
14646H3019N1434O1689J0638p2492j16353k6173L0064l469q41j0022K4574J3198
14634D5266l3566J3598K3503m6043r2364n4056N6483R772m8111j2524M6302P2256
14622a9484k7758p5049K312P8713L5846N1425q8961j9787j2095j1157P0887O1476
14610D6368l2623j09835o200J3277P4703O7150k7290J9003M9746P2561n928q6448
14598G4484r8608p5213J6259P6115j1401M0613K8887L4717M1727J1937m699k7498
14586A07320k9120p8732J160j4518m9463L143J32061l35n8473j9337J8771n4392
14574d1915j3445j431M6176o5855p2121p4638J5310Q3254J76596J06614p9132
$$ y = [-43348, -105237, -97706, -36201, -18655, -29612, -40445, -68045, -42447, 22765, -17795, -29301, 83019, 134453, 196142, 206780, 134288, 17935, -8238, 21826, 18357, 17516, 7494, 32068, 45266, 11700, 25298, 48801, 2758, -89606, -143662, -87179, -77407, -125518, -138042, -91740, -19484, -47242, -122291, -119979, -41266, -5420, 46005, -42956, -62743, -74838, -85995, -15108, 46368, 13745, -96090, -102290, -89013, -14310, 52840, 25550, 44553, 94299, 166860, 160932, 74484, -24124, -99337, -83078, -6963, -18364, 22249, 51136, 85853, 127580, 139517, 134818, 107320, 78200, -532, 628, -13890, -63353, -60210, 71851, 71516, 13043, -6294, 12477, -41915, -55360, -56791, -10615, -76470, -148591, -223229, -207919, -124665, 51931, 158545, 79413]
14563G9413j17002J2175j2264m6349K952J3458J7471q434J3494J6657M3515l6455
14551b1369q4936j4538P4412L9323J9917j09317o2245K4842L5443N2114P820m7760
14539h6294l0628O6720J9405J212l4593K3362p4307k2198L4914K707N547j4875
14527a09028m996L4800M3075J8546L9319m944k915n9981k9990J8801J16213k43
14515E8657o0350J2125Q0739N2347K118m5714j23433q8507k0872J5351R3328j4769
14503c8980j155q183J5391M6592M2149K5103n8972p9261J2105O3563J8791J3339
14491E0482n0716j0278N9026L2757j1304m2474m3488M2852J8934n3686r968n0877
14479f8740n5991m7814K8742M7481m8028R1791O3969k8985o5327M4968K9943K0224
$$ y = [79413, -37589, -25414, -37678, -84027, -81075, -67617, -50146, -58580, -45086, -28429, 15086, -21369, -106305, -120843, -46431, -7108, 12809, -96508, -158753, -133911, -98468, -46354, -38534, -86294, -116922, -50202, -30797, -29585, -64178, -40816, -115123, -137321, -102407, -99700, -94153, -109028, -114024, -79224, -36149, -17603, 21716, 16772, 13857, -46124, -76114, -57313, 58900, 58657, -1693, 10432, 91171, 143518, 145636, 99922, -23511, -112018, -132890, -117539, -24211, -38980, -40135, -48318, -32927, 13665, 55814, 80917, 21945, -57316, -45211, 18352, 37143, 50482, -234, -10512, 48514, 81271, 69967, 27493, -15995, 26857, 45791, -7895, -17863, -68740, -124731, -172545, -143803, -96322, -144350, -52559, 11410, -17575, -82902, -37934, -7991, 12233]
14467A2233M7347k6438m0905j13334n6146R3463N0046j0703m8715J2223O0055
14456b0874k7453K0226l6928l8873O9607N6436j0703M2352J2560N284k2291n7367
14444h024m2884n3483L9287M5227O5636K8198k8469o2839L39k8947j540Q1336
14432C3837J5939k6202r09L4323j3799m154N5350l1883n8030j1524L7622j1661
14420A8909p1782k0933M0425j03555m2563M466N5722k2603R5205J03592m9754
14409G129L1664R6351m5651p434J2365p834K4330L4524o8091q4871k1428K214
14397b6732J0124m7145k3450m9978l3069J13728M0052j7986m806J7871K5561q052
14385c882L176K2046n7784m9496q297M1094M1835j0015l089n9339j6839Q2352
$$ y = [12233, 59580, 33142, -7763, -121097, -177243, -83780, -33734, -44437, -93152, -80929, -20874, -48327, -28101, -65029, -103902, -34295, 22141, 11438, 53790, 66350, 71634, 49343, -8024, -50908, -104391, -65104, -19877, 45759, 73957, 45488, -17351, -17012, -45959, -47499, 33837, 49776, 23574, 22665, 56988, 43189, 39035, 94385, 62502, 4472, -7052, 30570, 18909, -52873, -73806, -33381, -136936, -179499, -175033, -119311, -141914, -46709, 56883, 7129, 38793, 135144, 89493, 82059, 94424, 86590, 110920, 145444, 77353, -7518, -28946, -26732, -16608, -63753, -87203, -137181, -170250, -56522, -16470, -34456, -39262, -21391, 4170, -3882, -706, 21340, -36444, -85940, -94237, -53143, -11308, -21323, -24412, -83751, -100590, -18238]
14373a8238R070M0739L6718M369O587m3328q8333p280M3089Q4415O9866Q1836
14361B19510k015n9881m1310p0122k9053j8314l9245R746O2677R0193j0547n1559
14349F0080o7566K8496L6671K66O0966J0641n7532q931K0920J16841r2774j18257
14337a0179j06540M9864M4728l1243K0050K4765O3645K8132l4384l3859L1390
14326D6369o18l674m9589J8772L3130n5082l5826K4240L4508j5113M4696K7645
14314F9458l5352R054L9330n9835q1620L002M0519m2729K725M074j6835j3911
14302h2120L9008j2726L549M0804P0377l5855j06580k3172M2507M4689j3264L8051
14290E268j7231l5574N057l4553l0236Q0453Q0822K5378J4322n6050k9075R000
$$ y = [-18238, -9168, 31571, 68289, 72658, 79245, 35917, -52416, -59696, -16607, 67808, 137674, 219510, 217495, 157614, 116304, 46182, 17129, -1185, -40430, -30684, 31993, 122186, 111639, 60080, -7486, 21010, 57681, 57947, 118913, 129554, 72022, 63091, 84011, 200852, 108078, -10179, -116719, -66855, -22127, -53370, -33320, -8555, 55090, 83222, 48838, 14979, 46369, 45751, 42077, -7512, 11260, 44390, -10692, -46518, -22278, 12230, -2883, 41813, 69458, 34106, 43160, 82490, 22655, -58965, -55963, -15444, -58173, -55448, -51374, -68209, -82120, -43112, -55838, -52289, -11485, 58892, 23037, -83543, -106715, -64208, -19519, -32783, 5268, -11963, -47537, -42480, -77033, -107269, -26816, 54006, 79384, 93706, 37656, 8581, 17581]
14278A7581L9395L7312k6215l7224p302J3705N9220m0829p2159k5276N837M2748
14266F793L6674J6027j0053j8439k9708m2340j186J2119M0291P5895o8543M5597
14254F3127k7O850K1420l7456o5096l9913R364j0007J16112P4398K8296N4631
14242B21699J2315O942J1024m1540l043m4998j1291k6845k7376q272M214j6363
14230G6466L031l9877M0100Q9468N7115O849m1292m4717o3071n6515N4173m0182
14218D1548r0655P4707J7510O705J8008k5336l1839j6649K1121q655m9362R045
14206c3852O5304r1828m9286m8007L7440J09239R524O5877L811l9574m2063j4823
14194b8238n987M7947J9953o1052k4205N7686L3425R59l133Q996J2786l4880q8336
$$ y = [17581, 56976, 94288, 68073, 30849, 23547, 37252, 96472, 55643, -16516, -41792, -35955, 6793, 43467, 59494, 49441, 31002, 1294, -41046, -42232, -30113, 10178, 86073, 17530, 63127, 63100, 69950, 91370, 53914, -11182, -51095, -41731, -51738, 64374, 138772, 167068, 221699, 234014, 240956, 251980, 210440, 207397, 162399, 151108, 124263, 96887, 88615, 92829, 76466, 79497, 39620, 79720, 169188, 226303, 233152, 191860, 147143, 84072, 27557, 81730, 41548, -49107, 25600, 43110, 49815, 67823, 42487, 10648, -6001, 15120, 6465, -42897, -33852, 31452, -60376, -109662, -157669, -120229, -10990, -1466, 64411, 68222, 28648, -13415, -28238, -34225, 13722, 33675, -27377, -51582, 6104, 39529, 40488, 37355, 46351, 59137, 24257, -64079]
14181f4079j379K4664m154J5388Q0255M8645m4303K2124j4566j5757n194N4471
14169I6115O2244o6274r9303N1999K4589o898j2557m0945m5672K157K1451J2191
14157i03j0249M5546j3227n6170k0898J06278j7867o0480j500J5881J9170k6022
14145b0441L2306J5272l8257L8201K2375L5191l3432J7147L1684K4589l9121j9160
14133F6354j6402j1348l943p208j1229J7622Q550J5468M9016K5419j3901m802
14121A13596j165J3008r4669r4466N81Q6275M5049o2125N1617M1975K9055j1578
14109A17153m0094l3432K3503n9606l9273M3228m2861R013j7373L5033M4701k3150
14097A6842m3231K0550M7542K9092N8779n5604m4114m2710l1279k8067m440j7309
$$ y = [-64079, -65458, -40794, -44948, -29560, 50695, 99340, 55037, 77161, 62595, 46838, 41644, 96115, 158359, 92085, -7218, 44781, 69370, 62472, 49915, 8970, -36702, -34545, -13094, -903, -11152, 34394, 21167, -35003, -55901, 50377, 32510, -27970, -29470, -13589, 5581, -20441, 11865, 27137, -11120, 27081, 49456, 84647, 51215, 68362, 100046, 124635, 85514, 66354, 49952, 38604, 34661, 27453, 16224, 33846, 42396, 57864, 106880, 132299, 118398, 113596, 112431, 125439, 30770, -63696, -63115, 23160, 68209, 6084, 57701, 99676, 128731, 117153, 77059, 43627, 67130, 7524, -31749, 11479, -31382, -22369, -39742, -4709, 39992, 16842, -26389, -5839, 41703, 70795, 129574, 73970, 29856, -12854, -44133, -72200, -76640, -93949]
14085i3949k6896o5087P8788J03164o774k9986O0300L8252o7257o6012l189J6669
14073f1977K114L1029L5728Q4854N0089r332o4165j9043L8837K8156p861L4165
14061A42594L1631N0638j6021j21535q7959n3617Q13Q6496J4561M1883R149j8035
14049H0598n7517M8340J11950l7650m2255M4090J5259q3217o387K0646l4003m998
14037E4856Q536k2265k5615Q162K4095L4281N0942q3571m4180L8222l35J9953
14025F3081Q775L2214N1382K016q5947O320l6116p723l3636j9772M1664m8384
14013b6126l5063j4645J651L1054P5599K918p2852Q007K1786m9902R244L8107
14001a0222N6167R665j952J9496j6965O923p857J5608p94M1700j4277j4873l7711
$$ y = [-93949, -120845, -185932, -107144, -3980, -10754, -40740, 19560, 57812, -9445, -75457, -78646, -61977, -59863, -28834, 6894, 91748, 141837, 132505, 68340, 49297, 88134, 116290, 108429, 142594, 174225, 224863, 208842, 87307, -652, -54269, -53456, 33040, 47601, 89484, 98633, 80598, 23081, 71421, 183371, 145721, 103466, 147556, 162815, 79598, 73211, 93857, 59854, 54856, 63392, 41127, 15512, 23674, 47769, 82050, 132992, 49421, 5241, 43463, 43128, 63081, 71856, 104070, 155452, 157468, 71521, 77841, 41725, 34002, 366, -19406, 22258, -26126, -61189, -75834, -74183, -43129, 32470, 35388, -37464, -29457, -7671, -57573, -48329, -10222, 45945, 55610, 53658, 73154, 56189, 63112, 55255, 70863, 70069, 111769, 97492, 82619, 44908]
13988D4908j2137J9230N3786l5617k8412l5887O289L2513M81o4909r50K4335N171
13975H801L5504l3100L6175q4091J1944J04614J1683j10994m7358N706J0038o0236
13963a11314K4974J27704M6009M0109p9533R269j8248p8478o4918N1306J06900
13952E3780J610M333M204K0658K5503n3127l0580O0582N0336J8739m3698k6196
13940H6144j5616J7403L04M1851q085j5068N615J8894p1404l854k2078J5706k5054
13927B4758O4297M4836K9598m0568k7503r910J2787K4593J5335J9827j1703R690
13915A56037o026J6096O833r3951n8573m1663J2076M2641P0602p992k6128m4141
13903B5811R642l099J0526m484L9716J879p7108k8499j0366L7791m951K4371N1589
$$ y = [44908, 32771, 52001, 105787, 70170, 41758, 5871, 12160, 44673, 45154, -19755, -20705, 3630, 8801, 44305, 11205, 47380, -36711, -24767, 79847, 91530, -19464, -66822, -61116, -51078, -111314, -86340, 41364, 87373, 127482, 47949, 57218, 38970, -39508, -104426, -53120, 53780, 55390, 59723, 63927, 84585, 110088, 56961, 26381, 86963, 137299, 156038, 112340, 86144, 70528, 87931, 88235, 130086, 122001, 106933, 112548, 131442, 60038, 56184, 34106, 49812, 24758, 89055, 133891, 163489, 122921, 95418, 85508, 98295, 122888, 138223, 158050, 146347, 156037, 150011, 166107, 172940, 78989, 20416, -21247, -9171, 33470, 104072, 96080, 69952, 25811, 35453, 32354, 42880, 38396, 78112, 79991, 2883, -25616, -35982, 1809, -3142, 21229, 72818]
13890G2818Q550j1981j6181J670l5531J895N7921N2085m4929l4929R790l1166
13878C0012n4766J00476L4696m131p0539Q271m7280L9104K9832K0749p461k449
13866G6514l7038J6452l5530K3598M6628R9556J05525J715q6302n8971L242l2303
13854A23086J5950r462r3391p4911L6535l4285M2778L1869J6403J1983k2213l000
13842D1342j8523l0311J10393N3489M5614N113J3433R076j09619j4030m558p3826
13830B7593M744N5586J8446O6694k403j54721m4972M6891J3315M599L2450m0856
13818B7366m6598K7126J2250n7212k1032N6966L7667q40L1758m3434Q092k3941
13806H168M7833J02517J636L8343n815q6597j26M3071l82j3306l8775o5267N106
$$ y = [72818, 81368, 69387, 53206, 54876, 19345, 21240, 79161, 131246, 86317, 51388, 61178, 30012, -24754, 75722, 110418, 106287, 35748, 44019, -3261, 35843, 65675, 86424, 78963, 76514, 39476, 55928, 20398, 43996, 90624, 190180, 295705, 297420, 211118, 152147, 155389, 123086, 139036, 129574, 36183, -38728, -2193, -36478, 6300, 38169, 54572, 66555, 44342, 41342, 22819, -7492, 102901, 156390, 202004, 207117, 220550, 229626, 120007, 105977, 101419, 27593, 32337, 87923, 106369, 173063, 170660, 15939, -29033, 17858, 31173, 35772, 68222, 27366, -19232, 7894, 20144, -37068, -58100, -1134, 36533, 35693, 67451, 24017, 32109, 8168, 56001, 158518, 160154, 198497, 192682, 106085, 105959, 149030, 148648, 135342, 96567, 31300, 36406]
13793C6406M9929q459k5752n574K1998M027M1424p3033J5405O1186J0689R443
13781A37689M8739K3503j9025M596q0498j10692k8827j2149K971K411J19087K4522
13769A12327j0203J731n2044k5226P1673q197P0052M6898o9018l6502J1112l0204
13757H2399k0552J01691P4531m0661n903n6497l6248r0274P1499J0252J8836k8466
13745H0607J0070M8117k510j8989J8407O2235L037r1658q1669r065K2329K5957
13733F6868K5231r9392q280k1097O2503O5896j7214k2517K3944N1399o2490k9847
13721C5004K1217q7062n8890N9714R1426M3126J0603r379O3972j0074r3631p8740
13709a2714R767P2018j5404o1538O029N7914M567k1492l8393K9146k3042K5630
$$ y = [36406, 86335, 77876, 52124, 46550, 68548, 72575, 113999, 40966, 56371, 117557, 128246, 137689, 186428, 209931, 190906, 195502, 115004, 4312, -24515, -36664, -33693, -31282, 87805, 112327, 102124, 103855, 51811, 26585, 98258, 90061, 160113, 207011, 137993, 101491, 112603, 82399, 61847, 163538, 238069, 197408, 191505, 135008, 98760, 8486, 79985, 90237, 109073, 80607, 90677, 138794, 136284, 117295, 135702, 197937, 200974, 109316, 27647, 18582, 40911, 66868, 92099, -7293, -15573, -36670, 25833, 91729, 74515, 51998, 75942, 127341, 64851, 35004, 56221, -30841, -89731, -30017, 61409, 104535, 115138, 105759, 169731, 159657, 66026, -12714, -2947, 69071, 53667, -7871, -1842, 56072, 60639, 39147, 754, 29900, 6858, 32488]
13697C2488N907L0692k3577K548k0594j7355j1176j0203P2539m4802j38115O7203
13685e4445k5289k338M9265J1639k4962N8010k3572k5335M166K6168L001m5713
13673d9405J9945p7790Q5766R1259p524j0229N3537K8079J672j14688m618O1233
13661G7237j2509M0901p004J9494j8969J8516M7745J7062k8468p2512r3011L4874
13649B3356K5072l1407j8965L2178M4124o8284N9564N4078n276l4037p6643j611
13637B149J31756O5305o3787K3404J6177p4362n3067Q044j1387M7873J3903j8827
13625H7181L1563J6969j2726L164l4741k5447Q404M1901j2556M6673j35n0574
13613I9676n4177k1356J4310j671r662L8248n8422l4834n7828K2370M9101J01507
$$ y = [32488, 38395, 69087, 45510, 48058, 27464, 10109, -1067, -11270, 61269, 16467, -121648, -54445, -79734, -82072, -32807, -21168, -46130, 11880, -11692, -37027, -32861, -6693, -3692, -49405, -29460, -107250, -21484, 69775, 62251, 52022, 105559, 133638, 135310, 20622, 16004, 77237, 64728, 105629, 98625, 118119, 99150, 117666, 165411, 182473, 154005, 81493, -11518, 23356, 48428, 17021, -1944, 30234, 74358, 6074, 65638, 119716, 114440, 80403, 3760, 2149, 133905, 199210, 135423, 158827, 175004, 100642, 47575, 55619, 44232, 92105, 106008, 87181, 118744, 135713, 122987, 126151, 91410, 65963, 74367, 116268, 103712, 150385, 150250, 99676, 45499, 24143, 38453, 36782, 27120, 65368, 6946, -27888, -85716, -63346, -14245, 87262]
13601H7262L4970J2385L2527M1474l3540r7006r3356P9286O1983J0245k7751j02551
13589E928m4790M6681P8213m3350L5545O0935J1429j0555n374J02218m0697m9518
13577A46665J3702k5206m1583j1347n8068Q1554M3039k2522j0525K0238j1440
13566A24507J6293K7437o726n1258j9446N8825N8522P0358q424r2716m5227k3161
13554A08984N651n190p0542N5471M4994n2787m2772m688N2033M3502J3091j01028
13542D6719j5682o4901J233L5236J8798N5549Q2550M1473R141m5476J0603K2179
13530A97422k8464P883j3556K0178p0628k8194m4291K8922n080O51k2207j4506
13518B8130P8465N6105K8260k1258q0128l8733L4858k212o0046l4534O4564L0863
$$ y = [87262, 122232, 134617, 167144, 208618, 175078, 78072, -15284, 64002, 125985, 136230, 108479, 5928, -38862, 7819, 86032, 42682, 78227, 139162, 150591, 140036, 134662, 236880, 196183, 146665, 160367, 135161, 93578, 82231, 24163, 105717, 148756, 126234, 115709, 135947, 124507, 140800, 168237, 161511, 110253, 90807, 149632, 208154, 278512, 270088, 177372, 132145, 108984, 114635, 109445, 38903, 94374, 139368, 86581, 43809, 39121, 91154, 134656, 147747, 46719, 31037, -33864, -32631, 2605, 21403, 76952, 159502, 200975, 210116, 164640, 175243, 197422, 168958, 176841, 163285, 183463, 112835, 84641, 40350, 69272, 64192, 64843, 42636, 28130, 106595, 162700, 190960, 169702, 89574, 50841, 85699, 83487, 23441, -11093, 53471, 84334]
13506H4334M6o3867l3502m52K6938n2750O0335J03262j4834n2820P84j0876K3018
13493F9616m4293J5945N8150k5294j40236R22N3271J67097J07352m4073p7832
13482A40625m3253k3229O9342n6867O326M9426k2594m3913L7806o511r3991j5721
13470b554n1302M8872J18504P8191Q399n5642o4985J400N466k0067l5544j4698
13458A6040L8150R5584M2522l6840n0913M1836O3061J0992r4427M9331L3707l3638
13446A75405l5304n159n1727J3917O7281J2951p4037K6251N5457k2687l7658N7384
13434A82074k6881o6157O993R4975k791l7635K2427J0175q0069l3679N5057N1144
13422A75633O1361k7525m8842K2357m6898K5925q0933n4627o7299Q3008R3173
$$ y = [84334, 84380, 20513, -12989, -13441, 13497, -39253, 21082, 124344, 109510, 56690, 57474, 46598, 69616, 25323, 41268, 99418, 74124, -66112, -65190, -11919, 155178, 262530, 218457, 140625, 97372, 74143, 143485, 86618, 92944, 142370, 119776, 75863, 113669, 107158, 13167, -2554, -53856, -4984, 113520, 191711, 200110, 144468, 79483, 80883, 86349, 66282, 30738, 16040, 54190, 149774, 192296, 155456, 104543, 146379, 209440, 220432, 126005, 175336, 209043, 175405, 140101, 134942, 83215, 97132, 164413, 177364, 103327, 129578, 185035, 162348, 124690, 182074, 155193, 89036, 96029, 191004, 188213, 150578, 173005, 183180, 103111, 69432, 124489, 175633, 236994, 209469, 160627, 182984, 136086, 162011, 81078, 26451, -40848, 42160, 135333]
13411A35333k2740j5189M9458O739p2863k8899L9936J27857j03853J3052O4528
13400A93359n0035p8210o7508K1233L8434O0538M5971R9514K554l81j0703q658
13388B46108j7306J9219P67o6707l3548p662O011M9865M9565M586l10l3281K5249
13375B42556L9180k3983r2137k9103N8580j8368j9412O8279O0362l9048l9311
13364B07595K2602p3397K6778L9822m9076m1667R0725J06985L3084m5159n0824
13353B67468o7527o2851k6118N9349k7962k3264J2425N6702O7039n9224k9230
13342A66807M8926M6175K9371K5327q680q12l4383j9883j8757J279L3761O7415
13330C36546O5553p6102m6509n3981m2487O1716M7850q4730J3559K4515L7339
$$ y = [135333, 112593, 97404, 146862, 153601, 80738, 51839, 91775, 219632, 115779, 128831, 193359, 143324, 65114, -2394, 18839, 57273, 117811, 163782, 263296, 265850, 265469, 254766, 246108, 228802, 248021, 248788, 182081, 148533, 140871, 146882, 196747, 246312, 250898, 250588, 217307, 242556, 281736, 257753, 165616, 136513, 195093, 176725, 157313, 225592, 285954, 246906, 207595, 230197, 156800, 183578, 223400, 174324, 132657, 223382, 330367, 363451, 318292, 267468, 199941, 137090, 110972, 170321, 142359, 119095, 131520, 188222, 255261, 196037, 166807, 215733, 261908, 291279, 316606, 307926, 307114, 272731, 252848, 234091, 235370, 269131, 336546, 402099, 325997, 279488, 225507, 183020, 244736, 292586, 207856, 221415, 245930, 283269]
13319B83269N2847r7136j9876L7408K2995L8244l0920p0804O5994Q0053k6262
13308C35812o0856n991L8267P5306j9253n3238j5382j8305K0513K124j61m0934
13296B57902K5236M5181k067j92669l9497Q6398N8417J58806J8439n0400l1284
13285C34462J8346l7327p0877j4475J5535m6786K6365P4185L5973m3438J9391
13274C11354J8580p4367n3472J497K3894K4030N749l6101m0896j0240J45J31186
13262C01359R1827j0113n6437K8863K6881J6021p9767n2970o2203r2386l4257
13251G6818J26880J12714O0360k2194n4861p3022M0295k1843o720K7361M2104
13240C07892j2883j939J6685l356j4367m7021m9431L2442R7698J3757l4143j3045
$$ y = [283269, 336116, 238980, 219104, 256512, 279507, 317751, 286831, 216027, 282021, 362074, 335812, 274956, 268965, 307232, 382538, 363285, 310047, 294665, 276360, 296873, 298997, 298836, 257902, 283138, 328319, 326252, 133583, 94086, 180484, 238901, 397707, 416146, 365746, 334462, 352808, 315481, 244604, 230129, 245664, 198878, 225243, 299428, 335401, 291963, 311354, 329934, 255567, 202095, 203592, 227486, 251516, 257265, 221164, 180268, 170028, 170173, 301359, 393186, 383073, 326636, 355499, 382380, 398401, 318634, 265664, 203461, 111075, 76818, 203698, 316412, 376772, 354578, 299717, 226695, 266990, 245147, 238427, 265788, 307892, 295009, 293070, 309755, 306399, 292032, 245011, 195580, 228022, 325720, 339477, 305334, 292289]
13228B92289l2023j1322O4591N3429n9372j04922Q239O2457l3500L5642J4834
13217B90342m566l9174q7335N4395K5849J2686N6024L4889q7840m3944N2325L4253
13205B97904J619L7136O7431Q087L280P601l8794N5912K4663o8212j97O091p9684
13192C22837j6801N2072J5448k917l9554j7733J3339l1364N228L9824r580k52
13180C30547N0329N5276O4115K6369N723m4798o0429j14839L0199J10953j8921
13169D34524K4006j7468n5207K3284L3770j1260K739o287k6127m4170O1818n0221
13157C69401J0859K8388r658J0271M9802P3405J607k026J4704n8215K2295o117
13145E04716q9338J3521J25536R5493n3612r7758n6750K8595M8369R3846M5279
$$ y = [292289, 260266, 248944, 313535, 366964, 307592, 202670, 210909, 273366, 239866, 275508, 290342, 285776, 246602, 159267, 213662, 239511, 252197, 308221, 343110, 255270, 211326, 263651, 297904, 299523, 336659, 404090, 412177, 415457, 423058, 384264, 440176, 464839, 396627, 396430, 402521, 322837, 306036, 358108, 373556, 370639, 331085, 313352, 326691, 295327, 300555, 340379, 330799, 330547, 380876, 436152, 500267, 526636, 532359, 487561, 427132, 312293, 342492, 453445, 434524, 458530, 441062, 385855, 409139, 442909, 431649, 434388, 428101, 401974, 357804, 419622, 369401, 380260, 408648, 398990, 409261, 459063, 532468, 534075, 532049, 546753, 488538, 510833, 504716, 415378, 428899, 554435, 649928, 596316, 498558, 441808, 470403, 518772, 612618, 657897]
13134F57897p3229o9614K786m613o638K4513k5626l5257n7771L954O1807k0732
13122D57477o4121K939K1393Q1187J7934l7123o877J8735j9475N039n525M7198
13110E18781N4025k2590m8746L162O337P559L8849J0080k4778L7595n5131k7602
13098D97541K9241l2193n1061l5795l808Q3562M4787K9863R9321m4161p6654l8788
13086E01855n1879P1983J28427p644R099j5966k0034K4036L7561k7764j6948L8644
13074F71370J4565Q782L324n4481q0366l4062P2152K4153O5426N6050k8980k0868
13062F97065j1144J4825p2815o6228O4565M4372j7391k6223k0348J910j5012P3490
13050F67066k8341L2455M0448L3739J7179o8098M9931N6206m8865j0800P6040
$$ y = [657897, 584668, 515054, 517840, 513227, 506589, 531102, 505476, 470219, 412448, 416402, 478209, 457477, 393356, 396295, 417688, 498875, 516809, 479686, 472809, 491544, 472069, 477108, 471583, 518781, 572806, 550216, 501470, 504632, 510969, 518528, 557377, 567457, 542679, 580274, 525143, 497541, 526782, 494589, 443528, 407733, 403925, 487487, 532274, 562137, 661458, 617297, 540643, 501855, 449976, 521959, 650386, 642742, 651841, 635875, 615841, 639877, 677438, 649674, 632726, 671370, 685935, 694717, 698041, 643560, 563194, 529132, 601284, 625437, 690863, 746913, 717933, 697065, 685921, 700746, 627931, 561703, 626268, 670640, 653249, 627026, 606678, 608588, 593576, 667066, 638725, 671180, 711628, 745367, 762546, 694448, 744379, 800585, 751720, 740920, 816960]
13039H16960Q2823l2357n7897n5223k5523P261O9491K691J5223k8051J3907n6874
13027G52431k5112P598O0607O3772k1453k7794J3557J7099j9598l144M0511L0888
13015H89362L696O9864j9798p6604m3854N1182r798l3475j7429J4783m3651j6509
13003G67769J11343O0694l5282j6879j3722P2795M6272p5791l6349L1093J4738
12992I26681j5559r608M79L5472N2381J673O0987M1349j8548l6490o4046q9846
12980H84925N3525O4359l9517o0957N090R6247Q5420k6220k3050l5038M2349M5262
12968A092395j4723p8948L3083K5215n0093M3643Q9534l7408j25955R310k743
12957I83310j831K4604P265J27254K0366K1993N251j1887N0770p8688r755P7799
$$ y = [816960, 899783, 867426, 809529, 754306, 728783, 736044, 805535, 808226, 823449, 795398, 809305, 752431, 727319, 734917, 795524, 859296, 837843, 810049, 823606, 840705, 821107, 817963, 858474, 889362, 893058, 962922, 943124, 866520, 822666, 873848, 864050, 830575, 813146, 827929, 784278, 767769, 879112, 939806, 904524, 887645, 873923, 946718, 992990, 917199, 880850, 911943, 926681, 911122, 901514, 901993, 937465, 989846, 991519, 1052506, 1093855, 1075307, 1038817, 974771, 884925, 938450, 1002809, 963292, 902335, 907425, 1003672, 1089092, 1062872, 1039822, 1004784, 1047133, 1092395, 1077672, 998724, 1031807, 1057022, 1006929, 1050572, 1140106, 1102698, 976743, 986053, 983310, 981479, 1006083, 1013348, 1140602, 1160968, 1182961, 1188212, 1176325, 1227095, 1148407, 1138652, 1216451]
12945A216451j2849P481l9738k670j116m3854l3407R2918N6857J13252L847l5650
12933A321522O51L7266l1806p2092k4440L770J2650M3623O3616K1342o387l2139
12921A337576J045P5212L8303j0410P355O9402M7878j7373M1186P0009K7380M2795
12909A730358L3449q2068p1419j1199L861J3203L0518k3951P3948J33794o1527
12898A768967q9665j1149O5027J7651j7073j6000K0934N3126K6987k2091Q4963
12887A881677k176J7488O8728O947l0342k6184J45K5796M0382m438J2397N4606
12875B045026K7619J6286J4908M9587M8615l0621j2070P4813J46448N6770O566
12864B443947O0604O9141K951q840P0253J13645l2165L7306M5529K8553M7607
$$ y = [1216451, 1203602, 1211083, 1171345, 1168675, 1167559, 1123705, 1090298, 1183216, 1240073, 1353325, 1357172, 1321522, 1322173, 1359439, 1327633, 1255541, 1231101, 1234871, 1247521, 1291144, 1354760, 1376102, 1369715, 1337576, 1338621, 1413833, 1452136, 1441726, 1449081, 1518483, 1566361, 1548988, 1590174, 1660183, 1687563, 1730358, 1763807, 1681739, 1610320, 1599121, 1602982, 1616185, 1646703, 1622752, 1696700, 1830494, 1768967, 1679302, 1668153, 1733180, 1750831, 1733758, 1717758, 1738692, 1791818, 1818805, 1796714, 1881677, 1879501, 1896989, 1965717, 1972664, 1942322, 1916138, 1916283, 1942079, 1982461, 1978023, 1990420, 2045026, 2072645, 2088931, 2103839, 2153426, 2202041, 2171420, 2159350, 2234163, 2380611, 2437381, 2443947, 2504551, 2573692, 2576643, 2567803, 2638056, 2751701, 2719536, 2756842, 2802371, 2830924, 2878531]
12853B878531O1826N4587q2666n7386M2901L0383Q8638L8941n3485r1900k4424
12842B885946M7502P625m4164r557M2493l5403p4446l1319J11211P2552k8045
12831B944395P0172N347p345N5280L4141k8886l4636K0740L9117O1286P853k6493
12819C140971K8051j8709l523N4786M9360O1658l0061O5736M599m5739L9158N3086
12807C399373l0178m6586O0808P9548K1597j7239K8324M2010N3772j875O2463
12796C652017J667L6647N7876N8827Q1286N7770P3807O379p6178l7438J06875
12785D019535J07747M8001R6248K1825L5873K6123l387J026P1666M6185Q2713
12774D553555J5810M9731R1716J23918L8824o3355L8178J59072J13887J0237R5992
$$ y = [2878531, 2940357, 2994944, 2912278, 2854892, 2897793, 2928176, 3016814, 3055755, 3002270, 2910370, 2885946, 2933448, 2941073, 2896909, 2887352, 2929845, 2894442, 2819996, 2788677, 2899888, 2972440, 2944395, 3014567, 3019914, 3012569, 3067849, 3101990, 3073104, 3038468, 3059208, 3098325, 3159611, 3167464, 3140971, 3169022, 3150313, 3146790, 3201576, 3250936, 3312594, 3282533, 3348269, 3352868, 3307129, 3346287, 3399373, 3369195, 3322609, 3383417, 3462965, 3484562, 3467323, 3495647, 3537657, 3591429, 3589554, 3652017, 3653684, 3690331, 3748207, 3807034, 3888320, 3946090, 4019897, 4026276, 3950098, 3912660, 4019535, 4127282, 4175283, 4271531, 4293356, 4329229, 4355352, 4351965, 4352991, 4424657, 4470842, 4553555, 4569365, 4619096, 4710812, 4834730, 4873554, 4810199, 4848377, 5007449, 5121336, 5131573, 5227565]
12763E227565Q9532P122J085O7920R7375P738O3261J17172J08677K4823L9093
12752E851363O4630P3763K4204P6063K18692J29841l0552P7424J69959J51304
12742F806691R9572J42019J29202P2838R2576R6552Q3181J11100J33825J72358
12732G939914P5171O3985J14665R7459J59779R4829R1108J70284J21389J56520
12722I085103J93775J01246P5247K09650K05802J01981P8049J78645J85142J59854
12712A0574494J83167J79149K22947J95819J95127K02177K03595K29865K64466
12703A2450806J80826K27676K91675K30960K28684K13888J43232K11425K14814
12694A4393986L55923L73965K76149L59977L55216K53996L53674M18356L61127
$$ y = [5227565, 5317097, 5324219, 5325304, 5393224, 5490599, 5498337, 5561598, 5678770, 5787447, 5812270, 5851363, 5915993, 5989756, 6013960, 6090023, 6308715, 6438556, 6408004, 6485428, 6655387, 6806691, 6906263, 7048282, 7177484, 7250322, 7342898, 7439450, 7522631, 7633731, 7767556, 7939914, 8015085, 8079070, 8193735, 8291194, 8450973, 8545802, 8636910, 8807194, 8928583, 9085103, 9278878, 9380124, 9455371, 9665021, 9870823, 9972804, 10050853, 10229498, 10414640, 10574494, 10757661, 10936810, 11159757, 11355576, 11550703, 11752880, 11956475, 12186340, 12450806, 12631632, 12859308, 13150983, 13381943, 13610627, 13824515, 13967747, 14179172, 14393986, 14749909, 15123874, 15400023, 15760000, 16115216, 16369212, 16722886, 17141242, 17502369]
12685A7502369K97264L62334N03269M37005L96872L87014M40819M35590M95910
12676B1258446M33176M90933M63031M97480N48319N92838O49698O27179N78474
12667B6139574N80930O57463P18678O64547O89658P09222P62219Q23596Q30929
12658C2576816Q15042Q67930R11692R71842R68745R99638J015944J076508J132164
12649D1336321J203379J167722J263834J363663J367192J492248J517084J487497
12641E2198940J597805J660111J643051J810188J899275J827201J900050K101468
12633F6638089K160407K135160K266525K356629K341501K433087K403217K419629
12625H5154244K564343K646412K710748K640097K652040K732289K792632K697577
$$ y = [17502369, 17799633, 18161967, 18665236, 19102241, 19499113, 19886127, 20326946, 20762536, 21258446, 21691622, 22182555, 22645586, 23143066, 23691385, 24284223, 24933921, 25561100, 26139574, 26720504, 27377967, 28096645, 28761192, 29450850, 30160072, 30922291, 31745887, 32576816, 33391858, 34259788, 35171480, 36143322, 37112067, 38111705, 39127649, 40204157, 41336321, 42539700, 43707422, 44971256, 46334919, 47702111, 49194359, 50711443, 52198940, 53796745, 55456856, 57099907, 58910095, 60809370, 62636571, 64536621, 66638089, 68798496, 70933656, 73200181, 75556810, 77898311, 80331398, 82734615, 85154244, 87718587, 90364999, 93075747, 95715844, 98367884, 101100173, 103892805, 106590382]
12617A06590382K607868K621655K524243K443935K451509K378284K158400J973934
12609A25750210J876763J735305J611817J357321J111603R45284O94967N85390
12601A35668660L07291J080k40694m15941o05913q02686r12116j155471j350199
12592A30494011j483873j618452j707346j848034j941832k021504k103180k161196
12584A15608594k199877k297630k288656k304706k298324k281997k273886k231571
$$ y = [106590382, 109198250, 111819905, 114344148, 116788083, 119239592, 121617876, 123776276, 125750210, 127626973, 129362278, 130974095, 132331416, 133443019, 134388303, 135083270, 135668660, 135975951, 135977031, 135736337, 135320396, 134714483, 133911797, 132999681, 131844210, 130494011, 129010138, 127391686, 125684340, 123836306, 121894474, 119872970, 117769790, 115608594, 113408717, 111111087, 108822431, 106517725, 104219401, 101937404, 99663518, 97431947]
$$ [...]
##END NTUPLES=NMR SPECTRUM
##END=
