##TITLE=Analysis number 321571
Compound Code cc 23602
Book Reference 461/198/5
Project Code adrs
Chemist Name toml
##JCAMPDX= 6.0         $$ Bruker NMR JCAMP-DX V2.0
##DATA TYPE= NMR SPECTRUM
##DATA CLASS= NTUPLES
##ORIGIN= Bruker BioSpin GmbH
##OWNER= nmr
$$ XWIN-NMR		Version 3.5
$$ Wed Aug 16 12:33:37 2006 GMT Daylight Time (UT+1h)  MAYBRIDGE\nmr@NMR_250MHZ
##.OBSERVE FREQUENCY= 250.131544655141
##.OBSERVE NUCLEUS= ^1H
##.ACQUISITION MODE= SIMULTANEOUS (DQD)
##.ACQUISITION SCHEME= undefined
##.AVERAGES= 16
##.DIGITISER RES= 18
##SPECTROMETER/DATA SYSTEM= dpx250
##.PULSE SEQUENCE= zg30
##.SOLVENT NAME= MeOD
##.SHIFT REFERENCE= (INTERNAL, MeOD, 0, 16.5804)
##AUDIT TRAIL= $$ (NUMBER, WHEN, WHO, WHERE, WHAT)
$$ ##TITLE= Audit trail, XWIN-NMR		Version 3.5
$$ ##JCAMPDX= 5.01
$$ ##ORIGIN= Bruker BioSpin GmbH
$$ ##OWNER= nmr
$$ C:\u/data/dgb/nmr/ADRS/1020/pdata/1/auditp.txt
$$ ##AUDIT TRAIL=  $$ (NUMBER, WHEN, WHO, WHERE, WHAT)
(   1,<2006-08-16 12:33:16.29 +100>,<MAYBRIDGE\nmr>,<NMR_250MHZ>,
      <created by zg, POWCHK disabled, PULCHK disabled
       configuration hash MD5:
       E2 DF 36 D8 04 B2 41 60 5A D7 A3 38 5A 4B D0 FE
       data hash MD5: 64K
       82 21 3B 73 4E E8 62 1D 76 3E 95 38 89 B7 D4 1E>)
(   2,<2006-08-16 12:33:29.18 +100>,<MAYBRIDGE\nmr>,<NMR_250MHZ>,
      <Start of raw data processing
       ef LB = 0.3 FT_mod = 6 PKNL = 1 SI = 32K 
       data hash MD5: 32K
       7C 8A F0 2E 1C 73 D2 57 F7 A6 59 95 B6 76 54 0A>)
(   3,<2006-08-16 12:33:30.82 +100>,<MAYBRIDGE\nmr>,<NMR_250MHZ>,
      <apk 
       data hash MD5: 32K
       41 A1 26 FC 43 7E 9A 4B D7 60 D6 98 EB E7 BD 05>)
(   4,<2006-08-16 12:33:31.54 +100>,<MAYBRIDGE\nmr>,<NMR_250MHZ>,
      <abs ABSG = 5 
       data hash MD5: 32K
       25 8A 1D 5F FF AF B6 2E FD 08 85 09 73 6C 13 95>)
$$ ##END=
$$ 
$$ hash MD5
$$ E9 8F C9 5F 13 76 65 C8 8A DB 98 45 7E 02 4E D3
##$RELAX= 
##$RELAX= 
##$RELAX= 
##$RELAX= 
##$RELAX= 
##$RELAX= 
##$RELAX= 
$$ Bruker specific parameters
$$ --------------------------
##$DU= <C:\u>
##$EXPNO= 1020
##$NAME= <ADRS>
##$PROCNO= 1
##$TYPE= <nmr>
##$USER= <dgb>
##$AMP= (0..31)
100 100 100 100 100 100 100 100 100 100 100 100 100 100 100 100 100 100 
100 100 100 100 100 100 100 100 100 100 100 100 100 100 
##$AQSEQ= 0
##$AQ_mod= 3
##$AUNM= <au_zg>
##$AUTOPOS= <27 >
##$BF1= 250.13
##$BF2= 250.13
##$BF3= 250.13
##$BF4= 250.13
##$BF5= 500.13
##$BF6= 500.13
##$BF7= 500.13
##$BF8= 500.13
##$BYTORDA= 1
##$CFDGTYP= 0
##$CFRGTYP= 5
##$CHEMSTR= <none>
##$CNST= (0..31)
1 1 145 1 1 1 1 1 1 1 1 1 1 1 1 1 1 1 1 1 1 1 1 1 1 1 1 1 1 1 1 1 
##$CPDPRG= <>
##$CPDPRG1= <>
##$CPDPRG2= <>
##$CPDPRG3= <>
##$CPDPRG4= <mlev>
##$CPDPRG5= <mlev>
##$CPDPRG6= <mlev>
##$CPDPRG7= <mlev>
##$CPDPRG8= <mlev>
##$CPDPRGB= <>
##$CPDPRGT= <>
##$D= (0..31)
0 1 0 0 0 0 0 0 0 0.06 0 0 0 0 0 0 0.0002 0 0 0 0 0 0 0 0 0 0 0 0 0 0 
0 
##$DATE= 1155727995
##$DBL= (0..7)
120 120 120 120 120 120 120 120 
##$DBP= (0..7)
150 150 150 150 150 150 150 150 
##$DBP07= 0
##$DBPNAM0= <>
##$DBPNAM1= <>
$$ [...]
##$SUBNAM7= <"">
##$SUBNAM8= <"">
##$SUBNAM9= <"">
##$SW= 20.6930455092707
##$SWIBOX= (0..15)
0 0 3 0 0 0 0 0 0 0 0 0 0 0 0 0 
##$SW_h= 5175.983436853
##$TD= 65536
##$TD0= 1
##$TE= 295.16
##$TE2= 300
##$TE3= 300
##$TEG= 300
##$TL= (0..7)
0 120 120 120 120 120 120 120 
##$TP= (0..7)
150 150 150 150 150 150 150 150 
##$TP07= 0
##$TPNAME0= <>
##$TPNAME1= <>
##$TPNAME2= <>
##$TPNAME3= <>
##$TPNAME4= <>
##$TPNAME5= <>
##$TPNAME6= <>
##$TPNAME7= <>
##$TPOAL= (0..7)
0.5 0.5 0.5 0.5 0.5 0.5 0.5 0.5 
##$TPOFFS= (0..7)
0 0 0 0 0 0 0 0 
##$TUNHIN= 0
##$TUNHOUT= 0
##$TUNXOUT= 0
##$USERA1= <user>
##$USERA2= <user>
##$USERA3= <user>
##$USERA4= <user>
##$USERA5= <user>
##$V9= 5
##$VALIST= <valist>
##$VCLIST= <CCCCCCCCCCCCCCC>
##$VD= 0
##$VDLIST= <DDDDDDDDDDDDDDD>
##$VPLIST= <PPPPPPPPPPPPPPP>
##$VTLIST= <TTTTTTTTTTTTTTT>
##$WBST= 1024
##$WBSW= 4
##$XGAIN= (0..3)
0 0 0 0 
##$XL= 0
##$YL= 0
##$YMAX_a= 396535
##$YMIN_a= -389202
##$ZGOPTNS= <>
##$ZL1= 120
##$ZL2= 120
##$ZL3= 120
##$ZL4= 120
##$ABSF1= 16.58042
##$ABSF2= -4.112755
##$ABSG= 5
##$ABSL= 3
##$ALPHA= 0
##$AQORDER= 0
##$ASSFAC= 0
##$ASSFACI= 0
##$ASSFACX= 0
##$ASSWID= 0
##$AUNMP= <proc_1d>
##$AZFE= 0.1
##$AZFW= 0.1
##$BCFW= 0
##$BC_mod= 0
##$BYTORDP= 0
##$COROFFS= 0
##$CY= 12.5
##$DATMOD= 1
##$DC= 0
##$DFILT= <>
##$DTYPP= 0
##$F1P= 14.0000005364418
##$F2P= -0.99999901652339
##$FCOR= 0.5
##$FTSIZE= 32768
##$FT_mod= 6
##$GAMMA= 0
##$GB= 0
##$INTBC= 1
##$INTSCL= 1
##$ISEN= 128
##$LB= 0.3
##$LEV0= 0
##$LPBIN= 0
##$MAXI= 10000
##$MC2= 0
##$MEAN= 0
##$ME_mod= 0
##$MI= 0
##$NCOEF= 0
##$NC_proc= -4
##$NLEV= 6
##$NOISF1= 0
##$NOISF2= 0
##$NSP= 0
##$NTH_PI= 0
##$NZP= 0
##$OFFSET= 16.58042
##$PC= 1
##$PHC0= 136.5404
##$PHC1= 16.53515
##$PH_mod= 1
##$PKNL= yes
##$PPARMOD= 0
##$PSCAL= 4
##$PSIGN= 0
##$REVERSE= no
##$SF= 250.129985386722
##$SI= 32768
##$SIGF1= 0
##$SIGF2= 0
##$SINO= 400
##$SIOLD= 32768
##$SREGLST= <1H.MeOD>
##$SSB= 0
##$STSI= 32768
##$STSR= 0
##$SW_p= 5175.98343685301
##$SYMM= 0
##$S_DEV= 0
##$TDeff= 65536
##$TDoff= 0
##$TI= <Analysis number 999999
Compound Code 99
Book Reference 9
Project Code 9>
##$TILT= no
##$TM1= 0
##$TM2= 0
##$TOPLEV= 0
##$USERP1= <user>
##$USERP2= <user>
##$USERP3= <user>
##$USERP4= <user>
##$USERP5= <user>
##$WDW= 1
##$XDIM= 32768
##$YMAX_p= 424342013
##$YMIN_p= -489122
$$ End of Bruker specific parameters
$$ ---------------------------------
##NTUPLES= NMR SPECTRUM
##VAR_NAME=  FREQUENCY,     SPECTRUM/REAL,   SPECTRUM/IMAG
##SYMBOL=    X,             R,               I
##VAR_TYPE=  INDEPENDENT,   DEPENDENT,       DEPENDENT
##VAR_FORM=  AFFN,          ASDF,            ASDF
##VAR_DIM=   32768,         32768,           32768
##UNITS=     HZ,            ARBITRARY UNITS, ARBITRARY UNITS
##FACTOR=    0.157963299565203, 1,           1
##FIRST=     4147.26009734729, 0,            0
##LAST=      -1028.72333950572, 0,           0
##MIN=       -1028.72333950572, -489122,     0
##MAX=       4147.26009734729, 424342013,    0
$$ Real data points
##PAGE= N=1
##DATA TABLE= (X++(R..R)), XYDATA
$$ [...]
$$ plain form
15949 7078 -3610 -64454 -30485 -61315 -146816 -50028 -59759 -138192 -233131 -132954 -9642 166
15937 166 14971 -31205 -73389 -115419 -194327 -120886 -50600 34808 -54309 -58019 -180850 -149816
15925 -149816 -71692 -71567 -18440 -52577 -57520 -173713 -174687 -118004 -158884 -180729 -121264 -88138
15913 -88138 -153790 -133894 -165067 -214791 -226116 -280437 -311210 -253420 -263910 -310223 -193087
15902 -193087 -49020 9368 -18980 21446 96014 64766 -29002 -99807 -18193 52015 89895
15891 89895 159179 100100 35641 -46125 -56333 -112386 -97552 11785 -22739 -63991 -131185
15880 -131185 -213874 -273348 -308612 -140210 -16283 55100 124608 150530 67519 -27745 -50341
15869 -50341 -106580 -155911 -100859 -194692 -213424 -228483 -225533 -219238 -271157 -249042 -199645 -170708
$$ packed form
15949G078j0688o0844L3969l0830q5501R6788r731p8433r4939J00177J23312R808
15937A66J4805m6176m2184m2030p8908P3441P0286Q5408q9117l710j22831L1034
15925a49816P8124J25N3127l4137m943j16193r74N6683m0880k1845N9465L3126
15913h8138o5652J9896l1173m9724j1325n4321l0773N7790j0490m6313J17136
15902a93087J44067N8388k8348M0426P4568l1248r3768p0805Q1614P0208L7880
15891H9895O9284n9079o4459q1766j0208n6053J4834J09337l4524m1252o7194
15880a31185q2689n9474l5264J68402J23927P1383O9508K5922q3011r5264k2596
15869e0341n6239m9331N5052r3833j8732j5059K950O295n1919K2115M9397K8937
$$ plain form
15857 -170708 -62321 -17950 86011 68473 -53013 -121381 -113467 -53626 -129691 -152509 -182760
15846 -182760 -69156 46266 31374 -63103 -114855 -39205 9399 87896 135408 40103 -79495
15835 -79495 -192465 -300137 -305467 -254727 -176912 -253679 -388288 -330190 -292488 -305245 -304790 -336822
15823 -336822 -235201 -193411 -121610 -71888 -126772 -189255 -233120 -55155 87488 -3111 -68727
15812 -68727 -128167 -230268 -197100 -144047 -201071 -245913 -146338 -49989 51001 -21818 -22216 -6332
15800 -6332 -102649 -93620 -136743 -170184 -136055 -113821 -229345 -266003 -311612 -215256 -162748 -187811
15788 -187811 -46556 -5035 63702 13270 -144495 -188916 -62134 -104103 -117607 -39911 54824
15777 54824 -30825 -129739 -182226 -134891 -183765 -120256 -22926 22479 22627 37592 133922 62190
$$ packed form
15857a70708J08387M4371J03961j7538j21486o8368P914N9841p6065k2818l0251
15846a82760J13604J15422j4892r4477n1752P5650M8604P8497M7512r5305j19598
15835g9495j12970j07672n330N0740P7815p6767j34609N8098L7702j2757M55l2032
15823c36822J01621M1790P1801M9722n4884o2483m3865J77965J42643r0599o5616
15812f8727n9440j02101L3168N3053n7024m4842R9575R6349J00990p2819l98J5884
15800f332r6317R029m3123l3441L4129K2234j15524l6658m5609R6356N2508k5063
15788a87811J41255M1521O8737n0432j57765m4421J26782m1969j3504P7696R4735
15777E4824q5649r8914n2487M7335m8874O3509R7330M5405J48J4965R6330p1732
$$ plain form
15765 62190 -81858 -81767 -134938 -222302 -136472 2840 138214 146727 103481 93529 37434 103575
15753 103575 118575 26353 -32999 -51534 -43010 74736 69950 75136 26186 -54904 -77556 -23507
15741 -23507 14113 -104231 -138969 -191885 -281762 -285044 -278625 -248708 -163084 -131446 -43982 -13478
15729 -13478 -105897 -177033 -68837 87029 180565 168142 99189 -43970 -162677 -168746 -205033
15718 -205033 -141598 -53315 94131 171423 104650 93149 60281 13016 -118428 -47504 -29400
15707 -29400 35335 7021 -62544 -95695 -74770 -96200 -92250 -8026 -29962 -22268 -122858 -269112
15695 -269112 -230355 -143439 22747 86989 104374 102056 107612 98278 17371 -47969 -8439 -45589
15683 -45589 -126944 -127853 -20938 70682 229108 192026 -49421 -162195 -82978 -60355 -112018
$$ packed form
15765F2190j44048R1n3171q7364Q5830J39312J35374Q513m3246r952n6095O6141
15753A03575J5000r2222n9352j8535Q524J17746m786N186m8950q1090k2652N4049
15741b3507L7620j18344l4738n2916q9877l282O419K9917Q5624L1638Q7464L0504
15729a3478r2419p1136J08196J55866R3536j2423o8953j43159j18707o069l6287
15718b05033O3435Q8283J47446P7292o6773j1501l2868m7265j31444P0924J8104
15707b9400O4735k8314o9565l3151K0925k1430L950Q4224k1936P694j00590j46254
15695b69112L8757Q6916J66186O4242J7385k318N556r334q0907o5340L9530l7150
15683d5589q1355r09J06915R1620J58426l7082k41447j12774P9217K2623n1663
$$ plain form
15672 -112018 -117609 -70310 40119 129201 176389 107290 5727 -143554 -245294 -200152 -81304
15661 -81304 -34072 -11379 60964 14998 -18640 -21140 68827 132095 94156 -35710 -82647 -22062
15649 -22062 -178283 -236572 -170503 -116530 -228430 -67397 12926 -150615 -140671 -167931 -178652
15638 -178652 -42813 -33737 -36786 105999 85200 38062 41877 96009 136927 -3842 -88107
15627 -88107 -103295 -190861 -237667 -201715 -142453 1983 38523 47410 11945 -82693 -50381 -55567
15615 -55567 -107749 -248011 -285805 -249549 -163717 -223936 -247641 -200970 -252484 -266786 -191615
15604 -191615 -6177 27152 40434 114958 149362 155544 153406 155567 184578 84827 33362 -47397
15592 -47397 -172409 -123980 -66552 -54500 -108428 -104036 -40940 -19503 41867 66973 20294 78051
$$ packed form
15672a12018n591M7299J10429Q9082M7188o9099j01563j49281j01740M5142J18848
15661h1304M7232K2693P2343m5966l3638k500Q9967O3268l7939j29866m6937O0585
15649b2062j56221n8289O6069N3973j11900J61033Q0323j63541R944k7260j0721
15638a78652J35839R076l049J42785k0799m7138L815N4132M0918j40769q4265
15627h8107j5188q7566m6806L5952N9262J44436L6540Q887l5465r4638L2312n186
15615e5567n2182j40262l7794L6256Q5832o0219k3705M6671n1514j4302P5171
15604a91615J85438L3329J3282P4524L4404O182k138K161K9011r9751n1465q0759
15592d7397j25012M8429N7428J2052n3928M392O3096K1437O1370K5106m6679N7757
$$ plain form
15580 78051 61305 -31224 -44690 -137138 -191427 -219894 -199240 -196788 -262703 -305466 -393602 -215854
15568 -215854 -103295 -119830 -195695 -118770 -84291 -49319 -49056 -23379 103136 76144 58433
15557 58433 100148 42007 -58639 -155765 -155849 -99955 -67503 -35144 -227231 -260438 -153760 -127719
15545 -127719 -258023 -265089 -133864 -81810 -34696 -19306 -39281 -37393 -42691 -23371 -81409 187
15533 187 -22004 -57119 -39791 -103738 -155587 -116740 -62483 -103624 -133765 6786 -12844 -86602
15521 -86602 -199646 -148330 -125661 -91166 -149625 -138571 -203416 -226780 -225060 -181230 -124848 -152760
15509 -152760 -178100 -87911 -16010 -74221 53453 33397 16356 100464 16404 -34956 -36425
15498 -36425 149 -5235 -34382 -12479 1024 -136320 -149709 -19785 41645 83584 42602
$$ packed form
15580G8051j6746r2529j3466r2448n4289k8467K0654K452o5915m2763q8136J77748
15568b15854J12559j6535p5865P6925L4479L4972K63K5677J26515k6992j7711
15557E8433M1715n8141j00646r7126q4N5894L2452L2359j92087l3207J06678K6041
15545a27719j30304p066J31225N2054M7114J5390j9975J888n298J9320n8038Q1596
15533A87k2191l5115J7328o3947n1849L8847N4257m1141l0141J40551j9630p3758
15521h6602j13044N1316K2669L4495n8459J1054o4845k3364J720M3830N6382k7912
15509a52760k5340R0189P1901n8211J27674k0056j7041Q4108q4060n1360j469
15498c6425L6574n384k9147K1903J3503j37344j3389J29924O1430M1939m0982
$$ plain form
15487 42602 72287 8855 -122200 -197919 -100590 -91108 -166768 -253638 -189972 -93485 -13482 71064
15475 71064 2589 -102181 -42739 97706 125751 54544 27429 25286 -7203 -56058 -47562 -15723
15463 -15723 29447 118770 15150 -64475 -83777 -144493 -220051 -238691 -211039 -182732 -159005
15452 -159005 -135667 -85208 -66536 -49979 11032 -65416 -265899 -266440 -191984 -118089 -99075 -96029
15440 -96029 -45082 -52124 -74520 -39998 54455 94664 27193 -28996 -19214 74472 148727 113359
15428 113359 111674 137198 74679 -1942 7055 -40387 -116370 -120486 -74696 -41445 26558 104911
15416 104911 135754 50662 -17943 -18946 62438 161617 183987 152640 60318 -129112 -195838
15405 -195838 -211347 -151978 -72484 -4586 122900 72881 92518 45687 3629 -53539 45330
$$ packed form
15487D2602K9685o3432j31055p5719R7329R482p5660q6870O3666R6487Q0003Q4546
15475G1064o8475j04770N9442J40445K8045p1207k7115k143l2489m8855Q496L1839
15463a5723M5170Q9323j03620p9625j9302o0716p5558j8640K7652K8307K3727
15452a59005K3338N0459J8672J6557O1011p6448k00483n41P4456P3895J9014L046
15440i6029N0947p042k2396L4522R4453M0209o7471n6189R782R3686P4255l5368
15428A13359j685K5524o2519p6621Q997m7442p5983m116M5790L3251O8003P8353
15416A04911L0843q5092o8605j003Q1384R9179K2370l1347r2322j89430o6726
15405a95838j5509N9369P9494O7898J27486n0019J9637m6831m2058n7168R8869
$$ plain form
15394 45330 -80032 -18181 75211 105801 -37159 -13393 3290 -103170 -76073 -126288 -130851
15383 -130851 -151379 -151826 -140314 -120561 -16372 17378 -36865 10711 52840 101939 10670 -142457
15371 -142457 -218065 -132388 -44775 -72374 -202441 -122264 -123761 -195491 -87139 -44378 -58482
15360 -58482 49753 8048 -125027 -130757 -194244 -109151 32908 14221 -112914 -210466 -234739
15349 -234739 -249561 -160580 -185540 -105673 -29296 -109192 -207257 -298528 -128402 -14887 52747
15338 52747 16144 -79634 -68594 -128446 -172737 -221716 -166670 -80632 -115034 -107781 -148680 -183309
15326 -183309 -163263 -26542 -17056 17601 -17249 -53286 -148895 -105665 -22848 23236 18224 -17678
15314 -17678 -19785 -13930 71416 -8000 -66257 -118845 -67378 -120192 -93683 -130169 -220586 -182541
$$ packed form
15394D5330j25362O1851R3392L0590j42960K3766J6683j06460K7097n0215m563
15383a30851k0528m47J1512J9753J04189L3750n4243M7576M2129M9099r1269j53127
15371a42457p5608Q5677Q7613k7599j30067Q0177j497p1730J08352M2761j4104
15360e8482J08235m1705j33075n730o3487Q5093J42059j8687j27135r7552k4273
15349b34739j4822Q8981k4960P9867P6377p9896r8065r1271J70126J13515O7634
15338E2747l6603r5778J1040n9852m4291m8979N5046Q6038l4402P253m0899l4629
15326a83309K0046J36721R486L4657l4850l6037r5609M3230Q2817M6084n012l5902
15314a7678k107N855Q5346p9416n8257n2588N1467n2814K6509l6486r0417L8045
$$ plain form
15302 -182541 -108921 10147 67872 -31959 -135206 -87882 -161277 -172435 -109137 -123837 -165909
15291 -165909 -213233 -111954 -65963 -36023 -67330 -25266 -12360 -115191 -113083 -144098 -126805
15280 -126805 -199283 -217035 -188939 -218333 -256635 -317829 -344018 -380700 -342876 -212632 -88783
15269 -88783 -91254 -52743 -50594 -35025 -44809 -62771 -127967 -106954 -78294 -58529 36408 85782
15257 85782 133028 125158 113909 77753 -102151 -202503 -131948 -42504 -108620 -105000 57543
15246 57543 31511 -101675 -110048 -138919 -73873 -4763 18350 46441 38131 -22720 -59691 -11263
15234 -11263 -35448 -106528 -183723 -171777 -159340 -149643 -213178 -123712 -87123 -192680 -137910 -26663
15222 -26663 8933 -72848 -175758 -122320 -171809 -156860 -58564 -9514 -70621 -141605 -220033
$$ packed form
15302a82541P3620J19068N7725r9831j03247M7324p3395j1158O3298j4700m2072
15291a65909m7324J01279M5991K9940l1307M2064J2906j02831K108l1015J7293
15280a26805p2478j7752K8096k9394l8302o1194k6189l6682L7824J30244J23849
15269h8783k471L8511K149J5569r784j7962o5196K1013K8660J9765R4937M9374
15257H5782M7246p870j1249l6156j79904j00352P0555Q9444o6116L620J62543
15246E7543k6032j33186q373k8871O5046O9110K3113K8091q310o0851l6971M8428
15234a1263k4185p1080p7195J1946J2437R697o3535Q9466L6589j05557N4770J11247
15222b6663L5596q1781j02910N3438m9489J4949R8296M9050o1107p0984p8428
$$ plain form
15211 -220033 -173160 -89776 -91182 1361 9405 -121758 -130310 -70068 -118892 -168563 -164128 -172363
15199 -172363 -136256 -93190 -140972 -177766 -178095 -199581 -254596 -246397 -237946 -207611 -67073 52733
15187 52733 46946 -162681 -162296 -102605 -30844 -14289 14007 -51689 -129103 -40226 3943 -86220
15175 -86220 -76906 73180 112858 74203 -50902 -132064 -143672 -155080 -140026 -129468 -179298
15164 -179298 -196757 -87679 -68042 -165077 -170948 -219282 -218867 -185621 -246410 -272390 -116075 -120264
15152 -120264 -150464 -145823 -190066 -168074 -147771 -195912 -203511 -243128 -220030 -168101 -176261 -25176
15140 -25176 28140 -65261 -69098 -93723 36588 120430 56474 28679 -54880 -80389 149223
15129 149223 237574 137822 224564 166295 45300 124478 129992 128576 41385 -11583 39870 107827
$$ packed form
15211b20033M6873Q3384j406R2543Q044j31163q552O0242m8824m9671M435q235
15199a72363L6107M3066m7782l6794l29k1486n5015Q199Q451L0335J40538J19806
15187E2733n787k09627L85N9691P1761J6555K8296o5696p7414Q8877M4169r0163
15175h6220R314J50086L9678l8655j25105q1162j1608j1408J5054J0558m9830
15164a79298j7459J09078J9637r7035n871m8334M15L3246o0789k5980J56315m189
15152a20264l0200M641m4243K1992K0303m8141p599l9617K3098N1929q160J51085
15140b5176N3316r3401l837k4625J30311Q3842o3956k7795q3559k5509K29612
15129A49223Q8351r9752Q6742n8269j20995P9178N514j416q7191n2968N1453O7957
$$ plain form
15117 107827 134634 82554 131211 -65782 -59085 -51716 -98781 -64754 -78862 -121073 -100478 -124511
15105 -124511 -152016 -172787 -68513 -113123 -123045 -151397 -94739 15067 11494 8732 99058 8748
15093 8748 -49620 -73296 -77610 -8945 -30110 -7233 23793 92567 77761 -28786 -35448 -111078
15081 -111078 -243930 -350423 -240295 -140019 -19263 5013 102575 95304 72591 31367 18210
15070 18210 -73701 -96998 -129870 -233416 -207399 -86911 -17353 -4667 -24586 -58682 -77974
15059 -77974 -101393 -44070 -76296 -110439 -80613 -44511 -23510 16853 99748 137093 31120
15048 31120 -109252 -80518 -14529 81437 77961 9999 -11560 -11180 -106183 -116012 -34921 -34178 -34238
15035 -34238 25991 25227 -119989 -145904 -213499 -286185 -259487 -206508 -161067 -175513 -202926 -234629
$$ packed form
15117A07827K6807n2080M8657j96993O697P369m7065L4027j4108m2211K0595k4033
15105a24511k7505k0771J04274m4610r922k8352N6658J09806l573k762R0326r0310
15093H748n8368k3676m314O8665k1165K2877L1026O8774j4806j06547o662p5630
15081a11078j32852j06493J10128J00276J20756K4276R7562p271k2713m1224j3157
15070A8210r1911k3297l2872j03546K6017J20488O9558J2686j9919l4096j9292
15059g7974k3419N7323l2226l4143K9826L6102K1001M0363Q2895L7345j05973
15048C1120j40372K8734O5989R5966l476o7962k1559L80r5003r829Q1091P43o0
15035c4238O0229p64j45216k5915o7595p2686K6698N2979M5441j4446k7413l1703
$$ plain form
15023 -234629 -286465 -149105 -56365 -39968 12939 23816 141173 196089 166049 8049 -53822
15012 -53822 26576 69633 145953 84756 -23740 -124268 -107075 -66153 -98584 -181501 -263286
15001 -263286 -142815 -18659 -82331 -115644 -15130 37662 41581 28483 -64362 -141371 -116197
14990 -116197 -128191 -80562 6299 54203 33486 -84534 -50853 8574 -92651 -96505 -95174
14979 -95174 -58221 -12029 -122733 -223582 -242324 -271757 -223453 -53334 48079 51799 164303
14968 164303 211985 175099 -4203 -40387 71769 97787 15222 19306 24124 70720 19295
14957 19295 50891 75301 -13047 -189724 -272488 -218298 -67357 76614 -56713 -240639 -295698
14946 -295698 -266559 -177289 -74825 -165243 -243900 -218017 -161733 -108548 12441 -40303 -113787
$$ packed form
15023b34629n1836J37360R2740J6397N2907J0877J17357N4916l0040j58000o1871
15012e3822Q0398M3057P6320o1197j08496j00528J7193M0922l2431q2917q1785
15001b63286J20471J24156o3672l3313J00514N2792L919j3098r2845p7009K5174
14990a16197j1994M7629Q6861M7904k0717j18020L3681N9427j01225l854J331
14979i5174L6953M6192j10704j00849j8742k9433M8304J70119J01413L720J12504
14968A64303M7682l6886j79302l6184J12156K6018q2565M084M818M6596n1425
14957A9295L1596K4410q8348j76677q2764N4190J50941J43971j33327j83926n5059
14946b95698K9139Q9270J02464r0418p8657K5883N6284N3185J20989n2744p3484
$$ plain form
14935 -113787 -92005 -69479 -133124 -34770 -12276 24316 3236 75083 24795 -63834 -129441
14924 -129441 -41366 -54599 -49105 3930 19564 74905 147783 113577 472 -94788 -132581
14913 -132581 -194225 -187012 -114373 -14139 42576 -113841 -178167 -223025 -255529 -116519 -7465
14902 -7465 11421 2578 -109189 -168051 -16810 83725 99602 83497 75088 -80302 -215416
14891 -215416 -136008 -113104 -215181 -202909 -71007 90486 45728 -31784 -80996 -113989 -169886
14880 -169886 -188370 -183175 -181863 -114563 -132734 -126265 -139203 -85412 -57028 -70461 -75625 -49527
14868 -49527 -112444 -168978 -140062 -58646 -40808 -46760 -58642 -34555 -4261 21209 -49877 -142886
14856 -142886 -209779 -182397 -182580 -201861 -86645 21544 76539 144230 165591 -31412 -213698
$$ packed form
14935a13787K1782K2526o3645R8354K2494L6592k1080P1847n0288q8629o5607
14924a29441Q8075j3233N494N3035J5634N5341P2878l4206j13105r5260l7793
14913a32581o1644P213P2639J00234N6715j56417o4326m4858l2504J39010J09054
14902g465J8886q843j11767n8862J51241J00535J5877j6105q409j55390j35114
14891b15416P9408K2904j02077J2272J31902J61493m4758p7512m9212l2993n5897
14880a69886j8484N195J312O7300j8171O469j2938N3791K8384j3433n164K6098
14868d9527o2917n6534K8916Q1416J7838n952j1882K4087L0294K5470p1086r3009
14856a42886o6893K7382j83j9281J15216J08189N4995O7691K1361j97003j82286
$$ plain form
14845 -213698 -168350 -78591 -146112 -138642 -134197 -178507 -103669 -28495 -49516 -26790 -21467 -46369
14833 -46369 -120364 -127003 -78137 -141473 -215977 -244510 -309194 -231415 -77053 13664 55840 -106634
14821 -106634 -130465 -36975 8140 -93908 -58977 -102355 -135437 -25198 -90892 -169198 -182015
14810 -182015 -201072 -55393 13071 -40133 -70552 8482 33429 50034 -17143 -19235 -65182
14799 -65182 -128575 -127639 -179310 -172859 -217606 -181827 -18374 -25143 30625 -6366 -169668 -181374
14787 -181374 -106036 -107393 -51001 506 -34962 -95066 -68729 -128373 -114686 15149 130606
14776 130606 91668 -7605 -19589 39071 29742 -78126 -64355 -126626 -185736 -159347 -140452
14765 -140452 -47071 69657 89927 6495 34591 47944 43709 -29360 -72414 27609 125887
$$ packed form
14845b13698M5348Q9759o7521P470M445m4310P4838P5174k1021K2726N323k4902
14833d6369p3995o639M8866o3336p4504k8533o4684P7779J54362R0717M2176j62474
14821a06634k3831R3490M5115j02048L4931m3378l3082J10239o5694p8306j2817
14810a82015j9057J45679O8464n3204l0419P9034K4947J6605o7177k092m5947
14799f5182o3393R36n1671O451m4747L5779J63453o769N5768l6991j63302j1706
14787a81374P5338j357N6392N1507l5468o0104K6337n9644J3687J29835J15457
14776A30606l8938r9273j1984N8660r329j07868J3771o2271n9110K6389J8895
14765a40452R3381J16728K0270q3432K8096J3353m235p3069m3054J00023R8278
$$ plain form
14754 125887 164174 90307 61703 45873 -40324 -33623 -7623 -30509 -78017 -141529 -242967
14743 -242967 -256632 -164523 -25041 -2340 -2578 -39226 -45425 -74117 -151931 -100513 -50134 24990
14731 24990 18251 41491 20538 5356 39263 -29439 -83030 -108829 32493 86885 102846 89834
14719 89834 153641 56704 41048 118744 113178 125129 69884 93084 177367 338318 496340
14708 496340 439905 340283 337440 303715 360749 454638 356610 328174 202170 210973 153699 50442
14696 50442 89778 169963 92920 110993 144684 50478 -65065 -42244 -12434 -60114 -160845
14685 -160845 -21561 62897 14542 -95434 -241931 -195293 -97966 -36604 -11453 124702 167745
14674 167745 170591 171430 277005 107018 -74743 -133373 -158754 -138981 -25208 13850 -48212
$$ packed form
14754A25887L8287p3867k8604j5830q6197O701K6000k2886m7508o3512j01438
14743b42967j3665R2109J39482K2701k38l6648o199k8692p7814N1418N0379P5124
14731B4990o739K3240k0953j5182L3907o8702n3591k5799J41322N4392J5961j3012
14719H9834O3807r6937j5656P7696n566J1951n5245K3200Q4283J60951J58022
14708D96340n6435r9622k843l3725N7034R3889r8028k8436j26004Q803n7274j03257
14696E0442L9336Q0185p7043J8073L3691r4206j15543K2821K9810m7680j00731
14685a60845J39284Q4458m8355j09976j46497M6638R7327O1362K5151J36155M3043
14674A67745K846Q39J05575j69987j81761n8630k5381J9773J13773L9058o2062
$$ plain form
14663 -48212 -207350 -222014 -91868 -77402 -167849 -193192 -162470 -48881 -12935 -113084 -140676
14652 -140676 -146784 -186701 -214936 -289990 -247408 -194826 -120403 -151943 -188011 -68721 -88076
14641 -88076 -46644 1791 -60650 -61943 -141282 -142590 -88066 -76006 17750 85399 2970 43386
14629 43386 219652 187803 52997 -30035 -80425 -159309 -272241 -198549 -118954 -121695 -175564
14618 -175564 -126484 -82333 38719 85072 -17503 -25212 -40038 92792 179171 166745 114168
14607 114168 62586 88155 138267 190845 133336 94176 -15985 -77404 -39407 -19763 1687
14596 1687 -19949 17237 -8935 -55445 -4808 133359 227103 161611 -32499 -89425 -104642
14585 -104642 -83633 -38538 -75304 -123899 -76470 -389 97105 52298 53896 54533 -67128 -78042
$$ packed form
14663d8212j59138j4664J30146J4466r0447k5343L0722J13589L5946j00149k7592
14652a40676o108l9917k8235p5054M2582N2582P4423l1540l6068J19290j9355
14641h8076M1432M8435o2441j293p9339j308N4524J2060R3756O7649q2429M0416
14629D3386J76266l1849j34806q3032n0390p8884j12932P3692P9595k741n3869
14618a75564M9080M4151J21052M6353j02575p709j4826J32830Q6379j2426n2577
14607A14168n1582K5569N0112N2578n7509l9160j10161o1419L7997J9644K1450
14596A687k1636L7186k6172m6510N0637J38167R3744o5492j94110n6926j5217
14585a04642K1009M5095l6766m8595M7429P6081R7494m4807J598O37j21661j0914
$$ plain form
14573 -78042 -136718 -172314 -131425 -201470 -181859 -165805 -196358 -184102 -249839 -234395 -106350
14562 -106350 75866 151080 115556 106326 78381 -6937 -31103 -2765 -12951 -51908 -26302
14551 -26302 41102 -174396 -357763 -385870 -344783 -319135 -204833 -123651 -64607 -87963 -44658
14540 -44658 109919 118948 -26974 -136785 -204486 -190666 -191471 -241662 -326517 -369071 -335984 -110666
14528 -110666 -9826 -5404 7804 -10253 29553 -40451 -68763 -174667 -158742 50219 106339
14517 106339 122458 -48074 -46479 18077 85089 53120 -104950 -124035 -156866 -188572 -143358
14506 -143358 -133817 -107457 -79652 -81726 -132749 -108833 -172597 -233288 -207233 -173489 -133023 -99426
14494 -99426 -171529 -142449 -60334 -10659 -55509 -53199 -64267 -179114 -197684 -185902 -157671 -95942
$$ packed form
14573g8042n8676l5596M0889p0045J9611J6054l0553J2256o5737J5444J28045
14562a06350J82216P5214l5524r230k7945q5318k4166K8338j0186l8957K5606
14551b6302O7404k15498j83367k8107M1087K5648J14302Q1182N9044k3356M3305
14540d4658J54577R029j45922j09811o7701J3820q05n0191q4855m2554L3087K25318
14528a10666J00840M422J3208j8057L9806p0004k8312j05904J5925K08961N6120
14517A06339J6119j70532J595O4556O7012l1969j58070j9085l2831l1706M5214
14506a43358R541K6360K7805k074n1023K3916o3764o0691K6055L3744M0466L3597
14494i9426p2103K9080Q2115M9675m4850K310j1068j14847j8570J1782K8231O1729
$$ plain form
14482 -95942 -102559 -44085 -3015 19717 -18228 -68211 -131978 -162066 -73622 -156035 -241675 -56024
14470 -56024 53079 28468 -28696 -215851 -214150 -75020 6472 -23136 -185275 -215689 -64181
14459 -64181 103976 74107 73729 150115 134344 62948 -116696 -148119 -45748 67890 5409
14448 5409 1008 -47579 -177667 -290660 -303969 -155729 -99790 -145949 -125990 -129316 -66842 69237
14436 69237 126525 104447 51922 31051 -53291 -73756 62536 17855 -68142 -40831 65518
14425 65518 155306 46818 -68833 -116274 -16603 -20218 -34790 -40853 -35587 -46243 -79932 -259612
14413 -259612 -277938 -183051 -107739 -92376 -92643 -165887 -111069 20346 113759 36685 -118115
14402 -118115 -160454 -52569 30945 -118657 -67033 -70695 -175509 -85792 -29272 -103297 -215091
$$ packed form
14482i5942o617N8474M1070K2732l7945m9983o3767l0088Q8444q2413q5640J85651
14470e6024J09103k4611n7164j87155J701J39130Q1492k9608j62139l0414J51508
14459f4181J68157k9869l78P6386j5771p1396j79644l1423J02371J13638o2481
14448E409m401m8587j30088j12993j3309J48240N5939m6159J9959l326O2474J36079
14436F9237N7288k2078n2525k0871q4342k0465J36292m4681q5997K7311J06349
14425F5518Q9788j08488j15651m7441R9671l615j4572o063N266j0656l3689j79680
14413b59612j8326R4887P5312J5363k67p3244N4818J31415R3413p7074j54800
14402a18115m2339J07885Q3514j49602N1624l662j04814Q9717N6520p4025j11794
$$ plain form
14391 -215091 -209899 -61026 -25624 -18710 95511 44859 44830 -20581 -5896 50753 155494 141217
14379 141217 57833 -24586 -47393 13822 -32109 -143979 -99072 -217783 -309237 -217409 -155104
14368 -155104 -171001 -202632 -173841 -107493 -172851 -190952 -187003 -112976 -87594 -117251 -154688 -71735
14356 -71735 102777 187019 146671 133437 64769 22229 65570 170869 263833 238356 132800
14345 132800 103632 171643 118786 25071 61006 74491 27356 19087 143621 205771 225981
14334 225981 113676 12161 6028 -6538 -88252 -10457 54823 74999 -66812 -94673 -55971
14323 -55971 52565 109221 98909 62318 138719 97015 29257 12856 -39620 -68910 -74412 -139107
14311 -139107 -143145 -132031 -71530 -70619 -56505 -123645 -270449 -133115 -10286 63178 33460
$$ packed form
14391b15091N192J48873L5402O914J14221n0652k9o5411J4685N6649J04741j4277
14379A41217q3384q2419k2807O1215m5931j11870M4907j18711r1454R1828O2305
14368a55104j5897l1631K8791O6348o5358j8101L949P4027K5382k9657l7437Q2953
14356g1735J74512Q4242m0348j3234o8668m2540M3341J05299R2964k5477j05556
14345A32800k9168O8011n2857r3715L5935J3485m7135q269J24534O2150K0210
14334B25981j12305j01515o133j2566q1714P7795O5280K0176j41811k7861L8702
14323e5971J08536N6656j0312l6591P6401m1704o7758j6401n2476k9290n502o4695
14311a39107m038J1114O0501R11J4114o7140j46804J37334J22829P3464k9718
$$ plain form
14300 33460 -51560 -114371 -34072 66653 -4587 -15195 -8760 3361 27212 -38143 -49358 -207835
14288 -207835 -123857 108970 58585 -29873 -114750 -127759 -82094 67973 29375 31717 11163
14277 11163 35892 -82122 -164197 50665 227144 288206 305611 157653 -9862 16012 18824
14266 18824 -95898 -110339 -220082 -232494 -142358 -67737 -63155 134 -45124 -134361 -109899
14255 -109899 -2205 -57730 -69733 -31607 -84657 -234358 -170884 -104307 -2100 101240 103824
14244 103824 91148 186464 253781 286709 316617 292160 233788 318530 343783 458305 619164
14233 619164 915394 1321905 1630343 2080398 2428994 2602520 2786088 2717243 2604663 2406683
14223 2406683 1959773 1590735 1337202 991811 719674 637488 636038 463469 347894 340860
$$ packed form
14300C3460q5020o2811Q0299J00725p1240j0608O435J2121K3851o5355j1215j58477
14288b07835Q3978K32827n0385q8458q4877j3009M5665J50067l8598K342k0554
14277A1163K4729j18014q2075K14862J76479O1062J7405j47958j67515K5874K812
14266A8824j14722j4441j09743j2412R0136P4621M582O3289m5258q9237K4462
14255a09899J07694n5525j2003L8126n3050j49701O3474O6577J02207J03340K584
14244A03824j2676R5316O7317L2928K9908k4457n8372Q4742K5253J14522J60859
14233F19164K96230M06511L08438M50055L48596J73526J83568o8845j12580j97980
14223B406683m46910l69038k53533l45391k72137q2186j450j72569j15575p034
$$ plain form
14213 340860 377620 365554 357236 293498 251466 263946 206748 201642 246809 298318 219693 116365
14201 116365 52185 118617 187786 159694 31678 -29278 -58727 -8160 131817 102772 59597
14190 59597 145467 121695 69219 11169 -20272 -19119 -19591 -5947 -34950 37291 214493 316492
14178 316492 260918 238233 195017 82099 34976 50254 31189 12838 35262 29913 52954
14167 52954 42544 82106 -50490 -43032 -39396 -77365 -65672 -23602 91894 147009 83729 159317
14155 159317 131739 95878 87966 144536 67663 34554 165118 112130 18253 48228 31567
14144 31567 41329 35626 36766 -11864 27024 126736 164070 165489 254667 195250 29971 -39640
14132 -39640 -95991 -84149 41634 515 -112889 -184659 -284369 -242067 -150653 -32110 -34637
$$ packed form
14213C40860L6760j2066q318o3738m2032J2480n7198n106M5167N1509p8625j03328
14201A16365o4180O6432O9169k8092j28016o0956k9449N0567J39977k9045m3175
14190E9597Q5870k3772n2476n8050l1441J153m72J3644k9003P2241J77202J01999
14178C16492n5574k2685m3216j12918m7123J5278j9065j8351K2424n349K3041
14167E2954j0410L9562j32596P458L636l7969J1693M2070J15496N5115o3280P5588
14155A59317k7578l5861p912N6570p6873l3109J30564n2988r3877K9975j6661
14144C1567R762n703J140m8630L8888R9712L7334J419Q9178n9417j65279o9611
14132c9640n6351J1842J25783m1119j13404p1770r9710M2302R1414J18543k527
$$ plain form
14121 -34637 -9134 60230 46106 -111950 -202200 -71313 89229 38810 -7450 68594 37625
14110 37625 -20555 26049 -31884 -35685 -57250 -97093 2157 113179 192981 284496 308274 221203
14098 221203 104153 -21972 148815 183246 86870 20928 8677 -66923 -65729 -78269 -91904
14087 -91904 -86608 -160229 -125652 -121445 -68361 -121452 -86253 -115911 -48982 -7394 -71714 -112333
14075 -112333 -40202 19245 22653 161726 267594 137850 94439 33960 37323 30869 -10759
14064 -10759 18855 -61896 -63338 -122 6308 -39820 26701 89913 30549 -68872 -50918 98553
14052 98553 201437 139247 -62204 -174766 -120655 -29010 17738 -8325 116002 193915 255709
14041 255709 181257 115896 52629 73099 150154 163647 35055 -112864 -111372 -130075 -116502
$$ packed form
14121c4637K5503O9364j4124j58056r0250J30887J60542n0419m6260P6044l0969
14110C7625n8180M6604n7933l801k1565l9843R9250J11022P9802R1515K3778q7071
14098B21203j17050j26125J70787L4431r6376o5942j2251p5600J194j2540j3635
14087i1904N296p3621L4577M207N3084n3091L5199k9658O6929M1588o4320m0619
14075a12333P2131N9447L408J39073J05868j29744m3411o0479L363o454m1628
14064a0759K9614q0751j442O3216O430m6128O6521O3212n9364r9421J7954J49471
14052I8553J02884o2190k01451j12562N4111R1645M6748k6063J24327P7913O1794
14041B55709p4452o5361o3267K0470P7055J3493j28592j47919J492j8703J3573
$$ plain form
14030 -116502 -101088 -102942 -26505 54789 41188 -14779 -25889 -94114 -101587 -188872 -80042 17217
14018 17217 33087 10105 -107601 -20162 -171270 -198401 -44565 47118 109349 78401 31686
14007 31686 140786 82833 95604 30554 11032 -90054 -74950 50914 66625 75556 199734
13996 199734 280494 242507 158262 80914 -5388 -54237 -101757 -114682 -180363 -197127 -96267
13985 -96267 -34382 -63028 -57647 -51307 -52194 -50708 23064 27026 -13021 -81964 -133339 -81904 139388
13972 139388 122342 24241 70159 75529 79655 113899 48102 113961 128815 77422 43184 24587
13960 24587 51074 113532 103180 8638 43339 73765 -19185 56167 67616 22770 92355 107689
13948 107689 -1989 -64887 87240 88433 -17078 31794 209582 181845 172294 103427 87852
$$ packed form
14030a16502J5414j854P6437Q1294j3601n5967j1110o8225p473q7285J08830R7259
14018A7217J5870k2982j17706Q7439j51108k7131J53836R1683O2231l0948m6715
14007C1686J09100n7953J2771o5050j9522j01086J5104J25864J5711Q931J24178
13996A99734Q0760l7987q4245p7348q6302m8849m7520j2925o5681j6764J00860
13985i6267O1885k8646N381O340q87J486P3772L962m0047o8943n1375N1435K21292
13972A39388j7046r8101M5918N370M126L4244o5797O5859J4854n1393l4238j8597
13960B4587K6487O2458j0352r4542L4701L0426r2950P5352J1449m4846O9585J5334
13948A07689j09678o2898J52127J193j05511M8872J77788k7737r551o8867j5575
$$ plain form
13937 87852 140026 219640 313454 209595 56524 64095 12324 -17724 15324 90273 91407 -36895
13925 -36895 -51957 -103718 -50673 -14003 -52198 -9650 -11773 -46002 -53384 -45883 73768 82631
13913 82631 29651 -51611 -34413 30874 -27437 -76962 -72264 -84751 -144552 -90582 -2787 30208
13901 30208 -49588 -67624 33988 68254 -24538 -36788 -62595 -89270 -4472 54191 -36870
13890 -36870 1677 38382 -28945 -151201 -133400 -15937 88342 52574 6361 -65487 -57087
13879 -57087 -66194 -34125 -65919 -15744 170855 134886 91754 93726 40609 58275 54752 49413
13867 49413 90759 13356 -77197 -52994 60304 37329 34525 135654 142565 220004 251160 217694
13855 217694 -13497 -39820 -71823 -74717 -142082 -74123 93594 128432 -25930 -34253 62410
$$ packed form
13937H7852N2174P9614R3814j03859j53071P571n1771l0048L3048P4949J134j28302
13925c6895j5062n1761N3045L6670l8195M2548k123l4229p382P501J19651Q863
13913H2631n2980q1262J7198O5287n8311m9525M698j2487n9801N3970Q7795L2995
13901C0208p9796j8036J01612L4266r2792j2250k5807k6675Q4798N8663r1061
13890c6870L8547L6705o7327j22256J7801J17463J04279l5768m6213p1848Q400
13879e7087r107L2069l1794N0175J86599l5969m3132J972n3117J7666l523n339
13867D9413M1346p7403r0553K4203J13298k2975k804J01129O911P7439L1156l3466
13855B17694k31191k6323l2003k894o7365O7959J67717L4838j54362q323R6663
$$ plain form
13844 62410 67014 96202 173022 167988 130839 132454 53778 14282 93068 134893 177472 256790
13832 256790 81553 69279 68290 7404 363 65369 44540 81560 78080 143979 180965 217303
13820 217303 155788 97732 93476 35854 64622 64003 -2920 -52696 -1132 -62961 30985 80311
13808 80311 199961 141935 68318 38550 84738 124910 96703 -118483 -202836 -64106 -99287
13797 -99287 -35389 -31196 -66493 -265262 -314667 -300632 -301917 -206016 -56947 -11480 -78352 -148042
13785 -148042 -125963 -25528 28972 85953 34333 145384 115286 49412 14496 -40061 -170493
13774 -170493 -123673 -77472 -39757 48772 -16064 -84346 -89700 -104180 -26514 -46864 -178033
13763 -178033 -64688 34438 -23767 -125628 51155 162676 117500 39860 -25173 -92763 -75150
$$ packed form
13844F2410M604K9188P6820n034l7149J615p8676l9496P8786M1825M2579P9318
13832B56790j75237j2274r89o0886p041O5006k0829L7020l480O5899L6986L6338
13820B17303o1515n8056m256n7622K8768o19o6923m9776N1564o1829R3946M9326
13808H0311J19650n8026p3617k9768M6188M0172k8207k15186q4353J38730l5181
13797i9287O3898M193l5297j98769m9405J4035j285R5901J49069M5467o6872o9690
13785a48042K2079J00435N4500N6981n1620J11051l0098o5874l4916n4557j30432
13774a70493M6820M6201L7715Q8529o4836o8282n354j4480P7666k0350j31169
13763a78033J13345R9126n8205j01861J76783J11521m5176p7640o5033o7590J7613
$$ plain form
13752 -75150 59698 31121 30491 81582 125697 150690 129229 46926 -49585 -68685 -76592 7276
13740 7276 20405 -22567 -147110 -213221 -165324 -64116 -39720 26965 22554 32619 -5880 -134259
13728 -134259 -124641 57070 128164 78439 8034 33639 86049 -12517 -133883 -88861 -36995
13717 -36995 -47759 -82835 -120972 -114011 -69706 -29916 -77388 -158411 -223312 -168050 -24895 -473
13705 -473 -19504 -136974 -163255 -177320 -139022 -92336 57845 -100490 -224982 -310660 -290001
13694 -290001 -65979 11095 -87955 -141656 -73741 -84967 -115822 -7745 131332 189101 142558
13683 142558 -30067 -110946 -88557 -37173 -16518 14979 -11359 -17135 724 154460 156973
13672 156973 54319 862 -5012 18596 59553 30937 102060 59653 -1605 4086 107127
$$ packed form
13752g5150J34848k8577o30N1091M4115K4993k1461q2303r6511j9100p907Q3868
13740G276J3129m2972j24543o6111M7897J01208K4396O6685m411J0065l8499j28379
13728a34259R618J81711P1094m9725p0405K5605N2410r8566j21366M5022N1866
13717c6995j0764l5076l8137O961M4305L9790m7472q1023o4901N5262J43155K4422
13705d73j9031j17470k6281j4065L8298M6686J50181j58335j24492q5678K0659
13694b90001K24022P7074r9050n3701O7915j1226l0855J08077J39077N7769m6543
13683A42558j72625q0879K2389N1384K0655L1497k6338n776J7859J53736K513
13672A56973j02654n3457n874K3608M0957k8616P1123m2407o1258N691J03041
$$ plain form
13661 107127 105957 100022 136786 247676 277449 242505 146564 201249 99241 10175 -116578
13650 -116578 -170645 -61851 -46046 -37828 -74362 60902 106845 22901 -42264 -38198 128521
13639 128521 223634 147439 64864 80146 -153 123968 122516 -39276 -97711 -138173 1633
13628 1633 16197 57712 59534 -42649 -37162 -41401 -99026 -147562 -9537 49884 -136486 -71226
13616 -71226 61541 109151 139013 31580 35574 59343 23880 78094 64075 44336 12967
13605 12967 15984 -19723 -20664 37937 19843 64170 25597 -113417 74608 28632 -86097 -43311
13593 -43311 -68106 58165 138959 120368 196795 162549 33931 16082 65814 -78011 -37409
13582 -37409 -2861 26998 59263 25641 9610 229137 306293 191048 96989 120724 175383
$$ packed form
13661A07127j170n935L6764J10890K9773l4944r5941N4685j02008q9066j26753
13650a16578n4067J08794J5805Q218l6534J35264M5943q3944o5165M066J66719
13639A28521R5113p6195q2575J5282q0299J24121j452j61792n8435m0462J39806
13628A633J4564M1515J822j02183N487m239n7625m8536J38025N9421j86370O5260
13616g1226J32767M7610K9862j07433L994K3769l5463N4214j4019j9739l1369
13605A2967L017l5707r41N8601j8094M4327l8573j39014J88025m5976j14729M2786
13593d3311k4795J26271Q0794j8591P6427l4246j28618j7849M9732j43825M0602
13582c7409L4548K9859L2265l3622j6031K19527P7156j15245r4059K3735N4659
$$ plain form
13571 175383 49568 -42242 29200 87658 -13260 -51505 -36293 -104636 -2846 176937 229199
13560 229199 69278 -81128 -139239 -159647 -114758 -44279 43739 -18650 -17528 5068 -9046
13549 -9046 -29305 -64254 48354 50202 40286 95941 172354 191390 119761 51569 25393 48982
13537 48982 56169 109158 73815 137090 47290 -54997 -99087 13305 4083 31857 121575 77069
13525 77069 27679 34815 -26252 1235 -17021 -105231 -114052 -63276 -107074 -116432 -13776 47989
13513 47989 -24001 -5224 100968 26564 -79883 -86323 -772 19559 -23746 85768 169846
13502 169846 137715 43529 57046 134854 40103 -16678 -101805 -59930 -104603 -141966 -44487
13491 -44487 9772 67350 147558 162363 195425 89855 19232 -35681 -81263 -15868 63510
$$ packed form
13571A75383j25815r1810P1442N8458j00918l8245J5212o8343J01790J79783N2262
13560B29199j59921j50406n8111k0408M4889P0479Q8018o2389J122K2596j4114
13549i046k0259l4949J12608J848r916N5655P6413J9036p1629o8192k6176K3589
13537D8982P187N2989l5343O3275q9800j02287m4090J12392r222K7774Q9718m4506
13525G7069m9390P136o1067K7487j8256q8210q821N0776m3798r358J02656O1765
13513D7989p1990J8777J06192p4404j06447o440Q5551K0331m3305J09514Q4078
13502A69846l2131r4186J3517P7808r4751n6781q5127M1875m4673l7363R7479
13491d4487N4259N7578Q0208J4805L3062j05570p0623n4913m5582O5395P9378
$$ plain form
13480 63510 55943 129109 66695 -17570 41191 112612 28107 -57266 -96091 -49961 -76247 35226
13468 35226 37469 -56160 2480 127307 219666 173559 85259 14183 6221 65863 105527 66187
13456 66187 -19743 47120 104256 57094 -22379 -74714 -66388 -123018 8392 -24527 -18362 7779
13444 7779 -93211 -183639 -118421 32958 -10413 -69970 9108 85887 138073 171728 256760
13433 256760 334047 207814 157404 100062 143897 127200 113176 38939 25318 69096 23166
13422 23166 -80025 -34293 31770 26882 136395 73371 104517 233077 247417 132735 104330
13411 104330 118618 142299 100626 49359 94272 -7960 1450 -24352 8409 31148 68440
13400 68440 85835 -6807 -52276 -89441 -27476 39943 58824 60417 -152005 -116571 26774
$$ packed form
13480F3510p567P3166o2414q4265N8761P1421q4505q5373l8825M6130k6286J11473
13468C5226K243r3629N8640J24827R2359m6107q8300p1076p962N9642L9664l9340
13456F6187q5930O6863N7136m7162p9473n2335Q326n6630J31410l2919O165K6141
13444G779j00990r0428O5218J51379m3371n9557P9078P6779N2186L3655Q5032
13433B56760P7287j26233n0410n7342M3835j6697j4024p4237j3621M3778m5930
13422B3166j03191M5732O6063m888J09513o3024L1146J28560J4340j14682k8405
13411A04330J4288K3681m1673n1267M4913j02232R410k5802L2761K2739L7292
13400F8440J7395r2642m5469l7165O1965O7419J8881J593k12422L5434J43345
$$ plain form
13389 26774 112082 166258 201519 161463 164797 251627 247714 138964 -50486 -109096 -96979 -182279
13377 -182279 -165543 -16843 3730 -73564 -106447 -167270 -236872 -132309 -72240 -166064 -107292
13366 -107292 -83505 8392 -13665 -36388 61829 128363 159294 85174 -116954 -166860 -116194
13355 -116194 -96890 -112683 -233163 -261929 -157065 -136865 -128716 -140407 -98054 -51831 -44994
13344 -44994 -1787 -53892 8153 -121359 -299629 -362423 -273347 -118509 -40678 -47803 2624
13333 2624 -5575 -54528 -12443 52324 56939 102426 121230 22485 -112684 -143478 5608 -53425
13321 -53425 10100 28718 72762 156858 101179 -17144 -102965 -92018 6424 103696 60023
13310 60023 9214 -58095 50679 9955 -38480 -22531 -11461 50811 31268 45474 20253
$$ packed form
13389B6774Q5308N4176L5261m0056L334Q6830l913j08750j89450n8610J2117q5300
13377a82279J6736J48700K0573p7294l2883o0823o9602J04563O0069r3824N8772
13366a07292K3787R1897k2057k2723R8217O6534L0931p4120k02128m9906N0666
13355a16194J9304j5793j20480k8766J04864K0200Q149j1691M2353M6223O837
13344d4994M3207n2105O2045j29512j78270o2794Q9076J54838P7831p125N0427
13333B624q199m8953M2085O4767M615M5487J8804r8745j35169l0794J49086n9033
13321e3425O3525J8618M4044Q4096n5679j18323q5821J0947R8442R7272m3673
13310F0023n0809o7309J08774m0724m8435J5949J1070O2272j9543J4206k5221
$$ plain form
13299 20253 -20880 -958 40218 116704 53211 76197 145043 127481 59347 84706 141387 198498
13287 198498 75236 -711 195930 205004 40498 -39569 -51293 -84358 -46313 82383 25692
13276 25692 43332 -35030 -99293 -138859 -167654 -156655 -141868 -57331 -72513 -125638 -20572
13265 -20572 101862 165902 198527 169935 -5691 -95748 -23848 -100068 -51008 13734 -55715
13254 -55715 -155015 -162102 -99513 70214 200625 163923 75488 10835 76009 64881 -30711
13243 -30711 -77769 -16260 153589 98037 92224 157651 110337 -9544 34385 51702 55637 102996
13231 102996 102742 141681 160032 -47976 -54013 -16617 82405 90721 -104397 -181191 -41367 42840
13219 42840 92841 169639 122292 210799 118406 167078 75301 35302 69878 -9302 -89432 -64617
$$ packed form
13299B0253m1133J9922M1176P6486o3493K2986O8846j7562o8134K5359N6681N7111
13287A98498j23262p5947J96641R074j64506q0067j1724l3065L8045J28696n6691
13276B5692J7640p8362o4263l9566k8795J0999J4787Q4537j5182n3125J05066
13265b0572J22434O4040L2625k8592j75626r0057P1900p6220M9060O4742o9449
13254e5715r9300p087O2589J69727J30411l6702q8435o4653O5174j1128r5592
13243c0711m7058O1509J69849n5552n813O5427m7314j19881M3929J7317L935M7359
13231A02996k54L8939J8351k08008o037L7396R9022Q316j95118p6794J39824Q4207
13219D2840N0001P6798m7347Q8507r2393M8672r1777l9999L4576p9180q0130K4815
$$ plain form
13207 -64617 -27119 -80851 195 10702 33780 -24330 -26651 67306 79875 34296 89756 158329
13195 158329 64919 -46591 -28478 73855 137730 -15096 -62004 82654 15291 33532 104558
13184 104558 1914 -21786 16831 -18706 -99720 -97899 -60168 40968 45493 74550 11505
13173 11505 -102751 -115567 25090 164386 186022 115758 95237 140091 154679 123238 164191
13162 164191 172585 130440 75341 91385 19009 34838 136623 207520 137282 56251 -2643
13151 -2643 -44169 -77668 -19004 -57478 -176541 -29983 52404 100063 -38918 -26153 44394
13140 44394 26314 -34375 -131280 -79702 -62734 -63635 -44028 -60846 -28183 -57450 -99610 -163140
13128 -163140 -172137 -208315 -87429 49229 39937 120631 61697 91834 202234 137125 219467
$$ packed form
13207f4617L7498n3732Q1046J0507K3078n8110k321R3957J2569m5579N5460O8573
13195A58329r3410j11510J8113J02333O3875j52826m6908J44658o7363J8241P1026
13184A04558j02644k3700L8617l5537q1014J821L7731J01136M525K9057o3045
13173A1505j14256j2816J40657J39296K1636p0264k0521M4854J4588l1441M0953
13162A64191Q394m2145n5099J6044p2376J5829J01785P0897p0238q1031n8894
13151b643m1526l3499N8664l8474j19063J46558Q2387M7659j38981J2765P0547
13140D4394j8080o0689r6905N1578J6968r01J9607j6818L2663k9267m2160o3530
13128a63140q997l6178J20886J36658r292Q0694n8934L0137J10400o5109Q2342
$$ plain form
13117 219467 185040 38341 78638 146462 159233 225324 224340 270244 309917 214194 224854 151124
13105 151124 81672 128420 207704 204572 79025 143144 166508 230739 180482 52851 5056
13094 5056 72558 101869 131659 165563 109751 6826 -27140 -36926 35741 127928 162245 188590
13082 188590 119010 61740 135932 145860 63411 -27822 -41232 6663 42553 -6682 75422 11416
13070 11416 77035 93745 103878 272647 320326 306335 163737 81550 -1587 19433 -51848
13059 -51848 -119823 -47567 4454 -253 77337 18468 -83603 -72113 -62272 -17458 -96922 -64897
13047 -64897 34259 75303 62154 59535 111852 39506 -28447 -111974 -15634 -34861 -17956 -60807
13035 -60807 -65546 -10893 -73435 -137748 -173561 -47994 -21242 -25035 89232 216383 184752
$$ packed form
13117B19467l4427j46699M0297O7824J2771O6091r84M5904L9673r5723J0660p3730
13105A51124o9452M6748P9284l132j25547O4119K3364O4231n0257j27631m7795
13094E056O7502K9311K9790L3904n5812j02925l3966r786P2667R2187L4317K6345
13082A88590o9580n7270P4192R928q2449r1233j3410M7895L5890m9235Q2104o4006
13070A1416O5619J6710J0133J68769M7679j3991j42598q2187q3137K1020p1281
13059e1848o7975P2256N2021m707P7590n8869j02071J1490R841M4814p9464L2025
13047f4897R9156M1044j3149k619N2317p2346o7953q3527R6340j9227J6905m2851
13035f0807m739N4653o2542o4313l5813J25567K6752l793J14267J27151l1631
$$ plain form
13024 184752 127079 141164 177948 182851 200697 154337 103832 107403 228937 211046 249991 218270
13012 218270 202591 258623 215650 41590 -33392 25337 36550 164917 292850 229704 173494
13001 173494 62349 71486 20945 -68224 -69866 -67745 -62846 8838 39241 82191 20116 25658
12989 25658 137736 91126 -3816 59292 98255 31673 7915 29241 17476 -53069 13468
12978 13468 32293 25640 12253 -35603 -7510 38131 82327 105848 82511 -21195 81316
12967 81316 38967 -59370 50262 46341 33796 24677 -16754 59103 92795 33186 -87703 8931
12955 8931 81286 178521 -18173 12149 143148 107511 -1437 -93928 -87197 25344 80015
12944 80015 8448 23362 -29037 -30187 46285 46889 23895 -70191 -92020 -90973 -135708 -138381 -137188
$$ packed form
13024A84752n7673J4085L6784M903J7846m6360n0505L571J21534j7891L8945l1721
13012B18270j5679N6032m2973j74060p4982N8729J1213J28367J27933o3146n6210
13001A73494j11145R137n0541q9169j642K121M899P1684L0403M2950o2075N542
12989B5658J12078m6610r4942O3108L8963o6582k3758K1326j1765p0545O6537
12978A3468J8825o653j3387m7856K8093M5641M4196K3521k3337j03706J02511
12967H1316m2349r8337J09632l921j2545r119m1431P5857L3692n9609j20889R6634
12955H931P2355R7235j96694L0322J30999l5637j08948r2491O731J12541N4671
12944H0015p1567J4914n2399j150P6472O04k2994r4086k1829J047m4735k673J193
$$ plain form
12931 -137188 -42803 47094 107194 133104 223158 240223 204130 208804 176084 259594 245833 262887
12919 262887 257064 192254 32512 -23829 -70186 -85872 -109855 -121423 -52585 23146 73474
12908 73474 110576 137190 280844 306898 196819 136474 34432 -8815 2998 53469 74811
12897 74811 -28896 -52057 31069 -17627 19147 68269 100023 48839 61484 55858 224966
12886 224966 320323 334974 323363 281771 149222 85868 -4242 4312 2546 -24428 8759 109424
12874 109424 230743 87179 79585 54952 54139 -84863 -75226 -57937 -95505 -143440 -58696 51420
12862 51420 93565 220312 273902 233273 144564 75790 -15722 26710 9502 -38200 -51340
12851 -51340 105256 241924 279102 148808 29698 -45382 12705 221754 323691 262237
$$ packed form
12931a37188R4385Q9897O0100K5910R0054J7065l6093M674l2720Q3510j3761J7054
12919B62887n823o4810j59742n6341m6357j5686k3983j1568O8838P5731N0328
12908G3474L7102K6614J43654K6054j10079o0345j02042m3247J1813N0471K1342
12897G4811j03707k3161Q3126m8696L6774M9122L1754n1184J2645n626J69108
12886B24966R5357J4651j1611m1592j32549o3354r0110Q554j766k6974L3187J00665
12874A09424J21319j43564p594k4633q13j39002R637J7289l7568m7935Q4744J10116
12862E1420M2145J26747N3590m0629q8709o8774r1512M2432j7208m7702j3140
12851e1340J56596J36668L7178j30294j19110p5080N8087K09049J01937o1454
$$ plain form
12841 262237 238376 197331 119389 119382 129834 94980 208811 195367 -17672 -98751 -110626 -71299
12829 -71299 23103 106573 171999 116876 22463 -33158 -55908 5485 89681 156796 144525 48686
12817 48686 37508 70141 31464 -28399 13237 -102896 -203737 -293541 -207284 -117702 65300
12806 65300 206304 181660 123206 68485 84508 -943 -16176 82915 5851 -135576 -100854
12795 -100854 8469 -10951 -6403 164798 244780 130903 75451 119481 155384 191871 83898
12784 83898 4819 42814 -16060 36373 8599 -16900 86181 206208 306263 216207 173560
12773 173560 213123 268343 220201 144701 107666 24680 33430 38643 25657 -19887 -13758 14270
12761 14270 4608 42277 91245 212473 239945 210098 184103 59562 -33735 24726 159602
$$ packed form
12841B62237k3861m1045p7942pJ0452l4854J13831j3444k13039q1079j1875L9327
12829g1299R4402Q3470O5426n5123r4413n5621k2750O1393Q4196O7115j2271r5839
12817D8686j1178L2633l8677n9863M1636j16133j00841q9804Q6257Q9582J83002
12806F5300J41004k4644n8454n4721J6023q5451j5233R9091p7064j41427L4722
12795a00854J09323j9420M548J71201P9982j13877n5452M4030L5903L6487j07973
12784H3898p9079L7995n8874N2433k7774k5499J03081J20027J00055r0056m2647
12773A73560L9563N5220m8142p5500l7035q2986Q750N213j2986m5544O129K8028
12761A4270r662L7669M8968J21228K7472k9847k5995j24541r3297N8461J34876
$$ plain form
12750 159602 163247 151985 145227 85652 7533 62106 250660 284018 168482 46058 107444
12739 107444 236837 116490 52644 127328 195854 220093 177234 123331 33810 216745 238329
12728 238329 243552 170966 106622 26624 154902 223746 203059 275004 301659 238367 158846
12717 158846 27209 -37082 -146952 -150816 -132527 40227 241003 347593 401779 401834 383950
12706 383950 341458 246874 321388 370068 275939 276522 213125 123293 112197 189053 177044 227668
12694 227668 147539 167507 210680 166390 31740 92792 152844 36729 -75133 68689 119627
12683 119627 129074 133315 246483 316477 297696 178139 47824 102508 228670 207674 183029
12672 183029 228992 249160 120814 52442 -35041 29747 171149 166299 133115 66913 60455
$$ packed form
12750A59602L645j1262o758n9575p8119N4573J88554L3358j15536j22424O1386
12739A07444J29393j20347o3846P4684O8526K4239m2859n3903q9521J82935K1584
12728B38329N223p2586o4344p9998J28278O8844k0687P1945K6655o3292p9521
12717A58846j31637o4291j09870l864J8289J72754K00776J06590N4186N5j7884
12706C83950m2492r4584P4514M8680r4129N83o3397q9832j1096P6856j2009N0624
12694B27668q0129J9968M3173m4290j34650O1052O0052j16115j11862J43822N0938
12683A19627R447M241J13168O9994j8781j19557j30315N4684J26162k0996k4645
12672A83029M5963K0168j28346o8372q7483O4788J41402m850l3184o6202o458
$$ plain form
12661 60455 96517 114416 240367 260147 205721 97499 -76103 -28536 133320 202750 108806
12650 108806 112198 219524 353066 453637 387857 167944 81823 44803 20096 49004 22528
12639 22528 42913 102374 202671 253256 300146 219592 180726 162944 261334 221435 153120
12628 153120 144252 74951 91067 311806 357346 215863 149153 223578 171023 160391 207317
12617 207317 141172 108872 59310 31492 59871 147444 172060 149633 122461 116517 110040 72079
12605 72079 103593 233604 173949 125748 195688 375902 387907 240035 220248 139395 93800
12594 93800 142402 104571 19819 -34988 133107 202900 242607 261401 228736 175024 199115
12583 199115 121759 91234 197960 318459 349774 330813 240680 188770 236176 268496 142318
$$ packed form
12661F0455L6062J7899J25951J9780n4426j08222j73602M7567J61856O9430r3944
12650A08806L392J07326J33542J00571o5780k19913q6121l7020k4707K8908k6476
12639B2528K0385N9461J00297N0585M6890q0554l8866j7782R8390l9899o8315
12628A53120q868o9301J6116K20739M5540j41483o6710P4425n2555j0632M6926
12617B07317o6145l2300m9562k7818K8379Q7573K4616k2427k7172n944o477l7961
12605G2079L1514J30011n9655m8201O9940J80214J2005j47872j9787q0853m5595
12594I3800M8602l7831q4752n4807J68095O9793L9707J8794l2665n3712K4091
12583A99115p7356l0525J06726J20499L1315j8961r0133n1910M7406L2320j26178
$$ plain form
12572 142318 132435 238722 242478 240298 155121 201887 302043 348463 205510 158618 262907
12561 262907 302922 80344 -4607 100753 221353 373229 350132 161014 130768 249576
12551 249576 197430 234223 305647 246154 189414 176050 157378 209452 97929 169721 255484
12540 255484 227034 268181 302639 265063 242430 325250 330559 275504 233390 245891 249931 143428
12528 143428 185385 242788 146879 69786 128190 286678 296944 281675 266105 231090 255195
12517 255195 246127 223032 114512 54952 106888 149510 175278 290268 270776 243202 166694
12506 166694 115198 126876 107785 65254 130846 233630 241851 199904 219019 270187 309759
12495 309759 328175 327498 269069 216222 81365 -22154 2902 120789 182637 227407 276589
$$ packed form
12572A42318r883J06287L756k180q5177M6766J00156M6420j42953m6892J04289
12561B62907M0015k22578q4951J05360J20600J51876k3097j89118l0246J18808
12551B49576n2146L6793P1424n9493n6740j3364j8672N2074j11523P1792Q5763
12540B55484k8450M1147L4458l7576k2633Q2820N309n5055m2114J2501M040j06503
12528A43428M1957N7403r5909p7093N8404J58488J0266j5269j5570l5015K4105
12517B55195r068k3095j08520n9560N1936M2622K5768J14990j9492k7574p6508
12506A66694n1496J1678j9091m2531O5592J02784Q221m1947J9115N1168L9572
12495C09759J8416o77n8429n2847j34857j03519K5056J17887O1848M4770M9182
$$ plain form
12484 276589 234307 222332 212232 215230 269184 308942 351513 312147 225379 246309 295727 254636
12472 254636 159197 129727 181560 256265 121273 53628 52826 40216 47573 57886 171932 146078
12460 146078 74518 48332 226915 398766 438731 348412 354991 282440 234596 275728 321520
12449 321520 278665 271572 217008 212970 243651 283518 334864 395098 451103 546614 593550 491375
12437 491375 518907 511607 423149 347470 339902 193889 164811 244802 331348 274443 304231 360845
12425 360845 313752 190470 59798 144039 229485 338548 344234 282805 206448 133622 205753
12414 205753 346479 339156 300421 266650 266539 354236 361297 384595 401770 468362 515147 477069
12402 477069 429740 468875 432722 414866 393357 338898 308895 341052 314598 280603 218661
$$ packed form
12484B76589m2282j1975j0100K998N3954L9758M2571l9366q6768K0930M9418m1091
12472B54636r5439k9470N1833P4705j34992o7645q02j2610P357J0313J14046k5854
12460A46078p1560k6186J78583J71851L9965r0319O579p2551m7844M1132M5792
12449C21520m2855p093n4564m038L0681L9867N1346O0234N6005R5511M6936j02175
12437D91375K7532p300q8458p5679p568j46013k9078P9991Q6546n6905K9788N6614
12425C60845m7093j23282j30672Q4241Q5446J09063N686o1429p6357p2826P2131
12414B05753J40726p323l8735l3771j11Q7697P061K3298J7175O6592M6785l8078
12402D77069m7329L9135l6153j7856k1509n4459l0003L2157k6454l3995o1942
$$ plain form
12391 218661 163610 222848 281909 237755 319982 409916 338893 388750 471945 522320 567474
12380 567474 581544 454500 322220 199363 318953 421569 340160 249442 256355 257624 246855
12369 246855 252893 302713 222292 214795 298029 321106 304950 381654 389947 420870 469836 429443
12357 429443 483136 388218 445043 423209 425254 395631 281877 259919 273385 326458 295017
12346 295017 234897 309478 285024 330319 353242 376159 454904 454870 404446 422108 403770 253383
12334 253383 320352 346543 351481 335554 274616 280421 216972 300757 287066 282420 311014 386667
12322 386667 437176 454362 387428 561464 745695 667393 574791 576184 579638 592635 448838
12311 448838 381735 241779 248061 437470 590443 502152 483539 581240 593038 604132 640605
$$ packed form
12391B18661n5051N9238N9061m4154Q2227Q9934p1023M9857Q3195N0375M5154
12380E67474J4070j27044j32280j22857J19590J02616q1409r0718O913J269j0769
12369B46855O038M9820q0421p497Q3234K3077j6156P6704Q293L0923M8966m0393
12357D29443N3693r4918N6825k1834K045k9623j13754k1958J3466N3073l1441
12346B95017o0120P4581k4454M5295K2923K2917P8745l4n0424J7662j8338j50387
12334B53383O6969K6191M938j5927o0938N805o3449Q3785j3691m646K8594P5653
12322C86667N0509J7186o6934J74036J84231p8302r2602J393L454J2997j43797
12311D48838o7103j39956O282J89409J52973q8291j8613R7701J1798J1094L6473
$$ plain form
12300 640605 670010 698734 740032 783021 692812 586504 633346 600876 591103 645371 620211
12289 620211 548576 386842 446324 556608 616007 629265 585196 547046 597870 533396 460037
12278 460037 480874 681644 794799 783820 702516 670752 667199 533965 434008 394955 396500
12267 396500 446483 447908 472690 495744 445765 467356 544344 517368 388100 369520 365354 377180
12255 377180 483546 621012 617810 637436 669457 664796 651706 623685 569478 502572 585446
12244 585446 672214 672438 641806 616283 661844 702630 657513 608400 641462 591963 529047 473997
12232 473997 438255 434692 593838 681063 675770 614586 622713 630207 607188 646478 747143 766630
12220 766630 760036 748398 650792 542245 682375 849163 912010 781303 646574 686961 872164
$$ packed form
12300F40605K9405K8724M1298M2989r0209j06308M6842l2470r773N4268k5160
12289F20211p1635j61734N9482J10284N9399J3258m4069l8150N0824o4474p3359
12278D60037K0837K00770J13155j0979q1304l1764l553j33234r9957l9053J545
12267C96500M9983J425K4782K3054m9979K1591P6988k6976j29268j8580m166J1826
12255C77180J06366J37466l202J9626L2021m661j3090k8021n4207o6906Q2874
12244E85446Q6768K24l0632k5523M5561M0786m5117m9113L3062m9499o2916n5050
12232D73997l5742l563J59146Q7225n293o1184Q127P494k3019L9290J00665J9487
12220G66630o594j1638r7606j08547J40130J66788O2847j30707j34729M0387J85203
$$ plain form
12209 872164 936991 1052013 993559 925351 878087 846464 806128 742796 658542 670235 662287
12198 662287 800114 806632 818855 699810 628533 652290 674271 795339 925708 845136 763807
12187 763807 781366 735179 718131 699662 649583 659115 757644 811988 738761 698337 782936 840086
12175 840086 856824 909851 968042 985556 950448 987591 1068914 1071846 1034727 1079283 970236
12164 970236 1110322 1113856 1131686 1102158 1062709 985974 873784 956922 1119021 1144265 1051582
12153 1051582 1012909 1027963 1132009 1165134 1202569 1312032 1434377 1448958 1257630 1149605
12143 1149605 1178799 1236303 1206264 1133700 1069893 1113995 995062 867851 873844 1035455 1013145
12132 1013145 1045274 1093463 1157655 1131750 1076052 949832 1012726 1106169 1247965 1322018 1478765
$$ packed form
12209H72164O4827J15022n8454o8208m7264l1623m0336o3332q4254J1693p948
12198F62287J37827O518J2223j19045p1277K3757K1981J21068J30369q0572q1329
12187G63807J7559m6187j7048j8469n0079R532R8529N4344p3227m0424Q4599N7150
12175H40086J6738N3027N8191J7514l5108L7143Q1323K932l7119M4556j09047
12164I70236J40086L534J7830k9528l9449p6735j12190Q3138J62099K5244r2683
12153A051582l8673J5054J04046L3125L7435J09463J22345J4581j91328j08025
12143A149605K9194N7504l0039p2564o3807M4102j18933j27211N993J61611k2310
12132A013145L2129M8189O4192k5905n5698j26220O2894R3443J41796P4053J56747
$$ plain form
12121 1478765 1550721 1418405 1371065 1415348 1375826 1395040 1335367 1335343 1510096 1640025 1654663
12110 1654663 1598013 1630166 1665160 1646914 1567234 1484305 1497865 1557869 1620575 1738145 1757741
12099 1757741 1718468 1773287 1813841 1720102 1724720 1857171 1929048 1930491 1904359 1898386 1859225 1862291
12087 1862291 1963624 2003353 2095482 1969463 1831992 1814353 1776785 1735219 1724620 1770857 1841284
12076 1841284 1917868 1839247 1713255 1659791 1756737 1728703 1718281 1695261 1581409 1631604 1556156
12065 1556156 1580287 1642671 1640684 1679868 1705561 1683405 1727067 1774895 1720836 1653286 1805865
12054 1805865 1795117 1666201 1713488 1850086 1847037 1861714 1889966 1886725 1914919 1955082 1939993
12043 1939993 1991204 2041806 2079502 2102825 2084812 2060460 2090270 2151265 2151354 2053717 2129693 2295607
$$ packed form
12121A478765P1956j32316m7340M4283l9522J9214n9673k4J74753J29929J4638
12110A654663n6650L2153L4994j8246p9680q2929J3560O0004O2706J17570J9596
12099A757741l9273N4819M0554r3739M618J32451P1877J443k6132n973l9161L066
12087A862291J01333L9729R2129j26019j37471j7639l7568m1566j0599M6237P0427
12076A841284P6584p8621j25992n3464R6946k8034j0422k3020j13852N0195p5448
12065A556156K4131O2384j987L9184K5693k2156M3662M7828n4059o7550J52579
12054A805865j0748j28916M7287J36598l049J4677K8252l241K8194M0163j5089
12043A939993N1211N0602L7696K3323j8013k4352K9810O0995Q9r7637P5976J65914
$$ plain form
12031 2295607 2204012 2171422 2248970 2265522 2268690 2281444 2424286 2470069 2455623 2387107 2386159 2474698
12019 2474698 2417196 2361319 2492988 2493524 2512943 2645160 2739318 2856812 2893308 2881666 2903230
12008 2903230 2953695 3028497 3131442 3234855 3390181 3509971 3615675 3732625 3808564 3873757
11998 3873757 3998127 4119150 4196885 4259882 4255811 4175455 4251246 4317828 4305114 4302073 4430002
11987 4430002 4525246 4650278 4618789 4656976 4756164 4727848 4788242 4944331 4914713 4889458 4952892
11976 4952892 5090348 5275320 5320286 5331074 5410012 5390687 5455384 5517127 5594370 5670346 5685614
11965 5685614 5810045 6005038 6122692 6248048 6422354 6521058 6696724 6928621 7117480 7189976
11955 7189976 7249704 7373754 7553862 7646059 7833156 7977235 8016441 8154355 8270405 8426434
$$ packed form
12031B295607r1595l2590P7548J6552L168J2754J42842M5783j4446o8516r48Q8539
12019B474698n7502n5877J31669N36J9419J32217R4158J17494L6496j1642K1564
12008B903230N0465P4802J02945J03413J55326J19790J05704J16950P5939O5193
11998C873757J24370J21023P7735O2997m071q0356P5791O6582j2714l041J27929
11987D430002R5244J25032l1489L8187R9188k8316O0394J56089k9618k5255O3434
11976D952892J37456J84972M4966J0788P8938j9325O4697O1743P7243P5976J5268
11965E685614J24431J94993J17654J25356J74306R8704J75666K31897J88859P2496
11955G189976N9728J24050J80108R2197J87097J44079L9206J37914J16050J56029
$$ plain form
11945 8426434 8698630 9113491 9397505 9606335 9839270 10146572 10501295 10863269 11238686
11936 11238686 11545245 11902222 12228965 12501122 12856225 13300449 13819619 14273235 14653294
11927 14653294 15024968 15514773 16059553 16561343 17118027 17732123 18309703 18926557 19530426
11918 19530426 20032676 20553681 21295764 22032284 22723820 23408429 24211748 24926020 25758537
11909 25758537 26711337 27612594 28616356 29707860 30878590 32217464 33458970 34706200
11901 34706200 36064250 37520051 39125014 40813211 42710268 44848282 46954094 49129035
11893 49129035 51463048 53998044 56885950 59915240 63236679 66720195 70411694 74282583
11885 74282583 78412906 82809856 87531233 92645151 97972257 103449304 109188616 115373829
$$ packed form
11945H426434K72196M14861K84014K08830K32935L07302L54723L61974L75417
11936A1238686L06559L56977L26743K72157L55103M44224N19170M53616L80059
11927A4653294L71674M89805N44780N01790N56684O14096N77580O16854O03869
11918A9530426N02250N21005P42083P36520O91536O84609Q03319P14272Q32517
11909B5758537R52800R01257J003762J091504J170730J338874J241506J247230
11901C4706200J358050J455801J604963J688197J897057K138014K105812K174941
11893D9129035K334013K534996K887906L029290L321439L483516L691499L870889
11885G4282583M130323M396950M721377N113918N327106N477047N739312O185213
$$ plain form
11877 115373829 121793821 128245153 134985109 141706570 148304168 154813582 161107060 167008085
11869 167008085 172442617 177204727 181209105 184408043 186603982 187773068 187704206 186703940
11861 186703940 184812114 181883555 178061864 173641689 168668282 163322426 157570222 151670960
11853 151670960 145755264 139865377 133878852 128100961 122515158 117275871 112146094 107258320
11845 107258320 102653346 98231889 93891419 89764698 85997377 82438438 79112264 75944534
11837 75944534 72940873 70119661 67372884 64842999 62396094 60062747 57819932 55816906
11829 55816906 53772132 51863677 50111947 48410958 46837970 45223671 43654302 42251873
11821 42251873 40997483 39730418 38507582 37271753 36133569 34986192 33943203 32992294
$$ packed form
11877A15373829O419992O451332O739956O721461O597598O509414O293478N901025
11869A67008085N434532M762110M004378L198938K195939J169086o8862j000266
11861A86703940j891826k928559l821691m420175m973407n345856n752204n899262
11853A51670960n915696n889887n986525n777891n585803n239287n129777m887774
11845A07258320m604974m421457m340470m126721l767321l558939l326174l167730
11837G5944534l003661k821212k746777k529885k446905k333347k242815k003026
11829E5816906k044774j908455j751730j700989j572988j614299j569369j402429
11821D2251873j254390j267065j222836j235829j138184j147377j042989r50909
$$ plain form
11813 32992294 32201328 31312758 30390378 29509201 28782482 28133886 27386569 26733174 25997739
11804 25997739 25397619 24922832 24359577 23757640 23131925 22442782 22061214 21698845 21323305
11795 21323305 20808279 20348612 19959430 19531637 19238006 18928109 18749599 18361477 17904235
11786 17904235 17524670 17204158 16941450 16647035 16451705 16186259 15802725 15343393 15014960
11777 15014960 14681812 14336043 14014091 13692800 13402697 13225640 12935100 12807659 12762780
11768 12762780 12461593 12205968 12070908 11859645 11588013 11316908 11130118 10928051 10694348
11759 10694348 10517219 10296843 10054448 9865673 9701427 9525163 9478847 9315255 9065102
11750 9065102 8884918 8776263 8674945 8559207 8246685 8106118 8059682 7939208 7870868 7755421
$$ packed form
11813C2992294p90966q88570r22380q81177p26719o48596p47317o53395p35435
11804B5997739o00120m74787n63255o01937o25715o89143l81568l62369l75540
11795B1323305n15026m59667l89182m27793k93631l09897j78510l88122m57242
11786A7904235l79565l20512k62708k94415j95330k65446l83534m59332l28433
11777A5014960l33148l45769l21952l21291k90103j77057k90540j27441m4879
11768A2762780l01187k55625j35060k11263k71632k71105j86790k02067k33703
11759A0694348j77129k20376k42395j88775j64246j76264m6316j63592k50153
11750I065102j80184j08655j01318j15738l12522j40567m6436j20474o8340j15447
$$ plain form
11740 7755421 7562132 7351809 7206741 7133236 6950969 6724963 6573338 6456226 6286802 6176716
11730 6176716 6052053 6042461 6025731 6054566 6003712 5981555 5904103 5713100 5558527 5409286 5321217
11719 5321217 5134259 5097729 5204709 5238993 5134828 5073166 5101398 5085634 4996979 4885201
11709 4885201 4854849 4822518 4720542 4536919 4522596 4516289 4363532 4296118 4329957 4322156 4246780
11698 4246780 4042647 3986120 3900297 3859046 4004654 3959201 3829318 3729763 3648690 3609484 3487144
11687 3487144 3358966 3226394 3193892 3138998 3211505 3250393 3154073 3084950 3031748 3035733 2973668
11676 2973668 2827963 2697995 2740876 2787706 2798597 2797095 2704282 2579224 2498699 2406459 2335932
11665 2335932 2511457 2626744 2541289 2473313 2408330 2456048 2465431 2433176 2197205 2049523 1954180
$$ packed form
11740G755421j93289k10323j45068p3505j82267k26006j51625j17112j69424j10086
11730F176716j24663r592j6730K8835n0854k2157p7452j91003j54573j49241q8069
11719E321217j86958l6530J06980L4284j04165o1662K8232j5764q8655j11778
11709D885201l0352l2331j01976j83623j4323o307j52757o7414L3839p801p5376
11698D246780k04133n6527q5823m1251J45608m5453j29883r9555q1073l9206j22340
11687C487144j28178j32572l2502n4894P2507L8888r6320o9123n3202L985o2065
11676B973668j45705j29968M2881M6830J0891j502r2813j25058q0525r2240p0527
11665B335932J75525J15287q5455o7976o4983M7718R383l2255k35971j47682r5343
$$ plain form
11654 1954180 1902568 1839820 1676951 1633764 1692653 1784350 1850719 1738125 1538003 1520574 1535231
11643 1535231 1638595 1493696 1365421 1413552 1458569 1407230 1294318 1289043 1348331 1331847 1256130
11632 1256130 1149847 1148392 1291458 1197489 1020621 1023253 1101172 1189737 1131636 1020342 996716
11621 996716 1017769 1131821 1061967 1002694 886290 883454 1005851 1102325 1090555 1076021 1060906
11610 1060906 1069133 925986 889774 937924 896517 949502 1026052 1047507 1052204 955920 922550
11599 922550 906693 966541 967856 939890 848546 903911 925717 835999 736715 699375 697090 589853
11587 589853 670000 800191 794621 835755 765392 670452 633691 688233 705943 608731 681889
11576 681889 718945 674531 656043 723674 855557 835570 701807 661972 615806 653244 696786
$$ packed form
11654A954180n1612o2748j62869m3187N8889R1697O6369j12594k00122j7429J4657
11643A535231J03364j44899j28275M8131M5017n1339j12912n275N9288j6484p5717
11632A256130j06283j455J43066r3969j76868K632P7919Q8565n8101j11294k3626
11621I96716K1053J14052o9854n9273j16404k836J22397R6474j1770j4534j5115
11610A060906Q227j43147l6212M8150m1407N2985P6550K1455M697r6284l3370
11599I22550j5857N9848J315k7966r1344N5365K1806q9718r9284l7340k285j07237
11587E89853Q0147J30191n570M1134p0363r4940l6761N4542J7710r7212P3158
11576F81889L7056m4414j8488O7631J31883j9987j33763l9835m6166L7438M3542
$$ plain form
11565 696786 574212 487639 434917 513750 670740 650515 637523 599422 512634 488506 599631
11554 599631 665121 663956 706048 675406 570105 499042 359733 436640 592637 641697 546930
11543 546930 487291 525600 457039 368999 371879 463873 437200 368932 528650 665386 576339
11532 576339 503254 444863 422311 403650 366199 339250 433218 462053 337020 328198 303226
11521 303226 363564 391199 444126 448683 365799 240256 245981 289780 334092 373773 388085 314980
11509 314980 278761 297191 352848 417883 515670 600426 573727 397476 419105 432244 415254
11498 415254 353118 398348 406235 413932 399858 501732 477117 432012 465425 444903 369957 402044
11486 402044 497189 491411 474016 527326 528726 497575 443447 356882 384285 469158 500433 509833
$$ packed form
11565F96786j22574q6573n2722P8833J56990k0225j2992l8101q6788k4128J11125
11554E99631O5490j165M2092l0642j05301p1063j39309P6907J55997M9060r4767
11543E46930n9639L8309o8561q8040K880R1994k6673o8268J59718J36736q9047
11532E76339p3085n8391k2552j8661l7451k6949R3968K8835j25033q822k4972
11521C03226O0338K7635N2927M557q2884j25543N725M3799M4312L9681J4312p3105
11509C14980l6219J8430N5657O5035R7787Q4756k6699j76251K1629J3139j6990
11498D15254o2136M5230P887P697j4074J01874k4615m5105L3413k0522p4946L2087
11486D02044R5145n778j7395N3310J400l1151n4128q6565K7403Q4873L1275R400
$$ plain form
11474 509833 522313 632158 684516 711453 543821 508589 567995 533041 438020 357964 371039
11463 371039 435796 452038 469061 427448 446383 430467 394913 407828 474447 447309 445921 462342
11451 462342 444558 425743 364575 360573 318108 238860 43365 84250 112825 75620 26063
11440 26063 173253 332536 312110 309945 358639 400106 397777 338985 310275 439159 490026
11429 490026 611516 656125 581616 550580 577584 692387 851505 841823 786667 804948 860139
11418 860139 784480 679766 656005 620846 453105 264631 140624 10671 66121 154486
11408 154486 338012 406323 378101 284037 258925 303527 445868 513918 453942 385477 301303
11397 301303 215780 225718 220644 221060 269195 354815 421413 399214 350915 369241 457834 403331
$$ packed form
11474E09833J2480J09845N2358K6937j67632l5232N9406l4954r5021q0056J3075
11463C71039O4757J6242J7023m1613J8935j5916l5554J2915O6619k7138j388J6421
11451D62342j7784j8815o1168m002m2465p9248j95495M0885K8575l7205m9557
11440B6063J47190J59283k0426k165M8694M1467k329n8792k8710J28884N0867
11429D90026J21490M4609p4509l1036K7004J14803J59118r682n5156J8281N5191
11418H60139p5659j04714k3761l5159j67741j88474j24007j29953N5450Q8365
11408A54486J83526O8311k8222r4064k5112M4602J42341O8050n9976o8465q4174
11397C01303q5523R938n074M16M8135Q5620O6598k2199m8299J8326Q8593n4503
$$ plain form
11385 403331 329918 347453 390416 450588 484831 539503 637639 722360 752933 906999 1003814
11374 1003814 941039 783611 728315 732191 729459 631486 540404 439063 242045 208290 330616
11363 330616 390451 233299 342804 402618 334720 364468 465397 529768 435109 342150 303329
11352 303329 298932 261209 341067 325396 207337 173286 250284 368901 292528 290521 340878
11341 340878 349513 329761 462640 597328 441140 300852 230767 265613 240409 177524 160737
11330 160737 190965 182165 263901 344486 428800 357541 287180 148466 118234 285414 275902
11319 275902 168038 53764 90433 78512 8766 -55697 -53883 -69523 -85675 -68068 -74129
11308 -74129 10213 40966 16533 53381 58447 114034 104135 168202 253097 325228 307834 266457
$$ packed form
11385D03331p3413J7535M2963O0172L4243N4672R8136Q4721L0573J54066R6815
11374A003814o2775j57428n5296L876k732r7973r1082j01341j97018l3755J22326
11363C30616N9835j57152J09505N9814o7898K9748J00929O4371r4659r2959l8821
11352C03329m397l7723P9858j5671j18059l4051P6998J18617p6373k007N0357
11341C40878Q635j9752J32879J34688j56188j40288p0085L4846k5204o2885j6787
11330A60737L0228q800Q1736Q0585Q4314p1259p0361j38714l0232J67180r512
11319B75902j07864j14274L6669j1921o9746o4463J814j5640j6152J7607o061
11308g4129Q4342L0753k4433L6848N066N5587r899O4067Q4895P2131j7394m1377
$$ plain form
11296 266457 177731 187837 160093 45715 59288 107739 220139 138245 119432 51429 -30273
11285 -30273 171081 220681 101127 21149 93796 241348 238968 287480 283155 294148 279907
11274 279907 192045 277002 294231 246141 293296 326735 152488 121839 79816 18150 -21664
11263 -21664 -25437 32345 80872 119893 205765 197586 90509 49459 43351 -11559 5293 51758
11251 51758 146218 110973 29538 -16086 25608 118966 241252 214632 126649 128071 102717 218384
11239 218384 255839 270531 185888 163804 88199 124154 243184 188717 193259 238040 273803
11228 273803 268249 233009 312771 420349 304224 249358 174371 164101 184589 189878 309227
11217 309227 432521 500373 377825 259818 233367 319433 361474 403290 415419 387765 404861
$$ packed form
11296B66457q8726J0106k7744j14378J3573M8451J12400q1894j8813o8003q1702
11285c0273K01354M9600j19554p9978P2647J47552k380M8512m325J0993j4241
11274B79907q7862Q4957J7229m8090M7155L3439j74247l0649m2023o1666l9814
11263b1664l773N7782M8527L9021Q5872q179j07077m1050o108n4910J6852M6465
11251E1758R4460l5245q1435m5624M1694R3358J22286k6620q7983J422k5354J15667
11239B18384L7455J4692q4643k2084p5605L5955J19030n4467M542M4781L5763
11228B73803n554l5240P9762J07578j16125n4866p4987j0270K0488N289J19349
11217C09227J23294O7852j22548j18007k6451Q6066M2041M1816J2129k7654J7096
$$ plain form
11206 404861 195212 7813 9696 4211 44247 58632 64758 47732 89175 60191 64923 109863
11194 109863 180875 129187 68723 138321 104041 264337 312083 205084 136537 133815 197133
11183 197133 257793 207268 214815 257382 176806 262069 432950 500335 452559 446114 340549
11172 340549 277601 245922 278751 419582 494303 448120 316184 237372 224767 283856 385974
11161 385974 486679 421705 448961 550063 383266 345949 449204 518463 389747 262395
11151 262395 193766 227737 381079 382526 294798 119568 34321 68889 139532 181988 109551
11140 109551 158212 199408 184192 229171 276003 237213 128967 56202 224501 322577 251751
11129 251751 284218 296828 297273 321455 258560 174503 164795 203545 176203 80160 70303 116100
$$ packed form
11206D04861k09649j87399J883n485M0036J4385O126j7026M1443k8984M732M4940
11194A09863P1012n1688o0464O9598l4280J60296M7746j06999o8547k722O3318
11183A97133O0660n0525P547M2567q0576Q5263J70881O7385m7776o445j05565
11172C40549o2948l1679L2829J40831P4721m6183j31936p8812j2605N9089J02118
11161C85974J00705o4974K7256J01102j66797l7317J03255O9259j28716j27352
11151B62395o8629L3971J53342J447q7728j75230q5247L4568P0643M2456p2437
11140A09551M8661M1196j5216M4979M6832l8790j08246p2765J68299R8076p0826
11129B51751L2467J2610M45K4182o2895q4057r708L8750k7342r6043r857M5797
$$ plain form
11117 116100 85548 214952 204562 313595 307303 147389 46999 103528 19323 -58355 36581
11106 36581 228066 300248 184223 195021 194574 192339 250541 264076 168240 262607 393693 490985
11094 490985 477924 488769 438022 415315 590788 808946 1164187 1496877 1778334 1983203
11084 1983203 2183023 2328121 2397989 2279433 1997937 1795228 1630233 1455988 1264475 1194197
11074 1194197 1070566 997905 814057 633408 604435 592036 602427 616779 521289 484034 449959
11063 449959 454483 416053 424407 403075 427286 419201 409507 554446 596439 564612 501748 455286
11051 455286 532917 651806 544609 459115 454088 394704 261337 157390 231992 299251 253378
11040 253378 151937 201456 389881 401151 185812 142015 133489 181464 196681 122687 74173
$$ packed form
11117A16100l0552J29404j0390J09033o292j59914j00390N6529q4205p7678R4936
11106C6581J91485P2182j16025J0798m47k235N8202J3535r5836R4367J31086R7292
11094D90985j3061J0845n0747k2707J75473K18158L55241L32690K81457K04869
11084A983203J99820J45098O9868j18556k81496k02709j64995j74245j91513p0278
11074A194197j23631p2661j83848j80649k8973j2399J0391J4352r5490l7255l4075
11063D49959M524l8430Q354k1332K4211q085r694J44939M1993l1827o2864m6462
11051D55286P7631J18889j07197q5494n027n9384j33367j03947P4602O7259m5873
11040B53378j01441M9519J88425J1270k15339m3797q526M7975J5217p3994m8514
$$ plain form
11029 74173 77840 9881 -44759 -94008 -142383 20019 230073 353448 287772 324846 326255
11018 326255 339144 337216 323030 265948 150246 195612 278632 300474 373825 388541 273397
11007 273397 182305 172442 219535 251336 281827 317223 300880 353758 355182 370803 298584 350046
10995 350046 373064 255507 216773 194697 254136 190476 144297 330947 273872 95078 131327
10984 131327 233147 297965 301748 219062 240674 193781 263525 348357 393053 478075 531144
10973 531144 494413 523521 455308 332381 367600 374363 204351 212484 356867 325779 322784
10962 322784 315300 254667 358119 449678 524739 600320 542452 392083 353339 393244 497264
10951 497264 493077 450742 514780 427990 434120 447454 390642 375750 416133 347743 254728 93991
$$ packed form
11029G4173L667o7959n4640m9249m8375J62402K10054J23375o5676L7074J409
11018C26255J2889j928j4186n7082j15702M5366Q3020K1842P3351J4716j15144
11007B73397r1092r863M7093L1801L0491L5396j6343N2878J424J5621p2219N1462
10995C50046K3018j17557l8734k2076N9439o3660m6179J86650n7075j78794L6249
10984A31327J01820O4818L783q2686K1612m6893O9744Q4832M4696Q5022N3069
10973E31144l6731K9108o8213j22927L5219O763j70012Q133J44383l1088k995
10962C22784p484o0633J03452R1559P5061P5581n7868j50369l8744L9905J04020
10951D97264m187m2335O4038q6790O130J3334n6812j4892M0383o8390r3015j60737
$$ plain form
10939 93991 102461 91001 100853 176967 252993 232493 299843 282923 293444 392291 527913 467077
10927 467077 357569 401337 612310 741659 716631 651219 665685 651332 631930 707969 676148
10916 676148 614901 479986 486633 480952 491809 499255 335630 357887 370801 289144 262553 337248
10904 337248 410708 524923 620356 657005 633899 485247 442874 424699 301793 160232 109936
10893 109936 -18671 6648 -5074 -80421 -16406 -26597 -89532 -20767 141728 397455 628480
10882 628480 656247 671269 812087 850264 761467 758619 813211 777815 748079 640534 670562
10871 670562 809046 826953 751484 825570 814815 767833 783517 915082 1031368 935047 903985
10860 903985 809008 633793 645240 627845 579272 679352 670810 545948 449622 540356 599187
$$ packed form
10939I3991Q470j1460R852P6114P6026k0500O7350j6920J0521R8847J35622o0836
10927D67077j09508M3768K10973J29349k5028o5412J4466j4353j9402P6039l1821
10916F76148o1247j34915O647n681J0857P446j63625K2257J2914q1657k6591P4695
10904C37248P3460J14215R5433L6649k3106j48652m2373j8175j22906j41561n0296
10893A09936j28607K5319j1722p5347O4015j0191o2935O8765J62495K55727K31025
10882F28480K7767J5022J40818L8177q8797k848N4592l5396k9736j07545L0028
10871F70562J38484J7907p5469P4086j0755m6982J5684J31565J16286r6321l1062
10860I03985r4977j75215J1447j7395m8573J00080q542j24862r6326R0734N8831
$$ plain form
10849 599187 512175 531540 688826 679919 711771 698278 730014 907073 1003990 1057269 962957
10838 962957 996062 1052430 882697 655911 513516 439168 311748 116080 23381 -39508
10828 -39508 -68913 -146126 -183920 -217517 -183554 -7661 74528 30604 4844 30064 78560
10817 78560 99153 144645 268146 414650 369265 321760 388473 350327 409231 431827 365133
10806 365133 426879 495628 434201 496517 535811 517220 497623 406580 332735 168391 98805
10795 98805 138587 -7213 -118187 -28065 -18366 -91099 -143353 -178654 -220984 -438591 -467051
10784 -467051 -281453 -191512 -154562 -135465 -134379 -77367 69934 119541 66336 170080 322507
10773 322507 514317 579830 465703 420175 549313 573079 623260 622386 539090 558527 548038
$$ packed form
10849E99187q7012J9365J57286q907L1852j3493L1736J77059R6917N3279r4312
10838I62957L3105N6368j69733k26786j42395p4348j27420j95668r2699o2889
10828c9508k9405p7213l7794l3597L3963J75893Q2189m3924k5760K5220M8496
10817G8560K0593M5492J23501J46504m5385m7505O6713l8146N8904K2596o6694
10806C65133O1746O8749o1427O2316L9294j8591j9597r1043p3845j64344o9586
10795I8805L9782j45800j10974R0122R699p2733n2254l5301m2330k17607k8460
10784d67051J85598Q9941L6950J9097J086N7012J47301M9607n3205J03744J52427
10773C22507J91810O5513j14127m5528J29138K3766N0181q74q3296J9437j0489
$$ plain form
10762 548038 550180 794627 915448 1051712 1204875 1458671 1537892 1495480 1413622 1462478 1526897
10751 1526897 1559329 1546111 1502554 1433370 1287265 1029430 919045 819792 636073 449424
10741 449424 206455 45897 -113849 -211362 -172943 -118124 -48980 113694 154194 293223
10731 293223 488904 764571 907033 882327 917187 920984 963743 880957 772391 610339 370406
10720 370406 256851 226530 216045 399570 435512 500451 619003 729285 751136 711884 649554
10709 649554 606841 400653 141599 -55136 -332239 -378395 -270885 -275337 -271369 -145273 -8013
10698 -8013 107969 163983 235986 478691 779657 1063567 1453020 1917963 2438731 2980437
10688 2980437 3552198 4192321 4681584 4706571 4704127 4722300 4526404 4180265 3853532 3474611
$$ packed form
10762E48038K142K44447J20821J36264J53163K53796P9221m2412q1858M8856O4419
10751A526897L2432j3218m3557o9184j46105k57835j10385r9253j83719j86649
10741D49424k42969j60558j59746r7513L8419N4819O9144J62674M0500J39029
10731B93223J95681K75667J42462k4706L4860L797M2759q2786j08566j62052k39933
10720C70406j13555l0321j0485J83525L5942O4939J18552J10282K1851l9252o2330
10709F49554m2713k06188k59054j96735k77103m6156J07510m452L968J26096J37260
10698h013J15982N6014P2003K42705L00966K83910L89453M64943N20768N41706
10688B980437N71761O40123M89263K4987k444J8173j95896l46139l26733l78921
$$ plain form
10678 3474611 3231088 2991506 2781563 2942666 3169631 3259301 3241957 3439527 3779144 4049296
10668 4049296 4027394 4065825 4452264 4891317 5143017 4947036 4837012 4754921 4658245 4590373
10658 4590373 4721990 4899250 5055365 5391389 5941615 6572927 7007790 7613215 8360917
10649 8360917 9210875 10439341 11947719 13885869 16182338 18635674 21538918 25038314
10641 25038314 28721882 32801964 38218715 45605064 55170956 68584839 89175780 121328754
10633 121328754 167000529 222515643 275755223 315605913 349934463 390717904 424342013
10626 424342013 418293811 373117575 329120172 298839225 262997550 209288793 158282284
10619 158282284 125051316 104738128 91021247 81011707 73449102 66978672 61762621
$$ packed form
10678C474611k43523k39582k09943J61103K26965Q9670j7344J97570L39617K70152
10668D049296k1902L8431L86439M39053K51700j95981j10024q2091r6676o7872
10658D590373J31617J77260J56115L36024N50226O31312M34863O05425P47702
10649H360917Q49958J228466J508378J938150K296469K453336K903244L499396
10641B5038314L683568M080082N416751P386349R565892J3413883K0590941L2152974
10633A21328754M5671775N5515114N3239580L9850690L4328550M0783441L3624109
10626D24342013o048202m5176236m3997403l0280947l5841675n3708757n1006509
10619A58282284l3230968k0313188j3716881j0009540p562605o470430n216051
$$ plain form
10612 61762621 57618411 53969834 50428350 47243317 44694264 42489787 40303720 37722700
10604 37722700 35086907 33083993 31515025 29870002 28230664 27007788 25988832 25122679
10596 25122679 24307018 23518921 22659983 21812002 20917095 19872943 18810830 17964521 17251070
10587 17251070 16705600 15938086 15262069 15008901 14903833 14562612 14047625 13656790 13479162
10578 13479162 13398476 13085348 12582866 12144182 11516117 10789389 10003231 9242503 8699333
10569 8699333 8303617 7884404 7727609 7776580 7833188 7797408 7828794 7952461 8168836 8303781
10559 8303781 8399000 8518769 8539390 8399040 8332263 8268122 8297252 8257191 8067943 7886937
10549 7886937 7792189 7634973 7436689 6999844 6639982 6405387 6155143 5845107 5663500 5506172
$$ packed form
10612F1762621m144210l648577l541484l185033k549053k204477k186067k581020
10604C7722700k635793k002914j568968j645023j639338j222876j018956q66153
10596B5122679q15661p88097q58938q47981q94907j044152j062113q46309p13451
10587A7251070n45470p67514o76017k53168j05068l41221n14987l90835j77628
10578A3479162q0686l13128n02482m38684o28065p26728p86158p60728n43170
10569H699333l95716m19213j56795M8971N6608l5780L1386J23667K16375J34945
10559H303781R5219J19769K0621j40350o6777o4141K9130m0061j89248j81006
10549G886937r4748j57216j98284m36845l59862k34595k50244l10036j81607j57328
$$ plain form
10539 5506172 5544283 5582395 5404838 5293451 5276291 5220419 5113238 5000555 4937896 4752490
10529 4752490 4523674 4275561 4151971 4247102 4233402 4232768 4282755 4430840 4657762 4662289 4614688
10518 4614688 4529354 4498454 4444317 4320145 4269601 4033794 3681973 3569674 3514221 3302222
10508 3302222 3227876 3130452 2951648 2767983 2714965 2561674 2342267 2248671 2151308 1944470
10498 1944470 1770537 1736427 1746167 1775411 1799503 1755887 1765956 1808831 1828919 1875384 1834120
10487 1834120 1939095 2056365 2151246 2180187 2068327 1944314 1897502 1837687 1847173 1896347 1999663
10476 1999663 1939876 1978059 2097448 2077394 1962531 1973828 1962065 1999360 1995488 2065685 2086115
10465 2086115 2155099 2107747 1878074 1765660 1773422 1765886 1745752 1738475 1695512 1670703 1687671
$$ packed form
10539E506172L8111L8112j77557j11387j7160n5872j07181j12683o2659j85406
10529D752490k28816k48113j23590R5131j3700o34M9987J48085K26922M527m7601
10518D614688q5334l0900n4137j24172n0544k35807l51821j12299n5453k11999
10508C302222p4346r7424j78804j83665n3018j53291k19407r3596r7363k06838
10498A944470j73933l4110R740K9244K4092m3616J0069M2875K0088M6465m1264
10487A834120J04975J17270R4881K8941j11860j24013m6812n9815R486M9174J03316
10476A999663n9787L8183J19389k0054j14863J1297j1763L7295l872P0197K0430
10465B086115O8984m7352k29673j12414P762p536k0134p277m2963k4809J6968
$$ plain form
10454 1687671 1637098 1561888 1316323 1134809 1095966 1236498 1357541 1360371 1321800 1486524
10444 1486524 1589488 1602875 1597488 1639951 1709378 1726582 1633809 1640195 1668582 1603323 1624221
10433 1624221 1675739 1713940 1710009 1748782 1751083 1738501 1823956 1914245 1971710 1995054 1859017
10422 1859017 1890603 1797765 1792713 1728524 1565352 1498813 1441154 1437196 1432763 1532147 1607037 1755518
10410 1755518 1876967 2024890 2189143 2333728 2371096 2480113 2779422 3164222 3385775 3703031
10400 3703031 4134688 4637968 5403546 6317048 7291689 8552591 10236579 12613440 16054739
10391 16054739 20882573 27060679 34228053 41481810 48324851 54396716 58733345 60347337
10383 60347337 58713942 54366154 48194029 41300988 34479682 27694820 21583196 17287996
$$ packed form
10454A687671n0573p5210k45565j81514l8843J40532J21043K830l8571J64724
10444A486524J02964J3387n387M2463O9427J7204r2773O386K8387o5259K0898
10433A624221N1518L8201l931L8773K301j2582Q5455R0289N7465K3344j36037
10422A859017L1586r2838n052o4189j63172o6539n7659l958m433R9384P4890J48481
10410A755518J21449J47923J64253J44585L7368J09017K99309L84800K21553L17256
10400C703031M31657N03280P65578R13502R74641J260902J683988K376861L441299
10391A6054739M827834O178106P167374P253757O843041O071865M336629J613992
10383F0347337j633395m347788o172125o893041o821306o784862o111624m295200
$$ plain form
10375 17287996 14410363 12523883 11370079 10434265 9648040 9127095 8742314 8376626 8046704
10366 8046704 7804610 7635097 7518776 7401084 7316672 7427233 7722510 8189792 8776490 9518284
10356 9518284 10083228 10495372 10860872 10983235 10580528 9942664 9175236 8400773 7710568
10347 7710568 6923048 6086184 5296981 4725232 4615692 4379543 3945729 3614473 3326613
10338 3326613 3205784 3039766 2801799 2639138 2577815 2400844 2264216 2148102 2095541 1988084
10328 1988084 2075714 2173823 2160333 2060608 2024245 2056899 2161088 2115485 2078191 2110172 2031434
10317 2031434 2022376 1848771 1833798 1809751 1845353 1849186 1718836 1556384 1467448 1268485 1321940
10306 1321940 1472019 1591552 1645962 1610808 1612770 1588654 1399984 1251022 1235768 1247704 1145064
$$ packed form
10375A7287996k877633j886480j153804r35814p86225n20945l84781l65688l29922
10366H046704k42094j69513j16321j17692q4412J10561K95277M67282N86698P41794
10356I518284N64944M12144L65500J22363m02707o37864p67428p74463o90205
10347G710568p87520q36864p89203n71749j09540k36149m33814l31256k87860
10338C326613j20829j66018k37967j62661o1323j76971j36628j16114n2561j07457
10328A988084Q7630R8109j3490r9725l6363L2654J04189m5603l7294L1981p8738
10317B031434r058j73605j4973k4047L5602L833j30350j62452q8936j98963N3455
10306A321940J50079J19533N4410l5154J962k4116j88670j48962j5254J1936j02640
$$ plain form
10295 1145064 1153176 1086998 1170184 1320188 1304376 1270710 1174162 1179578 1231808 1343262 1414708
10284 1414708 1333000 1252146 1250247 1212739 1110806 1164661 1139958 1055599 1071762 1153684 1222195
10273 1222195 1287193 1355933 1359150 1415398 1505433 1712423 1901272 2193792 2574849 2843226
10263 2843226 3027268 3125754 3123154 2918117 2692633 2434731 2215875 1808633 1389387 1168632
10253 1168632 1102172 1147625 1227437 1356694 1381731 1352011 1381494 1328338 1219661 1147307 1055093
10242 1055093 994939 1070705 1008118 865150 777838 724523 735379 850937 903139 934736 884566
10231 884566 872035 952786 844378 812555 847349 766922 658477 647572 659656 606386 579245
10220 579245 527773 547709 537660 418186 321306 362029 376083 362114 415650 389552 271672
$$ packed form
10295A145064Q112o6178Q3186J50004j5812l3666r6548N416N2230J11454P1446
10284A414708q1708q0854j899l7508j01933N3855k4703q4359J6163Q1922O8511
10273A222195O4998O8740L217N6248R0035K06990J88849K92520L81057K68377
10263B843226J84042R8486k600k05037k25484k57902k18856m07242m19246k20755
10253A168632o6460M5453P9812J29257K5037k9720K9483n3156j08677p2354r2214
10242A055093o0154P5766o2587j42968q7312n3315J0856J15558N2202L1597n0170
10231H84566j2531Q0751j08408l1823L4794q0427j08445j0905J2084n3270k7141
10220E79245n1472J9936j0049j19474r6880M0723J4054j3969N3536k6098j17880
$$ plain form
10209 271672 268891 246931 237596 251374 177402 316294 280271 162796 101421 141955 158810
10198 158810 213851 327379 395174 420725 349117 316213 441116 396608 410729 346050 305564
10187 305564 281652 321731 391923 442101 426380 413178 362893 361711 332006 311679 378002 357311
10175 357311 341958 392714 462773 624399 834766 930923 1067902 1312477 1502690 1785302
10165 1785302 2065461 2343647 2241560 2004942 1761920 1677538 1618185 1445044 1178389 931969
10155 931969 748893 629892 677143 589378 513294 483325 529378 657903 599925 523654 455532
10144 455532 275391 264553 223615 304154 502385 492824 363387 333174 388126 452312 435913
10133 435913 383449 370967 306467 276331 329416 290480 281143 233899 239956 257144 337324 486745
$$ packed form
10209B71672k781k1960r335J3778p3972J38892l6023j17475o1375M0534J6855
10198A58810N5041J13528O7795K5551p1608l2904J24903m4508J4121o4679m0486
10187C05564k3912M0079P0192N0178j5721j3202n0285j182k9705k0327O6323k0691
10175C57311j5353N0756P0059J61626K10367R6157J36979K44575J90213K82612
10165A785302K80159K78186j02087k36618k43022q4382n9353j73141k66655k46420
10155I31969j83076j19001M7251q7765p6084k9969M6053J28525n7978p6271o8122
10144D55532j80141j0838m0938Q0539J98231r561j29437l0213N4952O4186j6399
10133D35913n2464j2482o4500l0136N3085l8936r337m7244O057J7188Q0180J49421
$$ plain form
10121 486745 524413 511859 455093 416160 451858 442499 319415 228916 264358 347605 299635
10110 299635 201980 159497 208812 272198 241159 163498 96135 110082 -45963 -32641 114440
10099 114440 204977 203493 211745 117414 106837 97047 3443 -25665 -9626 79961 183787 139062
10087 139062 9893 -87155 -33434 10726 78930 30948 -25822 -4189 -87863 -80464 15474
10076 15474 9113 -34932 -150254 -106113 -96184 -56889 -123612 -152293 -158699 -1579 61769 125740
10064 125740 249901 365132 351339 364317 437928 419929 405717 321364 203572 35932 -13967
10053 -13967 5865 105605 110921 201342 213854 92362 -29933 -109115 12078 113951 73383
10042 73383 81060 109586 166419 257892 222110 251294 225593 168501 38580 36231 36468 -47836
$$ packed form
10121D86745L7668j2554n6766l8933L5698r359j23084r0499L5442Q3247m7970
10110B99635r7655m2483M9315O3386l1039p7661o7363J3947j56045J3322J47081
10099A14440R0537j484Q252r4331j0577r790r3604k9108J6039Q9587J03826m4725
10087A39062j29169r7048N3721M4160O8204m7982n6770K1633q3674P399R5938
10076A5474o361m4045j15322M4141R929L9295o6723k8681o406J57120O3348O3971
10064A25740J24161J15231j3793J2978P3611j7999j4212q4353j17792j67640m9899
10053a3967J9832R9740N316R0421J2512j21492j22295p9182J21193J01873m0568
10042G3383P677K8526N6833R1473l5782K9184k5701n7092j29921k349K37q4304
$$ plain form
10030 -47836 -46056 -79531 -69823 -56344 -29135 68362 97868 -39108 -25988 84035 67924 -60835
10018 -60835 -253703 -332543 -207640 -99945 23877 103022 156104 145542 66553 81989 266480
10007 266480 233089 65488 75822 176190 252671 296075 214089 232578 150622 76769 22909
9996 22909 -9319 10214 31253 23992 -26715 -18104 -44761 -23855 37883 75495 166907 193889
9984 193889 256667 337779 354039 278783 218265 204035 194249 244475 242584 243345 195015 293883
9972 293883 218917 126787 98087 91538 97498 10068 -29176 45713 13340 28621 -82029 -147531
9960 -147531 -88156 -3461 158800 213664 218240 223997 256751 332450 329731 215524 188283 242441
9948 242441 322254 366021 457029 373130 282888 365872 360765 263824 339630 301614 240562 157373
$$ packed form
10030d7836J780l3475R708J3479K7209R7497K9506j36976J3120J10023j6111j28759
10018f0835j92868p8840J24903J07695J23822P9145N3082j0562p8989J5436J84491
10007B66480l3391j67601J0334J00368P6481M3404q1986J8489q1956p3853n3860
9996B2909l2228J9533K1039p261n0707Q611k6657K0906O1738L7612R1412K6982
9984A93889O2778Q1112J6260p5256o0518j4230r786N0226j891P61m8330R8868
9972B93883p4966r2130k8700o549N960q7430l9244P4889l2373J5281j10650o5502
9960a47531N9375Q4695J62261N4864M576N757L2754P5699k719j14207k7241N4158
9948B42441P9813M3767R1008q3899r0242Q2984n107r6941P5806l8016o1052q3189
$$ plain form
9936 157373 103487 120426 97955 88074 169389 226667 264687 434190 400581 311280 309583 368962
9924 368962 455962 422765 432118 498505 470477 422299 445199 344934 244595 131032 237689
9913 237689 408662 514194 459385 347455 258922 148922 243807 292953 252063 243221 217383
9902 217383 81718 81641 98444 122728 127300 125995 113554 121944 254022 189687 160372 123437
9890 123437 219166 259140 281694 251938 185343 205042 294799 408899 357021 314804 319847 368391
9878 368391 309338 146728 34727 52717 136805 163340 238153 409920 514510 436961 299706
9867 299706 211115 303246 366576 401295 444834 460853 491785 412770 315163 246224 225145 224693
9855 224693 231636 267920 246876 212643 108980 79679 170004 237372 266052 147830 117108
$$ packed form
9936A57373n3886J6939k2471r881Q1315N7278L8020J69503l3609q9301j697N9379
9924C68962Q7000l3197R353O6387k8028m8178K2900j00265j00339j13563J06657
9913B37689J70973J05532n4809j11930q8533j10000R4885M9146m0890q842k5838
9902B17383j35665p7J6803K4284M572j305j2441Q390J32078o4335k9315l6935
9890A23437R5729L9974K2554k9756o6595J9699Q9757J14100n1878m2217N043M8544
9878C68391n9053j62610j12001J7990Q4088K6535P4813J71767J04590p7549j37255
9867B99706q8591R2131O3330L4719M3539J6019L0932p9015r7607o8939k1079m52
9855B24693O943L6284k1044l4233j03663k9301R0325O7368K8680j18222l0722
$$ plain form
9844 117108 100818 90930 -45548 -14746 21031 64571 66757 -21277 -46083 -61600 58507 27355
9832 27355 -65005 -33336 99840 88209 56164 144333 274104 246566 192893 201063 89182
9821 89182 -26962 -163221 -69897 33406 -33868 -59268 15524 8352 -125 -35540 -57890 -40336
9809 -40336 -99127 -74776 -136004 -181775 -181825 -209421 -142854 101041 151428 124764 48331 45272
9797 45272 -51639 8195 174499 269302 265817 261802 202383 66360 -117841 -59507 119436
9786 119436 69882 -65454 -117263 -70161 -35043 19178 32616 23878 2966 24831 -20873 -50412
9774 -50412 62017 152593 151176 244241 211478 176699 221335 269531 244412 302722 427144 493053
9762 493053 389764 404132 422990 401237 482346 520177 451808 562493 650653 733704 624397
$$ packed form
9844A17108j6290r888j36478L0802L5777M3540K186q8034k4806j5517J20107l1152
9832B7355r2360L1669J33176j1631l2045Q8169J29771k7538n3673Q170j11881
9821H9182j16144j36259R3324J03303o7274k5400P4792p172q477l5415k2350J7554
9809d0336n8791K4351o1228m5771n0k7596O6567K43895N0387k6664p6433l059
9797D5272r6911N9834J66304R4803l485m015n9419j36023j84201N8334J78943
9786A19436m9554j35336n1809M7102L5118N4221J3438q738k0912K1865m5704k9539
9774e0412J12429R0576j417R3065l2763l4779M4636M8196k5119N8310J24422O5909
9762D93053j03289J4368J8858k1753Q1109L7831o8369J10685Q8160Q3051j09307
$$ plain form
9751 624397 524600 431636 386248 436003 554776 550571 533628 415111 302376 255191 401899
9740 401899 538926 443570 243031 219110 188763 155694 236478 231859 265710 193975 77105
9729 77105 103759 185808 321076 414000 474847 365972 254181 195451 188047 174096 95252
9718 95252 25229 43856 53445 4508 18885 50603 4385 98579 210897 281886 294837 385220
9706 385220 336545 188724 177468 199647 184208 157006 287640 239406 159811 167180 306174
9695 306174 193823 148864 134756 70001 126733 183766 160665 161238 321972 215488 156905
9684 156905 140825 219749 171134 50190 28490 -32794 50419 113635 23656 -49102 -73138
9673 -73138 122047 176429 25934 -14905 24592 109724 265376 324476 255448 51801 31528
$$ packed form
9751F24397r9797r2964m5388M9755J18773m205j6943j18517j12735m7185J46708
9740D01899J37027r5356k00539k3921l0347l3069Q0784m619L3851p1735j16870
9729G7105K6654Q2049J35268R2924O0847j08875j11791n8730p404j3951p8844
9718I5252p0023J8627R589m8937J4377L1718m6218R4194J12318P0989J2951R0383
9706C85220m8675j47821j1256K2179j5439k7202J30634m8234p9595P369J38994
9695C06174j12351m4959j4108o4755N6732N7033k3101N73J60734j06484n8583
9684A56905j6080P8924m8615j20944k1700o1284Q3213O3216q9979p2758k4036
9673g3138J95185N4382j50495m0839L9497Q5132J55652N9100o9028k03647k0273
$$ plain form
9662 31528 182557 171925 218706 203374 26263 119808 168125 191722 18479 -83383 -65138
9651 -65138 -55499 62294 86226 121810 115735 170482 127017 61906 90148 112525 145107 132443
9639 132443 136887 96524 140517 122966 100825 155591 201050 138445 103121 68120 64881 136561
9627 136561 192076 203635 199525 213669 241958 152899 161995 100047 56807 39012 141746 252361
9615 252361 387221 433630 374635 314563 233030 219820 26033 -115446 -36306 135795 227855
9604 227855 198634 94581 125837 275430 333624 324862 339863 226027 197633 225632 113157
9593 113157 59627 137222 101488 104261 106892 243239 251422 54400 -35132 -40446 -22492 24482
9581 24482 158195 120061 83012 34945 -13451 -55473 -94766 -55540 84044 68437 144328
$$ packed form
9662C1528J51029j0632M6781j5332j77111R3545M8317K3597j73243j01862J8245
9651f5138R639J17793K3932L5584o075N4747m3465o5111K8242K2377L2582j2664
9639A32443M444m0363M3993j7551k2141N4766M5459o2605l5324l5001l239P1680
9627A36561N5515J1559m110J4144K8289q9059R096o1948m3240j7795J02734J10615
9615B52361J34860M6409n8995o0072q1533j3210j93787j41479P9140J72101R2060
9604B27855k9221j04053L1256J49593N8194q762J5001j13836k8394K7999j12475
9593A13157n3530P7595l5734K773K631J36347Q183j97022q9532n314J7954M6974
9581B4482J33713l8134l7049m8067m8396m2022l9293L9226J39584j5607P5891
$$ plain form
9570 144328 270286 388684 430063 454496 513391 537436 508140 412865 360846 479170 394550
9559 394550 307450 430530 530553 603427 555197 369725 249604 225136 254768 243823 152315
9548 152315 170724 159065 192912 157792 301206 418717 545465 471073 418228 376883 303810
9537 303810 137792 120549 61163 58211 80433 140489 220641 205744 171867 105623 15842 -15785
9525 -15785 24940 55906 53684 173028 110050 99624 107523 85245 18902 73074 51690 72877
9513 72877 94036 35472 8229 91297 144452 100349 29340 -19409 -104862 -172655 -231390 -192103
9501 -192103 -112818 -70853 -11505 -124916 -290969 -295511 -312074 -160750 -115628 -101019 -28745
9490 -28745 -47636 -51918 -91967 -178043 -105619 -150627 -168663 -180014 -127073 -91941 -161253 -204093
$$ packed form
9570A44328J25958J18398M1379K4433N8895K4045k9296r5275n2019J18324q4620
9559C94550q7100J23080J00023P2874m8230j85472j20121k4468K9632j0945r1508
9548A52315J8409j1659L3847l5120J43414J17511J26748p4392n2845m1345p3073
9537C03810j66018j7243n9386k952K2222O0056Q0152j4897l3877o6244q9781l1627
9525a5785M0725L0966k222J19344o2978j0426P899k2278o6343N4172k1384K1187
9513G2877K1159n8564k7243Q3068N3155m4103p1009m8749q5453o7793n8735L9287
9501a92103P9285M1965N9348j13411j66053m542j6563J51324M5122J4609P2274
9490b8745j8891m282m0049q6076P2424m5008j8036j1351N2941L5132o9312m2840
$$ plain form
9478 -204093 -108231 -213405 -413783 -414130 -431557 -450229 -462118 -335130 -317600 -171959 -186945
9467 -186945 -328462 -385384 -203784 -125559 -3133 116964 24974 -39943 80557 114329 53058
9456 53058 77789 169295 279488 171375 21947 -69128 87802 170908 212436 118751 122479
9445 122479 134446 175706 264368 194685 131075 54244 109135 123416 196384 351036 272748
9434 272748 177381 158331 198774 286922 414619 455830 357266 249764 377759 358433 386306
9423 386306 332749 321819 371953 355182 320258 178428 94346 254552 290062 268322 168839
9412 168839 141162 68431 28563 -5903 -44145 -120582 -194526 -161117 -213806 -336271 -159892
9401 -159892 -29723 49862 110163 191951 318916 306387 255282 156390 117689 147910 338675
$$ packed form
9478b04093R5862j05174k00378l47j7427j8672j1889J26988J7530J45641j4986
9467a86945j41517n6922J81600P8225J22426J20097r1990o4917J20500L3772o1271
9456E3058K4731R1506J10193j08113j49428r1075J56930Q3106M1528r3685L728
9445A22479J1967M1260Q8662o9683o3610p6831N4891J4281P2968J54652p8288
9434B72748r5367j9050M0443Q8148J27697M1211r8564j07502J27995j9326K7873
9423C86306n3557j0930N0134j6771l4924j41830q4082J60206L5510k1740r9483
9412A68839k7677p2731l9868l4466l8242p6437p3944L3409n2689j22465J76379
9401a59892J30169P9585O0301Q1788J26965j2529n1105r8892l8701L0221J90765
$$ plain form
9390 338675 473992 511899 473204 542606 756157 791251 730631 718150 811575 867643 862972
9379 862972 946302 1096497 1295372 1648353 1893707 2042827 2116510 2180626 2296115 2280318
9369 2280318 2104738 1799203 1795343 1936038 2065276 2297943 2703223 3154577 3516066 3584475
9359 3584475 3463293 3209138 3101538 3090371 3404972 3942893 4437220 4702433 5019560 5607261
9349 5607261 6027972 6206576 6444089 6625845 7327607 8788798 10975741 13841648 17938758
9340 17938758 24244263 33442015 44460938 53442023 56431395 56528481 58447483 60653228
9332 60653228 57742839 52963283 55239527 66394555 84621573 103698045 113704345 113102221
9324 113102221 112875916 115417768 111979190 97498990 89133658 96408691 117279895 144811639
$$ packed form
9390C38675J35317L7907l8695O9402K13551L5094o0620j2481R3425N6068m671
9379H62972Q3330J50195J98875L52981K45354J49120P3683O4116J15489j5797
9369B280318j75580l05535l860J40695J29238K32667M05280M51354L61489O8409
9359C584475j21182k54155j07600j1167L14601N37921M94327K65213L17127N87701
9349E607261M20711J78604K37513J81756P01762J461191K186943K865907M097110
9340A7938758O305505R197752J1018923Q981085K989372R7086J919002K205745
9332F0653228k910389m779556K276244J1155028J8227018J9076472J0006300o02124
9324A13102221k26305K541852l438578j4480200q365332P275033K0871204K7531744
$$ plain form
9316 144811639 165456921 168114567 163625196 163053265 159460941 137550199 109219147 96801273
9308 96801273 100305248 113213462 127163465 131720843 126988554 123185756 120935675 110253303
9300 110253303 88293607 72204510 67706473 70554518 76248598 79642830 77643870 73942646
9292 73942646 71191141 66458300 55436186 43034553 35427992 31311034 28604703 26482825
9284 26482825 24923097 23478239 21833966 20256305 18864182 17587064 16498839 16046019
9276 16046019 15616330 15101641 14749385 14381235 13750424 12926829 12174547 11518227 10999227
9267 10999227 10669456 10367839 10053924 9935508 9797381 9509924 8927338 8458925 8102466
9258 8102466 7940525 7784823 7696062 7517540 7365218 7162554 6958523 6835574 6626346 6419203
$$ packed form
9316A44811639K0645282K657646m489371n71931l592324k1910742k8331052j2417874
9308I6801273L503975J2908214J3950003M557378m732289l802798k250081j0682372
9300A10253303k1959696j6089097m498037K848045N694080L394232j998960l701224
9292G3942646k751505m732841j1022114j2401633p606561m116958k706331k121878
9284B6482825j559728j444858j644273j577661j392123j277118j088225m52820
9276A6046019m29689n14689l52256l68150o30811q23595p52282o56320n19000
9267A0999227l29771l01617l13915j18416j38127k87457n82586m68413l56459
9258H102466j61941j55702q8761j78522j52322k02664k04031j22949k09228k07143
$$ plain form
9248 6419203 6382944 6415639 6354170 6255268 6184996 6154121 6081057 5900346 5697237 5501063 5471164
9237 5471164 5456490 5364916 5354567 5359578 5179675 4938269 4761021 4658147 4560575 4540379 4504433
9226 4504433 4485159 4506264 4543003 4592832 4518658 4375593 4213193 4014972 3883732 3827512 3867008
9215 3867008 3719344 3679412 3682989 3585323 3498346 3292364 3115828 3133267 3185290 3279953 3266844
9204 3266844 3192796 3041083 2838452 2752344 2598142 2551444 2490531 2443877 2311498 2310148 2330545
9193 2330545 2193487 2037545 1918770 1886225 1790752 1737027 1728221 1691946 1616123 1605460 1528906
9182 1528906 1491767 1534883 1481755 1390407 1365236 1346530 1378273 1406701 1452783 1524077 1449230
9171 1449230 1313914 1268605 1200627 1217367 1251156 1232853 1214590 1368172 1330484 1355611 1324238
$$ packed form
9248F419203l6259L2695o1469r8902p0272l0875p3064j80711k03109j96174k9899
9237E471164j4674r1574j0349N011j79903k41406j77248j02874r7572k0196l5946
9226D504433j9274K1105L6739M9829p4174j43065j62400j98221j31240n6220L9496
9215C867008j47664l9932L577r7666q6977k05982j76536J7439N2023R4663j3109
9204C266844p4048j51713k02631q6108j54202m6698o0913m6654j32379j350K0397
9193B330545j37058j55942j18775l2545r5473n3725q806l6275p5823j0663p6554
9182A528906l7139M3116n3128r1348k5171j8706L1743K8428M6082P1294p4847
9171A449230j35316m5309o7978J6740L3789j8303j8263J53582l7688K5127l1373
$$ plain form
9160 1324238 1168950 1210831 1122238 1141520 1143882 1196573 1286076 1372069 1378688 1225127 1059418
9149 1059418 1012984 1041212 950865 885710 828231 884229 947557 1061847 1017547 978237 832786
9138 832786 872729 877517 891852 965646 881108 792078 843355 815325 774062 725473 673320 537662
9126 537662 582130 555854 466977 437399 507047 573323 582852 633329 599408 473832 461497 401681
9114 401681 408207 657743 669649 544242 399315 361823 392382 410170 434472 366173 300299
9103 300299 303105 302289 330760 333663 196560 113409 145612 265586 286185 305848 336672 287073
9091 287073 274259 310825 435526 264864 11353 23277 77067 118260 157394 168382 252400
9080 252400 177642 68111 -9133 54232 174687 -3815 -116273 -240383 -189747 -102436 -170301
$$ packed form
9160A324238j55288M1881q8593J9282K362N2691Q9503Q5993O619j53561j65709
9149A059418m6434K8228r0347o5155n7479N5998O3328J14290m4300l9310j45451
9138H32786L9943M788J4335P3794q4538q9030N1277k8030m1263m8589n2153j35658
9126E37662M4468k6276q8877k9578O9648O6276R529N0477l3921j25576j2335n9816
9114D01681O526K49536J1906j25407j44927l7492L0559J7788K4302o8299o5874
9103C00299K806q16K8471K903j37103q3151L2203J19974K0599J9663L0824m9599
9091B87073j2814L6566J24701j70662k53511J1924N3790M1193L9134J0988Q4018
9080B52400p4758j09531p7244O3365J20455j78502j12458j24110N0636Q7311o7865
$$ plain form
9069 -170301 -126320 14061 47230 172900 153111 127056 99153 17014 83696 232807 245402
9058 245402 263425 190777 24990 11261 90764 102486 212724 247114 277567 211670 105502
9047 105502 85404 83042 32387 38090 92506 35899 73613 119872 106587 178118 172695 116175
9035 116175 24897 108463 96178 82541 62000 -48599 -58936 -46307 -122393 -60401 -136488
9024 -136488 -222407 -165044 -153648 -223159 -289193 -394211 -356926 -372276 -282185 -129133 -55966
9013 -55966 -54487 -123793 -104073 -65621 -98557 -63291 64503 66160 -56042 -34828 -3441 791
9001 791 -63841 -78231 -13411 44928 47356 -20336 78984 37868 1093 -27351 -45634 4462
8989 4462 35601 55040 63469 74707 72443 73740 18236 -14933 -66087 -141202 -201173 -182313 -139804
$$ packed form
9069a70301M3981J40381L3169J25670j9789k6055k7903q2139O6682J49111J2595
9058B45402J8023p2648j65787j3729P9503J1722J10238L4390L0453o5897j06168
9047A05502k0098k362n0655N703N4416n6607L7714M6259j3285P1531n423n6520
9035A16175r1278Q3566j2285j3637k0541j10599j0337J2629p6086O1992p6087
9024a36488q5919N7363J1396o9511o6034j05018L7285j5350R0091J53052P3167
9013e5966J479o9306J9720L8452l2936L5266J27794J657j22202K1214L1387M232
9001G91o4632j4390O4820N8339K428o7692R9320m1116l6775k8444j8283N0096
8989D462L1139J9439Q429J1238k264J297n5504l3169n1154p5115n9971J8860M2509
$$ plain form
8976 -139804 -117665 -92974 8547 62030 85885 51257 -41850 -11018 25601 72519 4532
8965 4532 -19749 -160571 -250891 -132478 -32646 -80224 -33807 58156 67799 -39850 -117091 -163320
8953 -163320 -263716 -275543 -250317 -217808 -12023 53152 -15286 -89308 -138165 -45126 35491
8942 35491 17410 -32650 -175571 -205975 -136300 -61693 -85455 -11258 -38907 25554 47881 -21150
8930 -21150 -115387 -69778 91158 218231 271970 163065 179984 190303 113866 90399 95366
8919 95366 95967 42546 3595 -26789 -123374 -101078 -26294 46995 71204 123327 70916 -4425
8907 -4425 115700 207101 75638 -14406 23138 29445 62819 144628 89726 11819 70026 154303
8895 154303 135958 -13905 -77504 -29092 118878 215611 271336 198275 217657 307240 193175
$$ packed form
8976a39804K2139K4691J01521N3483K3855l4628r3107L0832L6619M6918o7987
8965D532k4281j40822r0320J18413R9832m7578M6417R1963R643j07649p7241m6229
8953a63320j00396j1827K5226L2509K05785O5175o8438p4022m8857R3039Q0617
8942C5491j8081n0060j42921l0404O9675P4607k3762P4197k7649O4461K2327o9031
8930b1150r4237M5609J60936J27073N3739j08905J6919J0319p6437k3467M967
8919I5366O01n3421l8951l0384r6585K2296P4784P3289K4209N2123n2411p5341
8907d425J20125R1401j31463r0044L7544O307L3374Q1809n4902p7907N8207Q4277
8895A54303j8345j49863o3599M8412J47970R6733N5725p3061J9382Q9583j14065
$$ plain form
8884 193175 157680 99468 70517 106947 289983 380259 373934 406638 382314 261833 282169
8873 282169 261484 243847 313506 353406 302968 365925 448935 466532 491127 422278 360535 244295
8861 244295 132375 88092 193501 261825 276078 411368 394847 251359 181190 91790 179632
8850 179632 270183 233015 154159 148469 221669 194598 147690 108048 26904 11134 98345 185670
8838 185670 223080 159318 177715 273039 308847 190022 120318 73127 25290 -63460 -145751
8827 -145751 -90059 -36865 -6106 62355 94727 71003 9927 -30230 26020 79546 235828
8816 235828 145639 -103863 -48793 30319 43944 28338 44120 -43491 52623 124458 102915
8805 102915 77827 37138 78278 -26588 -144675 -78246 -11206 5570 -30004 -97739 -52802
$$ packed form
8884A93175l5495n8212k8951L6430J83036R0276o325L2704k4324j20481K0336
8873B82169k0685j7637O9659L9900n0438O2957Q3010J7597K4595o8849o1743j16240
8861B44295j11920m4283J05409O8324J4253J35290j6521j43488p0169q9400Q7842
8850A79632R0551l7168p8856n690P3200k7071m6908l9642q1144j5770Q7211Q7325
8838A85670L7410o3762J8397R5324L5808j18825o9704m7191m7837q8750q2291
8827a45751N5692N3194L0759O8461L2372k3724o1076m0157N6250N3526J56282
8816B35828r0189k49502N5070P9112J3625j5606J5782q7611R6114P1835k1543
8805A02915k5088m0689M1140j04866j18087O6429O7040J6776l5574o7735M4937
$$ plain form
8794 -52802 1079 -21100 -102409 8998 127747 90853 169490 167720 62205 14280 -56009
8783 -56009 -56349 -14441 25513 8902 68378 146774 103909 78987 77597 30601 95832 112523
8771 112523 102454 95036 55292 89058 69614 139277 103139 42634 -12491 -136898 -144270 -87181
8759 -87181 -47605 -14078 -63166 43564 57772 -98013 -106472 -63141 -12180 24150 80697 2763
8747 2763 25814 -29556 -90088 -46619 -36929 58528 171837 56370 8950 7168 5568 19072
8735 19072 -43229 -172741 -122921 -209660 -239898 -133969 -67487 352 14981 -6833 -32769
8724 -32769 24962 72920 133458 133995 -32881 -155325 -125067 -12731 -57253 -64376 36986 -24209
8712 -24209 -77740 -93537 -42359 -2115 -142676 -232551 -111702 -134414 -142104 -33154 97015
$$ packed form
8794e2802N3881k2179q1309J11407J18749l6894P8637j770j05515m7925p0289
8783e6009l40M1908L9954j6611N9476P8396m2865k4922j390m6996O5231J6691
8771A12523j0069p418l9744L3766j9444O9663l6138o0505n5125j24407p372N7089
8759h7181L9576L3527m9088J06730J4208j55785q459M3331N0961L6330N6547p7934
8747B763K3051n5370o0532M3469R690R5457J13309j15467m7420j782j600J3504
8735A9072o2301j29512M9820q6739l0238J05929O6482O7839J4629k1814k5936
8724c2769N7731M7958O0538N37j66876j22444L0258J12336m4522p123J01362o1195
8712b4209n3531j5797N1178M0244j40561q9875J20849k2712p690J08950J30169
$$ plain form
8701 97015 128740 -63864 -200657 -314166 -198481 -2816 48220 -46546 -6668 24297 -34588
8690 -34588 -66008 -112368 -126828 -71835 -3547 -31532 32583 47922 108110 129759 136688 101270
8678 101270 222890 172371 134405 83087 73110 89330 50655 -52700 -179688 -217895 -225935
8667 -225935 -184966 -150443 -258952 -272264 -250291 -167655 -39219 -84243 -102553 -15288 -52673
8656 -52673 -44403 -96751 -123743 -98151 -13952 61789 41088 66144 127470 132079 154589 9409
8644 9409 -97889 -31259 -124593 -230439 -88866 59782 -6876 -21784 -70157 -69770 -71179 46439
8632 46439 91420 124337 97044 66479 96889 84643 -48332 -103313 -11536 115477 14568
8621 14568 -14372 -26585 51418 39959 4555 50858 58411 112987 49477 72878 112264 186423
$$ packed form
8701I7015L1725j92604j36793j13509J15685J95665N1036r4766L9878L0965n8885
8690c4588l1420m6360j4460N4993O8288k7985O4115J5339O0188K1649O929l5418
8678A01270J21620n0519l7966n1318r977J6220l8675j03355j26988l8207q040
8667b25935M0969L4523j08509j3312K1973Q2636J28436m5024j8310Q7265l7385
8656e2673Q270n2348k6992K5592Q4199P5741k0701K5056O1326M609K2510j45180
8644I409j07298O6630r3334j05846J41573J48648o6658j4908m8373L87j409J17618
8632D6439M4981L2917k7293l0565L0410j2246j32975n4981R1777J27013j00909
8621A4568k8940j2213P8003j1459l5404M6303P553N4576o3510K3401L9386P4159
$$ plain form
8609 186423 221979 101660 49785 -18834 -146566 -126904 -93698 -8168 119236 272662 181176
8598 181176 55458 135599 -9756 -97934 -131544 -275348 -407468 -294328 -82021 -1961
8588 -1961 11466 -15792 107223 236948 250510 133381 -21141 -38182 -23516 19644 7352
8577 7352 16475 39371 12761 -49278 -88698 -34309 58808 -3889 -172457 -185448 -74510 49576
8565 49576 -61331 -37528 -8723 -70637 -55873 37987 143181 127308 -9909 60011 103249
8554 103249 85462 57411 -88511 -103999 -5743 -22235 -29027 -74118 -86092 -7198 70476 -18472
8542 -18472 -27107 55756 93311 69247 10852 64990 -30086 -46028 -123750 -37617 140882 124652
8530 124652 -37020 -99099 -46730 10221 -129901 -219765 -178254 -53547 -36677 -20925 32734
$$ packed form
8609A86423L5556j20319n1875o8619j27732J9662L3206Q5530J27404J53426r1486
8598A81176j25718Q0141j45355q8178l3610j43804j32120J13140K12307Q0060
8588a961J3427k7258J23015J29725J3562j17129j54522j7041J4666M3160j2292
8577G352R123K2896k6610o2039l9420N4389R3117o2697j68568j2991J10938J24086
8565D9576j10907K3803K8805o1914J4764R3860J05194j5873j37217O9920M3238
8554A03249j7787k8051j45922j5488R8256j6492o792m5091j1974P8894P7674q8948
8542a8472q635Q2863L7555k4064n8395N4138r5076j5942p7722Q6133J78499j6230
8530A24652j61672o2079N2369N6951j40122q9864M1511J24707J6870J5752N3659
$$ plain form
8519 32734 86410 59097 24470 16632 41063 81612 140223 168739 165558 202340 148180 54963
8507 54963 119274 78312 -107996 -240984 -271526 -43276 88500 28416 26041 44023 28109
8496 28109 83554 79039 -36516 -90823 -157161 -69459 50218 -46917 -122258 -126715 -164858 -158329
8484 -158329 -101763 -58498 -94907 -51434 -41582 -118397 -110922 -123347 -178046 -62862 -114 28646
8472 28646 32956 89056 24503 -134074 -191240 -93896 -133018 -66073 72674 -5631 -43813 128599
8460 128599 175749 237785 268019 213507 68723 77200 74070 126233 48631 -31722 -117504 -198808
8448 -198808 -140023 -180766 -238159 -326745 -331627 -245445 -211816 -177966 -116952 -106376 19185 49981
8436 49981 -33454 -37208 -17220 12817 140581 62497 20535 110250 152189 -28557 -19867 80959
$$ packed form
8519C2734N3676k7313l4627p838K4431M0549N8611K8516l181L6782n4160r3217
8507E4963O4311m0962j86308j32988l0542K28250J31776o0084k375J7982j5914
8496B8109N5445m515j15555n4307o6338Q7702J19677r7135p5341m457l8143O529
8484a58329N6566M3265l6409M3473R852p6815P475j2425n4699J15184O2748K8760
8472B8646M310N6100o4553j58577n7166R7344l9122O6945J38747p8305l8182J72412
8460A28599M7150O2036L0234n4512j44784Q477l130N2163p7602q0353q5782q1304
8448a98808N8785m0743n7393q8586m882Q6182L3629L3850O1014J0576J25561L0796
8436D9981q3435l754J9988L0037J27764p8084m1962Q9715M1939j80746Q690J00826
$$ plain form
8424 80959 62887 4781 -82409 -88988 -35652 -114743 -174690 -155102 -79457 -23235 72892 68372
8412 68372 103961 87515 33133 190538 162370 103105 90066 85575 46558 112965 41670 -16064
8400 -16064 2804 95104 66181 3431 -87256 -87055 -51778 76377 42850 68085 48074 -103686
8388 -103686 -113105 -72108 53021 28193 -154534 -188865 -125589 81647 193273 95536 -13306
8377 -13306 35636 102298 67423 30016 -12173 -154456 -306753 -251749 -149527 -137197 -243747
8366 -243747 -268878 -201057 -185245 -269796 -204942 -201078 -232024 -158216 -123836 -62656 10130 -52184
8354 -52184 -48021 7440 108823 220125 180371 159743 174921 142049 2169 -77027 -4361
8343 -4361 38766 -24378 -58649 -78925 -164706 -120435 -151045 -219938 -176929 -123034 58377 110226
$$ packed form
8424H0959j8072n8106q7190o579N3336p9091n9947J9588P5645N6222R6127m520
8412F8372L5589j6446n4382J57405k8168n9265j3039m491l9017O6407p1295n7734
8400a6064J8868R2300k8923o2750r0687K01L5277J28155l3527K5235k0011j51760
8388a03686r419M0997J25129k4828j82727l4331O3276K07236J11626r7737j08842
8377a3306M8942O6662l4875l7407m2189j42283j52297N5004J02222J2330j06550
8366b43747k5131O7821J5812q4551O4854L864l0946P3808L4380O1180P2786o2314
8354e2184M163N5461J01383J11302l9754k0628J5178l2872j39880p9196P2666
8343d361M3127o3144l4271k0276q5781M4271l0610o8893M3009N3895J81411N1849
$$ plain form
8331 110226 81661 64883 -11308 -85985 -33077 -42797 70176 58198 126681 68963 -181320
8320 -181320 -210911 -186960 -71676 -175919 -255063 -135161 -132246 -113252 2013 26092 5740
8309 5740 106828 176809 127772 127331 169316 128813 88092 77496 1025 -30172 -134115 -257504
8297 -257504 -248219 -226775 -142921 15558 96269 43622 68430 108384 102793 113514 161261 155075
8285 155075 98401 70250 32674 55349 92568 46989 54441 813 12822 66591 79212 170070
8273 170070 192541 217385 236502 227600 8904 -78803 117896 297524 291519 234614 102763
8262 102763 161024 160896 157417 121283 29600 -68760 -203264 -243160 -204909 -154196 -210502 -149267
8250 -149267 -69170 -2039 12342 49156 932 -42090 -163824 -207376 -88066 14367 -75653
$$ packed form
8331A10226k8565j6778p6191p4677N2908r720J12973j1978O8483n7718k50283
8320a81320k9591K3951J15284j04243p9144J19902K915J8994J15265K4079k0352
8309E740J01088O9981m9037m41M1985m0503m0721j0596p6471l1197j03943j23389
8297b57504R285K1444Q3854J58479Q0711n2647K4808L9954n591J0721M7747o186
8285A55075n6674k8151l7576K2675L7219m5579P452n3628J2009N3769J2621R0858
8273A70070K2471K4844J9117q902k18696q7707J96699J79628o005n6905j31851
8262A02763N8261j28l479l6134r1683r8360j34504l9896L8251N0713n6306O1235
8250a49267Q0097O7131J4381L6814m8224m3022j21734m3552J19310J02433r0020
$$ plain form
8239 -75653 11502 27346 25230 89673 94733 100177 168275 206708 98677 68344 14978 16777
8227 16777 -9724 -38927 -97561 -197459 -325167 -206725 -97123 -87178 -170983 -161921 -208904 -105599
8215 -105599 -12464 -61641 -57120 -12964 107108 52470 -60145 -64410 60574 41101 147545
8204 147545 117091 72637 119331 160672 171799 107545 13234 -8449 -50058 -120341 -54740 -8697
8192 -8697 -135173 -190029 -44294 -35137 -160563 -122123 -69960 -100948 -27187 41849 -30786 -73963
8180 -73963 -33554 12833 -129209 -137855 11513 33745 -11566 -144550 -183896 -118188 -89711
8169 -89711 -126599 -132431 -182746 -225130 -70568 19780 -42104 -47099 -45983 19093 73400 67017
8157 67017 47707 -65091 -81375 7223 134974 175178 194111 228403 172538 72705 34276
$$ packed form
8239g5653Q7155J5844k116O4443N060N444O8098L8433j08031l0333n3366J799
8227A6777k6501k9203n8634r9898j27708J18442J09602R945q3805R062m6983J03305
8215a05599R3135m9177M521M4156J20072n4638j12615m265J24984j9473J06444
8204A47545l0454m4454M6694M1341J1127o4254r4311k1683m1609p0283O5601M6043
8192h697j26476n4856J45735R157j25426L8440N2163l0988P3761O9036p2635m3177
8180g3963M0409M6387j42042q646J49368K2232m5311j32984l9346O5708K8477
8169h9711l6888n832n0315m2384J54562R0348o1884m995J116O5076N4307o383
8157F7017j9310j12798j6284Q8598J27751M0204J8933L4292n5865r9833l8429
$$ plain form
8146 34276 164322 325016 308606 288690 321473 143845 -68787 -99164 23320 -15739 -55833
8135 -55833 -64079 -131844 -89156 -28897 63193 13368 -54555 22600 89016 140194 190354 151382
8123 151382 126458 199915 219790 172975 139889 -32327 -141466 -248780 -297207 -148120 -95969
8112 -95969 -147292 -61902 12847 -36483 -33945 -86854 530 76867 79353 26212 42047 44788
8100 44788 36669 56799 26874 -24792 85555 70347 76274 39434 8413 -19963 11944 -3920
8088 -3920 -110274 -16587 44223 43621 -51391 2914 122432 31225 46520 -22701 22414 9093
8076 9093 -29370 42007 131121 56235 -18449 -48952 -1262 30728 887 -115897 -261000 -244100
8064 -244100 -58234 -83843 -207503 -245563 -187769 -88286 -150130 -214784 -285996 -245948 -177326
$$ packed form
8146C4276J30046J60694j6410j9916L2783j77628k12632l0377J22484l9059m0094
8135e5833q246o7765M2688O0259R2090m9825o7923P7155O6416N1178N0160l8972
8123A51382k4924P3457J9875m6815l3086j72216j09139j07314m8427J49087N2151
8112i5969n1323Q5390P4749m9330K538n2909Q7384P6337K486n3141J5835K741
8100D4788q119K0130k9925n1666J10347j5208N927l6840l1021k8376L1907j5864
8088c920j06354R3687O0810o02r5012N4305J19518r1207J5295o9221M5115j3321
8076I093l8463P1377Q9114p4886p4684l0503M7690L1990k9841j16784j45103J6900
8064b44100J85866k5609j23660l8060N7794R9483o1844o4654p1212M0048O8622
$$ plain form
8053 -177326 -141062 -74045 -135596 -103562 -125262 -209279 -203959 -129967 -152715 -122863 -188746 -151904
8041 -151904 -177227 -243564 -290293 -242662 -206955 -129285 -63290 -126368 -122730 -15053 -114392 -150842
8029 -150842 -155371 -99022 -140475 -213443 -214265 -40306 31963 47233 31815 -58725 -103424 -169402
8017 -169402 -149580 -63237 49582 148435 131520 3983 -29243 -48518 -237638 -252704 -155992
8006 -155992 -102296 -111270 -115080 -103370 -89801 2219 2747 277 5404 -114301 -132797 -165383 -226882
7993 -226882 -172816 -117168 -103987 -46665 -53542 41746 131432 44115 -13748 -95221 -45599 55070
7981 55070 97578 177296 277615 252857 101344 89528 155820 166411 118271 104511 147407
7970 147407 124336 84906 -5178 -76919 -74925 -120645 -150776 -41831 9557 -133096 -221137
$$ packed form
8053a77326L6264O7017o1551L2034k1700q4017N320P3992k2748K9852o5883L6842
8041a51904k5323o6337m6729M7631L5707P7670O5995o3078L638J07677r9339l6450
8029a50842m529N6349m1453p2968q22J73959P2269J5270j5418r0540m4699o5978
8017a69402J9822Q6343J12819R8853j6915j27537l3226j9275j89120j5066R6712
8006a55992N3696q974l810J1710J3569R2020N28k470N127j19705j8496l2586o1499
7993b26882N4066N5648J3181N7322o877R5288Q9686q7317n7863q1473M9622J00669
7981E5070M2508P9718J00319k4758j51513j1816O6292J0591m8140j3760M2896
7970A47407k3071l9430r0084p1741J994m5720l0131J08945N1388j42653q8041
$$ plain form
7959 -221137 -202071 -193969 -110665 -44206 -5584 64187 92293 -5815 -139283 -164630 -138827 -67414
7947 -67414 -38288 -73829 -96984 -78336 -97699 -66577 -63377 -93850 -115228 -167344 -145214 -125110
7935 -125110 -173762 -124508 49345 73895 21202 14728 -30341 -18660 3278 -1078 -41649 -37029
7923 -37029 -46258 -2100 -41686 -72122 -14098 41749 -5315 -214435 -293159 -162759 -66995 -91407
7911 -91407 -29986 47943 46336 30130 25670 85970 -37801 -6982 83437 143434 -46938 -220923
7899 -220923 -225318 -178375 -154884 -50455 -83341 -149048 -113183 -5231 9089 -86924 -130548
7888 -130548 -73871 11363 -15941 -23001 57012 -21526 -45934 -43394 -54065 -180822 -178669 -222406
7876 -222406 -339373 -326007 -177492 -44683 43306 34708 65118 69386 -160720 -223460 -34342
$$ packed form
7959b21137J9066Q102Q3304O6459L8622O9771K8106r8108j33468k5347K5803P1413
7947f7414K9126l5541k3155J8648j9363L1122L200l0473k1378n2116K2130K0104
7935a25110m8652M9254J73853K4550n2693o474m5069J1681K1938m356m0571M620
7923c7029r229M4158l9586l0436N8024N5847m7064k09120p8724J30400R5764k4412
7911i1407O1421P7929j607j6206m460O0300j23771L0819R0419N9997j90372j73985
7899b20923m395M6943K3491J04429l2886o5707L5865J07952J4320r6013m3624
7888a30548N6677Q5234k7304p060Q0013p8538k4408K540j0671j26757K153m3737
7876b22406j16967J3366J48515J32809Q7989q598L0410M268k30106o2740J89118
$$ plain form
7865 -34342 -9452 38494 -20140 -124677 -123186 -167079 -141202 -70489 -106310 -100749 -75331 51038
7853 51038 22732 11596 -78058 -78482 -66228 -43951 -9559 49209 135590 107382 6413 -57962
7841 -57962 -11842 -61917 59829 22197 -113943 -141507 -90410 -14527 -73943 -97010 15308
7830 15308 109814 92537 55153 52585 1482 -25468 14111 21790 -39615 -13011 -47377 -57421
7818 -57421 -55970 -130931 -16133 22133 -19410 64603 61907 96668 -12429 -104930 -147374 -176163
7806 -176163 -96810 -77114 2207 -27980 19199 16583 -32254 -51558 -17438 50125 28284 -7767
7794 -7767 -49645 -22814 42250 130531 49933 -49768 26951 161826 80214 24039 29119 -77784
7782 -77784 2163 -46021 -118036 -103582 -60418 73610 138082 28062 72189 -2576 74705
$$ packed form
7865c4342K4890M7946n8634j04537J491m3893K5877P0713l5821N561K5418J26369
7853E1038k8306j1136q9654m24J2254K2277L4392N8768Q6381k8208j00969o4375
7841e7962M6120n0075J21746l7632j36140k7564N1097P5883n9416k3067J12318
7830A5308R4506j7277l7384k568n1103k6950L9579P679o1405K6604l4366j0044
7818e7421J451p4961J14798L8266m1543Q4013k696L4761j09097r2501m2444k8789
7806a76163P9353J9696P9321l0187M7179k616m8837j9304L4120O7563k1841l6051
7794g767m1878K6831O5064Q8281q0598r9701P6719J34875q1612n6175N080j06903
7782g7784P9947m8184p2015J4454M3164J34028O4472j10020M4127p4765P7281
$$ plain form
7771 74705 148663 173758 30587 -113150 -61452 -64661 -107369 -174628 -116964 -80815 -28024 79960
7759 79960 -13614 -67338 -48770 -181084 -139503 15140 22675 -50814 43532 54651 18322 71395
7747 71395 42138 -17774 -47508 -42912 90573 123988 -6962 -86216 66945 123699 70582
7736 70582 13092 -74616 -62442 -2585 -30394 -118505 -120052 -107788 -205174 -206330 -172351 -134867
7724 -134867 -134850 37154 41632 -2885 60954 96571 103141 112311 99005 -633 -101620 -28776
7712 -28776 46971 64680 -4605 -90999 -197851 -242249 -190456 -64950 49672 95453 157075
7701 157075 269657 215937 168923 158737 104726 62842 33072 66693 21727 15786 -50021 4563
7689 4563 4021 48076 12743 -125651 -172412 -180594 -170534 -242296 -126744 128767 167811 162533
$$ packed form
7771G4705P3958K5095j43171j43737N1698l209m2708o7259N7664L6149N2791J07984
7759G9960r3574n3724J8568j32314M1581J54643P535p3489R4346J1119l6329N3073
7747G1395k9257n9912k9734M596J33485L3415j30950p9254J53161N6754n3117
7736G0582n7490q7708J2174N9857k7809q8111j547J2264r7386j156L3979L7484
7724a34867J7J72004M478m4517O3839L5617O570R170j3306r9638j00987P2844
7712b8776P5747J7709o9285q6394j06852m4398N1793J25506J14622M5781O1622
7701A57075J12582n3720m7014j0186n4011m1884k9770L3621m4966n941o5807N4584
7689D563n42M4055l5333j38394m6761q182J0060p1762J15552K55511L9044n278
$$ plain form
7677 162533 92279 -6980 24893 86772 141823 63327 93920 100076 5737 -91221 -50887 -124588
7665 -124588 -19972 18260 -30225 -125064 -56762 -82692 -50345 55340 110377 105164 25311
7654 25311 -82873 -52847 -67156 -29829 32704 -20687 -88222 -48445 80456 151699 189533
7643 189533 200092 16865 101675 100801 54508 85215 130258 78506 146486 120602 96122 70251
7631 70251 24031 -73041 -77386 51064 106191 34311 93419 56292 61642 99609 140019 64722
7619 64722 65066 -13061 9472 99771 28976 85285 7459 -97915 -70484 -56096 -155085 -227069
7607 -227069 -174948 -70941 7822 47473 -114660 -170709 -186201 -230893 -188314 -140621 -161118
7596 -161118 -128970 -139042 -133176 -178765 -64159 48282 20706 -13624 -70838 -114296 -138804
$$ packed form
7677A62533p0254r9259L1873O1879N5051p8496L0593O156r4339r6958M0334p3701
7665a24588J04616L8232m8485r4839O8302k5930L2347J05685N5037n213p9853
7654B5311j08184L0026j4309L7327O2533n3391o7535L9777J28901P1243L7834
7643A89533J0559j83227Q4810q74m6293L0707M5043n1752O7980k5884k4480k5871
7631G0251m6220r7072m345J28450N5127p1880N9108l7127N350L7967M0410p5297
7619F4722L44p8127K2533R0299p0795N6309p7826j05374K7431J4388r8989p1984
7607b27069N2121J04007P8763L9651j62133n6049j5492m4692M2579M7693k0497
7596a61118L2148j0072N866m5589J14606J12441k7576l4330n7214m3458k4508
$$ plain form
7585 -138804 -174954 -17026 46273 -4186 -26267 96820 60075 52935 39653 110390 97457
7574 97457 38740 -24007 -39108 -36586 -4410 113463 125219 151607 160835 113594 109444 100741
7562 100741 84241 129922 8823 -34455 79376 76914 38712 -65001 -150170 -114230 11160
7551 11160 -37792 -192681 -204347 -213079 -187614 -117692 -37720 -10998 6765 34845 -111971 -159833
7539 -159833 -51598 7009 19421 37136 -118491 -170877 -233406 -229774 -236982 -259769 -223448 -144112
7527 -144112 -155503 -92328 -51613 -111265 -196137 -186484 -45388 -36428 -24793 -44245 25118 -62111
7515 -62111 -79787 -109609 -163832 -58338 30650 102847 104701 111623 153851 190656 157304 98456
7503 98456 182849 275875 229172 102113 104174 48459 -111608 -208070 -220242 -159150 -134831 35185
$$ packed form
7585a38804l6150J57928O3299n0459k2081J23087l6745p140j3282P0737j2933
7574I7457n8717o2747j5101K522L2176J17873J1756K6388R228m7241m150q703
7562A00741j6500M5681j21099m3278J13831k462l8202j03713q5169L5940J25390
7551A1160m8952j54889j1666q732K5465O9922P9972K6722J7763K8080j46816m7862
7539a59833J08235N8607J2412J7715j55627n2386o2529L632p208k2787L6321P9336
7527a44112j1391O3175M0715n9652q4872R653J41096Q960J1635j9452O9363q7229
7515f2111j7676k9822n4223J05494Q8988P2197J854O922M2228L6805l3352n8848
7503I8456Q4393R3026m6703j27059K061n5715j60067r6462j2172O1092K4319J70016
$$ plain form
7491 35185 206393 205412 253695 172573 72418 182742 213830 74081 -40653 -305 15537
7480 15537 107660 142815 118621 -14327 -2244 10811 -28508 -42693 -125687 -213102 -142244 -53065
7468 -53065 -20908 -5991 36541 28885 6480 24455 188736 206528 169324 209881 221066 211283
7456 211283 179909 -19946 -140536 -108423 -147328 -105375 -86205 -99462 51329 71892 31283
7445 31283 12308 -54070 -32424 -21814 -89795 -163527 -138420 -102941 -72042 -104092 -175943 -262285
7433 -262285 -177635 -106552 -90552 -136679 -182876 -232100 -186089 -98885 -18332 -16301 63735 114517
7421 114517 -5624 -81903 17267 182610 184440 93350 29367 -19969 54844 124611 19154
7410 19154 -119225 -168788 -51759 31227 -27196 -86504 -136461 -272684 -155908 -110048 -176664
$$ packed form
7491C5185J71208r81M8283q1122j00155J10324L1088j39749j14734M0348J5842
7480A5537R2123L5155k4194j32948J2083J3055l9319j4185q2994q7415P0858Q9179
7468e3065L2157J4917M2532p656k2405J7975J64281J7792l7204M0557J1185r783
7456B11283l1374j99855j20590L2113l8905M1953J9170j3257J50791K0563m0609
7445C1283j8975o6378K1646J0610o7981p3732K5107L5479L0899l2050p1851q6342
7433b62285Q4650P1083J6000m6127m6197m9224M6011Q7204Q0553K031Q0036N0782
7421A14517j20141p6279R9170J65343J830r1090o3983m9336P4813O9767j05457
7410A9154j38379m9563J17029Q2986n8423n9308m9957j36223J16776M5860o6616
$$ plain form
7399 -176664 -251741 -96178 -8745 -122634 -210272 -201129 -105949 -49810 21474 -13401 -25435
7388 -25435 50629 87731 49477 22569 7058 -454 53074 85820 168304 14895 -104513 -140027
7376 -140027 -67783 11996 11265 8086 134534 173484 97062 5038 -58076 -232719 -312228 -251060
7364 -251060 -186103 -133671 -78427 -45951 -10790 11579 14628 -16292 6104 58444 85048 45409
7352 45409 -11342 1196 101440 114627 107245 100981 86236 32773 166585 172793 158540 186742
7340 186742 253705 218065 84869 -13054 22693 81299 80896 64305 73006 59826 -41908 -76249
7328 -76249 -108514 -180127 -181357 -34268 -40441 2910 37014 53148 106575 191101 143360 136046
7316 136046 124595 83448 14063 75363 165384 218100 219081 119900 168148 94881 68151 -40637
$$ packed form
7399a76664p5077J55563Q7433j13889q7638R143R5180N6139P1284l4875j2034
7388b5435P6064L7102l8254k6908j5511p512N3528L2746Q2484j53409j19408l5514
7376a40027P2244P9779p31l179J26448L8950p6422r2024o3114j74643p9509O1168
7364b51060O4957N2432N5244L2476L5161K2369L049l0920K2396N2340K6604l9639
7352D5409n6751J2538J00244J3187p382o264j4745n3463J33812O208j4253K8202
7340A86742O6963l5640j33196r7923L5747N8606m03j6591Q701j3180j01734l4341
7328g6249l2265p1613j230J47089o173M3351L4104J6134N3427Q4526m7741p314
7316A36046j1451m1147o9385O1300R0021N2716R81r9181M8248p3267k6730j08788
$$ plain form
7304 -40637 68413 199041 141985 152048 95069 33378 8438 -7676 14810 99786 49343
7293 49343 109553 27513 -55421 -102229 48681 153361 62688 -50931 -11200 66568 76921
7282 76921 136422 248004 372119 548750 587978 551559 450205 515599 530401 482081 360024
7271 360024 241085 114498 -61624 -98561 -45776 -40211 -33123 -14874 -46451 11070 99191
7260 99191 154522 119221 58705 167687 238119 201364 144191 83019 18500 -71628 3260 61196
7248 61196 20394 -39137 -69965 8535 38748 54141 -62574 -67651 -101673 -117174 -62816 -36834
7236 -36834 28127 48159 -38202 41602 204830 379316 544586 804899 934755 971345 932056
7225 932056 981970 962380 669224 356306 169599 185376 278912 260914 152073 134255 247000
$$ packed form
7304d0637J09050J30628n7056J0063n6979o1691k4940j6114K2486Q4976n0443
7293D9343O0210q2040q2934m6808J50910J04680r0673j13619L9731P7768J0353
7282G6921N9501J11582J24115J76631L9228l6419j01354O5394J4802m8320j22057
7271C60024j18939j26587j76122l6937N2785N565P088J8249l1577N7521Q8121
7260I9191N5331l5301o0516J08982P0432l6755n7173o1172o4519r0128P4888N7936
7248F1196m0802n9531l0828P8500L0213J5393j16715n077l4022j5501N4358K5982
7236c6834O4961K0032q6361P9804J63228J74486J65270K60313J29856L6590l9289
7225I32056M9914j9590k93156l12918j86707J5777R3536j7998j08841j7818J12745
$$ plain form
7214 247000 161478 54114 55520 58556 80965 173507 141608 138446 51909 -84295 -84278 -56076
7202 -56076 43779 145254 103277 -47874 -104887 31508 100333 104243 100231 110114 203676 244749
7190 244749 67756 77875 122217 120156 91587 100815 178138 164119 93896 62306 -19527 -73321
7178 -73321 -73250 70875 144862 131426 154312 50279 -137694 -173908 -119612 -85532 -101800 -87558
7166 -87558 10823 71706 44734 9984 -34900 -55171 -171154 -189960 -291795 -203882 -122549
7155 -122549 8639 114452 78332 89084 -2858 -64610 -98018 -96364 -149005 -119699 -62063
7144 -62063 -899 -2726 15445 -13077 -121285 -80992 -118196 -89983 9016 73745 149073 278959
7132 278959 258832 173548 101508 101037 54918 -22057 35655 60532 -23965 -13078 37113 11717
$$ packed form
7214B47000q5522j07364J406L036K2409R2542l1899l162q6537j36204J7K8202
7202e6076R9855J01475m1977j51151n7013J36395O8825L910m012R883R3562M1073
7190B44749j76993J0119M4342k061k8569R228P7323j4019p0223l1590q1833n3794
7178g3321P1J44125P3987j3436K2886j04033j87973l6214N4296L4080j6268J4242
7166h7558R8381O0883k6972l4750m4884k0271j15983j8806j01835Q7913Q1333
7155a22549J31188J05813l6120J0752r1942o1752l3408J654n2641K9306N7636
7144f2063O1164j827J8171k8522j08208M0293l7204K8213R8999O4729P5328J29886
7132B78959k0127q5284p2040m71m6119p6975N7712K4877q4497J0887N0191k5396
$$ plain form
7120 11717 8262 35281 5109 7155 43961 117640 67124 73011 -2170 -111964 -117262 -56911
7108 -56911 -107171 -27580 -54431 -47206 -78950 -81210 -202184 -260074 -146289 -67103 -87113 -66207
7096 -66207 -85117 75860 108825 91906 25497 -114805 -109227 -16544 -21523 -36912 -90853 -16572
7084 -16572 -35823 -39921 -111249 -166260 -17075 71814 90435 53392 53173 -2076 33619 -24171
7072 -24171 -163205 -183307 -233671 -162036 -85807 93118 118038 -12750 -5908 133549 136213
7061 136213 94493 -5408 25933 31884 11869 -94664 -70590 -50740 -67322 20384 47913 54492
7049 54492 12308 -6558 -16815 -87754 -63940 -96334 -73826 24526 67309 44937 -62179 -29994
7037 -29994 -27408 -68084 57123 162181 59621 28917 120998 47735 -125800 -58963 -103928
$$ packed form
7120A1717l455K7019l0172K046L6806P3679n0516N887p5181j09794n298O0351
7108e6911n0260P9591k6851P225l1744k260j20974n7890J13785P9186k0010K0906
7096f6207j8910J60977L2965j6919o6409j40302N578R2683m979j5389n3941P4281
7084a6572j9251m098p1328n5011J49185Q8889J8621l7043k19n5249L5695n7790
7072b4171j39034k0102n0364P1635P6229J78925K4920j30788O842J39457K664
7061A36213m1720r9901L1341N951k0015j06533K4074J9850j6582Q7706K7529O579
7049E4492m2184j8866j0257p0939K3814l2394K2508R8352M2783k2372j07116L2185
7037b9994K586m0676J25207J05058j02560l0704R2081p3263j73535O6837m4965
$$ plain form
7026 -103928 -187771 -243508 -149733 -124490 -216843 -169742 -83490 -47965 -37368 -19796 25668 53577
7014 53577 -62930 -104097 -31725 48901 -68058 -145312 -71261 -82521 -131413 -34423 163515
7003 163515 149924 5015 -15532 50611 31243 22663 21632 48295 87925 25115 29625 -14060
6991 -14060 -102991 -182386 -54235 -15169 -43060 101036 112226 -5721 4897 -945 51979
6980 51979 -41849 -9194 -28670 -93226 -137527 -91865 -35041 3192 -43575 -57797 -7939 47971
6968 47971 62866 75391 29474 155220 170723 29227 -40711 -9851 -12416 -12469 -406 -23826
6956 -23826 61764 -6493 -178845 -130484 -194364 -244508 -93901 33751 115522 25720 -80399
6945 -80399 -25555 39469 -111160 -159112 -127005 -91688 -45581 -90421 -90347 -77015 -90035 -124763
$$ packed form
7026a03928q3843n5737R3775K5243r2353M7101Q6252L5525J0597J7572M5464K7909
7014E3577j16507m1167P2372Q0626j16959p7254P4051j1260m8892R6990J97938
7003A63515j3591j44909k0547O6143j9368q580j031K6663L9630o2810M510m3685
6991a4060q8931p9395J28151L9066k7891J44096J1190j17947J0618n842N2924
6980E1979r3828L2655j9476o4556m4301M5662N6824L8233m6767j4222M9858N5910
6968D7971J4895J2525m5917J25746J5503j41496o9938L0860k565n3J2063k3420
6956b3826Q5590o8257j72352M8361o3880n0144J50607J27652Q1771q9802j06119
6945h0399N4844O5024j50629m7952L2107L5317M6107m4840P4J3332j3020l4728
$$ plain form
6933 -124763 -186211 -162132 -121266 -160497 -81683 10658 -5351 -91062 -158628 -138527 -130671 -83467
6921 -83467 -67105 46992 122092 68624 146756 113368 61909 -88839 -185462 -162739 -193393
6910 -193393 -229125 -154921 -120482 -102616 -111752 -127901 -118592 -42791 -32675 -142217 -133684 -69086
6898 -69086 28497 117121 123349 116404 53627 -63745 -153655 -64241 -128525 -170120 -182467 -68043
6886 -68043 56369 61831 79225 44850 -51749 -2576 37401 33012 57607 26410 -2111 5289
6874 5289 2424 66813 93599 119593 -30838 -85117 -84622 -155728 -145289 8365 114166 62427
6862 62427 30666 127428 117498 24164 48182 78895 -15121 -92183 -70293 -50696 -152972 -171338
6850 -171338 -177606 -119083 -227853 -249744 -276328 -354642 -305216 -142471 28759 -6112 -67178
$$ packed form
6933a24763o1448K4079M0866l9231P8814R2341j6009q5711o7566K0101P856M7204
6921h3467J6362J14097P5100n3468P8132l3388n1459j50748r6623K2723l0654
6910a93393l5732P4204L4439J7866r136j6149R309P5801J0116j09542Q533O4598
6898f9086R7583Q8624O228o945o2777j17372q9910Q9414o4284m1595j2347J14424
6886f8043J24412N462J7394l4375r6599M9173L9977m389K4595l1197k8521P400
6874E289k865O4389K6786K5994j50431n4279M95p1106J0439J53654J05801n1739
6862F2427l1761R6762r930r3334K4018L0713r4016p7062K1890J9597j02276j8366
6850a71338o268N8523j08770k1891k6584p8314M9426J62745J71230l4871o1066
$$ plain form
6839 -67178 -51128 -105558 -136321 39850 129715 83380 68216 105417 46638 65977 16735 -32931
6827 -32931 -23034 58090 102250 94924 -68919 -117399 -49644 18370 149372 170510 103523 158749
6815 158749 144616 148293 78075 33173 90486 173947 117821 16542 35068 77473 63072 132322
6803 132322 58143 -37387 30034 -12765 -54246 69021 36852 -51588 25172 98938 46816
6792 46816 88675 71530 10328 12829 24754 48308 43730 -114855 -24122 86399 48321 32460
6780 32460 65492 96374 67505 -82366 -168787 -55949 48771 134386 99339 -36786 -67243
6769 -67243 -41569 16424 6832 -83812 -99112 -50893 -30789 -164340 -76782 -24053 -23413 49356
6757 49356 89904 114220 22461 -111689 -214805 -123689 670 79668 -9185 -95469 -27152
$$ packed form
6839f7178J6050n4430l0763J76171Q9865m6335j5164L7201n8779J9339m9242m9666
6827c2931R897Q1124M4160p326j63843m8480O7755O8014J31002K1138o6987N5226
6815A58749j4133L677p0218m4902N7313Q3461n6126j01279J8526M2405j4401O9250
6803A32322p4179r5530O7421m2799m1481J23267l2169q8440P6760P3766n2122
6792D6816M1859j7145o1202K501J1925K3554m578j58585R0733J10521l8078j5861
6780C2460L3032L0882k8869j49871q6421J12838J04720Q5615l5047j36125l0457
6769f7243K5674N7993r592r0644j5300M8219K0104j33551Q7558N2729O40P2769
6757D9356M0548K4316r1759j34150j03116R1116J24359P8998q8853q6284O8317
$$ plain form
6746 -27152 -107738 -95011 25997 -7217 19175 24896 35486 24094 34159 -31130 -14406 -34934
6734 -34934 25607 48969 29591 -1477 -49555 -63409 -103220 -301022 -351644 -171895 -67009
6723 -67009 23500 152045 145539 73071 -104943 -221526 -108861 -45415 58118 13948 -40512
6712 -40512 8011 525 -5479 41439 12629 83585 153440 114239 93500 37192 19063 -41701
6700 -41701 -106667 -173701 -95118 -92933 -172110 -201126 -162948 40803 42963 -6067 77947 105301
6688 105301 -72284 -161358 -50056 143965 100028 -31610 -70446 28555 12458 -45940 -7240
6677 -7240 -2347 24516 39752 -62305 -94298 -44820 82182 14725 12141 49095 -12615 18243
6665 18243 112287 151014 169999 87993 -29951 46323 46159 -36429 4132 115357 58727 108084
$$ packed form
6746b7152q0586J2727J21008l3214K6392N721J0590j1392J0065o5289J6724k0528
6734c4934O0541K3362j9378l1068m8078j3854l9811j97802n0622J79749J04886
6723f7009R0509J28545o506p2468j78014j16583J12665O3446J03533m4170n4460
6712d0512M8523p486o004M6918k8810P0956O9855l9201k0739n6308j8129o0764
6700d1701o4966o7034P8583K185p9177k9016L8178K03751K160m9030Q4014K7354
6688A05301j77585q9074J11302J94021m3937j31638l8836R9001j6097n8398L8700
6677g240M893K6863J5236j02057l1993M9478J27002o7457k584L6954o1710L0858
6665A8243R4044L8727J8985q2006j17944P6274j64q2588M0561J11225n6630M9357
$$ plain form
6653 108084 72077 -38113 -134468 -25247 116963 209281 208970 24874 -134734 -138410 -76227
6642 -76227 -157883 -196240 -158858 -144431 -177189 -134788 -107269 -25664 91192 59812 3904 33584
6630 33584 -47161 -150253 -164644 -198743 -186245 -100634 -106934 -84218 -52342 22868 151314 216603
6618 216603 139503 108396 -79450 -162037 -106539 -96128 -66047 -143127 -75286 184257 321020
6607 321020 320923 301505 227483 15509 21450 -12047 -12657 -26822 69556 32120 56655 15193 30894
6594 30894 7435 14306 47686 64726 22496 -100974 -93431 -165964 -185681 -94347 47794 99306
6582 99306 59278 116354 33780 49117 49611 86434 149758 156332 199150 168650 119992 138475
6570 138475 235252 191163 122812 181531 228670 129608 43252 166485 379819 583297 629052
$$ packed form
6653A08084l6007j10190r6355J09221J42210R2318l11j84096j59608l676O2183
6642g6227q1656l8357L7382J4427l2758M2401K7519Q1605J16856l1380n5908K9680
6630C3584q0745j03092j4391l4099J2498Q5611o300K2716L1876P5210J28446O5289
6618B16603p7100l1107j87846q2587N5498J0411L0081p7080O7841K59543J36763
6607C21020r7j9418p4022k11974N941l3497o10j4165R6378l7436K4535m1462J5701
6594C0894k3459O871L3380J7040m2230j23470P543p2533j9717R1334J42141N1512
6582I9306m0028N7076q2574J5337M94L6823O3324O574M2818l0500m8658J8483
6570A38475R6777m4089o8351N8719M7139r9062q6356J23233K13334K03478M5755
$$ plain form
6559 629052 638463 758379 942659 980094 851608 650129 602382 473041 445871 317262 305803
6548 305803 255415 234280 214579 124266 1368 58694 257784 184792 58005 14449 -30796
6537 -30796 -1965 30859 -51750 -158386 -129806 -46821 -77766 -62020 67458 83890 119904
6526 119904 92524 91344 183294 262769 226593 163528 224192 343190 544179 815838 1036880
6515 1036880 1201275 1409630 1503288 1490520 1387557 1340603 1127897 977555 738777 615401
6505 615401 584762 482603 291135 278989 302749 324695 285838 361371 287783 226314 118054
6494 118054 93594 122733 60128 150393 152538 169182 192778 126337 131114 216380 297331 312349
6482 312349 373966 295255 143553 -11099 5581 -3625 -85904 -92193 76904 321130 426019
$$ packed form
6559F29052R411J19916J84280L7435j28486k01479m7747j29341k7170j28609j1459
6548C05803n0388k1135j9701r0313j22898N7326J99090p2992j26787m3556m5245
6537c0796K8831L2824q2609j06636K8580Q2985l0945J5746J29478J6432L6014
6526A19904k7380j180R1950P9475l6176o3065O0664J18998K00989K71659K21042
6515A036880J64395K08355R3658j2768j02963m6954k12706j50342k38778j23376
6505F15401l0639j02159j91468j2146K3760K1946l8857P5533p3588o1469j08260
6494A18054k4460K9139o2605R0265K145J6644K3596o6441M777Q5266Q0951J5018
6482C12349O1617p8711j51702j54652J6680r206q2279o289J69097K44226J04889
$$ plain form
6471 426019 396555 466232 591181 643605 690016 544783 579783 569549 461724 383087 208187
6460 208187 158597 230551 230030 177722 189179 218116 266216 286371 267382 201708 78293 -26464
6448 -26464 62254 141948 138888 129893 202730 212032 214384 240224 185909 166190 124791 8758
6436 8758 69447 43932 -79238 -83193 -25611 50214 8793 -52204 46748 18034 -37165 -68818
6424 -68818 -11168 -52614 82019 203963 268712 207433 131171 96058 78017 18492 -93650
6413 -93650 -92159 -36325 -42385 -36541 -3102 -23628 -25692 -72464 -114632 -22976 64589 27528 25899
6400 25899 52806 27014 19803 82957 112569 121119 98005 99814 143044 161927 138791 44375
6388 44375 74637 -10683 -66858 -41787 15676 -145872 -194416 -125885 -62620 -109246 -134276 -190725
$$ packed form
6471D26019k9464O9677J24949N2424M6411j45233L5000j0234j07825p8637j74900
6460B08187m9590P1954n21n2308J1457K8937M8100K0155j8989o5674j23415j04757
6448b6464Q8718P9694l060q995P2837R302K352K5840n4315j9719m1399j16033
6436H758O0689k5515j23170l955N7582P5825m1421o0997R8952k8714n5199l1653
6424f8818N7650m1446J34633J21944O4749o1279p6262l5113j8041n9525j12142
6413i3650J491N5834o060N844L3439k0526k064m6772m2168R1656Q7565l7061j629
6400B5899K6907k5792p211O3154K9612Q550k3114J809M3230J8883k3136r4416
6388D4375L0262q5320n6175K5071N7463j61548m8544O8531O3265m6626k5030n6449
$$ plain form
6376 -190725 -92152 93049 322051 171407 93813 140185 108228 114307 127786 123470 93922
6365 93922 105243 -12965 -79599 -4885 119228 155860 30773 -44003 -105436 -32117 -40442
6354 -40442 2510 41928 7798 26976 67024 53195 -28722 -4606 -46014 -71783 -33389 -24646
6342 -24646 -29296 54640 -3794 -105447 -26014 -112682 -215749 -107771 30537 8423 24864
6331 24864 7447 29926 27079 -32693 -171705 -208979 -76574 -3481 -45411 -119044 -40328 22351
6319 22351 3319 -25766 -56071 -6020 56275 32016 8189 -81669 -77607 3314 33421 138245
6307 138245 124908 60466 74143 108179 126620 54327 8827 49676 47161 62060 80512 107511
6295 107511 69397 -11422 -77352 -36948 -5551 3672 -57137 -85724 -71127 -76823 -99817 -105405
$$ packed form
6376a90725R8573J85201K29002j50644p7594M6372l1957O079J3479m316k9548
6365I3922J1321j18208o6634P4714J24113L6632j25087p4776o1433P3319q325
6354d0442M2952L9418l4130J9178M0048j3829q1917K4116m1408k5769L8394Q743
6342b4646m650Q3936n8434j01653P9433q6668j03067J07978J38308k2114J6441
6331B4864j7417K2479k847n9772j39012l7274J32405P3093m1930p3633P8716O2679
6319B2351j9032k9085l0305N0051O2295k4259k3827q9858M062Q0921L0107J04824
6307A38245j3337o4442J3677L4036J8441p2293m5500M0849k515J4899J8452K6999
6295A07511l8114q0819o5930M0404L1397R223o0809k8587J4597n696k2994n588
$$ plain form
6283 -105405 -105589 -14080 8573 -40377 -74133 -58040 64868 130897 33921 -19721 -19276 15684
6271 15684 -10757 59004 6990 -49126 -802 61272 -8708 10985 -16970 61102 175561 110873
6259 110873 85650 -9017 92502 157072 144186 82956 36549 17491 17953 -22496 27705 175163
6247 175163 198038 175552 136250 77107 -16327 -71404 -158886 -310144 -376683 -248741 -97653
6236 -97653 30487 74987 -8327 -35694 -24787 57960 -16043 -40743 -117292 -83355 -181813 -246532
6224 -246532 -174760 -123074 -121822 -72657 -35185 61435 86997 87206 95383 41384 584 13282
6212 13282 -22579 43075 -18404 -96454 -27631 37756 -45755 -99444 -84711 -118357 -46096 -78342
6200 -78342 -65034 -92604 -211297 -230564 -140090 -183341 -265577 -188472 -21024 76383 -51689
$$ packed form
6283a05405j84R1509K2653m8950l3756J6093J22908O6029r6976n3642M45L4960
6271A5684k6441O9761n2014n6116M8324O2074o9980J9693k7955P8072J14459o4688
6259A10873k5223r4667J01519O4570j2886o1230m6407j9058M62m0449N0201J47458
6247A75163K2875k2486l9302n9143r3434n5077q7482j51258o6539J27942J51088
6236i7653J28140M4500q3314k7367J0907Q2747p4003k4700p6549L3937r8458o4719
6224b46532P1772N1686J252M9165L7472R6620K5562K09Q177n3999m0800J2698
6212A3282l5861O5654o1479p8050O8823O5387q3511n3689J4733l3646P2261l2246
6200g8342J3308k7570j18693j9267R0474m3251q2236P7105J67448R7407j28072
$$ plain form
6189 -51689 22667 133361 127670 -28676 -95966 -22323 38974 1797 15446 -44352 -46540 33874
6177 33874 54901 -450 -8245 -62532 -61946 -108165 -114873 49040 146486 63578 12284 69890
6165 69890 86280 22687 -15285 -40226 51258 124038 17225 -188772 -243584 -79056 22302
6154 22302 81280 47898 73604 82460 146137 47151 1280 56186 125236 25027 11249 31848
6142 31848 45007 135551 193711 142211 87306 127602 187788 212284 201681 180108 84163 -89396
6130 -89396 -130282 -70451 -1523 20827 157253 153719 86199 68901 160820 339845 274329 194933
6118 194933 151184 214780 216148 199308 261424 169843 145465 178388 222166 167843 130495 202506
6106 202506 109735 -30351 -122572 -13646 110199 128144 38587 -85 85648 101986 -12575
$$ packed form
6189e1689P4356J10694n691j56346o7290P3643O1297l7177J3649n9798k188Q0414
6177C3874K1027n5351p795n4287N86m6219o708J63913R7446q2908n1294N7606
6165F9890J6390o3593l7972k4941R1484P2780j06813k05997n4812J64528J01358
6154B2302N8978l3382K5706Q856O3677r8986m5871N4906O9050j00209j3778K0599
6142C1848J3159R0544N8160n1500n4905M0296O0186K4496j0603k1573r5945j73559
6130h9396m0886N9831O8928K2350J36426l534o7520j7298R1919J79025o5516p9396
6118A94933m3749O3596J368j6840O2116r1581k4378L2923M3778n4323l7348P2011
6106B02506r2771j40086r2221J08926J23845J7945q9557l8672Q5733J6338j14561
$$ plain form
6095 -12575 35829 57226 67823 41625 13194 118426 241197 221851 174641 120499 55958
6084 55958 120770 88776 124322 267764 356363 225904 201861 245966 186935 112251 64610
6073 64610 127009 254597 321186 163934 68082 165339 145032 -48571 -107654 -95571 -46466
6062 -46466 190214 301908 182134 94007 45244 -59445 -91095 -27424 140345 151627 77443
6051 77443 16101 -13814 -9262 -9844 -111646 -64312 90726 110825 64567 97551 97142 109888
6039 109888 114834 236614 242437 238474 182808 50365 6980 147333 14042 13587 4826 -67470
6027 -67470 -99349 -78348 -61208 -7761 5471 2572 96469 177022 228031 137384 54301 28945
6015 28945 -21445 -60357 -64785 9774 47877 -38845 -57327 -59395 -112814 -171253 -243622 8548
$$ packed form
6095a2575M8404K1397J0597k6198k8431J05232J22771j9346m7210n4142o4541
6084E5958O4812l1994L5546J43442Q8599j30459k4043M4105n9031p4684m7641
6073F4610O2399J27588O6589j57252r5852R7257k0307j93603n9083J2083M9105
6062d6466K36680J11694j19774q8127m8763j04689l1650O3671J67769J1282p4184
6051G7443o1342k9915M552n82j01802M7334J55038K0099m6258L2984m09J2746
6039A09888M946J21780N823l963n5666j32443m3385J40353j33291m55q761p2296
6027f7470l1879K1001J7140N3447J3232k899R3897Q0553N1009r0647q3083k5356
6015B8945n0390l8912m428P4559L8103q6722j8482k068n3419n8439p2369K52170
$$ plain form
6003 8548 246540 196035 46938 -30860 -27171 6249 23687 151560 209155 286360 157485
5992 157485 166754 171869 107707 30318 11526 17359 -37685 -23541 10294 90971 73422 84647
5980 84647 84181 172534 28159 -141061 -67761 -19538 142081 302099 287791 106703 15154
5969 15154 -57473 -17675 -25034 5501 -1737 -51979 -162374 -230853 -185720 -217105 -229242 -230771
5957 -230771 -341001 -363761 -296656 -183267 -81357 15047 43960 15545 -17666 -22290 83270
5946 83270 97638 53255 27194 26887 -36508 -59309 -9817 100479 116418 96073 22706 -38314
5934 -38314 -58743 56523 103143 -17988 -62746 -21899 -19131 128992 160035 113389 -103797
5923 -103797 -122576 -44139 56484 128020 125547 66878 4156 9159 94805 96052 70825 104530
$$ packed form
6003H548K37992n0505j49097p7798L689L3420J7438J27873N7595P7205j28875
5992A57485R269N115o4162p7389j8792N833n5044J4144L3835Q0677j7549J1225
5980H4647m66Q8353j44375j69220P3300M8223J61619J60018j4308j81088r1549
5969A5154p2627L9798p359L0535p238n0242j10395o8479M5133l1385j2137j529
5957b30771j10230k2760O7105J13389J01910R6404K8913k8415l3211m624J05560
5946H3270J4368m4383k6061l07o3395k2801M9492J10296J5939k0345p3367o1020
5934c8314k0429J15266M6620j21131m4758M0847K768J48123L1043m6646k17186
5923a03797j8779P8437J00623P1536k473n8669o2722N003Q5646J247k5227L3705
$$ plain form
5911 104530 138015 2086 -119020 -128835 20813 26086 6394 457 -1960 -128554 -147195 -34299
5899 -34299 12025 55428 105817 92617 90570 118257 118376 -3976 -61177 -34011 -204820 -216603
5887 -216603 -99405 1889 -61393 -178639 -365561 -330150 -281441 -279970 -169547 -12804 188653
5876 188653 146657 104374 48252 33064 -36708 -164464 -170597 -52824 120563 199982 46383
5865 46383 -122981 -112713 3565 33396 -28314 -97829 -107469 52028 127491 121447 78040 -111880
5853 -111880 -175438 -2722 70751 68916 44072 -37490 -30440 -28838 68562 108452 -2905 -3012
5841 -3012 -49255 -39216 155423 236608 187640 127572 -27364 -47668 1134 9823 -6076 24378
5829 24378 80076 15781 -105 -79604 -216921 -210254 -95622 -73938 -11018 82037 -19997
$$ packed form
5911A04530L3485j35929j21106r815J49648N273j9692n937k417j26594j8641J12896
5899c4299M6324M3403N0389j3200k047K7687J19j22352n7201K7166j70809j1783
5887b16603J17198J01294o3282j17246j86922L5411M8709J471J10423J56743K01457
5876A88653m1996m2283n6122j5188o9772j27756o133J17773J73387P9419j53599
5865D6383j69364J0268J16278K9831o1710o9515r640J59497P5463o044m3407j89920
5853a11880o3558J72716P3473j835k4844q1562P050J602R7400L9890j11357j07
5841c012m6243J0039J94639Q1185m8968o0068j54936k0304M8802Q689j5899L0454
5829B4378N5698o4295j5886p9499j37317O667J14632K1684O2920R3055j02034
$$ plain form
5818 -19997 -43523 50874 97562 80033 -14971 -113445 -127524 -55502 -113036 -79090 -83125 -108212
5806 -108212 -56322 -72586 3540 19170 -1573 -85283 -31155 29627 68845 35147 -37546 2449
5794 2449 71565 -4570 -87369 -81230 6189 69159 63412 106311 -40382 -127084 -52379 -125091
5782 -125091 -190365 -141127 -203850 -204661 -122966 -24450 34513 -36825 -117165 -134695 -197874 -225740
5770 -225740 -240919 -189837 -97547 74248 201664 218366 142883 3195 -20411 -86823 -42829
5759 -42829 -151619 -194347 -192192 -187246 -173275 -171425 -94703 -98488 -98628 -42827 35698 5241 -46373
5746 -46373 -97432 -60610 -17948 91390 145034 117971 98272 62871 -10643 -116454 -94585
5735 -94585 -9327 48585 -34176 33866 163842 179472 182556 101096 5091 -124849 -177852 -96293
$$ packed form
5818a9997k3526R4397M6688j7529r5004r8474j4079P2022n7534L3946m035k5087
5806a08212N1890j6264P6126J5630k0743q3710N4128O0782L9218l3698p2693L9995
5794B449O9116p6135q2799O139Q7419O2970n747M2899j46693q6702P4705p2712
5782a25091o5274M9238o2723q11Q1695R8516N8963p1338q0340j7530o3179k7866
5770b25740j5179N1082R2290J71795J27416J6702p5483j39688k3606o6412M3994
5759d2829j08790m2728K155M946J3971J850P6722l785j40N5801P8525l0457n1614
5746d6373n1059L6822M2662J09338N3644k7063j9699l5401p3514j05811K1869
5735i4585Q5258N7912q2761O8042J29976J5630L084q1460r6005j29940n3003Q1559
$$ plain form
5723 -96293 -74388 24415 114081 137531 216415 172966 4726 -46520 18542 48120 83887 -25501
5711 -25501 -54391 66346 16751 9995 29245 -87752 -161165 -154309 -182297 -249749 -180519 -134498
5699 -134498 -188554 -234251 -202554 -285116 -288856 -205994 -70514 -154161 -253529 -98591 -110443
5688 -110443 -18884 -39370 29280 125238 112626 92937 96788 134568 107827 -9588 -106538 26513
5676 26513 128898 93142 54060 89561 50890 -105133 32845 123074 90759 4946 -66224
5665 -66224 -193980 -153163 -51824 -14739 -42820 9080 77089 11248 -18771 -124980 -91829
5654 -91829 -80525 -19439 63639 60374 -50518 -191422 -205738 -70247 10502 -104930 -133462
5643 -133462 -139256 -247772 -248352 -174655 -185013 -228722 -219748 -227678 -140308 -107631 -144425 -225038
$$ packed form
5723i6293K1905R8803Q9666K3450P8884m3449j68240n1246O5062K9578L5767j09388
5711b5501k8890J20737m9595o756J9250j16997p3413O856k7988o7452O9230M6021
5699a34498n4056m5697L1697q2562l740Q2862J35480q3647r9368J54938j1852
5688a10443R1559k0486O8650R5958j2612j9689L851L7780k6741j17415r6950J33051
5676B6513J02385l5756l9082L5501l8671j56023J37978R0229l2315q5813p1170
5665f6224j27756M0817J01339L7085k8081N1900O8009o5841l0019j06209L3151
5654i1829J1304O1086Q3078l265j10892j40904j4316J35491Q0749j15432k8532
5643a33462n794j08516n80P3697j0358m3709Q974p930Q7370L2677l6794q0613
$$ plain form
5631 -225038 -189039 -265281 -96005 -67018 -79783 -144135 -159257 -113072 -57611 40997 101568
5620 101568 128067 61855 47151 172731 249062 119037 103377 119022 108159 49954 71301
5609 71301 30798 202929 102940 81097 -52133 -26556 106957 77702 140596 164483 26874
5598 26874 -96934 -25410 101741 171552 297502 327490 170425 3500 -66949 -130924 -201854
5587 -201854 -225506 -143056 -119284 -124515 -13318 -17443 -118947 -131676 -155 16064 41981
5576 41981 -85088 -33114 3544 141636 166942 116715 22125 1255 27396 113376 141270
5565 141270 37195 -128424 -152523 -73941 72750 157429 61373 -2112 43941 -52960 -61954
5554 -61954 4438 -5305 10779 67417 155998 119666 149328 205076 179246 79029 41392 46732
$$ packed form
5631b25038L5999p6242J69276K8987j2765o4352j5122M6185N5461R8608O0571
5620A01568K6499o6212j4704J25580P6331j30025j5660J5645j0863n8205K1347
5609G1301m0503J72131r9989k1843j33230K5577J33513k9255O2894K3887j37609
5598B6874j23808P1524J27151O9811J25950K9988j57065j66925p0449o3975p0930
5587b01854k3652Q2450K3772n231J11197m125j01504j2729J31521J6219K5917
5576D1981j27069N1974L6658J38092K5306n0227r4590k0870K6141Q5980K7894
5565A41270j04075j65619k4099P8582J46691Q4679r6056o3485M6053r6901q994
5554f1954O6392r743J6084N6638Q8581l6332K9662N5748k5830j00217l7637N340
$$ plain form
5542 46732 127382 152643 101038 7448 -150271 -210238 -24377 -115820 -171025 -81823 -3893
5531 -3893 68207 65685 7575 -15745 -33256 -66319 -87335 6083 40298 73557 122644 122731 132277
5518 132277 173676 139878 182385 202844 224633 55103 -28530 -97309 -164415 -221774 -121302
5507 -121302 43258 93703 140957 16567 -51134 -104371 -59448 -22564 -21333 -8438 -112207
5496 -112207 -99404 -14972 -65097 -207451 -289073 -152346 -81973 -118602 -162417 -191928 -236290
5485 -236290 -207825 -107964 -198345 -199324 -273998 -138794 -105649 -193659 -101183 51025 88579 -1797
5473 -1797 -48438 -33734 -64737 -40363 6144 56897 5641 -98030 -154052 -127597 -68996 62945
5461 62945 135957 -3456 -21728 -13594 24575 -130517 -279908 -325721 -143284 53031 54718
$$ packed form
5542D6732Q0650K5261n1605r3590j57719n9967J85861r1443n5205Q9202P7930
5531c893P2100k522n8110k3320j7511l3063k1016R3418L4215L3259M9087Q7R546
5518A32277M1399l3798M2507K0459K1789j69530q3633o8779o7106n7359J00472
5507a21302J64560N0445M7254j24390o7701n3237M4923L6884J231J2895j03769
5496a12207J2803Q4432n0125j42354q1622J36727P0373l6629m3815k9511m4362
5485b36290K8465R9861r0381r79p4674J35204L3145q8010R2476J52208L7554r0376
5473a797m6641J4704l1003K4374M6507N0753n1256j03671n6022K6455N8601J31941
5461F2945P3012j39413j8272Q134L8169j55092j49391m5813J82437J96315J687
$$ plain form
5450 54718 37440 -15245 -66430 -24032 28143 26175 45625 113110 186581 211165 296167 258808
5438 258808 146216 107525 95355 13576 -18045 20456 36683 -158214 -131542 -180929 -169115
5427 -169115 -141709 -229620 -170106 -188617 -176030 801 -75163 -195276 -40419 23510 -3284
5416 -3284 84350 144817 245370 223035 217187 220357 166022 127892 106625 31223 77636 158005
5404 158005 164310 97016 7302 -43391 4742 61981 187314 204984 161584 192819 78768
5393 78768 31737 -8906 -583 72279 215835 136613 26022 -26169 62551 47460 -38677 57288
5381 57288 71623 25870 76131 129789 70786 -50400 -110876 -75351 -14708 -35080 -92970 -94749
5369 -94749 -124797 -93753 -119355 -133585 -163625 -106847 -38639 30107 45516 29257 68988 86804
$$ packed form
5450E4718j7278n2685n1185M2398N2175j968J9450O7485P3471K4584Q5002l7359
5438B58808j12592l8691j2170q1779l1621L8501J6227j94897K6672m9387J1814
5427a69115K7406q7911N9514j8511J2587J76831p5964j20113J54857O3929k6794
5416c284Q7634O0467J00553k2335n848L170n4335l8130k1267p5402M6413Q0369
5404A58005O305o7294q9714n0693M8133N7239J25333J7670m3400L1235j14051
5393G8768m7031m0643Q323P2862J43556p9222j10591n2191Q8720j5091q6137R5965
5381E7288J4335m5753N0261N3658n9003j21186o0476L5525O0643k0372n7890j779
5369i4749l0048L1044k5602j4230l0040N6778O8208O8746J5409j6259L9731J7816
$$ plain form
5357 86804 -14806 -27760 -71777 -63077 -59419 -36747 74138 168972 183029 76325 55732 -28205
5345 -28205 -100745 -145761 -2643 52741 13040 -68517 32705 59627 70794 109515 98988
5334 98988 48435 97535 198331 63696 59068 -58289 -109257 -24616 -52343 -85015 -87244 -135132
5322 -135132 -43634 22236 -8061 -67016 -147280 -277602 -385925 -341216 -307544 -159362 -78015
5311 -78015 -35525 52323 7440 -93534 -124850 -124716 -182532 -285045 -228316 -224039 -233839 -227379
5299 -227379 -73740 7855 -60004 -20956 -73762 -148195 -150919 -175548 -109195 -149420 -226438 -276881
5287 -276881 -128631 -132098 -34822 35518 93017 244732 204671 165283 105722 142010 142939 124475
5275 124475 38125 -75131 -180418 -212851 -311962 -310018 -232199 -194635 -182423 -191368 -131927 -83035
$$ packed form
5357H6804j01610j2954m4017Q700L658K2672J10885R4834J4057j06704k0593q3937
5345b8205p2540m5016J43118N5384l9701q1557J01222K6922J1167L8721j0527
5334I8988n0553M9100J00796j34635m628j17357n0968Q4641k7727l2672k229m7888
5322a35132R1498O5870l0297n8955q0264j30322j08323M4709L3672J48182Q1347
5311g8015M2490Q7848m4883j00974l1316J34n7816j02513N6729M277r800O460
5299b27379J53639Q1595o7859L9048n2806p4433k724k4629O6353m0225p7018n0443
5287b76881J48250l467R7276P0340N7499J51715m0061l9388n9561L6288R29j8464
5275A24475q6350j13256j05287l2433r9111J944P7819L7564J2212q945N9441M8892
$$ plain form
5263 -83035 -61915 -85009 -54436 -58258 -78778 -103982 -189407 -172960 -142324 -193311 -154188 -167537
5251 -167537 -244163 -193583 -133984 -153230 -57067 96590 94558 74144 14787 19549 -11439 8697
5239 8697 67934 161453 85859 11140 146081 162499 23762 -187657 -78062 -21194 22034
5228 22034 84386 -24364 -87679 -34225 63812 186701 132489 81311 137546 181621 128663
5217 128663 108471 237708 181933 32291 51161 32467 -58531 -163882 -127360 -145975 -116606
$$ packed form
5263h3035K1120k3094L0573l822k0520k5204q5425J6447L0636n0987L9123j3349
5251a67537p6626N0580N9599j9246R6163J53657k032k0414n9357M762l0988K0136
5239H697N9237R3519p5594p4719J34941J6418j38737k11419J09595N6868M3228
5228B2034O2352j08750o3315N3454R8037J22889n4212n1178N6235M4075n2958
5217A28663k0192J29237n5775j49642J8870j8694r0998j05351L6522j8615K9369
$$ [...]
##END NTUPLES=NMR SPECTRUM
##END=
