##TITLE=Analysis number 321853
Compound Code cc 27206
Book Reference 505/7
Project Code adrs
Chemist Name robb
##JCAMPDX= 6.0         $$ Bruker NMR JCAMP-DX V2.0
##DATA TYPE= NMR SPECTRUM
##DATA CLASS= NTUPLES
##ORIGIN= Bruker BioSpin GmbH
##OWNER= nmr
$$ XWIN-NMR		Version 3.5
$$ Thu Aug 31 10:47:06 2006 GMT Daylight Time (UT+1h)  MAYBRIDGE\nmr@NMR_250MHZ
##.OBSERVE FREQUENCY= 250.131544655141
##.OBSERVE NUCLEUS= ^1H
##.ACQUISITION MODE= SIMULTANEOUS (DQD)
##.ACQUISITION SCHEME= undefined
##.AVERAGES= 16
##.DIGITISER RES= 18
##SPECTROMETER/DATA SYSTEM= dpx250
##.PULSE SEQUENCE= zg30
##.SOLVENT NAME= CDCl3
##.SHIFT REFERENCE= (INTERNAL, CDCl3, 0, 16.522)
##AUDIT TRAIL= $$ (NUMBER, WHEN, WHO, WHERE, WHAT)
$$ ##TITLE= Audit trail, XWIN-NMR		Version 3.5
$$ ##JCAMPDX= 5.01
$$ ##ORIGIN= Bruker BioSpin GmbH
$$ ##OWNER= nmr
$$ C:\u/data/dgb/nmr/ADRS/2010/pdata/1/auditp.txt
$$ ##AUDIT TRAIL=  $$ (NUMBER, WHEN, WHO, WHERE, WHAT)
(   1,<2006-08-31 10:46:39.63 +100>,<MAYBRIDGE\nmr>,<NMR_250MHZ>,
      <created by zg, POWCHK disabled, PULCHK disabled
       configuration hash MD5:
       E2 DF 36 D8 04 B2 41 60 5A D7 A3 38 5A 4B D0 FE
       data hash MD5: 64K
       65 20 B0 63 C4 F9 10 07 9E 85 D5 3F 76 BD BC DA>)
(   2,<2006-08-31 10:46:53.96 +100>,<MAYBRIDGE\nmr>,<NMR_250MHZ>,
      <Start of raw data processing
       ef LB = 0.3 FT_mod = 6 PKNL = 1 SI = 32K 
       data hash MD5: 32K
       88 F7 6F 00 A8 AA E3 F6 B3 B4 CF 0E CC 97 68 CF>)
(   3,<2006-08-31 10:46:55.55 +100>,<MAYBRIDGE\nmr>,<NMR_250MHZ>,
      <apk 
       data hash MD5: 32K
       53 EC A1 A9 41 4E 65 35 CC 46 95 0D 29 04 74 89>)
(   4,<2006-08-31 10:46:56.28 +100>,<MAYBRIDGE\nmr>,<NMR_250MHZ>,
      <abs ABSG = 5 
       data hash MD5: 32K
       75 0F 66 43 36 B6 55 88 53 9B 41 B9 0B F4 D5 73>)
$$ ##END=
$$ 
$$ hash MD5
$$ 9E 7F E4 EF B4 B3 4C 0D C4 1D 50 1B F6 83 FF A6
##$RELAX= 
##$RELAX= 
##$RELAX= 
##$RELAX= 
##$RELAX= 
##$RELAX= 
##$RELAX= 
$$ Bruker specific parameters
$$ --------------------------
##$DU= <C:\u>
##$EXPNO= 2010
##$NAME= <ADRS>
##$PROCNO= 1
##$TYPE= <nmr>
##$USER= <dgb>
##$AMP= (0..31)
100 100 100 100 100 100 100 100 100 100 100 100 100 100 100 100 100 100 
100 100 100 100 100 100 100 100 100 100 100 100 100 100 
##$AQSEQ= 0
##$AQ_mod= 3
##$AUNM= <au_zg>
##$AUTOPOS= <13 >
##$BF1= 250.13
##$BF2= 250.13
##$BF3= 250.13
##$BF4= 250.13
##$BF5= 500.13
##$BF6= 500.13
##$BF7= 500.13
##$BF8= 500.13
##$BYTORDA= 1
##$CFDGTYP= 0
##$CFRGTYP= 5
##$CHEMSTR= <none>
##$CNST= (0..31)
1 1 145 1 1 1 1 1 1 1 1 1 1 1 1 1 1 1 1 1 1 1 1 1 1 1 1 1 1 1 1 1 
##$CPDPRG= <>
##$CPDPRG1= <>
##$CPDPRG2= <>
##$CPDPRG3= <>
##$CPDPRG4= <mlev>
##$CPDPRG5= <mlev>
##$CPDPRG6= <mlev>
##$CPDPRG7= <mlev>
##$CPDPRG8= <mlev>
##$CPDPRGB= <>
##$CPDPRGT= <>
##$D= (0..31)
0 1 0 0 0 0 0 0 0 0.06 0 0 0 0 0 0 0.0002 0 0 0 0 0 0 0 0 0 0 0 0 0 0 
0 
##$DATE= 1157017598
##$DBL= (0..7)
120 120 120 120 120 120 120 120 
##$DBP= (0..7)
150 150 150 150 150 150 150 150 
##$DBP07= 0
##$DBPNAM0= <>
##$DBPNAM1= <>
$$ [...]
##$SUBNAM7= <"">
##$SUBNAM8= <"">
##$SUBNAM9= <"">
##$SW= 20.6930455092707
##$SWIBOX= (0..15)
0 0 3 0 0 0 0 0 0 0 0 0 0 0 0 0 
##$SW_h= 5175.983436853
##$TD= 65536
##$TD0= 1
##$TE= 295.16
##$TE2= 300
##$TE3= 300
##$TEG= 300
##$TL= (0..7)
0 120 120 120 120 120 120 120 
##$TP= (0..7)
150 150 150 150 150 150 150 150 
##$TP07= 0
##$TPNAME0= <>
##$TPNAME1= <>
##$TPNAME2= <>
##$TPNAME3= <>
##$TPNAME4= <>
##$TPNAME5= <>
##$TPNAME6= <>
##$TPNAME7= <>
##$TPOAL= (0..7)
0.5 0.5 0.5 0.5 0.5 0.5 0.5 0.5 
##$TPOFFS= (0..7)
0 0 0 0 0 0 0 0 
##$TUNHIN= 0
##$TUNHOUT= 0
##$TUNXOUT= 0
##$USERA1= <user>
##$USERA2= <user>
##$USERA3= <user>
##$USERA4= <user>
##$USERA5= <user>
##$V9= 5
##$VALIST= <valist>
##$VCLIST= <CCCCCCCCCCCCCCC>
##$VD= 0
##$VDLIST= <DDDDDDDDDDDDDDD>
##$VPLIST= <PPPPPPPPPPPPPPP>
##$VTLIST= <TTTTTTTTTTTTTTT>
##$WBST= 1024
##$WBSW= 4
##$XGAIN= (0..3)
0 0 0 0 
##$XL= 0
##$YL= 0
##$YMAX_a= 408218
##$YMIN_a= -388009
##$ZGOPTNS= <>
##$ZL1= 120
##$ZL2= 120
##$ZL3= 120
##$ZL4= 120
##$ABSF1= 16.522
##$ABSF2= -4.171173
##$ABSG= 5
##$ABSL= 3
##$ALPHA= 0
##$AQORDER= 0
##$ASSFAC= 0
##$ASSFACI= 0
##$ASSFACX= 0
##$ASSWID= 0
##$AUNMP= <proc_1d>
##$AZFE= 0.1
##$AZFW= 0.1
##$BCFW= 0
##$BC_mod= 0
##$BYTORDP= 0
##$COROFFS= 0
##$CY= 12.5
##$DATMOD= 1
##$DC= 0
##$DFILT= <>
##$DTYPP= 0
##$F1P= 14.0000005364418
##$F2P= -0.99999901652339
##$FCOR= 0.5
##$FTSIZE= 32768
##$FT_mod= 6
##$GAMMA= 0
##$GB= 0
##$INTBC= 1
##$INTSCL= 1
##$ISEN= 128
##$LB= 0.3
##$LEV0= 0
##$LPBIN= 0
##$MAXI= 10000
##$MC2= 0
##$MEAN= 0
##$ME_mod= 0
##$MI= 0
##$NCOEF= 0
##$NC_proc= -3
##$NLEV= 6
##$NOISF1= 0
##$NOISF2= 0
##$NSP= 0
##$NTH_PI= 0
##$NZP= 0
##$OFFSET= 16.522
##$PC= 1
##$PHC0= 147.007
##$PHC1= 4.793152
##$PH_mod= 1
##$PKNL= yes
##$PPARMOD= 0
##$PSCAL= 4
##$PSIGN= 0
##$REVERSE= no
##$SF= 250.13
##$SI= 32768
##$SIGF1= 0
##$SIGF2= 0
##$SINO= 400
##$SIOLD= 32768
##$SREGLST= <1H.CDCl3>
##$SSB= 0
##$STSI= 32768
##$STSR= 0
##$SW_p= 5175.98343685301
##$SYMM= 0
##$S_DEV= 0
##$TDeff= 65536
##$TDoff= 0
##$TI= <Analysis number 999999
Compound Code 99
Book Reference 9
Project Code 9>
##$TILT= no
##$TM1= 0
##$TM2= 0
##$TOPLEV= 0
##$USERP1= <user>
##$USERP2= <user>
##$USERP3= <user>
##$USERP4= <user>
##$USERP5= <user>
##$WDW= 1
##$XDIM= 32768
##$YMAX_p= 550706444
##$YMIN_p= -1374035
$$ End of Bruker specific parameters
$$ ---------------------------------
##NTUPLES= NMR SPECTRUM
##VAR_NAME=  FREQUENCY,     SPECTRUM/REAL,   SPECTRUM/IMAG
##SYMBOL=    X,             R,               I
##VAR_TYPE=  INDEPENDENT,   DEPENDENT,       DEPENDENT
##VAR_FORM=  AFFN,          ASDF,            ASDF
##VAR_DIM=   32768,         32768,           32768
##UNITS=     HZ,            ARBITRARY UNITS, ARBITRARY UNITS
##FACTOR=    0.157963299565203, 1,           1
##FIRST=     4132.6476996994, 0,             0
##LAST=      -1043.33573715361, 0,           0
##MIN=       -1043.33573715361, -1374035,    0
##MAX=       4132.6476996994, 550706444,     0
$$ Real data points
##PAGE= N=1
##DATA TABLE= (X++(R..R)), XYDATA
$$ [...]
$$ plain form
15334 -13802 -14136 -10773 -14245 -23722 -13436 1698 -550 -8001 -16768 -12048 -287 16079 26447
15321 26447 18436 1583 -3885 -7736 1048 7472 13027 11594 -5676 -9288 2198 8651 8970 10335
15307 10335 18327 19656 11087 194 -11828 -8215 9000 13751 8776 22728 26753 18785 19624 9686
15293 9686 2428 -3006 -2178 -3037 -747 -2817 -11257 -16152 -4976 -1790 -15713 -27463 -28976 -30111
15279 -30111 -14363 4706 7180 965 7438 26679 36778 30939 18109 2446 -6492 -17875 -16363
15266 -16363 -5340 -4163 -1690 4421 -1407 -10969 -1522 7962 399 -2010 17371 19620 13102 974
15252 974 -5638 -11072 -5396 -1262 -165 -11269 -18056 -20204 -8451 -377 -9384 -2453 4416 14454
15238 14454 6682 -10983 -17505 -5239 -3949 1036 -212 5769 24846 19646 8804 17670 8374
$$ packed form
15334a3802l34L363l472r477J0286J5134k248p451q767M720J1761J6366J0368
15321B6447q011j6853n468l851Q784O424N555j433j7270l612J1486O453L19J365
15307A0335P992J329q569j0893j2022L613J7215M751m975J3952M025p968Q39r938
15293I686p258n434Q28q59K290k070q440m895J1176L186j3923j1750j513j135
15279c0111J5748J9069K474o215O473J9241J0099n839j2830j5663q938j1383J512
15266a6363J1023J177K473O111n828r562R447R484p563k409J9381K249o518j2128
15252I74o612n434N676M134J097j1104o787k148J1753Q074r007O931O869J0038
15238A4454p772j7665o522J2266J290M985j248N981J9077n200j0842Q866r296
$$ plain form
15225 8374 15112 23321 23927 19799 25492 14279 10226 13172 18059 14169 4713 1293 14614 15269 3131
15210 3131 -2117 -6254 -2242 -2447 -11758 -4719 -3575 1921 11953 10527 10639 8718 12531 9993 3905
15195 3905 -6378 -681 -2617 -9401 -9454 -2816 -5110 470 6711 938 368 922 -12821 -20319 -4349
15180 -4349 15288 26945 34627 28830 21662 24067 31899 28039 12514 1196 -447 824 7162 923
15166 923 -1481 376 -7827 -7521 -8 1853 11398 14381 25329 15797 -189 4084 -1712 2094 -2354
15151 -2354 -12064 1571 20788 2616 -5597 1226 -38 -5853 -16262 -17896 -7434 -11709 -18429
15138 -18429 -27986 -27199 -2617 8556 20501 33031 26494 22991 14099 2358 -6820 -14543 -9794
15125 -9794 -5387 -3737 -17793 -15432 1846 9269 11750 635 -15188 -13933 -9845 7980 12025
$$ packed form
15225H374O738Q209O06m128N693j1213m053K946M887l890r456l420J3321O55j2138
15210C131n248m137M012k05r311P039J144N496J0032j426J12j921L813k538o088
15195C905j0283N697j936o784n3O638k294N580O241n773n70N54j3743p498J5970
15180d349J9637J1657P682n797p168K405P832l860j5525j1318j643J271O338o239
15166I23k404J857q203L06P513J861R545K983J0948r532j5986M273n796L806m448
15151b354r710J3635J9217j8172q213O823j264n815j0409j634J0462m275o720
15138a8429r557P87K4582J1173J1945J2530o537l503q892j1741r178p723M749
15125i794M407J650j4056K361J7278P423K481j1115j5823J255M088J7825M045
$$ plain form
15112 12025 5526 -8728 -13983 -3829 -13009 -2563 10663 3934 14604 35044 19879 -1003
15100 -1003 1835 -7573 -10075 4328 7921 5107 153 -5587 -493 1762 9777 14258 5583 -23460
15086 -23460 -28728 -5993 -3870 2158 13753 6649 -7064 -6798 -139 -10170 -10601 -7245 1977 4176
15072 4176 -4298 1093 10015 -2880 -9044 -10619 -1416 2832 7028 12650 -177 -6041 1136 1757
15058 1757 930 708 6775 10720 7028 -3210 1507 9131 11107 6880 4207 -8108 -10102 -13173 -21792
15043 -21792 -29208 -15806 -5025 -5353 -2972 431 -373 2424 4133 2017 2767 6832 -1010 3894 13607
15028 13607 21441 13579 16161 20081 5421 -12987 -12784 -11821 -17938 -8900 5038 13516 2687 -21272
15014 -21272 -20868 -13376 -11525 1660 13478 14186 1695 -6760 -6468 -9038 -10363 -9236 -12693 -17201
$$ packed form
15112A2025o499j4254n255J0154r180J0446J3226o729J0670K0440j5165k0882
15100a003K838r408k502J4403L593k814m954n740N094K255Q015M481q675k9043
15086b3460n268K2735K123O028J1595p104j3713K66O659j0031m31L356R222K199
15072D176q474N391Q922j2895o164j575R203M248M196N622j2827n864P177O21
15058A757q27k22O067L945l692j0238M717P624J976m227k673j2315j994l071q619
15043b1792p416J3402J0781l28K381L403q04K797J709k116P50M065p842M904R713
15028A3607P834p862K582L920j4660j8408K03R63o117R038J3938Q478j0829k3959
15014b1272M04P492J851J3185J1818P08j2491q455K92k570j325J127l457m508
$$ plain form
15000 -17201 -18428 -17201 -14734 -6306 350 -5411 -11492 -16626 -23805 -16742 -19886 -10288 985 8145
14986 8145 8534 -6530 -12193 -15856 -20805 -916 4287 7674 6947 -570 -4316 -14957 1665 333
14972 333 -8455 -12251 -6071 -10231 -16644 -12762 -2598 -246 11472 6269 -789 1531 8893 10015
14958 10015 16269 12046 -6318 -9046 -11298 -9445 -11056 -20690 -26849 -28325 -25860 -19052 -19924 -23818
14944 -23818 -15287 -24174 -33450 -30522 -20732 -15377 -12525 -1758 6197 6852 7169 2385 -6504 -894 6279
14929 6279 4706 -10137 -4071 -7109 -12467 -10085 -21944 -28477 -11351 3699 -2744 -3891 -5002 14982
14915 14982 23009 4924 -14538 -18560 -9446 -11485 -11200 -4336 4935 6994 10915 2906 1098 14953
14901 14953 14358 7865 7173 2781 6472 15202 20231 20945 22352 24979 16673 11838 9611 3463 -8117
$$ packed form
15000a7201j227J227K467Q428O656n761o081n134p179P063l144R598J1273P160
14986H145L89j5064n663l663m949J9889N203L387p27p517l746j0641J6622j332
14972C33q788l796O180m160o413L882J0164K352J1718n203p058K320P362J122
14958A0015O254m223j8364k728k252J853j611r634o159j476K465O808q72l894
14944b3818Q531q887r276K928R790N355K852J0767P955O55L17m784q889N610P173
14929F279j573j4843O066l038n358K382j1859o533J7126J5050o443j147j111J9984
14915A4982Q027j8085j9462m022R114k039K85O864R271K059L921q009j808J3855
14901A4953n95o493o92m392L691Q730N029P14J407K627q306m835k227o148j1580
$$ plain form
14886 -8117 -16577 -11308 -2839 6740 10164 2024 5456 11592 116 9587 20713 7431 -4904 -17379
14872 -17379 -11361 -5859 -975 5197 3596 -15 2524 12429 5568 -7278 -3831 -1614 -3515 -5265
14858 -5265 -445 5944 3892 -7735 -5869 1629 -11511 -8063 -7249 -11581 -5856 -4109 -331 -3076
14844 -3076 1512 15502 13346 14565 25747 24117 9052 -3214 -7075 -15036 -17489 -12545 -5841 -9020
14830 -9020 283 -7270 -5912 6043 17273 25654 28354 17230 12675 -4351 -11753 -11522 4309 6042
14816 6042 -448 -4039 -9274 -13578 -1890 -2036 -19569 -31606 -34871 -27421 -30360 -29408 -26776 -13583
14802 -13583 -15932 -24504 -12582 -10786 -12222 -22547 -28822 -16822 -13565 -18674 -12184 -8638 -6272 1366
14788 1366 972 -12363 -10227 -19899 -23989 -23499 -8742 -12313 -14518 -19422 -18620 -7551 -545 -6095 -12797
$$ packed form
14886h117q460N269Q469R579L424q140L432O136j1476R471J1126j3282j2335j2475
14872a7379O018N502M884O172j601l611K539R905o861j2846L447K217j901j750
14858e265M820O389k052j1627J866P498j3140L448Q14m332N725J747L778k745
14844c076M588J3990k156J219J1182j630j5065j2266l861p961k453M944O704l179
14830i020R303p553J358J1955J1230Q381K700j1124m555j7026p402K31J5831J733
14816F042o490l591n235m304J1688j46j7533j2037l265P450k939R52K632J3193
14802a3583k349q572J1922J796j436j0325o275J2000L257n109O490L546K366P638
14788A366l94j3335K136r672m090M90J4757l571k205m904Q02J1069P006n550o702
$$ plain form
14773 -12797 -9890 -12669 -10550 6074 855 -3653 -182 -7690 -8562 -11252 -6839 -10464 -10426 -18627 -22468
14758 -22468 -19922 -6413 -8874 -17219 -10428 3212 18205 13589 1906 -352 10254 23063 29972
14745 29972 24254 19818 6700 -1754 -3623 312 665 6144 21591 21669 13025 7718 2853 1078 3165
14730 3165 5474 4916 -1101 973 2222 1729 3620 6667 14866 12865 15991 16503 16972 17596 -1577 -10373
14714 -10373 -13040 -8164 -10918 -6868 -7270 -14793 -11436 5041 13509 7279 7693 9127 8561 -4008 -15069
14699 -15069 -16073 -17137 -22657 -21325 -16491 -14182 -8184 -6441 -394 -15334 -17279 -18319 -28139 -28733
14685 -28733 -29381 -20880 -15135 -11780 -7386 -3519 -6987 -10589 -11057 -16638 -13975 -5541 12778 9327 10484
14670 10484 -1471 -5129 -10776 -10051 -6333 -7812 9835 22177 21444 3743 -11404 -13301 -14347 -8507
$$ packed form
14773a2797K907k779K119J6624n219m508L471p508q72k690M413l625L8q201l841
14758b2468K546J3509k461q345O791J3640J4993m616j1683k258J0606J2809O909
14745B9972n718m436j3118q454j869L935L53N479J5447P8q644n307m865j775K087
14730C165K309n58o017K074J249m93J891L047Q199k001L126N12M69O24j9173q796
14714a0373k667M876k754M050m02p523L357J6477Q468o230M14J434n66j2569j1061
14699a5069j004j064n520J332M834K309N998J743O047j4940j945j040r820n94
14685b8733o48Q501N745L355M394L867l468l602m68n581K663Q434J8319l451J157
14670A0484j1955l658n647P25L718j479J7647J2342p33j7701j5147j897j046N840
$$ plain form
14656 -8507 -965 -3332 -13393 -23119 -13011 -2068 -7728 -9711 -14964 -8870 -7291 -832 6029 -6508
14642 -6508 -8496 -4116 -1384 4736 7683 3752 10151 7709 10151 19826 12774 -1033 -3691 -5265
14628 -5265 1231 -8176 -13732 -6821 -24450 -34640 -33536 -27312 -22570 -10495 -6476 -651 -9341 -7510
14614 -7510 5471 16224 16208 8605 -3039 -329 63 -976 -410 9298 2511 -4652 -4324 892 -399
14599 -399 -4533 -13902 -27006 -21240 -13728 -18925 -21455 -16751 -4460 -7379 -6119 -10604 -13898 -11688
14585 -11688 -10801 -348 4402 -9717 -429 1886 -5382 -18230 -10123 -6859 -2341 2969 -2022 17
14571 17 6557 8426 -8805 -17712 -21175 -9810 510 607 14579 19542 8626 -5135 -11543 -9360
14557 -9360 -22388 -26594 -4605 5566 3028 8126 8275 6986 -2537 7112 2201 438 1772 8262
$$ packed form
14656h507P542k367j0061r726J0108J0943n660j983n253O094J579O459O861j2537
14642f508j988M380K732O120K947l931O399k442K442R675p052j3807k658j574
14628e265O496r407n556O911j7629j0190J104O224M742J2075M019N825q690J831
14614g510J2981J0753j6p603j1644K710L92j039N66R708o787p163L28N216j291
14599c99m134r369j3104N766P512n197k530M704J2291k919J260m485l294K210
14585a1688Q87J0453M750j4119R288K315p268j2848Q107L264M518N310m991K039
14571A7O540J869j7231q907l463J1365J0320R7J3972M963j0916j3761o408K183
14557i360j3028m206K1989J0171k538N098J49j289r523R649m911j763J334O490
$$ plain form
14543 8262 15852 7740 -7935 -7323 -1230 -3182 -2624 6014 4096 -3676 -13926 -8674 -7826 -16742 -6703
14528 -6703 6698 12599 12683 3669 269 6387 2398 -5434 -2672 4909 12111 17692 1838 -15047
14514 -15047 -23454 -12525 1912 -6087 -22293 -15126 -5797 -11161 -4192 -4365 -11665 -9363 -1999 -15830
14500 -15830 -13284 -12831 -13119 -21884 -18971 -10462 -6182 -9326 -8238 -2049 467 297 -9684 -9899 -783
14485 -783 4457 1757 -8016 -12636 -1323 -7041 -9714 -4862 -476 7405 15488 26365 26352 -6190 -20174
14470 -20174 -16270 -9270 -4185 -11974 -26239 -32826 -22904 -14142 -23829 -21416 -11243 -5869 -2715 -8444
14456 -8444 -2232 -10142 -21020 -9171 -2654 5049 3277 -14192 -32434 -21498 -6729 -1564 -4223
14443 -4223 -11216 -10569 -12661 -15521 -10553 -6471 -3211 -10915 -11208 -10587 -11570 -17625 -14765 -9496 -7549 -13291
$$ packed form
14543H262P590q112j5675O12O093j952N58Q638j918p772j0250N252Q48q916J0039
14528f703J3401N901Q4r014l400O118l989p832K762P581P202N581j5854j6885
14514a5047q407J0929J4437p999j6206P167R329n364O969j73p300K302P364j3831
14500a5830K546M53k88q765K913Q509M280l144J088O189K516j70r981k15R116
14485g83N240k700r773m620J1313n718k673M852M386P881Q083J0877j3l2542j3984
14470b0174L904P000N085p789j4265o587R922Q762r687K413J0173N374L154n729
14456h444O212p910j0878J1849O517P703j772j7469j8242J0936J4769N165k659
14443d223o993O47k092k860M968M082L260p704k93O21r83o055K860N269J947n742
$$ plain form
14427 -13291 -10796 -4289 -4731 -12871 -15464 -20240 -7897 -1042 3514 -1309 -10604 -8650 -12199 -11779 -7347
14412 -7347 -7194 -18185 -9254 -7625 -10595 -13556 -6752 -7294 -3363 -12678 -14382 -15365 -13235 -24740 -13022
14397 -13022 -3749 -3784 858 841 -3548 -8950 6317 4262 -4765 -4035 -2321 6355 23561 15609 -125
14382 -125 -12538 -17514 -19870 -8688 2309 3522 -8412 -3762 -2420 -11953 -923 7136 12601 4230
14368 4230 -9622 -8262 -20276 -11470 -567 18020 22780 -1083 -1738 1726 5693 -5627 -21219
14355 -21219 -14008 1980 15623 8882 3049 -2154 -793 -7841 -9331 -24034 -42025 -49217 -21723
14342 -21723 -4151 1173 -7551 -7786 -828 4388 6805 14409 13826 25935 27886 35694 46342 47904
14328 47904 25262 8253 -9146 -14613 -4014 12170 16433 11283 13205 861 -5799 -6636 -4550
$$ packed form
14427a3291K495O507m42q140k593m776J2343O855M556m823r295J954l549M20M432
14412g347J53j0991Q931J629k970k961O804n42L931r315j704r83K130j1505J1718
14397a3022R273l5M642j7m389n402J5267k055r027P30J714Q676J7206p952j5734
14382a25j2413m976k356J1182J0997J213j1934M650J342r533J1030Q059N465q371
14368D230j3852J360j2014Q806J0903J8587M760k3863o55L464L967j1320j5592
14355b1219P211J5988J3643o741n833n203J361p048j490j4703j7991p192K7494
14342b1723J7572N324q724k35O958N216K417P604n83J2109J951P808J0648J562
14328D7904k2642j7009j7399n467J0599J6184M263n150J922j2344o660q37K086
$$ plain form
14315 -4550 -1687 14294 22949 11184 8238 12134 12627 10466 7944 14358 17748 10321 17915 13105
14301 13105 22038 21260 20581 7530 -1093 -57 7697 12321 14254 16613 15620 4452 17049 30791
14287 30791 20151 8375 -4904 -2442 -1568 -5014 -14512 -19817 -29502 -20261 -18006 -23401 -14485 -15693
14273 -15693 -19447 -23678 -26192 -24962 -16225 -11323 -12356 -470 -6755 -9749 -13017 -16654 -23106 -13167
14259 -13167 1385 40 -1433 6778 21529 21162 7464 -5668 -8037 -3591 8288 8513 11157 16081
14245 16081 12576 18023 29380 27689 10494 -2115 -4122 -18632 -10654 1620 2828 6200 11638
14232 11638 2923 1070 6988 7164 -14345 -24243 -26910 -12443 -9912 -12692 18484 19464 8400 1601
14218 1601 7121 17068 6968 -4138 -3626 1021 4958 1427 -4995 -10584 -14200 -5892 -2453 -3816
$$ packed form
14315d550K863J5981Q655j1765k946L896M93k161k522O414L390p427P594m810
14301A3105Q933p78o79j3051q623J036P754M624J933K359r93j1168J2597J3742
14287C0791j0640j1776j3279K462Q74l446r498n305r685R241K255n395Q916j208
14273a5693l754m231k514J230Q737M902j033J1886o285k994l268l637o452R939
14259a3167J4552j345j473Q211J4751l67j3698j3132k369M446J1879K25K644M924
14245A6081l505N447J1357j691j7195j2609k007j4510P978J2274J208L372N438
14232A1638q715j853N918J76k1509r898k667J4467K531k780L1176R80j1064o799
14218A601N520R947j0100j1106N12M647L937l531o422n589l616Q308L439j363
$$ plain form
14204 -3816 -17345 -11303 -8619 -7310 -15101 -11194 -7956 -6082 3155 13608 -1404 -9490 -10750 -9357
14190 -9357 -1819 -10672 -7140 -1787 -509 -1211 -1508 -13224 -21632 -24233 -41524 -36352 -36308 -25268 -13571
14175 -13571 -2224 2045 -3198 -20557 -27771 -23849 -14864 -1217 4606 -9226 -28154 -17865 -2041
14162 -2041 2567 6073 8519 -3439 -13045 -866 2835 -11161 -21675 -30734 -34559 -15653 -6066
14149 -6066 -9355 -2981 -7532 -19243 -24451 -5133 7556 5594 -6450 -19325 -9766 -5195 5911
14136 5911 13492 14973 14361 1300 -5691 2513 4881 -10924 -28604 -24410 -20753 -25420 -22952 -6764
14122 -6764 14060 17849 9206 -18 2500 3617 9641 4837 -11117 -8185 -8067 -4701 -4754 -17755 -10169
14107 -10169 -5142 -4322 -5521 15392 20676 7380 -1886 -8514 -5105 5879 -9996 -8827 -7011 -5455
$$ packed form
14204c816j3529O042K684J309p791L907L238J874R237J0453j5012q086j260J393
14190i357P538q853L532N353J278p02k97j1716q408k601j7291N172M4J1040J1697
14175a3571J1347M269n243j7359p214L922Q985J3647N823j3832j8928J0289J5824
14162b041M608L506K446j1958r606J2179L701j3996j0514r059l825J8906R587
14149f066l289O374m551j1711n208J9318J2689j962j2044j2875R559M571J1106
14136E911P581J481o12j3061o991Q204K368j5805j7680M194L657m667K468J6188
14122f764K0824L789q643r224K518J117O024m804j5954K932J18L366n3j3001P586
14107a0169N027Q20j199K0913N284j3296r266o628L409J0984j5875J169J816J556
$$ plain form
14093 -5455 -4744 -2397 11304 19488 14656 9670 16467 20156 33805 39693 29532 21567 25074 33094
14079 33094 28076 15256 3548 1815 794 8194 8818 2783 -1719 4056 5848 7618 18034 17382
14065 17382 -20 -9672 -5744 -10164 -5745 1294 -10078 -22384 -26202 -26338 -20961 6313 22927
14052 22927 2578 -1257 -10850 -9561 -16649 -23832 -12580 -15984 -18105 -9583 1180 315 -1771 -14284
14038 -14284 -25140 -28095 -30811 -23176 -6117 -9215 -31886 -26930 -9655 -497 -2469 -8793 -6707
14025 -6707 -8420 -14478 -17031 -11474 -5337 -4976 8589 6733 6653 -3707 -8571 -1327 4773 17391 18033
14010 18033 14899 15946 -8456 -16175 -9465 -5184 -1770 -4722 1128 2654 7546 15925 6683 12117
13996 12117 9870 -7105 -16096 -21780 -2960 8822 14952 7277 -1397 2084 5218 12921 22715 31967
$$ packed form
14093e455P11K347J3701Q184m832m986O797L689J3649N888j0161p965L507Q020
14079C3094n018j2820j1708j733j021P400O24o035m502N775J792J770J0416o52
14065A7382j7402r652L928m420M419P039j1372j2306l818j36N377K7274J6614
14052B2927k0349l835r593J289p088p183J1252l404k121Q522J0763q65k086j2513
14038a4284j0856k955k716P635J7059l098k2671M956J7275R158j972o324K086
14025f707j713o058k553N557O137L61J3565j856q0j0360m864P244O100J2618O42
14010A8033l134J047k4402p719O710M281L414k952N850J526M892Q379r242N434
13996A2117k247j6975q991n684J8820J1782O130p675q674L481L134P703R794R252
$$ plain form
13982 31967 22698 6918 1719 18845 19961 6787 8901 12410 8216 -4042 -4679 -13842 -6205 -1839
13968 -1839 5143 -1123 -14302 -9995 -680 2780 -5061 -18840 -11879 -1447 -12517 -15450 -2094
13955 -2094 -423 -9204 -15171 -7785 -3464 3617 10070 741 -3580 -1053 -3948 -7657 -2595 4652 -2118
13940 -2118 -4811 -432 -9108 -11686 -8181 -2789 -4831 -6492 -2494 4514 -54 -2563 -3443 -6614 -4221
13925 -4221 -6410 -5036 -2778 8409 -1718 -16517 -10148 -17105 -21256 -24277 -29917 -43051 -36734 -19253
13911 -19253 -16398 -17396 -8062 9952 8552 1712 -14270 -10283 -8470 -13700 -9140 -13485 -22451 -19542
13897 -19542 -855 10486 1587 4751 -1151 6572 4624 -12562 -15694 -19689 -25810 -24054 -9636
13884 -9636 -6098 -10644 -10902 -16997 -13525 -4143 -10793 -11295 -13665 -13756 -14474 -12333 -8333 -1022 15253 11969
$$ packed form
13982C1967r269j5780n199J7126J116j3174K114L509m194j2258o37r163P637M366
13968a839O982o266j3179M307R315L460p841j3779O961J0432j1070k933J3356
13955b094J671q781n967P386M321P081O453r329m321K527k895l709N062P247o770
13940b118k693M379q676k578L505N392k042j661L998P008m568k509q80l171K393
13925d221k189J374K258J1187j0127j4799O369o957m151l021n640j3134O317J7481
13911a9253K855r98R334J8014j400o840j5982L987J813n230M560m345q966K909
13897a9542J8687J1341q899L164n902P723j948j7186l132l995o121J756J4418
13884i636L538m546k58o095L472R382o650n02k370r1p18K141M000P311J6275l284
$$ plain form
13868 11969 11544 15089 6042 2702 -689 -1191 -7906 -16537 -15240 -3795 -4624 -8756 -14933 3790 5389
13853 5389 -8034 -5636 254 14191 11929 15632 25726 26325 15493 866 -6859 -4623 -2103 2857
13839 2857 5563 2706 -6472 -17619 -20885 -25626 -19892 -15830 -16012 -19329 -22445 -4768 24928 29058
13825 29058 14143 18624 19868 13353 2344 -5703 -9161 -1285 -3671 -3265 5123 -2116 -11890 -15708
13811 -15708 -15198 -26372 -27794 -9401 -4796 4244 5263 -2156 3286 15090 -481 -19326 -16960
13798 -16960 -4778 -1457 -9979 -14432 -17543 -17247 -13562 -6475 1689 -5146 -15595 -11737 -15430 -33028
13784 -33028 -25781 -9100 -1644 -1733 -12222 -15046 -8479 7165 10977 5627 -5495 6369 13697 5164
13770 5164 -514 -3018 -3572 1138 1335 -7042 -16178 -14896 -19291 -29488 -26313 -17514 -24383 -25923 -31012
$$ packed form
13868A1969m25L545r047l340l391n02o715q631J297J1445q29m132o177J8723J599
13853E389j3423K398N890J3937k262L703J0094N99j0832j4627p725K236K520M960
13839B857K706k857r178j1147l266m741N734M062j82l317l116J7677K9696M130
13825B9058j4915M481J244o515j1009q047l458P876k386M06Q388p239r774l818
13811a5708N10j1174j422J8393M605R040J019p419N442J1804j5571j8845K366
13798a6960J2182L321q522m453l111K96L685P087Q164o835j0449L858l693j7598
13784c3028P247J6681P456q9j0489k824O567J5644L812n350j1122J1864P328q533
13770E164n678k504n54M710J97q377r136J282m395j0197L175Q799o869j540n089
$$ plain form
13755 -31012 -34198 -30873 -20546 -411 5640 -7227 -18978 -16764 -15756 -6532 -43 5399 -3979
13742 -3979 -13899 -17003 -19294 -20962 -20405 -8840 342 -2188 -8733 -19175 -13728 -2643 -5229 -6279
13728 -6279 -19334 -30476 -14120 -17441 -27469 -27730 -25585 -24583 -25011 -17682 -4545 1733 12271 16172
13714 16172 13861 4980 2028 -13209 -9433 -125 -2922 -10516 -13801 -13087 -11149 -11808 -15712 -19902 -8773
13699 -8773 1340 -3957 -20068 -10610 -6316 -6723 -2882 -1299 3060 542 4584 2127 -13454 -20897
13685 -20897 -14044 -2322 4750 -3007 -6088 -11375 -7722 -995 -2447 -7482 -6677 890 4061 7254
13671 7254 11908 -2849 -10994 -7859 3360 15593 14052 2866 1836 -16901 -15650 -415 -2775
13658 -2775 -13113 -23093 -21275 -9242 -12421 -16852 -9980 -7899 -9287 -5752 -6025 -19632 -18890 -19960
$$ packed form
13755c1012l186L325J0327K0135O051j2867j1751K214J008R224O489N442r378
13742c979r920l104k291j668N57J1565R182k530o545j0442N447J1085k586j050
13728f279j3055j1142J6356l321j0028k61K145J002m28P329J3137O278J0538L901
13714A6172k311q881k952j5237L776R308k797p594l285P14J938o59l904m190J1129
13699h773J0113n297j6111R458M294m07L841J583M359k518M042k457j5581p443
13685b0897O853J1722P072p757l081n287L653O727j452n035Q05P567L171L193
13671G254M654j4757q145L135J1219J2233j541j1186j030j8737J251J5235k360
13658b775j0338r980J818J2033l179m431O872K081j388L535k73j3607P42j070
$$ plain form
13644 -19960 -23724 -27337 -14871 -14384 -7007 -8109 -19007 -13295 5066 2221 -9909 -12927 -9326 9710
13630 9710 14868 675 -5486 -18223 -26676 -21408 -14808 -4498 -11028 -21366 -22601 -23368 -33718 -35169
13616 -35169 -27158 -27334 -17943 -19692 -21653 -3459 -8664 -9978 -10969 -3473 5686 4478 4146 -345 -1529
13601 -1529 -4510 -21177 -31925 -25425 -19086 -7882 -1596 -10868 -21250 -22448 -13145 -11127 -9964 -13378
13587 -13378 -18100 -11110 -3692 -10780 -11124 -2247 -1538 -6858 522 18847 13463 3683 4123 3546 5811
13572 5811 22353 23720 11527 5068 5652 7045 27 -3368 -5427 -12023 -10959 450 -1377 8481
13558 8481 11839 6910 1112 1797 -9544 -11573 -9497 -13571 -3254 8541 5625 926 -5697 -7680
13544 -7680 -5434 12232 18810 12648 12151 14145 21037 23666 24187 31388 34795 33064 23653 22819 19652
$$ packed form
13644a9960l764l613J2466M87P377j102j0898N712J8361k845j2130l018L601J9036
13630I710N158j4193o161j2737q453N268O600J0310o530j0338j235p67j0350j451
13616c5169Q011j76R391j749j961J8194n205j314r91P496R159j208l32m491j184
13601a529k981j6667j0748O500O339J1204O286r272j0382j198R303K018J163l414
13587a3378m722O990P418p088l44Q877P09n320P380J8325n384r780M40n77K265
13572E811J6542J367j2193o459N84J393p018l395k059o596J064J1409j827R858
13558H481L358m929n798O85j1341k029K076m074J0317J1795k916m699o623j983
13544g680K246J7666O578o162m97J994O892K629N21P201L407j731r411q34l167
$$ plain form
13529 19652 11756 -17059 -25443 -18014 -12977 -8163 -9152 -7030 -4052 -5610 -1090 5937 3372 -16888
13515 -16888 -27075 -31548 -33137 -18365 -11969 -15469 -15933 -3955 16269 20112 8737 9339 12113 6374
13501 6374 7588 4090 5618 3544 -3535 -17431 -20429 -26788 -17601 -8671 -12023 -17140 -12713 -11733 -2534
13486 -2534 -4823 -6505 -16908 -11232 -24259 -51457 -50620 -30475 -16650 -14293 -12222 3461 5330
13473 5330 -784 -9635 -5637 2208 4553 3506 -3794 -4069 7952 6796 13739 10298 -7374 -16303
13459 -16303 -6407 -1475 2328 2945 -8622 -17461 -15662 -6014 -3878 -3675 7660 20447 4405 -21024
13445 -21024 -26797 -17398 -15967 -26460 -22323 -16755 -1114 7515 7607 -2476 -12703 -23179 -21215 -9535
13431 -9535 -1591 -3922 -5280 -5378 -8721 -10479 -10461 -14120 -8909 -8902 -10749 -4705 1599 10633 19050 17348
$$ packed form
13529A9652p896k8815q384P429N037M814r89K122K978j558M520P027k565k0260
13515a6888j0187m473j589J4772O396l500m64J1978K0224L843j1375O02K774n739
13501F374J214l498J528k074p079j3896k998o359R187Q930l352n117M427R80R199
13486b534k289j682j0403N676j3027k7198Q37K0145J3825K357K071J5683J869
13473E330o114q851L998P845K345j047p300k75J2021j156O943l441j7672q929
13459a6303R896M932L803O17j1567q839J799R648K136K03J1335J2787j6042k5429
13445b1024n773R399J431j0493M137N568J5641Q629R2j0083j0227j0476J964J1680
13431i535P944k331j358r8l343j758J8l659N211Pj847O044O304R034Q417j702
$$ plain form
13415 17348 22569 15575 27934 20409 1873 3663 -4769 -5822 -3004 8032 5659 -10454 -16059
13402 -16059 5085 8891 2303 1702 -1871 2882 1929 1345 -13768 -25811 -14326 -2002 -6496 -9498
13388 -9498 -4781 -587 16445 10598 -214 -8450 -8318 -4251 -16853 -29430 -12686 -13950 -14563 -15852
13374 -15852 -17159 -29757 -26855 -26002 -16854 -21548 -21334 -15274 267 -7287 -10132 295 -10836 -18955
13360 -18955 -20334 -12322 -18138 -24142 -26681 -9870 -9922 -15452 -13575 -11155 -13256 -14141 -15733 -4698 -8095
13345 -8095 -4985 -5984 -18474 -26012 -18572 -13862 -728 932 -50 1359 104 -17209 -19912 -15061
13331 -15061 -12290 -23303 -27741 -31633 -31628 -24987 -21928 -27268 -17482 -6952 4665 6784 7763 2808 -1740
13316 -1740 -451 224 -10670 2822 5218 8125 -6032 -19958 -16256 -5235 -11753 -20083 -7399
$$ packed form
13415A7348N221o994J2359p525j8536J790q432j053K818J1036k373j6113n605
13402a6059K1144L806o588o01l573M753r53n84j5113j2043J1485J2324m494l002
13388i498M717M194J7032n847j0812q236J32M067j2602j2577J6744j264o13j289
13374a5852j307j2598K902Q53R148m694K14O060J5541p554k845J0427j1131q119
13360a8955j379Q012n816o004k539J6811n2n530J877K420k101q85j592J1035l397
13345h095L110r99j2490p538P440M710J3134J660r82J409j255j7313k703M851
13331a5061K771j1013m438l892NO641L059n340R786J0530J1617K119R79m955m548
13316a740J289O75j0894J3492K396K907j4157j3926L702J1021o518q330J2684
$$ plain form
13303 -7399 -9288 -6022 5287 12105 7232 1507 -3503 -11436 -8585 -3412 9895 8450 3184 -1811
13289 -1811 7150 -2049 -7248 -17426 -23700 -17402 4943 7584 -4790 -8340 -2449 -10806 -25695 -25919
13275 -25919 -11830 -4583 3598 9269 4385 -17526 -13507 6084 262 545 2491 -5515 -7399 -20224
13261 -20224 -24089 -28030 -31446 -24757 -16310 -10695 -8982 -23554 -24812 -19031 -6899 1269 -13799 -27708
13247 -27708 -22101 -16950 -13262 -21044 -14356 10249 30582 31300 24770 14758 11708 12479 11202 15162
13233 15162 14106 -2680 -9174 356 2900 5421 14073 -2818 -18624 -14887 3053 13863 5842
13220 5842 -15227 -24716 -14311 -15501 -12344 -11131 -6416 1982 5390 8011 6515 5276 -160 -6677
13206 -6677 5368 11690 5266 2905 -1086 2343 15642 10420 4488 -15791 -18182 -26531 -36462 -33349
$$ packed form
13303g399j889L266J1309O818m873n725n010p933K851N173J3307j445n266m995
13289a811Q961r199n199j0178o274O298K2345K641j2374l550N891q357j4889k24
13275b5919J4089P247Q181N671m884k1911M019J9591n822K83J946q006j884j2825
13261b0224l865l941l416O689Q447N615J713j4572j258N781J2132Q168j5068j3909
13247b7708N607N151L688p782O688K4605K0333P18o530j0012l050P71j277L960
13233A5162j056j6786o494R530K544K521Q652j6891j5806L737J7940J0810q021
13220E842k1069r489J0405j190L157J213M715Q398L408K621j496j239n436o517
13206f677J2045O322o424k361l991L429J3299n222n932k0279k391q349r931L113
$$ plain form
13192 -33349 -16982 -12911 -9227 -10172 -3805 2543 -4207 -8395 -22151 -27513 -25060 -16682 -19531 -24375
13178 -24375 -22787 -14271 -13685 -12583 -12511 -1377 880 -12400 -9858 442 -1052 -12755 -17355 -17902
13164 -17902 -17140 -31719 -32190 -13055 -20066 -24106 -13015 -14299 -14811 -15807 -20034 -11404 -918 1208
13150 1208 -2531 796 6429 -2304 -990 -3646 1731 8924 14256 20880 17684 3393 -1708 -13203
13136 -13203 -8970 7954 1451 6956 5566 -1864 -5976 -2937 6828 9054 314 -6378 -10392 -8870
13122 -8870 -11494 -9515 -5209 7008 870 -5826 -22882 -33320 -30961 -19736 -9527 -6442 -19026
13109 -19026 -27694 -29535 -19495 -892 1328 687 7560 4143 -7114 -16391 -30257 -28037 -13381
13096 -13381 -16955 -18090 -20581 -24349 -15512 -4718 -1074 -12933 -26848 -29073 -20710 -17922 -27013 -28781
$$ packed form
13192c3349J6367M071L684r45O367O348o750m188j3756n362K453Q378k849m844
13178b4375J588Q516N86J102P2J1134K257j3280K542J0300j494j1703m600n47
13164a7902P62j4579m71J9135p011m040J1091j284n12r96m227Q630J0486K126
13150A208l739L327N633q733J314k656N377P193N332O624l196j4291n101j1495
13136a3203M233J6924o503N505j390p430m112L039R765K226q740o692m014J522
13122h870k624J979M306J2217o138o696j7056j0438K359J1225J0209L085j2584
13109a9026q668j841J0040J8603K220o41O873l417j1257r277j3866K220J4656
13096a3381l574j135k491l768Q837J0794L644j1859j3915k225Q363K788r091j768
$$ plain form
13082 -28781 -19893 -22446 -16197 -9129 -193 9147 -311 -13106 -14865 -8729 -3373 1442 2362 -8265
13068 -8265 -7525 -2711 1814 9735 -7192 -16460 -26179 -25231 -18255 -20948 -25028 -17402 -19684 -20225 -15279
13053 -15279 -20764 -33003 -32348 -24034 -17725 -3744 -12222 -14929 -19943 -32064 -19500 -16008 -19845 -12127
13039 -12127 -9426 -20510 -27396 -23598 -29736 -31944 -28616 -26267 -42200 -27170 2060 5800 -924
13026 -924 -6930 -238 5707 3177 849 605 5970 -4094 4560 1866 13989 8900 5231 813 -2319
13011 -2319 -1427 -11631 -14281 -8406 -8622 -10831 -15091 -9301 -5368 -7306 -2376 -7055 -13972 -7218 7286
12996 7286 10182 15979 5357 -17395 -29296 -15037 428 4535 -6185 -11715 -15249 -16202 -19291
12983 -19291 -34725 -27950 -8837 -6235 -5418 -2299 14391 21748 14572 13995 -3046 -7279 -6111 -3619
$$ packed form
13082b8781Q888k553O249P068Q936R340r458j2795j759O136N356M815R20j0627
13068h265P40M814M525P921j6927r268r719R48O976k693m080P626k282n41M946
13053a5279n485j2239O55Q314O309J3981q478k707n014j2121J2564L492l837P718
13039a2127K701j1084o886L798o138k208L328K349j5933J5030K9230L740o724
13026i24o006O692N945k530k328k44N365j0064Q654k694J2123n089l669m418l132
13011b319Q92j0204k650N875k16k209m260N790L933j938M930m679o917O754J4504
12996G286K896N797j0622k2752j1901J4259J5465M107j0720n530l534r53l089
12983a9291j5434O775J9113K602Q17L119J6690P357p176n77j7041m233J168K492
$$ plain form
12969 -3619 -6402 -9280 -3140 -3459 2372 12275 4860 -5234 -21175 -35825 -19189 -15706 -14808 -15470
12955 -15470 -6266 -6558 2544 14051 8850 -16535 -13441 -5058 -14960 -18875 -31816 -18399 -19448 -29153
12941 -29153 -26320 -13006 -7523 -17167 -12329 -11435 -11891 -8334 -2248 -4343 4258 7827 -2564 -5536
12927 -5536 -10964 -11162 -19291 -24735 -22761 -15077 -6273 672 7025 6059 -7671 -11278 -10784 -12935 -20314
12912 -20314 -30155 -18634 -15846 -14759 5293 -1362 -3222 -98 -7857 -7563 -11197 -5806 -7778 -9558
12898 -9558 -12757 -18323 -17845 -11054 -12355 -12267 -15975 1145 8100 4114 20734 36892 47155 56687
12884 56687 50429 54174 94157 160499 238005 369103 486222 533992 475208 374928 280898
12873 280898 220034 185146 176493 148120 132624 124021 112110 91471 85346 71498 53665 46401
$$ packed form
12969c619k783k878O140l19N831R903p415j0094j5941j4650J6636L483Q98o62
12955a5470R204k92R102J1507n201k5385L094Q383r902l915j2941J3417j049r705
12941b9153K833J3314N483r644M838Q94m56L557O086k095Q601L569j0391k972
12927e536n428j98q129n444J974P684Q804O945O353r66j3730l607M94k151p379
12912b0314r841J1521K788J087K0052o655j860L124p759K94l634N391j972j780
12898i558l199n566M78O791j301Q8l708J7120O955l986J6620J6158J0263R532
12884E6687o258L745L9983O6342P7506J31098J17119M7770n8784j00280r4030
12873B80898o0864l4888q653k8373j5496q603j1911k0639o125j3848j7833p264
$$ plain form
12861 46401 61566 55058 43317 32438 34621 30652 30072 26641 25418 39584 44167 44239 36055 32411
12847 32411 32233 33449 24835 22584 34520 39172 27033 28302 39228 42281 53917 67550 60865
12834 60865 46146 37210 19409 20034 31695 23038 16442 7824 13991 16810 5692 11516 31995
12821 31995 29418 5436 11325 12505 1671 -7010 -8353 -8248 -1158 10341 28710 23412 3539
12808 3539 7122 666 1458 8427 10914 4907 -14351 -26109 -4850 -3522 -1926 -1906 -5128 -12710 -19268
12793 -19268 -2427 6327 19712 23544 28688 20963 25871 12820 2348 343 17603 26099 22401
12780 22401 42249 58012 57014 55308 56138 53851 77049 120095 153189 206275 280471 377455 552532
12767 552532 855722 1304210 1686186 1789301 1591048 1280958 1018161 833819 718222 626900
$$ packed form
12861D6401J5165o508j1741j0879K183l969n80l431j223J4166M583P2q184l644
12847C2411j78J216q614k251J1936M652j2139J269J0926L053J1636J3633o685
12834F0865j4719q936j7801O25J1661q657o596q618O167K819j1118N824K0479
12821C1995k577k3982N889J180j0834q681j343J05P090J1499J8369n298j9873
12808C539L583o456P92O969K487o007j9258j1758K1259J328J596K0l222p582o558
12793a9268J6841Q754J3385L832N144p725M908j3051j0472k005J7260Q496l698
12780B2401J9848J5763r98j706Q30k287K3198M3046L3094N3086P4196R6984J75077
12767E52532L03190M48488L81976J03115j98253l10090k62797j84342j15597r1322
$$ plain form
12757 626900 536213 453306 382768 339062 303032 263120 231393 214479 206637 197104 167748 145363
12745 145363 147676 153776 141802 136167 122604 116449 118017 99056 96257 99503 90753 89054 85783
12732 85783 90152 88348 84066 79717 69604 64356 81027 81796 62243 40695 30336 39723 51309
12719 51309 55502 65000 58586 44158 32416 34848 36239 40361 34634 34947 34325 22143 33003 34688
12705 34688 25398 27078 35733 20641 -1709 6443 1670 4476 23956 35115 37501 32204 24153
12692 24153 21134 26445 34123 45169 32682 21908 28679 18760 18838 10737 8359 10898 16550 15998
12678 15998 16087 14028 10348 17207 12414 -1340 -4632 -6500 7295 16796 3530 -7393 -14581 -15250
12664 -15250 -11882 -4638 22045 27504 26769 15800 -5060 -9756 3380 2401 7286 -3203 1545 6163
$$ packed form
12757F26900r0687q2907p0538m3706l6030l9912l1727j6914p842r533k9356k2385
12745A45363K313O100j1974n635j3563o155J568j8961k799L246q750j699l271
12732H5783M369j804m282m349j0113n248J6671P69j9553k1548j0359R387J1586
12719E1309M193R498o414j4428j1742K432J391M122n727L13o22j2182J0860J685
12705C4688r290J680Q655j5092k2350Q152m773K806J9480J1159K386n297q051
12692B4153l019N311P678J1046j2487j0774O771r919P8q101k378K539N652n52
12678A5998Q9k059l680O859m793j3754l292j868J3795R501j3266j0923p188o69
12664a5250L368P244K6683N459p35j0969k0860m696J3136r79M885j0489M748M618
$$ plain form
12650 6163 202 -20340 -14186 -2345 -8305 -18468 -10162 -11019 -17613 -15285 -16306 -5727 7175 12793
12636 12793 10539 7067 -209 11225 7615 88 -13442 -17107 -23829 -10309 -9234 -2776 6017 9467
12622 9467 4095 -3734 -10282 -22269 -36109 -24667 -10457 -5107 -5205 2025 12183 16835 -1686 -11489
12608 -11489 -1336 -3195 -7077 -8821 -3917 -17173 -21566 -17024 -16086 -7554 -13095 -31306 -30625 -14524
12594 -14524 -9721 -8407 400 -1916 12381 21394 4131 -10936 -10751 -9817 -13099 -20806 -13264 31
12580 31 2010 1895 -12623 -10163 -1543 -1996 -11630 -10639 -9171 -26487 -31734 -23761 -17421 -6486 -13106
12565 -13106 -25042 -30550 -7720 -5527 -4978 1305 9271 12846 9089 4312 11571 10641 17107 19689
12551 19689 11994 -1731 -17401 -14131 -6485 -18044 -10202 -4808 -10785 -3974 7753 -5853 -11156
$$ packed form
12650F163n961k0542O154J1841n960j0163Q306q57o594K328j021J0579J2902N618
12636A2793k254l472p276J1434l610p527j3530l665o722J3520J075O458Q793L450
12622I467n372p829o548j1987j3840J1442J4210N350r8P230J0158M652j8521r803
12608a1489J0153j859l882j744M904j3256m393M542R38Q532n541j8211O81J6101
12594a4524M803J314Q807k316J4297R013j7263j5067J85R34l282p707P542J3295
12580C1J979j15j4518K460Q620m53r634R91J468j7316n247P973O340J0935o620
12565a3106j1936n508K2830K193N49O283P966L575l757m777P259r30O466K582
12551A9689p695j3725j5670L270P646j1559P842N394n977O811J1727j3606n303
$$ plain form
12538 -11156 -3033 -508 -503 -9889 -2259 -3271 1107 4702 15030 18253 -1797 -15565 -18261 -23064
12524 -23064 -17428 -5945 9110 20093 21871 9586 1623 -7447 -6065 -843 -2962 936 -3461
12511 -3461 -18830 -19652 -28844 -37040 -27927 -21540 -33002 -39267 -33734 -33548 -21339 -6126 12785 12296
12497 12296 11329 10049 8601 16538 22889 16942 1752 -12897 -13959 -3324 -3786 -930 -4640 -4884
12483 -4884 -5989 636 -4703 -14862 -21943 -18208 -4661 -10590 -28564 -19059 236 4654 1892 5403
12469 5403 5282 2431 9291 17527 8920 -6731 -4809 -3532 -907 6177 9467 5148 -2577 -5895 -3011
12454 -3011 1844 8762 6359 8033 3357 -13167 -15042 -11087 -8556 -8708 -5458 676 11227 11933 4699
12439 4699 830 -14191 -12439 3556 9734 4585 -5754 2602 -1566 -3327 -6029 -11474 -9248 -21952
$$ packed form
12538a1156Q123K525Nr386P630j012M378L595J0328L223k0050j3768k696m803
12524b3064N636J1483J5055J0983J778j2285p963r070J382N222k119L898m397
12511c461j5369q22r192q196R113O387j1462o265N533J86J2209J5213J8911m89
12497A2296r67j280j448P937O351n947j5190j4649j062J0635m62K856l710k44
12483d884j105O625n339j0159p081L735J3547n929j7974R505J9295M418k762L511
12469E403j21k851O860Q236q607j5651J922J277K625P084L290m319p725l318K884
12454c011M855O918k403J674m676j6524j875L955K531j52L250O134J0551P06p234
12439D699l869j5021J752J5995O178n149j0339Q356m168j761k702n445K226j2704
$$ plain form
12425 -21952 -21094 -19528 -17037 -13004 -1764 -875 -689 -6510 -24324 -17005 -1067 -6526 -6396 -6860 1656
12410 1656 -3760 -5793 -11201 -11272 -225 12302 1344 -12727 -8095 -4896 4266 6407 9345 4127
12396 4127 -8747 -13718 -13617 -16971 -6481 -6641 -4116 -7260 1019 13960 6551 4482 2385 -27
12382 -27 -577 3764 2959 -8449 -17121 -17234 -8249 -589 8942 5246 -10158 -14822 -704 10090 -3687
12367 -3687 -7417 3464 388 3161 8722 3543 -5484 -11831 -14810 -22862 -25692 -19158 -10519 -13670
12353 -13670 -13576 -23054 -30638 -27786 -13427 -12550 -6460 -4126 -5510 -4572 -15868 -15255 -9125 -4617 6886
12338 6886 6257 -6207 -5534 -8183 -6734 -1679 -4998 -5457 -5873 2925 19458 29267 21433 9301 -1149
12323 -1149 6896 7384 -1662 -4503 -4080 -4173 -7111 -21043 -23671 -26854 -13979 169 11244 9688 2477
$$ packed form
12425b1952Q58J566K491M033J1240Q89J86n821j7814P319J5938n459J30m64Q516
12410A656n416k033n408p1J1047J2527j0958j4071M632L199R162K141K938n218
12396D127j2874m971J01l354J0490j60K525l144Q279J2941p409k069k097k412
12382b7n50M341q05j1408q672j13Q985P660R531l696j5404m664J4118J0794j3777
12367c687l730J0881l076K773N561n179r027o347k979q052k830O534Q639l151
12353a3670R4r478p584K852J4359Q77O090K334j384R38j1296O13O130M508J1503
12338F886o29j2464O73k649J449N055l319m59m16Q798J6533R809p834j2132j0450
12323a149Q045M88r046k841M23r3k938j3932k628l183J2875J4148J1075j556p211
$$ plain form
12308 2477 -691 -209 -18849 -25602 -6753 5753 518 1846 -11685 -926 8116 8981 -11942 -19174
12294 -19174 -14520 -1187 12342 11884 9667 -1298 -22330 -34646 -33933 -18359 -8191 -9112 -5576
12281 -5576 3771 16974 12796 9765 6797 12483 18470 22874 19725 21274 10447 3670 9063 13467
12267 13467 7887 3493 2722 -4966 -6327 3432 16987 19930 9416 4331 8963 10853 15365 592
12253 592 -9658 -18998 -2997 6064 3400 4437 -2716 1027 13086 -178 -3454 -476 4493 2061
12239 2061 -7392 -18219 -13264 -8034 -14266 -22692 -20081 -5377 -10532 -11712 -12059 -14645 -13404 -12922 -25067
12224 -25067 -27519 -31944 -33165 -30306 -31600 -29697 -25603 -25048 -24098 -26001 -24416 -11343 -1872 -3728 -5
12209 -5 10734 18108 -1619 -8638 -5383 -7127 -6281 -567 -3640 -2452 -3791 8677 4981 -9233 -10322
$$ packed form
12308B477l168M82j8640o753J8849J2506n235J328j3531J0759R042Q65k0923p232
12294a9174M654J3333J3529m58k217j0965k1032j2316P13J5574J0168r21L536
12281e576R347J3203m178l031k968N686N987M404l149J549j0827o777N393M404
12267A3467n580m394p71p688j361R759J3555K943j0514n085M632J890M512j4773
12253E92j0250r340J6001R061k664J037p153L743J2059j3264l276K978M969k432
12239B061r453j0827M955N230o232q426K611J4704n155j180l47k586J241M82j2145
12224b5067k452m425j221K859j294J903M094N55R50j903J585J3073R471j856L723
12209eJ0739P374j9727p019L255j744Q46N714l073J188j339J2468l696j4214j089
$$ plain form
12194 -10322 -8580 -8308 -9152 1800 14224 9305 -2639 -3871 -9747 -12703 -19495 -13416 -11628 -14760
12180 -14760 -11702 -10824 -2071 -1472 -40 8662 5671 5815 -1305 -5306 -2409 4690 6716 1304 -10870
12165 -10870 -28565 -25367 -13148 -10330 -14660 -15501 -28097 -27059 -24410 -18974 -12948 -17580 -26058 -28558
12151 -28558 -29438 -23514 -17005 -18917 -13257 -15982 -25031 -24133 -15938 4915 9176 3159 6040 4144 5332
12136 5332 3125 -3680 -3039 7087 4149 -6873 -15807 -8701 -11877 -2294 -4135 -8985 3376 10173
12122 10173 8000 -13250 -21833 -17156 -16083 -8967 -10895 -18472 -26614 -27870 -11520 659 -7784 -15588
12108 -15588 -5830 4057 -5531 -13538 -13382 1203 15892 9761 16356 16549 13228 23611 13324 2697
12094 2697 -3778 -3663 4206 6507 -5770 -8551 -5752 -3234 -4014 -12278 -25533 -4904 -3882 -14690
$$ packed form
12194a0322J742K72q44J0952J2424m919j1944j232n876k956o792O079J788l132
12180a4760L058Q78Q753N99J432Q702k991J44p120m001K897P099K026n412j2174
12165a0870j7695L198J2219K818m330q41j2596J038K649N436O026m632q478k500
12151b8558q80N924O509j912N660k725r049Q98Q195K0853M261o017K881j896J188
12136E332k207o805O41J0126k938j1022q934P106l176R583j841m850J2361O797
12122A0173k173k1250q583M677J073P116j928p577q142j256J6350J2179q443p804
12108a5588R758R887r588q007J56J4585J4689o131O595J93l321J0383j0287j0627
12094B697o475J15P869K301j2277k781K799K518p80q264j3255K0629J022j0808
$$ plain form
12080 -14690 -2730 4393 -5711 -755 4956 1653 -9855 -1690 -9179 -10647 3770 -10133 -11384
12067 -11384 -11827 -8741 -5772 6379 20405 25408 13420 8176 -5203 -5054 -4106 -11123 -20319 -14003
12053 -14003 3672 -1324 -295 -2274 -12656 -18391 -15891 -15125 -26764 -31730 -22297 -5815 -6026 -14855
12039 -14855 1311 18750 9852 -1368 3912 7567 19237 20336 32645 33860 32597 33904 24867
12026 24867 11213 8488 18267 23792 22031 26924 28766 108 -4310 7213 19759 11674 2130
12013 2130 2612 3807 4161 2327 3873 6025 -2083 -7813 -8494 -10195 -13474 -2472 10052 13483 19466
11998 19466 11880 7749 6515 12439 11636 -3597 -7454 -5592 -1833 -14779 -12893 -9129 -7962 -10677
11984 -10677 -25303 -22517 -14513 -9450 -13157 -15326 -6664 11209 -3570 -18343 -8295 -9715 -558
$$ packed form
12080a4690J1960P123j0104M956N711l303j1508Q165p489j468J4417j3903j251
12067a1384m43L086K969J2151J4026N003j1988n244j3379J49R48p017r196O316
12053a4003J7675m996J029j979j0382n735K500P66j1639m966R433J6482k11q829
12039a4855J6166J7439q898j1220N280L655J1670J099J2309J215j263J307r037
12026B4867j3654k725R779N525j761M893J842k8658m418J1523J2546q085r544
12013B130M82J195L54j834J546K152q108n730o81j701l279J1002J2524L431N983
11998A9466p586m131j234N924q03j5233l857J862L759j2946J886L764J167k715
11984a0677j4626K786Q004N063l707k169Q662J7873j4779j4773J0048j420R157
$$ plain form
11971 -558 13334 19037 20484 14319 12630 22447 30442 21827 10047 2964 -3350 -2276 1572 4514
11957 4514 921 -4229 597 7877 16093 15750 12817 19365 16633 16615 12794 12961 8259 -5396 -19601
11942 -19601 -14290 -485 5000 -7326 -14410 -6684 16437 6064 2514 217 5859 2694 -8926
11929 -8926 -1233 -1667 -9547 239 6878 -820 -3591 198 13197 16866 7452 -2006 -9928 -9537 -11188
11914 -11188 -1234 13736 -2574 -4680 -2386 11765 18243 4150 -7483 -3062 1378 20841 34462
11901 34462 23873 13112 25182 21776 15781 16507 18643 21872 49861 88756 117395 136308 155188
11888 155188 194266 247879 299833 354910 390397 429405 476255 520263 559666 580026 579936 578329
11876 578329 576964 569519 540897 503197 440823 376929 336287 295478 270680 246784 222388 215754
$$ packed form
11971e58J3892N703J447o165j689R817P995q615j1780p083o314J074L848K942
11957D514l593n150M826P280Q216l43k933O548k732j8l821J67m702j3655j4205
11942a9601N311J3805N485j2326p084P726K3121j0373l550k297N642l165j1620
11929h926P693m34p880R786O639p698k771L789J2999L669r414r458p922L91j651
11914a1188R954J4970j6310k106K294J4151O478j4093j1633M421M440J9463J3621
11901C4462j0589j0761J2070l406n995P26K136L229K7989L8895K8639J8913J8880
11888A55188L9078N3613N1954N5077L5487L9008M6850M4008L9403K0360r0j607
11876E78329j365p445k8622l7700o2374o3894m0642m0809k4798k3896k4396o634
$$ plain form
11864 215754 197695 183716 170784 163704 143675 129644 117671 111760 109157 107185 92944 84914
11852 84914 81235 81755 86651 89223 81223 62562 58564 66948 68856 79354 79278 68733 59344 59713 68247
11837 68247 65199 68985 67085 49927 38393 28813 23493 31331 29428 21784 12609 13312 18760 26952
11823 26952 29146 24474 32768 40394 49836 37981 29093 34209 29546 29383 26763 23643 33758 42731
11809 42731 38879 29426 17600 11757 5464 9145 -3173 7351 28450 37466 29293 24105 22436
11796 22436 18752 22433 29488 45460 56850 42747 28675 35571 30376 6477 15023 8500 5068
11783 5068 715 12204 20511 12715 16691 30819 30585 22668 21963 20762 33486 52220 47705 33406
11769 33406 30017 25047 11198 2872 22990 40084 33022 30398 30009 28666 21162 24682 25180 21710
$$ packed form
11864B15754j8059j3979j2932p080k0029j4031j1973n911k603j972j4241q030
11852H4914l679N20M896K572q000j8661l998Q384J908J0498p6j0545r389L69Q534
11837F8247l048L786j900j7158j1534r580n320P838j903p644r175P03N448Q192
11823B6952K194m672Q294P626R442j1855q888N116m663j63k620l120J0115Q973
11809D2731l852r453j1826n843o293L681j2318J0524K1099R016q173n188j669
11796B2436l684L681P055J5972J1390j4103j4072O896n195k3899Q546o523l432
11783E068m353J1489Q307p796L976J4128k34p917p05j201J2724J8734m515j4299
11769C3406l389m970j3849q326K0118J7094p062k624l89j343p504L520M98l470
$$ plain form
11755 21710 31521 32418 35545 14173 -132 592 1747 7591 1374 -4665 4236 19039 37131 42898
11741 42898 31226 32052 32143 33309 27195 19893 33600 38325 36049 30474 23724 18105 22056 28196 23911
11726 23911 23305 13128 10061 -317 16285 41129 46117 44340 52160 63750 71079 75103 81195
11713 81195 70180 66272 72118 84482 85019 83875 71665 74697 82336 88520 83596 74968 65292 57322
11699 57322 45732 46014 53836 54902 41935 28038 36477 35272 20870 23794 22354 32290 44325
11686 44325 36162 21616 16931 27886 23566 6995 3368 -3210 -5878 -11098 -7564 2964 14055
11673 14055 5159 14518 17408 20384 22818 13201 10355 7826 -15076 -43044 -58748 -49939 -58474 -80961
11659 -80961 -107089 -151972 -186071 -191805 -207929 -231157 -254056 -270531 -290980 -306190 -292182 -279791
$$ packed form
11755B1710R811Q97L127k1372j4305P24J155N844o217o039Q901J4803J8092N767
11741D2898j1672Q26R1J166o114p302J3707M725k276n575o750n619L951O140m285
11726B3911o06j0177l067j0378J6602K4844M988j777P820J1590P329M024O092
11713H1195j1015l908N846J2364N37j144j2210L032P639O184m924q628r676p970
11699E7322j1590K82P822J066j2967j3897Q439j205j4402K924j440R936J2035
11686D4325q163j4546m685J0955m320j6571l627o578k668n220L534J0528J1091
11673A4055q896R359K890K976K434r617k846k529k2902k7968j5704Q809q535k2487
11659h0961k6128m4883l4099n734j6124k3228k2899j6475k0449j5210J4008J2391
$$ plain form
11647 -279791 -272652 -263416 -258921 -229326 -184354 -157101 -148653 -134754 -106770 -77607 -51608 -32144
11635 -32144 -35713 -24765 -26057 -18336 -7404 -719 18349 17765 5630 21476 38160 40534 15258
11622 15258 6895 1893 7620 15099 4406 -2965 2310 -8340 -14899 -3438 -1516 1245 4875 10769
11608 10769 15429 5066 6140 15216 26698 39171 36260 37914 44939 66222 92449 87703 92892
11595 92892 90805 106906 117533 115702 111603 119845 133645 127057 139348 146287 144147 148909 150846
11582 150846 162785 174352 171464 168396 161591 152090 146387 137628 141439 145309 144556 164629 174428 179797
11568 179797 179142 156335 166819 186594 195322 199178 192612 198137 214279 214191 220377 228608 228406 231688
11554 231688 236485 243531 252275 254480 257295 267808 276001 264231 255391 265423 282068 303592 318868
$$ packed form
11647b79791P139R236M495K9595M4972K7253Q448J3899K7984K9163K5999J9464
11635c2144l569J0948j292P721J0932O685J9068n84j2135J5846J6684K374k5276
11622A5258q363n002N727P479j0693p371N275j0650o559J1461J922K761L630N894
11608A0769M660j0363J074R076J1482J2473k911J654P025K1283K6227m746N189
11595I2892k087J6101J0627j831m099Q242J3800o588J2291O939k140M762J937
11582A50846J1939J1567k888l068o805r501n703q759L811L870p53K0073R799N369
11568A79797o55k2807J0484J9775Q728L856o566N525J6142q8O186Q231k02L282
11554B31688M797P046Q744K205K815J0513Q193j1770q840J0032J6645K1524J5276
$$ plain form
11541 318868 322159 322700 311114 312554 319201 332648 343275 340794 340599 351084 365827 376399 380868
11528 380868 388404 392018 396738 410904 425469 437370 442481 447313 449741 441650 463431 473812 480754
11515 480754 495276 509642 511605 517438 523535 536558 576840 615029 651946 685646 695287 726006
11503 726006 784348 843088 901316 947726 997928 1067142 1132796 1220183 1326020 1405519 1493787
11492 1493787 1598464 1733561 1889018 2090707 2339126 2601113 2894721 3236260 3642947
11483 3642947 4111632 4650197 5242406 5930051 6736776 7687979 8864485 10357461 12256385
11474 12256385 14768130 18279154 23327007 30504071 39928153 50657237 60959122 69475877
11466 69475877 76523785 83749209 92301896 101489219 109071516 112903475 112501226 109431433
$$ packed form
11541C18868L291N41j1586J440O647J3447J0627k481j95J0485J4743J0572M469
11528C80868P536L614M720J4166J4565J1901N111M832K428q091K1781J0381O942
11515D80754J4522J4366J963N833O097J3023M0282L8189L6917L3700R641L0719
11503G26006N8342N8740N8228M6410N0202O9214O5654Q7387J05837P9499Q8268
11492A493787J04677J35097J55457K01689K48419K61987K93608L41539M06687
11483C642947M68685N38565N92209O87645Q06725R51203J176506J492976J898924
11474A2256385K511745L511024N047853P177064R424082J0729084J0301885Q516755
11466F9475877P047908P225424Q552687R187323P582297L831959m02249l069793
$$ plain form
11458 109431433 105902120 102760334 98815499 92365166 83217196 72833733 63049322 54859393
11450 54859393 48273560 42889955 38364244 34538622 31274446 28508335 26133879 24074917
11442 24074917 22306094 20772657 19414426 18172234 17055092 16069153 15175125 14363880
11434 14363880 13629512 12976999 12405336 11871069 11381615 10932276 10483984 10063411 9658002
11425 9658002 9293766 8937676 8594966 8263829 7954357 7655579 7370510 7100625 6847728
11416 6847728 6620102 6401491 6181798 5975129 5782251 5607295 5443072 5281776 5123536
11407 5123536 4975090 4829364 4683135 4527495 4391107 4281880 4170977 4055173 3939438
11398 3939438 3833790 3753734 3671606 3582153 3481356 3414879 3385937 3359271 3331888 3305844 3276661
$$ packed form
11458A09431433l529313l141786l944835o450333r147970j0383463r784411q189929
11450E4859393o585833n383605m525711l825622l264176k766111k374456k058962
11442B4074917j768823j533437j358231j242192j117142r85939q94028q11245
11434A4363880p34368o52513n71663n34267m89454m49339m48292m20573m05409
11425I658002l64236l56090l42710l31137l09472k98778k85069k69885k52897
11416F847728k27626k18611k19693k06669j92878j74956j64223j61296j58240
11407E123536j48446j45726j46229j55640j36388j09227j10903j15804j15735
11398C939438j05648q0056q2128q9453j00797o6477k8942k6666k7383k6044k9183
$$ plain form
11387 3276661 3248840 3226790 3203703 3175697 3136715 3096935 3038795 2974127 2898131 2807834 2717749
11376 2717749 2639138 2573899 2492632 2386587 2286954 2178394 2076979 1982912 1906245 1840133 1776469
11365 1776469 1725884 1680927 1619715 1564502 1538231 1507012 1470498 1433277 1388747 1340277 1302917
11354 1302917 1260978 1215559 1181540 1166360 1147100 1130825 1110989 1087478 1063774 1036759 1007665
11343 1007665 994150 982397 972641 951887 922482 899128 873476 854484 855640 861033 848981 832904
11331 832904 799206 785374 776241 771322 753094 737272 717698 689754 664697 652070 632477 608506
11319 608506 584095 572880 548830 517044 492147 482416 471398 463283 446090 443566 431020 412222
11307 412222 389260 386682 378595 365733 352893 355960 386709 423053 447825 451048 442889 422360
$$ packed form
11387C276661k7821k2050k3087k8006l8982l9780n8140o4668p5996r0297r0085
11376B717749p8611o5239q1267j06045r9633j08560j01415r4067p6667o6112o3664
11365A776469n0585m4957o1212n5213k6271l1219l6514l7221m4530m8470l7360
11354A302917m1939m5419l4019j5180j9260j6275j9836k3511k3704k7015k9094
11343A007665j3515j1753r756k0754k9405k3354k5652j8992J156N393j2052j6077
11331H32904l3698j3832r133m919j8228j5822j9574k7944k5057j2627j9593k3971
11319F08506k4411j1215k4050l1786k4897r731j1018q115j7193k524j2546j8798
11307D12222k2962k578q087j2862j2840L067L0749L6344K4772L223q159k0529
$$ plain form
11295 422360 400509 359618 340115 325354 304247 278587 270343 258601 243975 235354 233997 243570
11283 243570 252627 284828 312999 327762 342111 368384 391996 430692 463329 482914 494816 493916
11271 493916 496800 494641 484179 468290 450468 437262 422136 388597 360643 333976 322938 323153
11259 323153 293968 264220 243392 226029 225693 227997 218962 203941 209191 200966 195779 179683 183824
11246 183824 181622 181199 178225 175970 174034 180398 187322 182002 178882 186107 172224 162580 156104 153889
11232 153889 147999 148857 159187 146541 165236 179638 156973 129632 128861 134529 110255 91647 86012
11219 86012 90890 107074 109123 108415 106006 117943 115287 106267 90786 98489 104246 117919 132200
11206 132200 146076 156044 152517 144883 147672 144274 159883 159020 138824 125600 135879 132603 121701
$$ packed form
11295D22360k1851m0891j9503j4761k1107k5660q244j1742j4626q621j357R573
11283B43570R057L2201K8171J4763J4349K6273K3612L8696L2637J9585J1902r00
11271D93916K884k159j0462j5889j7822j3206j5126l3539k7954k6667j1038K15
11259C23153k9185k9748k0828j7363l36K304r035j5021N250q225n187j6096M141
11246A83824k202m23k974k255j936O364O924n320l120P225j3883r644o476k215
11232A53889n890Q58J0330j2646J8695J4402k2665k7341p71N668k4274j8608n635
11219H6012M878J6184K049p08k409J1937k656r020j5481P703N757J3673J4281
11206A32200J3876R968l527p634K789l398J5609q63k0196j3224J0279l276j0902
$$ plain form
11193 121701 128495 143846 167634 204882 238283 269510 281614 284622 276470 271964 243410 204736
11181 204736 164812 137627 117305 104118 93476 101661 92150 89950 86582 58105 54346 62801 61675
11168 61675 60072 66879 65193 61579 76043 72939 59895 52256 46258 39095 54378 68117 64694
11155 64694 56476 48088 37327 27547 30129 28963 35966 32124 22386 11275 22177 25758 20168 13661
11141 13661 16826 24317 15079 18684 20765 17371 29560 41024 46541 37522 14318 8707 -654 -1250
11127 -1250 20940 28253 40291 41546 23718 22262 22524 20303 24398 27927 23035 28026 39378 41876
11113 41876 29958 15743 13593 9838 14473 9378 -4209 176 11043 16175 14075 14342 11221 11958
11099 11958 9890 1344 1924 5079 -838 -1940 -4819 -2788 4882 17774 31418 32928 17582 -2753
$$ packed form
11193A21701O794J5351K3788L7248L3401L1227J2104L008q152m506k8554l8674
11181B04736l9924k7185k0322j3187j0642Q185r511k200l368k8477l759Q455j126
11168F1675j603O807j686l614J4464l104j3044p639n998p163J5283J3739l423
11155F4694q218q388j0761r780K582j166P003l842r738j1111J0902L581n590o507
11141A3661L165P491r238L605K081l394J2189J1464N517r019k3204n611r361n96
11127a250K2190P313J2038J255j7828j456K62k221M095L529m892M991J1352K498
11113D1876j1918j4215k150l755M635n095j3587M385J0867N132k100K67l121P37
11099A1958k068q546N80L155n917j102k879K031P670J2892J3644J510j5346k0335
$$ plain form
11085 -2753 14774 21709 17982 13542 12661 8451 9339 17310 26920 24411 18121 14279 17559 16917 15997
11070 15997 21913 24218 18941 3091 -509 1795 13304 6892 3054 9292 11564 15117 18714 27705
11056 27705 37369 43039 53808 57474 54753 63540 80260 107821 139235 183202 229152 283790 346976
11043 346976 383284 407417 448275 486792 537281 587531 605890 612830 597305 583086 567127 531990
11031 531990 484890 442436 400198 357181 313920 275945 263973 255947 245729 227236 203954 193031
11019 193031 172255 161330 147412 138830 137158 139157 119433 111500 103473 98021 102687 99462 98858
11006 98858 91218 86041 82141 77732 78304 76711 65765 73160 76889 74442 62458 63985 55516 43756
10992 43756 48553 51950 58264 54352 51924 50958 42064 29670 42952 56790 59172 45019 35166 36361
$$ packed form
11085b753J7527O935l727m440q81m210Q88P971R610k509o290l842L280o42r20
11070A5997N916K305n277j5850l600K304J1509o412l838O238K272L553L597Q991
11056B7705R664N670J0769L666k721Q787J6720K7561L1414M3967M5950N4638O3186
11043C46976L6308K4133M0858L8517N0489N0250J8359O940j5525j4219j5959l5137
11031E31990m7100m2454m2238m3017m3261l7975j1972q026j0218j8493k3282j0923
11019A93031k0776j0925j3918q582j672J999j9724p933q027n452M666l225o04
11006I8858p640n177l900m409N72j593j0946P395L729k447j1984J527q469j1760
10992D3756M797L397O314l912k428r66q894j2394J3282J3838K382j4153r853J195
$$ plain form
10978 36361 28637 12844 28968 30022 35170 37053 20935 2553 -4281 15897 16095 18420 25661
10965 25661 26998 21443 16108 22654 22488 29273 38795 40913 27459 2124 -7797 3734 11946 -6330
10951 -6330 -15069 -4120 6884 7392 5815 -8705 -15231 -21932 -3537 9800 8884 11130 12699 11071
10937 11071 11466 10227 8415 8796 -188 6164 8074 4280 -9151 -1634 10923 5542 37 539 20221
10922 20221 25669 4005 -16695 -12717 9287 15825 9255 -5555 -6378 -11525 -12044 -7414 75 2701
10908 2701 -3085 -8180 4562 12453 18956 20849 22621 4781 -10043 -15798 -23364 -21276 -17484 -36806
10894 -36806 -29433 -10645 9611 19214 13624 10698 13519 -2164 -21562 -21624 -23151 -10339 -43
10881 -43 -9433 -15031 -6199 -4345 -18259 -28292 -24659 -17367 -10277 -9304 -5774 -13622 -6100 -20 -7408
$$ packed form
10978C6361p724j5793J6124J054N148J883j6118j8382o834K0178J98K325P241
10965B5661J337n555n335O546j66O785R522K118j3454k5335r921J1531Q212j8276
10951f330q739J0949J1004N08j577j4520o526o701J8395J3337r16K246J569j628
10937A1071L95j239j812L81q984O352J910l794j3431P517J2557n381n505N02J9682
10922B0221N448k1664k0700L978K2004O538o570j4810q23n147n19M630P489K626
10908B701n786n095J2742P891O503J893J772j7840j4824n755p566K088L792j9322
10894c6806P373J8788K0256R603n590k926K821j5683j9398o2j527J2812J0296
10881d3r390n598Q832J854j3914j0033L633P292P090R73L530p848P522O080p388
$$ plain form
10866 -7408 -9898 -1972 -4787 -8506 -6663 -8768 1263 8641 19137 24057 11839 5243 15992 4520
10852 4520 2243 5217 -4762 -2067 -12572 -12888 -8177 -4023 6282 3103 11595 11123 10228 5296 3052
10837 3052 11011 7567 10655 18640 7703 -1708 -616 5471 3705 27469 29476 15884 26886 28209
10823 28209 13066 -1971 -8286 -10489 1999 -418 -11718 -6480 -4278 -1941 -5925 -13090 -2188
10810 -2188 1715 -19809 -39768 -24903 -2807 11260 2329 2318 12302 3368 -12434 -20325 -18428 -7623
10796 -7623 971 -8705 -9506 -9275 -1345 2303 -5056 1415 5122 -5256 -1578 6308 2169 -5333 890
10781 890 8112 900 -16276 -15451 -9141 -3886 -9355 -16296 -13747 -3860 2522 13586 13625 11008 23139
10766 23139 30758 33827 36118 50087 77719 104975 143154 218337 271168 273464 221634 168356
$$ packed form
10866g408k490P926k815l719J843k105J0031P378J0496M920j2218o596J0749j1472
10852D520k277K974r979K695j0505l16M711M154J0305l179Q492m72q95m932k244
10837C052P959l444L088P985j0937r411J092O087j766K3764K007j3592J1002J323
10823B8209j5143j5037o315k203J2488k417j1300N238K202K337l984p165J0902
10810b188L903k1524j9959J4865K2096J4067q931j1R984q934j5802p891J897J0805
10796g623Q594r676q01K31P930L648p359O471L707j0378L678P886m139p502O223
10781H90P222p212j7176Q25O310N255n469o941K549R887O382J1064L9k617J2131
10766B3139P619L069K291J3969K7632K7256L8179P5183N2831K296n1830n3278
$$ plain form
10754 168356 134760 99663 93766 91080 92310 84809 83091 71123 55172 39596 31606 31431 35055
10741 35055 38162 32268 15291 5367 16027 24334 25721 23776 15887 11800 9267 23172 28359 21509
10727 21509 20919 25699 28481 41102 53767 58366 58747 43475 22419 9626 10342 18891 28744 33002
10713 33002 29571 24609 20777 29064 17033 12132 29032 32320 23446 7434 3937 14871 30706
10700 30706 43172 40193 22235 12100 18749 10132 1304 3941 8036 14540 9604 -2203 -1959 -9154
10686 -9154 -4161 1354 -2260 -8746 -9604 -7014 -8361 -10493 -2854 3600 -15533 -19589 1233 13431
10672 13431 9465 -3714 -21738 -22449 -7838 7341 7000 5848 -2288 -10105 -1651 -5389 -30883 -38294
10658 -38294 -32396 -8860 -14168 -19949 -11598 -10615 -7200 -511 -12191 -11743 -25049 -26208 -19452 -9265
$$ packed form
10754A68356l3596l5097n897k686J230p501j718j1968j5951j5576p990j75L624
10741C5055L107n894j6977r924J0660Q307J387j945p889m087k533J3905N187o850
10727B1509n90M780K782J2621J2665M599L81j5272k1056j2793P16Q549R853M258
10713C3002l431m962l832Q287j2031m901J6900L288q874j6012l497J0934J5835
10700C0706J2466k979j7958j0135O649q617q828K637M095O504m936j1807K44p195
10686i154M993N515l614o486q58K590j347k132P639O454j9133m056K0822J2198
10672A3431l966j3179j8024p11J4611J5179l41j152q136p817Q454l738k5494p411
10658c8294N898K3536n308n781Q351R83L415O689j1680M48j3306j159O756J0187
$$ plain form
10644 -9265 -11570 -8789 -13253 -16761 -6476 -4702 -642 1384 -4364 -3944 -7135 3037 16311 20297
10630 20297 10812 3591 -574 8178 3039 -560 8387 -388 -13237 -15134 -9086 5433 6992 14452
10616 14452 -1613 -14944 -18949 -17986 -9437 14671 18325 14571 5159 2793 3715 14312 3263 -12626
10602 -12626 -11543 -9137 -13709 -2535 1565 7564 8397 -2994 -10653 -14891 -14529 -20040 -23806 -22534
10588 -22534 -2608 -1298 2766 1058 -8046 -8732 -2082 -8369 3331 18131 7270 7513 5209 7651
10574 7651 -2547 -13514 -10419 5074 6530 -7524 -5023 -11201 -26829 -30003 -40944 -31643 -21951
10561 -21951 -17845 -829 5256 -8776 -16207 1214 5062 -11474 -15369 -12186 3357 3599 2015
10548 2015 -10403 -13591 -20034 -30049 -30920 -15605 -2347 1793 3313 1299 11831 8049 -8313
$$ packed form
10644i265k305K781m464l508J0285J774M060K026n748M20l191J0172J3274L986
10630B0297r485p221m165Q752n139l599Q947q775j2849j897O048J4519J559P460
10616A4452j6065j3331m005R63Q549K4108L654l754r412k366R22J0597j1049j5889
10602a2626J083K406m572J1174M100N999Q33j1391p659m238L62n511l766J272
10588b2534J9926J310M064j708r104o86O650o287J1700J4800j0861K43k304K442
10574G651j0198j0967L095J5493J456j4054K501o178j5628l174j0941R301R692
10561b1951M106J7016O085j4032p431J7421L848j6536l895L183J5543K42j584
10548B015j2418l188o443j0015q71J5315J3258M140J520k014J0532l782j6362
$$ plain form
10535 -8313 -11629 663 2541 -2294 -6036 -3423 -10427 2543 7317 708 1293 -470 -169 -1222 -15460
10520 -15460 -24791 -16145 12016 22266 3340 1103 10210 -9730 -21542 -12418 -6968 -6448 -17
10507 -17 7855 21345 9880 9521 8957 -1650 4596 1743 1873 -8346 -9358 -13190 -18785 -21703 -32113
10492 -32113 -28683 -23958 -11911 -9663 -5162 -3248 2033 -12289 -20913 -8822 -8338 -19545 -13436 -8110
10478 -8110 2520 5578 2714 -6558 -5654 -11363 -12457 -16950 -18041 -15193 3853 11694 20960 20776 10028
10463 10028 -1054 9464 -2395 -19128 -29413 -19468 -14017 -27554 -35710 -21048 -3789 -3168 9612
10450 9612 2445 7228 4227 -6343 -7742 -10536 -23756 -27332 -24555 -24799 -15084 -11806 -9712 -2053
10436 -2053 449 767 -8562 -11938 -1132 13241 7713 13409 11073 1356 917 11171 11794 9054 6587
$$ packed form
10535h313l316J2292J878m835l742K613p004J2970M774o609N85j763L01j053j4238
10520a5460r331Q646K8161J0250j8926k237R107j9940j1812R124N450N20O431
10507a7P872J3490j1465l59n64j0607O246k853J30j0219j012l832n595k918j0410
10492c2113L430M725J2047K248M501J914N281j4322q624J2091M84j1207O109N326
10478h110J0630L058k864r272R04n709j094m493j091K848J9046P841R266j84j0748
10463A0028j1082J0518j1859j6733j0285R945N451j3537q156J4662J7259O21J2780
10450I612p167M783l001j0570j399k794j3220l576K777k44R715L278K094P659
10436b053K502L18r329l376J0806J4373n528N696k336r717m39J0254O23k740k467
$$ plain form
10421 6587 5187 2869 180 -10952 -14998 -9148 3834 6665 -4282 -17562 -15083 5546 5583 6694
10407 6694 5337 8199 2332 -4228 7403 16369 6747 6570 9466 -3677 -11554 -4214 1501 -4570
10393 -4570 9944 18782 8732 479 10367 16583 11095 14291 18572 19211 13416 -711 492 -5419
10379 -5419 -12917 8615 12748 2594 2974 -2376 5645 4036 3225 9701 22982 27945 28042 29356 26849
10364 26849 28386 34476 39817 46705 61965 76046 98472 142753 193676 270233 338429 421905
10352 421905 494484 562091 609411 642440 652001 640331 603103 555345 496384 434094 394209 351510
10340 351510 290336 240869 205437 172216 150090 152695 145705 129961 115721 107506 112393 101882
10328 101882 105677 99317 87773 81679 92053 84527 74522 71321 69215 75115 62552 63621 70239
$$ packed form
10421F587j400k318k689j1132m046N850J2982K831j0947j3280K479K0629L7J111
10407F694j357K862n867o560J1631Q966r622j77K896j3143p877P340N715o071
10393d570J4514Q838j0050q253R888O216n488L196M281O39n795j4127J203n911
10379e419p498K1532M133j0154L80n350Q021j609q11O476J3281M963R7J314k507
10364B6849J537O090N341O888J5260J4081K2426M4281N0923P6557O8196Q3476
10352D21905P2579O7607M7320L3029R561j1670l7228m7758n8961o2290l9885m2699
10340C51510o1174m9467l5432l3221k2126K605o990j5744j4240q215M887j0511
10328A01882L795o360j1544o094J0374p526j0005l201k106N900j2563J069O618
$$ plain form
10315 70239 67024 61374 65824 61418 76950 81734 65227 57218 68615 59023 49337 57164 68207
10302 68207 65600 68927 62754 71036 56473 47447 39613 31689 29675 38117 38542 32874 28763 26467
10288 26467 9308 11747 14817 7786 19323 29635 38149 38443 33225 25335 10701 3923 121 17118
10274 17118 28027 34504 17567 16569 26442 42180 42087 25494 2973 -2116 1956 4462 13928 14980
10260 14980 12688 15870 9571 3274 5333 -2517 7489 13204 3197 9380 18143 25012 18880 11922
10246 11922 9888 5722 -1682 10999 9533 2517 1800 -1953 7148 5623 -1324 -20894 -12998 -14979
10232 -14979 -6181 -1170 181 -2103 -3358 14020 23549 21185 21552 10140 4122 4093 -1296 -8020 1243
10217 1243 2281 -1177 -6004 -3563 -2390 -4248 1015 7009 20651 18825 19100 30512 34345 31718
$$ packed form
10315G0239l215n650M450m406J5532M784j6507q009J1397r592r686P827J1043
10302F8207k607L327o173Q282j4563r026p834p924k014Q442M25n668m111k296
10288B6467j7159K439L070p031J1537J0312Q514K94n218p890j4634o778l802J6997
10274A7118J0909O477j6937r98R873J5738r3j6593k2521n089M072K506R466J052
10260A4980k292L182o299o297K059p850J0006N715j0007O183Q763O869o132o958
10246A1922k034m166p404J2681j466p016p17l753R101j525o947j9570P896j981
10232a4979Q798N011J351k284j255J7378R529k364L67j1412o018k9n389o724R263
10217A243J038l458m827K441J173j858N263N994J3642j826K75J1412L833k627
$$ plain form
10203 31718 18803 5985 -2289 5107 17171 14202 15196 13231 -8613 -8816 -10173 -10621 -8264 -1007
10189 -1007 7522 4622 10573 11984 144 -9255 -16612 -23310 -29817 -29525 -19657 -17769 -29061 -8004
10175 -8004 -1562 -15591 -15947 -6992 -6247 -8501 -17734 -24233 -12743 -3076 -4107 -8613 -16963 -14123 -32863
10160 -32863 -35554 -23529 -20719 -8412 5200 6672 8959 5282 13250 524 -6323 -20039 -19166
10147 -19166 -19001 -17726 -12585 2149 18806 21514 11977 1391 6414 12819 25637 31253 29654 23312
10133 23312 17633 11510 5374 17750 20149 4770 2213 -1217 -420 -5760 -4962 -17184 -18161 -16102
10119 -16102 -14943 -22847 -35103 -30238 -16253 -10690 -10605 -5437 3301 15377 19634 18584 9579 9681
10105 9681 12774 18827 19106 7839 12613 14498 14765 -1324 -648 12233 15555 22267 42655 52239
$$ packed form
10203C1718j2915j2818q274P396J2064k969R94j965k1844k03j357m48K357P257
10189a007Q529k900N951J411j1840r399p357o698o507K92R868J888j1292K1057
10175h004O442j4029l56Q955P45k254r233o499J1490R667j031m506q350K840j8740
10160c2863k691J2025K810J2307J3612J472K287l677P968j2726o847j3716Q73
10147a9166J65J275N141J4734J6657K708r537j0586N023O405J2818N616j599o342
10133B3312n679o123o136J2376K399j5379k557l430P97n340P98j2222r77K059
10119a6102J159p904j2256M865J3985N563Q5N168Q738J2076M257j050r005J02
10105I681L093O053K79j1267M774J885K67j6089O76J2881L322O712K0388R584
$$ plain form
10091 52239 44858 43800 48250 32208 32907 39272 36099 35531 29815 26271 9322 3956 7180 9366
10077 9366 17612 9899 2015 7213 7931 2036 5398 10442 21828 25645 10381 12314 14150 5544
10063 5544 15538 12114 2974 4946 11953 20764 19672 18346 11927 4308 2961 4870 6277 11996 10341
10048 10341 8133 5229 5007 8318 -3558 -14116 -13246 -13012 -3581 -1225 -5269 6815 10036 -1408
10034 -1408 -6717 -10932 -15788 -10970 -3826 -8398 -17021 -10795 650 -3107 2214 13100 21155 20729
10020 20729 20376 13489 -1784 -5336 6126 9155 -12770 -16305 -17968 -21240 -22446 -9977 -12172 -23771
10006 -23771 -21522 -10735 424 5953 -922 -11949 -9945 -4812 10042 22280 19497 8435 117
9993 117 -9965 -12504 6372 4360 -8266 -7526 43 -9900 -12872 -7310 -9457 -11379 -11809 3721 17967
$$ packed form
10091E2239p381j058M450j6042O99O365l173n68n716l544j6949n366L224K186
10077I366Q246p713p884N198P18n895L362N044J1386L817j5264J933J836q606
10063E544R994l424r140J972P007Q811j092j326o419p619j347J909J407N719j655
10048A0341k208k904k22L311j1876j0558Q70K34R431K356m044J2084L221j1444
10034a408n309m215m856M818P144m572q623O226J1445l757N321J0886Q055m26
10020B0729l53o887j5273l552J1462L029k1925l535j663l272j206J2469k195j1599
10006b3771K249J0787J1159N529o875j1027K004N133J4854J2238k783j1062q318
9993A17j0082k539J8876k012j2626P40P569r943k972N562k147j922m30J5530J4246
$$ plain form
9978 17967 9905 -11070 -6630 8281 15700 14824 29348 30684 19772 4806 6543 23617 20149
9965 20149 9537 11929 12048 -4560 -15904 -11638 -17521 -21682 -12876 -7404 -4143 -5724 -2660 -7229
9951 -7229 8452 13010 15871 12118 2177 1705 723 8368 -4280 -15278 -18511 -14652 -1384 431
9937 431 1624 5041 -2358 -11601 -10482 -5003 5802 -3952 -6617 -2138 -9850 -15126 -842 9675
9923 9675 6623 -50 -5371 -10136 -17875 -19708 -14634 -7873 -3770 4757 5690 4004 9105 11070 18983
9908 18983 16995 12387 13703 3885 18537 16135 2737 -7676 -4616 2470 13387 27982 29829
9895 29829 19891 7096 -7169 -14067 -10370 2339 -3795 -26446 -19906 -9011 -4225 -291 -10371
9882 -10371 -6887 -11122 -20792 -17867 -11075 -12290 -4423 8365 -5075 -7525 -5975 -370 -4077 -50
$$ packed form
9978A7967q062k0975M440J4911P419q76J4524J336j0912j4966J737J7074l468
9965B0149j0612K392J19j6608j1344M266n883m161Q806N472L261j581L064m569
9951g229J5681M558K861l753r941m72r82P645j2648j0998l233L859J3268J815
9937D31J193L417p399r243J119N479J0805r754k665M479p712n276J4284J0517
9923I675l052o673n321m765p739j833N074O761M103Q527R33j686N101J965P913
9908A8983j988m608J316r818J4652k402j3398j0413L060P086J0917J4595J847
9895B9829r938j2795j4265o898L697J2709o134k2651O540J0895M786L934j0080
9882a0371L484m235r670K925O792j215P867J2788j3440k450J550N605l707M027
$$ plain form
9868 -50 -7136 -5211 1489 13407 35092 42713 22503 9550 15992 5389 2203 12709 8758 -9569
9854 -9569 -8561 -7645 13824 20778 21025 27460 12771 916 -3292 8301 15640 12389 17329 20220
9840 20220 31043 23160 15934 25968 10169 6969 4044 5125 9048 8029 5474 5810 10273 5423
9826 5423 7259 15554 9347 10455 2353 1335 10535 28063 31793 27664 24547 20082 13999 6360 4182
9811 4182 8169 9909 14984 12118 -6054 -14058 -12670 2278 2212 -9026 -5679 5641 7726 8796
9797 8796 6447 -8698 -14175 -5121 5796 -9517 -2837 -13956 4414 21353 14834 -6183 -9231
9784 -9231 -495 -3581 -10013 -12094 -11810 1376 -7976 -12451 -2874 -8000 -10029 -11648 -6127 -11539 -19073
9769 -19073 -21341 -8111 -654 -4685 -3610 -9147 -12311 -3694 881 1935 6192 9684 45 -3967
$$ packed form
9868e0p086J925O700J1918K1685P621k0210j2953O442j0603l186J0506l951j8327
9854i569J008R16K1469O954K47O435j4689j1855m208J1593P339l251M940K891
9840B0220J0823p883p226J0034j5799l200k925J081L923j019k555L36M463m850
9826E423J836Q295o207J108q102j018R200J7528L730m129l117m465o083p639k178
9811D182L987J740N075k866j8172q004J388J4948o6j1238L347J1320K085J070
9797H796k349j5145n477R054J0917j5313O680j1119J8370J6939o519k1017l048
9784i231Q736l086o432k081K84J3186r352m475R577n126k029j619N521n412p534
9769a9073k268J3230P457m031J075n537l164Q617M575J054M257L492r639m012
$$ plain form
9755 -3967 -4611 1533 12628 14922 13035 14867 9684 -3917 -8527 -4173 -3803 -2635 8023 14583 21502
9740 21502 35543 35320 29509 23880 31316 40231 29091 17800 28961 30002 18984 5237 17618
9727 17618 29680 21220 7206 5077 9695 8846 -1484 -8514 4138 30328 28314 15829 20754
9714 20754 19678 5142 -768 12141 25721 21061 -650 3398 11882 17018 21603 29524 32760 34934
9700 34934 25084 18579 23337 33364 35171 40755 45750 34529 19778 19538 31621 28416 26001 28394
9686 28394 22314 18670 21392 28238 35701 37379 36964 26937 29747 38417 26504 18841 15754 28558
9672 28558 34979 35909 28237 36168 51386 48110 34965 19491 20731 20627 11499 21807 41776 47713
9658 47713 40235 40325 40229 21302 19856 26919 32636 24947 19415 23033 16798 27618 42886 44885 29816
$$ packed form
9755c967o44O144J1095K294j887J832n183j3601m610M354L70J168J0658O560O919
9740B1502J4041k23n811n629P436Q915j1140j1291J1161J041j1018j3747J2381
9727A7618J2062q460j4014k129M618q49j0330p030J2652K6190k014j2485M925
9714B0754j076j4536n910J2909J3580m660k1711M048Q484N136M585P921L236K174
9700C4934r850o505M758J0027J807N584M995j1221j4751k40J2083l205k415K393
9686B8394o080l644K722O846P463J678m15j0027K810Q670j1913p663l087J2804
9672B8558O421R30p672P931J5218l276j3145j5474J240j04r128J0308J9969N937
9658D7713p478R0r6j8927j446P063N717p689n532L618o235J0820J5268J999j5069
$$ plain form
9643 29816 18409 19734 12985 25296 28971 38349 46708 45395 29669 20696 17481 16514 31766 33828
9629 33828 23114 11236 11905 13043 3173 12854 31283 44304 27665 17049 10529 1283 -8470
9616 -8470 -685 15135 8248 -784 -943 6203 20125 31838 31210 31085 27563 31106 27672 29939 29563
9601 29563 11362 14791 28404 40938 38131 30988 26886 20084 18111 16348 23150 36008 40011 41545
9587 41545 43591 47385 45920 41697 44474 43990 62723 60634 36972 20632 22415 22588 19006 18820 38462
9572 38462 50865 49961 43764 44139 47774 44246 56539 61366 52372 37311 30300 20678 26945 43114
9558 43114 46959 34585 25388 27780 30231 30561 29159 24321 21461 16283 21543 32276 29302 30515
9544 30515 41697 35134 11066 9198 15520 22630 30020 33821 28228 24049 31453 32564 29462 20582
$$ packed form
9643B9816j1407J325o749J2311L675R378Q359j313j5726q973l215r67J5252K062
9629C3828j0714j1878O69J138r870R681J8429J3021j6639j0616o520r246r753
9616h470P785J5820o887r032j59P146J3922J1713o28j25l522L543l434K267l76
9601B9563j8201L429J3613J2534k807p143m102o802j973j763O802J2858M003J534
9587D1545K046L794j465m223K777m84J8733k089k3662j6340J783J73l582j86J9642
9572C8462J2403r04o197L75L635l528J2293M827q994j5061p011r622O267J6169
9558D3114L845j2374r197K392K451L30j402m838k860n178N260J0733k974J213
9544C0515J1182o563k4068j868O322P110P390L801n593m179P404J111l102q880
$$ plain form
9530 20582 23700 12930 4901 9857 19843 36221 46042 36373 34326 26111 27294 32155 31409 19327
9516 19327 21956 39002 19452 27992 32762 28197 43885 39118 32634 23850 14040 20902 28123 30469
9502 30469 35021 46178 48316 38947 40541 43173 48027 48423 51690 56017 53429 49314 50808 63171
9488 63171 78698 64500 57696 71281 85514 81235 65659 63633 43101 34744 28434 37006 56767
9475 56767 55529 42503 48388 59593 59748 37654 15079 19833 14490 5533 3334 9231 31206 34492
9461 34492 34540 36679 42968 31518 31048 24274 13299 13876 6886 -16952 -40269 -45073 -38636 -20824
9447 -20824 5223 19953 31895 54291 69851 73410 67504 68966 67957 72533 79686 80003 98980
9434 98980 112566 121073 119609 109794 105743 115456 120064 135597 147597 161686 176200 184325 197855
$$ packed form
9530B0582L118j0770q029M956R986J6378R821r669k047q215J183M861p46j2082
9516A9327K629J7046j9550Q540M770m565J5688m767o484q784r810O862P221K346
9502C0469M552J1157K138r369J594K632M854L96L267M327k588m115J494J2363
9488F3171J5527j4198o804J3585J4233m279j5576k026k0532q357o310Q572J9761
9475E6767j238j3026N885J1205J55k2094k2575M754n343q957k199N897K1975L286
9461C4492M8K139O289j1450m70o774j0975N77o990k3838k3317m804O437J7812
9447b0824K6047J4730J1942K2396J5560L559n906J462j009M576P153L17J8977
9434I8980J3586Q507j464r815m051R713M608J5533J2000J4089J4514Q125J3530
$$ plain form
9421 197855 205269 231313 265939 303924 355517 437256 547575 674105 840519 1060736 1330337
9410 1330337 1628164 1904021 2138434 2291989 2329523 2276321 2131451 1945284 1742111 1520104
9400 1520104 1322021 1153125 1007709 901584 817526 736138 679505 617230 554118 512022 477024
9389 477024 432589 396838 380226 356567 330781 301293 282790 281247 267512 259219 261156 256332
9377 256332 254444 248496 232702 221441 209252 201502 205044 216349 206019 200070 194575 197444 186830
9364 186830 186131 193579 196208 193387 195363 186603 175990 162640 146582 143641 155122 160919 156230 151346
9350 151346 154294 164781 161415 149320 134055 126011 121571 126252 129889 134982 137989 129007 131519 126278
9336 126278 110689 98171 99538 92296 88859 89264 82493 79602 81701 90330 110453 102511 106025 117600
$$ packed form
9421A97855P414K6044L4626L7985N1593Q1739J10319J26530J66414K20217K69601
9410A330337K97827K75857K34413J53555L7534n3202j44870j86167k03173k22007
9400A520104j98083j68896j45416j06125q4058q1388n6633o2275o3112m2096l4998
9389D77024m4435l5751j6612k3659k5786k9488j8503j543j3735q293J937m824
9377B56332j888n948j5794j1261j2189p750L542J1305j0330n949n495K869j0614
9364A86830o99P448K629k821J976q760j0613j3350j6058k941J1481N797m689m884
9350A51346K948J0487l366j2095j5265q044m440M681L637N093L007q982K512n241
9336A26278j5589j2518J367p242l437M05o771k891K099Q629K0123p942L514J1575
$$ plain form
9322 117600 117317 134233 138717 128894 137453 140280 126636 93301 71272 66640 62977 58954 65136 60158
9308 60158 63569 68845 85490 87864 72430 68546 81751 106265 119021 106714 113474 124513 120491
9295 120491 115333 125903 118605 114702 107751 100439 104091 98260 104298 121742 126562 129615 125047 126986
9281 126986 123171 114659 123430 123412 124203 120240 115609 102155 92485 93832 105702 116117 99991 96854
9267 96854 103779 123770 165595 218028 268592 325114 379305 381212 359814 336821 308119 292959
9255 292959 274408 257336 273177 279567 277076 266408 237173 211816 195958 192979 191071 188908 177221
9242 177221 176787 174473 173396 174086 152611 141066 129044 125909 120727 95366 87212 87647 99525 97251
9228 97251 85996 90866 85418 95981 100073 80925 99154 128935 145843 149355 135767 111968 105449
$$ packed form
9322A17600k83J6916M484r823Q559K827j3644l3335k2029m632l663m023O182m978
9308F0158L411N276J6645K374j5434l884J3205K4514J2756j2307O760J1039m022
9295A20491n158J0570p298l903o951p312L652n831O038J7444M820L053m568J939
9281A26986l815q512Q771j8P91l963m631j3454r670J347J1870J0415j6126l137
9267I6854O925J9991M1825N2433N0564N6522N4191J907k1398k2993k8702j5160
9255B92959j8551j7072J5841O390k491j0668k9235k5357j5858k979j908k163j1687
9242A77221m34k314j077O90k1475j1545j2022l135n182k5361q154M35J1878k274
9228I7251j1255M870n448J0563M092j9148J8229K9781J6908L512j3588k3799o519
$$ plain form
9215 105449 115415 101819 82911 51548 14896 -3318 -28395 -65280 -97385 -136847 -203279 -263891
9203 -263891 -326575 -444202 -642257 -929097 -1211329 -1374035 -1336406 -1156654 -935512 -748782
9193 -748782 -608029 -507065 -427759 -343366 -281029 -238979 -188926 -136099 -94174 -57842 -18551
9182 -18551 20558 40046 56940 69050 85785 95905 106527 116374 134976 149263 149126 136876
9170 136876 132025 132987 128365 128324 127636 130230 112175 99035 82076 75025 76169 79491 81387 93515
9156 93515 112878 133869 138681 152417 165618 184203 193438 201477 197738 200834 206513 229203 248298
9143 248298 268646 292763 322689 359797 438433 524909 609218 666245 690308 692494 675764 647704
9131 647704 622309 587404 574165 581847 591360 587226 583539 577756 588332 612118 647318 669085 675595
$$ packed form
9215A05449R966j3596j8908l1363l6652j8214k5077l6885l2105l9462o6432o0612
9203b63891o2684j17627j98055k86840k82232j62706L7629J79752K21142J86730
9193g48782J40753J00964P9306Q4393O2337M2050N0053N2827M1925L6332L9291
9182a8551L9109J9488J6894J2110J6735J0120J0622R847J8602J4287j37j2250
9170A36876m851R62m622m1o88K594j8055j3140j6959p051J144L322J896J2128
9156I3515J9363K0991M812J3736J3201J8585R235Q039l739L096N679K2690J9095
9143B48298K0348K4117K9926L7108P8636Q6476Q4309N7027K4063K186j6730k8060
9131F47704k5395l4905j3239P682R513m134l687n783J0576K3786L5200K1767O510
$$ plain form
9118 675595 678632 677075 658458 643996 648545 680492 715143 753297 788172 800803 781748 765894
9106 765894 762228 786520 828660 871820 904232 925750 940087 965036 1007318 1068261 1114397 1149449
9094 1149449 1174882 1189147 1205002 1240839 1292333 1355426 1438624 1518373 1623356 1779660 2001184
9083 2001184 2333708 2854441 3746557 5281175 7320033 8727229 8877195 7680496 6318957
9074 6318957 5322136 4724704 4345657 3991014 3647805 3364729 3140921 2967851 2852491 2772473
9064 2772473 2717983 2669334 2641058 2644682 2645304 2644425 2665366 2701689 2766451 2877392 3055923 3282904
9052 3282904 3555088 3895883 4370961 5012270 5786540 6510228 6932525 6981882 6819573 6630101
9042 6630101 6529434 6518469 6520425 6547327 6646330 6848413 7167266 7566824 8004265 8480872
$$ packed form
9118F75595L037j557j8617j4462M549L1947L4651L8154L4875J2631j9055j5854
9106G65894l666K4292M2140M3160L2412K1518J4337K4949M2282O0943M6136L5052
9094A149449K5433J4265J5855L5837N1494O3093Q3198P9749J04983J56304K21524
9083B001184L32524N20733Q92116J534618K038858J407196J49966j196699j361539
9074F318957r96821n97432l79047l54643l43209k83076k23808j73070j15360q0018
9064B772473n4490m8649k8276L624O22q79K0941L6323O4762J10941J78531K26981
9052C282904K72184L40795M75078O41309P74270P23688M22297M9357j62309j89472
9042F630101j00667j0965J956K6902R9003K02083L18853L99558M37441M76607
$$ plain form
9032 8480872 9042414 9750157 10674877 11849406 13264974 14952617 16997027 19568241 22797043
9023 22797043 26714424 31031827 35482734 40195504 45754020 53025707 63063076 77352727
9015 77352727 98265220 129801516 178697572 254055838 358845555 470790669 544526587
9008 544526587 550706444 495750204 416478134 344814598 290913801 251023222 218176725
9001 218176725 189399048 165025223 145279779 129553495 116999292 106729778 97973795
8994 97973795 90093423 82764175 76007177 69948167 64614040 59972358 55951695 52395691
8986 52395691 49192087 46324805 43776625 41538431 39578025 37828341 36216199 34679086
8978 34679086 33252318 31960128 30812546 29770830 28772903 27765942 26762611 25778061
$$ packed form
9032H480872N61542P07743R24720J174529J415568J687643K044410K571214L228802
9023B2797043L917381M317403M450907M712770N558516P271687J0037369J4289651
9015G7352727K0912493L1536296M8896056P5358266J04789717J11945114P3735918
9008E44526587O179857n4956240p9272070p1663536n3900797l9890579l2846497
9001B18176725k8777677k4373825j9745444j5726284j2554203j0269514q755983
8994I7973795p880372p329248o756998o059010n334127m641682m020663l556004
8986E2395691l203604k867282k548180k238194j960406j749684j612142j537113
8978C4679086j426768j292190j147582j041716r97927j006961j003331r84550
$$ plain form
8970 25778061 24847224 23943665 23078953 22251532 21475144 20747172 20089205 19489924 18941623
8961 18941623 18434693 17992141 17622215 17309737 17110776 16968254 16826173 16660380 16452939
8952 16452939 16132377 15633519 14990340 14277732 13578530 12950739 12408158 11924618 11484705
8943 11484705 11091701 10730435 10405753 10112454 9823076 9522978 9239675 8985480 8752146
8934 8752146 8521011 8309285 8098957 7908351 7706497 7502497 7321035 7142133 6954049 6750873
8924 6750873 6542882 6342012 6150482 5994274 5847963 5703275 5559560 5405225 5265261 5128618
8914 5128618 5008616 4915260 4837646 4747515 4623050 4472942 4330117 4204000 4119576 4044310
8904 4044310 3976561 3903301 3813586 3688561 3566767 3462809 3376586 3308022 3251528 3191453 3125575
$$ packed form
8970B5778061r30837r03559q64712q27421p76388p27972o57967n99281n48301
8961A8941623n06930m42552l69926l12478j98961j42522j42081j65793k07441
8952A6452939l20562m98858o43179p12608o99202o27791n42581m83540m39913
8943A1484705l93004l61266l24682k93299k89378l00098k83303k54195k33334
8934H752146k31135k11726k10328j90606k01854k04000j81462j78902j88084k03176
8924F750873k07991k00870j91530j56208j46311j44688j43715j54335j39964j36643
8914E128618j20002r3356p7614r0131j24465j50108j42825j26117q4424p5266
8904D044310o7749p3260q9715j25025j21794j03958q6223o8564n6494o0075o5878
$$ plain form
8893 3125575 3062672 2999205 2930017 2894981 2871121 2838551 2785424 2734158 2694803 2672507 2641323
8882 2641323 2609082 2592432 2565363 2512321 2454633 2410904 2365232 2302370 2257916 2215284 2151940
8871 2151940 2090785 2004229 1917140 1847668 1787512 1736529 1677188 1618199 1565927 1517920 1463877
8860 1463877 1418126 1376748 1342420 1303988 1250219 1194681 1137611 1083514 1048891 1008451 971106
8849 971106 935875 892543 854984 817566 789839 755094 715350 693468 681263 669783 656725 651910
8837 651910 649335 659966 670410 670695 674442 685250 711020 735230 746768 770854 789727 822111
8825 822111 874267 977826 1174602 1456494 1790798 2054293 2140634 2011701 1807015 1618742
8815 1618742 1466893 1370794 1295386 1222851 1148374 1063639 1000582 961616 931077 892508 837170
$$ packed form
8893C125575o2903o3467o9188l5036k3860l2570n3127n1266l9355k2296l1184
8882B641323l2241j6650k7069n3042n7688m3729m5672o2862m4454m2632o3344
8871B151940o1155q6556q7089o9472o0156n0983n9341n8989n2272m8007n4043
8860A463877m5751m1378l4328l8432n3769n5538n7070n4097l4623m0440l7345
8849I71106l5231m3332l7559l7418k7727l4745l9744k1882j2205j1480j3058m815
8837F51910k575J0631J0444K85L747J0808K5770K4210J1538K4086J8873L2384
8825H22111N2156J03559J96776K81892L34304K63495Q6341j28933k04686j88273
8815A618742j51849r6099p5408p2535p4477q4735o3057l8966l0539l8569n5338
$$ plain form
8804 837170 778977 745695 718511 679594 636224 610535 597470 579388 566745 567992 560761 548471
8792 548471 554837 556477 556864 558114 556202 556230 563384 577768 585454 577853 566181 542084 509893 503339
8778 503339 476828 468706 477478 470152 466740 480914 477896 464961 433209 421004 418145 388517 363820
8765 363820 350532 347253 335810 336303 368715 380609 380476 377467 386373 399823 403390 407767 419987
8752 419987 419513 414332 402532 397193 389657 394122 393848 383757 391670 387185 362205 361721 354188 338757
8738 338757 326243 323920 328151 322487 305306 284081 275370 269121 258412 257821 245853 236031 223455
8725 223455 209205 208116 193089 189294 199503 202859 198138 191043 184311 178319 165839 168754 169213 170569
8711 170569 165794 169228 174161 182921 181045 166174 156993 138003 134309 130979 107469 97036 108504
$$ packed form
8804H37170n8193l3282k7184l8917m3370k5689j3065j8082j2643J247p231j2290
8792E48471O366J640L87J250j912K8P154J4384P686p601j1672k4097l2191o554
8778E03339k6511q122Q772p326l412J4174l018j2935l1752j2205k859k9628k4697
8765C63820j3288l279j1443M93L2412J1894j33l009Q906J3450L567M377J2220
8752D19987m74n181j1800n339p536M465k74j0091P913m485k4980m84p533j5431
8738C38757j2514k323M231n664j7181k1225q711o249j0709n91j1968r822j2576
8725B23455j4250j089j5027l795J0209L356m721p095o732n992j2480K915M59J356
8711A70569m775L434M933Q760j876j4871r181j8990l694l330k3510j0433J1468
$$ plain form
8698 108504 117832 134160 132326 126498 120033 124567 127531 117853 117196 118046 127240 131296 117266 108384
8684 108384 107385 108840 101352 80542 68035 71069 82104 96194 102744 103828 108192 103350 100836 95051
8670 95051 97268 102151 110819 111267 108367 101229 95991 102625 105093 107940 111635 106586 96663 82126 74603
8655 74603 74406 69561 66281 55474 55667 76377 86347 92902 106397 122312 131183 134857 130517 128501
8641 128501 119749 122039 129927 114679 106263 108825 110482 118245 125068 135579 152912 172783 179622
8628 179622 172959 168416 157914 139958 146363 171673 187263 206127 216326 236153 246979 275160
8616 275160 306855 363099 443401 544441 676681 846356 1060974 1316755 1610285 1897400
8606 1897400 2117505 2259973 2303603 2243683 2118492 1940562 1724595 1504791 1312257 1131355
$$ packed form
8698A08504R328J6328j834n828o465M534K964r678o57Q50R194M056j4030q882
8684A08384r99J455p488k0810j2507L034J1035J4090O550J084M364m842k514n785
8670I5051K217M883Q668M48k900p138n238O634K468K847L695n049r923j4537p523
8655G4603j97m845l280j0807J93K0710R970O555J3495J5915Q871L674m340k016
8641A28501q752K290P888j5248q416K562J657P763O823J0511J7333J9871O839
8628A79622o663m543j0502j7956O405K5310J5590J8864J0199J9827J0826K8181
8616B75160L1695N6244Q0302J01040J32240J69675K14618K55781K93530K87115
8606A897400K20105J42468M3630n9920j25191j77930k15967k19804j92534j80902
$$ plain form
8596 1131355 987437 879547 795747 729351 664368 608951 556239 519722 480124 441824 411837
8585 411837 385728 356127 338543 311701 297244 270349 256022 262544 245574 234701 223034 204764
8573 204764 208091 207450 207547 231316 244525 236601 233139 230178 238860 231356 235869 219469 211777 189489
8559 189489 177744 174367 180126 176394 181960 191719 193899 182944 168533 150072 137239 126229 123035
8546 123035 125904 138805 141971 139129 142670 141839 132909 118010 113022 113066 104081 108622 99919 92621 79680
8531 79680 66081 65737 79957 91206 97415 102635 88328 87027 86027 88973 79499 67298 58839 56425
8517 56425 57091 48867 52668 49281 44953 51524 62185 61153 72097 81176 86736 96873 95402 90258
8503 90258 77858 79875 76934 72216 69135 63213 61939 59510 51448 41236 41907 47341 47896 57868 68446
$$ packed form
8596A131355j43918j07890q3800o6396o4983n5417n2712l6517l9598l8300k9987
8585D11837k6109k9601j7584k6842j4457k6895j4327O522j6970j0873j1667j8270
8573B04764L327o41R7K3769J3209p924l462k961Q682p504M513j6400p692k2288
8559A89489j1745l377N759l732N566R759K180j0955j4411j8461j2833j1010l194
8546A23035K869J2901L166k842L541q31q930j4899m988M4q985M541q703p298j2941
8531G9680j3599l44J4220J1249O209N220j4307j301j000K946r474j2201q459k414
8517E6425O66q224L801l387m328O571J0661j032J0944R079N560J0137j471n144
8503I0258j2400K017k941m718l081n922j274k429q062j0212O71N434N55R972J0578
$$ plain form
8488 68446 52043 36644 48872 66511 74400 77347 61501 59971 68719 57670 44152 29616 26282
8475 26282 40206 53341 51523 38068 34715 39978 39206 35155 37188 47400 55634 51412 44428 40103
8461 40103 36054 26440 36328 43688 34964 26006 39755 42262 48182 52231 39694 20497 20480 11304
8447 11304 8704 8967 14431 21716 19299 21424 25227 34072 37361 37039 31669 24854 27055 36897 40182
8432 40182 41248 38822 38976 30112 6062 10749 13771 26936 28193 34221 36558 31476 28240 18032
8418 18032 19321 27340 25924 19162 21605 26636 19169 18043 10507 21606 31797 32839 33592 37446
8404 37446 41372 26153 23835 31339 35068 35695 35852 25144 21062 23754 30950 39468 40477 26898
8390 26898 27808 32461 19938 8513 14143 29739 26742 27008 22699 18869 15371 15837 22973 19775 17698
$$ packed form
8488F8446j6403j5399J2228J7639P889K947j5846j530Q748j1049j3518j4536l334
8475B6282J3924J3135j818j3455l353N263p72m051K033J0212Q234m222o984m325
8461D0103m049r614R888P360q724q958J3749K507N920M049j2537j9197j7r176
8447A1304k600K63N464P285k417K125L803Q845L289l22n370o815K201R842L285
8432D0182J066k426J54q864k4050M687L022J3165J257O028K337n082l236j0208
8418A8032J289Q019j416o762K443N031p467j126p536J1099J0191J042P53L854
8404C7446L926j5219k318P504L729O27J57j0708m082K692P196Q518J009j3579
8390B6898R10M653j2523j1425N630J5596k997K66m309l830l498M66P136l198k077
$$ plain form
8375 17698 17703 11070 6389 27022 37969 34626 20323 10794 21128 24573 17282 21394 13553 18182
8361 18182 10640 15134 32112 35114 42616 48626 42658 29275 11841 -4816 -13346 115 17393
8348 17393 22170 30681 39612 27202 15392 21181 18108 26327 23621 17988 14332 14551 13263 8754
8334 8754 9423 893 15264 22332 31058 29424 37728 34734 27816 17000 14966 20317 25312 10836
8320 10836 9545 5609 12942 18030 10197 6146 8964 6160 -8633 -961 23002 15268 20854 26507
8306 26507 23090 18781 3383 13250 21145 35832 42437 41780 24913 16541 13191 345 1631 -1469
8292 -1469 5834 11556 -2329 2470 -524 130 13902 18324 23173 19807 13950 14452 2886 -1591 5493
8277 5493 6991 14706 18184 18556 22993 21163 21001 12896 2364 13075 25272 37644 47165 61275
$$ packed form
8375A7698No633m681K0633J0947l343j4303r529J0334L445p291M112p841M629
8361A8182p542M494J6978L002P502O010n968j3383j7434j6657q530J3461J7278
8348A7393M777Q511Q931j2410j1810N789l073Q219k706n633l656K19j288m509
8334H754O69q530J4371P068Q726j634Q304k994o918j0816k034N351M995j4476
8320A0836j291l936P333N088p833m051K818k804j4793P672K3963p734N586N653
8306B6507l417m309j5398R867P895J4687O605o57j6867q372l350j2846J286l100
8292a469P303N722j3885M799k994O54J3772M422M849l366n857N02j1566m477P084
8277E493J498P715L478L72M437j830j62q105j0532J0711J2197J2372R521J4110
$$ plain form
8263 61275 51524 37050 28868 18413 19685 28433 25609 20347 16574 12036 17787 26715 15790 1372
8249 1372 9470 18049 30084 19976 23301 20348 22827 38554 46675 29372 19581 22178 15239 18384
8235 18384 9575 5457 11930 22033 30812 42802 37447 27863 13286 18210 17489 -678 -13984 -9969
8221 -9969 -337 13868 8121 -220 3106 9267 9621 4650 -2164 -405 8443 -2954 -2139 5133 18204
8206 18204 27120 25028 16145 7942 19433 17912 7107 15918 12237 -1693 -5468 -4497 4471 12740
8192 12740 -5777 -24696 -8270 4472 3035 15357 17954 12562 5922 -3973 -6598 8523 11369
8179 11369 9009 -5892 -9956 7022 14532 14654 23670 17054 14928 2601 9497 13971 13679 20624
8165 20624 15995 13597 27565 23483 14601 13117 10173 10793 7658 -243 -8356 -7939 -18 9850 16444
$$ packed form
8263F1275r751j4474q182j0455J272Q748k824n262l773m538N751Q928j0925j4418
8249A372Q098Q579J2035j0108L325k953K479J5727Q121j7303r791K597o939L145
8235A8384q809m118O473J0103Q779J1990n355r584j4577M924p21j8167j3306M015
8221i969R632J4205n747q341L326O161L54m971o814J759Q848j1397Q15P272J3071
8206A8204Q916k092q883q203J1491j521j0805Q811l681j3930l775R71Q968Q269
8192A2740j8517j8919J6426J2742j437J2322K597n392o640r895k625J5121K846
8179A1369k360j4901m064J6978P510J22R016o616k126j2327O896M474k92O945
8165B0624m629k398J3968m082q882j484k944O20l135p901q113M17P921R868O594
$$ plain form
8150 16444 33690 36361 17317 5828 4159 6565 16200 28203 36063 21199 9973 10 378
8137 378 -9929 -8811 -12631 -1942 4344 4797 5728 8041 18412 13093 3071 12208 12656 3418 9811
8122 9811 19065 30916 22435 5228 6494 14829 18343 12594 11810 17715 19861 16441 24550 32841 28896
8107 28896 33897 42659 41780 33420 24811 24670 30734 31539 15506 4200 2367 4545 10933 22235 28589
8092 28589 26538 29678 31135 28169 33093 32652 24653 15119 2984 2983 13678 17552 25923 47254 50861
8077 50861 25908 11509 6971 7561 16083 19555 15525 20687 16361 15404 4273 -13400 -8374 5599
8063 5599 14020 35976 50134 50335 51606 25626 12419 22787 16831 -643 -14344 -10554 -4647
8050 -4647 2373 552 5307 -7415 -8217 2382 9980 9065 21976 39955 29302 16455 19960 29637
$$ packed form
8150A6444J7246K671j9044j1489j669K406R635J2003P860j4864j1226r963L68
8137C78j0307J118l820J0689O286M53R31K313J0371n319j0022R137M48r238O393
8122I811R254J1851q481j7207J266Q335L514n749p84N905K146l420Q109Q291l945
8107B8896N001Q762q79q360q609j41O064Q05j6033j1306j833K178O388J1302O354
8092B8589k051L140J457k966M924m41p999r534j2135jJ0695L874Q371K1331L607
8077E0861k4953j4399m538N90Q522L472m030N162m326r57j1131j7673N026J3973
8063E599Q421K1956J4158K01J271k5980j3207J0368n956j7474j3701L790N907
8050d647P020j821M755j2722q02J0599P598r15J2911J7979j0653j2847L505R677
$$ plain form
8036 29637 25003 2641 1353 13545 23479 10079 11532 23247 17858 23586 14658 8886 13577 27651
8022 27651 22385 12436 12057 15490 19759 17500 12006 16726 24944 11773 7383 20083 28108 44612
8008 44612 43748 31089 28934 23402 20977 16813 12379 18474 28444 30994 37351 40930 27699 26868 21425
7993 21425 17828 27682 31040 31701 32448 34914 29180 29961 24386 14367 12035 19538 12860 2134 16758
7978 16758 22626 24687 21739 22121 18505 10092 15753 32489 36146 40141 44404 33109 27647 25947
7964 25947 15913 8993 11739 17072 2640 -5523 6267 12849 14207 10756 9875 4120 5090 -11
7950 -11 -1182 1921 10906 1962 5791 8032 21006 38197 45246 37181 28558 31399 24914 12939 17829
7935 17829 32239 38815 34740 28097 39725 36552 33692 36305 32891 36584 35116 27662 24572 23344
$$ packed form
8036B9637m634k2362j288J2192R934j3400J453J1715n389N728q928n772M691J4074
8022B7651n266r949l79L433M269k259n494M720Q218j3171m390J2700Q025J6504
8008D4612q64j2659k155n532k425m164m434O095R970K550O357L579j3231q31n443
7993B1425l597R854L358O61P47K466n734P81n575j0019k332P503o678j0726J4624
7978A6758N868K061k948L82l616q413N661J6736L657L995M263j1295n462j700
7964B5947j0034o920K746N333j4432q163J1790O582J358l451q81n755R70n101
7950a1j171L103Q985q944L829K241J2974J7191P049q065q623K841o485j1975M890
7935A7829J4410O576m075o643J1628l173k860K613l414L693j468p454l090j228
$$ plain form
7921 23344 28256 27298 31563 20658 12472 -5509 -8267 2576 2263 -5433 -6097 5113 16133 31346
7907 31346 37157 35079 47611 39026 29512 34413 24612 24542 28798 26416 20138 14838 16859 11342 4806
7892 4806 15867 30909 31035 21785 14266 10888 38591 44912 32632 21893 5918 17631 24395
7879 24395 8871 5647 16081 10530 22254 8286 -6300 -10847 -7408 1013 7120 -9424 -18295
7866 -18295 -16272 -17145 -14485 -7756 -19247 -20708 -24613 -33837 -27564 -13906 -1488 7520 12898 16484
7852 16484 19821 11947 1672 -4080 4617 14832 5678 17157 20026 21503 13920 -891 -12847
7839 -12847 -15139 -4025 -2029 8591 1807 -531 1763 -3333 -5060 -4594 6017 14261 16736 12571
7825 12571 9605 6497 8729 21393 19670 18037 8641 -16283 -24139 -15979 -8875 -10135 -7825 -3207
$$ packed form
7921B3344M912r58M265j0905q186j7981k758J0843l13p696o64J1210J1020J5213
7907C1346N811k078J2532q585r514M901r801p0M256k382o278n300K021n517o536
7892D806J1061J5042J26r250p519l378K7703O321j2280j0739j5975J1713O764
7879B4395j5524l224J0434n551J1724j3968j4586m547L439Q421O107j6544q871
7866a8295K023q73K660O729j1491j461l905r224O273J3658J2418R008N378L586
7852A6484L337p874j0275n752Q697J0215r154J1479K869J477p583j4811j1956
7839a2847k292J1114J996J0620o784k338K294n096j727M66J0611Q244K475m165
7825A2571k966l108K232J2664j723j633r396k4924p856Q160P104j260K310M618
$$ plain form
7811 -3207 2465 7381 8952 2870 2674 17861 14548 18059 38044 41838 27656 19271 16022 27484
7797 27484 36833 35671 28854 40707 32165 20165 18083 12375 12029 11673 17963 9297 6676 6528 1919
7782 1919 -3865 11226 27685 14322 -551 -12866 -8088 3922 -5356 -4175 -9856 -5146 7021
7769 7021 14132 26748 16835 -4093 -5291 13949 3185 5334 14956 12434 11596 12537 9172 3747
7755 3747 7076 11039 4085 -8751 -18127 -18319 -3096 18708 21429 19366 22177 3194 -5495 3887
7741 3887 5064 -2084 1563 15822 10356 1519 5469 12528 8441 4646 2372 -4579 -6371 -450 15516
7726 15516 7480 -4982 -8994 -7027 6296 -4996 -11322 -8319 -6235 1184 9411 13539 4059 773
7712 773 -3648 5167 16914 13030 -408 -11436 -18787 -4146 16683 20072 16155 19756 7259 12208
$$ packed form
7811c207N672M916J571o082j96J5187l313L511J9985L794j4182q385l249J1462
7797B7484R349j162o817J1853q542j2000k082n708l46l56O290q666k621j48m609
7782A919n784J5091J6459j3363j4873j2315M778J2010r278J181n681M710J2167
7769G021P111J2616r913k0928j198J9240j0764K149R622k522q38R41l365n425
7755C747L329L963o954j2836r376j92J5223K1804K721k063K811j8983q689R382
7741C887J177p148L647J4259n466q837L950P059m087l795k274o951j792N921J5966
7726A5516q036j2462m012J967J3323j1292o326L003K084P419Q227M128r480l286
7712G73m421Q815J1747l884j3438j1028p351J4641K0829L389l917L601j2497M949
$$ plain form
7698 12208 27898 28148 27249 18274 14622 11210 -1832 -16666 -16047 -8591 5431 3769 -13254 -18123
7684 -18123 -11677 -13701 -15950 -18481 -18050 -9862 -9224 851 -6638 -26063 -25920 -17208 -20293 -11786 -7336
7669 -7336 -15022 -16001 -25005 -22807 -17206 1209 8012 4308 -3898 -822 -9271 -21624 -8320 15418
7655 15418 15189 1736 4532 13286 18857 7499 4307 3150 1459 8160 14655 19234 30303 24429
7641 24429 13747 15317 8908 8631 1140 14050 21727 9721 1165 2991 1622 47 -3149 -1729
7627 -1729 -2719 -19912 -24102 -12263 -11283 -4925 506 -7962 -12455 -7514 -1577 -4680 -4652 -1604 392
7612 392 1501 -8044 -16928 -10861 -5506 -5118 -4822 -8300 -18060 -12058 -11009 -11172 -14450 -21461 8881 24183
7596 24183 23687 8733 3042 11580 15797 13249 5751 4498 -5881 -8591 2113 12591 22217 23821
$$ packed form
7698A2208J5690K50q99q975l652l412j3042j4834O19P456J4022j662j7023m869
7684a8123O446k024k249k531M31Q188O38J0075p489j9425J43Q712l085Q507M450
7669g336p686r79r004K198N601J8415O803l704q206L076q449j2353J3304K3738
7655A5418k29j3453K796Q754N571j1358l192j157j691O701O495M579J1069n874
7641B4429j0682J570o409k77p491J2910P677j2006q556J826j369j575l196J420
7627a729r90j7193m190J1839R80O358N431q468m493M941N937l103K8L048J996
7612C92J109r545q884O067N355L88K96l478r760O002J049j63l278p011L0342J5302
7596B4183m96j4954n691Q538M217k548p498j253j0379k710J0704J0478R626J604
$$ plain form
7582 23821 14941 5556 18821 17261 9288 8380 2298 191 4186 2251 -5314 -7117 -12254 -29667
7568 -29667 -28171 -25637 -4046 2321 -11688 -10883 -10745 -13113 -3067 3582 13999 13348 -1021 -5820
7554 -5820 -11667 -11714 1259 21679 22644 20775 8902 15497 25156 14580 9076 21082 21034 14101 14411
7539 14411 19523 11872 7952 12660 13764 13057 6169 -2959 554 1961 4772 1920 -2117 -5839 2046
7524 2046 4377 5139 5412 10388 7138 9974 11868 13003 9100 9541 7739 -3402 2737 5181 -400
7509 -400 -12287 -6444 2539 -2617 1765 6651 5211 9322 6319 5067 -6413 -2061 1754 -2817 -17002
7494 -17002 -4734 -6969 -16222 -6368 -7211 -14556 -17208 -9133 -2937 7506 -3825 1938 7545 16013
7480 16013 35425 20289 14028 6040 -1017 6117 8103 -6712 -21459 -19444 -13832 1784 15108
$$ packed form
7582B3821q880r385J3265j560p973r08o082k107L995j935p565j803n137j7413
7568b9667J496K534K1591O367j4009Q05J38k368J0046O649J0417o51j4369m799
7554e820n847m7J2973K0420R65j869j1873O595R659j0576n504J2006m8o933L10
7539A4411N112p651l920M708J104p07o888r128L513J407K811k852m037l722P885
7524B046K331P62K73M976l250K836J894J135l903M41j802j1141O139K444n581
7509d00j1887N843Q983n156M382M886j440M111l003j252j1480M352L815m571j4185
7494a7002J2268k235r253R854q43p345k652Q075O196J0443j1331N763N607Q468
7480A6013J9412j5136o261p988p057P134J986j4815j4747K015N612J5616J3324
$$ plain form
7467 15108 6572 -2764 909 6863 8359 -3246 -9975 -750 16560 13393 -5004 -11954 -5923 2918
7453 2918 6876 1244 -9211 -13827 -24101 -15944 -14318 -16566 -13801 -3609 17666 24624 19586 11429
7439 11429 23644 20527 16715 13729 11662 20171 28509 17712 5119 8539 2975 27 -718 -4585
7425 -4585 782 -882 -12418 -6688 -7579 -10197 -1921 8514 18258 18923 24800 11652 6094 7816 748
7410 748 -3155 -5481 -13953 -9829 -13732 -21444 -13918 -14995 -8892 -16351 -536 4275 -5413 -9905 -5287
7395 -5287 -1757 1472 5375 16762 6967 863 809 14771 21318 19581 13176 3902 -3851 -9543 -22711
7380 -22711 -25241 -18633 -15892 -12691 -6741 6603 3093 -2982 -198 6536 6051 134 -2206 -17403
7366 -17403 -28900 -15947 -2621 -2939 -2374 -5052 -2367 2181 323 -2220 -2496 -1202 -403 3046 4033
$$ packed form
7467A5108q536r336L673N954J496j1605o729R225J7310l167j8397o950O031Q841
7453B918L958n632j0455m616j0274Q157J626k248K765J0192K1275O958n038q157
7439A1429J2215l117l812k986k067Q509Q338j0797j2593L420n564k948p45l867
7425d585N367j664j1536N730q91k618Q276J0435R744O65N877j3148n558J722p068
7410G48l903k326q472M124l903p712P526j077O103p459J5815M811r688m492M618
7395e287L530L229L903J1387r795o104n4J3962O547j737o405r274p753n692j3168
7380b2711k530O608K741L201N950J3344l510o075K784O734m85n917k340j5197
7366a7403j1497J2953J3326l18N65k678K685M548j858k543k76J294P99L449R87
$$ plain form
7351 4033 15842 6942 2221 10661 13428 10992 3594 3126 -7432 -5270 2165 14022 1844 -3216
7337 -3216 -5539 3844 14043 22945 10358 -5189 -10406 -14241 -8583 -4102 -11800 -15182 -11527 -13202
7323 -13202 -18530 -18653 -19075 -17799 -8085 8843 4187 -3468 3412 10627 1361 11331 7834 2621 8818
7308 8818 1116 -12491 -8749 -10107 1644 2325 11034 -5457 -8778 -6245 -3345 -5714 7125 14524
7294 14524 16196 3200 -12130 -2926 -9051 -16613 -10843 -9561 3035 13016 -3786 -12808 -13867 -13162
7280 -13162 -11775 -11004 -3937 -1807 -6909 -3599 10195 21064 14366 7159 2954 4043 5449 5353 -9995
7265 -9995 3331 14882 14622 14211 16976 721 -16539 -28819 -18350 -11225 2352 14278 3190
7252 3190 -8200 -3139 -1232 -9233 -19121 -7612 862 -943 7198 8891 4704 7375 20008 34211
$$ packed form
7351D033J1809q900m721Q440K767k436p398m68j0558K162P435J1857j2178n060
7337c216k323R383J0199Q902j2587j5547n217l835N658M481p698l382L655j675
7323a3202n328j23m22J276R714J6928m656p655O880P215r266R970l497n213O197
7308H818p702j3607L742j358J1751O81Q709j6491l321K533K900k369J2839P399
7294A4524J672j2996j5330R204o125p562N770J282J2596R981j6802r022j059P05
7280a3162J387P71P067K130n102L310J3794J0869o698p207m205J089J406r6j5348
7265i995J3326J1551k60m11K765j6255j7260j2280J0469P125J3577J1926j1088
7252C190j1390N061J907q001r888J1509Q474j805Q141J693m187K671J2633J4203
$$ plain form
7238 34211 31542 18954 4208 -3675 -790 113 -5022 -591 11692 3150 -7670 -24932 -20887 -11858
7224 -11858 -4143 -5023 -7454 -2558 -4197 1872 -14757 -22185 3480 14281 24911 13058 4350 6532
7210 6532 14201 2254 -5096 11743 4637 5160 11035 5950 6536 6473 -3856 -19275 -15170 -7303 -3443
7195 -3443 -10113 -2236 3565 5883 10837 15639 -208 -2178 -21938 -32639 -19688 4977 16034
7182 16034 4863 -5565 -641 -9234 -17879 -8366 -8134 -22758 -11182 3583 12615 15834 4259
7169 4259 3678 4459 13177 11919 945 -8135 5935 6019 -91 8363 23496 18512 17503 12143 7660
7154 7660 5554 9483 5033 10450 14935 5634 9701 5458 -11532 -18217 -12081 -4567 -1743 -10595 -11826
7139 -11826 61 5541 -1873 -2625 9831 16671 13081 3668 -994 4467 13341 0 -11051 -5173
$$ packed form
7238C4211k669j2588j4746p883K885R03n135M431J2283q542j0820j7262M045R029
7224a1858P715q80k431M896j639O069j6629p428K5665J0801J0630j1853q708K182
7210F532P669j1947p350J6839p106N23N875n085N86o3j0329j5419M105P867L860
7195c443o670P877N801K318M954M802j5847j970j9760j0701J2951K4665J1057
7182A6034j1171j0428M924q593q645R513K32j4624J1576J4765R032L219j1575
7169D259n81P81Q718j258j0974r080J4070Q4o110Q454J5133m984j009n360m483
7154G660k106L929m450N417M485r301M067m243j6990o685O136P514K824q852j231
7139a1826J1887N480p414p52J2456O840l590r413m662N461Q874j3341j1051N878
$$ plain form
7125 -5173 -6872 -3752 -1117 -1732 8202 25257 23989 4020 3071 16224 12730 -6416 -11077 -8207
7111 -8207 -7038 11132 4535 4952 15880 24466 19192 13954 17410 20651 7479 -3223 -22264 -26835
7097 -26835 -16875 -3202 506 7070 -160 -18297 -22247 -12901 -14049 -13651 -10014 -992 -4720 -8236
7083 -8236 -5974 2324 5061 5298 9133 1846 -13062 -7455 10082 12522 16122 17418 10865 3183 -14984
7068 -14984 -15523 -13326 -9812 -5983 5126 10155 6505 13613 24899 31313 23002 8007 6054 4900
7054 4900 450 2439 -1556 1438 1902 -6828 -7848 -7804 -11936 -10998 -18644 -22678 -20996 -13294 -7295 -2040
7038 -2040 1826 -8667 -5899 -6620 -11392 -12314 -9563 -14549 -19675 -19175 -21660 -30244 -25554 -10603 -17524
7023 -17524 -18326 -17441 -22522 -21304 -16447 -7009 -3422 9939 19766 24491 20680 17074 37241 47038 35452
$$ packed form
7125e173j699L120K635o15R934J7055j268j9969r49J3153l494j9146m661K870
7111h207J169J8170o597M17J0928Q586n274n238L456L241j3172j0702j9041m571
7097b6835R960J3673L708O564p230j8137l950R346j148L98L637R022l728l516
7083h236K262Q298K737K37L835p287j4908N607J7537K440L600J296o553p682j8167
7068a4984n39K197L514L829J1109N029l650P108J1286O414q311j4995j953j154
7054D900m450J989l995K994M64q730j020M4m132R38p646m034J682P702N999N255
7038b040L866j0493K768p21m772r22K751m986n126N00k485q584M690J4951o921
7023a7524q02Q85n081J218M857R438L587J3361R827M725l811l606K0167R797j1586
$$ plain form
7008 35452 20789 9650 4194 761 -9515 -13368 -9661 -20843 -20419 -4491 5391 -2852 -6745 552
6994 552 4331 10317 -510 -6882 -13378 -7264 5165 10411 4778 3605 12016 4106 -18798 -16060
6980 -16060 2800 5852 7663 2727 1949 9958 20247 8948 6629 5454 -4138 -9912 -3379 7849
6966 7849 13829 10781 1139 -12007 -3264 6782 -2503 -16718 -23773 -9355 -5238 4548 10194 11972
6952 11972 7563 4427 -22242 -12171 269 -6946 532 4318 2680 2703 -8330 -15385 -12877 -18496
6938 -18496 -16354 -2654 4840 2921 -301 971 -1041 -5119 3278 22572 23575 25571 7002 1888
6924 1888 -1915 5044 13949 3847 8961 6709 10670 10143 1873 450 3442 -10728 -9606 5321
6910 5321 15948 15149 -3843 -7665 542 5301 1924 -376 -3977 4198 -12298 -10779 -6715 -13766
$$ packed form
7008C5452j4663j1139n456l433j0276l853L707j1182M24J5928R882q243l893P297
6994E52L779N986j0827o372o496O114J2429N246n633j173Q411p910k2904K738
6980a6060J8860L052J811m936p78Q009J0289j1299k319j175r592n774O533J1228
6966G849N980l048r642j3146Q743J0046r285j4215p055J4418M117R786N646J778
6952A1972m409l136k6669J0071J2440p215P478L786j638K3j1033p055K508n619
6938a8496K142J3700P494j919l222J272k012m078Q397J9294J003J996j8569n114
6924A888l803O959Q905j0102N114k252L961n27q270j423K992j4170J122J4927
6910E321J0627p99j8992l822Q207M759l377k300l601Q175j6496J519M064p051
$$ plain form
6896 -13766 -24463 -30363 -19889 -3812 -2000 3012 -3938 -5977 2877 7277 -4002 -8007 -5781 6431
6882 6431 25659 19208 305 -9971 876 1370 4097 1570 1732 931 -7272 -10604 -11403 -3267 -932
6867 -932 10836 12020 10330 6268 2262 3492 -15438 -15735 -17843 -18951 -10439 -14838 -12234 6531 15657
6852 15657 -476 -11375 -4458 -713 1824 -9418 -4811 -6254 -12538 -12486 -8720 -14032 -19323 -11294
6838 -11294 -823 9037 5408 2545 3278 2061 1638 2084 1436 2219 5985 14759 15476 12922 15402 8088
6822 8088 3239 -4751 -5970 347 7696 -1153 -9754 1259 -9216 -16081 -320 10075 7787 11323
6808 11323 -1276 -8294 -10945 -6096 -7343 -5856 -1585 -427 5318 6331 390 -6063 -8315 -4661
6794 -4661 5496 7308 4796 73 -17216 -9629 2929 4884 9538 7819 10325 12380 -8779 -25725
$$ packed form
6896a3766j0697n900J0474J6077J812N012o950k039Q854M400j1279m005K226J2212
6882F431J9228o451j8903j0276J0847M94K727k527J62q01q203l332p99Q136K335
6867i32J1768J184j690m062m006J230j8930k97k108j108Q512m399K604J8765R126
6852A5657j6133j0899O917L745K537j1242M607j443o284N2L766n312n291Q029
6838a1294J0471R860l629k863P33j217m23M46o48P83L766Q774P17k554K480p314
6822H088m849p990j219O317P349q849q601J1013j0475o865J5761J0395k288L536
6808A1323j2599p018k651M849j247J487M271J158N745J013n941o453k252L654
6794d661J0157J812k512m723j7289P587J2558J955M654j719K506K055k1159j6946
$$ plain form
6780 -25725 -20427 -3851 -8535 -8508 -14018 -27486 -24799 -18449 -12516 -15547 -20014 -6063 15611 24376
6766 24376 15811 12457 13981 6857 -788 1771 3845 3526 -5377 -4246 2990 2745 -14932 -17447 -11030
6751 -11030 2051 7017 2445 20652 29002 21331 7013 7098 22110 22029 12465 -2037 -5682 19943
6737 19943 26104 27001 24661 2001 -14307 -22935 -30709 -16706 7718 -5111 -12120 -10974 -9391 -18313
6723 -18313 -6613 -4414 -13390 -24959 -15322 -11372 -10374 -9547 -2239 -2173 11584 16803 11817 4711 -3924
6708 -3924 -7679 -1972 12302 26272 24825 6424 -8658 -13426 -4660 -4011 -3503 -12344 -13860 -10117
6694 -10117 2301 3690 7545 10679 21640 11663 10471 18314 33052 30922 22342 16287 1456 -4309
6680 -4309 -70 1210 5457 3837 12263 22698 23902 22061 12216 8359 23684 24727 18790 18765 13302
$$ packed form
6780b5725N298J6576m684K7n510j3468K687O350N933l031m467J3951K1674Q765
6766B4376q565l354J524p124p645K559K074l19q903J131P236k45j7677k515O417
6751a1030J3081M966m572J8207Q350p671j4318Q5J5012q1r564j4502l645K5625
6737A9943O161Q97k340k2660j6308q628p774J4003K4424j2829p009J146J583q922
6723a8313J1700K199q976j1569R637L950R98Q27P308O6J3757N219m986p106q635
6708c924l755N707J4274J3970j447j8401j5082m768Q766O49N08q841j516L743
6694a0117J2418J389L855L134J0961r977j192P843J4738k130q580o055j4831n765
6680d309M239J280M247j620Q426J0435J204j841r845l857J5325J043n937k5n463
$$ plain form
6665 13302 16224 765 7785 14148 21887 29239 12864 2536 -4256 7617 13615 16603 -4486
6652 -4486 -25462 -24790 -10611 -7137 3998 21610 23999 26583 33184 13963 8043 8391 -7807 -3234
6638 -3234 5052 -2676 -6478 -14505 -21318 -11189 3567 5520 11710 6715 4037 -9351 -8636 -18405
6624 -18405 -26387 -15635 -12923 -8910 -15648 -23007 -33497 -36896 -35670 -23846 -9358 -14506 -12923 -4052
6610 -4052 -3301 -7758 -5767 401 8012 13382 -339 -5154 -4060 -7229 -14208 -609 4676 3324 -12863
6595 -12863 -24111 -27842 -25404 -23412 -22635 -16114 -15753 -10925 -10038 -14524 -15647 -7902 -12664 -17224 -6925
6580 -6925 -13899 -15216 -5185 -19692 -15500 -12632 4173 11667 17127 16076 14709 8728 -1266 -17723
6566 -17723 -13542 -15105 -12492 -7465 4590 5948 2925 4735 11952 -494 -1053 8048 5060 8852
$$ packed form
6665A3302K922j5459P020O363P739P352j6375j0328o792J1873N998K988k1089
6652d486k0976O72J4179L474J1135J7612K389K584O601j9221n920L48j6198M573
6638c234Q286p728l802q027o813J0129J4756J953O190m995k678j3388P15r769
6624a8405p982J0752K712M013o738p359j0490l399J226J1824J4488n148J583Q871
6610d052P51m457J991O168P611N370j3721m815J094l169o979J3599N285j352j6187
6595a2863j1248l731K438J992P77O521L61M828Q87m486j123P745m762m560J0299
6580f925o974j317J0031j4507M192K868J6805P494N460j051j367n981r994j6457
6566a7723M181j563K613N027J2055J358l023J810P217j2446n59R101k988L792
$$ plain form
6552 8852 1700 -3340 -1180 -2244 10638 3658 -2639 15901 24760 27188 19829 -6706 -17284 -26018
6538 -26018 -21272 -5086 -8573 -19381 -23774 -26601 -23992 -13121 -5245 13575 -1505 -7133 -12945
6525 -12945 -7108 1246 3632 10632 13851 16517 7113 -4595 -19746 -22139 -6721 -11202 -15727 -14504
6511 -14504 -12597 -21788 -23098 3650 24655 19946 -11021 -24196 -13747 -6838 -4972 -5232 -626 5
6497 5 6792 1480 -6034 -12779 -20102 -17546 -12021 -4717 13329 17957 8063 -6048 -16406 -12540 -7684
6482 -7684 11659 16882 16934 4433 -1317 4855 18369 17529 18225 10645 5196 12192 -7400 -10125 6241
6467 6241 -3866 -18904 -29080 -23952 -15700 -9651 11151 14036 14079 17446 13819 11807 2083 -2584
6453 -2584 3242 4644 22639 16940 -5344 -128 -9376 -7606 5750 6700 5024 -896 3140 -3440
$$ packed form
6552H852p152n040K160j064J2882o980o297J8540Q859K428p359k6535j0578q734
6538b6018M746J6186l487j0808m393k827K609J0871P876J8820j5080n628n812
6525a2945N837Q354K386P000L219K666r404j1708j5151k393J5418m481m525J223
6511a4504J907r191j310K6748K1005m709l0967j3175J0449O909J866k60M606O31
6497EO787n312p514o745p323K556N525P304J8046M628r894j4111j0358L866M856
6482g684J9343N223N2j2501n750O172J3514q40O96p580n449O996j9592k725J6366
6467F241j0107j5038j0176N128Q252O049K0802K885M3L367l627k012r724m667
6453b584N826J402J7995n699k2284N216r248J770J3356R50j676n920M036o580
$$ plain form
6439 -3440 -15749 -24327 -16276 -2686 9689 7195 5079 868 -7163 -12238 -17522 -15498 -6882 7306
6425 7306 12419 1860 -10669 -16385 -11224 -11885 -17041 -15727 -13160 -6253 12611 17438 11914 8401
6411 8401 186 -3266 -3539 -8931 -21153 -20376 -6092 13128 18491 7009 12801 10865 10853 -6692 -9157
6396 -9157 -8261 -26207 -18711 -12947 -3069 460 -4923 -10668 -11545 -9511 2322 822 9572 13803 11193
6381 11193 10531 16632 1431 -14347 -29513 -28076 -7455 4965 2861 -5746 -2264 24138 17328
6368 17328 11963 7129 17122 15676 14213 4724 8819 9957 1982 -8024 -6513 2442 10777 5399
6354 5399 -1708 -7039 -4212 10978 11850 16453 15131 2331 -3724 -4950 -10188 -12911 -19349 -19698 -5793
6339 -5793 1072 14267 17642 4830 -3517 -3279 -754 233 -6208 -943 11542 -508 -1193 -4342 -1358
$$ packed form
6439c440j2309q578Q051J3590J2375k494k116m211q031n075n284K024Q616J4188
6425G306N113j0559j2529n716N161o61n156J314K567O907J8864M827n524l513
6411H401q215l452k73n392j2222P77J4284J9220N363j1482N792j936j2j7545k465
6396i157Q96j7946P496N764R878L529n383n745q77K034J1833j500Q750M231k610
6381A1193o62O101j5201j5778j5166J437K0621J2420k104q607L482K6402o810
6368A7328n365m834R993j446j463r489M095J138p975j0006J511Q955Q335n378
6354E399p107n331K827J5190Q72M603j322j2800o055j226n238k723o438l49J3905
6339e793O865J3195L375j2812q347K38K525R87o441N265J2485j2050o85l149K984
$$ plain form
6324 -1358 -4522 -4717 3579 774 -5069 -8025 -17090 -13317 -21499 -30322 -29596 -26584 -10198 -2739 2744
6309 2744 11796 5299 -4576 -16716 -9283 -15000 -4005 5418 -10062 -14277 -24436 -17641 -6549 -11028
6295 -11028 -8135 -9310 -3748 6171 4824 7149 7560 12163 10750 1736 1364 5744 8304 4424 -17541
6280 -17541 -18187 -7507 -942 13203 26994 36546 27919 14593 8253 8906 8950 10967 7314 7977 13807
6265 13807 25796 18152 -4536 -12798 -13424 -12124 -11505 -6501 -1393 22 4920 -511 4964 4948 -9215
6250 -9215 -7832 4475 11237 6640 12839 373 -4665 9305 26607 14293 6030 -9595 -34330
6237 -34330 -46954 -34156 -27325 -11568 5959 -1482 -5569 -15080 -8273 -3236 -14646 -21547 95
6224 95 14364 13313 7777 9052 8397 -6285 -17901 -24534 -18463 -14049 -23524 -25269 -15066 -1804
$$ packed form
6324a358l164j95Q296k805n843k956r065L773q182q823P26L012J6386P459N483
6309B744R052o497r875j2140P433n717J0995R423j5480m215j0159O795J1092m479
6295a1028K893j175N562R919j347K325M11M603j413r014l72M380K560l880k1965
6280a7541o46J0680O565J4145J3791R552q627j3326o340O53M4K017l653O63N830
6265A3807J1989p644k2688q262o26J300O19N004N108J415M898n431N475j6j4163
6250i215J383J2307O762m597O199j2466n038J3970J7302j2314q263j5625k4735
6237c4330j2624J2798O831J5757J7527p441m087r511O807N037j1410o901K1642
6224I5J4269j051n536J275o55j4682j1616o633O071M414r475j745J0203J3262
$$ plain form
6210 -1804 15201 11509 12634 -9 -15356 -6815 1155 -8867 2996 952 -200 -886 6784 8857
6196 8857 -5994 -4623 -4759 390 2 4651 8257 -7854 -9541 -6678 1870 -1964 -17038 -10357 8268
6181 8268 7425 -15239 -15555 -5524 -2487 -3191 5078 11868 5805 9784 10738 3278 7750 11362 3965
6166 3965 3008 2259 7017 -7811 -18709 -14938 -921 12942 16880 7777 -3643 -5442 -1030 167
6152 167 -5031 -5448 562 5375 -7316 -5009 -114 -59 -5891 -10980 -15269 -1099 7995 6936 -1247
6137 -1247 -6648 5385 17346 22919 10370 8971 2603 -12673 -18377 -24159 -20611 -3236 -6815 -12110
6123 -12110 -16302 -20082 -15372 313 -2733 -8896 -11699 2237 786 481 6734 14300 20820 19926 8471
6108 8471 -1515 -3908 -4453 -15496 -17104 -12937 -18756 -15867 -9522 -17973 -22304 -21888 -19826 -28681 -39830
$$ packed form
6210a804J7005l692J125j2643j5347Q541P970j0022J1863k044j152o86P670K073
6196H857j4851J371j36N149l88M649L606j6111j687K863Q548l834j5074O681J8625
6181H268q43k2664l16J0031L037p04Q269O790o063L979R54p460M472L612p397
6166C965r57p49M758j4828j0898L771J4017J3863L938r103j1420j799M412J197
6152A67n198m17O010M813j2691K307M895N5n832n089m289J4170R094j059q183
6137a247n401J2033J1961N573j2549j399o368j5276n704n782L548J7375l579n295
6123a2110m192l780M710J5685l046o163k803J3936j451l05O253P566O520q94j1455
6108H471r986k393n45j1043j608M167n819K889O345q451m331M16K062q855j1149
$$ plain form
6093 -39830 -34761 -12682 -5795 -5558 -4426 -7122 -2139 -2970 -7548 -12974 -11371 -5507 -9381 -4695 -9652
6078 -9652 -8280 -9224 -1753 7764 10134 20051 16621 24385 9562 -5453 -4973 -10243 -26536 -18682 -6844
6063 -6844 -15460 -8221 6234 2043 5112 10904 10086 -2945 -16661 -25531 -26724 -30948 -24190 -11356
6049 -11356 3505 1802 -1167 2468 7150 14434 25142 27973 20662 -6142 -23475 -28325 -28185 -36430
6035 -36430 -28520 -18650 -13516 -6234 -7346 -12965 -14829 -24373 -20452 -16427 -7087 7543 9011 4828
6021 4828 232 5559 2010 -12736 -10380 -8187 -13333 -23556 -17555 -5591 2370 1758 11491 3942
6007 3942 -564 -1745 -9101 -4424 5177 782 -3360 5484 3805 4722 2343 -5469 -9276 -10891 -19441
5992 -19441 -20588 -19579 -12594 -9532 -1660 9239 9024 7289 5375 -12647 -21385 -16714 -12151 -11654 -7363
$$ packed form
6093c9830N069K2079O887K37J132k696M983q31m578n426J603N864l874M686m957
6078i652J372r44P471R517K370R917l430P764j4823j5015M80n270j6293P854J1838
6063f844q616P239J4455m191L069N792q18j3031j3716q870j193m224O758J2834
6049a1356J4861j703k969L635M682P284J0708K831p311k6804j7333m850J40q245
6035c6430P910R870N134P282j112n619j864r544L921M025R340J4630J468m183
6021D828m596N327l549j4746K356K193n146j0223O001J1964P961o12R733p549
6007C942m506j181p356M677R601m395m142Q844j679R17k379p812l807j615q550
5992a9441j147J009O985L062P872J0899k15j735j914j8022q738M671M563M97M291
$$ plain form
5977 -7363 -14724 -7648 -6509 -9862 -14776 -22160 -26516 -29029 -22335 -8779 -387 -675 -18890 -25510 -29626
5962 -29626 -24459 -23118 -11934 -3622 1054 -7533 -15899 -20714 -24280 -22357 -20040 -19100 -12810 -1162
5948 -1162 6623 7403 7034 3349 10759 24599 14609 -2711 -4498 -10688 -18326 -22237 -30570 -18002 -14314
5933 -14314 -21225 -18443 -24388 -21377 -20219 -19827 -22944 -18483 -15255 -16698 -15814 -15452 -2921 -879 -9065
5918 -9065 -16310 -17942 -11596 -12763 7486 5894 5025 8911 14909 15356 -1044 -14782 -26415 -37938
5904 -37938 -41037 -43075 -34343 -25422 -14676 -21775 -22283 -16394 -22018 -17803 -22120 -30429 -15249 -3888
5890 -3888 3904 9781 7028 -7957 -11890 -11546 -9075 -14844 -11365 -6744 -6867 -7889 -19932 -13861 -3768
5875 -3768 5246 1503 2047 17423 24127 14964 17005 19715 6052 3422 -2916 822 8231 3208 -10231
$$ packed form
5977g363p361P076J139l353m914p384m356k513O694J3556Q392k88j8215o620m116
5962b9626N167J341J1184Q312M676q587q366m815l566J923K317R40O290J1648
5948a162P785P80l69l685P410J3840r990j7320j787o190p638l911q333J2568L688
5933a4314o911K782n945L011J158L92l117M461L228j443Q84L62J2531K042q186
5918i065p245j632O346j167K0249j592q69L886N998M47j6400j3738j1633j1523
5904c7938l099k038Q732Q921J0746p099n08N889n624M215m317q309J5180J1361
5890c888P792N877k753j4985l933L44K471n769L479M621j23j022j2043O071J0093
5875c768R014l743N44J5376O704r163K041K710j3663k630o338L738P409n023j3439
$$ plain form
5860 -10231 -16612 -13906 -3371 -207 -8525 -3279 3937 3326 5468 928 603 -17231 -14523 -1367
5846 -1367 744 1712 -3536 -1015 -10131 -26203 -17363 -3348 -2957 -8040 -5915 -6680 11275 24693 904
5831 904 4486 -663 -6797 -25723 -22387 -25037 -21556 -18729 -22073 -26160 -25621 -24706 -26484 -7248 14049
5816 14049 20741 9778 -520 -5496 11653 10934 8034 12202 8169 -6330 -9338 4903 -1006 5804
5802 5804 12765 12563 5885 7850 -241 -21787 -23974 -6685 1820 -3660 -1447 3056 5086 10017 4883
5787 4883 9102 12607 10474 -3952 -14106 -13946 -16375 -20246 -9975 -16813 -32475 -32833 -18541 -561
5773 -561 -8515 -11682 -8219 -11546 1527 15822 7327 1555 -1215 -2553 -558 2976 1763 -5157 -9125
5758 -9125 218 3476 5131 11200 10668 15168 16456 12795 4340 2903 482 6386 17389 11065 18722
$$ packed form
5860a0231o381K706J0535L164q318N246P216o11K142m540l25j7834K708J3156
5846a367K111R68n248K521r116j6072Q840J4015L91n083K125p65J7955J3418k3789
5831I04L582n149o134j8926L336k650L481K827l344m087N39R15j778J9236K1297
5816A4049O692j0963j0298m976J7149p19k900M168m033j4499l008J4241n909O810
5802E804O961k02o678J965q091k1546k187J7289Q505n480K213M503K030M931n134
5787D883M219L505k133j4426j0154J60k429l871J0271o838j5662l58J4292J7980
5773e61p954l167L463l327J3073J4295q495n772k770j338J995L534j213o920l968
5758i125R343L258J655O069n32M500J288l661q455j437k421N904J1003o324P657
$$ plain form
5743 18722 11664 14594 14461 23705 22711 20500 10138 11555 12397 2863 -2201 -18223 -21033 -19000 -19659
5728 -19659 -11941 -10003 -11086 -999 -1693 3333 3371 5785 2581 -9733 -17312 -12372 -16192 -13772 -11929
5713 -11929 -22358 -17013 -15901 -10736 -7763 150 23170 16700 2436 -3413 -4775 2933 324 1247
5699 1247 19226 9691 -4338 -1777 -3537 5644 8909 -10238 -10797 -5425 -5668 -2843 -5859 -3507 -1030
5684 -1030 1091 -9904 -2065 6705 -978 -5390 941 -828 -12136 -8674 13855 18668 2562 -6644
5670 -6644 276 -3721 -3096 10259 12858 7899 -510 -16849 -25276 -24068 -16786 4953 12942 16994
5656 16994 9813 10682 8828 -8574 -15548 652 21927 28795 6109 -15965 1469 8158 10983
5643 10983 -134 2161 8480 1656 -5245 -8978 -24274 -13675 -4877 -15279 -30697 -36920 -15080
$$ packed form
5743A8722p058K930j33R244r94k211j0362J417Q42r534n064j6022k810K033o59
5728a9659P718J938j083J0087o94N026L8K414l204j2314p579M940l820K420J843
5713a1929j0429N345J112N165K973P913K3020o470j4264n849j362P708k609R23
5699A247J7979r535j4029K561j760R181L265j9147n59N372k43K825l016K352K477
5684a030K121j0995P839Q770p683m412O331j769j1308L462K2529M813j6106r206
5670f644O920l997O25J3355K599m959q409j6339q427J208P282K1739P989M052
5656A6994p181Q69j854j7402o974J6200K1275O868k2686k2074J7434O689K825
5643A0983j1117K295O319o824o901l733j5296J0599Q798j0402j5418o223K1840
$$ plain form
5630 -15080 -3985 -12703 -18176 -3153 951 -6715 -9826 -9231 -9781 -16598 -13068 -1823 9645 1008
5616 1008 -7099 -10548 -15168 -18338 -26043 -22818 -12428 6904 5566 11109 12001 6460 5192 -10896
5602 -10896 -15221 -22484 -22333 -19209 -13737 -6618 -6082 -6195 -5844 11543 4520 -3634 -8090 -8895 -17557 -20859
5586 -20859 1295 8921 2677 -8528 -8813 -7753 -1919 -9359 -6720 -3174 -9018 -5240 -4748 -11741 -11570
5571 -11570 -11401 -16407 -19260 -20627 -20124 -20354 -15361 -11330 -6853 8555 4979 -5071 -1117 -5288 -3580
5556 -3580 7609 9850 11443 7422 8674 18734 16677 -6086 -14093 -13853 -17669 -22026 -20530 -18534
5542 -18534 -28191 -14414 -1871 5374 1523 6543 14795 24060 21607 9776 2869 2612 -15276 -31630
5528 -31630 -26427 -25306 -19328 -13784 -16031 -21944 -16501 -14461 -16561 -28015 -32399 -36082 -29943 -20594
$$ packed form
5630a5080J1095q718n473J5023M104p666l111N95n50o817L530J1245J1468q637
5616A008q107l449m620l170p705L225J0390J9332j338N543Q92n541j268j6088
5602a0896m325p263J51L124N472P119N36j13L51J7387p023q154m456q05q662l302
5586b0859K2154P626o244j1205k85J060N834p440K639L546n844L778M92o993J71
5571a1570J69n006k853j367N03k30M993M031M477J5408l576j0050L954m171J708
5556c580J1189K241J593m021J252J0060k057k2763q007K40l816m357J496J996
5542a8534r657J3777J2543P245l851N020Q252R265k453j1831o907k57j7888j6354
5528c1630N203J121N978N544k247n913N443K040k100j1454m384l683O139R349
$$ plain form
5514 -20594 -7669 4383 3135 -3043 -7162 -5631 8784 13079 19691 4898 5663 -3413 -11792 7135
5500 7135 14383 4381 -14056 -9908 -5094 -15894 -23165 -13694 -1344 5324 13342 8332 2204 -7648
5486 -7648 -5112 638 2932 11539 7887 -3640 -10022 -3120 4784 12525 15797 2909 -9117 -17020
5472 -17020 -14595 -4037 -2777 -15149 -22068 -17415 -17638 -25176 -22278 -11815 -18040 -18265 -4972 11566
5458 11566 3214 3157 19865 25352 3584 -662 -13695 -15356 -4463 -6581 -1269 -7020 -14126 -13871
5444 -13871 -4435 -14427 -12457 -2913 5779 6967 10562 85 -7369 8687 7189 1586 1500 4494 4803
5429 4803 6372 4930 5058 -4238 -7468 -5330 -9994 -9219 -18598 -20429 -3040 -49 6639 23625 18282
5414 18282 20777 17429 -885 -12731 -6581 -5351 -5991 -4700 153 2388 11807 14073 -2678 -4661
$$ packed form
5514b0594J2925J2052j248o178m119J531J4415M295O612j4793P65r076q379J8927
5500G135P248j0002j8437M148M814j0800p271R471J2350O668Q018n010o128r852
5486g648K536N750K294Q607l652j1527o382O902P904P741L272j2888j2026p903
5472a7020K425J0558J260j2372o919M653k23p538K898J0463o225k25J3293J6538
5458A1566q352n7J6708N487k1768m246j3033j661J0893k118N312n751p106K55
5444a3871R436r992J970R544Q692J188L595j0477p454J6056j498n603q6K994L09
5429D803J569j442J28r296l230K138m664P75r379j831J7389K991O688J6986n343
5414A8282K495l348j8314j1846O150J230o40J291M853K235R419K266j6751j983
$$ plain form
5400 -4661 -2837 -18361 -16116 -16056 -2083 3845 4485 5253 9433 17489 15783 9854 463 -2077 -6477
5385 -6477 6369 10392 4981 -4850 30 6270 -870 -12264 -6876 3228 10097 18961 16288 4971
5371 4971 -1168 -6635 -4283 -2966 -25264 -34335 -24374 -15992 760 -5288 -9095 -10161 -17291 -9324
5357 -9324 -12560 -17391 -12462 -579 -6658 -22679 -28321 -26324 -10244 -3732 -4460 -7316 -13974 -10918
5343 -10918 -18156 -24111 -26850 -17125 -7909 6681 19159 20834 8189 7294 12140 10372 12457 2498
5329 2498 -8989 -4453 -4011 -6843 -7112 -200 5431 153 -12008 -20167 -21711 -5311 5551 13170
5315 13170 7464 5949 8758 4966 2786 9360 5413 -5144 1799 14153 6807 -11782 -14115 -7383
5301 -7383 -637 -3980 -7496 -8135 -11310 -19831 -15646 7241 -593 -9504 -4119 -7769 -1812 9205 5989
$$ packed form
5400d661J824j5524K245O0J3973N928O40P68M180Q056j706n929r391k540m400
5385f477J2846M023n411r831M880O240p140j1394N388J0104O869Q864k673j1317
5371D971o139n467K352J317k2298r071R961Q382J6752o048l807j066p130P967
5357i324l236m831M929J1883o079j6021n642J997J6080O512p28k856o658L056
5343a0918p238n955k739R725R216J4590J2478J675j2645q95M846j768K085r959
5329B498j1487M536M42k832k69O912N631n278j2161q159j544J6400J0862P619
5315A3170n706j515K809l792k180O574l947j0557O943J2354p346j8589k333O732
5301g383O746l343l516o39l175q521M185K2887p834q911N385l650N957J1017l216
$$ plain form
5286 5989 -4997 737 2006 9468 20370 18326 10083 3028 -5375 -12176 -15574 -14780 2019 2754 -15173
5271 -15173 -11674 8875 18725 30763 14503 -2672 -16835 -24353 -10508 -7811 2927 8189 10922
5258 10922 7408 4812 -77 -5798 -7653 -6308 201 2466 -7421 -11859 -12979 -3995 7965 9263
5244 9263 10130 15572 11706 8490 15441 17125 8240 8071 8467 -6561 -16320 -21107 -36194 -30672 -11273
5229 -11273 -6433 -14094 -15764 72 -4836 -6936 -10970 -17756 -4516 10173 22874 25427 19789 10812
5215 10812 -3042 -13855 -16959 -14369 -13699 -314 8315 21172 14371 2477 2838 3067 -10338 -23027
5201 -23027 -15557 -6208 -1018 3285 10858 8895 18090 19552 16730 14531 -3530 7286 5192 1236
5187 1236 -10713 -12913 -12303 -14454 -15933 -13151 -11883 -9092 -150 6025 9247 10397 3181 -4491 -13465
$$ packed form
5286E989j0986N734J269P462J0902k044q243p055q403o801l398P94J6799P35j7927
5271a5173L499K0549R850J2038j6260j7175j4163p518J3845K697J0738N262K733
5258A0922l514k596m889n721j855J345O509K265r887m438j120Q984J1960J298
5244I263Q67N442l866l216O951J684q885j69L96j5028r759m787j5087N522J9399
5229a1273M840p661j670J5836m908k100m034o786J3240J4689J2701K553n638q977
5215A0812j3854j0813l104K590O70J3385Q629J2857o801j1894L61K29j3405j2689
5201b3027P470R349N190M303P573j963R195J462k822k199j8061J0816k094l956
5187A236j1949k200O10k151j479K782J268K791Q942O175L222J150p216p672q974
$$ plain form
5172 -13465 -22734 -8974 -16330 -12341 -4343 -5509 -10471 -13910 -8990 -7575 1702 2070 -1033 5671 2972
5157 2972 -5650 -9446 1418 -2962 -8907 -2324 -7187 -707 14780 13973 -6305 -7753 -7196 -15494 -7867
5142 -7867 -806 -8292 -5986 -6308 2099 8795 8150 2793 1105 -7393 6697 12198 14367 3779 -7179
5127 -7179 -3620 2331 -5655 -3989 -5688 -6962 -12145 -6311 -8012 -14258 107 10131 9282 -606 -7312
5112 -7312 -9722 -5521 -15910 -28025 -22539 -17823 -18685 -15616 -10759 -3503 10927 19518 11890 1274
5098 1274 -20062 -20596 -15636 -10527 -10959 -16419 -21139 -22710 -8474 -3464 2969 10010 13139 -1839 -4791
5083 -4791 2790 4072 -348 -6524 -5463 -8552 -1081 5876 1965 -22128 -26385 5269 -4903 -17031
5069 -17031 -19916 -14981 -25844 -17899 -12738 -5598 -8881 -11231 -11180 -21243 -16659 -5333 -3914 -12871
$$ packed form
5172a3465r269J3760p356L989P998j166m962l439M920J415R277L68l103O704k699
5157B972q622l796J0864m380n945O583m863O480J5487q07k0278j448N57q298P627
5142g867P061p486K306l22Q407O696o45n357j688q498J4090N501K169j0588j0958
5127g179L559N951p986J666j699j274n183N834j701o246J4365J0024q49r888o706
5112g312k410M201j0389j2115N486M716q62L069M857P256J4430Q591p628j0616
5098A274k1336n34M960N109m32n460m720j571J4236N010O433P041L129j4978k952
5083d791P581J282m420o176J061l089P471O957l911k4093m257L1654j0172j2128
5069a7031k885M935j0863P945N161P140l283k350N1j0063M584J1326J419q957
$$ plain form
5055 -12871 -16627 4959 4685 8025 6410 -1431 4951 2772 1354 3891 245 -3509 -6111 -19712
5041 -19712 -15180 -6264 2959 2351 1015 -895 4735 2597 -7726 -20721 -7063 7891 2271 -496
5027 -496 -9093 -18459 -10407 -9618 -8113 -1713 -1411 2025 15540 13876 20097 30735 30366 28814 31114
5012 31114 15898 2638 -5112 -13598 -19307 -22753 -11167 10756 17965 15590 15693 11881 5803 -6318
4998 -6318 -14168 -11152 2396 -1656 -6985 -7792 -7630 2995 4433 8955 9904 5356 12383 6243 -7794
4983 -7794 1778 4142 3481 1731 -13177 -7300 -530 9919 20446 13417 1743 -10346 -13019 -25132
4969 -25132 -25303 -18599 -17712 -16177 -9682 -16115 -14182 -12253 1650 -8223 -24993 -19540 -25568 -28702 -23309
4954 -23309 -16803 -17198 -8546 2259 833 -8829 -6722 -8748 -9435 4316 13931 4518 -10119 -21976
$$ packed form
5055a2871l756K1586k74L340j615p841O382k179j418K537l646l754k602j3601
5041a9712M532Q916R223o08j336j910N630k138j0323j2995J3658J4954n620k767
5027d96q597r366Q052P89J505O400L02L436J3515j664O221J0638l69j552K300
5012C1114j5216j3260p750q486n709l446J1586K1923P209k375J03l812o078j2121
4998f318p850L016J3548m052n329q07J62J0625J438M522R49m548P027o140j4037
4983g794R572K364o61j750j4908N877O770J0449J0527p029j1674j2089k673j2113
4969b5132j71O704Q87J535O495o433J933J929J3903r873j6770N453o028l134N393
4954b3309O506l95Q652J0805j426r662K107k026o87J3751R615r413j4637j1857
$$ plain form
4940 -21976 -18907 -13318 -19053 -24276 -12243 -12372 -21301 -24489 -23211 -14656 -12614 -3587 -12836 -9548 -3835
4925 -3835 -3867 -2105 -3990 2477 -13043 -24294 -9882 1422 -17483 -31756 -19378 -16660 1474
4912 1474 5564 -6507 505 1913 -11576 -9441 -7226 -13918 -24574 -26059 -11207 1555 1646 1944
4898 1944 4821 8677 11206 -7868 -17601 -23973 -28565 -29090 -24545 -12967 -15490 -9197 1770 -2649
4884 -2649 -4448 -2402 6410 5258 644 3128 977 -5931 -17699 -19069 -13193 -2475 3949 238
4870 238 -3206 -1555 -10276 -21294 -27408 -14277 -10843 -13306 -16563 -16650 -21783 -11874 -4605 9690 10663
4855 10663 12121 7359 10304 7385 -989 4713 7205 338 5484 -806 -24616 -40755 -40449 -24694
4841 -24694 -7767 -12258 -14380 -9388 -5340 -3908 -905 10524 3847 789 4251 -1765 8528 10244
$$ packed form
4940b1976L069N589n735n223J2033j29q929l188J278Q555K042R027r249L288N713
4925c835l2J762j885O467j5520j1251J4412J1304j8905j4273J2378K718J8134
4912A474M090j2071P012J408j3489K135K215o692j0656j485J4852J2762R1K98
4898A944K877L856K529j9074r733o372m592n25M545J1578k523O293J0967m419
4884b649j799K046Q812j152m614K484k151o908j1768j370N876J0718O424l711
4870B38l444J651q721j1018o114J3131L434k463l257q7n133R909P269J4295R73
4855A0663J458m762K945k919q374N702K492o867N146o290k3810j6139L06J5755
4841b4694J6927m491k122M992M048J432L003J1429o677l058L462o016J0293J716
$$ plain form
4827 10244 -6307 -12150 -6037 2570 -2036 -14329 -5189 -7919 -5660 52 -8193 -3474 5099 11052
4813 11052 1756 -11997 -16755 -8437 -362 -7966 -12104 -20694 -23170 -22872 -17131 -18044 -18377 -13113 9308
4798 9308 16972 6749 -173 4114 -2089 -4420 -9201 -11992 -6369 -2078 -3437 -4609 -122 4531 -2876
4783 -2876 2348 -2736 -10358 -11097 -13285 -1312 4394 3763 2430 5964 7877 887 2690 -13328 -24788
4768 -24788 -21953 -10031 -1440 -15810 -29653 -31104 -12501 3009 -725 -5326 -8101 -17897 -23680
4755 -23680 -6348 4104 7994 9929 8495 2550 -13833 -5319 4188 -49 8401 8692 -2058 -7592
4741 -7592 -5765 -15079 -19162 1045 2607 352 12930 8717 8900 4727 1994 2724 5865 11242 9656
4726 9656 8333 7495 5613 -6577 -7566 7482 10340 -2318 4775 18616 5999 -4252 1746 409
$$ packed form
4827A0244j6551n843O113Q607m606j2293R140k730K259N712q245M719Q573N953
4813A1052r296j3753m758Q318Q075p604m138q590k476K98N741r13l33N264K2421
4798I308P664j0223o922M287o203k331m781k791N623M291j359j172M487M653p407
4783b876N224n084p622p39k188J1973N706o31j333L534J913o990J803j6018j1460
4768b4788K835J1922Q591j4370j3843j451J8603J5510l734m601k775r796n783
4755b3680J7332J0452L890J935j434n945j6383Q514R507m237Q450K91j0750n534
4741g592J827r314m083K0207J562k255J2578m213J83m173k733P30L141N377j586
4726I656j323q38j882j2190r89J5048K858j2658P093J3841j2617j0251N998j337
$$ plain form
4712 409 5502 13560 22024 28759 24198 522 -14425 -442 17830 13968 15122 -1225 -11249 2821
4698 2821 21695 23135 20375 1486 -8341 -10212 -7589 -5948 -1936 20327 23855 13660 -3469 -13074
4684 -13074 -22149 -13217 -9338 -7227 -112 -2514 -2494 -1387 9178 13060 6528 7215 8720 10757 8811
4669 8811 -7792 -932 1936 4265 5599 -976 -5112 -12881 -13021 -3236 275 10411 -455 -3221
4655 -3221 -17916 -35333 -41534 -36851 -19996 -14665 -8235 -919 -8758 -8054 -6658 -12984 -9555 -12954
4641 -12954 -17744 -6885 -4551 1942 9868 13295 1778 -11540 -22171 -16237 -8789 -2697 -3181 2797
4627 2797 19034 19310 -5283 -15482 -3950 4889 4263 5694 10997 4952 1890 -1627 -9424 -15289
4613 -15289 -5037 12041 8212 5747 12909 10568 14253 8449 -3348 -12148 -12248 -11709 -7572 1738
$$ packed form
4712D09N093Q058Q464O735m561k3676j4947J3983J8272l862J154j6347j0024J4070
4698B821J8874J440k760j8889r827j871K623J641M012K2263L528j0195j7129r605
4684a3074r075Q932L879K111P115k402K0J107J0565L882o532O87J505K037j946
4669H811j6603O860K868K329J334o575m136p769j40R785L511J0136j0866k766
4655c221j4695j7417o201M683J6855N331O430P316p839P04J396o326L429l399
4641a2954m790J0859K334O493P926L427j1517j3318j0631N934P448O092m84N978
4627B797J6237K76k4593j0199J1532Q839o26J431N303o045l062l517p797n865
4613a5289J0252J7078l829k465P162k341L685n804j1797q800j00N39M137R310
$$ plain form
4599 1738 3539 1425 -2271 -4500 -19334 -17023 -8397 657 -1658 5403 17047 10010 1066 -5971
4585 -5971 -9885 -8209 -5354 -3454 -12989 -3870 20773 21896 11853 11674 -9655 -8703 -9947 -8651 -1786
4570 -1786 -1453 2326 14789 4712 5674 -83 -11642 -6735 2734 5670 -494 1478 17760 10264
4556 10264 -4723 -23175 -24025 -23661 -9705 -1552 2223 -1917 -15311 -21735 -22720 -26789 -30609 -20399
4542 -20399 -2796 9307 7298 9233 17843 22234 13915 4089 364 -10145 -10890 -5393 -4040 1033
4528 1033 -7920 -17201 1324 -4655 -2879 508 5374 5204 9411 -773 -5452 -11110 -1439 4522 -9538
4513 -9538 -19863 -19775 -27806 -21840 -5604 7864 8282 -4917 -3083 8284 9016 -1852 -13335 1256
4499 1256 -593 -21505 -13245 -7980 12029 18022 7148 -2763 -1844 -7317 3450 10630 8698 11074
$$ packed form
4599A738J801k114l696k229j4834K311Q626R054k315P061J1644p037q944p037
4585e971l914J676K855J900r535R119K4643J123j0043j79k1329R52j244J296O865
4570a786L33L779J2463j0077R62n757j1559M907R469K936o164J972J6282p496
4556A0264j4987j8452q50L64J3956Q153L775m140j3394o424r85m069l820J0210
4542b0399J7603J2103k009J935Q610M391q319r826l725j0509p45N497J353N073
4528A033q953r281J8525n979J776L387M866j70M207j0184m679n658R671N961j4060
4513i538j0325Q8q031N966J6236J3468M18j3199J834J1367P32j0868j1483J4591
4499A256j849k0912Q260N265K0009N993j0874r911R19n473J0767P180j932K376
$$ plain form
4485 11074 9315 -5379 -24244 -25349 -26732 -25368 -24763 -24654 -21734 -24349 -4989 -7488 -17443 -19172
4471 -19172 -10320 -8040 -13342 -10204 1913 -4543 -12747 -9854 -4891 -2868 5717 6763 2562 -8296
4457 -8296 -25384 -32603 -27764 -33664 -36330 4831 21809 20852 2878 -17808 -8474 -10933 -16588 -13781
4443 -13781 -14412 -8397 -1928 -3922 -7978 -33806 -53065 -24325 9171 10828 6176 8277 8538 496
4429 496 -3788 -10473 -17689 -11488 -16783 -19548 -19409 -12674 -10639 -19438 -25081 -17870 -6063 2903 -1001
4414 -1001 1041 -1468 -17804 -29531 -26228 -19252 -3362 4984 -4160 -6386 -7890 -8852 -11472 3258
4400 3258 7630 9408 4854 -7638 -2925 892 14371 19115 10361 8592 10918 -8146 -10573 3017
4386 3017 711 3492 -1897 44 5161 5464 -3412 -8590 -5553 1479 4424 -2370 144 -4619 -1881
$$ packed form
4485A1074j759j4694j8865j105j383J364O05J09K920k615J9360k499r955j729
4471a9172Q852K280n302L138J2117o456q204K893M963K023Q585J046m201j0858
4457h296j7088p219M839n900k666M1161J6978r57j7974k0686R334k459n655K807
4443a3781o31O015O469j994m056k5828j9259K8740L3496J657m652K101K61q042
4429D96m284o685p216O201n295k765J39O735K035q799n643P211J1807Q966l904
4414a001K042k509j6336j1727L303O976J5890Q346r144k226j504r62k620J4730
4400C258M372J778m554j2492M713L817J3479M744q754j769K326j9064k427J3590
4386C017k306K781n389J941N117L03q876n178L037P032K945o794K514m763K738
$$ plain form
4371 -1881 -8569 -10696 -20397 -18070 -5572 -1963 3927 8435 4701 -3164 -9992 -19950 -13451 -5423 -15071
4356 -15071 -22728 -17610 -8132 -3059 -10458 -7027 10879 10745 179 7106 4838 2160 -126 -2344
4342 -2344 -1622 -10627 -17367 -14117 -24206 -26900 -19267 -13509 -3563 -745 -60 2527 -5002 -3321 4226
4327 4226 14041 14309 12663 8155 12129 13631 11146 13454 16904 8846 588 -357 -3839 2043 5732
4312 5732 8922 7952 -1421 7397 18360 22851 17011 9802 5859 -2069 -13215 -22976 -24266 -10971
4298 -10971 -17241 -22076 -10354 -4948 -1245 -867 -9734 -18192 -12265 128 14551 7736 85 1886
4284 1886 -9295 -17611 -22174 -1524 12001 15713 11045 -592 2748 -1734 -11806 -12078 -8487 -4158
4270 -4158 10896 11294 11167 18525 26115 18304 9107 -2946 -11746 -13098 -17083 -13381 -15147 -7409 -3706
$$ packed form
4371a881o688k127r701K327J2498L609N890M508l734p865o828r958O499Q028r648
4356a5071p657N118R478N073p399L431J7906j34j0566O927k268k678k286k218
4342b344P22r005o740L250j0089k694P633N758R946K818O85K587p529J681P547
4327D226R815K68j646m508L974J502k485K308L450q058q258r45l482N882L689
4312E732L190r70r373Q818J0963M491n840p209l943p928j1146r761j290J3295
4298a0971o270m835J1722N406L703L78q867q458N927J2393J4423o815p651J801
4284A886j1181q316m563K0650J3525L712m668j1637L340m482j0072k72L591M329
4270d158J5054L98j27P358P590p811r197j2053q800j352l985L702j766P738L703
$$ plain form
4255 -3706 -16076 -26486 -22700 -11594 -19015 -22091 -30068 -23063 -12995 -8277 -4190 -3639 10499 12650
4241 12650 4171 8864 9213 -6961 -11332 -16067 -3073 10886 4241 -6618 -1475 8646 1409 1299
4227 1299 14823 17980 13146 12137 1796 -5297 17765 26061 16012 8211 11930 403 -6169 16263
4213 16263 13900 21142 11045 -8239 -8056 -5763 -10008 -12343 -26383 -14180 -2176 -2144 -6168 -1859
4199 -1859 2764 1083 -10743 -12720 357 2483 -355 -11523 -18887 -7341 -10489 -17315 -18783 -17186
4185 -17186 -6405 480 -3245 -4749 5931 4241 3396 -15008 -20448 -9054 3844 4035 2628 -3371
4171 -3371 -12259 -13766 -8042 -5754 4991 8895 -2871 -11289 963 9197 3216 11506 16352 20824
4157 20824 23457 19552 -6033 -16118 -9231 -13450 -27523 -23626 -22539 -26106 -14107 -9654 -19030 -7468
$$ packed form
4255c706j2370j0410L786J1106p421l076p977P005J0068M718M087N51J4138K151
4241A2650q479M693L49j6174m371m735J2994J3959o645j0859N143J0121p237j10
4227A299J3524L157m834j009j0341p093K3062Q296j0049p801L719j1527o572K2432
4213A6263k363P242j0097j9284J83K293m245k335j4040J2203J2004L2m024M309
4199a859M623j681j1826j977J3077K126k838j1168p364J1546l148o826j468J597
4185a7186J0781O885l725j504J0680j690q45j8404n440J1394J2898J91j407n999
4171c371q888j507N724K288J0745L904j1766q418J2252Q234n981Q290M846M472
4157B0824K633l905k5585j0085O887m219j4073L897J087l567J1999M453r376J1562
$$ plain form
4143 -7468 -13459 -3339 7501 -5192 -28166 -38201 -24565 -11098 -1622 5646 -3 -15144 -20877
4130 -20877 -10616 -13256 -14535 -11972 -1661 2551 235 -4591 -12345 -17500 -17214 -18898 -15040 -7332
4116 -7332 -6587 -19326 -12844 -1945 5825 12889 18780 20058 14874 2322 -19514 -25073 -15551 -9777
4102 -9777 -992 -7818 -6171 4152 9898 1090 -3202 -4745 7882 24263 21186 7579 -1987 -12023
4088 -12023 -19354 -14659 -12527 -10346 -4313 -4246 -3728 6871 10055 5562 9551 11882 4758 7221 5978
4073 5978 -2088 -2809 6883 14070 11641 -4278 -8132 -1400 6443 9325 1273 5547 6281 11883 20550
4058 20550 7679 7032 -914 -12942 -6401 -4601 -19970 -33922 -19982 -9571 -11430 -320 4174
4045 4174 -4561 -9070 -8610 -2422 3580 8242 -507 421 17251 13704 2131 -6263 -9981 -3353 7556
$$ packed form
4143g468n991J0120J0840j2693k2974j0035J3636J3467R476P268n649j5141n733
4130b0877J0261k640j279K563J0311M212k316m826p754n155K86j684L858P708
4116g332P45j2739O482J0899P770P064N891J278n184j2552k1836n559R522N774
4102i777Q785o826J647J0323N746q808m292j543J2627J6381l077j3607r566j0036
4088a2023p331M695K132K181O033O7N18J0599L184m493L989K331p124K463j243
4073E978q066p21R692P187k429j5919l854O732P843K882q052M274P34N602Q667
4058B0550j2871o47p946j2028O541J800j5369j3952J3940J0411j859J1110M494
4045D174q735m509M60O188O002M662q749R28J6830l547j1573q394l718O628J0909
$$ plain form
4030 7556 14605 2246 -14975 -19108 -12379 -589 4328 -5314 -23252 -8593 6930 9076 14657
4017 14657 24219 18394 -7828 -11812 -14261 -25085 -22721 -12641 17575 16707 10338 4498 -9650 -17268
4003 -17268 -18149 -13981 -19422 -17979 -19023 -8844 -2114 -3211 -16103 -18840 -18587 478 7778 3365
3989 3365 -7659 -4957 -2869 -12043 -12034 2503 10049 5235 11774 13809 1609 8044 12538 2343 -1459
3974 -1459 -3972 -7145 -215 -3528 -9844 -19199 -27894 -31779 -22257 563 -2303 -2621 -2363 -5672 -3210
3959 -3210 -3416 -3700 -5489 -11071 -23068 -19521 -7906 -1783 -2537 -15553 -22203 -6193 5060 13097
3945 13097 15447 7300 2365 2929 4308 7012 5717 -8628 -29874 -24109 -6328 932 -163 -14016
3931 -14016 -17326 -15153 -9664 -3392 3876 -5891 -15925 -11790 -3306 -985 -141 -6956 -18361 -4427
$$ packed form
4030G556P049j2359j7221m133O729J1790M917r642j7938J4659J5523K146N581
4017A4657R562n825k6222l984k449j0824K364J0080L0216q68o369n840j4148p618
4003a7268q81M168n441J443j044J0179O730j097j2892k737K53J9065P300m413
3989C365j1024K702K088r174RJ4537P546m814O539K035j2200O435M494j0195l802
3974a459k513l173O930l313o316r355q695l885R522K2820k866l18K58l309K462
3959c210k06k84j789n582j1997L547J1615O123p54j3016o650J6010J1253Q037
3945A3097K350q147m935N64J379K704j295j4345k1246N765J7781P260j095j3853
3931a4016l310K173N489O272P268r767j0034M135Q484K321Q44o815j1405J3934
$$ plain form
3917 -4427 8153 8753 1823 -1409 9666 13160 13870 27438 30042 3324 -11179 311 5784 -3191
3903 -3191 -11325 -5979 135 4813 17025 15113 21047 8268 5284 6943 5379 6254 12473 9802 9177
3888 9177 4619 692 -8340 -7708 -177 792 -3185 -15339 -18338 -21541 -21930 -19559 -19261 -24852 -5186
3873 -5186 -1805 -332 -7762 4597 11835 13678 11467 20310 11402 3612 4979 4133 11212 12456 6860
3858 6860 9253 19250 16753 26111 30780 20203 14429 10424 -5850 -14260 -16402 -14409 -4998 -5677 4309
3843 4309 17322 27691 27618 27489 11821 -3531 -11578 -9412 -6253 -5641 -9354 -16940 -20017 -10148 -1973
3828 -1973 34 -8324 -8166 -20949 -9321 -7772 -7745 -1378 -622 -6720 2656 -1796 -12235 -12929 6108
3813 6108 7981 -1094 -24982 -24083 -5420 -8003 -13477 -9953 -14023 -5605 13923 5706 -17678 -10127
$$ packed form
3917d427J2580O00o930l232J1075L494P10J3568K604k6718j4503J1490N473q975
3903c191q134N346O114M678J2212j912N934j2779k984J659j564Q75O219k671o25
3888I177m558l927r032O32P531R69l977j2154k999l203l89K371K98n591J9666
3873e186L381J473p430J2359P238J843k211Q843q908p790J367q46P079J244n596
3858F860K393R997k497R358M669j0577n774m005j6274q410k142J993R411o79R986
3843D309J3013J0369p3j29j5668j5352q047K166L159O12l713p586l077R869Q175
3828a973K007q358J58j2783J1628J549K7O367P56o098R376m452j0439o94J9037
3813F108J873r075k3888Q99J8663k583n474L524m070Q418J9528q217k3384P551
$$ plain form
3799 -10127 5177 -442 7157 16702 18180 14497 1961 -4976 -25473 -29562 -19189 -15081 -2293
3786 -2293 1227 3910 8747 8517 6228 10118 -227 -5127 -6545 -7361 -5563 4682 3332 -8642 595
3771 595 2828 -7989 -12024 -9594 5261 5556 -11498 -15390 -12478 2279 12493 16444 2873 -10681
3757 -10681 -12499 5426 33109 28465 5614 -16658 -11013 -5271 20091 26724 24188 17356 11596
3744 11596 -3628 -13571 -13608 -10890 -14580 -9986 -9097 362 5634 2846 -5757 -11118 -12370 -10677 -13592
3729 -13592 -5466 -4529 -11 5802 5427 -3761 -7961 -16012 -20325 -30734 -13491 -2749 2581 12978
3715 12978 12138 19101 29403 42939 36621 15978 1479 2952 12422 4874 -1477 -28 -7177 -5290
3701 -5290 2140 4789 1446 -625 10501 19328 15313 25982 32396 22011 18364 5307 1320 -4880
$$ packed form
3799a0127J5304n619P599R545J478l683j2536o937k0497m089J0373M108J2788
3786b293L520K683M837k30k289L890j0345m900j418q16J798J0245j350j1974R237
3771E95K233j0817m035K430J4855K95j7054l892K912J4757J0214L951j3571j3554
3757a0681j818J7925K7683m644k2851k2272N645N742K5362O633k536o832n760
3744A1596j5224r943l7K718l690M594Q89R459N272k788q603n361j252J693k915
3729a3592Q126R37M518N813l75r188m200q051m313j0409J7243J0742N330J0397
3715A2978q40O963J0302J3536o318k0643j4499J473R470p548o351J449p149J887
3701e290P430K649l343k071J1126Q827m015J0669O414j0385l647j3057l987o200
$$ plain form
3687 -4880 -21085 -26432 -20262 -20485 -9910 -11367 -13326 -3105 -1386 4056 4036 8495 19515 12358 11670
3672 11670 5823 1101 508 -9827 -12937 -14567 -18433 -21424 -10212 -1554 5406 6154 -2919 1033 6234
3657 6234 5560 10145 16763 17431 23923 26458 4010 -14330 -23435 -17902 -4377 -9420 -19135 -24924 -30013
3642 -30013 -12288 1652 -11960 -5712 2185 -3137 -12332 -15081 -11207 -3285 5761 4380 -8752 -17369
3628 -17369 -3289 -7735 -11194 -993 3291 -3877 -1778 -3270 1706 3123 -9975 -12526 -5943 -2617
3614 -2617 -8539 -13579 -14280 3121 -1190 -11592 3585 19180 17280 13727 13511 9575 16462 26352
3600 26352 15488 -2544 -12493 -6774 -14057 -7108 18 314 6481 14385 8438 -4092 -178 25070
3586 25070 23191 25137 16005 1370 -2931 1337 18417 30099 29750 21784 11375 935 14460
$$ packed form
3687d880j6205n347O170k23J0575j457j959J0221J719N442k0M459J1020p157o88
3672A1670n847m722n93j0335l110j630l866k991J1212Q658O960P48r073L952N201
3657F234o74M585O618O68O492K535k2448j8340r105N533J3525n043r715n789n089
3642c0013J7725J3940j3612O248P897n322r195k749L874P922R046j381j3132q617
3628a7369J4080m446l459J0201M284p168K099j492M976J417j3098k551O583L326
3614b617n922n040p01J7401m311j0402J5177J5595j900l553k16l936O887R890
3600B6352j0864j8032r949N719p283O949P126K96O167P904n947j2530L914K5248
3586B5070j879J946r132j4635m301M268J7080J1682l49p966j0409j0440J3525
$$ plain form
3573 14460 14212 10418 9014 1421 3305 8254 6793 9552 9264 7336 7861 -4561 -13026 -3574 3516
3558 3516 3400 8152 11563 10587 16662 20505 20647 12418 9173 13115 21247 9811 -4381 -1226 -4332
3543 -4332 -7616 -230 -6598 -15535 -22106 -19395 -11223 -752 -3469 -11444 -7370 12287 19538 16667
3529 16667 8409 4464 3018 -9233 -16384 -7706 6311 14781 18153 -7693 -17850 896 11473
3516 11473 5407 -5534 -2942 743 2543 13136 13383 18434 9385 3100 3889 8317 16569 18513 25860
3501 25860 26043 24149 377 -8782 -4851 2220 4767 -4731 -16665 -11568 -8001 -6757 -11866 -8593
3487 -8593 -1365 -9068 -16410 -8249 3379 -3188 -5490 4782 8629 -6545 -10758 -7203 -17704 -7351
3473 -7351 -5137 -4977 7234 7602 6919 3214 5043 1646 -10152 -22790 -22097 -17317 -20923 -22516 -18981
$$ packed form
3573A4460k48l794j404p593J884M949j461K759k88j928N25j2422q465R452P090
3558C516j16M752L411r76O075L843J42q229l245L942Q132j1436j4192L155l106
3543d332l284P386o368q937o571K711Q172J0471k717p975M074J9657P251k871
3529A6667q258l945j446j2251p151Q678J4017Q470L372k5846j0157J8746J0577
3516A1473o066j0941K592L685J800J0593K47N051r049o285P89M428Q252J944P347
3501B5860J83j894k3772r159L931P071K547r498j1934N097L567J244n109L273
3487h593P228p703p342Q161J1628o567k302J0272L847j5174m213L555j0501J0353
3473g351K214J60J2211L68o83l705J829l397j1798j2638O93M780l606j593L535
$$ plain form
3458 -18981 -9996 -7547 9154 22461 5580 -2130 -5573 -4320 -3976 -9066 -5429 1984 -2085 6159
3444 6159 19667 21192 4812 -661 -19589 -28502 -30635 -26483 -7810 5099 -2551 -13015 -7762
3431 -7762 6556 2587 143 2356 819 11009 11600 -3030 -16154 -7485 4601 6732 2820 -5725
3417 -5725 -7832 4460 17407 14149 3212 -14694 -11494 -10847 -13196 -20798 -17445 2551 6489 -6248
3403 -6248 -29483 -24255 -15192 -1576 -4038 -17979 -16269 -3888 12177 14664 17387 13450 7
3390 7 -6780 -18216 -21725 -9566 -5019 -33 5918 18165 20389 11729 15059 15466 10617 9241 18378
3375 18378 6218 -12650 -17905 -16525 -26312 -24029 -24669 -28415 -16126 1536 -2952 -14828 2152
3362 2152 17286 24501 13102 11309 14650 15816 8355 4948 4054 12980 21750 13063 12110 2945 -6919
$$ packed form
3458a8981Q985K449J6701J3307j6881p710l443J253L44n090L637P413m069Q244
3444F159J3508J525j6380n473j8928q913k133M152J8673J2909p650j0464N253
3431g762J4318l969k444K213j537J0190N91j4630j3124Q669J2086K131l912q545
3417e725k107J2292J2947l258j0937j7906L200O47k349p602L353J9996L938j2737
3403f248k3235N228R063J3616k462j3941J710J2381J6065K487K723l937j3443
3390Go787j1436l509J2159M547M986N951J2247K224q660L330M07m849j376R137
3375A8378j2160j8868n255J380r787K283o40l746J2289J7662m488j1876J6980
3362B152J5134P215j1399j793L341J166p461l407q94Q926Q770q687r53r165r864
$$ plain form
3347 -6919 -1973 3783 -8473 6745 252 -6603 -3162 1377 15722 10715 6939 14176 8226 10495
3333 10495 19462 15445 8164 2846 3780 7954 18483 17758 19874 23592 17172 2208 -10691 -8944
3319 -8944 2673 -2067 5034 -1286 -8466 -9309 -1873 -4613 -8883 -12473 -5583 -7066 -6809 -3096 -13889
3304 -13889 -12745 -8159 -11859 -11996 -17858 -15266 -4710 -6088 -101 9991 22081 39493 38245 36199
3290 36199 6467 -10190 -9131 -20392 -25237 -3413 4443 2274 1077 9354 11918 5872 8007 14675
3276 14675 11011 3201 2336 368 -4115 -10338 -8931 -10429 -16951 -12750 1563 -2610 -10262 -15987 -11936
3261 -11936 -13095 -16957 -3613 1154 3031 -10420 -27459 -23401 -18609 -12816 -6194 -5030 -10567 -4682
3247 -4682 8805 13071 860 -11740 -11415 -474 -9056 -13276 6812 11904 2150 -1063 -3277 -14077
$$ packed form
3347f919M946N756j2256J5218o493o855L441M539J4345n007l776P237n950K269
3333A0495Q967m017p281n318R34M174J0529p25K116L718o420j4964j2899J747
3319h944J1617m740P101o320p180q43P436k740m270l590O890j483K57L713j0793
3304a3889J144M586l700j37n862K592J0556j378N987J0092J2090J7412j248k046
3290C6199k9732j6657J059j1261m845K1824P856k169j197Q277K564o046K135O668
3276A4675l664p810q65j968m483o223J407j498o522M201J4313m173p652n725M051
3261a1936j159l862J3344M767J877j3451j7039M058M792N793O622J164n537N885
3247d682J3487M266j2211j2600L25J0941q582m220K0088N092r754l213k214j0800
$$ plain form
3233 -14077 -23520 -12220 -6266 -10482 -666 -5457 6822 9676 -437 -3600 -6256 2029 10199 2048
3219 2048 -9050 -9511 -12435 845 1580 10548 16765 5558 1193 5648 13876 18555 3341 -8837
3205 -8837 -9242 -19624 -29654 -16759 -5699 5691 11681 6293 -11925 -16116 -13160 -4888 776 8641
3191 8641 1268 -10604 -10449 -11896 -5614 -8680 -6816 -13356 -8590 1293 -1693 -596 -4236 -2763 1248
3176 1248 1675 4291 23580 30404 24223 21423 22040 19358 10748 9725 9018 10691 9914 11301 9540 1180
3160 1180 -6061 -3676 -12030 -16660 -13102 -19516 -13518 5627 17917 14437 7724 10456 16887 20079
3146 20079 16170 6587 4185 -767 -10451 219 -9029 -17391 -15221 -13848 560 7904 -7118 -3896
3132 -3896 17675 29710 13049 4326 -2268 3174 17297 3282 -6716 -2516 12774 8419 16664
$$ packed form
3233a4077r443J1300N954m216R816m791J2279K854j0113l163k656Q285Q170q151
3219B048j1098m61k924J3280P35Q968O217j1207m365M455Q228M679j5214j2178
3205h837m05j0382j0030J2895J1060J1390N990n388j8218m191K956Q272N664P865
3191H641p373j1872J55j447O282l066J864o540M766R883k986J097l640J473M011
3176A248M27K616J9289O824o181k800O17k682q610j023p07J673p77J387j761q360
3160A180p241K385q354m630L558o414N998J9145J2290l480o713K732O431L192
3146B0079l909r583k402m952r684J0670r248q362K170J373J4408P344j5022L222
3132c896K1571J2035j6661q723o594N442J4123j4015r998M200J5290m355Q245
$$ plain form
3119 16664 26908 4532 2653 865 958 6105 -4876 -5666 2870 -4594 -15582 -11804 -5460 -10526
3105 -10526 -1699 -11687 -22480 -22166 -10325 -1099 5239 18099 15005 3733 -1687 7707 9604 -499
3091 -499 9707 7571 -3415 7978 8724 16008 10726 1816 2865 3570 7458 14723 7558 -2068 -3184
3076 -3184 -3072 -2905 -8420 -4316 -2376 -6766 -13056 -8967 5302 5139 -9800 -11200 -13463 -8116 -4112
3061 -4112 -1715 -6964 -6653 -3611 -9457 -15274 -25797 -21701 -14594 4970 15403 17600 9663 -2852
3047 -2852 -50 -671 4140 11158 5775 -11053 -11282 482 -4293 -13692 -23023 -13781 -3505 2823 2776
3032 2776 5547 23474 21320 12901 10089 5910 5363 -682 -2744 2036 -2034 -3997 9356 16890 12608
3017 12608 2736 -6616 -10192 4272 3785 -13054 -18087 -18814 -12446 -7481 -9690 -2866 -1238 -9120 -9039
$$ packed form
3119A6664J0244k2376j879j788R3N147j0981p90Q536p464j0988L778O344n066
3105a0526Q827r988j0793L14J1841R226O338J2860l094j1272n420R394J897j0103
3091d99J0206k136j0986J1393P46P284n282q910J049P05L888P265p165r626j116
3076c184J12J67n515M104J940m390o290M089J4269j63j4939j400k263N347M004
3061d112K397n249L11L042n846n817j0523M096P107J9564J0433K197p937j2515
3047b852K802o21M811P018n383j6828k29J1764m775r399r331R242J0276O328m7
3032B776K771J7927k154q419k812m179n47o045k062M780m070j963J3353P534m282
3017A2608r872r352l576J4464m87j6839n033p27O368M965k209O824J628p882Q1
$$ plain form
3002 -9039 -3902 -6143 1442 -1931 3465 9370 17935 8444 -10205 6321 17973 10673 4116 474
2988 474 12618 28304 28171 28787 26411 22482 13084 4442 -10199 -3025 -10756 -8515 -2326 -5987 3130
2973 3130 5755 9189 2278 -1231 -14086 -9895 -6988 -3949 -3952 3768 13790 25822 16766 8598 6446
2958 6446 2319 8449 -6764 5731 21829 17459 6891 -3271 -9604 -5583 13993 22822 19585
2945 19585 9216 10030 18648 19702 21099 10522 -2002 -12705 -7142 8962 19872 20083 -3166
2932 -3166 -3959 -1895 -7470 -467 10686 2829 -11089 -14857 -8172 2149 4463 11649 19443 17481
2918 17481 -2922 -6459 3668 18705 23124 7947 2278 5322 -1158 -8618 -17145 -21491 -18994 -17902
2904 -17902 -21795 -23904 -6922 -10968 -24304 -15057 -16967 -23713 -28405 -26729 -17672 5663 30590 29586
$$ packed form
3002i039N137k241P585l373N396N905Q565r491j8649J6526J1652p300o557l642
2988D74J2144J5686j33O16k376l929r398q642j4641P174p731K241O189l661R117
2973C130K625L434o911l509j2855M191K907L039lP720J0022J2032r056q168k152
2958F446m127O130j5213J2495J6098m370j0568j0162o333M021J9576Q829l237
2945A9585j0369Q14Q618J054J397j0577j2524j0703N563J6104J0910K11k3249
2932c166p93K064n575P003J1153p857j3918l768O685J0321K314P186P794j962
2918A7481k0403l537J0127J5037M419j5177n669L044o480p460q527m346K497J092
2904a7902l893k109J6982m046j3336R247j910o746m692J676R057K3335K4927j004
$$ plain form
2890 29586 4489 -137 5008 9960 4223 5036 -1926 275 6769 16504 19654 18789 14124 4955 10189
2875 10189 11128 9137 16074 26902 27096 8740 -6740 -6734 -2546 5199 6126 6054 7893 -13810 -8049 1206
2859 1206 7888 12803 -7020 -10362 -5416 4824 7209 2656 -10894 -19802 -3360 10594 15496 24751
2845 24751 23857 17775 13109 9619 -3032 -4078 -13011 70 12977 17902 17420 21370 16971 18945
2831 18945 21156 10461 7480 7125 -3479 -17597 -12997 -3403 -1045 -4070 -2008 -2014 -7131 -9787 -3482
2816 -3482 -1743 -20808 -39400 -24382 -13513 -8733 -13131 -6557 -4312 -8027 -8452 -17652 -29156 -25535
2802 -25535 -13470 4903 13098 20220 16236 -11993 -24738 -21062 -7124 2757 2419 -3966 1646 14820
2788 14820 7265 7365 18149 13437 -2539 -12284 -15836 -10802 -12642 -9315 -390 -7977 -19331 1389
$$ packed form
2890B9586k5097m626N145M952n737Q13o962K201O494R735L150q65m665r169N234
2875A0189R39j991O937J0828J94j8356j5480OM188P745R27p2J839k1703N761R255
2859A206O682M915j9823l342M946J0240K385m553j3550q908J6442J3954M902R255
2845B4751q94o082m666l490j2651j046q933J3081J2907M925m82L950m399J974
2831A8945K211j0695k981l55j0604j4118M600R594K358l025K062on117k656O305
2816c482J739j9065j8592J5018J0869M780m398O574K245l715m25r200j1504L621
2802b5535J2065J8373Q195P122l984k8229j2745L676J3938R881l38o385N612J3174
2788A4820p555J00J0784m712j5976r745l552N034j840L327Q925p587j1354K0720
$$ plain form
2774 1389 1045 6040 12640 -1078 -11419 -11742 2289 4897 -1304 9814 25355 24324 18191 623
2760 623 -788 1161 -1821 9072 14807 246 -8478 -9665 -4665 -13314 -10827 -12993 -18404 -11473 8509
2745 8509 10772 -2967 -273 1034 -12207 -13110 -22077 -13428 -8028 9062 16514 15111 6120 10296
2731 10296 16375 14439 996 5503 10952 -2794 -1250 12538 23408 24076 21591 7724 -11720
2718 -11720 -2113 11082 3924 -4388 -1430 909 -1517 7678 9919 15521 16986 18793 16662 15933 8511
2703 8511 5833 19180 15052 17668 12984 7926 1161 2335 3421 4850 -4026 -10010 -14007 -3130
2689 -3130 6565 3649 14522 29208 30882 24837 10129 -1321 1936 14235 13764 3202 857 328
2675 328 -10724 -21887 -16540 -21662 -16869 -10662 -3875 -6445 -26344 -25126 -14029 -6924 5637 31105
$$ packed form
2774A389l44M995O600j3718j0341l23J4031K608o201J1118J5541j031o133j7568
2760F23j411J949k982J0893N735j4561q724j187N000q649K487k166n411O931J9982
2745H509K263j3739K694J307j3241r03q967Q649N400J7090P452j403q991M176
2731A0296O079j936j3443M507N449j3746J544J3788J0870O68k485j3867j9444
2718a1720R607J3195p158q312K958K339k426R195K241N602J465J807k131p29p422
2703H511k678J3347m128K616m684n058o765J174J086J429q876n984l997J0877
2689c130R695k916J0873J4686J674o045j4708j1450L257J2299m71j0562k345n29
2675C28j1052j1163N347n122M793O207O787k570j9899J218J1097P105J2561K5468
$$ plain form
2661 31105 30957 28139 13933 -5144 -15138 -25970 -20248 -9303 -9859 -13234 -9576 -1692 10313 5965
2647 5965 -11450 -6612 2143 1082 1402 2591 11009 8721 7450 2030 5217 -1056 -2139 -1902 -3948
2632 -3948 6433 3627 -4957 -5137 5612 3677 -3497 -11820 -13236 -12106 -6393 -3292 -8079 -14106 -20005
2617 -20005 -21061 -7453 551 -1115 -9825 -11362 559 4563 3879 5898 -456 -16432 -17167 -12900
2603 -12900 -20935 -27320 -25455 -11926 -8959 -14526 -8673 -68 -189 8610 -4853 -9986 -9938 -11765 -5066
2588 -5066 -2107 3750 6799 9569 5994 3562 4411 -775 1194 2950 5899 15661 14379 13151 4057
2573 4057 -3846 -11712 -10504 -2205 -6046 3690 7951 10032 -471 -10834 -16749 -10963 -11282 -7443 -631
2558 -631 -450 1796 -5717 -18004 -21535 -11647 -11668 5067 5442 -3827 3685 -5826 -9948 -20939 -19968 -329
$$ packed form
2661C1105j48k818j4206j9077r994j0832N722J0945n56l375L658P884J2005m348
2647E965j7415M838Q755j061L20J189Q418k288j271n420L187o273j083K37k046
2632c948J0381k806q584j80J0749j935p174q323j416J130N713L101m787o027n899
2617b0005j056J3608Q004j666q710j537J1921M004o84K019o354j5976p35M267
2603a2900q035o385J865J3529K967n567N853Q605j21Q799j3463n133M8j827O699
2588e066K959N857L049K770l575k432Q49n186J969J756K949R762j282j228r094
2573D057p903p866J208Q299l841R736M261K081j0503j0363n915N786l19L839O812
2558f31J81K246p513j2287l531R888k1J6735L75r269P512r511m122j0991R71J9639
$$ plain form
2542 -329 1125 2014 -1670 -5553 -21972 -20403 -6636 -6757 -15798 -9858 4629 -5413 -15350 -18421 -16452
2527 -16452 -14541 -8611 -14896 -14321 177 -3864 -5105 -1714 -1226 -6087 -11487 -1424 10047 -444
2513 -444 -8920 -3446 11714 14900 -6422 -9060 791 -3616 -9325 -18188 -11055 -4221 -16515 -21696
2499 -21696 -7554 4256 2676 -690 -9881 -5386 -5556 -11787 -5374 10465 9462 8525 20270 35082
2485 35082 26341 -8568 -11538 10613 18139 14775 4238 -5282 -2880 -10221 -5899 1026 11494 9816
2471 9816 9885 12831 17547 6210 5729 21027 6375 16029 19297 8143 17786 8894 -5739 2461
2457 2461 10521 5071 16428 9646 14450 14503 9317 13105 -3387 -2835 -1866 -2838 -4912 -2183 -2520 9115
2441 9115 15708 17790 19168 23208 12507 278 -9518 -18879 -15827 -2867 113 -14705 -15134 -9098
$$ packed form
2542c29J454Q89l684l883j6419J569J3767j21r041N940J4487j0042r937l071J969
2527a6452J911N930o285N75J4498m041j241L391M88m861n400J0063J1471j0491
2513d44q476N474J5160L186k1322k638R851m407n709q863P133O834j2294n181
2499b1696J4142J1810j580l366r191M495j70o231O413J5839j003r37J1745J4812
2485C5082q741l4909k970K2151P526l364j0537r520K402p341M322O925J0468j678
2471I816O9K946M716j1337m81J5298j4652R654L268j1154R643q892j4633Q200
2457B461Q060n450J1357o782M804N3n186L788j6492N52R69r72k074K729l37J1635
2441I115O593K082J378M040j0701j2229r796r361L052J2960K980j4818m29O036
$$ [...]
##END NTUPLES=NMR SPECTRUM
##END=
