##TITLE=Analysis number 321547
Compound Code cc 30904
Book Reference 458/182
Project Code adrs
Chemist Name stevem
##JCAMPDX= 6.0         $$ Bruker NMR JCAMP-DX V2.0
##DATA TYPE= NMR SPECTRUM
##DATA CLASS= NTUPLES
##ORIGIN= Bruker BioSpin GmbH
##OWNER= nmr
$$ XWIN-NMR		Version 3.5
$$ Wed Aug 16 09:49:41 2006 GMT Daylight Time (UT+1h)  MAYBRIDGE\nmr@NMR_250MHZ
##.OBSERVE FREQUENCY= 250.131544655141
##.OBSERVE NUCLEUS= ^1H
##.ACQUISITION MODE= SIMULTANEOUS (DQD)
##.ACQUISITION SCHEME= undefined
##.AVERAGES= 16
##.DIGITISER RES= 18
##SPECTROMETER/DATA SYSTEM= dpx250
##.PULSE SEQUENCE= zg30
##.SOLVENT NAME= CDCl3
##.SHIFT REFERENCE= (INTERNAL, CDCl3, 0, 16.522)
##AUDIT TRAIL= $$ (NUMBER, WHEN, WHO, WHERE, WHAT)
$$ ##TITLE= Audit trail, XWIN-NMR		Version 3.5
$$ ##JCAMPDX= 5.01
$$ ##ORIGIN= Bruker BioSpin GmbH
$$ ##OWNER= nmr
$$ C:\u/data/dgb/nmr/ADRS/970/pdata/1/auditp.txt
$$ ##AUDIT TRAIL=  $$ (NUMBER, WHEN, WHO, WHERE, WHAT)
(   1,<2006-08-16 09:49:16.76 +100>,<MAYBRIDGE\nmr>,<NMR_250MHZ>,
      <created by zg, POWCHK disabled, PULCHK disabled
       configuration hash MD5:
       E2 DF 36 D8 04 B2 41 60 5A D7 A3 38 5A 4B D0 FE
       data hash MD5: 64K
       2E CC 74 7A 97 DD D8 4E 55 C4 9D 23 31 01 44 C5>)
(   2,<2006-08-16 09:49:30.63 +100>,<MAYBRIDGE\nmr>,<NMR_250MHZ>,
      <Start of raw data processing
       ef LB = 0.3 FT_mod = 6 PKNL = 1 SI = 32K 
       data hash MD5: 32K
       00 CA 88 64 87 D5 4D E1 19 BF FC 35 8B 58 0A 29>)
(   3,<2006-08-16 09:49:32.19 +100>,<MAYBRIDGE\nmr>,<NMR_250MHZ>,
      <apk 
       data hash MD5: 32K
       32 B8 6D 4F 61 B6 DD 1E DC 0D B8 CD 6A 76 54 5E>)
(   4,<2006-08-16 09:49:33.01 +100>,<MAYBRIDGE\nmr>,<NMR_250MHZ>,
      <abs ABSG = 5 
       data hash MD5: 32K
       AC A0 5F EE A2 66 DA 33 B7 E1 9C 79 5D 50 57 C8>)
$$ ##END=
$$ 
$$ hash MD5
$$ 89 B3 5A 66 09 50 2F 81 95 EE 9E FE 88 65 A2 D7
##$RELAX= 
##$RELAX= 
##$RELAX= 
##$RELAX= 
##$RELAX= 
##$RELAX= 
##$RELAX= 
$$ Bruker specific parameters
$$ --------------------------
##$DU= <C:\u>
##$EXPNO= 970
##$NAME= <ADRS>
##$PROCNO= 1
##$TYPE= <nmr>
##$USER= <dgb>
##$AMP= (0..31)
100 100 100 100 100 100 100 100 100 100 100 100 100 100 100 100 100 100 
100 100 100 100 100 100 100 100 100 100 100 100 100 100 
##$AQSEQ= 0
##$AQ_mod= 3
##$AUNM= <au_zg>
##$AUTOPOS= <5 >
##$BF1= 250.13
##$BF2= 250.13
##$BF3= 250.13
##$BF4= 250.13
##$BF5= 500.13
##$BF6= 500.13
##$BF7= 500.13
##$BF8= 500.13
##$BYTORDA= 1
##$CFDGTYP= 0
##$CFRGTYP= 5
##$CHEMSTR= <none>
##$CNST= (0..31)
1 1 145 1 1 1 1 1 1 1 1 1 1 1 1 1 1 1 1 1 1 1 1 1 1 1 1 1 1 1 1 1 
##$CPDPRG= <>
##$CPDPRG1= <>
##$CPDPRG2= <>
##$CPDPRG3= <>
##$CPDPRG4= <mlev>
##$CPDPRG5= <mlev>
##$CPDPRG6= <mlev>
##$CPDPRG7= <mlev>
##$CPDPRG8= <mlev>
##$CPDPRGB= <>
##$CPDPRGT= <>
##$D= (0..31)
0 1 0 0 0 0 0 0 0 0.06 0 0 0 0 0 0 0.0002 0 0 0 0 0 0 0 0 0 0 0 0 0 0 
0 
##$DATE= 1155718155
##$DBL= (0..7)
120 120 120 120 120 120 120 120 
##$DBP= (0..7)
150 150 150 150 150 150 150 150 
##$DBP07= 0
##$DBPNAM0= <>
##$DBPNAM1= <>
$$ [...]
##$SUBNAM7= <"">
##$SUBNAM8= <"">
##$SUBNAM9= <"">
##$SW= 20.6930455092707
##$SWIBOX= (0..15)
0 0 3 0 0 0 0 0 0 0 0 0 0 0 0 0 
##$SW_h= 5175.983436853
##$TD= 65536
##$TD0= 1
##$TE= 295.16
##$TE2= 300
##$TE3= 300
##$TEG= 300
##$TL= (0..7)
0 120 120 120 120 120 120 120 
##$TP= (0..7)
150 150 150 150 150 150 150 150 
##$TP07= 0
##$TPNAME0= <>
##$TPNAME1= <>
##$TPNAME2= <>
##$TPNAME3= <>
##$TPNAME4= <>
##$TPNAME5= <>
##$TPNAME6= <>
##$TPNAME7= <>
##$TPOAL= (0..7)
0.5 0.5 0.5 0.5 0.5 0.5 0.5 0.5 
##$TPOFFS= (0..7)
0 0 0 0 0 0 0 0 
##$TUNHIN= 0
##$TUNHOUT= 0
##$TUNXOUT= 0
##$USERA1= <user>
##$USERA2= <user>
##$USERA3= <user>
##$USERA4= <user>
##$USERA5= <user>
##$V9= 5
##$VALIST= <valist>
##$VCLIST= <CCCCCCCCCCCCCCC>
##$VD= 0
##$VDLIST= <DDDDDDDDDDDDDDD>
##$VPLIST= <PPPPPPPPPPPPPPP>
##$VTLIST= <TTTTTTTTTTTTTTT>
##$WBST= 1024
##$WBSW= 4
##$XGAIN= (0..3)
0 0 0 0 
##$XL= 0
##$YL= 0
##$YMAX_a= 404708
##$YMIN_a= -467176
##$ZGOPTNS= <>
##$ZL1= 120
##$ZL2= 120
##$ZL3= 120
##$ZL4= 120
##$ABSF1= 16.522
##$ABSF2= -4.171173
##$ABSG= 5
##$ABSL= 3
##$ALPHA= 0
##$AQORDER= 0
##$ASSFAC= 0
##$ASSFACI= 0
##$ASSFACX= 0
##$ASSWID= 0
##$AUNMP= <proc_1d>
##$AZFE= 0.1
##$AZFW= 0.1
##$BCFW= 0
##$BC_mod= 0
##$BYTORDP= 0
##$COROFFS= 0
##$CY= 12.5
##$DATMOD= 1
##$DC= 0
##$DFILT= <>
##$DTYPP= 0
##$F1P= 14.0000005364418
##$F2P= -0.99999901652339
##$FCOR= 0.5
##$FTSIZE= 32768
##$FT_mod= 6
##$GAMMA= 0
##$GB= 0
##$INTBC= 1
##$INTSCL= 1
##$ISEN= 128
##$LB= 0.3
##$LEV0= 0
##$LPBIN= 0
##$MAXI= 10000
##$MC2= 0
##$MEAN= 0
##$ME_mod= 0
##$MI= 0
##$NCOEF= 0
##$NC_proc= -4
##$NLEV= 6
##$NOISF1= 0
##$NOISF2= 0
##$NSP= 0
##$NTH_PI= 0
##$NZP= 0
##$OFFSET= 16.522
##$PC= 1
##$PHC0= 153.6033
##$PHC1= 8.590362
##$PH_mod= 1
##$PKNL= yes
##$PPARMOD= 0
##$PSCAL= 4
##$PSIGN= 0
##$REVERSE= no
##$SF= 250.13
##$SI= 32768
##$SIGF1= 0
##$SIGF2= 0
##$SINO= 400
##$SIOLD= 32768
##$SREGLST= <1H.CDCl3>
##$SSB= 0
##$STSI= 32768
##$STSR= 0
##$SW_p= 5175.98343685301
##$SYMM= 0
##$S_DEV= 0
##$TDeff= 65536
##$TDoff= 0
##$TI= <Analysis number 999999
Compound Code 99
Book Reference 9
Project Code 9>
##$TILT= no
##$TM1= 0
##$TM2= 0
##$TOPLEV= 0
##$USERP1= <user>
##$USERP2= <user>
##$USERP3= <user>
##$USERP4= <user>
##$USERP5= <user>
##$WDW= 1
##$XDIM= 32768
##$YMAX_p= 453206664
##$YMIN_p= -516188
$$ End of Bruker specific parameters
$$ ---------------------------------
##NTUPLES= NMR SPECTRUM
##VAR_NAME=  FREQUENCY,     SPECTRUM/REAL,   SPECTRUM/IMAG
##SYMBOL=    X,             R,               I
##VAR_TYPE=  INDEPENDENT,   DEPENDENT,       DEPENDENT
##VAR_FORM=  AFFN,          ASDF,            ASDF
##VAR_DIM=   32768,         32768,           32768
##UNITS=     HZ,            ARBITRARY UNITS, ARBITRARY UNITS
##FACTOR=    0.157963299565203, 1,           1
##FIRST=     4132.6476996994, 0,             0
##LAST=      -1043.33573715361, 0,           0
##MIN=       -1043.33573715361, -516188,     0
##MAX=       4132.6476996994, 453206664,     0
$$ Real data points
##PAGE= N=1
##DATA TABLE= (X++(R..R)), XYDATA
$$ [...]
$$ plain form
28245 20539 5477 -10967 -84989 -150875 -286186 -176323 -64811 -52259 -41285 55361 77946
28234 77946 72072 -38403 -106759 -136700 -80852 -37110 -15016 -81909 -75601 -12850 -85467 -126466
28222 -126466 -185240 -90085 -42628 -33234 -37537 -127647 -37712 -10116 -43235 120098 189530 51738
28210 51738 20204 71334 54208 93901 95026 40060 128625 223477 127060 34130 3706 49779
28198 49779 900 -3046 78653 72998 45940 182376 44364 -53148 -77931 19079 54834 55455
28186 55455 -8531 3373 100248 93947 111234 147560 170887 97179 84843 63979 114439 118700
28174 118700 -1862 -11361 -54520 -17195 1915 -56504 -28486 78819 94408 87754 25428
28163 25428 123875 109167 65612 77903 48204 25165 127321 178343 256185 299900 247672
$$ packed form
28245B0539j5062j6444p4022o5886j35311J09863J11512J2552J0974R6646K2585
28234G7946n874j10475o8356k9941N5848M3742K2094o6893O308O2751p2617m0999
28222a26466n8774R5155M7457R394m303r0110Q9935K7596l3119J63333O9432j37792
28210E1738l1534N1130j7126L9693J125n4966Q8565R4852r6417r2930l0424M6073
28198D9779m8879l946Q1699n655k7058J36436j38012r7512k4783R7010L5755O21
28186E5455o3986J1904R6875o301J7287L6326K3327p3708j2336k0864N0460M261
28174A18700j20562r499m3159L7325J9110n8419K8018J07305J5589o654o2326
28163B5428R8447j4708m3555J2291k9699k3039J02156N1022P7842M3715n2228
$$ plain form
28152 247672 246738 169344 228687 251781 271811 355601 324325 242594 72377 25186 75663 85881
28140 85881 -834 -17491 31499 -138854 -251099 -243095 -125392 -31345 37304 -38171 -114294
28129 -114294 -14484 76316 70260 70277 39381 -47077 -80981 -17140 77457 107111 141903 89087
28117 89087 52798 -46403 -28092 -89979 -25077 -21200 39881 186650 173529 161067 94629 27947
28105 27947 2516 -18354 -117623 -131252 -55217 31216 68866 97431 147459 184597 135476 60072
28093 60072 85472 103998 205412 192009 41907 -48135 -102449 -132362 -181503 -189277 -68803
28082 -68803 -67839 -77169 -41394 -35607 846 44115 -28292 -5601 55009 -52032 -62583 -50720
28070 -50720 -11569 54387 2849 -45920 -53781 -4386 136792 232249 98890 -29171 -110797
$$ packed form
28152B47672r34p7394N9343K3094K0030Q3790l1276q1731j70217m7191N0477J0218
28140H5881q6715j6657M8990j70353j12245Q004J17703R4047O8649p5475p6123
28129a14294R9810R0800o056J7l0896q6458l3904O3841R4597K9654L4792n2816
28117H9087l6289r9201J8311o1887O4902L877O1081J46769j3121j2462o6438o6682
28105B7947k5431k0870r9269j3629P6035Q6433L7650K8565N0028L7138m9121p5404
28093F0072K5400J8526J01414j3403j50102r0042n4314k9913m9141p774J20474
28082f8803R64r330L5775N787L6453M3269p2407K2691O0610j07041j0551J1863
28070e0720L9151O5956n1538m8769p861M9395J41178R5457j33359j28061q1626
$$ plain form
28059 -110797 -42848 -26765 -28399 -49695 -100691 -137592 -163474 -30988 35536 22394 33074
28048 33074 -27119 -112377 -125659 -22823 -95184 -26377 15550 -30964 8255 16912 -50710 -69617
28036 -69617 -26056 -9773 -3697 32030 99129 91104 124214 136495 144844 89655 -50935 -67444
28024 -67444 -25923 -72721 -85636 -89663 -157749 -57946 130870 206026 136516 222305 187178 71191
28012 71191 -6662 -105728 12058 61381 -57370 -68812 -5171 -20532 -170402 -116587 182037
28001 182037 252442 161022 -94667 -146245 -97836 -1474 28917 19978 -58978 -55884 88440
27990 88440 90100 -2941 14593 131184 132532 -35087 -29291 12044 86232 101281 196751 254576
27978 254576 262171 222830 143201 161989 133555 17282 -109868 -116515 -66522 -81712 -122490
$$ packed form
28059a10797O7949J6083j634k1296n0996l6901k5882J32486O6524j3142J0680
28048C3074o0193q5258j3282J02836p2361O8807M1927m6514L9219Q657o7622j8907
28036f9617M3561J6283O076L5727O7099q025L3110J2281Q349n5189j40590j6509
28024f7444M1521m6798j2915m027o8086R9803J88816P5156o9510Q5789l5127j15987
28012G1191p7853r9066J17786M9323j18751j1442O3641j5361j49870N3815K98624
28001A82037P0405r1420k55689n1578M8409R6362L0391q939p8956L094J44324
27990H8440J660r3041J7534J16591J348j67619N796M1335P4188J5049R5470N7825
27978B54576P595l9341p9629J8788k8434j16273j27150o647M9993j5190m0778
$$ plain form
27967 -122490 -128839 -9726 93620 95353 116131 135299 167752 78982 107777 128156 84909
27956 84909 98190 98305 4359 -108282 -157511 -159851 -175445 -53428 46491 36963 112980 48278
27944 48278 -54735 -36851 -46613 -33370 38052 22042 100819 133681 102023 35351 32729 -59778
27932 -59778 -248964 -204997 -160614 -109244 -107204 -186251 -174117 -30847 -21323 -143271 -129623
27921 -129623 38822 24865 -3237 -128256 -46884 64504 54949 2699 -27307 34474 154467
27910 154467 126482 -18986 2728 19558 -11221 -12317 129391 199405 220941 209334 77257
27899 77257 74428 50962 91613 50615 35006 47430 61205 149771 241608 137045 19068
27888 19068 16486 59465 81046 -4401 23161 2318 -90824 -72928 -3991 -6375 -119297 -41305
$$ packed form
27967a22490o349J19113J03346J733K0778J9168L2453q8770K8795K0379m3247
27956H4909J3281J15r3946j12641m9229k340j5594J22017R9919r528P6017o4702
27944D8278j03013J7884r762J3243P1422j6010P8777L2862l1658o6672k622r2507
27932e9778j89186M3967M4383N1370K040p9047J2134J43270R524j21948J3648
27921a29623J68445j3957k8102j25019Q1372J11388r555n2250l0006O1781J19993
27910A54467k7985j45468K1714J6830l0779j096J41708P0014K1536j1607j32077
27899G7257k829k3466M0651m0998j5609J2424J3775Q8566R1837j04563j17977
27888A9068k582M2979K1581q5447K7562k0843r3142J7896O8937k384j12922P7992
$$ plain form
27876 -41305 64360 238048 274384 214031 76200 30376 -36800 -101911 -145914 -189288 -107322
27865 -107322 59733 102992 111072 137127 44774 -128 106834 47028 9942 75546 69977
27854 69977 27806 50073 232392 256703 126947 85827 41653 -44839 -38707 10501 63020
27843 63020 49437 23240 93503 59506 -62856 -162151 -143807 -90043 -124138 -142974 -229489
27832 -229489 -254777 -183232 -153586 4915 68927 232230 215450 17573 -39475 10893 84516
27821 84516 120397 28858 -2672 22760 100400 155411 124516 181961 104037 24365 115137 43748
27809 43748 -46055 11310 84557 81284 7333 -72272 -205778 -168191 -122684 -24092 122189
27798 122189 205313 175426 178711 206108 298240 189086 86335 54085 -7246 -51785 -72605
$$ packed form
27876d1305J05665J73688L6336o0353j37831m5824o7176o5111m4003m3374Q1966
27865a07322J67055M3259Q080K6055r2353m4902J06962n9806l7086O5604n569
27854F9977m2171K2267J82319K4311j29756m1120m4174q6492O132M9208N2519
27843F3020j3583k6197P0263l3997j22362r9295J8344N3764l4095j8836q6515
27832b29489k5288P1545K9646J58501O4012J63303j6780j97877n7048N0368P3623
27821H4516L5881r1539l1530K5432P7640N5011l0895N7445p7924p9672R0772p1389
27809D3748q9803N7365P3247l273p3951p9605j33506L7587M5507R8592J46281
27798A22189Q3124k9887L285K7397R2132j09154j02751l2250o1331m4539k0820
$$ plain form
27787 -72605 -59030 -110049 -210796 -192849 -140426 -89178 -88588 -132073 -91654 -50903 -127159 -59551
27775 -59551 -111750 -179403 -254897 -262147 -169458 48411 111889 46178 -19410 102056 158808
27764 158808 123384 35956 98495 133131 60166 -8036 10812 -108197 -124570 19636 145900
27753 145900 147846 8571 -25474 -29074 -39795 99343 258842 335464 223448 16969 -3259
27742 -3259 -27739 -163651 -141361 -103225 -49242 -16757 27815 -15265 -171192 -123177 -143072
27731 -143072 -108098 -62537 -90137 -31263 106827 190825 115569 -8018 -112115 -166640 -59539
27720 -59539 47905 15651 135113 63572 27915 -56114 -154763 -47496 125169 203418 289098
27709 289098 166976 1874 -54161 -67865 -28024 2053 79194 -48117 -97671 -128784 -83500
$$ packed form
27787g2605J3575n1019j00747J7947N2423N1248N90m3485M0419M0751p6256O7608
27775e9551n2199o7653p5494p250R2689K17869O3478o5711o5588J21466N6752
27764A58808l5424q7428O2539L4636p2965o8202J8848j19009j6373J44206J26264
27753A45900J946j39275l4045l600j0721J39138J59499P6622j12016k06479k0228
27742c259k4480j35912K2290L8136N3983L2485M4572m3080j55927M8015j9895
27731a43072L4974M5561k7600N8874J38090Q3998p5256j23587j04097n4525J07101
27720e9539J07444l2254J19462p1541l5657q4029r8649J07267J72665P8249Q5680
27709B89098j22122j65102n6035j3704L9841L0077P7141j27311m9554l1113M5284
$$ plain form
27698 -83500 -57188 -93265 -86409 30474 45855 -10891 -53000 -61462 -129159 -150940 -138791 -142027
27686 -142027 -146769 -56313 875 31300 129774 134321 91043 26887 -16509 -57327 -127063 -27410
27674 -27410 18447 -57745 -106764 -82128 10445 81516 19533 -86962 -14980 99557 144547
27663 144547 117240 6572 -15026 -60651 43454 135720 111357 30709 83234 27790 -29321
27652 -29321 76319 -54692 -99772 -147343 -179065 -208889 -108321 -13028 -35714 -6485 7870
27641 7870 -9563 -50071 -33545 6867 -15491 -151642 -102520 6825 -60163 -207574 -210408
27630 -210408 -145903 -646 145212 161666 118915 23938 -6341 61213 -72003 -109648 -135080
27619 -135080 -83007 21293 90864 44178 164416 198538 125687 128256 57179 70344 19868
$$ packed form
27698h3500K6312l6077O856J16883J5381n6746m2109q462o7697k1781J2149l236
27686a42027m742R0456N7188L0425R8474M547m3278o4156m3396m0818o9736R9653
27674b7410M5857p6192m9019K4636R2573P1071o1983j06495P1982J14537M4990
27663A44547k7307j10668k1598m5625J04105R2266k4363q0648N2525n5444n7111
27652b9321J05640j31011m5080m7571l1722k9824J00568R5293k2686K9229J4355
27641G870j7433m0508J6526M0412k2358j36151M9122J09345o6988j47411k834
27630b10408O4505J45257J45858J6454m2751r4977l0279O7554j33216l7645k5432
27619a35080N2073J04300O9571m6686J20238L4122p2851K569p1077J3165n0476
$$ plain form
27608 19868 6042 27748 14086 108747 220157 320380 254109 216488 142166 3109 -76594
27597 -76594 -18291 -48130 -95693 -26146 4265 42587 -31118 -173734 -127837 -135596 -228273 -112442
27585 -112442 -37923 -2437 20801 -30594 -86320 -90521 -28948 -55345 -47310 -21302 -36467 -155116
27573 -155116 -133208 -160479 -183099 7693 -33270 56133 78387 60277 78787 136796 73721
27562 73721 -71318 -157956 -83797 -53945 -1957 12224 -196284 -272210 -129139 -14887 88632
27551 88632 -20098 -88454 -50987 55689 112471 82176 -76326 -208149 -211347 -192234 -138368
27540 -138368 98692 170233 127292 130197 192183 242805 211617 192545 48405 -65050 -75299
27529 -75299 -73771 -79972 -96657 -199525 -108361 -12742 -76461 -125558 -82290 138701 148059 -95907
$$ packed form
27608A9868j3826K1706j3662R4661J11410J00223o6271l7621p4322j39057p9703
27597g6594N8303k9839m7563O9547L0411L8322p3705j42616M5897p759r2677J15831
27585a12442P4519L5486K3238n1395n5726m201O1573k6397Q035K6008j5165j18649
27573a55116K1908k7271k2620J90792m0963Q9403K2254j8110J8510N8009o3075
27562G3721j45039q6638P4159K9852N1988J4181k08508p5926J43071J14252J03519
27551H8632j08730o8356L7467J06676N6782l0295j58502j31823l198J9113N3866
27540a38368K37060P1541m2941K905O1986N0622l1188j9072j44140j13455j0249
27529g5299J528o201j6685j02868R1164R5619o3719m9097M3268K20991R358k43966
$$ plain form
27517 -95907 -157609 21954 106283 243503 289948 252384 226371 122573 63185 48843 22461
27506 22461 30982 -35066 -64150 158670 179148 65983 -67587 -166095 363 133440 193098
27495 193098 153548 107605 22492 -26689 -48846 81596 157416 98272 -10657 68426 37785
27484 37785 -32263 45925 21112 31486 114635 117803 273409 220379 176568 73758 74983 50692
27472 50692 39990 -68 69511 -104790 -143283 -69461 -16771 -10948 -24550 23149 38239 -23174
27460 -23174 42077 67111 30347 26537 -24695 20475 -16937 -109472 -169195 -115684 -123406 -190522
27448 -190522 -99775 17496 -80135 -192273 -274989 -181308 -103241 -70921 -16981 19092 70964
27437 70964 134124 190658 69095 -39568 -43464 -56618 -73607 -82902 -48089 -886 42484 21084
$$ packed form
27517i5907o1702J79563Q4329J37220M6445l7564k6013j03798n9388j4342k6382
27506B2461Q521o6048k9084K22820K0478j13165j33570r8508J66458J33077N9658
27495A93098l9550m5943q5113m9181k2157J30442P5820n9144j08929P9083l0641
27484C7785p0048P8188k4813J0374Q3149L168J55606n3030m3811j02810J225k4291
27472E0692j0702m0058O9579j74301l8493P3822N2690N823j3602M7699J5090o1413
27460b3174O5251K5034l6764l810n1232M5170l7412r2535n9723N3511p722o7116
27448a90522R0747J17271r7631j12138q2716R3681P8067L2320N3940L6073N1872
27437G0964O3160N6534j21563j08663l896j3154j6989r295L4813M7203M3370k1400
$$ plain form
27425 21084 39094 -59328 -103893 72615 146298 146872 55317 10530 71759 -50243 -135502 -104309
27413 -104309 -39544 -47314 103866 137254 100447 -69605 -11461 70519 112434 34648 80012
27402 80012 143872 164904 121936 65060 10772 -15342 68404 80735 74464 96935 145332 88275
27390 88275 43776 -34489 -102641 -24000 80372 170962 148733 173793 79888 -20724 -66950
27379 -66950 -88033 -106772 -72911 -108008 -32035 76012 186962 146209 74918 -52499 -92569
27368 -92569 -104951 -130583 -172831 -236213 -168558 -121570 -93600 -111436 -83713 -39614 -208020
27357 -208020 -261102 -239941 -125758 -7574 -12108 -41641 -14841 -40155 34983 80401 14493
27346 14493 7663 -89432 -133291 25121 48592 47123 89873 166951 258227 193668 72038 4534
$$ packed form
27425B1084J8010r8422m4565J76508P3683N74r1555m4787O1229j22002q5259L1193
27413a04309O4765p770J51180L3388l6807j70052N8144Q1980M1915p7786M5364
27402H0012O3860K1032m2968n6876n4288k6114Q3746J2331o271K2471M8397n7057
27390H8275m4499p8265o8152P8641J04372R0590k2229K5060r3905j00612m6226
27379f6950k1083j8739L3861l5097P5973J08047J10950m0753p1291j27417m0070
27368i2569j2382k5632m2248o3382O7655M6988K7970j7836K7723M4099j68406
27357b08020n3082K1161J14183J18184m534k9533K6800k5314P5138M5418o5908
27346A4493o830r7095m3859J58412K3471j469M2750P7078R1276o4559j21630o7504
$$ plain form
27334 4534 -95256 -69210 -58222 -187955 -269575 -125460 -10967 36340 -9862 -82222 -198425
27323 -198425 -108806 12738 5376 -23455 111812 133105 106323 51628 -4444 -36294 11315
27312 11315 148528 35591 -18892 95432 219690 153320 -6215 -67581 64693 119677
27302 119677 211448 286558 136487 75961 -49074 -60843 29896 -1210 58325 67221 -19828
27291 -19828 -126934 -52747 -31070 -146424 -227705 -225525 -138058 -13686 -6581 -13293 74222 52862
27279 52862 103884 36674 3412 157033 234684 103587 -82116 -219810 -155369 -28668 24644
27268 24644 -61364 -24665 -3116 31663 86260 22581 -41035 -44585 -60125 -81026 -59485 -28761
27256 -28761 49787 99282 32482 43913 67937 25153 -23096 21328 147491 181677 219039
$$ packed form
27334D534r9790K6046J0988j29733q1620J44115J14493M7307m6202p2360j16203
27323a98425Q9619J21544p362k8831J35267K1293k6782n4695n6072l1850M7609
27312A1315J37213j12937n4483J14324J24258o6370j59535o1366J32274N4984
27302A19677R1771P5110j50071o0526j25035j1769R0739l1106N9535Q896q7049
27291a9828j07106P4187K1677j15354q1281K180Q7467J24372P105o712Q7515k1360
27279E2862N1022o7210l3262J53621P7651j31097j85703j37694O4441J26701N3312
27268B4644q6008L6699K1549L4779N4597o3679o3616l550j5540k0901K1541L0724
27256b8761P8548M9495o6800J1431K4024m2784m8249M4424J26163L4186L7362
$$ plain form
27245 219039 199394 191119 14179 3663 11771 -130166 -90106 18476 -775 52521 103
27234 103 9830 6246 48214 5659 -55978 -170061 -75999 -67023 31331 114768 82974 -154085
27222 -154085 -298335 -305075 -172133 -178826 -268200 -244419 -62742 -77936 -26705 -49189 -213023
27211 -213023 -238061 -152716 -102163 -96838 -163441 -151155 -90193 -114940 -162494 -174820 -245834 -191829
27199 -191829 -77204 6372 -44667 15009 -18634 81893 92292 49987 -37414 -11229 -24232
27188 -24232 -69509 -69770 223 12959 -119452 -265023 -241883 -130828 -98436 -147707 -124709
27177 -124709 -97324 6526 83902 -14101 -57088 -90635 -70416 5735 132337 137737 104080
27166 104080 27355 -8575 51575 20985 42513 -53650 -134947 -172707 -108851 41984 84142
$$ packed form
27245B19039j9645q275j76940j0516Q108j41937M0060J08582j9251N3296n2418
27234A03R727l584M1968m2555o1637j14083R4062Q976R8354Q3437l1794k37059
27222a54085j44250o740J32942o693q9374K3781J81677j5194N1231k2484j63834
27211b13023k5038Q5345N0553N325o6603J2286O0962k4747m7554j2326p1014N4005
27199a91829J14625Q3576n1039N9676l3643J00527J0399m2305q7401K6185j3003
27188b4232m5277k61O9993J2736j32411j45571K3140J11055L2392m9271K2998
27177a24709K7385J03850P7376r8003m2987l3547K0219P6151J26602N400l3657
27166A04080p6725l5930O0150l0590K1528r6163q1297l7760O3856J50835M2158
$$ plain form
27155 84142 -24809 -62752 -60913 -92870 -9378 57621 53244 36068 -26929 -99647 39403 21282
27143 21282 16180 41164 175972 172504 163272 276532 163365 75212 122077 105165 78014 34358
27131 34358 30689 106839 95069 186846 156351 110333 3270 -98754 -83249 -26929 45257
27120 45257 -28076 -32788 11328 -39520 -83215 -56456 -80435 -16853 -31832 -88184 -137917 19525
27108 19525 -5368 -26050 57798 -28226 -82902 -21868 -46061 -47489 14410 -75512 -158770 -182219
27096 -182219 -240693 -223866 -137394 -34956 68024 82446 108126 42533 -42328 94499 156441
27085 156441 35160 57277 60947 76228 48424 79398 90185 -37935 6846 75706 221716
27074 221716 228230 219301 165697 161396 141653 130303 116798 92439 22775 6116 60145 7870
$$ packed form
27155H4142j08951l7943J839l1957Q3492O6999m377j7176o2997p2718J39050j8121
27143B1282n102K4984J34808l468r232J13260j13167q8153M6865j6912k7151m3656
27131C4358l669P6150j1770R1777l0495m6018j07063j02024J5505N6320P2186
27120D5257p3333m712M4116n0848m3695K6759k3979O3582j4979n6352m9733J57442
27108A9525k4893k0682Q3848q6024n4676O1034k4193j428O1899q9922q3258k3449
27096a82219n8474J6827Q6472J02438J02980J4422K5680o5593q4861J36827O1942
27085A56441j21281K2117L670J5281k7804L0974J0787j28120M4781O8860J46010
27074B21716O514q929n3604m301j9743j1350j3505k4359o9664j6659N4029n2275
$$ plain form
27062 7870 17949 -7875 133506 150893 175258 209171 163564 59084 93857 110220 72950
27051 72950 108316 90607 58971 51439 -34819 -93619 3199 82284 122906 125388 53713 12578
27039 12578 55572 3713 58743 165327 176514 57474 -5929 -45695 -56792 81057 150077
27028 150077 97679 30622 -38331 29476 23270 -61971 -116099 -59325 -19259 22102 22814 36472
27016 36472 9156 2862 41158 13500 -72862 -183785 -218182 -220508 -226509 -231144 -194925 -181011
27004 -181011 -166128 -41885 27557 -27657 -81159 -41357 -103567 -77763 14720 -36146 -134801
26993 -134801 -91160 -6826 -128083 -227970 -234239 -85815 6989 18245 -4543 -61032 -45614
26982 -45614 35448 -14970 -77093 -170757 -181161 -176228 -126523 -113243 -90302 3392 10635 70585
$$ packed form
27062G870J0079k5824J41381J7387K4365L3913m5607j04480L4773J6363l7270
27051G2950L5366j7709l1636p532q6258n8800R6818P9085M0622K482p1675m1135
27039A2578M2994n1859N5030J06584J1187j19040o3403l9766j1097J37849O9020
27028A50077n2398o7057o8953O7807o206q5241n4128N6774M0066M1361P12J3658
27016C6472k7316o294L8296k7658q6362j10923l4397k326o001m635L6219J3914
27004a81011J4883J24243O9442n5214n3502L9802o2210K5804R2483n0866r8655
26993a34801M3641Q4334j21257r9887o269J48424R2804J1256k2788n6489J5418
26982d5614Q1062n0418o2123r3664j0404M933M9705J3280K2941R3694P243N9950
$$ plain form
26970 70585 140202 215848 51122 -25348 -40247 -47961 -73264 83058 206136 93816 -70385
26959 -70385 -122380 22759 111909 128358 215918 157084 119209 97168 76606 133901 56065
26948 56065 141845 192430 108563 -66567 -92281 85870 133217 131246 139488 148170 141344 40292
26936 40292 -74796 -128157 -49499 -79638 21117 76193 180922 88546 31200 105051 87949
26925 87949 109922 114422 72124 2638 29700 -1654 106311 130580 146296 50428 -75244
26914 -75244 6344 113613 85383 -84481 -228372 -119781 -108376 -99282 -141578 -17722 -9345
26903 -9345 -91286 -30447 89378 25325 -101623 -120758 -128602 -126574 -63079 69698 121323 159320
26891 159320 156963 -6898 -214277 -247529 -205202 -138577 -70267 -203253 -153914 -127933 -64791
$$ packed form
26970G0585O9617P5646j64726p6470j4899p714k5303J56322J23078j12320j64201
26959g0385n1995J45139Q9150J6449Q7560n8834l7875k2041k0562N7295p7836
26948E6065Q5780N0585q3867j75130k5714J78151M7347j971Q242Q682o826j01052
26936D0292j15088n3361P8658l0139J00755N5076J04729r2376n7346P3851j7102
26925H7949K1973M500m2298o9486K7062l1354J07965K4269J5716r5868j25672
26914g5244Q1588J07269k8230j69864j43891J08591J1405R094m2296J23856Q377
26903i345q1941O0839J19825o4053j26948j9135p844K028O3495J32777N1625L7997
26891A59320k357j63861k07379l3252M2327O6625O8310j32986M9339K5981O3142
$$ plain form
26880 -64791 -102260 -247031 -231904 -203510 -130741 -107924 -76694 -116124 -180911 -94691 -46559
26869 -46559 -1205 118901 90579 41760 -88680 46824 71051 83124 189152 151856 213722
26858 213722 255430 189083 110076 133006 91233 31403 30817 114317 148219 117057 166432 125688
26846 125688 144335 107680 -94699 -227855 -273792 -239040 -196693 -62760 43883 111925 73226
26835 73226 1741 -72686 30173 63746 51220 26490 -18377 31920 63135 82202 -3930
26824 -3930 10434 12695 -82378 -112562 -3041 105371 175678 98088 -33396 -81206 -2378
26813 -2378 35546 -7253 10195 164549 288456 381045 245465 114829 72121 99334 70097
26802 70097 65226 51951 -12484 -30593 -87914 -73661 -45924 38815 -36547 104851 199743 149934
$$ packed form
26880f4791l7469j44771J5127K8394P2769K2817L1230l9430o4787Q6220M8132
26869d6559M5354J20106k8322m8819j30440J35504K4227J2073J06028l7296O1866
26858B13722M1708o6347p9007K2930m1773n9830n86Q3500L3902l1162M9375m0744
26846A25688J8647l6655k02379j33156m5937L4752M2347J33933J06643O8042l8699
26835G3226p1485p4427J02859L3573j2526k4730m4867N0297L1215J9067q6132
26824c930J4364K261r5073l0184J09521J08412P0307p7590j31484m7810P8828
26813b378L7924m2799J7448J54354J23907R2589j35580j30636m2708K7213k9237
26802G0097m871j3275o4435j8109n7321J4253K7737Q4739p5362J41398R4892m9809
$$ plain form
26790 149934 84118 47146 -45765 -54464 -76872 -148272 -123967 -8687 -42293 -24666 47672
26779 47672 -104354 -171855 -44229 36716 16271 -122817 -133090 -78007 -54659 -24048 -64216
26768 -64216 -25604 152393 156584 73009 103017 30875 19825 73290 68574 18990 -75259 -5387
26756 -5387 -59111 -27883 58410 -72573 -157980 -41463 23932 -71755 -50461 61689 68101
26745 68101 3884 -112354 -71457 33108 63490 -89734 -204499 -182230 -124302 -49150 -27880
26734 -27880 -110810 -93652 50765 152155 132052 23762 -7550 -44396 -78244 -11526 702
26723 702 14923 -57032 4597 55490 -52040 3951 25954 -92316 -158687 -177965 -155747 -87074
26711 -87074 -59693 -1774 -34413 1932 420 -43674 -102190 -135994 -69913 33318 -24289 39324
$$ packed form
26790A49934o5816l6972r2911q699k2408p1400K4305J15280l3606J7627P2338
26779D7672j52026o7501J27626Q0945k0445j39088j0273N5083K3348L0611m0168
26768f4216L8612J77997M191q3575L0008p2142j1050N3465m716m9584r4249O9872
26756e387n3724L1228Q6293j30983q5407J16517O5395r5687K1294J12150O412
26745F8101o4217j16238M0897J04565L0382j53224j14765K2269N7928P5152K1270
26734b7880q2930J7158J44417J01390k0103j08290l1312l6846l3848O6718J2228
26723G02J4221p1955O1629N0893j07530N5991K2003j18270o6371j9278K2218O8673
26711h7074K7381N7919l2639L6345j512m4094n8516l3804O6081J03231n7607O3613
$$ plain form
26699 39324 107777 42576 -59541 -112235 -118584 -206600 -231921 -248298 -218779 -117587 -73692
26688 -73692 -71765 12416 11288 -4239 95193 -1213 -40065 -79832 -136202 -198315 -47262 110559
26676 110559 118664 21582 -53256 -19497 -5498 -4720 -41556 -56595 -83653 49662 171773 61829
26664 61829 28049 70118 -55581 -34288 -90273 -78453 -9818 35794 -8331 -37577 35615
26653 35615 66984 -13044 -28885 -32370 -18917 -86231 -106433 -166753 -92983 -16317 -86814 -89549
26641 -89549 -8206 -24713 -101938 -51124 -14470 -87192 -52063 -61474 -101857 -59217 -100499 -178383
26629 -178383 -116252 53395 153169 111808 -55531 -55249 31714 188942 198442 56200 43542
26618 43542 -8369 -133198 -200701 -197593 -155993 -239190 -319353 -152177 -20152 33895 -53418
$$ packed form
26699C9324O8453o5201j02117n2694o349q8016k5321j6377K9519J01192M3895
26688g3692J927Q4181j128j5527R9432r6406l8852l9767n6370o2113J51053J57821
26676A10559Q105r7082p4838L3759J3999P78l6836j5039k7058J33315J22111j09944
26664F1829l3780M2069j25699K1293n5985J1820O8635M5612m4125k9246P3192
26653C5615L1369q0028j5841l485J3453o7314k0202o0320P3770P6666p0497k735
26641h9549Q1343j6507p7225N0814L6654p2722L5129r411m0383M2640m1282p7884
26629a78383O2131J69647R9774m1361j67339K82Q6963J57228R500j42242j2658
26618D3542n1911j24829o7503L108M1600q3197q0163J67176J32025N4047q7313
$$ plain form
26607 -53418 -77199 -134261 -191699 -188284 -130494 -39353 18845 -66889 -30566 71747 33355 78333
26595 78333 172341 200219 199856 143472 232024 113623 50711 -49520 -92722 -176822 -142478 -49007
26583 -49007 24347 -21815 68443 4189 -79230 -112627 -176337 -240800 -146646 -98602 -129241 -107799
26571 -107799 -2743 179041 193952 105779 34298 -30940 -30583 -15097 -85775 -62992 -78978
26560 -78978 -118176 -87484 -10391 3188 67729 85163 96655 93865 62727 36404 -9512 -130411
26548 -130411 -12631 -11052 25576 -55788 -98121 13670 -18548 34366 34081 -20338 63510 1567
26536 1567 1085 -7238 -25641 8695 99720 135717 49125 138639 108085 100075 117448 171969 176737
26523 176737 108970 6118 -84556 -89155 -72525 -151856 -85011 86414 41262 -19120 -81118
$$ packed form
26607e3418k3781n7062n7438L415N7790R1141N8198q5734L6323J02313l8392M4978
26595G8333R4008K7878l63n6384Q8552j18401o2912j00231m3202q4100L4344R3471
26583d9007P3354m6162R0258o4254q3419l3397o3710o4463R4154M8044l0639K1442
26571a07799J05056J81784J4911q8173p1481o5238L57J5486p0678K2783j5986
26560g8978l9198L0692P7093J3579O4541J7434J1492k790l1138k6323m5916j20899
26548a30411J17780J579L6628q1364m2333J11791l2218N2914k85n4419Q3848o1943
26536A567m82q323j8403L4336R1025L5997q6592Q9514l0554q010J7373N4521M768
26523A76737o7767j02852r0674m599J6630p9331O6845J71425m5152o0382o1998
$$ plain form
26512 -81118 -8243 10193 92537 169902 190087 140393 132254 68398 123480 190853 3351 -19480
26500 -19480 3071 48758 53450 98317 154173 177654 137654 -4483 -78203 -2116 56773 89544
26488 89544 84404 139046 179711 88180 72309 119016 143748 58755 -43523 45026 129616 63310
26476 63310 -51561 -73366 -53092 -86437 -47800 -69033 -67140 -28795 85332 73134 20127
26465 20127 -68048 -144832 -40140 -99347 -229300 -217085 -146104 -39839 33544 55970 38685
26454 38685 -18823 107700 182750 127707 137988 93333 72207 143843 108649 34054 -99505
26443 -99505 -167463 -188946 12059 115986 140933 25941 -7001 -14054 82084 106141 105392 191530
26431 191530 256082 318488 250181 63841 -52422 -66172 -41871 -6112 46028 175786 245611
$$ packed form
26512h1118P2875J8436Q2344P7365K0185m9694q139o3856N5082O7373j87502k2831
26500a9480K2551M5687M692M4867N5856K3481m0000j42137p3720P6087N8889L2771
26488H9544n140N4642M0665r1531j5871M6707K4732q4993j02278Q8549Q4590o6306
26476F3310j14871k1805K0274l3345L8637k1233J893L8345J14127j2198n3007
26465B0127q8175p6784J04692n9207j29953J2215P0981J06265P3383K2426j7285
26454C8685n7508J26523P5050n5043J0281m4655k1126P1636l5194p4595j33559
26443i9505o7958k1483K01005J03927K4947j14992l2942p053R6138K4057p49Q6138
26431A91530O4552O2406o8307j86340j16263j3750K4301L5759N2140J29758O9825
$$ plain form
26420 245611 186479 127186 175454 161659 66031 -114989 -103565 -44619 -14748 75088 58478
26409 58478 97044 80043 6418 26177 67096 -4470 -73073 25380 97806 20127 -42595 8824
26397 8824 110001 180642 124369 99939 48687 30926 148982 123527 127013 331347 386215
26386 386215 322837 168396 101432 52779 204942 239260 185649 196826 58568 49873 90985
26375 90985 160845 128122 36628 5508 -620 70248 48684 -23730 -128586 -118747 -131053 -101800
26363 -101800 1942 144116 88753 70833 147234 164507 117965 -62387 -120535 -54215 35416
26352 35416 -3299 -2028 -51152 -212834 -218376 -190063 -98644 -55653 35410 44160 14278 -74704
26340 -74704 -180899 -114218 60253 262228 207811 94017 -19486 -72150 -120962 -125819 -137440
$$ packed form
26420B45611n9132n9293M8268j3795r5628j81020J1424N8946K9871Q9836j6610
26409E8478L8566j7001p3625J9759M0919p1566o8603R8453P2426p7679o2722N1419
26397H824J01177P0641n6273k4430n1252j7761J18056k5455L486K04334N4868
26386C86215o3378j54441o6964m8653J52163L4318n3611J1177j38258q695M1112
26375I0985O9860l2723r1494l1120o128P0868k1564p2414j04856R839j2306K9253
26363a01800J03742J42174n5363j7920P6401J7273m6542j80352n8148O6320Q9631
26352C5416l8715J271m9124j61682n542K8313R1419M2991R1063Q750k9882q8982
26340g4704j06195O6681J74471K01975n4417j13794j13503n2664m8812m857j1621
$$ plain form
26329 -137440 -52862 -56747 -78842 23100 79551 117944 19438 -20942 93242 38663 -109160
26318 -109160 -88909 -41184 -13870 -6253 -21828 -43780 -69128 -31858 17227 -115503 -93891
26307 -93891 61706 40941 -60169 -172989 -54387 -56025 -47830 -45935 -65269 -171456 -261558
26296 -261558 -283517 -165717 -162688 -182503 -58015 58829 1576 -17928 -119749 -99375 66597
26285 66597 24978 -34728 21084 15569 -39836 -93197 -27829 -6928 -69594 -177407 -213606 -66551
26273 -66551 143723 116450 168055 212610 201578 87727 -133730 -268522 -194015 -145819 -113960
26262 -113960 -56538 -28488 4273 56207 30674 95714 58840 -16315 -60764 -21639 -13339 -27603
26250 -27603 -57476 -148184 -105833 3679 38584 113714 143045 189169 244346 292926 171536
$$ packed form
26329a37440Q4578l885k2095J01942N6451L8393r8506m0380J14184n4579j47823
26318a09160K0251M7725K7314P617j5575k1952k5348L7270M9085j32730K1612
26307i3891J55597k0765j01110j12820J18602j638Q195J895j9334j06187r0102
26296b61558k1959J17800L029j9815J24488J16844n7253j9504j01821K0374J65972
26285F6597m1619n9706N5812n515n5405n3361O5368K0901o2666j07813l6199J47055
26273f6551K10274k7273N1605M4555j1032j13851k21457j34792P4507M8196L1859
26262a13960N7422K8050L2761N1934k5533O5040l6874p5155m4449L9125Q300j4264
26250b7603k9873r0708M2351J09512L4905P5130K9331M6124N5177M8580j21390
$$ plain form
26239 171536 50349 -8231 -900 95471 40390 19686 60922 169671 161051 87063 133476
26228 133476 77694 16289 146504 72054 -32377 7079 69533 144339 141181 143274 -32078
26217 -32078 32195 -21473 10414 93955 70582 91431 49542 -37791 65361 112828 142347
26206 142347 107100 107337 143992 117052 97082 44309 -90029 -108319 -145966 -207714 -206383 -103154
26194 -103154 -59946 -41348 -99843 -36942 47145 185756 211522 63234 -52986 -44401 31790
26183 31790 59129 -9924 -90285 -132681 6195 3027 -24422 -15684 29723 15267 46410 121598
26171 121598 106884 33226 -5055 -9811 38172 73437 141273 131596 99758 72290 123740 135137
26159 135137 41870 -39435 -105229 -91437 -25920 -3925 -11442 35301 67476 92209 93977 126706
$$ packed form
26239A71536j21187n8580P331R6371n5081k0704M1236J08749q620p3988M6413
26228A33476n5782o1405J30215p4450j04431L9456O2454P4806l158K093j75352
26217c2078O4273n3668L1887Q3541k3373K0849m1889q7333J03152M7467K9519
26206A42347l5247K37L6655k6940j9970n2773j34338j8290l7647o1748J331J03229
26194a03154M3208J8598n8495O2901Q4087J38611K5766j48288j16220Q585P6191
26183C1790K7339o9053q0361m2396J38876l168k7449Q738M5407j4456L1143P5188
26171A21598j4714p3658l8281m756M7983L5265O7836r677l1838k7468N1450J1397
26159A35137r3267q1305o5794J3792O5517K1995p517M6743L2175K4733J768L2729
$$ plain form
26147 126706 142699 123488 229542 297806 196725 143363 86510 -42171 -30853 90107 83398
26136 83398 50108 19032 72251 86244 150240 117642 82172 19219 68348 121220 139913 85878
26124 85878 60335 -45023 -69680 -50074 -64859 20515 28466 -29195 -59446 -95618 -119062 -66415
26112 -66415 56766 64107 93095 104750 -8748 -118004 -108417 -137958 -127042 -278167 -346052
26101 -346052 -161252 -53322 -45475 -191844 -195582 -141321 -63536 -23078 -2988 36210 -74443
26090 -74443 -158149 -82049 -120527 -33618 -1169 -147437 -173851 -159396 -203677 -144690 -63666
26079 -63666 27573 127112 127654 103567 72949 97323 193792 185852 51672 -104043 -87226 25261
26067 25261 196493 246037 143748 11083 -20546 44448 188546 130665 64696 625 69261
$$ packed form
26147A26706J5993j9211J06054O8264j01081n3362n6853j28681J1318J20960o709
26136H3398l3290l1076N3219J3993O3996l2598l5470o2953M9129N2872J8693n4035
26124H5878k5543j05358k4657J9606j4785Q5374P951n7661l0251l6172k3444N2647
26112f6415J23181P341K8988J1655j13498j09256R587k9541J0916j51125o7885
26101c46052J84800J07930P847j46369l738N4261P7785M0458K0090L9198j10653
26090g4443q3706P6100l8478Q6909L2449j46268k6414J4455m4281N8987Q1024
26079f3666R1239R9539N42k4087l0618K4374R6469p940j34180j55715J6817J12487
26067B5261J71232M9544j02289j32665l1629O4994J44098n7881o5969o4071O8636
$$ plain form
26056 69261 161184 82142 23000 -14284 -61346 -169380 -170859 -112895 -59720 22117 115177 95604
26044 95604 57133 108926 115287 -61827 -175746 -145018 -106657 -61511 104173 124441 148606
26033 148606 96161 -20130 -51637 31982 46225 141393 134615 234289 194437 147784 55719
26022 55719 -54087 -68828 -113190 -122309 -172024 -208014 -167173 -66718 83680 144479 67975
26011 67975 30874 59683 -34990 -46868 48569 17815 -47907 38353 37706 28094 86663 117545
25999 117545 123751 66475 67509 45462 -36487 79804 130479 48193 32183 -37105 -71683 -9924
25987 -9924 79595 124562 69046 -21677 -7390 80738 109664 226947 297939 278261 227632 65253
25975 65253 -92821 -83042 -43583 -90374 -1837 36254 37455 -12234 -51134 -26376 25139 93193
$$ packed form
26056F9261R1923p9042n9142l7284m7062j08034j479N7964N3175Q1837R3060j9573
26044I5604l8471N1793O361j77114j13919L0728L8361M5146J65684K0268K4165
26033A48606n2445j16291l1507Q3619J4243R5168o778R9674l9852m6653r2065
26022E5719j09806j4741m4362r119m9715l5990M0841J00455J50398O0799p6504
26011F7975l7101K8809r4673j1878R5437l0754o5722Q6260o47r612N8569L0882
25999A17545O206n7276J034k2047q1949J16291N0675q2286j6010o9288l4578O1759
25987i924Q9519M4967n5516r0723J4287Q8128K8926J17283P0992j9678n0629j62379
25975F5253j58074R779L9459m6791Q8537L8091J201m9689l8900K4758N1515O8054
$$ plain form
25963 93193 32817 18869 -972 62913 79500 181245 174566 92026 -42388 -145086 -140945
25952 -140945 -106922 -23397 14127 -33300 -85709 4570 24469 -14781 60635 31252 -13331
25941 -13331 96479 32323 -63331 -160598 -139178 -42377 27885 -1046 -79539 4795 64937
25930 64937 20193 -29201 -82423 -130047 -83988 -84567 -38556 -45709 -20390 67049 121056 -5218
25918 -5218 -178935 -212628 -136544 22269 -5224 22905 84631 137223 134957 23842 59354
25907 59354 38800 27281 2175 -51840 -126691 -39174 106376 -7534 -89644 -10629 -37907
25896 -37907 -20973 49816 21677 52836 -11287 -33878 16744 15875 36534 62663 79152 63980
25884 63980 27120 -19610 2815 -39185 -61858 -25136 25363 118880 150373 162701 41435
$$ packed form
25963I3193o0376j3948j9841O3885J6587J01745o679q2540j34414j02698M141
25952a40945L4023Q3525L7524m7427n2409R0279J9899l9250P5416k9383m4583
25941a3331J09810o4156r5654r7267K1420R6801P0262k8931p8493Q4334O0142
25930F4937m4744m9394n3222m7624M6059n79M6011p153K5319Q7439N4007j26274
25918e218j73717l3693P6084J58813k7493K8129O1726N2592k266j11115L5512
25907E9354k0554j1519k5106n4015p4851Q7517J45550j13910q2110P9015k7278
25896c7907J6934P0789k8139L1159o4123k2591N0622q69K0659K6129J6489j5172
25884F3980l6860m6730K2425m2000k2673L6722N0499R3517L1493J2328j21266
$$ plain form
25873 41435 -3521 27 19337 -84120 62091 111394 12245 -66579 -37871 4283 -108030
25862 -108030 -142453 -137565 -184073 -192400 9272 79948 151930 75207 -31924 -20393 -47076
25851 -47076 44831 34263 32796 96033 187455 175615 30016 -17300 -17824 37906 -20569 -59126
25839 -59126 -119613 -90737 -699 4732 -30189 -135097 -120352 -55249 -145715 -165405 -161607 -48901
25827 -48901 -68210 -170381 -76486 -110369 -111566 -79472 -118602 -211635 -135929 -178919 -160215 -94201
25815 -94201 16072 30795 28349 38678 4818 -31048 -43947 -4559 58587 93281 -9145
25804 -9145 63685 184128 118151 20316 27635 52069 88362 73616 173262 230887 265264 232893
25792 232893 96983 -74287 -19136 -101742 -133816 -52342 64292 -20167 -127626 -136148 -67118
$$ packed form
25873D1435m4956L548J9310j03457J46211M9303r9149p8824K8708M2154j12313
25862a08030l4423M888m6508q327K01672P0676P1982p6723j07131J1531k6683
25851d7076R1907j0568j467O3237R1422j1840j45599m7316n24N5730n8475l8557
25839e9126o0487K8876R0038N431l4921j04908J4745O5103r0466j9690L798J12706
25827d8901j9309j02171R3895l3883j197L2094l9130r3033P5706m2990J8704O6014
25815i4201J10273J4723k446J0329l3860l5866j2899L9388O3146L4694j02426
25804i145P2830J20443o5977r7835P319K4434L6293j4746R9646N7625L4377l2371
25792B32893j35910j71270N5151q2606l2074Q1474J16634q4459j07459q522O9030
$$ plain form
25781 -67118 26144 17735 -113109 -204023 -154245 -65865 -53037 -57745 -111665 -165817 -129136 -52041
25769 -52041 22818 -52458 -65373 -46176 -16394 -17265 21647 100861 85370 3696 -51053 -152953
25757 -152953 -94578 -9437 48504 -60451 -103771 -58521 -8019 3996 42701 -46445 14926
25746 14926 95346 145421 88403 59261 146647 71877 -12451 13321 156719 210159 114556
25735 114556 15520 -90415 -80698 -18861 -79846 -94117 -3491 48924 -69841 -69708 -6992 56602
25723 56602 25964 37157 46214 40044 87298 11736 -30401 -90156 -88518 -30965 -1911 -890
25711 -890 18581 49974 21617 56487 78698 -11157 21919 8287 -143505 -185397 -181651 -237930
25699 -237930 -145684 -42743 -33888 -106984 -75801 -2040 11746 -2736 -43040 4915 -32081
$$ packed form
25781f7118R3262q409j30844r0914M9778Q8380J2828m708n3920n4152L6681P7095
25769e2041P4859p5276j2915J9197K9782q71L8912P9214j5491q1674n4749j01900
25757a52953N8375Q5141N7941j08955m3320M5250N0502J2015L8705q9146O1371
25746A4926Q0420N0075n7018k9142Q7386p4770q4328K5772J43398N3440r5603
25735A14556r9036j05935R717O1837o0985j4271R0626N2415j18765J33O2716O3594
25723E6602l0638J1193R057o170M7254p5562m2137n9755J638N7553K9054J021
25711h90J9471L1393k8357L4870K2211q9855L3076j3632j51792m1892L746n6279
25699b37930R2246J02941Q855p3096L1183P3761J3786j4482m0304M7955l6996
$$ plain form
25688 -32081 -90764 -4683 149637 106847 134036 157801 157225 106877 64575 -69650 -157837 -149016
25676 -149016 -182835 -136337 -5331 -63332 -15604 -101195 -202216 -236231 -106571 68560 49388
25665 49388 -348 -35920 -120001 -123615 -139622 -47635 4685 85873 95510 6941 -38097 74402
25653 74402 86214 22983 24582 13448 -74404 -6571 41891 6146 41995 101039 34633 -68729
25641 -68729 -16365 -119050 -180102 -153764 -76950 -74080 -135074 -169269 -95017 -54290 -93891 -98186
25629 -98186 -67137 -71856 -70681 27534 -7810 -53229 -7326 -116524 -155581 -124746 -63731 -103920
25617 -103920 -85114 -84381 -14242 55868 73455 -15017 7541 -62959 -37192 17772 108687 132274
25605 132274 169214 215754 263392 195302 156428 200821 79763 94415 184059 192682 119993
$$ packed form
25688c2081n8683Q6081J54320m2790K7189K3765n76n0348m2302j34225q8187Q821
25676a49016l3819M6498J31006n8001M7728q5591j01021l4015J29660J75131j9172
25665D9388m9736l5572q4081l614j6007R1987N2320Q1188R637q8569m5038J12499
25653G4402J1812o3231J599j1134q7852O7833M8462l5745L5849N9044o6406j03362
25641f8729N2364j02685o1052K6338P6814K870o0994l4195P4252M0727l9601m295
25629i8186L1049m719J175R8215l5344m5419M5903j09198l9057L0835O1015m0189
25617a03920J8806P33P0139P0110J7587q8472K2558p0500K5767N4964R0915K3587
25605A32274L6940M6540M7638o8090l8874M4393j21058J4652Q9644Q623p2689
$$ plain form
25594 119993 19972 -107948 -41784 -45197 -81929 42938 64416 -5504 -43380 15359 45319
25583 45319 -16678 -132254 -56185 88907 111408 45090 -67154 -45751 5828 6209 2529 56572
25571 56572 -5451 -95329 -180321 -124659 -61131 -32905 -16469 60817 42077 6749 9888 -4425
25559 -4425 -112060 -104487 -87660 31936 41603 159547 127757 -25242 -100659 -176334 -227706
25548 -227706 -183214 -99346 -4782 -131 14662 -50135 -34867 56629 127705 127508 82414 72536
25536 72536 46429 -99261 -147073 -142119 -204453 -219669 -252213 -200975 775 79436 -25653
25525 -25653 66721 155842 137945 77933 86971 59926 -1080 -106615 -128022 -170664 -210252 -283670
25513 -283670 -227351 -206309 -151860 -82140 -1272 -50046 -2601 156530 86172 -45601 -28712
$$ packed form
25594A19993j00021j27920O6164l413l6732J24867K1478o9920l7876N8739K9960
25583D5319o1997j15576P6069J45092K2501o6318j12244K1403N1579L81l680N4043
25571E6572o2023q9878q4992N5662O3528K8226J6436P7286j8740l5328L139j4313
25559d425j07635P573J6827J19596R667J17944l1790j52999p5417p5675n1372
25548b27706M4492Q3868R4564M651J4793o4797J5268R1496P1076j97m5094r878
25536G2536k6107j45690m7812M954o2334j5216l2544N1238K01750P8661j05089
25525b5653R2374Q9121j7897o0012R038k7045o1006j05535k1407m2642l9588p3418
25513b83670N6319K1042N4449O9720Q0868m8774M7445J59131p0358j31773J6889
$$ plain form
25502 -28712 46844 63614 10191 4014 64916 127205 88809 37032 6968 -9922 -41303 -88579
25490 -88579 -137025 12005 68820 56719 21359 -69218 2771 26098 -105491 -203672 -260609
25479 -260609 -202328 -187287 -23649 -51150 -101102 -57165 -52346 -10558 -64063 14160 -905
25468 -905 -38854 27278 63384 54713 97944 103648 132740 223390 274859 80411 100777 45894
25456 45894 -50467 -84705 34639 245057 176985 80976 -29059 -48926 3417 57525 121550
25445 121550 69875 30294 -28431 -63381 -60734 44295 99503 86656 19456 86573 102266
25434 102266 -48459 -167623 -104790 -102118 -79412 -32437 -26852 23281 -8467 47015 64108
25423 64108 -32750 -113468 -62086 -18786 86956 113446 49024 16623 10135 -18571 18726 44728
$$ packed form
25502b8712P5556J6770n3423o177O0902O2289l8396n1777l0064j6890l1381m7276
25490h8579m8446J49030N6815j2101l5360r0577P1989K3327j31589r8181n6937
25479b60609N8281J5041J63638k7501m9952M3937M819M1788n3505P8223j5065
25468i05l7949O6132L6106q671M3231N704K9092R0650N1469j94448K0366n4883
25456D5894r6361l4238J19344K10418o8072r6009j10035j9867N2343N4108O4025
25445A21550n1675l9581n8725l4950K647J05029N5208j2847o7200O7117J5693
25434A02266j50725j19164O2833K672K2706M6975N585N0133l1748N5482J7093
25423F4108r6858q0718N1382M3300J05742K6490o4422l2401o488k8706L7297K6002
$$ plain form
25411 44728 28059 -11340 -80632 -62663 -44746 -58537 -77179 -46212 -99050 -149297 -182249 -68342
25399 -68342 -98223 -113792 -150390 -205989 -189420 -176874 -143431 -30523 55216 -28082 -115260
25388 -115260 -87474 -150251 -236832 -207198 -83907 50062 29112 -73650 -24215 94775 107803
25377 107803 110996 -4475 -58742 4377 96300 146380 155927 180512 164163 142336 24701
25366 24701 -95267 -93572 19040 -55484 -132330 -195069 -20996 55573 25228 -73333 -95959
25355 -95959 -229337 -157013 -156071 -149051 -74620 82987 -39716 -187736 -136181 -96353 -31041
25344 -31041 133814 165131 48158 -55750 -163135 -106007 -112724 -111815 -114195 -118330 -76449 -123466
25332 -123466 -124773 -37169 -6479 1805 6810 23827 60483 67110 26300 90924 92032 98221 109004
$$ packed form
25411D4728j6669l9399o9292J7969J7917j3791j8642L0967n2838n0247l2952J13907
25399f8342k9881j5569l6598n5599J6569J2546L3443J12908Q5739q3298q7178
25388a15260K7786o2777q6581K9634J23291J33969k0950j02762M9435J18990J3028
25377A07803L193j15471n4267O3119R1923N0080R547K4585j6349k1827j17635
25366B4701j19968J695J12612p4524p6846o2739J74073P6569l0345r8561k2626
25355i5959j33378P2324R42P020P4431J57607j22703j48020N1555L9828O5312
25344c1041J64855L1317j16973j03908j07385N7128o717R09k380m135M1881m7017
25332a23466j307Q7604L0690Q284N005J7017L6656O627m0810O4624J108O189J0783
$$ plain form
25319 109004 74845 21486 -91760 -138403 -94241 -56116 -49059 99731 174595 138196 180043
25308 180043 130855 74390 15540 -2326 -76273 -50619 50670 124605 -82750 18879 115741
25297 115741 199922 230472 132708 40517 62024 11165 47335 29755 -75294 -165787 -140386
25286 -140386 19874 32331 31568 -22511 49459 -26292 -61170 -173919 -29903 155465 141902
25275 141902 125553 -10092 -56946 -125022 -102940 -144240 -184489 -184634 -125721 -27134 16036 -45271
25263 -45271 -32327 -82042 -102287 -150207 -281170 -279123 -199531 -146520 -193366 -107447 -99635 -70437
25251 -70437 10363 73418 45613 -75734 -95482 -97910 -151935 -136547 13630 53090 110129
25240 110129 51759 64526 95658 11446 76725 93309 -13780 108431 207713 135229 105684
$$ packed form
25319A09004l4159n3359j13246m6643M4162L8125P057J48790P4864l6399M1847
25308A80043m9188n6465n8850j7866p3947K5654J01289P3935k07355J01629R6862
25297A15741Q4181L0550r7764r2191K1507n0859L6170j7580j05049r0493K5401
25286a40386J60260J2457p63n4079P1970p5751l4878j12749J44016J85368j3563
25275A41902j6349j35645m6854o8076K2082m1300m0249j45N8913R8587M3170o1307
25263d5271J2944m9715k0245m7920j30963K047P9592N3011m6846Q5919P812K9198
25251g0437Q0800O3055k7805j21347j9748k428n4025J5388J50177L9460N7039
25240A10129n8370J2767L1132q4212O5279J6584j07089J22211R9282p2484k9545
$$ plain form
25229 105684 29158 84864 110272 117142 44084 -60304 -90232 -210555 -185593 -162968 -97888
25218 -97888 -86009 -43768 -8122 50485 20759 -76616 -23167 -30936 5683 109540 214497
25207 214497 163834 27764 -27854 663 -84613 -128578 -183760 -175696 -130928 -169212 -215774
25196 -215774 -190892 -72912 113005 153179 76581 79258 100935 136123 142990 120810 57978
25185 57978 -2247 -80511 -100369 -84043 -95482 -47245 -144300 -44114 37842 64903 8304
25174 8304 -89698 -112510 -185594 -161383 23911 -154 31745 78290 -15253 -48165 -59951 -31026
25162 -31026 -17025 45901 117910 37927 48246 98860 70835 115355 74550 3153 -63915 -1441
25150 -1441 50202 -13236 -45632 -67256 36347 130973 95462 24382 97019 172346 103088 51725
$$ packed form
25229A05684p6526N5706K5408O870p3058j04388k9928j20323K4962K2625O5080
25218i7888J1879M2241L5646N8607k9726r7375N3449p769L6619J03857J04957
25207B14497n0663j36070n5618K8517q5276m3965n5182Q064M4768l8284m6562
25196b15774K4882J17980J85917M0174p6598K677K1677L5188O867k2180o2832
25185E7978o0225p8264j9858J6326j1439M8237r7055J00186Q1956K7061n6599
25174H304r8002k2812p3084K4211J85294k4065L1899M6545r3543l2912j1786K8925
25162c1026J4001O2926P2009p9983J0319N0614k8025M4520m0805p1397o7068O2474
25150a441N1643o3438l2396k1624J03603R4626l5511p1080P2637P5327o9258n1363
$$ plain form
25138 51725 109170 83371 34727 6564 134287 -119281 -227636 -84883 -85267 -107518 -86063
25127 -86063 -63028 -81682 -125949 -82912 -127067 -12664 149570 126985 161498 154566 155758 232030
25115 232030 177874 107259 34340 68121 153385 119835 -13165 -71192 39565 -63817 -240864
25104 -240864 -248181 -220568 -175095 -52807 22088 138524 115037 99314 107331 119010 68249
25093 68249 -15743 -91258 -146901 -217143 -101620 8875 60666 98771 111916 120107 104936
25082 104936 49927 -38131 -77093 -142682 -106485 27540 22969 49930 95237 5914 -17394
25071 -17394 -42845 43598 7131 -17612 -104170 -121709 -66341 -78758 -128411 -135663 -126433 -172420
25059 -172420 -190117 -175558 -137255 -39200 25177 34644 13849 -15739 -47353 -151765 -220965
$$ packed form
25138E1725N7445k5799m8644k8163J27723k53568j08355J42753l84k2251K1455
25127h6063K3035j8654m4267M3037m4155J14403J62234k2585L4513o932J192P6272
25115B32030n4156p0615p2919L3781Q5264l3550j33000n8027J10757j03382j77047
25104b40864p317K7613M5473J22288P4895J16436k3487j5723Q017J1679n0761
25093F8249q3992p5515n5643p0242J15523J10495N1791L8105J3145Q191j5171
25082A04936n5009q8058l8962o5589L6197J34025m571K6961M5307q9323k3308
25071a7394k5451Q6443l6467k4743q6558j7539N5368j2417m9653p252R230m5987
25059a72420j7697J4559L8303R8055O4377R467k0795k9588l1614j04412o9200
$$ plain form
25048 -220965 -166222 -144258 -148051 -74463 3885 58133 -19395 -116882 -32300 20033 58002 -53270
25036 -53270 -104250 6705 52995 -33556 -143075 -73870 -32768 -66314 -244042 -213477 -137392
25025 -137392 -123224 -48490 900 -17469 -46013 -26191 38877 131399 157837 93536 -25410
25014 -25410 -76056 -89135 -123264 -102540 630 48669 27340 -48541 3889 22727 43118
25003 43118 -2421 -26588 -45243 -107229 -104625 -161159 -63426 63165 18336 -143946 -112621
24992 -112621 -101284 -84868 -14837 -83709 -109106 -95880 -36983 15544 61164 131746 224714
24981 224714 241968 266901 152207 49221 57992 -12935 -127806 -116630 -39423 18293 65236
24970 65236 46807 99790 141485 61015 86756 189674 180817 123565 -66242 23208 119517
$$ packed form
25048b20965N4743K1964l793P3588P8348N4248p7528r7487Q4582N2333L7969j11272
25036e3270n0980J10955M6290q6551j09519O9205M1102l3546j77728L0565P6085
25025a37392J4168P4734M9390j8369k8544J9822O5068R2522K6438o4301j18946
25014b5410n0646j3079l4129K0724J03170M8039k1329p5881N2430J8838K0391
25003D3118m5539k4167j8655o1986K604n6534R7733J26591m4829j62282L1325
24992a12621J1337J6416P0031o8872k5397J3226N8897N2527M5620P0582R2968
24981B24714J7254K4933j14694j02986Q771p0927j14871J1176P7207N7716M6943
24970F5236j8429N2983M1695q0470K5741J02918q857n7252j89807Q9450R6309
$$ plain form
24959 119517 91934 59905 70115 129364 135002 149986 121158 1881 -14890 -84686 -97359
24948 -97359 -99151 7449 44162 -63628 -181716 -227754 -132193 -56984 4838 39353 97113
24937 97113 116319 -371 -87614 -62285 3790 72159 175173 203354 192771 156550 40454
24926 40454 -104021 -85922 -34132 -77711 -124629 -187476 -199446 -89874 5727 29588 86244
24915 86244 -9327 -21549 -106927 -272493 -186557 -90873 -70346 -43394 -18576 -59600 -76718
24904 -76718 -189537 -230630 -265448 -242790 -121104 -27605 -35191 -32375 31605 142996 81774
24893 81774 -81647 -110795 -134160 -152043 -70678 -73190 32666 20801 -69862 6594 162287
24882 162287 185708 101521 79871 -11433 -15546 -22784 -91400 -166249 -75615 -151237 -210173 -153631
$$ packed form
24959A19517k7583l2029J0210N9249N638J4984k8828j19277j6771o9796j2673
24948i7359j792J06600L6713j07790j18088m6038R5561P5209O1822L4515N7760
24937I7113J9206j16690q7243K5329O6075O8369J03014K8181j0583l6221j16096
24926D0454j44475J8099N1790m3579m6918o2847j1970J09572R5601K3861N6656
24915H6244r5571j2222q5378j65566Q5936R5684K0527K6952K4818m1024j7118
24904g6718j12819m1093l4818K2658J21686R3499p586K816O3980J11391o1222
24893H1774j63421k9148k3365j7883Q1365k512J05856j1865r0663P6456J55693
24882A62287K3421q4187k1650r1304m113p238o8616p4849R0634p5622n8936N6542
$$ plain form
24870 -153631 -129262 -162012 -228909 -220284 -26934 -64128 -212337 -277049 -224027 -149304 -108393
24859 -108393 -64585 -7600 -15109 37039 118142 171221 37416 -29689 -31794 66048 25641 -76007
24847 -76007 75798 128955 158433 212906 185637 91676 39153 67509 166776 122674 63780
24836 63780 3955 36102 36932 -72444 -54878 53578 80959 37120 -40324 -37542 -56639 -107888
24824 -107888 -113393 -150843 -147435 -46355 -54959 -123371 -189576 -202340 -121913 -220601 -306089 -207268
24812 -207268 -163003 -122643 -73381 -88385 -107793 -162266 -102481 -69670 10897 6354 -116638
24801 -116638 -114573 -152510 -91365 15748 117302 58104 -33250 -114346 -124993 -108244 -76080
24790 -76080 -62958 -25484 -34701 -101054 -164421 -157134 -22026 -938 -38395 41675 1440 4782
$$ packed form
24870a53631K4369l2750o6897Q625J93350l7194j48209o4712N3022P4723M0911
24859a08393M3808N6985p509N2148Q1103N3079j33805o7105k105R7842m0407j01648
24847g6007J51805N3157K9478N4473k7269r3961n2523K8356R9267m4102n8894
24836F3780n9825L2147Q30j09376J7566J08456K7381m3839p7444K782j9097n1249
24824a07888n505l7450L408J01080q604o8412o6205j2764Q0427r8688q5488R8821
24812b07268M4265M0360M9262j5004j9408n4473N9785L2811Q0567m543j22992
24801a16638K065l7937O1145J07113J01554n9198r1354q1096j0647J6749L2164
24790g6080J3122L7474r217o6353o3367P287J35108K1088l7457Q0070m0235L342
$$ plain form
24778 4782 67089 173243 117895 20549 60343 80089 22319 54965 95068 138069 44104 -8784
24766 -8784 -20943 9536 30937 77459 162616 188014 131799 128958 42135 14013 -16503 96128
24754 96128 53023 -4176 -42539 -42818 -80133 -29772 24052 -94148 -228938 -282277 -206353 -165378
24742 -165378 -143591 -13496 109998 131737 96270 69859 56224 60979 69717 82510 43022
24731 43022 13782 -132303 -238244 -188609 -171002 -114565 -175822 -150800 -113136 -98477 -88445
24720 -88445 -93672 -116413 -10320 27969 36920 -98329 -141428 -105917 -20336 27714 119201 160657
24708 160657 201808 89354 35549 -53931 -195132 -93430 38758 -30616 -100022 -47816 70397
24697 70397 58178 -34366 -20599 237 78065 11627 10164 3676 -102469 -102380 -80844 -183852
$$ packed form
24778D782O2307J06154n5348r7346L9794J9746n7770L2646M0103M3001r3965n2888
24766h784j2159L0479K1401M6522Q5157K5398n6215k841q6823k8122l0516J12631
24754I6128m3105n7199l8363k79l7315N0361N3824j18200j34790n3339P5924M0975
24742a65378K1787J30095J23494K1739l5467k6411j3635M755Q738J2793l9488
24731D3022k9240j46085j05941M9635J7607N6437o1257K5022L7664J4659J0032
24720h8445n227k2741J06093L8289Q951j35249m3099L5511Q5581M8050R1487M1456
24708A60657M1151j12454n3805q9480j41201J01702J32188o9374o9406N2206J18213
24697G0397j2219r2544J3767K0836P7828o6438j463o488j06145Q9K1536j03008
$$ plain form
24685 -183852 -201892 -127827 2924 -72977 -64234 -83646 -183898 -169990 -48271 41634 104308
24674 104308 68437 28759 -22703 -143412 -89590 130620 186518 182515 88120 44720 67378
24663 67378 -24010 2998 137873 122018 110772 251467 297583 216195 113124 86071 67087
24652 67087 -40041 -142285 -76467 -53900 -93452 -29209 -464 30926 77546 28433 -103823
24641 -103823 -180970 -127141 -26504 28435 -49763 -151086 -154825 -121812 -123980 -171940 -209861
24630 -209861 -149145 -66129 -1820 82829 4051 37964 22958 13088 24039 28789 -23026 19375
24618 19375 120404 61841 -23951 -20363 12536 -70831 -64091 -147398 -128990 -67867 -79459 -54798
24606 -54798 -77179 -143411 -93107 18387 117676 -1454 -84903 -87668 -15584 101078 113236
$$ packed form
24685a83852j8040P4065J30751p5901Q743j9412j00252J3908J21719Q9905O2674
24674A04308l5871l9678n1462j20709N3822K20210N5898m003r4395m3400K2658
24663F7378r1388K7008J34875j5855j1246J40695M6116q1388j03071k7053j8984
24652F7087j07128j02244O5818K2567l9552O4243K8745L1390M6620m9113j32256
24641a03823p7147N3829J00637N4939p8198j01323l739L3013k168m7960l7921
24630b09861O0716Q3016O4309Q4649p8778L3913j5006r870J0951M750n1815M2401
24618A9375J01029n8563q5792L588L2899q3367O740q3307J8408O1123j1592K4661
24606e4798k2381o6232N0304J11494R9289j19130q3449k765P2084J16662J2158
$$ plain form
24595 113236 68912 68346 115945 70321 117881 120788 80764 34196 124019 215819 237952 84547
24583 84547 -96874 -120259 -127144 -105569 -80896 -67952 -60949 -35784 100076 109056 -57455 -185281
24571 -185281 -137316 -96307 -15783 64288 37243 4725 3814 84420 27614 97707 134290 27626
24559 27626 28819 109271 23073 -74484 48088 -60361 -133184 -41477 -47083 -16538 -72594 -174556
24547 -174556 -156121 -30773 -150517 -225098 -93877 -6779 -103786 -247054 -311483 -347254 -363098
24536 -363098 -279912 -146536 -122234 -67480 -2268 -23014 -85650 -63870 -150909 -83876 -82158
24525 -82158 -70547 31726 125202 10499 -53660 -32972 17831 -43110 -64543 -15130 -25641
24514 -25641 2457 -28665 -42813 -127341 -196302 -260629 -260686 -99309 31218 111737 138475 54000
$$ packed form
24595A13236m4324n66M7599m5624M7560K907m0024m6568Q9823R1800K2133j53405
24583H4547j81421k3385o885K1575K4673J2944P003K5165J35860Q980j66511j27826
24571a85281M7965M1009Q0524Q0071k7045l2518r11Q0606n6806P0093L6583j06664
24559B7626J193Q0452q6198r7557J22572j08449p2823R1707n606L0545n6056j01962
24547a74556J8435J25348j19744p4581J31221Q7098r7007j43268o4429l5771j5844
24536c63098Q3186J33376K4302N4754O5212k0746o2636K1780q7039O7033J718
24525h2158J1611J02273R3476j14703o4159K0688N0803o0941k1433M9413j0511
24514b5641K8098l1122j4148q4528o8961o4327n7J61377J30527Q0519K6738q4475
$$ plain form
24502 54000 5133 -52670 -15474 75358 106646 58027 -567 74892 137930 104358 90708 37320
24490 37320 -14958 43009 44123 -13285 -101394 -103305 -15302 43736 38158 34225 -7665 32488
24478 32488 104648 126969 148687 70584 79431 -51617 -26115 18521 66370 86697 111980 120706
24466 120706 82607 106228 31355 -113471 -109181 -115312 -102062 -132102 -233093 -239604 -52650
24455 -52650 12378 54756 82129 51457 75492 142231 68937 -77710 -57512 21716 -81507
24444 -81507 -177814 -26175 2449 -19183 2852 -52020 -212531 -90395 -6594 -85746 -184345
24433 -184345 -192812 -80458 -89169 -6724 -68762 -196739 -235888 -142290 -47051 78780 75081
24422 75081 205982 292751 181560 88719 2075 -113796 -66861 -130567 -249887 -257228 -252023
$$ packed form
24502E4000m8867n7803L7196R0832L1288m8619n8594P5459O3038l3572j3650n3388
24490C7320n2278N7967J114n7408q8109j911Q8003N9038n578l933m1890M0153
24478C2488P2160K2321K1718p8103Q847j31048K5502M4636M7849K0327K5283Q726
24466A20706l8099K3621p4873j44826M290o131J3250l0040j00991o511J86954
24455e2650O5028M2378K7373l0672K4035O6739p3294j46647K0198P9228j03223
24444h1507r6307J51639K8624k1632K2035n4872j60511J22136Q3801p9152r8599
24433a84345q467J12354q711Q2445o2038j27977l9149R3598R5239J25831l699
24422G5081J30901Q6769j11191r2841q6644j15871M6935o3706j19320p341N205
$$ plain form
24411 -252023 -297220 -251947 -120543 -47808 -187475 -334428 -285513 -165974 -113616 -11978
24401 -11978 32434 40746 177075 201203 125069 57815 -146858 -230447 -276934 -176080 -124976
24390 -124976 -35695 70523 44172 17844 -62079 -137642 -117419 80 -65898 -115734 -65014
24379 -65014 -121364 -185330 -139933 -276139 -319674 -153932 63024 104689 123447 185821 202497
24368 202497 238365 240638 129669 91710 106959 40009 48739 143432 218934 204609 127467 -4770
24356 -4770 -49617 -16043 -166823 -266135 -185142 -202674 -238526 -163047 -21535 3970 -171694
24345 -171694 -152515 -160747 -283797 -290602 -162559 -133339 -61236 -36190 -66259 -47875 -41846 98934
24333 98934 172978 131603 26716 -103227 -110299 -30380 -72514 -123480 20124 111354 64724
$$ packed form
24411b52023m5197M5273J31404P2735j39667j46953M8915J19539N2358J01638
24401a1978M4412Q312J36329K4128p6134o7254k04673q3589m6487J00854N1104
24390a24976Q9281J06218k6351k6328p9923p5563K0223J17499o5978m9836N0720
24379f5014n6350o3966M5397j36206m3535J65742K16956M1665J8758O2374J6676
24368B02497L5868K273j10969l7959J5249o6950Q730R4693P5502j4325p7142j32237
24356d770m4847L3574j50780r9312Q0993j7532l5852P5479J41512K5505j75664
24345a71694J9179q232j23050o805J28043K9220P2103K5046l0069J8384O029J40780
24333I8934P4044m1375j04887j29943p072P9919m2134n0966J43604R1230m6630
$$ plain form
24322 64724 68420 54976 20132 -21679 -184835 -306641 -261073 -237904 -206994 -192464 -233474
24311 -233474 -292372 -143855 -93593 -157895 -191081 -183498 -118626 -83970 -124248 -86922 -52549
24300 -52549 -69300 -61162 -29791 143660 171325 173810 90742 74916 143692 130401 111569 108
24288 108 -113079 -188724 -219774 -156098 -72552 -87415 -111974 -74066 -93235 -60791 30830 55763
24276 55763 37333 -10494 -40033 -35682 -9773 -109489 -35379 85708 38338 -179986 -181010 -116302
24264 -116302 -160645 -76895 2022 -72332 -84305 -44861 -42563 30883 181424 163485 7869
24253 7869 -7044 65387 112323 150695 177048 200322 220669 352153 322354 219841 180128
24242 180128 86023 135893 101087 36437 -85391 -69270 -31828 -37748 -38989 43513 60857 -76699
$$ packed form
24322F4724L696j3444l4844m1811j63156j21806M5568K3169L0910J4530m1010
24311b33474n8898J48517N0262o4302l3186P583O4872L4656m0278L7326L4373
24300e2549j6751Q138L1371J73451K7665K485q3068j5826O8776j3291j8832j11461
24288A08j13187p5645l1050O3676Q3546j4863k4559L7908j9169L2444R1621K4933
24276E5763j8430m7827k9539M351K5909r9716P4110J21087m7370k18324j024O4708
24264a16302m4343Q3750P8917p4354j1973L9444K298P3446J50541j7939j55616
24253G869j4913P2431M6936L8372K6353K3274K0347J31484k9799j02513l9713
24242A80128r4105M9870l4806o4650j21828J6121L7442n920j241Q2502J7344j37556
$$ plain form
24230 -76699 -132571 -194943 -131010 -35614 -81898 -74828 -91691 -161578 -222982 -190204 -35777 -72195
24218 -72195 -39295 -7246 -53807 -49040 -30175 -46597 -206423 -256764 -180516 -110097 -86448 -65173
24206 -65173 8384 -40122 -45042 -110940 -158605 -166617 -155044 -147998 26473 188764 108756 -104228
24194 -104228 -97178 39639 180691 120021 -52095 -88634 -21556 11740 128521 129211 57170
24183 57170 46638 91940 102430 -34591 -135321 -199062 -225343 -161195 -112103 -202211 -139497
24172 -139497 -71317 -29121 38908 -1661 13584 124398 146890 51878 -106437 -171228 4205
24161 4205 -53606 -127717 -114831 -228418 -224472 -80723 -5890 142045 213448 197906 260582
24150 260582 142675 33209 -11510 -53938 18105 4046 -51679 -28186 37591 24770 34345
$$ packed form
24230g6699n5872o2372O3933R5396m6284P070j6863o9887o1404L2778J54427l6418
24218g2195L2900L2049m6561M767J8865j6422j59826n0341P6248P0419K3649K1275
24206f5173P3557m8506m920o5898m7665q012J1573P046J74471J62291q0008k12984
24194a04228P050J36817J41052o0670j72116l6539O7078L3296J16781O90p2041
24183E7170j0532M5302J0490j37021j00730o3741k6281O4148M9092r0108O2714
24172a39497O8180M2196O8029m0569J5245J10814K2492r5012j58315o4791J75433
24161D205n7811p4111J2886j13587L946J43749P4833J47935P1403j5542O2676
24150B60582j17907j09466m4719m2428P2043j4059n5725K3493O5777j2821R575
$$ plain form
24139 34345 -1227 2286 41495 53318 76411 -92685 -175954 -232123 -220614 -75787 26978
24128 26978 176044 100470 60989 50227 36502 54443 83282 19943 88813 82394 2202 10063
24116 10063 31837 -13615 2873 88510 129975 59427 -35747 51332 104280 167721 99417 -22562
24104 -22562 -139017 -35927 -6677 -2574 6677 -126685 -101444 -66604 -31061 38050 35529 -21202
24092 -21202 -19716 -96730 -34838 6560 -49652 -63332 -99204 -71849 40653 169176 182059
24081 182059 28354 -17240 -8304 -156506 -134333 52807 136919 92195 163213 163901 69585
24070 69585 103662 159575 66649 -71186 -157036 -88158 62903 139990 198142 247984 230761
24059 230761 63951 35386 121371 203419 172846 35839 43989 -52841 6268 102400 39807
$$ packed form
24139C4345l5572L513L9209J1823K3093j69096q3269n6169J1509J44827J02765
24128B6978J49066p5574l9481j0762j3725J7941K8839o3339O8870o419q0192P861
24116A0063K1774m5452J6488Q5637M1465p0548r5174Q7079N2948O3441o8304j21979
24104b2562j16455J03090K9250M103R251j33362K5241L4840L5543O9111k521n6731
24092b1202J486p7014O1892M1398n6212j3680l5872K7355J12502J28523J2883
24081A82059j53705m5594Q936j48202K2173J87140Q4112m4724P1018O88r4316
24070F9585L4077N5913r2926j37835q5850O8878J51061P7087N8152M9842j7223
24059B30761j66810k8565Q5985Q2048l0573j37007Q150r6830N9109R6132o2593
$$ plain form
24048 39807 -54781 -102405 -154273 -151602 -5899 53486 45024 75532 52388 76189 30616 -98082
24036 -98082 -139230 -36499 -30401 -106448 -83931 -19055 1134 -18934 55179 -5187 1366 48569
24024 48569 -48868 -54513 -129100 -246234 -270238 -135540 -153399 -165725 -152276 -105554 -103064 -77082
24012 -77082 9259 -19400 -116569 -111365 -76093 -30014 -113741 -196028 -202916 -230426 -236136 -44326
24000 -44326 -176 -83253 -147569 -178531 -31558 35432 34340 63057 87752 52330 -41147 -55878
23988 -55878 -4643 -106404 -126207 -150119 -186019 -65681 -54715 -77968 -15649 47805 98404
23977 98404 -5949 -125303 -178442 -217425 -193588 -138465 -11182 64998 -2433 -66980 -83511
23966 -83511 -48417 -45980 -71618 21091 175598 62741 -69182 17822 70857 174111 228756
$$ packed form
24048C9807r4588m7624n1868K671J45703N9385q462L0508k3144K3801m5573j28698
24036i8082m1148J02731O098p6047K2517O4876K0189k0068P4113o0366O553M7203
24024D8569r7437n645p4587j17134k4004J34698j7859j2326J3449M6722K490K5982
24012g7082Q6341k8659r7169N204L5272M6079q3727q2287o888k7510n710J91810
24000d4326M4150q3077o4316l0962J46973O6990j092K8717K4695l5422r3477j4731
23988e5878N1235j01761j9803k3912l5900J20338J0966k3253O2319O3454N0599
23977I8404j04353j19354n3139l8983K3837N5123J27283P6180o7431o4547j6531
23966h3511L5094K437k5638R2709J54507j12857j31923Q7004N3035J03254N4645
$$ plain form
23955 228756 54875 79437 76812 -20701 -34159 -7352 -100117 -153618 -158527 -36213 -98885
23944 -98885 -181446 -99416 -118244 -189559 -178847 -84643 -10006 -12178 -12976 -97872 -221203 -274168
23932 -274168 -280938 -104371 -88904 -49859 60137 66980 67137 69632 58741 -4939 -107827 -144043
23920 -144043 -76357 -68473 44311 178245 86740 111813 7916 -84983 -41698 13256 161538
23909 161538 112926 -31564 807 5940 -107490 -104602 14548 77947 114536 75578 64867
23898 64867 92383 11722 -82465 -88391 31751 55842 -446 59024 6290 -19830 -38913 -152361
23886 -152361 -174683 -235409 -119369 -58145 -88932 -104929 -137292 -187804 -208903 -198629 -182805
23875 -182805 -146602 -48442 -39147 -182624 -121757 11491 36916 51974 31088 77101 137549
$$ packed form
23955B28756j73881K4562k625r7513j3458K6807r2765n3501m909J22314o2672
23944i8885q2561Q2030j8828p1315J0712R4204P4637k172p98q4896j23331n2965
23932b74168o770J76567J5467L9045J09996O843J57K495j0891o3680j02888l6216
23920a44043O7686P884J12784J33934r1505K5073j03897r2899M3285N4954J48282
23909A61538m8612j44490L2371N133j13430K888J19150O3399L6589l8958j0711
23898F4867K7516q0661r4187n926J20142K4091n6288N9470n2734k6120j9083j13448
23886a52361k2322o0726J16040O1224l0787j5997l2363n0512k1099J0274J5824
23875a82805L6203R8160R295j43477O0867J33248K5425J5058k0886M6013O0448
$$ plain form
23864 137549 25462 -124867 -101236 -159515 -256565 -188414 -136859 -10849 169641 114783 97969
23853 97969 103230 98498 5382 -67713 -108101 -115004 -179095 -199233 -88955 -116867 -184725 -210640
23841 -210640 -123168 -31728 25497 45475 22464 -35853 60396 170954 146859 77378 28687
23830 28687 21218 -22309 -141695 -80447 16666 -25465 -84064 -94086 -92954 -28397 -68339 -83334
23818 -83334 -37151 -85618 -74290 -73297 -36057 -34398 -69952 -106836 -66336 -5255 -1721 58264
23806 58264 143392 72995 -43298 -78262 -25565 71750 87765 -1520 17636 45938 27554
23795 27554 108782 155801 119771 79244 49253 49187 60517 53946 90480 68063 70471 98468 91758
23782 91758 45759 -102356 -70116 -22704 -44062 -9693 53296 85917 104826 43959 48243 78523
$$ packed form
23864A37549j12087j50329K3631n8279r7050O8151N1555J26010J80490n4858j6814
23853I7969N261m732r3116p3095m0388o903o4091k0138J10278k7912o7858k5915
23841b10640Q7472R1440N7225J9978k3011n8317R6249J10558k4095o9481m8691
23830B8687p469m3527j19386O1248R7113m2131n8599j0022J132O4557l9942j4995
23818h3334M6183m8467J1328R93L7240J659l5554l6884M0500O1081L534N9985
23806E8264Q5128p0397j16293l4964N2697R7315J6015q9285J9156K8302j8384
23795B7554Q1228M7019l6030m0527k9991o6J1330o571L6534k2417K408K7997o710
23782I1758m5999j48115L2240M7412k1358L4369O2989L2621J8909o0867M284L0280
$$ plain form
23770 78523 186465 214679 226755 266930 196595 115494 123853 129075 190433 139862 90522 69823
23758 69823 82598 122643 146712 284508 268608 125968 65571 41972 6705 -94338 -147977
23747 -147977 -108412 -126149 -165631 -23558 98503 146194 95528 80275 50368 -39446 -130593
23736 -130593 -100899 -87317 17711 115663 129621 13758 -33333 -14663 -87844 -57932 -78919
23725 -78919 32921 173261 78157 -54614 -108845 -33002 -60539 -106888 45035 138088 205665
23714 205665 175705 140947 141682 87151 31283 48538 74084 89185 47302 2257 -15245 3567
23702 3567 53177 57913 110587 58938 69878 36923 95999 91270 76949 3925 -48564 -8458
23690 -8458 -89927 -10290 63201 36932 45517 76461 102454 164796 192058 43462 -128938 -120402
$$ packed form
23770G8523J07942K8214J2076M0175p0335q1101Q359N222O1358n0571m9340k0699
23758F9823J2775M0045K4069J37796j5900j42640o0397k3599l5267j01043n3639
23747a47977L9565j7737l9482J42073J22061M7691n0666j5253k9907q9814r1147
23736a30593K9694J3582J05028R7952J3958j15863m7091J8670p3181K9912k0987
23725g8919J11840J40340r5104j32771n4231P5843k7537m6349J51923R3053O7577
23714B05665k9960l4758P35n4531n5868J7255K5546J5101m1883m5045j7502J8812
23702C567M9610M736N2674n1649J0940l2955N9076m729j4321p3024n2489M0106
23690h458q1469P9637P3491k6269Q585L0944K5993O2342K7262j48596j72400Q536
$$ plain form
23678 -120402 -95310 -108187 -213939 -248979 -140274 -114206 -30558 -107320 -225304 -189537 -146920
23667 -146920 -85706 -29956 -151610 -291306 -312581 -315401 -342859 -204662 -37355 -99264 9625
23656 9625 44713 49897 144751 202053 241188 281931 186173 181811 160487 166265 88268 60660
23644 60660 -31831 -19972 -6512 103561 77331 85769 61190 -23587 -31023 56091 121289 -58656
23632 -58656 -181617 -209313 -213776 -119430 -82303 60136 20707 -81958 -180421 35888 27648
23621 27648 -125837 -248480 -340471 -146841 7022 -31733 -161184 -165473 -79413 -23669 -90299
23610 -90299 -30947 21277 -46644 -104700 -112403 -119538 -70052 -40989 -17929 111668 152305 29030
23598 29030 -35970 -31411 -2347 88700 21969 -70062 -52811 -25653 -84844 -68007 -83265 -173180
$$ packed form
23678a20402K5092j2877j05752l5040J08705K6068Q3648p6762j17984L5767M2617
23667a46920O1214N5750j21654j39696k1275k820k7458J38197J67307o1909J08889
23656I625L5088N184R4854N7302L9135M0743r5758m362k1324N778p7997k7608
23644F0660r2491J1859J3460J10073k6230Q438k4579q4777p436Q7114O5198j79945
23632e8656j22961k7696m463R4346L7127J42439l9429j02665r8463K16309q240
23621B7648j53485j22643r1991J93630J53863l8755j29451m289Q6060N5744o6630
23610i0299N9352N2224o7921n8056p703p135M9486K9063K3060J29597M0637j23275
23598B9030o5000M559K9064R1047o6731r2031J7251K7158n9191J6837j5258q9915
$$ plain form
23586 -173180 -303507 -256049 -130298 -94950 -154676 -280612 -218479 -89155 -26324 -171013
23576 -171013 -180659 -106461 -109860 -67142 -166538 -117941 -107836 -188384 -114791 17616 -123277
23565 -123277 -171979 -128686 -206107 -190443 -220247 -244157 -242992 -235909 -198320 -167335 -161461 -106634
23553 -106634 -60778 54535 73082 138418 227337 228509 203736 83818 -68555 -91785 -21423
23542 -21423 15718 61630 19190 -107008 -181730 -150073 -122679 -154271 -162521 -119875 -105741 -32442
23530 -32442 1840 18034 24585 73242 77648 136612 114492 11337 -75785 -16741 -15221 -21439
23518 -21439 -21628 -68438 -122459 -127592 -75085 4906 129256 209589 120041 113030 130715 10181
23506 10181 -68811 -8593 6549 126486 130897 116221 140087 106396 12596 27327 2091 -27562
$$ packed form
23586a73180j30327M7458J25751L5348n9726j25936O2133J29324O2831j44689
23576a71013r646P4198l399M2718r9396M8597J0105q0548P3593J32407j40893
23565a23277m8702M3293p7421J5664k9804k3910J165P083L7589L0985N874N4827
23553a06634M5856J15313J8547O5336Q8919J172k4773j19918j52373k3230P0362
23542b1423L7141M5912m2440j26198p4722L1657K7394l1592q250M2646J4134P3299
23530c2442L4282J6194O551M8657M406N8964k2120j03155q7122N9044J520o218
23518b1439j89m6810n4021n133N2507P9991J24350Q0333q9548p011J7685j20534
23506A0181p8992O0218J5142J19937M411j4676K3866l3691r3800J4731k5236k9653
$$ plain form
23494 -27562 16625 60385 19999 12175 8855 36376 45620 26592 108563 106516 73280 -3441
23482 -3441 55773 91687 92287 59185 51964 99595 121713 128054 12522 -5694 39784 117487
23470 117487 98545 63518 39569 79583 101523 -9590 20583 78244 109704 59869 -15465
23459 -15465 21717 146211 131106 92890 99167 36265 22354 -31749 -73825 -134036 -229751 -114877
23447 -114877 -7097 9050 -47864 -36823 -5425 70308 151927 221874 144410 118179 141214
23436 141214 125361 53038 18257 20806 -59246 -16538 90084 141709 78945 65068 252707
23425 252707 353429 227267 101086 -28945 -56070 -13182 127791 60382 58446 67329 74495
23414 74495 35810 38934 -32102 7824 75119 92019 122168 119024 156267 38629 -132559 -71857
$$ packed form
23494b7562M4187M3760m0386p824l320K7521R244j9028Q1971k047l3236p6721
23482c441N9214L5914O00l3102p221M7631K2118O341j15532j8216M5478P7703
23470A17487j8942l5027k3949M0014K1940j11113L0173N7661L1460m9835p5334
23459a5465L7182J24494j5105l8216O277o2902j3911n4103m2076o0211r5715J14874
23447a14877J07780J6147n6914J1041L1398P5733Q1619O9947p7464k6231K3035
23436A41214j5853p2323l4781K549q0052M2708J06622N1625o2764j3877J87639
23425B52707J00722j26162j26181j30031k7125M2888J40973o7409j936Q883P166
23414G4495l8685L124p1036L9926O7295J6900L0149l144L7243j17638j71188O0702
$$ plain form
23402 -71857 -3338 4341 16199 -58797 -81703 -59182 -89297 30244 74076 46691 96633 36343
23390 36343 38374 57445 -26996 18365 165738 179239 263812 374423 436385 610271 934177
23379 934177 1291632 1583462 1983642 2245803 2407458 2422199 2425247 2342183 2118720 1855488
23369 1855488 1635500 1172831 777876 617495 497568 401847 370956 367449 326184 345418
23359 345418 301319 220621 103183 78186 69842 83667 166140 270092 497299 474125 241584
23348 241584 46938 -183641 -198095 -123715 -88261 -72498 -70393 -144271 26893 245228 211963
23337 211963 141993 84486 14244 77416 126531 138138 181083 184373 196497 34138 -93203
23326 -93203 -60332 10906 3099 71769 107752 109697 31118 -24759 -700 -8051 39784 52931
$$ packed form
23402g1857O8519P679J1858p4996k2906K2521l0115J19541M3832k7385M9942o0290
23390C6343K031J9071q4441M5361J47373J3501Q4573J10611O1962J73886L23906
23379I34177L57455K91830M00180K62161J61655J4741L048q3064k23463k63232
23369A855488k19988m62669l94955j60381j19927r5721l0891l507m1265J9234
23359C45418m4099q0698j17438k4997q344J3825Q2473J03952K27207k3174k32541
23348B41584j94646k30579j4454P4380L5454J5763K105p3878J71164K18335l3265
23337B11963o9970n7507p0242O3172M9115J1607M2945L290J2124j62359j27341
23326i3203L2871P1238p807O8670L5983J945p8579n5877K4059p351M7835J3147
$$ plain form
23314 52931 -471 34415 126412 200077 199480 182134 172085 124509 -83709 -167303 -220737 -213147
23302 -213147 -160277 -73273 -180605 -164284 -93436 -5199 -85352 -130707 -186819 -118968 -10406
23291 -10406 -1730 72502 61989 38759 596 -48073 -134060 -128271 -74439 -42380 138061 135034
23279 135034 221873 288595 205223 152890 229021 191792 71908 -83166 -101945 -58397 -98004
23268 -98004 -12872 -23656 -55163 4009 86772 19020 -53562 -59535 -62288 -65593 -25277 34359
23256 34359 15467 -34925 20083 7492 -158256 -147421 -103532 72927 238051 267605 93560
23245 93560 -55591 -88095 33826 71091 110697 146715 178140 148563 10836 54664 27325
23234 27325 7867 32051 38292 -45634 -185376 -157222 -61186 91806 202980 173362 184825
$$ packed form
23314E2931n3402L4886R1997P3665n97j7346j0049m7576k08218q3594n3434P590
23302b13147N2870Q7004j07332J6321P0848Q8237q0153m5355n6112O7851J08562
23291a0406Q676P4232j0513k3230l8163m8669q5987N789N3832L2059J80441l027
23279A35034Q6839O6722q3372n2333P6131l7229j19884j55074j8779M3548l9607
23268i8004Q5132j0784l1507N9172Q2763o7752p2582n973k753l305M0316N9636
23256C4359j8892n0392N5008j2591j65748J0835M3889J76459J65124K9554j74045
23245I3560j49151l2504J21921L7265L9606L6018L1425k9577j37727M3828k7339
23234B7325j9458K4184O241q3926j39742K8154R6036J52992J11174k9618J1463
$$ plain form
23223 184825 259495 199716 139425 78964 90150 94682 80784 3828 -85212 30734 46591
23212 46591 51191 -11523 -50478 -78032 -65894 -76091 -2674 -26591 17343 206080 211200 -17539
23200 -17539 38635 59189 -69517 -144981 -105912 -103701 -129959 -196209 -227243 -272292 -114886
23189 -114886 16197 -76889 -139706 -51949 87101 109040 76718 63916 58919 -26460 -88239
23178 -88239 -48187 -97265 -192768 -211436 -80709 13685 -42137 -42296 105141 45197 -40069 -12389
23166 -12389 7782 -82478 -196823 -132430 -146338 -178877 -126570 -72944 17952 85626 110192
23155 110192 27452 -67557 -48639 -35965 -119534 -83846 14250 70386 194778 117735 105126
23144 105126 245240 402767 438817 526754 599516 730148 1101689 1495066 1878086 1881192
$$ packed form
23223A84825P4670n9779o0291o0461J1186M532j3898p6956q9040J15946J5857
23212D6591M600o2714l8955k7554J2138j0197P3417k3917M3934J88737N120k28739
23200a7539N6174K0554j28706p5464L9069K211k6258o6250l1034m5049J57406
23189a14886J31083r3086o2817Q7757J39050K1939l2322j2802m997q5379o1779
23178h8239M0052m9078r5503j8668J30727R4394n5822j59J47437n9944q5266K7680
23166a2389K0171r0260j14345O4393j3908l2539N2307N3626R0896O7674K4566
23155A10192q2740r5009J8918J2674q3569L5688R8096N6136J24392p7043j2609
23144A05126J40114J57527L6050Q7937P2762J30632L71541L93377L83020L106
$$ plain form
23134 1881192 1760111 1652670 1640577 1635914 1545074 1206052 872261 657694 506484 445543
23124 445543 450537 377695 223668 112299 191153 100862 55240 174634 197040 288796 268775
23113 268775 181754 102504 131826 205833 167290 109418 16774 63648 52523 140811 260908
23102 260908 159106 255644 276522 236586 229485 145141 35605 11888 2020 -57181 46688
23091 46688 125360 115751 53831 40501 18716 5833 -38403 -85434 -145035 -123821 -126278 -166895
23079 -166895 -156895 -63736 -19808 -3095 -68866 -65097 39177 6393 99919 29800 -81092
23068 -81092 -242435 -90663 36316 -64784 32412 103862 107700 142676 146912 164298 179352
23057 179352 147371 73017 48441 21784 104056 205145 330915 328009 295830 345405 338517
$$ packed form
23134A881192j21081j07441j2093m663r0840l39022l33791k14567j51210o0941
23124D45543M994p2842j54027j11369P8854r0291m5622J19394K2406R1756k0021
23113B68775q7021p9250K9322P4007l8543n7872r2644M6874j1125Q8288J20097
23102B60908j01802R6538K0878l9936p101q4344j09536k3717r868n9201J03869
23091D6688P8672r609o1920j3330k1785j2883m4236m7031n9601K1214k457m0617
23079a66895J0000R3159M3928J6713o5771L769J04274l2784R3526p0119j10892
23068h1092j61343J51772J26979j01100R7196P1450L838L4976M236J7386J5054
23057A79352l1981p4354k4576k6657Q2272J01089J25770k906l2179M9575o888
$$ plain form
23046 338517 359893 495823 486805 416555 453504 444281 356847 399779 360907 303087 232491 147315
23034 147315 131980 65108 78073 175809 183386 161723 208924 309096 332703 518855 466445
23023 466445 243418 153322 202821 134515 -2076 -37925 -81036 -115720 -26861 68783 142719
23012 142719 132119 49324 4240 12243 106664 146771 172095 184646 241066 148404 120948 89772
23000 89772 33231 -71764 -15470 55181 12395 79671 240679 255871 168375 5929 15747
22989 15747 107264 227891 273174 118392 49286 29138 17798 84748 47047 -901 52934
22978 52934 30810 -9384 -64662 -102142 -12190 47808 52401 25221 120946 201382 88727 4316
22966 4316 114577 160815 86909 188379 290123 271720 301589 210227 105809 56986 61463
$$ packed form
23046C38517K1376J35930r018p0250L6949r223q7434M2932l8872n7820p0596q5176
23034A47315j5335o6872J2965R7736P577k1663M7201J00172K3607J86152n2410
23023D66445k23027r0096M9499o8306j36591l5849m3111l4684Q8859R5644P3936
23012A42719j0600q2795m5084Q003R4421M0107K5324J2551N6420r2662k7456l1176
23000H9772n6541j04995N6294P0651m2786O7276J61008J5192q7496j62446R818
22989A5747R1517J20627M5283j54782o9106k0148j1340O6950l7701m7948N3835
22978E2934k2124m0194n5278l7480Q9952N9998M593k7180R5725Q0436j12655q4411
22966D316J10261M6238p3906J01470J01744j8403K9869r1362j04418m8823M477
$$ plain form
22955 61463 94263 48714 -788 -21294 -75686 -114740 -106474 29654 80149 12247 -37014 152149
22943 152149 185329 224768 234037 312271 306590 290687 390376 476547 403638 358740 369338 377376
22931 377376 332765 425915 468080 449468 458280 504109 525781 508557 522490 552719 600550 744024
22919 744024 777261 746107 640591 582028 556938 591616 500589 451963 363459 255641 299613
22908 299613 543406 569514 434810 468368 499225 686832 710891 681852 613501 576982 624988
22897 624988 659495 600201 524438 497760 618684 760592 698104 634707 605953 495440 575948
22886 575948 510809 482095 582660 683503 759036 883744 1065728 1250182 1485162 1810844
22876 1810844 2237182 2568379 2874628 2979725 2885287 2925586 3014271 2786048 2375434 2179517
$$ packed form
22955F1463L2800m5549m9502k0506n4392l9054Q266J36128N0495o7902m9261J89163
22943A52149L3180L9439R269P8234n681j5903R9689Q6171p2909m4898J0598Q038
22931C77376m4611R3150M2165j8612Q812M5829K1672j7224J3933L0229M7831J43474
22919G44024L3237l1154j05516n8563k5090L4678r1027m8626q8504j07818M3972
22908B99613K43793K6108j34704L3558L0857J87607K4059k9039o8351l6519M8006
22897F24988L4507n9294p5763k6678J20924J41908o2488o3397k8754j10513Q0508
22886E75948o5139k8714J00565J00843P5533J24708J81984J84454K34980L25682
22876A810844M26338L31197L06249J05097r4438M0299Q8685k28223m10614j95917
$$ plain form
22866 2179517 1942722 1632371 1460577 1243562 1021998 911796 995680 1087831 1022408 1095420
22856 1095420 1058300 901662 814263 886453 1023180 1126610 1192237 1220452 1142410 1181214 1192781
22845 1192781 1178509 1122304 1212396 1254502 1223726 1372098 1470595 1555273 1411436 1317548 1323319
22834 1323319 1418671 1645234 1865177 1987190 2120066 2182929 2279167 2469050 2633257 2707163
22824 2707163 2789332 2967889 3032502 3234354 3745200 4153222 4425929 4993593 5765772 6472043
22814 6472043 7151338 7945071 8816214 9920031 11427047 13238921 15583432 18589509 22491865
22805 22491865 27628129 34412152 43734004 58068483 80875257 115504131 161797464
22798 161797464 216985479 279087754 346544791 406695549 443909084 453206664 450584607
$$ packed form
22866B179517k36795l10351j71794k17015k21564j10202Q3884R2151o5423P3012
22856A095420l7120j56638q7399P2190J36727J03430O5627K8215p8042L8804J1567
22845A192781j4272n6205R0092M2106l0776J48372R8497Q4678j43837r3888N771
22834A323319R5352K26563K19943J22013J32876O2863R6238J89883J64207P3906
22824B707163Q2169J78557O4613K01852N10846M08022K72707N67664P72179P06271
22814F472043O79295P93733Q71143J103817J507016J811874K344511L006077L902356
22805B2491865N136264O784023R321852J4334479K2806774L4628874M6293333
22798A61797464N5188015O2102275O7457037O0150758L7213535R297580k622057
$$ plain form
22791 450584607 438990866 405068424 354503766 311773750 263573063 201239430 150169130
22784 150169130 118747732 98656502 84449634 73861279 65829610 59674209 54765322
22777 54765322 50687973 47214568 44274622 41687039 39432052 37472953 35744050 34279330
22769 34279330 32841818 31319738 30116565 29089425 27951465 26914431 26056864 25268762
22761 25268762 24312922 23218958 22369301 21564094 20782016 20077461 19460220 18787778 18157811
22752 18157811 17547291 16890580 16334186 15692503 15044743 14580443 14343120 13888455 13277065
22743 13277065 12743131 12386231 11978335 11590518 11371749 11076132 10590788 10206706 10027979
22734 10027979 9696339 9374020 9114477 8970166 8824395 8603828 8238677 7952805 7739826
$$ packed form
22791D50584607j1593741l3922442n0564658m2730016m8200687o2333633n1070300
22784A50169130l1421398k0091230j4206868j0588355q031669o155401m908887
22777E4765322m077349l473405k939946k587583k254987j959099j728903j464720
22769C4279330j437512j522080j203173j027140j137960j037034q57567p88102
22761B5268762r55840j093964q49657q05207p82078p04555o17241o72442o29967
22752A8157811o10520o56711n56394o41683o47760m64300k37323m54665o11390
22743A3277065n33934l56900m07896l87817k18769k95617m85344l84082j78727
22734A0027979l31640l22319k59543j44311j45771k20567l65151k85872k12979
$$ plain form
22725 7739826 7622214 7448607 7291846 7083435 6941205 6946566 7104157 7167410 7217610 7344090
22715 7344090 7645990 7660955 7614653 7547666 7395126 7108501 6584408 6152130 5848046 5537086
22705 5537086 5247741 4885375 4666334 4508800 4324544 4051919 3876503 3815357 3736002 3626337
22695 3626337 3475021 3432087 3398283 3329647 3343248 3287611 3111775 3028519 3019812 2915384 2834153
22684 2834153 2846881 2735709 2514497 2424416 2311052 2148695 2179588 2191070 2027460 1893557
22674 1893557 1758673 1635996 1578806 1560690 1634835 1539453 1414169 1139904 916992 832685
22664 832685 790979 681345 526685 276697 241149 336854 389202 284108 292506 395552 501388
22653 501388 642335 625214 522027 438212 377240 321300 289839 268173 159798 102547 85174
$$ packed form
22725G739826j17612j73607j56761k08411j42230N361J57591O3253N0200J26480
22715G344090L01900J4965m6302o6987j52540k86625n24093m32278l04084l10960
22705E537086k89345l62366k19041j57534j84256k72625j75416o1146p9355j09665
22695C626337j51316m2934l3804o8636J3601n5637j75836q3256q707j04428q1231
22684B834153J2728j11172k21212r0081j13364j62357L0893J1482j63610j33903
22674A893557j34884j22677n7190j8116P4145r5382j25284k74265k22912q4307
22664H32685m1706j09634j54660k49988l5548R5705N2348j05094Q398J03046J05836
22653E01388J40947j7121j03187q3815o0972n5940l1461k1666j08375n7251j7373
$$ plain form
22642 85174 172624 329706 450390 422176 390277 532427 594770 574657 425839 429972 391084
22631 391084 388700 533593 510765 401812 279402 252026 368072 426249 351391 310331 274343
22620 274343 337342 391325 401769 394950 415087 431577 377781 321703 417959 468026 456095 502960
22608 502960 526308 525826 449222 444992 416489 374448 308774 345155 309442 269208 262846 227600
22596 227600 232433 241808 335556 286038 207293 187202 348435 437359 354528 275580 286899 376325
22584 376325 484577 511406 634801 585447 489678 561873 469266 422065 416104 457449 404169
22573 404169 408800 392873 284369 356994 389491 355096 288114 233339 232230 258515 186680 220941
22561 220941 264497 255972 337717 358541 363876 210911 179633 142007 228532 334020 281566
$$ packed form
22642H5174Q7450J57082J20684k8214l1899J42150O2343k0113j48818M133l8888
22631C91084k384J44893k2828j08953j22410k7376J16046N8177p4858m1060l5988
22620B74343O2999N3983J0444o819K0137J6490n3796n6078R6256N0067j1931M6865
22608E02960K3348m82p6604m230k8503m2041o5674L6381l5713m0234o362l5246
22596B27600M833R375R3748m9518p8745k0091J61233Q8924q2831p8948J1319Q9426
22584C76325J08252K6829J23395m9354r5769P2195r2607m7201n961M1345n3280
22573D04169M631j5927j08504P2625L2497l4395o6982n4775j109K6285p1835L4261
22561B20941M3556q525Q1745K0824N335j52965l1278l7626Q6525J05488n2454
$$ plain form
22550 281566 316721 289998 253035 238591 243131 233868 218415 232671 209484 121936 41088 75730
22538 75730 53845 156038 209391 247491 102927 89662 106069 155164 82933 31434 94217
22527 94217 174836 107080 71276 92570 47031 -17366 25101 69881 39132 82453 149472 96446
22515 96446 8604 183017 279890 283287 230489 170135 202876 171818 235925 297302 247063 232447
22503 232447 248719 265507 218371 174257 119558 144328 139971 69667 58010 103480 167365 43358
22491 43358 46324 166030 183910 159781 40151 -81741 -81693 113256 193022 81896 121788
22480 121788 89719 30778 63898 13302 39494 -9888 12781 62566 77349 -72206 14697
22469 14697 75101 99015 40980 130084 176301 101629 136902 52928 12095 49023 70902 -49586
$$ packed form
22550B81566L5155k6723l6963j4444M540r263j5453J4256k3187q7548q0848L4642
22538G5730k1885J02193N3353L8100j44564j3265J6407M9095p2231n1499O2783
22527I4217Q0619o7756l5804K1294m5539o4397M2467M4780l0749M3321O7019n3026
22515I6446q7842J74413R6873L397n2798o0354L2741l1058O4107O1377n0239j4616
22503B32447J6272J6788m7136m4114n4699K4770m357p0304j1657M5470O3885j24007
22491D3358K966J19706J7880k4129j19630j21892M8J94949P9766j11126L9892
22480A21788l2069n8941L3120n0596K6192m9382K2669M9785J4783j49555Q6903
22469A4697O0404K3914n8035Q9104M6217p4672L5273q3974m0833L6928K1879j20488
$$ plain form
22457 -49586 -167450 -105615 -80044 -230190 -343206 -188520 12908 69225 48903 25727 71899
22446 71899 143844 99675 5894 107420 148659 159055 239172 255080 137716 -3662 13590
22435 13590 -35440 -40790 119875 147079 84073 -38684 -4779 127385 226674 271334 113192
22424 113192 -95686 -147167 -19053 74568 21039 -33992 24826 -140834 -131899 -32600 50305
22413 50305 58776 -70262 -52076 75290 79316 71064 92687 36543 24125 32039 -1836 3864
22401 3864 -15368 27165 -62155 -274352 -358432 -264803 -94289 -8682 52497 60996 31157 -21311
22389 -21311 14319 72301 -26514 -171151 -91303 96137 100468 111794 113103 25500 39428 114151
22377 114151 134777 -61879 -135142 -106982 -165590 -108272 -3163 -82530 -44224 49250 42728
$$ packed form
22457d9586j17864O1835K5571j50146j13016J54686K01428N6317k0322k3176M6172
22446G1899P1945m4169r3781J01526M1239J0396Q0117J5908j17364j41378J7252
22435A3590m9030n350J60665K7204o3006j22757L3905J32164R9289M4660j58142
22424A13192k08878n1481J28114R3621n3529n5031N8818j65660Q935R9299Q2905
22413E0305Q471j29038J8186J27366M026q252K1623n6144j2418P914l3875N700
22401C864j9232M2533q9320k12197q4080R3629J70514Q5607O1179Q499k9839n2468
22389b1311L5630N7982r8815j44637P9848J87440M331J1326J309q7603J3928P4723
22377A14151K0626j96656p3263K8160n8608N7318J05109p9367L8306R3474o522
$$ plain form
22366 42728 -142604 -117628 60322 118224 101552 147610 71935 39754 -65058 -91894 -120360
22355 -120360 -100534 -105093 19785 37975 119724 245029 317991 235482 148368 -21249 -45145
22344 -45145 -49452 143449 219727 116161 107202 125359 135342 121808 25864 74347 -3619 -27216
22332 -27216 -30804 8498 5812 -56830 -62163 -78322 5135 103437 -5343 -74057 -29430 3874
22320 3874 -75513 -85269 -57813 -147469 -52983 -73962 -84398 -141423 -70065 -41777 -59639 -84343
22308 -84343 -83492 -44846 -11826 -101127 -114163 -169278 -170963 -168227 -92671 -51132 10053 156840
22296 156840 173799 91432 27757 -25073 80688 153585 96986 61681 12136 -18667 27302
22285 27302 91440 58884 -16100 15808 121512 110328 75542 73672 -1162 -62241 -7270 73621
$$ packed form
22366D2728j85332K4976J77950N7902j6672M6058p5675l2181j04812k6836k8466
22355a20360J9826m559J24878J8190Q1749J25305P2962q2509q7114j69617k3896
22344d5145m307J92901P6278j03566q959J8157R983j3534r5944M8483p7966k3597
22332b7216l588L9302k686o2642n333j6159Q3457R8302j08780o8714M4627L3304
22320C874p9387r756K7456q9656R4486k0979j0436n7025P1358K8288j7862k4704
22308h4343Q51L8646L3020q9301j3036n5115j685K736P5556M1539O1185J46787
22296A56840J6959q2367o3675n2830J05761P2897n6599l5305m9545l0803M5969
22285B7302O4138l2556p4984L1908J05704j1184l4786j870p4834o1079N4971Q0891
$$ plain form
22273 73621 67054 -101157 -152217 -135107 -153482 -9839 -4900 -75063 3456 75174 71634 104034
22261 104034 54992 38133 61734 45915 -49546 -16811 10339 43390 14972 8886 10223 20473
22249 20473 8966 -42509 -83188 -55503 11736 96942 172236 32993 116867 145725 41192
22238 41192 -41365 -50291 -76626 -23645 -21928 -39769 -118886 -106680 -125535 -58230 -23472 52666
22226 52666 22222 40401 2649 -120427 -66010 -112384 -82904 -53887 42671 100302 146627
22215 146627 228502 258700 210020 179372 353091 322698 542466 915606 1239843 1557294
22205 1557294 1946420 2458310 2771501 2831288 2663061 2539693 2263500 2000637 1668253 1395266
22195 1395266 1142753 853484 663881 567156 506735 488810 479471 388473 389328 333145 274692
$$ packed form
22273G3621o567j68211n1060J7110j8375J43643M939p0163P8519P1718l540L2400
22261A04034m9042j6859K3601j5819r5461L2735K7150L3051k8418o086J337J0250
22249B0473j1507n1475m0679K7685O7239Q5206P5294j39243Q3874K8858j04533
22238D1192q2557q926k6335N2981J717j7841p9117J2206j8855O7305L4758P6138
22226E2666l0444J8179l7752j23076N4417m6374K9480K9017R6558N7631M6325
22215A46627Q1875L0198m8680l0648J73719l0393K19768L73140L24237L17451
22205A557294L89126N11890L13191N9787j68227j23368k76193k62863l32384k72987
22195A395266k52513k89269j89603r6725o0421j7925r339r0998Q55n6183n8453
$$ plain form
22184 274692 266201 97412 86848 58666 -56191 6273 83413 63651 49071 -7219 4099
22173 4099 9205 171053 107430 88258 75469 121473 226442 254869 278953 275285 213412 164373
22161 164373 81202 136355 194306 101251 32431 -28531 5759 -11493 -75220 -50444 12966
22150 12966 75543 16176 -12189 -37644 56724 142973 159790 123668 88620 92431 237100 293689
22138 293689 206427 157448 92259 8498 -43838 -80153 32205 63628 59478 82039 74795 95977
22126 95977 55682 113542 196315 202931 150698 209651 61041 -157558 -335897 -331707 -252452
22115 -252452 -54568 108539 62065 -97657 -121965 -83253 -152791 -191353 -114958 -15613 64748
22104 64748 45005 -95848 -190465 -216933 -68321 -19641 18591 -93875 -247918 -194724 -120518
$$ packed form
22184B74692q491j68789j0564k8182j14857O2464P7140j9762j4580n6290J1318
22173D099N106J61848o3623j9172j2789M6004J04969K8427K4084l668o1873m9039
22161A64373q3171N5153N7951r3055o8820o0962L4290j7252o3727K4776O3410
22150A2966O2577n9367k8365k5455R4368Q6249J6817l6122l5048L811J44669N6589
22138B93689q7262m8979o5189q3761n2336l6315J12358L1423m150K2561p244K1182
22126I5977m0295N7860Q2773O616n2233N8953j48610k18599j78339M190P9255
22115b52452J97884J63107m6474j59722k4308L8712o9538l8562P6395R9345Q0361
22104F4748j9743j40853r4617k6468J48612M8680L8232j12466j54043N3194P4206
$$ plain form
22093 -120518 -212313 -197130 -65524 -97572 -127957 -155540 -191464 -44929 -78989 -118367 -215256
22082 -215256 -168921 -163327 -165727 -149302 -99972 -95762 -92300 -61750 -33693 -53891 -204757 -150814
22070 -150814 -228547 -222482 -174498 -146629 -53109 24968 108860 99177 78848 57770 105861 200595
22058 200595 206988 165847 160805 136927 87152 51813 37681 -122464 -243635 -244375 -193144 -134958
22046 -134958 -55499 -136875 -150945 -156771 -133092 -83808 -36662 -36229 -18049 42873 31211 41462
22034 41462 25093 -80845 -136252 -219388 -200066 -241225 -265921 -297116 -383447 -296710 -136557
22023 -136557 -89400 -73796 -132038 -416471 -303033 -81826 -131571 -136951 -118135 -97046 -126255
22012 -126255 -5651 73596 120833 56566 -103256 -157236 -169402 -73901 -100182 -34930 -61116
$$ packed form
22093a20518r1795J5183J31606l2048l0385k7583l5924J46535l4060l9378r6889
22082b15256M6335N594k400J6425M9330M210L462L0550K8057k0198j50866N3943
22070a50814p7733O065M7984K7869R3520P8077Q3892r683k0329k1078M8091R4734
22058B00595O393m1141n042k3878m9775l5339j4132j60145j21171p40N1231N8186
22046a34958P9459q1376j4070n826K3679M9284M7146M33J8180O0922j1662J0251
22034D1462j6369j05938n5407q3136J9322m1159k4696l1195q6331Q6737J60153
22023a36557M7157J5604n8242k84433J13438K21207m9745n380J8816K1089k9209
22012a26255J20604P9247M7237o4267j59822n3980j2166R5501k6281O5252k6186
$$ plain form
22001 -61116 -7836 26388 -7088 12510 -117961 -39171 116983 162810 191385 183961 118029
21990 118029 225815 215278 93728 64652 -3839 36610 66128 -5503 35855 84712 88389
21979 88389 77402 124802 -19696 4174 133238 -13567 2298 53503 -27979 -63740 -145090
21968 -145090 -49094 -52472 -102732 -19268 12398 7096 84570 87974 -35808 -159777 -112765 -43761
21956 -43761 -49889 -183817 -117148 -50971 38215 29776 -6756 -77596 -32657 -109218 -230887 -159904
21944 -159904 -136011 -101907 -42011 -64866 -16911 17448 73568 124562 72125 -48693 -127813
21933 -127813 31030 132953 39572 11801 -22908 -90857 -116858 -63806 49551 43139 -83432
21922 -83432 -142781 -155054 -190771 -179176 -61054 -37936 -33132 -117887 -198112 -157390 -184516 -178943
$$ packed form
22001f1116N3280L4224l3476J9598j30471P8790J56154M5827K8575p424o5932
21990A18029J07786j0537j21550k9076o8491M0449K9518p1631M1358M8857L677
21979H8389j0987M7400j44498K3870J29064j46805J5865N1205q1482l5761q1350
21968a45090R5996l378n0260Q3464L1666n302P7474L404j23782j23969M7012O9004
21956d3761o128j33928O6669O6177Q9186q439l6532p0840M4939p6561j21669P0983
21944a59904K3893L4104N9896k2855M7955L4359N6120N0994n2437j20818p9120
21933a27813J58843J01923r3381k7771l4709o7949k6001N3052J13357o412j26571
21922h3432n9349j2273l5717J1595J18122K3118M804q4755q0225M0722k7126N573
$$ plain form
21910 -178943 -207862 -120597 -113742 -21968 68734 48731 114755 126286 -30152 -18280 61710
21899 61710 104857 64350 -14144 -61093 -59332 34394 4975 59814 80589 90835 52461 44810
21887 44810 9214 67100 234627 337285 278787 247157 206208 119643 106711 118463 104069
21876 104069 69094 -33116 52422 33632 -16326 61402 43607 86957 56058 19453 -35169
21865 -35169 -41256 -115061 -120975 -86716 -2404 22745 -23512 -90430 -32155 163550 246695 408445
21853 408445 559774 540334 648266 711249 704276 728937 659409 510310 296208 63932 57049
21842 57049 95551 205806 292969 255760 134188 62699 23830 81222 184389 233916 203933
21831 203933 105925 43045 23485 10660 188892 275238 192116 69410 -64096 -47520 20528
$$ packed form
21910a78943k8919Q7265O855R1774R0702k0003O6024J1531j56438J1872P9990
21899F1710M3147m0507p8494m6949J761R3726k9419N4839K0775J0246l8374p651
21887D4810l5596N7886J67527J02658n8498l1630m0949q6565j2932J1752j4394
21876A04069l4975j02210Q5538j8790m9958P7728j7795M3350l0899l6605n4622
21865c5169o087p3805n914L4259Q4312K5149m6257o6918N8275J95705Q3145J61750
21853D08445J51329j9440J07932O2983o973K4661o9528j49099k14102k32276o883
21842E7049L8502J10255Q7163l7209j21572p1489l8869N7392J03167M9527k9983
21831B03933r8008o2880j9560j2825J78232Q6346q3122j22706j33506J6576O8048
$$ plain form
21820 20528 -65606 -164045 -88115 -33575 57827 82943 -21197 3382 37233 -1917 32833
21809 32833 -59399 -128498 -143487 -69581 -19683 -55668 -42978 -36034 -75629 -88083 -108443 -44336
21797 -44336 -30207 -55513 -126145 -15784 74660 54608 6453 -68957 -69837 13258 6714 192838
21785 192838 162847 125821 163884 132695 -10442 -109772 -23504 122029 131333 118585 269013
21774 269013 268419 158536 94462 105071 31539 1421 62695 -2576 -152399 -193846 -113613
21763 -113613 -66665 -4820 48184 -36591 -110309 52865 74685 89424 9567 20865 101997
21752 101997 126461 119405 55502 -33419 5188 8593 -73313 -186500 -100408 -4525 -43212 -70363
21740 -70363 -105906 -83746 -80505 -1787 84319 78975 10844 -188976 -207960 -160337 -78640 -21301
$$ packed form
21820B0528q6134r8439P5930N4540R1402K5116j04140K4579L3851l9150L4750
21809C2833r2232o9099j4989P3906M9898l5985J2690O944l9595j2454k0360O4107
21797d4336J4129k5306p0632J10361R0444k0052m8155p5410q80Q3095o544J86124
21785A92838k9991l7026L8063l1189j43137r9330Q6268J45533R304j2748J50428
21774B69013n94j09883o4074J0609p3532l0118O1274o5271j49823m1447Q0233
21763a13613M6948O1845N3004q4775p3718J63174K1820J4739p9857J1298Q1132
21752A01997K4464p056o3903q8921L8607L405q1906j13187Q6092R5883l8687k7151
21740g0363l5543K2160L241P8718Q6106n344o8131j99820j8984M7623Q1697N7339
$$ plain form
21728 -21301 -71560 -136001 -143271 -126758 -196280 -224423 -266632 -299945 -280504 -308052 -252395 -222397
21716 -222397 -295559 -345273 -317338 -202512 -103284 -136501 -29813 68533 21072 -186579 -220473
21705 -220473 -7924 150599 145848 126228 103712 4704 -73695 -120965 -174000 -194842 -239724
21694 -239724 -298144 -172579 -22878 12131 -67775 -16346 56828 213450 110130 401
21684 401 31032 67234 7417 -64521 -85593 -58321 -31973 -40900 -34788 -37017 30757 175144
21672 175144 216853 39358 -35937 -66369 -39330 -68604 -111691 -206742 -242511 -172476 -136211
21661 -136211 -149103 -66158 37565 21782 -1658 -23691 19266 -87928 -205188 -99354 33263
21650 33263 33521 58984 59279 21096 36727 20352 -51474 -61683 -59123 -174283 -228378 -146231
$$ packed form
21728b1301n0259o4441p270J6513o9522k8143m2209l3313J9441k7548N5657K9998
21716b22397p3162m9714K7935J14826R9228l3217J06688R8346m7461k07651l3894
21705b20473K12549J58523m751j9620k2516r9008p8399m7270n3035k0842m4882
21694b39724n8420J25565J49701L5009p9906N1429P3174J56622j03320j09729
21684D01L0631L6202n9817p1938k1072K7272K6348q927O112k229O7774J44387
21672A75144M1709j77495p5295l0432K7039k9274m3087r5051l5769P0035L6265
21661a36211j2892Q2945J03723j5783k3440k2033M2957j07194j17260J05834J32617
21650C3263K58K5463K95l8183J5631j6375p1826j0209K560j15160n4095Q2147
$$ plain form
21638 -146231 -99236 -88184 -206965 -309142 -236657 -62841 -45690 -13523 89959 128062 -33507
21627 -33507 -66505 -33668 -104089 -138605 -59725 31543 55101 17086 69913 128206 64815 -163697
21615 -163697 -270500 -206892 19178 213368 41957 -100867 -238193 -147728 -48090 21700
21605 21700 70483 103130 142168 -89593 -273798 -268323 -256041 -198099 -200566 -148543 3263
21594 3263 -52153 -99514 -180495 -135961 -102309 -139940 -206464 -296644 -343427 -254821 -309108 -336254
21582 -336254 -384425 -393514 -391174 -288469 -200359 -105915 -60136 -79546 -132074 -55662 -1643 -145703
21570 -145703 -287775 -209887 -224157 -105925 -1986 106423 103481 174474 161321 84183 187023
21559 187023 161125 165989 174440 44508 -37238 25428 -64912 -126517 -100713 59143 72885
$$ packed form
21638a46231M6995J1052j18781j02177P2485J73816J7151L2167J03482L8103j61569
21627c3507l2998L2837p0421l4516P8880R1268K3558l8015N2827N8293o3391k28512
21615a63697j06803O3608K26070J94190j71411j42824j37326R0465R9638O9790
21605B1700M8783L2647L9038k31761j84205N475J2282N7942k467N2023J51806
21594C263n5416m7361q0981M4534L3652l7631o6524r0180m6783Q8606n4287k7146
21582c36254m8171r089K340J02705Q8110R4444M5779j9410n2528P6412N4019j44060
21570a45703j42072P7888j4270J18232J03939J08409k942P0993j3153p7138J02840
21559A87023k5898M864Q451j29932q1746O2666r0340o1605K5804J59856J3742
$$ plain form
21548 72885 85567 61326 164279 260528 189106 62442 57565 151868 98151 10768 55190
21537 55190 110685 68959 -87808 -86283 5608 117696 55244 25180 -96744 -66005 74473
21526 74473 77407 -63055 -210019 -255740 -249591 -174896 9928 38836 -29888 -90621 -63647
21515 -63647 -124231 -120770 -170758 -212278 -136809 -193308 -143331 -221941 -276639 -242626 -148426 -58022
21503 -58022 56035 26038 66382 5331 -78265 -133259 -85293 -92658 -60370 -108551 -50659 -96741
21491 -96741 5664 99444 90096 14748 -10428 13371 168555 77665 -41873 -717 -112284
21480 -112284 -118303 -31241 46091 12980 -33307 75917 94798 -20444 -208252 -175435 -75424
21469 -75424 -40245 -74517 -112220 -121410 -86169 -40609 -148981 -202320 -106239 48643 183022
$$ packed form
21548G2885J2682k4241J02953R6249p1422j26664m877R4303n3717q7383M4422
21537E5190N5495m1726j56767J525R1891J12088o2452l0064j21924L0739J40478
21526G4473K934j40462j46964m5721O149P4695J84824K8908o8724o0733K6974
21515f3647o0584L461m9988m1520P5469n6499M9977p8610n4698L4013R4200R0404
21503e8022J14057k9997M0344o1051q3596n4994M7966p365L2288m8181N7892m6082
21491i6741J02405R3780r348p5348k5176K3799J55184r0890j19538M1156j11567
21480a12284o019Q7062P7332l3111m6287J09224J8881j15242j87808L2817J00011
21469g5424L5179l4272l7703r190L5241M5560j08372n3339R6081J54882J34379
$$ plain form
21458 183022 190457 89587 -38173 -125722 -25215 103907 -12081 -70060 2834 39813 92789
21447 92789 136946 134894 121819 25790 -18067 -5752 -141750 -238091 -269822 -268856 -198315 -193565
21435 -193565 -230595 -155873 -107103 -110265 -152609 -111780 -125759 -142401 -213596 -328808 -271127
21424 -271127 -173075 -153617 -139654 5110 32634 125666 110104 -85144 -65286 -26066 -59310
21413 -59310 -150893 -134355 -100593 -142615 -69448 -54370 -51265 -12529 -19731 52773 -45186 -136691
21401 -136691 -179718 -239699 -226960 -240284 -152320 -51474 -41377 -113800 -165964 -208459 -165018
21390 -165018 -119278 22531 -59037 -109960 -117193 -237852 -235796 -156453 -86271 -91833 -195985
21379 -195985 -184803 -277695 -279224 -92836 -75441 -96270 -123024 -120515 -98342 -87396 -92109 -61587
$$ packed form
21458A83022P435j00870j27760q7549J00507J29122j15988n7979P2894L6979N2976
21447I2789M4157k052j3075r6029m3857J2315j35998r6341l1731R66P0541M750
21435a93565l7030P4722M8770l162m2344M0829j3979j6642p1195j15212N7681
21424b71127R8052J9458J3963J44764K7524R3032j5562j95248J9858L9220l3244
21413e9310r1583J6538L3762m2022P3167J5078L105L8736p202P2504r7959r1505
21401a36691m3027n9981J2739j3324Q7964J00846J0097p2423n2164m2495M3441
21390a65018M5740J41809q1568n0923p233j20659K056P9343P0182n562j04152
21379a95985J1182r2892j529J86388J7395k0829k6754K509K2173J0946m713L0522
$$ plain form
21367 -61587 -139961 -156453 -118713 -190549 -239033 -165457 -135453 -70273 120815 78191 -21137
21356 -21137 24575 -44371 56340 65166 23177 -63850 -161249 -144235 -114765 -88149 -123607 -28828
21344 -28828 -47000 -106532 -32407 -97196 -100009 -42053 -21104 -21426 -103708 -90079 -130210 -171704
21332 -171704 -129286 17224 -43911 -116024 -139087 -94165 -20639 -24596 -86100 -77862 39694
21321 39694 168096 135187 32612 85983 22850 -146293 -114263 -89261 -54528 -96594 -123842
21310 -123842 -113680 -144143 -164954 -221984 -288416 -274384 -217690 -120924 -38571 -74995 -118151
21299 -118151 -41717 -30716 -12953 -22541 53283 127259 117449 117647 103168 23820 -15331 -84637
21287 -84637 -148805 -206850 -227785 -166188 -49015 -97497 -96478 54250 206247 211845 111083
$$ packed form
21367f1587p8374j6492L7740p1836m8484P3576L0004O5180J91088m2624r9328
21356b1137M5712o8946J00711Q826m1989q7027r7399J7014K9470K6616l5458R4779
21344b8828j8172n9532P4125o4789k813N7956K0949l22q2282J3629m0131m1494
21332a71704M2418J46510o1135p2113k3063M4922P3526l957o1504Q238J17556
21321C9694J28402l2909j02575N3371o3133j69143L2030K5002L4733m2066k7248
21310a23842J0162l0463k0811n7030o6432J4032N6694R6766Q2353l6424m3156
21299a18151P6434J1001J7763r588P5824P3976r810J98j4479p9348l9151o9306
21287h4637o4168n8045k0935O1597J17173m8482J019J50728J51997N598j00762
$$ plain form
21276 111083 -6377 -30792 -103522 -168081 -282642 -290208 -173318 -107063 -110200 -63903 -65881
21265 -65881 -66956 -126994 -109261 -68722 -77474 -26081 -93676 -43014 -29648 -106366 -61737 -54917
21253 -54917 -80631 -196978 -160725 -94511 -9748 32406 -93426 -178663 -326846 -393168 -356670
21242 -356670 -248309 -207602 -30142 185098 89137 -34941 -72339 -2813 12178 -54082 -52841
21231 -52841 -80310 -102561 -110173 -97033 -85305 -229678 -258981 -164892 -139221 -5580 79856
21220 79856 38607 8517 22223 26085 -78954 -209904 -157549 -114787 -6258 47313 57962
21209 57962 143419 126689 -38881 -116803 -164193 -246087 -286249 -250954 -81822 -83972 -69160
21198 -69160 22427 6259 -75657 -141037 -184616 -145228 -95235 -138118 -153484 -113602 -80261 -46662
$$ packed form
21276A11083j17460k4415p2730o4559j14561p566J16890O6255l137M6297j978
21265f5881j075o0038J7733M0539q752N1393o7595N0662J3366p6718M4629O820
21253e4917k5714j16347L6253O6214Q4763M2154j25832q5237j48183o6322L6498
21242c56670J08361M0707J77460K15240r5961j24078l7398O9526J4991o6260J241
21231e2841k7469k2251p612J3140J1728j44373k9303R4089K5671J33641Q5436
21220G9856m1249l0090J3706L862j05039j30950N2355M2762J08529N3571J0649
21209E7962Q5457j6730j65570p7922m7390q1894m0162L5295J69132k150J4812
21198f9160R1587j6168q1916o5380m3579L9388M9993m2883j5366L9882L3341L3599
$$ plain form
21186 -46662 -104998 -96373 -146490 -83562 -25934 -104487 -101561 -80999 -70399 -136383 -71384 -29655
21174 -29655 -48110 92832 110783 -75835 -138204 -136005 -2353 105007 99775 -31281 -135546
21163 -135546 -124931 -114662 -188733 -151654 -148105 -153624 -97209 -37182 -58080 -38150 -34861 -113696
21151 -113696 -26363 -3053 -24905 -132386 -15177 58723 36440 23151 8597 49780 -1889
21140 -1889 -36775 -203338 -329494 -237126 -212429 -213757 -208195 -135100 -16471 19011 -109548
21129 -109548 -101083 -58523 -1730 139217 59262 -45490 -88942 -183579 -240089 -202721 -173958
21118 -173958 -66001 15592 73238 137520 -33997 -51190 -102171 -186132 -86148 -12277 19833
21107 19833 105028 145454 142702 12926 -66189 -41448 -37892 -107777 -142674 -286345 -297903 -153652
$$ packed form
21186d6662n8336Q625n0117O2928N7628p8553K926K0562J0600o5984O4999M1729
21174b9655j8455J40942J7951j86618o2369K199J33652J07360n232j31056j04265
21163a35546J0615J0269p4071L7079L549n519N6415O0027k0898J9930L289p8835
21151a13696Q7333K3310k1852j07481J17209P3900k2283j3289j4554M1183n1669
21140a889l4886j66563j26156R2368K4697j328N562P3095J18629L5482j28559
21129a09548Q465M2560N6793J40947p9955j04752m3452r4637n6510L7368K8763
21118a73958J07957Q1593N7646O4282j71517j7193n0981q3961R9984P3871L2110
21107A9833Q5195M0426k752j29776p9115K4741L556o9885l4897j43671j1558J44251
$$ plain form
21095 -153652 -220142 -200946 7806 -11852 -112125 -118581 -125376 -2914 19769 27709 861
21084 861 32993 120920 76348 41598 -82106 -89564 99506 190301 65512 4255 -24850 -93489
21072 -93489 -14559 89147 2935 -2143 3771 86475 212806 180854 69955 1787 46170
21061 46170 35882 34488 -76287 -100510 -24413 63229 -75264 -190495 -94049 35969 106126
21050 106126 -66808 -131847 -206334 -233147 -125184 20362 16030 28616 47242 49214 70309
21039 70309 25771 -37973 75502 2620 -53095 -24335 -120091 -164544 -88360 -81197 -185692
21028 -185692 -7919 -10248 -99955 -8304 -30752 -43237 -82547 -75492 -64919 -139742 7367
21017 7367 -47293 -158143 -243873 -212544 -35230 73879 61157 33105 68499 89975 62635
$$ packed form
21095a53652o6490J9196K08752j9658j00273o456o795J22462K2683P940k6848
21084H61L2132Q7927m4572l4750j23704p458J89070R0795j24789o1257k9105o8639
21072i3489P8930J03706q6212n078N914Q2704J26331l1952j10899o8168M4383
21061D6170j0288j394j10775k4223P6097Q7642j38493j15231R6446J30018P0157
21050A06126j72934o5039p4487k6813J07963J45546m332J2586J8626J972K1095
21039G0309m4538o3744J13475p2882n5715K8760r5756m4453P6184P163j04495
21028a85692J77773k329q9707R1651k2448j2485l9310P055J0573p4823J47109
21017G367n4660j10850q5730L1329J77314J09109j2722k8052L5394K1476k7340
$$ plain form
21006 62635 27438 35353 17673 35478 -70536 -190855 -201829 -122124 -91872 -104558 -170393
20995 -170393 -36651 -89924 -27305 -139558 -334745 -394497 -272950 -180648 -153832 -156243 -32366
20984 -32366 57656 -75747 -78869 -17779 -9383 -11359 -81431 -211931 -337855 -303143 -270676 -153926
20972 -153926 -115462 -12733 41604 120627 143751 263776 243522 85702 6219 -62756 -114615
20961 -114615 -73519 -71492 68066 133898 44909 -2398 -41792 -117960 -107868 -77750 -143212
20950 -143212 -231507 -265379 -98341 38827 -47033 45212 143793 30046 -126209 -178425 -262944
20939 -262944 -236997 -241665 -115846 9027 7635 -110728 -217337 -144634 -57565 -41617 -51601
20928 -51601 -93693 -163341 -179807 -66171 -9793 62918 124024 -24593 -63115 -118860 -79561
$$ packed form
21006F2635l5197P915j7680J7805j06014j20319j0974P9705L0252j2686o5835
20995a70393J33742n3273O2619j12253j95187n9752J21547R2302K6816k411J23877
20984c2366R0022j33403l122O1090Q396j976p0072j30500j25924L4712L2467J16750
20972a53926L8464J02729N4337P9023K3124J20025k0254j57820p9483o8975n1859
20961a14615M1096K027J39558O5832q8989m7307l9394p6168J0092L0118o5462
20950a43212q8295l3872J67038J37168q5860R2245R8581j13747j56255n2216q4519
20939b62944K5947m668J25819J24873j392j18363j06609P2703Q7069J5948r984
20928e1601m2092o9648j6466J13636N6378P2711O1106j48617l8522n5745L9299
$$ plain form
20917 -79561 -89485 -149878 -90529 -4124 -5843 -67678 -92674 -95877 -83892 -145306 15020 103744
20905 103744 -87183 -147170 -113779 -52173 -101214 -42630 -23403 -130837 -55183 70296 88411
20894 88411 -388 -29658 52577 -32686 -82347 -131545 -98520 -29601 109364 168764 241770
20883 241770 269095 286258 410885 443432 478658 588507 620173 573109 448400 363156 465126
20872 465126 597156 667951 728214 829529 766950 725278 633157 504823 457225 392111 325102
20861 325102 348647 566912 574416 532481 711537 740451 762609 712719 734604 764206 745671
20850 745671 684307 617706 669900 715454 790135 897184 986557 945812 910211 767623 587716
20839 587716 517310 522715 582216 631241 653117 657514 639546 657802 655020 662877 512029 308238
$$ packed form
20917g9561r924o0393N9349Q6405j719o1835k4996l203J1985o1414J60326Q8724
20905A03744j90927n9987L3391O1606m9041N8584J9227j07434P5654J25479J8115
20894H8411q8799k9270Q2235q5263m9661m9198L3025O8919J38965N9400P3006
20883B41770K7325J7163J24627L2547L5226J09849L1666m7064j24709q5244J01970
20872D65126J32030P0795O0263J01315o2579m1672r2121j28334m7598o5114o7009
20861C25102K3545K18265P504m1935J79056K8914K2158m9890K1885K9602j8535
20850G45671o1364o6601N2194M5554P4681J07049Q9373m0745l5601j42588j79907
20839E87716p0406N405N9501M9025K1876M397j7968J8256k782P857j50848k03791
$$ plain form
20827 308238 254953 187163 88065 56772 77264 42875 -9143 54723 143299 161540 84012
20816 84012 -33469 -50470 -20207 30284 61348 45364 -103777 -102868 52288 171562 252097
20805 252097 152405 153903 170286 103619 53409 -23295 94 51179 62967 15264 46745 15342
20793 15342 83285 89348 156490 125262 237025 302309 250314 161728 263249 257127 140249
20782 140249 106813 -32097 -50245 86238 82899 -114575 -137738 -70766 63101 -43685 -103351
20771 -103351 -115472 -119397 -108402 -69959 -168496 -189886 -164563 -115745 -84553 -81199 -75849 -120347
20759 -120347 -155989 -149926 -60844 -47404 -63409 -65757 -69189 -109474 -62033 33311 106502 -5447
20747 -5447 -109340 -115624 -26498 22373 -36489 -76577 -106148 -180359 -117372 -67189 891 28151
$$ packed form
20827C08238n3285o7790r9098l1293K0492l4389n2018O3866Q8576J8241p7528
20816H4012j17481j7001L0263N0491L1064j5984j49141R09J55156J19274Q0535
20805B52097r9692J498J6383o6667n0210p6704K3389N1085J1788m7703L1481l1403
20793A5342O7943O063O7142l1228J11763O5284n1995q8586J01521o122j16878
20782A40249l3436j38910j8148J36483l339j97474k3163O6972J33867j06786n9666
20771a03351j2121l925J0995L8443r8537k1390K5323M8818L1192L354N350m4498
20759a20347l5642O063Q9082J3440j6005k348l432m0285M7441R5344P3191j11949
20747e447j03893o284Q9126M8871n8862m0088k9571p4211O2987N0183O8080K7260
$$ plain form
20735 28151 24510 -12265 95992 137734 134411 106917 -37517 -83049 -8699 89386 16000 93903
20723 93903 215635 117516 35392 -105916 -201404 -192472 -76472 -62426 -89472 30530 28808
20712 28808 -122155 -132691 -102464 -59964 -43202 -76845 -92055 -142934 6799 2075 -253364
20701 -253364 -281150 -239833 -161410 -74128 -12909 181858 160488 127984 104751 79009 227390
20690 227390 205416 80410 129833 202802 166969 15366 2141 25805 74270 23517 -54898
20679 -54898 -70665 64021 194120 166654 153053 95356 154631 256019 108867 -52434 -147178
20668 -147178 -74527 101150 -35996 -186211 -208042 -126599 -54070 -8824 27739 57451 15764
20657 15764 47392 46011 91364 153883 197736 104758 95784 57924 -68702 -52900 -59436 -125159
$$ packed form
20735B8151l641l6775J08257M1742l323k7494j44434m5532P4350R8085p3386P7903
20723I3903J21732r8119q2124j41308r5488Q932J16000J4046k7046J20002j722
20712B8808j50963j0536L0227M2500J6762l3643j5210n0879J49733m724k55439
20701b53364k7786M1317P8423Q7282O1219J94767k1370l2504k3233k5742J48381
20690B27390k1974j25006M9423P2969l5833j51603j3225K3664M8465n0753p8415
20679e4898j5767J34686J30099k7466j3601n7697N9275J01388j47152j61301r4744
20668a47178P2651J75677j37146j50215k1831Q1443P2529M5246L6563K9712m1687
20657A5764L1628j381M5353O2519M3853r2978q974l7860j26626J5802o536o5723
$$ plain form
20645 -125159 -59729 -81465 -124383 -1763 120235 -11460 -75495 -27533 -11755 11862 -122308
20634 -122308 -199404 -49718 64947 -9428 53214 89609 82954 -3515 -43885 -11012 6487
20623 6487 15572 -107597 -81516 22897 -13478 -40068 30432 125862 180829 13129 -109235
20612 -109235 -4905 82587 96759 -1429 -105566 -181838 -156519 -131569 -15644 78185 62288
20601 62288 27474 -38269 -7786 -62370 -59472 -31023 -8014 46577 135625 72955 29926 66991
20589 66991 150994 82811 5579 -79461 -103040 -174297 -182000 -213720 -204747 -172210 -79649 -83819
20577 -83819 -131339 -107605 -162700 -207759 -224675 -232247 -83428 -31343 12034 70262 47180 -40918
20565 -40918 -161083 -113917 76010 77910 -13054 -133241 -150469 -162521 -60534 -103993 -231554
$$ packed form
20645a25159O5430k1736m2918J22620J21998j31695o4035M7962J5778K3617j34170
20634a22308p7096J49686J14665p4375O2642L6395o655q6469m0370L2873J7499
20623F487R085j23169K6081J04413l6375k6590P0500R5430N4967j67700j22364
20612a09235J04330Q7492J4172r8188j04137p6272K5319K4950J15925R3829j5897
20601F2288l4814o5743L0483n4584K898K8449K3009N4591Q9048o2670m3029L7065
20589F6991Q4003o8183p7232q5040k3579p1257p703l1720Q973L2537R2561m170
20577h3819m7520K3734n5095m5059j6916p572J48819N2085M3377N8228k3082q8098
20565d0918j20165M7166J89927J900r0964j20187j7228j2052J01987m3459j27561
$$ plain form
20554 -231554 -113998 -120370 -41053 37011 137289 184197 125838 90773 7860 -28612 -75317
20543 -75317 -19183 46604 62657 105976 90868 147635 153635 73664 171702 245963 194872 201105
20531 201105 285996 331245 283971 233493 208462 134089 94532 284059 441270 302338 178843
20520 178843 91022 78407 87986 65274 75151 89023 51390 35112 97920 186362 241109 118802
20508 118802 124031 223880 291098 348805 261027 69867 24951 -54942 -5598 85032 127590
20497 127590 163427 103170 71204 124194 3003 -39295 -27900 35697 -22767 -78200 -125139
20486 -125139 -76167 -28028 67930 192629 251145 177359 130308 155394 146783 201938 211153 222225
20474 222225 277248 187177 144919 172318 172814 224493 236290 230241 310573 302203 256505 91228
$$ packed form
20554b31554J17556o372P9317P8064J00278M6908n8359l5065q2913l6472m6705
20543g5317N6134O5787J6053M3319j5108N6767O000p9971R8038P4261n1091O233
20531B01105Q4891M5249m7274n0478k5031p4373l9557J89527J57211j38932j23495
20520A78843q7821j2615R579k2712R877J3872l7633j6278O2808Q8442N4747j22307
20508A18802N229R9849O7218N7707q7778j91160m4916p9893M9344R0630M2558
20497A27590L5837o0257l1966N2990j21191m2298J1395O3597n8464n5433m6939
20486a25139M8972M8139R5958J24699N8516p3786m7051K5086q611N5155R215J1072
20474B22225N5023r0071m2258K7399M96N1679J1797o049Q0332q370m5698j65277
$$ plain form
20462 91228 -45346 -76099 -26602 22632 122646 198584 173928 117290 120648 175682 241597
20451 241597 290451 220974 225824 312082 217735 166409 220559 235729 213131 185055 232018 315876
20439 315876 358568 347230 286413 303061 278993 231576 304041 419465 484250 501036 518310
20428 518310 660435 717660 735552 706810 892714 1024099 1110797 1158833 1273298 1358042 1307286
20417 1307286 1150293 1147299 1228537 1216536 1247874 1398535 1585176 1672024 1639305 1526264 1433580
20406 1433580 1242169 1067560 1080168 1046457 1027191 897104 844443 822452 856423 874193 839279
20395 839279 825153 818188 847100 826324 775220 739299 696732 637055 692372 758729 759111 669946
20383 669946 618262 644755 719618 804117 784798 770622 767520 776421 728215 694440 786760 776243
$$ packed form
20462I1228j36574l0753M9497M9234J00014P5938k4656n6638L358N5034O5915
20451B41597M8854o9477M850Q6258r4347n1326N4150J5170k2598k8076M6963Q3858
20439C15876M2692j1338o0817J6648k4068m7417P2465J15424O4785J6786J7274
20428E18310J42125N7225J7892k8742J85904J31385Q6698M8036J14465Q4744n0756
20417A307286j56993k994Q1238j2001L1338J50661J86641Q6848l2719j13041r2684
20406A433580j91411j74609J2608l3711j9266j30087n2661k1991L3971J7770l4914
20395H39279j4126o965K8912k0776n1104l5921m2567n9677N5317O6357L82q9165
20383F69946n1684K6493P4863Q4499j9319j4176l102Q901m8206l3775R2320j0517
$$ plain form
20371 776243 814602 868943 994933 975039 900507 850224 756353 672920 733790 811937 858890
20360 858890 978441 1121790 1131420 1049493 1195785 1295191 1470178 1705730 1915014 1865137
20350 1865137 1741223 1791089 1840961 1647847 1521643 1502205 1530284 1522941 1613578 1689465 1766522
20339 1766522 2029369 2413036 2548872 2725961 2897235 3105989 3362627 3820064 4316345
20330 4316345 4870376 5345400 5796456 6134867 6116836 6062472 5962690 5890196 5939063 5981451
20320 5981451 6076518 6283917 6703622 7258376 7899812 8648837 9610419 10761584 12093823
20311 12093823 13589472 15299052 17807503 21511953 26685748 33791363 43000687 53506008
20303 53506008 63429193 72319172 79655907 82547172 79317259 74088231 72377000 76292482
$$ packed form
20371G76243L8359N4341J25990j9894p4532n0283r3871q3433O0870P8147M6953
20360H58890J19551J43349R630q1927J46292R9406J74987K35552K09284m9877
20350A865137j23914M9866M9872j93114j26204j9438K8079p343R0637P5887P7057
20339A766522K62847L83667J35836J77089J71274K08754K56638M57437M96281
20330D316345N54031M75024M51056L38411j8031n4364r9782p2494M8867M2388
20320E981451R5067K07399M19705N54754O41436P49025R61582J151165J332239
20311A2093823J495649J709580K508451L704450N173795P105615R209324J0505321
20303E3506008R923185Q889979P336735K891265l229913n229028j711231L915482
$$ plain form
20295 76292482 85300785 97526799 111271743 125084969 135447496 138104172 133275725
20288 133275725 123260155 109221772 94653458 83763608 77880946 76689035 80305844
20281 80305844 88986004 102443304 119673779 139815317 161282073 180213771 190963374
20274 190963374 192771787 187900408 175999360 157364931 138535668 126240802 120960371
20267 120960371 119818548 120344856 121299508 120156408 113546752 102960488 94264615 90692406
20259 90692406 91665572 95051083 98513310 101277406 102167992 97772870 86747340 73271504
20251 73271504 62013475 53690842 47480588 42752315 38948177 35899179 33521510 31686174
20243 31686174 30212658 28791010 27563444 26573382 25561060 24474801 23516697 22634554
$$ packed form
20295G6292482R008303J2226014J3744944J3813226J0362527K656676m828447
20288A33275725j0015570j4038383j4568314j0889850n882662j191911L616809
20281H0305844Q680160J3457300J7230475K0141538K1466756J8931698J0749603
20274A90963374J808413m871379j1901048j8634429j8829263j2294866n280431
20267A20960371j141823N26308R54652j143100o609656j0586264q695873l572209
20259I0692406R73166L385511L462227K764096Q90586m395122j1025530j3475836
20251G3271504j1258029q322633o210254m728273l804138l048998k377669j835336
20243C1686174j473516j421648j227566r90062j012322j086259r58104q82143
$$ plain form
20235 22634554 22010051 21472223 20733612 19966523 19211527 18403267 17737898 17137627 16572529
20226 16572529 16129070 15638583 15347916 15280744 15269638 15163125 14960558 14827658 14659778 14407749
20216 14407749 13833011 13160752 12435921 11721657 11161589 10522623 9956263 9647115 9376465
20207 9376465 9046440 8622595 8222334 7905349 7625594 7230387 7009014 6980769 6893593 6687078
20197 6687078 6483120 6242437 6025770 5756247 5687985 5597555 5381543 5209296 4990898 4927062
20187 4927062 4864698 4736704 4476613 4247591 4199860 4194850 4061049 3912048 3700643 3711503
20177 3711503 3769075 3768973 3710109 3548541 3615827 3646854 3503325 3421809 3263949 3222900 3266122
20166 3266122 3208595 2992721 2819020 2719902 2591608 2393530 2412319 2442498 2570301 2494846
$$ packed form
20235B2634554o24503n37828p38611p67089p54996q08260o65369o00271n65098
20226A6572529m43459m90487k90667o7172j1106j06513k02567j32900j67880k52029
20216A4407749n74738o72259p24831p14264n60068o38966n66360l09148k70650
20207I376465l30025m23845m00261l16985k79755l95207k21373k8245q7176k06515
20197F687078k03958k40683k16667k69523o8262r0430k16012j72247k18398o3836
20187D927062o2364j27994k60091k29022m7731n010j33801j49001k11405J0860
20177C711503N7572j02n8864j61568O7286L1027j43529q1516j57860m1049M3222
20166C266122n7527k15874j73701r9118j28294j98078J8789L0179J27803p5455
$$ plain form
20156 2494846 2237617 2076035 1970315 2061925 2048671 1877457 1670443 1622304 1542653 1444644
20146 1444644 1439720 1349904 1329255 1363676 1323268 1263062 1184825 1030904 894622 950779 1035106
20135 1035106 1068894 1021994 894313 777016 693335 826430 854943 881538 671686 619048
20125 619048 693739 600131 626989 697073 634332 633887 791143 796062 740187 742621 769847 752958
20113 752958 719940 632564 610910 693616 719603 616979 634988 762245 809256 838890 846404
20102 846404 690212 731242 699287 728893 723605 597270 493087 436919 535472 599421 554521
20091 554521 583298 560085 571460 625092 652152 560154 505573 517498 490128 457752 499362
20080 499362 508067 453334 458839 601087 805790 856686 721691 727046 756977 741007 666458
$$ packed form
20156B494846k57229j61582j05720R1610j3254j71214k07014m8139p9651r8009
20146A444644m924q9816k0649L4421m0408o0206p8237j53921j36282N6157Q4327
20135A035106L3788m6900j27681j17297q3681J33095K8513K6595k09852n2638
20125F19048P4691r3608K6858P0084o2741m45J57256M919n5875K434K7226j6889
20113G52958l3018q7376k1654Q2706K5987j02624J8009J27257M7011K9634P514
20102H46404j56192M1030l1955K9606n288j26335j04183n6168R8553O3949m4900
20091E54521K8777k3213J1375N3632K7060r1998n4581J1925k7370l2376M1610
20080D99362Q705n4733N505J42248K04703N0896j34995N355K9931j5970p4549
$$ plain form
20069 666458 599462 603943 562059 637171 604200 487857 345771 331729 422585 445843 504703
20058 504703 490394 381138 397700 540048 718872 704240 631218 555558 531532 572288 628127
20047 628127 720656 726257 729448 659873 625064 638337 700190 714791 706702 651805 605379 560671
20035 560671 606330 650619 585970 667315 687494 625397 478015 345414 470498 572422 569635
20024 569635 505869 389352 477851 510775 557435 647109 602650 583434 562552 586121 625479
20013 625479 613558 707847 626307 540022 613889 599269 561515 477855 381074 423089 437043
20002 437043 379233 433143 527608 641079 482515 285885 329408 399698 466243 415036 391783
19991 391783 495129 621230 660065 748434 699858 505258 368560 380856 498360 649794
$$ packed form
20069F66458o6996M481m1884P5112l2971j16343j42086j4042R0856K3258N8860
20058E04703j4309j09256J6562J42348J78824j4632p3022p5660k4026M0756N5839
20047F28127R2529N601L191o9575l4809J3273O1853J4601q089n4897m6426m4708
20035E60671M5659M4289o4649Q1345K0179o2097j47382j32601J25084J01924k787
20024E69635o3766j16517Q8499L2924M6660Q9674m4459j9216k0882K3569L9358
20013F25479j1921R4289q1540q6285P3867j4620l7754q3660r6781M2015J3954
20002D37043n7810N3910R4465J13471j58564j96630M3523P0290O6545n1207k3253
19991C91783J03346J26101L8835Q8369m8576j94600j36698J2296J17504J51434
$$ plain form
19981 649794 613083 471311 471462 585520 558231 600770 667854 790784 819753 726846 665089
19970 665089 639795 699141 677681 561317 520633 468240 458873 440698 460081 368012 290600
19959 290600 169633 271735 432421 433316 453594 570996 665728 548643 573119 491392 430122
19948 430122 397668 327950 90088 19308 167668 313950 310759 225330 273169 241245 182107
19937 182107 253329 279550 420208 492387 573077 517966 374634 257288 269569 430839 455157
19926 455157 416471 409702 461157 525799 495572 341026 231468 238651 431519 548810 600733
19915 600733 589426 584810 453051 371636 426710 516603 559250 466720 319931 418556 458988
19904 458988 511799 528849 510416 556958 535461 475743 437996 542324 555224 449184 439143
$$ packed form
19981F49794l6711j41772J51J14058k7289M2539O7084J22930K8969r2907o1757
19970F65089k5294N9346k1460j16364m0684n2393r367j8175J9383r2069p7412
19959B90600j20967J02102J60686Q95K0278J17402R4732j17085K4476q1727o1270
19948D30122l2454o9718k37862p0780J48360J46282l191q5429M7839l1924n9138
19937A82107P1222K6221J40658P2179Q0690n5111j43332j17346J2281J61270K4318
19926D55157l8686o769N1455O4642l0227j54546j09558P183J92868J17291N1923
19915F00733j1307m616j31759q1415N5074Q9893M2647r2530j46789R8625M0432
19904D58988N2811J7050j8433M6542k1497n9718l7747J04328J2900j06040j0041
$$ plain form
19893 439143 420209 352942 268453 259598 439676 535281 552100 555391 514335 427614 340382 310145
19881 310145 269588 349740 390474 196303 83979 179967 178305 209886 297963 273655 223773
19870 223773 301034 360522 487591 512332 496045 472956 424322 403313 417717 420679 340672
19859 340672 368702 530985 440359 279374 255119 442512 380492 233247 223653 273290 440989
19848 440989 437342 417107 332993 341410 444626 369566 391629 420195 458991 394580 364576 340842
19836 340842 372264 301987 299212 354147 452509 416902 380743 263364 271551 231367 231957 189517
19824 189517 197488 155248 245268 236862 212322 300695 291154 272636 195137 161059 163514 260903
19812 260903 257236 271635 176266 119261 202017 179848 68308 67191 117972 92633 66209 37516
$$ packed form
19893D39143j8934o7267q4489q855J80078R5605J6819L291m1056q6721q7232l0237
19881C10145m0557Q0152M0734j94171j12324R5988j662L1581Q8077k4308m9882
19870B23773P7261N9488J27069K4741j6287k3089m8634k1009J4404K962q0007
19859C40672K8030J62283r0626j60985k4255J87393o2020j47245r594M9637J67699
19848D40989l647k0235q4114Q417J03216p5060K2063K8566L8796o4411l0004k3734
19836C40842L1422p0277k775N4935R8362l5607l6159j17379Q187m0184N90m2440
19824A89517P971m2240R0020q406k4540Q8373r541j8518p7499l4078K455R7389
19812B60903l667J4399r5369n7005Q2756k2169j11540j117N0781k5339k6424k8693
$$ plain form
19800 37516 3146 -5840 -142883 -191182 -123811 -105290 -22615 122730 165725 126694 53904
19789 53904 117346 83593 63994 13233 27582 39880 170637 201777 188241 121577 49903
19778 49903 45581 64746 13693 6039 -48811 -76851 -50419 45473 165258 201276 158689 -13257
19766 -13257 -26114 -113623 -74360 31655 -43966 -65571 44552 81382 109445 89495 15059
19755 15059 3495 44716 62595 36078 -103525 -96455 -117828 -138961 -114717 26767 72020
19744 72020 57588 167130 107655 118071 189433 126594 31390 6927 25555 32060 172027
19733 172027 193024 109804 77122 29707 84932 146716 166281 175974 238796 200463 203732 260936
19721 260936 324773 432574 448174 462107 399095 299952 336348 387184 402465 413756 397362
$$ packed form
19800C7516l4370q986j37043m8299O7371J8521Q2675J45345M2995l9031p2790
19789E3904O3442l3753j9599n0761J4349J2298J30757L1140j3536o6664p1674
19778D9903m322J9165n1053p654n4850k8040K6432R5892J19785L6018m2587j71946
19766a3257j2857q7509L9263J06015p5621k1605J10123L6830K8063j9950p4436
19755A5059j1564M1221J7879k6517j39603P070k1373k1133K4244J41484M5253
19744G2020j4432J09542n9475J0416P1362o2839r5204k4463J8628O505J39967
19733A72027K0997q3220l2682m7415N5225O1784J9565R693O2822l8333L269N7204
19721B60936O3837J07801J5600J3933o3012r9143L6396N0836J5281J1291j6394
$$ plain form
19710 397362 560679 590483 538646 549535 706564 814325 706123 631075 580447 540201 509557
19699 509557 413309 526689 639822 737670 785705 902080 968041 835928 772635 730220 650552
19688 650552 718721 726977 661981 626851 567686 606982 473047 400023 461176 512683 466429
19677 466429 459539 435232 482433 447812 411894 441172 475897 554441 652318 606289 445325
19666 445325 383201 239793 165006 179921 223883 266599 266749 362508 339982 218826 126432
19655 126432 97757 97605 24551 -84716 -104291 54861 95074 131632 175928 49 -101891
19644 -101891 -58005 -63418 -109382 5272 52340 118091 62770 52318 91705 -11410 29642
19633 29642 89905 143432 128157 47489 -29539 -66855 -48907 -81251 -172709 -172180 -31476 -35481
$$ packed form
19710C97362J63317K9804n1837J0889J57029J07761j08202p5048n0628m0246l0644
19699E09557r6248J13380J13133R7848M8035J16375O5961j32113o3293m2415p9668
19688F50552O8169Q256o4996l5130n9165L9296j33935p3024O1153N1507m6254
19677D66429o890k4307M7201l4621l5918K9278L4725P8544R7877m6029j60964
19666D45325o2124j43408p4787J4915M3962M2716J50R5759k2526j21156r2394
19655A26432k8675j52p3054j09267j9575J59152M0213L6558M4296j75879j01940
19644a01891M3886n413m5964J14654M7068O5751n5321j0452L9387j03115M1052
19633B9642O0263N3527j5275q0668p7028l7316J7948l2344r1458N29J40704m005
$$ plain form
19621 -35481 -55742 -10374 31101 -60143 -31836 -21069 -43379 -87695 -82337 -79776 -110719 -129368
19609 -129368 -151341 -63990 -9044 83227 89397 84405 -82577 -192990 -179307 -183725 -70730
19598 -70730 47040 43223 24223 -47330 -34859 29791 87042 195798 122039 82820 85115 -54060
19586 -54060 -29160 43032 -45767 -121936 -130051 -10565 69514 -42191 -34777 -85104 -51265 94259
19574 94259 81760 16208 10178 38185 89960 46326 12175 13550 -64619 -109246 -94094 -49494
19562 -49494 -5795 -3592 -73549 3302 30838 -2369 -138925 -290026 -304451 -134509 -62701
19551 -62701 1883 6810 -40823 -33885 48620 55592 42676 21054 52183 103097 114227 218040
19539 218040 151497 146463 193829 175487 82529 -40532 -79557 -89523 -86013 -76538 -50921 -32248
$$ packed form
19621c5481k0261M5368M1475r1244K8307J0767k2310m4316N358K561l0943j8649
19609a29368k1973Q7351N4946R2271O170m992j66982j10413J3683m418J12995
19598g0730J17770l817j9000p1553J2471O4650N7251J08756p3759l9219K295j39175
19586e4060K4900P2192q8799p6169q115J19486Q0079j11705P414n0327L3839J45524
19574I4259j2499o5552o030K8007N1775m3634l4151J375p8169m4627J5152M4600
19562d9494M3699K203o9957P6851K7536l3207j36556j51101j4425J69942P1808
19551f2701O4584M927m7633O938Q2505O972j2916k1622L1129N0914J1130J03813
19539B18040o6543n034M7366j8342r2958j23061l9025r966L510R475K5617J8673
$$ plain form
19527 -32248 -36592 -11737 125694 173239 78978 -156220 -297872 -297055 -248867 -353187 -339304
19516 -339304 -281557 -196459 -199352 -143885 -204698 -259023 -169400 -234472 -242735 -176667 -89791 10253
19504 10253 -47894 -130108 -64323 -8154 -30080 -75696 -77905 -123383 -136909 -11650 161794
19493 161794 53599 -89300 -10326 85676 8175 52227 -18313 -149720 -132933 -101256 33194
19482 33194 116957 103166 30952 54771 130005 248963 165733 160448 58296 47858 123994
19471 123994 78542 87240 38945 -25446 -79025 -103243 -95289 -69141 -24186 -27899 -114045 -234425
19459 -234425 -264410 -196227 -250286 -201315 -152535 2498 -41962 -149089 -92738 33398 75234
19448 75234 137353 185020 159357 18797 28748 143883 33042 59957 122766 127655 95562
$$ packed form
19527c2248m344K4855J37431M7545r4261k35198j41652Q17M8188j04320J3883
19516c39304N7747Q5098k893N5467o0813n4325Q9623o5072q263O6068Q6876J00044
19504A0253n8147q2214O5785N6169k1926m5616k209m5478j3526J25259J73444
19493A61794j08195j42899P8974R6002p7501M4052p0540j31407J6787L1677J34450
19482C3194Q3763j3791p2214K3819P5234J18958q3230n285j02152j0438P6136
19471A23994m5452Q698m8295o4391n3579k4218P954K6148M4955l713q6146j20380
19459b34425k9985O8183n4059M8971M8780J55033m4460j07127N6351J26136M1836
19448G5234O2119M7667k5663j40560R951J15135j10841K6915O2809M889l2093
$$ plain form
19437 95562 57074 57403 97309 64504 -81626 -134264 -118758 -63850 -190 89213 96953 75078
19425 75078 82249 -10210 -42487 -25162 -144992 -206472 -233363 -204351 -130645 -157068 -343023
19414 -343023 -266855 -83840 -100501 -34503 -94837 30024 159738 182067 7763 -136193
19404 -136193 -99598 -33300 82967 227990 155709 28913 18555 44835 73706 -2892 -63772
19393 -63772 -11410 -8542 -49061 56252 66130 -43614 -47687 17570 79618 -16053 -36693 -159123
19381 -159123 -360547 -402518 -304378 -131512 -112518 -183202 -115387 -49095 41606 50405 78336
19370 78336 -46129 -104281 -127779 -109891 -140653 -218602 -263327 -108311 -138141 -184527 -38989
19359 -38989 -17139 -55974 107750 200594 62508 36421 -145383 -183523 -94618 -69244 -94813
$$ packed form
19437I5562l8488L29L9906l2805j46130n2638J5506N4908O3660Q9403P740k1875
19425G5078P171r2459l2277J7325j19830o1480k6891K9012P3706k6423j85955
19414c43023P6168J83015j6661O5998o0334J24861J29714K2329j74304j43956
19404a36193L6595O6298J16267J45023p2281j26796j0358K6280K8871p6598o0880
19393f3772N2362K868m0519J05313R878j09744m073O5257O2048r5671k0640j22430
19381a59123k01424m1971R8140J72866J8994p0684O7815O6292R0701Q799K7931
19370G8336j24465n8152k3498J7888l0762p7949m4725J55016k9830m6386J45538
19359c8989K1850l8835J63724R2844j38086k6087j81804l8140Q8905K5374k5569
$$ plain form
19348 -94813 -27713 -50744 -86517 -48431 64457 -56581 -174273 -89867 20862 94124 13733
19337 13733 -37962 -89270 -50344 72944 42764 -57549 -72527 -64400 36342 156492 181310
19326 181310 172282 154569 170200 141298 206098 209017 255459 163524 102324 89551 130199 193313
19314 193313 162989 100893 67807 112845 163673 291075 294889 205318 195523 147637 152881 231968
19302 231968 376014 313438 214562 208436 236171 244175 191342 126585 106144 63446 23998 -15639
19290 -15639 29555 37979 57449 141972 135478 68608 66008 7540 86124 136444 84161 -19794
19278 -19794 -185772 -297210 -288675 -375611 -235740 -101294 -14289 57257 -24553 62707 14110
19267 14110 -50121 95657 151882 87703 83190 74602 81492 67055 64291 -19591 -224264 -149782
$$ packed form
19348i4813O7100k3031l5773L8086J12888j21038j17692Q4406J10729P3262q0391
19337A3733n1695n1308L8926J23288l0180j00313j4978Q127J00742J20150K4818
19326A81310r028j7713J5631k8902O4800K919M6442r1935o1200j2773M0648O3114
19314A93313l0324o2096l3086M5038N0828J27402L814q9571r795m7886N244P9087
19302B31968J44046o2576r8876o126K7735Q004n2833o4757k0441m2698l9448l9637
19290a5639M5194Q424J9470Q4523o494o6870k600n8468P8584N0320n2283j03955
19278a9794j65978j11438Q535q6936J39871J34446Q7005P1546q1810Q7260m8597
19267A4110o4231J45778N6225o4179m513q588O890j4437k764q3882k04673P4482
$$ plain form
19255 -149782 23708 54396 268710 267916 216942 171876 108791 92533 28829 9576 79487
19244 79487 80253 -19621 -47565 -110207 -153424 -213493 -190576 -128927 -66516 -64498 -48548 -45897
19232 -45897 22546 144997 41759 2727 -28212 -52024 -49177 6161 66597 66545 92554 259889
19220 259889 321672 362326 384160 281775 235138 299206 427898 377813 344606 357492 303157
19209 303157 228269 249547 286564 321041 345602 377551 178394 46207 6363 125847 148611
19198 148611 5584 1424 62654 68447 27460 82969 128115 123830 95042 109651 144901 143874
19186 143874 253781 396953 504547 567849 498667 462770 393624 267774 243103 305289 278371
19175 278371 181207 59984 -6371 55978 115711 124562 212788 369223 378855 386384 528541
$$ packed form
19255a49782J73490L0688K14314p94n0974m5066o3085j6258o3704j9253O9911
19244G9487P66r9874k7944o2642m3217o0069K2917O1649O2411K018J5950K651
19232d5897O8443J22451j03238l9032l0939k3812K847N5338O0436n2K6009J67335
19220B59889O1783M0654K1834j02385m6637O4068J28692n0085l3207J2886n4335
19209C03157p4888K1278L7017L4477K4561L1949j99157j32187l9844J19484K2764
19198A48611j43027m160O1230N793m0987N5509M5146m285k8788J4609L5250j027
19186A43874J09907J43172J07594O3302o9182l5897o9146j25850k4671O2186k6918
19175B78371r7164j21223o6355O2349N9733Q851Q8226J56435R632P529J42157
$$ plain form
19164 528541 603111 667377 731380 802118 930756 1103268 1225999 1378247 1357729 1213095
19154 1213095 1215250 1146737 1082154 977566 904763 887688 743627 629338 702033 756804 656142
19143 656142 558651 531030 565991 532975 350573 332706 447361 469490 414812 480140 489893
19132 489893 517231 560285 668859 909330 973430 968859 915140 866988 685495 656055 528235
19121 528235 465250 466660 410122 391838 399002 398925 377850 313289 294807 244619 298514 340730
19109 340730 264151 275389 316091 427326 576325 656741 662870 847817 1136415 1366874 1347750
19098 1347750 1258358 1182880 1096021 974886 867258 764074 755381 750205 554750 412678 327871
19087 327871 218594 203938 122810 155507 215943 156608 31908 93816 144418 260775 463500
$$ packed form
19164E28541P4570O4266O4003P0738J28638J72512J22731J52248k0518j44634
19154A213095K155o8513o4583j04588p2803j7075j44061j14289P2695N4771j00662
19143F56142r7491k7621L4961l3016j82402j7867J14655K2129n4678O5328R753
19132D89893K7338M3054J08574K40471O4100m571n3719m8152j81493k9440j27820
19121E28235o2985J410n6538j8284P164p7k1075o4561j8482n0188N3895M2216
19109C40730p6579J1238M0702J11235J48999Q0416O129J84947K88598K30459j9124
19098A347750q9392p5478q6859j21135j07628j03184q693n176j95455j42072q4807
19087C27871j09277j4656q1128L2697O0436n9335j24700O1908N0602J16357K02725
$$ plain form
19076 463500 484146 387725 407501 511070 525787 349735 217924 306448 447380 354360 274825
19065 274825 126203 236887 343343 302969 153528 109477 13639 -41868 -171844 -103079
19055 -103079 -85837 -1431 45150 122141 116680 -47345 -30319 52696 156812 214753 162861
19044 162861 163341 235888 185906 185074 143107 105041 93540 30699 51852 125256 76303 47288
19032 47288 87705 58207 19452 -31278 37082 -13518 -77955 -123882 -170044 -88396 -1228 42030
19020 42030 -46046 -54785 71410 184040 119106 3622 -6786 -21875 11525 8768 98028
19009 98028 72777 15389 -30119 -22636 11538 -31259 -44547 5044 6450 -36898 55274 160132
18997 160132 145521 103849 37039 43152 76280 41065 31895 2147 -66192 -107984 -155135 -167851
$$ packed form
19076D63500K0646r6421J9776J03569J4717j76052j31811Q8524J40932r3020p9535
19065B74825j48622J10684J06456m0374j49441m4051r5838n5507j29976O8765
19055a03079J7242Q4406M6581P6991n461j64025J7026Q3015J04116N7941n1892
19044A62861M80P2547m9982q32m1967l8066j1501o2841K1153P3404m8953k9015
19032D7288M0417k9498l8755n0730O8360n0600o4437m5927m6162Q1648Q7168M3258
19020D2030q8076q739J26195J12630o4934j15484j0408j5089L3400k757Q9260
19009I8028k5251n7388m5508P483L4174m2797j3288M9591J406m3348R2172J04858
18997A60132j4611m1672o6810O113L3128l5215r170k9748o8339m1792m7151j2716
$$ plain form
18985 -167851 -271761 -252386 -166477 -135877 -59792 1937 -9093 -48192 -91907 -90616 -61931
18974 -61931 44114 14854 62548 -19053 -68501 -139836 -170208 -97915 -66492 -48247 36102
18963 36102 -17213 -62903 -103047 -125062 -144343 -98078 4324 29076 -199146 -329086 -279972
18952 -279972 -332241 -436559 -409786 -372048 -316820 -310588 -318649 -287851 -349374 -309760 -234276 -171670
18940 -171670 -98502 -15554 15556 -57592 -106190 -113506 -58951 -27135 -73973 -82820 -55933 3755
18928 3755 -50124 -59555 -89264 -145616 -121911 -155456 -177147 -118938 -34036 52582 105955 90826
18916 90826 130558 167849 69622 58985 50499 182478 188996 187090 159128 91719 129558 151666
18904 151666 173888 221961 193265 125391 57707 161728 198578 235619 228052 94581 77930
$$ packed form
18985a67851j03910J9375Q5909L0600P6085O1729j1030l9099m3715J291K8685
18974f1931J06045k9260M7694q1601m9448p1335l0372P2293L1423J8245Q4349
18963C6102n3315m5690m0144k2015j9281M6265J02402K4752k28222j29940M9114
18952b79972n2269j04318K6773L7738N5228O232q061L0798o1523L9614P5484O2606
18940a71670P3168Q2948L1110p3148m8598p316N4555L1816m6838q847K6887N9688
18928C755n3879r431k9709n6352K3705l3545k1691N8209Q4902Q6618N3373j5129
18916I0826L9732L7291r8227j0637q486J31979O518j906k7962o7409L7839K2108
18904A51666K2222M8073k8696o7874o7684J04021L6850L7041p567j33471j6651
$$ plain form
18893 77930 67338 45501 63683 138894 101521 118932 80981 -260 -34171 -58322 -169668
18882 -169668 -238534 -243883 -234745 -201856 -56633 -47552 -141768 -75946 80611 83649 65301 134381
18870 134381 198983 204590 179969 144962 76217 31205 4175 7310 5640 -72747 -143601 -90329
18858 -90329 768 134159 109737 116101 180538 396334 552022 572784 576205 535009 441067
18847 441067 204141 37191 122986 177309 136195 164202 190682 180431 235365 260974 226560
18836 226560 150592 123929 220346 331991 427637 428934 386696 342419 362361 358609 370599 430839
18824 430839 408853 528240 553748 503076 490978 589649 601983 677584 632897 501241 559175
18813 559175 483672 306630 267724 111469 80968 131450 228189 374504 399672 234065 125616
$$ packed form
18893G7930j0592k1837J8182P5211l7373J7411l7951q1241l3911k4151j11346
18882a69668o8866n349R138L2889J45223R081r4216O5822J56557L038j8348O9080
18870A34381O4602N607k4621l5007o8745m5012k7030L135j670p8387p0854N3272
18858i0329R1097J33391k4422O364O4437K15796J55688K0762L421m1196r3942
18847D41067k36926j66950Q5795N4323m1114K8007K6480j0251N4934K5609l4414
18836B26560p5968k6663R6417J11645R5646J297m2238m4277J9942l752J1990O0240
18824D30839k1986J19387K5508n0672j2098R8671J2334P5601m4687j31656N7934
18813E59175p5503j77042l8906j56255l0501N0482R6739J46315K5168j65607j08449
$$ plain form
18802 125616 47691 74561 2925 25183 241900 367954 454694 612655 625327 696218 755737
18791 755737 852133 908939 915220 835989 901808 953553 903117 934975 1013292 1034809 918379
18780 918379 788115 752581 666449 635246 648963 548795 549075 712738 851285 871950 865784
18769 865784 853651 911961 925107 892850 932460 992742 1216556 1252083 1276704 1175662 1023917
18758 1023917 1095939 1193659 1295920 1278252 1104885 1038114 1065690 940374 901469 972259 958027
18747 958027 877997 865046 834805 830833 835604 807051 806140 835473 828345 876563 841320 771063
18735 771063 807857 1000982 1183839 1313849 1317223 1332198 1310074 1296950 1310525 1317393 1374961
18724 1374961 1304833 1368544 1290716 1201976 1211340 1183821 1259040 1501460 1656644 1777955 2067951
$$ packed form
18802A25616p7925K6870p1636K2258K16717J26054Q6740J57961J2672P0891N9519
18791G55737R6396N6806O281p9231O5819N1745n0436L1858P8317K1517j16430
18780I18379j30264l5534q6132l1203J3717j00168K80J63663J38547K0665o166
18769H65784j2133N8310J3146l2257L9610O0282K23814L5527K4621j01042j51745
18758A023917P2022R7720J02261j7668j73367o6771K7576j25316l8905P0790j4232
18747I58027q0030j2951l0241l972M771k8553r11K9333p128M8218l5243p0257
18735G71063L6794J93125J82857J30010L374J4975k2124j3124J3575O868N7568
18724A374961p0128O3711p7828q8740R364k7519P5219K42420J55184J21311K89996
$$ plain form
18713 2067951 2348358 2530532 2853467 3541773 4590696 5798301 7039621 8445067 10269058
18704 10269058 11782834 11938870 11172868 10695800 9593184 8532939 8535255 9756235 11879806
18695 11879806 14181742 16718121 19861054 22481706 22217450 20214864 18935415 16417969
18687 16417969 12691555 10105841 8560352 7604773 6997369 6334858 5896884 5732292 5575714
18678 5575714 5558982 5677186 5856629 5785397 5802929 5959917 6079616 6058142 6186878 6521403
18668 6521403 6759632 7106522 7540185 8186249 9058332 10306304 11849006 13640722 15944177
18659 15944177 18997970 22942365 28556073 37154502 50469992 68530643 88195072 109217020
18651 109217020 133482110 153172692 156995244 153224422 151697138 145049022 144461545 160630349
$$ packed form
18713B067951K80407J82174L22935O88306J048923J207605J241320J405446J823991
18704A0269058J513776J56036p66002m77068j102616j060245K316J220980K123571
18695A1879806K301936K536379L142933K620652k64256k002586j279449k517446
18687A6417969l726414k585714j545489r55579o07404o62511m37974j64592j56578
18678E575714j6732J18204J79443p1232J7532J56988J19699k1474J28736L34525
18668F521403K38229L46890M33663O46064Q72083J247972J542702J791716K303455
18659A5944177L053793L944395N613708Q598429J3315490J8060651J9664429K1021948
18651A09217020K4265090J9690582L822552l770822j527284o648116n87477J6168804
$$ plain form
18643 160630349 185561803 211866366 239785976 264246248 266131781 241688302 206914403
18636 206914403 178829108 159842172 135378920 107557680 87754281 75548189 67892657
18629 67892657 62776133 59132712 56795731 55426305 54943278 55847107 59185655 66490247
18621 66490247 79913679 100329227 122842419 139971638 155186644 169913742 167401183
18614 167401183 136572788 105574079 87658102 78512771 74532320 74683719 79415635 90408186
18606 90408186 111344787 146546149 193098188 240144937 284848593 324508555 344707357
18599 344707357 322736553 272469384 208513578 159210138 130085604 112975809 102717318
18592 102717318 97603805 97210756 102252160 113706249 133679847 163056932 199555086
$$ packed form
18643A60630349K4931454K6304563K7919610K4460272J885533k4443479l4773899
18636B06914403k8085295j8986936k4463252k7821240j9803399j2206092p655532
18629F7892657n116524l643421k336981j369426m83027R03829L338548P304592
18621F6490247J3423432K0415548K2513192J7129219J5215006J4727098k512559
18614A67401183l0828395l0998709j7915977r145331l980451J51399M731916J0992551
18606I0408186K0936601L5201362M6552039M7046749M4703656L9659962K0198802
18599C44707357k1970804n0267169o3955806m9303440k9124534j7109795j0258491
18592A02717318n113513l93049N041404J1454089J9973598K9377085L6498154
$$ plain form
18585 199555086 241659500 282340140 310043199 318858190 315232110 281419785 221306762
18578 221306762 165676344 129449100 107117862 91960196 80960692 72816708 66720120
18571 66720120 62009487 58468176 56038138 54777957 55017103 56457341 58384377 59365854
18563 59365854 60249393 60804080 57949785 50634966 44170259 39855489 36865953 34541589
18555 34541589 32575896 30948952 29570576 28451678 27508415 26697407 26041765 25322103 24603771
18546 24603771 23852249 23048988 22195694 21365417 20454965 19700196 19074448 18507952 17936082
18537 17936082 17450757 16951050 16382838 15888310 15499193 15330064 15427634 15452853 15275970 15037409
18527 15037409 14845074 14437323 13629345 12744481 11875965 11268652 10756348 10406969 10153966
$$ packed form
18585A99555086M2104414M0680640K7703059Q814991l626080l3812325o0113023
18578B21306762n5630418l6227244k2331238j5157666j0999504q143984o096588
18571F6720120m710633l541311k430038j260181K39146J440238J927036R81477
18563E9365854Q83539N54687k854295p314819o464707m314770k989536k324364
18555C4541589j965693j626944j378376j118898r43263q11008o55642p19662p18332
18546B4603771p51522q03261q53294q30277r10452p54769o25748n66496n71870
18537A7936082m85325m99707n68212m94528l89117j69129R7570K5219j76883k38561
18527A5037409j92335m07751q07978q84864q68516o07313n12304l49379k53003
$$ plain form
18518 10153966 9803314 9577214 9310204 9103215 8791317 8251389 7913733 7852617 7748662
18509 7748662 7360901 7180717 7031399 6810246 6625358 6391541 6257531 6188799 5998493 5720805
18499 5720805 5504825 5360702 5329105 5254420 5187921 5034899 4896400 4833325 4681366 4452600
18489 4452600 4293450 4048477 3919386 3957051 3806200 3615960 3562510 3502586 3488709 3458065
18479 3458065 3345422 3304490 3311346 3318316 3268192 3093188 2727396 2555505 2500616 2509343 2458392
18468 2458392 2300094 2205201 2066052 2030042 2110659 2285534 2295239 2169457 2058836 2071172
18458 2071172 2026610 1951251 1874860 1817625 1765255 1650616 1554043 1395846 1380274 1450138 1439188
18447 1439188 1380268 1348021 1446954 1440836 1371716 1226095 1253974 1205602 1119930 1159627 1134918
$$ packed form
18518A0153966l50652k26100k67010k06989l11898n39928l37656o1116j03955
18509G748662l87761j80184j49318k21153j84888k33817j34010o8732j90306k77688
18499E720805k15980j44123l1597p4685o6499j53022j38499o3075j51959k28766
18489D452600j59150k44973j29091L7665j50851j90240n3450n9924j3877l0644
18479C458065j12643m0932O856O970n0124j75004l65792j71891n4889Q727n0951
18468B458392j58298r4893j39149l6010Q0617J74875R705j25782j10621J2336
18458B071172m4562p5359p6391n7235n2370j14639r6573j58197j5572O9864j0950
18447A439188n8920l2247R8933o118o9120j45621K7879m8372q5672L9697k4709
$$ plain form
18436 1134918 1138124 1056436 1066943 1028139 1120578 1222292 1252585 1146976 1159845 1149281 1147859
18425 1147859 1262499 1359394 1431784 1297102 1193500 1247283 1284403 1306744 1234384 1265404 1245214
18414 1245214 1218851 1217068 1293050 1318177 1226636 1106810 1100756 1186840 1326092 1309572 1320241
18403 1320241 1272075 1216046 1143988 1155071 1213095 1290803 1312643 1297857 1270608 1277773 1336492
18392 1336492 1283924 1198191 1073852 964234 893546 746459 698382 787483 793794 897155 862612
18381 862612 845907 826697 852832 879744 874621 768139 599817 668971 714702 799321 954514
18370 954514 1024012 1047546 905035 1014997 1051273 946609 874368 835760 856106 852844 956940
18359 956940 1053684 1066629 1030209 1023186 913208 805001 838416 760304 809596 879931 826757
$$ packed form
18436A134918L206q1688J0507l8804R2439J01714L0293j05609J2869j0564j422
18425A147859J14640R6895P2390j34682j03602N3783L7120K2341p2360L1020k0190
18414A245214k6363j783P5982K5127r1541j19826o054Q6084J39252j6520J0669
18403A320241m8166n6029p2058J1083N8024P7708K1840j4786k7249P165N8719
18392A336492n2568q5733j24339j09618p0688j47087m8077Q9101O311J03361l4543
18381H62612j6705j9210K6135K6912n123j06482j68322O9154M5731Q4619J55193
18370I54514O9498K3534j42511J09962L6276j04664p2241l8608K0346l262J04096
18359I56940R6744J2945l6420p023j09978j08207L3415p8112M9292P0335n3174
$$ plain form
18348 826757 685057 710012 877511 980050 1055456 837711 688325 662352 661616 640197 739256
18337 739256 819298 799201 855697 770441 717594 726014 706713 825252 885412 889316 964443 966398
18325 966398 809615 603539 489443 472768 453841 538041 671854 671758 540055 496326 559167
18314 559167 525223 510853 624629 658577 708906 779394 720427 686060 767477 764580 866671
18303 866671 969438 974897 912568 862101 836077 792474 676172 570931 590618 558816 475521
18292 475521 527202 712725 736323 653115 641219 607737 533665 500770 456132 562265 496417
18281 496417 512824 521851 500963 504995 526574 586738 655843 593004 489041 501154 471914 404980
18269 404980 450004 448805 517189 535854 613675 700308 766168 755640 800403 668451 542054
$$ packed form
18348H26757j41700K4955J67499J02539P5406k17745j49386k5973p36k1419R9059
18337G39256Q0042k0097N6496q5256n2847Q420j9301J18539O0160L904P5127J955
18325I66398j56783k06076j14096j6675j8927Q4200J33813r6j31703m3729O2841
18314E59167l3944j4370J13776L3948N0329P0488n8967l4367Q1417k897J02091
18303H66671J02767N459o2329n0467k6024m3603j16302j05241J9687l1802q3295
18292D75521N1681J85523K3598q3208j1896l3482p4072l2895m4638J06133o5848
18281D96417J6407R027k0888M032K1579O0164O9105o2839j03963J2113k9240o6934
18269D04980M5024j199O8384J8665P7821Q6633O5860j0528M4763j31952j26397
$$ plain form
18258 542054 500465 715241 808218 898798 918294 815655 817977 849755 844814 842806 771094 872551
18246 872551 884498 869035 809246 677426 667485 734148 742596 803224 764342 708829 752102 702329
18234 702329 707982 618348 650354 757104 735976 671610 677089 519257 404971 364526 427488
18223 427488 576360 610546 715496 802014 805074 845437 815894 936205 954398 731253 658868
18212 658868 775586 696122 565556 550116 628196 773911 705186 607077 573985 562263 484714
18201 484714 520720 532110 454616 500549 642282 544597 552313 642425 625412 627120 634459 591983
18189 591983 641811 670822 731810 830692 732459 646938 614083 573353 615989 515823 483962
18178 483962 449266 568822 617935 650411 583461 561888 624668 695331 749172 636479 533961
$$ packed form
18258E42054m1589K14776R2977R0580J9496j02639K322L1778m941k008p1712J01457
18246H72551J1947j5463n9789j31820r941O6663Q448O0628l8882n5513M3273m9773
18234G02329N653q9634L2006J06750k1128o4366N479j57832j14286m0445O2962
18223D27488J48872L4186J04950Q6518L060M0363k9543J20311J8193k23145p2385
18212F58868J16718p9464j30566j5440P8080J45715o8725r8109l3092j1722p7549
18201D84714L6006J1390p7494M5933J41733r7685P716R0112j7013J708P339m2476
18189E91983M9828K9011O0988R8882r8233q5521l2855m0730M2636j00166l1861
18178D83962l4696J19556M9113L2476o6950k1573O2780P0663N3841j12693j02518
$$ plain form
18167 533961 566901 692350 755892 880322 953363 939514 991525 1019236 1087246 1193009 1317809
18156 1317809 1415317 1362303 1302177 1311994 1291426 1227546 1265393 1346285 1326394 1285140 1285375 1252208
18144 1252208 1122827 1033780 963056 917341 938079 999873 979528 884282 789009 824450 952983
18133 952983 1067515 1125580 1272354 1517285 1620007 1718473 1781948 1826026 2055938 2357917
18123 2357917 2516087 2568788 2658572 2996809 3570818 4217652 4865776 5709799 6837878 8309039
18113 8309039 10235360 13137925 17813797 25754351 40139903 63409973 89884195 107801479
18105 107801479 124285887 144735712 146361165 105575566 68247643 48621672 37797305
18098 37797305 30853004 25834623 22030130 19230581 17093868 15478163 14242947 13330641
$$ packed form
18167E33961L2940J25449O3542J24430P3041j3849N2011K7711O8010J05763J24800
18156A317809R7508n3014o0126R817k0568o3880L7847Q0892j9891m1254K35l3167
18144A252208j29381q9047p0724m5715K0738O1794k0345r5246r5273L5441J28533
18133I52983J14532N8065J46774K44931J02722R8466O3475M4078K29912L01979
18123B357917J58170N2701Q9784L38237N74009O46834O48124Q44023J128079J471161
18113H309039J926321K902565M675872P940554J4385552K3270070K6474222J7917284
18105A07801479J6484408K0449825J625453m0785599l7327923j9625971j0824367
18098C7797305o944301n018381l804493k799549k136713j615705j235216r12306
$$ plain form
18090 13330641 12446115 11534707 10865184 10283384 9796105 9358150 8890976 8480746 8114788
18081 8114788 7748329 7439205 7113761 6965115 6775563 6535080 6245825 6240948 6254646 6070658
18071 6070658 5907104 5830214 5718878 5348813 4885116 4663013 4531259 4376477 4225323 4068620
18061 4068620 3839909 3732719 3647567 3500790 3385297 3239625 3164566 3109526 2882000 2825882
18051 2825882 2920765 2938575 2974108 2978688 2997556 2938405 2942114 2995856 2986181 2836347 2713744
18040 2713744 2540179 2458547 2452093 2475909 2525495 2325019 2122554 2059432 2052604 2026970 1835356
18029 1835356 1706569 1696023 1789285 1747264 1595745 1654147 1682554 1568830 1470627 1379767 1324436
18018 1324436 1453515 1531855 1597956 1502718 1402716 1337125 1371664 1286059 1222921 1187039 1146668
$$ packed form
18090A3330641q84526r11408o69523n81800m87279m37955m67174m10230l65958
18081H114788l66459l09124l25444j48646j89552k40483k89255m877J3698j83988
18071F070658j63554p6890j11336l70065m63697k22103j31754j54782j51154j56703
18061D068620k28711j07190q5152j46777j15493j45672p5059n5040k27526n6118
18051B825882R4883J7810L5533M580J8868n9151L709N3742r675j49834j22603
18040B713744j73565q1632o454K3816M9586k00476k02465o3122o828k5634j91614
18029A835356j28787j0546R3262m2021j51519N8402K8407j13724r8203r0860n5331
18018A324436J29079P8340O6101r5238j00002o5591L4539q5605o3138l5882m0371
$$ plain form
18007 1146668 1099509 1018365 1021838 1008495 872262 658475 614674 716660 838500 898006 974974
17996 974974 869227 804761 774109 618591 650527 689288 623713 601666 601959 606500 556783 520668
17984 520668 585190 663862 561477 534830 643927 605760 600719 467810 301385 314441 245043
17973 245043 224521 275714 285492 291473 386154 457213 527959 334215 194374 251406 304831
17962 304831 167003 92535 36270 20994 59168 40582 -59829 7128 123676 148312 115059
17951 115059 86158 182476 320778 353129 195665 228261 330461 343009 240009 197087 237059
17940 237059 272934 301556 343033 244703 77711 90954 104805 -30825 -44715 44061 35008
17929 35008 140645 190177 137875 180687 297496 299564 312208 352100 374971 259271 161763
$$ packed form
18007A146668m7159q1144L473j3343j36233k13787m3801J01986J21840N9506P6968
17996I74974j05747o4466l0652j55518L1936L8761o5575k2047K93M541m9717l6115
17984E20668O4522P8672j02385k6647J09097l8167n041j32909j66425J3056o9398
17973B45043k0522N1193R778N981R4681P1059P0746j93744j39841N7032N3425
17962C04831j37828p4468n6265j5276L8174j8586j00411O6957J16548K4636l3253
17951A15059k8901R6318J38302L2351j57464L2596J02200J2548j03000m2922L9972
17940B37059L5875K8622M1477r8330j66992J3243J3851j35630j3890Q8776r053
17929C5008J05637M9532n2302M2812J16809K068J2644L9892K2871j15700r7508
$$ plain form
17918 161763 47939 89863 83207 82479 84237 74105 113811 50840 -93838 -156089 -166049 -65295
17906 -65295 87580 190946 256515 313677 310647 225395 140577 26527 102446 212253 215780
17895 215780 103493 81470 191915 310597 274744 244791 156426 141280 35941 -28373 63846
17884 63846 98427 -24428 -60929 -120048 -111282 -50523 102484 206909 228489 273667 301477
17873 301477 244317 182930 175982 104607 12828 87150 168425 251269 163850 108904 190013 167165
17861 167165 53122 32823 73057 111842 160521 114276 110177 116255 54220 -81669 24588
17850 24588 190246 173335 90305 79092 -33674 19184 49575 -4130 -114805 -193741 13121
17839 13121 2035 53064 29398 59046 38635 -9872 -97447 -59056 -21797 -120801 10334
$$ packed form
17918A61763j13824M1924o656p28J758j0132L9706o2971j44678o2251r960J00754
17906f5295J52875J03366O5569N7162l030q5252q4818j14050P5919J09807L527
17895B15780j12287k2023J10445J18682l5853k9953q8365j5146j05339o4314R2219
17884F3846L4581j22855l6501n9119Q766O0759J53007J04425K1580M5178K7810
17873C01477n7160o1387o948p1375r1779P4322Q1275Q2844q7419n4946Q1109k2848
17861A67165j14043k0299M0234L8785M8679m6245m099O078o2035j35889J06257
17850B4588J65658j6911q3030j1213j12766N2858L0391n3705j10675p8936K06862
17839A3121j1086N1029k3666K9648k0411m8507q7575L8391L7259r9004J31135
$$ plain form
17828 10334 120288 100444 58910 117565 284998 286339 265080 307734 269215 210855 65668
17817 65668 106216 175670 128264 135727 206515 237487 194597 -35326 -231926 -183186 -115669
17806 -115669 -153431 -210930 -134758 -21907 172514 184196 182701 255394 220678 95420 -112523
17795 -112523 -158261 -173270 -110457 -59261 -52057 -9574 153614 219717 160780 95331 163514
17784 163514 203255 121556 7992 -90093 62007 83521 106274 74847 57456 163027 218088
17773 218088 208970 117224 80231 180994 161077 46559 5438 44495 6500 -92882 -125979
17762 -125979 -41048 -73919 -15512 128860 220325 204797 145492 75920 130740 139136 173096
17751 173096 222141 74388 31846 115488 79059 -54089 51021 80387 74914 98118 50411
$$ packed form
17828A0334J09954j9844m1534N8655J67433J341k1259M2654l8519n8360j45187
17817F5668M0548O9454m7406P463P0788L0972m2890k29923j96600M8740O7517
17806a15669l7762n7499P6172J12851J94421J1682j495P2693l4716j25258k07943
17795a12523m5738j5009O2813N1196P204M2483J63188O6103n8937o5449O8183
17784A63514L9741q1699j13564r8085J52100K1514K2753l1427j7391J05571N5061
17773B18088r118r1746l6993J00763j9917j14518m1121L9057l7995r9382l3097
17762a25979Q4931l2871N8407J44372R1465j5528n9305o9572N4820Q396L3960
17751A73096M9045j47753m2542Q3642l6429j33148J05110K9366n473K3204m7707
$$ plain form
17740 50411 132976 196804 307046 235220 129784 22832 -52757 -21411 154574 151502 169469
17729 169469 278575 295671 166533 63348 90330 157728 159923 70114 89809 98803 99733 58974
17717 58974 22673 85567 89828 80339 84051 -3605 -7572 -9078 -89647 -107696 -81549 -48524 -171707
17704 -171707 -176100 -109168 28856 67153 65978 -97610 -188599 -86668 5795 54937 84454
17693 84454 149240 255113 238077 120843 115134 -9471 -124730 -120158 -7879 -88694 -18224
17682 -18224 -19102 -32716 -71536 -56099 23996 86628 69301 92249 114958 117756 113782 40907
17670 40907 -7628 65655 226107 146536 -6182 -104279 -6598 2621 54346 132960 202840
17659 202840 141979 116624 153263 161941 102065 33223 31016 110509 264210 250379 260127 198491
$$ packed form
17740E0411Q2565O3828J10242p1826j05436j06952p5589L1346J75985l072J7967
17729A69469J09106J7096j29138j03185K6982O7398K195q9809J9695Q994R30m0759
17717E8974l6301O2894M261r489L712q7656l967j506q0569j8049K6147L3025j23183
17704a71707m393O6932J38024L8297j175j63588r0989J01931R2463M9142K9517
17693H4454O4786J05873j7036j17234n709j24605j15259M572J12279q0815P0470
17682a8224q78j3614l8820J5437Q0095O2632j7327K2948K2709K798l974p2875
17670D0907m8535P3283J60452p9571j52718r8097R7681R219N1725P8614O9880
17659B02840o0861k5355L6639Q678n9876o8842k207P9493J53701j3831R748o1636
$$ plain form
17647 198491 18153 -64515 -6761 28281 105884 106857 26677 -80527 -91912 10860 164247
17636 164247 111799 123048 157829 190998 263010 279568 208032 229102 235582 223608 84516
17625 84516 165675 120002 78540 72825 98335 181502 134168 -41539 -41110 -39217 -98261 -140502
17613 -140502 -69259 -25196 44751 200331 174190 151769 149016 129071 140848 126518 70173
17602 70173 -21645 -14112 -47487 -68992 42900 178860 238101 237889 205764 210181 120727 -28313
17590 -28313 -171702 -165438 -48891 121889 108511 74281 33064 -5734 61088 80463 -33748
17579 -33748 -62431 -130380 -189921 -212397 -103078 6395 -14462 119828 96142 37400 73841
17568 73841 133830 97542 93666 23696 -8201 -17739 -31455 5453 -15167 -42312 -29297 51850
$$ packed form
17647A98491j80338q2668N7754L5042P7603R73q0180j07204j1385J02772J53387
17636A64247n2448J1249L4781L3169P2012J6558p1536K1070O480j1974j39092
17625H4516Q1159m5673m1462n715K5510Q3167m7334j75707M29J893n9044m2241
17613a40502P1243M4063O9947J55580k6141k2421k753j9945J1777j4330n6345
17602G0173r1818P533l3375k1505J11892J35960N9241k12l2125M417q9454j49040
17590b8313j43389O264J16547J70780j3378l4230m1217l8798O6822J9375j14211
17579c3748k8683o7949n9541k2476J09319J09473k0857J34290k3686n8742L6441
17568G3841N9989l6288l876o9970l1897r538j3716L6908k0620k7145J3015Q1147
$$ plain form
17556 51850 63355 -30433 -49592 -56102 -33827 58197 121087 65940 48810 57848 168211 88636
17544 88636 43695 -26110 -106537 -135797 -346 -26022 -190892 -307845 -312078 -135298 43478
$$ packed form
17556E1850J1505r3788j9159o510K2275R2024O2890n5147j7130R038J10363p9575
17544H8636m4941o9805q0427k9260J35451k5676j64870j16953m233J76780J78776
$$ [...]
##END NTUPLES=NMR SPECTRUM
##END=
