##TITLE=Analysis number 321420
Compound Code cc 45803
Book Reference 468/136/2
Project Code adrs
Chemist Name colinb
##JCAMPDX= 6.0         $$ Bruker NMR JCAMP-DX V2.0
##DATA TYPE= NMR SPECTRUM
##DATA CLASS= NTUPLES
##ORIGIN= Bruker BioSpin GmbH
##OWNER= nmr
$$ XWIN-NMR		Version 3.5
$$ Wed Aug  9 15:32:17 2006 GMT Daylight Time (UT+1h)  MAYBRIDGE\nmr@NMR_250MHZ
##.OBSERVE FREQUENCY= 250.131544655141
##.OBSERVE NUCLEUS= ^1H
##.ACQUISITION MODE= SIMULTANEOUS (DQD)
##.ACQUISITION SCHEME= undefined
##.AVERAGES= 16
##.DIGITISER RES= 18
##SPECTROMETER/DATA SYSTEM= dpx250
##.PULSE SEQUENCE= zg30
##.SOLVENT NAME= CDCl3
##.SHIFT REFERENCE= (INTERNAL, CDCl3, 0, 16.522)
##AUDIT TRAIL= $$ (NUMBER, WHEN, WHO, WHERE, WHAT)
$$ ##TITLE= Audit trail, XWIN-NMR		Version 3.5
$$ ##JCAMPDX= 5.01
$$ ##ORIGIN= Bruker BioSpin GmbH
$$ ##OWNER= nmr
$$ C:\u/data/dgb/nmr/ADRS/550/pdata/1/auditp.txt
$$ ##AUDIT TRAIL=  $$ (NUMBER, WHEN, WHO, WHERE, WHAT)
(   1,<2006-08-09 15:31:51.82 +100>,<MAYBRIDGE\nmr>,<NMR_250MHZ>,
      <created by zg, POWCHK disabled, PULCHK disabled
       configuration hash MD5:
       E2 DF 36 D8 04 B2 41 60 5A D7 A3 38 5A 4B D0 FE
       data hash MD5: 64K
       8E F3 AC 02 3E D8 13 60 59 34 2A A4 95 68 B3 4F>)
(   2,<2006-08-09 15:32:08.24 +100>,<MAYBRIDGE\nmr>,<NMR_250MHZ>,
      <Start of raw data processing
       ef LB = 0.3 FT_mod = 6 PKNL = 1 SI = 32K 
       data hash MD5: 32K
       CB C7 93 3E 1A CC 49 87 83 BC D0 A1 CE B5 B0 B3>)
(   3,<2006-08-09 15:32:09.87 +100>,<MAYBRIDGE\nmr>,<NMR_250MHZ>,
      <apk 
       data hash MD5: 32K
       EB B1 10 39 45 8A E3 B8 C8 4A 6E EE 32 D3 3D 29>)
(   4,<2006-08-09 15:32:10.63 +100>,<MAYBRIDGE\nmr>,<NMR_250MHZ>,
      <abs ABSG = 5 
       data hash MD5: 32K
       F5 35 7C 70 A2 64 D1 BD 30 6B 31 2B 78 23 F0 46>)
$$ ##END=
$$ 
$$ hash MD5
$$ 1F A5 E5 59 99 A2 86 95 6E 5C AA B8 CE F1 6A 45
##$RELAX= 
##$RELAX= 
##$RELAX= 
##$RELAX= 
##$RELAX= 
##$RELAX= 
##$RELAX= 
$$ Bruker specific parameters
$$ --------------------------
##$DU= <C:\u>
##$EXPNO= 550
##$NAME= <ADRS>
##$PROCNO= 1
##$TYPE= <nmr>
##$USER= <dgb>
##$AMP= (0..31)
100 100 100 100 100 100 100 100 100 100 100 100 100 100 100 100 100 100 
100 100 100 100 100 100 100 100 100 100 100 100 100 100 
##$AQSEQ= 0
##$AQ_mod= 3
##$AUNM= <au_zg>
##$AUTOPOS= <35 >
##$BF1= 250.13
##$BF2= 250.13
##$BF3= 250.13
##$BF4= 250.13
##$BF5= 500.13
##$BF6= 500.13
##$BF7= 500.13
##$BF8= 500.13
##$BYTORDA= 1
##$CFDGTYP= 0
##$CFRGTYP= 5
##$CHEMSTR= <none>
##$CNST= (0..31)
1 1 145 1 1 1 1 1 1 1 1 1 1 1 1 1 1 1 1 1 1 1 1 1 1 1 1 1 1 1 1 1 
##$CPDPRG= <>
##$CPDPRG1= <>
##$CPDPRG2= <>
##$CPDPRG3= <>
##$CPDPRG4= <mlev>
##$CPDPRG5= <mlev>
##$CPDPRG6= <mlev>
##$CPDPRG7= <mlev>
##$CPDPRG8= <mlev>
##$CPDPRGB= <>
##$CPDPRGT= <>
##$D= (0..31)
0 1 0 0 0 0 0 0 0 0.06 0 0 0 0 0 0 0.0002 0 0 0 0 0 0 0 0 0 0 0 0 0 0 
0 
##$DATE= 1155133910
##$DBL= (0..7)
120 120 120 120 120 120 120 120 
##$DBP= (0..7)
150 150 150 150 150 150 150 150 
##$DBP07= 0
##$DBPNAM0= <>
##$DBPNAM1= <>
$$ [...]
##$SUBNAM7= <"">
##$SUBNAM8= <"">
##$SUBNAM9= <"">
##$SW= 20.6930455092707
##$SWIBOX= (0..15)
0 0 3 0 0 0 0 0 0 0 0 0 0 0 0 0 
##$SW_h= 5175.983436853
##$TD= 65536
##$TD0= 1
##$TE= 295.16
##$TE2= 300
##$TE3= 300
##$TEG= 300
##$TL= (0..7)
0 120 120 120 120 120 120 120 
##$TP= (0..7)
150 150 150 150 150 150 150 150 
##$TP07= 0
##$TPNAME0= <>
##$TPNAME1= <>
##$TPNAME2= <>
##$TPNAME3= <>
##$TPNAME4= <>
##$TPNAME5= <>
##$TPNAME6= <>
##$TPNAME7= <>
##$TPOAL= (0..7)
0.5 0.5 0.5 0.5 0.5 0.5 0.5 0.5 
##$TPOFFS= (0..7)
0 0 0 0 0 0 0 0 
##$TUNHIN= 0
##$TUNHOUT= 0
##$TUNXOUT= 0
##$USERA1= <user>
##$USERA2= <user>
##$USERA3= <user>
##$USERA4= <user>
##$USERA5= <user>
##$V9= 5
##$VALIST= <valist>
##$VCLIST= <CCCCCCCCCCCCCCC>
##$VD= 0
##$VDLIST= <DDDDDDDDDDDDDDD>
##$VPLIST= <PPPPPPPPPPPPPPP>
##$VTLIST= <TTTTTTTTTTTTTTT>
##$WBST= 1024
##$WBSW= 4
##$XGAIN= (0..3)
0 0 0 0 
##$XL= 0
##$YL= 0
##$YMAX_a= 256383
##$YMIN_a= -434007
##$ZGOPTNS= <>
##$ZL1= 120
##$ZL2= 120
##$ZL3= 120
##$ZL4= 120
##$ABSF1= 16.522
##$ABSF2= -4.171173
##$ABSG= 5
##$ABSL= 3
##$ALPHA= 0
##$AQORDER= 0
##$ASSFAC= 0
##$ASSFACI= 0
##$ASSFACX= 0
##$ASSWID= 0
##$AUNMP= <proc_1d>
##$AZFE= 0.1
##$AZFW= 0.1
##$BCFW= 0
##$BC_mod= 0
##$BYTORDP= 0
##$COROFFS= 0
##$CY= 12.5
##$DATMOD= 1
##$DC= 0
##$DFILT= <>
##$DTYPP= 0
##$F1P= 14.0000005364418
##$F2P= -0.99999901652339
##$FCOR= 0.5
##$FTSIZE= 32768
##$FT_mod= 6
##$GAMMA= 0
##$GB= 0
##$INTBC= 1
##$INTSCL= 1
##$ISEN= 128
##$LB= 0.3
##$LEV0= 0
##$LPBIN= 0
##$MAXI= 10000
##$MC2= 0
##$MEAN= 0
##$ME_mod= 0
##$MI= 0
##$NCOEF= 0
##$NC_proc= -3
##$NLEV= 6
##$NOISF1= 0
##$NOISF2= 0
##$NSP= 0
##$NTH_PI= 0
##$NZP= 0
##$OFFSET= 16.522
##$PC= 1
##$PHC0= 151.9037
##$PHC1= 12.37563
##$PH_mod= 1
##$PKNL= yes
##$PPARMOD= 0
##$PSCAL= 4
##$PSIGN= 0
##$REVERSE= no
##$SF= 250.13
##$SI= 32768
##$SIGF1= 0
##$SIGF2= 0
##$SINO= 400
##$SIOLD= 32768
##$SREGLST= <1H.CDCl3>
##$SSB= 0
##$STSI= 32768
##$STSR= 0
##$SW_p= 5175.98343685301
##$SYMM= 0
##$S_DEV= 0
##$TDeff= 65536
##$TDoff= 0
##$TI= <Analysis number 999999
Compound Code 99
Book Reference 9
Project Code 9>
##$TILT= no
##$TM1= 0
##$TM2= 0
##$TOPLEV= 0
##$USERP1= <user>
##$USERP2= <user>
##$USERP3= <user>
##$USERP4= <user>
##$USERP5= <user>
##$WDW= 1
##$XDIM= 32768
##$YMAX_p= 319202305
##$YMIN_p= -362609
$$ End of Bruker specific parameters
$$ ---------------------------------
##NTUPLES= NMR SPECTRUM
##VAR_NAME=  FREQUENCY,     SPECTRUM/REAL,   SPECTRUM/IMAG
##SYMBOL=    X,             R,               I
##VAR_TYPE=  INDEPENDENT,   DEPENDENT,       DEPENDENT
##VAR_FORM=  AFFN,          ASDF,            ASDF
##VAR_DIM=   32768,         32768,           32768
##UNITS=     HZ,            ARBITRARY UNITS, ARBITRARY UNITS
##FACTOR=    0.157963299565203, 1,           1
##FIRST=     4132.6476996994, 0,             0
##LAST=      -1043.33573715361, 0,           0
##MIN=       -1043.33573715361, -362609,     0
##MAX=       4132.6476996994, 319202305,     0
$$ Real data points
##PAGE= N=1
##DATA TABLE= (X++(R..R)), XYDATA
$$ [...]
18330G16074R493J64228J47486J01697L7955P3723J10082K8603O237J32069Q2456
18319A610103K88M0013J87001J56424J40057R9141K9240M9919P9624Q7537J04815
18308B584162J05539K00344L10221M03561N77779Q22105J094854J914210L079834
18299A1092609M270905N096692N401786M795103J411945k253201m111053o209768
18291A9495018n287411k933615j631877j071466p42150m74006l62396l67241j93585
18282F431271j22517k8983J22374K70720L97040N22022O81690J048216J538784
18273A0860617K047737L270403M660859N801257O643753O351149M763010J830902
18265D6229687j715211m507860n985897o053166n014817l471238k070835j128724
$$ plain form
18330 716074 725567 889795 1037281 1138978 1176933 1250656 1360738 1389341 1395578 1527647 1610103
18319 1610103 1610391 1650404 1837405 1993829 2133886 2233027 2262267 2312186 2391810 2479347 2584162
18308 2584162 2689701 2890045 3200266 3603827 4181606 5003711 6098565 8012775 11092609
18299 11092609 15363514 20460206 25861992 30657095 32069040 29815839 25704786 19495018
18291 19495018 14207607 11273992 9642115 8570649 7828499 7354493 6992097 6624856 6431271
18282 6431271 6308754 6279771 6402145 6672865 7069905 7591927 8273617 9321833 10860617
18273 10860617 12908354 16178757 20839616 26640873 33284626 39635775 44398785 46229687
18265 46229687 44514476 40006616 34020719 27967553 22952736 19481498 17410663 16281939
18257A6281939l51854L17357J027867K070941L291414N060689P756691J0929484
18249D6384528J3226379J3940932J2685459P621472p70331p815166j2240986j4093337
18241E8938950j1947288r598716p355674m761661l218494k321097j794083j437712
18233A6504225j232933j010756j016365q90289o59944o28590o11905m79073k49359
18224I725011k57364l53880l15438k37363j46375j48045k95290k05998j77115
18215G588143j53105j71777j74791j48088k60968k34281j86887k04395j8437J03923
18205F139337J13363J35707L21763M66037Q70331J431005K253813L043270L438333
18196A8212959L588527K848718J45507k239899l463248m463821l355319k005356
$$ plain form
18257 16281939 15930085 16247442 17275309 19346250 22637664 27698353 35455044 46384528
18249 46384528 59610907 73551839 86237298 93858770 93088439 85273273 73032287 58938950
18241 58938950 46991662 37392946 30037272 25275611 22057117 19736020 17941937 16504225
18233 16504225 15271292 14260536 13244171 12353882 11693938 11065348 10453443 9974370 9725011
18224 9725011 9467647 9113767 8798329 8560966 8414591 8266546 7971256 7765258 7588143
18215 7588143 7435038 7263261 7088470 6940382 6679414 6445133 6258246 6053851 6035414 6139337
18205 6139337 6252700 6388407 6710170 7176207 8046538 9477543 11731356 14774626 18212959
18196 18212959 21801486 24650204 24795711 22555812 19092564 14628743 11273424 9268068
18188I268068j279935q75389o19362m37991l01673k60694l28713k46994k97434
18179D619883k35685k71814j66570j42324j31186j27912j78873j24889o0312j79082
18169C001236r2275k9455j4097L9599k5521R835p8363n5426L780j38689j33693
18158B486931j54216r1770k4523n3903n4245r3608l7040K873o4352m9133n7511
18147A809503L1594J977m7277j9737n806l6820J3212N334n1303L3936n9770j9418
18135A655425J08523N7062J5275n3482L5624R0726J4172O3139J44798J38656R8317
18124B368235J30738J34883K44075K29309K01665K28521L12291M56569O49539
18115D955825Q58808J168287J498063K168524L452419N926539J0609038J7852527
$$ plain form
18188 9268068 7988133 7112744 6493382 6055391 5753718 5493024 5164311 4917317 4619883
18179 4619883 4384198 4112384 3945814 3803490 3672304 3544392 3365519 3240630 3180318 3001236
18169 3001236 2908961 2879506 2865409 2905008 2879487 2889322 2810959 2755533 2759313 2620624 2486931
18158 2486931 2332715 2240945 2216422 2162519 2108274 2014666 1977626 1980499 1916147 1867014 1809503
18147 1809503 1841097 1843074 1795797 1776060 1770254 1733434 1746646 1751980 1700677 1734613 1674843 1655425
18135 1655425 1763948 1821010 1836285 1782803 1818427 1909153 1923325 1986464 2131262 2269918 2368235
18124 2368235 2498973 2633856 2877931 3107240 3308905 3537426 3849717 4306286 4955825
18115 4955825 5814633 6982920 8480983 10649507 14101926 20028465 30637503 48490030
18107D8490030K1327022J7020111J5764487P678226k2294198l2915977j8731134
18100C6338567q977073m791701l327870k586906j952008j424099j186113j016309
18092A1076488r08923p38804o63630n43041m69933m59047m45791l96976l67183
18083F083160l17461k77222j97132j81749k63940k06352j65452q5509j61463k30958
18073C995922j83871j1967j04801p5154q0658j09024r9302k0571l5482m0157j22096
18062C112839j17936p9297j47109j09183j15975p0820m3927l9342q4923q0465
18052B223862k9054j13166n8993l2131q50m9293j09639q2400o9828m3755L2163
18041A666916r6658o1821j8786L7788q6462j03637n0989n3335l8216k0485o3707
$$ plain form
18107 48490030 69817052 86837163 102601650 110279876 87985678 55069701 36338567
18100 36338567 27361494 22569793 19241923 16655017 14703009 13278910 12092797 11076488
18092 11076488 10167565 9428761 8765131 8222090 7752157 7293110 6847319 6450343 6083160
18083 6083160 5765699 5488477 5291345 5109596 4845656 4639304 4473852 4388343 4226880 3995922
18073 3995922 3812051 3800084 3695283 3620129 3539471 3430447 3331145 3310574 3275092 3234935 3112839
18062 3112839 2994903 2915606 2768497 2659314 2543339 2472519 2428592 2389250 2304327 2223862
18052 2223862 2194808 2081642 2022649 1990518 1989668 1940375 1830736 1748336 1678508 1634753 1666916
18041 1666916 1570258 1508437 1489651 1527439 1440977 1337340 1286351 1233016 1194800 1174315 1110608
18030A110608m5531J4971j9251j27781n0381J00179N3228l7552k1578r6259q8863
18019G91790j32074Q9616l50p1829Q9078M3397o0007p3619Q7993N15M0102k7020
18007G77592M6968L021k3957l9527o5204q8049p017j8100L6069L9060j1724m6741
17995F02391R977M3207l5476N686l8525r9284m6577J2429Q9172q9171j1641L5885
17983D78073k8404l3559j4181L3849m777p0613o0763R321m5550l1606L9770k9714
17971B41846o5317j5317l0138P957n090j01141M1895j0057L8949P0001N5334J7566
17959B46488o1057M671j8491j345R570q4906r2267l5243N7244P5481O2098k8766
17947A33477p0683R0575P2800J1527j13739n3924m973K9849M4854L7740o751K2576
$$ plain form
18030 1110608 1065077 1080048 1060797 933016 882635 982814 1036042 998490 976912 880653 791790
18019 791790 659716 749332 748982 677153 766231 809628 749621 676002 763995 764510 804612 777592
18007 777592 824560 827581 803624 764097 698893 610844 603827 585727 621796 660856 649132 602391
17995 602391 612368 655575 620099 625785 587260 487976 441399 453828 543000 453829 442188 478073
17983 478073 449669 416110 401929 435778 431001 360388 299625 308946 263396 231790 271560 241846
17971 241846 176529 161212 131074 139031 133941 32800 74695 64638 103587 173588 228922 246488
17959 246488 185431 190102 171611 170266 179836 94930 2663 -32580 24664 100145 162243 133477
17947 133477 62794 153369 226169 237696 123957 70033 65060 94909 139763 177503 170752 193328
17935A93328O674J0317o7082o8349L4570k2629q9176K5514L7129K0309J04343
17924A84948J14710L663l766M8216J8646l2893m4474n7623k2441J3928k1616N2475
17912B53773O0560L3401m8020l9860j5983q866m4450o335k2011k3584k8137q1524
17900B8964M3578N8910J8070n8712Q8042L2271j72081M1265M1461m3443P9963
17889A58288K9555N035M7084o2469n9945j5417k5593N1193n6532q4466L1154M3292
17877F1179O5261M8005m6829p3993L004j8590n1746j3893K7718R0041j6908M5675
17865A18924M0536m2766n8409j0424J9426N7880J31927J4115j39995K1135Q8630
17854B40979Q1758K8643o1249j17824P1995N8221L4346o6313K1140j5996n3358
$$ plain form
17935 193328 200002 210319 143237 74888 109458 86829 -2347 23167 60296 80605 184948
17924 184948 299658 303321 299555 347771 366417 333524 289050 231427 208986 222914 201298 253773
17912 253773 314333 347734 299714 259854 243871 235005 190555 184220 162209 138625 110488 28964
17900 28964 72542 131452 149522 90810 178852 211123 39042 80307 121768 78325 158288
17889 158288 187843 192878 239962 177493 117548 102131 76538 127731 71199 -13267 17887 61179
17877 61179 126440 174445 127616 53623 56627 38037 -13709 -27602 116 90157 73249 118924
17865 118924 159460 116694 58285 47861 67287 125167 257094 271209 131214 152349 240979
17854 240979 322737 351380 290131 172307 244302 302523 336869 270556 291696 275700 222342
17843B22342K1427J1445L863K1573q536k146j6100L0376J8585P7317J02324j35497
17831C46973n1796N9108J16006J6147J8248l9827j05333k1139J6285p5283k7406
17820B51983P1230R3457Q1266P6571l5363P059K4667m78l1220K6128r145m3814
17808E12341m6385o193l6284k8107J01596K6036R0709J6697O5153N5039M7775
17797G98377N121L2956O7809O0885N6236J99935J45801J32779Q4489J19093J25858
17786A829339J11140K16025K09552K42140L17137M94700O68216Q92212J417815
17777F398276K258576L472279M893064N574553N203052M828984K747445j092310
17769C4283919j493668K53158J105130R59900k234886o748962o462750l796291
$$ plain form
17843 222342 243769 255214 259077 280650 272114 269968 253868 284244 302829 380146 482470 346973
17831 346973 295177 354285 470291 486438 504686 464859 359526 338387 354672 279389 251983
17820 251983 323213 416670 497936 574507 539144 546203 570870 570392 539172 565300 556155 512341
17808 512341 465956 459763 423479 395372 496968 523004 613713 630410 695563 750602 798377
17797 798377 803498 836454 904263 965148 1021384 1221319 1367120 1499899 1584388 1703481 1829339
17786 1829339 1940479 2156504 2366056 2608196 2925333 3420033 4088249 4980461 6398276
17777 6398276 8656852 12129131 17022195 22596748 27799800 32628784 35376229 34283919
17769 34283919 32790251 33043409 34148539 35108439 32873553 26124591 19661841 15865550
17761A5865550j914284r86914l16098M90858J568189K767009M080460M604852
17753B6159622M222730L756840J779241j317383j434213m0091Q40164M46767l335152
17744C1078525p000231n935992l562349k235779j454789j134870q35018n71852
17736H347645n69222m85589m17384l64202l61928l12808k05291j77044k33727
17727E220450j74743j09934k25187k06689j81139q7983l0645j02214q8936k14864
17717C798116k50538j35371j88538p6517j45303j45397j44534l5462q3506j19782
17707B473168j60654j38125k2418l6848m5820q9550j01098J6395K8124j32257
17697A790917p2086j5643q6253r6319j36411j0040O1998k6115K3371n340R7670
$$ plain form
17761 15865550 13951266 12964352 12648254 13139112 14707301 17474310 21554770 26159622
17753 26159622 30382352 34139192 35918433 34601050 33166837 33126746 33966910 34413677 31078525
17744 31078525 24078294 18142302 14579953 12344174 10889385 9754515 8919497 8347645
17736 8347645 7778423 7292834 6875450 6511248 6149320 5836512 5631221 5454177 5220450
17727 5220450 5045707 4935773 4710586 4503897 4322758 4234775 4204130 4101916 4012980 3798116
17717 3798116 3547578 3412207 3223669 3147152 3001849 2856452 2711918 2676456 2592950 2473168
17707 2473168 2312514 2174389 2151971 2115123 2069303 1979753 1878655 1895050 1923174 1790917
17697 1790917 1718831 1703188 1616935 1520616 1384205 1374165 1436163 1410048 1433419 1428079 1525749
17686A525749l2928k11066j26028K4997K33l0086J32953O0434r9041p1141j8076
17675A156000O837p5969j47686M0955R4874R520o4954m8170M8076j14417j9287
17664H85779j1698j0578j277k6039J0916m044m9104l2796r0774l7020k3122O8863
17652F79106K3022n8803l9995o1185J5064n1750J8699j0458q786m5474o0910K181
17640D00711m1103J19805J7901r2522m2669J9342P8917k0090l5097J8159k4802
17629C98552M3289R820K1603j5369j08399j30320k8882k7797k8290K4663K2453
17618A81323k4757P6162L3972o706j3611m0070L3434q2612n2838l9923K7475O1778
17606A53627O1044O8601n8895j0319k1616m4110l5866n0770q9918k6319K6710
$$ plain form
17686 1525749 1492821 1281755 1155727 1180724 1180957 1150871 1283824 1344258 1245217 1174076 1156000
17675 1156000 1162837 1086868 939182 980137 1075011 1084531 1019577 971407 1019483 905066 885779
17664 885779 874081 863503 862226 836187 847103 843059 793955 761159 670385 633365 610243 679106
17652 679106 702128 643325 603330 542145 557209 505459 524158 513700 504914 459440 398530 400711
17640 400711 359608 479413 497314 404792 362123 381465 460382 440292 405195 423354 398552
17629 398552 441841 451661 473264 457895 349496 219176 190294 162497 134207 158870 181323
17618 181323 156566 232728 266700 259994 246383 206313 239747 157135 104297 64374 91849 153627
17606 153627 214671 283272 224377 214058 192442 148332 112466 61696 -28222 -54541 -27831
17595b7831L9732J07996K4581N8815J19895k4119k9105M0956p2076l9651l6454
17584A62739n5038j800m7658K7702J8047j1525m1856O9111J01624L154n5185l764
17572A65551r0404r3194J263J0082q1091l406P4651O7385l135Q231P1782L3631
17560A61346k5801p4696j6115O7548L0872K4693K3345k3188n8169J7077J2758
17549A39670r8679q876M4324p5204o7648P3835M0000K0965K3048j03641o0628
17538g2834M9959J7187m0077N6937P0111j4927r0657l192k0581l740J3242n6137
17526i4709q718P6063l2960r9937M6270J04652p842p1108j0351m4711K132q828
17514a50047J17627M2339Q2746L3891p0382j0392k4805j37842j01763Q9587M3355
$$ plain form
17595 -27831 11901 119897 144478 203293 323188 299069 269964 310920 238844 199193 162739
17584 162739 107701 105901 58243 85945 103992 92467 50611 119722 221346 224500 169315 165551
17572 165551 75147 -18047 -16784 -6702 -87793 -91199 -16548 50837 47702 55933 127715 161346
17560 161346 135545 60849 44734 112282 143154 167847 191192 168004 109835 126912 139670
17549 139670 40991 32115 76439 1235 -66413 7422 47422 68387 91435 -12206 -72834
17538 -72834 -22875 -5688 -45765 11172 81283 66356 -24301 -27493 -48074 -51814 -38572 -94709
17526 -94709 -103427 -27364 -60324 -160261 -113991 -9339 -17181 -88289 -98640 -143351 -141219 -150047
17514 -150047 -32420 9919 92665 126556 56174 45782 20977 -116865 -218628 -129041 -85686
17503h5686k0443O603L0837N6281N1350J7792j27068j42203J0590O9701J18400
17492a3846Q9161o4922o1472o7096K9442Q9966J8633j0763M7632j17355m7688
17481a08308N7627o754M554L4777K11m4959m7811J6695J35240J15452l0181k9349
17469I7194k955j9927p990J8438N73n1538n9109p1232Q756M603j0451k2703N2739
17456f3602O3609M8063Q087M923j2217o9951n9912j1647k586m097Q0533J3095
17444e702J3317J33360J47606N0906O9933O3934N1378n7960j67745j30268L19
17433A69078k5218j31258r8188r0401R8913J37585J06855l3388m450j4522j6324
17422I8682N3713K2769j371j9271j14830m0042N0857K0884o3617J6622n8546n2707
$$ plain form
17503 -85686 -106129 -99526 -68689 -12408 38942 56734 -70334 -212537 -201947 -132246 -13846
17492 -13846 75315 10393 -51079 -118175 -88733 1233 19866 9103 56735 -60620 -108308
17481 -108308 -50681 -57435 -52881 -18104 -17893 -62852 -110663 -93968 41272 156724 126543 97194
17469 97194 94239 74312 66322 84760 85333 33795 -25314 -96546 -87790 -83187 -93638 -116341 -63602
17456 -63602 7 48070 56157 61080 48863 -21088 -81000 -92647 -95233 -99330 -18797 -5702
17444 -5702 7615 140975 288581 339487 409420 473354 524732 466772 299027 168759 169078
17433 169078 143860 12602 -85586 -175987 -77074 60511 167366 133978 129528 115006 98682
17422 98682 152395 175164 173793 154522 39692 -350 50507 71391 7774 24396 -34150 -86857
17410h6857l9496O8966M7442o650n4157L5982L2233l6747j6719r621m8226j6591
17398a30441N8256l887n00J1554j0664K9530J1123K7985m7422l5508J33578O4857
17386A08461k9454p5326p4574k9320J39482m9311q4016Q728N1409J2855n4673
17375g5739m1489k1362k881o6937L0180O7178J4103N5966Q4202L7542k9283n8748
17363g268l6947l0274L3212R7462j2278o4239m4899O2162l2273L5163r426o551
17351a6156j9567r5041J8496O5487Q344j24M495l0204p267n1361J9588j442O7113
17338c7639m1726l5583P5909N7203m3421M3808q0586j6412N0000l1217N5169Q00
17326c695o1611n9791M3112L0530J6746m2100k0360M0223K1723m910j237j7107
$$ plain form
17410 -86857 -126353 -57387 -9945 -16595 -70752 -34770 -2537 -39284 -56003 -65624 -113850 -130441
17398 -130441 -72185 -76072 -76572 -65018 -75682 -46152 -35029 -7044 -54466 -89974 43604 108461
17386 108461 79007 3681 -70893 -100213 39269 -10042 -94058 -85330 -33921 -21066 -75739
17375 -75739 -117228 -138590 -141471 -208408 -178228 -111050 -96947 -40981 43221 80763 51480 -7268
17363 -7268 -44215 -74489 -41277 56185 43907 -20332 -65231 -3069 -35342 -179 -9605 -16156
17351 -16156 -35723 -130764 -112268 -46781 -38437 -38561 -34066 -64270 -71537 -122898 -103310 -104752 -37639
17338 -37639 -79365 -114948 -39039 18164 -25257 18551 -62035 -78447 -28447 -59664 -4495 -3695
17326 -3695 -65306 -125097 -81985 -51455 -34709 -76809 -97169 -56946 -35223 -40133 -41370 -58477
17314e8477o1664N5378N3234J5411j6352J09326J372n7531n1430k2742J0901k5426
17302d8000j3400O2089p1649j23638K712J06864Q6912J022J823R3403Q6105n120
17290A79123o8040j99696p7794K6954R8919K7911K7915k3644Q7386n8406r6452
17279g5824J4509Q1143J1657K1398n9618o0251p1320O6303O4913L7189M4441L1756
17267A06296J4870o6429p5788q6518l9281M597O8938M0346M5296Q6431n1817m140
17255D2801k9069m9322N2991m2436n0969n0805k6351Q7529K9392p3096o8563K4808
17243a53090P2680M8899j6900n3270o9858N8831K1440L5856j0520M3539K4J6735
17231e634J02071N9426o2023l7993Q455k4741j09681L2612J8784O6406P0125O785
$$ plain form
17314 -58477 -120141 -64763 -11529 3882 -12470 96856 98228 40697 -10733 -33475 -22574 -48000
17302 -48000 -61400 689 -70960 -194598 -191886 -85022 1890 2912 4735 98138 184243 179123
17290 179123 111083 -88613 -166407 -139453 -40534 -12623 15292 -8352 79034 20628 -75824
17279 -75824 -61315 19828 31485 52883 -6735 -66986 -138306 -72003 -7090 30099 74540 106296
17267 106296 121166 54737 -21051 -107569 -146850 -142253 -73315 -32969 12327 98758 46941 42801
17255 42801 13732 -35590 17401 -25035 -76004 -126809 -153160 -65631 -36239 -109335 -177898 -153090
17243 -153090 -80410 -31511 -48411 -101681 -171539 -112708 -91268 -55412 -65932 -22393 -22369 -5634
17231 -5634 96437 155863 93840 55847 64302 39561 -70120 -37508 -18724 47682 117807 124592
17219A24592m4302k9938J1873n1230n4006Q0466R121k1272j5231J5874m8394m1725
17207f4172O1068L3240m467L1457O2980J3155r818j0658r6277J7820M1721N2577
17195A28626J5144j9459o415L1105n4950r5997k1627M2416k4014K8863L3204L6089
17183I2985l0369n436o0405J2054N1155R3327Q9774n6553l4503J11405Q3983j5008
17171C32409m7151p7070p7634K3532O2411j20409j40467J9360J14770N3836R080
17160A52667k3401o1191r74j2381N4231M89o043o9554Q885j6409n0599N7277k0595
17147A2402o4133k6972j7559M720k700K1961K9722Q8577K8018n0091o7594p9687
17135a23336p65M8823l3254K5025j9468M5952J5974N3852K7218j5715M531o0404
$$ plain form
17219 124592 80290 50352 62225 10995 -43011 37455 46576 25304 10073 25947 -22447 -64172
17207 -64172 -3104 30136 25669 57126 120106 133261 123443 112785 16508 34328 76049 128626
17195 128626 143770 124311 117896 149001 94051 -1946 -23573 18843 -5171 23692 56896 92985
17183 92985 62616 57180 -3225 8829 59984 153311 243085 186532 152029 263434 347417 332409
17171 332409 285258 208188 130554 154086 216497 96088 -44379 -25019 89751 143587 152667
17160 152667 129266 68075 67101 54720 108951 109440 103397 33843 42728 26319 -24280 32997 12402
17147 12402 -51731 -78703 -96262 -91542 -94242 -72281 -42559 46018 74036 23945 -43649 -123336
17135 -123336 -124101 -75278 -108532 -83507 -102975 -57023 -41049 12803 40021 24306 28837 -31567
17123c1567m6934q4909m0308M4317M7823l1032l8891L9847K5661n1041j0406j2504
17111a89944l7479L5560j715J13998J5059l2886O3506J8221J4841j2859L9296
17100B5598O8149J6455l3975n3423K9431R253m7363K3633n7090m3712j3493K3353
17088e3184j7827p0127K5658N2469m6361L6737P8185R2755j06030m4875L9377
17077a3223k6448k2509Q967N2811K5804o9308p9044q40J652J23652L6770j30529
17065i2245o1341Q8889O9366l7017J8837kP133L3263m1300M8819o5634q2755j0826
17052a24813O1954L5005r8626M34N1801P4905N4067n1409n580p6968n3409K9204
17040a03435p179K0698k0652M0230Q8882L1870K3655Q603O942J3915m1421M426
$$ plain form
17123 -31567 -78501 -163410 -203718 -159401 -111578 -142610 -181501 -141654 -115993 -167034 -177440 -189944
17111 -189944 -227423 -191863 -193578 -79580 -64521 -97407 -33901 -15680 -839 -13698 25598
17100 25598 93747 110202 76227 22804 52235 61488 14125 37758 -19332 -63044 -76537 -53184
17088 -53184 -71011 -141138 -115480 -63011 -109372 -72635 5550 98305 -7725 -52600 -13223
17077 -13223 -39671 -62180 -53213 -402 25402 -43906 -122950 -123790 -122138 1514 38284 -92245
17065 -92245 -153586 -64697 4669 -32348 -13511 -13513 -6380 26883 -14417 34402 -31232 -113987 -124813
17052 -124813 -62859 -27854 -126480 -126046 -74245 660 54727 3318 -2262 -79230 -132639 -103435
17040 -103435 -110614 -89916 -110568 -70338 18544 50414 74069 82672 89614 103529 62108 66534
17028F6534L1262R7856q771j43234o6560K77j0183k3331K4537K1669j1549O2920
17016D1427Q6248j8047o4367j9772J7461K18M2618k3810l4683n5062J7536O3542
17004E3309K5863j7687M163j9344o2810P6669l3058K5474l0467n1323n0418k3635
16992a03264j0187n9808j6065k2852N5665J19469M6847n4539l0007K096o3573
16981a36218O7601O1600k6683qk9133J6989L1136k0075N9123J21621j6475k3484
16969A05994p3884k1448m4252k617L3750k4205n9493J6887R1520l8471m727J7062
16957c884Q2593L2670l5627l3608m3123k9445n1961o944M9064L8748N8419L9662
16945I6564M0908N1261m3266j49224L5036J6299j3177N7666R347j45469k5634
$$ plain form
17028 66534 97796 195652 186881 43647 -22913 -22636 -32819 -56150 -31613 -9944 -21493 41427
17016 41427 127675 109628 45261 25489 42950 43168 85786 61976 27293 -27769 -10233 53309
17004 53309 79172 61485 65648 46304 -16506 60163 27105 52579 22112 -29211 -79629 -103264
16992 -103264 -113451 -173259 -189324 -212176 -156511 -37042 9805 -44734 -74741 -72645 -136218
16981 -136218 -68617 -7017 -33700 -33708 -62841 -45852 -14716 -34791 24332 145953 129478 105994
16969 105994 32110 10662 -33590 -36207 -2457 -26662 -86155 -69268 22252 -16219 -20946 -3884
16957 -3884 78709 111379 75752 42144 -979 -30424 -82385 -89329 -40265 -1517 56902 96564
16945 96564 137472 188733 145467 -3757 31279 47578 34401 92067 101414 -44055 -69689
16934f9689N9678O4631P993j17514m9872J7922L1040l750M0808k691l2954L0913
16922b3485l2511q2891n8804R6120J04925O8026k6894L111K6737q501p9647P5632
16910F1818j6031o6770Q8450k4129k3689o2812j6950k4891j5195j6384k2102J13471
16898b5214O2190n461Q2152R657o2110l0310n4232L832l397N0121k0957p8252
16886g1981k2741M2498N5304j7505L4435k7936l569m5224j06280o5272P0659P5846
16874h1766M5159L9784m6351L2441m2616M9878o5329K2476M474M5236K4450o4420
16862c6584k8595n5983J7197l493j2533l6648N4206N6621K8680j7691l6791m1413
16850a13027l1598J47781R1712j5293n4305l4303J0969L0471r799k5529p5416
$$ plain form
16934 -69689 -10011 54620 62613 -54901 -104773 -86851 -55811 -59561 -18753 -21444 -54398 -23485
16922 -23485 -55996 -138887 -197691 -101571 3354 71380 44486 47597 74334 65833 -13814 61818
16910 61818 45787 -20983 67467 43338 19649 -43163 -60113 -85004 -100199 -116583 -138685 -25214
16898 -25214 36976 31515 113667 123324 61214 30904 -23328 -19496 -22893 27228 6271 -71981
16886 -71981 -94722 -52224 3080 -14425 20010 -7926 -11495 -56719 -162999 -228271 -157612 -81766
16874 -81766 -36607 3177 -43174 -10733 -53349 -3471 -68800 -46324 -41850 3386 27836 -36584
16862 -36584 -65179 -121162 -103965 -107458 -119991 -156639 -102433 -45812 -17132 -34823 -71614 -113027
16850 -113027 -144625 3156 94868 79575 25270 -9033 1936 32407 22608 -2921 -78337
16839g8337R042m9961R230R1974Q3139p5121m7325n376N090M1288m5208m7578
16827a09143Q3224K9583q602P2755j1298r0055o4295N4708M5583k9626n8271n7693
16815a43130K2511O2043o7808P6583J7480n2171o1946p594K3629L5980O282M1632
16803d6509m8320l8753K2586k082l0137r422N1155m2886J4037J1702K8838m8781
16791a38572P704K4571l047M418R1166K1250k9650J8528N7446j3842o9787p9804
16779a09619O1772R3259L0994M7361o1351r6357Q677l3758n273J14866L2502O1181
16767A44254o9827j13486m1785k6166K2151L416q3989R36Q1645L1643j506J9813
16755c2901J96M9348q139N9111K698j42036j32628L0824M2377K7852P393N0782
$$ plain form
16839 -78337 -69295 -119256 -110026 -18052 65087 -10034 -57359 -62735 -57645 -16357 -61565 -109143
16827 -109143 -25919 3664 -4938 67817 56519 -33536 -97831 -43123 2460 -27166 -85437 -143130
16815 -143130 -120619 -58576 -126384 -49801 -32321 -84492 -146438 -154032 -130403 -94423 -88141 -46509
16803 -46509 -94829 -133582 -110996 -113078 -143215 -152637 -101482 -144368 -130331 -118629 -89791 -138572
16791 -138572 -130868 -106297 -109344 -104926 -13760 7490 -22160 -3632 53814 39972 -29815 -109619
16779 -109619 -47847 45412 76406 123767 62416 -33941 -25264 -59022 -64295 50571 83073 144254
16767 144254 74427 -39059 -80844 -107010 -84859 -81443 -165432 -164496 -82851 -51208 -52714 -32901
16755 -32901 -32705 16643 8504 67615 70313 -71723 -204351 -173527 -131150 -103298 -95905 -45123
16743d5123l4204j7657K9108L757o0166o3936J4911Q9771m212k1511N3493N9341
16731C572p822O7067N5883k248q3050l7046k4103p2031J5712k3292L261N8683
16719d5414N4233P874j5773K6030k3930k0301K0569J4978m2482o141O4916J7378
16707E1937R2255k8889L8454N449p623r9664n4709k1651M6063K4550l0922o9139
16695e3889l9293l0396N8706R724Q6431P8615k9585n624l471k1992N896K3813
16683G8935k5322N695o7281m461M9136m7569p7814k1017M2072L3651p7374n8252
16671a69601l7880P1764K8452J7234M4041m3033n0916j7915O5019j1176J23679
16660A9668K9030j8405o9092j24787j6564K9003M3366j756R252J32312O8008p1826
$$ plain form
16743 -45123 -79327 -96984 -67876 -64119 -124285 -188221 -173310 -83539 -87751 -109262 -55769 3572
16731 3572 -4250 62817 118700 116452 33402 -3644 -27747 -99778 -84066 -107358 -104097 -45414
16719 -45414 8819 16693 920 26950 3020 -17281 3288 18266 -24216 -30357 34559 51937
16707 51937 144192 115303 153757 159206 151583 51919 -2790 -24441 21622 46172 15250 -53889
16695 -53889 -93182 -123578 -64872 -55148 31283 109898 80313 74689 71218 49226 55122 78935
16683 78935 53613 59308 -7973 -12434 36702 -10867 -88681 -109698 -67626 -33975 -111349 -169601
16671 -169601 -207481 -135717 -107265 -90031 -45990 -89023 -139939 -157854 -92835 -104011 19668
16660 19668 48698 30293 -38799 -163586 -180150 -151147 -107781 -109537 -100285 32027 100035 28209
16648B8209l1346M8006o7329J4590L0848Q0268j7476j50933p4515j05503L25K6004
16636b18852P6860M5083O9011P5247r619m9071k0892Q0919N3559j5883l9558m3272
16624C532r336K1446l5016n9775p626J9639N9448j9272o1786n4792O6004k5022
16612a02556k4829j0751O1166J6639k8262Q7327N241k2690k5097r5282K4142R7510
16600a7442O385M3395N7162r25k8193p0323m6170p8061K7916L7143K3567K3587
16588b1959O6593P4085l9063l5434p8340L562M6977K521l4166J623O9917j0206
16576D6110p3839j6924l298j3097n215L3122R6682j2224j24391l1337L7252L1944
16564c5215L0739o0980l7996J3206l9767O7730j6657n7085M4021l4947P7431K4472
$$ plain form
16648 28209 -3137 44869 -22460 -7870 22978 103246 85770 -65163 -139678 -245181 -244856 -218852
16636 -218852 -141992 -96909 -27898 47349 37730 -11341 -32233 48686 102245 86362 46804 3532
16624 3532 -5804 15642 -19374 -79149 -86775 -67136 -7688 -26960 -88746 -143538 -77534 -102556
16612 -102556 -127385 -138136 -76970 -60331 -88593 -1266 3975 -18715 -43812 -139094 -114952 -17442
16600 -17442 -11057 32338 89500 88575 60382 -9941 -56111 -134172 -106256 -69113 -45546 -21959
16588 -21959 44634 118719 79656 44222 -34118 -30556 16421 18942 -15224 -13601 56316 46110
16576 46110 -27729 -44653 -47951 -61048 -66263 -33141 63541 51317 -73074 -104411 -67159 -35215
16564 -35215 -4476 -65456 -103452 -90246 -130013 -62283 -78940 -136025 -92004 -126951 -49520 -25048
16552b5048n0056K9463N7812L2394o6744n8683R706J2030R9744J8121p3547m2365
16540e7173n2525M4873P4110K6439K4479l3261R872k6453j13084L4099P6901O9374
16528G7651n551p7126J3790L5672l3313n3619j8130L5856M4898P216j9554j26186
16516a18396L1949R0850r0297m0406K4149J9350m9162J6294R4084N9302M0935
16505G8652j8926q436k0111p4007p3534K8861J20090Q1147j9171p6251m5822N4556
16493B7048K7417j7206J726p9955r4397K3267L9936N8875p74j3402l0740K9009
16481b9196N7543m4612n248N5074O2152Q298n9024p3222j25491R447J48676m3864
16469c9467o780N4202J8964p7239O5571Q1683j4951o684q4209p1270K5852j6841
$$ plain form
16552 -25048 -75104 -45641 12171 44565 -22179 -80862 -71156 -59126 40618 58739 -14808 -57173
16540 -57173 -109698 -64825 9285 35724 60203 26942 36814 10361 -102723 -68624 8277 77651
16528 77651 72100 -5026 8764 44436 11123 -42496 -60626 -24770 20128 27344 7790 -118396
16516 -118396 -86447 4403 -85894 -126300 -102151 -82801 -131963 -115669 -21585 37717 78652
16505 78652 59726 51290 31179 -42828 -116362 -87501 32589 113736 94565 18314 -27508 27048
16493 27048 54465 37259 38985 -40970 -135367 -112100 -72164 -13289 -14063 -27465 -58205 -29196
16481 -29196 28347 -16265 -21513 33561 95713 104011 44987 -28235 -153726 -144279 4397 -39467
16469 -39467 -46247 7955 26919 -50320 15251 96934 81983 75299 -8910 -80180 -54328 -71169
16457g1169O6338K2344k2223n0170J5663M845q232M6546k4750p6360p4578j8605
16445a90351K1550J04759k2759p094J4825J2646M8744L3507j639m3180N0909J10903
16433A32820L5059k2294n6555k3994q593n8992m1358K6304k0091m7820J2815l8053
16421a10752l9134m022Q5082N0202L4601o1249l648J4104M6314P0644K4894j49306
16409d2270l9311j7780R8K6044o5221K8916P2457K4542o4885r7762Q4661Q4308
16397f203k21O003n1482j7430P073Q975J3352l477L1282M2973L7552k6891m3272
16384a766R122n722M6275R5560P5935j1551q4914o1554l6852N931m8188o7258
16372h4982K0680P8983K2767n1932o5352J6757n4567J2002O1943K5804p54N3270
$$ plain form
16457 -71169 -4831 17513 -4710 -54880 -39217 -34372 -42604 3942 -20808 -97168 -171746 -190351
16445 -190351 -168801 -64042 -86801 -93895 -79070 -66424 -17680 15827 14188 -28992 21917 132820
16433 132820 167879 145585 89030 65036 56443 -2549 -43907 -17603 -37694 -85514 -72699 -110752
16421 -110752 -149886 -153908 -68826 -18624 15977 -45272 -48920 -34816 11498 82142 107036 -42270
16409 -42270 -81581 -99361 -99263 -73219 -138440 -109524 -37067 -12525 -77410 -175172 -90511 -6203
16397 -6203 -6424 -421 -51903 -69333 -62260 -53285 -39933 -43410 -12128 30845 68397 41506 -1766
16384 -1766 7356 1634 47909 143469 219404 207853 122939 61385 24533 30464 -17724 -84982
16372 -84982 -64302 14681 37448 -14484 -79836 -63079 -117646 -105644 -43701 -17897 -18651 34619
16360C4619K4852k0363K5864n7056j1973p5741L3005N1108q5087j12289N297P3882
16348a13882J05237L9567n5400P3906J03916J9458r4270j14833q6915O4659J01892
16337D3335M5815p5662J0010J7336L3240l9138J2131l6122o9818J3462Q1199j33628
16325i7840p7139J07582K5094J21152J00931L8245o5820m4757J0645k1758j13694
16314a7359o754L4412p0650l4191n6085M4085J23580l6683j4306K0440L8733k6347
16302a125L0358k6690j9119J053q823n4513k5039L5639j761Q579l0321Q998j7448
16289a00212o8027j6457N6903M1810m5388N3157J6468O0287J4027L0676n8201
16278a4957j1148J8052l2976L3617L7106o0569o1717k9740J10925Q600j9505L5876
$$ plain form
16360 34619 59471 39108 64972 7916 -4057 -79798 -46793 4315 -80772 -193061 -187764 -113882
16348 -113882 -8645 30922 -24478 49428 153344 172802 78532 -36301 -123216 -58557 43335
16337 43335 89150 13488 23498 40834 74074 34936 47067 10945 -58873 -45411 35788 -97840
16325 -97840 -174979 -67397 -42303 78849 179780 218025 152205 107448 118093 96335 -17359
16314 -17359 -24113 10299 -60351 -94542 -150627 -106542 17038 -19645 -33951 -13511 25222 -1125
16302 -1125 29233 2543 -16576 -15523 -24346 -78859 -103898 -68259 -70020 -61441 -91762 -82764 -100212
16289 -100212 -168239 -184696 -127793 -85983 -131371 -78214 -61746 -1459 12568 43244 -14957
16278 -14957 -26105 -8053 -41029 -7412 29694 -30875 -92592 -122332 -11407 -2807 -22312 13564
16266A3564O7380K7459m6240j07754m8526j5341l7632m1835M3435M3922l4689
16255a36257K7495J3222M4483K9585k2067J5747K1129l8880j8725K7712K252Q051
16243b6253N8195J1769q8252n2440M1632O5200J2000l6396N204q164Q751K0156
16231A1402O4216O1876P26o6216p3031l4696l0059o475L7775k1555n8520O781
16219a07776J16859N2535l7448n8004k6853M2488L5273j28558l6164Q2730M6550
16208a8368M5406N656j7520L9997M7345k6134K4970j3354j11170n3426K3197j25150
16196a78551N5246j043J1792J11441K8210j34881j6106K8117R2983l638M5867
16185C9437O0818r799k0744j1560k5267O2709l8170j8859m7751J0521k2669n041
$$ plain form
16266 13564 80944 108403 62163 -45591 -94117 -109458 -147090 -188925 -145490 -101568 -136257
16255 -136257 -108762 -95540 -51057 -21472 -43539 -27792 -6663 -45543 -64268 -36556 -34304 -26253
16243 -26253 31942 43711 -44541 -96981 -55349 9851 21851 -14545 -9341 -17505 -8754 11402
16231 11402 75618 137494 138220 72004 -1027 -35723 -65782 -72257 -34482 -56037 -114557 -107776
16219 -107776 9083 61618 24170 -33834 -60687 -18199 17074 -111484 -147648 -64918 -18368
16208 -18368 27038 32694 15174 55171 102516 76382 101352 87998 -23172 -76598 -53401 -178551
16196 -178551 -123305 -124348 -112556 -1115 27095 -107786 -123892 -95775 -2792 -6430 39437
16185 39437 100255 90456 69712 58152 32885 95594 57424 38565 -9186 1335 -21334 -26375
16173b6375k7492L8510J18137R196r4990R87k5201l9033j23755J9727J38073k2103
16161c4319j06726L2894Q8296M9980M8609l5293p9770l9069j490N9583M7357J7315
16149D7367n4364J0764l1572J4540L6632n1800q0288J2710o828q420k7581k7549
16137a66389Q3742J51172L4090j6085n4821j9414K6475K9408N8850j5678o7726
16126D3624r7264P880O6654L6097R945q6437p7179l5051J02952K7658J6108L076
16114A8063K9324l4500l483j1323L5873L0257M054n949k0672k3814O1279Q7972
16102A67081j35390n1455p8384N8579j5620p4561K1018N3789k8559J02090N5769
16091G4357N1346q3346o9716p1031o581m1566K758J6905q743N0398O1733P9697
$$ plain form
16173 -26375 -53867 -15357 102780 111976 16986 17973 -7228 -46261 -170016 -150289 -12216 -34319
16161 -34319 -141045 -108151 -19855 30125 78734 43441 -36329 -75398 -76888 -17305 30052 47367
16149 47367 -6997 3767 -27805 -13265 23367 -28433 -108721 -96011 -102839 -111259 -138840 -166389
16137 -166389 -82647 68525 102615 86530 31709 12295 38770 68178 127028 111350 43624
16126 43624 -53640 -45760 20894 56991 66936 -19501 -96680 -131731 -28779 -1121 14987 18063
16114 18063 47387 12887 9404 -1919 33954 64211 68265 62316 41644 17830 79109 167081
16102 167081 31691 -19764 -98148 -39569 -55189 -129750 -108732 -54943 -83502 18588 74357
16091 74357 125703 42357 -27359 -98390 -104971 -146537 -143779 -126874 -135617 -85219 -23486 56211
16079E6211Q6650m0639j7772j8461p4767M3907M1732q1219l8383K6552R8697P8153
16067A60661j59811n1254j9458k1129K6833l6509K5992P7588O99Q4954j8750k9333
16055D0483O992J5135r029n2345L77l7707J7136J3773n1686N425O7978K7045k1026
16042B2551J2419L2863k5875q5425O22n307n680l053L5858j249p208k5966q297
16029f3747O456O1338K7649O9923M4735o6355j24954O432J2706P4595j4259j34170
16017i9651K1394L4532Q418m8158j7241m855L8058O2661N9221j0743j6779l4099
16005g242O7921M7869l4791M8131j6282m5698m2850p4285j0912L6903P019j448
15993b5665P7006Q1212o0074p3982k9186m1321j0442N9681K3594M9483j8967n5274
$$ plain form
16079 56211 142861 102222 84450 65989 -8778 35129 76861 -4358 -42741 -16189 82508 160661
16067 160661 850 -50404 -69862 -90991 -64158 -100667 -74675 2913 3612 88566 69816 40483
16055 40483 47475 62610 53581 1236 1613 -36094 -18958 -5185 -56871 -51446 16532 43577 22551
16042 22551 34970 67833 41958 -43467 -42845 -48152 -53832 -56885 -21027 -22276 -29484 -55450 -63747
16029 -63747 -57291 4047 31696 101619 146354 79999 -44955 -38523 -25817 48778 34519 -99651
16017 -99651 -78257 -43725 -35307 -83465 -100706 -105561 -67503 -4842 54379 43636 26857 -7242
16005 -7242 60679 108548 73757 121888 105606 59908 17058 -57227 -68139 -31236 -24217 -25665
15993 -25665 51341 132553 72479 -1503 -30689 -72010 -82452 -22771 823 50306 31339 -23935
15981b3935k4397o3421K0726N9858L1962Q752l2909l6203J5313P1530N6641N8656
15969A42573q44P472M6518j07711m1806J772L2476L8624P370l0330j00246o8906
15957g3038K1956n412j0639o4011J983J5539K1349L182J01910l6809M2627m6183
15945b7546J3349R802r482R8146o1362p1856K127J12689k0385j34350o6161K7916
15933a27113P6872J19790l2538q2505k924N9900L892k4300p6031L50P6058M7988
15921C9439k8332o482j20028j3709J6089l0428l3608m1253k8456O6820R4998L0737
15909e4213M9044J1015m304m9080r747K8483K9954m954J4815k9193M7068k8467
15897D21K9261J06614m7814q2766k113L8088L8106P0423k2295l8521p321l6248
$$ plain form
15981 -23935 -48332 -111753 -91027 -31169 793 9545 -23364 -59567 -44254 27276 83917 142573
15969 142573 141729 149201 195719 88008 46202 47974 80450 119074 126444 96114 -4132 -73038
15957 -73038 -51082 -56494 -67133 -131144 -129161 -113622 -92273 -89091 12819 -23990 18637 -27546
15945 -27546 -14197 -4395 -13877 84269 22907 -48949 -46822 65867 45482 -88868 -155029 -127113
15933 -127113 -50241 69549 37011 -45494 -48418 11482 15374 -8926 -84957 -84607 -8549 39439
15921 39439 11107 4625 -115403 -129112 -113023 -143451 -177059 -218312 -246768 -179948 -84950 -54213
15909 -54213 -5169 5846 1542 -47538 -57285 -28802 1152 -3802 11013 -18180 28888 421
15897 421 29682 136296 88482 5716 3603 41691 79797 150220 127925 89404 82083 45835
15885D5835J1569L1279n9442j04924j25180r087M844N4555j03461j361R9903Q3281
15873g2189J7988J9355N2937R8588m3182p8458m9709m2016J03317M4552k6386
15862B4797o3801j5618K1894N5100N3930K3566j18501k3264N8304K027n9014N267
15850c5313K0040N119l1407Q3435j0987o1799L095j0522M3175q6627k5633J7588
15838h9836Q8633P5527l6689m2603O6767P1060j2256L2714l6427N0325k1605l8421
15826A07189n3903J2912n1195l7829n0367j8177O5160J2784k6674n0414K6375
15815f4139L2187p9993p7849K7426P5340K2359O4496p659M5348j8885n8717l4136
15803g4222Q5388m7476q1532J3030J12876J0819M721M849K4676l2658j9488N3889
$$ plain form
15885 45835 57404 88683 29241 -75683 -200863 -209950 -205106 -150551 -254012 -255373 -155470 -72189
15873 -72189 -54201 -34846 18091 116679 73497 -4961 -54670 -96686 6631 51183 24797
15862 24797 -39004 -54622 -32728 22372 76302 99868 -18633 -41897 16407 18434 -40580 -35313
15850 -35313 -15273 -10154 -41561 41874 30887 -30912 -27817 -38339 4836 -81791 -107424 -89836
15838 -89836 -1203 74324 37635 -4968 61799 132859 120603 153317 116890 167215 145610 107189
15826 107189 53286 66198 15003 -22826 -73193 -91370 -26210 -13426 -40100 -90514 -64139
15815 -64139 -31952 -111945 -189794 -162368 -87028 -64669 -173 -7832 37516 18631 -40086 -74222
15803 -74222 11166 -36310 -117842 -104812 8064 18883 23604 28453 53129 20471 983 54872
15791E4872J2515o3586m5695N5652N5482M8598L9141l0852m7923k0842J5678L025
15779G6065j1001k3736j6813j0044n3279q5779k4038n5943M2083Q8688J7293J4501
15767d2003o4777L7189P6070R880k0287K7923L0478L1973M7516j0277p4394n0784
15755a493j8698r445J08040L3170p1209m0750N2579M4173m0481r5780Q923N4641
15743B3670L9234n393j0534L3217l4956k9845j18921k0205O9292O584N4721L7948
15731D4812p4341M9647k6690n8701M1895K3767Q2373l1528o010l5165J5454K4566
15719E0079L3756Q074o5307q2659Q2277N8113j3589k8486m7287N2967j3170m2652
15707g884n4025r509R4877Q5268m8718l3331m7720r0817j9977J27694K0199p5915
$$ plain form
15791 54872 67387 3801 -41894 13758 69240 117838 156979 126127 78204 57362 73040 76065
15779 76065 65064 41328 24515 14471 -38808 -124587 -148625 -204568 -162485 -73797 -56504 -42003
15767 -42003 -106780 -69591 6479 16359 -3928 23995 54473 86446 133962 123685 49291 -1493
15755 -1493 -20191 -29636 78404 111574 40365 -385 52194 96367 55886 -39894 -30971 23670
15743 23670 62904 57511 46977 80194 45238 15393 -103528 -123733 -54441 -47857 6864 44812
15731 44812 -29529 20118 -6572 -65273 -23378 389 82762 51234 45224 10059 25513 50079
15719 50079 83835 91909 26602 -56057 26220 84333 70744 42258 -5029 47938 34768 -7884
15707 -7884 -61909 -71418 23459 108727 60009 26678 -21042 -111859 -131836 -4142 16057 -59858
15695e9858l3277M8518M2559k1489O1294o2044p878k7043k9009L0104q434o2745
15683a29302M4654m631m3454O297Q7361J03376j2130l8185Q5145j29505l1877
15672f2251O1851l6351r945R0519R379q2289Q131J1974M8697J08590j8799n6185
15660G3321j7018J0540j9193L2514J489j06431o3623Q235J3861J75896R0223j13477
15648H6337r2920j2355K0618J0573j07601j04383P3163J32273J7647N1187O6095
15637A40634j063j15593J0944L8085N3069l7736o7914n9374N9272j28514p6586
15626a84776N6722M6264L2152J2388m0157P2309q687l6228q938k2746M5388n4984
15614i1293N9917M5437K4944N7933K9782r1732p0963R029J5205k6364k8974p4622
$$ plain form
15695 -59858 -93135 -44617 -2058 -23547 37747 -24297 -32175 -59218 -88227 -58123 -66557 -129302
15683 -129302 -84648 -89279 -132733 -126436 -39075 64301 52171 13986 99131 -30374 -62251
15672 -62251 -400 -36751 -46696 43823 53202 -29087 -20956 -8982 39715 148305 129506 73321
15660 73321 56303 66843 47650 80164 81653 -24778 -88401 -80166 -66305 109591 199814 86337
15648 86337 -6583 -18938 1680 12253 -95348 -199731 -126568 5705 23352 74539 140634
15637 140634 139571 23978 34922 73007 126076 88340 20426 -38948 20324 -108190 -184776
15626 -184776 -128054 -81790 -49638 -37250 -77407 -5098 -13785 -50013 -58951 -81697 -36309 -91293
15614 -91293 -31376 14061 39005 96938 126720 34988 -35975 -26946 -11741 -38105 -67079 -141701
15602a41701J228P9047O8395j4180p970L3148L7971q429l6993p5794P5237r844
15590A15j14497K1091O0751l9394O654k0586K6497P096k1364q302L5943O9232
15578B3236j9899M396n3540j9668K3660M9417Q2477o7176R374N3308n8953j5795
15566A0837M7811J2106j03139L4119k5960j6537O7699j4069r8921M3948l9754
15555h1860O4766N1917n4654m5518l5168j9464L766j9589l933J04371N0536o8688
15543e3518j3674P2468O893k2971r7840n892j6807j9515L0050L4529m0973n0926
15531a78176J5853M4938l0298N7811L3415L1112R5946o5918m3343N2849M635n6034
15519c7210j4357O6662P1095M93k4245l6995m4851j1887P3021n4961m7733k3512
$$ plain form
15602 -141701 -140473 -61426 6969 -7211 -15181 17967 55938 47509 10516 -65278 9959 115
15590 115 -114382 -93291 -32540 -71934 -65280 -85866 -59369 -52273 -73637 -81939 -45996 23236
15578 23236 3337 7733 -45807 -65475 -41815 7602 90079 22903 32277 85585 26632 10837
15566 10837 58648 70754 -32385 1734 -24226 -40763 26936 12867 -86054 -42106 -81860
15555 -81860 -17094 34823 -19831 -65349 -100517 -119981 -116215 -135804 -139737 -35366 15170 -53518
15543 -53518 -67192 5276 12169 -10802 -108642 -114534 -131341 -150856 -120806 -86277 -127250 -178176
15531 -178176 -162323 -117385 -147683 -89872 -56457 -25345 70601 4683 -38660 14189 18824 -37210
15519 -37210 -51567 15095 86190 86683 62438 25443 -19408 -31295 41726 -13235 -60968 -84480
15507h4480L7128M9510O974l0657p636q978L0341l398r5587O4056J53441p0899
15495C9815O879p6502j7183m742r8864q6192J04815J19462J7660L716q9962Q4903
15483C805Q1700q2638k0592N6817n2585n1618m7444k3133k7544O835N5495Q6785
15471a4117K0130m9681m6585p5570J0265L2792J2392M2687M1845p9417n2043M8995
15459a08307M4757P4577J7622l3630J3763Q549p6156l9101l9304o4796p553K3194
15447a86385Q7867J13513L9460j7767j30879o2794M6301N8894M0961k9538l994
15436d4361k2828k6139N7042n8430n1558j0596M882k391N8491P5576Q06j5929
15424c5435R8901J9134o6854J0797J1502m5641m69j9680q6629m330O9045J31598
$$ plain form
15507 -84480 -47352 2158 9132 -21525 -29161 -38139 -7798 -11196 -106783 -42727 110714 39815
15495 39815 46694 -29808 -46991 -51733 -150597 -236789 -131974 -12512 5148 8864 -81098 3805
15483 3805 85505 2867 -17725 39092 -13493 -65111 -112555 -135688 -163232 -156397 -100902 -14117
15471 -14117 6013 -43668 -90253 -165823 -155558 -122766 -110374 -67687 -25842 -105259 -157302 -108307
15459 -108307 -63550 11027 28649 -4981 8782 17331 -58825 -97926 -137230 -202026 -209579 -186385
15447 -186385 -98518 14995 54455 36688 -94191 -156985 -110684 -51790 -10829 -40367 -44361
15436 -44361 -67189 -93328 -36286 -94716 -146274 -156870 -151988 -154379 -95888 -20312 -19506 -35435
15424 -35435 63466 82600 15746 26543 38045 -7596 -8065 -27745 -114374 -118704 -49659 81939
15412H1939N1786N1270P33o1141p6209m1705K3025P776l7520L8918K6227r1160
15400b6061m4550K7206M7138m2563o1751K8239K6152J8303P130o8178J6326J11895
15388C9286j4200o1778k0221Q272Q9916K1424K2851m7839o9531p3215J0743M0672
15376e3620L802O6513l9593r7525k2568k7076k0221R0738O7970n5005l1419k7904
15364a45908J3600K1059j8614L2960j5349K4428J7426J3681N5516o602l306R729
15352a380m2082J6980M0438p2092n5023M2188o0044J7813L2125L013Q32Q5808
15340H576m0693j27484l1687M2694N9573Q2461J35662m5051k4697j5985m0630
15329B739L77Q440k922P923l9799m7225p5966N7006Q5199M7859j4718n707p748
$$ plain form
15412 81939 133725 184995 185728 124587 48378 6673 29698 37474 -46 38872 65099 -26061
15400 -26061 -70611 -43405 3733 -38830 -100581 -72342 -46190 -27887 -20757 -88935 -72609 39286
15388 39286 25086 -36692 -56913 -48641 41275 62699 85550 37711 -31820 -105035 -94292 -53620
15376 -53620 -49818 16695 -22898 -120423 -142991 -170067 -190288 -99550 -31580 -86585 -118004 -145908
15364 -145908 -132308 -111249 -129863 -96903 -112252 -87824 -70398 -56717 -1201 -7803 -11109 -1380
15352 -1380 -43462 -26482 13956 -58136 -113159 -70971 -131015 -113202 -81077 -78064 -77232 8576
15340 8576 -32117 -159601 -191288 -148594 -89021 -6560 129102 84051 59354 43369 2739
15329 2739 3116 11556 8634 16557 -23242 -70467 -146433 -89427 -4228 43631 28913 23206 15458
15316A5458p37K0028j8456M518Q385J06523j1208l8566j38371l1551n8260N0422
15304i1815R0102j0680o1160M0473J22261J3686j23054J2880j1162l0449L5501
15293a3417l961n0158K2398j5800l2746p719r019L7046M7094m618m0326p1593
15281a42819o175k4659L5715P1361K6446o7079k5244K2178m1246K0244N8285R2534
15269A9541J02105r3440n2731j2762L6440O693J03900l187j02148l0781j74j9677
15257d6221o2034j01968k0423R7081N9306J8259M7417Q8268K114n6346o8764J3501
15245b9810O4842l450p2858R559o108r7368N909L6520L0567R478o774M8532J02627
15232I1666N2323q6317m6960J0469M784l7029O579L8445k236j758l7038J7306
$$ plain form
15316 15458 14721 34749 16293 20811 29196 135719 124511 85945 -52426 -83977 -142237 -91815
15304 -91815 -1713 -12393 -73553 -33080 89181 102867 -20187 -7307 -18469 -48918 -13417
15293 -13417 -17378 -67536 -45138 -60938 -93684 -101403 -110422 -73376 -26282 -30900 -71226 -142819
15281 -142819 -148994 -173653 -137938 -66577 -40131 -107210 -132454 -110276 -151522 -131278 -72993 19541
15269 19541 121646 28206 -24525 -37287 -847 5846 109746 106559 4411 -26370 -26544 -46221
15257 -46221 -108255 -210223 -230646 -133565 -74259 -56000 -8583 79685 81799 25453 -43311 -29810
15245 -29810 35032 31582 -41276 -31717 -37825 -135193 -129284 -92764 -62197 -52719 -59493 -10961 91666
15232 91666 143989 57672 10712 21181 25965 -11064 -4485 33960 31724 29966 -7072 10234
15220A0234l3770N969K5045q548Q076p4339n949m1219m0679j5019p865L0767L0460
15207a16837P7469J07538p5196n2183R642N520o994j1755m6499J48038J20988
15196A59731L0188n8312m5116k9295l3002L0111N4976P0260l922p2585o1149L6043
15184G7928K457n7916L056M7224J2733o2481j7594q9090o974P9287J0678n3052
15172e3744n7475j7677K3815r216r6819k2453N2114J31702O7347R129M0247p916
15160E9054j1082j8768m365r820k1065j9946k0553J2399J5917n1848K2686N9978
15148A2587R6584K8518p2582m1565m5877l7420P7426L5333n4313J7880j224m1773
15136b6426j8986n0380R057l336L8711M1984j0208K6277k100j3111M3878j5523
$$ plain form
15220 10234 -23536 -17567 7478 -1070 7006 -67333 -73282 -114501 -155180 -170199 -178064 -147297 -116837
15207 -116837 -39368 68170 -7026 -59209 -49567 -44047 -51041 -62796 -109295 38743 159731
15196 159731 189919 131607 86491 57196 24194 54305 109281 179541 175619 103034 41885 77928
15184 77928 80385 22469 25525 72749 85482 23001 5407 -83683 -90657 -11370 -692 -53744
15172 -53744 -111219 -128896 -105081 -114297 -211116 -233569 -181455 -49753 17594 26723 66970 59054
15160 59054 47972 29204 24839 15019 -6046 -25992 -46545 -34146 -18229 -70077 -47391 12587
15148 12587 109171 137689 65107 23542 -22335 -59755 17671 53004 -1309 16571 15347 -26426
15136 -26426 -45412 -95792 -86735 -90071 -51360 -9376 -19584 6693 4593 -8518 35360 19837
15124A9837J689n3806n1463j150N3375l5629k4169K0885k6627m9684L2559P7344
15112c6839p913m8151m329n2664j27756J10122R1580N3346l8815j08589J09164
15101f0844J01472P6883J4712j1681j31081n195l5884N1893l1426p7495J11599
15090B953p0797n3796J02569J8961m4282k5311o0463J2213J14123O2188L4495
15079I2853p2428n8807K5576J7566J2761O3697Q9169r3587k7151N2387q295M7612
15067A41353n2733l7522P547k8300p4330L9431O3769K8539M6903K874j15802M2148
15055F3877Q4474j07948o8928k9549L5322K4825j1146k9387K4786K9966q1448
15044f5156K0685J76277N2384J8754n3564n5527k0826m8352J6184r8487o6895
$$ plain form
15124 19837 21526 -32280 -83743 -84893 -31518 -67147 -91316 -70431 -97058 -146742 -114183 -36839
15112 -36839 -44752 -92903 -97232 -149896 -277652 -167530 -75950 -22604 -61419 -170008 -60844
15101 -60844 40628 117511 132223 120542 -10539 -15734 -51618 275 -31151 -108646 2953
15090 2953 -67844 -121640 -19071 -110 -44392 -69703 -130166 -117953 -3830 58358 92853
15079 92853 20425 -38382 -12806 4760 17521 81218 170387 76800 49649 102036 93741 141353
15067 141353 88620 51098 58645 30345 -43985 -4554 59215 87754 134657 137531 21729 63877
15055 63877 148351 40403 -28525 -58074 -22752 2073 -9073 -38460 -13674 16292 -65156
15044 -65156 -44471 131806 184190 202944 149380 93853 73027 24675 40859 -57628 -124523
15033a24523k4873J535N5414J0931p142m5899R0212O9535N3692K8833J3798o7785
15021E3728K8305k5869m1053p9630R1485J5261M9134O1804j5678r1308j9259Q940
15009C5860n469n7672Q8122J4998o5198o0793m2003o8342K8942m8837j9489O2532
14997a37349Q5698N723K656O2179k7959o794j8667P4074q216n0625M3451l8693
14985a4522q765M0228K0678o0306J01950J1252o4856K1218l825J6577J1224M616
14973G5469L1378Q853J5100J6231l8901r1938l7544J7739M3602J7452L521p1512
14961a0550q903j3516K7269q418p3788n021O9565P0078O57n3625j51596k2523
14949a80371K5135J7859O3412L8870M7979k9497K9203r217j2374m0060l7249K2617
$$ plain form
15033 -124523 -149396 -147861 -92447 -81516 -88658 -134557 -44345 25190 78882 107715 121513 53728
15021 53728 82033 56164 15111 -64519 26966 42227 91361 153165 137487 46179 26920 35860
15009 35860 30391 -27281 60841 75839 10641 -50152 -92155 -160497 -131555 -180392 -199881 -137349
14997 -137349 -51651 -45928 -43272 18907 -9052 -15846 -34513 39561 31345 -19280 24171 -14522
14985 -14522 -23287 16941 37619 -22687 79263 90515 25659 46877 43052 59629 70853 75469
14973 75469 106847 115700 130800 147031 108130 16192 -21352 -3613 39989 57441 60962 -10550
14961 -10550 -19453 -32969 -5700 -14118 -87906 -92927 -23362 46716 47373 -6252 -157848 -180371
14949 -180371 -155236 -137377 -73965 -35095 12884 -16613 12590 3373 -9001 -49061 -86310 -63693
14937f3693l5610J7047K9191K5159k9432M1979l0289k343Q3506L0548j23913n0739
14925a08589J5217P4287l8114o5169M0944J3303k0305N3679J1890K5613R9713
14914A02469L2152p3463j6999J34768N9976r5281j89298P8297P4701j6181o0348
14903C0793o0568K636j5902m1848l7911O7714K8992k1666P6635k4137n028k0239
14891b0529m4757n3992j149j0645P13l1113k1045l0919L2998O8238N6828L3659
14879b1713j4536R2392J8436k2945l8133l3602K0567P2499q9157N8747K8004l3887
14867C6672j31M3076L8659J7033m983j51233j58476J10612Q8845k4919l0407O0505
14855B5253n2542q9096L2075M6218k1848n0755k2930L6681O6451N2250j8651j4033
$$ plain form
14937 -63693 -99303 -82256 -53065 -27906 -57338 -15359 -45648 -47991 35515 66063 -57850 -108589
14925 -108589 -93372 -19085 -57199 -122368 -81424 -68121 -88426 -34747 -22857 2756 102469
14914 102469 134621 61158 44159 178927 238903 143622 -45676 32621 107322 91141 30793
14903 30793 -29775 -27139 -43041 -84889 -122800 -55086 -26094 -47760 28875 4738 -290 -20529
14891 -20529 -65286 -119278 -120427 -131072 -130359 -161472 -182517 -213436 -180438 -112200 -55372 -21713
14879 -21713 -36249 56143 74579 51634 13501 -20101 466 72965 -16192 42555 70559 36672
14867 36672 36541 79617 118276 135309 130326 -20907 -179383 -68771 20074 -4845 -35252 25253
14855 25253 -27289 -116385 -84310 -38092 -59940 -110695 -133625 -96944 -30493 21757 3106 -10927
14843a0927j2255n426J6088P097N1060K9375m1574L6414N8091m5918n688j3191
14831F3146m3202q2234n0960J4910p785k665J13430J0960p1321Q7955L4105r5338
14819b8999l9126m33l2756J7014R1426M4652j09202N9271R2304P3722m2425r2405
14807C3043m8125k6117j1958M5259k2067L742K5491R741K669O6901r255j15040
14795d5716L0857L9001m6226P0351k8784q1946l2384N3567M7661K93l2623m64
14783b6413k5702j00790J0517R3581J5366q0562k2549l5069O0986P4600l3344
14772f9379P073J0806M0874L4456N9615p4206n0073q3497J1256n9495l1873O1233
14760a43210Q7353P3916M127j3098Q897J7006n1841n8442M4681J80484m2339q0893
$$ plain form
14843 -10927 -23182 -28608 -12520 -5423 45637 75012 33438 69852 127943 82025 76337 63146
14831 63146 19944 -62290 -113250 -98340 -106125 -108790 4640 15600 -55721 32234 66339 -28999
14819 -28999 -68125 -68558 -101314 -84300 7126 51778 -57424 1847 94151 167873 125448 33043
14807 33043 -15082 -41199 -53157 -7898 -29965 -26223 -732 9009 11678 78579 69324 -45716
14795 -45716 -14859 24142 -22084 48267 19483 -62463 -94847 -41280 6381 6674 -25949 -26413
14783 -26413 -52115 -152905 -142388 -48807 -33441 -114003 -136552 -171621 -110635 -36035 -69379
14772 -69379 -62306 -51500 -10626 23830 83445 9239 -40834 -124331 -113075 -172570 -204443 -143210
14760 -143210 -55857 18059 22186 9088 17985 34991 -16850 -75292 -30611 149873 107534 26641
14748B6641j13564n8580P3839P1995R3700J006q2826k4458l8614R1131P2682K7293
14736A40245j00040q712n766n027P612l1137o2909L0189j3281k2707n3553k0J1591
14723a13515O2120Q2156J1973k468l2163L031q855N119J4501L8977N6748l2381
14711H5243q8989j7522K6918j9154J2325k7982n8707L7399O4359l9343j23143
14700a48596l6589J21776J14244l2449n6726r1167O5499N8903N1103L7353K8810
14689A12161m7724n8815L6909l2956m9936n6384L4375j6853P0980J1065k6312
14678b3490m9256j1640R6155J17865J0835j2907L385q1853j22085k6638L2350
14667f7279R6227Q2405k144o4797o721j3100n6457p7328N0300Q4678l522P0653
$$ plain form
14748 26641 -86923 -145503 -71664 331 94031 95037 12211 -12247 -50861 40270 112952 140245
14736 140245 40205 31493 25727 20700 28312 -2825 -65734 -35545 -48826 -71533 -125086 -125106 -113515
14723 -113515 -51395 30761 42734 40266 8103 11134 2279 7398 21899 60876 117624 85243
14711 85243 -3746 -21268 5650 -13504 -1179 -29161 -87868 -50469 13890 -25453 -148596
14700 -148596 -185185 -63409 50835 18386 -38340 -129507 -64008 -5105 45998 83351 112161
14689 112161 64437 5622 42531 9575 -40361 -96745 -62370 -79223 -8243 2822 -23490
14678 -23490 -72746 -84386 11769 129634 140469 127562 130947 49094 -72991 -99629 -67279
14667 -67279 28948 111353 109209 44412 37691 24591 -31866 -109194 -58894 25784 22262 92915
14655I2915k619p6785n9609J00124K2310k5299Q0559j8617M9450O4599q4116m2497
14643A00415m6232K8821l7063m040Q2528r756l7306p9187p4692j8018Q9454J4212
14631I136J01280J4969m3836l5819k2143M9641L1457k6149m6869l0905j4532l5512
14619d9282l7243L366K0343L912N9206O4171J39p3879N1763n8080o9265j135k9329
14606a15313J11460J43431J7958m6984M2126J3534j15817m8121J2363j05816L6560
14595e4619J5119o1811L808N4720M1626M3347j40716m4096J51290N2014k7013
14584C3669l0982O4150l4474q9154r0456L8357N8850L5713L6410j12175k1390
14573a11482K9332m2430k5098J1009R2565j6612j3304M5060O6238P5827J5777
$$ plain form
14655 92915 90296 13511 -46098 54026 76336 51037 131596 112979 162429 227028 142912 100415
14643 100415 54183 83004 45941 41901 124429 114673 77367 -1820 -76512 -94530 -5076 9136
14631 9136 110416 125385 81549 45730 23587 73228 104685 78536 31667 762 -13770 -49282
14619 -49282 -86525 -83159 -62816 -58904 302 64473 64612 -9267 42496 -15584 -84849 -85984 -115313
14606 -115313 -3853 139578 157536 110552 152678 166212 50395 2274 14637 -91179 -54619
14595 -54619 -39500 -101311 -97503 -42783 -1157 42190 -98526 -142622 8668 60682 33669
14584 33669 2687 66837 32363 -56791 -147247 -108890 -50040 -14327 22083 -90092 -111482
14573 -111482 -82150 -124580 -149678 -138669 -46104 -62716 -76020 -30960 35278 111105 126882
14562A26882m0345j8374J7589K4198q3968k1217j8170l5416L392J18650o4886
14551H335n359l1580k5397m240j1316O3071M5458R0209l5883o236J4069K883l4470
14538F9544P9610O8248k794p8826m172n9079K5460P2169k8845q0083o8511J0079
14526B800K7329n993n6959M0401l3103N5111m5145J500k5912r2490L1333O614
14514i4514k5294m1665K4621O0216l3439P0421P9574M5838L7858m466l902J2770
14502A28018j07516q9989m5922o4842L6913Q3742N3868q402j20421j8208m3772
14491a96531J10196J9490J1144O6930J06534m1544q3525N3212O1613P0972l1454
14480A47037k1347L066j06255r0525j5632j3148K1939l6678O0463K6049K9674
$$ plain form
14562 126882 86537 68163 85752 109950 25982 4765 -13405 -48821 -45429 73221 8335
14551 8335 2976 -28604 -54001 -58241 -69557 -6486 38972 129181 93298 87062 101131 104014 69544
14538 69544 149154 217402 214608 135782 131610 72531 97991 170160 141315 61232 -7279 2800
14526 2800 30129 24136 -32823 7578 -25525 29586 -15559 -14059 -39971 -132461 -101128 -94514
14514 -94514 -119808 -161473 -136852 -76636 -110075 -39654 39920 85758 123616 119150 115248 128018
14502 128018 20502 -69487 -115409 -180251 -143338 -59596 -5728 -14130 -134551 -152759 -196531
14491 -196531 -86335 -66845 -55701 11229 117763 76219 -7306 45906 107519 178491 147037
14480 147037 125690 128756 22501 -68024 -83656 -96804 -74865 -111543 -51080 -25031 4643
14469D643r882J3978k4104p7977L6655N6208J6872L44p1980j2798J1649P7349
14457B0957M2134p1273n4341P1825J0829N422K8687M7394q1121p2201Q6893R035
14445D4240q723l3881L3675J03465o092m7284L7489J7660m3781o3390M0954K791
14433G7123L8647r9060j36628K7643P0386L0163J01683M6670M0841j02666m8147
14422D6655k1988J894j33096q3234J32853L5223k3687l9892j4169M3411j1834
14411f7864M1661K3992O1743K9648k8330k7001n0156j52871q6186N4590J06722
14400i4052K9901j25776k57O5532K250j824L2608M9563Q3326L7304j12379M45
14388c3359Q4174l7588L1341j2256K4698k8873J256r925J8948m8301K9332N1610
$$ plain form
14469 4643 -5239 8739 -15365 -93342 -56687 -479 16393 16737 -55243 -68041 -56392 20957
14457 20957 63091 -8182 -62523 9302 20131 25553 54240 101634 20513 -51688 35205 44240
14445 44240 35517 1636 35311 138776 132684 85400 122889 140549 96768 33378 74332 77123
14433 77123 115770 16710 -119918 -92275 -21889 8274 109957 156627 197468 94802 46655
14422 46655 24667 26561 -106535 -189769 -56916 -21693 -45380 -85272 -99441 -56030 -67864
14411 -67864 -26203 -2211 59532 89180 60850 33849 -16307 -169178 -255364 -200774 -94052
14400 -94052 -64151 -189927 -190184 -124652 -122402 -124226 -91618 -42055 41271 78575 -33804 -33359
14388 -33359 50815 13227 44568 32312 57010 28137 29393 19468 38416 -9885 19447 71057
14376G1057o6811o6279L2719L885k92P198M0238O510J4478n5615r2634L3268R2927
14363B0649m713J00173J0871j27746l836R0635n5464j25653p6464R5435R7351
14352B1238l7476K9525J4842k4905l9369j6083Q4496O8617N4953R813n5462n2345
14340E7844k6127m8002j26924M9414N5927L9493L9609P862L8948k2367L3755j5358
14328H4074r1634m7641J7805L3828N6085j9205l22o1398k9868k2559J787Q0177
14316A129J20732n6111j11262j0053L5077l296l0272j6894Q776M3584L8876l4934
14304a4648m4678K3591L1860k6298j8855o770j4019p331L3585P8259k7035m3610
14292c5949n7714o1654N6645J19191K486r6094j7311k7544j7332J56546N1265
$$ plain form
14376 71057 4246 -62033 -29314 -25429 -25721 -18523 21715 28225 42703 -12912 -105546 -72278 20649
14363 20649 15936 116109 126980 -766 -4602 86033 30569 -95084 -171548 -76113 21238
14352 21238 -16238 13287 28129 3224 -36145 -52228 32268 100885 155838 165651 110189 57844
14340 57844 31717 -16285 -143209 -93795 -37868 1625 41234 49096 88044 65677 99432 84074
14328 84074 -7560 -55201 -37396 -3568 52517 33312 32990 -28408 -58276 -80835 -79048 1129
14316 1129 121861 65750 -45512 -55565 -20488 -23784 -54056 -70950 -62174 -18590 20286 -14648
14304 -14648 -59326 -35735 -3875 -30173 -49028 -55798 -69817 -77148 -43563 34696 7661 -35949
14292 -35949 -93663 -155317 -98672 20519 23005 -73089 -90400 -117944 -135276 21270 72535
14281G2535q2427j17814k9080j7460L3563J9739R8373N2683m2488m8025n1676
14270a12077M4133k1568P0362R2547j039j2504k4768P9753P2228o8885o9497O4531
14258A13216N6924r3404N19L4417j7432j06546P138k7718l952J8631r167K028
14246b5346N1146O4566o722k17625l7261J01467P5398R2105M3744m273m3631n6728
14234C6840j01220N062M3364m2533k9481M4575J0516j606p0779P9813Q3868l1067
14222B7352j616M871p3194m9l9341L9939l6609m6084l5673k533J60117J21913
14210A19093Q80n1842p4561Q247N106o184R994J3281o1496M0980J4451K614L9403
14197E9966M9716J1903O859m8970l3016j3879K0867m1467L880k9919j03003M5840
$$ plain form
14281 72535 -9892 -127706 -156786 -174246 -140683 -120944 -22571 30112 -12376 -60401 -112077
14270 -112077 -67944 -89512 -19150 73397 72358 59854 35086 114839 187067 118182 48685 113216
14258 113216 170140 76736 77255 111672 94240 -12306 -5168 -32886 -36838 -18207 -27374 -25346
14246 -25346 25800 90366 83644 -133981 -171242 -69775 5623 97728 141472 137199 93568 36840
14234 36840 -64380 -59318 -15954 -58487 -87968 -43393 -32877 -34483 -105262 -25449 58419 27352
14222 27352 25736 30607 -42587 -42636 -81977 -42038 -78647 -124731 -160404 -162937 -2820 119093
14210 119093 119973 68131 -6430 1817 6923 739 10733 24014 -37482 3498 17949 20563 59966
14197 59966 109682 121585 128444 79474 46458 32579 53446 11979 15859 -14060 -117063 -71223
14185g1223K7676Q2487N2144n8248m6843J701L2264J09728L674l0038l4370k989
14173F5963q4075l1733J2283k5401k1555J3021N1307K6543L5440M8919l7817p4999
14161b2104k8966Q9836k7191Q426M3725p7712K7947k4335m1044l9309r708j6518
14149a16953j9777J40162J09893P9090L975j42031j03444J148l550L7811o5067
14138g8743N103R4137J5675j0395P9924M9204L878q1543n5222n1534K3939O5113
14126E9536k00621j33063P4702J28902J8837k7311J5589K2891j4861N844k1246
14115g0801m7511m8793K2417J9424K710J1748N5521j0496L0710o2150O1084M852
14103c1285O3196n683k1312M6600l2984l1292L8529M4884p4926l7353O1332L2147
$$ plain form
14185 -71223 -43547 38940 91084 32836 -14007 -12306 19958 129686 133360 103322 68952 65963
14173 65963 -18112 -49845 -37562 -62963 -84518 -71497 -20190 6353 41793 90712 52895 -22104
14161 -22104 -51070 38766 11575 20001 63726 -13986 13961 -10374 -51418 -90727 -100435 -116953
14149 -116953 -136730 3432 113325 192415 196390 54359 -49085 -47937 -51487 -13676 -78743
14138 -78743 -73640 20497 36172 25777 105701 154905 158783 77240 22018 -29516 -5577 59536
14126 59536 -141085 -274148 -199446 -70544 -51707 -79018 -63429 -40538 -55399 -49555 -70801
14115 -70801 -118312 -167105 -144688 -125264 -122554 -110806 -55285 -65781 -35071 -97221 -36137 -31285
14103 -31285 31911 26228 4916 51516 18532 -12760 25769 70653 -4273 -41626 19706 51853
14091E1853r513n5976m0341k2486K9150l9476J18419J06618P846k8230n5437j8491
14079D3936j6320m909K1531o5679o0087L6598K8787P787n3696M6860K8418K3474
14067C6700N2739m6538o2709M1345N6306k00732o9974J29956J2156J2955K432
14056c5364m66k0779k527K895K6150M8297l3220l4866J4817p0876o1705K8552
14044a39092J50398J2458K7426k3377J2179K9838n0136K3370m7030l3040R5133
14033E8127M145j36240m0731Q0444Q7301K3921r572K4438L765o5611o1945Q4350
14021E2392k1881o9016M777j9344p2792l4184P9329R6335L5554J0801j6376j7751
14009B7844m6712n093n7688m2676O0908O8365j5282K4913L4155k0564r0003l9039
$$ plain form
14091 51853 42340 -13636 -53977 -76463 -47313 -86789 31630 138248 146094 117864 62427 43936
14079 43936 27616 22707 44238 -21441 -81528 -44930 -16143 -8356 -62052 -15192 13226 36700
14067 36700 89439 42901 -19808 21537 77843 -122889 -192863 -62907 -50751 -37796 -35364
14056 -35364 -35830 -56609 -59136 -56241 -30091 18206 -15014 -49880 -35063 -105939 -167644 -139092
14044 -139092 11306 23764 51190 27813 39992 69830 19694 43064 -3966 -37006 58127
14033 58127 62272 -73968 -114699 -34255 53046 76967 67395 91833 95598 29987 -31958 52392
14021 52392 30511 -38505 -33728 -53072 -125864 -160048 -80719 15616 51170 61971 45595 27844
14009 27844 -18868 -23961 -81649 -124325 -63417 4948 -10334 14579 48734 28170 -61833 -100872
13997a00872n2580J7143P3885N9681j3889j3257J9068L981Q930O3434P403L3138
13985A06065n8984j26643K1777K6520j6863q8425m4946K6892P381p4468L2891
13974a88803P2559R926J8743J02443N3218m9724l25k2344M5036o551q153n4826
13962b8801M3012j7641k1919M8868K2349l3094l5282L5491n159k2514N6254R710
13950E1274j5486l4453L7835M2190N214r5505J0338K9873J1167k0826K4950P9226
13938A25797p2269j13584K9000n396P466K7068P3080N2717k3122o2463j4232J4782
13926C8844J1982n7354o4164O8768K0088k7971N2686P1559j555p5683m0013K2308
13914A9495M7963k4635p7980j04144L4478P5171K8655j9738m0747m6957R96M3557
$$ plain form
13997 -100872 -153452 -136309 -62424 -2743 -16632 -29889 -10821 -6840 2090 65524 72927 106065
13985 106065 47081 -79562 -57785 -31265 -48128 -136553 -181499 -154607 -147226 -221694 -188803
13974 -188803 -116244 -106318 -87575 14868 68086 18362 18037 -4307 40729 34178 26025 -28801
13962 -28801 14211 -3430 -25349 23519 45868 12774 -22508 12983 7824 -14690 41564 51274
13950 51274 35788 1335 39170 81360 86574 -8931 1407 31280 42447 21621 46571 125797
13938 125797 53528 -60056 -31056 -36452 -28986 -1918 71162 123879 100757 38294 24062 38844
13926 38844 50826 -6528 -70692 -1924 18164 -9807 42879 114438 112883 37200 -2813 19495
13914 19495 67458 42823 -35157 -139301 -104823 -29652 -997 -20735 -61482 -108439 -107443 -63886
13902f3886k3899L7191J23292J8181q3315j4286l6269L6503Q694p1947Q3473M9709
13890F3441q0248L7297l8k3897m2634l6214L0071l4664k7267M5370O2959M064
13878a760L614O0086j4923o105J2613j7772k7803n0332n3980K3896O2226J32622
13866A22382M8489L13K1344r0836q9913L084J8277k4278o1782o329L7939m2540
13854f3850n5990m176L5370L0072P3915O3259k2979j10376k1770N2971J36830
13843A13276O4990l9265K837K769L2105n3308r7320m9019j084N1171J7394p1346
13831b6800n1533k7977K9425P365P147M2699o4813r2266m005N8869Q9076J07560
13819G4747k711l5353n9765o0129L0632R3814p5889R762P5857r1431j13827L0608
$$ plain form
13902 -63886 -87785 -50594 72698 90879 7564 -6722 -42991 -6488 2206 -69741 13732 63441
13890 63441 -16807 20490 20452 -3445 -46079 -82293 -52222 -86886 -114153 -68783 -5824 -1760
13878 -1760 1854 61940 47017 40912 53525 35753 7950 -42382 -96362 -72466 -10240 122382
13866 122382 170871 171184 192528 101692 11779 14863 33140 8862 -52920 -59249 -21310 -63850
13854 -63850 -119840 -124016 -88646 -58574 15341 78600 55621 -54755 -76525 -23554 113276
13843 113276 178266 139001 141838 144607 176712 123404 26084 -22935 -24019 27152 44546 -26800
13831 -26800 -78333 -106310 -76885 -69520 -62373 -19674 -84487 -176753 -180758 -121889 -32813 74747
13819 74747 72036 36683 -23082 -83211 -52579 41235 -34654 -24892 50965 -40466 -154293 -123685
13807a23685k5521N3837n59K4199M4402J3063k8004L7521K0659l5329j34492N5272
13795i8637R3511J5954k4767K7968L3761m7923r5151J34354R4584R3j5130m0307
13783G8310K0479K1333r2252j29299K9374L7574j8370M2554j24m6405m6893k1160
13771a24879m8689J61436J2562m5733j8359o865o854l2273o7585M3539M5445o5356
13759a53611L5200N6758l131m5701L6707M5090k4444K8712k6065M6818M9183m4476
13747A040M9181O7998R890R33n3840M0575J4395k4131p8612j18850K4730R3206
13735B6515N5675J2951p2093K5939Q2642k7508j22397n0584J05717k0893J04671
13724A20635k1368q9488m2870M3023l8939M9836N858L983O816J532k7139M57N272
$$ plain form
13807 -123685 -149206 -95369 -95928 -71729 -27327 -14264 -42268 -4747 15912 -19417 -153909 -98637
13795 -98637 -5126 10828 -13939 14029 47790 -133 -95284 39070 133654 133747 118617 78310
13783 78310 98789 120122 27870 -101429 -72055 -34481 -52851 -10297 -10421 -56826 -103719 -124879
13771 -124879 -173568 -12132 430 -45303 -63662 -70527 -77381 -109654 -177239 -133700 -88255 -153611
13759 -153611 -118411 -61653 -64784 -110485 -73778 -28688 -53132 -24420 -50485 -3667 45516 1040
13747 1040 50221 118219 128109 129042 75202 115777 130172 106041 27429 -91421 -66691 26515
13735 26515 82190 95141 23048 48987 131629 104121 -18276 -68860 36857 15964 120635
13724 120635 99267 9779 -33091 9932 -29007 20829 26687 30670 37486 39018 11879 12336 17608
13711A7608n1154q0999K3732Q4214N6016L8165L4567M6278o9571r1440j1954K173
13699b365K8734L6046o1129o4424N8300R617o4071L6954J1970k5551j9056m8172
13687a03147Q9406R3786K6546J0737J5127N481K629J1834L9267j07988j3185N3135
13675A23628j27133m6261N214O1072n3759m4169L416K5948K6054K2276o737j4577
13663b5028O5200O6242L7915j6212q0125o0168R247P6671o74j41705m9504R4232
13651b3909k06K0635l4461p0214N9416K8992N3037N9355O9819k0336j29740o7071
13639e4683L160M0841o0673J00102M5980p7064m0411L8912n1352l3438K3821J09658
13627D4853m8451o7023q3039J0337J5382O1608l4749L8008R6585M1942n841q0147
$$ plain form
13711 17608 -33546 -114545 -90813 -6599 49417 87582 122149 168427 98856 7416 -4538 -2365
13699 -2365 26369 62415 1286 -63138 -4838 4779 -59292 -22338 -10368 -35919 -54975 -103147
13687 -103147 -13741 80045 106591 117328 132455 137936 140565 152399 191666 83678 70493 123628
13675 123628 -3505 -49766 -44552 16520 -37239 -81408 -77992 -52044 -25990 -3714 -10451 -25028
13663 -25028 40172 106414 144329 128117 47992 -12176 -2929 73742 73068 -68637 -118141 -23909
13651 -23909 -24115 -3480 -37941 -108155 -48739 -19747 33290 92645 162464 142128 12388 -54683
13639 -54683 -51523 -10682 -71355 28747 74727 -2337 -42748 -3836 -55188 -88626 -64805 44853
13627 44853 -3598 -70621 -153660 -143323 -127941 -66333 -101082 -63074 33511 75453 69612 -10535
13615a0535N8605K1067n7078n9395N8369J95l1785K5100m5885L929J17216K0860
13603A00663j06914j01177K1431J2102m6865j9458J36902l531k3436K2626o525
13592a4182j167j2576j5731J5395J36483K3183o8393n5672J1373L5415R2550j09040
13580C7638j0347j9309j7699l6204o0660p6018o7024M0457K4912N0430O6294k2045
13568h9575n38L5943j1767m8513k0323j3183M1933J07502J4472K7462l6688l3287
13556b6562m0958Q9626N5272K840O2554P1904j1254o0958q9509J0126P8461n896
13544A35646K2648p7110K4836J6719m754J9142l041m6812j08208J8947n170m9480
13532e6637l5013n729n6029O3100P8880M3269n836l1408M8081J2004n3078n0504
$$ plain form
13615 -10535 48070 69137 12059 -47336 11033 11228 -20557 4543 -41342 -37413 79803 100663
13603 100663 -6251 -107428 -85997 -73895 -120760 -140218 -3316 -6847 -30283 -7657 -14182
13592 -14182 -15349 -27925 -43656 -28261 108222 131405 63012 7340 18713 54128 146678 37638
13580 37638 27291 7982 -9717 -45921 -106581 -182599 -249623 -209166 -184254 -133824 -67530 -89575
13568 -89575 -90113 -54170 -65937 -114450 -134773 -147956 -106023 1479 15951 43413 6725 -26562
13556 -26562 -67520 22106 77378 80218 142772 214676 203422 142464 52955 63081 141542 135646
13544 135646 158294 81184 106020 122739 117985 137127 134086 87274 -20934 -1987 -7157 -56637
13532 -56637 -91650 -97379 -153408 -90308 -11428 31841 26005 -5403 42678 54682 1604 -48900
13520d8900J2862m9032j3971L2855M9137J24607O1339k9244q3065n1n242l6218
13508A5077L5617O495K407O9867q5860j07948j04514o9895J4269O6356O5440O2748
13496b9941O3053k527l4309q500J4045j2662J8553m735L7243r715p646J8032q840
13483C2051m18J8152K9198n7985m8375K3038k1516J8430N21J1243K0941n7502
13471c2222M2576L8108K0694p8402m76L3754L4601n579j202J0047p6591o056l0936
13458e1684p6719O1811R3869K3673j1833k9444m2792j0424M4586m7457j5313M4529
13446a7198q537q9874j8986O8044R7118J12299J06924J29425L3255O8648j8983
13435D62135j01698j18215k1279L8526o9939j7704O6458k0479q1509j7845k8314
$$ plain form
13520 -48900 -36038 -85070 -99041 -66186 -17049 107558 168897 139653 56588 56537 51295 15077
13508 15077 50694 57189 59596 129463 43603 -64345 -168859 -238754 -224485 -158129 -92689 -29941
13496 -29941 33112 30585 -3724 -12224 1821 -10841 7712 2977 40220 30505 22859 40891 32051
13483 32051 31633 49785 78983 20998 -27377 -4339 -25855 -7425 -6904 4339 25280 -32222
13471 -32222 10354 48462 69156 -9246 -9722 24032 58633 53054 51852 61899 -14692 -20748 -51684
13458 -51684 -128403 -66592 27277 50950 39117 9673 -33119 -43543 1043 -46414 -61727 -17198
13446 -17198 -25735 -115609 -134595 -66551 30567 142866 249790 379215 412470 481118 462135
13435 462135 360437 242222 220943 259469 189530 171826 238284 217805 136296 118451 90137
13424I0137L2493m7023p0075r758O6250j9846M3307n7887M9124j1004p0705Q468
13412C481R7216J5422k9979j07898L7443M4065j745J2757L6251n54j1782J483
13400I6160J8819m4860q5728l7445K6214R8746L6036j03967L2602m3193k5389
13389c2005O6161o6801n4231j8810J5582r045l4676L6471K7340K027n3836m8243
13377a70066j07012J57963K0218j892M1700o6182l9832M5619M0044K0731n7371
13366a16080K5713R1335K9130n6650p7422O6224K0374k7283o8980N7347L9330
13355a6962m777O0077O8195K1777l0233q095n8738r254r4868m3318J119Q209J6825
13342i0043L836m8422m1191o9731J15869O7125l4936N5444L1812J00315Q6319
$$ plain form
13424 90137 122630 75607 5532 -4226 62024 42178 85485 27598 76722 65718 -4987 3481
13412 3481 100697 116119 86140 -21758 15685 59750 58005 70762 107013 106459 94677 96160
13400 96160 114979 70119 -15609 -53054 -26840 71906 107942 3975 36577 -6616 -32005
13389 -32005 34156 -32645 -86876 -105686 -90104 -99149 -133825 -97354 -70014 -67987 -121823 -170066
13377 -170066 -277078 -119115 -98897 -100789 -59089 -125271 -165103 -119484 -79440 -58709 -116080
13366 -116080 -90367 968 30098 -26552 -103974 -37750 -17376 -44659 -113639 -56292 -16962
13355 -16962 -21739 38338 106533 128310 98077 89982 31244 21990 -72878 -116196 -115077 -106868 -90043
13342 -90043 -86207 -134629 -175820 -245551 -129682 -62557 -97493 -42049 -10237 90078 176397
13331A76397o2765o0763m1676M6229O788o9879j15674K2094J3058K7687l0250
13320h8754j1640J5706K4118M2598K0944j4463o1183N3542M8158p3845l8438L9089
13308d4168L0307l5133r214k9023p3930K8638o010J8024M3186O6583j888o8136
13296h0764P6535J09999j6659j19053r45j6136Q1650P8565J9736m8471j02118
13285a7661J2640M719m6248r746K73k4878J5688P1951l2013N2110O7181M6888
13273A40904J8585j7363k6753m098p4855o5091J5891j0366j17188L8191R7645
13262d498N0565q3226o1204J1903J15554N3696O7423P2774j4297l9805Q2510P961
13250B59356q1079Q0477P7638K9580J46892L57637L47950K43140J15501L9711
$$ plain form
13331 176397 113632 52869 11193 57422 64210 -5669 -121343 -99249 -86191 -58504 -88754
13320 -88754 -100394 -84688 -60570 -17972 2972 -11491 -72674 -19132 29026 -44819 -83257 -44168
13308 -44168 -13861 -48994 -58208 -87231 -161161 -132523 -138533 -120509 -77323 -10740 -12628 -80764
13296 -80764 -4229 105770 89111 -29942 -30887 -47023 34627 113192 132928 84457 -17661
13285 -17661 -5021 -302 -46550 -56296 -56023 -80901 -65213 6738 -25275 26835 94016 140904
13273 140904 159489 142126 115373 111275 36420 -28671 -12780 -23146 -140334 -102143 -4498
13262 -4498 46067 -37159 -98363 -86460 29094 82790 150213 222987 208690 168885 251395 259356
13250 259356 178277 258754 336392 365972 512864 870501 1218451 1461591 1577092 1616803
13240A616803j72187k51470k54236k31941j76051j50205n7375k5453K1704k7931
13230B91658R084L6432k5310p6227j2925J7859k7643r698l6789m5065l4564L544
13218I0356k079j67410k5694M9889L5473R5706n0441l8703M3511L8085K517M7111
13206A18321j4433M5640M083j7818p2816k7096O1563O4087l3828n3956N9332K6468
13194A59547o0216L393n5724o3813J04496K4115M01M4265J132K145J7396q2068
13182I5069p5016n33L7444J4040J0959q069q7033j8955K5864k6318O441J9007
13170g100n5738j31708o825J85574J11626J1307J4397p4942o5604P2730K726o563
13158D9880P08q0671p0446M2279P2896r019K7254j184l1534J923M9239m5128l2483
$$ plain form
13240 1616803 1444616 1193146 938910 706969 530918 380713 323338 297885 319589 291658
13230 291658 300742 337174 311864 235637 222712 240571 212928 203230 166441 121376 86812 90356
13218 90356 88277 -79133 -104827 -54938 -19465 76241 25800 -12903 30608 68693 71210 118321
13206 118321 103888 149528 153611 135793 62977 35881 97444 161531 127703 73747 133079 159547
13194 159547 99331 102724 47000 -16813 87683 111798 112199 156464 157596 159741 177137 95069
13182 95069 20053 19520 56964 71004 81963 73894 -13139 -32094 -6230 -32548 -26107 -7100
13170 -7100 -62838 -194546 -201371 -15797 95829 107136 121533 46591 -19013 53717 56443 49880
13158 49880 50588 -30083 -100529 -58250 14646 5627 32881 31697 163 2086 51325 6197 -26286
13145b6286O7710L9993o2858k3691L5379N1655l891m7448j5683m3594K808P5665
13133D9759K2176J12893r128K821l0912k6561P071n9475k0935L6553K5812k6615
13121H3459J16065J3363n8170L23K1144M2473L2987K0618q1888l6325l0539L1419
13109A54929Q2792R3134Q2817J32062L1331O5345K80634L27326N01025P43008
13099B494403J136177J112688J105713P65190k6039j148481j592594j167136n98172
13090B081749m04030l06386j04657p270l4833j99045k02056j33487j3347l928
13080F72710K9878j09629r5993r7646K0803L953J3572r8426j5194m7177j0901
13069B65950j8085R9316L4241m3543j3440L570k7287q5725o2724K6263R4886J62803
$$ plain form
13145 -26286 41424 81417 18559 -5132 30247 81902 78011 30563 14880 -28714 -25906 49759
13133 49759 71935 184828 175700 178521 147609 121048 128119 68644 47709 84262 110074 83459
13121 83459 199524 212887 154717 155040 176184 218657 251644 272262 190374 154049 123510 154929
13109 154929 237721 330855 413672 545734 577065 642410 923044 1250370 1751395 2494403
13099 2494403 3630580 4743268 5848981 6614171 6588132 5439651 3847057 2679921 2081749
13090 2081749 1677719 1371333 1266676 1259406 1224573 1025528 823472 689985 676638 672710
13080 672710 702588 592959 496966 399320 420123 424076 437648 339222 324028 276851 265950
13069 265950 247865 347181 381422 337879 324439 328009 300722 214997 152273 178536 273422 436225
13057D36225Q0140K9096l8922q8446n8807M97l4809o1339m1052k4152P540p756
13045A98215n8190o2170P3026N5214R944r679K971J0009n155J97j6121M0760k932
13032B36089k5684m1222K2196n9766l4984m5115N4354l5973m2694l7232L4959
13021B4928Q8531M9005N6731p2235p1942j8693n831L0839j0129k3134Q746n2103
13009D713O3929L2759N9105J4764l4320L1115Q1663j3384J837p676j30096n6493
12997D7916N2361K6657k2989m2864o4182j1099O8061R0746l1093p3160L9131K9685
12985A09170R6175k6076l6788J4373l2130l9796m9660k2576Q2389k0227o5120
12974I734L7069J37674n97l2955p0368n1632q833k4380M1518n622l6013J18301
$$ plain form
13057 436225 516365 545461 506539 418093 359286 359783 324974 263635 222583 198431 205971 198215
13045 198215 140025 77855 150881 206095 216039 206360 209331 219340 214185 214382 198261 239021 236089
13032 236089 210405 169183 191379 131613 96629 51514 105868 69895 27201 -10031 24928
13021 24928 113459 162464 219195 146960 75018 56325 50494 81333 71204 48070 56816 4713
13009 4713 68642 101401 160506 175270 140950 172065 253728 240344 242181 234505 104409 47916
12997 47916 100277 126934 103945 61081 -3101 -14200 53861 144607 113514 40354 79485 109170
12985 109170 205345 179269 142481 156854 124724 84928 35268 12692 95081 74854 9734
12974 9734 46803 184477 183880 150925 80557 28925 20092 -4288 37230 31608 -4405 113896
12962A13896O1723m8001J7563j8043k6833j9391O9945M9757j4271N3311N9006
12951B98662o7124j34087n66n7021O173M5512j4183J64468J4375o9524k4451M6476
12939B08710P6260L9789K8528o2066l4497J4289L517k7550p7435o5225J4493p3161
12927D5652j38331L7036K229O4576J28710l4024j06447q3138k4063J0429K6066
12916g1305M50L0244M4909j4551j2549j1775P2880Q1160l5516o8151L0736K2511
12904F9043J119K680k0223J6832K9898N9173N8884n8965m5628N489K0008M1390
12892A79700J13709O4422N345m5332l0694r0735l3209J19344M8844o7662m418
12881B59314n3729l2430Q6879O5823L048j02289J4253l8919l6832K5496j7871
$$ plain form
12962 113896 175619 127618 145181 127138 100305 80914 150859 200616 186345 239656 298662
12951 298662 231538 97451 96885 39864 46037 91549 77366 241834 256209 186685 162234 208710
12939 208710 284970 324759 353287 291221 256724 271013 274530 246980 169545 104320 118813 45652
12927 45652 -92679 -55643 -53414 11162 139872 105848 -599 -83737 -107800 -97371 -71305
12916 -71305 -70855 -40611 4298 -10253 -22802 -34577 38303 119463 83947 15796 46532 69043
12904 69043 70162 72842 52619 69451 99349 158522 217406 158441 112813 118302 138310 179700
12892 179700 293409 357831 363176 317844 287150 196415 163206 282550 331394 263732 259314
12881 259314 205585 173155 260034 325857 328905 226616 240869 201950 165118 190614 172743
12870A72743J3996J10240P0285j1261o3523K5962P0507Q869O7570L7359l3917
12859D68830q9310n2402M2660L3263K09777J39268j02425j26144k520J05386J22963
12848G49346L8469j5483o4127P5630N5326N78N1792O7818N4563J54960Q7704R8293
12836A354869K10575P4615K5919Q8076K77688J50822K27390L26623K76553L23060
12826C336190M32790M13733M92988N32912N63877P77999R46436J205431J457570
12817A0159926J954321K360032K951495L680336M609288O212615R304298J5212425
12809E6444736K5679851M0592750N3656848N8079811N2869897L1878412q884743
12802C10317562n0497365o9090966n6399757l3587703j8961422j2110723q612005
$$ plain form
12870 172743 186739 296979 367264 356003 292480 318442 388949 397818 465388 502747 468830
12859 468830 379520 327118 369778 403041 612818 752086 649661 523517 520997 626383 749346
12848 749346 787815 772332 708205 783835 839161 839739 891531 959349 1013912 1168872 1256576 1354869
12836 1354869 1565444 1640059 1665978 1754054 2031742 2182564 2409954 2736577 3013130 3336190
12826 3336190 3768980 4182713 4675701 5208613 5772490 6550489 7496925 8702356 10159926
12817 10159926 12114247 14474279 17425774 21106110 25715398 31928013 41232311 56444736
12809 56444736 82124587 122717337 176374185 234453996 287323893 319202305 310317562
12802 310317562 259820197 190729231 134329474 100741771 81780349 69669626 61057621
12795F1057621o463777n169447m548408m146915l747041l288545k718909k215935
12787B8758644j883821j686920j472531j276783j166046r93801r73765q05175
12779A8499802q09399o88287o83481n65251m87423n16027n67644n79634m39943
12770A3162713l42047k68856k79635k71946l07612l04739m30815m06562k57880
12761A0292621k87275k32411k76291l31192j46179j29757j02625p1064j5761j13961
12751H586105k35293k69179l84199m56799l58007l24193k39424j59110j52479
12742F007422j73404j98687k46913j60349m9250k06846q8683p3265j38702j58446
12732D512877k03768j44420j50260r4552p8868j13257j19741n4846j22936r1600
$$ plain form
12795 61057621 54593844 49424397 44875989 40729074 36982033 33693488 30974579 28758644
12787 28758644 26874823 25187903 23715372 22438589 21272543 20278742 19304977 18499802
12779 18499802 17690403 17002116 16318635 15753384 15265961 14749934 14182290 13602656 13162713
12770 13162713 12820666 12551810 12272175 12000229 11692617 11387878 10957063 10550501 10292621
12761 10292621 10005346 9772935 9496644 9165452 9019273 8889516 8786891 8715827 8700066 8586105
12751 8586105 8350812 8081633 7697434 7240635 6882628 6558435 6319011 6159901 6007422
12742 6007422 5834018 5635331 5388418 5228069 5178819 4971973 4883290 4810025 4671323 4512877
12732 4512877 4309109 4164689 4014429 3919877 3841009 3727752 3608011 3553165 3430229 3338629
12722C338629j99862l5166r1598p7965m1113j9768j34984p4876o387q8561p2422
12711B495927l6807r6529o4243Q3444j4166l7125l2151j2191M1162o9801j55792
12700B101728j54698l0488R477Q2421l590l6528p1949o2492O1659k4629N3881
12689A924792Q5886J62530K03145J65782P7639p1239j78277j21967j27369j84602
12679A936320j51974j48387j56543r6834r627j2938P960r3032r6819K5607p7808
12668A125925p7814L4963n9693p2193O086m0565l1068p3317o7319J9339m3015
12657G21329k3569p6612p3034k7628l0177r6053m8467L3843M3372M6650J17427
12646E87081L9019q0729l1161N027L9018j07085J1350l0506k1470J7887o9126
$$ plain form
12722 3338629 3138767 3103601 3012003 2934038 2892925 2873157 2738173 2663297 2656910 2568349 2495927
12711 2495927 2459120 2362591 2298348 2381792 2367626 2330501 2298350 2286159 2327321 2257520 2101728
12700 2101728 1947030 1916542 1926019 2008440 2004850 1968322 1896373 1833881 1895540 1870911 1924792
12689 1924792 2010678 2173208 2376353 2542135 2619774 2548535 2370258 2248291 2120922 1936320
12679 1936320 1784346 1635959 1479416 1382582 1372955 1360017 1367977 1274945 1178126 1203733 1125925
12668 1125925 1048111 1083074 1023381 951188 957274 916709 885641 812324 745005 764344 721329
12657 721329 697760 621148 548114 520486 490309 394256 345789 379632 423004 469654 587081
12646 587081 626100 545371 514210 519237 558255 451170 462520 432014 410544 428431 359305
12635C59305Qp4610n6302O7604M4691O9151P4176n9455r8843l9328k6702q300
12623B51395K5289R859P4795J9596j8415j1610m4589J8179O3067r870M881k5722
12611C56855N3566k3452k6665p0087m2252J50902R7572J2680l5511j04151q7070
12600B82387p2594J6484N0754r5403L2203N5955l0145r6586K0615n0694L9761
12589A52737O840r0797j0640J22162J9597j24023j614P5592O9918o541r1233k0488
12577A01510M8718J05642Q3454P870m4735m218K067J9464m1652l5785K1121Q1823
12565C45279K1064m1661j7450J06004O5078o8920k1386n5940l0576J9637m8917
12554B72212n7552o003k1835k1826q031M1598m291Q872k8380k3418J3193j7152
$$ plain form
12635 359305 359313 284703 228401 296005 340696 409847 484023 424568 325725 286397 259695 251395
12623 251395 276684 286543 361338 380934 362519 350909 306320 324499 387566 377696 382577 356855
12611 356855 410421 386969 360304 290217 247965 398867 496439 509119 473608 369457 282387
12600 282387 209793 226277 277031 181628 213831 269786 239641 143055 163670 112976 152737
12589 152737 159577 68780 58140 180302 199899 75876 74262 149854 219772 213231 121998 101510
12577 101510 150228 255870 339324 347194 302459 298241 300308 319772 278120 242335 263456 345279
12565 345279 366343 324682 307232 413236 478314 409394 388008 332068 301492 321129 272212
12554 272212 214660 208657 186822 164996 156965 198563 194272 203144 174764 151346 164539 147387
12542A47387Q5759J04929j0590o2105k5675l5337J6349O5281m0873n1834m8263
12531A45028n8700J5483J9945K5898J9008k3989j8276o6862j6788k4478J13314
12520A29583J06625J7446K2357n1153L8041k6164j9177P1687n6558o0620n7189
12509A14878o3550M457M152J0575O3337p4963O751L8410j25973k1197J57852K7036
12497A41765n8857l1713k7853m0905K0683J29658m361m97J5350j4319l3930m5092
12485D9929l1951j4671m4559Q760K7933M0628P8550n9075j8212R2801R2095M1156
12473B63384o5208k2686N207j171m1722j10745L1389N692K7353L6813k5234L2997
12461A36069K365j4500K3114k1530q8154J2559J9822j0248r356L9681l5728p6452
$$ plain form
12542 147387 233146 338075 327485 265380 239705 204368 220717 285998 245125 193291 145028
12531 145028 86328 101811 121756 147654 166662 142673 124397 57535 40747 16269 129583
12520 129583 236208 253654 276011 224858 262899 236735 217558 289245 232687 172067 114878
12509 114878 51328 55785 59937 70512 133849 58886 65637 104047 -21926 -43123 114729 141765
12497 141765 82908 51195 23342 -17563 3120 132778 128417 127920 143270 128951 95021 49929
12485 49929 17978 3307 -41252 -32492 -4559 36069 114619 55544 37332 130133 222228 263384
12473 263384 198176 175490 180697 179526 137804 27059 58448 64140 91493 128306 103072 136069
12461 136069 138434 123934 147048 125518 37364 49923 69745 59497 50141 89822 54094 -22358
12449b2358R363Q2344K9173L5526q0535J1940k8270K3387j2498j0563j7226k1506
12437a223r6924o5288J9410n341j9820L5254K1145O9931K7971l1041m4100o4236
12425a54262L3815Q959J06637Q5814L3194k5652N8901L179n8470j07904q9874
12414a05663l4035Q3022R5073j3603N143Q3258m6747P513k7828J6183l975m785
12402E3556J7757o2620l3459N2889O4259k6701j3402K8831M0285O753r6061k8002
12390D085n001q683L0045N2816R4727n0843q4348k7477j6973K9896L896J03860
12378A26000J22106r2484j04559j1249j0371l0723N0499K3154J742K8786J23340
12367B26241Q4634Q3423P374J77577K39731L43502L40547R9737r6486k75174k67554
$$ plain form
12449 -22358 -12995 69349 98522 134048 53513 65453 37183 60570 48072 37509 20283 -1223
12437 -1223 -98147 -163435 -144025 -149366 -169186 -133932 -112787 -42856 -14885 -45926 -90026 -154262
12425 -154262 -120447 -111488 -4851 80963 114157 88505 147406 150585 92115 -15789 -105663
12414 -105663 -139698 -56676 38397 24794 29937 113195 66448 73961 46133 62316 58341 53556
12402 53556 71313 8693 -24766 28123 92382 65681 52279 81110 121395 128148 32087 4085
12390 4085 -916 -9599 20446 73262 167989 117146 32798 5321 -11652 18244 22140 126000
12378 126000 248106 155622 51063 39814 29443 -1280 49219 72373 74115 102901 226241
12367 226241 310875 394298 401672 579249 818980 1162482 1503029 1602766 1506280 1231106 963552
12356I63552j75825j71325r2058r4299r3454n8459l6829J694K5059l3071o311
12345B28674m8843l1790j5977R669Q1890p965k7893L7962p5909r570O2205n2422
12333A50031j15786q4210j0422K9747O4654J15577J1752m8163n7826k0281N8012
12322I3085J4794n6664q780P224N8043M7784l1850r93L3335l0848k5913m5778
12310E3439N3224r321O2250q6532M0213L1092n4979l4216j0670j3001m8064o4489
12298h1054J02924J01768L4322m167l7137m9134k2340J0520o0360r951j6284J2481
12286a8412P7021O6061Q8392L2987l8937p635r4597m4069k7855n0836m057J6199
12274e738J6040K0105q2330l0599k792m1770J1998M8698m5811p0065J8000J49069
$$ plain form
12356 963552 787727 616402 524344 430045 336591 278132 241303 242997 268056 234985 228674
12345 228674 179831 148041 132064 141733 223623 215658 187765 225727 149818 140248 202453 150031
12333 150031 34245 -49965 -60387 -30640 34014 149591 161343 113180 55354 35073 93085
12322 93085 107879 51215 42435 49659 107702 155486 123636 122643 155978 125130 99217 53439
12310 53439 106663 97342 159592 73060 113273 144365 89386 55170 44500 31499 -16565 -81054
12298 -81054 21870 123638 157960 153793 116656 67522 45182 55702 -4658 -14609 -30893 -18412
12286 -18412 58609 124670 213062 246049 207112 199477 104880 60811 32956 -17880 -21937 -5738
12274 -5738 10302 30407 -51923 -82522 -85314 -127084 -115086 -66388 -112199 -182264 -164264 -15195
12262a5195P8614k5800O309n7147N059J6315k1656l188O0294j6974Q231l6896
12250b034O0606Q3627j9654J0240r1770n0331r2782n64Q4363Q3129K8718k8196
12238F5352p2627r3868K4726N1188q4572m5061J03973L5224M5713M9150j9541
12227E9657l5621J2094K9029p300n0162J2306J3845N6550K7063M186m4957l7143
12215C9547j8957k913p2995O201J4264l6960n8369q52J4456p236R1619J6664L755
12202a1776L1319Q9120l4500l5451O0093K4795p1680r80J9558J428l6895k6337
12190H694l3650N064m6406K4973J6902N3417l3646k8854j1933J12848O399J8309
12178I2117J0990Q078m4620q6926M3726k2800k2741r194k4329l3344K7237J4348
$$ plain form
12262 -15195 63419 37619 43928 -13219 -8160 8155 -13501 -16689 43605 26631 34862 -2034
12250 -2034 58572 142199 122545 132785 41015 -9316 -102098 -102662 -18299 64830 93548 65352
12238 65352 -7275 -101143 -76417 -25229 -109801 -154862 -50889 -15665 30048 79198 59657
12227 59657 24036 36130 65159 57859 7697 20003 33848 90398 117461 121647 76690 39547
12215 39547 20590 17677 -55318 -49117 -34853 -71813 -130182 -131034 -116578 -123814 -32195 -15531 -11776
12202 -11776 19543 108663 74163 38712 98805 123600 51920 50940 70498 71926 35031 8694
12190 8694 -24956 -19892 -66298 -41325 -24423 28994 -4652 -33506 -45439 67409 73808 92117
12178 92117 103107 111185 66565 -20361 23365 565 -22176 -31370 -55699 -89043 -61806 -47458
12166d7458J11482Q5858n0852m8901m8515P780N902l935j2837j19247j9769J07086
12154c3406J11151J0040M6415n9013j6022P763k7515J1535J2652J7182L0112j11220
12142c26o0894J01474r519n5871m130o0063J06997P9512r17q9610o3988l5815
12130i3150O2604M1894Q1737q353o3392J3002q376n0597J263K6940j2834K1702
12118A2440Q053K6666k4698O3505l9015m1560N1401M2209j09697m18o115j6249
12106c3478k277L8840J35377k4560o678J3346m7991j4083L291J9821q0553p886
12094f831O6825j7427m1747o527n2911n2631O0513N025L3584k2383M5059M0008
12082E0557K0271P873M2662J8700k6418j1196O3053J700j31419j179M8799M1543
$$ plain form
12166 -47458 64024 149882 99030 50129 1614 9394 15296 11361 -1476 -120723 -140492 -33406
12154 -33406 77745 87785 134200 75187 59165 66928 39413 50948 63600 80782 110894 -326
12142 -326 -61220 40254 30735 -25136 -29266 -89329 17668 97180 96263 6653 -57335 -93150
12130 -93150 -30546 11348 93085 84732 21340 34342 25966 -24631 -23368 3572 -9262 12440
12118 12440 20493 47159 22461 85966 46951 5391 56792 99001 -10696 -11114 -17229 -33478
12106 -33478 -35755 3085 138462 113902 107224 120570 72579 58496 61787 81608 1055 -6831
12094 -6831 59994 42567 820 -5707 -58618 -111249 -50736 -45711 -12127 -34510 10549 50557
12082 50557 70828 78701 121363 140063 113645 102449 165502 167202 35783 34604 83403 124946
12070A24946q5062o3183K7033p0932o681J3863P4849K8485K3177O4959L3467m7253
12058A17668q8186n5556k1582N6782M512N090k1623J6231N4765k078m3663r1869
12046f9509Q71J6334n0580J62034J02533n2350m7135l5740n4221j0409l6556q748
12034h3476J11406J8869n731O719O0041P350j00363m1850J3350j2997n6819k4217
12022a07718L6996J46939M2150m6815n2248R413L8855P374O4742j4819q0022J2813
12010E7660K6033k9131q5497m4908P8371j5773N987k6467r796j516l3202k2766
11998a01005J12301K1098L558M6962K4097M8495k2956m7233J1992p687n4178L1112
11986F6556K8180l4045M8404L658r1614l5696J5363O026j11398r5797N8859Q3883
$$ plain form
12070 124946 39884 -23299 3734 -67198 -73879 -60016 14833 43318 66495 131454 164921 117668
12058 117668 29482 -26074 -47656 9126 13638 18728 -2895 13336 68101 66023 22360 -69509
12046 -69509 -68638 -52304 -102884 59150 161683 109333 62198 26458 -27763 -38172 -74728 -83476
12034 -83476 27930 46799 41068 47787 107828 115178 14815 -27035 -13685 -26682 -83501 -107718
12022 -107718 -70722 76217 118367 71552 19304 28717 67572 74946 139688 124869 44847 57660
12010 57660 83693 54562 -30935 -75843 2528 -13245 -7258 -33725 -43521 -45037 -78239 -101005
11998 -101005 11296 32394 35952 82914 107011 155506 132550 85317 97309 89622 35444 66556
11986 66556 94736 60691 109095 112753 21139 -14557 806 6832 -104566 -200363 -141504 -57621
11974e7621J4529J4966j5064j16478k1604L5492M7188R2587J9417l577p1929j0228
11962g2322L1916L4493J4343m6520K2601O3631J9869K8212K0766q2423l0077k001
11950B488K3568J8238K2802p1107K0508N8879P0421j3203r6342m9774J07722Q537
11938A02737l570k4412J011k1894J9174l3358n9457R870j8456K0029N8502K254
11926E2430J100j8249O4208m9513l4972p889n602j7206K8338M8316O503J7459
11914H4923L6911j53675k7994M3258M7519O2533M480k3730m0563o5675o7177P408
11902i1782J08557J0675n6950q2126m2950Q3072Q5384M1968j1625n5726m4344
11891e5847q733M2075N7858q0235m7238M6002J17189O3432k3107m2388n9778N3343
$$ plain form
11974 -57621 -43092 -28126 -43190 -159668 -181272 -145780 -98592 -6005 13412 9835 -62094 -72322
11962 -72322 -40406 -5913 8430 -38090 -15489 48142 68011 96223 116989 34566 4489 2488
11950 2488 26056 44294 67096 -4011 16497 75376 145797 132594 36252 -13522 94200 102737
11938 102737 99167 74755 75766 53872 73046 39688 -19769 -9899 -28355 -8326 50176 52430
11926 52430 53530 35281 99489 49976 15004 7115 1513 -15693 12645 60961 67464 84923
11914 84923 121834 -31841 -59835 -16577 30942 93475 97955 74225 33662 -32013 -99190 -91782
11902 -91782 16775 27450 -29500 -111626 -154576 -71504 13880 55848 44223 -11503 -55847
11891 -55847 -64580 -22505 35353 -44882 -92120 -46118 71071 134503 111396 69008 9230 62573
11879F2573K2327n9155O3041K8624n5766O74J11149k7236j06590K506q7330J5892
11867b9291M349n0479N0322N4697J8230J30566L5838K1307r7577j39093l7894
11856c9025K643j4082l5225N9834O7352o8597o8401J0820K4238k9904l5092M1261
11844h4178l0831Nl7556M2799P0176P0346L9864k8813m2810M9070m623l4904q8236
11831g9691q060L3900O0711k0259k0160Q2626R2958l7120p5173K7739n1005k027
11819D439R696l5285L8962J8313k8620N9124O2575j5099j9755J6921n9443k5346
11807B6482J1905M178J6186P7724k5117n7757J0508N9291n8189P1870l125o5667
11795F8289m4732l5948n255K7527k2154j2215M0312j4145m9206k6227J4277N9775
$$ plain form
11879 62573 84900 25745 88786 117410 61644 62318 173467 146231 39641 42147 -45183 -29291
11867 -29291 -24942 -75421 -25099 29598 47828 178394 214232 235539 137962 -1131 -39025
11856 -39025 -36382 -50464 -85689 -25855 41497 -27100 -95501 -84681 -60443 -90347 -125439 -84178
11844 -84178 -115009 -115004 -152560 -109761 -39585 30761 70625 41812 -998 48072 43449 8545 -79691
11831 -79691 -87751 -53851 6860 -13399 -33559 49067 142025 104905 29732 57471 6466 4439
11819 4439 14135 -21150 17812 36125 7505 66629 129204 114105 94350 111271 51828 26482
11807 26482 38387 42565 58751 136475 111358 53601 64109 123400 65211 137081 133956 68289
11795 68289 23557 -12391 -17646 9881 -12273 -24488 15824 1679 -47527 -73754 -59477 298
11783B98j1432P50m1377n5909j6096J11741L5980o884l2583L8508J9503q1056
11771c8557K1862o395n5553R2673J30902L5566k8571l1444l7132q2622r5160l3154
11759a27585K8818J8480J7200K6659l2532L9313L8600J1071l4508j8798l0273
11748f3555P2747n57l306m0220R8337l7210k2627P314l1070r8496R30l9517r8597
11735b55827K9917Q4453l324n5201L9661O4320J2474o1337N9503M3769N1942o9010
11723e8660N038J02923l5347l7226l8942K2214L1524k8042J9656O9136O5601J4016
11711A31891p4623r716L7693m4065k8350J5548j4207Q897k542J7103k5135n7849
11699d5355J23082R1660l9340O2822k096n0070k3973k6798o3210N6994k451j2215
$$ plain form
11783 298 -11134 -10384 -51761 -107670 -123766 -12025 23955 17071 -15512 22996 42499 -38557
11771 -38557 -16695 -23090 -78643 14030 144932 180498 151927 120483 83351 729 -94431 -127585
11759 -127585 -98767 -80287 -63087 -36428 -68960 -29647 8953 20024 -14484 -33282 -63555
11748 -63555 9192 8635 5329 -34891 63446 26236 3609 10923 -20147 -118643 -117713 -157230 -255827
11735 -255827 -225910 -141457 -144781 -199982 -160321 -96001 -83527 -144864 -85361 -41592 10350 -58660
11723 -58660 -53622 49301 13954 -23272 -62214 -40000 -8476 -36518 -16862 52274 117875 131891
11711 131891 57268 47552 85245 41180 12830 28378 14171 23068 20526 37629 12494 -45355
11699 -45355 77727 169387 130047 192869 190773 140703 116730 89932 26722 83716 81265 69050
11687F9050k7273k7021P4184k1676J791m4306O2404j4898J2809J26601m41m8811
11675A62413J4192l7315r2487P5764O6673L5261M7883m9977n2184L9910n6691
11664A53442l0678K9061m7829q7374M4918k1463q721m2504O5047Q4850q6846o9970
11652a8067K2195Q7785J21628M2620J5940o763q195O685m6487o9221q3648m4787
11640A9685K5085M161k9744k2888O8046R4510j6963r6101L1288M4556q6020k093
11628C3522j9483P8110j0595l6079j426k5732N4228n9521j731N2272m1058l5329
11616a2822M2273j035m4513o4906n088k007j8050P3504J17573J2736j5622N7072
11604A39115J23656N8270m8276j48997j11375P7919N1665J7430k6676N0211L2221
$$ plain form
11687 69050 41777 14756 88940 67264 69055 24749 87153 72255 85064 211665 211224 162413
11675 162413 176605 139290 46803 122567 189240 224501 272384 222407 170223 210133 153442
11664 153442 122764 151825 103996 16622 61540 40077 31356 -11148 53899 138749 51903 -18067
11652 -18067 4128 91913 213541 256161 272101 265338 257143 263828 217341 148120 64472 19685
11640 19685 44770 48931 19187 -3701 64345 158855 141892 45791 77079 121635 35615 33522
11628 33522 14039 92149 81554 45475 44049 18317 72545 13024 11293 63565 22507 -12822
11616 -12822 29451 28416 -16097 -81003 -86091 -88098 -106148 -32644 84929 97665 82043 139115
11604 139115 262771 321041 272765 123768 12393 90312 141977 159407 132731 182942 215163
11593B15163l7472j31535m5551l6632q4484M0766m0245M6324K6520K4271M1679
11582A8804M5252m4123N6061q3431M1639R4640K016j68663n9248K1193J6517k5036
11570h4379p6000N7760J40224J975k1285L3752R9296m7477n8786J2240M0611J1122
11558A09053l6020q888M582K2804q495L97l4397p0696r2546L4256M4876R513O4253
11545C8692Q287J0733k8595p2541n3108P5477l3697n2376R1478M8824Q123K1615
11533F2912k5970k1817L0314k8348k6924j2433P190k8366O567l6771K6538L6343
11521a0765P435M0797K4026k3740j7705m3624J549J1936n8935Q581M8153p5562
11509h7854p8597L4901M8415M7920m4859M6940M8463r5023n1375o7394J29365
$$ plain form
11593 215163 177691 46156 605 -36027 -120511 -79745 -119990 -73666 -47146 -22875 18804
11582 18804 64056 19933 75994 -7437 34202 128842 130858 -37805 -97053 -75860 -59343 -84379
11570 -84379 -160379 -102619 37605 39580 18295 52047 151343 103866 45080 57320 97931 109053
11558 109053 73033 64145 68727 91531 83036 83433 49036 -21660 -114206 -79950 -35074 -25561 38692
11545 38692 46979 57712 29117 -43424 -96532 -21055 -54752 -107128 -15650 33174 41297 62912
11533 62912 36942 15125 45439 17091 -9833 -22266 -15076 -43442 -36875 -73646 -47108 -10765
11521 -10765 -3330 37467 61493 37753 20048 -23576 -22027 -10091 -69026 -60445 -12292 -87854
11509 -87854 -166451 -131550 -83135 -35215 -80074 -33134 15329 -79694 -131069 -198463 -69098
11498f9098J16185J8200n1819J0416J7386P1458L3869k3514j17248k6287Q079
11487a2373m5062n6994j30J7613L2676J02090m1573o1524r7404M059P7816J29034
11475D8228j8786n2322K9206L4622R4070m7268o6942n1931J2110o91l1849N9948
11463H395P9855m0331k2671K617M4660k5740P381l8205Q539j5539K455J9835O8569
11450I9820J2795n6362l3297l5474M7810N6057n5307p8749l2106J8011K624O7036
11438A2858P2781J0637J7926K84l7840r5463q059K5758L4109n0208O8581K3745
11426G5109k7086n1372l9324o6682N6154R397l6353J9724J4855N6392J969j376
11414A1407K5010J25419j3053k3418q6260j15759n9314o277K08810R5380p2243
$$ plain form
11498 -69098 47087 65287 13468 23884 41270 112728 146597 123083 5835 -20452 -12373
11487 -12373 -57435 -114429 -114559 -96946 -64270 37820 -3753 -65277 -162681 -158622 -80806 48228
11475 48228 29442 -22880 6326 40948 135018 87750 20808 -31123 -19013 -19704 -51553 8395
11463 8395 88250 47919 25248 27865 72525 46785 54166 15961 24500 8961 11416 31251 99820
11450 99820 112615 56253 22956 -12518 35292 91349 36042 -42707 -74813 -56802 -54178 12858
11438 12858 85639 96276 114202 114486 76646 -18817 -26876 -1118 32991 -17217 51364 75109
11426 75109 48023 -3349 -42673 -109355 -53201 -43804 -80157 -60433 -45578 10814 12783 11407
11414 11407 36417 161836 148783 125365 39105 -76654 -135968 -142245 66565 161945 89702
11403H9702l5751L484L3426p3083k4362m8103j02491j455Q4796L0827O3702n3702
11391c3010m6368L7608J1143k7404k2084Q4814O4525k8861O380K5931o781m008
11379F1885O7301m3322m7559o0469N2356N2833r5407k5599O1392L8720n2351r179
11367F01K5703O7200o5343m714Q166Q5132J6998L840k105k891j9086p2965r4109
11354e3573j7637J04428N4290M726k9714l130k3425q6837K8616K4784k0300J456
11342a6316K4604P6613m3730r5557q059l0372M5282K7728p790q9393P1931M3153
11330a906m0252L2667M7809N1771l2414L263p1133p0852k348J01587k8491j5M8492
11317C8178j7767q475L4770O7758K6858m4365K82j3634j5541J16332k8308k6399
$$ plain form
11403 89702 53951 57435 90861 17778 -6584 -54687 -157178 -158633 -73837 -43010 20692 -33010
11391 -33010 -79378 -41770 -30627 -58031 -80115 4699 69224 40363 46743 72674 65893 61885
11379 61885 129186 85864 38305 -22164 30192 83025 -12382 -37981 23411 62131 9780 601
11367 601 26304 93504 28161 23447 31613 116745 133743 137583 135478 132587 113501 40536 -53573
11354 -53573 -71210 33218 87508 92234 62520 59390 35965 -50872 -22256 2528 -17772 -16316
11342 -16316 8288 84901 41171 -54386 -62445 -92817 -47535 -19807 -27597 -116990 -45059 -1906
11330 -1906 -42158 -9491 38318 90089 57675 60938 -10195 -81047 -83395 18192 -10299 -10314 38178
11317 38178 20411 11936 46706 114464 141322 96957 97239 83605 68064 184396 156088 129689
11305A29689j73220j35609m177O6432r196m3655o882R6861J13679Q4727r7765
11294B0884L4199P058J3957K5444J726Q6856m0915j49266m3521Q8285O4057m8033
11282F0731k5959J375m3519K5687K7217l7316O121P4526O9274j9422L6450n4765
11270A20400l0228J3494n132q7018o8307j8648M6114Q6081L6264o5650L9986l2796
11258C4560q4102j4933K83m0918j8914J60903M6479q838m309k496p6582k8323
11246c7190J9074M271o5q099k1080l0212m6729J5753P1357N3021l3017L7837L4701
11233E9622j06505l960O3379n3263m8323r92J9928L9182K8345M4020k430o1586
11221b2583l6707l6363J00350J12304K2175M5918j6522l8014j3493J5188p6437
$$ plain form
11305 129689 -43531 -179140 -183317 -116885 -126081 -169736 -176618 -79757 33922 118649 20884
11294 20884 55083 62141 76098 101542 103268 190124 149209 -57 -43578 44707 108764 60731
11282 60731 34772 36147 -7372 18315 45532 8216 14337 88863 158137 138715 175165 120400
11270 120400 90172 103666 98534 11516 -56791 -75439 -29325 56756 93020 27370 67356 34560
11258 34560 -49542 -64475 -64192 -105110 -124024 36879 83358 74520 70211 67715 -8867 -37190
11246 -37190 -18116 -13845 -13910 -22009 -43089 -73301 -120030 -104277 -32920 20101 -12916 24921 59622
11233 59622 -46883 -50843 12536 -40727 -89050 -90042 -70114 -30932 -2587 41433 39003 -22583
11221 -22583 -59290 -95653 4697 117001 139176 185094 168572 130558 117065 132253 55816
11210E5816n3404n6239m2187q4439n1063P4139N973L3282J6713K5512m0206M2312
11198g3791j4240P5061R6713M5022K7965r6508p265p4784q36M9509K8928K5270
11186H1044K4101j15023q2686O0160m104K6122J26035p01j9423k7518r9398k6262
11174e7653R8407l259n1856q7648K3743N7639M3584m437n8312m4573O434J2030
11162f5901j9599m08J8386k1021j48333k0187N9784L405j16045l2995K27849P6744
11150c8321n0243o054O4773L7691Q7973l9710J437P8874P6049R1592l6100j93957
11138G4004l3955K9395P690l2617M1133J770r2567p1390M6924Q9188N5963r54
11126A14584L4959m3473p9239k5753j636P6202M4120j2747N8232J3546j26318
$$ plain form
11210 55816 2412 -53827 -96014 -180453 -231516 -157377 -151404 -118122 -101409 -75897 -116103 -73791
11198 -73791 -88031 -12970 83743 128765 156730 60222 52957 -21827 -22663 26846 55774 81044
11186 81044 105145 -9878 -92564 -32404 -36508 -10386 115649 114948 95525 68007 -31391 -57653
11174 -57653 40754 37495 -14361 -102009 -78266 -20627 22957 18520 -39792 -84365 -77931 -65901
11162 -65901 -85500 -85908 -67522 -88543 -236876 -257063 -197279 -193874 -309919 -342914 -115065 -38321
11150 -38321 -88564 -94618 -29845 7846 95819 56109 57546 136420 212469 304061 267961 74004
11138 74004 40049 69444 77134 44517 85650 87420 -5147 -76537 -29613 59575 115538 114584
11126 114584 149543 106070 26831 1078 -558 75644 119764 107017 165249 178795 52477
11115E2477k7024m1148M3000j05200O5790j13Q6560M3613o2654k5063k1459o4607
11103e5828m5529N7062K730R8500K3371n1088k0090o2723k1292l0522m4359P2908
11091g6860K8871O2516q7j5340O8663M9794m5801L331J9331r369N0421k142J7150
11078A50478n2577L6439Q1469q6183j67645l7722l2530q1536k308N5950N0982
11067h5183P348j1647p910n3388N0969L4733P6949m9345q1028j1243M0276O2749
11055b6720N6327n6195J6589J07717l6721l8113r4984l9919p378J3668R3759M6863
11043C4893m08K0066k0081K929k0424l6094L4825O2199K9448q1706j0744J18930
11031A33833K2983R775m8336K8287o4026o1542J7020J1208M4149O6168J4635O6463
$$ plain form
11115 52477 25453 -15695 27305 -77895 -12105 -12218 74342 117955 55301 30238 8779 -55828
11103 -55828 -101357 -44295 -41565 56935 80306 29218 9128 -53595 -74887 -105409 -149768 -76860
11091 -76860 -47989 14527 14440 -900 67763 117557 71756 75087 94418 85049 135470 133328 150478
11078 150478 97901 134340 215809 129626 -38019 -75741 -108271 -189807 -192115 -136165 -85183
11067 -85183 -77835 -89482 -97392 -150780 -99811 -65078 11871 -37474 -118502 -129745 -89469 -26720
11055 -26720 29607 -26588 -9999 97718 60997 22884 -72100 -112019 -119397 -105729 -11970 34893
11043 34893 34485 54551 34470 37399 16975 -19119 15706 77905 107353 25647 14903 133833
11031 133833 156816 166591 118255 146542 82516 20974 37994 49202 93351 159519 174154 240617
11019B40617L4861n0202M2494J31847K2708P7661R9256O5109K36064N55539Q47361
11008B303315J006970Q76499Q46890L58126r59871j464441r66573n03967k62005
10999A234943j95086j11851o3997j68954j66710j08292j4960M674P6676J1255
10989D97698j0106k4066J7708m3566p6632q0572l5512Q149m4139L2862K0971j10040
10977A52755j9250M2113l3509J8289l7506l1462J3301O7401J05885r664J15l1752
10965B36716j9979k7077M8245m454n0407m1081n7527k1002L0571m4704p9013M7576
10953A7864M8643J02063O8690k7439j2914n1245M600j5038l884N1611J2815j34473
10941F1293k9338L7896q5424j31721L566J10441R9026k4612j01181K7577N8986
$$ plain form
11019 240617 275478 225276 267770 399617 422325 499986 599242 664351 900415 1455954 2303315
11008 2303315 3310285 4186784 5033674 5391800 4431929 2967488 2000915 1496948 1234943
10999 1234943 1039857 928006 864009 695055 528345 420053 405093 409767 486443 497698
10989 497698 487592 463526 481234 437668 361036 280464 244952 253101 208962 241824 262795 152755
10977 152755 133505 175618 142109 160398 122892 91430 104731 172132 278017 268353 268468 236716
10965 236716 216737 189660 237905 233451 183044 141963 84436 63434 94005 49301 -29712 17864
10953 17864 66507 168570 237260 209821 196907 145662 150262 135224 131340 182951 195766 61293
10941 61293 31955 69851 -15573 -147294 -143728 -33287 65739 41127 -60054 -32477 26509
10930B6509k8938j5661P6112O5114O5488j6510o8987n656q824M7784J61923J07975
10918D06329M9398R04J1426M048p2823q9403l0928r2504o8925J2549N409J1978
10906A47458j00675k0063N8988k7677N3248O6249O3891o185j13782p99J08232
10895B28885j006j15842m1693l7957m7549N1899m4161k8463J52783P1306l3890
10884A54312m4779L2676L230n7555q006n7026m5949j01284m0950K5133J61295
10873B1097Q9116o8046p8527J3952N8968l7061q5430Q71j3825O7046N6662r5893
10861g1070l404J03653J08600J11602k7035p8831p5257m6399Q6622L6790q115
10850A37156m1066l7583k8182L2565K7781m7395n6214L9389J7941j2357J3295
$$ plain form
10930 26509 -2429 -18090 58022 123136 188624 172114 103127 97471 88647 136431 298354 406329
10918 406329 455727 456631 468057 472105 399282 309879 278951 186447 117522 130071 135480 147458
10906 147458 46783 26720 85708 58031 111279 177528 241419 235234 121452 120653 228885
10895 228885 227879 112037 70344 32387 -15162 36737 -7424 -35887 116896 188202 154312
10884 154312 109533 142209 145439 87884 79878 22852 -23097 -124381 -165331 -140198 21097
10873 21097 110213 42167 -36360 -22408 36560 -501 -85931 -85060 -98885 -31839 24823 -71070
10861 -71070 -74474 29179 137779 249381 222346 143515 68258 21859 108481 145271 137156
10850 137156 96090 58507 30325 62890 90671 43276 -12938 26451 44392 32035 45330
10839D5330m1835k3683j3243J1771K6288n8143o7392M5357J10601J09099j897
10828A42253J3444q6235j7892j7344m8313k7611L9853N2101q5762n358J8437J0097
10816a2330J1889J4999j4504O5561R9131J44344N7626P6232J57295J33469r389
10805G24323j6106l3018l0271O3695P3109l6256j86537k92416q2805M6155j11532
10794A18341n0006N9380p970q418m9997n298j2970o8014m2413n447j6184J5061
10782g3935M6937L6273L7595L3190N2987J2252m4323l2407O2017l1961p5298k8609
10770e282k5163j0239l6518k4938K2183P6937n5893q1607J37744L7962O8742L6661
10758A40589o3531q7247K8767n0142P2421N9653P22L6726j35231n7484N4316M8051
$$ plain form
10839 45330 3495 -20188 -33431 -21660 4628 -53515 -120907 -75550 35051 144150 142253
10828 142253 155697 69462 51570 34226 -14087 -41698 -1845 50256 -35506 -40864 -22427 -12330
10816 -12330 -441 14558 54 65615 164746 309090 366716 442948 600243 733712 724323
10805 724323 708217 675199 644928 708623 781732 745476 558939 266523 183718 229873 118341
10794 118341 68335 127715 119745 111327 61330 56032 43062 -24952 -67365 -72812 -88996 -73935
10782 -73935 -26998 9275 46870 80060 133047 145299 100976 68569 130586 98625 23327 -5282
10770 -5282 -30445 -40684 -77202 -102140 -79957 -3020 -58913 -140520 -2776 35186 103928 140589
10758 140589 77058 -10189 18578 -31564 40857 100510 101232 137958 2727 -54757 -441 47610
10746D7610L6615K7215n5137l3050N3899J7951r1853q8566q0273k5344J41530
10735d9403R0617j6343j975m2489O328K6095M5945R1057N1216l7482o5565j8782
10723G9219l3524n0851n9942p7566k1315O4335Q7144k8849n8466K5233R4838j646
10711A8610j4580L2303J9968K482k5283j02906M6792J7948K3565k3319l0624J4431
10699b0613Q0861R854m2667P4201R6309q1765j51969j7462j7214j9546J1273n2783
10687a31521m8347M4764N3338N8120J10812Q735p4533N386j1729K4404J0990j4266
10675C6153l6390k2495k363P0346k0118l0165l5317l4796K941J537l4726L0900
10663g4493L5261P8669O4081l1236j26238n0732J00289K2912m5069l6797K2653
$$ plain form
10746 47610 84225 111440 56303 23253 77152 95103 3250 -85316 -165589 -190933 -49403
10735 -49403 41214 24871 22896 -19593 -13265 12830 58775 149832 201048 163566 98001 79219
10723 79219 45695 -5156 -65098 -142664 -163979 -99644 -12500 -41349 -99815 -74582 20256 18610
10711 18610 4030 36333 56301 58783 33500 -69406 -22614 -4666 18899 -4420 -35044 -20613
10699 -20613 60248 70102 27435 101636 197945 116180 -35789 -53251 -70465 -90011 -78738 -131521
10687 -131521 -179868 -135104 -81766 -23646 87166 95901 21368 26754 15025 39429 50419 36153
10675 36153 -237 -22732 -25095 45251 25133 -5032 -40349 -75145 -72204 -70667 -105393 -74493
10663 -74493 -39232 39437 103518 72282 -53956 -104688 -4399 18513 -26556 -63353 -40700
10652d0700J3563P2342M3705o817r4589o6678M9283R2744J13669l3586p4784p332
10640F0820k1317n8991m3894Q69m4032r2955j7246j8880j3035O3029L0040N1816
10628a03776K088l0642K994j9601K1841M4737M9362k3642m7734m8658M7453J06635
10616A057N9781q0260o4068r6781M2281O6680L1932k4346J3880P878m3441j943
10604h7350L6841l519L0086L7173p2420q3380J6475Q0112J7625l7646L6729K6633
10592b641n6984J6478J3722J7519O6185N4296l8883m8189j4586J944p3529k406
10580f7074k3951j277M0867m3401j4730k799r0403j0625N3371P6949J8502j0062
10568g4633p995J11980J6393K7490l2715l2828m2002L9933R105j8636p803k957
$$ plain form
10652 -40700 -27137 45205 88910 82093 -12496 -79174 -29891 62853 176522 142936 68152 60820
10640 60820 39503 -19488 -63382 -62513 -106545 -199500 -216746 -235626 -248661 -185632 -155592 -103776
10628 -103776 -101688 -132330 -129336 -148937 -127096 -82359 -32997 -56639 -104373 -153031 -105578 1057
10616 1057 60838 -19422 -83490 -180271 -137990 -71310 -39378 -63724 -49844 -41966 -85407 -87350
10604 -87350 -50509 -54028 -23942 13231 -59189 -142569 -126094 -45982 -28357 -66003 -29274 -2641
10592 -2641 -59625 -43147 -29425 -11906 54279 108575 69692 21503 6917 8861 -64668 -67074
10580 -67074 -91025 -92302 -51435 -94836 -109566 -112365 -202768 -213393 -160022 -83073 -64571 -74633
10568 -74633 -82628 29352 45745 73235 40520 7692 -34310 5623 14728 -3908 -11711 -14668
10556a4668P4163K3478p153r1993n6719p4766j5527J03398Q5062r940l9821L2436
10544G950j4228j0327O8135K6155q9882K4988l9570o2315L7845J9311q720k9316
10532f9974k9550l8882k3226K8723R2119N3817K3547J0546K044n4660m8677L9209
10520a4964n0648p3220N9308L4640K5655o6337M135q1653k5018J0385N6964J83578
10508F2825N3953n4572J2111L4910o1195m0715l554o6519l6373m86O0576K7293
10496a1746p5470j40227K2117J21646N2896N1040P5419M5386N573m4223n0925
10485E1486p545q7653r3288Q0714N7499P049j3662m6940N4394j9602l308m5260
10473f6116m045R8401J9367K0744n1193j5976L4350l7264p4638m199l3103Q0038
$$ plain form
10556 -14668 59495 82973 75820 -16173 -72892 -147658 -163185 -59787 25275 15335 -24486 7950
10544 7950 -6278 -16605 51530 77685 -12197 12791 -26779 -89094 -51249 -31938 -40658 -69974
10532 -69974 -99524 -138406 -161632 -132909 -40790 13027 36574 47120 49164 -5496 -54173 -14964
10520 -14964 -65612 -138832 -79524 -44884 -19229 -85566 -81431 -163084 -188102 -177717 -120753 62825
10508 62825 116778 62206 74317 109227 48032 7317 3763 -62756 -99129 -99615 -39039 -11746
10496 -11746 -87216 -227443 -205326 -83680 -30784 20256 95675 141061 146634 102411 51486
10485 51486 43941 -43712 -137000 -56286 1213 8262 -5400 -52340 2054 -17548 -20856 -66116
10473 -66116 -70161 28240 47607 68351 17158 1182 35532 -1732 -76370 -80569 -113672 -33634
10461c3634P2294k818K2386Q6385l6500L6475o294o6524n5396J6598M7755k220
10449G8507l545N2958R3271o9126n5086l3997P2016K1228l5336l8655K6779J2516
10437A21530j6388k6481m4314L7053p243l7190m4105M9164p11m4124L7338L6239
10425F0768j1525M9352P551Q872J9526k933j40501n0182l4676m4356j0020q237
10413a56361O4842J174l5913L9472J2241n2718L6549J10469J3474o9173N010J02462
10401G1528L1607n5194p4513o0908k9015N9801K7146q1946M1381O4788K1724K764
10389A9163M6867o3889m5023M4482K8094j03288k2059P5622l4605L5014k5041
10378d4663j10848k6203N7598J7846J887M1999O7105l6621K95M0878l1531m9594
$$ plain form
10461 -33634 38660 35842 58228 144613 108113 144588 138294 71770 16374 32972 80727 78507
10449 78507 74962 127920 221191 152065 96979 62982 134998 156226 120890 82235 109014 121530
10437 121530 105142 78661 34347 71400 64157 26967 -17138 32026 31315 -12809 24529 60768
10425 60768 49243 98595 106146 115018 134544 131611 -8890 -59072 -93748 -138104 -148124 -156361
10413 -156361 -91519 -90345 -126258 -86786 -74545 -127263 -90714 19755 33229 -35944 -30934 71528
10401 71528 103135 47941 -26572 -87480 -116495 -56694 -29548 -111494 -70113 -5325 16399 19163
10389 19163 66030 2141 -42882 1600 29694 -73594 -95653 -20031 -54636 -19622 -44663
10378 -44663 -155511 -181714 -124116 -106270 -104383 -62384 4721 -31900 -31605 9273 -22258 -71852
10366g1852k6917R4617O2173J06828N2565l2586o0366O5615r569m8793K6726J1123
10354A69564r5266o7270N8324r1354K4302l6039p5692N4066k2M1471M5816P1398
10342I9298P2779K2748k1990j06232j15056J838P0181r379M1578L9045p865j17592
10330c0647J5144k6693J3128J3926j6272L855P0822L4915l5357k4478J3598K3811
10318E5752m942k1993l3532k582k1626q714o9648k6058J05320k2042O0521l9922
10306b9466m9647J703L2602J02577L6924m8575n767n9919n0408K7265L7470j6737
10294b1978m0067k8961J6353J0861L3789R0818M9138N364J4347q1785n7690J7418
10282G607K683j9421J8907L15O313J258j4428j2086N0882Q4092N6677m9722j12989
$$ plain form
10366 -71852 -98769 -4152 58021 164849 217414 184828 124462 190077 180508 131715 158441 169564
10354 169564 74298 7028 65352 -26002 -1700 -37739 -113431 -59365 -59387 -17916 27900 99298
10342 99298 172077 194825 172835 66603 -48453 -46615 23566 14187 55765 94810 86945 -30647
10330 -30647 -15503 -42196 -29068 -15142 -31414 -27559 43263 78178 42821 18343 31941 55752
10318 55752 50810 28817 -4715 -7297 -28923 -37637 -107285 -133343 -28023 -50065 10456 -29466
10306 -29466 -79113 -77410 -44808 57769 94693 46118 40351 -19568 -69976 -42711 -5241 -21978
10294 -21978 -62045 -91006 -74653 -63792 -30003 60815 109953 115317 129664 47879 -9811 7607
10282 7607 10290 -9131 9776 10091 16404 17662 3234 -8852 42030 126122 182799 133077 20088
10269B0088q1785n8543Q5559P2083l9474p8746K0915J5554M5095P7448r2996j01637
10257a16439Q9885J28783k0681q0963N4325j9726m7735l8845k9141j9544J02649
10246B568M3932p0241l152J2043J9199L3460q6499K5266o54R371j0104J2080k5844
10233c8575M7912P6227O845k3939J1969j23775j9943m5652k8515O4240K2368j8724
10221f9562J01208R3490m8805o6846j9101K9198k7636p4011n0515j6443j638O9407
10209h1254j7278j6301R4165j5597L5126L670o4190n7237J59787P5891l7193p4298
10197E291m8418J1735m029o5654k9523M8166o2147o4452K7875N0669L1285M6158
10185e3044L7610o9922n4366R7620K0124L6027L0933J366l9912j5676M569J9747
$$ plain form
10269 20088 -61697 -120240 -34681 37402 -2072 -80818 -59903 -44349 746 78194 -14802 -116439
10257 -116439 -26554 102229 81548 585 54910 35184 -12551 -51396 -80537 -100081 2568
10246 2568 46500 -23741 -26893 -14850 4349 37809 -48690 -23424 -24078 -14707 -24811 -12731 -38575
10233 -38575 9337 85564 92409 68470 80439 -43336 -63279 -108931 -137446 -73206 -50838 -69562
10221 -69562 31646 125136 76331 9485 -9616 19582 -8054 -82065 -132580 -149023 -150661 -81254
10209 -81254 -98532 -114833 -20668 -36265 -1139 2531 -61659 -118896 40891 116782 79589 5291
10197 5291 -43127 -31392 -35421 -101075 -130598 -82432 -144579 -209031 -181156 -130487 -99202 -53044
10185 -53044 -15434 -85356 -139722 -42102 -21978 14049 44982 46348 6436 -9240 -4671 15076
10173A5076l3633o0857q4615J05991L7578m1808o1929n1202P539K3240k8971N3224
10161a20367l2342n7798K9440J25994J4991k8951L2057l3886M929K4759l2063
10150g3237j4060N86M9042Q0720J28839k6292j14422K3611O261p3016n823Q0751
10138F2960l6749n5699L044R047o2778n0102R473O2412J9799L2499o187M0629
10126B8348o8317O1030m3298p1904p2020M4947L1578J47563K6324L8268m7870
10115G4649o7905K4865N6046m8657q4658k2605l7753J0797Q5408o0862j02674
10104a73349J4224k6901J32653Q5747j1725r4579k7000J8019J4642M4185M2461
10093A8377m956J1428p783L2368M3729N9534k5415m8059q073Q3331K6888m3244
$$ plain form
10173 15076 -18557 -79414 -164029 -58038 -20460 -62268 -124197 -175399 -167860 -144620 -173591 -120367
10161 -120367 -152709 -210507 -181067 -55073 -40082 -69033 -36976 -70862 -65933 -41174 -73237
10150 -73237 -87297 -86711 -37669 43051 171890 145598 31176 54787 61048 -11968 -17791 62960
10138 62960 26211 -29488 -26444 -17397 -80175 -130277 -120804 -58392 -38593 -6094 -12281 28348
10126 28348 -39969 21061 -22237 -94141 -166161 -121214 -89636 57927 84251 122519 74649
10115 74649 6744 31609 87655 38998 -45660 -68265 -106018 -95221 -9813 -70675 -173349
10104 -173349 -159125 -186026 -53373 32374 20649 -73930 -100930 -82911 -68269 -24084 18377
10093 18377 13421 24849 17066 49434 93163 152697 127282 79223 71150 154481 181369 138125
10081A38125K1424m4557k7404k6855Q2924K4176J9659J21236O2799j986O0098
10070D29639J18667Q4293Q767J72040J43847Q3816J33474O0168J19973K41141
10060A595825L33475L31465N04182P75623J255196K101633L857226O931414R556518
10051B7242557Q285678P228493O294762n294568j5610069j0186736m797981k467900
10043A0694236j653971j148432r71981p76947n36289m51201m27150l69682l33996
10034D024587k60007j96247j74228k11533p7359q3163j67470j42646j86454r9941
10024B425539j44763j42362j63465q5786P8690K8385o1045j20977q8701q8652
10014A636863p6611o5924j499l2980j14085j04413j979J1260m290r5187o4713
$$ plain form
10081 138125 159549 114992 87588 60733 143657 167833 187492 308728 371527 369541 429639
10070 429639 548306 632599 641366 813406 957253 1041069 1174543 1234711 1354684 1595825
10060 1595825 1929300 2260765 2764947 3540570 4795766 6897399 10754625 17686039 27242557
10051 27242557 35528235 42756728 49051490 43756922 28146853 17960117 13162136 10694236
10043 10694236 9040265 7891833 6919852 6142905 5606616 5155415 4728265 4358583 4024587
10034 4024587 3764580 3568333 3394105 3182572 3105213 3022050 2854580 2711934 2525480 2425539
10024 2425539 2280776 2138414 1974949 1889163 1967853 1996238 1935193 1814216 1725515 1636863
10014 1636863 1560252 1494328 1492829 1459849 1345764 1241351 1239372 1250632 1246342 1151155 1086442
10003A086442k7784m4274M7016M4513K504m1476J5737j05104q2921q279L4230
9992I20604k2257j07847n0123l5040K1056O864o0131o5776Q1687J157r0029N78
9980F00743M4503n495j30652m6649P2493M7483k7069n6667m9876l4806M3153M8240
9968E05401j552o7368K0667N3542N1908m785m5823q8169m3188m7277M4389j0035
9956C67710K3246M19K3347n7647q580O570o1325q5301J5104p6719p496N9057J4709
9943B13094k2699j2931M9302J37039o2477o7632m4990o7771K0903N2860o2501
9932A32197L993q49J6105l0166k1140K5431J10572l5254j26805l8724O3455L6319
9920A35134L6785l647o7381J9057P9555K5428r92m1338r0788o8583L8846N9323
$$ plain form
10003 1086442 1058658 1014384 1061400 1105913 1108417 1066941 1082678 977574 894653 886374 920604
9992 920604 898347 790500 740377 705337 726393 733257 673126 607350 689037 690194 600165 600743
9980 600743 645246 639751 509099 462450 534943 582426 555357 498690 448814 414008 457161 505401
9968 505401 503849 436481 457148 510690 562598 557813 511990 423821 380633 333356 377745 367710
9956 367710 390956 391375 414722 357075 348495 355065 293740 208439 223543 146824 139328 198385 213094
9943 213094 190395 177464 226766 363805 301328 233696 188706 120935 141838 194698 132197
9932 132197 136190 135341 151446 121280 100140 125571 236143 200889 74084 35360 98815 135134
9920 135134 171919 168272 100891 119948 199503 224931 223939 182601 91813 23230 62076 121399
9908A21399k4094O212K5426J4301m3475j48989m6766O0318J31037J14033o0933
9897A48469k8492n1549l5880R5475J4213p1727k5088L1061K4335n3268l2986l3516
9885a8953R8706L9618k0908l2121K6592N8046l9061n3299j9844j2453j18334q7697
9873a79708p055Q9282N8738k4318o2080k0581M3243K9829J18430k0660n5193L154
9861b6919J2287N3386Q9601k5116o6775J8277J2554j333j555m8537l1433o268
9849b1831L1943R8650P1993l5814j44326n4344j7901J04898O890r7953L186P1019
9837A6410n7736k1252k9268j8624P5912P0512J842O0577K8396l1918q2619j2923
9825f91J5471k1839o667n6960J0058K3750O8255O7822J6673o7185p1636l6001
$$ plain form
9908 121399 97305 103517 128943 143244 99769 -49220 -95986 -35668 95369 209402 148469
9897 148469 119977 68428 32548 128023 142236 70509 45421 76482 100817 47549 14563 -18953
9885 -18953 79753 119371 98463 66342 92934 150980 111919 58620 38776 26323 -92011 -179708
9873 -179708 -186763 -97481 -38743 -63061 -125141 -145722 -102479 -72650 45780 25120 -30073 -26919
9861 -26919 -14632 38754 128355 103239 36464 54741 67295 65962 64407 15870 -15563 -21831
9849 -21831 10112 108762 180755 144941 615 -53729 -71630 33268 40158 -57795 -54609 16410
9837 16410 -41326 -62578 -91846 -110470 -34558 35954 37796 98373 126769 94851 12232 -691
9825 -691 14780 -7059 -13726 -70686 -60628 -36878 31377 99199 115872 48687 -22949 -58950
9813e8950n2962P711J25349K3340L2893J9323k844l6815m8648k3435k133j7042
9801c4213L0361R3533j1471m1366m789j9842O2240L4705q626O240k2435p8729
9789E608J2913l0457L0688R3142Q0092r7049q5057m4144J9970M6393Q851l338
9777C7612n1063o6559j9857J9503N2487M1334K6149p839P6237k6293K4339q340
9765I7710r2167q8770K4066j7485p6281L1962N0928J4040K377K0298o7514R7498
9753c338m960n8113J1003J2883J0036Q1422M2789j3888j0185P0676J3385p4291
9741G7419r7904j4517m0966J158n991O339L9517j4544o4740k0803M6780j6071
9729a04323m9429M4725J59324Q8105j9476k9958k5749k9636N1677K5750j8967
$$ plain form
9813 -58950 -111912 -104201 21148 44488 77381 96704 93860 57045 8397 -15038 -17171 -34213
9801 -34213 -3852 89681 78210 36844 32055 12213 74453 109158 100532 106772 84337 5608
9789 5608 18521 -11936 18752 111894 191986 94937 9880 -34264 -14294 32099 40950 37612
9777 37612 -13451 -80010 -99867 -80364 -27877 13457 39606 31767 108004 81711 106050 97710
9765 97710 5543 -83227 -59161 -76646 -152927 -120965 -70037 -55997 -53620 -33322 -100836 -3338
9753 -3338 -8298 -66411 -55408 -42525 -32489 48933 91722 77834 67649 138325 151710 77419
9741 77419 -20485 -35002 -75968 -74810 -80801 -74462 -34945 -49489 -114229 -135032 -88252 -104323
9729 -104323 -153752 -109027 50297 138402 118926 88968 63219 33583 85260 111010 92043
9718I2043j1404m5118j05676k6408K5384K1678O8338J18245N5991m4470o1081
9707H7522l8451l1829Q3082n4198k4290k633K7294l7821j5858m757N685k2710
9695b8964L8288N3310k40L600r7157k6261J08819R3556K9228K4052o7283r1177
9683C9771q783l1758n1573j9703M369l0184j6728l5861k132N1279M5399r45j9901
9670g6750J91280O2615l4103l1046j9243L2275J6337p1871o7454J1N0797l0169
9658B2679k2413o4857O2304L5119j2900o991Q943P6210N8808N4915j00016m4138
9646F7663R3934L8527j3330N6017l8983O832j51323j15436l7571n0725N5484J5837
9634g3074P808J0679J9593L7321j485Q0953k4889k7555p2040j2084Q734o7309
$$ plain form
9718 92043 80639 35521 -70155 -96563 -71179 -49501 18837 137082 193073 148603 87522
9707 87522 49071 17242 100324 46126 21836 19203 46497 8676 -7182 -11939 -6254 -28964
9695 -28964 9324 62634 62394 65994 -31163 -57424 51395 144951 174179 198231 130948 39771
9683 39771 30988 -770 -52343 -72046 -67677 -97861 -114589 -150450 -152582 -101303 -55904 -56849 -76750
9670 -76750 114530 177145 143042 111996 92753 125028 141365 69494 2040 2051 52848 22679
9658 22679 266 -64591 -2287 32832 19932 12941 21884 98094 156902 211817 111801 67663
9646 67663 161597 200124 186794 242811 203828 210660 59337 -56099 -93670 -144395 -88911 -73074
9634 -73074 -65266 -54587 -34994 2327 842 81795 56906 29351 -42689 -54773 -46039 -113348
9622a13348O7387R347l735J7869o900R1762Q1466k2711j5107n5162j0916n6560
9610a6608k5420O8664L0889k309j2295K1259p0871k5761N4914J33573j08981r8379
9598e1325K7403J3468J9420J03470j2523o2916P4047M9754j3795j3577Q835m8759
9586I3502m8689k8930m5811l6165R6q507l1712j3242k478N9489P5737Q7042r7432
9573B900R3950L0226k3388l2374m3903L1763k1539q0546J2436L1001l1085K2944
9561g615l8937J8454k1912J6537Q687k5978p755J2338O3280J9452K489o121n1923
9548a9004o1659j8448P37l2325l0750j365M5871K8452P3703L0989O7678k7869
9536E6010j08885m1349j7873N6889k2374l2318L8846Q4684o6965J2350K986m3688
$$ plain form
9622 -113348 -45961 -36614 -40349 -22480 -29380 62382 143848 121137 106030 50868 39952 -16608
9610 -16608 -42028 26636 57525 55216 42921 64180 -6691 -32452 22462 156035 47054 -51325
9598 -51325 -23922 -10454 8966 112436 99913 36997 111044 160798 147003 133426 142261 93502
9586 93502 44813 15883 -29928 -66093 -65997 -74504 -106216 -119458 -121936 -62447 13290 100332 2900
9573 2900 96850 127076 103688 71314 27411 59174 37635 -42911 -30475 526 -30559 -7615
9561 -7615 -46552 -28098 -50010 -33473 -24786 -50764 -58519 -46181 17099 36551 39040 32919 -19004
9548 -19004 -80663 -99111 -98374 -130699 -161449 -162814 -116943 -88491 -14788 16201 83879 56010
9536 56010 -52875 -94224 -112097 -55208 -77582 -109900 -71054 13630 -53335 -40985 -37999 -81687
9524h1687M4514J26920N4311q0008n4203r2346L381K9310M3475n1686O930J32145
9512H1056L7085m4107M0024J3532r6863n9719j8895p9296P479K2496L0976m230
9500g0462J759o7547J12333K7163K9761j2652Q7826J8622q2300J0453m7393l6970
9488b9407Q2794m2739j6765l0196K8642R1487k7510K3681m7607p0274O8922N9278
9476I0306J2949m6228M5890L4349l8580K2001m4240q9715j6333P8461J2832j5179
9464D6513j06379k3184J01753L7332K4988k4822l0720K6305N1248m7595n5071
9453C68K6307q4680l4405j7249N0098N5304O4760J7874Q4593O4412l3301j3761
9441A80320j02636j33065k1105n286M77K6475J9387o6474j32366l0802J10936
$$ plain form
9524 -81687 -37173 89747 144058 64050 9847 -82499 -79118 -49808 -6333 -58019 -51089 81056
9512 81056 118141 74034 114058 127590 30727 -28992 -47887 -127183 -119704 -97208 -66232 -70462
9500 -70462 -68703 -136250 -23917 3246 33007 20355 108181 126803 44503 54956 7563 -29407
9488 -29407 53387 10648 -6117 -36313 -7671 83816 56306 79987 32380 -37894 31028 90306
9476 90306 103255 57027 102917 137266 98686 120687 76447 -13268 -29601 48860 61692 46513
9464 46513 -59866 -83050 18703 56035 81023 56201 25481 51786 103034 55439 368
9453 368 26675 -58005 -92410 -109659 -59561 -4257 60503 78377 162970 227382 194081 180320
9441 180320 77684 -55381 -76486 -81772 -81295 -54820 -35433 -101907 -234273 -265075 -154139
9430a54139R5144N4421m8616L2843N4575M0739M0986m0490L113m5878o6226k5980
9418e9508J08559J869l592j7054q6428j943P5292N123J0453J2841M4481j4531
9406G5562o4282L6469P1732o3152K409J5300L3194q5703n0071K0117N2026K8908
9394G2509P511l3167J0886k0025j4482K1250l1432k6656p9533J0186Q5520P0892
9382G3459m4443l7513m8156r185K8405O40M2127K2378m999k1331l9699m7155k4961
9369a10433R488R021m0993j4471k2261J5638N1221K4155J02626Q366j32998N9913
9357d0728K964j2705L9841l8235O7461L2749j9511Q5558M2651q3489n4782L5005
9345E6779o6619q2594J4445M9138M3875q0583r7303M7571J44744J0875m9437n6103
$$ plain form
9430 -154139 -58995 -4574 -53190 -20347 34228 74967 115953 75463 78576 32698 -33528 -59508
9418 -59508 49051 50920 47328 30274 -56154 -58097 17195 22318 32771 45612 90093 75562
9406 75562 11280 47749 119481 56329 58738 74038 107232 21529 -28542 -8425 43601 72509
9394 72509 80020 46853 57739 37714 23232 44482 13050 -13606 -93139 -82953 2567 73459
9382 73459 29016 -8497 -56653 -65838 -37433 -36793 5334 27712 22713 1382 -38317 -85472 -110433
9369 -110433 -100945 -91924 -132917 -147388 -169649 -154011 -102790 -78635 23991 32357 -100641 -40728
9357 -40728 -37764 -50469 -10628 -48863 18598 51347 31836 117394 160045 76556 21774 56779
9345 56779 -9840 -92434 -77989 -28851 15024 -65559 -162862 -115291 29453 40328 -9109 -65212
9333f5212J3585L9997j6089k3296m9374Q8568K02310O8032p2093k9416k9304n3613
9321G4095m7098J0661K2210k1124l2249J1211O3957K9684J8615o6963p4635L4967
9309B3331m3907K027P9284l6493j3605p726r0640N0661K0572n1373K3331p1509
9297a16047k5828R613P0402L9487M1591N279N6114L391m4764J8119M6959l0706
9285G3610N1178Q6595M2947j0841r2862o9367j540M3902l7319L4913O2314p7386
9273A06144J1809J7571O9797M9076j6400k9967l9440j8646m934m6987q304l7810
9261E1909M2414J3302M797n7121n1383L3231j6464J6056l5938J3298n464l4934
9249b6297O0897Q1860L4532j3914k4545m9905J3149n0141L1622l489l8825J15958
$$ plain form
9333 -65212 -51627 -11630 -27719 -51015 -100389 -11821 190489 258521 186428 157012 127708 74095
9321 74095 26997 37658 59868 38744 6495 17706 81663 111347 129962 62999 -11636 23331
9309 23331 -20576 -18549 60735 24242 10637 2911 -87729 -37068 -16496 -67869 -44538 -116047
9297 -116047 -141875 -132262 -61860 -22373 19218 24497 80611 84002 39238 57357 104316 73610
9285 73610 124788 211383 254330 243489 150627 81260 79720 123622 86303 121216 183530 106144
9273 106144 117953 135524 205321 254397 237997 208030 168590 149944 145010 98023 89719 51909
9261 51909 94323 107625 112422 55301 3918 37149 20685 36741 803 14101 8637 -26297
9249 -26297 34600 116460 150992 137078 112533 62628 75777 25636 57258 53769 14944 130902
9237A30902M200k6621k5945L0416P3233l588q166n9323n5469j17996r2768L5587
9225a15538J1025O9273J24553O2760m3402p5877l3384l5290L2377P7423p516K1781
9213H8185J5717r777L2444k3037n2572L6236J2373m0037K7262k2999r6236J3156
9201a9285J16072o66m1187L8586P8891O5705n4920m6517P2684l3859o3186q0579
9189C1739n2079r3757p149O1384J18512Q4306k2467m6119l1907O9761R2764k6606
9177A78382N3333j15138j07830L4189O2248K4980j420o2803M0865o1771r6713
9166e1678n8219L8197M6434O3875L5094L8577M9674l5812j994r1033o8003P1502
9154C6614L1107M2382O85N94j4050Q609n0833k7009m7573j5368o3560J03164L1482
$$ plain form
9237 130902 135102 108481 82536 112952 186185 182597 174431 115108 59639 -58357 -151125 -115538
9225 -115538 -104513 -35240 89313 152073 108671 32794 -590 -35880 -3503 73920 66404 88185
9213 88185 103902 94125 126569 103532 50960 87196 99569 59532 86794 63795 -32441 -19285
9201 -19285 96787 96121 54934 93520 172411 238116 183196 136679 209363 175504 112318 31739
9189 31739 -20340 -114097 -121246 -59862 58650 142956 120489 74370 42463 112224 204988 178382
9177 178382 231715 116577 8747 42936 105184 130164 128744 65941 106806 45035 -51678
9166 -51678 -109897 -71700 -25266 38609 73703 112280 161954 126142 124148 33115 -34888 36614
9154 36614 67721 110103 110788 111382 97332 105941 55108 28099 -19474 -34842 -98402 4762 36244
9141C6244K7434J3189R744J4294K7226J06496l8479j1469L6449j5002o5806o001
9129A34319J8576k4814l8175L8244Q0310K2849j1029K1356k7693o5336j5453O2515
9117A95669K8499Q6412Q0494O8463j9992n8607k2783k2566k1347Q0780J56555
9106E51577P3355k9173n2702l6292q181M5237J07705K7724P7657J30715J04895
9095I92517L8187J09071J26677O4018R0508K15390J19116J2259K41575L00464
9085B309782L39167M15526M98709N49660O78357Q38083J236178J531168J961130
9076A0357760K830325M191350O009632Q224759J0187981J0328301Q409870M579420
9068F5119398j988147q857120j1117020r211944o551800m596859l310085k452200
$$ plain form
9141 36244 63678 76867 86611 100905 128131 234627 196148 184679 221128 206126 140320 134319
9129 134319 152895 128081 89906 128150 208460 231309 220280 241636 213943 148607 133154 195669
9117 195669 224168 310580 391074 459537 439545 380938 358155 335589 314242 395022 551577
9106 551577 624932 595759 543057 506765 498584 543821 651526 679250 756907 887622 992517
9095 992517 1030704 1139775 1266452 1330470 1420978 1636368 1755484 1767743 2009318 2309782
9085 2309782 2648949 3064475 3563184 4112844 4791201 5629284 6865462 8396630 10357760
9076 10357760 13188085 17379435 23389067 31613826 41801807 52130108 60539978 65119398
9068 65119398 63131251 54274131 43157111 33945167 27393367 22796508 19486423 17034223
9060A7034223j969666j536392j272277j131912r98314n74215o00670o32655o08577
9051G709545n15123m12326k94832m19066l88745l70906k45287k72512k17707j43445
9041D429596j16384k11006j63844j56540r7614m2687n2386q8736j25700j50756
9031C223943n8826n0011k04335o1097J8864p3416l6246j247j97717j20308j10056
9020B329548o6326o4142j07967q3275m8170L2785j19357q1773j7651o3594J0772
9009A720850q6443j19838m7487K5816k6427m5279p9237o3790O3323O3917l3323
8998A372082m8656o2035n6231M1314R711q8941j73863n2422J09788Q692q6408
8987I73031j17543p8824R507J127O8434k7420L8112k2387j8957n0223n2881l9481
$$ plain form
9060 17034223 15064557 13528165 12255888 11123976 10125662 9551447 8950777 8318122 7709545
9051 7709545 7194422 6782096 6487264 6068198 5679453 5308547 5063260 4790748 4573041 4429596
9041 4429596 4313212 4102206 3938362 3781822 3684208 3641521 3589135 3500399 3374699 3223943
9031 3223943 3165117 3115106 2910771 2849674 2868538 2795122 2758876 2757629 2559912 2439604 2329548
9020 2329548 2263222 2199080 2091113 2007838 1959668 1992453 1873096 1791323 1773672 1710078 1720850
9009 1720850 1634407 1514569 1467082 1492898 1466471 1421192 1341955 1278165 1341488 1405405 1372082
8998 1372082 1323426 1261391 1205160 1246474 1256185 1167244 993381 940959 1050747 1059439 973031
8987 973031 855488 776664 786171 787298 855732 828312 866424 844037 825080 774857 721976 682495
8975F82495m5033j995p731k908L3754O9939J08233N6298r5211m6636j46119j16238
8963D88848k2238J22900O9731q2735J0592k5753k9143O642m6869k1374J8787k5705
8951D63683q03K5029L325N7654J50908q16j57660o6517n1202j25968l1767k2899
8939B42967Q6123N3818Q492j04752o3893k3092K4664J20082m826l9312L0127O481
8927C36879j1466l7671L8740m2177o2352o85l1663j5518p9147p6939M025L5488
8915E7514j04545m2631L2020J35767L8587M1889J21648j5035j29041K4954O2694
8904B23821k2875q371j9491l1299j38080r618M7580l2636m3081k5194Q0793N8500
8892H0049r537l4257j9834J0884j0245k5768O9853J0773J7097j2532j5462J7846
$$ plain form
8975 682495 637462 635467 627736 624828 658582 728521 836754 893052 797841 751205 605086 488848
8963 488848 466610 589510 659241 576506 587098 561345 532202 538844 491975 470601 489388 463683
8951 463683 462880 487909 491234 548888 699796 698980 541320 474803 423601 297633 265866 242967
8939 242967 329090 382908 391400 286648 222755 199663 224327 344409 339583 300271 330398 336879
8927 336879 325413 287742 326482 284305 221953 221268 189605 174087 94940 18001 22026 57514
8915 57514 -47031 -89662 -57642 78125 116712 158601 280249 265214 136173 161127 223821
8904 223821 200946 192575 173084 141785 3705 -5913 41667 9031 -34050 -59244 21549 80049
8892 80049 70512 36255 16421 27305 17060 -8708 61145 71918 89015 76483 61021 78867
8880G8867L2063m229L0258n806N3723q7143k4486j2609k581Q2138m0397p5276
8868B4522m132L0385M7493J11821j0447m8771n3526P6168P8526j2455q7543m1440
8856A10601K5303l0752o2452O4151J1362q5639j2722r012J01655J35809j4694
8845B33610p9670Q4229O6826j34288m3353M8338l1164m3847M2109N457o5748J4315
8833I6814J5141L3277j1295r210m8001r802Q497k8301Q9332J6858q5492j7781
8821E0037o0881j0620k2J8217Q3370k2197l0854P9326P3908r8732n2570K2115
8809E1097m0985N4209O7322n4911r4687N8678J04629J36909O5940J1487L3615
8798C93303p1684j21295j15945q4809O3487K9448J5429l2578q0803k1699N2497
$$ plain form
8880 78867 110930 106701 136959 131153 184876 97733 73247 60638 58057 140195 99798 24522
8868 24522 20390 50775 98268 210089 199642 150871 97345 173513 252039 239584 152041 110601
8856 110601 135904 105152 42700 106851 118213 32574 19852 10840 112495 248304 233610
8845 233610 153940 238169 304995 170707 127354 175692 144528 100681 142790 148247 82499 96814
8833 96814 111955 145232 133937 124727 76726 66924 75421 47120 136452 153310 67818 50037
8821 50037 -10844 -21464 -21486 -3269 80101 57904 27050 106376 180284 81552 28982 51097
8809 51097 10112 64321 131643 76732 -17955 40723 145352 282261 348201 359688 393303
8798 393303 321619 200324 84379 -430 63057 92505 107934 75356 -5447 -27146 25351
8787B5351L4308O673J6290k0696N1168o0396j2839p4853J3593J03933O3025M9534
8775A95091j3015j02406M775n3914k6342k0254M5742R0352Q1812O6425r2253j32879
8763D3134Q285Q1029q161k1099N099m0329j5531N8587j9486K3827P3281n5922
8751A32714O712j5130j2403j4585m6265o3962K9123L7444j7157n520R3538P9751
8739B04260o9725p8930M2395O5616Q1839k535q6269j15451m1389j3669Q566l5516
8727d0808n6492P8137j3338l0519M7242L9472M279n1212r893J91819O5783p4960
8715A49510K0065N4604o7336j06186o3600O7920J8441j9930l3441Q8502J50404
8704B58953J6174m4553J01957j8222j33988p849k5361l3091n273K4980J02476
$$ plain form
8787 25351 59659 66332 82622 61926 113094 52698 39859 -34994 -21401 82532 145557 195091
8775 195091 182076 79670 84445 30531 4189 -16065 29677 120029 201841 268266 176013 43134
8763 43134 51419 132448 124287 103188 108287 67958 52427 111014 91528 115355 188636 132714
8751 132714 139426 124296 111893 97308 51043 -12919 16204 53648 36491 30971 124509 204260
8739 204260 134535 55605 98000 163616 245455 242920 156651 41200 -189 -13858 -5292 -40808
8727 -40808 -97300 -19163 -32501 -63020 -15778 23694 27973 -23239 -33132 158687 224470 149510
8715 149510 169575 224179 156843 50657 -12943 54977 73418 53488 20047 108549 258953
8704 258953 275127 230574 332531 314309 180321 172472 147111 114020 108747 133727 236203
8693B36203J2477l1527m3680n9805m1148k1352K1006p6056M6007l2476m1466L4620
8681B803N1240M0949J2269J3346p0191p6002L9753j1443Q1469O1764M2116K739
8669A90812r9751M4746j59j89489j29108O8910J14660P5145Q2819K4146j0854
8658A71877m4506l3858K4640K4726n8893K0093O2112j2512o5089L796m4127j2071
8646C6188M3588j1946N941L6355p710K1022N7854k7047o4649J6618L808m2146
8634F7876O768l4119k0051L5835l4142m9909r5616k1457R9576L9116J0797k8781
8622b4107n323L7873J407J1084J3128K2950l4471o5413k8589L2289L5475M5569
8610D1872j9818r4K7355J3931n3309m2373O8768l6681o7441k4684K7108L5846
$$ plain form
8693 236203 248680 217153 173473 113668 72520 51168 72174 -3882 42125 9649 -31817 2803
8681 2803 54043 94992 107261 120607 50416 -25586 14167 2724 84193 145957 188073 190812
8669 190812 91061 135807 135648 -53841 -182949 -114039 621 75766 158585 182731 171877
8658 171877 127371 93513 118153 142879 83986 104079 166191 153679 88590 92386 48259 36188
8646 36188 79776 67830 73771 110126 102416 123438 181292 154245 89596 106214 110022 67876
8634 67876 74644 40525 20474 56309 22167 -27742 -123358 -144815 -45239 -6123 4674 -24107
8622 -24107 -29430 8443 9850 20934 34062 57012 22541 -42872 -71461 -39172 -3697 41872
8610 41872 22054 21960 49315 63246 9937 -32436 36332 -349 -67790 -92474 -65366 -29520
8598b9520N7691J4236k1817j7794M2288M5089R0370l5013m8462m9171L1448Q5223
8586A64568j1471m4172j18655j0033k6152k8330m5010K3148R9702O4739o2328
8575F006J8720q8666j9365O9461K0694J00466M0545n6194j5258p7437n2360K230
8563e1158k9328L7003M1064K9168j8139L6238k6297O835O3978m5631J1074K6678
8551H1485m7032m5947j1997j9395P2655m8009J3429l3199M4230m0384k3341N1804
8539e701R383N4501P7439K3705m0111J1265q8701j5252l0444p141L1012j3904
8527F051M9227M4312M9637o3463l2062j6296m0962j5049k8008M3978j0817j6512
8515b9964j7455m4039M7972Q0313o0638n9718L4119P1725k6649L1547L1943l4315
$$ plain form
8598 -29520 28171 42407 20590 2796 45084 90173 180543 145530 97068 47897 79345 164568
8586 164568 153097 108925 -9730 -19763 -45915 -74245 -119255 -96107 3595 68334 6006
8575 6006 24726 -63940 -83305 -13844 6850 107316 147861 91667 76409 -1028 -53388 -51158
8563 -51158 -80486 -43483 -2419 26749 8610 44848 18551 25386 89364 43733 54807 81485
8551 81485 34453 -11494 -23491 -42886 29769 -18240 -4811 -38010 6220 -34164 -57505 -5701
8539 -5701 3682 58183 135622 159327 119216 130481 41780 26528 -3916 -11057 19955 6051
8527 6051 55278 99590 149227 85764 53702 37406 -3556 -18605 -46613 -2635 -13452 -29964
8515 -29964 -47419 -91458 -43486 36827 -23811 -83529 -49410 22315 -4334 27213 59156 24841
8503B4841J9337L7048m4738o2617k3230m3087q8673n0926P0723j6974K4897N8648
8491i4751N9651N1474n971l7569r3493Q7766J00115L5127p3467j39292m4463L6233
8479a18640P8319P0328p108n2248j09387L4428L3048J5298K1614K9594K9063o5297
8467d0988r6482k6997L2012Q2834J1770o7966k2338M1774L9616R0672j4329p6433
8455d6855N2931M6835L043k0061m8169q6479P976J39968M776m0941K0409l8777
8443e344r5297J8721J3580k6396K1482j2226l8186M3086K4427J7298Q1726J9395
8431F2266q0739J115k7522j9138L4135J7109j1214l6548l558n8212J7313N8964
8419d6029M8771j3320j5320L634P1995N8232m5757N579L7593l4743j47370m5091
$$ plain form
8503 24841 44178 81226 36488 -26129 -49359 -92446 -181119 -232045 -161322 -178296 -153399 -94751
8491 -94751 -35100 16374 10403 -27166 -120659 -32893 67222 102349 28882 -110410 -154873 -118640
8479 -118640 -40321 30007 22899 -29349 -138736 -104308 -71260 -55962 -34348 -4754 24309 -40988
8467 -40988 -137470 -164467 -132455 -49621 -37851 -105817 -128155 -86381 -46765 43907 29578 -46855
8455 -46855 6076 52911 55954 35893 -12276 -98755 -90779 49189 53965 13024 33433 -5344
8443 -5344 -100641 -81920 -68340 -94736 -73254 -85480 -123666 -80580 -56153 -38855 42871 62266
8431 62266 -18473 -17358 -44880 -64018 -29883 -12774 -23988 -60536 -64094 -122306 -104993 -46029
8419 -46029 2742 -10578 -25898 -22264 49731 107963 62206 67785 105378 70635 -76735 -121826
8407a21826R0410J1203k043K7752r3078j223M0773P0121l9105N0297K5214o099
8395E2396J49772J67610M7593m8611m3683j0271j23670q8646l2371L7049P4684
8384A81852k9752j23275q7649N6322J3076m5556k2153P369m5892L2140L4982j193
8372b9729N8323M3273l5298J2989j6088m8358l5278l0874O7257J24848L1813O9346
8360B12224M9816P3900M7403k6097o9788p2719Q38m8307r2864N4632J849l5515
8348I5372k2886j5165O2326J6495K9398j1056O7181l8001k0625j8631l0355j10755
8336C298o5063J7730L6514K5918j0462j0251M3894J9696r5160l8084p0328p4365
8324b16663J4270Q3363J22094O6690N3503O4329k7968o8905m7660p1803n487N9677
$$ plain form
8407 -121826 -31416 -20213 -22256 5496 -87582 -88805 -48032 22089 -17016 33281 58495 52396
8395 52396 202168 369778 417371 368760 325077 314806 191136 102490 70119 107168 181852
8384 181852 152100 28825 -58824 -2502 10574 -34982 -57135 -49766 -95658 -63518 -28536 -29729
8372 -29729 28594 71867 36569 49558 33470 -14888 -50166 -81040 -13783 111065 142878 212224
8360 212224 262040 335940 383343 357246 287458 214739 215577 167270 74406 129038 130887 95372
8348 95372 72486 57321 119647 136142 165540 154484 221665 183664 163039 144408 114053 3298
8336 3298 -61765 -44035 -7521 18397 7935 -2316 41578 61274 -33886 -71970 -142298 -216663
8324 -216663 -202393 -119030 3064 69754 123257 187586 159618 90713 43053 -28750 -34237 25440
8312B5440O2361J7981M037j6073n7696L803M2990m6616j5484J8105l4722n8613
8300e4487m2460m6670K5911M1802R7645J01051l776o6090j13373n4068m432J1445
8288a07502J05459N9124J7625K6504N582l4364m7181K533m6020R852R3132n3352
8276C1392o038l7466m1358O6806M8218Q5102p4268o4315L864K9350J12093p396
8264A45984m2147k4576n7665j38748M6971Q1775J1921M7201n8143o8767o9612
8253a25806K7147Q7559K1967k6441l2837m8659n5319J03801O4604K8161r938L3502
8241F7741l4605j7792O632j6552M6085o4150l7130K1025R8538N4399Q2354j8839
8229A87706j61092r8684J0455m7094j5673L8450R2334k7528q9348P5367N0140
$$ plain form
8312 25440 87801 105782 109819 93746 36050 39853 82843 36227 20743 38848 4126 -54487
8300 -54487 -96947 -143617 -117706 -75904 21741 122792 119016 52926 -60447 -114515 -118947 -107502
8288 -107502 -2043 57081 74706 101210 106792 72428 25247 27780 -18240 -8388 84744 31392
8276 31392 25354 -12112 -53470 13336 61554 146656 72388 8073 11937 41287 153380 145984
8264 145984 103837 79261 21596 -117152 -70181 11594 23515 70716 12573 -56194 -125806
8253 -125806 -98659 -11100 10867 -15574 -48411 -97070 -152389 -48588 16016 44177 34239 67741
8241 67741 33136 15344 21976 5424 51509 -12641 -49771 -28746 69792 124191 206545 187706
8229 187706 26614 -72070 -61615 -108709 -124382 -85932 6402 -21126 -110474 -35107 15033
8218A5033M2294k8055Q6383L5119L3373N123o7049k5946q6093m3779o3957R4288
8206c266J64127K6756j01004j12964k5155J5350K9122L6162L4416k1192l7251
8195E101j7280J7451n562q6M0381J0086o5645k4579R474n1071K4708O7090P6986
8182H7054l6748l4561k7914l6885J794K9981l0298N8004J8872n9808J2756M2977
8170B5224m1223k5313k0467l5683Q903L3496P3953L7569L1486N6391o2284p1884
8158A0168q7766K1750j2297M2478L4869n1129K6650K7209l0199N4073P060J6915
8146E9781m7480N5684L1055m7108N343r483J0014j0813j03o5578l8442q3741l8924
8133a79795J0671N7272l2947o2774Q1431Q3065L5179Q128k0726j4894P3248M4358
$$ plain form
8218 15033 57327 29272 115655 150774 184147 189270 122221 96275 10182 -33597 -97554 -3266
8206 -3266 160861 187617 86613 -26351 -51506 -36156 -7034 29128 63544 42352 5101
8195 5101 -12179 5272 -290 -376 40005 50091 -15554 -40133 -30659 -81730 -57022 10068 87054
8182 87054 50306 15745 -12169 -49054 -47260 -17279 -47577 10427 29299 -30509 -17753 25224
8170 25224 -15999 -41312 -61779 -97462 -88559 -55063 18890 56459 87945 144336 82052 10168
8158 10168 -77598 -55848 -68145 -25667 9202 -41927 -15277 11932 -18267 35806 42866 59781
8146 59781 12301 67985 99040 51932 57275 47792 57806 46993 46890 -18688 -57130 -140871 -179795
8133 -179795 -169124 -111852 -144799 -207573 -126142 -43077 -7898 230 -20496 -35390 37858 82216
8121H2216J7560p1169l0313L9916L3380n7956N0368O590R783m4884o4215p3631
8109a02355J2194J9050l6326K1770P6396l4620j0276M0490O3633o751n7453J9259
8097E011J24951o978l2538K3672r0154p4030O246M7066J4212n0249j2598L8285
8085g104P1969L0454K8342o7798n1264J63466J9123n9533n3853J5544K3202o979
8073A05569O56N6480K9491l2459l8370P4627k0849M1724P1902J84719K91368K53466
8061A018324K43124J19286k7060k88654k58073k29833j87152j15957J0088p821
8051B76272n7472K4043O4653K8361m3679o8580k1265K7519k3651n389N5732J8793
8039B75337o3727n6406l7241K5833n671O4101P5253p4473L209N2088N2457l595
$$ plain form
8121 82216 99776 28607 -1706 38210 71590 13634 64002 70592 80375 35491 -28724 -102355
8109 -102355 -90161 -71111 -107437 -85667 -9271 -43891 -54167 -13677 49956 43205 -14248 5011
8097 5011 129962 122984 90446 114118 23964 -50066 -43820 3246 17458 -32791 -45389 -7104
8085 -7104 64865 95319 123661 55863 4599 168065 187188 127655 73802 89346 112548 105569
8073 105569 106225 162705 192196 159737 121367 195994 175145 216869 288771 473490 764858 1018324
8061 1018324 1261448 1380734 1353674 1065020 806947 577114 389962 274005 284093 276272
8051 276272 218800 242843 307496 335857 292178 223598 202333 229852 206201 200812 256544 275337
8039 275337 211610 155204 117963 143796 138125 202226 277479 203006 206215 258303 310760 307165
8027C07165M2368k6619p760Q5512J23966M11647M98296M77595O39435Q92681P12052
8016D156338M07677J70498l90704r67000j101505o78141k86968j27406m1229j05614
8006A035946j16421j26077o656m3099n237k7830n7605o2495l4016K772m1668n323
7994E12291j9810k4359m4630K9040O8610K9293K6955j0716j12922n6401k7801
7983C69550K2693J72913l4998n5934q8642n1838J7066j9860n5806l786o5936J5409
7971B20831K7977O88J2267j18129k3485P0964M7105j9693j1503J3721r0750l2976
7959I7017P9607j0991n4903O3898J03844M615r9125j6882N8671Q5837R5642o2034
7947C45196L0934J07765Q617q932j9244K7870N5497k6453q1195p1893n6587l9061
$$ plain form
8027 307165 349533 322914 315154 400666 524632 936279 1434575 1912170 2551605 3444286 4156338
8016 4156338 4564015 4734513 4343809 3376809 2275304 1597163 1310195 1182789 1141560 1035946
8006 1035946 919525 793448 786792 743693 738456 710626 653021 590526 556510 559282 517614 512291
7994 512291 492481 468122 423492 452532 521142 550435 577390 566674 453752 397351 369550
7983 369550 392243 565156 530158 474224 385582 333744 350810 330950 275144 271358 205422 220831
7971 220831 248808 249496 261763 143634 120149 191113 238218 218525 207022 220743 129993 97017
7959 97017 176624 165633 110730 174628 278472 283087 183962 167080 225751 311588 407230 345196
7947 345196 376130 483895 492512 483580 464336 492206 547703 521250 440055 368162 311575 272514
7935B72514j2165j09238j01142l8718N2001O0229n5078j5680m5664L5214M2961
7924H5234O729J1691K0271p362k7552M3738J611Q6968P8091j15213j31306O883
7912E9783l3401J0112R2972M0109L7130K1028J5060O7104m6900q6530j07452O3431
7900A32446k3195M2597K8674J14615M2717P045o8172l1169K0598k8759n995o9729
7888A61673j39750j0551J19908K8034k3752p941o7375q3836J9354L2329k9312
7877a219M6171M4981K2421j7450j6823N2817m1291N806K9860J02686j1460l1272
7865A85227q5394l1560n2247j5172L2642j7074L1280M9130j8480j68490r460J7879
7853h1719j9598K7452J8404N7246O6769k0874k9905k1210Q5519J4400M3111j7982
$$ plain form
7935 272514 260349 151111 49969 11251 63252 123481 68403 52723 7059 42273 85234
7924 85234 91963 103654 123925 116563 89011 132749 134360 221328 299419 184206 52900 59783
7912 59783 26382 36494 129466 169575 206705 227733 242793 309897 262997 176467 69015 132446
7900 132446 109251 151848 180522 295137 337854 344899 276727 245558 266156 237397 231402 161673
7888 161673 21923 11372 131280 159314 135562 127621 60246 -23590 -4236 28093 -1219
7877 -1219 44952 89933 112354 94904 78081 130898 89607 95413 125273 227959 216499 185227
7865 185227 99833 68273 16026 854 33496 16422 47702 96832 78352 -90138 -99598 -81719
7853 -81719 -101317 -73865 -55461 1785 68554 47680 17775 -3435 82084 96484 139595 121613
7841A21613q5785j7715J3464J1605J90j08259m3512L8055N7502R7308n0299l0087
7829D080K8388Q424o6231r444j1175j0984m062M4439N7600l3599L7825N6522o4959
7816C6824k0034n1607l7641j2699N8801P3757l408P605K5489O1647l3453n5983
7804D9298l7137M525L4876K0710m417K641k3060L2355n1639q3089j6975q0160
7792a52072R274j2149O6604K2297L0075K7330p936M8326m8871n5771N7098N4313
7780C8518l3746n9151j4094P686N1518m8358L582M2620j4513Q5667R5938m2866
7768A12801l2569O0130n0987k3335k6425m9526m0785N4869j3564n4735j531M5331
7756b0326P931j3752o8074J14054O9309J3270j9840j5447n6537k0603j4944j0703
$$ plain form
7841 121613 35828 18113 31577 43182 43372 -64887 -108399 -70344 -12842 84466 34167 4080
7829 4080 32468 40892 -25339 -34783 -45958 -56942 -61004 -16565 41035 7436 45261 101783 36824
7816 36824 16790 -34817 -72458 -85157 -26356 47401 43993 51598 77087 138734 105281 49298
7804 49298 12161 16686 51562 72272 67855 70496 47436 79791 28152 -54937 -71912 -152072
7792 -152072 -142798 -154947 -88343 -66046 -35971 -8641 -16577 31749 -17122 -72893 -15795 38518
7780 38518 4772 -54379 -68473 -60787 -9269 -57627 -54045 -11425 -25938 59729 155667 112801
7768 112801 80232 140362 89375 66040 39615 -9911 -50696 4173 -9391 -64126 -65657 -20326
7756 -20326 -12395 -26147 -94221 19833 89142 102412 82572 67125 10588 -10015 -24959 -35662
7744c5662K7473J4166k7458K6985n0536m5126P8632L595j3808j2015j4792M2624
7732e922j3571L3906l648l2357q015J362k935n3183k6557Q6347K5295K2120p2594
7719d9752k0437J6200J3284N1683j4903k2100Q4028p185n027J13874K4766J8960
7707B03391n3896o3641n4960n7242j28308J3434R8597o8256k4522l1065m303k8153
7695a98924L5131O4401j3155J04631M0738K4159m7133O24r482J0581l908j9378
7683a1715J5320r6065J5189N9455K8841l8803m8388m9555L6091N0111P5321j1790
7671B4012j7089o598K7001m7423j7340o1416k9097N9416M3134N8584n8965j76207
7659b01988L8009O6261J8028J24257m2358l1620K5131n2302M6366P2022M1408
$$ plain form
7744 -35662 -8189 5977 -21481 5504 -45032 -90158 -11526 -7931 -21739 -33754 -48546 -5922
7732 -5922 -19493 14413 10765 -21592 -29607 -28245 -31180 -84363 -110920 -24573 722 22842 -49752
7719 -49752 -70189 -53989 -40705 10978 -3925 -26025 58003 50818 45791 159665 184431 203391
7707 203391 149495 85854 30894 -26348 -154656 -141222 -42625 -110881 -135403 -166468 -170771 -198924
7695 -198924 -163793 -99392 -112547 -7916 32822 56981 9848 10472 990 11571 7663 -11715
7683 -11715 3605 -92460 -77271 -17816 11025 -27778 -76166 -125721 -89630 -39519 35802 24012
7671 24012 6923 325 27326 -20097 -37437 -98853 -127950 -68534 -25400 33184 -25781 -201988
7659 -201988 -163979 -97718 -79690 44567 2209 -29411 -4280 -56582 -10216 61806 103214
7648A03214n3312K0635R5796n9825j56373j26616r3866J15773P7400P4445j7622
7637b0351r6092K8617P0806O8941O7263n5228j32485m0175L3818k5923k6323O8708
7625e8424M3246l0693j31635P4796Q1703K8944M2857l0905m2057M4822L7255j17
7613E9792p5200L9636O9603m7786q1150o5764L0038k5934L4031k5216p3662R1234
7601g0378Q0772q02K9323K3625Q8219K7089P1677P1228j02662r0207j09602k0396
7589b114M7957J07411k953m5079r6751M8622j0079J3829j3618K8996P0215L781
7577A50217Q232p3576p0534k20J7715O6202J09629n9645m6197L6712N1798O5385
7565B55718j6306q2171q7375o2759j25418L0618R1386j2975L6910Q5169m8333
$$ plain form
7648 103214 49902 70537 166333 106508 -49865 -176481 -270347 -154574 -77174 -2729 -20351
7637 -20351 -116443 -87826 -17020 51921 119184 63956 -68529 -108704 -74886 -100809 -127132 -58424
7625 -58424 -15178 -45871 -177506 -102710 -21007 7937 50794 19889 -22168 22654 59909 59792
7613 59792 -15408 24228 93831 46045 -35105 -100869 -70831 -96765 -62734 -87950 -161612 -70378
7601 -70378 10394 9592 38915 62540 150759 177848 249525 320753 218091 127884 18282 -2114
7589 -2114 45843 153254 150301 105222 8471 57093 47014 60843 47225 76221 146436 150217
7577 150217 158449 84873 14339 14119 31834 98036 207665 148020 101823 138535 190333 255718
7565 255718 239412 157241 69866 7107 -118311 -87693 3693 -9282 27628 112797 64464
7554F4464l9377n429o4688N7081Q3270o3264q9894Q0390O157j30412k7875P4600
7542e4977L438O7788L9367J829J1237q6382l532m2988o2903M1135P2434q75k8025
7529d2454j9150n7150m9472K633O4380Q7330n7128j04617K6608R8169J13230l1425
7517C0954m4528P2276O1534j3062m0627j15286j7017J19552m3539Q487M3595M8324
7505A10663R2657L250j42549r4020k5631j9685j6976P462J5496Q1220P825j2581
7493G131O0971n048p5789k3798L0089j0577L8748J06159l023j2411L6750l6080
7481A13122r4742n0843m7151O7795K5214m4113M6390k0761p7759p984L4822M5989
7469a0021K9467n1779q180j6676Q7370J06058K0954r955j4583k8943n0713p7489
$$ plain form
7554 64464 25087 19658 -45030 12051 95321 32057 -57837 22553 28710 -101702 -129577 -54977
7542 -54977 -51539 16249 55616 57445 68682 -17700 -21232 -64220 -127123 -85988 -13554 -14429 -42454
7529 -42454 -61604 -118754 -168226 -165593 -101213 -13883 -71011 -175628 -149020 -50851 62379 30954
7517 30954 -13574 58702 120236 107174 66547 -48739 -65756 53796 10257 18744 62339 110663
7505 110663 203320 206570 64021 -29999 -55630 -75315 -92291 -84829 -69333 11887 19712 7131
7493 7131 68102 63054 -12735 -36533 -6444 -17021 21727 127886 124863 112452 149202 113122
7481 113122 18380 -32463 -79614 -11819 13395 -30718 15672 -5089 -82848 -90832 -56010 -10021
7469 -10021 19446 -32333 -40513 -57189 30181 136239 157193 147238 132655 103712 52999 -24490
7457b4490q7489L2284M3460r0379l6911Q0050K8258K2960L6992O0594n8237l0515
7445b3423O7411P462O056M8805K9319n0276j27654K2553R0261P313j6548J1113
7433G2392n2717m692P1747l9098j17202p3336J1515j0202K9451K4464L8994M9961
7421A277Q0800k3441j0462k9747n3727j9048J1803L3043N1846l8885k4903k5952
7409d7396M7999Q1036o809p8034n1303o026L657l7846o26J5786N3299L5413j5247
7396f097q9094J0730J08975p013M7602O248m3021N11n1455o3389K6636k8056J07037
7383A9614l5567k7578n895j3002j0152J15867J53199n4702n3016N6673n2280r6212
7371c051k8111R3089P0055p231j7600j7718r8110r8066J6892L6677l1063n798
$$ plain form
7457 -24490 -111979 -79695 -36235 -126614 -163525 -83475 -55217 -32257 4735 65329 7092 -23423
7445 -23423 43988 51450 57506 106311 135630 85354 -42300 -19747 70514 77827 61279 72392
7433 72392 19675 14983 86730 47632 -69570 -142906 -131391 -141593 -112142 -87678 -48684 1277
7421 1277 82077 58636 48174 18427 -35300 -54348 -42545 -9502 42344 3459 -21444 -47396
7409 -47396 603 81639 74830 -3204 -54507 -60533 -56876 -94722 -95348 -79562 -26263 9150 -6097
7396 -6097 -95191 -84461 24514 17501 65103 71351 28330 28841 -22614 -86003 -59367 -87423 19614
7383 19614 -15953 -43531 -49426 -62428 -72580 43287 196486 141784 88768 145441 93161 -3051
7371 -3051 -31162 61927 131982 124751 107151 89433 -8677 -106743 -89851 -53174 -84237 -90035
7359i0035L5814l0273j0330J131L0094M1974L7205N0433K1528k6550O289j08295
7347d1015m8168l7697L2424N5769o0284r867N988N0010P6893q062q0548K5295
7335c9262L2154m687K7441K4120n1948j4041J5364L378N2781J7794m3186N2776
7323G2684P1535k9740K9955J17755p3100r9220k7601J5100j18183m8989M6784
7312d3020N7818q817j482q160o0908m2930N6696Q141j7518J7843k0400L7568p2312
7299i7481j8894N2151Q8493O2295j04669r5401l4538K9543J60958r152J7335M3178
7287I3818p1082J7681n4742j0127n2437K4199L3969k3315J8387p3111K5778O1511
7275i471j8592q1201m808k4368J11033R8296j2294r6098l9854N3259J8780o179
$$ plain form
7359 -90035 -54221 -84494 -94824 -93693 -63599 -21625 15580 66013 87541 60991 67280 -41015
7347 -41015 -89183 -126880 -94456 -38687 -98971 -108838 -102850 -52840 24053 15991 -64557 -39262
7335 -39262 -7108 -11795 15646 39766 -12182 -26223 -10859 -7481 45300 63094 19908 72684
7323 72684 144219 114479 144434 262189 189089 89869 62268 77368 -40815 -89804 -43020
7312 -43020 14798 5981 4499 -3661 -64569 -107499 -50803 -42662 -60180 -42337 -62737 -25169 -97481
7299 -97481 -116375 -64224 24269 86564 -18105 -113506 -148044 -118501 42457 33305 50640 93818
7287 93818 22736 40417 -14325 -24452 -76889 -52690 -18721 -42036 -23649 -96760 -70982 -9471
7275 -9471 -28063 -109264 -114072 -138440 -27407 70889 58595 -37503 -77357 -24098 -5318 -11497
7263a1497K3784O9802k679n4995j51715n0872L3293p375N600K2485R6902l2254
7251e9521m9640J9581P6105j0299J5827L6842k6731J1372L9737m3347j04217P2924
7239b1367L3339N4498L0546k7039L9979J0931r23n2068n1244r0213m7122N2195
7227f8488Q9363j15284P170K0834o9052o3643O4281j2261m2036j4917M0127J14305
7215d9601J2492j7587L4494J21957J3179o3680Q6587k1622j40005j0211J33897
7204I9900j7183n6339k4028M403M5915O1900Q7992o5700j44403l3805j4567K822
7192e3093J7332q705l0135j102M4241N6243j6518J02475o96m5617M089o2778K9838
$$ plain form
7263 -11497 12287 82089 79410 24415 -127300 -178172 -144879 -152254 -146654 -124169 -27267 -59521
7251 -59521 -109161 -89580 -13475 -23774 -7947 28895 2164 13536 53273 9926 -94291 -21367
7239 -21367 11972 66470 97016 69977 109956 120887 119964 67896 16652 -73561 -120683 -68488
7227 -68488 20875 -94409 -87239 -66405 -135457 -199100 -134819 -147080 -189116 -204033 -163906 -49601
7215 -49601 -37109 -54696 -20202 101755 114934 51254 137841 116219 -23786 -33997 99900
7204 99900 82717 26378 2350 6753 52668 114568 202560 136860 -7543 -41348 -55915 -53093
7192 -53093 -35761 -44466 -74601 -75703 -31462 24781 8263 110738 110042 64425 68514 5736 35574
$$ [...]
##END NTUPLES=NMR SPECTRUM
##END=
