##TITLE=Analysis number 321431
Compound Code cc 46704
Book Reference 449/138
Project Code adrs
Chemist Name davee
##JCAMPDX= 6.0         $$ Bruker NMR JCAMP-DX V2.0
##DATA TYPE= NMR SPECTRUM
##DATA CLASS= NTUPLES
##ORIGIN= Bruker BioSpin GmbH
##OWNER= nmr
$$ XWIN-NMR		Version 3.5
$$ Thu Aug 10 09:46:58 2006 GMT Daylight Time (UT+1h)  MAYBRIDGE\nmr@NMR_250MHZ
##.OBSERVE FREQUENCY= 250.131544655141
##.OBSERVE NUCLEUS= ^1H
##.ACQUISITION MODE= SIMULTANEOUS (DQD)
##.ACQUISITION SCHEME= undefined
##.AVERAGES= 16
##.DIGITISER RES= 18
##SPECTROMETER/DATA SYSTEM= dpx250
##.PULSE SEQUENCE= zg30
##.SOLVENT NAME= CDCl3
##.SHIFT REFERENCE= (INTERNAL, CDCl3, 0, 16.4529)
##AUDIT TRAIL= $$ (NUMBER, WHEN, WHO, WHERE, WHAT)
$$ ##TITLE= Audit trail, XWIN-NMR		Version 3.5
$$ ##JCAMPDX= 5.01
$$ ##ORIGIN= Bruker BioSpin GmbH
$$ ##OWNER= nmr
$$ C:\u/data/dgb/nmr/ADRS/580/pdata/1/auditp.txt
$$ ##AUDIT TRAIL=  $$ (NUMBER, WHEN, WHO, WHERE, WHAT)
(   1,<2006-08-10 09:46:31.88 +100>,<MAYBRIDGE\nmr>,<NMR_250MHZ>,
      <created by zg, POWCHK disabled, PULCHK disabled
       configuration hash MD5:
       E2 DF 36 D8 04 B2 41 60 5A D7 A3 38 5A 4B D0 FE
       data hash MD5: 64K
       37 30 EA 78 E8 45 65 75 E5 60 0D ED 38 36 33 A8>)
(   2,<2006-08-10 09:46:49.19 +100>,<MAYBRIDGE\nmr>,<NMR_250MHZ>,
      <Start of raw data processing
       ef LB = 0.3 FT_mod = 6 PKNL = 1 SI = 32K 
       data hash MD5: 32K
       7A F0 61 E3 CC BA 3A 94 D3 2F A1 03 50 46 92 66>)
(   3,<2006-08-10 09:46:50.80 +100>,<MAYBRIDGE\nmr>,<NMR_250MHZ>,
      <apk 
       data hash MD5: 32K
       C5 19 17 B3 B0 44 90 3A C8 F6 21 1C 93 5F 69 15>)
(   4,<2006-08-10 09:46:51.58 +100>,<MAYBRIDGE\nmr>,<NMR_250MHZ>,
      <abs ABSG = 5 
       data hash MD5: 32K
       1F E5 35 14 B8 95 9B 38 AD 4F 34 6E 41 A9 6C BA>)
$$ ##END=
$$ 
$$ hash MD5
$$ 10 54 25 66 B1 B4 75 8C B0 CC D9 7D 82 6E 99 76
##$RELAX= 
##$RELAX= 
##$RELAX= 
##$RELAX= 
##$RELAX= 
##$RELAX= 
##$RELAX= 
$$ Bruker specific parameters
$$ --------------------------
##$DU= <C:\u>
##$EXPNO= 580
##$NAME= <ADRS>
##$PROCNO= 1
##$TYPE= <nmr>
##$USER= <dgb>
##$AMP= (0..31)
100 100 100 100 100 100 100 100 100 100 100 100 100 100 100 100 100 100 
100 100 100 100 100 100 100 100 100 100 100 100 100 100 
##$AQSEQ= 0
##$AQ_mod= 3
##$AUNM= <au_zg>
##$AUTOPOS= <7 >
##$BF1= 250.13
##$BF2= 250.13
##$BF3= 250.13
##$BF4= 250.13
##$BF5= 500.13
##$BF6= 500.13
##$BF7= 500.13
##$BF8= 500.13
##$BYTORDA= 1
##$CFDGTYP= 0
##$CFRGTYP= 5
##$CHEMSTR= <none>
##$CNST= (0..31)
1 1 145 1 1 1 1 1 1 1 1 1 1 1 1 1 1 1 1 1 1 1 1 1 1 1 1 1 1 1 1 1 
##$CPDPRG= <>
##$CPDPRG1= <>
##$CPDPRG2= <>
##$CPDPRG3= <>
##$CPDPRG4= <mlev>
##$CPDPRG5= <mlev>
##$CPDPRG6= <mlev>
##$CPDPRG7= <mlev>
##$CPDPRG8= <mlev>
##$CPDPRGB= <>
##$CPDPRGT= <>
##$D= (0..31)
0 1 0 0 0 0 0 0 0 0.06 0 0 0 0 0 0 0.0002 0 0 0 0 0 0 0 0 0 0 0 0 0 0 
0 
##$DATE= 1155199590
##$DBL= (0..7)
120 120 120 120 120 120 120 120 
##$DBP= (0..7)
150 150 150 150 150 150 150 150 
##$DBP07= 0
##$DBPNAM0= <>
##$DBPNAM1= <>
$$ [...]
##$SUBNAM7= <"">
##$SUBNAM8= <"">
##$SUBNAM9= <"">
##$SW= 20.6930455092707
##$SWIBOX= (0..15)
0 0 3 0 0 0 0 0 0 0 0 0 0 0 0 0 
##$SW_h= 5175.983436853
##$TD= 65536
##$TD0= 1
##$TE= 295.16
##$TE2= 300
##$TE3= 300
##$TEG= 300
##$TL= (0..7)
0 120 120 120 120 120 120 120 
##$TP= (0..7)
150 150 150 150 150 150 150 150 
##$TP07= 0
##$TPNAME0= <>
##$TPNAME1= <>
##$TPNAME2= <>
##$TPNAME3= <>
##$TPNAME4= <>
##$TPNAME5= <>
##$TPNAME6= <>
##$TPNAME7= <>
##$TPOAL= (0..7)
0.5 0.5 0.5 0.5 0.5 0.5 0.5 0.5 
##$TPOFFS= (0..7)
0 0 0 0 0 0 0 0 
##$TUNHIN= 0
##$TUNHOUT= 0
##$TUNXOUT= 0
##$USERA1= <user>
##$USERA2= <user>
##$USERA3= <user>
##$USERA4= <user>
##$USERA5= <user>
##$V9= 5
##$VALIST= <valist>
##$VCLIST= <CCCCCCCCCCCCCCC>
##$VD= 0
##$VDLIST= <DDDDDDDDDDDDDDD>
##$VPLIST= <PPPPPPPPPPPPPPP>
##$VTLIST= <TTTTTTTTTTTTTTT>
##$WBST= 1024
##$WBSW= 4
##$XGAIN= (0..3)
0 0 0 0 
##$XL= 0
##$YL= 0
##$YMAX_a= 318216
##$YMIN_a= -428238
##$ZGOPTNS= <>
##$ZL1= 120
##$ZL2= 120
##$ZL3= 120
##$ZL4= 120
##$ABSF1= 16.45295
##$ABSF2= -4.240223
##$ABSG= 5
##$ABSL= 3
##$ALPHA= 0
##$AQORDER= 0
##$ASSFAC= 0
##$ASSFACI= 0
##$ASSFACX= 0
##$ASSWID= 0
##$AUNMP= <proc_1d>
##$AZFE= 0.1
##$AZFW= 0.1
##$BCFW= 0
##$BC_mod= 0
##$BYTORDP= 0
##$COROFFS= 0
##$CY= 12.5
##$DATMOD= 1
##$DC= 0
##$DFILT= <>
##$DTYPP= 0
##$F1P= 14.0000005364418
##$F2P= -0.99999901652339
##$FCOR= 0.5
##$FTSIZE= 32768
##$FT_mod= 6
##$GAMMA= 0
##$GB= 0
##$INTBC= 1
##$INTSCL= 1
##$ISEN= 128
##$LB= 0.3
##$LEV0= 0
##$LPBIN= 0
##$MAXI= 10000
##$MC2= 0
##$MEAN= 0
##$ME_mod= 0
##$MI= 0
##$NCOEF= 0
##$NC_proc= -4
##$NLEV= 6
##$NOISF1= 0
##$NOISF2= 0
##$NSP= 0
##$NTH_PI= 0
##$NZP= 0
##$OFFSET= 16.45295
##$PC= 1
##$PHC0= 153.6379
##$PHC1= 9.877227
##$PH_mod= 1
##$PKNL= yes
##$PPARMOD= 0
##$PSCAL= 4
##$PSIGN= 0
##$REVERSE= no
##$SF= 250.130017271196
##$SI= 32768
##$SIGF1= 0
##$SIGF2= 0
##$SINO= 400
##$SIOLD= 32768
##$SREGLST= <1H.CDCl3>
##$SSB= 0
##$STSI= 32768
##$STSR= 0
##$SW_p= 5175.98343685301
##$SYMM= 0
##$S_DEV= 0
##$TDeff= 65536
##$TDoff= 0
##$TI= <Analysis number 999999
Compound Code 99
Book Reference 9
Project Code 9>
##$TILT= no
##$TM1= 0
##$TM2= 0
##$TOPLEV= 0
##$USERP1= <user>
##$USERP2= <user>
##$USERP3= <user>
##$USERP4= <user>
##$USERP5= <user>
##$WDW= 1
##$XDIM= 32768
##$YMAX_p= 440687180
##$YMIN_p= -436521
$$ End of Bruker specific parameters
$$ ---------------------------------
##NTUPLES= NMR SPECTRUM
##VAR_NAME=  FREQUENCY,     SPECTRUM/REAL,   SPECTRUM/IMAG
##SYMBOL=    X,             R,               I
##VAR_TYPE=  INDEPENDENT,   DEPENDENT,       DEPENDENT
##VAR_FORM=  AFFN,          ASDF,            ASDF
##VAR_DIM=   32768,         32768,           32768
##UNITS=     HZ,            ARBITRARY UNITS, ARBITRARY UNITS
##FACTOR=    0.157963299565203, 1,           1
##FIRST=     4115.37654858167, 0,            0
##LAST=      -1060.60688827134, 0,           0
##MIN=       -1060.60688827134, -436521,     0
##MAX=       4115.37654858167, 440687180,    0
$$ Real data points
##PAGE= N=1
##DATA TABLE= (X++(R..R)), XYDATA
$$ [...]
29204 17354 57894 144827 95851 45275 -118333 -98253 24839 54242 56750 -13086 -26123
29193 -26123 -65086 -41272 -146594 -96259 -54792 -165590 -233635 -99467 -29246 -40942 -33655
29182 -33655 21902 13394 -71880 -199723 -166363 -149407 -79342 -13314 71341 188638 109670
29171 109670 97398 102277 92188 103737 122159 114054 40068 110436 65315 44526 11508 47901
29159 47901 38453 8735 87786 217538 209273 218946 259576 228783 187015 157813 97513 -31675
29147 -31675 -66640 -102375 -58139 -23577 6411 25221 49588 -48280 -95616 -67443 97713
29136 97713 189465 166475 162509 101599 130899 131210 87225 9303 36724 28878 123466 132265 11223
29123 11223 -19717 64931 137094 129678 161274 248525 309456 214909 125852 147310 109347 54911
29111 54911 52715 -12781 -79887 -114887 -107223 -101052 -139179 -22244 67717 105958 119129 -36190
29099 -36190 -114575 -102827 -13263 -127520 -56326 95742 147170 72275 61118 21922 -97975
29088 -97975 -115910 -137776 -95064 80458 174751 213408 215806 104107 78060 31215 -116978
29077 -116978 -109054 -14011 164821 55525 -15224 -65339 -79220 -93226 -36749 -22146 59546
29066 59546 224218 213260 -14205 -168515 -96848 8332 19051 29900 -17139 -27107 -153888
29055 -153888 -170790 -198818 -135536 42355 259770 293651 133841 51893 47165 106782 97812
29044 97812 60952 -34711 -187091 -73360 91506 114895 23453 143679 168699 154367 31653
29033 31653 32985 -5307 38672 165380 209198 132685 96583 60585 -14248 57648 28277 -80311
29021 -80311 -137316 -169770 -90886 -66139 -75939 -95454 -60199 -22658 55289 75256 51607 101984
29009 101984 138052 102537 57474 16657 53707 -150910 -294772 -142870 -12975 -59932 -135159
28998 -135159 -236019 -165804 26873 201200 222828 174300 115914 165788 91447 81495 50952
28987 50952 -44714 10970 -16490 -13833 15019 -64891 -146309 -72836 9408 -91174 -8773 7239
28975 7239 71896 120578 86823 19147 -1070 3856 -41575 -24554 -34339 16655 36314 -48016
28963 -48016 -60873 -66643 -2681 98528 79068 186179 189454 155125 130092 161503 30107
28952 30107 -303 -73150 -65996 -922 -91336 -175681 -149048 -101897 -44787 -31484 -8284 1198
28940 1198 53808 99674 86597 178497 142730 17762 10583 38054 116405 165571 103047 93075
28928 93075 104160 -1165 -1621 9957 13066 99394 48141 -53845 -19047 -27735 84160 96318
28916 96318 -97738 -177918 -133869 -187869 -119912 -62470 -106290 -178668 -153613 37955 42037
28905 42037 64195 52789 13411 -80908 -33955 -1445 42874 -4560 6385 47900 -45551 -23380
28893 -23380 121753 75481 47951 -33852 -4264 -12979 -1890 26801 -94623 24736 112551
28882 112551 171519 115069 135475 31868 -50025 -20652 38905 62008 10934 31191 87931
28871 87931 95472 107269 40713 -59168 -106012 -128307 -187367 -218476 -199595 -144371 -62424 22906
28859 22906 64493 117462 47418 -41299 37413 -59549 11107 -16218 -2474 90589 37253 19670
28847 19670 -102726 -131765 -92818 -83332 -60732 6645 75613 133877 53900 -17914 7416 132341
28835 132341 201088 79017 61514 101369 81177 66543 146013 73378 54040 97708 25137
28824 25137 19022 38729 13435 93340 121653 -25961 -91731 -62813 -83221 38928 110721
28813 110721 173770 53640 29279 -150121 -190149 -66881 48503 144419 4547 -71575
28803 -71575 -34298 -93975 -74666 -22083 -31614 20590 150991 88407 18599 -13659 25351 123213
28791 123213 66434 146492 157449 79627 20963 14288 29172 -17277 129994 133061 115988 197495
28779 197495 234639 234389 166143 50360 43889 23397 14265 16201 -76037 -105350 -152264 -133788
28767 -133788 -27701 22208 18118 -51017 -170650 -170229 -33453 86886 141547 165685 7035
28756 7035 -18531 70705 85165 71483 28489 24268 166675 243768 129849 82274 162530 41957
28744 41957 67930 97961 158948 113354 2956 -77838 -60841 22350 65779 -22710 -169464
28733 -169464 -214086 -134433 11065 -37406 -534 -123577 -184326 -126182 -66564 -113697 -122208
28722 -122208 -66251 61160 123343 49473 20715 116475 163874 135418 10862 29549 191732
28711 191732 214431 200479 126198 21177 -50866 -100262 -174233 -189644 -196917 -161429 -75244
28700 -75244 -130050 -97302 -116355 -136878 -57208 33085 46380 107672 238774 229992 212432 82091
28688 82091 45177 181533 339382 333055 263739 102576 69471 87766 119461 22918 -20954
28677 -20954 10966 55350 11611 -115664 -67967 -92240 -95110 -60471 -103493 -85277 -93041 47929
28665 47929 92398 90040 182407 153320 118977 101934 94248 85907 -42255 -53189 -52335 5222
28653 5222 -39775 -41348 153533 266695 220976 61901 24771 -9324 -104240 -196415 -154670
28642 -154670 -77119 26831 105525 66276 122144 182001 71573 -153306 -281913 -161233
28632 -161233 -99630 -28869 -6122 -28340 -151877 -85719 13298 -62733 -78071 25247 226821
28621 226821 291467 162501 -613 16241 31275 24263 -65002 -22168 -91577 -157533 -157633 -165602
28609 -165602 -37883 -8001 -76879 -77746 -38937 -66525 -73394 -12562 -32818 -46523 -128423 -11009
28597 -11009 85516 86134 5749 -73818 -54927 -53893 -16010 -78786 -100245 -32750 -96053 -77762
28585 -77762 -67048 -125910 -95655 -65654 -155162 -71070 31209 60187 146379 153700 131019 88774
28573 88774 5844 -23217 56102 108546 75361 55300 29079 -34675 144433 88602 -81093
28562 -81093 -56057 212033 219741 175471 142677 192035 170866 202618 89541 38303 74686
28551 74686 183210 164094 152447 159863 157553 165984 193240 197529 3332 -118596 52069 87857
28539 87857 -12624 -125184 -197373 -202275 -204051 -94254 47340 5113 50037 152955 3827
28528 3827 -116375 -203678 -159491 -58331 -6676 -68796 -73519 -42300 -4911 73171 105240 126275
28516 126275 92069 16588 -1079 -9787 134326 47568 -87636 -37722 7798 -19003 -84416
28505 -84416 -37610 18394 36964 57430 75831 64545 31057 12416 -57758 -20962 -33310 112227
28493 112227 71811 -101060 -58765 -62345 -25638 46034 157680 134489 143970 153843 86840 39175
28481 39175 38460 48796 46660 97209 169046 168010 110278 195690 155820 116972 22591 42442
28469 42442 222681 223171 185401 36607 -61272 -96505 4592 93606 85873 -99362 -195841
28458 -195841 -130389 -32746 74421 32929 -53432 -4427 15013 66771 -59160 -80969 -34554
28447 -34554 -13781 -32532 -2109 -197612 -281557 -179720 -217765 -184557 -90016 -57563 -44441
28436 -44441 -23070 -105617 -83142 -60994 -38809 -27759 -8097 27361 27124 118075 143613 101101
28424 101101 49393 3694 -15825 56775 -16546 4970 -33078 56699 111454 28476 -33490
28413 -33490 -42863 30962 76324 110257 13483 -48269 -91298 23164 119246 196459 195464 37419
28401 37419 26497 1720 -150200 -228461 -146624 -42414 -1868 63894 -29816 -93772 -5646
28390 -5646 9420 -59477 -89908 -34119 958 -73308 -12514 83965 130465 63486 73860 163326
28378 163326 119900 -67415 -226488 -177833 -12266 39630 66754 103430 1764 -57265 -87902
28367 -87902 -68047 -105842 -139994 -122489 -142488 -54401 -47164 -65674 -23708 34151 -157 13396
28355 13396 -13859 -128356 -124664 -53077 17375 -122985 -81718 64685 96631 -70358 -9321
28344 -9321 70329 145473 190238 156578 112730 120930 107467 178178 247929 275343 102197 -102077
28332 -102077 -41584 11943 -60033 -8346 -4674 -37022 -43534 -59517 -107380 -170364 -237647 -268282
28320 -268282 -225955 -67882 -123733 -277641 -265079 -210726 -242249 -32819 2040 -68336 -193087
28309 -193087 -197171 -95177 42835 171930 235865 180966 66110 46158 -1440 37556 37480
28298 37480 75745 180464 155572 118668 186217 73635 -57628 6806 70284 31426 -51970
28287 -51970 -63552 15873 70073 -13636 -151224 -64214 37608 7499 32163 186063 146102
28276 146102 128891 35760 -34786 69201 127793 106790 76232 26355 27164 124980 125091 50962
28264 50962 3265 -43131 -62862 -29190 24990 -19184 -98621 -177545 -138239 -112560 -130255 -136969
28252 -136969 -157982 -217711 -210921 -148881 -101234 -16 25169 31656 -38052 -40901 4421 24576
28240 24576 57916 44455 31957 53985 -12641 77630 62000 3519 -101602 -94094 -8674 -42290
28228 -42290 -54910 -23786 -14796 32567 -107406 -162470 -162698 -124246 -133458 -84348 -140954 -73873
28216 -73873 -13278 54035 71362 76706 172165 74490 57296 92371 77843 113760 62047 106501
28204 106501 101910 24898 52041 94793 35447 54503 38295 -42906 -91334 -69983 8137 73975
28192 73975 27381 25185 68625 -53684 -83910 18943 71048 89256 128135 69038 -9137
28181 -9137 -47621 30220 58608 26263 113438 248844 207661 148562 91021 90381 55112 42183
28169 42183 -7882 -115507 -1271 115251 48460 11123 12164 3983 71493 200446 173073
28158 173073 66987 37415 -59796 -128557 -119927 -60526 48874 171587 197228 302227 238426
28147 238426 101217 148093 107380 -58135 -47569 56470 77684 48981 20082 -62290 -51439
28136 -51439 -98360 -18874 110261 92272 52025 7159 -6126 92063 80353 127237 103113
28125 103113 -15433 -26425 -41364 10861 53080 25063 -39649 -90351 17063 -40364 -135311
28114 -135311 -127221 22310 139168 50313 -31987 113979 82754 34063 150618 175678 -44293
28103 -44293 -225675 -152356 -81004 -11353 14795 -15460 -71420 32000 35791 -15730 45053
28092 45053 169107 208329 133923 131330 82593 -1104 26575 36380 28611 11921 -24863 -112490
28080 -112490 -164845 -186400 -161850 -24357 69979 -9370 25607 52937 20156 -80349 -201415
28069 -201415 -159813 68988 174477 265387 244424 88342 81904 100744 82744 4656 -10495
28058 -10495 -25955 -29607 -111441 -211627 -213866 -85313 -1508 26541 56932 53351 -47632 -186006
28046 -186006 -209870 -204878 -69781 45861 -2607 -152336 -88563 -42402 -171860 -201369 -150913
28035 -150913 -84392 -94729 -36126 -74341 -117454 -140962 -146934 -188710 -170480 -222718 -206332 -84632
28023 -84632 45794 130876 132757 53400 -86277 -167147 -248309 -222620 -188201 -176422 -226733
28012 -226733 -293964 -198388 -72105 24007 5434 -67765 -51621 -27821 29872 156582 83695
28001 83695 46616 60053 139512 99409 127356 31320 1970 -43752 -134035 -69284 -8650 -15742
27989 -15742 -34741 24610 -35447 -33144 32960 17064 13561 29064 102413 185034 228473 205646
27977 205646 12339 -120966 -58013 -70339 -88265 -39770 87027 124078 230734 231955 171248
27966 171248 171552 79190 -41610 -56697 -127710 -98021 4545 -35689 -27767 72695 6491
27955 6491 82336 126130 26003 147204 157116 204711 151072 5597 -157563 -286537 -200843
27944 -200843 -19614 -18083 -123776 -86869 7906 -37666 -141243 -43681 -38757 20708 125451
27933 125451 76099 61646 -24133 -62865 -155736 -212710 -68027 33930 24428 76204 238516
27922 238516 227497 231129 46194 -109619 -143206 -137500 -142506 -122656 -45411 -56547 -25119 11556
27910 11556 -17368 -82721 -148105 -216955 -79673 74841 32632 -82972 -132700 -161419 -266956
27899 -266956 -337645 -246723 -129298 -152336 -155579 -40973 4260 47027 90297 69734 98705
27888 98705 118220 112955 54356 63091 58329 76028 -11147 28403 -6761 -78297 -75450 40812
27876 40812 -34703 -93403 -212162 -226837 -77295 -12760 184166 -5961 -105000 -23339 -19478
27865 -19478 84233 169398 109630 118492 90468 135105 199202 57461 -21783 34540 158646
27854 158646 174702 77031 52696 -34834 -39539 -101951 -74147 -27707 85597 144637 34118
27843 34118 -65558 -106165 -183426 -155124 -133170 -30028 -105240 80291 152124 38759 -175068
27832 -175068 -186742 -84828 -38812 6974 10691 93072 155890 170709 61058 -73256 -182964
27821 -182964 -133999 -112781 -54570 162 -39823 37976 112146 98060 57059 34215 82971
27810 82971 134250 138716 -32087 -30387 53703 129739 45783 -134410 -188081 -40695 73741
27799 73741 -4519 -23963 -64533 -5452 -4451 20961 53897 75244 97993 20494 -105276 12974
27787 12974 80507 89370 57825 65492 156825 162474 174198 127689 217817 260521 100122 159175
27775 159175 198382 49720 -2998 -67346 -158887 -244197 -253677 -275409 -248520 -283732 -159143
27764 -159143 -49011 -69419 -89174 -93219 -13654 -7532 22431 -18402 -211477 -212623 -155337 -68970
27752 -68970 64974 181788 55415 -72017 -135746 -139449 -51218 35459 -64737 -93308 -111246
27741 -111246 -58991 -72141 -84839 -266048 -223160 -79133 49435 105307 81443 206123 347780
27730 347780 388870 314677 171987 54394 -25144 -74702 30028 82363 25727 39748 68528
27719 68528 52123 26377 12788 58547 22617 1256 -29236 -105270 -128845 -129251 -53490 27346
27707 27346 28036 -55675 -44374 -72982 -205104 -214579 -210788 -314033 -254361 -134967 -97272 -68592
27695 -68592 117221 105570 3679 -60078 -11856 50011 -30726 -48321 -64801 3726 -19046
27684 -19046 -6791 1282 -40389 18235 73390 40354 -4747 58684 82267 18293 -40998 -143453
27672 -143453 -173520 -60212 35246 93689 68524 26375 12665 51437 79118 97782 29361
27661 29361 19154 11865 13945 41250 40238 9238 40934 162200 141950 38058 -65390 -77011
27649 -77011 -71978 -67025 -85757 -46525 -31037 -74207 22333 131800 148766 97997 145351 92285
27637 92285 -38363 -109462 -118826 -97420 -83977 -53009 -32247 66594 130444 116450 180888 263962
27625 263962 316416 214479 98808 124838 61987 -13588 -84888 -69528 91069 178504 96779
27614 96779 -37105 89452 116993 -11260 -19604 -58695 -57702 -4998 62711 23730 82126 52290
27602 52290 42065 35753 121379 81354 -28197 -27345 37592 42042 706 -32857 -71085 -4609
27590 -4609 83570 250293 264661 189691 70696 80677 -26968 -164484 -273480 -157282 -109653
27579 -109653 -124808 8852 20499 124640 180485 191495 108856 -12258 -71711 -75021 52074
27568 52074 -49427 -134494 -128129 -145705 -125187 -189591 -104329 -68127 -103908 -50276 -141102 -182273
27556 -182273 -61205 -34785 13495 91338 112588 85203 100721 75190 76380 119493 122118 51458
27544 51458 -93001 -89201 71580 57497 -31754 79953 117445 47304 14056 -64448 -137193
27533 -137193 -6989 54278 -36198 -29107 -25580 62679 79958 97379 277108 320807 209968
27522 209968 20141 -22503 -81738 -107685 -78986 -10791 66368 21693 34947 55440 51885
27511 51885 -37360 -78732 82277 208404 239286 236199 95415 15638 80985 86610 108032
27500 108032 159852 159937 45783 63778 131621 93364 4465 66007 111455 162840 169727 100641
27488 100641 -75230 -89048 64094 90966 -5006 1836 -100329 -121347 -151539 -134541 -138159
27477 -138159 -166162 -172229 -144141 -112024 -47406 -80841 -84084 -34588 20279 2551 -100790 -49730
27465 -49730 6715 -40953 -97348 -30825 -26376 -59627 -66779 -2567 46101 -30775 -66908 -4372
27453 -4372 52720 30669 33475 6721 1774 14229 -16948 -64843 -147692 -217375 -278340 -292144
27441 -292144 -233017 -175543 -268651 -271756 -195064 -180862 -11067 187161 181232 184366 139448 136584
27429 136584 24138 53060 111754 212717 205194 67204 -24773 -37169 6914 -13976 40825
27418 40825 -29220 -149525 -153743 -65177 -23357 -39587 -21080 -196118 -180610 -78558 -52495
27407 -52495 87968 125313 4397 -13153 -77496 -162900 -210768 -220718 -122875 21417 84489
27396 84489 25531 -93665 -90145 -98961 -68098 -84928 -108682 67136 37786 4563 -54326 -98049
27384 -98049 -84049 -101841 -182418 -77321 -1972 -76877 -69060 49818 10098 -37047 -61025
27373 -61025 -109723 -112503 -19398 38749 47929 43526 -62971 -108679 -56919 -48955 -18894 60373
27361 60373 51880 88476 123519 99536 87106 -25661 -145972 -115898 19051 142331 86328
27350 86328 84567 162970 200165 146863 112513 45311 26653 54111 43037 94376 217942 201544
27338 201544 44960 -30373 -94917 -18428 85545 -16125 35228 101927 -101915 -144713 22932
27327 22932 -119245 -104810 47277 188271 222991 102473 43594 60973 78924 129859 101476
27316 101476 92383 124520 42600 -10356 -9208 -16515 139347 86997 8309 951 -74087 -171915
27304 -171915 -166371 -121437 -73112 -91539 -49227 22832 58551 -34749 -156772 -235831 -243152 -276139
27292 -276139 -279655 -167302 -68310 -84216 -81795 -77305 -29192 -60883 -190611 -287635 -353006 -234652
27280 -234652 31241 113015 -6555 -134319 -135645 -99397 -50374 -7840 -23757 -28951 31787
27269 31787 90796 25035 -55196 -55294 -15132 86068 30154 22797 30260 -49562 -106216 -38172
27257 -38172 31179 129549 139121 85657 -41864 -78809 -17638 92493 -30400 -92848 -65474
27246 -65474 -64316 -3339 91790 84219 67594 138297 119659 121672 177706 139813 50223 142908
27234 142908 78324 63924 64346 30642 17442 41340 76027 8620 -57431 -67160 -129269 -43991
27222 -43991 25185 34189 16440 -105123 -108484 -68684 -71088 6734 51092 124854 159467 119287
27210 119287 145460 105709 85055 65019 16086 57952 134652 172903 270304 320999 258530
27199 258530 195792 153350 103201 39673 60432 127886 162897 147374 101917 41776 6560
27188 6560 7755 84399 15023 -54691 -98224 -48904 -56200 15632 116975 152027 193882 254392
27176 254392 204858 205485 179787 70698 32435 -101737 -125439 37254 30277 -17078 -43897
27165 -43897 -43979 19247 88292 125227 126681 230928 192784 67379 15357 95786 57298 -18153
27153 -18153 -75257 -79615 -46761 -36667 -43540 -24821 -63326 -201838 -133120 -152442 -118823 -60990
27141 -60990 131676 275325 245507 135563 79619 110933 82661 21044 3038 -46311 -101796
27130 -101796 -142041 -49391 2474 36644 27580 -15018 101222 55076 -20759 -148977 -71262
27119 -71262 -40518 101257 125338 -23037 -39575 46120 43878 -36146 -126630 -73175 -67990 -57501
27107 -57501 73331 95870 -28985 -173851 -218156 -206577 -152475 -113517 -131207 -44823 25557
27096 25557 74379 -12105 77497 142275 17477 -64373 10760 6970 -96301 20929 107832
27085 107832 130008 130450 134069 122503 32832 92877 100334 89312 -40128 -187820 -242392 -123603
27073 -123603 -98913 -90755 -26684 -44524 8273 -47074 -20969 94210 54721 -5773 45635
27062 45635 -6879 -145654 -118314 11385 -16493 -45483 -49832 -33519 5895 -34018 -17233
27051 -17233 -85625 -71692 -47794 -60198 -31443 -103856 -94884 -38233 -131986 -196474 -149494 -86256
27039 -86256 -53994 -2983 66467 232628 155107 -17032 -26237 -73897 -54493 -17212 -75050
27028 -75050 -15335 50962 60885 114939 107799 67570 120034 68286 102983 99103 67621 -42862
27016 -42862 -137497 -98729 -15831 -49326 -14253 20538 -103801 -191018 -119052 -28391 22236
27005 22236 -100673 -188514 -231564 -214522 -51385 -44496 -28167 5422 6442 -42612 15760 -80874
26993 -80874 -76665 -59442 -71423 -70767 -90281 -50984 22765 121857 12575 -143758 -176928 -125176
26981 -125176 -106287 -43405 115249 186909 223090 143144 -76878 -112336 28846 50333 -1883
26970 -1883 11864 149333 215227 210853 221185 219817 216774 175873 33607 -30380 8973 -141856
26958 -141856 -199472 -261134 -281861 -164933 -227907 -84318 91594 250075 164416 -12825
26948 -12825 10664 -38365 6563 -17655 113041 102657 -13745 -33102 27074 18399 -110616
26937 -110616 -34394 -16170 72634 74307 -19763 72964 37784 -6683 47372 15618 38208 48861
26925 48861 -7240 -56212 -77009 -9790 -71074 -13653 74085 72917 -56234 -207185 -223763
26914 -223763 -144908 29207 59253 -36869 -62673 -74010 -63746 -51498 -18124 -25269 -167191
26903 -167191 -90297 48005 16090 60281 82964 117939 171703 128813 73733 125638 108131
26892 108131 12563 -40396 -77882 -100883 -244517 -229016 -40550 -44356 -208403 -303933 -207169
26881 -207169 -118427 -97440 9517 30149 18061 35866 132769 114260 14369 -50211 -88294
26870 -88294 -17906 -9531 -42393 30078 116479 161040 150314 140345 86588 141063 227612 241663
26858 241663 160988 108689 63661 93384 176000 98053 77124 110683 147825 92472 -37305
26847 -37305 -122102 -169093 36995 57647 -24280 12101 30999 93862 119218 77568 25188
26836 25188 63962 102021 130724 -5868 -137048 -133916 -1738 39487 -154420 -173669 -159613
26825 -159613 -203777 -268333 -245105 -236277 -110555 8861 142601 77160 -102412 -112027 -75920
26814 -75920 -59904 -31445 -134290 -168734 -150959 -73385 -34404 -38684 -46381 -113064 -28602 86602
26802 86602 171149 202766 89758 -6399 -48925 -53566 32388 91497 -12369 83998 118437
26791 118437 32572 111807 99413 90126 21014 2732 5923 -112683 -92538 -8925 -32015 43970
26779 43970 85507 -53337 -39611 35685 173141 170417 89514 35216 -47146 -40984 -62131 13911
26767 13911 21066 -123744 -157664 -75896 -724 73492 96749 -23707 -37977 14963 58868
26756 58868 45251 -14034 -39742 -11163 -35430 -24283 18095 49685 -69780 -223264 -211992
26745 -211992 -143182 -195566 -172490 -103449 -162377 -194558 -61148 -65323 -45664 11305 136132
26734 136132 114908 139705 184848 191494 77112 41711 10562 -43960 -82135 -207221 -46966
26723 -46966 91244 62571 24262 -43214 -169611 -161451 -93872 -35252 34592 -48976 -177553
26712 -177553 -254131 -229776 -227480 -197253 -187492 -211114 -112372 -77652 -183214 -139746 -48644 -70595
26700 -70595 -103629 -107762 -147559 -136121 -148952 -103140 -71319 -18697 69490 114912 33684 -21291
26688 -21291 -111436 -131113 -90121 -120135 -106286 -79743 53535 136308 71421 53788 43380
26677 43380 81283 139467 20457 -178 -7986 -40698 -39617 -49270 -50146 -46453 -80933 -56571 -28191
26664 -28191 127065 176403 101553 53678 18982 11216 32399 -119388 -109827 -71279 1168 121895
26652 121895 192719 96902 55745 75884 163413 139054 113512 140456 116558 50563 -32220
26641 -32220 -8654 27228 115019 79372 37787 11280 65987 160891 103324 -25545 -56881
26630 -56881 23175 54216 -71914 -71114 -28166 -54394 -44598 -30745 -221841 -163657 -30290 21943
26618 21943 140981 113220 -2638 -8215 -15890 -154758 -124941 -108445 -145494 -74399 54420
26607 54420 166108 146148 171967 205122 174128 86091 74026 9471 47150 13522 -13992
26596 -13992 -122030 -128493 -36288 -124579 -142805 -13931 32709 -48501 -85733 7414 147870
26585 147870 190739 190967 68287 38574 40121 98547 198967 183696 189283 91230 -11152 -31382
26573 -31382 -45708 -156967 -191153 -58410 153694 271614 229733 130899 7749 81152 78750
26562 78750 -80760 -202542 -228017 -145694 -167675 -147289 -153787 -123493 -159720 -162271 -168084 -167581
26550 -167581 -37492 -110332 -265550 -381939 -355872 -198585 2321 98578 50394 -81551
26540 -81551 -141371 -157834 -152338 -149185 -63760 -65914 -124168 -159474 -105359 -96248 -37138 -2780
26528 -2780 14269 94446 81725 134035 196795 175769 51566 27987 38134 34394 -28784 -50920
26516 -50920 17553 -168269 -172119 -64736 50347 50186 -29454 -9510 -1376 14667 -184423 -322806
26504 -322806 -172177 -62311 -2942 59243 -20394 -74008 -27923 59687 -79686 -51930 79173
26493 79173 122699 -59131 102560 176657 40133 -77829 -40807 73846 122538 162134 92349
26482 92349 207296 166282 -8825 -35358 -9281 31318 98452 56828 24297 63926 96024
26471 96024 75970 83854 50222 2613 152559 40881 -155890 -197042 -140822 -87215 -90714
26460 -90714 -24565 -5085 54371 128557 180808 145910 128043 17296 -117718 -260672 -311016
26449 -311016 -216746 -25287 85926 22181 -125988 -31256 -35156 -137080 -143483 -145306 -138089
26438 -138089 -122448 -94976 -19464 -39742 27794 145824 188703 104598 3501 159378 135450
26427 135450 53329 42294 57753 68850 108818 76153 134428 122280 30561 -73517 -113186
26416 -113186 -111145 -3557 -10373 77487 3520 -93167 -209047 -121085 -70304 -10265 104598
26405 104598 57076 -141396 -75251 -120883 -84684 -61168 -25305 21323 -27504 33952 94964
26394 94964 119279 17318 17331 112434 218738 195316 66710 -24371 -111428 -84623 -160940 -99369
26382 -99369 -41968 51558 40170 30752 14091 129493 184384 207844 123407 18525 -41066
26371 -41066 -19063 -36065 -133992 -226788 -264780 -205181 -204260 -144056 -48873 8254 -40141 -132970
26359 -132970 -51863 -5959 8938 -56482 -40648 -18065 -48418 -153317 -152477 31304 43500
26348 43500 -63579 -33069 24546 89046 149846 19360 -200955 -252456 -232742 -96842 57778
26337 57778 31304 -60215 -88880 30166 38603 65205 45417 -22776 -45335 -8802 -479 -25599
26325 -25599 -19550 18961 19248 101737 59758 102851 151875 226457 170759 145085 147343 77737
26313 77737 88098 7861 -65952 10388 10160 -8337 -8211 79270 -28569 -61905 -110184 -110359 -82429
26300 -82429 -95796 -135950 -95326 -21776 19946 -42249 -110871 -195243 -241301 -162945 -76968 -124528
26288 -124528 -101957 -97768 -65181 -123463 -77774 -29364 67152 64609 -90165 -161942 -191528 -180919
26276 -180919 -199377 -281082 -242357 388 3492 51144 107192 130481 203684 155608 123513
26265 123513 17645 11170 -16000 -37688 2884 -48308 -135133 -136734 -131324 -32108 8602 117395
26253 117395 64972 45749 62835 61683 -27019 -91303 -113575 -74427 -79305 -187780 -303867
26242 -303867 -235649 -41366 -31814 -1096 32353 -64760 -200466 -206116 -66528 32597 20443
26231 20443 -35157 -66215 -18667 7401 89348 20225 32659 55141 8753 -48065 -129080 -174365
26219 -174365 -116629 -123066 -72342 -128319 -178996 -88877 -45358 -47338 -78576 -144446 -98126 -149911
26207 -149911 -185863 -201362 -87553 82147 165226 131060 -8506 -106030 -89066 -81400 30464
26196 30464 159265 174128 131006 74289 -14573 -26507 -16685 175698 260557 216241 142514
26185 142514 131531 180467 134363 32345 -31584 -78950 -33168 109392 148971 -70512 -129761
26174 -129761 -69778 -11107 -3118 55200 134279 119130 123937 42829 -87933 61359 132006
26163 132006 122956 109647 27128 910 30809 40512 115952 137668 184518 185535 76710 -22461
26151 -22461 -46780 61269 74482 79174 54509 47574 35229 76426 161564 161217 156326 100615
26139 100615 105752 62314 -20790 -148604 -141376 -128929 -109775 -118260 -94452 -11667 -23678 -68463
26127 -68463 -162841 -210951 -142367 -49917 -13582 64329 165860 180686 -54912 -111473 -6764
26116 -6764 -42219 -103664 -128432 -86811 -29130 32044 62431 84842 45938 55950 81131 79071
26104 79071 -75564 -70931 27160 55444 24694 3889 117856 102743 -46495 -148704 -155814
26093 -155814 -140488 -207854 -284245 -120057 9928 -8521 9891 31612 70879 66218 74510
26082 74510 83509 1355 100141 108101 -13223 55443 83036 58119 20974 -76466 4325 66973
26070 66973 13561 7555 19233 -15143 -1807 71441 131770 68554 46548 -123903 -166881 -64351
26058 -64351 -101265 8732 26478 23269 130323 99740 77408 31686 -121250 -190684 -101933
26047 -101933 47089 72895 132203 136465 -33702 -49394 -29559 30443 107017 113349 170349
26036 170349 111387 123928 131971 125323 278975 127262 17980 57375 267 -5262 67001
26025 67001 78221 -108919 -147439 -25154 -22021 -136815 -63693 116322 63049 74373 100100
26014 100100 78762 20148 -17365 18535 128481 140770 128720 63756 64371 8791 -51982 50445
26002 50445 132961 183914 204342 136936 30418 -20718 -87629 -158372 -149324 -138551 -43118 23907
25990 23907 -28119 21748 50988 -2521 4433 77633 46394 19353 19650 4321 -169033 -143117
25978 -143117 -69111 -108778 -96551 -22532 2524 73806 29803 -46044 57543 243007 115628
25967 115628 4039 -117470 -148566 -121365 -110915 -126063 -25661 -3974 -89310 -100103 -48649
25956 -48649 -119027 -66882 68524 115770 101103 -61846 -17364 -70443 -155006 -98090 -47058
25945 -47058 -124881 -181355 -85281 -41726 -1401 -117403 -166783 -66383 -34684 -31021 -29647 -96734
25933 -96734 -13018 9369 -31968 20841 133440 235100 357462 247158 102572 141569 166992
25922 166992 179662 117450 22001 -26487 -11224 -3355 50297 82330 24155 -70386 -31726 16163
25910 16163 -19167 -127507 -116209 -47481 -24627 29822 6030 -71623 -119374 -135267 -60056
25899 -60056 -34435 -39728 -119490 -64507 -71483 -88801 -118178 -149146 -139271 -30088 48074 36438
25887 36438 -79481 -90369 -134950 -149422 -262022 -154393 27201 116641 41168 77841 65884
25876 65884 -24959 -151256 -127563 -29622 -23386 -115258 -135699 -80772 120728 122410 40372 -15170
25864 -15170 -18108 186236 263619 56450 -62093 -34421 71585 34924 18943 -4942 51791
25853 51791 129175 187043 150486 219050 195633 128299 90147 -44945 -132080 -185515 -214265
25842 -214265 -226575 -166863 -156428 -129322 -5716 -5740 25406 145725 186453 54180 19918
25831 19918 41971 51759 -101162 -191229 -138650 -27626 -46084 -142548 -186110 -128943 8381
25820 8381 -34774 -104668 -72227 -78516 -159978 -79974 10908 12234 63584 66592 32169 -7024
25808 -7024 -85870 -119902 -239964 -226824 -111219 -68651 -56024 -59392 -48060 -43333 -33565 -62815
25796 -62815 -18871 -42774 -82585 -93433 -109429 -30020 -115992 -120346 -91677 -134829 -107486 -149764
25784 -149764 -174285 -136608 54536 88670 16435 -128833 -186873 -37739 -4893 -82183 -35763
25773 -35763 135069 110520 22223 -45123 -76679 -205904 -187613 -179101 -129651 -56647 -90420
25762 -90420 -175312 -181281 -122432 -50537 -27161 -29461 12969 -21217 19701 170223 37785 -71853
25750 -71853 -89191 -34987 37687 -11976 60536 109839 48184 153114 230898 215817 148800
25739 148800 -27636 -151114 -160391 -47385 44537 19225 -65956 -27994 79472 175320 159028
25728 159028 74487 36747 39237 -3718 -61210 11131 30581 38729 41439 12993 97526 119297
25716 119297 -690 -60964 -37599 -85122 -9251 64627 54734 168980 134789 118871 140300
25705 140300 141170 84898 130972 143818 76397 144978 281619 301502 191134 101928 105685 35779
25693 35779 86670 140913 142593 151278 247225 179570 57313 17617 51483 78625 94477 11224
25681 11224 38541 116656 33732 -48576 -60609 -96142 -132519 -94699 -49714 -37044 -41815 -118105
25669 -118105 -108933 -248952 -320805 -274589 -142987 -64064 -42948 69667 66994 -74099 -73744
25658 -73744 57772 76626 170977 295748 152552 -2629 -43299 -92915 -60347 -63981 -61103
25647 -61103 -99862 -224730 -239246 -127499 1688 -87341 -181051 -83742 -126659 -131682 -30409
25636 -30409 4076 -56602 -26693 -1103 76288 45665 104043 149778 207075 238059 266215 262773
25624 262773 156429 123571 199401 61659 -48683 -13101 -66099 18000 140936 87811 -1345
25613 -1345 12502 40247 -7192 80633 100157 145917 111228 81100 39647 -7033 -42638 -151890
25601 -151890 -169205 -243625 -178191 -29129 -47413 -79500 -68174 -52891 -180900 -131074 -82921
25590 -82921 -159102 -107713 -61399 -206696 -215338 -98416 17402 79297 81521 46548 -118565
25579 -118565 -179739 -120809 -149634 -227620 -207689 -104960 54837 94185 118952 57605 -85438
25568 -85438 -179378 -167881 -159354 -52204 29779 -2699 32484 40148 -10493 22204 92107 73661
25556 73661 -25548 45684 95820 116494 -67282 -143113 -29701 -19520 -61924 -110260 -21135
25545 -21135 110826 164306 167458 55654 -82386 -65826 123510 148285 58949 64114 89424
25534 89424 -10535 24619 64838 4331 32303 207716 302258 330497 315703 204595 88563
25523 88563 35277 -20160 23330 74315 13899 -32993 -84323 9258 76467 17646 16375 115926
25511 115926 94850 193735 239404 92882 -13341 42530 112865 124944 117049 26858 26341 -69654
25499 -69654 -237463 -227185 -93971 123875 83405 -47983 -110611 -73668 -16684 72349 109407
25488 109407 166698 136438 204970 280932 185648 129146 130030 110395 -12781 -12389 -11356 -16446
25476 -16446 -122122 -230268 -137207 -90969 -161555 -126523 -79873 -165663 -254280 -212101 -163901
25465 -163901 -199544 -115879 -43535 -49295 -59049 -26061 -111672 -21414 63165 30506 62668 61109
25453 61109 95373 77722 41393 99962 35520 -67094 -26849 1430 -1806 12180 42110 -76313
25441 -76313 -43655 -61247 -126682 -80819 10428 3580 -39838 49451 68346 -11822 -75287 -110073
25429 -110073 -105173 -188374 -166613 -79814 -128239 -51574 -68454 -103797 -167438 -155486 36469
25418 36469 13532 15976 -47815 -82493 42634 80365 135818 176776 147004 48718 -90321
25407 -90321 -128195 -136379 -229838 -264990 -193210 -169630 -42049 -83997 -71305 -13994 27382 8810
25395 8810 51632 72659 104120 59730 30365 57259 71708 -40068 -22028 -81489 39935
25384 39935 193220 309014 313835 325084 236574 148331 180246 152808 93171 10842 -186900
25373 -186900 -170908 -175334 -124056 -32877 -29111 -20996 10308 96408 130836 79008 -28101 -45666
25361 -45666 -115711 -183624 -186890 -136357 -114962 -52441 44862 97633 126440 76802 24907 7963
25349 7963 -39921 -117715 -56529 144117 197622 28860 -61073 -18225 -9583 -2902 -15744 -63147
25337 -63147 -75333 -88095 -139917 -165168 -24435 -15491 -8886 -90083 -74755 88147 117916 64847
25325 64847 -6680 -45969 -71945 -45773 -4159 -22826 -26874 -34641 -17272 -8017 58135 114590
25313 114590 153873 177806 204051 259168 226426 105785 120440 137798 76756 34698 -18396
25302 -18396 9990 106039 138706 -40868 -100686 -67231 -119721 -159979 -248600 -196293 -216095
25291 -216095 -221732 -129653 -37241 -81326 -392 -18541 -102821 -159516 -49249 50472 27779
25280 27779 45255 4434 67387 35669 -25935 -70385 -57459 -46135 23627 -116273 -175319
25269 -175319 -188905 -164022 -20198 59945 -18364 -166097 -121235 -45198 93057 72945 63984
25258 63984 130864 45218 3604 -289 -90188 -105315 -32542 6928 -58946 -163455 -147520 -208989
25246 -208989 -169343 -126349 -55177 -19117 -30371 -139816 -79321 -40606 29007 57573 -132395
25235 -132395 5102 32282 16947 -125074 -155453 -36099 18568 -27744 75673 143767 180427
25224 180427 205649 245633 211403 128868 96056 117342 116113 5138 4197 630 -44589 83843
25212 83843 -21454 -50530 -177519 -267300 -232526 -123627 -71551 64985 170122 77765 9896
25201 9896 1974 49983 73349 32442 14512 50404 151220 168481 21521 -30472 -30505 -41683
25189 -41683 -13999 -6161 -108762 -85095 -187202 -177153 -75341 -12885 -120743 -179136 -16996
25178 -16996 8636 110936 -21974 -43085 84199 108537 164876 126907 -45828 -216710 -60164
25167 -60164 141043 197128 109794 64804 -33272 7142 130617 93690 -25065 -87081 76993
25156 76993 140011 4227 -49278 -81649 -53802 -88564 -52497 116847 186443 174852 68344
25145 68344 110194 108183 194392 162884 32338 -42595 140018 190729 228087 257580 147042
25134 147042 -43054 -217640 -109178 55034 191674 131057 19668 -414 128838 138541
25124 138541 96530 89670 74341 -32718 -101788 -47382 37095 -55916 21786 22403 59048 104993
25112 104993 134775 161654 100562 39926 44813 56102 61465 -15338 29695 83102 49059 36449
25100 36449 17429 -7553 -7932 35428 -76348 -36135 10460 36695 94329 5547 -60850 -97710
25088 -97710 -27370 23518 143609 123768 30171 159998 112306 14882 7957 86528 36301
25077 36301 97572 128733 68633 111418 138108 141046 45706 -12216 25373 34126 66956 73968
25065 73968 69917 134975 61436 -31249 -131250 -204917 -209461 -130612 -183284 -199072 -132846 45242
25053 45242 169119 151114 22250 -19605 -103175 -140014 -130971 -223559 -149282 -68967 -33711
25042 -33711 13400 16596 -15154 -27385 -40047 -34405 -944 -64939 -146930 -191173 -142342 13956
25030 13956 125273 99961 -33332 -9820 4552 -34351 73763 125128 104630 87216 46618
25019 46618 139165 91389 -5943 119068 259094 333138 239046 113181 40910 24868 6396
25008 6396 -119957 -143128 -84392 -199378 -122179 -133018 -176294 -86578 -73190 -41256 321
24997 321 -55802 -180453 -272163 -171362 -30361 -35259 -65859 -109707 -130854 -19323 69366
24986 69366 43055 12498 16121 -6924 -40193 -88879 -64096 -84527 -122826 -73516 -52866 -78531
24974 -78531 -87683 -51768 -37604 25537 114481 119945 131814 76893 102599 221486 163535 65845
24962 65845 48957 -47847 2557 -20995 20205 14342 27152 -86546 -48390 135019 163032
24951 163032 143719 175890 213104 113604 42257 13305 78447 -43660 -95354 -65658 -171170
24940 -171170 -125326 -138087 -143037 -23866 8130 -120672 -120952 -136584 -23643 -62822 -157910
24929 -157910 -149309 -85182 -45429 -121794 -108489 18514 -13090 -47756 -43903 -54636 -126893 -50510
24917 -50510 138160 139961 -119114 -133758 -90886 -165492 -81776 27358 2 -43046 -84090
24906 -84090 -77172 75427 180496 -37000 1029 -15752 31378 -18462 -49601 4358 27211
24895 27211 -69276 -41195 -14696 16845 73072 84724 106724 97844 28134 -7710 58314 102596
24883 102596 29038 25524 116421 170490 18842 7876 37931 88483 54585 101764 86089
24872 86089 112039 49742 37341 -35379 -112829 -47855 47043 -13492 -76386 -189348 -153479
24861 -153479 -16729 3255 73726 38259 -13880 22820 103641 89643 31312 179427 212764
24850 212764 193816 165810 541 -10064 85930 66608 60142 -25198 -133501 -152560 -80427
24839 -80427 -3985 -1243 -37975 -129208 -178501 -115026 108492 6663 -86999 -78815 -33984 38280
24827 38280 32139 -48669 -74503 -89800 -174591 -104227 -43483 -21913 -180432 -222910 -77939
24816 -77939 10810 36249 113059 162781 116259 79781 99658 55039 66736 51214 5136 -14916
24804 -14916 -66896 -48175 34155 -8927 -114281 -55602 37910 96164 38101 66979 112834
24793 112834 113852 84294 63677 25753 -55669 -94169 -147104 -172954 -203865 -162826 -706
24782 -706 23933 -113371 -205544 -151838 -119813 -206227 -69665 -49837 -55011 -133038 -107667 -52608
24770 -52608 -9468 53532 201872 306506 262899 204032 106624 192786 239181 154014 -77910
24759 -77910 -153675 -17491 87664 -11209 -185534 -272520 -184914 -71910 -60314 -50215 44822
24748 44822 27376 -29720 -39428 -57031 19714 66938 54434 1405 60501 149079 129827 133078
24736 133078 13145 -67412 -8858 60448 -2887 20502 2720 56224 -40066 -110974 -38004
24725 -38004 -12040 4632 -38882 27239 49068 97625 99656 149233 90215 72315 114347 183776
24713 183776 150741 113493 27914 61247 -51294 -48845 32030 101254 109603 123938 4769
24702 4769 -1485 104810 151040 201537 158657 115869 61736 -27549 21669 -8917 -120949 -129681
24690 -129681 -191413 -176378 -32810 15636 -34594 -30066 73589 118323 43270 -53274 -35030
24679 -35030 122468 72907 5502 -20920 30724 76167 -2283 -31702 18511 79766 12579
24668 12579 33189 108475 75497 46498 39960 94423 102435 81988 -33808 -11274 -28115 45804
24656 45804 31606 57372 -55935 -75364 -120856 -175996 -179521 -130818 -33264 28150 20786 100307
24644 100307 122322 -435 -132312 -202579 -126210 3946 6468 43246 56093 120433 215523
24633 215523 141455 78879 94078 12410 64240 156013 47407 65817 5646 -12285 -32288
24622 -32288 80076 196532 222426 67309 -130878 -101064 -151566 -131000 -206728 -237148 -119896
24611 -119896 -99046 -53148 -147315 -207908 -140567 -57090 -12097 1846 -126714 -201624 -161248
24600 -161248 -53788 64873 118704 125710 87226 -10821 -33599 -14547 85815 191384 228412
24589 228412 129426 44768 -7286 13531 59880 136546 165943 33229 -17187 -103163 -134306
24578 -134306 -114195 -76900 -38836 -102184 -69749 11033 -30423 -9910 -44829 -20011 24556
24567 24556 44082 139274 132857 178024 69810 -29384 -135802 -123323 -40345 73913 52664
24556 52664 -45480 -26375 17643 124494 227938 135283 87528 67644 -35843 -72091 -130344
24545 -130344 -66054 76693 135977 62699 -18985 -23898 -130557 -66365 89140 85392 167268
24534 167268 257526 263306 165083 82225 -136410 -262134 -212170 -123399 -122004 -142314 -49206
24523 -49206 -79162 -94153 -215407 -155864 -105782 -136699 -165911 -92393 -51281 55359 -12474
24512 -12474 -82321 62421 -27336 -78315 -176890 -131347 -86122 -89459 -42587 -154176 -220526
24501 -220526 -87808 8761 -29439 -125324 -53097 19890 54886 2158 -77429 -123092 -26394
24490 -26394 85464 176816 214589 159425 5356 -41659 -153037 -127252 51650 247984 229726
24479 229726 80012 -52441 -11888 84858 128627 15811 -157943 -231025 -233813 -200871 -172349
24468 -172349 -72290 -13968 -46793 -93170 -251180 -175701 -122646 -66747 -23792 -31348 -44467
24457 -44467 -31681 -723 -21075 5221 11835 -4081 62521 83941 88166 31806 -13263 -46865
24445 -46865 -73352 20452 93291 101349 227127 143514 100494 -23884 6593 35748 -51782
24434 -51782 -108905 -63296 -97887 -92316 -2213 -46919 -167607 -119893 -5565 44156 108720
24423 108720 40587 -157053 -165595 -149924 -69998 157327 103451 31491 25739 29825 85819 58120
24411 58120 33721 91543 125062 147517 83593 -63138 -87950 14685 8046 -5821 -110820
24400 -110820 -129552 10066 87784 48920 106262 143586 90488 26465 -31603 -119588 -150288
24389 -150288 -32931 -76658 -126804 -178851 -94507 -23276 -117193 -148326 -173998 -134359 -31139
24378 -31139 -1746 -59821 -39872 101948 189678 143118 165308 169263 135363 -42355 -143611
24367 -143611 -108892 -102055 -99344 -152634 -199875 -231739 -243807 -187085 -50637 65970 104481
24356 104481 88782 116922 106211 30118 30249 12193 -12354 -105918 -79258 -10105 -27557 46426
24344 46426 76115 50728 -33036 16453 118022 149468 71016 35668 -125687 -224423 -256149
24333 -256149 -250740 -245925 -170181 -167091 -160470 -54599 -14349 -54069 -64310 -49787 24316 74096
24321 74096 132286 150764 115233 38179 -57849 58921 139960 118405 117118 79519 60462 -78107
24309 -78107 -84948 24606 14752 70678 2953 35088 111000 205977 238818 225143 149126 89722
24297 89722 -111548 -212693 -272917 -301995 -272239 -223363 -122204 -14981 -85944 -82034 34581
24286 34581 22211 -33175 -74264 -162888 -251187 -151269 -34106 121345 159235 118925 123800
24275 123800 54073 -75376 -3363 48837 18305 11602 69242 201149 198756 132527 76155
24264 76155 -56958 -130513 -6007 87662 80729 -3146 -64835 -72566 -92770 -59214 -7728 59881
24252 59881 -45103 -232959 -341762 -252247 -182146 -39207 -22579 -49006 -148547 -85909 -11518
24241 -11518 -81006 -43849 -57527 33914 20674 -104835 -37988 69150 33002 109971 90330
24230 90330 -18553 -79716 -20940 -95528 -149792 -97978 -146176 -222165 -162158 -30998 5762
24219 5762 -77472 -98928 -171523 -31662 -20959 -82976 53912 94185 66568 4399 -47656
24208 -47656 -34758 -48893 -124570 -139244 -181801 -222225 -194400 -231165 -256166 -106159 -55776
24197 -55776 91665 248181 217082 95752 55642 199302 249738 171826 225275 231402 107556
24186 107556 39001 136056 66888 -14890 -21007 -30988 22447 34501 81938 -81567 -235114
24175 -235114 -190137 -182913 -266512 -229680 -55230 -17521 -7630 -23904 -54614 -53622 -73128 -241030
24163 -241030 -181569 -110987 -57425 -27667 6753 30430 14635 22269 -95518 -158988 -126230
24152 -126230 -112654 30108 -28537 -63862 -19240 -42106 -80173 17444 97195 43167 1192
24141 1192 28753 -58598 -113232 -89354 -99134 -53778 12617 27667 45924 108219 10346 -81410
24129 -81410 40206 59629 -12662 -42728 -28264 -85259 -167580 -212509 -134299 -93406 -96789 13099
24117 13099 34607 130921 174523 175381 209919 208080 4584 22266 61395 67175 73614 8539
24105 8539 -5619 134282 129716 65117 75946 36330 -74019 -143874 -157691 -15626 46823
24094 46823 -20090 -122288 -86819 4536 79419 202934 200909 156620 120515 110699 91967 110517
24082 110517 173418 194951 141230 136775 67963 157197 117670 20048 -3793 -30223 -60230 -53499
24070 -53499 -126281 -160883 -142931 38000 158388 158084 162401 260674 53386 -86491 -79027 -48507
24058 -48507 21322 -61119 -163289 -145578 -134204 -83830 -114838 -94042 -91625 -102832 39452
24047 39452 89806 5104 4424 -28699 -4145 84566 94841 91331 -27068 -142114 -144745 -49052
24035 -49052 -78224 -187447 -145361 -53782 110604 106752 85868 3760 -57870 -97734 32341
24024 32341 114528 279376 376686 315833 276587 196709 78195 27183 198243 290310 263224
24013 263224 224738 110010 18101 -85301 -58333 1560 -10962 6689 5115 -45842 -69536
24002 -69536 -55562 -26081 -83071 -27239 -22753 -28288 -63919 -40267 -85956 -199236 -97352 9459
23990 9459 -34011 -120404 -112900 -6989 8138 -950 58631 216122 189659 56574 97346 90818
23978 90818 127461 132961 93242 51994 -58003 -65618 47268 141379 57956 -70491 -134051
23967 -134051 -31331 105190 23031 47848 -33768 -163798 -139399 35053 131323 115745 -19024
23956 -19024 -165888 -172217 22041 37629 -85717 -234523 -240074 -235588 -70190 -27642 -54885
23945 -54885 -120275 9218 173500 65809 -154475 -182870 -50166 5921 -26119 66468 134399
23934 134399 181940 139677 148380 172227 102422 -84146 -88210 363 -48573 -108373 -153265 -193944
23922 -193944 -187134 -59806 -44800 -11292 65796 149910 150078 153381 82956 -5492 -27093 -21250
23910 -21250 38665 129398 95245 10870 -52764 -165129 -179861 -77774 -25127 -41918 -117865
23899 -117865 -11486 -18961 -37554 18932 14329 20346 -73910 -165708 -42616 63659 7588
23888 7588 -86399 -231795 -238271 -133842 -157053 -161379 -90612 -112756 -12716 59235 139902 194682
23876 194682 169381 205468 129796 97763 63659 126686 81726 63235 15738 90461 58414
23865 58414 10308 143754 216706 298952 277713 175527 99533 52102 379 -17329 -33410
23854 -33410 9371 14142 -97315 -149854 -140149 -29893 -58352 -56988 82009 145934 231388 165825
23842 165825 49069 162080 325963 215044 212173 168167 131359 43601 -19177 -82438 -186493
23831 -186493 -187817 -149660 -94713 -25541 -10991 74416 -11419 -107502 -55203 -21018 10847 4252
23819 4252 23033 41567 50800 102240 44311 -114610 -91213 -115465 -126437 -75023 -110751 -209813
23807 -209813 -147950 -79130 -5841 77581 162013 67459 -129061 -69819 -14276 -46136 -35923
23796 -35923 -32924 -18309 10707 856 15017 99613 95012 46364 -2783 101007 174175 20061
23784 20061 -69531 -154853 -182181 -115546 -95546 -54784 -11753 -41711 -114349 -66345 -95326 -97732
23772 -97732 -143297 -157858 -105477 -104009 -156622 -200193 -143861 -97090 -128640 -152053 -145630 8184
23760 8184 -28240 -142638 -133266 -48896 -110541 -131607 -72684 53520 104521 25158 20431 -91357
23748 -91357 -125289 -147787 -62123 -19174 47144 -17282 -32742 -75476 -159287 -211164 -196350 -96235
23736 -96235 -8185 36961 74537 61699 -113025 -119182 11305 -33075 12182 93970 131364
23725 131364 93693 44246 44021 -95 -72925 -205708 -149779 -65390 -16639 88241 64857
23714 64857 56975 36174 -3772 33165 62104 93857 26203 -20418 -29565 -71413 91406 84928
23702 84928 143569 217303 80129 -11640 -152822 -214369 -171236 -101784 -36015 -12147 31169
23691 31169 97079 165306 206856 159616 33039 72652 200174 222088 221193 85070 54493
23680 54493 -4055 -19229 -48794 -81299 -136980 -103824 -81520 -48747 -36689 27736 16836 -23099
23668 -23099 -56430 -6008 46661 40717 35476 -34389 -155544 -150396 -41247 45282 151219 98460
23656 98460 -62869 -216061 -202442 -69675 33237 48813 16594 75274 70408 62068 86669
23645 86669 116225 67987 -46711 -58391 -79384 -45282 -101894 -148561 -47278 -49019 -24359
23634 -24359 1296 -35808 -95742 -135119 -69559 -28043 41581 71819 -74187 -231203 -115698
23623 -115698 56904 59540 -30325 -163128 -202640 -182706 -80974 -78855 -48506 132505 198472
23612 198472 27290 36464 45727 91282 30382 -7385 -18080 -4989 23407 29082 51840 211425
23600 211425 208266 211411 75610 56809 -4010 -39864 -52500 -143979 -130708 -34908 -21242 -23583
23588 -23583 -17680 90261 -37854 -151347 -110700 -170181 -163518 -38743 180391 104928 -33243
23577 -33243 -140678 -120428 -1562 163644 106867 10740 -49144 -163848 -184614 -175868 -162080
23566 -162080 -45731 66157 -950 -124780 -54165 -3378 17370 -79111 -3179 52014 126349
23555 126349 189664 305111 310828 257896 198437 201814 235382 121482 31100 -40261 4416
23544 4416 67343 246598 264842 104974 2722 14297 143415 130826 120481 205978 142823
23533 142823 38733 -93928 -121026 -48040 10990 -24339 -63857 23183 92769 182420 89319
23522 89319 -78472 -122517 -76810 -52105 -15483 -137547 -221099 -71496 2525 -70673 -216249
23511 -216249 -290193 -189477 -130060 -250483 -183278 -48912 -39027 39876 -19599 -70949 -15513
23500 -15513 23239 123134 181341 208213 379184 456581 251573 99372 -15843 -2002 -45055
23489 -45055 -121366 -121300 -149101 -135627 -29458 36512 125232 170240 139781 166671 93302 45436
23477 45436 -55491 -84826 -42097 14332 -43167 18076 74567 10918 72019 -68449 -159941
23466 -159941 -166687 -160223 -140739 -82679 38369 180799 185930 196856 232358 222105 35727
23455 35727 54161 65549 132445 249853 99233 -94648 -93485 -105739 -100211 -55765 -48295 -113805
23443 -113805 -41134 -30476 48377 -66553 -137278 -79828 24390 -69139 -105778 -13370 16830
23432 16830 30627 50881 34405 -78493 -83062 -184988 -80752 114180 86178 -85977 -144064
23421 -144064 25060 51430 29529 -33056 18559 97286 91481 -50971 -83034 -134632 -218551
23410 -218551 -172350 -123265 -28827 -72873 -10861 51757 10127 -33374 -103058 -16900 -2434
23399 -2434 103219 59894 69263 104644 98587 22595 3747 -15002 -116016 -109654 -81794 53439
23387 53439 210284 136919 11281 27440 -6212 -2625 5438 109811 95184 91681 177273 143229
23375 143229 47286 65541 188003 212381 186572 131971 59502 93416 243977 240030 176221
23364 176221 148662 172878 201077 214238 37463 28921 200280 132191 36384 116867 97954
23353 97954 3821 -88398 -124119 -17520 110708 102604 149769 175213 176738 181337 28726 -13341
23341 -13341 173032 239312 217458 202636 193024 159680 126043 114548 96498 -3325 51746 112060
23329 112060 91354 117828 114985 51810 2220 130261 138574 -19335 -110701 -223383 -204518
23318 -204518 -12607 129671 58920 42952 101257 153292 85586 24378 146608 -9192 -96644
23307 -96644 -94993 91431 198859 21805 -139897 -226218 -160947 -110722 -93928 65349 85603
23296 85603 8754 -60170 -59196 -4634 -3168 -88838 -105726 -10309 -5925 -103369 -89368 -1651
23284 -1651 -41523 -127129 -145829 -84233 -63050 30515 108462 107409 -62803 -143208 27724 86067
23272 86067 -90383 -187553 -170488 -204330 -148285 25107 112254 94626 -2565 -131289 -72088
23261 -72088 68386 108650 516 38961 37334 -39035 33188 45250 -42458 -40831 128027
23250 128027 44700 -68847 -30548 -60991 -74570 -44517 -92089 -41910 115632 68282 42140
23239 42140 16976 -43548 -108929 49339 113984 22927 97490 78814 46082 26687 1182
23228 1182 -14951 34628 76301 96875 158564 218630 153335 79330 38773 30254 29268 -48500
23216 -48500 -83552 -10559 51102 67688 71961 121362 139858 173624 221614 185857 138425 70603
23204 70603 155531 226450 104631 81752 39608 -13600 58997 120931 137741 116312 100846
23193 100846 130556 126143 136130 53992 29059 128893 111231 62900 71595 145120 141814 212362
23181 212362 208558 106816 207028 265633 299465 472361 520046 615527 945740 1401176 1916704
23170 1916704 2270616 2316238 2089455 1456659 995590 805069 691332 599572 522503 394070
23160 394070 287683 141387 147018 126044 217243 281029 281481 366485 265114 282880 203720
23149 203720 243949 220291 212852 238423 231356 404312 325284 144654 196030 143897 157292
23138 157292 107495 27221 -24982 -65531 17778 -16238 -52313 -15346 -100947 -30658 114721
23127 114721 209258 172140 120557 158581 135241 66752 17847 -59696 -15304 -20962 -123103
23116 -123103 -86644 52788 128706 141223 130116 193094 111911 67960 143859 220142 150089
23105 150089 199499 220233 9671 -143011 -106206 -146495 -72343 -10788 30845 15662 -31520
23094 -31520 -65187 -77892 -54932 29548 190442 215393 68159 15026 50750 -36290 -19002
23083 -19002 23996 16511 -14299 -28187 -7216 -30641 -84357 -98379 -168490 -209229 -116517 -42748
23071 -42748 -54026 -102306 -72086 -23048 -66530 -84988 -102014 -182299 -165651 -95808 5870
23060 5870 24097 49162 102125 38351 53574 83783 37026 68194 -25314 -31026 89564 111906
23048 111906 92680 41984 80652 130120 185308 135367 73630 93156 81243 94559 165217
23037 165217 151078 270312 446129 415792 271489 143615 110495 244905 290399 215356
23027 215356 86860 -40 11673 75905 123821 166145 79812 58248 148707 178733 219325
23016 219325 221869 203426 219747 21601 -30901 13791 47225 -13019 -119485 -68815 121591
23005 121591 241693 246155 157496 69273 157656 193730 64828 67534 55310 -8137 185326
22994 185326 195276 168130 151483 -6865 16178 62948 -15469 -117798 -94282 -39705 -89806
22983 -89806 -75554 -45587 75195 186563 187829 27296 54732 29315 -25957 81549 200984
22972 200984 184847 214131 186548 57094 111613 138167 -2702 -63042 -122259 -23940 3332
22961 3332 14721 51876 73259 92882 73491 -31740 -73921 4800 34846 66857 19467 -12867
22949 -12867 -75319 -85759 -193357 -130234 -71543 -88396 -18635 -76296 -64025 -62218 -135069 -126943
22937 -126943 -116477 -83667 -70248 2607 50468 -40633 28765 119409 79588 67847 36257
22926 36257 117521 183856 116641 141345 243747 210603 92449 141011 129045 118183 2128
22915 2128 -61575 -26834 -4308 -29504 -38234 -55846 -44662 -22007 63852 202974 34212 -65451
22903 -65451 -22050 -11901 -45651 51322 77823 190973 57898 -16937 48150 91138 132787
22892 132787 76565 -5126 6826 -23907 -103848 -148691 -36233 -26771 5997 167091 151452
22881 151452 162532 206340 216069 201119 124986 124045 137928 114999 63170 21682 -18081 14734
22869 14734 127285 210934 272282 275265 243996 351388 321578 279127 243455 282621 272669 301096
22857 301096 298978 360459 331384 290872 321601 387453 367902 272767 244077 302261 310685 270439
22845 270439 289369 200723 127083 67286 203624 246961 199208 177104 168473 272796 338873
22834 338873 273948 226040 182525 219001 198081 163327 146224 145978 88508 117073 129837 94174
22822 94174 134210 187865 138919 150325 168986 192183 206272 199499 290568 402985 359627 235572
22810 235572 148917 159442 158799 210653 195768 170251 146509 62098 105224 205107 89704 14392
22798 14392 9075 -79947 -29971 138552 196877 159962 71108 25619 137744 160493 99722
22787 99722 176241 202711 85861 190908 254249 252403 236124 243459 236829 146881 67524 47814
22775 47814 106503 174850 214135 250627 306131 288779 216627 134761 143126 114762 52290 92927
22763 92927 98321 105319 152526 41636 -83849 5709 -14644 22924 119092 141735 197549 173226
22751 173226 153480 169371 176103 200861 203743 255425 106220 -24905 -35233 207018 289988
22740 289988 197898 190237 261364 255810 160663 120641 212963 298974 296354 353489 436242 579878
22728 579878 639994 560945 644748 780676 688158 620828 498597 403752 472458 478639 512139
22717 512139 514444 530025 435060 409842 440614 543944 547918 513855 459283 524027 703113
22706 703113 658692 516305 503944 559659 614219 550344 566869 599855 612014 521218 486249
22695 486249 506638 499314 597251 680408 593747 663606 717487 819724 876889 963469 1226057
22684 1226057 1659237 2193608 2506667 2844308 2844774 2345428 1709155 1465610 1331714 1174963
22674 1174963 979520 976994 1007677 967972 937646 808588 790737 692943 762882 957502 957330
22663 957330 906085 844926 779539 755749 760024 845690 932251 914309 863154 881453 875454 866354
22651 866354 859714 892086 797657 702582 824483 879868 954921 1050861 1072986 976660 1020509
22640 1020509 1102757 1312942 1512005 1628324 1616969 1722969 1976435 1952451 2018952 2139957
22630 2139957 2301507 2397807 2612097 2852729 3038079 3252695 3588646 3861903 4264066 4856642
22620 4856642 5584972 6465689 7166173 8128486 9175861 10439293 12226907 14498162 17287172
22611 17287172 20430211 24152317 29246108 37212530 50066226 72413713 112871976 182905738
22603 182905738 276472914 355883360 416311015 440687180 356838302 229723141 149267025
22596 149267025 107440122 83602264 68161002 57538432 50100682 44607680 40438382
22589 40438382 36978983 33800841 30857571 28421388 26258130 24352047 22859858 21685236
22581 21685236 20696517 19796614 18962948 18194766 17484789 16944735 16485328 15879569 15301058
22572 15301058 14636008 14051418 13587539 13262863 12992515 12627426 12338420 12203945 12064655
22563 12064655 11775616 11363552 11227175 11110052 10909206 10655886 10276324 9834466 9288152
22554 9288152 8848928 8443622 8063111 7788672 7528952 7185123 6975215 6723114 6370659
22545 6370659 6047679 5923836 5742240 5464900 5262468 5099843 4844966 4774638 4670145 4583547
22535 4583547 4517480 4351869 4091629 3986858 3907562 3778301 3756641 3642214 3605963 3639396
22525 3639396 3679633 3764878 3793363 4060914 4506682 4825567 5040798 4817429 4089663 3358424
22515 3358424 2895769 2603585 2478367 2525962 2469773 2338196 2222202 2119350 2075667 2032093
22505 2032093 2000222 1922011 1913360 1759370 1706141 1563391 1480018 1493995 1537925 1503520 1406324
22494 1406324 1374908 1276544 1105053 938287 1011552 1083182 1117914 1046544 921682 1001065 1004169
22483 1004169 905499 853483 809074 853247 972432 887444 736529 617162 516939 462267
22473 462267 507818 514282 502416 526383 469466 391914 235701 97704 60075 171238 165536
22462 165536 48279 25821 115532 85407 6382 -67639 -98395 -76970 -78474 -20006 99950
22451 99950 161764 57374 70088 92383 118517 121817 120514 153072 103185 51416 60902 46140
22439 46140 33731 -13344 50989 60582 -61097 12765 98341 42453 64788 21252 92765 219275
22427 219275 338792 390505 387957 319190 263628 255906 266439 242621 169019 115901 190512 205663
22415 205663 207172 189928 163484 96824 92331 162074 113672 64643 10682 78145 112326 289950
22403 289950 371225 327626 370082 354794 222575 258812 320554 289006 300039 282450 247281
22392 247281 179755 153685 91470 38591 9941 104970 95855 156428 135639 63727 81794 125444
22380 125444 112407 133995 180005 184122 223297 225573 144879 85787 65124 38312 73244 94524
22368 94524 143315 139518 95862 14545 58868 89022 111881 110757 40565 -54611 -83956 -70379
22356 -70379 -53819 68881 155312 258770 168555 104632 235543 290209 360124 287365 198971
22345 198971 195167 175487 33286 -66419 55540 171214 94372 23113 36991 115175 101806
22334 101806 128127 107291 153236 114563 142240 120383 -48675 -29662 48758 20459 -29381
22323 -29381 97300 148007 159096 170864 -30195 -246035 -211715 -70067 82039 11050 -22422
22312 -22422 34017 107043 146931 3752 -148491 -129494 -139922 -37838 40018 -114150 -153604
22301 -153604 -74278 3148 84734 115448 159806 81833 -41464 -4330 -18701 -27063 -90438
22290 -90438 -138607 -207291 -145338 -8393 96696 226312 184716 32745 -195009 -284295 -88476
22279 -88476 -40550 -26677 -18423 -111366 -118284 68976 114413 -8277 -133949 -169007 -90155
22268 -90155 -1569 22925 -78086 -149628 -118613 -35094 53923 -40576 -131841 -148669 -112530
22257 -112530 -112276 -200086 -227912 -289816 -228512 -156833 -205087 -179785 -55883 -3068 33906 6379
22245 6379 78724 87703 152832 19209 -18276 -79450 -234780 -154810 -43184 -12039 -168093
22234 -168093 -168064 -207946 -277177 -192306 -72426 -130297 -93128 82269 207753 88153 -77202
22223 -77202 -187104 -58035 75522 97076 127613 64151 60684 120781 148704 121941 115838
22212 115838 45600 72856 68772 -5091 -82593 -79394 -51580 -24002 161061 137133 54587 58909
22200 58909 7176 -55356 -2275 1381 -78968 -85584 -8798 30650 43092 149310 243954 111652
22188 111652 -149049 -62297 -48504 -103795 -25311 54801 131662 151790 176636 131671 33600
22177 33600 110338 170523 176668 18369 -43795 79093 49086 89801 -20111 -176590 -209430
22166 -209430 -153870 -171273 -176009 -159691 -147126 -151124 -92384 -69353 -115135 -200980 -184989 -45185
22154 -45185 62770 177025 85273 -19267 -50482 -124203 -157604 -45494 126038 176682 66492
22143 66492 42147 -13326 -74048 13618 8289 -22391 -24641 -48688 -142490 -183743 -208487 -243511
22131 -243511 -223404 -158846 -59643 -2201 -28837 21285 53005 8191 -196438 -267740 -145473
22120 -145473 54974 76673 -94970 -62001 -3983 -15497 -68958 -28537 -38072 -63720 -115362
22109 -115362 -129843 -93930 -104630 37275 -17007 -69423 -14471 40354 312 -81542 -88572
22098 -88572 -62267 -42444 -10659 71883 -17945 23369 125403 138369 92010 -8554 -220987
22087 -220987 -218816 -182490 -129152 -127932 -102984 -106035 -56343 -19359 6406 -16663 -108091 -182043
22075 -182043 -94102 -4164 176041 200882 114053 9184 -91319 -36699 -46879 -121791 -243356
22064 -243356 -261083 -59576 -6685 -111167 -119064 -115917 -236810 -288395 -198682 -9058 -89879
22053 -89879 -167290 -126413 -126632 -98379 -62886 58786 76876 29675 -8707 79916 55719 36061
22041 36061 90291 -10606 -84671 -136515 -67713 139901 124933 151249 167799 169192 230288
22030 230288 220743 164308 347163 633775 1081858 1530237 1905362 2209178 2201528 1881377
22020 1881377 1469600 967653 648378 508503 399364 359412 279068 197041 141497 131395
22010 131395 156517 95336 75695 -56775 -94985 2681 -41079 14802 -28772 -68538 -30198
21999 -30198 15479 -10216 43834 127687 110738 10790 -107477 -52918 -11745 133718 241131
21988 241131 185187 60043 51980 96481 -61808 -175470 -244825 -219579 -234298 -175657 -91256
21977 -91256 -75697 -65714 16187 115485 83014 5587 -52711 -74972 2668 102257 118335 15542
21965 15542 9388 -48723 -90011 -28853 -48113 -99082 -388 45221 -15742 -99846 -204552 -199172
21953 -199172 -96478 -39144 -7518 -62789 -182979 -170092 -57612 18346 27201 -28706 -82851
21942 -82851 -92383 -68933 -40571 -143455 -215215 -187809 -240346 -226984 -221409 -169805 -276771 -271579
21930 -271579 -257226 -151001 -75544 -71691 -117529 -131921 -67508 -44533 -104833 -25888 8231
21919 8231 31511 -43659 -58085 -192 79173 48613 41038 116498 66762 -8023 -83043 -48465
21907 -48465 -51383 -11188 3126 -78333 -59681 -74767 -114459 -138943 -161096 -96024 -49108 -25718
21895 -25718 -43912 22213 134795 88042 -41881 -125991 -197703 -129960 -129430 -196791 -45274
21884 -45274 116296 93010 -37086 -83914 -119349 -184030 -247565 -164378 -140374 -171879 -219853
21873 -219853 -149930 -151456 -211650 -206294 -62840 -53209 -20611 49001 98239 -21608 23964 4212
21861 4212 -28249 -58434 -168849 -153528 -180008 -289132 -224754 -97073 -41370 7528 85046
21850 85046 148831 91962 -42508 -114749 -22014 63478 106079 52607 -51996 -99099 -70991
21839 -70991 -36477 15418 104353 125132 -35395 -218093 -299407 -300389 -268793 -223608 -227307 -253966
21827 -253966 -279012 -163301 46748 89745 152440 173159 116358 90349 -64681 6153 12152
21816 12152 -69823 -27612 -67297 -44988 54930 55302 23610 70637 109506 1753 -72438 -64468
21804 -64468 -28801 -50609 -35138 -5576 44159 91683 -128112 -203771 -134593 -91505 -89843 -108333
21792 -108333 -77471 -22510 -5057 24642 -6 -49864 -79307 -14961 -70195 -78167 -130546 -80036
21780 -80036 -78248 -102838 -10689 -66336 -155641 -120932 -37532 748 -63641 -49814 -68294 -73754
21768 -73754 21428 -60414 -39432 -2189 27883 58897 -40127 -58708 -123753 -116320 -125998 -150254
21756 -150254 -223101 -332430 -241917 -225062 -100063 16211 113432 71563 115309 178704 144316
21745 144316 -12121 8483 -14457 -10316 -110897 -248985 -132051 -1968 -2221 56122 135964
21734 135964 179830 86133 -78314 -156544 -60097 21680 46071 6047 58344 56474 104050
21723 104050 231533 264338 243563 140526 49717 -20114 -133503 -154760 -29777 -36843 1490
21712 1490 -52812 -77170 20449 66566 64427 57096 -45565 -112326 -111835 -42047 -258104 -182805
21700 -182805 55155 99131 63640 68976 47318 -28048 18388 -52722 -48005 -119965 -139211 -144209
21688 -144209 -121030 -125969 -133931 -105654 -91168 -117657 -42531 -9624 13718 -4399 -15509 -17622
21676 -17622 -164281 -235801 -182294 -93050 -114119 -195912 -168805 -121486 -135330 -230662 -141191
21665 -141191 -135509 -138715 -172944 -10775 98102 45237 111406 198074 197618 156839 10397 28141
21653 28141 109938 151881 72728 141414 112056 13071 -3652 -45648 -135195 -101810 -51558 -12614
21641 -12614 32757 16928 24151 73713 78896 -111926 -103129 -134494 -168797 62265 154745 -9353
21629 -9353 -117638 -39741 54092 -24106 23090 -46536 -11940 171675 222182 144983 78673
21618 78673 73116 56839 151081 182275 182222 143753 103737 110238 104124 20745 29655 -20083 -40043
21605 -40043 -103589 17073 98155 64245 -109810 -180474 -197882 -260339 -291242 -153560 -80331
21594 -80331 -138288 -58104 -70135 -81260 -45702 -25819 -17880 57669 91747 131812 222785 327998
21582 327998 255725 153876 14596 -139535 -140920 -85814 -93789 -77318 102032 74785 71933
21571 71933 30095 -46893 -87866 -65967 -61887 -24556 -57560 -202797 -322857 -357568 -279793
21560 -279793 -233701 -104533 10279 18198 -8373 7076 -52066 -42165 -59350 -124168 -55033
21549 -55033 -139463 -169139 -179792 -142256 -91942 23367 7673 24166 81474 137853 184730
21538 184730 38995 -1759 -48853 -63987 51293 99479 117531 98122 45107 -166309 -283637
21527 -283637 -252829 -127308 -124412 -91026 -65359 -139360 -75840 83662 83313 42123 14738 -34113
21515 -34113 -41587 -77289 37808 22740 -35220 2852 -36415 53850 76006 61462 61727 64440
21503 64440 80949 61007 80331 77541 12883 -801 79230 127339 168326 163374 202380 257947
21491 257947 158739 80106 -54691 -136412 -166148 -83556 -138839 -99969 20743 108854 156123
21480 156123 83662 64752 105664 145811 189503 78827 122647 152157 284109 303614 169017
21469 169017 126548 6633 41428 62490 31566 -44345 97978 -57768 -74059 48234 75563
21458 75563 52550 88087 169315 77037 -17672 -206646 -174655 1027 -66498 -52351 61266
21447 61266 19420 -71939 -196769 -288271 -182774 -104343 -63778 -47894 5519 -9098 -80316
21436 -80316 -299481 -278945 -190692 -128561 -37673 -69673 -119965 107346 159434 125146 134225
21425 134225 104213 59878 51698 92749 72967 -4779 -47927 -98177 -24128 -54935 -102220 -81602
21413 -81602 -38442 -37312 -1216 22341 -28751 -97857 -118223 -133637 -154404 -131687 -133923 -159451
21401 -159451 -195967 -122974 23453 137417 189125 59672 -20576 -77168 -22420 -35907 -66366
21390 -66366 -159833 -141189 -128066 -206067 -321614 -270075 -218804 -177404 -92178 -121977 -106010
21379 -106010 -97479 -161320 -79072 -123022 -178514 -134388 -206033 -186704 -110767 -117699 -217875 -133189
21367 -133189 -51948 -123545 -107028 -105817 -119403 33805 141044 242825 227682 75977 -26373
21356 -26373 -111570 -185451 -172206 -121392 -102639 -48169 65822 209672 198697 242502 178770
21345 178770 142452 -22928 -179907 -125276 41339 30409 -92159 -135864 -64620 -17211 -28444
21334 -28444 -72871 32663 51502 -6775 -52660 -36981 -86427 -146122 -291702 -436521 -297256
21323 -297256 -103165 33580 51326 -2997 -39771 -40001 25011 -14537 -72691 -11458 29374
21312 29374 40770 -11643 34073 52115 -8589 -28757 -3599 20697 13339 1839 -13322 3755
21300 3755 -70412 -173905 -83162 -25829 42529 79953 46383 -63381 -43229 -65821 -85453
21289 -85453 -51644 -109443 -46116 88136 47639 49989 -27691 -59751 15137 70327 22392 -138536
21277 -138536 -169291 -139369 -119305 -102960 -70936 43222 -27540 -93114 -168395 -174730 -54131
21266 -54131 101476 60497 21649 23961 95118 58211 -55101 -98608 -92188 -80012 -47410 11488
21254 11488 16404 -26172 -69219 -125478 -73302 -60691 -155096 -221842 -206787 -44311 108080
21243 108080 47408 -73075 -3469 -22305 44083 -26661 11937 86596 156295 79461 18565
21232 18565 90207 113766 151038 154148 172720 163702 135922 47616 -22181 -77926 -103209 -1996
21220 -1996 85167 106318 217269 203978 198691 210458 187645 94421 -1970 -36300 -85463 -154724
21208 -154724 -80166 -65373 -173873 -39975 74994 149370 113559 -50326 -249743 -391858
21198 -391858 -321230 -128409 -2802 17614 -13567 -175314 -172994 -36414 -49111 -71314 -101429
21187 -101429 -152231 -223225 -216227 -158526 -81790 41727 68970 23046 -48554 -210925 -164997
21176 -164997 -59185 -58071 -115514 -174780 -131076 -114627 -13060 8138 -25234 -29206 -125666
21165 -125666 -134769 -158447 -265104 -263373 -183211 -150045 -7733 42991 -46765 10993 21689
21154 21689 5563 -19466 19245 -6956 -125168 -209494 -191951 -167432 -90739 16182 3152
21143 3152 14993 -11966 14656 19485 10341 -128731 -154869 -102489 -43100 -87643 -132876 -49846
21131 -49846 -162213 -150412 -254095 -76198 20116 -32665 -81137 40990 63825 119121 78236
21120 78236 51375 -75292 -271736 -186613 -56060 -36910 -29561 -4117 -139363 -124701 -16796
21109 -16796 99244 -35969 -113040 -108337 -36284 45068 -3151 5058 51187 26931 -37981 67608
21097 67608 152532 94082 72260 36211 59817 152321 78079 -16889 -131346 -180071 -182375 -122468
21085 -122468 -45293 -188430 -181265 -198509 -303155 -253990 -236742 -201820 -60063 -11161 -69711
21074 -69711 -68524 -6201 73490 61229 3406 -24116 19013 -26161 1044 73327 51424 -40733
21062 -40733 -51683 -7114 -18681 79601 110382 112268 57147 45304 -35205 -107288 -116297 -82952
21050 -82952 -66289 307 -44724 9966 12453 -126415 -125237 -60687 68563 45380 57674 79223
21038 79223 18749 -37859 5023 85794 -4429 -7823 27237 120951 214608 116594 -520 -4280
21026 -4280 15924 140487 188479 5583 18279 155123 243028 125597 -20039 -78173 -104025
21015 -104025 -89483 -35319 -251177 -275801 -209284 -114554 -141679 -55791 -45881 -59067 7226
21004 7226 90096 124425 143044 71433 37507 69316 31744 -63977 -21184 -97963 -141534 -111890
20992 -111890 -24849 12952 65116 31366 -6462 -10218 40661 83485 208638 267611 320589
20981 320589 242247 235265 306130 262790 75934 74410 187105 131859 15692 -29484 70619
20970 70619 161681 175012 124939 116650 169020 81883 -26791 -64942 -138847 -106924 -164927 -43596
20958 -43596 208300 268824 121591 32686 -39554 -68868 -66895 -63786 -24678 54645 19149 -94810
20946 -94810 -230090 -235297 -79047 82679 90561 52939 143437 80285 -130349 -158716 -101916
20935 -101916 -48859 110321 298034 267786 57588 -119949 -182932 -102329 -46083 21027 34617
20924 34617 100216 37366 -73368 -84811 -55322 -53829 -107627 -149383 -226291 -288259 -262002 -176790
20912 -176790 -132316 -155256 -123318 -88401 -104381 -95148 -88003 -3419 82220 98594 66284 -45832
20900 -45832 -157568 -242701 -249123 -193375 -125560 11882 59190 48613 34140 53845 80212
20889 80212 85172 34655 -29405 -9306 18342 -99311 -20412 87055 3352 57974 104019
20878 104019 122535 83542 74416 46480 -101608 -78845 65241 259461 256879 186673 197574
20867 197574 215400 136979 58287 21719 -44247 -45733 31190 94082 -41995 -136671 -207149
20856 -207149 -237999 -158123 -67573 -85466 -142316 -50601 -31738 -42127 10366 2964 -57463 -91464
20844 -91464 -52131 46393 39004 -121997 -111008 -2626 36185 -3208 -85726 -43108 -11299
20833 -11299 117 -48626 -951 45019 68490 29949 -33549 -105582 -163734 -150769 -116263 -30033
20821 -30033 51574 125328 166399 191338 12851 -66122 -87387 -68274 -143156 -121997 -119871 -54869
20809 -54869 -12048 70081 47233 -110097 -123933 -146577 -163722 -177814 -212374 -2898 104848
20798 104848 153066 78862 58674 11123 30277 -33035 -64212 -51207 -28753 -13462 44604
20787 44604 120779 167689 22155 -44117 37342 45596 76438 203450 226674 232454 313108 233519
20775 233519 120687 15418 6760 -53434 -37671 -178147 -196101 -106600 -159486 -151443 -36068
20764 -36068 1414 -53290 -25778 17674 48344 -6572 -38580 -44001 1 -5835 14339 132309
20752 132309 1533 55700 77562 21640 51202 87645 32225 65904 75862 38946 25656
20741 25656 8288 -34750 -8555 74490 37884 31591 -46808 -70964 -91788 80986 160007 73882
20729 73882 29988 24335 -65100 -39402 -45418 -38551 -4357 30102 -23771 -68567 -84397 -188587
20717 -188587 -206604 -255374 -167553 -55680 126864 267595 338659 249102 238877 250185 333466
20706 333466 258531 109221 104964 43781 -74180 -59167 30065 46217 110255 45228 -8792
20695 -8792 78294 66346 46678 80530 9382 -78624 -28083 -88529 -114504 -22147 -9443 10845
20683 10845 98199 195725 72416 55183 101513 -13758 -136052 -231685 -229688 -43679 125231
20672 125231 145200 121015 76621 21033 46697 116633 56040 -27247 -85338 -74493 -145886
20661 -145886 -150283 -172595 -191969 84462 226069 293722 149542 -3492 -64471 -105577 -84696
20650 -84696 -18847 42945 98576 142530 201647 127866 69715 39049 -53343 -200885 -139225
20639 -139225 -102041 -130440 -101005 6699 16861 142324 112884 16626 21657 -23717 -83731
20628 -83731 46445 66443 99849 186770 61492 6096 64745 49978 31487 -57784 -71150
20617 -71150 -17555 -21834 -82133 -54479 -74673 -96192 -173751 -114402 -75211 -83941 -19139 -3644
20605 -3644 -48544 -109805 -180641 -164636 -123809 -110612 -136127 -168884 -164965 -58639 -12509 -73247
20593 -73247 -199205 -145174 -19298 -11030 -11672 25153 59446 -15917 -45920 -131347 -114183 -117846
20581 -117846 -189805 -134281 -53780 24131 14472 35948 10634 28444 -23112 -137277 -17266
20570 -17266 108338 152968 183510 61855 183454 103842 27708 -53052 -86010 -15092 28105
20559 28105 -61072 -47597 102105 152332 181539 147289 91183 4957 -31132 65973 121932
20548 121932 98990 6030 -69964 -73606 -84263 -93740 -29702 87998 6308 61721 132036 113767
20536 113767 82190 52158 98087 90483 170095 160514 165694 179098 61897 -30752 -74072 -165027
20524 -165027 -137400 -118715 -84453 83175 167612 239814 277099 227997 219108 143026 -13282
20513 -13282 -32094 -55993 -109699 -112602 -68884 5020 78951 50903 111529 131056 11786 51546
20501 51546 117827 32520 -21184 -46838 -33160 -18669 -88156 -88847 -61060 -110140 -92806 -26633
20489 -26633 27378 66556 82715 13663 -89440 -134692 -174081 -106811 -251 22553 65268
20478 65268 3274 -31877 -39333 -12207 33105 -48149 -75904 -96553 -225123 -289514 -274262 -135794
20466 -135794 -26721 -45357 45753 -26615 -152531 -40506 41921 -42002 -107325 -30675 10710
20455 10710 -31113 -98282 -133839 -70296 -2597 31879 25075 -25480 19516 1843 -66480 -71298
20443 -71298 -20335 33317 106455 91057 60345 35169 85474 48760 77658 230606 154399
20432 154399 22296 34988 51741 -11393 38259 86765 71535 -17573 33492 16353 -80183
20421 -80183 -228830 -218069 -130676 -120049 -77694 -6201 8445 93928 177879 248741 281913
20410 281913 269253 -13461 -103484 -70126 -63907 -181054 -68379 18123 83811 118390 65579
20399 65579 124469 129161 58344 66479 -22375 -42439 -56117 -138984 -89184 10897 7759 40098
20387 40098 50576 -76450 -58787 61823 48678 -8193 -60388 -46544 -42519 -69956 -70700 -72893
20375 -72893 -138811 -149961 -78966 10885 13218 -121218 -184126 -220100 -229218 -272784 -168043 -127676
20363 -127676 -202572 -206513 -171413 -120334 -109747 -35924 -79918 -192455 -215334 -317245 -207505
20352 -207505 -134941 -62068 -45394 -53971 -21532 80511 115902 87447 25812 49309 141991
20341 141991 48706 -63337 37604 94668 224613 227412 59177 -49693 -79289 -111718 -139288
20330 -139288 -97119 -129060 -254485 -257980 -259596 -329109 -344249 -198619 -91056 -63011 -94321
20319 -94321 19556 111372 168096 142557 120083 60047 -116968 -67364 26383 -8371 36703
20308 36703 93691 165954 260366 217331 143313 72566 29006 106357 350 -62209 52841
20297 52841 168757 50614 88780 177275 294342 363947 303442 217320 110247 -46277 -15698
20286 -15698 -52245 -168465 -202067 -107706 -76383 -70428 -112930 16463 107524 98436 131233 150393
20274 150393 190340 125523 43235 88714 -15298 105602 214581 119094 46339 -5940 -53732
20263 -53732 -75550 -120188 -89699 -52771 38734 35170 89465 163030 134766 123813 84211 111969
20251 111969 54770 19226 38442 -17979 -94516 -65119 -52266 25353 -15836 22286 47895
20240 47895 55917 25764 -17819 39969 38958 18241 140811 218450 311305 322137 439156 363759
20228 363759 285264 211186 87871 72728 114418 122490 81075 65927 64206 41164 -2726 -14252
20216 -14252 79697 152911 147688 188460 249470 250677 103547 -29793 -90841 -69743 93220
20205 93220 126814 136122 249468 141235 153562 367136 461062 608247 1102815 1620653 1884366
20194 1884366 2068288 1991479 1638735 1175890 761387 525073 284960 164363 253804 354180
20184 354180 469564 381951 283412 144190 171748 156989 147669 141902 6467 -13196 -13160 -50885
20172 -50885 -34057 127682 131518 124380 95475 16109 12346 -70731 -104301 -23379 131845 154497
20160 154497 15494 -544 142634 116189 79227 78816 36249 165295 216192 148191 172919
20149 172919 241236 265123 178898 172183 130463 110710 99096 239238 270040 169261 87521
20138 87521 87254 160176 251695 140390 67225 81862 71611 235918 287274 274719 178554 85538
20126 85538 -306 -121975 -133243 -96979 -25127 12688 75822 78717 98197 31950 -16712 37714
20114 37714 58160 106214 116837 88666 125585 242879 155269 94633 110802 33898 61594
20103 61594 133615 189527 203448 180257 95784 64575 60058 -89266 -53478 -62864 -202920 -157832
20091 -157832 54250 87949 30487 -31372 16373 4429 40304 -19134 42795 -37457 -120627
20080 -120627 -53938 60062 55146 -120249 -169242 -150106 -40873 27386 177760 193711 170953
20069 170953 -12484 24807 -23185 55442 316148 275440 242787 197249 52676 -59534 -65915
20058 -65915 38834 131615 64450 -1201 -95614 45820 103727 -47561 110357 142467 112916
20047 112916 26717 -57206 -82433 -169927 -242545 -225268 -169092 38463 80363 82337 -4974
20036 -4974 52369 42355 28283 60500 142946 198016 221945 239565 151748 86155 34764 43000
20024 43000 -44853 -88362 1166 107455 102300 36352 -37214 -114057 -168023 30370 142691
20013 142691 86649 -26383 23289 -22327 -11964 95980 199596 120909 -108791 -69321 -80209
20002 -80209 -88880 -95377 -64989 57072 34221 46514 29161 90846 105904 26705 -31402 -1889
19990 -1889 41071 58972 72386 81530 23926 -12152 31852 80861 114213 84922 13166 -20193
19978 -20193 -111173 -154837 6515 27594 2709 7998 31585 50606 -56597 -111181 -2896
19967 -2896 15935 100638 109966 181271 186542 100199 56187 1877 13956 -93684 -99394 -14119
19955 -14119 -23618 46540 141326 189628 190329 150218 97931 67926 73214 8065 -57043 -8582
19943 -8582 35779 41095 39467 -90855 -41471 42503 50501 146204 138752 135495 70026 -19679 -27856
19930 -27856 56482 106722 204999 278521 298776 236090 263918 337125 215578 44511 1587
19919 1587 40413 106551 84381 47691 47762 152584 178505 148337 140729 184534 137781 81918
19907 81918 75973 121541 116371 46217 41275 67003 39743 80467 46723 92045 180178 53355
19895 53355 -35577 -34150 -100531 -42594 -75701 -66116 46912 33124 16859 79891 113701 25683
19883 25683 12878 110344 127995 98821 76116 39357 -98264 -72375 10266 61958 -58918
19872 -58918 -86682 -102780 -29304 22906 -72832 -61311 -102720 10439 148648 178545 246668
19861 246668 315038 414970 535863 479051 524574 530296 695109 677772 623302 761364 944805
19850 944805 985613 1098658 1197312 1134679 1156377 1184502 1005805 788728 717366 675204 746150
19839 746150 769348 733392 750522 645537 785043 796823 613042 562091 600287 448859 267965
19828 267965 145440 221319 244389 207334 107817 121790 226946 128520 -46950 -53917 -100709
19817 -100709 -32676 95802 41891 77278 197248 151164 166855 199598 218942 254026 258270
19806 258270 213212 129349 109871 185147 324295 388608 316801 323054 281316 249145 208490
19795 208490 119865 195186 297101 204608 192357 99259 93620 82330 199460 169533 100561
19784 100561 22120 52303 53541 114704 181790 156442 83448 -58532 -53946 70013 156372
19773 156372 198612 117688 57200 64615 68750 145257 324662 466163 409967 363438 150621
19762 150621 64365 74632 92084 100330 219292 283053 270106 272748 299490 263594 347698 440048
19750 440048 321632 285087 299345 208807 134521 117139 190712 227145 243273 177676 137652
19739 137652 208638 298981 309515 248830 237950 115627 103774 183979 152640 184290 139080
19728 139080 141947 231959 239602 200061 146152 144930 263479 413729 435194 371737 451853 548560
19716 548560 639169 628052 545906 504160 518198 630454 647690 510561 528831 533343 450787
19705 450787 352805 254917 202377 229798 316370 322596 465568 556552 554740 475459 356502
19694 356502 306251 338452 371748 431799 509038 459426 475092 510304 622656 658155 616519
19683 616519 494333 497580 476978 528126 599590 680258 800539 860749 664280 555223 690442
19672 690442 717283 791866 880884 747898 599755 568926 494798 493194 697557 690660 701468
19661 701468 779879 830101 804785 763329 662855 664238 622731 529145 523336 535278 562084 594103
19649 594103 626102 670092 777692 781605 777908 823398 829902 828705 735448 694143 746863 796849
19637 796849 889975 1056423 1013850 939258 945577 974962 1155466 1345529 1367102 1472127 1662468
19626 1662468 1853892 1883998 1883177 2013915 2311227 2552294 2765706 3092571 3643591 4228673
19616 4228673 4980001 5626281 5939054 5881888 6042166 6564179 7226535 8194509 9404552
19607 9404552 10776128 12324544 13989678 15579141 17732369 20827323 25698930 32840752
19599 32840752 43401439 60183641 88813100 139112415 216757631 303239241 372897736
19592 372897736 421218624 405608569 305293570 199553944 135811628 101477274 80640968
19585 80640968 66204062 55694346 48079384 42611679 38549702 35500345 33306090 31516808
19577 31516808 29879053 28235776 26458149 24775813 23302887 22276700 21753877 21349271
19569 21349271 20897732 20443495 19683403 18432038 17306852 16395079 15680678 15160849 14822332
19560 14822332 14435241 14012238 13590759 13218807 12879255 12641074 12510833 12426769 12225363
19551 12225363 12176772 11927088 11510925 10955432 10432386 9942753 9334944 8900260 8634104
19542 8634104 8320517 7986528 7592095 7411066 7224521 6927143 6708114 6448276 6200302
19533 6200302 5940075 5672820 5621317 5543471 5268495 5133249 5066530 4991985 4659468 4613998
19523 4613998 4536697 4361891 4184732 4026621 3963041 3881402 3855294 3706885 3553152 3436866
19513 3436866 3405732 3331754 3107988 2949067 2874714 2767081 2650642 2498850 2548157 2665764
19503 2665764 2689621 2552805 2389252 2316337 2144623 2002626 2029425 2026197 2012143 1986665 1998784
19492 1998784 2101945 2030727 1942430 1893331 1856732 1828862 1818980 1671816 1442581 1353149 1432758
19481 1432758 1489337 1518165 1340823 1112254 1176053 1286847 1308735 1305574 1350675 1282173 1237867
19470 1237867 1157890 1055638 1001019 955510 878658 739898 721663 758635 716205 555778 588939
19459 588939 569276 527899 486226 499851 464859 452986 472864 459487 519820 558580 602997
19448 602997 583808 456958 493540 667184 670253 551124 529105 455311 593136 714365 823513
19437 823513 873796 903390 902718 688606 675982 647596 568055 680383 707099 690430 621071
19426 621071 651600 668134 726501 702607 749800 805240 628708 655239 694083 779248 870570
19415 870570 791759 739759 669562 658996 544269 555578 555536 626226 652229 652757 657452 646885
19403 646885 728676 851264 982079 1029617 929178 785193 784598 809125 862633 934420 1048854
19392 1048854 1168203 1221462 1008031 818238 805582 724470 660386 657843 614874 802234 873568
19381 873568 1062259 1068143 1062497 1012051 1034177 1070165 1121206 1156464 1287727 1294028 1217668 1187455
19369 1187455 1206256 1201158 1192537 1213087 1197003 1197176 1332808 1403402 1409627 1583640 1734198 1934305
19357 1934305 2278580 2426008 2649414 3027100 3320603 3677424 4061290 4398951 4668453
19348 4668453 5046863 5702890 6426965 7342239 8749661 10419699 12573763 15584642 20620736
19339 20620736 28482875 39214533 50476367 60913969 70463803 74044157 73337345 74466854
19331 74466854 78347458 82674364 83489311 86700921 100067243 119021200 138647138 158505896
19323 158505896 164201253 154580760 147365928 140801006 127427127 107958347 88455388
19316 88455388 78562181 79430308 86386890 94650461 104881088 111302421 105680282 97508751
19308 97508751 91460411 79052356 61654788 48446235 40140814 34681057 30706423 27802139
19300 27802139 25701736 23977294 22641362 21520519 20551567 19696608 19023359 18314223 17440654
19291 17440654 16634363 15861500 15331047 14738674 14068651 13589301 13173145 12732186 12437546
19282 12437546 12105728 11674657 11182916 10917742 10599318 10236569 9769018 9317076 9081486
19273 9081486 8775339 8518320 8328270 8139963 7902914 7592999 7276525 7056676 6875753
19264 6875753 6724870 6620968 6425373 6217059 5911472 5690590 5366969 5168073 5068657 4972391
19254 4972391 4764471 4663090 4378332 4220761 4133912 4074564 4058576 3999268 3864747 3748332
19244 3748332 3598524 3616741 3412908 3284544 3226224 3180939 3222688 3196340 3022515 3066812
19234 3066812 3056733 3077498 3243679 3465472 3670774 3883509 3978558 4149209 4048292 3896903
19224 3896903 4052699 4262259 4539923 4923149 5424934 5643229 5786917 5912405 5733693
19215 5733693 5332684 5112789 5325903 5405826 5098567 4553407 4007690 3787729 3906746 4072748
19205 4072748 4167350 4181895 4021302 3883865 3767568 3599289 3150379 2733057 2390475 2110934
19195 2110934 2040971 1803426 1620270 1528930 1563721 1560423 1468409 1358417 1283749 1304657 1325195
19184 1325195 1339469 1252881 1111644 1037136 1083348 1060924 1126612 1096297 1073195 980797 990853
19173 990853 979871 1054835 1006360 967240 941163 960250 930316 868533 793208 792555 888410 903054
19161 903054 967683 1014624 968167 995987 1007701 1096556 1279596 1514573 1715144 1814211 1848536
19150 1848536 1861549 1687456 1428207 1247118 1075037 1063611 1114086 1115447 1098930 1146169 1276423
19139 1276423 1365795 1329343 1438656 1628797 1858677 2150802 2444354 2668935 2543026 2142291
19129 2142291 1823244 1576449 1287937 1150345 1216331 1345063 1493210 1588793 1649588 1695876
19119 1695876 1782595 1998194 2281524 2329515 2382964 2550382 2798516 2973265 3094236 3168312
19109 3168312 3326350 3621863 3942330 4338683 4851701 5451182 6147884 7162473 8718918
19100 8718918 11177044 14920521 21066293 30330525 40391703 48315559 54340275 53249286
19092 53249286 43028986 33761622 29698742 29703692 33776853 43119478 58815010 76936098
19084 76936098 91036760 101222753 98180954 76072575 53938686 40944983 34200105
19077 34200105 30684208 29760841 31624212 37133967 45278890 52133856 57119546 57983390
19069 57983390 48480080 35961600 27986611 23457234 20737167 19077455 18020940 17374475
19061 17374475 16870556 16650483 16838185 17324751 18172137 19688341 22252356 26626237 33750243
19052 33750243 43764212 53778754 61558777 66745617 63150928 52346526 44709923 42861923
19044 42861923 46321007 55522752 70167072 87289191 103130161 111983191 108896652 93976600
19036 93976600 72454525 55662615 46428832 42095018 41564729 44981410 52225251 60307472
19028 60307472 65995239 69268482 63923229 49724504 37543094 30087157 25432841 22329204
19020 22329204 20028245 18401881 17114135 15950233 15034216 14304289 13778870 13239666 12775107
19011 12775107 12255896 11730488 11311559 11049582 10716150 10307192 9834539 9362792 9174030
19002 9174030 9026575 8861430 8612628 8281189 7868940 7605421 7426671 7497491 7406648 7415944
18992 7415944 7440800 7352911 7476980 7516908 7367074 7223124 7564490 8067591 8740120 9507078
18982 9507078 10362234 11012723 10985277 10448283 10057797 9328276 8324435 7604597 7047491
18973 7047491 6446345 5773336 5241310 4878757 4582960 4529143 4500677 4424810 4327703 4251591
18963 4251591 4318366 4498080 4461750 4130007 3641860 3456859 3306785 3020593 2966498 2898425
18953 2898425 2950809 3101640 3218954 3364751 3618619 3587808 3388687 3117899 2950425 2895960
18943 2895960 2906320 3060860 3249332 3325039 3286837 3182156 3152224 3282112 3343572 3479995
18933 3479995 3555183 3272272 2906100 2754413 2650077 2533823 2440026 2650545 2988273 3307213
18923 3307213 3589198 3483363 3071439 2721664 2516157 2359047 2105670 1847155 1752559 1696912
18913 1696912 1695748 1474975 1439413 1496461 1523039 1340502 1127258 1006523 1062004 967670 917210
18902 917210 819085 769424 746009 764566 816558 924457 953762 923835 817949 583423 455352
18891 455352 533234 608925 671913 679208 713993 743890 726568 643309 644212 582761 540834 613852
18879 613852 686569 639736 599938 765965 902357 1059468 1205517 1276612 1319814 1284244 1128317
18868 1128317 969916 826630 581267 565576 596683 611310 608397 562928 562975 535596 457831
18857 457831 440586 387078 328117 226716 285354 275066 313430 449049 515217 594590 502951
18846 502951 463712 340230 275432 189611 270364 411878 442281 353956 346237 451324 454943
18835 454943 489393 598817 650637 633384 542865 482401 552134 541822 464627 443538 503630
18824 503630 534113 618945 643910 641328 686445 755325 701736 514841 419191 472303 500673
18813 500673 339456 361709 366744 463788 489441 481050 461434 488970 601011 594953 585467 651395
18801 651395 673207 700083 916184 1088743 1062361 1074983 1107758 993999 981450 1021503 1046633
18790 1046633 1017412 799061 535931 401568 442954 536309 655338 782246 726699 702262
18780 702262 783045 712129 749832 665521 320054 173730 161176 141740 67592 233236 408181
18769 408181 530097 504530 464714 600599 806650 1071555 1141936 1136072 920900 673016
18759 673016 539724 504222 495547 424321 493810 419700 432649 375890 247112 149111 126110
18748 126110 217333 286531 276262 177228 79746 58445 108144 152080 359062 399473 243663
18737 243663 191952 96502 25804 73357 88452 82962 203695 147392 120493 102082 35628
18726 35628 -7567 36380 83359 47289 65917 160344 185956 211761 130941 46233 120601 166277
18714 166277 68429 102393 105500 67575 52861 124872 158723 250769 278201 262396 77699
18703 77699 53741 102738 170819 203402 248561 239259 303078 360521 246650 157509 158238 251355
18691 251355 277018 106670 223577 287288 117035 -18705 -111197 -102403 -22213 -3904 7991
18680 7991 12845 88109 -11662 36476 102576 36366 20416 35104 128382 174649 156900 72600
18668 72600 -10684 784 30816 68106 190288 124747 51307 55102 133038 223483 212123 223703
18656 223703 257852 231910 295324 356103 427116 359769 284531 219391 235753 258199 318643
18645 318643 343983 216539 91950 141420 270722 238553 200894 122281 105017 142436 194285
18634 194285 133229 35071 18494 7741 118814 183239 239733 332537 233337 60717 96512
18623 96512 206838 161463 48697 2112 159499 152614 219199 225435 180449 238633 257371
18612 257371 229843 194853 221976 281142 344639 309135 215459 334192 493645 422366 398093
18601 398093 426253 425449 299786 266858 275084 194173 224750 210855 115063 3570 61782 47737
18589 47737 13282 46792 184683 265389 195357 372436 491666 453808 556647 607656 564971
18578 564971 468023 427305 380558 411566 400091 451402 466683 466484 580632 755513 779267
18567 779267 667277 701957 730684 667846 707365 509773 441216 463049 504673 570007 582867
18556 582867 508169 304893 255980 383980 460976 461592 553341 556057 557013 560144 556128 507100
18544 507100 434408 394807 430630 543317 699065 813161 847926 891579 918858 936340 921344
18533 921344 994598 964006 918961 975671 1078974 1052290 981736 976028 907030 1049121 1123677
18522 1123677 1094414 945151 889952 981081 924624 966174 1147374 1218888 1086870 1029499 974701
18511 974701 984295 1007117 858570 850820 868531 837960 670313 714416 706175 636340 643690 787807
18499 787807 880217 863488 917524 1021028 963444 884139 884721 1013171 1255031 1461220 1383079
18488 1383079 1375525 1357326 1388390 1300973 1346562 1519382 1451121 1459266 1738096 2050071 2244905
18477 2244905 2251828 2325740 2573814 2850011 3183757 3829044 4773368 6249829 8528634 11259395
18467 11259395 13503856 15214572 15292474 12778107 10467112 9526471 9949805 11539395 14779065
18458 14779065 20321723 27414595 33162888 37475420 38323288 31173848 22425191 16995304
18450 16995304 14425432 13234802 13072344 13985608 16368047 20528832 24636458 27462910
18442 27462910 29440208 27141470 20888263 15993350 13130667 11445357 10502904 10035107
18434 10035107 9887324 9852335 9910883 9912923 10094185 10462419 10967471 11417123 12047056 13043899
18424 13043899 14500628 16749490 20041022 25015545 32759965 44939864 62752695 81587445
18416 81587445 96173614 107463442 105470212 86474358 69814618 62670135 62892838 69935269
18408 69935269 86260877 114329482 149027592 178132755 202091403 209862087 187012869
18401 187012869 165137064 160925668 165486348 175664995 181915573 179530560 183480711 195349126
18393 195349126 207447459 202693124 178313550 144287128 109375868 84811580 69668877
18386 69668877 59927779 53078103 48026669 44134914 40886240 38410674 36310690 34515486
18378 34515486 32827831 31244983 29954560 28776808 27636442 26843502 26170005 25523602
18370 25523602 25146907 24799313 24586493 24446912 24375987 24406245 24827055 25436634 26528599
18361 26528599 28138330 30658386 34703532 41527562 52880834 69580245 87929503 105695675
18353 105695675 124668368 133854627 128762950 124625644 120428846 103065405 82400782
18346 82400782 67625576 56640934 49318951 44600900 41266178 37125250 31949145 28100433
18338 28100433 25291885 23151258 21496777 20111731 18877619 17830284 17112627 16501224
18330 16501224 15926951 15537442 15126390 14844099 14542369 14241630 13949648 13783505 13531848
18321 13531848 13184794 13010032 13065585 13029173 13099792 13470745 14043295 14584451 15310949 16131094
18311 16131094 16406293 16687067 17446562 18767226 20725948 24570134 30711863 37072378
18303 37072378 42979746 48547990 49184237 44893840 41712184 38751949 31779563 24142832
18295 24142832 19060349 16022716 14071232 12680621 11712868 11115796 10766446 10631114 10429526
18286 10429526 10345830 9950338 9067757 8277574 7693618 7338173 7097248 6923762 6673069
18277 6673069 6392348 6199560 6070785 6057340 6046973 5992207 6323557 6748877 7051926 7442970
18267 7442970 7682484 7499082 7117525 6801890 6447385 5743244 4988691 4436454 4083095
18258 4083095 3893984 3678683 3443403 3252617 3221437 3169591 3005653 2842023 2722606 2621145
18248 2621145 2451921 2357588 2338286 2435072 2427051 2284158 2211783 2172956 2016249 2036913 2115427
18237 2115427 2141300 2000133 1943521 2017875 2023511 1963185 1837901 1833568 1860943 1849821 1783629
18226 1783629 1643322 1519640 1458885 1527164 1562559 1541165 1580994 1690759 1679869 1707634 1772756
18215 1772756 1840866 1779493 1649186 1582906 1515730 1341604 1226183 1227613 1210373 1215623 1318465
18204 1318465 1433096 1377247 1352375 1388637 1362941 1271782 1244217 1114528 930764 928755 1011375
18193 1011375 1016210 963510 912330 923288 925323 869805 827167 687939 637195 620444 606270
18182 606270 598259 563923 534068 619334 645339 724264 814589 814298 879899 899041 746446 665353
18170 665353 665244 750528 843502 817418 690428 498503 572135 678304 766636 859184 883955
18159 883955 813906 733063 725501 620045 649561 756644 769676 769601 794263 752328 771492 774336
18147 774336 660771 658457 604858 451509 459995 545516 683180 700818 697410 774607 762719
18136 762719 752983 831759 895896 975022 1040785 1002596 997787 1059459 1218823 1257502 1335850 1668893
18124 1668893 1999450 2292071 2636495 2924659 3251684 3449207 3847783 4524197 5382534
18115 5382534 6495676 7956715 10147922 13231631 18019624 26221632 41163916 67228317
18107 67228317 102039678 129345388 150989983 160441121 124434255 78188329 51746198
18100 51746198 38042077 29987129 24648380 20909470 17968550 15790795 14315720 13147392
18092 13147392 12179487 11190507 10393944 9685357 8970123 8427787 8135920 7800981 7551509
18083 7551509 7086152 6801056 6599199 6350306 6158250 5938598 5793220 5678297 5462363
18074 5462363 5154917 4988311 5006175 4927710 4797703 4634186 4551785 4448822 4500177 4519765
18064 4519765 4478338 4336756 4306992 4249861 4100845 4203675 4305616 4556387 4992217 5509071
18054 5509071 6024660 6487499 6783785 7014395 7405916 7970525 8508182 8773343 8163477
18045 8163477 6994803 6447611 6321695 6219697 5932956 5283822 4399384 3619719 3145109
18036 3145109 2906760 2731027 2599963 2523663 2483824 2307376 2125782 2017831 1971096 1885244
18026 1885244 1877234 1829612 1711633 1664473 1610631 1562339 1459548 1374056 1413941 1419259 1375514
18015 1375514 1287336 1166175 1191496 1135088 1037272 997440 919193 785296 726690 863213 993989
18004 993989 866034 644962 616526 488465 659371 750264 684687 624787 699416 784094 716582
17993 716582 787188 742399 689067 638478 593914 680602 782630 795339 829929 834838 760499
17982 760499 698784 645663 615417 451582 508007 577321 647475 472449 269041 254507 273100
17971 273100 227498 112180 118945 176630 311891 240148 170065 177814 308502 340662 283552
17960 283552 194193 341617 341252 163372 88084 47873 4279 -30740 -52071 -40657 5759
17949 5759 136350 171666 231670 296785 283705 304860 229548 143569 149201 201595 113994 92802
17937 92802 169554 21273 17813 100234 152757 222483 243847 189026 195222 313768 306703 410554
17925 410554 426921 435855 421279 462680 575374 590020 562024 495450 458053 476135 419470
17914 419470 341716 267810 336244 304001 346356 455737 615192 616766 487372 342217 310270
17903 310270 348320 295933 363790 370799 345217 324769 114885 16002 64746 159349 185521
17892 185521 131694 190399 328457 477983 564382 586913 603823 508423 377286 304218 274138
17881 274138 240899 192831 148202 165020 252665 238391 152694 243891 211430 185019 244157
17870 244157 398053 472007 371883 236058 303693 347217 320026 355807 306421 327866 277514
17859 277514 247682 180757 116242 155321 315462 435994 559156 605792 555101 431469 337960
17848 337960 299410 230906 150189 243196 363045 449768 456043 708864 806805 957530 993451
17837 993451 994873 959706 913141 893547 771269 645950 663961 670542 581662 381719 179410
17826 179410 26465 19991 9841 -42144 31926 171990 320976 417308 266277 175665 194107
17815 194107 71417 676 79354 154332 142368 173174 247933 323058 340563 290833 400946
17804 400946 461394 451808 369785 268960 230195 230332 163468 49652 6018 24196 99365 166180
17792 166180 168024 243622 300129 302731 326198 374311 369009 414204 328305 158276 48731 53154
17780 53154 9128 20104 -63952 -86807 -100867 -84789 -88647 -117238 -87011 -32108 -45373 -10928
17768 -10928 -25915 -33697 111262 101296 76771 26070 -52177 8247 51817 -20301 -6681 -17561
17756 -17561 28393 -14108 10344 -173812 -273738 -222895 -184699 -146662 -17755 43592 24480
17745 24480 -7844 34909 59303 95122 154647 78534 100239 142794 74530 7263 -7742 -24488
17733 -24488 -5423 89060 87836 92463 -5541 25702 173237 265246 249537 102614 38186 65715
17721 65715 -24406 -14835 3891 -55878 -58545 -65273 -116762 -70512 -90207 -91382 -84245 -65732 -78435
17708 -78435 -166489 -168245 -90657 52985 1072 -104445 -33456 48801 161957 233398 116276
17697 116276 22170 50513 12456 -76063 -38324 -23537 -101072 -26879 32915 -52998 62311
17686 62311 197512 128681 -16838 228 103089 104959 105721 90096 61131 34395 66223 110525
17674 110525 196141 176594 218542 239554 125765 71421 48781 80881 77542 -2512 -11094 -30054
17662 -30054 -123442 -137007 -179026 -26815 103675 46944 23528 51683 58175 34972 11873
17651 11873 -60749 -96846 5968 64875 -44299 -60364 57561 85962 21465 -3569 -97247
17640 -97247 -180443 -52849 68053 108572 166290 42066 -38591 39768 -69140 -160161 -129770
17629 -129770 -83907 -46157 42338 58486 35403 -38782 -65671 63089 171459 147154 96217
17618 96217 100758 40049 -9671 -74513 -131560 -86825 -135713 -108761 61761 41122 46549 4021
17606 4021 -117235 -107020 -88812 -45900 -104174 -70098 68543 62415 -68701 -163412 -153931 -144004
17594 -144004 -72498 16552 -49193 -97495 63455 161448 163723 166352 89868 42389 -21749 -67471
17582 -67471 -59896 17867 87079 -23409 -74931 -68450 -10718 156100 235758 61773 -45322
17571 -45322 -63420 -3787 -7448 138866 256054 184126 183081 132594 -53287 -146851 -193381
17560 -193381 -169960 -95589 3658 30567 105675 81779 63809 -16801 22043 15651 18985 -1338
17548 -1338 -82995 -54042 -57130 -28243 -12754 -22489 69120 -89003 -102493 -94961 -2125 -25066
17536 -25066 -99084 -168245 -84882 -51484 -106834 -176721 -146115 -119435 -142286 -118874 -61265 -57749
17524 -57749 -140049 -144428 49031 96077 -72452 -61572 20398 8898 -930 47683 27283 -45381
17512 -45381 -26878 -113008 -85907 60908 46751 -12139 -48381 -49790 11112 -47213 12494 125938
17500 125938 95561 138071 156472 170703 164100 16180 45412 40822 -665 -64954 -98828 -115763
17488 -115763 -23327 113990 270289 233388 217066 143778 67111 85238 126568 47707 -28308
17477 -28308 -36770 24160 -34539 -22740 -53564 -117729 -133467 -73991 -103166 -118215 -152733 -182388
17465 -182388 -160239 -177549 -114645 8191 -1816 3631 -11929 -74570 -47155 117094 -19054
17454 -19054 -146407 -80568 -12481 72437 50876 12558 39027 156183 172274 177773 204903
17443 204903 253704 397924 609911 866392 973413 1003341 932320 577609 337165 250304
17433 250304 196924 221183 161224 74384 67283 109348 111518 203794 95133 16379 35078 25427
17421 25427 83264 172843 170264 211871 139605 72099 24848 26731 -1307 -63479 -47598 -18899
17409 -18899 10392 -61594 -139893 -137367 24787 -19314 -41695 -92468 -108140 2218 -26059
17398 -26059 29326 32203 -58064 -78376 25714 43164 -72008 -74537 -32863 -136040 -185736
17387 -185736 -200298 -151959 -133803 -198525 -274303 -136467 16239 54314 68200 130529 47911
17376 47911 -57130 -163473 -106270 -77741 -90900 -112815 -119156 -167961 -181077 -135502 -91707
17365 -91707 -61926 27617 74496 -83826 -74449 36815 119941 34343 -2731 -104790 -118151
17354 -118151 -21037 61260 98682 246757 294452 216167 239716 222496 140893 -74737 -165132
17343 -165132 20328 81291 21371 -12125 92785 163271 146374 115494 85122 147559 107603
17332 107603 76323 66292 70853 5315 20384 -721 -86762 -86942 -37693 -58780 -177271 -129832
17320 -129832 -52144 -168994 -86856 -48437 -130120 -111621 13442 2727 4774 -33256 -84447
17309 -84447 -217231 -249810 -251335 -233213 -78109 -44331 -158398 -121949 48228 112466 119082
17298 119082 88200 40262 128429 140125 85830 94288 107162 88531 153772 173963 213377 157038
17286 157038 49364 64419 101680 140980 121997 20845 -45153 19587 192922 247914 169076
17275 169076 104109 6759 60357 162079 169012 109015 71749 -2416 10365 17416 -7335 15600
17263 15600 6898 24583 39390 24977 -20592 -194547 -284503 -194013 -206548 -179179 -120994 -68332
17251 -68332 -137430 -75688 -117541 -121391 -89410 -99017 -54829 94806 19829 -44650 39971 56072
17239 56072 78434 68790 67121 50182 -47493 -129759 22234 -39705 -135244 -178665 -161265 -58749
17227 -58749 53807 17893 -40189 -92656 -90783 -1571 203275 182918 145553 130931 79808
17216 79808 117733 62314 114885 202300 242305 153403 -27755 -114180 -153755 -77868 57732
17205 57732 43123 29725 119120 161562 36337 12255 116794 150864 117166 -66397 -223039
17194 -223039 -237644 -190551 -138289 -84093 -45742 14812 -34291 -41985 -82310 -173112 -67292
17183 -67292 -70433 -54211 -73689 -160243 -131670 -196721 -161920 -22766 71397 89707 132150 156989
17171 156989 142905 9193 -42644 -3174 36130 -77340 -61630 -28166 119219 101099 -45777
17160 -45777 25399 158214 210053 161892 -23789 -33056 -90317 50762 -6955 -104711 -114777
17149 -114777 -67882 -9397 33747 -16944 -99734 -143846 -58072 -79720 -101151 -132491 -181157
17138 -181157 -111994 62110 54132 117648 187342 102551 7907 -58658 -142037 -142742 -35740 34683
17126 34683 -11469 -45113 -42593 -99823 -191265 -128125 -37971 33545 70115 -48251 -113705 -57576
17114 -57576 41456 81357 -94180 -165771 -64242 -40582 19173 94068 99453 -7539 1879
17103 1879 15974 8936 -3585 -111078 -92289 -75702 -187076 -140803 80848 153138 123779
17092 123779 119311 66619 51851 19542 -45057 -98997 -67379 -164418 -93403 27667 -72111
17081 -72111 -34877 28822 -76255 37201 49612 69598 28391 36617 77462 21004 -62883
17070 -62883 58993 112067 -50134 -172722 -98741 -141599 -65876 -66757 -1754 145483 148696
17059 148696 72983 31238 21633 8903 14117 38884 83394 124978 184802 19671 -131585
17048 -131585 -81866 -53969 -138754 -104779 55858 150202 135689 71735 -58955 2075 99960
17037 99960 92114 37312 -67716 -65339 19908 -24378 -93012 -143115 -95041 -90601 -14878 57183
17025 57183 30927 -9116 64558 -11268 -58689 -5768 37021 1634 49004 40365 93528 55282
17013 55282 64306 26422 -7449 -43607 -82957 -40405 134094 40083 -10236 -118431 -31823
17002 -31823 54230 14330 -14705 42614 9703 -81453 -160425 -133646 -152338 -164628 -111013 -143581
16990 -143581 -171543 -85065 2090 56650 142148 167956 139978 54029 154623 170871 125706
16979 125706 197559 152120 132423 116810 61428 -120391 -168767 -136354 -103405 -162398 -191861
16968 -191861 -55454 26229 -870 -44742 23588 18739 -30769 33286 118412 86462 80752 53837
16956 53837 159069 186781 140361 183848 127214 156181 186886 28451 -19854 -62115 -140197
16945 -140197 -94386 -28441 -74976 -136309 -93705 -92220 -79669 -89381 93240 93091 -69656 -130943
16933 -130943 -166942 -184801 -177009 -72790 -111802 -186131 -82208 -156243 -200334 -141593 -80957
16922 -80957 -102907 -98825 70714 125365 178458 105089 206241 277253 280267 280885 128191 -22925
16910 -22925 -60626 -118821 -33703 -50936 -40274 -106829 -77953 -40099 -60479 58434 125044
16899 125044 99109 39378 -79802 -126545 -165281 -111335 52789 62736 95794 102391 -22005
16888 -22005 -129853 -26894 28960 -24023 -48436 44295 -19760 -148584 -159389 -150176 -42318
16877 -42318 -6040 -101225 -125843 -39264 -5918 -113282 -204161 -192837 -149406 -160680 -80050
16866 -80050 -79391 -54939 -135612 -162070 -126961 -34023 3392 138286 68625 1046 21440 30865
16854 30865 59350 59468 62115 63075 66985 29448 92241 135234 155835 114100 102635 73354 86794
16841 86794 48305 69650 137674 172833 170462 75857 -17064 -36864 -25225 -98383 -49384 -91959
16829 -91959 -192435 -171520 14494 19822 -47236 -65031 -104302 -74260 40767 -31690 -148968
16818 -148968 -132379 -99388 -174260 -317007 -317029 -267505 -92461 -38078 113206 132659 33327
16807 33327 57912 137434 102283 -52882 -117920 -209832 -117364 -41627 116862 141161 150946
16796 150946 121262 113737 -5052 -49752 -7058 19362 66590 113010 116438 41052 -95079
16785 -95079 -193068 -174144 -17180 68680 26232 -136540 -268802 -302093 -226621 -196387 -196889
16774 -196889 -154482 -186827 -247560 -231861 -174375 -166968 -176288 -228673 -253582 -187632 -109730 2886
16762 2886 193251 259151 75913 -25437 -25875 -59174 -80216 -111835 -145744 -56165 41113 54241
16750 54241 -81830 -223305 -120677 -27468 -31867 -57322 10264 109125 81344 33487 -6460
16739 -6460 -69150 -96390 -137606 33025 207560 157276 167436 193229 69176 -28040 6033
16728 6033 -13149 -48704 -64743 56843 153957 226436 165008 65895 58529 54354 23577 32955
16716 32955 -89003 75455 216957 116829 98667 108000 86493 36539 -36674 -1835 58902
16705 58902 136176 146346 187023 77567 -60843 -1756 -58465 -125449 -143618 -33714 54593
16694 54593 32740 21434 -43395 -69475 -112020 -63458 -41861 -102323 -200902 -250289 -130734
16683 -130734 -157396 -243626 -131297 -6718 -43350 -113647 -26039 29734 -10200 -85264 -86169
16672 -86169 -132939 -147640 -181487 -129395 -148645 -146202 -183669 -137966 -43685 -125997 -25619 48847
16660 48847 45455 28440 23977 27167 116656 20429 -13176 84444 186848 149711 37207 1472
16648 1472 -3771 -64735 -63544 -125121 -61312 37083 28626 -16853 -42193 -81390 -157281 -103878
16636 -103878 -57661 -6488 -53278 -76848 -24135 89351 32672 5648 -35939 4610 52603
16625 52603 31822 -41862 -99087 27302 -40421 -179342 -254657 -258008 -304922 -303385 -251378 -75626
16613 -75626 19968 -5461 43185 126072 158452 164314 130723 131187 82452 70698 68988 25464
16601 25464 115803 200622 252306 320195 221935 16250 101497 86553 83020 120181 74082 154111
16589 154111 131107 174010 185577 219219 125925 91203 96089 124638 60969 35154 -8759 24526
16577 24526 59427 -10521 -99388 -130991 -57664 -65918 -18289 199575 213687 137367 56918 26689
16565 26689 -55778 -36977 -221339 -262712 -144258 72032 45647 -41977 -46571 -105885 -65862
16554 -65862 31029 -12753 -10179 17478 102549 17399 -870 -66521 -208663 -179975 -196986 -275649
16542 -275649 -171479 -106110 -110032 -30636 60825 1855 -137566 -60422 65779 71269 -54152
16531 -54152 -114406 -156128 -165794 -103661 -81757 -120170 -60471 -38155 -96331 -104567 -91396 -214900
16519 -214900 -152504 -30891 -126965 -119758 4466 45653 26743 23647 96658 53571 59956 95470
16507 95470 56320 14556 -11260 -21936 -119463 -131217 30637 200147 214863 130018 211480
16496 211480 185205 49051 12210 14499 -82080 -51188 80791 87452 -67302 -119275 -159393
16485 -159393 -129736 -34633 -40381 -86818 -13521 4386 45433 80860 -7282 10301 59785 13613
16473 13613 -6100 98299 124564 -103819 -137762 -64157 26202 19382 -55176 -88061 78891
16462 78891 85820 24201 -13718 -105263 -116795 -253771 -125216 102738 98284 93537 85946 162417
16450 162417 81632 82742 -38669 -1549 50783 95456 111663 97329 -7574 -22965 1830
16439 1830 22680 -4525 -102528 -90081 -25556 -109185 -188802 -210657 -214104 -115291 -35200 -50584
16427 -50584 -64498 -121641 -38932 -52408 -48098 77917 47106 -3780 -39699 -12657 3374 6136
16415 6136 -1724 66179 150963 151891 89841 -64983 -118009 -116052 -1326 1354 -36083 7934
16403 7934 76116 43999 -73859 -91902 61054 159976 134105 40779 -178675 -204722 -193970
16392 -193970 -167500 -80489 -77995 -174554 -115470 -125266 -165555 -88050 -53847 -3194 52283 16590
16380 16590 48635 108326 124042 49244 -2450 -66502 -119893 -64215 -52803 -7329 -27430 2869
16368 2869 -25779 13191 7197 -6467 -15760 -30222 -48878 -67758 -59338 -30541 68896 -67852
16356 -67852 -480 -31103 -43108 39250 55821 134140 185919 217172 142779 52664 22602 138416
16344 138416 59127 -19993 -84247 -61134 18640 -67148 -81972 -81859 -141240 -70722 -42875 -17572
16332 -17572 -54489 -55963 -29186 52612 60150 41864 38964 -136509 -304842 -369519 -303077 -162164
16320 -162164 54915 151097 91060 -62466 -162259 -242851 -131393 -34636 -28568 -6639 -74989
16309 -74989 36767 98713 169163 187298 44772 17378 31044 28122 122242 55115 1963
16298 1963 -2736 28527 28578 -36955 9403 -65788 -90185 -10161 36137 40040 -83205 -29024 -53673
16285 -53673 -112732 -93896 -63717 -90797 -200844 -217380 -304294 -282913 -198543 20843 93571
16274 93571 36627 45300 69640 103894 55973 32666 109638 66469 -15606 146835 194086 111207
16262 111207 105897 183814 215426 164546 92179 5091 19889 16110 3459 -83167 -62669 -12981
16250 -12981 41727 125674 177768 141400 68785 100071 32348 66655 -59346 -84888 23019
16239 23019 62788 13827 -62089 -93571 -71187 -29071 -51422 -33397 -73114 6679 83533 72543
16227 72543 44925 4637 23724 63436 100914 112946 54569 -61461 -60196 -135993 41926
16216 41926 160324 82654 -62205 -162227 -94010 -12651 40469 96907 159932 217779 157544
16205 157544 6323 -37029 -150361 -162687 -86463 29574 86692 59615 -31163 -68116 -8010
16194 -8010 44132 63592 70395 -19262 -137766 -156100 -156975 -120885 -48368 -19232 30433 40036
16182 40036 41300 131685 122394 80361 39736 -43108 -26731 99279 113868 110403 -103921 -180743
16170 -180743 -102477 -28567 -25571 -34279 -98375 -193783 -267529 -325700 -159091 -97362 -89161 -54051
16158 -54051 69515 121474 87259 -5942 -38707 -54189 -35884 -44483 81822 79599 42067 3816
16146 3816 -20771 -56713 144627 314828 227474 63067 -64066 -153041 -90939 -66414 -99408
16135 -99408 -171537 -99575 -68176 -213999 -225521 -86299 -11331 -98991 -123659 -149302 -132665
16124 -132665 -69184 112973 176087 59188 9183 -56333 -69326 -58812 -13578 113387 128374
16113 128374 161153 134855 83947 -2296 -38052 -15476 69187 67464 87320 12877 54391 29054
16101 29054 64184 131957 211235 155239 72664 86608 163023 155467 158349 53010 24274 -67917
16089 -67917 -167091 -163695 -176901 -145266 -119567 -54714 4251 -13034 -19226 -5083 43759 119458
16077 119458 154054 112351 68415 76825 45107 45055 -50201 -66875 43422 203462 184226 178651
16065 178651 123007 137663 134767 143339 131093 -62491 -159428 -189203 -171413 -121994 15808
16054 15808 -52552 -21195 22574 -10781 -40734 -23584 31879 26147 65544 82959 108784 237900
16042 237900 250893 243753 189090 199947 295477 111376 -41581 -21645 4145 -28778 38875
16031 38875 20823 -109564 -56159 22028 59415 153115 63730 -31078 -105816 -62677 -5
16020 -5 6845 -55992 -28396 39885 3302 -82042 -38200 -35431 14477 -2883 -8107 29719 117621
16007 117621 163114 148258 43808 -9142 -27200 55472 -8876 23216 -24491 -41711 105232
15996 105232 139902 105445 106300 158189 104721 73735 53450 43853 20205 -88601 -81463 -62829
15984 -62829 -47368 -22288 -45103 -84970 -195981 -141363 -35780 28793 139000 154243 62102
15973 62102 19393 -119313 -162174 -259978 -157498 -17589 3047 59790 26488 63509 102869
15962 102869 92908 -34615 -157372 -128304 48450 64692 -25067 -11821 628 85178 189258
15951 189258 169028 162014 160880 178281 86188 3029 110098 140330 -6003 -42286 -18172
15940 -18172 -29357 -40324 22132 41423 124382 12974 -119922 -87354 -56207 77573 141499
15929 141499 124716 51891 203777 171776 70834 111943 61080 72511 151834 249260 132244
15918 132244 -6351 -67223 -170062 -162898 61389 139442 132664 23397 -8353 -48318 -125443
15907 -125443 -111674 -66098 -125419 -111910 -81924 25001 46228 31854 -163294 -193756 -13538
15896 -13538 52731 -28448 -64977 10469 -62614 -116446 -26578 11776 6196 -74568 -66981 9787
15884 9787 100364 197865 163477 160173 37170 -35601 -59075 -89824 -36971 -75766 -153516 -133269
15872 -133269 -87886 20614 -50386 6682 131686 146286 152038 60319 59434 79728 -99312
15861 -99312 -341048 -267715 -43971 135739 133065 77053 29 -60188 -110658 -122630 -105366
15850 -105366 -4195 6755 -4912 -6382 29463 9930 -29371 24230 70984 3186 -29774
15839 -29774 -51801 -70577 -16492 -22859 -70932 20553 -17162 -32368 25532 -38093 -140692 -165761
15827 -165761 -108272 -37995 40 -12763 -777 29694 86659 57731 -20349 -10684 80606 104135
15815 104135 38097 116389 178437 109290 39095 -17573 -69630 -110496 -104923 -99726 91315 221900
15803 221900 237764 173782 221821 281283 260356 114889 77164 163826 30519 -67220 -41423
15792 -41423 -38704 146075 130418 16204 -49837 -21850 44146 103352 -9905 16177 29697
15781 29697 -35548 -7503 -12659 -60174 -43259 -108968 -62519 12093 101418 167893 174406 69200
15769 69200 -108424 -157023 -140310 -123185 -169433 -70615 -49746 -102405 -242249 -277892 -143873
15758 -143873 -65591 -55994 -2834 -49429 -88717 -66975 -50173 -33627 -13844 18706 9515 -16099
15746 -16099 -106184 -85906 66167 164461 140424 41244 78172 51682 -111404 -176884 -244076
15735 -244076 -219465 -128648 -76467 -123567 30129 80000 109649 153210 81604 26225 -55262
15724 -55262 -25313 -61498 -37948 -44073 -56377 -14697 -86927 -165812 -18529 -113894 -90604 -93580
15712 -93580 -7927 -66492 -133449 -138734 -106767 -111582 -125230 -67267 -75007 18979 99520 134579
15700 134579 103330 58298 -23430 58408 98940 41642 -71993 -59188 63172 31876 -53366
15689 -53366 4772 40866 61672 141606 -30602 -84680 40118 128483 21518 -27252 19098
15678 19098 47676 54803 72086 117002 130847 106016 55011 -13288 -39021 -147946 -305753
15667 -305753 -282819 -95726 21718 -26556 -25256 -18702 50463 35144 -42353 -86684 -53961
15656 -53961 -106098 -2934 106596 130974 -41036 -39595 -139046 -46949 13783 63991 62377
15645 62377 1076 -27946 -67425 -110717 -48633 -57112 38218 37299 -23190 -104031 -154169 -150210
15633 -150210 -81847 17263 12106 -16324 -123359 -181762 -190125 -125473 8775 88508 94144 12018
15621 12018 12405 -34413 -62936 -67542 59654 58446 -32166 157361 273131 220177 235414 256735
15609 256735 199299 186818 159451 7140 -8946 -108191 -146710 -67375 26344 215515 258115
15598 258115 218174 201171 90945 -10146 -195421 -153061 -65110 -8316 128033 125406 191064
15587 191064 241964 191812 93433 -70226 -50692 32385 6535 29563 -88000 -169237 -165144
15576 -165144 -59597 -16666 38271 119843 114037 -43915 -187355 -172687 -62732 -34283 -162126
15565 -162126 -129764 -54761 -172018 -123848 -49780 28740 98774 113756 46104 -15582 -85901
15554 -85901 -133726 51918 105090 85477 43844 -38208 -32277 85246 64938 13928 -49022
15543 -49022 -41220 -32001 -80446 -5316 -20629 -23627 38606 14761 1703 19272 135657 214381
15531 214381 120526 24425 24797 -52854 -7676 -81563 2027 132610 124272 127477 71544 -56811
15519 -56811 -18590 86825 238685 205975 74549 16605 3388 -147030 -87037 -6764 74828
15508 74828 87338 57083 33186 44461 131710 199718 187381 169877 30460 34352 25156 75633
15496 75633 13552 -56198 55346 60614 23622 94693 164461 97682 -61637 -39964 7623
15485 7623 87362 167963 137781 162683 207156 179756 143721 107642 49086 -75237 -64984 24626
15473 24626 60211 -68865 -71362 19727 45608 -22358 90509 180422 153056 36328 39576
15462 39576 182784 227639 242211 200027 196264 166838 -43773 -151367 -79168 -22829 -13213
15451 -13213 4476 104808 53039 52671 189694 224054 143978 15070 126616 146621 146435 119195
15439 119195 42687 29277 -41045 -94935 13540 77260 29442 -52457 35505 123023 137198
15428 137198 53835 158883 213950 243706 282095 249654 181657 75169 64150 90176 103013
15417 103013 30161 -36184 3412 -104703 -108707 -96669 -108559 2611 100667 46337 -4350
15406 -4350 2982 5535 -26757 -33589 6417 -8853 42244 35433 -49255 115717 154919 226809
15394 226809 133069 -26892 -155595 -186477 -139902 -10061 -10323 52906 171336 90017 162777
15383 162777 142466 121967 45709 -14375 -18697 15224 -69219 -104968 -133241 -66382 68652
15372 68652 83887 60267 74478 125657 69150 54120 -19511 -123151 -118650 -157126 -96838 -136216
15360 -136216 -14001 125884 184949 171981 158577 20468 -70178 -104047 -106176 -158786 17115
15349 17115 30284 -75578 -136030 -73883 -51335 -89667 -42064 63672 174768 88241 -95695
15338 -95695 10643 24064 -27822 -8268 -18379 26420 -7731 -12857 -10750 -26179 33085 -101910
15326 -101910 -203364 -123560 -66517 5800 -78012 -98334 -72098 -8060 17449 104248 54358
15315 54358 -10206 -4926 -117647 -29150 236839 338674 245536 124759 137932 162891 102134
15304 102134 4623 19111 -75907 -52911 24466 -546 35523 -25524 -53849 -46156 -76280 -173103
15292 -173103 -231981 -130129 -47281 30334 28767 -5694 58391 119363 233940 199949 197659
15281 197659 83712 -74204 -28820 29670 171408 112782 1565 21156 42416 67384 59329
15270 59329 -27564 -72709 -31849 -72473 -213146 -286022 -257444 -145610 -75790 -12790 21039
15259 21039 -153462 -227831 -144969 -49636 12580 75310 57334 142479 185773 103553 149089
15248 149089 124135 168228 167569 117608 113357 81735 83380 -33036 -126731 22468 136182 129297
15236 129297 173422 220916 206732 62758 31166 62458 89659 142421 203382 197034 179243
15225 179243 86757 40387 84277 24253 -138501 -113469 -70948 35455 -85261 -113187 -82160
15214 -82160 89229 188 -108544 51763 151546 114965 1259 -1917 21214 -96363 -128483
15203 -128483 -66633 -109657 -143588 -141121 19160 146285 139700 67573 135386 121672 80381
15192 80381 114102 95964 79116 133041 88700 76359 108545 166104 101811 52698 -53643
15181 -53643 89922 261333 199648 113694 11893 -97755 -170934 -157674 -181298 -174765 -164644
15170 -164644 -71392 -11846 -28142 61142 64414 73582 37121 107579 25483 37215 111685 172599
15158 172599 27213 -69048 -94162 -85250 -107393 -80291 -40743 -84821 -139816 22643 41585
15147 41585 -84879 -736 40292 -17761 -58866 -1534 -30928 -20111 -112525 -100050 9272
15136 9272 -8078 -67725 -160794 -197729 -145089 -29515 65195 100676 23779 -48770 -45244 14567
15124 14567 59133 -18402 -64161 48518 40902 57461 88727 16762 -80212 -212306 -178195
15113 -178195 -161132 -173816 -17072 -851 -88751 -97130 -106459 -109010 -208489 -166567 -123838 -179062
15101 -179062 -120324 -42727 6429 51 97032 40180 -96987 -182068 -130654 -68854 -173459
15090 -173459 -168144 -41008 49718 102691 -5666 -133875 -120472 -137519 -133271 -178630 -241359
15079 -241359 -102908 36386 -26135 -95754 -33651 -19192 -56026 52885 80736 11595 -29777
15068 -29777 -57964 -42147 67382 91927 -15808 16453 33450 -52270 -57505 -63837 -47805 -168963
15056 -168963 -134226 57850 71623 47195 69589 40956 -44570 -168366 -227025 -126249 -122834
15045 -122834 -110843 -24005 -44561 -54166 -47407 221 -48114 -194802 -390788 -379535 -302719
15034 -302719 -71831 78316 151580 78921 26061 -46016 11839 159979 140739 65106 -2289
15023 -2289 -932 52074 -15183 -185039 -280107 -133244 -34866 44946 817 -66157 -58710 -12090
15011 -12090 -51156 -180089 -229362 -213024 -162974 -211434 -127968 -22323 -160622 -187252 66130
15000 66130 229867 122214 99305 107920 -35312 -90088 -181095 -231658 -238710 -177061 -79429
14989 -79429 97959 23308 -121306 -198996 -168117 -218764 -234642 -221460 -193275 -60739 146342
14978 146342 174785 39487 -59749 -120294 -158489 -136765 -152338 -156648 -181815 -111955 -79160
14967 -79160 -109571 -44431 -71221 -131697 -101134 -65721 39081 -57556 -116208 -78184 -86313 -17147
14955 -17147 -17592 -61449 71096 114205 149381 104103 104350 222753 174022 211781 155009 203877
14943 203877 211671 253428 219524 62615 31393 -51424 -160409 -183574 -187701 -42155 41105
14932 41105 37141 -20084 -67788 -35132 -166713 -223959 -167530 -182369 -106170 -98175 -325539 -370904
14920 -370904 -255514 -175380 -84717 -107576 71836 119267 136367 126842 54892 -4303 104534
14909 104534 126132 107134 126091 180601 222951 263901 212658 171197 164497 140677 91948 99734
14897 99734 182860 219684 161982 72774 32690 139986 246734 258041 297412 255199 67279
14886 67279 -6306 -2394 -906 -65460 -123290 -237955 -160066 -33351 191877 267709 94139
14875 94139 -43976 -142695 -45880 -83106 -11409 -35535 -93819 -97066 -144571 -166714 -1009
14864 -1009 117480 58231 66901 148181 152330 131093 106883 80048 -68524 -202511 -75105
14853 -75105 -23836 -147224 -237311 -81125 -90900 -163528 -181976 -231955 -203508 -214147 -259186
14842 -259186 -181506 -60449 -15087 -60647 -45842 -9097 -69037 -55099 18147 29768 74569
14831 74569 47551 -100457 -213864 -133263 79180 102270 16337 -34520 -43389 -61716 -61710 -64083
14819 -64083 34030 -34243 -64164 -1737 101585 207633 187806 253370 182166 121943 70464
14808 70464 77068 50206 17044 32984 -40217 65482 149825 169569 229347 180719 130125 230356
14796 230356 312766 235121 143417 161158 104173 15920 -24294 89126 -34280 -158058 -152361
14785 -152361 -65841 693 82976 145241 78800 -61987 -163755 -120842 -129736 -171132 -154639
14774 -154639 -38586 72799 91128 104921 39531 -36088 16911 31294 -59481 -77794 -139095
14763 -139095 -198729 -135942 -24781 35685 32605 165812 112306 106531 50884 43407 86867 66523
14751 66523 17702 8312 46181 3094 35598 94691 49348 -12289 -21222 -26542 -52874 41315
14739 41315 38293 -66071 4768 77718 31542 98681 197769 160249 237099 299280 218613 54979
14727 54979 -69232 -150061 10825 31675 -61915 -77183 -149252 -77058 45085 -70189 -33506
14716 -33506 -14526 67095 26684 -5443 -73400 -107933 -26680 -33209 -123394 -14997 -112724 -226175
14704 -226175 -287663 -339638 -209520 -215076 -151066 -94969 115735 147083 71057 61722 47661
14693 47661 73523 153625 177476 195514 131628 -60196 -115359 -41835 -34975 -65964 54944
14682 54944 51263 89089 40002 -48075 39449 -50694 -78670 68839 204744 234397 152776
14671 152776 128946 87413 -63224 -127636 -165586 -107121 8089 13088 -77302 -150558 20509
14660 20509 30895 12267 -59651 -83910 -30527 -17423 -29453 47060 21521 -56556 64985
14649 64985 184785 112120 -41985 -75263 -4830 98090 182710 105388 35770 -30783 -13341
14638 -13341 28281 44273 61708 131373 84789 -24666 -121782 -134614 -141895 -113188 -65770 -57799
14626 -57799 -78747 -86374 -140064 -199199 -156089 -200784 -217587 -107331 -12666 -69218 -120232 -128542
14614 -128542 -75430 -174738 -187218 -129055 -10831 -123672 -295426 -273601 -62393 137967
14604 137967 202130 175434 59912 -17361 101810 145744 146226 147803 81609 62767 -26029 -101845
14592 -101845 -152895 -54217 -22257 -82961 -154672 -158596 -60522 -149765 -235557 -223142 -107417
14581 -107417 -70882 -50943 130492 257572 129264 48222 49528 203543 325520 257356 -13378
14570 -13378 -205245 -200950 -162376 -161096 -101573 -22348 3238 -55065 -91132 -147135 -154816 -84231
14558 -84231 -126744 -106288 -124145 -170498 -62402 106364 141965 186095 211496 174275 125757
14547 125757 161136 115640 96949 5223 -119591 -132996 -68310 -9507 22800 52263 -106031
14536 -106031 -87237 22813 85039 18164 -3126 13782 38115 26538 -102082 -246084 -228364
14525 -228364 -226458 -123834 8253 60979 75703 117110 68400 19656 70802 102339 -31849
14514 -31849 -40359 -101761 -91814 -13148 25788 1540 61526 141484 130309 45512 -55970 -103788
14502 -103788 4654 67862 -14231 -121608 -40373 -34024 10464 -62560 -99185 -61233 12515
14491 12515 -8648 -42264 -5848 -63009 -103781 -29744 -108637 1666 138483 98117 72276
14480 72276 152039 186823 320094 252397 75649 89785 102730 100675 94224 114738 97197 5160
14468 5160 -6044 -6301 21175 80028 94130 9765 -28084 -104002 -128622 -161524 -188311 -114141
14456 -114141 -90666 -19662 -19418 -48708 -104229 -179863 -158169 29655 62048 55707 2875 -28402
14444 -28402 -44103 -70110 -139496 -119159 -175577 -319263 -338517 -224404 -166791 -100399 -142759
14433 -142759 -148799 -49623 88050 81928 -39567 -120154 -16792 38512 80502 13535 20208
14422 20208 54218 -91755 -78856 38768 -59708 -137927 -234076 -214199 -82634 25775 -45245
14411 -45245 -96598 -40392 -15217 -144257 -163033 -39505 4504 -131925 -202089 -48133 5047
14400 5047 -62290 -69600 -71981 -30483 5457 136638 124216 154506 181089 192741 77543 -72855
14388 -72855 -76193 -10522 -7062 -35982 -43906 -3510 50222 85308 83667 38210 -53376 -28181
14376 -28181 -4440 -16874 31778 130250 116821 33058 46505 82973 -14805 19988 29091 20716
14364 20716 85847 69760 203328 199492 100953 32570 73875 -9785 -101568 -186527 -134260 -59683
14352 -59683 41128 84486 31187 46651 1560 45908 40592 53683 150419 85359 6155 71400
14340 71400 78034 93575 103559 92664 96689 37976 62621 -14590 -52561 -117558 -159857 -59153
14328 -59153 77778 111158 162705 119117 142520 194590 172852 96912 55583 81835 -49486
14317 -49486 -50423 -20472 -44681 38616 6146 -26248 48633 172696 151505 115356 257710 411272
14305 411272 456956 424001 454269 453872 416126 579455 578393 547570 615646 790766 910355
14294 910355 947678 1081749 1331087 1752058 2491261 3304773 3925038 4414306 4865360 5138901
14284 5138901 5252047 5462336 5474294 5533654 5357291 4850389 4253248 3526573 2941404 2552162
14274 2552162 2362593 2174723 1986076 1862561 1804400 1810512 1856092 1734821 1555196 1456600
14264 1456600 1453951 1576236 1652015 1608462 1564752 1515114 1605609 1790182 2033092 2319713 2584043
14253 2584043 3067170 3768363 4338257 4926209 5421186 5705635 5793231 5902991 5916898 5794986
14243 5794986 5665440 5310465 4678858 3924316 3323762 2771474 2387167 2092770 1794303
14234 1794303 1621203 1455811 1324012 1328300 1289324 1257427 1120648 905487 833135 825903 767883
14223 767883 726080 583796 476619 468571 589151 664443 609042 635595 662584 628841 636969
14212 636969 693099 636419 611140 446068 415300 410235 447479 402894 348529 499442 542628
14201 542628 507064 503433 488613 433119 399644 290145 323512 342296 293809 336258 341832 295391
14189 295391 295206 329660 286349 232579 271487 137919 25747 86677 57253 73673 -71809
14178 -71809 -53824 19766 -24702 -20613 -23273 30884 145972 210990 151355 117928 59225 36187
14166 36187 117794 39147 36218 76119 53613 -60362 21197 119911 185200 87677 -160149
14155 -160149 -166576 -35659 51573 89902 162213 64636 -1464 -4293 -30817 -57555 -118415 -7060
14143 -7060 144017 179276 212942 188908 110546 80163 45123 -47631 -65951 12691 1219 105475
14131 105475 186460 125628 185971 242321 248769 190900 71290 15169 11017 137 7964 110750
14119 110750 176770 145036 56248 181251 191925 210521 250136 146191 -3556 53071 65653
14108 65653 110513 78948 -46041 -77061 -15582 3548 -2587 86194 148425 160981 99752 6820
14096 6820 -14449 29323 115671 160893 60176 23750 32036 39412 38871 -36087 -166244 -261988
14084 -261988 -189985 -184842 -132233 -88910 -67983 -39525 -72912 -153456 -142400 -18474 -16405 -39563
14072 -39563 -9269 -88689 -55056 -107336 -164775 -154271 -21908 -28382 -30159 -18299 54758 24103
14060 24103 -69157 -120895 27348 145205 313606 291643 128905 45567 -29309 16725 96951
14049 96951 51454 -5115 -50487 -85565 -81834 -95156 -58979 -36499 13301 48895 -15907 25257
14037 25257 36958 -63014 -215597 -110903 -73165 52462 55525 12504 50875 98355 108670
14026 108670 -6811 56828 58938 92550 71898 -21489 -99734 -173954 -85583 96712 112597
14015 112597 110153 84588 70792 46309 12472 -164859 -145620 -109463 -36397 5968 61514
14004 61514 45767 -57901 -67161 11954 -35426 -45094 50529 153864 88868 34631 -46371 -95516
13992 -95516 6064 29229 -28254 -142394 -180785 -109221 -10465 14811 -15124 23794 68110
13981 68110 90361 126768 49607 32721 143836 138544 210120 243081 247889 120446 181000 199110
13969 199110 79234 31813 104171 76033 53530 187892 248707 68386 -18741 -94874 -134847
13958 -134847 -101168 -89914 -73539 91657 173893 86367 130256 281665 275517 185455 92216
13947 92216 -55967 972 25193 34496 98541 130505 125721 156507 95573 14020 -9826 1392
13935 1392 97 94760 110954 4293 -34933 15857 81489 88508 151653 113141 87085 158526
13923 158526 160606 75079 7310 -41942 12171 48390 -172634 -172561 -98706 -77080 15377 19611
13911 19611 -20052 -77444 -182310 -226698 -90895 16048 -2235 -49445 -58645 17625 -35306
13900 -35306 -173297 -225972 -148472 -39880 20155 -16239 -5416 21341 113844 101222 138347
13889 138347 211193 183738 179745 171154 53599 90617 158393 107605 46430 92656 77606 -74764
13877 -74764 -126988 -160770 -136796 -100069 -51402 4478 -34576 14545 16898 -61195 -46089 25825
13865 25825 -14520 13096 102051 117662 163711 225297 231714 94960 62105 231600 246604
13854 246604 42167 -93243 -115949 30183 21262 42614 23089 -61813 -184410 -144639 -23332
13843 -23332 -50533 -93087 -80746 -120637 -99779 -64242 -77309 -51834 351 -16125 14851 86220
13831 86220 92397 39197 18965 51941 9261 -25708 -86359 36241 108652 200592 250361 335308
13819 335308 179343 128547 124721 81405 76216 166500 221246 216246 175667 190111 73382 10733
13807 10733 37172 -5584 -46189 -30757 96587 197024 25380 -112058 -107529 -157469 -237157
13796 -237157 -212571 -206863 -150684 -77811 -70892 -64779 -120672 -132859 -203090 -170418 -78352 -13462
13784 -13462 79729 88716 19465 17411 100945 173718 189003 170273 93167 35031 2602 -95227
13772 -95227 36510 182136 227310 170310 193112 215915 148919 93721 25181 19238 -38848
13761 -38848 -124492 -112885 -56123 -171932 -85070 31976 97362 197078 127206 -26418 -127275
13750 -127275 -190728 -208960 -305542 -304099 -255174 -174956 -52954 92528 180186 182022 51723
13739 51723 -35347 -66624 -6950 62759 144953 197538 188973 154601 -25269 -28849 98937 52722
13727 52722 46975 111490 94886 -17595 13275 34939 54071 37700 77267 -70162 -89026
13716 -89026 10840 29288 -28630 46177 60976 9370 18226 -48624 -76058 -78535 -42752 137
13704 137 8163 90124 155041 75529 57266 49588 42691 29933 204397 174390 85362 11605
13692 11605 66944 90261 -24022 -120825 -178457 -175916 -91080 45425 37376 -170701 -199249
13681 -199249 -37975 -113359 -113671 -61288 -18599 22301 92526 94324 108526 134545 286913 219150
13669 219150 40800 38391 128884 266035 164987 87238 126548 174378 49761 27834 -23161
13658 -23161 -28694 9341 82188 71161 40695 14935 54736 94225 117063 90040 119948 200254
13646 200254 127570 165448 149200 150123 234788 198593 220960 226883 165242 94296 24371 36840
13634 36840 -45590 20800 99734 117182 140071 241342 226451 -15435 -30676 -6689 -56023
13623 -56023 -31038 47860 5596 111400 121885 82100 71751 68974 29477 25504 -61596 -78469
13611 -78469 30155 87380 153267 170652 102840 145370 118096 58804 -26951 -87053 -5546
13600 -5546 -7046 11659 67103 40734 -44586 54336 18159 -54807 -65581 42736 12388 -67051
13588 -67051 -156115 -102524 -177922 -169193 -119703 -89993 -65440 -135247 -207972 -204312 -228755 -135765
13576 -135765 -237559 -208186 -46877 39022 8372 -7753 -41345 -101563 -21401 84085 123034
13565 123034 138784 47767 85968 61217 113886 164096 -70397 -129165 -55779 -95314 -40371
13554 -40371 107393 144766 66100 86372 -43363 -71104 -47757 -2092 -63556 -36423 -7139
13543 -7139 14092 34759 68211 30383 41798 67079 120428 85003 89009 13764 -54227 -45509
13531 -45509 -23757 58591 -35109 -59738 70426 122868 32782 6051 31274 21746 -108011
13520 -108011 -167072 -50492 -5871 -31520 22684 63484 106630 25111 -29547 63083 153221
13509 153221 96603 13822 39384 172193 89759 211793 313604 258536 22474 -79305
13499 -79305 -1817 56767 57675 14980 24172 11601 -41901 106371 151789 90983 -47866 -147345
13487 -147345 -85185 1061 139911 117288 112393 67731 49606 -52810 -195260 -115531 -92765
13476 -92765 -16973 47504 60856 115857 96889 45740 138934 138774 203411 126867 134073 104162
13464 104162 57357 21488 135066 94512 37726 31604 46343 39528 75623 40624 51938 138355
13452 138355 25865 -103097 -87875 -40424 -23976 -73829 -68991 39786 -45013 -99643 -185043
13441 -185043 -215441 -100419 22567 104773 60394 -21457 -16540 50616 -5883 -29372 126202
13430 126202 190372 164932 79875 77061 160102 174292 198583 162598 17816 47759 -7479
13419 -7479 -21429 4169 -10567 -28080 -142977 -159758 -162384 -43931 155158 164465 118301 160412
13407 160412 80044 10498 22994 -57716 -85191 -127530 -101025 10582 120734 122461 100278
13396 100278 120632 95495 -8358 -19753 32231 89562 54446 -42593 22445 37289 43737
13385 43737 -19248 -70615 -30572 -82871 -266880 -220305 -164116 -65988 -81466 -133104 -167340
13374 -167340 -135971 25688 129847 104703 88885 99171 92811 -55529 -134907 -52979 -18760
13363 -18760 -22883 -97581 -190548 -141055 -24862 -68923 -41678 -44111 -99976 -19545 -32994 -71450
13351 -71450 58441 262178 274088 249556 188242 59666 -13019 -28451 12644 23055 105237
13340 105237 92947 -14395 20618 -68636 -64441 -84851 -134004 -67646 -119453 -156665 -144929
13329 -144929 -109875 -82156 -48203 -118053 -16617 180182 210684 150333 160511 84566 -54243
13318 -54243 -104759 50694 45625 -58740 -106068 -90581 -45976 -28933 -36181 -142590 -216608
13307 -216608 -130364 -33380 -141605 -195607 -136567 -131493 -167968 -140810 -33373 -54990 -8417
13296 -8417 -5345 10512 48095 27310 2291 -114782 -159594 -54314 -51655 -55116 -32850 -39619
13284 -39619 37936 13681 -61982 13474 85871 -70341 -120983 -82087 11371 -98998 -203328
13273 -203328 -182402 -202292 -221882 -118095 -29761 41279 47199 71004 113276 75512 -52034
13262 -52034 -98894 -52851 180123 123725 76744 48699 119199 130844 92912 86399 90075 75480
13250 75480 113971 205961 198155 156610 88095 4893 54817 39297 28302 -11828 -81759 -50718
13238 -50718 80559 182385 56526 -55354 71645 191729 91856 -33540 -28388 -103148
13228 -103148 -294124 -282044 -113802 95333 122743 99632 21731 -22915 -110806 25457 132185
13217 132185 228871 324749 222044 109667 30406 42367 76711 24333 4377 50091 94431
13206 94431 -18251 -84353 -106447 -71403 -44275 47934 91680 74248 50875 -177 -15036
13195 -15036 -27108 6061 40012 -11349 -5725 -74280 -136825 -8665 29454 -47122 -74060 11063
13183 11063 33165 -22764 -22797 76371 108387 119649 170814 122022 76984 28696 41395 3518
13171 3518 25520 6758 16758 -80347 -60176 -40220 82099 104207 -31658 -115657 -101477
13160 -101477 -1638 43595 27359 -74624 -2372 145407 189902 251376 216256 107191 -18320
13149 -18320 -7321 -4776 -47975 -37025 47841 156626 214376 190191 139947 67131 -37639
13138 -37639 -784 49592 17681 -42912 13244 52785 67915 55221 87209 39154 -58780 -8089
13126 -8089 227899 263072 144081 69663 4607 1492 35342 90587 87866 16706 17047 -9085
13114 -9085 -68966 -19825 70896 73564 -19865 43058 147038 115323 -13911 5045 1290 29609
13102 29609 85062 115098 123403 136323 118084 48333 120503 140067 153000 125111 114536 218431
13090 218431 248452 184993 41349 104746 148086 118897 86222 10430 -10445 27074 -35156
13079 -35156 61817 132162 60721 -65160 -149343 -178569 -177612 -111143 -15061 -47666 -165923 -167697
13067 -167697 -147399 -219999 -248187 -143811 -31338 36836 -73295 -70011 -69821 92362 217071
13056 217071 220581 109401 -30231 -77118 -67300 11132 27888 39238 -101699 -137530 -90650
13045 -90650 -112718 -123600 -169664 -198374 -100890 -66593 -100581 -164066 -140311 -54886 -6828 85582
13033 85582 106779 126363 42020 -58538 -140025 -47022 71334 62318 38209 7786 25307
13022 25307 60417 137652 142989 85454 55668 89763 112834 31545 51924 45905 -43949 -75694
13010 -75694 -17355 72241 138780 202946 155622 67349 -104136 -137447 -134046 -142432 -249009 -215490
12998 -215490 -160855 -78477 -75314 2441 93779 66998 -34015 -55572 -16246 27908 639
12987 639 11355 -74136 -113154 17086 159852 234696 67347 19992 37077 -28180 -118529
12976 -118529 -73000 -36860 -97749 -136700 -121565 -120257 25129 202846 195816 69891 5288
12965 5288 71281 -52993 -67596 -12997 -26289 26892 159206 174178 97928 -10601 -87153
12954 -87153 -195933 -118606 -125024 -92831 -73188 -89677 30501 117167 173240 99054 -4922
12943 -4922 -16285 -42598 -3737 51203 159616 233704 161483 -5491 -207225 -170097 -51004
12932 -51004 -34331 -14746 2542 31720 115114 180830 67163 -42445 -80361 -102800 -136580
12921 -136580 -97416 -92057 21111 -10838 -99325 -53282 12834 24559 -118399 -76633 150456
12910 150456 119763 47914 -1807 -90351 29338 45731 -39307 -73772 44404 -27948 -114366
12899 -114366 -59659 39216 79033 -1777 -54976 -107308 9938 161785 155124 261642 282656
12888 282656 28433 -125912 -116100 -48058 18271 -9262 -42187 -65332 -127198 -153840 -65252
12877 -65252 22203 -23503 64093 147926 40983 37491 113336 87908 110033 73122 181650
12866 181650 263555 144103 -27504 -114969 -4403 -475 -64835 95641 173038 33008 -45629
12855 -45629 -61647 -40218 -119336 -18434 -104815 -39830 54206 22231 -53388 -139213 -174357
12844 -174357 -148314 -117314 -43613 45172 143469 94549 -79705 -28712 -31127 -26426 -41193 29294
12832 29294 64633 103761 -46987 -90903 -131043 -119003 -15446 1966 42952 157899 107900
12821 107900 93917 1781 10200 123310 140695 43207 32749 24387 12630 127060 138161
12810 138161 47325 -86933 -72669 52704 -55742 -97821 49315 115613 146456 193764 99400
12799 99400 39880 23933 69509 135373 107164 -6198 -49253 -80631 -119340 -108060 -172254
12788 -172254 -39917 64722 -96979 -152052 -84698 -81990 -224141 -270285 -190138 -91295 -79416
12777 -79416 32598 -97763 -123088 -56772 -100142 -153169 -122760 -82884 -42968 63309 48018
12766 48018 1365 -32943 -40429 -25862 -12767 3832 70245 120382 108780 67600 -1652 75948
12754 75948 134861 42974 -95184 -68860 -138641 -128276 -78660 156088 175314 223689 213064
12743 213064 -35459 -79735 -5512 73651 22478 34956 -21770 67408 132029 71700 -57947
12732 -57947 -172423 -46923 39805 -16639 -11894 11498 -16261 81085 57968 -50581 470
12721 470 -2813 35541 62948 41768 73326 57278 5540 -65228 -22332 -7488 -98737 -44315
12709 -44315 11945 -14111 -98381 -13118 -10638 -75369 -69628 -81205 -26287 86726 176556 195424
12697 195424 159017 153089 252403 315314 282757 197631 73506 65644 23131 165307 285591
12686 285591 300731 225587 160010 159178 85657 96887 129575 106460 155518 171587 153970 134200
12674 134200 47967 -2667 59334 106355 -2030 -62020 -34898 -34456 -29211 58504 129251 92003
12662 92003 35914 101080 146089 -29318 -59479 -87684 -86985 -9556 411 34049 -4021 -16988
12650 -16988 -15859 33896 30688 42304 58932 -66698 -161164 -128196 -172678 -89963 -45696 53556
12638 53556 40197 -37182 -72188 -148471 -331055 -308743 -150489 -146665 -80213 -1389 35427
12627 35427 -88373 -162487 -182402 -118021 -124310 -112667 34979 76003 -77644 -166123 -93522
12616 -93522 21661 66742 42398 17768 73684 62175 100838 7061 9779 52913 -31098 -61513
12604 -61513 -80110 -102018 -145925 -132058 -168134 -198380 -136025 -114045 -106759 -7667 -10633 59001
12592 59001 119714 236137 248927 220592 221801 87561 -156084 -175524 -74319 -66974 -78535
12581 -78535 20377 46965 83619 48409 -95503 -51732 -30714 -28374 -16945 -26016 58886 101245
12569 101245 50292 88130 56590 -17899 -2866 -68892 -41012 75625 81072 39730 85828
12558 85828 139464 174181 154163 31850 97528 107325 59980 53199 -34017 -132644 -172314 -77104
12546 -77104 61697 146153 -6933 -195072 -357772 -394743 -290254 -233187 -171009 -132556 -94779
12535 -94779 -101280 -97776 113284 40792 14204 84161 172853 165958 31627 89843 152534 123891
12523 123891 77135 39369 51244 -44335 -124319 -153956 -44268 103062 133765 80945 98611
12512 98611 59615 32207 11856 3415 -64556 -102199 -63519 83343 86619 77891 25555 51250
12500 51250 27230 6727 132591 132007 62833 -33918 -45659 -40196 -60384 -36853 21127 108584
12488 108584 15597 -80587 -163775 -66257 -9253 52221 25648 29198 -19426 -16447 -25084 -79746
12476 -79746 6882 179591 232763 206829 133514 227938 208474 200170 241345 203924 124680 122496
12464 122496 146557 123745 75719 -1505 -36693 -44291 57547 -11540 -214455 -264117 -218994
12453 -218994 -153618 -124243 -66074 28070 -2089 94461 127972 35506 -3354 33884 89175
12442 89175 151400 68480 71068 -51954 -75890 17024 24804 109796 245449 198726 103537 -28847
12430 -28847 -65515 4230 -35643 -5596 25419 -71603 -176512 -250399 -161152 17891 27123
12419 27123 -87795 -110028 -82432 -14483 10793 -215 -69818 -136619 -191309 -255365 -243152
12408 -243152 -206468 -80439 -16881 4114 -1012 21813 5108 -18053 -105110 -127148 -75690
12397 -75690 32732 104587 83296 83177 45403 2426 69101 -17521 -28118 -13713 -49689 -19391
12385 -19391 -105386 -74491 82589 190638 207652 186490 102779 -13466 -33638 -16538 109255
12374 109255 140626 71009 30748 109801 111554 17943 27432 25919 54478 45771 52477 149981
12362 149981 208991 184409 106360 38755 45750 111935 132574 124172 83690 -11596 -48655 -20222
12350 -20222 -104415 -31617 117826 199795 203533 154591 169198 131613 39831 21036 111074 172919
12338 172919 124041 -12348 -115246 -146528 -43223 -14662 -85823 -48240 -69215 -175730 -59940
12327 -59940 14109 -19017 -1206 31812 168825 252730 273568 216740 191608 255671 229739
12316 229739 236285 177243 101862 109954 168330 214020 81491 10603 32212 59072 106684 87273
12304 87273 113061 128184 76187 -27133 27600 153898 181432 127214 82190 29277 -9412
12293 -9412 -24187 -18066 -77956 -58873 44282 73452 59172 91014 242362 275639 149788
12282 149788 88942 226062 242797 145112 144793 173198 95460 111118 149042 111771 33702 -190846
12270 -190846 -99475 28868 25289 -8145 16031 99656 167840 273017 180613 102808 135410
12259 135410 112805 105204 21796 -112553 -144202 3823 4582 987 -75997 -125259 -63584 -74655
12247 -74655 94978 162577 150982 -18804 -49638 -7956 21279 63467 8933 -8612 81120
12236 81120 118865 166062 186087 195301 148041 213894 244021 129240 33925 8065 3929 68711
12224 68711 52407 -43373 -85780 -73236 17054 82966 161388 132396 228378 266738 330446 145058
12212 145058 112534 85187 210548 323766 208570 175557 97885 9595 13439 130501 106614
12201 106614 15210 -1215 40603 132925 153431 66568 9394 90149 42642 68856 253346
12190 253346 291970 314563 190496 85591 -46994 -148762 -53941 -46925 21758 -15859 -40698
12179 -40698 -21698 -9251 -107161 -156016 -121748 287 47579 -83435 -175551 -211664 -132960
12168 -132960 425 37306 124804 149868 39514 -113139 -167928 -173504 -194312 -204338 -86730
12157 -86730 -88144 -89806 7102 75588 96064 -26920 -86233 -82728 -84260 -20418 -20578 35026 10220
12144 10220 -10117 -2898 74134 94002 13791 101396 122489 92890 128947 23297 -60672 -117997
12132 -117997 -189225 -26116 -11853 13217 -56704 -21649 180449 130414 50881 18807 -48053
12121 -48053 -46045 -68782 -118083 -63594 -77891 -131507 -76425 5335 30449 74310 186605 245843
12109 245843 208853 168375 167839 51080 -29600 -42059 -125760 -198125 -194520 -269342 -198716 -172163
12097 -172163 -155474 -164559 -255380 -274224 -158970 -16255 103841 79682 3021 44623 83067
12086 83067 -15079 -24083 -59038 -25544 -30936 -72184 -78068 -52589 -30797 -74008 -194091 -225483
12074 -225483 -205170 -156376 -129164 -234799 -233123 -171929 -239494 -184896 -133974 -74501 -17520
12063 -17520 -81132 -201667 -161731 -59215 -30114 85578 181433 265064 182195 154391 156035
12052 156035 94265 -29606 -215870 -165942 -79403 13620 47616 11483 -37783 -31057 50144
12041 50144 123053 41881 1693 5732 43913 -106095 -60992 -3087 -66130 -85717 22243
12030 22243 79208 44813 34082 143173 71982 -38370 -45680 -34476 -39192 -58074 -96203 -151766
12018 -151766 -110885 -36965 9257 107728 142951 44377 -77553 -231154 -259605 -144894 -112313
12007 -112313 -158852 -178959 -210380 -119922 -113699 -37681 -104829 -142861 -165502 -109486 -103464 -198686
11995 -198686 -277396 -193934 -67493 -169891 -212079 -112535 65813 83684 64953 28429 -48430
11984 -48430 -19241 -41989 -16270 54736 122866 133102 128919 -20114 -104078 88517 170454
11973 170454 78680 34512 118148 81906 17524 74678 160175 106007 140584 140670 1343 -11622
11961 -11622 54199 21444 -115199 -90245 -126730 -111598 -103210 39165 95921 179924 100509
11950 100509 106503 86904 -41636 -135329 -156910 -201659 -106364 27458 35263 -47278 21321
11939 21321 70215 68412 36177 -56597 -52546 -3432 -13992 -47034 -80103 56150 34711 22097
11927 22097 -2078 61475 212019 197620 25164 -78986 -115011 -16393 -2698 -92864 -126538
11916 -126538 -35347 12059 18011 178470 109410 56460 42105 -42475 -42560 35737 143115 118118
11904 118118 88776 51290 -60689 5726 -22437 -172231 -198304 -184888 -195580 -201723 -149446
11893 -149446 -156579 -217273 -163305 -133449 -151039 -82743 57435 215832 258174 222354 85534
11882 85534 -13647 115953 99984 45497 28475 -38308 -114911 -66630 -8715 744 -13649 -23512
11870 -23512 42101 41264 -58943 -136176 -73865 -146211 -58882 4464 -27954 -81398 -104937 -109761
11858 -109761 -72318 -80454 -119478 -207538 -244199 -106291 63995 108688 56206 -17962 -49461
11847 -49461 6507 -24533 -97834 -127912 -97923 -18070 35296 -6103 -55502 -283 -50322 -38309
11835 -38309 16275 40816 -3461 -39202 -82921 -120925 -107282 -118107 -247854 -159886 -84047
11824 -84047 -24508 127442 204375 184856 288143 188416 103858 48969 -51770 36450 111989
11813 111989 13302 683 -94932 -216849 -252611 -154122 -1387 56322 71372 42009 105703
11802 105703 202811 207911 194522 99160 -11229 7258 27273 48256 133389 -31432 -161880
11791 -161880 -27153 100697 45071 11541 61738 128312 67024 52421 81210 115287 68818
11780 68818 39469 -21916 -45910 -51742 -63682 29614 26336 -93806 -171962 -114614 40567 -54859
11768 -54859 -47294 155075 217069 134457 19040 -23383 -71178 113370 139063 5637 -69261
11757 -69261 -35798 10365 12604 -33674 -68444 -95100 -147190 -159303 -59588 -117443 -253468 -283249
11745 -283249 -185487 -79165 -32466 -55886 -26808 -39946 -51247 -56092 -113697 -82943 -13443
11734 -13443 -9251 -35026 -91584 -173615 -174873 -150151 -245213 -261744 -139064 -92726 -245421 -259884
11722 -259884 -173798 -132801 -83711 4013 -30458 -73355 -67673 -83953 -144860 -190958 -54683
11711 -54683 108043 47915 30746 48312 115199 126841 -10305 -23310 76962 58719 31202
11700 31202 177291 22605 -135261 -131794 58459 121620 12062 -84505 473 23275 22275
11689 22275 88206 120806 175003 84181 49936 71355 -82611 -130995 -34010 108397 262635
11678 262635 128145 91475 105299 3812 -16331 -24121 989 -24622 25342 11765 -107256
11667 -107256 -100557 -138624 -126159 156 64452 199137 125948 26698 27830 -5719 -102817
11656 -102817 -114488 12748 122700 151033 72970 -24309 -15886 47046 246634 300576 209454
11645 209454 216418 115015 26478 -38781 -51743 -58099 -50514 -97739 -142383 -14216 65537 4912
11633 4912 -138160 -63358 37200 -13487 60933 100934 83050 -9569 -112330 -105650 -71591
11622 -71591 -121239 -154832 -239215 -337164 -268718 -263295 -205239 -149388 -27674 -75610 -92265 -54163
11610 -54163 -12839 -136363 -236590 -189593 -80351 -55570 -73061 -63560 -39519 -4052 -66129
11599 -66129 -137280 -98667 -66492 -61978 -127592 -219559 -105092 -207 -23933 -55806 -96948
11588 -96948 -93998 6891 -140 -2408 -22758 -21524 -119704 -50220 42103 -6466 -122266 -171894
11576 -171894 -122254 -190906 -153730 -175472 -214937 -169162 -148288 -126241 -134345 1439 48051
11565 48051 25473 -55624 -83414 -181318 -295897 -120827 89490 86190 -31826 -34152 -33231 50646
11553 50646 -46997 6556 107134 175218 221961 210782 72627 3681 -21747 -22997 24843
11542 24843 -78061 -229915 -124138 -68738 -123545 -248697 -269490 -170369 -181102 -165711 -36667
11531 -36667 44593 27078 -33506 9401 71152 105281 -41956 -153266 -205155 -81883 150491
11520 150491 141181 62104 -39213 -51285 -121375 -3946 41894 30186 52809 152342 58040
11509 58040 20731 129884 155110 120845 144544 79556 33674 34187 40374 32351 -8500 -95644
11497 -95644 -125195 -90468 -77703 -213823 -175163 -18125 184135 132598 -21125 -127873 -89089
11486 -89089 13800 58404 24388 -77903 -52340 -118414 -119382 -111919 -82206 -68230 -62343 -81757
11474 -81757 25069 114656 109553 148155 175623 156845 -13633 -105857 -79401 -176695 -278232
11463 -278232 -213168 -209505 -206779 -178365 -87226 -37438 57829 27471 90007 148201 30302 -93099
11451 -93099 -32609 100953 204625 95497 -32629 7745 12643 -48691 -154133 -131401 41925
11440 41925 163835 -12045 -8621 96237 82598 53963 92811 22208 -32236 -109114 -81822
11429 -81822 -10099 11190 -9749 -53779 -60927 -22535 -159527 -171044 -57862 -159779 -147490
11418 -147490 -75815 39610 94335 195645 95233 73708 212744 250536 263449 118173
11408 118173 55533 -746 47955 57674 87715 63990 -5682 -99567 -44330 -25224 1133 -11566
11396 -11566 -67222 -52749 28726 50437 23091 -91146 -116814 -112028 -111734 -137410 -145866 -118837
11384 -118837 -158970 -95075 -5373 53787 58237 79862 50417 -34780 -17854 57770 111235 141346
11372 141346 93317 90637 104906 87290 131222 147403 50591 118063 31890 -47259 46278 72428
11360 72428 163337 112059 77171 16233 -7757 -100465 -89544 -44898 14823 6493 -126591 -138759
11348 -138759 -9388 -18128 -86132 -161307 -120180 -67728 8441 25788 4397 -25338 -196150
11337 -196150 -156118 -3698 41330 24020 -14155 25236 142767 246514 255232 171883 66905
11326 66905 99730 184051 44456 -28212 66742 109720 48483 -21596 33313 82591 57025
11315 57025 102175 123145 77244 103914 -68842 -34906 96943 139445 81671 61778 1733
11304 1733 -33725 -136183 -206607 -78193 -98045 -77372 -67751 -23443 81992 134996 9972
11293 9972 -124813 -159767 -231614 -221371 -172048 -89002 -35800 -79844 37965 60721 -28743
11282 -28743 -75087 -84397 -149511 -134118 -8620 137109 141174 -943 -105122 -164160 -170195
11271 -170195 -140183 -216529 -326910 -207876 -89613 10298 32280 45128 -69858 -113044 -126195
11260 -126195 -179105 -120752 -106181 -56314 -77041 -49133 -55459 -194182 -154479 -42738 9087
11249 9087 -75658 -235439 -171949 -68523 130794 193285 158909 64384 -173221 -187522 -88964
11238 -88964 -112124 -136130 -107810 -53400 33412 90771 107287 27319 4432 84573 93421 95899
11226 95899 39620 32538 -100368 -200612 -111123 -61094 -121007 -149964 -170937 -127829 -107765
11215 -107765 -49424 38948 146341 213042 99396 -6186 -54493 -80691 7499 94389 87040
11204 87040 150104 74234 -30124 29824 -30386 79425 47903 -26511 61382 138933 187572
11193 187572 237004 156756 55633 -34000 -104463 -166066 -65087 -64061 -11985 51141 82642
11182 82642 10693 -7807 -226006 -286391 -278882 -173137 -118934 -45722 18921 104420 172570
11171 172570 174426 196637 208147 105281 34678 -80669 -199649 -235020 -179002 -100812 -47227
11160 -47227 -8723 15475 -5037 -9679 4161 -112949 -111588 -170152 -193263 -233303 -261898 -246837
11148 -246837 -322713 -244655 -61079 35 21253 117743 71782 103714 64001 43767 -79851
11137 -79851 -125624 -206612 -132093 -37873 15515 -76695 -40170 122981 239768 266839 236573
11126 236573 133173 -20343 -101207 -16236 -15344 -35024 -147012 -174925 -271057 -326418 -256404
11115 -256404 -155265 -101633 -29552 27379 -30587 -156828 -67209 3565 7544 83207 22356
11104 22356 -58205 2617 145508 75587 -38180 -29382 129854 256003 192841 45683 -26478
11093 -26478 -22597 -27039 -50901 -68043 -56906 -77472 -83793 -29351 38652 31203 5367 -130509
11081 -130509 -158794 -40012 53807 101067 145343 162381 -19661 20561 77226 100617 106623
11070 106623 149466 225961 178343 105250 -40930 -19463 3388 23409 -106337 -211267 -315447
11059 -315447 -218661 -105514 -32456 30164 44038 121740 80135 81627 107132 106943 15299 -64075
11047 -64075 -4857 25125 79586 26843 -30038 12378 93793 176573 157477 69994 -25734 3665
11035 3665 8077 113664 330161 330916 167646 121227 122460 99548 72491 134159 112639 101253
11023 101253 5250 -9238 -90297 -35632 -38569 76196 124305 52494 -57056 -143888 -218736
11012 -218736 -131321 -56706 -31735 -41511 -86445 -55345 -63154 5309 -35524 -32255 -23930 -78813
11000 -78813 -45540 -37509 37589 157061 193410 85155 9942 -15753 -120816 -120239 -39601 30377
10988 30377 41588 89579 89896 25710 21268 110879 194532 174971 97224 42659 82005 156371
10976 156371 68006 22766 14184 -54626 -54001 -118338 -212036 -127025 50304 48748 18293 -49012
10964 -49012 -66158 -57399 -138936 -30818 4350 -30696 -30395 -53652 -81675 -59030 -49264 -36831
10952 -36831 104542 182569 231298 168351 21437 24689 126188 168053 173837 78672 37727
10941 37727 -18212 78171 157954 134029 98264 54316 -22817 8286 75552 79620 80677 108891
10929 108891 206922 206392 50017 18064 58615 57292 53975 -171 -108806 -112026 -127997 -79131
10917 -79131 -133422 -84087 131501 179025 155478 80120 43583 84434 120783 39452 -16768
10906 -16768 -30377 26528 3117 14546 59863 -1512 -56906 -22443 45053 22648 -35404 -139048
10894 -139048 -214200 -156166 -118344 -168738 -257484 -133367 -7596 54211 114177 21899 -19176
10883 -19176 -82227 -39914 136567 269763 242186 183743 203805 116735 55272 -4866 -66752
10872 -66752 63885 52542 -51337 -187418 -188392 -97219 -67989 -123446 -194804 -148129 -216415
10861 -216415 -210456 -99616 -24807 -22449 6434 -34446 -57842 -17075 79056 94179 73671 104542
10849 104542 -36984 -117804 -11222 -40671 -77589 29951 79445 -35298 10428 53404 -11584
10838 -11584 -87197 -256656 -164909 -117364 -45015 -144916 -195044 -141360 -219645 -180345 -178501 -142595
10826 -142595 -62165 -10441 77353 72015 62817 126236 74281 40123 49079 -98654 -253965 -342607
10814 -342607 -371037 -369727 -95798 6732 22237 33554 10117 -45559 -73552 -98028 -95322
10803 -95322 -47838 -67319 -58394 -69178 -186311 -192846 -170800 -99765 -156065 -211661 -368532 -212016
10791 -212016 -162479 -129988 8529 75902 96764 189794 240075 119919 27328 -3615 11114
10780 11114 183673 207140 22630 -5066 -25548 -73030 -64815 500 44674 -13284 78469
10769 78469 28071 -38493 -79390 8839 26402 -35893 -22228 91320 33770 -78589 -100558
10758 -100558 14950 -11271 39473 50369 -46125 -77067 -76708 -71254 -130532 -78280 23802 79529
10746 79529 -11970 -60102 75717 248386 164942 142022 42193 -164391 -297019 -260373 -289592
10735 -289592 -260640 -140936 -154045 -204457 -355650 -289531 -310531 -252671 -219603 -220365 -66895
10724 -66895 -23817 -39718 -117843 -28739 7550 -23913 -108594 21954 75728 67253 95824 86980
10712 86980 -34500 56239 165363 66629 -10161 43724 5191 -51004 -95106 -111003 -199687
10701 -199687 -302563 -217308 -18106 5304 -15886 -120235 -189733 -206632 -162658 -14796 3671
10690 3671 -101157 -250817 -170803 -114033 -4844 21688 46316 52346 73636 68873 160223 208368
10678 208368 185040 115876 19908 -34144 -84019 53209 172253 218715 86918 -24005 -53815
10667 -53815 32586 79238 69191 16974 42189 31264 12138 69056 69642 -61531 -176493 -54312
10655 -54312 -34990 -15880 -102086 -189319 -248290 -103981 -146788 -225617 -153762 -47746 -108368
10644 -108368 -124667 -84112 -6006 -42754 -86306 -86618 -61957 18312 69375 27957 16600 27636
10632 27636 61779 169122 204737 118024 33292 5921 -73932 -117300 -14232 36496 86496
10621 86496 -22113 -120124 -78198 77265 231628 239325 159633 51026 16439 49611 62560
10610 62560 -3204 -16255 -9221 -21344 7835 36862 -43441 -48912 -29446 -19583 25697 -41449
10598 -41449 -60766 84086 138261 79515 29294 91591 11792 -47583 -108479 -56037 -11802
10587 -11802 -135435 -283735 -289728 -425831 -376238 -242909 -177332 12094 117765 128347 96407
10576 96407 -104199 -205294 -182721 -121878 8608 -1686 -22568 -64 32630 114029 110751
10565 110751 -5372 -70426 9525 48844 122029 7260 -142863 -186921 -166196 -75812 48025
10554 48025 66432 -45330 44715 121996 -32581 -94284 116820 36455 -75741 55351 50314
10543 50314 8606 -117435 -99453 -60531 -86118 -204686 -107107 -49669 -38598 14250 -56425
10532 -56425 -112454 -136299 -78552 -45180 37148 85149 61158 5750 -20886 22824 -53215 43643
10520 43643 169301 191794 144426 43028 -83521 -38354 -43151 -88129 -35886 -65876 -121749
10509 -121749 -65994 -20751 -44814 -33042 -16547 23656 23313 -91644 -123918 -188126 -241395 -219786
10497 -219786 -194739 -231231 -177797 -140454 -87040 -123108 -206991 -244650 -133776 -189810 -275307
10486 -275307 -190963 -223632 -237478 -129344 -58889 -158122 -345154 -257445 -59684 96901 34186
10475 34186 -53393 -48062 -142792 -240468 -195514 -123232 -3842 85322 137279 59205 -2121 -94151
10463 -94151 -177603 -136014 -27163 -47182 -107068 -41718 -105115 -179159 -226784 -279187 -258887
10452 -258887 -203119 -192888 -233977 -257562 -240642 -137258 -1902 -46688 -137590 -114738 -81759
10441 -81759 -111196 -113201 -116543 -65248 -61539 68399 44483 -4572 -36161 -37253 11770 -1286
10429 -1286 -52829 -97676 -172107 -137584 -137951 -126232 -143353 -193878 -157457 -28956 -91370 -98937
10417 -98937 -177981 -114433 -11720 71217 120956 92107 78090 31410 42035 -28320 32145
10406 32145 113581 109083 53606 -56760 -121481 -30019 -72055 -137071 -76490 -45973 -5963 46207
10394 46207 87121 -11034 -49572 -18930 -41217 -194706 -137821 -7390 -50398 -50051 -48047 -30742
10382 -30742 -82582 -68241 -223075 -253216 -148771 -46392 -114647 -151441 -17532 74057 9067
10371 9067 -5063 -89336 -223060 -7123 72353 74545 135196 143587 20442 -69442 -160335 -162863
10359 -162863 -118201 -116256 -80388 -20407 -82524 -109529 -144871 -69925 -38218 -37388 -37090 83
10347 83 6507 -74361 -176075 -214246 -107905 -7858 5232 -17768 -37645 -36803 -113474 -143618
10335 -143618 -141869 -121561 -21510 122805 106808 5230 -30612 -52963 -54120 7996 163660
10324 163660 199209 165584 12943 -72608 -86891 -75623 -30067 7498 -18781 12743 112306
10313 112306 37423 125527 4276 -28237 96889 156135 178796 216864 132222 -43080 -262019
10302 -262019 -207215 -109121 -41250 -96590 -30966 41227 119905 79689 -38319 -95974 -74228
10291 -74228 5234 59962 167640 132051 74036 -37203 -68994 -20013 -28526 -39347 -15
10280 -15 -34645 -16465 114050 173329 122916 59774 54434 101072 167875 264868 221076 160435
10268 160435 96126 31506 -48319 -60258 -11803 66616 983 -50484 -108608 -44643 -92136
10257 -92136 -145558 -178712 -26852 -27004 -180979 -203872 -122005 -49407 -12092 -34248 55526 65344
10245 65344 35439 2877 -37240 -51694 -17130 -85173 26778 255158 300278 278306 175536
10234 175536 178757 246202 298503 456897 561586 607925 626102 786438 923454 1090155 1362551
10223 1362551 1325842 1337121 1456002 1421636 1228201 894132 760669 666040 564910 513450
10213 513450 463768 537707 471851 464317 434145 440434 508168 490371 403655 291380 285795 250376
10201 250376 296958 353142 419710 422221 498285 622522 695159 812947 980323 1029508 1101831
10190 1101831 1472620 1882342 2259215 2548887 2804231 2908233 3005752 2904178 2678427 2291268
10180 2291268 1964890 1749758 1366846 1110946 1041385 1035227 1001830 958904 847131 761981
$$ [...]
##END NTUPLES=NMR SPECTRUM
##END=
