##TITLE=Analysis number 321396
Compound Code cc 50313
Book Reference 438/182
Project Code adrs
Chemist Name antons
##JCAMPDX= 6.0         $$ Bruker NMR JCAMP-DX V2.0
##DATA TYPE= NMR SPECTRUM
##DATA CLASS= NTUPLES
##ORIGIN= Bruker BioSpin GmbH
##OWNER= nmr
$$ XWIN-NMR		Version 3.5
$$ Wed Aug  9 09:45:50 2006 GMT Daylight Time (UT+1h)  MAYBRIDGE\nmr@NMR_250MHZ
##.OBSERVE FREQUENCY= 250.131544655141
##.OBSERVE NUCLEUS= ^1H
##.ACQUISITION MODE= SIMULTANEOUS (DQD)
##.ACQUISITION SCHEME= undefined
##.AVERAGES= 16
##.DIGITISER RES= 18
##SPECTROMETER/DATA SYSTEM= dpx250
##.PULSE SEQUENCE= zg30
##.SOLVENT NAME= CDCl3
##.SHIFT REFERENCE= (INTERNAL, CDCl3, 0, 16.522)
##AUDIT TRAIL= $$ (NUMBER, WHEN, WHO, WHERE, WHAT)
$$ ##TITLE= Audit trail, XWIN-NMR		Version 3.5
$$ ##JCAMPDX= 5.01
$$ ##ORIGIN= Bruker BioSpin GmbH
$$ ##OWNER= nmr
$$ C:\u/data/dgb/nmr/ADRS/470/pdata/1/auditp.txt
$$ ##AUDIT TRAIL=  $$ (NUMBER, WHEN, WHO, WHERE, WHAT)
(   1,<2006-08-09 09:45:26.29 +100>,<MAYBRIDGE\nmr>,<NMR_250MHZ>,
      <created by zg, POWCHK disabled, PULCHK disabled
       configuration hash MD5:
       E2 DF 36 D8 04 B2 41 60 5A D7 A3 38 5A 4B D0 FE
       data hash MD5: 64K
       FC 58 80 E0 6D 70 8B E4 0B 79 3C 2E 3C C5 DC D5>)
(   2,<2006-08-09 09:45:39.63 +100>,<MAYBRIDGE\nmr>,<NMR_250MHZ>,
      <Start of raw data processing
       ef LB = 0.3 FT_mod = 6 PKNL = 1 SI = 32K 
       data hash MD5: 32K
       14 EA 1B 74 88 34 BF ED D0 95 B4 A4 16 6E 2E 52>)
(   3,<2006-08-09 09:45:41.35 +100>,<MAYBRIDGE\nmr>,<NMR_250MHZ>,
      <apk 
       data hash MD5: 32K
       17 C2 C1 BD 9E 60 AD 4F 03 F9 A9 E4 3E 09 B8 F8>)
(   4,<2006-08-09 09:45:42.10 +100>,<MAYBRIDGE\nmr>,<NMR_250MHZ>,
      <abs ABSG = 5 
       data hash MD5: 32K
       4A B0 FD A6 20 9B 3B 01 FC A2 2C 21 35 D9 42 35>)
$$ ##END=
$$ 
$$ hash MD5
$$ AA 02 83 33 7F 11 F5 AD 19 72 9C 18 22 F0 8B 95
##$RELAX= 
##$RELAX= 
##$RELAX= 
##$RELAX= 
##$RELAX= 
##$RELAX= 
##$RELAX= 
$$ Bruker specific parameters
$$ --------------------------
##$DU= <C:\u>
##$EXPNO= 470
##$NAME= <ADRS>
##$PROCNO= 1
##$TYPE= <nmr>
##$USER= <dgb>
##$AMP= (0..31)
100 100 100 100 100 100 100 100 100 100 100 100 100 100 100 100 100 100 
100 100 100 100 100 100 100 100 100 100 100 100 100 100 
##$AQSEQ= 0
##$AQ_mod= 3
##$AUNM= <au_zg>
##$AUTOPOS= <6 >
##$BF1= 250.13
##$BF2= 250.13
##$BF3= 250.13
##$BF4= 250.13
##$BF5= 500.13
##$BF6= 500.13
##$BF7= 500.13
##$BF8= 500.13
##$BYTORDA= 1
##$CFDGTYP= 0
##$CFRGTYP= 5
##$CHEMSTR= <none>
##$CNST= (0..31)
1 1 145 1 1 1 1 1 1 1 1 1 1 1 1 1 1 1 1 1 1 1 1 1 1 1 1 1 1 1 1 1 
##$CPDPRG= <>
##$CPDPRG1= <>
##$CPDPRG2= <>
##$CPDPRG3= <>
##$CPDPRG4= <mlev>
##$CPDPRG5= <mlev>
##$CPDPRG6= <mlev>
##$CPDPRG7= <mlev>
##$CPDPRG8= <mlev>
##$CPDPRGB= <>
##$CPDPRGT= <>
##$D= (0..31)
0 1 0 0 0 0 0 0 0 0.06 0 0 0 0 0 0 0.0002 0 0 0 0 0 0 0 0 0 0 0 0 0 0 
0 
##$DATE= 1155113125
##$DBL= (0..7)
120 120 120 120 120 120 120 120 
##$DBP= (0..7)
150 150 150 150 150 150 150 150 
##$DBP07= 0
##$DBPNAM0= <>
##$DBPNAM1= <>
$$ [...]
##$SUBNAM7= <"">
##$SUBNAM8= <"">
##$SUBNAM9= <"">
##$SW= 20.6930455092707
##$SWIBOX= (0..15)
0 0 3 0 0 0 0 0 0 0 0 0 0 0 0 0 
##$SW_h= 5175.983436853
##$TD= 65536
##$TD0= 1
##$TE= 294.16
##$TE2= 300
##$TE3= 300
##$TEG= 300
##$TL= (0..7)
0 120 120 120 120 120 120 120 
##$TP= (0..7)
150 150 150 150 150 150 150 150 
##$TP07= 0
##$TPNAME0= <>
##$TPNAME1= <>
##$TPNAME2= <>
##$TPNAME3= <>
##$TPNAME4= <>
##$TPNAME5= <>
##$TPNAME6= <>
##$TPNAME7= <>
##$TPOAL= (0..7)
0.5 0.5 0.5 0.5 0.5 0.5 0.5 0.5 
##$TPOFFS= (0..7)
0 0 0 0 0 0 0 0 
##$TUNHIN= 0
##$TUNHOUT= 0
##$TUNXOUT= 0
##$USERA1= <user>
##$USERA2= <user>
##$USERA3= <user>
##$USERA4= <user>
##$USERA5= <user>
##$V9= 5
##$VALIST= <valist>
##$VCLIST= <CCCCCCCCCCCCCCC>
##$VD= 0
##$VDLIST= <DDDDDDDDDDDDDDD>
##$VPLIST= <PPPPPPPPPPPPPPP>
##$VTLIST= <TTTTTTTTTTTTTTT>
##$WBST= 1024
##$WBSW= 4
##$XGAIN= (0..3)
0 0 0 0 
##$XL= 0
##$YL= 0
##$YMAX_a= 430040
##$YMIN_a= -521094
##$ZGOPTNS= <>
##$ZL1= 120
##$ZL2= 120
##$ZL3= 120
##$ZL4= 120
##$ABSF1= 16.522
##$ABSF2= -4.171173
##$ABSG= 5
##$ABSL= 3
##$ALPHA= 0
##$AQORDER= 0
##$ASSFAC= 0
##$ASSFACI= 0
##$ASSFACX= 0
##$ASSWID= 0
##$AUNMP= <proc_1d>
##$AZFE= 0.1
##$AZFW= 0.1
##$BCFW= 0
##$BC_mod= 0
##$BYTORDP= 0
##$COROFFS= 0
##$CY= 12.5
##$DATMOD= 1
##$DC= 0
##$DFILT= <>
##$DTYPP= 0
##$F1P= 14.0000005364418
##$F2P= -0.99999901652339
##$FCOR= 0.5
##$FTSIZE= 32768
##$FT_mod= 6
##$GAMMA= 0
##$GB= 0
##$INTBC= 1
##$INTSCL= 1
##$ISEN= 128
##$LB= 0.3
##$LEV0= 0
##$LPBIN= 0
##$MAXI= 10000
##$MC2= 0
##$MEAN= 0
##$ME_mod= 0
##$MI= 0
##$NCOEF= 0
##$NC_proc= -5
##$NLEV= 6
##$NOISF1= 0
##$NOISF2= 0
##$NSP= 0
##$NTH_PI= 0
##$NZP= 0
##$OFFSET= 16.522
##$PC= 1
##$PHC0= 147.3123
##$PHC1= 8.105941
##$PH_mod= 1
##$PKNL= yes
##$PPARMOD= 0
##$PSCAL= 4
##$PSIGN= 0
##$REVERSE= no
##$SF= 250.13
##$SI= 32768
##$SIGF1= 0
##$SIGF2= 0
##$SINO= 400
##$SIOLD= 32768
##$SREGLST= <1H.CDCl3>
##$SSB= 0
##$STSI= 32768
##$STSR= 0
##$SW_p= 5175.98343685301
##$SYMM= 0
##$S_DEV= 0
##$TDeff= 65536
##$TDoff= 0
##$TI= <Analysis number 999999
Compound Code 99
Book Reference 9
Project Code 9>
##$TILT= no
##$TM1= 0
##$TM2= 0
##$TOPLEV= 0
##$USERP1= <user>
##$USERP2= <user>
##$USERP3= <user>
##$USERP4= <user>
##$USERP5= <user>
##$WDW= 1
##$XDIM= 32768
##$YMAX_p= 597642936
##$YMIN_p= -245715
$$ End of Bruker specific parameters
$$ ---------------------------------
##NTUPLES= NMR SPECTRUM
##VAR_NAME=  FREQUENCY,     SPECTRUM/REAL,   SPECTRUM/IMAG
##SYMBOL=    X,             R,               I
##VAR_TYPE=  INDEPENDENT,   DEPENDENT,       DEPENDENT
##VAR_FORM=  AFFN,          ASDF,            ASDF
##VAR_DIM=   32768,         32768,           32768
##UNITS=     HZ,            ARBITRARY UNITS, ARBITRARY UNITS
##FACTOR=    0.157963299565203, 1,           1
##FIRST=     4132.6476996994, 0,             0
##LAST=      -1043.33573715361, 0,           0
##MIN=       -1043.33573715361, -245715,     0
##MAX=       4132.6476996994, 597642936,     0
$$ Real data points
##PAGE= N=1
##DATA TABLE= (X++(R..R)), XYDATA
$$ [...]
14591a2369k7995p2151J0419J5307M6470K4015l4426n9806n1633J1227J3412J404
14579a36126j0464Q2176P6940p381j2428n2053n811P61o4874m237L6869M9512
14567d7116r413N6430N1183L1833l2029o5164n4459k1337J4884K5821L8602j4751
14555b5516l3103K979J7359M5453o659k1528k3775k4393O8370J9752o416k3732
14543a1209n4956j6216K401n5114M0607J5277j6766P2783R9956n5705k2214r643
14531a0799p631l2170O8204m3024j7495Q27j8639r799L4369p407o1210j973l0089
14518a36836j0051N7881r555l1639p63M4439J01747K8468j334j1616m4960l7293
14506e1512K5576K7484M8081K7818l2147r9850P400K4059j9801J8772l6476l1303
$$ plain form
14591 -12369 -40364 -112515 -102096 -86789 -40319 -16304 -50730 -110536 -162169 -150942 -137530 -136126
14579 -136126 -146590 -64414 12526 5145 -7283 -59336 -65147 -64386 -129260 -133497 -96628 -47116
14567 -47116 -56529 -99 51084 82917 50888 -14276 -68735 -90072 -75188 -49367 -10765 -25516
14555 -25516 -58619 -55640 -38281 7172 513 -21015 -44790 -69183 -813 18939 12523 -11209
14543 -11209 -66165 -82381 -79980 -135094 -94487 -79210 -95976 -23193 76763 21058 -1156 -10799
14531 -10799 -18430 -50600 17604 -25420 -42915 -42088 -60727 -70526 -36157 -43564 -104774 -106747 -136836
14518 -136836 -146887 -89006 -98561 -130200 -130963 -86524 15223 43691 42357 30741 -14219 -51512
14506 -51512 -25936 1548 49629 77447 45300 -54550 -47150 -23091 -42892 -24120 -60596 -91899
14494i1899m3023J4777O9546k3271J310K3003n991J095L3353M7412J4786l0722
14482A0376J4506k3903J3701j9231m5103j3788n8896Q046M1464K7117O521P3911
14470C4721m4622j24109l8509M1822K5630o227N8541N0535m7139j5192K520P5596
14458A3567L0566P689k5311l1890o0245Q434L0276l1177k8128l016j9066J0054
14446i8247M8045J8102j3599l3519K4468j8379l770N7846k7863k6189L1912K5146
14434a6047J334j8062o5076l3654J418q609K350J1388J5473L4231K4542P515J3219
14421b9978k7105K1K1725p653P039l8842m1837K9490J324Q8476J2084l9217j3491
14408c7964N0068L6886M8489K3774m1072n2903J2551m184j9956r5011l33J6887
$$ plain form
14494 -91899 -134922 -120145 -50599 -73870 -72560 -49557 -55548 -54453 -21100 26312 41098 10376
14482 10376 24882 979 14680 -4551 -49654 -63442 -122338 -114292 -72828 -45711 -39190 34721
14470 34721 -9901 -134010 -172519 -130697 -105067 -111294 -52753 -2218 -49357 -64549 -62029 13567
14458 13567 44133 51822 26511 -5379 -65624 -57190 -26914 -58091 -86219 -89235 -108301 -98247
14446 -98247 -50202 -32100 -45699 -79218 -54750 -73129 -76899 -19053 -46916 -73105 -41193 -16047
14434 -16047 -14713 -32775 -97851 -131505 -130087 -138696 -136346 -124958 -109485 -75254 -50712 -43197 -29978
14421 -29978 -57083 -57062 -35337 -42990 -35951 -74793 -116630 -87140 -85816 2660 14744 -24473 -37964
14408 -37964 12104 48990 97479 121253 80181 27278 39829 35645 15689 -79322 -79655 -62768
14396f2768J4582K9340L5509N283N089L0286Q852l2449l7544j0873n4084m271
14384g3048j8621M1434l4961m2848L5473J3873l3799M0209J5348L069J7269L4523
14372b079L1840k6741m8868q639K360j7830l5159k24l442K6218N348Q187j9474
14359h8503J3161P586n9050l803l0747J1058L6065L1083J280k3864M7276Q4129
14347B5671p0192n5123q168K7353n3760K1373N9901J0170l766p807K511l3003
14335h4840M8350K7361m7933l0909J4097K4694J1319m5711l0731K4854l1379m4721
14323a65549j9023M4130P1765L266K480j674P813l3064j9673l469L6978j5581
14311i1601O288L5264j371M923N698K2467K6021J23l4674l0771k4053l9921K8488
$$ plain form
14396 -62768 -48186 -18846 16663 21946 27035 57321 66173 33724 -3820 -14693 -68777 -73048
14384 -73048 -91669 -50235 -85196 -128044 -92571 -78698 -112497 -72288 -56940 -53871 -36602 -2079
14372 -2079 29761 3020 -45848 -54487 -52127 -69957 -105116 -105340 -108782 -82564 -77216 -69029 -88503
14359 -88503 -75342 -67756 -126806 -130609 -161356 -150298 -114233 -83150 -81870 -105734 -58458 25671
14347 25671 -44521 -99644 -107812 -80459 -134219 -112846 -52945 -42775 -46541 -54348 -51837 -84840
14335 -84840 -36490 -9129 -57062 -87971 -73874 -49180 -37861 -83572 -114303 -89449 -120828 -165549
14323 -165549 -184572 -140442 -68677 -65411 -62931 -64605 -56792 -89856 -109529 -112998 -76020 -91601
14311 -91601 -85313 -50049 -51420 -46497 -40799 -18332 7689 7812 -26862 -57633 -81686 -121607 -93119
14298i3119j6372K2514j4439K5651O8435k5782l9117M5342J9123P05k0015K593
14286b4481J625o0274k8360J1711k8803m9168M6526k341O7634M4120j6744k1539
14274f0094r564L6792L5269j2404J4585r49m7556R415K3417J980J519m5705m172
14261e7467J2963K1925k5472K0399J1279K5140n2158l8293J4404L1729k3951n499
14249f5001J0997P508K3264J4079n0L0425o2869m8509m1352j4643M5727K0650
14237g9774k2835K0201K4613M5231o72l0874N793o8586J04J1443O6212M9508l6710
14224a6346j351n736j8816l7017l8320j9097K4314L99m547o881J6583K0319O66
14211h5830p45K1342J5278l9177M8429M5593m2722O756l072o802q6593k5381J3634
$$ plain form
14298 -93119 -109491 -86977 -101416 -75765 -7330 -33112 -72229 -26887 -7764 -7059 -27074 -24481
14286 -24481 -22856 -83130 -111490 -99779 -128582 -177750 -131224 -133565 -65931 -21811 -38555 -60094
14274 -60094 -69658 -32866 2403 -10001 4584 3635 -43921 -34506 -11089 -9109 -7590 -53295 -57467
14261 -57467 -44504 -22579 -48051 -27652 -16373 8767 -43391 -81684 -67280 -35551 -59502 -65001
14249 -65001 -54004 -46496 -23232 -9153 -9203 21222 -41647 -90156 -131508 -146151 -100424 -79774
14237 -79774 -102609 -82408 -57795 -12564 -13236 -44110 -38317 -106903 -106799 -95356 -29144 20364 -16346
14224 -16346 -17697 -23433 -42249 -79266 -117586 -136683 -112369 -111970 -116517 -123398 -106815 -86496 -85830
14211 -85830 -86575 -65233 -49955 -89132 -40703 4890 -37832 -31076 -34148 -40950 -127543 -152924 -139290
14198a39290O2861J0025j0159r533L1002L7362m3569n3848K3803L3847l3585Q73
14186i0211J7528k6857m9019K0397L1677j3217L1701J1531p754K3166k7042k5920
14174a04020n859j5249j3544l036k206j5963N1954P9263O2059J136k8461r9357
14162i3283q2699J845R2663O1737J101K3512m0763p0868o839K626J6307k9331
14150a23992o8975k7412N4299O7923M9371L3206J5028P466k1287o287n7089j0925
14138h8674l9295J9423N3617N296M992n0530p044L0102j5442J6696q319K6108
14126e3070O9153K3746q3297k2037M985P736m4015j326L5321M9051L7304K048
14114B5599o5267k2465k0531n9956K009r775q938K7906O3007j9171J7358p748
$$ plain form
14198 -139290 -76429 -66404 -76563 -86096 -55094 -17732 -61301 -115149 -91346 -57499 -91084 -90211
14186 -90211 -72683 -99540 -148559 -128162 -96485 -109702 -78001 -66470 -74224 -51058 -78100 -104020
14174 -104020 -109879 -125128 -138672 -141708 -143914 -159877 -107923 -28660 33399 34535 6074 -93283
14162 -93283 -175982 -174137 -81474 -19737 -18636 4876 -35887 -106755 -113594 -110968 -94661 -123992
14150 -123992 -192967 -220379 -166080 -98157 -48786 -15580 -552 6914 -14373 -20660 -77749 -88674
14138 -88674 -127969 -108546 -54929 -49633 -44641 -95171 -102215 -72113 -87555 -70859 -79178 -53070
14126 -53070 16083 39829 -43468 -65505 -60520 -52784 -96799 -98125 -62804 -13753 23551 25599
14114 25599 -39668 -62133 -82664 -142620 -140611 -150386 -159324 -131418 -68411 -87582 -70224 -77972
14102g7972M1694L6834j3569n0947k9455L2493Q721L0376N1461p2519j09434N325
14090a46992j989J5424M810L4499O9863p971J2077m325O951P53k7326K3223L295
14077a7708J318M2093J2968J3029j1387j882n3995l8675K4354L2218j5055j7185
14065b9907o2573k0447N324m3859m2369M983J6124M9905j6371n8737k329K5112
14053a75144K8084P5410L9993K0291k3387m1797M583K8924l0277j6087K5439K1062
14041d2906M5521L2523o8910m8014K0402m354k6525M7562J5120n9181N1532O6819
14029B9589j3549J0706J5185j6909Q229k388m5453L3631J0445o248k8512o1871
14017f7145Q319K4488q583M731N3717P322j0018n4424m2024m3563n3961J0424
$$ plain form
14102 -77972 -36278 556 -13013 -63960 -93415 -60922 -52201 -21825 29636 -42883 -152317 -146992
14090 -146992 -148981 -133557 -128747 -94248 -24385 -32356 -20279 -24604 -17653 -16900 -44226 -21003 -17708
14077 -17708 -16390 25703 38671 51700 40313 38431 -15564 -54239 -29885 2333 -12722 -29907
14065 -29907 -92480 -112927 -107603 -151462 -193831 -188848 -172724 -122819 -139190 -197927 -200256 -175144
14053 -175144 -147060 -71650 -31657 -11366 -34753 -76550 -71967 -43043 -73320 -89407 -63968 -42906
14041 -42906 2615 35138 -33772 -81786 -61384 -65738 -92263 -44701 -29581 -88762 -37230 29589
14029 29589 16040 26746 41931 25022 33251 30863 -14590 19041 29486 23238 -5274 -67145
14017 -67145 -58826 -34338 -42921 -38190 15527 22849 12831 -41593 -83617 -127180 -181141 -170717
14005a70717L8275L2482R8418j9095m5838n5126J8450M0077M574j3084m1051L8345
13993g4290N911P071l7057J1731k649K3192M7565l5342q903j1794j2016j449J6124
13980g1906L4168R711J4270J0797j0144M6757L8391p1759r8114o1859L7226K6744
13968i5718j6100r903K6465j0339j9876K5901M9614l8379n5508l5831J1507J7426
13956a50741K941J5982K5459M5312K9884o486q000n097J2838M213J3886l0720
13944e0529M971j4755L5536K9586o2480k9120Q2075l6370l0647l164q895l1734
13932a15526K1386Q5960M2228o1379n8739Q862R965N929J2117L0779j7465j0072
13920d5955M4624m555l1838Q527K8986K5288n3634p1908k5202K3437K297p42J8540
$$ plain form
14005 -170717 -132442 -99960 -1542 -20637 -66475 -121601 -103151 -63074 -58500 -71584 -112635 -74290
13993 -74290 -68379 -61308 -98365 -86634 -89283 -66091 -18526 -53868 -62771 -74565 -86581 -88030 -71906
13980 -71906 -37738 -28027 -13757 -2960 -13104 33653 72044 285 -97829 -159688 -122462 -95718
13968 -95718 -111818 -121721 -95256 -105595 -125471 -99570 -49956 -88335 -143843 -179674 -168167 -150741
13956 -150741 -147800 -131818 -106359 -61047 -31163 -37649 -45649 -50746 -37908 -33695 -19809 -50529
13944 -50529 -45558 -60313 -24777 4809 -57671 -86791 -4716 -41086 -71733 -74897 -83792 -115526
13932 -115526 -94140 -8180 34048 -27331 -86070 -77208 -67243 -61314 -49197 -18418 -35883 -45955
13920 -45955 -1331 -5886 -37724 -29197 -211 25077 -28557 -100465 -125667 -102230 -99933 -100675 -82135
13907h2135O7629j2883l0045Q991J5466o521N001K4875j6589n3518m4838j5712
13895a40279K781N8926M1383l3410J9087M3518j3273M1711p822L0701l4264q963
13883I6J5100k4946l9971J1808K9431l797K4392M4873L0575m6960m5608j6959
13871b1966K6465r785N2002K3551m7864m6255m2968q6830J6025K5719M8311L9524
13859b4071k3467n7055k1900l4263j7554P4778k4010N3063N0231r486n2056Q521
13847g7269K7587J9263l3040n2196K9972J4518N6384j3404p0099L1897l375k7576
13835i7338M0184L0133J3271k9327j9399O8819L4068J5985n7185l5940o5741r383
13823a11853J7536L0198l3944o3654Q355J3533k0262j1235O9776N3260j678j7506
$$ plain form
13907 -82135 -14506 -27389 -57434 -48443 -32977 -39498 -34497 -9622 -26211 -79729 -124567 -140279
13895 -140279 -137498 -78572 -37189 -70599 -51512 -7994 -21267 20444 12622 43323 9059 96
13883 96 15196 -9750 -49721 -37913 -8482 -12279 12113 56986 87561 40601 -5007 -21966
13871 -21966 4499 -5286 46716 70267 22403 -23852 -66820 -153650 -137625 -111906 -63595 -24071
13859 -24071 -47538 -104593 -126493 -160756 -178310 -103532 -127542 -74479 -24248 -33734 -85790 -77269
13847 -77269 -49682 -30419 -63459 -115655 -85683 -71165 -14781 -28185 -98284 -66387 -69762 -97338
13835 -97338 -57154 -27021 -13750 -43077 -62476 6343 40411 56396 -789 -36729 -102470 -111853
13823 -111853 -94317 -64119 -98063 -161717 -153362 -139829 -160091 -171326 -101550 -48290 -49968 -67474
13811f7474k2410l3863k2068L6999N070n3463O721m371J0350M4323P0607k9284
13799e8863k2396q632L100K0254J6065k0872q7J3827K1010j6545l2699l0792j6195
13786a32825k1458j4727P3193R146L385K8952L169l3186k0714K2411p771j9160
13774a09585l709O1616O2547p762m7408j181k895O8778J637o6828j9853N868l704
13761f2479j160j3822j7170P0897L5748K4703N7954K4351j18380q4065j9803J9894
13749h3332R4926N4154p0137r5207J0167O4584K1004R813K3905L8681l3543j03588
13737f8573o6954l8199L3356O1635J1342K3279P664j961k6508r758J4842N3864
13725e971m3142n409k148l8509r816k4186p5564M0676K9477K8502K5385J9333
$$ plain form
13811 -67474 -89884 -123747 -145815 -108816 -103746 -157209 -150488 -154859 -144509 -100186 -29579 -58863
13799 -58863 -81259 -89891 -86791 -66537 -50472 -71344 -71431 -57604 -36594 -53139 -85838 -116630 -132825
13786 -132825 -154283 -169010 -95817 -86671 -83286 -54334 -51165 -84351 -105065 -82654 -90425 -109585
13774 -109585 -113294 -51678 10869 3107 -44301 -45482 -48377 20401 22038 -44790 -64643 -58775 -62479
13761 -62479 -63639 -77461 -94631 -23734 12014 36717 94671 119022 642 -83423 -103226 -83332
13749 -83332 11594 65748 -4389 -99596 -89429 -24845 -3841 5972 29877 68558 35015 -68573
13737 -68573 -135527 -173726 -140370 -78735 -67393 -44114 -36450 -38411 -64919 -74677 -59835 -5971
13725 -5971 -49113 -54522 -56670 -95179 -104995 -129181 -204745 -164069 -134592 -106090 -80705 -61372
13713f1372j480m3635P169M542Q720J852K4707l6103J1264m123m9604l898O5695
13700g6266p392L4634K2589k2784m6347j5600r816m1438r279k7711K9055O3800
13688a06555M1757L8976j7781k3812J1664l0227M4319k1563o015n1828j0451L7050
13676i4466J7199k2636L9818O6708R831O9340n1731n6936j5463k1080L8116j5444
13664c6744p970j9162n831K8774j1758K1489K8797m2582l1581n607r971l7031
13652a29177m2124j559M9466P307m8429J6971M9264M3429j5768L7425L6218O616
13640I639j3041p1740l3776k6295p5141l5361N0462O5800O0157k723r552M459
13628g7112j2719K1076k123r884M3759p4459j6438M7768M5393N9178J6353J6329
$$ plain form
13713 -61372 -62852 -106487 -99318 -94776 -86056 -84204 -59497 -95600 -84336 -88459 -138063 -141961 -76266
13700 -76266 -83658 -49024 -26435 -49219 -95566 -111166 -120982 -162420 -171699 -199410 -170355 -106555
13688 -106555 -64798 -25822 -43603 -67415 -55751 -85978 -41659 -63222 -69237 -121065 -131516 -94466
13676 -94466 -77267 -99903 -60085 6623 16454 85794 34063 -22873 -38336 -59416 -21300 -36744
13664 -36744 -44714 -63876 -69707 -40933 -52691 -31202 -2405 -44987 -76568 -82175 -92146 -129177
13652 -129177 -171301 -172860 -123394 -116087 -164516 -147545 -98281 -54852 -70620 -33195 3023 9639
13640 9639 -3402 -75142 -108918 -135213 -210354 -245715 -195253 -129453 -69296 -72019 -81571 -77112
13628 -77112 -89831 -68755 -70878 -80762 -37003 -111462 -127900 -80132 -34739 24439 40792 57121
13616E7121p21j3817l065L0288k6072n4563l1346l4664m6317r385N183K0945R555
13603i6858j6415L6789K9416J2735k703m6231l4212k8816l5853M8775K5310J1008
13591i7055k260J8784J4669J0166M721N58j8913L2195j448l3636J7648K1677k0458
13578e3352q2802N11N804O205r587J7668L3050K6149k8236l9547k4959M894J4663
13565a29539J6763j0125l1584L1082K5073l4458k6002K5421l0023J4581K3164
13554a25647L2821n302p7311j2979r030Q907J08223M8240M1541K3963j1769n9103
13542c7446m575m7790m0986N575O8701Q7368K2852m0182j8672m3066l0755K7534
13530e1442l6839j4265N5497p053k1532o232k335k7014J2689m3662J1804J7677
$$ plain form
13616 57121 56400 42583 39518 69806 43734 -10829 -42175 -76839 -123156 -132541 -127358 -106413 -96858
13603 -96858 -113273 -76484 -47068 -34333 -37036 -83267 -117479 -146295 -182148 -133373 -108063 -97055
13591 -97055 -99315 -80531 -65862 -55696 -50975 -50417 -69330 -37135 -38583 -72219 -54571 -32894 -53352
13578 -53352 -136154 -135643 -129839 -123634 -133221 -115553 -82503 -56354 -84590 -124137 -149096 -144202 -129539
13565 -129539 -112776 -122901 -154485 -123403 -98330 -132788 -158790 -133369 -163392 -148811 -125647
13554 -125647 -92826 -98128 -175439 -188418 -197448 -188541 -80318 -32078 9463 33426 21657 -37446
13542 -37446 -42021 -89811 -130797 -125222 -56521 30847 53699 13517 -5155 -48221 -78976 -51442
13530 -51442 -88281 -102546 -47049 -54102 -75634 -81866 -84201 -111215 -98526 -142188 -130384 -112707
13518a12707K036p401Q839L4045P014J8857J0129r566j5937N8521M4914m0949
13506b205l5430M911J6820j1404k23o9390m8390j0269L40k8778R4879J33293J9851
13493F4005J940L656k3860n7458r688j529O4424K1077j466n6336l4812j4728l232
13480d8007L0548l8381r347J7206J8916o72J8172j4846L2742Q355j8034M770l2694
13467c1272l3876l0050n047M4808j249K1258K3916j1552M547l1343o1780L8239
13455g3401M0650m8207p4232L0759M3422n566j551K3340L8519L707m9590l3386
13443a05536j0342J3200L3260P4582N1473L5849n3496m1516k9357o5698k6639
13432a24220N3920K5106m9627m597K407m2316l5240K7032L9371l0340L3502O5761
$$ plain form
13518 -112707 -110671 -118072 -109233 -75188 -68174 -49317 -39188 -48754 -64691 -6170 38744 -2205
13506 -2205 -37635 -32724 -15904 -27308 -27531 -96921 -145311 -155580 -155240 -184018 -89139 44154 64005
13493 64005 65945 69601 45741 -11717 -21405 -22934 41490 62567 61101 4765 -30047 -44775 -48007
13480 -48007 -17459 -55840 -65187 -47981 -29065 -29737 -11565 -26411 6331 14686 -3348 1422 -31272
13467 -31272 -65148 -95198 -100245 -55437 -56686 -35428 -11512 -23064 -18517 -49860 -111640 -73401
13455 -73401 -32751 -80958 -155190 -124431 -81009 -86575 -88126 -64786 -26267 -22560 -72150 -105536
13443 -105536 -115878 -102678 -69418 5164 56637 92486 38990 -2526 -31883 -97581 -124220
13432 -124220 -70300 -45194 -94821 -99418 -97011 -139327 -174567 -147535 -108164 -138504 -105002 -39241
13420c9241K2754k2171l3303m1524J7315M6189N8472o042l1824m4742J684M9224
13408b3209k3679N836n452q348m465L610J2050M4676J456l0303m2020j2524l0503
13395a12875k0598L9997p040l6326J3553K4680K6435L414l9274k4852L1079j0327
13383a12134n9501k4446M1587N0152L1352N999P5752N40P519o333p2062R687J722
13370e0166l3976M8759L9763m4980K7870J9580n0584k1032M4631K5509M6608K0113
13358G2095m4561l7420J3869j7401m575K5209O0216K2857k9860r2952k5384k5904
13346h3811j6354M6444j958j904K1252k449J399l4472l7667J1252L940L541j8427
13333a09214j8129N9013N0550L8505o9919k605K4131L3506m5745n7839m4183J5553
$$ plain form
13420 -39241 -16487 -38658 -71961 -113485 -96170 -49981 8491 2449 -29375 -74117 -72433 -23209
13408 -23209 -46888 -41052 -46504 -54852 -59317 -55707 -43657 1019 2475 -27828 -69848 -82372 -112875
13395 -112875 -133473 -93476 -100516 -136842 -123289 -98609 -72174 -68760 -108034 -132886 -101807 -112134
13383 -112134 -171635 -196081 -154494 -104342 -72990 -66991 8761 9301 16820 10487 -61575 -51888 -50166
13370 -50166 -84142 -35383 4380 -40600 -12730 6850 -43734 -64766 -20135 5374 51982 72095
13358 72095 27534 -9886 3983 -13418 -17993 7216 67432 90289 60429 -32523 -57907 -83811
13346 -83811 -100165 -53721 -55679 -57583 -36331 -38780 -37381 -71853 -109520 -98268 -94328 -90787 -109214
13333 -109214 -127343 -68330 -17780 20725 -49194 -51799 -27668 5838 -39907 -97746 -141929 -126376
13321a26376n161K252J0663k3079N8900K7049l973R046p295R594K444J3127K017
13308c0792J9272K4419K5458k461o3588k7860K8303j249j6506L7762j0533k9128
13296d6903n5082Q785N2003k3983l8623k5986K5802L2439k5093k7396k6438J6445
13284a34030K7079Q0121N7304m9598l7409J832j9374L8219r85l512L0183j0529
13272b0699O6794n025P386n6859o0578l8047J09638K8871r9558n4035l7613N126
13260a54599M4556N3750l4322l8872l021L0541M8091k1304n015N8346o631m3089
13248g1569J5600k5308k7546k9475N6325O6659m8929l4618j4693l1767K4690M0297
13236h0334J6580L5804J8504Q513l5441m1641J2957j9281k174j2704N3068Q6615
$$ plain form
13321 -126376 -131537 -129285 -118622 -141701 -82801 -55752 -59725 -50679 -57974 -48380 -45936 -32809 -30792
13308 -30792 -11520 12899 38357 35896 -27692 -55552 -27249 -28498 -45004 -7242 -17775 -46903
13296 -46903 -101985 -93200 -41197 -65180 -103803 -129789 -103987 -71548 -96641 -124037 -150475 -134030
13284 -134030 -106951 -26830 30474 -19124 -56533 -54701 -74075 -35856 -36841 -40353 -10170 -20699
13272 -20699 46095 41070 48456 -8403 -68981 -107028 2610 31481 -68077 -122112 -159725 -154599
13260 -154599 -110043 -56293 -90615 -129487 -132508 -101967 -53876 -75180 -80195 -21849 -28480 -71569
13248 -71569 -55969 -81277 -108823 -138298 -81973 -15314 -64243 -98861 -113554 -145321 -120631 -80334
13236 -80334 -63754 -27950 -9446 -933 -36374 -78015 -65058 -84339 -86513 -99217 -46149 40466
13224D0466k1541k711k1714j404m969j0803R346q03L3329J4020K264k3161l7819
13211b5500p855J2233L3919L7616K3339m8927n3703k3545L0158l5210O672M8432
13199b371M0126j104r053Q239k8058o5289k8191N441L847L144m791L8963M3768
13186D671j5208J8620m2894n7912j3742O0994N8956q162o5794Q861M70m4136N575
13173h9701L0466O4881L0520L4802O738K4245m6007k6416m032l7997k2237M9073
13161A4335O4196K187o1638j0658j5987L2353R116K1484n7410k5808O176M0249
13149A8595m4340J1587l812K6321k1925l2758M3076M1972k7173n1587K504K8784
13137h756r152K650j0508k7079o943L8861q63K72k2584o2584L5973K0173j8145
$$ plain form
13224 40466 18925 16214 -5500 -6904 -11873 -22676 -13330 -14133 19196 33216 35480 12319 -25500
13211 -25500 -33355 -21122 12797 50413 73752 24825 -28878 -52423 -22265 -57475 -50803 -2371
13199 -2371 37755 36651 27598 35837 7779 -57510 -85701 -80260 -76413 -73269 -78060 -39097 4671
13186 4671 -10537 8083 -34811 -92723 -106465 -45471 13485 5323 -60471 -51610 -51140 -95276 -89701
13173 -89701 -59235 5646 36166 70968 77706 101951 55944 29528 25496 -12501 -34738 14335
13161 14335 78531 80718 19080 8422 -7565 24788 33904 55388 -2022 -27830 -21654 18595
13149 18595 -25745 -14158 -17970 8351 -13574 -46332 -3256 38716 11543 -40044 -37540 -8756
13137 -8756 -17908 -15258 -25766 -52845 -59788 -20927 -21790 -21518 -44102 -106686 -70713 -50540 -68685
13124f8685M5522R3608l7420k4015j6329l886M4190M09l6423j6124J2894K5126
13112A8867K3367l5077l0618k1786J2661j4979l0790K7492K7007M148J0475L4726
13100B5493J7912n317j7258m3284j4083k3054l4860M135N6239L0247q126R79J5866
13087D889N44j1061K0210L9134k01n4049m2714O679l2107N4943N5459j00072n0701
13074a09047N2191M1841K9356m2909j0755L3530J7267K2895j6571o3116k450N0126
13062B358l783k3700K928J6766J0940Q506l5156k8840L0040J4146K2712L0263
13050D7180o6170K1305L2941J4093o4183j7029L951j0376j538j8744J6351M121
13038c8098K6002L466n855K8086L0741L3176K2436n3735l818J8689O564M8185
$$ plain form
13124 -68685 -23163 70445 33025 9010 -7319 -11205 32985 33394 -3029 -19153 -6259 18867
13112 18867 42234 7157 -23461 -45247 -32586 -47565 -78355 -50863 -23856 -19708 -9233 25493
13100 25493 43405 38088 20830 -22454 -36537 -59591 -94451 -90316 -34077 -3830 -11956 -10977 4889
13087 4889 5433 -5628 14582 53716 53515 -534 -43248 -36569 -68676 -13733 41726 -58346 -109047
13074 -109047 -56856 -15015 14341 -28568 -39323 -5793 11474 34369 17798 -45318 -47768 2358
13062 2358 -1425 -25125 -22197 -5431 5509 14015 -21141 -49981 -19941 -5795 16917 47180
13050 47180 -18990 2315 35256 49349 -14834 -31863 -27912 -38288 -39826 -58570 -42219 -38098
13038 -38098 -12096 -8630 -14485 13601 44342 77518 99954 46219 42401 61090 67654 115839
13026A15839o705l9278j0369J2391K8078r271K9228J6971M2604j7372m586L1159
13014A88689N5506Q7266P0671Q4710J53011K03663L48103L11512K76580K15074
13004A994785K17280K46578J61671L6165r7089j91728j71332j94508k89543l08695
12994A403584k85423k29405j14471k5498l7127n2268m2846o0434m5585J7449q1193
12983D46783l3999k5171j484L5202l1999q5852l9906J4232N74K524L1669n1420
12971B61153p220j7912n7718p8815j5580P3289O6617j6597k5258k776K2688q381
12959A93490J8979m0388m1442j3368O3977j0251l9991r460O380J0385k6101j3199
12947I9011M624N0808J0613m1287K0269J0538j4309k3384M592m3269l2633m371
$$ plain form
13026 115839 109134 69856 59487 71878 99956 90685 119913 136884 179488 162116 157530 188689
13014 188689 244195 331461 402132 486842 639853 843516 1191619 1503131 1779711 1994785
13004 1994785 2212065 2458643 2620314 2656479 2559390 2367662 2196330 2001822 1712279 1403584
12994 1403584 1118161 888756 774285 748787 711660 659392 616546 556112 510527 527976 446783
12983 446783 412784 387613 386129 421331 389332 303480 263574 277806 278380 280904 312573 261153
12971 261153 253933 236021 178303 99488 83908 157197 223814 207217 181959 179183 201871 193490
12959 193490 212469 172081 130639 117271 181248 170997 131006 121546 127926 138311 112210 99011
12947 99011 103635 154443 165056 123769 144038 154576 140267 116883 121475 78206 45573 41202
12935D1202P4413K3773L757k061n7528j4865k969n566j250l211R987K4324n5128
12922C4878j8349O1587K1261j3124l625k0889m5157M7450K2794K5199L8148K635
12910A52808k094j7804j3137k834k5464j7516l1769k0633K8580M8482j0299O1573
12898A49893p867n5633m1197k471K9930J2597j9145n321L409K8900j3500l8571
12886D1024L9761J7404n260J772l1472l0061k0368Q404P2461K7657j1861J3336
12874A22797j5558j452o2855j9284L9056J5036J636J05935J7935p3416j6609M387
12862A17608j0231j6607j6883k8559Q5176P9281J4876m6324m7569R900J7669J0778
12850A69115M0255k0310o332J81j8923j4654O6924o848n3606l0401p193L1869
$$ plain form
12935 41202 115615 139388 143145 141084 83556 68691 65722 60156 58906 55695 65682 90006 34878
12922 34878 16529 78116 99377 86253 82628 61739 16582 64032 86826 112025 150173 152808
12910 152808 150714 132910 119773 116939 91475 73959 42190 21557 50137 98619 88320 149893
12898 149893 142026 86393 45196 42725 72655 85252 66107 60786 64195 93095 79595 41024
12886 41024 80785 98189 92929 94701 63229 33168 12800 21204 93665 121322 109461 122797
12874 122797 107239 105787 42932 23648 62704 77740 79376 185311 203246 129830 113221 117608
12862 117608 107377 90770 73887 45328 130504 209785 224661 178337 130768 140668 158337 169115
12850 169115 209370 189060 182728 182909 163986 149332 216256 209408 155802 125401 118208 150077
12838A50077J8611M0117O0039J7263L1583M292k4601K3906P476k6518j0389J342
12826B93198L4413K4560K018k2329j433o2046k1791l909l557j1599L5378J6805
12814B79708m1463j3475l0371l0603K1988m6442K2538L1767M858r86o360o0520
12802A30639P560O2297N2845k9657J0045j4612M2748Q918J733j2077j7440k8341
12790B14658N9343M2553j5201j4553Q4258M3n1718L2896J9782M1170N6605L8295
12778E08131j2234J5929j5353O322J359m8035j8870j0524J2742k5799k0063k4405
12766C69200n5396n3063k3750j8798j2977K3214n6190n4804N0675J9015m8264
12755A38862p981q736K3283O7827M7675l296K1055m7224K1547J9366L4915n312
$$ plain form
12838 150077 168688 208805 268844 286107 317690 321982 297381 321287 328763 302245 291856 293198
12826 293198 327611 352171 354189 331860 330427 268381 246590 242681 239124 227525 262903 279708
12814 279708 238245 224770 194399 163796 185784 139342 161880 193647 198505 197519 191159 130639
12802 130639 138199 200496 253341 223684 233729 219117 261865 270783 272516 260439 242999 214658
12790 214658 274001 316554 301353 286800 371058 371101 319383 352279 372061 413231 469836 508131
12778 508131 495897 511826 496473 502795 504154 456119 437249 426725 439467 413668 393605 369200
12766 369200 313804 260741 236991 218193 205216 228430 172240 117436 168111 187126 138862
12755 138862 130881 122145 145428 213255 260930 257634 278689 231465 253012 272378 307293 301981
12743C01981k1800J1482L2914L5934L9706J6145k104j1294j2016q697k1561J9177
12731C79867J9400j2789m7011k0456J0281K5843M8514n1084l6672Q601N4957J6739
12719C96190l4748K2569J7246K2962O3260O0669K0708L1862M5076M3564O9501
12708G58859N7132J6191Q5079Q9270j9415p381k1092j0329K092J3620M248j1930
12696I56344j6655l2921m0925k1141N2372K043j01631m2258L3261j6043m2793
12685G29653K2222K3438N2746Q798N7057j679k0307K1213N3629Q7283O3901J1762
12673A109716L347M8073O6263N8186Q100R773L6754Q0227P0991K5187J3846p523
12661A522940N0528M3958j8107k8343j8767L2323O1410P7535M7330L8642M5633
$$ plain form
12743 301981 280181 291663 324577 360511 400217 416362 414258 402964 390948 382251 360690 379867
12731 379867 399267 386478 339467 319011 329292 355135 403649 352565 315893 324494 379451 396190
12719 396190 361442 384011 401257 424219 487479 548148 568856 600718 645794 689358 758859
12708 758859 815991 832182 917261 1006531 987116 979735 958643 948314 950406 964026 968274 956344
12696 956344 939689 906768 865843 844702 897074 899117 797486 755228 788489 772446 729653
12685 729653 751875 775313 828059 836857 893914 892235 871928 893141 946770 1034053 1097954 1109716
12673 1109716 1113063 1161136 1227399 1285585 1293685 1303458 1340212 1420439 1491430 1516617 1530463 1522940
12661 1522940 1573468 1617426 1599319 1570976 1552209 1584532 1645942 1723477 1770807 1809449 1855082
12650A855082O8067J05226J26665J74650J79379P2559Q7711N0314o609M6656N2992
12639B812692O173K4383k4384L4956N3389M6111P6268J09716J28821J48459J20332
12628C536916J10520J64497J38310J16644R6245L9169Q8852K02556J57740K03188
12618D854637K35136K58933K30761K87418L39748M01972L81635L71455M02072
12609G763767L64081M38304M79024M69580M60105N45005P33090Q79928J077934
12600A3210818J238711J543762J907392K341949K924753L267894L503888L929100
12592C3868267M648866N479527O570658Q246498J1279635J6164746K3852494L5067873
12584A45178564M8316432N8119914N7419884M7680266M0890516M0009813L4591967
$$ plain form
12650 1855082 1923149 2028375 2155040 2329690 2509069 2581628 2669339 2719653 2713044 2759700 2812692
12639 2812692 2818865 2843248 2818864 2853820 2907209 2953320 3029588 3139304 3268125 3416584 3536916
12628 3536916 3647436 3811933 3950243 4066887 4163132 4202301 4291153 4493709 4651449 4854637
12618 4854637 5089773 5348706 5579467 5866885 6206633 6608605 6990240 7361695 7763767
12609 7763767 8127848 8566152 9045176 9514756 9974861 10519866 11252956 12132884 13210818
12600 13210818 14449529 15993291 17900683 20242632 23167385 26435279 29939167 33868267
12592 33868267 38517133 43996660 50567318 58813816 70093451 86258197 110110691 145178564
12584 145178564 193494996 251614910 309034794 356715060 397605576 437615389 472207356
12577D72207356J3082273j6019654l3033259l4791344l5579361m4426282n2826731
12570B68612998n0888872l8654926k6242630j7829425j2875541j0068166q277912
12563A03775526p192515o515510o032363n561642n094912m620906m175818l753712
12555F0828148l258076k952118k597678k274816k103120j990593j776571j560263
12547D2314913j444024j406058j327147j217448j096560j098507j062891j090444
12539C2571834j055006j058154j060227j030957r86413q82375q25873q38135q38605
12530B3996089p46621n99969n79563n91271n53230m91841m60631m99329m93142
12521A8980492m76031m66915m65910m97612m86910m98463m93841n22230m57358
$$ plain form
12577 472207356 485289629 469269975 436236716 401445372 365866011 321439729 268612998
12570 268612998 217724126 179069200 152826570 134997145 122121604 112053438 103775526
12563 103775526 96583011 90067501 84035138 78473496 73378584 68757678 64581860 60828148
12555 60828148 57570072 54617954 52020276 49745460 47642340 45651747 43875176 42314913
12547 42314913 40870889 39464831 38137684 36920236 35823676 34725169 33662278 32571834
12539 32571834 31516828 30458674 29398447 28367490 27381077 26498702 25672829 24834694 23996089
12530 23996089 23249468 22649499 22069936 21478665 20925435 20433594 19972963 19473634 18980492
12521 18980492 18504461 18037546 17571636 17074024 16587114 16088651 15594810 15072580 14615222
12512A4615222l78466m01665l63532k93350l35704l18836l14077l30861k99839
12503A1578892k07679k52160l02558k98280l52738l09167k51795j87323k47872
12494I169320k39005j99983j92620k49283k69892k39764j86099j68217j77286
12485G247171j57134j18484r0139p0359j33351k01851j83530j63272q5298n1372
12475E992381j06719j63349j22383m6434j19913j01051m8714j09805m4714o9660
12465E059639r9000j24153q9237r7195o2576j11789j10260j35343q3679r8651
12455D047756n1604K231r2230p2544j25377p0397k4690l4710q2821p8386n9436
12444C357792n2645k4257r5083l0397n5462r4146j22263r2527q663p9989j68939
$$ plain form
12512 14615222 14236756 13835091 13471559 13178209 12842505 12523669 12209592 11878731 11578892
12503 11578892 11371213 11119053 10816495 10518215 10165477 9856310 9604515 9417192 9169320
12494 9169320 8930315 8730332 8537712 8288429 8018537 7778773 7592674 7424457 7247171
12485 7247171 7090037 6971553 6881414 6811055 6677704 6475853 6292323 6129051 6043753 5992381
12475 5992381 5885662 5722313 5599930 5553496 5433583 5332532 5283818 5174013 5129299 5059639
12465 5059639 4960639 4836486 4747249 4650054 4587478 4475689 4365429 4230086 4146407 4047756
12455 4047756 3996152 3998383 3906153 3833609 3708232 3637835 3613145 3578435 3495614 3417228 3357792
12444 3357792 3305147 3280890 3185807 3155410 3099948 3005802 2883539 2791012 2782349 2702360 2533421
12433B533421j00654n8462p0416o7093o0422q6603j02695l2920N0779k8580q8142
12422A888213j32098p9594j1749l4770o3050r4760l3480j6355j7707L5592M0916
12411A481158J5751j998j4067m057l6532J0798K8131j0725P949K7249m7788J8982
12399A474851j7643m0298j6533K6935M8519P143J3638J1378l311O1558N6404M3822
12387A666463n0943r8631o5463m101n9697j268k2949o8846j4523l3155m4767M7763
12375A249883l4385L0360K6720k5582N065j3466m0916p190M0614K9956k3844M405
12363A241620J0788K4276j2559k0352O6592N4240L2798L984m6138k7955N8492
12352A385786P2831O3642K0718L8044K9367o0618r1804k0064j0281l7641l35P0438
$$ plain form
12433 2533421 2432767 2374305 2303889 2236796 2176374 2089771 1987076 1954156 2004935 1976355 1888213
12422 1888213 1756115 1676521 1664772 1630002 1566952 1472192 1438712 1422357 1404650 1440242 1481158
12411 1481158 1496909 1494911 1480844 1476787 1440255 1451053 1479184 1468459 1476408 1503657 1455869 1474851
12399 1474851 1457208 1416910 1400377 1427312 1475831 1482974 1496612 1507990 1504679 1566237 1622641 1666463
12387 1666463 1615520 1516889 1451426 1447325 1387628 1386360 1363411 1294565 1280042 1246887 1202120 1249883
12375 1249883 1215498 1245858 1272578 1246996 1252061 1238595 1197679 1190489 1231103 1261059 1237215 1241620
12363 1241620 1252408 1276684 1264125 1243773 1310365 1364605 1397403 1401387 1355249 1327294 1385786
12352 1385786 1458617 1522259 1542977 1581021 1610388 1549770 1457966 1437902 1427621 1389980 1389645 1460083
12340A460083M6860k4139j314k1796J2999K8425Q097M9694L0822K0859M5043L0527
12328A686160k1619J4395Q826l2111J4498P674p561K9532J8961N49J4580J7066
12316A750950J02010P2393L5396K9945L9753L7872k882M2796J5022J3387L0368
12305B167010P4656k7550l0010L6460Q7020Q8411K0606N234Q884P8293K3795n3930
12293B478879P2321O8103R0777L6075O1188Q9159R9128J08002Q068M6937J43474
12282C302111J42861N3036J06839J41075J25206J71259R7088J14899J51319J98350
12272D604043J32378J01900J25473J15141J21155J83625K03298J96417K34488
12263F017918K59955K97940L53516L13178K89382L49331L86341M24570M15505
$$ plain form
12340 1460083 1506943 1482804 1481490 1459694 1472693 1501118 1509215 1558909 1589731 1610590 1655633 1686160
12328 1686160 1664541 1678936 1687762 1655651 1670149 1677823 1670262 1699794 1718755 1719304 1733884 1750950
12316 1750950 1852960 1925353 1960749 1990694 2030447 2068319 2065437 2108233 2123255 2136642 2167010
12305 2167010 2241666 2214116 2184106 2220566 2307586 2395997 2416603 2421837 2430721 2509014 2532809 2478879
12293 2478879 2551200 2619303 2710080 2746155 2807343 2896502 2995630 3103632 3111700 3158637 3302111
12282 3302111 3444972 3498008 3604847 3745922 3871128 4042387 4139475 4254374 4405693 4604043
12272 4604043 4736421 4838321 4963794 5078935 5200090 5383715 5587013 5783430 6017918
12263 6017918 6277873 6575813 6929329 7242507 7531889 7881220 8267561 8692131 9107636
12254I107636M34246M92408N12014M21808N09492M98040N41195O27637P01065
12245A3845541P55015R81052J100019J254636J468866J637019J781989J919417
12237B4743554J970534J874457J740661J704127J765217K022503K272147K558406
12229D0651606K863353L183555L644347M277255N237079O526303P950917R271849
12221H3606264R893691R492636Q233095P002752O188959N472870M558799L232883
12213A37681949J776070R20093Q48854J443309K051387K191593K132263K126928
12205A51172446K289183K633046L197132L795961M511397N361373O336274P002578
12197A86299390P100148O583925O025217N632778N596874N530287N212022M991124
$$ plain form
12254 9107636 9541882 10034290 10546304 10968112 11477604 11975644 12516839 13144476 13845541
12245 13845541 14600556 15581608 16681627 17936263 19405129 21042148 22824137 24743554
12237 24743554 26714088 28588545 30329206 32033333 33798550 35821053 38093200 40651606
12229 40651606 43514959 46698514 50342861 54620116 59857195 66383498 74334415 83606264
12221 83606264 93499955 102992591 111225686 118228438 124417397 129890267 134449066 137681949
12213 137681949 139458019 140378112 141226966 142670275 144721662 146913255 149045518 151172446
12205 151172446 153461629 156094675 159291807 163087768 167599165 172960538 179296812 186299390
12197 186299390 193399538 199983463 206008680 211641458 217238332 222768619 227980641 232971765
12189B32971765M923858M787983M534154M195335L856175L348873K699319K010676
12181B63328138J469655R14063J42387j022426k373154l716509n048364o045712
12173B47648078o373357o164961n624628n223400m928010m540034l931876l310525
12165B07551287k666107k278827k200410k317476k271539j837030j115077p09922
12157A92154899r27885j601987k753803l730196m202498m307981m173618m184333
12149A66272598m715765n980702p663115q966633r176256q289515p031483n948790
12141A08500339n035894m368337l889818l528359l329713l333836l374388l217385
12133G8422609k998716k884665k853991k841228k887606k785316k587396k376283
$$ plain form
12189 232971765 237895623 242683606 247217760 251413095 255269270 258618143 261317462 263328138
12181 263328138 264797793 265711856 265854243 264831817 262458663 258742154 253693790 247648078
12173 247648078 241274721 235109760 229485132 224261732 219333722 214793688 210861812 207551287
12165 207551287 204885180 202606353 200405943 198088467 195816928 193979898 192864821 192154899
12157 192154899 191227014 189625027 186871224 183141028 178938530 174630549 170456931 166272598
12149 166272598 161556833 155576131 147913016 138946383 129770127 121480612 114449129 108500339
12141 108500339 103464445 99096108 95206290 91677931 88348218 85014382 81639994 78422609
12133 78422609 75423893 72539228 69685237 66844009 63956403 61171087 58583691 56207408
12125E6207408k160849k007292j849567j634204j490735j469728j430811j361590
12117D2802632j297955j287407j297404j245740j212326j141393j114376j103476
12109C3102555j008702r29854q39450q51044p88044p43755p33269o95211o49885
12100B5863341o10641p28772p15732o23385o25453o24178n28236n50240n47572
12091B0309132n46249m90906m68999m58043m93619n35148m67282m35583l83694
12082A6029609l51822l76869l78119m30998m06099l31157k83934l38315l45470
12073A2786826l04663l55771k61134k26285k61713k87477k11868k32247k65623
12064A0380045k79235k20073k05300j94413k73508k36313k54532j55210k55521
$$ plain form
12125 56207408 54046559 52039267 50189700 48555496 47064761 45595033 44164222 42802632
12117 42802632 41504677 40217270 38919866 37674126 36461800 35320407 34206031 33102555
12109 33102555 32093853 31163999 30324549 29473505 28685461 27941706 27208437 26513226 25863341
12100 25863341 25252700 24523928 23808196 23184811 22559358 21935180 21406944 20856704 20309132
12091 20309132 19762883 19271977 18802978 18344935 17851316 17316168 16848886 16413303 16029609
12082 16029609 15677787 15300918 14922799 14491801 14085702 13754545 13470611 13132296 12786826
12073 12786826 12482163 12126392 11865258 11638973 11377260 11089783 10877915 10645668 10380045
12064 10380045 10100810 9880737 9675437 9481024 9207516 8971203 8716671 8561461 8305940
12055H305940k04575j33821k51015k13702j67799j06564j64550k45283j69438
12046F649193j08546j11972j65060j11428k42969j14052o2771j50355j40873j62143
12036E279024j74784j15856j39562j53584p3933r5327j08108j37452j12379q2883
12026D085156j12848j44860o2156p7064q4964p8156j11195o1434o8272r3329q9732
12015C101146p8142r7312q4274n6393o6127o9456l2649l1477o2464p7559r8249
12004B347044j17928o3618l6865k9840j3547m204n1295o5918r7455r9092J4753
11993A782035n9520l4647J3332n390O866L1561l7671p0243p0200l6604L007j1727
11981A510799J5136l3784Q809J7693l9492j896J7751k9114j4295m1378j5861M9545
$$ plain form
12055 8305940 8101365 7967544 7716529 7502827 7335028 7228464 7063914 6818631 6649193
12046 6649193 6540647 6428675 6263615 6152187 5909218 5795166 5732395 5582040 5441167 5279024
12036 5279024 5104240 4988384 4848822 4695238 4621305 4525978 4417870 4280418 4168039 4085156
12026 4085156 3972308 3827448 3765292 3688228 3603264 3525108 3413913 3352479 3284207 3190878 3101146
12015 3101146 3023004 2925692 2841418 2785025 2718898 2649442 2616793 2585316 2522852 2445293 2347044
12004 2347044 2229116 2165498 2128633 2098793 2085246 2081042 2029747 1963829 1866374 1767282 1782035
11993 1782035 1722515 1687868 1701200 1695810 1702676 1734237 1696566 1626323 1556123 1519519 1522526 1510799
11981 1510799 1525935 1492151 1500960 1518653 1479161 1477265 1495016 1465902 1451607 1410229 1394368 1443913
11969A443913k0365m0872j6729m2955N051O020k9288m1992o0806j0764k1048k1968
11957A148197r011j2427J1277J5045L5820J8054j2300k4714O556J989n5434l4190
11945A088862k8409j5056M6589J9398l6613J2367j9030k4009K063N2138o785n42
11933A090973q399k7416N421K8720K7537k4783J1522j8736o0258k0011M8914K1203
11921A074687q8292l6698K5985P5171K629o0746n1221p1553Q71L7075K8865N2501
11909I89274L6146J7769L8613N6221K3915M5037J9062M0950L5144K5770K4807
11898A352708M7618m1453k4913j46j1398k0902m6117n5051K0486K8972l1506l8631
11886A179667l6826P7682L4487j05799j3168L0061j3248L1703K5023q569M1367
$$ plain form
11969 1443913 1423548 1382676 1365947 1322992 1328043 1334063 1304775 1262783 1201977 1191213 1170165 1148197
11957 1148197 1139186 1126759 1138036 1153081 1188901 1206955 1194655 1169941 1176497 1178486 1123052 1088862
11945 1088862 1060453 1045397 1091986 1111384 1074771 1087138 1068108 1044099 1046162 1098300 1091515 1090973
11933 1090973 1082574 1055158 1060579 1089299 1116836 1092053 1103575 1084839 1024581 1004570 1053484 1074687
11921 1074687 986395 949697 975682 1050853 1053482 992736 941515 869962 870833 907908 936773 989274
11909 989274 1025420 1043189 1081802 1138023 1161938 1206975 1226037 1266987 1302131 1327901 1352708
11898 1352708 1400326 1358873 1333960 1333814 1322416 1301514 1255397 1200346 1220832 1249804 1218298 1179667
11886 1179667 1142841 1220523 1255010 1149211 1136043 1166104 1152856 1184559 1209582 1201013 1242380
11875A242380P0356R323L9424k5199p1409J784M4309O6074R3607j1862J6798N6965
11863A532550M3542j3353k6962O565R597l4407n7451l45r846n5417n0928K412
11851A345957p7378j3689J6898R269j0545J0168L6662m6946m2295o630J4137J3021
11839A248629k0784J7482P009k0588r729J1044N2880P111m3616J9537J4924n8045
11827A225854j5901k4964l9320l3798k8666k8003m9799o7006o0100k4215j308
11816H52774l2208l7358J466j8507m0584N972q401n9069N973O0302N3791j7747
11804G66404o4797j5768n2433p7116L5061P6092K5699L754K7870J9687o413P2848
11792H10888N8913j6732m336R2616K3035M5844L5713l8826k208N6362K5778j1238
$$ plain form
11875 1242380 1312736 1322059 1361483 1336284 1264875 1266659 1310968 1377042 1470649 1458787 1475585 1532550
11863 1532550 1576092 1562739 1535777 1542342 1551939 1517532 1460081 1459736 1449890 1394473 1343545 1345957
11851 1345957 1268579 1254890 1271788 1281057 1270512 1280680 1317342 1270396 1228101 1221471 1235608 1248629
11839 1248629 1227845 1245327 1252336 1231748 1222019 1233063 1285943 1293054 1249438 1268975 1283899 1225854
11827 1225854 1209953 1184989 1145669 1111871 1083205 1055202 1005403 938397 878297 854082 852774
11816 852774 820566 783208 784674 766167 725583 731555 723154 664085 670058 730360 784151 766404
11804 766404 701607 685839 633406 556290 591351 667443 693142 696896 724766 744453 738040 810888
11792 810888 869801 853069 848733 941349 964384 1010228 1045941 1007115 1004907 1061269 1087047 1075809
11780A075809J3992M4929M1625K4392Q022k6977j2113J1110O5518L1252l650j2058
11768A261851O3819K4609n2377n9752P5390J37281L6307N0253J4703M2461J0300
11757A604845q19K2273K1388N9542N5701N6095j1450k3399j8154j2723j058n3906
11745A698335k1516L704o7621o7961o2203j3039O5068m6507j5141l9454m8181
11734A385484n5189k7148m7228j9874M0J9165J0494k5316j4451J7399L554o258
11722A240672J2418L2380K3988M065K7015o5184j01930J1062r6682j56061j01203
11711H30540k3590o314k3413k8948K2965n0304o0821n121l901j02524j3859K6467
11699E61177L5483j4668J3778N42K9545K3158o244q259k34l1648n289p4880l6971
$$ plain form
11780 1075809 1089801 1134730 1176355 1200747 1208769 1181792 1169679 1180789 1246307 1277559 1273909 1261851
11768 1261851 1325670 1350279 1297902 1238150 1313540 1450821 1487128 1537381 1552084 1594545 1604845
11757 1604845 1604026 1626299 1647687 1707229 1762930 1819025 1807575 1784176 1766022 1753299 1752241 1698335
11745 1698335 1676819 1680523 1612902 1544941 1482738 1469699 1534767 1488260 1473119 1433665 1385484
11734 1385484 1330295 1303147 1255919 1236045 1236085 1255250 1265744 1240428 1225977 1243376 1246930 1240672
11722 1240672 1253090 1285470 1309458 1313523 1340538 1275354 1173424 1184486 1087804 931743 830540
11711 830540 806950 800636 777223 748275 771240 720936 660115 654994 651093 548569 534710 561177
11699 561177 596660 581992 595770 596312 625857 649015 642771 634512 634278 602630 597341 522461 485490
11686D85490M7056j3617l3482l2280j3180K3329n8489j6866n409L384N387j7133
11674C74190n1370j9853J1173j9381j0553J8159m3501m9973J4644k9037l9253
11663A55245O1087j2575m0682O2058L4688j2267j3420J2505O0311L4747k6073
11652C15624l6757m8840k1078P26R727m0620K8167P9184m8553J5767r570l9241
11640B04536m2944P309n106O1730O1028J631m9295l3888J0909M489l641p224k9883
11627A79651L1842j6861j9110k8909N854N1352l5265n1218J3877N2434j7935q99
11615A64813m0959m8370m851K2021j1754j0661O8824N4867l2166l5809m117n191
11603A16647l277R805N4570k1690L5733j1370p0443j4338K5213K5594l0112L0999
$$ plain form
11686 485490 532546 518929 485447 453167 439987 463316 404827 387961 382552 385936 391323 374190
11674 374190 322820 302967 314140 294759 284206 302365 258864 208891 223535 194498 155245
11663 155245 216332 203757 163075 225133 259821 247554 234134 246639 306950 341697 315624
11652 315624 278867 230027 208949 209675 219402 178782 206949 286133 237580 253347 243777 204536
11640 204536 161592 168901 163795 225525 286553 288184 238889 205001 215910 220399 216758 209534 179651
11627 179651 211493 194632 175522 146613 152467 203819 168554 117336 131213 183647 165712 164813
11615 164813 123854 75484 70633 92654 80900 70239 139063 193930 161764 125955 121838 116647
11603 116647 113370 123175 177745 156055 191788 180418 109975 95637 120850 146444 116332 147331
11591A47331l2290j6508M4324K6810j9474l3149J131P1586K0565J625l5601m8813
11579A27537K8924M0629j9086o2005k9364j6180M9311L8453K1680k7928m1607
11568A10364k270M907m5077j7124K8425j0607k75Q169l791l3976K9126J3325M4083
11555A25279K6320l4724m9468J325J3470K4497L7867j959o2146K139O774k0270
11543F9104J8367L1309Q487k514m4785j2655N4785M3729p583K2686M523K0040
11531B05493j4891k4125n7172J5993m7716r5370O7074P8428j4372L0801J9857
11520A64000K601K5089j040n6986p344j6888L5476P4113N1356k2577r16J9988
11508B66872J1152k8391k7729j8602n4824k0223l3310P988R7301J0050K6856K1529
$$ plain form
11591 147331 115041 98533 142857 169667 150193 117044 118175 189761 210326 211951 176350 127537
11579 127537 156461 197090 178004 115999 86635 70455 119766 158219 179899 151971 110364
11568 110364 108094 113001 67924 50800 79225 68618 68343 76512 72721 38745 67871 81196 125279
11555 125279 151599 116875 67407 68732 82202 106699 144566 142607 80461 82600 89374 69104
11543 69104 87471 118780 127267 124753 79968 67313 122098 165827 158244 180930 185453 205493
11531 205493 190602 166477 109305 125298 77582 -17788 49286 127714 113342 144143 164000
11520 164000 166601 191690 190650 133664 126320 109432 144908 219021 270377 247800 246884 266872
11508 266872 278024 249633 221904 203302 148478 128255 94945 102933 200234 210284 237140 258669
11496B58669n2111o6335n096p662L1733k4289l6967l5095N3410M9892N853n9475
11484A12527j8348J4441L6877k4919J8852K6340m3366m226M6328J1739j4123J7210
11472A79332j3740N696J5901k2561J0247k7309K195l5736O960l174R1399M8737
11460B57947m6683l9689j3782O791M721k1974L74K600r9280l9118M0479L7815
11448I0201O5521L9078L7180l1367q4906M0561M2701m5806m9386j034P5468M8519
11436B26730l8033l223J9674n2462L9559L2633M2966K2862p0954k8712n0526m4122
11424I6392L298k9923K4951L5201K2021L4060M4554j5527r166O031P812l8259
11412A81445k1154L6046M8982J8398l1641l477L6822j9067K1096k4991M201l7036
$$ plain form
11496 258669 206558 140223 135127 127465 159198 134909 97942 62847 116257 166149 172002 112527
11484 112527 94179 108620 145497 120578 139430 165770 122404 118178 164506 176245 162122 179332
11472 179332 165592 171288 187189 164628 174875 147566 149761 114025 120985 117811 209210 257947
11460 257947 211264 171575 157793 164584 169305 147331 147705 150305 51025 11907 52386 90201
11448 90201 155722 194800 231980 200613 115707 156268 198969 153163 103777 102743 178211 226730
11436 226730 188697 185474 205148 152686 192245 224878 267844 290706 219752 191040 140514 96392
11424 96392 99690 69767 94718 129919 151940 186000 230554 215027 205861 211892 219704 181445
11412 181445 160291 196337 245319 263717 232076 228599 265421 246354 267450 242459 246660 209624
11400B09624k2009j969N6914n6913o6716n299J0027P266N8623L0272L2033l1698
11388B20155n5859n8771n1392J9259P459q010J4852J3893o653j3119N906O83K0781
11375A09184m9084l1028N0854M9961j2019j3836k8876m2868L108L1966J4315k7498
11363E4179M5074k078k1291k9671j8282k2722k6259J6586m949o591N2446L3401
11351F9843k7173q985l1989o2027K9157J33956K8148m3110m872J1995j2909j7615
11339F4419l9207k978J1021K4099L3412M8094J43m8812j4269P716k2501o50r761
11326E0726j7714J3627l2590k1946l984k724O608L4038J5591J4908j1300l3667
11314A1573n8186q585K397N5755P3244J1945m0619m111L400p00J5428M2491L3814
$$ plain form
11400 209624 187615 185646 242560 185647 118931 113632 123659 130925 189548 219820 251853 220155
11388 220155 164296 105525 54133 73392 80851 72841 87693 101586 94933 81814 87720 88403 109184
11375 109184 60100 29072 79926 129887 117868 104032 75156 32288 35396 67362 81677 54179
11363 54179 99253 97175 75884 46213 27931 5209 -21050 -4464 -9413 -16004 36442 69843
11351 69843 42670 33685 1696 -60331 -31174 102782 130930 87820 82948 94943 82034 64419
11339 64419 25212 22234 33255 57354 90766 138860 139003 90191 75922 83638 61137 60487 50726
11326 50726 33012 46639 14049 -7897 -11881 -14605 -7997 26041 41632 56540 45240 11573
11314 11573 -46613 -55198 -52801 2954 76198 88143 47524 43413 46813 46113 61541 104032 137846
11301A37846r365k5731k75L7382k5480k8632l1739K3908K250Q1279l715o9228
11289H8500o5052K7966J1693k5569k4028m3513m2669m770N4078J6459R564p983
11277e324J2179O553N6248o226m4179k376J7249J3511r781l3089Q007j8482m3987
11264d9697j7933P1018L7542m8800j7227P1114L9565N2664m8896o9428r6390K1118
11252e5350R4623N4268L0328j2316n7141K820q488M5500J5996l1401j3489K2764
11240H8114q096O0525n862m4865n3424M5221O8811j6167n1924o6568n4808M9848
11228A0805Q3170j1768K4090L3845K2289O7269l8745q8369q5571p69O5262n249
11216G6259Q315k0205m3499O5886Q5854l0618m3226J1834j7542k368j026N5511
$$ plain form
11301 137846 128481 102750 102475 139857 114377 85745 54006 77914 80164 161443 157728 88500
11289 88500 23448 51414 63107 37538 13510 -30003 -72672 -77442 -23364 -6905 2659 -5324
11277 -5324 6855 13408 69656 63430 19251 16875 34124 47635 37854 4765 12772 -5710 -49697
11264 -49697 -67630 3388 40930 -7870 -25097 46017 85582 138246 89350 19922 -76468 -55350
11252 -55350 39273 93541 123869 111553 54412 57232 48744 94244 110240 78839 65350 88114
11240 88114 80018 140543 134681 89816 36392 81613 150424 134257 82333 15765 -39043 10805
11228 10805 93975 82207 106297 140142 162431 229700 190955 102586 17015 16246 81508 76259
11216 76259 84574 64369 20870 86756 172610 141992 98766 110600 93058 90690 89664 145175
11204A45175k6048n0161J1193L2947m0161o2571J6551O2189Q316J3364j928m59
11192A08407K9339j7311L9898L589N0824p381o5148j4508N478J6334n000J7599
11180A62120l2207m1334k8824l2247M4348K2396K6090N498l7455L8412L2786K814
11168A62397n8388l2159l4033M1314k2598j0021L7967k7924j739J1178k4639q443
11156C2912l990J0537k5547J9119L6991J484o925N2466N0796j3420k1290l387
11144A29746j8928N816R359L2351R271k8379p7094k5575J0871l4249K0737L8871
11132G2797j4683O2016j5624n9671j1364n6757m472M7635K1575j3963J3694M5549
11120H6732j0888j8511R79l757L1807k1602m5797J1062j4749l7934k1537P887
$$ plain form
11204 145175 119127 68966 80159 113106 72945 10374 26925 89114 97430 110794 108866 108407
11192 108407 137746 120435 160333 163922 214746 207365 142217 127709 133187 149521 144521 162120
11180 162120 129913 88579 59755 27508 71856 94252 120342 125840 88385 126797 159583 162397
11168 162397 104009 71850 37817 79131 56533 46512 84479 56555 54816 65994 41355 32912
11156 32912 28922 39459 13912 33031 70022 71506 64581 117047 167843 154423 133133 129746
11144 129746 110818 116634 125993 158344 167615 139236 62142 36567 47438 13189 33926 72797
11132 72797 58114 120130 104506 44835 33471 -23286 -27758 19877 41452 27489 41183 86732
11120 86732 75844 57333 58312 54555 86362 64760 18963 30025 15276 -22658 -44195 -36308
11108c6308L4731P8356j6267n5787k4720j5070K1410l9296L676M027p739O6302
11096A3315L7564q0310j0896M8052M59j2501q489o396J3610O0844J6096P974k2513
11083E6809P410M505J8458n3389m52M7389K6420j7867m6656l9967j4839n447p10
11070a8336N1499N5935K0185k3469p0268r380N6111n8188n3578q8062M826J09364
11058b3361Q8282k0484r527k1887L666M1243M7593K4138K0869K6057n8126p209
11046A11254K6567M4765p727M5913Q0312L7432K1499N698o3364q7612N786J2255
11034B32778N9235M5539j439K78m7357l5546M6748j0493r6688K17O6435K5744
11022B85451K456J9371J4589L0862r766L2351J5202k6204J6410m8343J0155J3745
$$ plain form
11108 -36308 -1577 76779 60512 4725 -19995 -35065 -13655 -52951 -49275 -45248 -52987 13315
11096 13315 50879 -29431 -40327 7725 8184 -4317 -12806 -19202 -5592 55252 71348 79322 56809
11083 56809 64219 68724 87182 33793 33341 80730 107150 89283 42627 2660 -12179 -17626 -18336
11070 -18336 33163 89098 109283 85814 15546 6166 62277 4089 -49489 -137551 -132725 -23361
11058 -23361 64921 44437 34910 13023 16689 57932 105525 129663 150532 176589 118463 111254
11046 111254 137821 182586 174859 220772 301084 338516 360015 365713 302349 214737 220523 232778
11034 232778 292013 337552 336113 336391 289034 253488 300236 289743 193055 193272 259707 285451
11022 285451 287907 307278 321867 352729 342963 375314 390516 364312 380722 332379 342534 356279
11010C56279j7300J5259R0203O093O58k7434j0943L7980L348k0449l3001k754
10998C97939j0643k3281L6713L3020J1718j8264K1497K6168j2329m3487j1773
10987D07278J0552n1169k4046N0992r922l2825L1578P335l1007K6562k0130M9505
10975D14703J6108L0119m3371j30822o9118j409O493O797J4927j1950j8002M4625
10963B59100p809J4258p566l0487j6744l8481p668j1604o2350o7535l3574R8096
10951H7636J42081k5969j7715n5597K7392L4376p4894k242L6380J3989O824L6086
10939B08347M0720m0288L8657J06466m271l8743j2337J901j4431J9660M137M2815
10927C52633N1118K5409m3204L0800L1863k6903j9257J1003j1595N1055L1769
$$ plain form
11010 356279 338979 354238 444441 450534 451192 423758 412815 450795 454143 433694 400693 397939
10998 397939 387296 364015 400728 433748 445466 427202 448699 474867 462538 419051 407278
10987 407278 417830 366661 342615 393607 383685 350860 382438 389773 358766 385328 365198 414703
10975 414703 430811 460930 417559 286737 217619 216210 222703 229500 244427 232477 214475 259100
10963 259100 251291 265549 257983 227496 210752 172271 164603 152999 90649 23114 -10460 87636
10951 87636 229717 203748 186033 130436 157828 192204 117310 115068 151448 165437 172261 208347
10939 208347 249067 208779 247436 353902 349631 310888 298551 300452 286021 305681 309818 352633
10927 352633 403751 429160 385956 416756 448619 421716 402459 413462 401867 452922 484691
10916D84691K7837M3340J2755N3681q4426o3145p5636m1888k4078q599J1233K7499
10904C63264k0902j6023k520n182J0830l8910p9373k4336L6279K7363p21k3290
10892B26479l6827l2541n994K9094O3349L0031r626O6K1694Q7171J07381L2713
10880E12990j4689J5225O6065N5850P2836O7604J4277K29J2009N9561M4203M6064
10868I52224K9762m4380l8863k8653m4523p1203m6071q9508j2806m2426m5705
10857E17848j7902j8775l219m8050p731q672k0811K319L9576o1619l6478K8443
10845C64929J9994L1459m4750o9456M652N786r305J6232J9309K281l9112N6341
10833C58360N6986O0306L6157N1546K0245j6568K3182M7669J9256K1717N2866
$$ plain form
10916 484691 512528 555868 568623 622304 537878 474733 399097 357209 333131 324532 335765 363264
10904 363264 342362 326339 323819 318637 329467 290557 211184 186848 223127 250490 249769 226479
10892 226479 189652 157111 151117 180211 243560 273591 263965 264031 285725 372896 480277 512990
10880 512990 498301 513526 579591 635441 708277 775881 790158 790387 802396 861957 906160 952224
10868 952224 981986 937606 898743 870090 825567 754364 708293 618785 605979 563553 517848
10857 517848 499946 481171 477952 429902 422171 413499 392688 395007 434583 372964 336486 364929
10845 364929 384923 416382 371632 302176 306828 312614 303309 319541 338850 341131 302019 358360
10833 358360 415346 475652 511809 563355 583600 567032 590214 637883 657139 678856 731722
10822G31722P0056M4350p7026p8224j12984p9517p5866n6942p6847k8512M9142
10811C09352j728q178k0913j5452j3262l7348l792N439K3627L0813n1500j7085
10799A99973j6564J8336M0051k1046p311N3406k4503k2614k1283K6557p894J4918
10787B32026K0550N463P0330M0376K93n267P2531O64r5087Q456L3681L1407K3948
10774D39371J467l6987l4114n3810l298M6414L6308p4432n9813n4079p0540j6400
10762A20087J4080P7458L640k7463l2689K042L4134J2272j6024Q888K8111J8778
10750B43314m5718o978k5590p848O014o4060j7477O0222M6434K386j2082m9087
10738A29530n3606q067J4674Q363P889O1515j1416J0480l2516k2436j2866O5475
$$ plain form
10822 731722 801778 846128 769102 690878 577894 498377 422511 365569 288722 260210 309352
10811 309352 307624 299446 278533 263081 249819 212471 208679 214118 237745 268558 217058 199973
10799 199973 183409 201745 241796 220750 213439 266845 242342 219728 198445 225002 217108 232026
10787 232026 252576 258039 328369 368745 369038 363771 436302 436966 341879 350335 384016 415423 439371
10774 439371 440838 403851 369737 315927 312629 359043 395351 320919 261106 207027 136487 120087
10762 120087 134167 211625 215265 187802 155113 157155 191289 203561 187537 196425 224536 243314
10750 243314 197596 190618 165028 157180 163194 99134 81657 141879 188313 190699 178617 129530
10738 129530 75924 67857 82531 90894 98783 160298 148882 159362 126846 104410 91544 157019
10726A57019P3048j4514m9308j9122j3778k5786K092m3304k5008Q3074L3880P299
10714A65592J5305j5733n3457L2807k5789j3347j395j6299K7769M966K1282N697
10702A47398K2000J4845j8944K5289J1456K3041K7059K1589K6758K5904j5850
10691C10545m3503j242n580l6176l2528m8275J9401j6411k6843p94J3645N6381
10679A88620Q9059J8443r847k4023j6514m1382J5673M3994R410j5993k8539l1500
10667A97401l3242P848K987j4166R823Q1412J11195Q8879P7972L3134j8293o9987
10655D74963p7131n0145l5195K9689l2515n3359N88q6981j594M7024J2572K3095
10643B51011N223j6910n3113r4214o7191N6485j5079N7969M4638k8504j0245j214
$$ plain form
10726 157019 230067 215553 166245 147123 133345 107559 109651 66347 41339 124413 158293 165592
10714 165592 180897 165164 111707 144514 118725 105378 103983 87684 115453 120419 141701 147398
10702 147398 169398 184243 165299 190588 202044 225085 252144 273733 300491 326395 310545
10691 310545 267042 265800 260220 224044 191516 143241 162642 146231 119388 118594 132239 188620
10679 188620 277679 296122 286275 262252 245738 204356 220029 264023 273433 257440 228901 197401
10667 197401 164159 172007 174994 160828 170651 252063 363258 452137 530109 563243 544950 474963
10655 474963 397832 347687 312492 342181 309666 256307 256895 169914 168320 215344 227916 251011
10643 251011 256234 239324 186211 91997 24806 81291 66212 124181 168819 140315 130070 128856
10631A28856j4395j831P1032P912k3250N6801L2298m9889R08K7123J6290O5019
10619C16874Q7110O7337N4261n830m2085n2995q7302l5716n4940l3925Q14N6149
10607B69752P9362l626o7522k5467Q932k6848j7266k506n959K4215N774k810n2454
10594A83577l1606m3480p1239o2340P470R1873j7009M2946J72l9541l5815J3711
10582C8719N0644J0593o2831l6913J4140k5921p521L0169L0975K7941N3569M9955
10570A73519L575j0438J1008k652q4126J6213K7939m3407K6700l8543J8243K6403
10558A24434q525n8732j3741L0163M6061L5375j9396o2874k3824J2572L2283j3523
10546H0273j7463j4471l408j915J3173O5774L2054k7904n6655k2897P70k684N8826
$$ plain form
10631 128856 114461 112630 183662 191574 168324 225125 257423 207534 208442 235565 251855 316874
10619 316874 403984 471321 525582 519752 477667 424672 337370 301654 246714 212789 213603 269752
10607 269752 349114 345488 277966 252499 261431 234583 217317 214811 208852 233067 238841 236031 183577
10594 183577 151971 108491 37252 -25088 -17618 74255 57246 100192 100364 60823 25008 38719
10582 38719 89363 99956 37125 212 14352 -11569 -19090 11079 42054 69995 123564 173519
10570 173519 177094 166656 177664 175012 90886 107099 135038 91631 118331 79788 98031 124434
10558 124434 115909 57177 43436 73599 119660 155035 135639 72765 48941 61513 93796 80273
10546 80273 62810 48339 44931 43016 56189 121963 154017 126113 69458 46561 47331 44647 103473
10533A03473J3146J6821J6105l2655J3296M933j9024J0613J117M9235M5719K3186
10521B45965q5680l2335P0048R82k8723k8377j6932L8583N398m2177k9830l5102
10509F1820K1601P082R336o3659k2228j5996J5410K2432l7353k893K8787M0041
10497F4380O653J2223R567k351m117L3445k0283m9352O443L5178N7591L5828O4186
10484B49391m9666p4077m410J4897r365K2001O4619N0185k087r305M7790Q0522
10472C80495J47932R7509L9751j09709j00717q9142k1273o9298m7390l6530j2514
10461A79114k3877L974N4009N046K1500J7057J9836L9654j1318M912l1777n8781
10449B19349P350J9392j3112p975q5361j4229O4617L4332m7359M6523k8003m5892
$$ plain form
10533 103473 116619 133440 149545 116890 130186 135119 116095 126708 127825 177060 222779 245965
10521 245965 160285 127950 197998 198980 170257 141880 124948 163531 168929 126752 96922 61820
10509 61820 83421 90503 99839 36180 13952 -2044 13366 35798 -1555 -4448 24339 64380
10497 64380 71033 83256 92823 90472 86355 119800 99517 50165 56608 91786 149377 185205 249391
10484 249391 199725 125648 121238 136135 126770 148771 213390 263575 261488 252183 299973 380495
10472 380495 528427 625936 665687 555978 455261 366119 344846 275548 228158 191628 179114
10461 179114 155237 159211 213220 218266 239766 256823 276659 316313 304995 309907 278130 219349
10449 219349 226699 246091 232979 225004 139643 125414 190031 224363 177004 223527 195524 149632
10437A49632j7557J2095j7005l9527j5428J2010N5194j0526J186o2864O174K7507
10425A00891P643N3948N1346n4999r806K7457m313K6707l7028P043J9855m2089
10413A46655j2843K8293j4968p934K7301K7827L3149k7073m1352O7101P5838M6207
10401C48201K1238k3868l1478m6718M117J572n8991O838K3945l5698q0590n3823
10389G4745L4943P2284N9343l6066k4938k0070n0569l5627m6139J8646P9442P186
10377A33180j3045j4219j5247K7833M9588M171L8061J6721R103j904o812m0760
10365A86670L615M4302L4406K1350J590Ll05q891m6848J8927r816k2495J6331
10352B38839J7898M5234l5257J1796L2998m1848o638j527L8389K1524j5357m9890
$$ plain form
10437 149632 132075 144170 127165 87638 72210 84220 139414 128888 130074 67210 73384 100891
10425 100891 108534 162482 213828 158829 149023 176480 172167 198874 161846 168889 188744 146655
10413 146655 133812 162105 147137 139203 166504 194331 227480 200407 159055 226156 301994 348201
10401 348201 369439 345571 314093 267375 271492 273064 214073 220911 244856 209158 128568 74745
10389 74745 109688 181972 241315 205249 180311 160241 109672 74045 27906 46552 125994 133180
10377 133180 120135 105916 90669 118502 168090 172261 210322 227043 236146 234242 227430 186670
10365 186670 190285 234587 268993 290343 291933 291936 291631 282740 235892 254819 245003 222508 238839
10352 238839 256737 301971 266714 278510 311508 269660 263022 261495 299884 321408 306051 256161
10340B56161m95o7107o3384n739M5790p7n495K1207M9663O7205k570J4095o7123
10327B42131m5497O074K6924N5289k2190L5195K8080k795m0212k0254m3112J4344
10315B33977N4902k7940n884P206O689J113m8277k2966m470J9464N2517L9970
10303C06301j8797k7224o7071K054Q5835M0207j0311o215l5487J3373l6036m8136
10291A98493j03769m9162P2931O1158m341J1998K3644k4375j415l0417k1486m2254
10279I1005J9855Q1939J8816M975k6801k7208l6204l6965l2948J3188L3557n639
10267I7570J8184J5374J8185Q379l688q0433L0441K2319N5251L8254o3981j2395
10255A43460n3560j8002J7455M699K8301L736l3583j69N6327L4361k7579l3907
$$ plain form
10340 256161 255666 188559 125175 119436 165226 165149 159654 180861 230524 297729 295159 309254 242131
10327 242131 196634 202708 229632 284921 262731 297926 326006 323211 282999 262745 219633 233977
10315 233977 288879 260939 255055 262261 268950 270063 221786 198820 194350 213814 266331 306301
10303 306301 287504 260280 193209 195263 281098 321305 310994 304779 269292 282665 246629 198493
10291 198493 94724 45562 118493 179651 175310 187308 210952 186577 185162 154745 133259 91005
10279 91005 110860 192799 211615 216590 189789 162581 126377 89412 56464 69652 103209 97570
10267 97570 115754 131128 149313 157692 154004 73571 104012 126331 181582 219836 155855 143460
10255 143460 89900 71898 89353 94052 122353 126089 92506 92337 148664 183025 155446 121539
10243A21539j3198k7707J3517k555L1827K1836o1437l16N8210P7207k016j1447
10231B05460O655n763o5285o1906N4080N3066l2628n9818k14l935l7962m7913
10219C837L2584Q7475M2290J2594k3218m0550k6824l147Q0631L7093k5266k9170
10207A48329J7338l0067k130N1216K9203p417j9905j8036N0104L3659n8646k7332
10195A66316R8206J04057M166L4227M2963j8365o6778J12655K09357J94387K11358
10184A092549J48548J30331J28537Q2323l7209j28527q5750r3987j71266j57994
10174I07555j94548j13924o7217p0264n9193m3390K205m936j9339K4561k6254
10163C35256R12o843j0112M2746k4165k9963m8495m6001K0779j1516L1187L5823
$$ plain form
10243 121539 108341 80634 94151 91596 123423 145259 83822 83506 141716 218923 216907 205460
10231 205460 212115 206352 141067 79161 133241 186307 153679 93861 93647 89712 51750 3837
10219 3837 36421 123896 166186 178780 155562 115012 88188 85041 165672 202765 177499 148329
10207 148329 165667 135600 133470 184686 213889 206472 186567 168531 218635 252294 193648 166316
10195 166316 264522 368579 372745 406972 449935 431570 364792 477447 686804 881191 1092549
10184 1092549 1241097 1371428 1499965 1582288 1545079 1416552 1330802 1236815 1065549 907555
10174 907555 713007 599083 531866 461602 402409 359019 361224 356288 336949 361510 335256
10163 335256 336168 329325 319213 361959 337794 307831 259336 213335 234114 222598 253785 289608
10151B89608k7014J1917J485j3423j2919K4351m4962J1115j0703m248L620K2953
10139B51780M6215m0634l6946K3411K9122o972K0738j5124m4466m892L0036Q862
10127B61130n2311l0449L3128k3594m2490p95K5792j2271j2926O6791O022J4535
10115B32562m8681j2491j8038q772K8406M5906m277K0851R002L1046P447N53J4339
10102B97853K4617m7491j0677n58q97L2116j6672j8152R088l0684n1932j2077
10090A74534J52o419l1720k861l2261J5225J6269m1198k8850L3182J5139L8499
10078A49691J1979m5830P38K1947j0733M0753M1275j4890k6079o0034l0389N2159
10066A30587N919J9267N7123K2535J0681J2500K2363l6188o9563N4451N0102m0530
$$ plain form
10151 289608 262594 274511 275996 262573 249654 274005 229043 240158 229455 225207 228827 251780
10139 251780 297995 257361 220415 243826 272948 265976 286714 271590 227124 222232 252268 261130
10127 261130 208819 178370 211498 187904 145414 144619 170411 158140 145214 212005 218027 232562
10115 232562 183881 171390 153352 144580 172986 218892 214615 235466 244468 275514 282961 283514 297853
10102 297853 322470 274979 264302 263744 262847 294963 278291 260139 269227 238543 186611 174534
10090 174534 174686 168267 136547 133686 101425 116650 132919 91721 62871 96053 111192 149691
10078 149691 161670 115840 116578 138525 127792 168545 209820 194930 168851 108817 78428 130587
10066 130587 136506 155773 212896 235431 246112 258612 280975 244787 175224 229675 279777 239247
10054B39247j6221K2018J1035m0576k6382M3365M826M029k69r7112m9847M1212
10042A35325J6948k2770J3453M8576j9630m6118j8853j4862Q1565Q5430p049K70
10030B52285J973n003N6216J58354J68555J86900K98511M64630Q93902J239353
10020C715676J100638q9460j518228j116985n86698l44424j56724j36160r3533
10011G74102l2502n7887j9027k7139m5079l7174l4048k8521n0558m1521j3882
10000C86764K4798K0418k217j3224n3116j4289n943m7769m0485J9448K9250m3863
9988B59772k8087o833P682l7936k4822m1299N323P0364P0247K8913r016n5969
9976B38339o2166m89M7069j393k144N6237k526Q321J3784J7910M3037l2923J2437
$$ plain form
10054 239247 223026 245044 256079 215503 189121 232486 237312 241341 241072 143960 94113 135325
10042 135325 152273 129503 142956 191532 171902 125784 106931 92069 173634 259064 252015 252285
10030 252285 254258 249255 305471 463825 632380 819280 1117791 1582421 2476323 3715676
10020 3715676 4816314 4726854 3208626 2091641 1504943 1160519 1003795 867635 774102
10011 774102 741600 683713 664686 637547 592468 555294 521246 492725 442167 400646 386764
10000 386764 411562 431980 429763 416539 363423 349134 343191 295422 254937 274385 303635 259772
9988 259772 231685 224852 232534 194598 169776 128477 133800 204164 274411 303324 294308 238339
9976 238339 176173 175684 222753 221360 219216 275453 272927 281248 295032 312942 355979 323056 335493
9963C35493O528j5655Q832o653P74K1928j618J9454m8115o0112J9180J4770k4504
9950B70302l111r9751l3330K5788L4499K1512K7022j002P5877j5258l4453l2888
9938B35207r659K1579m2116m2370N0637l4286p975n5346m6260k1007N2108O7106
9926A67618p510J0691K0500m5519k3060j0735P878J2991k6293J2122l2628k7430
9914E8625K9394N4904L0527j3732k4541j3174O198j263M5966J163j281m841n5895
9901A12050K831J0566k5213M2929p703j7374Q911N6713n051K0639q907j3373K946
9888A79964l2945K4060k182j0727m6164K3427m2820o142j9627k1002N0947L4739
9876A31528J0840J8982k3608m3503J5859L85N3375R254M2084R936L6087k2527
$$ plain form
9963 335493 342021 326366 335198 328545 329319 351247 349629 369083 320968 260856 280036 294806 270302
9950 270302 267191 167440 134110 159898 194397 215909 242931 241929 317806 302548 268095 235207
9938 235207 225548 247127 205011 162641 213278 178992 171017 115671 69411 48404 100512 167618
9926 167618 160108 170799 191299 145780 122720 111985 119863 132854 106561 118683 86055 58625
9914 58625 88019 142923 173450 159718 135177 122003 128201 126938 172904 174067 172786 167945 112050
9901 112050 114881 125447 100234 143163 135460 118086 126997 183710 178659 199298 190391 177018 179964
9888 179964 147019 171079 168897 158170 112006 135433 92613 86471 66844 45842 96789 131528
9876 131528 142368 161350 137742 94239 110098 110483 163858 173112 215196 225132 261219 238692
9864B38692J9173L7822q1610m2332j9101k8324N154K0406O4007P080m8970J0002
9852A81999M5883j8787P34J8578k3921n8748J055J4958L3797j1165m1650j0628
9840A32105M7578k410m2396j1229K3868M3594k4675o5126Q7692L8625k3668l9104
9828A64854K0391R2461P5746K9062o6588j05064q266Q5696N3408K3534l6555n4938
9816B73741k15M4264l8688q6628j2474O009m0936K7528J28085q975p6598k4808
9804A90305k7536N389O7359o78n2746L1558N1676k3296M360r99j6224L4361N5409
9791C18938k673k5432j1881k608P833L443O996k3924l2825l7070J4809L3536K5640
9778B74782J6831m3492J7923M3726M9104N2669N8544K1352M5061J12169J26794
$$ plain form
9864 238692 257865 295687 214077 171745 152644 124320 129474 149880 213887 220967 171997 181999
9852 181999 227882 209095 209829 228407 204486 145738 146793 161751 195548 184383 142733 132105
9840 132105 179683 177273 134877 123648 147516 191110 166435 101309 189001 227626 203958 164854
9828 164854 185245 277706 353452 382514 315926 210862 202596 288292 341700 365234 328679 273741
9816 273741 273526 317790 279102 192474 180000 186009 145073 172601 300686 291711 215113 190305
9804 190305 162769 168158 235517 234839 182093 213651 265327 242031 246391 245392 229168 263529 318938
9791 318938 316265 290833 278952 276344 284177 287620 294616 270692 237867 200797 215606 249142 274782
9778 274782 291613 248121 266044 309770 358874 411543 470087 491439 536500 648669 775463
9767G75463M0432j36025j76965r5088K603n5228p391o6425p396J2225Q2815l0894
9755C38126j7369J3598j308q13P237o6176n760O8416l8750q6525l180M967L712
9742B16175L3806J0722o093n5886R912M6864K583L2708J062J1706k0568l5423
9730B47568k589K497j0137M5986p407k9131L9975m5934j3258k3480M0473K884
9718B47447l4355j7333o8312J5612N3076N0735L4913J1877j5460l5054k4776l030
9706B15340l0656K9730J1494k4576L0781K2253m151k0324O789K7747L0186m1937
9694B52676j2819j9949l1014j5773N1240R545l1371j9793Q7023J2357J1595K8974
9682C22691L747m7911Q082j1162M786L6555k048k0935l7182o429K6305n066K6516
$$ plain form
9767 775463 815895 679870 502905 407817 410420 355192 347801 281376 273980 286205 369020 338126
9755 338126 320757 334355 333047 332234 339471 273295 267535 335951 297201 210676 207496 212463 216175
9742 216175 249981 260703 254610 198724 208636 255500 258083 290791 291853 303559 282991 247568
9730 247568 244979 247476 237339 283325 275918 246787 286762 240828 227570 204090 244563 247447
9718 247447 213092 195759 127447 143059 196135 246870 281783 293660 278200 243146 218370 215340
9706 215340 184684 214414 225908 201332 232113 254366 250215 229891 236680 264427 294613 252676
9694 252676 239857 219908 188894 173121 224361 233906 202535 182742 269765 282122 293717 322691
9682 322691 326438 278527 286609 275447 280233 316788 314740 293805 256623 250194 276499 271433 297949
9669B97949M8411N337J4105M7683M0675K1935n2901j8133M0452m5818k9074L9272
9657D09893K3043k4201K8316j8958l2237K155K8424M7702L8181L9872K4861R804
9645E76855J6530J3027m5642J7645K9110P3484N1827j2105l7961J0797K8836L8305
9633G60708N4449K3399j363J794L3918L4182M8429K3264O336l508K0919P2521
9621A075048N6741o402o74K0659l4661P777K8581N6609P6802k5426L0319O1648
9609A347021r703r467L8453k6943l4524k0653P17J9058K2845K4299M8185K3378
9597A422666k6945K6082Q9731M7229O4068N3430M9774N2793K8094L4463n1673
9586A789712o4536l3700Q999j2228j8067k7449J7285J2368P968k3604m0684K1029
$$ plain form
9669 297949 346360 351697 365802 413485 454160 476095 423194 405061 445513 399695 370621 409893
9657 409893 432936 408735 437051 418093 385856 388011 416435 464137 502318 542190 567051 576855
9645 576855 593385 606412 560770 578415 607525 681009 732836 720731 682770 693567 722403 760708
9633 760708 815157 838556 837193 838987 872905 907087 955516 978780 985116 981608 1002527 1075048
9621 1075048 1131789 1125387 1124713 1145372 1110711 1118488 1147069 1203678 1280480 1255054 1285373 1347021
9609 1347021 1337318 1327851 1366304 1339361 1304837 1284184 1284901 1303959 1326804 1351103 1399288 1422666
9597 1422666 1395721 1421803 1511534 1558763 1622831 1676261 1726035 1778828 1806922 1841385 1789712
9586 1789712 1725176 1691476 1700475 1688247 1670180 1642731 1660016 1672384 1680352 1656748 1616064 1637093
9574A637093p116k7413J3746J3716K970J6409k051L666M0216K1319m2133J8040
9562A688462r397m6390J8348Q513o084n8091M9847k9770L5099M0493K4953m915
9550A711068o8066r0363k9179K0236N177k0741K9657q556p1082n8277n5987k6022
9538A337865o994l2652l0257l3963k0925m4629l4615p756j6756o0258K37J9249
9526A068546j6766j678K1709K009k3398k3984k6541j459J6432J098J2955K4256
9514A053179q446l2782m2379l5567R876M9329J4945k5771J530p8841o5106l0371
9502H09596L0278p605K4080k8442o1353o5227J7631J598j3736k604o197J4591
9490G12610m8639o222M1506K9034K5250r645l0955k9001j9733k2079J8895O3167
$$ plain form
9574 1637093 1629977 1602564 1616310 1630026 1632996 1649405 1647354 1651020 1691236 1712555 1670422 1688462
9562 1688462 1679065 1632675 1651023 1659536 1653452 1595361 1645208 1615438 1650537 1691030 1715983 1711068
9550 1711068 1643002 1552639 1523460 1543696 1548873 1528132 1557789 1549233 1478151 1419874 1363887 1337865
9538 1337865 1330871 1298219 1267962 1233999 1213074 1168445 1133830 1126074 1109318 1049060 1049297 1068546
9526 1068546 1051780 1050102 1071811 1073820 1050422 1026438 999897 998438 1014870 1015968 1028923 1053179
9514 1053179 1044733 1011951 969572 934005 943881 993210 1008155 982384 983914 905073 839967 809596
9502 809596 839874 832269 856349 827907 766554 701327 718958 720556 706820 704216 698019 712610
9490 712610 663971 657749 699255 728289 753539 743894 712939 683938 664205 642126 661021 724188
9478G24188M4475j1077K930k9296j2171n5692K9436L6674Q35k8393N9048Q8889
9466H49846J1009Q833l9476l5631o3954K2326J2832n6360J584r30K3302M5483
9454G78864N056J7866L3395M2101m796n5K3312O049K2736N592r5452n2083M9550
9441H32135L1435L5853Q5809P6173L6378r729j4783o739L2883r731j6996J5584
9429A088272j8283j5993m8430p3264L385J1471j4553l2868K1285N7445L767J776
9417I84010K4276j777q430j2084N57Q052J6113L7996k0219n963j5775J8554L1959
9404A057269J4160J2187O237L9351p677J6657L6690N3924K8648n2218n3588R173
9392A160813k5485K9974M6054L3970k1804R483P0988r280L192k4473j2275m333
$$ plain form
9478 724188 768663 757586 760516 731220 719049 663357 692793 729467 730302 701909 760957 849846
9466 849846 860855 869688 830212 794581 730627 752953 765785 709425 711009 710079 733381 778864
9454 778864 783920 801786 835181 877282 872486 872431 895743 901792 924528 930120 834668 782585 832135
9441 832135 863570 899423 985232 1061405 1097783 1088054 1073271 1066532 1099415 1089684 1072688 1088272
9429 1088272 1069989 1053996 1005566 932302 935687 947158 932605 899737 921022 978467 982234 984010
9417 984010 1008286 1006509 998079 985995 986552 994604 1010717 1048713 1028494 1022531 1006756 1025310 1057269
9404 1057269 1071429 1083616 1089853 1129204 1121527 1138184 1174874 1228798 1257446 1205228 1151640 1160813
9392 1160813 1135328 1165302 1211356 1245326 1223522 1233005 1303993 1294713 1297905 1273432 1261157 1256824
9380A256824N1027K5832L5174m6718n8359m0340k045L150m7412K6381M8559n3812
9368A198261M9433l6149L758K2025M0304M8482m6548n2229m9958P2729K2179O500
9356A278787Q0586P3776j1957l1376n5481l053J29063P2374j173M0909O7130K7988
9344A667573K2248J1484J1584l036q499N7172N8326K6616L0183j2224l8832L8485
9332A861080O0309O5676K2788m9671J7083J7163j2565K5139P4669O3544Q8889
9321B234104O1109K8689N2642J6334M8741O6445N6558O9162J05147O5770K9831
9310B834532J1833P7871O3150L5060k0953K8244L9921P4600K8265q770P1295J13965
9298C349013L8036J0396N6688Q5680P6444K7877O6366J32463K1566P0317R0776
$$ plain form
9380 1256824 1307851 1333683 1368857 1322139 1263780 1223440 1221395 1224545 1177133 1203514 1252073 1198261
9368 1198261 1247694 1211545 1215303 1237328 1277632 1326114 1279566 1227337 1177379 1250108 1272287 1278787
9356 1278787 1359373 1433149 1421192 1389816 1334335 1331282 1460345 1532719 1531546 1572455 1639585 1667573
9344 1667573 1689821 1701305 1712889 1709853 1701354 1758526 1816852 1843468 1873651 1861427 1822595 1861080
9332 1861080 1921389 1987065 2009853 1960182 1977265 1994428 1981863 2007002 2081671 2145215 2234104
9321 2234104 2295213 2323902 2376544 2392878 2441619 2508064 2564622 2633784 2738931 2804701 2834532
9310 2834532 2846365 2924236 2987386 3022446 3001493 3029737 3069658 3144258 3172523 3163753 3235048 3349013
9298 3349013 3387049 3397445 3454133 3539813 3616257 3644134 3710500 3842963 3864529 3934846 4025622
9287D025622J11210J30053J16315M6811J02131J30855J63503R5368P5346Q2594
9277E079808J13902P2576J29973J85784J91319J99223J58951J48590K24293K00136
9267F704555J91179K24263K26659K67055K94500L50191K99481L29790M05461L38085
9257I631219L18067L50249L00532M26145M69619N46681N53972N57653O23707P08922
9247A4486766P25968Q02796R85548J075558J147875J185006J210289J354345J511624
9238B4485775J579814J626097J590800J585859J483511J489812J653377J849491
9230C7344536K013375K049315K057582K142863K213118K247093K280985K506605
9222E4855472L129751L956387N086615O433488P866745R073756R798332R618837
$$ plain form
9287 4025622 4136832 4266885 4383200 4430011 4532142 4662997 4826500 4921868 4997214 5079808
9277 5079808 5193710 5266286 5396259 5582043 5773362 5972585 6131536 6280126 6504419 6704555
9267 6704555 6895734 7119997 7346656 7613711 7908211 8258402 8557883 8887673 9293134 9631219
9257 9631219 9949286 10299535 10600067 11026212 11495831 12042512 12596484 13154137 13777844 14486766
9247 14486766 15212734 16015530 17001078 18076636 19224511 20409517 21619806 22974151 24485775
9238 24485775 26065589 27691686 29282486 30868345 32351856 33841668 35495045 37344536
9230 37344536 39357911 41407226 43464808 45607671 47820789 50067882 52348867 54855472
9222 54855472 57985223 61941610 67028225 73461713 81328458 90402214 100200546 109819383
9214A09819383R000365Q522918Q365245Q624903R304366J0530789J1934392J2897648
9206A89000009J2904004J2090672J0628766R463960R325583J0461625J1980577
9199B65855196J3057555J3691525J4447431J5501117J6835590J7613670J7421497
9192C74423581J6373797J5124796J4838792J6319300J9761156K4350358K8628701
9185E09820481L0836552K8871167K0976947P137789r093979k1141368k6173024
9178E41234565k5606498k1789431j7160394j3653977j2287796j3080069j5256229
9171D22400171j7171293j7746816j6995629j5155850j2689101j0355209q638059
9164C23648214p453768o712554o558559p263904q768969j0503828j1841573j2562658
$$ plain form
9214 109819383 118819748 127342666 135707911 144332814 153637180 164167969 176102361 189000009
9206 189000009 201904013 213994685 224623451 234087411 243412994 253874619 265855196
9199 265855196 278912751 292604276 307051707 322552824 339388414 357002084 374423581
9192 374423581 390797378 405922174 420760966 437080266 456841422 481191780 509820481
9185 509820481 540657033 569528200 590505147 597642936 588548957 567407589 541234565
9178 541234565 515628067 493838636 476678242 463024265 450736469 437656400 422400171
9171 422400171 405228878 387482062 370486433 355330583 342641482 332286273 323648214
9164 323648214 316194446 309481892 302923333 295659429 286890460 276386632 264545059 251982401
9156B51982401j2713763j2153041j0874748q950483o845288m983173l697119l411146
9148A88353640l902469m763437n853706p072410q011556q444757p955348o928936
9140A35421021n894239n005672m461315m248459m138681m001691l794264l434217
9132A00442483l039558k764709k561849k440781k523956k607116k653862k753349
9124G9097303k827207k732906k533471k271636k007672j799590j695733j648126
9116F1580962j598316j679198j679314j554774j485440j515301j499914j497010
9108D9071695j430497j408062j308645j223422j100031r85632r30283q61320q20783
9099C9003020q71373q58467r64309r80456q10321o76241p03876p39912o74931
$$ plain form
9156 251982401 239268638 227115597 216240849 207290366 200445078 195461905 191764786 188353640
9148 188353640 184451171 179687734 173834028 166761618 158750062 150305305 142349957 135421021
9140 135421021 129526782 124521110 120059795 115811336 111672655 107670964 103876700 100442483
9132 100442483 97402925 94638216 92076367 89635586 87111630 84504514 81850652 79097303
9124 79097303 76270096 73537190 71003719 68732083 66724411 64924821 63229088 61580962
9116 61580962 59982646 58303448 56624134 55069360 53583920 52068619 50568705 49071695
9108 49071695 47641198 46233136 44924491 43701069 42601038 41615406 40685123 39823803 39003020
9099 39003020 38131647 37273180 36308871 35328415 34518094 33841853 33137977 32398065 31723134
9090C1723134o29588o91622o99102o66636o34345n45108n48832m50873m83345
9081B6373683m78392m12476m31137m38438n11144m82538n19765m38201l99313
9072B2262279m61385m30436l82807m00254l49644l30049k37460k31818k34443
9063A9203983k39106k54195k96853l62983l03594l01050k27782k29228k51880
9054A6737312l20937l31618k63205k45855k53093l01721l30148l55737k81211
9045A4053787k17409j85592k47956l27009k68483k29106k23021j58881j97935
9036A1998395k48611k12447k29322j65427j58230j18942j61580j89896j35588
9027A0378352j21411n4483j31379j07591r5622q3852p5198j56351j29473p3559
$$ plain form
9090 31723134 31093546 30401924 29702822 29036186 28401841 27856733 27307901 26857028 26373683
9081 26373683 25895291 25482815 25051678 24613240 24102096 23619558 23099793 22661592 22262279
9072 22262279 21800894 21370458 20987651 20587397 20237753 19907704 19670244 19438426 19203983
9063 19203983 18964877 18710682 18413829 18050846 17747252 17446202 17218420 16989192 16737312
9054 16737312 16416375 16084757 15821552 15575697 15322604 15020883 14690735 14334998 14053787
9045 14053787 13836378 13650786 13402830 13075821 12807338 12578232 12355211 12196330 11998395
9036 11998395 11749784 11537337 11308015 11142588 10984358 10865416 10703836 10513940 10378352
9027 10378352 10256941 10202458 10071079 9963488 9867866 9784014 9708816 9552465 9422992 9349433
9017I349433k5488j0226q467k6583k4820o5106r5198l6837o3226N821n420j1660
9005H982223k4127m6802j5287J2805o0035r4078p5539n0761l1525J2937n1682
8994H558129o4453o2887n3382M477L2808P363j3401j0607n9788J4122k261o2213
8982H287907o053O40j6653L8140M6337K3182N2436P1381K3965R3646Q9686P0155
8970H774769J5777M1411J00456J07366M5141K4746R3430O7365P7024N4822J25794
8959I528101J01267Q3346O7241M3356R7183J06236R8316N7488O1951Q6190J41193
8948A0471868J10825J23628J28308J46396P9439R2976Q7924R7656J36774P8253
8938A1554047J05663J43907J58173J01380Q9402J99718K11045J47430J53110Q3496
$$ plain form
9017 9349433 9323945 9313719 9305252 9278669 9253849 9188743 9093545 9056708 8993482 8999303 8993883 8982223
9005 8982223 8958096 8911294 8896007 8908812 8848777 8754699 8679160 8628399 8596874 8609811 8558129
8994 8558129 8493676 8430789 8377407 8381884 8414692 8422055 8408654 8398047 8338259 8352381 8350120 8287907
8982 8287907 8281854 8282494 8265841 8303981 8350318 8373500 8425936 8497317 8521282 8614928 8704614 8774769
8970 8774769 8790546 8831957 8932413 9039779 9084920 9109666 9203096 9270461 9347485 9402307 9528101
8959 9528101 9629368 9712714 9779955 9823311 9920494 10026730 10125046 10182534 10244485 10330675 10471868
8948 10471868 10582693 10706321 10834629 10981025 11060464 11153440 11241364 11339020 11475794 11554047
8938 11554047 11659710 11803617 11961790 12063170 12152572 12352290 12563335 12710765 12863875 12947371
8928A2947371K26674K42980J60875J61682K12705J87765J76633K16920J47995
8919A4681600J26732K59161K08530K23592K81122K54773L11935K33143K74472
8910A6855060K43887K82171L30296L12040L26246L60583L19465K46458K88234
8901A9564440L58280M24481L36409L65423M33109L77368M15655M26925L92542
8892B3094632M06866M69902N19037N30371N39482N95900O05297N34011N67006
8883B7862504O21046O31328O33134N96126O22834P21662P60276P67252P26710
8874C3942872P16627Q33798Q65831Q70855Q90799R41078R49338R35398J013266
8865D1959862J019265J029696J119920J173250J155144J173215J172822J229817
$$ plain form
8928 12947371 13174045 13417025 13577900 13739582 13952287 14140052 14316685 14533605 14681600
8919 14681600 14808332 15067493 15276023 15499615 15780737 16035510 16347445 16580588 16855060
8910 16855060 17098947 17381118 17711414 18023454 18349700 18710283 19029748 19276206 19564440
8901 19564440 19922720 20347201 20683610 21049033 21482142 21859510 22275165 22702090 23094632
8892 23094632 23501498 23971400 24490437 25020808 25560290 26156190 26761487 27295498 27862504
8883 27862504 28483550 29114878 29748012 30344138 30966972 31688634 32448910 33216162 33942872
8874 33942872 34659499 35493297 36359128 37229983 38120782 39061860 40011198 40946596 41959862
8865 41959862 42979127 44008823 45128743 46301993 47457137 48630352 49803174 51032991
8857E1032991J313697J519012J728782J986025K379706L093791L876369M020631
8849G0951004K690708k752j823106j604267p22915l5531L74470N95604O70431
8840G1093646P33931P23853O34785O25051O20786M75599M13188L76544M21205
8831G6118588L56933K44731J58210R4195k6053r6222j66062j16406k12705k45422
8821G6109787l49559m29777m86495m95079n00286o02535o43456o55804p50276
8812G1196520q32485q44459q76503q51980r50300r55730r47943r73722r90519
8803F2972879r71626r15407j010054j009596r22254r31431r57580r40579r27862
8794E4386490r77911r43667q65441q98760q71611q12640q67901q41058p89378
$$ plain form
8857 51032991 52346688 53865700 55594482 57580507 59960213 63054004 66930373 70951004
8849 70951004 73641712 73638960 71815854 70211587 69488672 69453141 69827611 70423215 71093646
8840 71093646 71827577 72551430 73186215 73811266 74432052 74907651 75320839 75697383 76118588
8831 76118588 76475521 76720252 76878462 76972657 76946604 76850382 76684320 76567914 76355209 76109787
8821 76109787 75760228 75330451 74843956 74348877 73848591 73246056 72602600 71946796 71196520
8812 71196520 70364035 69519576 68643073 67791093 66840793 65885063 64937120 63963398 62972879
8803 62972879 62001253 61085846 60075792 59066196 58143942 57212511 56254931 55314352 54386490
8794 54386490 53408579 52464912 51599471 50700711 49829100 49016460 48148559 47307501 46518123
8785D6518123p85865q37579p54373p36679o94623o85655o97113o69854o43295
8776D0013087o50098p17089p14639o54377o49103p00867o30191o44379o51010
8767C4001334o85410n86260n83423n93715n65803n77957n94419n40709m28060
8758B8845578m24420m57838m08455n01114n14727m14251m45746m64372m05067
8749B4809588m04844m04198l51924l16089l54172l79491l36604l09979k97024
8740B1655263l93945l99874k28566k69003l28449l27744l30520l59109l51931
8731A8666122l44841k89720k66887l43079k79735k97375k52296k52731k62920
8722A6076538k48939k27455k88315k50029k65261k48884k03786j58731j68736
$$ plain form
8785 46518123 45732258 44894679 44140306 43403627 42709004 42023349 41326236 40656382 40013087
8776 40013087 39362989 38645900 37931261 37276884 36627781 35926914 35296723 34652344 34001334
8767 34001334 33315924 32729664 32146241 31552526 30986723 30408766 29814347 29273638 28845578
8758 28845578 28421158 27963320 27554865 27053751 26539024 26124773 25679027 25214655 24809588
8749 24809588 24404744 24000546 23648622 23332533 22978361 22598870 22262266 21952287 21655263
8740 21655263 21261318 20861444 20632878 20363875 20035426 19707682 19377162 19018053 18666122
8731 18666122 18321281 18031561 17764674 17421595 17141860 16844485 16592189 16339458 16076538
8722 16076538 15827599 15600144 15311829 15061800 14796539 14547655 14343869 14185138 14016402
8713A4016402k18885k24518k11217j84996j25229j33756j99998j91772j45896
8704A2380135k02476j88749j99683k18426j18307j01454j85664j96094j65640
8695A0803642j95702j84435k16172j82456q2259j08936j08521j15948k09469j65185
8685I234559n3755r3688j31907j22002j25788j31508q3970j32484j18182j44087
8675H097188j07970j17609j07285r9419q2116j30771r3541r9261j07660j21124
8665G030432j21400o5539n4544n9681o4002k8395k1515r3799j13419j04916r7146
8654F206076k2877n8622j04814j9801o5670o6103n1389q3647r3887l6671n4752
8643E547843j01645m9461m8845j03875m4963k2740p275k1332n7470j02204q1750
$$ plain form
8713 14016402 13797517 13572999 13361782 13176786 13051557 12917801 12717803 12526031 12380135
8704 12380135 12177659 11988910 11789227 11570801 11452494 11351040 11165376 10969282 10803642
8695 10803642 10607940 10423505 10207333 10024877 9942618 9833682 9725161 9609213 9399744 9234559
8685 9234559 9180804 9087116 8955209 8833207 8707419 8575911 8491941 8359457 8241275 8097188
8675 8097188 7989218 7871609 7764324 7664905 7582789 7452018 7358477 7259216 7151556 7030432
8665 7030432 6909032 6843493 6788949 6729268 6665266 6636871 6615356 6521557 6408138 6303222 6206076
8654 6206076 6183199 6124577 6019763 5999962 5934292 5868189 5816800 5733153 5639266 5602595 5547843
8643 5547843 5446198 5396737 5347892 5244017 5199054 5176314 5169039 5147707 5090237 4988033 4906283
8632D906283p2512n4117J6291l3675r9418r029n0346m4935r2787q7031l9604k6154
8620D312966l3769J665j8043q5443p4878k1476o3415o4437m8117l2744k4614j0614
8608C837081q83P18j6603n1520l7830l5018k9145j00039m9413N479P2686L9425
8596C634938k8365n4063m5996J9054r1053p4619n0810l7265l3326j3823J4179
8585C238851L4969r0158p3816k3762p107j1421K949n8453o1754n3965J4049n30
8573B909852J2476J0817m829j330M044K214j5918K7266n3867j01668q4274Q416
8561B713199k490p994j9406n2182n0060m0084j2269l381n7580j395M3683j3280
8549B496761j8932p2541r655K6679k7062n4542n8425r902K9509L635L2351l1719
$$ plain form
8632 4906283 4833771 4779654 4795945 4762270 4662852 4653823 4603477 4558542 4465755 4378724 4339120 4312966
8620 4312966 4279197 4280862 4262819 4177376 4102498 4081022 4017607 3953170 3905053 3872309 3847695 3837081
8608 3837081 3836198 3836916 3820313 3768793 3730963 3695945 3666800 3566761 3517348 3522827 3595513 3634938
8596 3634938 3606573 3552510 3506514 3525568 3434515 3359896 3309086 3271821 3238495 3224672 3238851
8585 3238851 3273820 3183662 3109846 3086084 3078977 3067556 3070505 3012052 2950298 2896333 2910382 2909852
8573 2909852 2922328 2933145 2928316 2926986 2931030 2933244 2917326 2944592 2890725 2789057 2704783 2713199
8561 2713199 2710709 2702715 2683309 2631127 2581067 2540983 2528714 2525333 2467753 2466358 2510041 2496761
8549 2496761 2477829 2405288 2395633 2422312 2395250 2340708 2282283 2272381 2301890 2305525 2337876 2306157
8537B306157j5852M271l1948m0584k9251m1329j3293k3500Q705J5868o4626p1548
8525B003070k4676K2733J9284k6216R557J4429J748K682p803J3661j8148n2204
8513A958117q467l5657L1392L3146n6773p1006N442L9767K2861l5401n3146l1080
8501A799195J1064l343J5811L7249L8589o8972r8610m7130l6906m2668K7881j6921
8489A615239Q843j1406l8315J467K840n5834n944K580J1862j6798k8950o0701
8477A424883j0394J7089K5884O6096J2270k9002J9598m2190k4468j4916N062K5922
8465A475834j8135l5452l730K8474J6316q9931k0879J8255K158j6936l2825m6008
8453A277141k786O5820j5907M4522K4228k8926k0190j2756j0745M4800j7088n1245
$$ plain form
8537 2306157 2290305 2294576 2262628 2222044 2192793 2151464 2138171 2114671 2123376 2139244 2074618 2003070
8525 2003070 1978394 2001127 2020411 1994195 2003752 2018181 2019929 2022611 2014808 2028469 2010321 1958117
8513 1958117 1949650 1913993 1945385 1978531 1921758 1850752 1856194 1895961 1918822 1883421 1830275 1799195
8501 1799195 1810259 1806916 1822727 1859976 1898565 1829593 1730983 1683853 1646947 1604279 1632160 1615239
8489 1615239 1624082 1612676 1574361 1575828 1578668 1522834 1516890 1519470 1531332 1514534 1485584 1424883
8477 1424883 1414489 1431578 1457462 1523558 1535828 1506826 1526424 1484234 1459766 1444850 1449912 1475834
8465 1475834 1457699 1422247 1418517 1446991 1463307 1373376 1352497 1370752 1372910 1355974 1323149 1277141
8453 1277141 1274355 1340175 1324268 1368790 1393018 1364092 1343902 1331146 1320401 1365201 1348113 1296868
8441A296868o2914q867K4719J7400l3702j6123K3271n002l2821L236J9082j3806
8429A211341K8054O3293j2596q8489m0559K2421l8435L6873K5283k7154j7963
8418A162069n9628l3628P0643j8982k3522n2693L5934j1530n3069O237M1695M3992
8406A107518k0024o6125m0382L7209M5879O9909n305m4582p2887j383O7186L488
8394A080501K0573R454n9380k2561m0083o0596L1295M6633R159l4908P859L9056
8382A027002k464o7522l7586J0573K1597N3336R804k1753n864l1139k8179L847
8370I31652k5475j1880j690K2383k0210m7176P981R957N5862P330k6504M538K191
8357I08959J8939j8444L9954n233m125K4978j2152l980k0198K3361N9045l533
$$ plain form
8441 1296868 1233954 1225087 1249806 1267206 1233504 1217381 1240652 1235650 1202829 1206065 1225147 1211341
8429 1211341 1239395 1302688 1290092 1201603 1161044 1183465 1145030 1181903 1207186 1180032 1162069
8418 1162069 1102441 1068813 1139456 1120474 1096952 1044259 1080193 1068663 1015594 1021831 1063526 1107518
8406 1107518 1087494 1021369 980987 1018196 1064075 1133984 1128679 1084097 1011210 1009827 1077013 1080501
8394 1080501 1101074 1110528 1051148 1028587 988504 927908 959203 1005836 1014995 980087 987946 1027002
8382 1027002 1024538 957016 919430 930003 951600 1004936 1014740 992987 987123 955984 927805 931652
8370 931652 906177 894297 892607 914990 894780 847604 855585 865542 921404 928734 902230 906768 908959
8357 908959 927898 909454 949408 944175 940050 965028 952876 948896 928698 952059 1011104 1007571
8345A007571m3157m8582m7124l3471m1372l2908n8058J9041J01473K9625O440
8334H59478k0562M0884J9251K079R913K9811l8974m6878j3039j1156L6440K873
8322H70120L3949m3569r2665K0648N1094L2089l7858j3178k7697n944K4903j4998
8310G96894l0100k8377J5748Q552m2626r596J130j4244J4613K8394j5137J5381
8298G40632M295n9087J8968K3893J4579m194l7861j0069L1804N530m5848k2510
8286F60132L519K9410k9618j4639J5721L6903R2619j7223K8985j6787m2269K792
8274G49545P1552N5266l5264o4928n9107m0282o427M5747k1941m3477r573n3470
8262E87641j8771Q679J0988L3213J4858J6681l3687q96J7138L9775N0954o2341
$$ plain form
8345 1007571 964414 915832 868708 835237 793865 760957 702899 721940 823413 853038 859478
8334 859478 838916 879800 899051 901130 911043 940854 901880 855002 841963 830807 867247 870120
8322 870120 904069 860500 767835 788483 839577 871666 833808 820630 792933 786989 811892 796894
8310 796894 766794 738417 754165 762717 720091 710495 711625 697381 711994 740388 725251 740632
8298 740632 744927 685840 704808 728701 743280 739086 701225 691156 722960 728490 682642 660132
8286 660132 663651 693061 663443 648804 664525 701428 794047 776824 805809 789022 746753 749545
8274 749545 821097 876363 841099 776171 717064 676782 670355 716102 694161 650684 641111 587641
8262 587641 568870 577549 588537 621750 636608 653289 619602 618706 635844 675619 726573 664232
8250F64232O637k5204j1449K8657p643J0041l7895j29P419N1901L7236m4050o2208
8237F17545J6163J4930j8144l3185K4588n0524j1250O608K7225J0854R689P915
8225F22414L2670o180L1238o6993r4708J4909l026M8709K3053j3082n0989m5199
8213D92816m5102L2688M6996k6545K5017n4931k8465N4940P4557L0915K7160M4374
8201F74420O21m9636m8277q507m569J1193Q7k9940j5378L9291N5407l1104n4683
8188E38925m9522K7764j7815Q906Q228p689J235j023J9386J3678J4183K0905k4750
8175E52411J6027r464k8340j2460j9592L900L8096M2936m9122l6746m4367k2642
8163D30637J5028k445m3153N194O292J6150J7210K6722l914m5198l3147j4247
$$ plain form
8250 664232 670869 645665 634216 662873 655230 665271 627376 627247 634666 686567 723803 679753 617545
8237 617545 633708 648638 630494 597309 621897 571373 560123 566731 593956 604810 614499 622414
8225 622414 655084 648904 680142 613149 518441 533350 530324 579033 602086 589004 538015 492816
8213 492816 447714 480402 527398 500853 525870 470939 442474 497414 571971 602886 630046 674420
8201 674420 675041 625405 577128 568621 564052 575245 575332 545392 530014 569305 624712 593608 538925
8188 538925 489403 517167 499352 508258 516486 508797 510032 509009 528395 542073 556256 577161 552411
8175 552411 568438 558974 530634 518174 498582 502482 540578 583514 534392 497646 453279 430637
8163 430637 445665 443220 400067 405261 411553 427703 444913 471635 467721 422523 389376 375129
8151C75129L3172l8772p76R437J5857M1875J844j3317P0981Q022k2163o6465j7883
8138C96941K9713j5840j8302K6216M634j1511L0691j6604k2608j2589L4991K9358
8126D55090p3352k360K1890P4916m360j0317J0043P900j089k5000P9732M7874
8114E80967o1243n6125k708P212m017n4561k3809Q761L5144R257k4448k3691j8518
8101C72221L7031N590q0466k781K7432L6514J2429M5356R119l5640m1577K5241
8089D10469K5612j4583k4077J4111n019J1100n812L6805j7117l4017j2309j7059
8077C68104p940J3459l6002l5535J3060j966l3564R1260R8899K2979j9740j09528
8065C63486j6159k2335j2580L091l229p9O1303J4364l7133m2907Q932O1774J4789
$$ plain form
8151 375129 408301 369529 368753 378190 394047 435922 437766 424449 495430 503452 481289 414824 396941
8138 396941 426654 410814 392512 418728 423362 411851 442542 425938 403330 390741 425732 455090
8126 455090 381738 379378 401268 476184 471824 461507 471550 479450 478361 453361 533093 580967
8114 580967 519724 463599 460891 468103 464086 409525 385716 394477 429621 438878 414430 390739 372221
8101 372221 409252 414842 334376 331595 359027 395541 407970 453326 462445 426805 385228 410469
8089 410469 436081 421498 397421 411532 406513 417613 411801 448606 431489 397472 385163 368104
8077 368104 360164 373623 337621 302086 315146 313180 279616 370876 469775 492754 473014 363486
8065 363486 347327 324992 312412 315503 312274 312195 373498 387862 350729 307822 316754 378528 393317
8052C93317P130N525j5559o8495l0152N5238K0074K2203K2500k796n937j8224
8040C84824l832n860o8599l3058r171R9784O7495K8040K9806l5250l0360m5175
8028C78644m4339N6852l2693p549J585j8804K2291N0052j0482o0500l7638j2850
8016B84569j0825L4965P3803Q810m1522p8771J1148l650M4447j640J2967l4116
8004C00185M0438L9248R190K9671j9938p4359j5757K8479K2115l5541k0450j1639
7992B91642j5999J0141M5775j5252q5767k4148l657k2364l190k0825J5702P0569
7980B42627j2329j8243J6879O0008O762L302K0457l8615m4236l4530P0466m0360
7968B32188J7768q672L4178M7385l9001l961L0442L0741o9828j1829L062K907
$$ plain form
8052 393317 400447 405972 390413 321918 291766 347004 367078 389281 411781 408985 403048 384824
8040 384824 380992 375132 306533 273475 264304 364088 431583 459623 489429 454179 423819 378644
8028 378644 334305 391157 358464 350915 352500 333696 355987 406039 395557 335057 297419 284569
8016 284569 273744 308709 382512 391322 349800 271029 282177 278527 322974 321334 334301 300185
8004 300185 340623 379871 389061 418732 398794 324435 308678 337157 359272 323731 303281 291642
7992 291642 275643 285784 331559 316307 230540 206392 202735 180371 177181 156356 172058 242627
7980 242627 230298 212055 228934 288942 295704 299006 319463 280848 236612 202082 272548 232188
7968 232188 249956 241284 275462 322847 283846 279885 310327 341068 271240 259411 262473 265380
7956B65380J1348m9702L8335L8619j9943N6612r014J2378n8830M998L8027j1957
7944C16251K7n2425o242O5197P938l5348k0600O7464J6239p496q15n5745k3599
7931B70846j2401O3972J2431k9403q809L0360O765K9899j7873j8615l9103N714
7919B93783K3551m5309l1321j4581L3196M4179M834j6429j229L1739k9024m25
7907B92964o86N4823k5553l540l7963m1502P3223j4543j3594j1351L7299L8997
7895C48574J8407K4028o093j8298L9146r327K0988m5178r1340k5378L1474P285
7883B94288k741J1320k2864L2747O166j95j5301o422J673l5906n1029O497L2480
7870B50713K6834k4488n5455L0507J4921J6962k85o690K5510j929p100M56O8142
$$ plain form
7956 265380 276728 227026 265361 303980 284037 340649 331635 344013 285183 290181 328208 316251
7944 316251 316278 263853 257611 322808 330746 295398 274798 342262 358501 351005 350190 294445 270846
7931 270846 258445 322417 334848 305445 296636 326996 333761 363660 345787 327172 288069 293783
7919 293783 317334 272025 240704 226123 259319 303498 308332 291903 290674 322413 293389 292964
7907 292964 292278 347101 321548 318008 280045 238543 311766 297223 283629 272278 309577 348574
7895 348574 366981 391009 384916 366618 405764 396437 417425 372247 280907 255529 287003 294288
7883 294288 291547 302867 280003 312750 318916 318721 303420 296998 298671 262765 211736 218233 250713
7870 250713 277547 253059 197604 228111 243032 259994 259709 253019 278529 276600 269500 269956 338098
7857C38098K0834q904l9742l0942r710k6426k1211M2597J0996l3745n6834k5450
7845A59561q033J3383k349J5622p586Q677R059k598k24L7875p214P723M0595M143
7831B68634m8545k0345m2908L796K2754K0349o018K4064j3887k9944K6829M1246
7819B46025k6118P025N100k7184k6964P551j2096K3246k1598k6900L0349l28J9623
7806A97731L313J3127K5763j353j8987N3067J4697l9748k8730J8694M3376J8096
7794B99046l7973l6949Q369J3611p7770l5928O641L4094N0073L1718M064k7655
7782B31341j6494n1979J8048j4714l9465l1164O4514K1112N867L8282j3418n923
7770B06007L955J8291k6466K0842J7615m3762K7143j2991K6627L0932L5915O850
$$ plain form
7857 338098 358932 350028 310286 279344 269634 243208 221997 264594 275590 241845 185011 159561
7845 159561 151528 164911 162562 178184 170598 179275 188334 185736 185512 223387 216173 223896 264491 268634
7831 268634 220089 199744 156836 160632 183386 203735 197717 221781 207894 177950 204779 246025
7819 246025 219907 226932 232032 204848 177884 185435 173339 196585 174987 148087 178436 178108 197731
7806 197731 201044 214171 239934 238581 219594 272661 287358 247610 218880 237574 280950 299046
7794 299046 261073 224124 232493 246104 168334 132406 139047 173141 223214 254932 258996 231341
7782 231341 214847 162868 180916 166202 126737 95573 160087 181199 187066 225348 211930 206007
7770 206007 209962 228253 201787 222629 240244 196482 223625 210634 237261 268193 304108 310958
7758C10958k8375l5406q031N190j6783j575R445l0724l9216k9367O1074L9661
7746B36851L6121L8911k2678m6768o8237m0377l4491q981N9490P516J1916K6758
7734A96031J3989l9220p3031j2682P2976L3832K6939j3556K7036K3308m1717n4876
7722A59029m8996P581N3225N822m711O446l528j9543m0730j665N483k1396j4695
7709H2322M1099N7891M5417L3047M0458j2275m0304k7018l2150j4776j6645m1922
7697A15144O983l577K6053q278Q645N0651L369k7763P411L9761J8487o064j527
7684B29295o2361r8548j4485N5739L172j316k439q562J2698j5516k7751Q0823
7672A50749L5089l0731L7112k651j2961l6184M2688J2887j3617J2775O587l3040
$$ plain form
7758 310958 282583 247177 239146 244336 227553 225978 235423 204699 165483 136116 197190 236851
7746 236851 272972 311883 289205 242437 174200 133823 99332 90351 149841 157357 169273 196031
7734 196031 210020 170800 97769 85087 158063 191895 218834 205278 232314 255622 213905 159029
7722 159029 110033 117614 170839 176661 171950 178396 174868 155325 114595 112930 118413 97017 82322
7709 82322 123421 181312 226729 259776 300234 287959 247655 220637 188487 173711 157066 115144
7697 115144 122127 118550 144603 136325 144970 195621 198990 171227 178638 218399 236886 230822 229295
7684 229295 166934 68386 53901 109640 112812 111496 109057 100495 113193 97677 69926 150749
7672 150749 185838 155107 192219 189568 176607 140423 183111 195998 182381 195156 201743 168703
7660A68703n7671L659M9772K243r842m5068k9698l6960M7936O3134j2182R414
7648A53440o0253l8721R5680O2502p417l6411p4670l311p970L402J2233J4948
7636A13452P87K9331K3952J9600k5508J1336L5896n7615n6132M2252K7192K5115
7624A89658j8991m0275l2623M6443K8659N147K7853L5307M3864J129n285l6951
7612B43935l9999n0932j4331J8590k0266J9534j1100k4221n665k4881k3710M6587
7600A13541L3205j0218K9269j6843m2016j9732O3186l501m921p2766L832M617
7588G7653L3171j4412m9249k582L6719J1956o5968k1181m584P1815O3111J2062
7576A48511o589O664L363J3535l6158P221j9901k9602J428k3377J2556N7065L7358
$$ plain form
7660 168703 111032 114691 164463 166706 156864 111796 82098 45138 93074 156208 144026 153440
7648 153440 93187 54466 150146 212648 205231 168820 94150 90839 82869 86271 98504 113452
7636 113452 114239 143570 167522 187122 161614 172950 208846 151231 95099 137351 164543 189658
7624 189658 170667 130392 97769 144212 172871 178018 205871 241178 285042 286171 280886 243935
7612 243935 203936 153004 138673 157263 136997 156531 145431 121210 115545 90664 66954 113541
7600 113541 146746 136528 165797 148954 106938 87206 150392 146891 141970 69204 73036 77653
7588 77653 110824 96412 47163 44581 81300 93256 27288 6107 1523 73338 136449 148511
7576 148511 141922 148586 151949 165484 129326 136547 116646 87044 88472 65095 77651 134716 172074
7563A72074k1791K833J7755p4471l6145L2693M189j3187J3998M3163M6171m7276
7551A40006n9705j8542m6585N536L0889J0024K5544r290L3467m1950J1326J11313
7539A92033k0828p1502K351m1595l6578m0313K961J01398Q8918j9778p90r718
7527A46559j5321J6997k2134k5883N4354J6555r6597n596N9724j7028K9914n2197
7515H9347l0685j500M937j7743L2640J3818O3002J7127m5858K0767q381k7821
7503A09650K2299l1501J4191k7833m3097K4857P3533j4548k9678K5432N5863L1962
7491B11130l5662k4443j3015k3001J6598M2972K4798l6666q7014k6733K9490M5506
7479A23960j7004j7067l960J9738N3225L3738n7578n6315K8287N9605j1859k6484
$$ plain form
7563 172074 150283 153116 170871 96400 60255 92948 97137 83950 97948 141111 187282 140006
7551 140006 80301 61759 15174 20710 51599 61623 87167 77877 111344 69394 80720 192033
7539 192033 171205 99703 102054 60459 23881 -16432 -13471 87927 176845 157067 156277 146559
7527 146559 131238 148235 126101 100218 154572 171127 74530 68934 128658 111630 141544 89347
7515 89347 58662 57162 62099 44356 76996 90814 153816 170943 125085 145852 137471 109650
7503 109650 131949 100448 114639 86806 43709 68566 142099 127551 97873 123305 179168 211130
7491 211130 175468 151025 138010 115009 131607 174579 199377 162711 75697 48964 78454 123960
7479 123960 106956 89889 85929 105667 158892 192630 135052 78737 107024 166629 154770 128286
7467A28286M0664k5252k1578P143O5101K2851n3558l025j2173Q373j4647j8394
7455A23791k2523l9227Q086J1079k6788J1550N011l4337m2558N7330K8436k45
7443G9605J7001k0851K49N6141N970l6648k8240L2982K2662k6640l0521J5364
7431H7074N646Q529J6625L2384j0880k2279j06902k1642L4023Q535j3379l31N5316
7418G2719N2173J4398k1507N415k4318l3681L7854N428m438k3756m8081M7598
7406G9804J118j3627L5840J6125L8361K6060n6831o2392j019M556J8087R099K5931
7393A21112N2715J8851r036k4105l0345O602m7029K0806R3135L8908l3199n3817
7381A54598n3421J3705r337j1492k1139p498j8411O5645J08963l39q3932l8674
$$ plain form
7467 128286 168950 143698 122120 129263 194364 217215 163657 160632 148459 156832 142185 123791
7455 123791 101268 62041 70127 81206 54418 65968 70979 36642 -5916 51414 79850 79605
7443 79605 96606 75755 76004 132145 138115 101467 73227 106209 128871 102231 71710 87074
7431 87074 92720 101249 117874 150258 139378 117099 10197 -11445 22578 31113 17734 17403 72719
7418 72719 124892 139290 117783 123198 98880 65199 103053 108481 104043 80287 32206 79804
7406 79804 80922 67295 103135 119260 157621 183681 126850 64458 63439 67995 86082 95181 121112
7393 121112 173827 192678 183642 159537 129192 135794 88765 109571 202706 241614 208415 154598
7381 154598 101177 114882 105545 94053 72914 65416 47005 112650 221613 221274 137342 98668
7369I8668m2121K7883J2598J6016K3714j5978O220M6572N152N520j3245j7363
7357A53636l6721j6563k4305L4687m1250l6660J0225K825Q171M4849M8000M1032
7345A87926K5143l4795o0839l1496J2329p9938j2421K737M2291L9865P942j1061
7333H7683n3183m3002l122J0751N6720k4319l8471j4435M9336J903J0563J3549
7321E3973k4517n9527m0064P9144R7846k2311j8304J9861j0576l0362K4145j422
7309F7886N5839L8436L2877j8446P837j3540J1223K3575o4648r0626m2484R928
7297A7857m5615q963M8389O5005K5364l1077j4332j2898J2530j424J8967P744
7285H1547K5853K2322j0794j9862j1902Q56m6822j5841R156L3968L4141k200m2104
$$ plain form
7369 98668 56547 84430 97028 113044 136758 120780 127000 173572 178724 184244 170999 153636
7357 153636 116915 100352 76047 110734 69484 32824 43049 45874 54045 98894 146894 187926
7345 187926 213069 178274 117435 85939 98268 18330 5909 8646 50937 90802 98744 87683
7333 87683 34500 -8502 -11624 -873 55847 31528 -6943 -21378 27958 29861 40424 53973
7321 53973 29456 -30071 -70135 9009 106855 84544 66240 86101 75525 45163 69308 67886
7309 67886 123725 162161 195038 176592 184429 170889 182112 205687 141039 50413 7929 17857
7297 17857 -27758 -36721 11668 76673 102037 70960 56628 43730 56260 54836 73803 81547
7285 81547 107400 129722 118928 99066 87164 88020 41198 25357 34513 68481 102622 100422 58318
7272E8318o7981Q310L5811l1466r48N8542M7686m5408m1158q500J7357M6061L6017
7259A12641m6851L685K1450M968N4174L9112o2466p6579L8795K812m8696p2052
7247b9007k6625M3575L899M1750k1081k3411L583k0422O119k1211K1768O7949
7235D6886k5845r7347Q694O453O7545M5116k4630m7125J6561j3714J2955R8049
7223I3598K2222J6765k6657K8524k0090l2763K906m6678p559P0406N8898l1094
7211A28478n8655L529R344J9371R381j0777N1927m684j7578l7120q909J6134P901
7198A08342J0312J1509l5796j7001L460P756j3384k0140j7008l1715k0532M1076
7186B6879j5122L4880L0519N2781m1846K920L3206J7305l5744J5235k6243k47
$$ plain form
7272 58318 -9663 -1353 34458 2992 2044 60586 108272 62864 21706 13206 30563 76624 112641
7259 112641 65790 69475 90925 95893 150067 189179 126713 50134 88929 91741 43045 -29007
7247 -29007 -55632 -12057 -8158 33592 12511 -10900 -7317 -27739 -21620 -42831 -21063 46886
7235 46886 21041 -76306 -67612 -61159 6386 51502 26872 -20253 -3692 -17406 -4451 93598
7223 93598 115820 132585 105928 134452 114362 81599 84505 37827 30268 100674 159572 128478
7211 128478 69823 73352 82696 102067 111448 100671 152598 147914 130336 93216 84307 100441 108342
7198 108342 118654 130163 94367 77366 80826 88582 75198 55058 38050 6335 -14197 26879
7186 26879 11757 46637 77156 129937 88091 91011 124217 141522 105778 121013 94770 94523
7174I4523l1694l4391L6201k0622m6919M2189O5386j299j7514m0654m8340q209
7162a1343M7127N081L9040l4372l7565L5173L2588O2733R36m7334j7764n9J01
7149G4342j4430r7521j4189L5294M6572M2548k0741K7049L1544O726N1109j8410
7137A49893j04311k7829P4730P010m5282L164n4783J3148N2489K7253j6454k3131
7125E5897K4448l5482j4983k5729k2982K1046J1907p056N2917l4623j6464J7247
7113B6143K9800N2575k6640j9499N887L0081k3785q031M1301p9318n4014k2410
7101d7910J4081N5451N0680K2373K1810K2318j1051k6703K6100L8583n4406m5397
7089F5929l2281n101m3418k9528N5810N3696j3846K6140k7094p0864L103L497
$$ plain form
7174 94523 62829 28438 64639 44017 -2902 39287 104673 103374 85860 45206 -3134 -11343
7162 -11343 35784 40865 79905 45533 7968 43141 75729 138462 139398 92064 74300 74241 74342
7149 74342 59912 -37609 -51798 -16504 30068 72616 51875 78924 110468 117194 168303 149893
7137 149893 45582 17753 92483 99493 54211 57375 2592 15740 68229 95482 79028 55897
7125 55897 80345 44863 29880 4151 -18831 2215 14122 7066 59983 25360 8896 26143
7113 26143 55943 108518 81878 62379 68266 98347 74562 66531 107832 28514 -25500 -47910
7101 -47910 -33829 21622 72302 94675 116485 138803 127752 101049 127149 165732 111326 65929
7089 65929 33648 28547 -14871 -44399 11411 65107 51261 77401 50307 -20557 -17454 -13957
7077a3957k5299J4351L4939N8498L6171M181O818N3045J1900o3861p645L898m1360
7064G1679P063r777j4842J2121n2399j272N1076R9183O346m8075Q257m07O142
7051A35095j8790l3475j4132j7701j1028m2056L4792L5847k7983k1774k2110k6390
7039b9705K5305j1113l4846j0718p199M1760N1338M7417L2067o8720k7110p260
7027A216L032N1225l8773j5735j5032J0111L9846L4242j4874m5097n0379L9841
7015c77R4665k0746l4152K5550n2882l4021l855k5582K650M24P6242L6081L8927
7002A02924J388n1983j6205p14j8730p6617R493J12958L3476j7923m3992M673
6990C8748L7754n991l25J1987K0423m4878J7228L4428K4057l6724m7139m4938
$$ plain form
7077 -13957 -39256 -24905 10034 68532 104703 108884 115702 168747 180647 116786 109141 113039 71679
7064 71679 78742 68965 54123 66244 13845 12573 63649 162832 169178 121103 129360 128953 135095
7051 135095 116305 82830 68698 50997 39969 -2087 32705 68552 40569 18795 -3315 -29705
7039 -29705 -4400 -15513 -50359 -61077 -68276 -26516 24822 72239 104306 35586 8476 1216
7027 1216 4248 55473 16700 965 -14067 -3956 35890 70132 55258 10161 -40218 -377
7015 -377 94288 73542 39390 64940 12058 -21963 -25818 -51400 -48750 -48326 27916 63997 102924
7002 102924 104312 52329 36124 35410 16680 -59937 -50444 62514 95990 78067 34075 38748
6990 38748 76502 70511 70186 82173 102596 57718 74946 109374 133431 96707 49568 4630
6978D630K726q62L8352K7066j8084J2562Q036J1252L4113j1512k4362m1064J043
6965D3896L7086n355k0718K3619O9162J0316O737J2988l3726L2804k3385k4463
6953A28961n869o1203j4409m1837K4305R1577J7217p2151j1204J6280p658K5510
6941H9519m9861p1201p7794M132J08660M7143J1140k6970r413j8928p457l028
6929d058J3924J1374N7494N1270J015o3770q0938l741J5450P0711K3736j7801
6917G4666k7045p9292J6977M7299J9714j1548m720l7379O806O9326O21q295J9529
6904H6659j902L5329O0526j216q9837l7487J6273P811q485M1993m7573l9139n500
6891A7452Q611j0914m130K6967q282j02O6749j849O30n3236K793j6695j3865J6136
$$ plain form
6978 4630 7356 6494 44846 71912 53828 66390 74426 85678 119791 108279 83917 42853 43896
6965 43896 80982 75627 54909 78528 147690 158006 164743 177731 144005 176809 153424 128961
6953 128961 123092 61889 47480 5643 29948 121525 138742 66591 55387 71667 64009 89519
6941 89519 39658 -31543 -109337 -105205 3455 50598 61738 34768 25355 6427 -1030 -4058
6929 -4058 9866 21240 78734 130004 131019 67249 -13689 -17430 -1980 68731 92467 74666
6917 74666 47621 -31671 -14694 32605 52319 40771 36051 -1328 5478 74804 75425 67130 86659
6904 86659 84757 120086 180612 179396 89559 52072 68345 76156 67671 109664 62091 22952 17452
6891 17452 26063 15149 11019 37986 29704 29602 96351 94502 95132 41896 44689 27994 14129 30265
6877C0265K68K8775L6659Q737j8232j5462j0117K9950J2677m2323l5707O91J5398
6864D1579N8906J9878m4013J4879K2983l6496l9734O90J7222K0057J0110J1846
6852I7907J3483k6581l965O2685l8198q5650j7839o959k9455j496M261O1584R765
6839C9542n8138M7043M5916k3548J2980J2875J7126q195j4364j3198J0690K3582
6827I2311m4342j01605j6685R4572P0575j2827o390J997l3325N430K8169m4336
6815C3544L597O4068k8320p754J5666m1683m0364P110n492j1993P447m841O6173
6802E7158j0001m4438J8658J3570l7032j8097P822O9324J1253j6672L7951J9862
6790A09358n4512o097q007m8268l7909J398M7460N0012N266l5342q414j4563j3501
$$ plain form
6877 30265 30533 59308 95967 104704 86472 71010 60893 90843 103520 61197 25490 26181 41579
6864 41579 100485 120363 76350 91229 114212 77716 37982 38672 55894 75951 86061 97907
6852 97907 111390 84809 80844 143529 105331 19681 1842 -5117 -34572 -36068 -31807 29777 39542
6839 39542 -18596 28447 74363 50815 63795 76670 93796 85601 71237 58039 68729 92311
6827 92311 47969 -53636 -70321 24251 94826 81999 75609 77606 44281 49711 77880 33544
6815 33544 37141 101209 72889 65135 80801 39118 -1246 5864 372 -11621 -4174 -9015 57158
6802 57158 47157 2719 21377 34947 -2085 -20182 -12360 56964 68217 51545 89496 109358
6790 109358 54846 48749 40742 -7526 -45435 -44037 3423 53435 58701 23359 14945 382 -13119
6777a3119m1350K7848M3341J8976r334o3379J146M049J2730N6432M1867L2614
6765A11821n266j9008j0989l835P653l1365l378r180n6689n6591p70M7601L911
6752b6085K4613J6338M0026R6635M635m1540L3384j3008q1762k2585l094M7954
6740G5511m4809l8251j2896J8525N8878K2746M5846o8349q8488n4930j9426J3502
6728i2141J6756K8401P0576o717p554l8884L6986J6562m1539J3039M2772K2514
6716F0771k3486J0638O186l4543k6111J2440m749J9237J2853L9756J7257k1978
6704F8271o0766m1741K9954P0862q080j0917K8667J3484K8215o5810o8807Q741
6692g927K1614K9375m4182J8156M877L5476J9191m9814l8374J3080L9293L2773
$$ plain form
6777 -13119 -54469 -26621 16720 35696 26362 -37017 -35871 -31822 -19092 37340 79207 111821
6765 111821 106555 87547 76558 72723 80376 49011 45633 36453 -20236 -76827 -77597 -29996 -26085
6752 -26085 -1472 14866 54892 151527 156162 114622 148006 134998 53236 30651 27557 75511
6740 75511 30702 -7549 -20445 -1920 56958 79704 125550 57201 -31287 -86217 -105643 -92141
6728 -92141 -75385 -46984 23592 16875 9321 -29563 7423 23985 -17554 -4515 38257 60771
6716 60771 37285 47923 54109 19566 -6545 5895 1146 20383 33236 72992 90249 68271
6704 68271 7505 -34236 -4282 66580 58500 47583 76250 89734 117949 52139 -16668 -7927
6692 -7927 13687 43062 -1120 17036 21913 57389 76580 26766 -11608 1472 40765 73538
6680G3538m2321j1610j2250q100m5133q844j4729M5195l6684K8484j495L5438
6668A489K3394M561l4930j417l00l4920J2787K3901L0909n2267k5328J0522J2213
6655b9386K9059L2038l973o4998J3508L5922K9392r188k2979l1805L0652Q926
6643A7168N000J9688O853O740r430j1139k2260o615Q199j5712N8085K6224l3831
6630D8970J8041j5292n6397j3668m464k8533k5157L6981M6875K9840q167p62k8152
6617A15k3949L1033M8096m2863J4975L8889K0885l5496m9833K0140O0938P02K3270
6604A06902J7497m1606n8768M60l3893K375J2463K4846L0827j1563P903l6724
6592B0719j4509P316K92K3593L8225J1086n2042j8915l0626o1614k9513J2199
$$ plain form
6680 73538 31217 19607 7357 -743 -45876 -54720 -69449 -24254 -60938 -32454 -33949 1489
6668 1489 24883 29444 -5486 -6903 -7203 -42123 -29336 -5435 25474 -26793 -52121 -41599 -29386
6655 -29386 -327 31711 27738 -37260 -23752 12170 41562 32374 9395 -22410 8242 17168
6643 17168 22168 41856 48709 55449 46019 34880 12620 6005 14204 -1508 56577 82801 48970
6630 48970 67011 51719 -4678 -18346 -22810 -51343 -76500 -39519 7356 37196 29029 28267 115
6617 115 -23834 7199 55295 12432 27407 66296 87181 51685 1852 21992 82930 83632 106902
6604 106902 124399 82793 24025 24485 -9408 -7033 5430 30276 61103 49540 57443 20719
6592 20719 6210 13526 13818 37411 75636 86722 34680 15765 -14861 -76475 -105988 -93789
6580i3789P1710j4765j8504J2862J9937K4687j9158j3823K0905K3138K4921J6489
6568E4610k4248Q037M826l5684j2877R654O6017O703k177N738Q67k0636o1713
6555h83j1072J4431L5220L192R235M6094P210j00921j3739M1662j6352k169J2052
6542B3960n69m2762j4066M5367M4784j0506k0524k6671L621l5425o7393N7963
6530d2221N8161L4022n7167j327O439k9296L630k1228L0617N6774o6161J9457
6518h300K2100N104k1116j0953o492K8607j9113n1064n8945N3144Q9332J6329
6506C8633L4319k7017L2396l6056j2513N390k0209k3954K1308l2184K3359l1594
6494b8122r580N95P2326J4978k6711m9515l0475J2148L8878p214n878J6194N977
$$ plain form
6580 -93789 -22079 -36844 -55348 -42486 -22549 2138 -17020 -30843 -9938 13200 38121 54610
6568 54610 30362 38399 43225 7541 -5336 4318 70335 77038 74861 80599 81466 60830 -883
6555 -883 -11955 2476 37696 40888 50123 96217 103427 2506 -11233 30429 14077 11908 23960
6542 23960 23391 -19371 -33437 11930 56714 46208 25684 -987 2634 -32791 -100184 -42221
6530 -42221 15940 49962 -7205 -8532 -2093 -31389 -27759 -48987 -18370 38404 -27757 -8300
6518 -8300 13800 18904 -2212 -13165 -19657 8950 -10163 -61227 -120172 -67028 22304 38633
6506 38633 72952 45935 78331 42275 29762 35152 14943 -9011 12297 -19887 3472 -28122
6494 -28122 -37702 -37107 35219 50197 23486 -26029 -56504 -44356 -5478 -12692 -18570 -2376 3601
6481C601m0353M2342K3090j7341m0532R556K8981M199m564m1579L2848L2809k4480
6468H577J0657n4946j3911K4175j0763J2972K4391M2138n9307J5121M7027J4227
6456F0358j6329m4893k3855Q951J2909l4419p153l1291K0557R6863K1618m8332
6444A4984j0658j7702k1094O687O5102M7665m489p3967k0798L2334J4509O0883
6432I3456J6787l8644q3434l7023J2695K4994j2979j4601j6960j6848O7084M4586
6420C9113J6750M2786L561J5758n7814k2524o5186J0485K6011k1814J0867N4881
6408E2874k1527n3759Q530l7761L997N9987K3217l7032k481J817M048R298M911
6395A6119K0865K3149K0602m180Q498M98k3797M415k3997l8643j3568l3621k0845
$$ plain form
6481 3601 -36752 5590 28680 11339 -29193 -19637 9344 13543 8979 -32600 248 33057 8577
6468 8577 19234 -35712 -49623 -25448 -36211 -23239 1152 43290 -16017 -896 46131 60358
6456 60358 44029 -864 -24719 -15768 -2859 -37278 -44431 -75722 -55165 41698 63316 14984
6444 14984 4326 -13376 -34470 -27783 37319 84984 80495 6528 -14270 18064 32573 93456
6432 93456 110243 71599 -11835 -48858 -36163 -11169 -24148 -38749 -55709 -72557 -5473 39113
6420 39113 55863 98649 102210 117968 60154 37630 -27556 -17071 8940 -12874 -2007 52874
6408 52874 31347 -22412 -13882 -51643 -47646 12341 35558 -1474 -3955 -2138 1910 11208 16119
6395 16119 36984 60133 80735 76555 85053 85551 61754 66169 42172 3529 -10039 -43660 -64505
6382f4505K1320O1770K1887J2561l8345k2154M5369L8304K0534n8810j0521j3457
6370A3953L7234J4571k6777L1847j7159l7731K6587K6334K7980l9627k9121j3148
6358A4943K1481J9497N660n7545k6398L8125N3852j9064o4599K456q294M7897
6346B8011Q1661o100l3184O491p3135j3628L4089L232o526J0751j3949l280O233
6333B0666m78m0459m418L655j4252O0939J6213K6805n2295m0429j1437m2979K0826
6320e7643L3032l585N2054q716J3956K8373k3490m2686n1234Q843L5634P651j4563
6307b2374J7230n2602n2804L1828N5368L7281J9344o863J4929j0807L749J056
6295C5335j3374K9684p689j3962j874m267L0679m2881L0253k650J0962j9810l5614
$$ plain form
6382 -64505 -43185 18585 40472 53033 14688 -7466 37903 76207 96741 37931 27410 13953
6370 13953 51187 65758 38981 70828 53669 15938 42525 68859 96839 57212 28091 14943
6358 14943 36424 55921 61581 4036 -22362 15763 69615 50551 -14048 -11592 -19886 28011
6346 28011 109672 103572 70388 76879 3744 -9884 24205 27437 20911 31662 17713 14433 20666
6333 20666 20188 -20271 -24689 -21034 -35286 25653 41866 68671 16376 -24053 -35490 -78469 -57643
6320 -57643 -24611 -28196 23858 15142 29098 57471 33981 -8705 -59939 -51096 -15462 -7811 -22374
6307 -22374 -5144 -57746 -110550 -78722 -23354 13927 33271 26408 41337 30530 34279 35335
6295 35335 21961 51645 43956 29994 28120 23853 54532 11651 41904 39254 50216 30406 -5208
6282e208p9451j482J5785M8388N9415j6739k0203M1628j4278k3908m466R779n809
6269C451l1568K9936J0172J6514o9321j1771l3947j4053O2862N2086O426l3719
6257a2932K7424j2163n0298L1946K6353K5391O2268P475p8435r0398l5106M1333
6245e7142M6349N4921O7172M1899p5024o7088L033j4494L276J5581k3188K2259
6233A7554l856l0053O1253K9659n0552l3899N62J8717m0586K8870Q2965l3357
6221D7277n0737r004J6223j1999m1056l3025K8214O1632J3175K7337Q86J9871
6209F8794o1818o6k4551Q418k3069L9343P0488n1283L1052N8528M292j4425l0794
6196G4909J0983M6751j3261m3713q1971l3545J6105O9225K9926k0922J0502j0390
$$ plain form
6282 -5208 -84659 -86141 -70356 -21968 37447 20708 505 42133 27855 3947 -519 9260 3451
6269 3451 -28117 1819 11991 28505 -40816 -52587 -86534 -100587 -37725 14361 20787 -12932
6257 -12932 14492 2329 -47969 -16023 10330 35721 97989 105464 27029 -63369 -98475 -57142
6245 -57142 -10793 44128 111300 153199 78175 11087 14120 -374 2902 18483 -4705 17554
6233 17554 13698 -16355 44898 74557 24005 -9894 -9332 9385 -31201 -2331 80634 47277
6221 47277 -3460 -12464 3759 -8240 -49296 -82321 -54107 7525 20700 48037 48923 68794
6209 68794 6976 6910 -17641 -9223 -32292 7051 77539 26256 57308 115836 120128 105703 74909
6196 74909 85892 132643 119382 75669 -6302 -39847 -23742 45483 75409 54487 64989 54599
6184E4599j6824J838l5170j0803J2035M6700L5897l7146J2397j5245j8683l2019
6172b424n5302M52K2094J3346J8913J3172K9078l2394m4129K0805j6466k6448
6160e9303O1949L9821j4088k4762l3693m2063j9435O7821L1259L2056k7915k0456
6148h809J3257J8656J794k4168j7595L160J6669k8521l532J6992P662K5995r638
6135A1922k9269o830l6653K2224N4714L9765l548l5438L191l0194L0661N4571
6123G5116J6929j0909k6280k1826l1514m1780l0615j7826L5859j3561k0309j5497
6111a02213O8247O1895j51m2662k9708R033L5065o0090r850k5417M0799M2665
6099a2387J4365j3914l5373L0833M2358L7078k9468j0097L0692j5118j8253q1402
$$ plain form
6184 54599 37775 39613 4443 -6360 5675 52375 88272 51126 63523 48278 29595 -2424
6172 -2424 -57726 -57274 -35180 -21834 -2921 10251 39329 6935 -37194 -16389 -32855 -59303
6160 -59303 2646 42467 28379 3617 -30076 -72139 -91574 -23753 7506 39562 11647 -8809
6148 -8809 4448 23104 24898 730 -16865 -13705 2964 -25557 -29089 -12097 -4435 21560 11922
6135 11922 -17347 -24177 -60830 -38606 16108 55873 52325 16887 20078 -10116 20545 75116
6123 75116 92045 81136 54856 33030 1516 -40264 -70879 -88705 -52846 -66407 -86716 -102213
6111 -102213 -33966 27929 27778 -14884 -44592 -35559 -494 -60584 -70434 -95851 -55052 -12387
6099 -12387 1978 -11936 -47309 -16476 25882 62960 33492 23395 54087 38969 20716 -60686
6087f0686k3620K3142O907L1766K2532J120k794k2427m1825m0698L4455J6026
6075e6102L8342P2502O5694J2454j2532m7125q861K4007m2165m2169m3564j3736
6063e3255o107m875l2143K3922j4605J1222J9089j1609J8945j2444L854L010J043
6050e3953K1357M1680K544k6167j0354k0978N781K8909N1994q323n0874m8421
6038f6805O672L675K2037L7810R195K2894K7384p9073j3961J1475M0835M835m2085
6025a5112r839M1720K5493j8653q198L659L8126N085o3143n7258J8487M5391J62178
6012A67936J7891q3492n6663p5179r451J09558l4428j09334m0450K0905K478M1799
6000d8430P9172k1256l8440J0610j9995J545L0978k3896m3328K3675K0292N7176
$$ plain form
6087 -60686 -84306 -61164 -54257 -22491 41 1161 -1633 -24060 -65885 -106583 -72128 -56102
6075 -56102 -17760 54742 120436 132890 120358 73233 64372 88379 46214 4045 -39519 -53255
6063 -53255 -59362 -64237 -96380 -72458 -87063 -75841 -56752 -68361 -49416 -61860 -58006 -54996 -53953
6050 -53953 -32596 9084 11628 -14539 -24893 -45871 -40090 -11181 40813 32490 -18384 -66805
6038 -66805 -60133 -56458 -34421 3389 12584 35478 62862 -16211 -30172 -18697 22138 26973 -15112
6025 -15112 -24951 16769 42262 23609 15411 19070 57196 62281 -862 -58120 -39633 5758 167936
6012 167936 185827 102335 45672 -29507 -38958 70600 36172 -73162 -113612 -92707 -90229 -48430
6000 -48430 30742 9486 -28954 -18344 -38339 -36794 -5816 -29712 -73040 -49365 -29073 28103
5988B8103m0220o5237q579R0115N4877m1395M839k9877q096M880K465o704j527
5975a6356p8663k5961N7287P7024M5844K462l8515j0544l0945Q890o0180k8313
5963i7970K2066K6816M7582P505R490l4157M8547J7152k282j7158j974J503j8163
5950H957m7915L95J0797n0835k3431Q8806N1556K2591o022m1011L8503K770J2724
5937F7885k2910L6110m0644o5279Q792N7022J8175j1022q12l0310l1492L1474
5925A6989L733j6447K4760n110m646L3131m1412p8323k2192L1374J3763K7931
5913a6449K2366N830L2290N8028l6897m3253l2911k9187l45m035o152N3111L093
5900E489k6276J4629j3088j6785K2030J9724K0313j9462k0951M752K1733k0782
$$ plain form
5988 28103 -12117 -77354 -85933 4182 59059 17664 22503 -7374 -15470 -10590 -8125 -14829 -16356
5975 -16356 -95019 -120980 -63693 13331 59175 61637 23122 12578 -18367 -9477 -69657 -97970
5963 -97970 -75904 -49088 -1506 5999 15489 -18668 29879 47031 44749 27591 25617 27120 8957
5950 8957 -38958 -38563 -27766 -78601 -102032 -13226 38330 60921 54899 13888 52391 55161 67885
5937 67885 44975 81085 40441 -24838 -16046 40976 59151 48129 47317 17007 -14485 16989
5925 16989 20722 4275 29035 23925 19279 52410 10998 -67325 -89517 -58143 -44380 -16449
5913 -16449 5917 11747 44037 102065 65168 21915 -10996 -40183 -40528 -44563 -50715 2396 5489
5900 5489 -20787 -6158 -19246 -36031 -14001 5723 26036 6574 -14377 -9625 12108 -8674
5888h674k2611P0997L9684J8400l4957m4511O991P212K4963J3870J8864n3172
5876C7056q3153m2007L7985K777o8665k9592K8025M7792L7282j4497O303P3989
5864C3295K1521L0339K0086n1217l4438n826R198k4274K3471M0625K6451l8332
5852E0899l5732K3761M5934M4476k9097o9158l1342n713M7227r274N813K859j0665
5839B9988k8068o0252K0216O8661K0900J0030l0623j3575j0007k6546n008K4709
5827D25l626k6643O115j5740j0461l0011J613O9132O8147J9178m3501J7307l454
5814D8481R218n8982j02991J408P9763Q0250L5238J1509m0818n4934k2087M403
5802i542J7362k7036k637K3094N1043J0036K6774k3987l3592j6696M1294L2262
$$ plain form
5888 -8674 -31285 39712 79396 97796 62839 18328 25319 32531 57494 71364 90228 37056
5876 37056 -46097 -88104 -50119 -47342 -116007 -145599 -117574 -69782 -32500 -46997 -40694 33295
5864 33295 54816 85155 105241 54024 19586 13760 22958 -1316 22155 62780 89231 50899
5852 50899 15167 38928 84862 129338 100241 31083 -259 -5972 41255 31981 37794 40653 29988
5839 29988 1920 -58332 -38116 30545 51445 61475 30852 17277 7270 -19276 -24284 425
5827 425 -3201 -29844 -23729 -39469 -49930 -79941 -78328 -9196 58951 78129 34628 51935 48481
5814 48481 57699 -1283 -104274 -102866 -23103 57147 92385 103894 63076 8142 -13945 -9542
5802 -9542 7820 -19216 -21853 1241 52284 62320 89094 65107 31515 14819 56113 88375
5790H8375k0028l3123m531J6517K8838l3287K8356L626j4934k4058J6399k2524
5778B9626l2807J3104L242o1073L2459L4953J3021n1125L8789j5431M51k7577
5766b2368L5525N688m1413K780k1444m0379j0111r013l7105P040N5666M2745L075
5753b9314N4333j2320n2333m997M8026N4945P768L9934O0550l9939j41020P692
5741f675N6979n3003j1057K2000j7116j5796K6434N6198j6014n3019j5897j400
5729b8366l0309p145m62N7059l566K6240l8091p4255L3328N7862q038l204M3744
5716B4797J32k0507k9931J3143N1994K2844q051o364m3471l8493n2528l246n602
5703i5283j410J8464r964n099j5007Q864N1233R2185K5378l0986j9217n009l8071
$$ plain form
5790 88375 68347 35224 30693 47210 76048 42761 71117 74743 59809 35751 52150 29626
5778 29626 -3181 9923 13165 -47908 -15449 19504 32525 -18600 20189 4758 5209 -22368
5766 -22368 13157 18845 -22568 -19788 -41232 -81611 -91722 -100735 -137840 -130800 -75134 -32389 -29314
5753 -29314 25019 12699 -39634 -44631 3395 58340 66108 106042 166592 126653 -14367 -6675
5741 -6675 50304 -2699 -13756 8244 -8872 -24668 1766 57964 41950 -11069 -26966 -28366
5729 -28366 -58675 -65820 -66282 -9223 -12789 13451 -24640 -98895 -65567 -7705 -15743 -18947 24797
5716 24797 24929 4422 -25509 -12366 39628 62472 54421 48057 4586 -33907 -86435 -89681 -95283
5703 -95283 -96693 -78229 -88193 -93292 -108299 -99435 -48202 43983 69361 38375 19158 14149 -23922
5690b3922r388O475M18k0026k539N6395O1619j0318n2015q4625J1923K8514j4500
5677e1989J0088L5551m7149l9956J7818O7862N3910l5192J0134J5276J8887j3831
5665D1409L3174m4936m6710j283N384J2024o085K6510M983m442M424M779K3075
5652E2306n980j1758J4285L3202P12j0899q776k6472M0898K7499n0004J9159M0784
5639A14956q6327k3921L9700L3576M306j8385o918k103l3380J0925o421m7509
5627b1501M7182K8327j3479O346k4380n6934K7507k668N844j3040j2716k4574
5615e4086J8142k998k003N1708J4374K5279k2188l2264j1614k4730N8092j3097
5603D615J2163P643o7310K706L0381l0306k7236N9341j3270m0790n4861m2676
$$ plain form
5690 -23922 -33310 -26835 -26417 -46443 -48982 7413 69032 58714 6699 -77926 -66003 -37489 -51989
5677 -51989 -41901 -6350 -53499 -93455 -75637 -7775 46135 10943 21077 36353 55240 41409
5665 41409 74583 29647 -17063 -18346 -12962 -938 -7023 19487 24470 20028 24452 29231 52306
5652 52306 46326 34568 48853 82055 82767 71868 63092 36620 77518 105017 55013 74172 114956
5639 114956 28629 4708 44408 77984 82290 63905 56987 54884 21504 32429 26008 -21501
5627 -21501 25681 54008 40529 46875 22495 -34439 -6932 -9600 -3756 -16796 -29512 -54086
5615 -54086 -35944 -38942 -40945 10763 25137 50416 28228 -4036 -15650 -40380 17712 4615
5603 4615 16778 24421 -42889 -40183 -9802 -40108 -67344 -8003 -21273 -62063 -116924 -159600
5591a59600K9403K405r015K1170N5870k0143Q5017L7431j188l0359N8579N0427
5579A19997m8898l8297j5524n8839R020K3288l255J0666j8646J6942J8922k2246
5567f870L1461K666n674j4632M3950k5202k9426R464l479q368L1472K722l6462
5554h378m7981M9083M9480k3686n1325O9069M3337q0558l6427J3004N4228M7l9939
5541a0046Q835j1068K288k2961J1959m2111J0181M7797k427J7169k7812M290K3762
5528I856M1504r954k4177n8647j5256P7355N6787O457q81m3950l9030L271J5294
5515A8629P266j7427J9348J0556J3779j7325k6700J9324K6768j1338l8906k9239
5503b5265M930O1758J4106j5618m2229m9292J0254k5039l618J6215j400L1562
$$ plain form
5591 -159600 -130197 -127792 -136807 -115637 -59767 -79910 5107 42538 41350 10991 69570 119997
5579 119997 71099 32802 17278 -41561 -32541 -9253 -12508 -1842 -20488 -3546 15376 -6870
5567 -6870 24591 27257 21583 6951 50901 25699 -3727 5737 2258 -6110 25362 28084 -8378
5554 -8378 -56359 -7276 42204 18518 -32807 36262 79599 -959 -37386 -24382 29846 29893 -10046
5541 -10046 -1211 -12279 -9991 -32952 -20993 -63104 -52923 -5126 -7553 9616 -18196 -13906 9856
5528 9856 51360 41406 17229 -41418 -56674 20681 77468 83925 83044 39094 64 3335 18629
5515 18629 25895 8468 27816 38372 52151 34826 8126 27450 54218 42880 3974 -25265
5503 -25265 -20335 41423 55529 39911 -2318 -51610 -41356 -66395 -70013 -53798 -55198 -23636
5491b3636J7048K4958k3394k7901k8259M554K1391j9339K2738K1688K6531P570
5479B3949l2330l0774m0250K7919k5250j429j7285k5968l1995M6430O1364K4308
5467b1311k7044K8619M1753J5585L5561J5425l7583n3968K3027K3754J3242l3066
5455B3994k4194l6105N676L0625k1476o376j1489j5785N8855P4403j2077m0606
5443B5445j1732l0830k0616J9741K4969J8040j7677R717k8933l9335L662L6240
5431a1309J1111j4882j6025j0043k1024J5489k94j2260K3370K9287l0848k3673
5419f1101l7002k345N7630j4144m7986M4029k5533K3260j2791j5335k2785J3412
5407a00691M8447l511k3839p00k5819P777J6723J4413J5753n714q1108Q837N8003
$$ plain form
5491 -23636 -6588 18370 -5024 -32925 -61184 -56630 -35239 -54578 -31840 -10152 16379 23949
5479 23949 -8381 -39155 -79405 -51486 -76736 -78165 -95450 -121418 -153413 -106983 -45619 -21311
5467 -21311 -48355 -19736 22017 37602 73163 88588 51005 -2963 20064 43818 57060 23994
5455 23994 -200 -36305 -30629 -4 -21480 -27856 -39345 -55130 3725 78128 66051 25445
5443 25445 13713 -17117 -37733 -17992 6977 25017 7340 17057 -11876 -51211 -47549 -11309
5431 -11309 -198 -15080 -31105 -41148 -62172 -46683 -46977 -59237 -35867 -6580 -37428 -61101
5419 -61101 -98103 -100448 -42818 -56962 -104948 -60919 -86452 -63192 -75983 -91318 -114103 -100691
5407 -100691 -52244 -55755 -79594 -80294 -106113 -98336 -81613 -67200 -51447 -57161 -138269 -129432 -71429
5394g1429O9473j7059k4717N075k1831k1304l8679j5891P0046J5384N112J9965
5382b5855M0451l3064n52Q0301K3049j3359n1279K4538N0064m9188k5040j6681
5370C385k7491M918j2224L1210q199l6796k5150o590j4888k0689L9711r821J3250
5357f9374J8673K2885J7087N400j1540L8515J7955L851Q312k7537o6551O086J5465
5344b0773j5355J7548m249k9798l1020J1190O5487J3837K4305J8269l4195j9029
5332c783J3817j8994j1167M1454K2735N7779O9107p7359j17924p2232o0340M7990
5320a08917O8388Q0938k7878j5973m7868L1151P3369k8131j64q483J8786M1429
5308G6647n0797k2352j9723n8955j3083O6672N4586j8699j22306j8854O3748j9417
$$ plain form
5394 -71429 -1956 -19015 -43732 -38657 -60488 -81792 -120471 -136362 -66316 -50932 -45820 -25855
5382 -25855 14596 -18468 -19020 61281 84330 70971 19692 44230 94294 45106 20066 3385
5370 3385 -24106 -19188 -31412 -202 -8401 -45197 -70347 -76937 -91825 -112514 -72803 -82624 -69374
5357 -69374 -50701 -27816 -10729 -5329 -16869 21646 39601 43452 51764 24227 -42324 -36238 -20773
5344 -20773 -36128 -18580 -22829 -52627 -83647 -72457 -6970 6867 31172 49441 15246 -3783
5332 -3783 10034 -8960 -20127 21327 44062 101841 170948 93589 -24335 -96567 -156907 -108917
5320 -108917 -40529 40409 12531 -3442 -51310 -20159 53210 25079 24915 16432 35218 76647
5308 76647 25850 3498 -16225 -75180 -88263 -21591 32995 14296 -108010 -126864 -63116 -82533
5296h2533j0610O4986K1048k1529N5275k5089q165k7037K9833k58j5721n3925
5284g3725J3496K6386k8413K0147L7175k1050l3702k9856K1832M0763j5363k7126
5272f9436M6068L726r925k8661k0185L5406L2355K4504j5759n2592J998N2106
5260c95j6749j9206l498Q307L5458K0764n0195n5332q619O5642J4624j2132L1297
5247I966M693J9060k9131l8613M3204J6403q77n0543m1889O7105j7992k5845J9611
5234b4848J7698J0801n7422R74J6164M9839Q697m447j496K4269J6949n6444m1202
5221d0468L6743J3744k6078L6758L2777n0620j9184k575L962N06M5199K6934n3652
5208D046j3286k102n5069L994O919l5761o0025k438N4902N8268j6577o5467K6061
$$ plain form
5296 -82533 -93143 -28157 -7109 -28638 26637 1548 -6617 -33654 -3821 -4079 -19800 -73725
5284 -73725 -60229 -33843 -62256 -42109 -4934 -25984 -59686 -89542 -67710 -26947 -42310 -69436
5272 -69436 -23368 -19642 -29567 -58228 -78413 -43007 -10652 13852 -1907 -54499 -52501 -395
5260 -395 -17144 -36350 -39848 -31541 3917 24681 -25514 -80846 -89465 -23823 -9199 -21331 9966
5247 9966 14659 33719 4588 -34025 9179 25582 24705 -25838 -67727 -622 -18614 -44459 -24848
5234 -24848 -7150 3651 -53771 -52797 -36633 13206 21903 17456 15960 40229 57178 734 -40468
5221 -40468 -3725 10019 -16059 20699 53476 2856 -16328 -18903 -14941 -14435 30764 57698 4046
5208 4046 -9240 -11342 -66411 -62417 -55498 -91259 -151284 -153722 -98820 -40552 -57129 -122596 -96535
5195i6535K8974K4011N0131L8803J5937L0545j8826j9474J625m1412L6158K2199
5183G2136l5900K30m6146k928l159K4949K0111k8817o1396m941L2522J1328j7526
5170c9537j2503J2888n6698K901J1961N0276k4379o8422k0018L6129Q506k1218
5158a20114K9185P510k680K5244L8518l9223j9317r4586M5888J30331L1485J3948
5146D6189L5968O468p1216n0115Q853j9937Q691m979j6317l958n2570L445M0626
5133f8852K1185j8051L8470O4444R035m7322j7162K0603l1522j8951n734p758
5121f1615L0847j3259r61K6933r176l2312K0955L9189J9826m3198m5312k2924
5109i1007K8173K6946K1760l6902J0636M7197K9572K5184m0245k2963k6206l6141
$$ plain form
5195 -96535 -67561 -43550 6581 45384 61321 91866 73040 53566 55191 13779 49937 72136
5183 72136 36236 36466 -9680 -12608 -15767 9182 29293 476 -60920 -65861 -33339 -22011 -39537
5170 -39537 -52040 -39152 -95850 -92949 -80988 -30712 -55091 -123513 -143531 -107402 -98896 -120114
5158 -120114 -90929 -83419 -86099 -60855 -22337 -61560 -80877 -175463 -129575 756 32241 46189
5146 46189 82157 88625 17409 -32706 -23853 -43790 -35099 -40078 -56395 -60353 -112923 -109478 -68852
5133 -68852 -47667 -65718 -27248 37196 46231 -1091 -18253 2350 -29172 -48123 -53857 -61615
5121 -61615 -30768 -44027 -44988 -18055 -27231 -59543 -38588 601 20427 -22771 -68083 -91007
5109 -91007 -62834 -35888 -14128 -51030 -40394 6803 36375 61559 21314 -1649 -27855 -63996
5097f3996J3067M9065Q184r649l0469L3108L297o1949k2243l8355k6393L7111
5085a09222L3421q593L304M7069K0922m781k1613m2044k680M876J7890N5108K2354
5072A6011M152J9209J1565j3298N367J4414j6863k1436J847M7741J3784j1811
5060G0682l4194k8391q583k9356k4983m3892k3166K5134j2708N3404N5589L1025
5048C0561m3213k5209K8766L7661k093m2709L0382L5836n3567k1946L1399J297
5036G165l7858R70K3262j3636O860l7412N4134J8517J9305M0282K6578l6038p0083
5023B046J2710p60L5843K5108q4030l2902R482J327L0279K3538o930l2537l5306
5010e2132l3080L2439k358J8697L4394k8972m535M493J5479M051j3018M705M4042
$$ plain form
5097 -63996 -50929 -1864 6320 -3329 -33798 -690 2607 -59342 -81585 -119940 -146333 -109222
5085 -109222 -75801 -84394 -81090 -34021 -13099 -17880 -39493 -81537 -84217 -79341 -61451 -6343 16011
5072 16011 20163 39372 50937 37639 43006 57420 40557 19121 20968 68709 82493 70682
5060 70682 36488 8097 -486 -29842 -54825 -98717 -121883 -96749 -109457 -56053 -464 30561
5048 30561 -12652 -37861 -9095 28566 26473 -16236 14146 49982 -3585 -25531 5868 7165
5036 7165 -30693 -29723 -6461 -20097 -13237 -50649 3485 22002 41307 81589 108167 72129 2046
5023 2046 14756 13996 49839 74947 -9083 -41985 -32503 -31176 -897 22641 15711 -16826 -52132
5010 -52132 -85212 -52773 -55131 -36434 -2040 -31012 -35547 -31054 -15575 -11524 -24542 -19837 24205
4997B4205m7984M219l6896n3955j4783L2548M6356J5091j4814n440N19J0739O3256
4984B3061R459J164j8904j7234j1294j7537l042p500K2864l4689L1508L4085j4719
4971b778l872j3678l3171l2914r652J3849K5605K507l3221j0659K273M1446L1187
4958b3078l4099k362j6837M2276M150j7779j8313J7254K3700j3807K5369M3339
4946B9813l1474j8701l1552N2740M0082J3101r560l7013n434O497l8999k9993
4934f0493n84P3674l9076k7258j6619K1505M3224K5540k2987j8600l4669K5720
4922c0623O6070k710k3485m4807j2146O3314j8862l5140L2575k2991n0493L9892
4910c9406J15647J3621m623k4124l3141l4384j3791o223l6406L3371J9621j6847
$$ plain form
4997 24205 -23779 -19560 -56456 -110411 -125194 -92646 -46290 -31199 -46013 -51453 -50934 -40195 23061
4984 23061 32520 33684 14780 -2454 -13748 -31285 -34327 -41827 -18963 -53652 -22144 11941 -2778
4971 -2778 -6650 -20328 -53499 -86413 -96065 -82216 -56611 -54104 -87325 -97984 -95711 -54265 -23078
4958 -23078 -57177 -59539 -76376 -34100 -29950 -47729 -66042 -48788 -25088 -38895 -13526 29813
4946 29813 -1661 -20362 -51914 826 40908 54009 44449 7436 2002 8499 -30500 -60493
4934 -60493 -61077 12597 -26479 -53737 -70356 -48851 -5627 19913 -3074 -21674 -56343 -30623
4922 -30623 35447 32737 9252 -35555 -47701 15613 -3249 -38389 -5814 -28805 -79298 -39406
4910 -39406 76241 89862 85239 61115 27974 -6410 -20201 -26424 -62830 -29459 -9838 -26685
4898b6685q722r4159K7128m717l4824p386R6850N0814l4169n9631k1027j3459
4886a29987P4501J42939n470m6853L60m6909l827J1610L8781O372k73m9709K838
4873e627K9292K24N720j5569M0649m1160n9143L7790P031m0358N2163J4407J9825
4860D5244P148K325o175o418j1345l6467k1367o461j7096R781L5874r552m4395
4847e8904J5864Q690l6460J197L9635k2394k6534K8941m417J1283K9759k5776
4835c9116m3516R194O7002L0263o581o2146k3700L283M5979M6530k5395n5680
4823e3883k7348j8442K5756L1506j0485m965n638j0660J2289L3976K9576k9351
4811b7669j2328j7038k2093k7371L3421J07680M1597j7229o4309j3149L0952J5921
$$ plain form
4898 -26685 -35407 -129566 -102438 -107155 -141979 -149365 -52515 -1701 -35870 -95501 -116528 -129987
4886 -129987 -55486 87453 81983 35130 35490 -11419 -15246 -3636 35145 41517 41244 -8465 -5627
4873 -5627 23665 23889 29609 14040 54689 13529 -45614 -7824 -793 -41151 11012 25419 45244
4860 45244 52392 54717 48542 42124 30779 -5688 -27055 -33516 -50612 -40831 -4957 -14509 -58904
4847 -58904 -43040 -34350 -70810 -69613 -29978 -52372 -78906 -49965 -54382 -43099 -13340 -39116
4835 -39116 -82632 -73438 -6436 23827 17246 -44900 -68600 -65317 -19338 27192 1797 -53883
4823 -53883 -81231 -99673 -73917 -42411 -52896 -57861 -63499 -74159 -61870 -27894 1682 -27669
4811 -27669 -39997 -57035 -79128 -106499 -73078 34602 76199 58970 -5339 -18488 12464 28385
4799B8385Q28o2090K9904M235o628o521N289L2066j2445l7182j0720N350M6976
4786A7447q6044l8144K1439n0796L5895L8538M2450k9002K9827L6330L1103k2875
4774B6168M479k2579k1438K4516J1145K030j0445n8910m62M1558J2334K0632L8201
4761F7229K5357j5795n4254m8728m8050m4195L4857N4827L7089K5783m8660m4874
4749e9414O1791K4381l3763J989j407m1287j224r918L3033O303l7005K4047k8742
4736f1216L1485J2589J7469k0307k5307N209m2612N455L1652J9283J458K3762
4724a080m2591k8476K3884J3964L6682o31j2882K3703k3248j14297r204L2895
4712a01281L8168L2665k5724l0209O851J3241J080k7093O308K6594L3689M4226
$$ plain form
4799 28385 29213 -32877 -2973 1262 -5366 -11887 -6598 25468 13023 -24159 -34879 -29529 17447
4786 17447 -68597 -106741 -85302 -136098 -100203 -61665 -19215 -48217 -18390 17940 49043 26168
4774 26168 30647 8068 -13370 11146 22291 24321 13876 -45034 -45496 -3938 8396 29028 67229
4761 67229 92586 76791 22537 -26191 -74241 -118436 -83579 -28752 8337 34120 -14540 -59414
4749 -59414 2377 26758 -7005 -5016 -6423 -47710 -48934 -58852 -25819 -19516 -56521 -32474 -61216
4736 -61216 -29731 -17142 327 -19980 -45287 -40078 -82690 -77235 -45583 -26300 -24842 -1080
4724 -1080 -43671 -72147 -48263 -34299 2383 1752 -11130 12573 -10675 -124972 -134176 -101281
4712 -101281 -63113 -30448 -56172 -86381 -79530 -66289 -65209 -92302 -85994 -59400 -25711 18515
4700A8515o037l4201k6249j7293L4105J7433M228l209L7660O449j8587J2308J5982
4687D1104j8200K8687P105n6592m1842k0066l4904M7587L9975m6124q142K3730
4675c7682L5642J8554j6071l4494l1212k7815Q012K0968L8527L3351o7410O3531
4663C901N2078l4050k1947k3080j0736k3912l6199k4646K3086L1801n1300k231
4651a17235M5571j6475J4789J7406k0119K1392j4814l4674Q52K2203M5598R089
4639b6417J5090K3056n461L0144P7083K1712r0646j1229l8571j8512K4810l2664
4627c1605P379K2619n0933l1547K0040N6728j7340o8610L5190L2446J6202m5336
4615e4767n3830L0659L6561k8461l5692N445K6265P293l0715l306N7399M3969
$$ plain form
4700 18515 12478 -21723 -47972 -65265 -31160 -13727 -9499 -12708 24952 31401 12814 25122 41104
4687 41104 22904 51591 58696 2104 -39738 -59804 -94708 -47121 -7146 -53270 -61412 -37682
4675 -37682 -2040 16514 443 -34051 -65263 -93078 -85066 -64098 -25571 7780 -59630 3901
4663 3901 55979 21929 -18 -23098 -33834 -57746 -93945 -118591 -95505 -63704 -115004 -117235
4651 -117235 -71664 -88139 -73350 -55944 -76063 -54671 -69485 -104159 -103307 -81104 -35506 -26417
4639 -26417 -11327 11729 6268 36412 113495 135207 44561 33332 -5239 -23751 1059 -31605
4627 -31605 -24226 -1607 -52540 -84087 -64047 -7319 -24659 -93269 -58079 -25633 -9431 -54767
4615 -54767 -108597 -77938 -41377 -69838 -105530 -100085 -73820 -66527 -97242 -100548 -43149 820
4603H20n4941M766J2377m3218m446k4773K135P2182L192k5235k6503K3157P0009
4590I522R162j4774k0250j2846N7321M4905m8187J2113K8593j2322m1107n8239
4578d6109O196K6448m056K0521l1768j6213K7394J6380J9592M1788J9101r2436
4566a3162m9273P278O8328N9617j9611k9542J935J2541K2301m5406k9349j7711
4554c2054o0516K6448R3124J4023j413l7307M734N2493k6027l3043n746J0724
4542E440R113L66L0698k9739m126J3757l0830k7135q526q345J2287J4042o339
4529b9337Q758m2564K4973K6408M584N9421j2246l4809j8708k48k687K3208m8891
4516d2138M688o5168J2264L3651K4670Q653k6830j3578q854K3380K5495k1089
$$ plain form
4603 820 -54121 -49355 -36978 -80196 -84642 -109415 -107280 -35098 -31906 -57141 -83644 -60487 9522
4590 9522 18684 3910 -16340 -29186 28135 73040 24853 36966 65559 53237 12130 -46109
4578 -46109 -39913 -13465 -17521 3000 -28768 -44981 -17587 -1207 18385 60173 79274 -13162
4566 -13162 -62435 -55157 13171 72788 53177 23635 25570 38111 60412 15006 -14343 -32054
4554 -32054 -92570 -66122 27002 41025 39612 2305 7039 59532 33505 462 -5284 5440
4542 5440 14553 14919 45617 15878 11752 25509 -5321 -32456 -40982 -49327 -37040 -22998 -29337
4529 -29337 -20579 -63143 -38170 -11762 -7178 52243 39997 5188 -13520 -13768 -16455 6753 -42138
4516 -42138 -37450 -102618 -90354 -56703 -32033 -23380 -50210 -63788 -72642 -49262 -23767 -44856
4504d4856l5920K023M3206r581m71j1123k597M4492O2857J6559n588k9912o4881
4491c5792j5776K9425L4754m3698Q148j3246j1618l6640J749l3698J5648M1582
4479e9162q62r5Q6053K9889j06123m6857P8761J3416J359j7196m488m726j7153
4466d7184O549n611l9325l0122M63k0721q229Q0778n031M5963L4648O44m543l4211
4452b5932K6657k4775J4523m0861l6222M4831N4298k2407Q464r854k1536k1674
4440e4488k0746Q968J6935Q725L182k5938K3574K6914k1080l9714k3874L8077
4428e9465O209N145j3616L0429N7263K1536l0582l5104n6815j3151l6254q247
4416a32652N5472M7652K680n42m2227J1293L0273N688J2376J36l8877m0701j4016
$$ plain form
4504 -44856 -80776 -78753 -35547 -45128 -45599 -56722 -59319 -14827 48030 64589 59001 29089 -35792
4491 -35792 -51568 -22143 12611 -31087 -22939 -36185 -47803 -84443 -82694 -116392 -100744 -59162
4479 -59162 -60024 -60119 25934 55823 -50300 -97157 -18396 -4980 -3621 -20817 -25305 -30031 -47184
4466 -47184 -40635 -46246 -85571 -115693 -115230 -135951 -144180 -63402 -68433 -22470 12178 12822 8279 -25932
4452 -25932 725 -24050 -9527 -50388 -86610 -41779 12519 -9888 -1424 -11278 -32814 -54488
4440 -54488 -75234 -66266 -49331 -40606 -37424 -63362 -39788 -12874 -33954 -73668 -97542 -59465
4428 -59465 -53256 -48111 -61727 -31298 25965 47501 16919 -18185 -75000 -88151 -124405 -132652
4416 -132652 -77180 -29528 -26848 -27390 -69617 -58324 -28051 -22363 -9987 -9851 -48728 -89429 -103445
4403a03445N8514K6820k4335K38L1646N6112l1729l2494J2167J0258K7369m400
4391B6721m090j0033m1451J2119j021p1532j0881o47n8736L0769O4563J7089K1316
4378b5814j1342m6124l6984r089M3969L7378j2765J0837J0720j5186J2106L436
4366c8858L3388o824J720m6322l9849P8194M6838j0693n27j8968m1794j5152K4884
4353c3963K6331q971q052L2181L0189l1947k9810L7648j0493J3472P105m4861
4341b1171k8293K902K4244L2079r979N188k3328K3621L0788Q705p2657k4304k0544
4328g2749N9841K9456k1792j618l0756N0907L7415j3633n0935l4227n5794j1127
4316a15012N6254j7023j4917J1685n515O692N5373K5400k5947o6033M2347j2075
$$ plain form
4403 -103445 -44931 -18111 -42446 -42208 -10562 45550 13821 -18673 -6506 3752 31121 26721
4391 26721 22631 12598 -28853 -16734 -17755 -89287 -100168 -100815 -159551 -128782 -64219 -47130 -25814
4378 -25814 -37156 -83280 -120264 -129353 -85384 -48006 -60771 -49934 -39214 -54400 -42294 -38858
4366 -38858 -5470 -12294 -10574 -56896 -96745 -18551 28287 17594 17067 -1901 -43695 -58847 -33963
4353 -33963 -7632 -16603 -24655 7526 37715 5768 -24042 13606 3113 16585 23690 -21171
4341 -21171 -49464 -46562 -22318 9761 -218 4970 -18358 5263 36051 44756 -27901 -52205 -72749
4328 -72749 -12908 16548 -5244 -6862 -37618 13289 50704 37071 -13864 -48091 -103885 -115012
4316 -115012 -58758 -75781 -90698 -79013 -84528 -77836 -22463 2937 -23010 -89043 -46696 -58771
4304e8771n0465M8533k1482j6090K9469L5944J535k1859J2007N2340N016m4121
4292b7944o3646M1005j2785J7685m52K323J3157l0506j4958J2134l4005j9781
4280a17773k0292N6844M3366K3864M1431J4158o9686j9477L4649J4580J4459N0462
4268F6585k2598q0540k5779L6513j1544K8157K288n773P1482J6786n8961j5828
4256G88K1209P4240P6627M0019p9056n485q568q9788n0257j2804J4343M92j6983
4243c5223O161m285k1548N8463M2920K6798k7646n5148k8851O035J674K2703O665
4230a282L691j5791L6320k3896r0392k9549R3541K5448l5577m8464K8000K7004
4218c0947j5933M8450L9241j1136j7857j5873Q693M072K0053m4593j3063m8142
$$ plain form
4304 -58771 -109236 -60703 -82185 -98275 -68806 -32862 -31327 -53186 -41179 11161 16177 -27944
4292 -27944 -91590 -50585 -63370 -45685 -46137 -43814 -30657 -61163 -76121 -63987 -97992 -117773
4280 -117773 -138065 -81221 -37855 -13991 27440 41598 -28088 -47565 -12916 1664 16123 66585
4268 66585 43987 -36553 -62332 -25819 -37363 -9206 -6918 -12691 58791 75577 16616 788
4256 788 21997 96237 172864 212883 133827 128342 119774 29986 -20271 -33075 -18732 -18240 -35223
4243 -35223 -29062 -33347 -54895 3568 46488 73286 45640 -9508 -38359 -32324 -30650 -7947 -1282
4230 -1282 2409 -13382 22938 -958 -91350 -120899 -27358 -1910 -37487 -85951 -57951 -30947
4218 -30947 -46880 1570 40811 29675 11818 -4055 4638 8710 28763 -15830 -28893 -77035
4206g7035j1990Q2722L6321L8029M7695l4449l2705M468l4676j0656k7772J072
4194a8976k8141K0657K7786M4441k4322n3261m7960l1374L0365P111K5837j8286
4182f6123N454K510k2987O415M614K0725L906L731J5708J5410M721k8074l0517
4169f4507J6874J3852O784L8336k2478j9126l7175k4286K8052J674M0672J2742
4157h586K1401K0553j0679n4139o9120N857R820q649m3340M6187J9222N7800O153
4144g520o1684J77K3129j9571Q0544K6419N853N220J4585j6724m0945N9586Q029
4131G7098m2889M925L5110M5825p973l1404k2757k9196P168j7950j7314J1087
4119A1730m610m2967K493j3235L2467L6728P368l1040k0635k5648k0108r202N540
$$ plain form
4206 -77035 -89025 -6303 30018 68047 115742 81293 48588 53056 18380 7724 -20048 -18976
4194 -18976 -47117 -26460 1326 45767 21445 -31816 -79776 -111150 -80785 -73674 -47837 -66123
4182 -66123 -60669 -58159 -81146 -74731 -70117 -49392 -45486 -41755 -26047 -10637 -5916 -33990 -64507
4169 -64507 -47633 -33781 -26997 11339 -11139 -30265 -67440 -91726 -63674 -62000 -21328 -8586
4157 -8586 12815 33368 22689 -31450 -100570 -94713 -84893 -93542 -136882 -90695 -71473 -13673 -7520
4144 -7520 -69204 -69027 -45898 -65469 15075 41494 47347 52567 67152 50428 9483 69069 77098
4131 77098 34209 39134 74244 120069 112096 80692 57935 28739 35907 17957 643 11730
4119 11730 7120 -35847 -33354 -46589 -14122 22606 29974 -1066 -21701 -47349 -67457 -76659 -71119
4106g1119L5591K3693l5894M6041o123l8400J1085O132k5787j1830M2478N988
4094a8145K5624L336j913k75l7947j6885l4725j5716N474K5830J911J7680k066
4081d7817J8907R350J6566L872k5422j2440L615L554p47n0933L3190P0966L3504
4068E6165l6196L2333L7678J6798k8121n7432o0735l5169j3980L1630P4669k5500
4056g860L6394J7610K9141r8333p761M1592J4147r152r42o892L0894j8802o5305
4043d5269m2205r841K2950N5594o239m6111L9980O5007J8397P843l8598j5502
4031F006J3827J6777L3897O5211m2058k2884q5597n2584L6033P0711R254k5001
4019B3592o4240m9188K8500p213J0017k5137l1216L9437N9112P5236l4715j4703
$$ plain form
4106 -71119 -35528 -11835 -47729 -1688 -7811 -46211 -35126 -28994 -54781 -66611 -24133 -18145
4094 -18145 7479 10815 8902 8627 -29320 -46205 -80930 -96646 -91172 -65342 -63431 -45751 -47817
4081 -47817 -28910 -19560 -2994 878 -24544 -36984 -33369 -29815 -30562 -81495 -48305 22661 56165
4068 56165 19969 52302 89980 106778 78657 21225 -39510 -74679 -88659 -57029 17640 -7860
4056 -7860 28534 46144 75285 -23048 -30809 10783 24930 15778 14836 7944 38838 20036 -45269
4043 -45269 -87474 -97315 -74365 -18771 -25010 -71121 -31141 33866 52263 60106 21508 6006
4031 6006 19833 36610 70507 135718 93660 70776 -14821 -67405 -31372 39339 48593 23592
4019 23592 -40648 -89836 -61336 -68549 -58532 -83669 -114885 -75448 -16336 58900 24185 9482
4007I482j6422j7920l2909l1878M374M4457J3499J3108R767m4118O8849Q9449
3995A09738m059m0254q1834O0647L0229r827m2624m2404J8114L1503j2649k9184
3983a2604l0596j2363l2563l7551L1863N5092j8526n7030M1500l5571O254J1084
3971i1011j5968l6672m4790J7701R2015O2678j1836k8427L8135J2960L3168m6594
3959a8641n8750K9331j0684K3182L5878l2640L3414L3315k5836l3957J7240l7087
3947d5235j9145o0960N4621N6762O346n477J1312L7248M5686m7892o1209l5450
3935f3393l0370J2144K1906K2232j8433m0656M7207K7395L0395J3812j7910J1744
3923A6073K6308m4806J833K7439n5630m924o443J9734P064L4533j8311L220L8819
$$ plain form
4007 9482 -6940 -24860 -57769 -89647 -85273 -40816 -27317 -14209 -4442 -48560 20289 109738
3995 109738 105679 65425 -16409 44238 74467 64640 22016 -20388 -2274 29229 16580 -12604
3983 -12604 -43200 -55563 -88126 -125677 -93814 -38722 -57248 -114278 -72778 -108349 -102095 -91011
3971 -91011 -106979 -143651 -188441 -170740 -78725 -16047 -27883 -56310 -18175 -5215 27953 -18641
3959 -18641 -77391 -48060 -58744 -35562 316 -32324 1090 34405 8569 -25388 -8148 -45235
3947 -45235 -64380 -125340 -70719 -13957 -7611 -13088 -1776 35472 81158 33266 -27943 -63393
3935 -63393 -93763 -81619 -59713 -37481 -55914 -96570 -49363 -21968 8427 22239 4329 16073
3923 16073 42381 -2425 -592 26847 -28783 -33707 -40150 -20416 -13352 21181 2870 6090 44909
3910D4909J9176j3598m6206j3834k0539k4967J0942M6699q68p9299l9450K0219
3898i6816L4802j218m9219l1539L3733M2377j8366K96K6045O7687o432k1735k9212
3885d9597j3510m9726n947O2418O5424j519J273M0515n2229n8147j575J0611J4278
3872c7731k3153k0302L0816m67L6342K5867R37j7886J1554m5309j9431O932L704
3859d8127J6694M7975m6401k2719K6310P3626j1717j6593J3232j2625n0211k0583
3847e1139j0637N756j981k2128M0391j9792L171K0448k0568R142O7133k5317M213
3834a308m384K992k3627k8036N2315K1354M0974M460L138k5126l3671L9111M7617
3821I5809J9294q236p0996o6755P0897J4375m7494m5341k215O78j3195P234P4
$$ plain form
3910 44909 64085 50487 4281 -9553 -30092 -55059 -44117 2582 1714 -77585 -117035 -96816
3898 -96816 -62014 -63232 -112451 -143990 -110257 -67880 -86246 -85950 -59905 7782 1350 -20385 -49597
3885 -49597 -63107 -112833 -118780 -56362 9062 7543 8816 49331 -2898 -61045 -62620 -52009 -37731
3872 -37731 -60884 -81186 -50370 -50837 -14495 11372 12309 -5577 5977 -39332 -58763 -51831 -48127
3859 -48127 -31433 16542 -29859 -52578 -26268 47358 35641 19048 32280 19655 -30556 -51139
3847 -51139 -61776 -56020 -58001 -80129 -39738 -59530 -56359 -35911 -56479 -47337 19796 -5521 -1308
3834 -1308 -5692 -2700 -26327 -54363 -2048 19306 60280 64740 67878 42752 9081 48192 95809
3821 95809 115103 106867 35871 -30884 40013 54388 6894 -38447 -40662 -39984 -53179 -45945 -45871
3808d5871l2241K2780K9780j5042J9075M0989m4455j8047q5852n1953j4029L3804
3796a61062J232Q2301L6426J2052r3475q85N4092m413K7123J4290L8466J6092
3784B2239J2941j6542l526k9191L8182J7473k4189l0704k4333l2195j5877J0542
3772g5180J9631L8012O350J0501r2560L293P132J3280r961Q515n2563J275M8823
3759g3452N3681N6595M1347k3894j1880m4218n4931K7246j1835r49l3033K466
3747g2857L3895o5680m9074M3968J3817k3129J4325J8803m219J3741j8574k5685
3735a20669L9229p559O4578K5003l7432K0112O6713K6441m380l2963M2211l6003
3723D5281o8102k6333J3984J0862L9223k1664K8091N610k1804l1142L2133k9052
$$ plain form
3808 -45871 -78112 -55332 -25552 -40594 -21519 19470 -24985 -43032 -128884 -180837 -194866 -161062
3796 -161062 -159830 -77529 -41103 -29051 -122526 -123411 -69319 -73732 -46609 -32319 6147 22239
3784 22239 35180 18638 15112 -14079 24103 41576 17387 -13317 -37650 -69845 -85722 -75180
3772 -75180 -55549 -17537 -11187 -686 -93246 -89953 -82821 -69541 -79502 -70987 -123550 -122275 -73452
3759 -73452 -19771 36824 78171 54277 42397 -1821 -56752 -29506 -41341 -42290 -75323 -72857
3747 -72857 -38962 -104642 -153716 -109748 -95931 -119060 -104735 -85932 -90151 -76410 -94984 -120669
3735 -120669 -81440 -88999 -24421 582 -36850 -16738 49975 76416 72036 39073 81284 45281
3723 45281 -22821 -49154 -35170 -24308 14915 -6749 21342 26952 5148 -25994 6139 -22913
3711b2913k4472j7144L2097l6066j8966J6887K1329K7625L2764q887p658J7979
3699A2575r902K4818o7052m0756J634L752M6259J9279j307L1316J6706n5762J2035
3686f405Q0606m44o7590o4713m2064P2364L8047n0421l7047k1606l1177J9006
3674a11444J02312L0027m2157N430N7490k7842n3300R407M2061J887j2251k5373
3662b3753m0426r832j842K4268P248M1681r9k9943n938l446N4128N0853K4254
3649H7153k8326k3003j6022m1240J3880N551J4365p871L683N0312l1344k9096
3637a958k2185j3200M8024O3487l4418n6879j0411M839j2349j7716j0912m3103
3625a06781M2951N9455J8738M2497o6496q3608Q901M285N9222K6404j3723P259
$$ plain form
3711 -22913 -47385 -64529 -32432 -68498 -87464 -70577 -49248 -21623 11141 2254 -5404 12575
3699 12575 2673 27491 -39561 -80317 -78683 -74931 -28672 -9393 -10700 20616 37322 -18440 -6405
3686 -6405 74201 73757 6167 -58546 -100610 -28246 9801 -40620 -77667 -99273 -130450 -111444
3674 -111444 -9132 20895 -21262 -15832 41658 13816 -39484 -30077 11984 13871 1620 -23753
3662 -23753 -64179 -74011 -75853 -51585 -44337 -2656 -2755 -32698 -38636 -42082 12046 62899 87153
3649 87153 58827 35824 19802 -21438 -7558 -2007 12358 4487 8170 58482 27138 -1958
3637 -1958 -24143 -37343 10681 74168 39750 -17129 -27540 -22701 -35050 -52766 -63678 -106781
3625 -106781 -63830 -4375 14363 56860 -9636 -93244 -84343 -80058 -20836 5568 -8155 -896
3613h96j6056J8110N1624j747R146m9204l0727k096L7493M9296J0169m9208L592
3600B9496o967J5773k4238K5429M7289j979r131k3521l5342J8389l2950L8109
3588D0357K5355q4885J3345J0464j9057k1147k3589k0196J2315k385K6160j225
3576d4488m2297K6489K5871R813l7208K7859l42n359l25M8407J7399k5066m9616
$$ plain form
3613 -896 -16952 1158 52782 51035 60181 10977 -19750 -21846 15647 64943 75112 25904 29496
3600 29496 22529 38302 14064 39493 86782 84803 75672 52151 16809 35198 2248 40357
3588 40357 65712 -19173 -5828 4636 -14421 -35568 -59157 -79353 -67038 -69423 -43263 -44488
3576 -44488 -86785 -60296 -34425 -24612 -61820 -33961 -34303 -39662 -39987 8420 25819 753 -48863
$$ [...]
##END NTUPLES=NMR SPECTRUM
##END=
