##TITLE=Analysis number 321326
Compound Code cc 50316
Book Reference 428/181
Project Code adrs
Chemist Name antons
##JCAMPDX= 6.0         $$ Bruker NMR JCAMP-DX V2.0
##DATA TYPE= NMR SPECTRUM
##DATA CLASS= NTUPLES
##ORIGIN= Bruker BioSpin GmbH
##OWNER= nmr
$$ XWIN-NMR		Version 3.5
$$ Thu Aug  3 14:25:11 2006 GMT Daylight Time (UT+1h)  MAYBRIDGE\nmr@NMR_250MHZ
##.OBSERVE FREQUENCY= 250.131544655141
##.OBSERVE NUCLEUS= ^1H
##.ACQUISITION MODE= SIMULTANEOUS (DQD)
##.ACQUISITION SCHEME= undefined
##.AVERAGES= 16
##.DIGITISER RES= 18
##SPECTROMETER/DATA SYSTEM= dpx250
##.PULSE SEQUENCE= zg30
##.SOLVENT NAME= CDCl3
##.SHIFT REFERENCE= (INTERNAL, CDCl3, 0, 16.522)
##AUDIT TRAIL= $$ (NUMBER, WHEN, WHO, WHERE, WHAT)
$$ ##TITLE= Audit trail, XWIN-NMR		Version 3.5
$$ ##JCAMPDX= 5.01
$$ ##ORIGIN= Bruker BioSpin GmbH
$$ ##OWNER= nmr
$$ C:\u/data/dgb/nmr/ADRS/260/pdata/1/auditp.txt
$$ ##AUDIT TRAIL=  $$ (NUMBER, WHEN, WHO, WHERE, WHAT)
(   1,<2006-08-03 14:24:39.54 +100>,<MAYBRIDGE\nmr>,<NMR_250MHZ>,
      <created by zg, POWCHK disabled, PULCHK disabled
       configuration hash MD5:
       E2 DF 36 D8 04 B2 41 60 5A D7 A3 38 5A 4B D0 FE
       data hash MD5: 64K
       AF 45 59 05 2F 34 2E AC 54 DC EA 08 CE EA C9 84>)
(   2,<2006-08-03 14:24:59.81 +100>,<MAYBRIDGE\nmr>,<NMR_250MHZ>,
      <Start of raw data processing
       ef LB = 0.3 FT_mod = 6 PKNL = 1 SI = 32K 
       data hash MD5: 32K
       E8 5A 6E 31 92 16 32 00 98 00 A4 F1 29 E7 06 32>)
(   3,<2006-08-03 14:25:01.82 +100>,<MAYBRIDGE\nmr>,<NMR_250MHZ>,
      <apk 
       data hash MD5: 32K
       69 4E 12 40 64 31 E0 F7 6E 0E E5 C7 A4 63 7F 33>)
(   4,<2006-08-03 14:25:02.56 +100>,<MAYBRIDGE\nmr>,<NMR_250MHZ>,
      <abs ABSG = 5 
       data hash MD5: 32K
       B6 8C 09 2C AA F7 D4 62 5A 13 B7 D2 B9 3A FE 86>)
$$ ##END=
$$ 
$$ hash MD5
$$ 8D A5 37 87 D1 C2 DA 24 75 2B 22 AE 95 06 C2 23
##$RELAX= 
##$RELAX= 
##$RELAX= 
##$RELAX= 
##$RELAX= 
##$RELAX= 
##$RELAX= 
$$ Bruker specific parameters
$$ --------------------------
##$DU= <C:\u>
##$EXPNO= 260
##$NAME= <ADRS>
##$PROCNO= 1
##$TYPE= <nmr>
##$USER= <dgb>
##$AMP= (0..31)
100 100 100 100 100 100 100 100 100 100 100 100 100 100 100 100 100 100 
100 100 100 100 100 100 100 100 100 100 100 100 100 100 
##$AQSEQ= 0
##$AQ_mod= 3
##$AUNM= <au_zg>
##$AUTOPOS= <42 >
##$BF1= 250.13
##$BF2= 250.13
##$BF3= 250.13
##$BF4= 250.13
##$BF5= 500.13
##$BF6= 500.13
##$BF7= 500.13
##$BF8= 500.13
##$BYTORDA= 1
##$CFDGTYP= 0
##$CFRGTYP= 5
##$CHEMSTR= <none>
##$CNST= (0..31)
1 1 145 1 1 1 1 1 1 1 1 1 1 1 1 1 1 1 1 1 1 1 1 1 1 1 1 1 1 1 1 1 
##$CPDPRG= <>
##$CPDPRG1= <>
##$CPDPRG2= <>
##$CPDPRG3= <>
##$CPDPRG4= <mlev>
##$CPDPRG5= <mlev>
##$CPDPRG6= <mlev>
##$CPDPRG7= <mlev>
##$CPDPRG8= <mlev>
##$CPDPRGB= <>
##$CPDPRGT= <>
##$D= (0..31)
0 1 0 0 0 0 0 0 0 0.06 0 0 0 0 0 0 0.0002 0 0 0 0 0 0 0 0 0 0 0 0 0 0 
0 
##$DATE= 1154611478
##$DBL= (0..7)
120 120 120 120 120 120 120 120 
##$DBP= (0..7)
150 150 150 150 150 150 150 150 
##$DBP07= 0
##$DBPNAM0= <>
##$DBPNAM1= <>
$$ [...]
##$SUBNAM7= <"">
##$SUBNAM8= <"">
##$SUBNAM9= <"">
##$SW= 20.6930455092707
##$SWIBOX= (0..15)
0 0 3 0 0 0 0 0 0 0 0 0 0 0 0 0 
##$SW_h= 5175.983436853
##$TD= 65536
##$TD0= 1
##$TE= 295.16
##$TE2= 300
##$TE3= 300
##$TEG= 300
##$TL= (0..7)
0 120 120 120 120 120 120 120 
##$TP= (0..7)
150 150 150 150 150 150 150 150 
##$TP07= 0
##$TPNAME0= <>
##$TPNAME1= <>
##$TPNAME2= <>
##$TPNAME3= <>
##$TPNAME4= <>
##$TPNAME5= <>
##$TPNAME6= <>
##$TPNAME7= <>
##$TPOAL= (0..7)
0.5 0.5 0.5 0.5 0.5 0.5 0.5 0.5 
##$TPOFFS= (0..7)
0 0 0 0 0 0 0 0 
##$TUNHIN= 0
##$TUNHOUT= 0
##$TUNXOUT= 0
##$USERA1= <user>
##$USERA2= <user>
##$USERA3= <user>
##$USERA4= <user>
##$USERA5= <user>
##$V9= 5
##$VALIST= <valist>
##$VCLIST= <CCCCCCCCCCCCCCC>
##$VD= 0
##$VDLIST= <DDDDDDDDDDDDDDD>
##$VPLIST= <PPPPPPPPPPPPPPP>
##$VTLIST= <TTTTTTTTTTTTTTT>
##$WBST= 1024
##$WBSW= 4
##$XGAIN= (0..3)
0 0 0 0 
##$XL= 0
##$YL= 0
##$YMAX_a= 670718
##$YMIN_a= -764063
##$ZGOPTNS= <>
##$ZL1= 120
##$ZL2= 120
##$ZL3= 120
##$ZL4= 120
##$ABSF1= 16.522
##$ABSF2= -4.171173
##$ABSG= 5
##$ABSL= 3
##$ALPHA= 0
##$AQORDER= 0
##$ASSFAC= 0
##$ASSFACI= 0
##$ASSFACX= 0
##$ASSWID= 0
##$AUNMP= <proc_1d>
##$AZFE= 0.1
##$AZFW= 0.1
##$BCFW= 0
##$BC_mod= 0
##$BYTORDP= 0
##$COROFFS= 0
##$CY= 12.5
##$DATMOD= 1
##$DC= 0
##$DFILT= <>
##$DTYPP= 0
##$F1P= 14.0000005364418
##$F2P= -0.99999901652339
##$FCOR= 0.5
##$FTSIZE= 32768
##$FT_mod= 6
##$GAMMA= 0
##$GB= 0
##$INTBC= 1
##$INTSCL= 1
##$ISEN= 128
##$LB= 0.3
##$LEV0= 0
##$LPBIN= 0
##$MAXI= 10000
##$MC2= 0
##$MEAN= 0
##$ME_mod= 0
##$MI= 0
##$NCOEF= 0
##$NC_proc= -4
##$NLEV= 6
##$NOISF1= 0
##$NOISF2= 0
##$NSP= 0
##$NTH_PI= 0
##$NZP= 0
##$OFFSET= 16.522
##$PC= 1
##$PHC0= 148.6978
##$PHC1= 6.183414
##$PH_mod= 1
##$PKNL= yes
##$PPARMOD= 0
##$PSCAL= 4
##$PSIGN= 0
##$REVERSE= no
##$SF= 250.13
##$SI= 32768
##$SIGF1= 0
##$SIGF2= 0
##$SINO= 400
##$SIOLD= 32768
##$SREGLST= <1H.CDCl3>
##$SSB= 0
##$STSI= 32768
##$STSR= 0
##$SW_p= 5175.98343685301
##$SYMM= 0
##$S_DEV= 0
##$TDeff= 65536
##$TDoff= 0
##$TI= <Analysis number 999999
Compound Code 99
Book Reference 9
Project Code 9>
##$TILT= no
##$TM1= 0
##$TM2= 0
##$TOPLEV= 0
##$USERP1= <user>
##$USERP2= <user>
##$USERP3= <user>
##$USERP4= <user>
##$USERP5= <user>
##$WDW= 1
##$XDIM= 32768
##$YMAX_p= 319172354
##$YMIN_p= -120257
$$ End of Bruker specific parameters
$$ ---------------------------------
##NTUPLES= NMR SPECTRUM
##VAR_NAME=  FREQUENCY,     SPECTRUM/REAL,   SPECTRUM/IMAG
##SYMBOL=    X,             R,               I
##VAR_TYPE=  INDEPENDENT,   DEPENDENT,       DEPENDENT
##VAR_FORM=  AFFN,          ASDF,            ASDF
##VAR_DIM=   32768,         32768,           32768
##UNITS=     HZ,            ARBITRARY UNITS, ARBITRARY UNITS
##FACTOR=    0.157963299565203, 1,           1
##FIRST=     4132.6476996994, 0,             0
##LAST=      -1043.33573715361, 0,           0
##MIN=       -1043.33573715361, -120257,     0
##MAX=       4132.6476996994, 319172354,     0
$$ Real data points
##PAGE= N=1
##DATA TABLE= (X++(R..R)), XYDATA
$$ [...]
$$ plain form
14942 -15483 -449 17862 -5167 -35312 3134 13705 -15272 -34601 -60459 -61621 -50288 -46919
14930 -46919 -22200 -12291 -22226 -6782 -17649 -22795 -31268 -14892 2929 -21917 -2069 21246
14918 21246 2925 -6313 -7971 -13764 3788 5311 -3529 -24070 -8554 12227 -7853 -34679 -55811
14905 -55811 -33112 -27830 -46597 -70882 -55493 -73625 -82811 -54551 -48737 -21440 -4508 -10972
14893 -10972 19886 1443 -1359 -4241 -40343 -44151 -25992 83 14701 16911 -4700 -28792
14881 -28792 -35785 -45994 -39852 -20774 -30020 -38728 -20762 -6435 -24399 -28179 -26799 -11999 -12059
14868 -12059 -16637 2287 11687 3043 -2348 -449 -8568 7652 -13968 -8768 -22716 -59002 -61387
14855 -61387 -42348 -14338 -2422 24537 -747 -27801 -74145 -69154 -60396 -67636 -68484 -40793 -40228
$$ packed form
14942a5483J5034J8311k3029l0145L8446J0571k8977j9329k5858j162J1333L369
14930d6919K4719R909r935J5444j0867n146q473J6376J7821k4846J9848K3315
14918B1246j8321r238j658n793J7552J523q840k0541J5516K0781k0080k6826k1132
14905e5811K2699N282j8767k4285J5389j8132r186K8260N814K7297J6932o464
14893a0972L0858j8443k802k882l6102l808J8159K6075J4618K210k1611k4092
14881b8792o993j0209O142J9078r246q708J7966J4327j7964l780J380J4800o0
14868a2059m578J8924R400q644n391J899q119J6220k1620N200j3948l6286k385
14855f1387J9039K8010J1916K6959k5284k7054m6344M991Q758p240q48K7691N65
$$ plain form
14842 -40228 -73542 -96271 -66886 -40763 -37403 -19513 -2748 -919 -5484 -9408 7965 4316 -34743
14829 -34743 -44955 -25624 268 -4825 -28651 -26386 -19171 -50121 -53798 -8464 -181 -7300 -6435
14816 -6435 -17918 -22001 -18026 -16872 -16373 -224 9311 -1767 -16313 -10851 4231 10531 -12735
14803 -12735 -28209 -32540 -51004 -61165 -39981 -45736 -42520 -6581 -5566 -14858 -22609 13395 14199
14790 14199 -4191 -13015 -4621 4265 25426 12930 -15171 -31261 -38728 -70966 -68138 -67143 -58492
14777 -58492 -72552 -46388 -48007 -23222 -32825 -51726 -41181 -23358 -18448 -15302 -2163 16009
14765 16009 12095 24113 22974 -26427 -50541 -32166 -28745 -20807 -10979 2607 2098 -8374 -9645
14752 -9645 4781 5701 -3303 -9756 -36085 -30401 -16326 5437 6144 -6629 -7761 -6838 -15375 -23939
$$ packed form
14842d0228l3314k2729K9385K6123L360J7890J6765J829m565l924J7373l649l9059
14829c4743j0212J9331K5892n093k3826K265P215l0950l677M5334Q283p119Q65
14816f435j1483m083L975J154M99J6149R535j1078j4546N462J5082O300k3266
14803a2735j5474m331j8464j0161K1184n755L216L5939J015r292p751L6004Q04
14790A4199j8390q824Q394Q886K1161j2496k8101j6090p467l2238K828R95Q651
14777e8492j4060K6164j619K4785r603j8901J0545J7823M910L146J3139J8172
14765A6009l914J2018j139m9401k4114J8375L421P938R828J3586n09j0472j271
14752i645J4426R20r004o453k6329N684J4075K1763P07j2773j132R23q537q564
$$ plain form
14738 -23939 -17729 -20113 -29547 -17584 -3137 -11023 -12844 -27531 -34632 -35118 -26730 -15351 -12657 -32562
14724 -32562 -35059 -19360 41 -2669 -17455 -25405 -12485 -36182 -22992 -4772 27266 -4676
14712 -4676 -13194 4494 -389 -36895 -66117 -61323 -32684 -55401 -47206 -36385 -16576 -28115 -16626
14699 -16626 -20009 -36308 -34408 -2535 9750 16005 -3952 -41779 -54416 -73130 -64082 -60907 -60309
14686 -60309 -38838 -44829 -32874 -44624 -42014 -35025 -53318 -50564 -17907 8880 -2406 -8446 -27071
14673 -27071 -27004 -20308 -7228 11135 6502 7731 -2490 -14760 -4280 -5915 -22424 -45360 -45586
14660 -45586 -8328 -18249 -31895 -44767 -52284 -39324 -24157 -20052 -48799 -63626 -25254 2080
14648 2080 29694 19133 12485 19988 5337 1960 -28423 -20090 -32277 -39305 -50320 -59646 -19984
$$ packed form
14738b3939O210k384r434J1963J4447p886j821j4687p101m86Q388J1379K694j9905
14724c2562k497J5699J9401k710j4786p950J2920k3697J3190J8220L2038l1942
14712d676q518J7688m883l6506k9222M794K8639k2717Q195J0821J9809j1539J1489
14699a6626l383j6299J900L1873J2285O255j9957l7827j2637j8714R048L175N98
14686f0309K1471n991J1955j1750K610O989j8293K754L2657K6787j1286o040j8625
14673b7071O7O696J3080J8363m633J229j0221j2270J0480j635j6509k2936k26
14660d5586L7258r921j3646j2872p517J2960J5167M105k8747j4827L8372K7334
14648B080K7614j0561o648P503j4651l377l0383Q333j2187p028j1015r326L9662
$$ plain form
14635 -19984 -5966 -18054 -29744 -13579 -17463 -21953 -21561 -8483 -1550 -223 -9518 -26945 -44799
14622 -44799 -43881 -43876 -54703 -43484 -24249 -4553 -10644 -26630 -22664 -24245 -13955 9775 37734
14609 37734 40794 -745 -21020 -3683 -15830 -24298 -13204 1527 6096 10113 17604 -6845 -52706
14596 -52706 -61091 -61253 -61520 -36353 -38877 -78831 -109362 -84080 -58980 -28326 -24832 -34847 -18385
14583 -18385 14898 17167 -1245 -10978 -21953 -34791 -36730 -17217 -29977 -44702 -20300 -29172
14571 -29172 -27953 -15189 -7453 -30393 -37281 -47577 -47358 -34850 -25994 -51708 -64067 -56770 -69142
14558 -69142 -69348 -57672 -44029 -32439 -31679 -66581 -77611 -58148 -52022 -68089 -46718 -50149 -54458
14545 -54458 -68123 -60472 -45914 -44782 -24166 -41524 -43741 904 28655 22422 17887 31705 12967
$$ packed form
14635a9984J4018j2088j1690J6165l884m490L92J3078O933J327r295j7427j7854
14622d4799R18Nj0827J1219J9235J9696o091j5986L966j581J0290K3730K7959
14609C7734L060m1539k0275J7337j2147q468J1094J4731M569M017P491k4449m5861
14596e2706q385j62k67K5167k524l9954l0531K5282K5100L0654L494j0015J6462
14583a8385L3283K269j8412r733j0975j2838j939J9513j2760j4725K4402q872
14571b9172J219J2764P736k2940o888j0296K19J2508Q856k5714j2359P297j2372
14558f9142k06J1676J3643J1590P60l4902j1030J9463O126j6067K1371l431m309
14545e4458j3665P651J4558J132K0616j7358k217M4645K7751o233m535J3818j8738
$$ plain form
14532 12967 32206 19863 -10224 -47128 -52342 -50729 -38145 -2634 -13072 -59449 -93476 -60883
14520 -60883 -59064 -49934 -56903 -42560 -21171 -16918 8420 27560 -5270 -41215 -40889 -43522 -35349
14507 -35349 -59918 -92367 -64218 -16700 -1072 -16524 -6737 -15679 -29027 -16413 -29232 -44160
14495 -44160 -22764 -21558 -34135 -42423 -30521 -34047 -49302 -47044 -22456 -15531 -22463 -10733 6478
14482 6478 -27339 -53296 -57419 -40933 -44176 -53497 -30414 -18738 -31110 4084 -7660 -40623
14470 -40623 -4859 10370 -11196 -47386 -72708 -31040 -21007 -45112 -54866 -59280 -80064 -59816
14458 -59816 -32808 -5689 -11500 -21859 -17147 -18445 -31597 -69499 -84762 -55521 -1233 -11128
14446 -11128 -37068 -55193 -95302 -117475 -102910 -103549 -86993 -60753 -84034 -76605 -34688 -21115
$$ packed form
14532A2967J9239j2343l0087l6904n214J613J2584L5511j0438m6377l4027L2593
14520f0883J819R130o969J4343K1389M253K5338J9140l2830l5945L26k633Q173
14507c5349k4569l2449K8149M7518J5628j5452R787q942j3348J2614j2819j4928
14495d4160K1396J206j2577q288J1902l526j5255K258K4588O925o932J1730J7211
14482F478l3817k5957m123J6486l243r321K3083J1676j2372L5194j1744l2963
14470d0623L5764J5229k1566l6190k5322M1668J0033k4105r754m414k0784K0248
14458e9816K7008K7119n811j0359M712j298j3152l7902j5263K9241N4288r895
14446a1128k5940j8125m0109k2173J4565o39J6556K6240k3281P429M1917J3573
$$ plain form
14434 -21115 -11651 -18223 -17808 -47076 -74893 -54313 -23270 -15998 -73326 -70103 -55141 -90796 -78862
14421 -78862 -48595 -36330 -27100 -32364 -55992 -73491 -49577 -39424 -31178 -28072 -30936 -24049 -27535
14408 -27535 10881 7004 -26205 -52357 -55882 -31689 -16255 -30795 -52566 -30891 -41257 -71455
14396 -71455 -70802 -66063 -79775 -67726 -55390 -53200 -57668 -29681 -19836 -23268 -25514 -47854 -45108
14383 -45108 -37600 -17742 -27221 -32945 -17531 -22955 -36039 -49815 -46448 -33286 -35971 -43058 -63052
14370 -63052 -79376 -47229 -36027 -25771 -22310 -21251 -19101 -48295 -61501 -32779 -33049 -27993 -15236
14357 -15236 -35453 -34561 -29684 -25426 -33226 -40423 -25122 -28771 -20926 -29812 3288 23155 16446 22122
14343 22122 16259 -6794 -18713 5611 7904 -21581 -10290 -9599 -9175 -12834 -21083 -2261 9490
$$ packed form
14434b1115R464o572M15k9268k7817K0580L1043P272n7328L223J4962l5655J1934
14421g8862L0267J2265R230n264k3628j7499K3914J0153Q246L106k864O887l486
14408b7535L8416l877l3209k6152l525K4193J5434j4540k1771K1675j0366l0198
14396g1455O53M739j3712J2049J2336K190m468K7987R845l432k246k2340K746
14383d5108P508J9858r479n724J5414n424j3084j3776L367J3162k685p087j9994
14370f3052j6324L2147J1202J0256L461J059K150k9194j3206K8722k70N056J2757
14357a5236k0217Q92M877M258p800p197J5301l649P845q886L3100J9867o709N676
14343B2122n863k3053j1919K4324K293k9485J1291O91M24l659q249J8822J1751
$$ plain form
14330 9490 -7037 1640 -38786 -56211 -54012 -73979 -55552 -55659 -43512 -45828 -52197 -33139 -26545
14317 -26545 -32172 -24862 -27856 -35523 -20752 -21132 -48905 -58919 -37374 -38736 -40957 -40231 -26886 -26494
14303 -26494 -33313 -21233 -22712 -37893 -2091 41261 35143 -2937 -20569 -13216 -7781 -17387 -13394
14290 -13394 -27672 -30394 -29803 -32493 -33298 -37992 -39932 -12476 -5271 16266 23311 8327 -4182 -3930
14276 -3930 -15348 -15308 13828 7673 -14725 -29818 -33741 -36057 -49419 -32648 -38806 -47183 -67106
14263 -67106 -91961 -69736 -39284 -34427 -43054 -35750 -41199 -57786 -60758 -40339 -38703 -48938 -30070
14250 -30070 -16629 -48345 -59904 -44007 -13758 -35130 -49882 -46984 -18847 -13153 -29345 -36576
14238 -36576 -48636 -33090 -43007 -45626 -38889 -64720 -67749 -39238 -20204 -16941 -21943 -31256 -27935
$$ packed form
14330I490j6527Q677m0426j7425K199j9967J8427j07J2147k316o369J9058O594
14317b6545n627P310k994p667J4771l80k7773j0014K1545j362k221P26J3345L92
14303b6494o819J2080j479j5181L5802M3352o118l8080j7632P353N435r606L993
14290a3394j4278k722N91k690q05m694j940K7456P205K1537P045j4984j2509K52
14276c930j1418M0K9136o155k2398j5093l923k316j3362J6771o158q377j9923
14263f7106k4855K2225L0452M857q627P304n449j6587k972K0419J636j0235J8868
14250c0070J3441l1716j1559J5897L0249k1372j4752K898K8137N694j6192p231
14238c6576j2060J5546r917k619O737k5831l029K8511J9034L263n002r313L321
$$ plain form
14225 -27935 -22574 -55488 -42150 -33527 -54781 -49131 -30534 -4378 3699 -28318 -57188 -69532
14213 -69532 -38829 -27247 1266 41261 39163 23771 17625 9533 4760 10307 -18658 -31372 -52918
14200 -52918 -55947 -38832 -31851 -45131 -28413 -30259 -67364 -73409 -56652 -39130 -16487 -20777 -17329
14187 -17329 -3760 -4151 -16321 -22316 -46409 -18482 27202 10610 -17513 -10911 -21132 -23657 -991
14174 -991 30465 25129 34703 11523 -16404 -22213 -35008 -66509 -74460 -62320 -89687 -82389 -31530
14161 -31530 -6468 -11425 -7788 -730 2538 -6440 -5831 14286 27494 28543 10402 -5058 -26652
14148 -26652 -31802 -25284 -17334 -32564 -50125 -44164 -30354 -31120 -41854 -65629 -68373 -39473 -15968
14135 -15968 -27213 -20314 5757 -16179 -25660 -19339 -48712 -45813 -24313 -21669 -32548 -18601 -17856
$$ packed form
14225b7935N361l2914J3338Q623k1254N650J8597K6156Q077l2017k8870j2344
14213f9532L0703J1582K8513L9995k098j5392o146q092m773N547k8965j2714k1546
14200e2918l029J7115O981j3280J6718j846l7105o045J6757J7522K2643m290L448
14187a7329J3569l91j2170n995k4093K7927M5684j6592k8123O602j0221k525K2666
14174i91L1456n336R574k3180k7927n809j2795l1501p951J2140k7367P298N0859
14161c1530K5062m957L637P058L268q978O09K0117J3208J049j8141j5460k1594
14148b6652n150O518P950j5230j7561N961J3810p66j0734k3775k744K8900K3505
14135a5968j1245O899K6071k1936r481O321k9373K899K1500K644j0879J3947P45
$$ plain form
14122 -17856 -21665 -28679 -17366 -13966 -19058 -3899 12075 -5337 -9838 6834 18678 4507 9179
14109 9179 10480 1979 -5886 7507 9503 16712 -18682 -52706 -49126 -43858 -18058 3732 2660
14096 2660 -30555 -35450 -35662 -27088 -18126 -28721 -21645 -1277 14047 -12471 -39968 -10557 -19792
14083 -19792 -32318 -10950 -11848 -21597 -23126 -20213 -31184 -49134 -64221 -64365 -44884 -42318 -49927
14070 -49927 -28550 -35678 -32028 -46363 -51827 -51351 -31707 -4693 4323 -3822 3250 -23255 -33372
14057 -33372 -51307 -54261 -29202 -10216 3125 10412 -13985 -48707 -63159 -44587 -58942 -60922
14045 -60922 -32622 -51331 -74064 -37744 -14505 6471 19658 -2465 -21956 -34322 -38389 -25699
14033 -25699 -17339 11949 27903 39545 8003 -21625 -26884 878 -5013 6948 29998 30881 3658
$$ packed form
14122a7856l809p014J1313L400n092J5159J5974j7412m501J6672J1844j4171M672
14109I179J301q501p865J3393J996P209l5394l4024L580N268K5800K1790j072
14096B660l3215m895k12Q574Q962j0595P076K0368J5324k6518k7497K9411r235
14083a9792j2526K1368q98r749j529K913j0971j7950j5087j44J9481K566p609
14070d9927K1377p128L650j4335n464M76J9644K7014R016q145P072k6505j0117
14057c3372j7935k954K5059J8986J3341P287k4397l4722j4452J8572j4355j980
14045f0922K8300j8709k2733L6320K3239K0976J3187k2123j9491j2366m067J2690
14033b5699Q360K9288J5954J1642l1542k9628n259K7762n891J1961K3050Q83k7223
$$ plain form
14020 3658 -5656 19681 17010 -7859 -20627 -26219 -38637 -52726 -49114 -43908 -33372 -36103 -50928
14007 -50928 -45735 -52265 -66578 -42870 -40959 -27034 -25902 -36873 -36869 -42653 -36567 -7617 7929 -3213
13993 -3213 -57186 -61941 -41187 -35210 -38661 -31938 -21062 -7866 7062 22893 441 -10331 -10558
13980 -10558 6552 -10109 -15670 -17566 -30359 -7409 -1761 -4434 -1376 10543 -214 -20605 -27686
13967 -27686 -28508 -10832 -29542 -63154 -75651 -45928 1779 23787 6885 937 6492 -4634
13955 -4634 -20932 -9159 -11758 -2228 1271 17724 19099 332 -21849 -38998 -13419 18589 5770
13942 5770 -6832 2032 -11428 -18732 11621 22776 -8981 4031 7138 -6024 -11247 -8948 -24518
13929 -24518 -41654 -17301 6225 -8441 1911 507 -12633 -30789 -46120 -40235 -48986 -31124
$$ packed form
14020C658r314K5337k671k4869j2768n592j2418j4089L612N206J0536k731j4825
14007e0928N193o530j4313K3708J911J3925J132j0971Mn784O086K8950J5546j1142
13993c213n3973m755K0754N977l451O723J0876J3196J4928J5831k2452j0772k27
13980a0558J7110j6661n561j896j2793K2950N648k673L058J1919j0757k0391p081
13967b7686q22J7676j8710l3612j2497K9723M7707K2008j6902n948N555j1126
13955d634j6298J1773k599R530L499J6453J375j8767k2181j7149K5579L2008j2819
13942E770j2602Q864j3460p304L0353J1155l1757J3012L107j3162n223K299j5570
13929b4518j7136K4353K3526j4666J0352j404j3140j8156j5331N885q751J7862
$$ plain form
13917 -31124 -15995 -24160 -26721 -38873 -23329 -20448 -31313 -7075 3701 3027 1428 -30261 -43297
13904 -43297 -52639 -53059 -22969 -19547 -22385 13077 9148 -15729 11533 30533 24286 38033 37488
13891 37488 8909 -8191 -21081 -24153 -30146 -38614 5079 22310 -27893 -57916 -42054 -24305
13879 -24305 -15864 1201 21571 -6620 -1397 -21769 -34259 -27904 -16157 -20379 -11338 -8597 -12876
13866 -12876 -37853 -31058 -23352 -30940 -34924 -61859 -55085 -38524 -23877 -20058 -12970 6709 -482
13853 -482 -10470 -23049 -2358 -26624 -55130 -43576 -27495 -11259 -20409 -27678 -29845 -27270 -26382
13840 -26382 -1922 1756 776 -8705 5375 -710 -19527 -16123 -17258 -53067 -45545 -19038 -5067
13827 -5067 -24315 -30344 -15343 -8138 -29800 -45621 -71284 -52723 -28971 -12890 -707 -17173
$$ packed form
13917c1124J5129q165k561j2152J5544K881j0865K4238J0776o74j599l1689j3036
13904d3297r342m20L0090L422k838L5462l929k4877K7262J9000o247J3747n45
13891C7488k8579j7100j2890l072n993q468M3693J7231n0203l0023J5862J7749
13879b4305Q441J7065K0370k8191N223k0372j2490O355J1747m222R041K741m279
13866a2876k4977O795P706p588l984k6935O774J6561J4647L819P088J9679p191
13853d82r988j2579K0691k4266k8506J1554J6081J6236r150p269k167K575Q88
13840b6382K4460L678r80r481J4080o085j8817L404j135l5809P522K6507J3971
13827e067j9248o029J5001P205k1662j5821k5663J8561K3752J6081J2183j6466
$$ plain form
13815 -17173 -37478 -66827 -80248 -59387 -67470 -44920 -51554 -10874 14700 309 11997 -10734
13803 -10734 -14270 -32858 -49602 -10336 -26060 -16658 -42930 -55534 -76778 -90902 -69094 -49890
13791 -49890 -56979 -37955 -23808 -19012 14274 18612 5647 1713 -11528 17445 56165 24538
13779 24538 7533 -19367 -23889 -27899 -13727 -24448 -50438 -65989 -63997 -62533 -66406 -83494 -74377
13766 -74377 -54616 -50124 -39150 -39279 -24437 -17978 -31521 -8796 3160 19277 6472 -17776
13754 -17776 -42790 -42533 -20762 -3651 12127 30364 59934 51947 26954 27899 -16090 -54304 -46497
13741 -46497 -17488 17480 19526 22352 35619 32416 16645 -10299 -37838 -28647 -7963 -251 -2733
13728 -2733 -5264 -19865 -26902 -19419 -13718 -21550 -2746 30543 6052 1007 5684 -8065 -22590
$$ packed form
13815a7173k0305k9349j3421K0861q083K2550o634M0680K5574j4391J1688k2731
13803a0734l536j8588j6744L9266j5724R402k6272j2604k1244j4124K1808J9204
13791d9890p089J9024J4147M796L3286M338j2965l934j3241K8973L8720l1627
13779B4538j7005k6900m522m010J4172j0721k5990j5551J992J464l873j7088R117
13766g4377J9761M492J0974j29J4842O459j3543K2725J1956J6117j2805k4248
13754a7776k5014K57K1771J7111J5778J8237K9570p987k4993R45m3989l8214P807
13741d6497K9009L4968K046K826J3267l203j5771k6944k7539R191K0684P712k482
13728b733k531j4601p037P483N701p832J8804L3289k4491n045M677j3749j4525
$$ plain form
13715 -22590 -2121 3626 -17841 -34462 -43765 -24729 -7064 -4277 5789 19870 -33039 -19910
13703 -19910 -17615 -8015 -6041 -3059 -9810 -18724 -8277 -6535 -10466 -1115 4014 -29562 -50038 -46920
13689 -46920 -25467 -8452 9124 2257 5682 19444 24716 21040 5220 -8667 -17596 -26138 -18568
13676 -18568 -34955 -46075 -26361 -4852 15872 25869 33952 28311 39996 30963 5186 -1675 8106
13663 8106 10844 14961 9453 13641 18000 6934 5517 -2180 -11276 -20651 -27292 -15242 -2790 16924
13649 16924 20138 44448 56675 57442 59525 53784 31649 18632 -2670 -23378 -26527 -7871 -11714
13636 -11714 -36837 -16308 1890 -38906 -35294 -18743 -17268 -23551 -41409 -53232 -41228 -15849
13624 -15849 -36568 -52486 -27498 -50980 -87852 -59075 -44038 -27347 -12667 4309 742 -24242
$$ packed form
13715b2590K0469N747k1467j6621r303J9036J7665K787J0066J4081n2909J3129
13703a9910K295R600J974K982o751q914J0447J742l931R351N129l3576k0476L118
13689d6920K1453J7015J7576o867L425J3762N272l676j5820j3887q929q542P570
13676a8568j6387j1120J9714K1509K0724R997Q083n641J1685r033k5777o861R781
13663H106K738M117n508M188M359j1066j417p697r096r375o641J2050J2452J9714
13649A6924L214K4310J2227P67K083n741k2135j3017k1302k0708l149J8656l843
13636a1714k5123K0529J8198m0796L612J6551J475o283j7858j1823J2004K5379
13624a5849k0719j5918K4988k3482l6872K8777J5037J6691J4680J6976l567k4984
$$ plain form
13612 -24242 -17106 -13288 -10196 -19053 -22552 -10029 -14428 -16973 -15466 -560 -19484 -29169 -6414
13599 -6414 -16333 -47323 -38737 8799 19668 8589 -5115 1502 1269 2531 3510 -6970 -9043 4507
13585 4507 -2292 -10869 -23888 -25202 -13832 -4156 25275 54119 25893 10143 15875 35830 32001
13572 32001 23578 27025 4165 -37806 -55838 -36601 -11163 -24434 -7424 14419 4858 -17588
13560 -17588 -7107 -32737 -37953 -12173 -29708 -41855 -24622 -5473 -13472 -36572 -27006 2124
13548 2124 3107 -16621 -23539 -45279 -21615 -5559 -3111 13006 -13084 -7169 11983 -531 -8658
13535 -8658 -14546 -15716 -20202 -30117 -23380 -25040 -53755 -32505 11917 38004 15036 2746 3600
13522 3600 -31669 -68818 -71004 -61122 -23975 -19907 5921 15252 -834 -1833 -15490 -48258 -42527
$$ packed form
13612b4242P136L818L092q857l499J2523m399k545J507J4906j8924r685K2755
13599f414r919l0990Q586M7536J0869j1079j3704O617k33J262R79j0480k073J3550
13585D507o799q577j3019j314J1370R676K9431K8844k8226j5750N732J9955l829
13572C2001q423L447k2860m1971j8032J9237K5438j3271J7010K1843r561k2446
13560a7588J0481k5630n216K5780j7535j2147J7233J9149p999k3100R566K9130
13548B124R83j9728o918k1740K3664J6056K448J6117k6090N915J9152j2514q127
13535h658n888j170m486r915O737j660k8715K1250M4422K6087k2968j2290Q54
13522C600l5269l7149k186R882L7147M068K5828R331j6086r99j3657l2768N731
$$ plain form
13509 -42527 8547 12966 9693 15875 32265 21036 -8792 -29123 -24320 -9483 9426 22370
13497 22370 -16212 -39822 -38012 -25596 -10060 19599 10068 -33919 -52843 -42498 -53835 -38250
13485 -38250 -36541 -19833 -7914 -2742 26844 19502 31112 -5673 -38633 -24321 -18652 -10235 -7275
13472 -7275 -12961 -7541 -10957 -14390 -8973 -10316 3924 9765 7756 4554 -3397 -17086 -48226 -40457
13458 -40457 -24678 -16212 -31018 -36470 -35081 -12140 -11793 -17873 -19998 -20357 -26898 2992 22279 16976
13444 16976 7114 6808 9845 12724 -11264 6098 23909 479 -21828 -15597 -10459 2322 4998
13431 4998 12616 46885 62464 40701 14280 23129 38073 25086 16519 11295 -8469 -9177 3929
13418 3929 11639 1110 -10067 -49321 -59668 -41198 -18120 -16375 1092 21203 32561 45167
$$ packed form
13509d2527N1074M419l273O182J6390j1229k9828k0331M803J4837J8909J2944
13497B2370l8582k3610J810J2416J5536K9659r531m3987j8924J0345j1337J5585
13485c8250J709J6708J1919N172K9586p342J1610l6785l2960J4312N669Q417K960
13472g275n686N420l416l433N417j343J4240N841k009l202p951j3689l1140P769
13458d0457J5779Q466j4806n452J389K2941L47o080k125l59o541K9890J9287n303
13444A6976r862l06L037K879k3988J7362J7811k3430k2307O231N138J2781K676
13431D998P618L4269J5579k1763k6421Q849J4944j2987q567n224j9764p08J3106
13418C929P710j0529j1177l9254j0347J8470K3078J745J7467K0111J1358J2606
$$ plain form
13406 45167 36062 35330 60634 15962 -13162 12908 22664 33670 59626 46934 38880 3965 8755
13393 8755 14940 16073 18786 20097 11802 4455 10995 6696 21891 37981 29508 23618 30356 13715
13379 13715 -2670 -3832 1151 -2055 -7090 -3777 49791 72090 37632 9549 -16901 -22079 -20643
13366 -20643 -15190 -5401 6000 -28154 -18380 23149 50101 28712 8765 14904 -21829 -25791 -4739
13353 -4739 -12626 -9302 -21728 -41000 -55757 -21226 -9632 3752 6935 2319 31578 24003 31825
13340 31825 39680 30416 25181 26509 6916 9121 10108 -4519 -4114 -6106 12146 35505 33000 12105
13326 12105 15420 3840 -6039 15418 42702 39759 19940 12794 25536 14884 -12299 7348
13314 7348 53172 34193 -27 -13803 10559 7398 -10199 -19401 16447 18511 7600 -9843
$$ packed form
13406D5167r105p32K5304m4672k9124K6070R756J1006K5956j2692q054l4915M790
13393H755O185J133K713J311q295p347O540m299J5195J6090q473n890O738j6641
13379A3715j6385j162M983l206n035L313N3568K2299l4458k8083k6450n178J436
13366b0643N453R789J1401l4154R774M1529K6952k1389j9947O139l6733l962K1052
13353d739p887L324j2426j9272j4757L4531J1594J3384L183m616K9259p575P822
13340C1825P855r264n235J328j9593K205R87j4627M05j992J8252K3359k505k0895
13326A2105L315j1580r879K1457K7284k943j9819p146J2742j0652k7183J9647
13314G348M5824j8979l4220j3776K4362l161j7597r202L5848K064j0911j7443
$$ plain form
13302 -9843 -5062 -10120 -7819 -15269 -17634 9375 34959 44015 53418 49981 25045 5810 12990 26564
13288 26564 38040 69774 69999 39771 31923 4505 -7378 -16710 -36816 -50503 -24271 10142
13276 10142 -8020 -6562 7300 -3215 12828 27212 22221 24635 16032 22152 20592 17586 13001
13263 13001 12433 22857 -1600 -14426 -8988 -8818 346 -5149 -20338 15928 45128 48396 55460
13250 55460 63297 30577 15306 33474 58278 61613 49664 38648 33426 23517 26094 27206 34965
13237 34965 22819 17279 8519 -2151 3624 21007 39251 50410 21366 22461 37617 17206
13225 17206 -3634 -8520 18779 310 -4815 586 17853 25865 16480 11802 26298 5122 -6705
13212 -6705 -795 -665 14743 13088 17291 13568 -29510 -12862 39933 40504 21723 5461 -3037 5300
$$ packed form
13302i843M781n058K301p450k365K7009K5584R056R403l437k4936j9235P180J3574
13288B6564J1476L1734K25l0228p848k7418j1883r332k0106j3687K6232L4413
13276A0142j8162J458J3862j0515J6043J4384m991K414q603O120j560l006m585
13263A3001n68J0424k4457j2826N438J70R164n495j5189L6266K9200L268P064
13250E5460P837l2720j5271J8168K4804L335j1949j1016n222r909K577J112P759
13237C4965j2146n540q760j0670N775J7383J8244J1159k9044J095J5156k0411
13225A7206k0840m886K7299j8469n125N401J7267Q012r385m678J4496k1176j1827
13212f705N910J30J5408j655M203l723m3078J6648N2795N71j8781j6262q498Q337
$$ plain form
13198 5300 25765 12643 -12633 -5827 -1325 41779 51207 49129 42765 21596 23031 10259 17324
13185 17324 53399 19454 -8389 -2232 12123 2865 -15031 -5515 -5207 -10462 -9649 9877 22101
13172 22101 40449 47937 55892 69866 40652 25872 18786 4654 -6362 -6462 -19854 -30299 -32640
13159 -32640 -1734 500 4009 8560 985 2502 7329 30653 33632 43265 56482 63570 32278
13146 32278 21273 13064 30434 48820 39020 12801 9712 1084 6557 14202 17162 21402 42240
13133 42240 37866 34661 22971 14973 28871 53605 48062 48355 53414 64830 53640 54750 66261
13120 66261 71798 50087 21002 13339 12499 37945 50724 62000 83617 63788 34825 26325 48188
13107 48188 51054 32826 -6773 -11620 7782 54554 58796 41558 84610 81815 32544 4739
$$ packed form
13198E300K0465j3122k5276O806M502M3104R428k078o364k1169J435j2772P065
13185A7324L6075l3945k7843O157J4355r258j7896R516L08n255Q13J9526J2224
13172B2101J8348P488P955J3974k9214j4780p086j4132j1016j00j3392j0445k341
13159c2640L0906K234L509M551p575J517M827K3324K979R633J3217P088l1292
13146C2278j1005q209J7370J8386r800k6219l089q628N473P645K960M240K0838
13133D2240m374l205j1690p998J3898K4734n543K93N059J1416j1190J110J1511
13120F6261N537k1711k9085p663q40K5446J2779J1276K1617j9829k8963q500K1863
13107D8188K866j8228l9599m847J9402M6772M242j7238M3052k795m9271k7805
$$ plain form
13095 4739 2078 18338 32276 39498 42830 44040 46504 61276 30512 3789 26288 31617 12606
13082 12606 6513 40700 52894 46860 42176 11696 -6244 -3557 -4865 21138 63102 50495 21807
13069 21807 11249 1855 4639 15005 21899 33786 31111 16639 16404 19805 30922 48721 47315
13056 47315 22636 2818 -19939 -15357 5063 -284 8253 -10415 33286 41984 54774 60368 52110
13043 52110 50705 69053 63961 48536 34498 35442 28061 55240 74855 57232 64092 75129 73692
13030 73692 64085 56376 58927 58076 58535 51583 64600 74090 75876 84201 84544 77878 46460 38977 24824
13015 24824 35734 34578 42467 55845 80344 65670 15118 -18035 -21877 -14211 19155 57789
13003 57789 41032 2895 -22208 -3630 45720 43508 27241 35041 62486 78288 88215 81080
$$ packed form
13095D739k661J6260J3938P222L332J210K464J4772l0764k6723K2499N329j9011
13082A2606o093L4187J2194o034m684l0480j7940K687j308K6003M1964j2607k8688
13069B1807j0558r394K784J0366O894J1887k675j4472k35L401J1117J7799j406
13056D7315k4679j9818k2757M582K0420n347Q537j8668M3701Q698J2790N594q258
13043E2110j405J8348n092j5425j4038R44p381K7179J9615j7623O860J1037j437
13030G3692r607p709K551q51M59o952J3017R490J786Q325L43o666l1418p483j4153
13015B4824J0910j156P889J3378K4499j4674n0552l3153l842P666L3366L8634
13003E7789j6757l8137k5103J8578M9350k212j6267P800K7445J5802R927p135
$$ plain form
12991 81080 74768 80716 74053 88221 105380 92596 90833 74226 43834 61094 94380 125348
12979 125348 93099 81471 82140 98808 64893 56158 79262 77475 75316 58052 35771 51288
12967 51288 69538 49906 49699 64224 85703 90449 62508 75582 96022 75519 68768 59887 67872
12954 67872 62943 93969 76760 62448 78588 89889 85709 85931 102636 122795 117047 92711 89766
12941 89766 79391 99522 110190 114205 114945 126975 137870 129971 112299 113900 102342 90701 53047
12928 53047 29240 31263 46288 61692 72133 67088 65883 61901 81863 111124 98828 115587
12916 115587 92501 72763 107611 130471 111991 108520 94060 80315 93285 106334 90839 92975
12904 92975 120662 122283 97146 89733 105962 117651 118309 107628 80503 57913 53527 47215 76938
$$ packed form
12991H1080o312N948o663J4168J7159j2784j763j6607l0392J7260L3286L0968
12979A25348l2249j1628O69J6668l3915q735K3104j787k159j7264k2281J5517
12967E1288J8250j9632k07J4525K1479M746k7941J3074K0440k0503o751q881P985
12954F7872m929L1026j7209j4312J6140J1301m180K22J6705K0159n748k4336k945
12941H9766j0375K0131J0668M015P40J2030J0895p899j7672J601j1558j1641l7654
12928E3047k3807K023J5025J5404J0441n045j205l982J9962K9261j2296J6759
12916A15587k3086j9738L4848K2860j8480l471j4460j3745J2970J3049j5495K136
12904I2975K7687J621k5137p413J6229J1689O58j0681k7125k2590m386o312K9723
$$ plain form
12891 76938 109959 114301 101155 123893 107031 84483 69728 61938 68229 80068 98293 105174
12879 105174 72479 66619 63828 67710 80046 89954 102395 118337 127995 132393 132533 120442 88920
12866 88920 82311 77077 95658 119407 127638 129915 100697 108265 131773 131423 127441 103965 94335
12853 94335 80625 67128 54422 63640 76233 80883 82194 64949 56933 74321 83194 73124 79870
12840 79870 82300 86487 97740 88028 132451 147214 106266 101850 105941 127805 140884 140844 133485
12827 133485 114945 108114 118521 114190 120968 148160 124595 109776 88994 109466 101692 115934
12815 115934 153386 153968 136011 120826 123563 115213 147749 152503 143810 147105 135793 102693 84810
12802 84810 68200 87275 111732 116946 131879 127530 129996 118100 106030 90288 91217 104916 124026
$$ packed form
12891G6938L3021M342j3146K2738j6862k2548j4755p790O291J1839J8225O881
12879A05174l2695n860k791L882J2336R908J2441J5942R658M398J40j2091l1522
12866H8920o609n234J8581K3749Q231K277k9218P568K3508l50l982k3476r630
12853I4335j3710j3497j2706R218J2593M650J311j7245q016J7388Q873j0070O746
12840G9870K430M187J1253r712M4423J4763m0948m416M091K1864J3079m0p359
12827A33485j8540o831J0407m331O778K7192k3565j4819k0782K0472p774J4242
12815A15934L7452N82j7957j5185K737q350L2536M754q693L295j1312l3100j7883
12802H4810j6610J9075K4457N214J4933m349K466j1896j2070j5742R29J3699J9110
$$ plain form
12789 124026 140324 163264 174155 171238 141306 123408 112053 129122 145660 156478 173548 167760
12777 167760 160476 180573 186970 185549 171921 184825 211637 218110 194109 189775 163142 178098
12765 178098 195378 179663 150599 143617 146917 165795 153231 169106 151738 154652 160615 148138
12753 148138 133595 146237 147299 149423 129801 147016 152389 154266 133985 137274 164457 157772 147351
12740 147351 146642 159974 187101 202912 199986 193037 164208 158917 196657 189617 198190 202818 191050
12727 191050 198767 196175 191764 166359 168339 155840 169246 180276 188077 193941 178282 163271 193762
12714 193762 213844 224573 252046 274781 303925 300850 335511 376497 406740 445151 482483 536918
12702 536918 595775 663520 771201 895719 970986 1012231 1083356 1141317 1185398 1175420 1125611
$$ packed form
12789A24026J6298K2940J0891k917k9932j7898j1355J7069J6538J0818J7070n788
12777A67760p284K0097O397j421j3628J2904K6812O473k4001m334k6633J4956
12765A78098J7280j5715k9064o982L300J8878j2564J5875j7368K914N963j2477
12753A48138j4543J2642J062K124j9622J7215N373J877k0281L289K7183o685j0421
12740A47351p09J3332K7127J5811k926o949k8829n291L7740p040Q573M628j1768
12727A91050P717k592m411k5405J980j2499J3406J1030P801N864j5659j5011L0491
12714A93762K0082J0729K7473K2735K9144l075L4661M0986L0243L8411L7332N4435
12702E36918N8857O7745J07681J24518P5267M1245P1125N7961M4081r978m9809
$$ plain form
12691 1125611 1051580 984871 946440 899678 874524 834566 783047 755990 736547 760880 786196
12680 786196 802318 822819 855453 841880 852058 884394 925142 949822 995793 1049784 1110103
12669 1110103 1144976 1175724 1211815 1249921 1283497 1338565 1393164 1429762 1447360 1438265 1433297 1435196
12657 1435196 1446788 1475652 1459672 1448218 1445197 1411393 1391134 1385062 1327584 1232386 1160284 1134654
12645 1134654 1089531 1058429 1017625 1001510 1010623 1027810 1047216 1046161 1069505 1103064 1120909 1128238
12633 1128238 1144650 1152703 1173303 1205179 1206398 1203166 1167834 1143626 1087370 1009835 959265 916165
12621 916165 853979 778174 704751 662211 615151 567165 538983 515769 504467 477485 449741
12610 449741 387050 366792 375222 359054 351120 329407 299929 299089 296897 274603 279581 268946 250942
$$ packed form
12691A125611p4031o6709l8431m6762k5154l9958n1519k7057j9443K4333K5316
12680G86196J6122K0501L2634j3573J0178L2336M0748K4680M5971N3991O0319
12669A110103L4873L0748L6091L8106L3576N5068N4599L6598J7598r095m968J899
12657A435196J1592K8864j5980j1454l021l3804k0259o072n7478r5198p2102k5630
12645A134654m5123l1102m0804j6115R113J7187J9406j055K3344L3559J7845P329
12633A128238J6412Q053K0600L1876J219l232l5332k4208n6256p7535n0570m3100
12621I16165o2186p5805p3423m2540m7060m7986k8182k3214j1302k6982k7744
12610D49741o2691k0258Q430j6168p934k1713k9478q40k192k2294M978j0635j8004
$$ plain form
12597 250942 246760 259252 261058 265322 283254 286471 305658 303664 271066 263233 264279 246170 224090
12584 224090 231207 258606 259128 251667 228700 201381 195402 192246 189278 202743 195325 228738 228179
12571 228179 241764 250863 229081 218704 192033 162626 153369 168037 176853 186959 205290 217260
12559 217260 244391 273532 277490 250628 267840 282378 270710 261068 238896 231910 215261 218492
12547 218492 240049 258556 259406 234969 243753 274512 237574 229774 235595 235465 227620 250145 253178
12534 253178 234916 233571 257218 294612 299362 286662 297021 298988 309592 321887 336045 339919
12522 339919 334642 349318 344804 353382 388952 413780 417697 421797 427978 409103 402466 418726 435769
12509 435769 430115 407402 385536 373918 407020 416705 411345 390594 403970 415502 438699 465949
$$ packed form
12597B50942m182J2492J806M264J7932L217J9187j994l2598p833J046j8109k2080
12584B24090P117K7399N22p461k2967k7319n979l156k968J3465p418L3413n59
12571B28179J3585R099k1782j0377k6671k9407r257J4668Q816J0106J8331J1970
12559B17260K7131K9141L958k6862J7212J4538j1668r642k2172o986j6649L231
12547B18492K1557J8507Q50k4437Q784L0759l6938p800N821j30p845K2525L033
12534B53178j8262j345K3647L7394M750j2700J0359J967J0604J2295J4158L874
12522C39919n277J4676m514Q578L5570K4828L917M100O181j8875o637J6260J7043
12509D35769n654k2713k1866j1618L3102R685n360k0751J3376J1532K3197K7250
$$ plain form
12497 465949 482137 513679 530433 525460 500068 500789 506347 516615 546745 562903 591711 618176
12485 618176 631929 631083 629566 638301 641178 605922 577985 566562 585031 595316 583022 572225
12473 572225 564606 535329 522822 524908 531883 525915 524621 536814 587921 602282 617873 616026 623622
12460 623622 638908 653847 631721 635040 653858 665427 683620 711101 706679 692707 706461 688577
12448 688577 696173 685785 701667 679439 656959 648231 650719 659472 649409 628495 612785 578576
12436 578576 563973 585587 574623 557371 548992 578397 603469 589617 580828 587356 586555 611764
12424 611764 646415 680195 720798 750181 755175 751399 742817 770936 770552 752844 746987 759185 788363
12411 788363 821638 856786 897285 916847 894014 889144 895056 893520 904373 908073 924298 947558
$$ packed form
12497D65949J6188L1542J6754m973k5392P21N558J0268L0130J6158K8808K6465
12485F18176J3753q46j517Q735K877l5256k7937j1423J8469J0285j2294j0797
12473E72225p619k9277j2507K086O975n968j294J2193N1107J4361J5591j847P596
12460F23622J5286J4939k2126L319J8818J1569J8193K7481m422j3972J3754j7884
12448F88577P596j0388J5882k2228k2480q728K488Q753j0063k0914j5710l4209
12436E78576j4603K1614j0964j7252q379K9405K5072j3852q789O528q01K5209
12424F11764L4651L3780M0603K9383M994l776q582K8119l84j7708n857J2198K9178
12411G88363L3275L5148M0499J9562k2833m870N912j536J0853L700J6225K3260
$$ plain form
12399 947558 986650 1015009 1030679 1024587 1050850 1115260 1150457 1160319 1194916 1198079 1194190 1231808
12387 1231808 1256779 1282923 1306691 1313355 1329070 1373723 1363257 1346905 1368041 1371620 1372107 1390452
12375 1390452 1415829 1422981 1405316 1396700 1397921 1404682 1417294 1451517 1477993 1509725 1535909 1576489
12363 1576489 1626808 1674004 1691897 1735774 1774341 1810991 1876464 1948959 2020723 2057529 2066992
12352 2066992 2105779 2170485 2222699 2244539 2271113 2354098 2406607 2433607 2488555 2556772 2633773
12341 2633773 2710627 2766311 2834647 2876988 2918812 2973830 3020163 3092241 3129816 3156856 3203377
12330 3203377 3244680 3296376 3338656 3348016 3362780 3427444 3485532 3515368 3588726 3679300 3760093
12319 3760093 3871105 3975789 4080438 4196301 4350249 4487040 4615680 4780613 4936681
$$ packed form
12399I47558L9092K8359J5670o092K6263O4410L5197R862L4597L163l889L7618
12387A231808K4971K6144K3768O664J5715M4653j0466j6352K1136L579M87J8345
12375A390452K5377P152j7665q616J221O761J2612L4223K6476L1732K6184M0580
12363A576489N0319M7196J7893M3877L8567L6650O5473P2495P1764L6806R463
12352B066992L8787O4706N2214K1840K6574Q2985N2509K7000N4948O8217P7001
12341B633773P6854N5684O8336M2341M1824N5018M6333P2078L7575K7040M6521
12330C203377M1303N1696M2280R360J4764O4664N8088K9836P3358R0574Q0793
12319C760093J11012J04684J04649J15863J53948J36791J28640J64933J56068
$$ plain form
12310 4936681 5099357 5280284 5464249 5665524 5879252 6111731 6347429 6599545 6840324
12301 6840324 7081191 7365240 7682037 7990376 8314996 8684374 9116926 9586057 10146967
12292 10146967 10798829 11503511 12264791 13146814 14208153 15397526 16741766 18278893 19983484
12283 19983484 21931641 24123868 26655248 29529731 32727018 36322905 40418082 45304148
12275 45304148 51227591 58554277 67791672 79333695 93301581 109224480 126064513
12268 126064513 142603351 157631592 170279564 179812129 185560620 186992308 184154572
12261 184154572 177888122 169716988 161296949 153630389 146932498 141097141 136078556 131955858
12253 131955858 128883913 127020363 126355054 126765247 128067405 130271063 133477507 137790977
$$ packed form
12310D936681J62676J80927J83965K01275K13728K32479K35698K52116K40779
12301F840324K40867K84049L16797L08339L24620L69378M32552M69131N60910
12292A0146967O51862P04682P61280Q82023J061339J189373J344240J537127J704591
12283A9983484J948157K192227K531380K874483L197287L595887M095177M886066
12275D5304148N923443P326686R237395J1542023J3967886J5922899J6840033
12268A26064513J6538838J5028241J2647972R532565N748491J431688k837736
12261A84154572o266450q171134q420039p666560o697891n835357n018585m122698
12253A31955858l071945j863550o65309M10193J302158K203658L206444M313470
$$ plain form
12245 137790977 143240539 149821159 157357682 165610793 174348756 183374919 192509047 201482523
12237 201482523 209968030 217749493 224731669 230932764 236403585 241143941 245176186 248409337
12229 248409337 250668494 251739317 251585479 250174280 247509260 243635130 238738622 233255663
12221 233255663 227475260 221632543 215894963 210416131 205369892 201030874 197474695 194639869
12213 194639869 192420515 190675882 189304946 188269912 187663177 187602709 187971007 188604822 189270574
12204 189270574 189847745 190259591 190327026 189887292 188801363 186843785 183567232 178479182 171340460
12195 171340460 162460095 152489983 141900648 130865696 119497425 108305135 97960257
12188 97960257 88976088 81454289 75240404 70015499 65589745 61749066 58365695 55335169
$$ packed form
12245A37790977N449562O580620P536523Q253111Q737963R026163R134128Q973476
12237B01482523Q485507P781463O982176O201095N470821M740356M032245L233151
12229B48409337K259157J070823j53838j411199k665020l874130m896508n482959
12221B33255663n780403n842717n737580n478832n046239m339018l556179k834826
12213A94639869k219354j744633j370936j035034o06735o0468L68298O33815O65752
12204A89270574N77171M11846O7435m39734j085929j957578l276553n088050p138722
12195A71340460q880365r970112j0589335j1034952j1368271j1192290j0344878
12188I7960257q984169p521799o213885n224905m425754l840679l383371l030526
$$ plain form
12180 55335169 52598347 50129904 47843404 45747197 43803555 41988151 40263292 38640550
12172 38640550 37070918 35577562 34125409 32731431 31408942 30131945 28882786 27662445
12164 27662445 26500740 25362770 24272189 23257228 22284252 21379927 20554705 19758774 18994594
12155 18994594 18289795 17649372 17044103 16474879 15924969 15412053 14918725 14447119 14003991
12146 14003991 13577094 13177056 12789603 12373805 11970056 11584434 11211688 10871953 10515278
12137 10515278 10161974 9828639 9559876 9273700 8932372 8568734 8294075 8042877 7787612
12128 7787612 7547590 7294953 7075594 6879361 6678111 6466183 6235540 6008443 5795699
12119 5795699 5634409 5483155 5320719 5152775 5011396 4872480 4700854 4583167 4491933 4364104
$$ packed form
12180E5335169k736822k468443k286500k096207j943642j815404j724859j622742
12172C8640550j569632j493356j452153j393978j322489j276997j249159j220341
12164B7662445j161705j137970j090581j014961r72976r04325q25222p95931p64180
12155A8994594p04799o40423o05269n69224n49910n12916m93328m71606m43128
12146A4003991m26897m00038l87453m15798m03749l85622l72746l39735l56675
12137A0515278l53304l33335k68763k86176l41328l63638k74659k51198k55265
12128G787612k40022k52637k19359j96233k01250k11928k30643k27097k12744
12119E795699j61290j51254j62436j67944j41379j38916j71626j17687r1234j27829
$$ plain form
12109 4364104 4259406 4149255 4005726 3897198 3778443 3693566 3591359 3470548 3365943 3290347
12099 3290347 3201606 3093890 3012464 2933086 2819867 2693454 2618748 2561525 2485930 2433007 2393516
12088 2393516 2366208 2316804 2273122 2213563 2175281 2127007 2085134 2053595 2027932 1992139 1973725
12077 1973725 1948448 1918551 1920819 1920996 1907958 1867369 1837209 1852069 1813145 1766912 1718237 1678602
12065 1678602 1717585 1703582 1673483 1671642 1634444 1604504 1571694 1533634 1537200 1524769 1485930 1472803
12053 1472803 1452507 1438985 1409757 1415993 1414316 1402607 1390527 1367729 1330109 1327988 1345298 1305278
12041 1305278 1251156 1219314 1204283 1205227 1208228 1212641 1176039 1142537 1113397 1114070 1101824 1085662
12029 1085662 1059227 1016320 1004823 998166 989559 983343 968261 976974 985069 964614 962119 954385 923269
$$ packed form
12109D364104j04698j10151j43529j08528j18755q4877j02207j20811j04605p5596
12099C290347q8741j07716q1426p9378j13219j26413p4706n7223p5595n2923l9491
12088B393516k7308m9404m3682n9559l8282m8274m1873l1539k5663l5793j8414
12077A973725k5277k9897K268J77j3038m0589l0160J4860l8924m6233m8675l9635
12065A678602L8983j4003l0099j841l7198k9940l2810l8060L566j2431l8839j3127
12053A472803k0296j3522k9228O236j677j1709j2080k2798l7620k121J7310m0020
12041A305278n4122l1842j5031R44L001M413l6602l3502k9140O73j2246j6162
12029A085662k6435m2907j1497o657q607o216j5082Q713Q095k0455k495p734l1116
$$ plain form
12016 923269 891771 890061 881504 885838 888392 885112 866011 857050 833503 813923 798820 795168 809909
12003 809909 788576 747818 746045 772675 752439 741418 741403 754518 745402 720177 714601 679665 649350
11990 649350 595601 599145 614674 633044 635134 603484 591132 554205 555701 570353 574292 558497
11978 558497 529374 486348 446809 432926 437192 455184 435608 408407 415248 446865 428868 406532
11966 406532 404369 410767 415815 405172 395067 385348 382132 361217 337529 326698 315802 335981
11954 335981 374681 382751 395905 376061 354774 376624 379382 363113 375412 361077 345350 355157
11942 355157 371348 350244 351427 362144 377036 374955 381551 382586 393482 403769 407354 421476
11930 421476 403378 419328 449244 435257 426634 449391 498328 520902 548432 599125 629851 661296
$$ packed form
12016I23269l1498j710q557M334K554l280j9101q961k3547j9580j5103l652J4741
12003H09909k1333m0758j773K6630k0236j1021j5J3115r116k5225n576l4936l0315
11990F49350n3749L544J5529J8370K090l1650j2352l6927J496J4652L939j5795
11978E58497k9123m3026l9539j3883M266J7992j9576k7201O841L1617j7997k2336
11966D06532k163O398N048j0643j0105r719l216k0915k3688j0831j0896K0179
11954C35981L8700Q070J3154j9844k1287K1850K758j6269J2299j4335j5727R807
11942C55157J6191k1104J183J0717J4892k081O596J035J0896J0287L585J4122
11930D21476j8098J5950K9916j3987q623K2757M8937K2574K7530N0693L0726L1445
$$ plain form
11918 661296 681111 704617 741612 768137 788785 841087 882613 932214 1022603 1083361 1144269
11907 1144269 1233262 1301753 1343216 1448971 1552601 1601177 1659746 1728814 1770199 1821433 1865928
11896 1865928 1932855 1993259 2005443 2000435 1983991 1991279 2006926 1993059 1989998 1998069 2028540 2039231
11884 2039231 2063017 2076561 2091643 2113165 2164771 2199090 2250493 2335462 2389167 2429176 2458560
11873 2458560 2518677 2574647 2640513 2699025 2736559 2784409 2854128 2896968 2938803 2943416 2953086 2996145
11861 2996145 3039036 3049301 3062934 3084683 3059287 3039512 3027276 3017216 3023676 3015733 3016554 3018517
11849 3018517 2993137 2968944 2933050 2895939 2864193 2855339 2863732 2864402 2881106 2869860 2882235 2890976
11837 2890976 2906474 2934940 2991753 3043425 3078893 3113663 3138172 3199010 3216459 3237340 3233523
$$ packed form
11918F61296J9815K3506L6995K6525K0648N2302M1526M9601R0389O0758O0908
11907A144269Q8993O8491M1463J05755J03630M8576N8569O9068M1385N1234M4495
11896A865928O6927O0404J2184n008j6444P288J5647j3867l061Q071L0471J0691
11884B039231K3786J3544J5082K1522N1606L4319N1403Q4969N3705M0009K9384
11873B458560O0117N5970O5866N8512L7534M7850O9719M2840M1835M613R670M3059
11861B996145M2891J0265J3633K1749k5396j9775j2236j0060O460p943Q21J963
11849C018517k5380k4193l5894l7111l1746q854Q393O70J6704j1246J2375Q741
11837B890976J5498K8466N6813N1672L5468L4770K4509O0838J7449K0881l817
$$ plain form
11826 3233523 3184300 3116923 3058094 2993474 2911294 2850724 2784655 2672871 2589306 2511998 2467298
11815 2467298 2405947 2338424 2270410 2256030 2246146 2187687 2157464 2162534 2169111 2180575 2180685 2194360
11803 2194360 2217027 2208137 2204939 2200463 2194897 2221989 2221959 2239059 2270831 2292320 2291025 2298807 2295651
11790 2295651 2273424 2278490 2245941 2204528 2192581 2164668 2111046 2068563 2060453 2011381 1956555 1927286
11778 1927286 1879057 1840408 1792638 1747487 1721359 1717202 1689774 1643344 1600785 1586851 1571254
11767 1571254 1533667 1465524 1424077 1410985 1371948 1344839 1332951 1293645 1250391 1213661 1167361
11756 1167361 1104574 1041465 983827 911768 847582 820963 806582 773810 712482 696844 682170
11745 682170 661494 654201 639123 618088 572350 549255 555364 535104 541533 523098 518590 523070
$$ packed form
11826C233523m9223o7377n8829o4620q2180o0570o6069j11784q3565p7308m4700
11815B467298o1351o7523o8014j4380r884n8459l0223N070O577J1464J10J3675
11803B194360K2667q890l198m476n566K7092l0J7100L1772K1489j295P782l156
11790B295651k2227N066l2549m1413j1947k7913n3622m2483q110m9072n4826k9269
11778A927286m8229l8649m7770m5151k6128m157k7428m6430m2559j3934j5597
11767A571254l7587o8143m1447j3092l9037k7109j1888l9306m3254l6730m6300
11756A167361o2787o3109n7638p2059o4186k6619j4381l2772o1328j5638j4674
11745F82170k0676p293j5078k1035m5738k3095O109k0260O429j8435m508M480
$$ plain form
11733 523070 516329 468369 430115 406222 419647 397550 349350 342545 347204 361602 341104 321962
11721 321962 318740 312085 307604 280802 256511 262922 249801 268976 295942 264984 229373 217270
11709 217270 220588 186617 180123 197988 204399 179736 162988 163475 199947 227203 237853 216307
11697 216307 194732 171215 163074 174607 138576 114221 114551 125719 139324 152130 144193 121633
11685 121633 138383 173385 182520 152564 125509 80458 103617 135430 104250 95129 112859 128494
11673 128494 129388 105525 75551 28607 29003 25810 55451 88929 100210 88287 72615 46820
11661 46820 14153 23159 50498 34273 43820 79787 79762 44593 36471 45340 31457 19106 29263
11648 29263 24450 33003 34217 42917 38883 32018 40193 49106 32603 17566 12219 8224 12172 25985
$$ packed form
11733E23070o741m7960l8254k3893J3425k2097m8200o805M659J4398k0498j9142
11721C21962l222o655m481k6802k4291O411j3121J9175K6966l0958l5611j2103
11709B17270L318l3971o494J7865O411k4663j6748M87L6472K7256J0650k1546
11697B16307k1575k3517q141J1533l6031k4355L30J1168J3605J2806p937k2560
11685A21633J6750L5002R135k9956k7055m5051K3159L1813l1180r121J7730J5635
11673A28494Q94k3863k9974m6944L96l193K9641L3478J1281j1923j5672k5795
11661D6820l2667R006K7339j6225R547L5967k5l5169q122Q869j3883j2351J0157
11648B9263m813Q553J214Q700m034o865Q175Q913j6503j5037n347l995L948J3813
$$ plain form
11634 25985 38547 34930 50504 76963 72844 54186 59753 78668 62219 31847 41028 57395
11622 57395 32206 16478 25811 41953 30961 37474 29805 31983 45346 45033 28727 39425 3118
11609 3118 -9613 9593 -2243 -9947 -12525 -27651 2493 34246 51033 46453 37205 37008 21036
11596 21036 13974 25579 37973 42508 40737 38291 38793 71006 68800 61448 59300 88870 85359 48946
11582 48946 34380 65507 73699 74073 57021 42218 17552 10961 25390 20163 31928 27404 8051
11569 8051 28237 41291 42237 34833 29913 -9031 -29600 -27449 -9674 30193 13622 30783 45566
11556 45566 45734 56819 38476 4839 -26782 -28657 -44779 -24508 -8518 9603 39228 47059
11544 47059 43380 52844 68172 56404 31815 1599 -11211 -5596 5279 -6225 -12393 -14771 9299
$$ packed form
11634B5985J2562l617J5574K6459m119j8658N567J8915j6449l0372R181J6367
11622E7395k5189j5728R333J6142j0992O513p669K178J3363l13j6306J0698l6307
11609C118j2731J9206j1836p704k578j5126L0144L1753J6787m580r248j97j5972
11596B1036p062J1605J2394M535j771k446N02L2213k206p352k148K9570l511l6413
11582D8946j4566L1127Q192L74j7052j4803k4666o591J4429n227J1765m524j9353
11569H051K0186J3054R46p404m920l8944k0569K151J7775L9867j6571J7161J4783
11556D5566J68J1085j8343l3637l1621j875j6122K0271J5990J8121K9625P831
11544D7059l679R464J5328j1768k4589l0216j2810N615J0875j1504o168k378K4070
$$ plain form
11531 9299 45543 30855 10646 30681 16715 16558 30164 30067 38479 29452 51673 52037 17564 -30968
11517 -30968 -47231 -25731 -1868 -4960 4638 44711 29717 41356 46900 46922 38416 3051 -3191
11504 -3191 5000 24836 37399 32570 17211 -3498 3526 26060 21840 2583 -3139 1884 27826
11491 27826 30678 17409 12684 25812 32282 3558 -11811 -22438 -1897 9096 44665 39688
11479 39688 24031 8169 -1425 15596 11347 2544 19127 7013 -13668 -4029 9029 -27901
11467 -27901 -23466 11744 2700 -4702 6344 -19141 -22003 4505 24571 20760 7125 10202 30577
11454 30577 26974 6603 -10582 -25381 -30699 -35278 -48185 -25019 14361 10712 89 628 -4764
11441 -4764 -6103 23171 29839 41529 39767 31730 27929 15638 7014 -2127 -14094 3798 26097
$$ packed form
11531I299L6244j4688k0209K0035j3966j57J3606r7Q412r027K2221L64l4473m8532
11517c0968j6263K1500K3863l092R598M0073j4994J1639N544K2q506l5365o242
11504c191Q191J9836J2563m829j5359k0709P024K2534m220j9257n722N023K5942
11491B7826K852j3269m725J3128O470k8724j5369j0627K0541J0993L5569m977
11479C9688j5657j5862r594J7021m249q803J6583j2114k0681R639J3058l6930
11467b7901M435L5210r044p402J1046k5485k862K6508K0066l811j3635L077K0375
11454C0577l603k0371j7185j4799n318m579j2907K3166L9380l649j0623N39n392
11441d764j339K9274O668J1690j762q037l801j2291q624r141j1967J7892K2299
$$ plain form
11428 26097 15713 13826 -10600 -29533 -14802 9822 23880 10365 -3685 3390 -949 11923
11416 11923 31444 44877 29749 38239 33090 46505 48926 53878 40855 17943 37505 50681
11404 50681 41263 25835 -6159 -17002 3071 16505 31098 64924 72888 40682 21924 -1884
11392 -1884 3668 7872 -3622 996 -13249 -34502 -27652 -11442 -13612 -43209 -32837 -9809 17710
11379 17710 6601 -3799 16328 18232 20226 -2213 -24331 -6460 9841 16218 12728 925
11367 925 -4627 -8001 -6776 7189 934 351 -4089 9027 -1315 1580 -24128 -47742 -25502 -10823
11353 -10823 -4620 4719 15124 47504 56159 24123 32023 18643 1033 8258 -4134 -22210 -31505
11340 -31505 -21362 -9356 6394 -8851 -2767 -13452 -20068 -6732 10377 -15855 -27667 -29669
$$ packed form
11428B6097j0384j887k4426j8933J4731K4624J4058j3515j4050P075m339J2872
11416A1923J9521J3433j5128Q490n149J3415K421M952j3023k2912J9562J3176
11404E0681r418j5428l1994j0843K0073J3434J4593L3826P964l2206j8758k3808
11392a884N552M204j1494M618j4245k1253O850J6210k170k9597J0372K3028K7519
11379A7710j1109j0400K0127J904J994k2439k2118J7871J6301O377l490j1803
11367I25n552l374J225J3965o255n83m440J3116j0342K895k5708k3614K2240J4679
11353a0823O203R339J0405L2380Q655l2036P900j3380j7610P225j2392j8076r295
11340c1505J0143J2006J5750j5245O084j0685o616J3336J7109k6232j1812k002
$$ plain form
11328 -29669 -36891 -31172 23911 65247 98590 110870 130183 134091 128198 123368 125673 92267 67586
11315 67586 57124 37975 19906 11725 24257 19599 19066 -7696 -25637 -2965 14276 19659 41
11302 41 -9788 9933 -12106 -38087 -72138 -87232 -81105 -70864 -42476 -13058 -23389 -39768 -35497
11289 -35497 -30785 -52035 -49358 -44569 -37302 -63963 -54062 -30218 3534 14462 16581 2677 -24978
11276 -24978 -14698 -1241 -33529 -68917 -26463 13468 28786 25058 11249 -23528 -28533 -33351
11264 -33351 -24476 -24337 -28635 -50085 -64618 -36709 -25159 -9479 -6107 -30092 -34127 -23203 -27186
11251 -27186 -10173 -7562 23666 36121 43855 38410 34970 22430 18452 -3267 -21284 -43277 -56342
11238 -56342 -46959 -40426 -43017 -53851 -57232 -72849 -60361 -34064 -14536 -5088 1038 -30221 -5963
$$ packed form
11328b9669p222N719N5083M1336L3343J2280J9313L908n893m830K305l3406k4681
11315F7586j0462j9149j8069q181J2532m658n33k6762j7941K2672J7241N383j9618
11302D1r829J9721k2039k5981l4051j5094O127J0241K8388K9418j0331j6379M271
11289c5497M712k1250K677M789P267k6661R901K3844L3752J0928K119j3904k7655
11276b4978J0280J3457l2288l5388M2454L9931J5318l728j3809l4777n005m818
11264c3351Q875J39m298k1450j4533K7909J1550J5680L372k3985m035J0924l983
11251b7186J7013K611L1228J2455P734n445l440j2540l978k1719j8017k1993j3065
11238e6342R383O533k591j0834l381j5617J2488K6297J9528R448O126l1259K4258
$$ plain form
11225 -5963 14756 29272 13799 24452 11583 26332 9392 -27475 -31836 -10908 -27673 -22888
11213 -22888 -8901 5864 9103 23879 9825 -15137 -22295 -10860 -10628 -7084 -20841 -6964 -2218
11200 -2218 -7313 -4237 9688 6916 -7871 11784 277 -31236 -27662 -17478 -21781 -13253 -4838
11187 -4838 -1726 14438 19929 21130 30697 18210 12002 3304 5801 3190 34027 56090 47886 52481
11173 52481 35158 23079 33974 26208 24816 29690 1918 -8031 -4152 -7469 -22238 2894 21090
11160 21090 39457 41582 26445 14008 -2846 5088 12687 -3889 -17213 -41385 -6038 4431
11148 4431 14890 18437 18970 5402 11989 26798 15252 8696 2718 -9491 -9407 -13267 -37523 -40217
11134 -40217 -9408 -32682 -62238 -37222 9620 25527 8170 1896 23764 8834 8675 28719
$$ packed form
11225e963K0719J4516j5473J0653j2869J4749j6940l6867m361K0928j6765M785
11213b2888J3987J4765L239J4776j4054k4962p158J1435K32L544j3757J3877M746
11200b218n095L076J3925k772j4787J9655j1507l1513L574J0184m303Q528Q415
11187d838L112J6164N491J201R567j2487o208q698K497k611L0837K2063q204M595
11173E2481j7323j2079J0895p766j392M874k7772r949L879l317j4769K5132J8196
11160B1090J8367K125j5137j2437j6854P934P599j6576j3324k4172L5347J0469
11148D431J0459L547N33j3568O587J4809j1546o556n978j2209Q4l860k4256k694
11134d0217L0809k3274k9556K5016M6842J5907j7357o274K1868j4930j59K0044
$$ plain form
11122 28719 8333 -9996 -2864 -7730 2135 6099 7550 9203 16946 6180 -2579 5132 27379
11109 27379 9525 -10199 -313 30 7293 -165 -4831 6968 8523 21737 24311 25765 -8552
11096 -8552 -20689 8345 23470 28275 20927 19583 14527 14040 26414 57563 53535 45639 59124
11083 59124 49304 49827 26634 35319 22878 39270 63268 67700 73408 80924 111556 184598 236234
11070 236234 312505 355908 389428 377748 342153 291596 234812 180614 120189 112019 95153 66642
11058 66642 74717 77953 69072 63737 41842 17418 26436 36537 56483 85442 70957 52048 36947
11045 36947 36900 49823 62028 42344 9268 -11008 13128 43194 53148 55056 52534 70537 75244
11032 75244 70702 45395 35808 55127 31593 24047 66548 123025 115865 103941 104927 82471 53836
$$ packed form
11122B8719k0386j8329P132m866R865L964J451J653P743j0766q759P711K2247
11109B7379j7854j9724R886L43P263p458m666J1799J555J3214K574J454l4317
11096h552j2137K9034J5125M805p348j344n056m87J2374L1149m028p896J3485
11083E9124r820N23k3193Q685j2441J6392K3998M432N708P516L0632P3042N1636
11070B36234P6271M3403L3520j1680l5595n0557n6784n4198o0425q170j6866k8511
11058F6642Q075L236q881n335k1895k4424R018J0101J9946K8959j4485j8909j5101
11045C6947m7J2923J2205j9684l3076k0276K4136L0066R954J908k522J8003M707
11032G5244m542k5307r587J9319k3534p546M2501N6477p160j1924R86k2456k8635
$$ plain form
11019 53836 52679 50771 69327 102462 108209 76467 79390 122396 140049 128419 127775 136144 118240
11006 118240 94798 88522 106772 109651 100032 72344 58907 55583 66608 73925 71790 80104 83855
10993 83855 94826 94399 109684 143712 144521 94235 79000 67784 76014 84170 85907 92764 93429 107123
10979 107123 122291 116339 71420 56914 75147 80466 77513 80670 68613 37344 28018 35686 30303
10966 30303 14961 12746 33305 31294 5966 8521 26947 31896 16427 48558 43272 30692 30219
10953 30219 5995 5649 26403 59951 63118 71516 53891 44831 47190 35732 32648 31482 27500
10940 27500 15095 28440 45828 36058 33631 49270 42430 33020 59875 70346 50148 18196
10928 18196 -4852 -65 15103 26927 12837 15626 806 -28840 -25091 4084 15583 31664
$$ packed form
11019E3836j157j908J8556L3135N747l1742K923M3006J7653j1630o44Q369j7904
11006A18240k3442o276J8250K879r619k7688j3437l324J1025P317k135Q314L751
10993H3855J0971m27J5285L4028Q09n0286j5235j1216Q230Q156J737O857O65J3694
10979A07123J5168n952m4919j4506J8233N319k953L157j2057l1269r326P668n383
10966C0303j5342k215K0559k011k5328K555J8426M949j5469L2131n286j2580m73
10953C0219k4224l46K0754L3548L167Q398j7625r060K359j1458l084j166l982
10940B7500j2405J3345J7388r770k427J5639o840r410K6855J0471k0198l1952
10928A8196k3048M787J5168J1824j4090K789j4820k9646L749K9175J1499J6081
$$ plain form
10916 31664 49747 39813 29628 22367 32713 21659 3753 5463 24252 30072 18375 -4185
10904 -4185 -20593 -7278 19754 43316 56303 29539 7258 5124 7051 18684 44344 33573
10892 33573 22205 27993 22280 26755 25048 23214 4102 12995 4085 -702 -6639 -7704 -17654 -10188
10878 -10188 -14459 -25624 -6796 11117 -3877 -8944 -17130 -28807 -19061 726 51202 66194
10866 66194 53467 60289 54008 30727 5339 33043 45965 26413 5347 20215 27226 13570
10854 13570 -7334 -10255 -26758 -19864 9581 33783 14442 12561 33607 13790 25541 41994
10842 41994 41249 33028 35024 31668 42767 36193 30834 44044 52364 62923 57882 42172 31931
10829 31931 37116 47665 61127 49664 37562 19577 40169 28463 11231 14655 31489 31395 43072
$$ packed form
10916C1664J8083r934j0185p261J0346j1054j7906J710J8789N820j1697k2560
10904d185j6408J3315K7032K3562J2987k6764k2281k134J927J1633K5660j0771
10892C3573j1368N788n713M475j707j834j9112Q893q910m787n937j065r950P466
10878a0188m271j1165J8828J7913j4994n067q186j1677R746J9787N0476J4992
10866F6194j2727O822o281k3281k5388K7704J2922j9552k1066J4868P011j3656
10854A3570k0904k921j6503O894K9445K4202j9341j881K1046j9817J1751J6453
10842D1994p45q221J996l356J1099o574n359J3210Q320J0559n041j5710j0241
10829C1931N185J0549J3462j1463j2102j7985K0592j1706j7232L424J6834r4J1677
$$ plain form
10816 43072 42136 17582 -11538 1080 12233 25456 7635 -4255 -6124 10127 -16525 -27808
10804 -27808 -27650 -29519 -32848 -27071 12476 25235 32274 12354 -422 -13346 -27689 -41535 -21948
10791 -21948 -9421 -907 5877 18730 40079 22838 6973 3249 30549 7843 -9948 7816
10779 7816 11898 13892 7573 -3974 10996 13284 31399 41409 41481 37587 22449 46138 53823 60881
10765 60881 41135 51797 57358 65428 67940 66432 73316 65797 56622 38781 42310 55075 49856
10752 49856 25041 28735 52254 68509 63882 64359 71913 84178 118431 110715 110626 93232 93368 123050
10738 123050 155992 155527 164715 180700 225397 307728 435587 566699 657238 660894 648787 672993
10726 672993 672874 557751 395357 294553 224249 198466 182587 172547 158759 134519 119757
$$ packed form
10816D3072r36k4554k9120J2618J1153J3223j7821j1890j869J6251k6652j1283
10804b7808J58j869l329N777L9547J2759P039j9920j2776j2924j4343j3846J9587
10791b1948J2527Q514O784J2853K1349j7241j5865l724K7300k2706j7791J7764
10779G816M082J994o319j1547J4970K288J8115J0010P2l894j5138K3689P685P058
10765F0881j9746J0662N561Q070K512j508O884p519r175j7841L529J2765n219
10752D9856k4815L694K3519J6255m627M77P554J2265L4253p716q9j7394J36K9682
10738A23050L2942m65R188J5985M4697Q2331J27859J31112R0539L656j2107K4206
10726F72993j19j15123j62394j00804p0304k5783j5879j0040j3788k4240j4762
$$ plain form
10715 119757 91801 95279 87133 80318 64674 63642 90413 76057 41543 44247 51362 53458 61208
10702 61208 61340 42449 38782 15159 -6690 14588 52935 74911 45068 31309 33056 32773 18098
10689 18098 33237 41456 41878 45820 75710 62687 2392 -14272 15915 37550 61007 40333
10677 40333 18142 5897 37986 64971 85597 76318 82732 81156 67293 68044 80987 83304 102297
10664 102297 90237 72944 64900 52126 52292 77166 73804 37846 28956 23690 5070 5881 16915
10651 16915 37179 40029 26286 22851 38111 58649 54969 45920 45528 50536 63085 63985 78827
10638 78827 88837 91356 82694 47900 49614 81634 90393 87745 101976 87524 73676 81933 85867
10625 85867 61035 40955 57042 67794 50300 20840 20279 47480 63696 59825 34096 22763
$$ packed form
10715A19757k7956L478q146o815j5644j032K6771j4356l4514K704P115K096P750
10702F1208J32j8891l667k3623k1849K1278L8347K1976k9843j3759J747k83j4675
10689A8098J5139Q219M22L942K9890j3023o0295j6664L0187K1635K3457k0674
10677D0333k2191j2245L2089K6985K0626r279O414j576j3863P51J2943K317J8993
10664A02297j2060j7293q044j2774J66K4874l362l5958q890n266j8620Q11J1034
10651A6915K0264K850j3743l435J5260K0538l680r049l92N008J2549R00J4842
10638G8827J0010K519q662l4794J714L2020Q759k648J4231j4452j3848Q257L934
10625H5867k4832k0080J6087J0752j7494k9460n61K7201J6216l871k5729j1333
$$ plain form
10613 22763 15491 -10097 -7554 7307 -8036 6753 3142 -21226 -7720 14232 17901 57488
10601 57488 56693 48346 35677 41206 54920 49951 28948 31523 62647 46883 55535 81132 43296
10588 43296 26105 10809 15404 25146 5634 3512 -73 17936 21542 43013 37667 24695 43403
10575 43403 18981 22906 17358 13636 9442 3674 13652 29984 32815 31741 35366 38129 54111 62042
10561 62042 66188 52991 39513 33169 13342 38995 57754 60934 74738 79346 62400 27526
10549 27526 12127 49483 57696 52498 88366 96921 79140 45777 39831 23334 46639 88414
10537 88414 74136 92854 88468 63495 84269 94847 84257 70048 80049 81965 76489 63455
10525 63455 51014 92006 94968 88623 83321 91987 117606 125380 111673 95136 81997 56534 30832
$$ packed form
10613B2763p272k5588K543J4861j5343J4789l611k4368J3506K1952L669L9587
10601E7488p95q347j2669N529J3714m969k1003K575L1124j5764Q652K5597l7836
10588D3296j7191j5296M595R742j9512k122l585J8009L606K1471n346j2972J8708
10575D3403k4422L925n548l722m194n768R978J6332K831j074L625K763J5982P931
10561F2042M146j3197j3478o344j9827K5653J8759L180J3804M608j6946l4874
10549B7526j5399L7356Q213n198L5868Q555j7781l3363n946j6497K3305M1775
10537H8414j4278J8718m386k4973K0774J0578j0590j4209J0001J916n476j3034
10525F3455j2441M0992K962o345n302Q666K5619P774j3707j6537j3139k5463k5702
$$ plain form
10512 30832 14048 12233 30524 48857 52988 37048 34625 45916 39442 52412 78205 74570 55013
10499 55013 30155 43791 63245 69718 57817 68038 50834 44061 64157 94674 89972 50794
10487 50794 26184 32872 62623 85658 91287 115888 142847 134912 145141 138512 147023 125537 119484
10474 119484 104148 74305 90348 94624 96401 91680 95990 91680 88978 91160 123809 129019 128752
10461 128752 129564 125786 99649 104129 119993 83894 89592 115941 118309 127614 142087 159884 145569
10448 145569 129015 133553 151386 175952 169102 169717 176543 151130 185198 195594 155676 144034
10436 144034 148526 161157 165266 176368 149337 147602 174745 198159 221060 256047 304670 353870
10424 353870 357970 350596 360094 356483 357998 338611 313863 311891 337581 337720 334815 324042 314154
$$ packed form
10512C0832j6784j815J8291J8333M131j5940k423J1291o474J2970K5793l635j9557
10499E5013k4858J3636J9454O473j1901J0221j7204o773K0096L0517m702l9178
10487E0794k4610O688K9751K3035N629K4601K6959p935J0229o629Q511k1486o053
10474A19484j5336k9843J6043M276J777m721M310m310k702K182L2649N210k67
10461A28752Q12l778k6137M480J5864l6099N698K6349K368R305J4473J7797j4315
10448A45569j6554M538J7833K4566o850O15O826k5413L4068J0396l9918j1642
10436A44034M492J2631M109J1102k7031j735K7143K3414K2901L4987M8623M9200
10424C53870M100p374R498l611J515j9387k4748j972K5690J39k905j0773r888
$$ plain form
10411 314154 326612 312033 298342 291650 284294 284474 285626 275629 277091 275108 289374 327799 354957
10398 354957 366276 333718 314137 330990 367578 382785 376297 371530 368899 343424 348633 388705
10386 388705 414875 383765 380230 378299 375133 385676 349073 318912 310118 294865 276700 285574
10374 285574 286762 282319 272071 279131 273979 265609 267996 257642 247763 244180 274448 285925 292811
10361 292811 318902 317986 314932 320690 322069 337139 322575 308612 302124 309546 306033 269847 250295
10348 250295 274139 252406 247209 251957 233908 233312 211431 197318 183352 196758 203689 193177
10336 193177 191081 181777 205757 202979 191970 190889 218690 205226 192000 172436 158034 143895
10324 143895 125770 104769 116455 124508 128382 138164 140303 132013 131316 138502 140091 113379 94860
$$ packed form
10411C14154J2458j4579j3691o692p356J80J152r997J462j983J4266L8425K7158
10398C54957J1319l2558j9581J6853L6588J5207o488m767k631k5475N209M0072
10386C88705K6170l1110l535j931l166J0543l6603l0161q794j5253j8165Q874
10374B85574J188m443j0248P060n152q370K387j0354r879l583L0268J1477O886
10361B92811K6091r16l054N758J379J5070j4564j3963o488P422l513l6186j9552
10348B50295K3844k1733n197M748j8049n96k1881j4113j3966J3406O931j0512
10336A93177k096r304K3980k778j1009j081K7801j3464j3226j9564j4402j4139
10324A43895j8125k1001J1686Q053L874R782K139q290o97P186J589k6712j8519
$$ plain form
10311 94860 109458 100859 77037 80346 88335 85589 111290 140865 144756 138875 131785 117105 96294
10298 96294 84394 107323 101448 76919 63806 71821 102717 130054 100319 72801 47575 49943
10286 49943 44313 48683 107818 141659 120402 101812 93202 98492 96095 97966 119578 111855 94430
10273 94430 101597 109230 99804 60459 33885 49650 79880 91503 81265 86263 75267 73840 66558
10260 66558 37783 24684 45705 55522 58715 84789 98002 98321 75878 55532 48967 54663 51853
10247 51853 82812 94517 83237 80689 77779 84019 82180 51527 53781 104396 99797 70305 50190
10234 50190 49365 29702 54560 57604 63962 68938 94044 118191 122326 93576 98451 116576 92976
10221 92976 66371 60716 64941 42116 47671 63584 47233 58090 46317 48202 75424 91604
$$ packed form
10311I4860J4598q599k3822L309P989k746K5701K9575L891n881p090j4680k0811
10298I6294j1900K2929n875k4529j3113Q015L0896K7337k9735k7518k5226K368
10286D9943n630M370N9135L3841k1257j8590q610N290k397J871K1612p723j7425
10273I4430P167P633r426l9345k6574J5765L0230J1623j0238M998j0996j427p282
10260F6558k8775j3099K1021R817L193K6074J3213L19k2443k0346o565N696k810
10247E1853L0959J1705j1280k548k910O240j839l0653K254N0615m599k9492k0115
10234E0190q25j9663K4858L044O358M976K5106K4147M135k8750M875J8125k3600
10221I2976k6605n655M225k2825N555J5913j6351J0857j1773J885K7222J6180
$$ plain form
10209 91604 80645 91979 59036 49716 64393 63540 48472 36193 47260 59682 92486 115260
10197 115260 85850 87423 120961 119410 101913 101072 90156 71040 72437 78186 75726 91088 88428
10184 88428 65391 87523 99452 104018 64462 70623 68029 62039 47576 44506 51139 65523 53910
10171 53910 70309 97514 111928 99297 78045 61200 43980 55603 74718 89773 109702 94695
10159 94695 94966 92294 78552 76818 75321 70670 57056 66170 87329 90543 103311 117448 105739
10146 105739 115709 120203 108558 96945 85410 78784 70280 82720 76303 86874 118710 124422 125983
10133 125983 121934 102774 78120 54336 65612 102913 111310 86661 73132 98389 100561 102276
10121 102276 91125 87717 104931 92717 91747 107912 127046 129359 111076 76449 63871 44875
$$ packed form
10209I1604j0959J1334l2943r320J4677q53j5068j2279J1067J2422L2804K2774
10197A15260k9410J573L3538j551j7497q41j0916j9116J397N749k460J5362k660
10184H8428k3037K2132J1929M566l9556O161k594n990j4463l070O633J4384j1613
10171E3910J6399K7205J4414j2631k1252j6845j7220J1623J9115J5055J9929j5007
10159I4695K71k672j3742j734j497m651j3614R114K1159L214J2768J4137j1709
10146A05739R970M494j1645j1613j1535o626q504J2440o417J0571L1836N712J561
10133A25983m049j9160k4654k3784J1276L7301Q397k4649j3529K5257K172J715
10121A02276j1151l408J7214j2214r70J6165J9134K313j8283l4627j2578j8996
$$ plain form
10109 44875 59295 71381 64279 57541 67677 72316 100911 119961 107183 120517 143937 151720
10097 151720 91065 79586 96814 90165 87261 100985 102336 76903 50360 74299 72234 57678
10085 57678 56725 48158 29451 32384 39033 65369 89982 101897 91799 72113 61030 74660 93926
10072 93926 92423 67750 64437 59938 52641 86814 121575 117229 110553 87790 106670 133715 147357
10059 147357 158857 155684 121509 94671 103941 136632 149292 129636 100340 90349 121760 156887
10047 156887 159401 156468 127215 128266 172863 167066 143868 119286 110032 110568 115564 143457 185865
10034 185865 199054 222636 242590 297387 404006 531513 757567 917771 968012 1004054 1035638
10023 1035638 1063992 1055101 856574 616283 465440 354796 277105 258138 235381 221148 236403
$$ packed form
10109D4875J4420J2086p102o738J0136M639K8595J9050j2778J3334K3420P783
10097A51720o0655j1479J7228o649k904J3724J351k5433k6543K3939k065j4556
10085E7678r53q567j8707K933O649K6336K4613J1915j0098j9686j1083J3630J9266
10072I3926j503k4673l313m499p297L4173L4761m346o676k2763J8880K7045J3642
10059A47357J1500l173l4175k6838R270L2691J2660j9656k9296r991L1411L5127
10047A56887K514k933k9253J051M4597n797k3198k4582r254N36M996K7893M2408
10034A85865J3189K3582J9954N4797J06619J27507K26054J60204N0241L6042L1584
10023A035638K8354q891j98527k40291j50843j10644p7691j8967k2757j4233J5255
$$ plain form
10012 236403 227522 197532 179420 142480 155515 164452 145896 147146 141466 136273 151507 156819 149755
9999 149755 126103 108560 97991 96667 105787 123871 120417 86375 94569 101905 107054 113107 121286
9986 121286 130266 138505 145545 144498 141866 147087 107599 91213 114697 138261 141063 135755 129063
9973 129063 130866 103385 120457 120819 113010 124492 145731 142569 131370 132164 146828 143446 131376
9960 131376 125751 110233 120874 148804 168060 159885 154789 165398 180416 189973 168077 119761
9948 119761 129110 108124 117649 128453 116364 131510 128468 121935 138080 150769 151383 167874 164974
9935 164974 169018 152933 163014 151530 152376 138393 130052 123600 147215 180324 170778 187742 210751
9922 210751 201797 202680 194245 197059 193680 178185 170759 157641 165646 180950 192098 195794 174628
$$ packed form
10012B36403q881k9990j8112l6940J3035Q937j8556J250n680n193J5234N312p064
9999A49755k3652j7543j0569j324R120J8084l454l4042Q194P336N149O053Q179
9986A21286Q980Q239P040j047k632N221l9488j6386K3484K3564K802n308o692
9973A29063J803k7481J7072L62p809J1482K1239l162j1199P94J4664l382j2070
9960A31376n625j5518J0641K7930J9256q175n096J0609J5018R557k1896m8316
9948A19761R349k0986R525J0804j2089J5146l042o533J6145J2689O14J6491k900
9935A64974M044j6085J0081j1484Q46j3983q341o452K3615L3109r546J6964K3009
9922B10751q954Q83q435K814l379j5495p426j3118Q005J5304J1148L696k1166
$$ plain form
9909 174628 152116 133215 121530 140811 159129 164037 157166 174898 163923 153982 164000 186110
9897 186110 205035 229049 206134 177000 165745 161376 150814 162490 175769 190097 197796 197338
9885 197338 201641 187704 158048 159831 165801 155723 152986 157405 139390 164595 173889 156555 162385
9872 162385 160795 172661 207999 225742 226695 213405 205329 220091 221038 218979 189414 180709 207725
9859 207725 207652 222019 218938 219051 223213 222214 234463 238120 228328 221009 202581 170667 146847 190627
9845 190627 242506 231581 185531 181891 210555 209107 203440 199780 238318 252009 249800 255608 257394
9832 257394 266885 265648 258784 242066 245412 262206 274452 264808 236770 231294 243996 207043 204185
9819 204185 214557 243876 251976 244124 227425 240511 240795 247826 233404 241185 246630 236219 259496
$$ packed form
9909A74628k2512j8901j1685J9281J8318M908o871J7732j0975r941J0018K2110
9897A86110J8925K4014k2915k9134j1255m369j0562J1676J3279J4328P699m58
9885A97338M303j3937k9656J783N970j0078k737M419j8015K5205R294j7334N830
9872A62385j590J1866L5338J7743R53j3290q076J4762R47k059k9565q705K7016
9859B07725p3J4367l081J13M162r99J2249L657r792p319j8428l1914k3820M3780
9845A90627N1879j0925m6050l640K8664j448n667l660L8538J3691k209N808J786
9832B57394R491j237o864j6718L346J6794J2246r644k8038n476J2702l6953k858
9819B04185J0372K9319Q100p852j6699J3086K84P031j4422P781N445j0411K3277
$$ plain form
9806 259496 258208 245907 259872 230755 205445 203256 224924 239756 242013 219437 196315 187159
9794 187159 201842 206315 194135 198016 221021 209752 195952 232907 240189 258950 286267 297590
9782 297590 279811 276630 290397 289875 276853 283130 290252 286641 268863 259015 259032 248599 233901 265468
9768 265468 260420 276857 272771 248054 232787 246281 250982 228785 248315 278151 266527 232733
9756 232733 225833 233988 247888 239477 245148 270308 271589 269684 261625 279998 274769 269015 286628
9743 286628 327124 343659 328858 336693 328999 312065 297348 296942 293870 309227 320557 320968 343480
9730 343480 350568 366318 372916 388642 404480 403006 396046 379609 374228 389537 386219 387719 394691
9717 394691 380202 350352 330398 333867 307299 305454 307960 310824 351680 373115 352479 370702
$$ packed form
9806B59496j288j2301J3965k9117k5310k189K1668J4832K257k2576k3122r156
9794A87159J4683M473j2180L881K3005j1269j3800L6955P282J8761K7317J1323
9782B97590j7779l181J3767n22j3022O277P122l611j7778r848J7j0433j4698L1567
9768B65468n048J6437m086k4717j5267J3494M701k2197J9530K9836j1624l3794
9756B32733o900Q155J3900q411N671K5160J281j905q059J8373n229n754J7613
9743B86628M0496J6535j4801P835p694j6934j4717m06l072J5357J1330M11K2512
9730C43480P088J5750O598J5726J5838j474o960j6437n381J5309l318J500O972
9717C94691j4489k9850j9954L469k6568j845K506K864M0856K1435k0636J8223
$$ plain form
9705 370702 373832 374549 400170 419705 423347 441354 470979 458196 466706 479781 503526 515860 522792
9692 522792 552650 572099 573323 569366 577230 581963 584807 568208 526641 521750 538424 561508 526083
9679 526083 520044 518166 511100 525845 514190 485459 490291 521227 553425 546423 528850 547523 560256
9666 560256 576816 586576 600404 608784 596880 628162 662708 699779 729104 742495 797150 838504
9654 838504 903767 969207 1011163 1037662 1051104 1063587 1031676 1007988 997643 970092 918707 852502
9642 852502 785154 754258 735482 744137 748809 738642 754710 752178 769563 788824 792280 833105
9630 833105 865325 907204 919003 941454 967800 991201 1022682 1056793 1079824 1100202 1149943 1165537
9618 1165537 1216170 1277787 1304464 1302756 1304232 1300809 1279258 1236862 1235946 1259227 1262438 1228925 1196746
$$ packed form
9705C70702L130P17K5621J9535L642J8007K9625j2783Q510J3075K3745J2334O932
9692E22792K9858J9449J224l957P864M733K844j6599m1567m891J6674K3084l5425
9679E26083o039j878p066J4745j1655k8731M832L0936L2198p002j7573J8673J2733
9666E60256J6560R760J3828Q380j1904L1282L4546L7071K9325J3391N4655M1354
9654H38504O5263O5440M1956K6499J3442J2483l1911k3688j0345k7551n1385o6205
9642H52502o7348l0896j8776Q655M672j0167J6068k532J7385J9261L456M0825
9630H33105L2220M1879J1799K2451K6346K3401L1481L4111K3031K0378M9741J5594
9618A165537N0633O1617K6677j708J476l423k1551m2396r16K3281L211l3513l2179
$$ plain form
9605 1196746 1190474 1181616 1185850 1160503 1167695 1183647 1173326 1179068 1190518 1180794 1192020 1186699 1202865
9592 1202865 1227771 1234950 1208890 1212784 1224167 1247579 1274928 1292724 1300221 1313707 1346435 1366768
9580 1366768 1421482 1484077 1549001 1589532 1607618 1632746 1608599 1554946 1524413 1507362 1499496 1444703
9568 1444703 1397594 1358507 1349351 1316658 1278715 1267660 1272459 1238863 1202411 1168271 1166710 1187790
9556 1187790 1201653 1248839 1268077 1260870 1256422 1251411 1253495 1279933 1280527 1271078 1282795 1297168 1300805
9543 1300805 1324512 1333538 1325184 1295655 1266824 1243145 1220664 1214169 1211755 1193406 1167468 1142619
9531 1142619 1108709 1111918 1126210 1117989 1117108 1098607 1068105 1058371 1051944 1065630 1045678 1034006 1034586
9518 1034586 1013231 1013290 1026447 1010211 965523 963839 959704 980806 989030 1005146 1018894 1010963 1021324
$$ packed form
9605A196746o272q858M234k5347P192J5952j0321N742J1450r724J1226n321J6166
9592A202865K4906P179k6060L894J1383K3412K7349J7796P497J3486L2728K0333
9580A366768N4714O2595O4924M0531J8086K5128k4147n3653l0533j7051p866n4793
9568A444703m7109l9087r156l2693l7943j1055M799l3596l6452l4140j561K1080
9556A187790J3863M7186J9238p207m448n011K084K6438N94r449J1717J4373L637
9543A300805K3707R026q354k9529k8831k3679k2481o495k414j8349k5938k4849
9531A142619l3910L209J4292q221q81j8501l0502r734o427J3686j9952j1672N80
9518A034586k1355N9J3157j6236m4688j684m135K1102Q224J6116J3748p931J0361
$$ plain form
9505 1021324 1048070 1056985 1038070 1027352 1050053 1032399 1025846 1028675 1009690 986657 968288 969139
9493 969139 968155 958071 961227 969885 972467 955328 967444 994732 1009012 1003946 1007512 1003761 1008377
9480 1008377 1052714 1069589 1087088 1099405 1084721 1100996 1143637 1160652 1163534 1165703 1191367 1204544
9468 1204544 1191545 1217477 1247181 1250865 1275791 1302492 1344145 1362462 1359115 1370397 1406897 1409661
9456 1409661 1384199 1372651 1369410 1384138 1416901 1441121 1444602 1442044 1449427 1487294 1489919 1493959 1524246
9443 1524246 1512488 1508073 1498746 1514885 1501821 1514699 1572555 1577670 1569639 1603447 1624469 1622767
9431 1622767 1618052 1646482 1683841 1699650 1713632 1709211 1708128 1757706 1784167 1776270 1801353 1822396
9419 1822396 1865726 1925797 1972282 2008242 2028793 2040346 2077687 2116088 2162514 2190451 2198305 2204986
$$ packed form
9505A021324K6746Q915j8915j0718K2701j7654o553K829j8985k3033j8369Q51
9493I69139r84j0084L156Q658K582j7139J2116K7288J4280n066L566l751M616
9480A008377M4337J6875J7499J2317j4684J6275M2641J7015K882K169K5664J3177
9468A204544j2999K5932K9704L684K4926K6701M1653J8317l347J1282L6500K764
9456A409661k5462j1548l241J4728L2763K4220L481k558P383L7867K625M040L0287
9443A524246j1758m415r327J6139j3064J2878N7856N115q031L3808K1022j702
9431A622767m715K8430L7359J5809J3982m421j083M9578K6461p897K5083K1043
9419A822396M3330O0071M6485L5960K0551J1553L7341L8401M6426K7937P854O681
$$ plain form
9407 2204986 2249966 2274098 2320661 2369215 2406738 2450138 2463880 2465556 2489848 2517626 2565272 2576963
9395 2576963 2592271 2595650 2618665 2672615 2739408 2753451 2757656 2777657 2800541 2787918 2836225 2890838
9383 2890838 2912619 2913967 2938688 2978040 2984598 2974384 3004500 3015659 3017531 2998809 3025064 3045200
9371 3045200 3056205 3056537 3088297 3102311 3099559 3114499 3121489 3111458 3113811 3154439 3171345 3205397
9359 3205397 3284147 3343925 3378356 3436418 3527969 3628619 3756907 3904778 4080855 4297872
9349 4297872 4572036 4867295 5199509 5545101 5814645 6036933 6216958 6337322 6355870 6299559
9339 6299559 6250339 6176713 6097424 5988453 5933507 5900274 5907011 5970162 6122769 6340312 6578146
9328 6578146 6916804 7425892 8063522 8875098 9795249 10668734 11444245 12146017 12769456 13311419
$$ packed form
9407B204986M4980K4132M6563M8554L7523M3400J3742J676K4292K7778M7646J1691
9395B576963J5308L379K3015N3950O6793J4043M205K0001K2884j2623M8307N4613
9383B890838K1781J348K4721L9352O558j0214L0116J1159J872j8722K6255K0136
9371C045200J1005L32L1760J4014k752J4940O990j0031K353M0628J6906L4052
9359C205397P8750N9778L4431N8062R1551J00650J28288J47871J76077K17017
9349D297872K74164K95259L32214L45592K69544K22288J80025J20364J8548n6311
9339F299559m9220p3626p9289j08971n4946l3233O737O3151J52607K17543K37834
9328F578146L38658N09088O37630Q11576R20151Q73485P75511P01772O23439N41963
$$ plain form
9318 13311419 13661932 13776684 13758117 13767368 13911690 14157093 14505676 14961247 15428843 15865438
9308 15865438 16260793 16550720 16781299 16942316 17027211 17057493 17034715 17050832 17128592 17279967
9298 17279967 17570718 17976080 18476051 19057746 19695154 20321509 20908174 21508868 22145796
9289 22145796 22798925 23472222 24189455 24928911 25764734 26789788 28004524 29313233 30652265
9280 30652265 32036918 33440753 34781746 35932033 36840821 37580639 38182955 38623461 38903966
9271 38903966 39098863 39375369 39834908 40480384 41222874 42066047 42984344 43899283 44813871
9262 44813871 45756790 46720135 47593847 48304025 48896698 49486153 50231309 51152853 52251065
9253 52251065 53589192 55276649 57371794 59838068 62639130 65622199 68662942 71623176
$$ packed form
9318A3311419L50513J14752j8567R251J44322K45403L48583M55571M67596M36595
9308A5865438L95355K89927K30579J61017Q4895L0282k2778J6117P7760J51375
9298A7279967K90751M05362M99971N81695O37408O26355N86665O00694O36928
9289B2145796O53129O73297P17233P39456Q35823J025054J214736J308709J339032
9280C0652265J384653J403835J340993J150287R08788P39818O02316M40506K80505
9271C8903966J94897K76506M59539O45476P42490Q43173R18297R14939R14588
9262D4813871R42919R63345Q73712P10178N92673N89455P45156R21544J098212
9253E2251065J338127J687457K095145K466274K801062K983069L040743K960234
$$ plain form
9245 71623176 74482378 77228505 79832606 82344588 84921374 87840524 91428400 95796654
9237 95796654 100894764 106595744 112808117 119432598 126648781 134663985 143684716 153780543
9229 153780543 164763117 176556058 189206925 202488074 215933017 228942864 240927841
9222 240927841 251598395 261072587 269420760 276831629 283674694 290312503 296968913 303549336
9214 303549336 309615905 314595257 317861739 319172354 318843200 317384808 314838435 310860662
9206 310860662 305281176 298712494 292339714 286952217 282504491 278367376 274106106 269902807
9198 269902807 266170385 262867802 259656686 256102960 252039238 247683947 243390926 239308936
9190 239308936 235540302 232034991 228716836 225472207 222033021 218253159 214288109 210236059
$$ packed form
9245G1623176K859202K746127K604101K511982K576786K919150L587876M368254
9237I5796654N098110N700980O212373O624481P216183Q015204R020731J0095827
9229A53780543J0982574J1792941J2650867J3281149J3444943J3009847J1984977
9222B40927841J0670554R474192Q348173P410869O843065O637809O656410O580423
9214C03549336O066569M979352L266482J310615l29154j458392k546373l977773
9206C10860662n579486o568682o372780n387497m447726m137115m261270m203299
9198B69902807l732422l302583l211116l553726m063722m355291m293021m081990
9190B39308936l768634l505311l318155l244629l439186l779862l965050m052050
$$ plain form
9182 210236059 206009367 201563299 197068033 192820639 188957143 185504408 182587327 180327936
9174 180327936 178931065 178460945 178662939 179274033 180063011 180982153 182091681 183422185 184678585
9165 184678585 185362576 185005995 183555775 181340373 178675651 175476880 171279691 165861480
9157 165861480 159434984 152671880 146272639 140464477 135123673 130171362 125518569 121314028
9149 121314028 117803208 115098602 113228344 112040490 111129819 110372464 109877172 109735675 109890073
9140 109890073 110048135 109970605 109549249 108810209 107925047 106973723 105731433 103977532 101555697
9131 101555697 98451732 94987033 91468604 88045717 84874321 81956047 79200554 76518860
9123 76518860 73864863 71252703 68613991 65932836 63229367 60479398 57682392 54995703
$$ packed form
9182B10236059m226692m446068m495266m247394l863496l452735k917081k259391
9174A80327936j396871m70120K01994O11094P88978R19142J109528J330504J256400
9165A84678585O83991l56581j450220k215402k664722l198771m197189n418211
9157A65861480o426496o763104o399241n808162n340804m952311m652793m204541
9149A21314028l510820k704606j870258j187854r10671p57355m95292j41497J54398
9140A09890073J58062p7530m21356p39040q85162r51324j242290j753901k421835
9131A01555697l103965l464699l518429l422887l171396k918274k755493k681694
9123G6518860k653997k612160k638712k681155k703469k749969k797006k686689
$$ plain form
9115 54995703 52561296 50411582 48510298 46811029 45350485 44156203 43235859 42558883
9107 42558883 42097555 41862987 41796597 41899395 42132216 42377976 42530494 42494299 42189741 41629635
9097 41629635 40795053 39701334 38403975 36962101 35410658 33811210 32253893 30739565
9089 30739565 29271954 27862300 26448390 25033402 23739963 22564592 21536675 20685470
9081 20685470 19949458 19280900 18655526 18083262 17513490 16964672 16427752 15905239 15353011
9072 15353011 14782752 14224013 13682181 13182806 12758300 12366633 11995431 11621163 11228896
9063 11228896 10861363 10557043 10290043 9998445 9755490 9499701 9261052 8993912 8734434
9054 8734434 8536413 8314552 8087525 7866022 7687350 7522826 7344492 7140435 6952487 6777604
$$ packed form
9115E4995703k434407k149714j901284j699269j460544j194282r20344o76976
9107D2558883m61328k34568o6390J02798K32821K45760J52518l6195l04558n60106
9097D1629635q34582j093719j297359j441874j551443j599448j557317j514328
9089C0739565j467611j409654j413910j414988j293439j175371j027917q51205
9081B0685470p36012o68558o25374n72264n69772n48818n36920n22513n52228
9072A5353011n70259n58739n41832m99375m24506l91667l71202l74268l92267
9063A1228896l67533l04320k67000k91598k42955k55789k38649k67140k59478
9054H734434j98021k21861k27027k21503j78672j64524j78334k04057j87948j74883
$$ plain form
9044 6777604 6627355 6474937 6339298 6228472 6129053 6005991 5877138 5795800 5726684 5636101
9034 5636101 5550436 5465003 5389988 5323208 5226050 5157259 5088752 5021663 4944597 4862867 4773397
9023 4773397 4678924 4595113 4516318 4420488 4304902 4238117 4152917 4056068 3959745 3876062 3790622
9012 3790622 3748546 3675010 3604319 3588919 3565759 3533626 3469413 3398771 3364760 3345445 3332078
9001 3332078 3290482 3232049 3179050 3148594 3110258 3073073 3037965 3007344 2954632 2900609 2847217
8990 2847217 2794282 2733579 2674726 2612058 2546157 2501232 2471474 2414376 2354453 2301692 2256748
8979 2256748 2203959 2154385 2110439 2074087 2040640 2017214 1965878 1900820 1869027 1839829 1813222
8968 1813222 1776156 1750346 1746146 1743987 1716416 1679022 1633035 1589928 1593589 1578904 1551626 1523493
$$ packed form
9044F777604j50249j52418j35639j10826r9419j23062j28853q1338o9116r0583
9034E636101q5665q5433p5015o6780r7158o8791o8507o7089p7066q1730q9470
9023D773397r4473q3811p8795r5830j15586o6785q5200r6849r6323q3683q5440
9012C790622m2076p3536p0691j5400k3160l2133o4213p0642l4011j9315j3367
9001C332078m1596n8433n2999l0456l8336l7185l5108l0621n2712n4023n3392
8990B847217n2935o0703n8853o2668o5901m4925k9758n7098n9923n2761m4944
8979B256748n2789m9574m3946l6352l3447k3426n1336o5058l1793k9198k6607
8968A813222l7066k5810m200k159k7571l7394m5987m3107L661j4685k7278k8133
$$ plain form
8956 1523493 1510951 1519593 1488922 1437464 1415547 1412009 1380253 1366987 1345186 1306632 1287109 1259123
8944 1259123 1222410 1191750 1177870 1174890 1165863 1150356 1111569 1090305 1060963 1031501 1030556 996414
8932 996414 990430 1000329 984642 971683 945487 925800 916643 877623 839637 829541 824456 843681
8920 843681 833124 849852 843621 864397 889243 883941 862656 892202 933349 952897 968990 977774
8908 977774 966835 907290 854011 849015 833845 843428 826104 797233 784950 781959 804646 823986
8896 823986 802138 801318 803442 816009 796079 808442 819549 831871 818027 811589 836348 858012
8884 858012 844210 794496 782556 800331 789854 799787 822211 863550 890662 908334 951870 992909
8872 992909 987599 969589 975791 977715 981705 988550 992238 977066 960004 964982 977316 926621 896040
$$ packed form
8956A523493j2542Q642l0671n1458k1917l538l1756j3266k1801l8554j9523k7986
8944A259123l6713l0660j3880k980r027j5507l8787k1264k9342k9462r45l4142
8932I96414n984R899j5687j2959k6196j9687r157l9020l7986j0096n085J9225
8920H43681j0557J6728o231K0776K4846n302k1285K9546M1147J9548J6093Q784
8908I77774j0939n9545n3279m996j5170R583j7324k8871j2283k991K2687J9340
8896H23986k1848q20K124J2567j9930J2363J1107J2322j3844o438K4759K1664
8884H58012j3802m9714j1940J7775j0477R933K2424M1339K7112J7672M3536M1039
8872I92909n310j8010O202J924L990O845L688j5172j7062M978J2334n0695l0581
$$ plain form
8859 896040 896132 861108 838323 822199 822949 819406 804780 798758 822168 812192 788777 795519 786021 794673
8845 794673 841606 888075 932641 989942 1063399 1138852 1202964 1251957 1300981 1299956 1291294 1294121
8833 1294121 1309933 1280103 1261565 1219301 1166651 1145668 1113368 1099389 1091429 1072739 1038369 1003096
8821 1003096 995841 988746 972803 958326 953067 996875 1051361 1064347 1057331 1078114 1121170 1142924
8809 1142924 1148909 1165527 1194616 1224835 1252377 1307671 1356655 1379490 1383447 1398825 1426936 1447996
8797 1447996 1435409 1423327 1404611 1354594 1349040 1353522 1341924 1304715 1276744 1246366 1233911 1225611
8785 1225611 1204006 1202802 1196175 1158905 1136180 1116086 1105918 1095836 1092710 1095771 1060933 1085804
8773 1085804 1088691 1070466 1103483 1135319 1172188 1216171 1280689 1338996 1397688 1428499 1448088 1450406
$$ packed form
8859H96040R2l5024k2785j6124P50l543j4626o022K3410r976k3415O742r498Q652
8845G94673M6933M6469M4566N7301P3457P5453O4112M8993M9024j025q662K827
8833A294121J5812k9830j8538m2264n2650k0983l2300j3979p960j8690l4370l5273
8821A003096p255p095j5943j4477n259M3808N4486J2986p016K0783M3056K1754
8809A142924N985J6618K9089L0219K7542N5294M8984K2835L957J5378K8111K1060
8797A447996j2587j2082j8716n0017n554M482j1598l7209k7971l0378j2455q300
8785A225611k1605j204o627l7270k2725k0094j0168j0082l126L061l4838K4871
8773A085804K887j8225L3017L1836L6869M3983O4518N8307N8692L0811J9589K318
$$ plain form
8761 1450406 1453687 1429089 1389221 1336772 1263602 1190849 1171478 1136048 1100315 1070352 1043567 1043335
8749 1043335 1005313 945919 936971 930616 885729 888524 890151 871280 880775 858015 867239 894491 920315
8736 920315 937182 942142 947689 938226 926765 931561 904435 911517 943661 933240 906531 875979 852841
8723 852841 839266 831692 797081 763917 741589 733455 677868 637474 609489 608707 553093 528418
8711 528418 518585 489564 474307 458755 413960 401362 395784 381444 360094 329683 363566 363968
8699 363968 361270 382528 412037 381253 383573 410243 416424 426778 460939 480407 454195 403497
8687 403497 376612 383519 366551 336485 307620 253155 229517 220112 199354 188806 200328 186871
8675 186871 176150 172884 163824 152999 157423 145833 144438 168234 155036 173310 148073 139498 142464
$$ packed form
8761A450406L281k4598l9868n2449p3170p2753j9371l5430l5733k9963k6785k32
8749A043335l8022n9394q948o355m4887K795J627j8871R495k2760R224K7252K5824
8736I20315J6867M960N547r463j1461M796k7126P082L2144j0421k6709l0552k3138
8723H52841j3575p574l4611l3164k2328q134n5587m0394k7985p82n5614k4675
8711E28418r833k9021j5257j5552m4795j2598n578j4340k1350l0411L3883M02
8699C63968k698K1258K9509l0784K320K6670O181J0354L4161J9468k6212n0698
8687D03497k6885O907j6968l0066k8865n4465k3638r405k0758j0548J1522j3457
8675A86871j0721l266r060j0825M424j1590j395K3796j3198J8274k5237q575K966
$$ plain form
8662 142464 141260 139412 122273 124283 112122 102282 115192 137581 156762 145999 143790 131602 83118
8649 83118 84632 112070 118087 110898 89193 67123 84031 94065 97070 88484 97796 92341 77945
8636 77945 73620 46785 48623 80394 99010 88662 74292 65828 72261 89658 84860 76455 54974
8623 54974 21077 13503 56871 89228 83313 59352 74207 78434 62428 53496 67708 58628 63360
8610 63360 79604 79551 71879 40016 32264 30872 30690 19187 14689 44497 44678 30167 43749 17151
8596 17151 24888 20817 38721 72512 90182 79294 71721 51570 41900 49514 59206 64449 42427
8583 42427 39901 60219 67463 76673 85980 87879 87539 74271 66340 67260 54292 62082 72347 114194
8569 114194 125607 93208 90356 116898 125056 123611 141648 157118 133170 91256 71392 52662
$$ packed form
8662A42464j204j848j7139K010j2161r840J2910K2389J9181j0763k209j2188m8484
8649H3118J514K7438O017p189k1705k2070J6908J0034L005q586R312n455j4396
8636G7945m325k6835J838L1771J8616j0348j4370q464O433J7397m798q405k1481
8623E4974l3897p574M3368L2357n915k3961J4855M227j6006q932J4212r080M732
8610F3360J6244n3p672l1863p752j392j82j1503m498K9808J81j4511J3582k6598
8596A7151P737m071J7904L3791J7670j0888p573k0151r670P614R692N243k2022
8583D2427k526K0318P244R210R307J899l40j3268p931R20j2968P790J0265M1847
8569A14194J1413l2399k852K6542Q158j445J8037J5470k3948m1914j9864j8730
$$ plain form
8557 52662 47873 61256 59323 53607 49958 43068 35407 15846 11299 39193 28826 3810 313
8544 313 18134 15295 108 -20762 -15861 -24002 -20402 10844 30616 39204 81652 80664 87251 87874
8530 87874 71325 73575 59906 72700 89353 85982 57038 67969 65932 75232 57916 55550 46396
8517 46396 76567 86560 90371 78783 61526 64021 58434 78808 100345 81703 71617 69723 55596
8504 55596 22676 10151 26397 34120 32288 10487 10675 36096 53989 38690 29873 31909 42877
8491 42877 57354 69207 54389 37049 2633 5769 6830 3890 24813 42558 45836 36868 11646
8478 11646 11268 11405 33634 51962 41840 30117 35298 40926 25340 37770 31937 23884 20181 9269
8464 9269 13261 33355 27069 8081 -9057 10542 13428 21911 34723 35951 29914 30299 12759 -36193
$$ packed form
8557E2662m789J3383j933n716l649o890p661j9561m547K7894j0367k5016l497
8544C13J7821k839j5187k0870M901q141L600L1246J9772Q588M2448r88O587O23
8530H7874j6549K250j3669J2794J6653l371k8944J0931k037R300j7316k366r154
8517D6396L0171R993L811j1588j7257K495n587K0374K1537j8642j0086j894j4127
8504E5596l2920j2525J6246P723j832k1801J88K5421J7893j5299q817K036J0968
8491D2877J4477J1853j4818j7340l4416L136J061k940K0923J7745L278q968k5222
8478A1646l78J37K2229J8328j0122j1723N181N628j5586J2430n833q053l703j0912
8464I269L992K0094o286j8988j7138J9599K886Q483J2812J228o037L85j7540m8952
$$ plain form
8450 -36193 -31508 -11824 20663 63208 73317 73737 52477 32508 14576 13392 17357 32011 25509
8437 25509 12381 -1806 2222 19879 26463 6432 13259 26737 1403 -7015 -5847 -518 42
8424 42 -29883 -36063 8050 37960 39722 54830 36071 45272 49207 42345 33048 37058 31437 30263
8410 30263 17480 16540 1656 -19464 6892 17678 -9321 -8861 816 -3495 -17379 -11782 -11708 -49070
8396 -49070 -43391 -3940 5554 -2422 -12156 6451 25770 18428 11292 21929 855 -16192 12568
8383 12568 37369 61921 46393 27872 27662 12074 28193 38611 28896 12300 11717 27185 33333
8370 33333 39473 41079 44850 39050 38003 22474 -176 -4107 -4766 8403 19279 9237 8664 12999
8356 12999 26441 42186 36564 55079 54517 16468 -5149 -2507 61265 60084 35639 5051 12907
$$ packed form
8450c6193M685J9684L2487M2545J0109M20k1260j9969j7932j184L965J4654o502
8437B5509j3128j4187M028J7657O584k0031O827J3478k5334q418J168N329N60
8424D2k9925o180M4113K9910J762J5108j8759R201L935o862r297M010n621j174
8410C0263j2783r40j4884k1120K6356J0786k6999M60R677m311j3884N597P4l7362
8396d9070N679L9451R494p976r734J8607J9319p342p136J0637k1074j7047K8760
8383A2568K4801K4552j5528j8521k10j5588J6119J0418r715j6596n83J5468O148
8370C3333O140J606L771n800j047j5529k2650l931o59J3169J0876j0042n73M335
8356A2999J3442J5745n622J8515n62l8049k1617K642O3772j181k4445l0588P856
$$ plain form
8343 12907 6472 -14321 -198 17350 1313 -21031 -14169 17237 29124 33710 11378 35559
8331 35559 42535 27217 22901 48527 46106 23393 20093 11948 -10021 2252 1999 -8371 -21957
8318 -21957 -31906 -12272 -5429 12369 24820 28044 20869 3206 -38127 -42987 -24285 -16359 -7210
8305 -7210 -12018 -12764 -4068 6055 12275 -559 -27579 -24567 -13612 -24142 -10859 -15528 -18344 -18765
8291 -18765 -19099 -8989 -3168 3307 6461 -11559 -51782 -23166 -2857 -6312 -369 -13830 -19083
8278 -19083 -10156 20291 11941 -9172 -28447 -9507 18402 14358 -18243 -10870 -9322 -12454 -12102
8265 -12102 -833 949 478 19296 14318 16494 7516 14190 35973 12842 -16661 -7011 15248
8252 15248 8545 -7716 -19498 -30930 -27159 -22821 -5836 -5206 -9447 -4947 19573 -9306 -15536
$$ packed form
8343A2907o435k0793J4123J7548j6037k2344O862L1406J1887M586k2332K4181
8331C5559O976j5318m316K5626k421k2713l300q145k1969J2273k53j0370j3586
8318b1957r949J9634O843J7798J2451L224p175j7663m1333m860J8702P926R149
8305g210m808p46Q696J0123O220j2834k7020L012J0955j0530J3283m669k816m21
8291a8765l34J0110N821O475L154j8020m0223K8616K0309l455N943j3461n253
8278a9083Q927L0447q350k1113j9275J8940K7909m044l2601P373J548l132L52
8265a2102J1269J782m71J8818m978K176q978O674K1783k3131k9503R650K2259
8252A5248o703j6261j1782j1432L771M338J6985O30m241M500K4520k8879o230
$$ plain form
8239 -15536 21519 16118 -21613 -20165 -5868 -41781 -26921 -5009 -18220 -19350 -10328 4430 14209
8226 14209 19814 7304 1609 -31699 -38140 -32997 -29653 -33707 14526 29163 7733 1860 6999
8213 6999 12421 10972 1650 -22270 -45594 -20462 -17359 -7919 -8274 -5882 -13657 -29250 -18452 -40190
8199 -40190 -46249 -51151 -37143 -22381 -44197 -28051 -20008 -1967 3547 -7746 -26497 -20734 -1553
8186 -1553 5490 8630 -1574 4500 -5446 -10667 -19695 -21908 -18611 2686 -10855 -40178 -41173 27
8172 27 -130 9310 34813 44480 28860 10517 3206 12570 34957 45087 24788 3534 8403 15801
8158 15801 -8820 7629 -112 -3612 -1311 18936 2630 3825 10184 -26206 -32166 -32529 -12288
8145 -12288 -36580 -40534 -14242 -2009 -10856 -12512 -23499 -50675 -38411 -49245 -40184 -43537 -52401
$$ packed form
8239a5536L7055n401l7731J448J4297l5913J4860K1912j3211j130R022J4758R779
8226A4209N605j2510n695l3308o441N143L344m054M8233J4637k1430n873N139
8213F999N422j449r322k3920k3324K5132L103R440l55K392p775j5593J0798k1738
8199d0190o059m902J4008J4762k1816J6146Q043J8041N514j1293j8751N763J9181
8186a553P043L140j0204O074r946n221r028k213L297K1297j3541k9323r95M1200
8172B7j57R440K5503R667j5620j8343p311R364K2387J0130k0299k1254M869P398
8158A5801k4621J6449p741l500K301K0247j6306J195O359l6390n960l63K0241
8145a2288k4292l954K6292J2233q847j656j0987k7176J2264j0834R061l353q864
$$ plain form
8132 -52401 -59375 -61544 -41827 -43935 -27967 -19766 -4184 -4144 -9986 -15433 -8017 8571 945 2769
8118 2769 -7248 -15494 11005 9214 -2382 -6929 -21726 -22561 278 36158 52124 39930 26457
8105 26457 26678 60228 50505 20209 10076 14849 17328 30002 29079 22656 -269 -25361 -7941
8092 -7941 31102 65848 78395 59654 47064 56397 51187 50941 28357 4076 6279 46139 59082
8079 59082 35691 44408 26972 962 -11143 -47087 -34442 -25876 -3948 -13202 -37533 -27825 -17878
8066 -17878 -14813 -3653 16142 204 14163 36042 17411 -23489 -8110 11748 24529 51248
8054 51248 22158 33201 48283 63119 45933 38734 19848 20693 32604 40317 49941 58682 47962
8041 47962 36769 29195 -6899 -14176 17436 17478 31748 21436 -2200 3538 13099 31615 25149
$$ packed form
8132e2401o974k169J9717k108J5968Q201J5582M0n842n447P416J6588p626J824
8118B769j0017q246K6499j791j1596m547j4797q35K2839L5880J5966j2194j3473
8105B6457K21L3550r723l0296j0133M773K479J2674r23o423k2925k5092J7420
8092g941L9043L4746J2547j8741j2590R333n210k46k2584k4281K203L9860J2943
8079E9082k3391Q717j7436k6010j2105l5944J2645Q566K1928r254k4331R708R947
8066a7878L065J1160J9795j5938J3959K1879j8631m0900J5379J9858J2781K6719
8054E1248k9090J1043J5082J4836j7186p199j8886Q45J1911P713R624Q741j0720
8041D7962j1193p574l6094p277L1612M2J4270j0312k3636N738R561J8516o466
$$ plain form
8028 25149 11022 15264 36545 22665 12750 3579 21837 56016 50865 37452 47318 47572 21533
8015 21533 16870 -3230 -31912 -21258 5821 18155 29964 51858 50476 45688 65803 20706
8003 20706 -4852 21085 32045 41557 43720 38893 45645 44621 44176 59848 38802 -14453 -33058
7990 -33058 -14772 4483 8195 11304 18375 13024 37219 64241 59700 58058 81042 64110 35317
7977 35317 167 -6058 8625 21414 39552 43525 20373 21541 23557 9135 32498 30347 31228
7964 31228 11263 22124 5075 8160 24803 33320 23092 24817 16050 15918 40571 56699 66484
7951 66484 62767 70989 71781 55385 41731 31119 43419 48107 42276 54400 26648 24581 48118
7938 48118 61021 59826 53428 51322 28735 22792 17054 15345 22000 15439 10655 24010 35433 27857
$$ packed form
8028B5149j4127M242K1281j3880r915r171J8258L4179n151j3413R866K54k6039
8015B1533m663k0100k8682J0654K7079J2334J1809K1894j382m788K0115m5097
8003B0706k5558K5937J0960R512K163m827O752j024m45J5672k1046n3255j8605
7990c3058J8286J9255L712L109P071n351K4195K7022m541j642K2984j6932k8793
7977C5317l5150o225J4683J2789J8138L973k3152J168K016j4422K3363k151Q81
7964C1228j9965J0861j7049L085J6643Q517j0228J725q767j32K4653J6128R785
7951F6484l717Q222P92j6396j3654j0612J2300M688n831J2124k7752k067K3537
7938D8118J2903j195o398k106k2587n943n738j709O655o561m784J3355J1423p576
$$ plain form
7924 27857 17639 21239 40183 43370 56682 14343 15990 31861 40375 10763 -15798 23185 50236
7911 50236 66351 51396 19495 3226 34286 33717 30464 44353 52876 68021 49134 7957 4190
7898 4190 -10673 -10091 5429 13619 37495 20784 16153 1689 -11514 -2107 -6941 -10576 -21277
7885 -21277 -5031 6338 10817 11022 24503 31141 48681 32500 20056 17112 25338 55229 53235
7872 53235 44553 29594 32087 34420 21700 7677 13719 -3717 -47040 -65860 -25585 -9543 -28540
7859 -28540 -24340 -23642 -28204 -23547 -47540 -43017 -34103 -27017 -23358 -30100 -34955 -34541 -36139 -29740 -12187
7844 -12187 -4073 33273 43960 19606 -6130 16963 32664 33551 32746 32107 7727 12243 22307
7831 22307 23382 18815 6922 -1072 -29359 -20253 7090 1455 6099 4342 -13715 -46601 -36840
$$ packed form
7924B7857j0218L600J8944L187J3312m2339J647J5871Q514k9612k6561L8983K7051
7911E0236J6115j4955l1901j6269L1060n69l253J3889Q523J5145j8887m1177l767
7898D190j4863N82J5520Q190K3876j6711m631j4464j3203R407m834l635j0701
7885b1277J6246J1369M479K05J3481O638J7540j6181j2444k944Q226K9891j994
7872E3235q682j4959K493K333j2720j4023O042j7436m3323j8820M0275J6042j8997
7859b8540M200O98m562M657k3993M523Q914P086L659o742m855M14j598O399J7553
7844a2187Q114L7346J0687k4354k5736K3093J5701Q87q05o39k4380M516J0064
7831B2307J075m567j1893p994k8287R106K7343n635M644j757j8057l2886R761
$$ plain form
7818 -36840 -18609 -7928 -17531 -9075 21786 15133 -14240 -14283 -32081 -35148 -15637 3278 -18405
7805 -18405 -24742 2686 11976 8703 -41 -3107 33950 43584 54257 74388 63967 76268 73003
7792 73003 46656 19278 3110 2245 -17886 -25475 -14111 -26871 -22252 -10113 -7178 -19294 -40493
7779 -40493 -35549 -11335 -19880 -30853 -40233 -43913 -47406 -32078 -12795 -28598 -19632 -8061 -5873
7766 -5873 -14334 -10167 -32992 -32720 -23793 -8554 -2953 3840 6392 17279 5667 -23977 -24032 -5319
7752 -5319 -4162 -1176 23964 -11381 -28203 -31922 -32331 -26103 6386 36862 36158 12423 13031 -4679
7738 -4679 -22107 -31796 -5599 -17132 -53822 -77796 -73938 -45292 -38335 -17674 -13500 -32134 -25423
7725 -25423 13 -3356 -10949 4666 18025 2905 -1416 -8188 20431 34979 14896 9037 24185
$$ packed form
7818c6840J8231J0681r603Q456L0861o653k9373m3j7798l067J9511J8915k1683
7805a8405o337K7428R290l273q744l066L7057R634J0673K0131j0421J2301l265
7792G3003k6347k7378j6168q65k0131p589J1364j2760M619J2139K935j2116k1199
7779d0493M944K4214q545j0973r380l680l493J5328J9283j5803Q966J1571K188
7766e873q461M167k2825K72Q927J5239N601O793K552J0887j1612k9644n5J8713
7752e319J157K986K5140l5345j6822l719m09O228L2489L0476p04k3735O08j7710
7738d679j7428r689K6197j1533l6690k3974L858K8646O957K0661M174j8634O711
7725b5423K5436l369p593J5615J3359j5120m321o772K8619J4548k0083n859J5148
$$ plain form
7712 24185 19741 24785 10474 -4989 -10937 1736 -28789 -8139 17422 26484 21396 20578 14472
7699 14472 -5767 -10705 14509 3250 -10054 18433 -6382 -10592 165 -2428 2879 6213 -1965
7686 -1965 847 -2391 -13224 -15614 -3923 -6099 -32244 -47596 -37940 -14172 -1254 2055 -13142
7673 -13142 -22059 -12317 -7234 14434 36816 17947 11547 437 3108 19466 14508 31162 19633
7660 19633 9899 -17085 2011 33598 19728 28356 14861 21579 30357 1844 -18865 2630 16377
7647 16377 12936 -5284 -3340 -4053 15613 -11606 -13324 -3239 13463 47778 59384 23847 1468
7634 1468 -2209 -18923 -17244 -6602 -8017 -35678 -31612 -25446 -23354 -3614 24266 19558 2575
7621 2575 -4808 -131 -31222 -35809 -10789 2759 -14502 -23344 -25575 -30483 -32740 -22193 -11443
$$ packed form
7712B4185m444N044j4311j5463n948J2673l0525K0650K5561R062n088q18o106
7699A4472k0239m938K5214j1259j3304K8487k4815m210J0757k593N307L334q178
7686a965K812l238j0833k390J1691k176k6145j5352R656K3768J2918L309j5197
7673a3142q917R742N083K1668K2382j8869o400j1110K671J6358m958J6654j1529
7660A9633r734k6984J9096L1587j3870Q628j3495O718Q778k8513k0709K1495J3747
7647A6377l441j8220J944p13J9666k7219j718J0085J6702L4315J1606l5537k2379
7634A468l677j6714J679J0642j415k7661M066O166K092J9740K7880m708j6983
7621B575p383M677l1091m587K5020J3548j7261q842k231m908k257J0547J0750
$$ plain form
7608 -11443 5454 20876 11053 20335 -8660 -22598 -12186 -133 -5151 -43161 -61250 -32794
7596 -32794 -15504 -23940 -28508 -19296 -19342 -2929 5141 -8456 -10932 -15096 -10720 15275 11090 -10162
7582 -10162 -9769 -31486 -28692 -30997 -23085 -23370 -30310 -27164 -8568 -8143 -21683 -37874 -11457 -13025
7568 -13025 -14207 -7739 16590 38022 34418 16953 18779 9401 11822 -6390 -11583 -4273 -6154 -26844
7554 -26844 -33905 -32595 -49065 -40775 -47211 -65334 -48115 -54231 -60645 -52107 -8626 22252 -17741
7541 -17741 -46933 -44369 -32067 -15527 -20163 -20418 -31153 -2844 7640 -32386 -35179 -26349 -52627
7528 -52627 -61114 -61149 -59901 -61427 -43061 -39457 -26897 -11470 3050 -16916 -18624 -35438 -64623
7515 -64623 -51016 -37772 -25130 688 31583 24987 23033 20855 28579 22272 10576 4185 -950
$$ packed form
7608a1443J6897J5422r823R282k8995j3938J0412J2053n018l8010j8089K8456
7596c2794J7290q436m568R212m6J6413Q070j3597k476m164M376K5995m185k1252
7582a0162L93k1717K794k305P912k85o940L146J8596M25j3540j6191K6417j568
7568a3025j182O468K4329K1432l604j7465J826r378K421j8212n193P310j881k0690
7554b6844p061J310j6470Q290o436j8123J7219o116o414Q538M3481L0878l9993
7541a7741k9192K564J2302J6540m636k55j0735K8309J0484m0026k793Q830k6278
7528e2627q487l5J248j526J8366L604J2560J5427J4520j9966j708j6814k9185
7515f4623J3607J3244J2642K5818L0895o596j954k178P724o307j1696o391n135
$$ plain form
7502 -950 3446 1723 15360 -11627 -29254 -22880 1460 -10110 -2688 -20011 -18546 -188 11117
7489 11117 5780 9631 -15679 389 -26311 -25289 -17671 -18585 -19164 -18432 -24035 -18326 3910 21066
7475 21066 -4252 -29593 -42420 -24322 -14107 -20061 107 6029 -9146 -16065 -5464 2541 -15518
7462 -15518 -14987 12743 20938 4916 9019 23994 44578 21897 -13477 -8955 3581 21179 16808
7449 16808 31735 37556 30805 4046 -19333 4274 25606 34088 35392 2142 -1580 3086 -25899
7436 -25899 -51202 -34417 -30308 -38882 -70465 -74709 -61383 -23127 -12842 -1165 16329 -12518
7424 -12518 -41905 -55257 -21663 -13928 2996 36315 23717 8951 48927 62834 45666 14068
7412 14068 -19321 -11746 5753 12982 6630 -4609 -39775 -29253 -29097 -37537 -46487 -48963 -48480 -24754
$$ packed form
7502i50M396j723J3637k6987j7627O374K4340j1570P422j7323J465J8358J1305
7489A1117n337L851k5310J6068k6700J022P618r14n79P32n603N709K2236J7156
7475B1066k5318k5341j2827J8098J0215n954K0168N922j5175o919J0601Q005j8059
7462a5518N31K7730Q195j6022M103J4975K0584k2681l5374M522J2536J7598m371
7449A6808J4927N821o751k6759k3379K3607K1332Q482J304l3250l722M666k8985
7436b5899k5303J6785M109q574l1583m244J3326L8256J0285J1677J7494k8847
7424a2518k9387j3352L3594P735J6924L3319j2598j4766L9976J3907j7168l1598
7412A4068l3389P575J7499P229o352j1239l5166J0522J56q440q950k476M83K3726
$$ plain form
7398 -24754 -16686 -38279 -37747 -38959 -42590 -40954 -41130 -32053 -27506 -23311 -21424 -28500 -29963 -28511 -30286
7383 -30286 -14473 -20264 -30855 -4888 -7683 -41536 -41332 -21871 -5028 -13298 -29939 -35832 -36925
7370 -36925 -27798 -37744 -37471 -3875 9123 -3055 -1625 6734 -14831 3437 -12370 -31492 -55672
7357 -55672 -75592 -73186 -59348 -53008 -29242 -14861 -33123 -38473 -1180 -12295 -34459 -27284 -30416
7344 -30416 -27400 -39287 -33102 -29079 -25340 -28848 -14375 -15184 -616 -4777 -7272 -2774 2921 9680
7330 9680 32851 45676 44964 15266 1491 -8628 -13131 -53478 -62880 -31638 -9121 -3787 -29732
7317 -29732 -53342 -44050 -37231 -38415 -30069 1987 15113 -9183 -27119 -12670 -28922 -24812 -30579
7304 -30579 -55468 -53936 -22823 6348 16400 6524 -1096 -19266 -24849 -12732 -20803 17271 34914
$$ packed form
7398b4754Q068k1593N32j212l631J636j76R077M547M195J887p076j463J452j775
7383c0286J5813n791j0591K5967k795l3853K04J9461J6843q270j6641n893j093
7370c6925R127r946K73L3596J2998j2178J430Q359k1565J8268j5807j9122k4180
7357e5672j9920K406J3838O340K3766J4381j8262n350L7293j1115k2164P175l132
7344c0416L016j1887O185M023L739l508J4473q09J4568m161k495M498N695O759
7330I680K3171J2825p12k9698j3775j0119m503m0347r402L1242K2517N334k5945
7317b9732k3610R292O819j184Q346L2056J3126k4296j7936J4449j6252M110n767
7304c0579k4889J532L1113K9171J0052r876p620j8170n583J2117q071L8074J7643
$$ plain form
7291 34914 58068 43086 -3189 -23574 -35846 -41395 -53523 -42383 -18193 -27287 -70433 -84534
7279 -84534 -90311 -100626 -119896 -120257 -69835 -50079 -37380 -45936 -44229 -42853 -33957 -25452 -45768
7266 -45768 -69131 -60166 -49412 -29698 -28418 -19286 -22170 -8604 -2092 -22830 -19288 6968 5328
7253 5328 -23673 -42734 -34146 -51406 -51878 -50666 -38140 -44501 -36482 -20257 -10510 4027 17928
7240 17928 -11608 -23530 -26790 -25174 -36422 4238 32319 18965 18346 11911 9127 -5207 -8876
7227 -8876 -31775 -47931 -40200 -18210 -23114 4803 41250 50730 27622 4137 -2117 -12534 -8593
7214 -8593 578 23819 4736 -25547 -35560 13188 10592 -2615 -2434 -3614 6619 25343 15217
7201 15217 -14649 -34348 -28134 -13893 -42447 -20653 -25045 -34598 -28408 -13689 -13077 -28716 -38756
$$ packed form
7291C4914K3154j4982m6275k0385j2272n549j2128J1140K4190r094m3146j4101
7279h4534n777j0315j9270l61N0422J9756J2699q556J707J376Q896Q505k0316
7266d5768k3363Q965J0754J9714J280R132k884J3566O512k0738L542K6256j640
7253E328k9001j9061Q588j7260m72J212J2526o361Q019J6225R747J4537J3901
7240A7928k9536j1922l260J616j1248M0660K8081j3354o19o435k784j4334l669
7227h876k2899j6156P731K1990m904K7917L6447R480k3108k3485o254j0417L941
7214h593R171K3241j9083l0283j0013M8748k596j3207J81j180J0233J8724j0126
7201A5217k9866j9699O214J4241k8554K1794m392r553O190J4719O12j5639j0040
$$ plain form
7188 -38756 -18023 -15335 -29648 -32582 -45507 -37265 -13191 -7568 -8350 -11446 -20896 -18027 3709 -13906
7174 -13906 -25558 -7229 3951 -13863 -14350 -1838 1048 -13853 -11273 -632 20169 -8825 -40971
7161 -40971 -26120 -29423 -21404 -10861 -6777 7523 8112 -21895 -39158 -28974 6202 28316 13271
7148 13271 4592 -857 19511 21400 9561 9327 -1229 -10733 -23344 -16299 -24181 -9069 9274
7135 9274 -6833 -19318 -22613 -7630 -13635 1245 27510 28466 31174 14694 16591 7738 12891 -2629
7121 -2629 -28112 -24722 -4334 -7581 -32807 -35565 -20421 -9847 -19549 -19495 -13562 -10447 -19067 -31832
7107 -31832 -21432 -28855 -23604 -13187 7814 13265 9591 -5858 -13370 -32193 -66605 -59931 -61008
7094 -61008 -62965 -45790 -27329 -13793 287 3935 -8468 5177 5546 13442 4357 -16728 -22729
$$ packed form
7188c8756K0733K688j4313k934j2925Q242K4074N623p82l096r450K869K1736j7615
7174a3906j1652J8329J1180j7814m87J2512K886j4901K580J0641K0801k8994l2146
7161d0971J4851l303Q019J0543M084J4300N89l0007j7263J0184L5176K2114j5045
7148A3271q679n449K0368J889j1839k34j0556r504j2611P045p882J5112J8343
7135I274j6107j2485l295J4983o005J4880K6265R56K708j6480J897q853N153j5520
7121b629k5483L390K0388l247k5226k758J5144J0574r702N4N933L115q620j2765
7107c1832J0400p423N251J0417K1001N451l674j5449p512j8823l4412O674j077
7094f1008j957J7175J8461J3536J4080L648j2403J3645L69P896r085k1085o001
$$ plain form
7081 -22729 -13553 -28182 -10151 33620 56542 26115 -13042 -13340 14674 -8116 -15292 10456 12666
7068 12666 -16523 -34642 -52432 -31424 -10019 3966 608 -3145 -20252 -48448 -75408 -70946
7056 -70946 -77443 -68820 -28427 -41751 -61876 -49547 21686 51168 38727 3505 8934 18388 8437
7043 8437 -3876 -6279 -12685 -31366 -32377 -17412 -19172 -49533 -26575 -14872 1837 -1787 -23634
7030 -23634 -41339 -38429 -41482 -25863 -15874 -26643 -51000 -41984 -32149 -31964 -11773 -7579 -6037 -13158
7016 -13158 -8149 -1327 -6316 -1126 -37878 -41912 -19852 -12361 -603 -27264 -52652 -44962 -28147
7003 -28147 -45530 -73119 -42083 -27170 -37886 -73923 -61628 -36287 -34862 -25072 -9821 -26366
6991 -26366 -27392 6487 31406 6330 20251 22322 11394 11484 20271 -2298 -44765 -77250 -73944
$$ packed form
7081b2729R176j4629J8031M3771K2922l0427l9157k98K8014k2790p176K5748K210
7068A2666k9189j8119j7790K1008K1405J3985l358l753j7107k8196k6960M462
7056g0946o497Q623M0393j3324k0125J2329P1233K9482j2441l5222N429R454r951
7043H437j2313k403o406j8681j011J4965j760l0361K2958J1703J6709l624k1847
7030b3634j7705K910l053J5619R989j0769k4357R016R835J85K0191M194J542p121
7016a3158N009O822m989N190l6752m034K2060P491J1758k6661k5388P690J6815
7003b8147j7383k7589L1036J4913j0716l6037J2295K5341J425R790J5251j6545
6991b6366j026L3879K4919k5076J3921K071j0928R0Q787k2569m2467l2485L306
$$ plain form
6978 -73944 -53917 -43143 -49317 -41936 -22289 -3056 -10558 -35627 -40051 -36579 -55414 -61706 -44724
6965 -44724 -24047 -22346 -29845 -37337 -30562 -20148 -23232 -44827 -61508 -57763 -42307 -62407 -39240
6952 -39240 -10805 8480 5922 5055 -7153 -13261 -7658 -12331 -14080 -15719 -13108 -41497 -60113 -34821
6938 -34821 -18969 -27022 -9809 -22189 -39249 -35073 -30859 -37855 -42372 -60204 -35011 -22310 -1557
6925 -1557 11696 14830 8277 -3962 -4160 2808 -2276 7121 15901 33536 19090 5667 9844 33036
6911 33036 34195 34113 43980 35760 22853 26645 47845 33891 14985 -26149 -22668 -13427 411 -15171
6897 -15171 -46000 -42518 -14015 3363 -8757 15768 28934 -765 -10315 -8980 -2434 5492 1156
6884 1156 -4145 -3118 -430 6812 535 -1168 -26423 -39012 -39318 -58470 -32014 -757 -11706 -14933
$$ packed form
6978g3944K0027J0774o174P381J9647J9233p502k5069m424L472j8835o292J6982
6965d4724K0677J701p499p492O775J0414l084k1595j6681L745J5456k0100K3167
6952c9240K8435J9285k558q67j2208o108N603m673j749j639K611k8389j8616K5292
6938c4821J5852q053J7213j2380j7060M176M214o996m517j7832K5193J2701K0753
6925a557J3253L134o553j2239j98O968n084R397Q780J7635j4446j3423M177K3192
6911C3036J159q2R867q220j2907L792K1200j3954j8906m1134L481R241J3838j5582
6897a5171l0829L482K8503J7378j2120K4525J3166k9699r550J335O546P926m336
6884A156n301J027K688P242o277j703k5255j2589l06j9152K6456L1257j0949l227
$$ plain form
6870 -14933 -19268 -19958 -14667 -11570 2193 -13871 -31106 -1410 18364 16587 -6934 -11598 -7809
6857 -7809 -37673 -31667 -26134 -28802 -16221 -714 18467 23098 30122 36921 3859 -24336 -38361
6844 -38361 -38691 -16583 -11334 -20261 -40055 -59855 -54091 -33270 -22915 -19104 -2209 -623 1806
6831 1806 9020 20295 11430 3149 -5464 10369 22095 17291 24866 -695 -19314 -26021 -43354
6818 -43354 -55969 -50435 -36408 -34939 -36534 -15137 -10677 -3011 -33941 -54417 -49730 -22136 10639
6805 10639 17079 28015 -572 -2210 -8099 -20724 -9160 -26573 -79709 -77752 -54783 -64782 -30980
6792 -30980 -44053 -53496 -30182 -25965 -2998 -6202 -22735 -15070 -11315 -31456 -34309 -21717 5641
6779 5641 -4321 -51248 -36640 1765 261 11370 8397 14776 17331 -836 -38561 -73886 -59881
$$ packed form
6870a4933m335o90N291L097J3763j6064j7235K9696J9774j777k3521m664L789
6857g809k9864O006N533k668J2581J5507J9181M631P024O799l3062k8195j4025
6844c8361l30K2108N249q927j9794j9800N764K0821J0355L811J6895J586K429
6831A806P214J1275q865q281q613J5833J1726m804P575k5561j8619o707j7333
6818d3354j2615N534J4027J469j595K1397M460P666l0930k0476M687K7594L2775
6805A0639O440J0936k8587j638n889j2625J1564j7413n3136J957K2969r999L3802
6792c0980j3073r443K3314M217K2967l204j6533P665L755k0141k853J2592K7358
6779E641r962m6927J4608L8405j504J1109k973O379K555j8167l7725l5325J4005
$$ plain form
6766 -59881 -57184 -60864 -53063 -39533 -20190 -25571 -19369 1499 2565 -10759 -24195 -21393 -10156
6753 -10156 -20846 -22774 -12790 -22488 -23011 -20289 18356 18373 -9089 -16275 -17209 -12176 -23296 -34588
6739 -34588 -38385 -16018 -22666 -26710 -39726 -40387 -4140 32612 8858 -7026 10915 -18287 -31133
6726 -31133 -38405 -54542 -47829 -39327 -38559 -15759 -5798 25875 56469 43757 5524 -1148 -16082
6713 -16082 -17491 5735 26227 37165 61313 96168 91776 115807 177913 207413 197716 193493 188847
6700 188847 172211 126770 96779 68085 56216 61428 44512 43451 31301 -3519 -8463 -16587
6688 -16587 -21195 -10386 -4402 -15841 -20564 -5780 4571 -1135 -25538 -19206 -2073 16794 44441
6675 44441 37270 25606 -2087 2364 13976 13130 -496 6304 -21524 -43278 -19923 -21381 -41743
$$ packed form
6766e9881K697l680P801J3530J9343n381O202K0868J066j3324j3436K802J1237
6753a0156j0690j928R984r698n23K722L8645J7k7462p186r34N033j1120j1292
6739c4588l797K2367o648m044j3016o61L6247L6752k3754j5884J7941k9202j2846
6726c1133p272j6137O713Q502P68K2800R961L1673L0594j2712l8233o672j4934
6713a6082j409K3226K0492J0938K4148L4855m392K4031O2106K9500r697m223m646
6700A88847j6636m5441k9991k8694j1869N212j6916j061j2150l4820m944q124
6688a6587m608J0809N984j1439m723J4784J0351n706k4403O332J7133J8867K7647
6675D4441p171j1664k7693M451J1612q46j3626O800k7828k1754K3355j458k0362
$$ plain form
6662 -41743 -45133 -53443 -58476 -36855 -31091 -29796 -14654 -7116 1131 24 -1653 9313 6756 -9524
6648 -9524 10241 28031 46978 24951 -13671 -34710 -36196 -34469 -18604 -13392 -15988 381 -1096
6635 -1096 -8895 108 -24383 -37321 -29147 -23413 -33436 -20139 12844 33988 22084 15167 19003
6622 19003 -9790 -31216 -44138 -41358 -50590 -73722 -68387 -41231 -55421 -23738 -3532 -7212 -14643
6609 -14643 2321 -4267 -8423 21845 27989 7764 12258 29583 18135 9783 -5440 -35850 -26635
6596 -26635 -30195 -23324 -19867 -10667 -8989 -683 24919 18973 11087 6838 -13711 -7787 -3453 -2330
6582 -2330 -3288 12051 938 2630 6322 -19329 -10677 -168 -36966 -41295 -31957 -24752 -12032 -5176
6568 -5176 -17169 -6542 -3132 -7303 -13010 -27455 -25168 -21107 -16710 8208 5268 -22312 -26744 1250
$$ packed form
6662d1743l390q310n033K1621N764J295J5142P538Q247j107j677J0966k557j6280
6648i524J9765J7790J8947k2027l8622k1039j486J727J5865N212k596J6369j477
6635a096p799R003k4491j2938Q174N734j0023J3297L2983K1144j1904o917L836
6622A9003k8793k1426j2922K780r232k3132N335K7156j4190L1683K0206l680p431
6609a4643J6964o588m156L0268O144k0225M494J7325j1448q352j5223l0410R215
6596b6635l560O871L457R200J678Q306K5602n946p886m249k0549N924M334J123
6582b330r58J5339j1113J692L692k5651Q652J0509l6798m329R338P205J2720O856
6568e176j1993J0627L410m171n707j4445K287M061M397K4918k940k7580m432K7994
$$ plain form
6554 1250 36419 10969 -10568 -36476 -18771 -18152 -34069 -36541 -42144 -44430 -43782 -53041 -31855 -42901
6540 -42901 -21838 -6752 -18892 -34800 -22778 -13659 -8464 25029 34456 25810 28508 14539 8270
6527 8270 -13458 -30210 -36378 -25072 -11669 -33326 -36356 -17441 -6004 -10218 -8362 -8889 -8100 -26268
6513 -26268 -15285 -12379 -19487 -18105 -10971 -13447 144 1638 -9765 -5568 -10851 -15488 -8626 -18141
6499 -18141 -8220 -14567 -15494 -26959 -24371 -6452 -24064 -43405 -48318 -48155 -22010 -17880 -10640 1454
6485 1454 10871 -3481 -8755 15810 45108 57424 42637 39298 28675 44111 27301 -5375 -7402
6472 -7402 -17040 -21220 -12254 -14250 -33402 -33602 -24056 -25880 -29589 -30441 -13950 -10806 -14035 2358 -3116
6457 -3116 -8417 2152 8812 -4229 5101 3529 -3394 -609 -25436 -46513 -10790 14489 -6149
$$ packed form
6554A250L5169k5450k1537k5908J7705O19j5917k472n603k286O48r259K1186j1046
6540d2901K1063J5086j2140j5908J2022R119N195L3493R427q646K698j3969o269
6527H270k1728j6752o168J1306J3403k1657l030J8915J1437m214J856n27P89j8168
6513b6268J0983K906p108J382P134k476J3591J494j1403M197n283m637O862r515
6499a8141R921o347r27j1465K588J7919j7612j9341m913J63K6145M130P240J2094
6485A454R417j4352n274K4565K9298J2316j4787l339j0623J5436j6810l2676k027
6472g402r638m180Q966j996j9152k00R546j824l709q52J6491L144l229J6393n474
6457c116n301J0569O660j3041R330j572o923K785k4827k1077L5723K5279k0638
$$ plain form
6444 -6149 -41595 -17657 19393 41858 54285 5224 -38682 -77022 -72911 -48227 -48389 -28620 -9960
6431 -9960 -27017 -43890 -24093 -15363 366 5789 -2148 -19447 -13113 2672 13337 26743 22300
6418 22300 2193 -30642 -43828 -32812 -39026 -49771 -32430 -9119 -16522 12121 54352 27089
6406 27089 -23133 -46950 -41625 -9630 -8192 -11384 -13144 562 2199 -14917 -27642 -24833 3478
6393 3478 21250 7822 -10866 -32402 -13814 -15442 -34828 -52247 -32652 -49531 -54624 -45884 -33967
6380 -33967 -23643 8441 41805 23029 -17876 -40430 -16369 -12787 7409 24866 22928 -9737
6368 -9737 -29860 -37606 -29614 -25527 -9375 -4942 8519 -9994 -30132 -24636 -29826 -48481 -36513
6355 -36513 -47402 -71296 -60653 -47200 -51429 -19718 -22736 -21511 -3129 -4594 20533 34264 44410
$$ packed form
6444f149l5446K3938L7050K2465J2427m9061m3906l8340M111K4684j62J9769J8660
6431i960j7057j6873J9797Q730J5729N423p937j7299O334J5785J0665J3406m443
6418B2300k0107l2835j3186J1016o214j0745J7341K3311p403K8643M2231k7263
6406B7089n0222k3817N325L1995J438l192j760J3706J637j7116j2725K809K8311
6393C478J7772j3428j8688k1536J8588j628j9386j7419J9595j6879n093Q740J1917
6380c3967J0324L2084L3364j8776m0905k2554K4061L582K0196J7457j938l2665
6368i737k0123p746P992M087J6152M433J3461j8513k0138N496n190j8655J1968
6355c6513j0889k3894J0643J3453m229L1711l018J225J8382j465K5127J3731J0146
$$ plain form
6342 44410 48374 67056 63895 28312 1074 829 -31423 -31061 -4740 -6426 1709 16636 21145 3887
6328 3887 -5464 5414 14253 26900 23991 8429 1626 20639 43798 49065 55033 59616 49464
6315 49464 12119 -16251 -34366 -46680 -53908 -37685 -30916 -31440 -39757 -29722 -29810 -23848 -21061 -16928
6301 -16928 222 -16701 -32066 -44124 -53997 -63378 -63338 -68683 -72384 -80356 -59785 -42534 -37781 -35613
6287 -35613 -33532 6652 9883 541 9505 13522 -11775 -19351 -14241 8623 13348 -12547 -16685 3344
6273 3344 2281 -26397 -33868 -34368 -16856 -21259 -39298 -46899 -16740 -4797 10522 14493 11697 -4841
6259 -4841 -37038 -24067 -5464 7056 -1423 -7788 10961 6235 13190 15835 -19917 -24405 -20880
6246 -20880 1176 -3902 -19384 -11328 -14373 -16015 -10277 -29890 -36552 -41739 -49998 -45304 -36269 -32608
$$ packed form
6342D4410L964J8682l161l5583k7238k45l2252L62K6321j686Q135J4927M509j7258
6328C887r351J0878Q839J2647k909j5562o803J9013K3159N267N968M583j0152
6315D9464l7345k8370j8115j2314p228J6223O769n24q317J0035q8N962K787M133
6301a6928J7150j6923j5365j2058r873r381M0n345l701p972K0571J7251M753K168
6287c5613K081M0184L231r342Q964M017k5297p576N110K2864M725k5895m138K0029
6273C344j063k8678p471n00J7512m403j8039p601L0159J1943J5319L971k796j6538
6259d841l2197J2971J8603J2520q479o365J8749m726O955K645l5752m488L525
6246b0880K2056n078j5482Q056l045j642N738j9613o662n187q259M694R035L661
$$ plain form
6232 -32608 -29321 -30981 -52348 -28060 -9361 -10086 3807 -7893 -13962 -10587 -18328 -52171 -96160
6219 -96160 -118098 -75177 -34738 -7586 -10088 -10303 -22354 -25932 -24413 -41792 -52028 -45434 1053
6206 1053 25996 11599 1615 -4718 3552 21185 17344 -18247 -25459 -9503 -413 -758 28607 45878
6192 45878 32124 30092 25471 15732 20591 48674 77192 50846 -9876 -22128 -11900 5796 13936
6179 13936 3448 -10440 -12959 -6845 -22954 -26849 -27188 6319 20534 8363 8732 -9174 -40084
6166 -40084 -41879 -38277 -58046 -23422 20272 23611 13854 -17405 -9904 -19526 -6016 -854 -14696
6153 -14696 -24837 -12372 -476 8491 1948 4810 -1487 19375 30622 13069 -10673 -36720 -47934
6140 -47934 -22026 -32143 -39117 -32287 -18264 9376 15230 -1556 8889 18015 14939 13898 21290
$$ packed form
6232c2608L287j660k1367K4288J8699p25J3893j1700o069L375p741l3843m3989
6219i6160k1938M2921M0439K7152k502k15j2051l578J519j7379j0236O594M6487
6206A053K4943j4397r984o333Q270J7633l841l5591p212J5956R090l45K9365J7271
6192D5878j3754k032m621r739M859K8083K8518k6346o0722j2252J0228J7696Q140
6179A3936j0488j3888k519O114j6109l895l39L3507J4215j2171L69j7906l0910
6166d0084j795L602j9769L4624M3694L339r757l1259P501r622J3510N162j3842
6153a4696j0141J2465J1896Q967o543K862o297K0862J1247j7553k3742k6047j1214
6140d7934K5908j0117o974O830J4023K7640N854j6786J0445R126l076j041P392
$$ plain form
6127 21290 14960 7907 -4256 -14017 -12708 -5704 6579 12372 27217 22998 -1486 -20135 1136
6114 1136 36404 63978 52892 18233 -8013 -9518 -17877 -38905 -37678 -35709 -63499 -52706 -47691
6101 -47691 -9936 15704 9459 25420 29283 14508 31392 24888 23572 20114 -6913 -3561 8766
6088 8766 6758 -21835 13580 30452 20386 15696 12573 33343 28604 36184 51853 47391 34718
6075 34718 34923 24396 -20598 -39410 -24367 6547 13513 -208 7052 -13422 -23803 -1770 23833
6062 23833 47297 19835 1035 -3147 13799 -41 -15504 -2750 -11361 -26297 -15264 -29169
6050 -29169 -29986 8065 -10211 -19695 -44325 -41486 -14884 -15571 -18848 -13490 2356 14747 7890 30504
6036 30504 16145 -23694 -32348 -20980 -9537 14900 37742 1479 -24603 -33575 -54545 -60975
$$ packed form
6127B1290o330p053j2163r761J309P004J2283N793J4845m219k4484j8649K1271
6114A136L5268K7574j1086l4659k6246j505q359k1028J227J969k7790J0793N015
6101d7691L7755K5640o245J5961L863j4775J6884o504j316l458k7027L352J2327
6088H766k008k8593L5415J6872j0066m690l123K0770m739P580J5669m462j2673
6075C4718K05j0527m4994j8812J5043L0914O966j3721P260k0474j0381K2033K5603
6062B3833K3464k7462j8800m182J6946j3840j5463J2754q611j4936J1033j3905
6050b9169q17L8051j8276r484k4630K839K6602o87l277N358J5846J2391o857K2614
6036C0504j4359l9839q654J1368J1443K4437K2842l6263k6082q972k0970o430
$$ plain form
6024 -60975 -46004 -9385 18192 7107 -15888 6857 27372 27386 29036 18274 19858 -4807 -21792
6011 -21792 -27906 -26463 -19753 -17506 -28545 -18026 -21326 -16232 -5080 -10771 10094 4679 -13487
5998 -13487 -12279 -8081 -48622 -33145 1049 -12378 -58269 -66366 -31472 10138 23643 7342
5986 7342 -6946 -23725 -3640 -21266 -35073 -43822 -16648 10887 13722 16434 -2578 -26655 -32860
5973 -32860 -38610 -32993 -4629 3702 7152 -8918 -30626 -38761 -17321 1951 -1871 -30948 -31225
5960 -31225 9224 23647 38990 43038 30754 19154 18314 14953 -3956 10509 22842 21240 -1779
5947 -1779 7463 -18766 -4926 -672 -6908 -14218 -28013 -6048 2672 10712 -16736 -22286 1849
5934 1849 3153 -20176 -22882 -6002 -8133 -7003 7783 3836 -3091 -28380 -51475 -61558 -49813
$$ packed form
6024f0975J4971L6619K7577j1085k2995K2745K0515J4J650j0762J584k4665j6985
6011b1792o114J443O710K247j1039J0519l300N094J1152n691K0865n415j8166
5998a3487J208M198m0541J5477L4194j3427m5891q097L4894M1610J3505j6301
5986G342j4288j6779K0085j7626j3807q749K7174K7535K835K712j9012k4077o205
5973c2860n750N617K8364Q331L450j6070k1708q135K1440J9272l822k9077k77
5960c1225M0449J4423J5343M048j2284j1600q40l361j8909J4465J2333j602k3019
5947a779R242k6229J3840M254o236p310j3795K1965Q720Q040k7448n550K4135
5934A849J304k3329k706J6880k131J130J4786l947o927k5289k3095j0083J1745
$$ plain form
5921 -49813 -38111 -17728 -27337 -40627 -16997 -9152 -5902 -16512 -23400 -17085 -8066 -14055 -17348
5908 -17348 -21789 -12235 11789 12136 -472 -15959 -4795 -2643 -6315 -3748 -9559 10098 19649 37017
5894 37017 49191 38228 25600 18295 31317 34393 29590 12577 24171 18831 10793 18876 11611
5881 11611 -5844 -5107 -7163 -2365 -19858 -23724 -8328 -17809 -11351 -822 10328 5140 -497 -2716
5867 -2716 -29578 -42372 -44318 -10826 -18207 -3489 -18181 -47342 -43316 -40434 -38076 -16038 15833
5854 15833 36831 55586 73507 60850 40242 44568 35829 31524 26035 -2468 -34778 -22621 -7037
5841 -7037 -5694 -3718 -14468 -12246 22485 19005 1537 4972 16664 14853 6091 -7456 -11818 -43799
5827 -43799 -58802 -25599 -17043 -10347 -5380 19169 26060 20001 659 -21329 -21975 -6668 14924
$$ packed form
5921d9813J1702K0383r609j3290K3630P845L250j0610o888O315R019n989l293
5908a7348m441R554K4024L47j2608j5487J1164K152l672K567n811J9657R551J7368
5894C7017J2174j0963j2628p305J3022L076m803j7013J1594n340q038Q083p265
5881A1611j7455P37k056M798j7493l866J5396r481O458J0529J1150n188n637k219
5867b716k6862j2794j946L3492p381J4718j4692k9161M026K882K358K2038L1871
5854A5833K0998J8755J7921j2657k0608M326q739m305n489k8503l2310J2157J5584
5841g037J343J976j0750K222L4731l480j7468L435J1692j811q762j3547m362l1981
5827d3799j5003L3203Q556O696M967K4549O891o059j9342k1988o46J5307K1592
$$ plain form
5814 14924 -12516 -29991 -3884 21114 37513 12589 -14733 -12419 -26431 -16697 23771 11005
5802 11005 -20499 -38483 -11409 13731 37656 36556 39743 10623 -42713 -46069 2711 22365
5790 22365 16431 25167 9333 11267 13966 -1835 11731 -109 -5579 -3330 8088 31432 19488
5777 19488 10213 47868 50782 49100 23937 31722 43759 13229 16865 1427 -18769 -30201 -56040
5764 -56040 -79299 -54280 4662 10774 -11072 3366 17434 -22536 -23360 -12258 -20626 -44367 -40508
5751 -40508 -23452 -36876 -39824 -24132 -11373 -13680 -4701 -24640 -50157 -67012 -37395 -7437
5739 -7437 -16778 -3352 8351 8385 4418 -6924 -4165 -11607 815 3406 -6122 -12287 -8746 -13621
5725 -13621 -20655 -29004 -20679 -12980 5918 -13475 -49109 -36685 -19100 -37572 -32909 -977 -8919
$$ packed form
5814A4924k7440j7475K6107K4998J6399k4924k7322K314j4012R734M0468j2766
5802A1005l1504j7984K7074K5140K3925j100L187k9120n3336l356M8780J9654
5790B2365n934Q736j5834J934K699j5801J3566j1840n470K249J1418K3344j1944
5777A9488r275L7655K914j682k5163P785J2037l0530L636j5438k0196j1432k5839
5764e6040k3259K5019N8942O112k1846J4438J4068l9970q24J1102q368k3741L859
5751d0508J7056j3424k948J5692J2759k307Q979j9939k5517j6855K9617K9958
5739g437r341J3426J1703L4l967j1342K759p442J2422K591r528o165L541m875
5725a3621p034q349Q325P699J8898j9393l5634J2424J7585j8472M663L1932p942
$$ plain form
5712 -8919 -12759 -11056 -10337 -20972 -15119 -8574 -6223 -8864 -14424 13802 64966 84803 26969 -24207
5698 -24207 -18437 -13347 9265 10653 -4567 -5612 -781 5398 4287 10605 9625 -1424 10465 38993
5684 38993 51921 50075 65141 40242 -165 -8384 9853 14910 11219 11445 6104 1582 -108 -2000
5670 -2000 -3650 -8546 -5305 28292 50784 49142 30756 8827 -9953 -7903 7340 6024 20284
5657 20284 31304 15436 -8809 -6412 -2014 3413 -415 -25180 -27353 -28292 -42662 -24695 -6961
5644 -6961 -2862 -16273 -60871 -62101 -31770 -41435 -41115 -44278 -14308 -17041 -14657 -32264 -22957 -7984
5630 -7984 14808 38624 33549 -4718 -9561 -10756 -42192 -35522 -30202 -34098 -36814 -4051 12693
5617 12693 -2567 -11143 -4031 6205 12850 -42837 -51754 -29281 -27395 -28072 -44281 -72445 -55255
$$ packed form
5712h919l840J703P19j0635N853O545K351k641n560K8226N1164J9837n7834n1176
5698b4207N770N090K2612J388j5220j045M831O179j111O318r80j1049J1889K8528
5684C8993J2928j846J5066k4899m0407q219J8237N057l691K26n341m522j690j892
5670b000j650m896L241L3597K2492j642j8386k1929j8780K050J5243j316J4260
5657B0284J1020j5868k4245K397M398N427l828k4765k173r39j4370J7967J7734
5644f961M099j3411m4598j230L0331r665L20l163K9970k733K384j7607R307J4973
5630g984K2792K3816n075l8267m843j195l1436O670N320l896k716L2763J6744
5617A2693j5260q576P112J0236O645n5687q917K2473J886o77j6209k8164J7190
$$ plain form
5604 -55255 -16852 -12223 -19881 -21621 -14261 2397 2678 -7423 -13698 -14644 7812 14144 2710 6567
5590 6567 -6588 -14766 -5414 2555 -10797 -16302 -43276 -42079 -17539 -18982 -39227 -45770 -8766
5577 -8766 14176 5250 -7637 -10225 -35814 -24912 -37739 -29350 -25137 -30091 -18507 -3876 -20886
5564 -20886 -25019 -1553 5040 -8252 -19558 -9895 10658 -12056 -15450 15142 3205 -11835 1849
5551 1849 1988 -6158 -830 -35449 -38496 -36474 -37117 -9679 5491 19862 30724 21041 3659 -22189
5537 -22189 -28981 -11184 19922 16631 -1543 -614 -20913 -3932 593 -11304 -11030 18953 43139
5524 43139 15339 -10883 -23845 -41646 -6296 16971 23693 22917 24045 36876 12955 -15837 -23583
5511 -23583 -7812 2876 5623 23989 21775 36347 10683 -13972 -21384 -34128 -53429 -48926 -43406
$$ packed form
5604e5255L8403M629p658j740P360J6658K81j0101o275r46K2456O332j1434L857
5590F567j3155q178R352P969j3352n505k6974J197K4540j443k0245o543L7004
5577h766K2942q926j2887k588k5589J0902j2827Q389M213m954J1584J4631j7010
5564b0886m133K3466O593j3292j1306R663K0553k2714l394L0592j1937j5040J3684
5551A849J39q146N328l4619l047K022o43K7438J5170J4371J0862r683j7382k5848
5537b2189o792J7797L1106l291j8174R29k0299J6981M525j1897K74K9983K4186
5524D3139k7800k6222j2962j7801L5350K3267O722p76J128J2831k3921k8792p746
5511b3583J5771J0688K747J8366k214J4572k5664k4655p412j2744j9301M503N520
$$ plain form
5498 -43406 -36095 -28410 -3723 -33270 -65811 -74996 -54089 -30459 3905 3013 -14190 -13861 -17941
5485 -17941 4616 31306 28905 6170 -12159 -24629 -49544 -53414 -64022 -47598 -24918 -24738 1229
5472 1229 -2956 -19750 -32966 -25080 -47781 -73848 -17010 21523 -3459 -18024 10070 11365 -11481
5459 -11481 -24270 -31977 -39417 -45012 -21820 -4329 -16183 -21072 -16505 -4230 2858 -9268 -31630
5446 -31630 -58972 -57397 -35102 -21826 -28436 -23626 -21326 -25660 -15042 -15015 -35236 -31146 -31629 -36626
5432 -36626 -39301 -30728 -2642 11658 -3919 -3315 -2325 13378 -6978 -31153 -21201 8122 19691
5419 19691 39371 55022 28221 9472 11647 1944 -8298 -3074 -11376 -24750 -23033 1370 -15993
5406 -15993 -16937 -14488 -7905 -18380 -5154 21247 31062 14715 4993 7674 30689 47853 27442
$$ packed form
5498d3406P311P685K4687k9547l2541r185K0907K3630L4364q92j7203L29m080
5485a7941K2557K6690k401k2735j8329j2470k4915l870j0608J6424K2680J80K5967
5472A229m185j6794j3216P886k2701k6067N6838L8533k4982j4565K8094J295k2846
5459a1481j2789p707p440n595K3192J7491j1854m889M567J2275P088j2126k2362
5446c1630k7342J575K2295J3276o610M810K300m334J0618K7k0221M090m83m997
5432c6626k675Q573K8086J4300j5577O04R90J5703k0356k4175R952K9323J1569
5419A9691J9680J5651k6801j8749K175r703j0242N224q302j3374J717K4403j7363
5406a5993r44K449O583j0475J3226K6401R815j6347r722K681K3015J7164k0411
$$ plain form
5393 27442 -27170 -36450 2441 29864 59515 46518 16464 -3585 -10007 -1140 3315 -20135 -40789
5380 -40789 -40941 -29132 -57013 -57129 -52354 -46467 -24957 -42490 -25071 -12774 -14852 2176 10398
5367 10398 5677 -3181 -10801 -29909 -26248 736 20879 43489 37139 2269 -16909 -27417 -35332
5354 -35332 -20727 11478 -1674 -9445 -36211 -23106 -21430 -20072 -15763 -19191 -15710 -10561 -1319
5341 -1319 -4480 -36277 -35230 -35412 -21537 -32970 -38315 -39030 -26135 -41317 -17648 -20428 -4823 4965
5327 4965 21622 32449 5524 4690 26892 18851 28266 32134 8416 10172 13703 4542 -28232 -14708
5313 -14708 3702 12016 18297 -15701 -5479 19303 16092 8065 20142 31712 29606 23376 25040
5300 25040 -22192 -53940 -64038 -77698 -67659 -51650 -40151 -16864 -9155 7358 14057 6688
$$ packed form
5393B7442n4612r280L8891K7423K9651j2997l0054k0049o422Q867M455k3450k0654
5380d0789j52J1809k7881j16M775N887K1510j7533J7419J2297k078J7028Q222
5367A0398m721q858p620j9108L661K6984K0143K2610o350l4870j9178j0508p915
5354c5332J4605L2205j3152p771k6766J3105J676J358M309l428L481N149R242
5341a319l161l1797J047j82J3875j1433n345p15J2895j5182K3669k780J5605R788
5327D965J6657J0827k6925q34K2202q041R415L868k3718J756L531r161l2774J3524
5313a4708J8410Q314O281l3998J0222K4782l211q027J2077J1570k106o230J664
5300B5040m7232l1748j0098j3660J0039J6009J1499K3287P709J6513O699p369
$$ plain form
5288 6688 -12041 -2151 -3173 6058 -1615 35712 57089 49567 50203 22831 -1799 -6080 -10791 -14950
5274 -14950 -43550 -42785 -15364 -15857 -15444 -3211 32037 5418 4614 8288 -27204 -21557 13579 -1080
5260 -1080 845 -4283 13168 -11622 -33716 -54838 -37233 -11665 8775 25955 27448 37064 54429
5247 54429 70924 64695 33979 21827 28865 28634 -7140 -37384 -16970 9571 28595 5626 -32568
5234 -32568 -43187 -17789 -17197 -28269 -33844 -31323 -19886 -17561 -7262 -7832 -10903 -5551 5736 -27107
5220 -27107 -40533 -32205 -34053 -47571 -14864 -7128 -10528 -5877 -29762 -11294 5707 -2066 6099
5207 6099 15007 3624 -9579 -28410 -31787 -10114 -3259 -10299 6147 14791 3867 -36297 -56728
5194 -56728 -68664 -63821 -51621 -35613 -29817 -10439 2609 28054 40231 17290 33567 49540
$$ packed form
5288F688j8729R890j022R231p673L7327K1377p522O36k7372k4630m281m711m159
5274a4950k8600P65K7421m93M13J2233L5248k6619q04L674l5492N647L5136j4659
5260a080J925n128J7451k4790k2094k1122J7605K5568K0440J7180J493R616J7365
5247E4429J6495o229l0716j2152P038k31l5774l0244K0414K6541J9024k2969l8194
5234c2568j0619K5398N92j1072n575K521J1437K325J0299n70l071N352J1287l2843
5220b7107j3426Q328j848j3518L2707P736l400M651k3885J8468J7001p773Q165
5207F099Q908j1383j3203j8831l377K1673O855p040J6446Q644j0924m0164k0431
5194e6728j1936M843J2200J6008N796J9378J3048K5445J2177k2941J6277J5973
$$ plain form
5182 49540 22283 7742 -369 16429 19441 32724 46006 56008 46082 16268 -8138 -28305
5170 -28305 -24045 -10377 -25760 -22618 15469 12225 -2476 -6813 -18763 -6151 -16760 -29477 -11310
5157 -11310 -297 -27511 -50729 -42355 -25523 -4625 15182 29520 14632 17959 8132 -728 2796
5144 2796 -21920 -35586 -41796 -30221 -26770 -26779 -3765 -4150 -23366 -33451 11745 24719 9777 -9391
5130 -9391 5638 25893 14381 15180 2818 7603 9959 -11569 -14396 -6322 -10575 -29929 -29485 -8415
5116 -8415 -19084 -25039 -11586 -5630 -2519 17219 26080 11233 8702 18719 23971 4268 12823
5103 12823 17790 7438 -16421 -16274 -25937 -13225 11080 1767 3920 19921 15316 10992 11504 -10634
5089 -10634 -18882 -14612 15550 40418 36591 23827 26307 19054 30765 17472 20109 18145 3923
$$ packed form
5182D9540k7257j4541q111J6798L012J3283J3282J0002r926k9814k4406k0167
5170b8305M260J3668j5383L142L8087l244j4701m337j1950J2612j0609j2717J8167
5157a1310J1013k7214k3218Q374J6832K0898J9807J4338j4888L327r827q860L524
5144B796k4716j3666o210J1575L451rK3014l85j9216j0085M5196J2974j4942j9168
5130i391J5029K0255j1512P99j2362M785K356k1528k827Q074m253j9354M44K1070
5116h415j0669n955J3453N956L111J9738Q861j4847k531J0017N252j9703Q555
5103A2823M967j0352k3859J47r663J2712K4305r313K153J6001m605m324N12k2138
5089a0634q248M270L0162K4868l827j2764K480p253J1711j3293K637j964j4222
$$ plain form
5076 3923 3175 -9535 -10463 15595 19020 -6058 -31629 -27530 -5016 19146 14955 -11231 -22538
5063 -22538 -22527 -50025 -36647 2894 8598 15634 -7610 -18973 -19117 15722 41028 37079 20764
5050 20764 4666 -6296 -33968 -13447 18951 575 -3656 -2865 24899 29032 5901 2440 -21208
5037 -21208 -4647 29014 50962 39274 49381 55239 11878 -6620 -6309 -13264 -18968 23431 22486
5024 22486 -1822 -27383 -45705 -25658 -11481 -4317 -14758 -4374 18433 10230 -37828 -57637
5012 -57637 -54504 -48687 -44352 -51109 -49868 -31571 -8664 3548 25558 39524 14896 12106 -12941
4999 -12941 -59242 -60474 -38788 -19490 6538 12612 26300 14652 -16151 -33067 -24518 -14998 1959
4986 1959 18773 15883 3761 20024 6322 -11606 25633 50065 50838 45150 28108 23760 12457
$$ packed form
5076C923p48j2710r28K6058L425k5078k5571M099K2514K4162m191k6186j1307
5063b2538J1k7498J3378L9541N704P036k3244j1363j44L4839K5306l949j6315
5050B0764j6098j0962k7672K0521L2398j8376m231P91K7764M133k3131l461k3648
5037b1208J6561L3661K1948j1688J0107N858m3361j8498L11o955n704M2399r45
5024B2486k4308k5561j8322K0047J4177P164j0441J0384K2807q203m8058j9809
5012e7637L133N817M335o757J241J8297K2907J2212K2010J3966k4628k790k5047
4999a2941m6301j232K1686J9298K6028O074J3688j1648l0803j6916Q549R520J6957
4986A959J6814k890j2122J6263j3702j7928L7239K4432P73n688j7042m348j1303
$$ plain form
4973 12457 -9956 -19275 -23035 -17345 -4855 26296 47281 44225 20539 -10149 -19013 -10492 8228
4960 8228 7654 10255 11788 35719 63457 51570 29472 25845 9296 11285 -1160 -18093 -15182
4947 -15182 6797 8994 -23328 -30323 -22322 -18623 -4235 3703 17253 -2321 6504 18875 10517
4934 10517 16306 23133 28606 31220 14344 -3751 -10092 3943 27728 31395 5612 -6977 -9408
4921 -9408 -5823 16541 21094 21104 -6117 11654 11637 1440 -7746 -6501 8880 -9 -25230 -45252
4907 -45252 -39409 -7976 8334 5553 23257 27005 7139 9685 -1394 -28169 -16322 -14169 -23789
4894 -23789 -19331 -39644 -42049 -23423 -27852 -28291 -26257 -39975 -33833 -9094 14330 11247 10620 3345
4880 3345 32454 47917 47715 30262 9945 -7396 -2847 5583 -10164 -4780 -1489 -6933 -18156
$$ packed form
4973A2457k2413r319l760N690J2490L1151K0985l056k3686l0688q864Q521J8720
4960H228n74K601J533K3931K7738j1887k2098l627j6549J989j2445j6933K911
4947a5182K1979K197l2322o995Q001L699J4388P938J3550j9574Q825J2371q358
4934A0517N789O827N473K614j6876j8095o341J4035K3785L667k5783j2589k431
4921i408L585K2364M553J0k7221J7771j7j0197r186J245J5381q889k5221k0022
4907d5252N843L1433J6310k781J7704L748j9866K546j1079k6775J1847K153r620
4894b3789M458k0313k405J8626m429m39K034j3718O142K4739K3424l083o27p275
4880C345K9109J5463k02j7453k0317j7341M549Q430j5747N384L291n444j1223
$$ plain form
4867 -18156 -25081 -18744 -40713 -28915 18047 16805 30223 39330 13923 -8470 -13730 -20285 -37336
4854 -37336 -35059 -10176 -20418 -23626 -20319 10868 11011 14136 -4036 -7025 -6769 11700 30458 20424
4840 20424 13132 -4968 -8074 -24685 -18821 -11300 -14714 -13020 22400 27252 23007 1238 -15860
4827 -15860 7055 15885 17304 31872 22255 -2284 -5215 -3497 -16067 -29458 -42450 -9225 -8752
4814 -8752 643 2378 33661 34420 45866 54333 62651 42153 7281 -14560 -18626 -17327 16964 51351
4800 51351 49515 14656 -19918 -26794 -28797 -10513 -255 -22132 -37852 -35709 -31353 -26252 -16481
4787 -16481 -22903 -20753 -11588 -24646 -35581 -41837 -33987 -44605 -71938 -61633 -60094 -14458 20614
4774 20614 7812 -9740 -26087 -11914 31931 40706 31957 29893 6087 9742 -13366 -3342 9311
$$ packed form
4867a8156o925O337k1969J1798M6962j242J3418R107k5407k2393n260o555j7051
4854c7336K277K4883j0242l208L307L1187J43L125j8172k989K56J8469J8758j0034
4840B0424p292j8100l106j6611N864P521l414J694L5420M852m245k1769j7098
4827a5860K2915Q830J419J4568r617k4539k931J718j2570j3391j2992L3225M73
4814h752R395J735L1283P59J1446Q467Q318k0498l4872k1841m066J299L4291L4387
4800E1351j836l4859l4574o876k003J8284J0258k1877j5720K143M356N101R771
4787a6481o422K150R165j3058j0935o256P850j0618k7333J0305J539M5636L5072
4774B0614j2802j7552j6347J4173M3845Q775q749k064k3806L655k3108J0024J2653
$$ plain form
4761 9311 33414 33961 9590 8150 5305 10234 27501 28311 23046 22306 23420 11848 -6827 -13005
4747 -13005 -13915 -5425 -16136 -4010 18402 24885 9986 -1572 9300 10183 -30410 -57943 -46376
4734 -46376 -3618 10219 7730 -23899 -46672 -74174 -73505 -81549 -54232 -48354 -20032 -2508 -2787
4721 -2787 -12888 -29904 -41717 728 9156 -16238 -4648 -16372 -17803 -30587 -14833 -24045 -18213
4708 -18213 41 6741 11915 4783 -4058 -8896 -26991 -39498 -10866 -17441 -13341 11041 -7149
4695 -7149 -22398 -24074 -104 -2174 -24476 -22236 -26604 -22423 2293 -18830 -27832 -29318 -5969
4682 -5969 11758 29807 34913 70761 58967 37110 10662 11498 7927 -3174 3051 23278 34385
4669 34385 41722 9494 -27423 -29230 -41187 -39718 -1926 24694 13546 -1413 -7383 -11402 -16355
$$ packed form
4761I311K4103N47k4371j440k845M929J7267Q10n265p40J114j1572j8675o178
4747a3005r10Q490j0711J2126K2412O483j4899j1558J0872Q83m0593k7533J1567
4734d6376M2758J3837k489l1629k2773k7502O69q044K7317N878K8322J7524k79
4721b787j0101j7016j1813M2445Q428k5394J1590j1724j431j2784J5754r212N832
4708a8213J8254O700N174p132q841m838j8095j2507K8632o575M100K4382j8190
4695g149j5249j676K3970k070k2302K240m368M181K4716k1123r002j486K3349
4682e969J7727J8049N106L5848j1794k1857k6448Q36l571j1101O225K0227J1107
4669C4385P337l2228l6917j807j1957J469L7792K6620j1148j4959n970m019m953
$$ plain form
4656 -16355 -2050 -4422 -7882 -18727 -11617 -17235 1800 6308 15917 20126 24692 20904 13303 -3805
4642 -3805 -19095 2052 11808 24189 40482 31309 -2882 9037 14685 24515 5253 -20947 -10615
4629 -10615 -9105 -14666 -23893 -19777 10730 8001 -24401 -35712 -26451 -26268 -11540 -2013 23147 33743
4615 33743 26649 8475 -934 -6617 -20901 -67773 -73290 -21237 -24033 -32464 -42225 -23792 -3865
4602 -3865 -23660 -21511 -5220 -17093 -15230 -7271 -228 -287 -14571 -19955 -19392 -15419 17832 16378
4588 16378 555 -35498 -39056 -26221 -31610 -26205 -17478 22783 16775 -19618 -45824 -73347 -82556
4575 -82556 -64718 -69294 -28944 -8670 2432 -559 -11082 -11626 -21660 -26621 -32544 -11269 -30287
4562 -30287 -2963 8534 6039 -6269 10840 21935 16650 -1274 -2533 -5714 10098 11941 16469
$$ packed form
4656a6355J4305k372l460j0845P110n618J9035M508R609M209M566l788p601j7108
4642c805j5290K1147R756J2381J6293r173l4191J1919N648R830j9262k6200J0332
4629a0615J510n561r227M116L0507k729l2402j1311R261J83J4728R527K5160J0596
4615C3743p094j8174r409n683j4284m6872n517N2053k796q431r761J8433J9927
4602c865j9795K149J6291j1873J863P959P043n9j4284n384N63L973L3251j454
4588A6378j5823l6053l558J2835n389N405Q727M0261o008l6393k6206k7523r209
4575h2556J7838m576M0350K0274J1102k991j0523n44j0034m961n923K1275j9018
4562c0287K7324J1497k495j2308J7109J1095n285j7924j259l181J5812J843M528
$$ plain form
4549 16469 16704 8046 -5340 -11933 -26246 -7663 1317 -17345 3992 33730 18786 -16078 -41597
4536 -41597 -53251 -51582 -50942 -22096 -9931 637 -22688 -28903 -17274 -16330 -9362 -9008 -12439 -12930
4522 -12930 18256 13923 -11553 -7517 -8641 -29048 -26998 16540 41872 46242 36476 30405 6816
4509 6816 -9968 -5378 9566 -12013 -23911 -6141 -2230 -3893 -14396 -1317 -1193 -5967 593
4496 593 10860 25571 30457 34528 25533 14706 -18690 -31412 1455 19012 21000 32870 45961
4483 45961 18359 -4645 -4828 5857 5741 -4298 -19470 -6815 36739 47951 46294 40231 33236
4470 33236 24307 24662 18805 36875 43072 25770 -2226 -23614 -13472 17788 14677 2405 19162
4457 19162 -2465 -42681 -32373 -34435 -40539 -36249 -9939 3915 -9997 -33284 -34979 -31013 -17975
$$ packed form
4549A6469K35q658j3386o593j4313J8583Q980j8662K1337K9738j4944l4864k5519
4536d1597j1654J669O40K8846J2165J0568k3325o215J1629R44O968L54l431m91
4522a2930L1186m333k5476M036j124k0407K050M3538K5332M370r766o071k3589
4509F816j6784M590J4944k1579j1898J7770L911j663j0503J3079J24m774O560
4496E93J0267J4711M886M071q995j0827l3396j2722L2867J7557J988J1870J3091
4483D5961k7602k3004j83J0685j16j0039j5172J2655M3554J1212j657o063o995
4470C3236q929L55n857J8070O197j7302k7996k1388J0142L1260l111j2272J6757
4457A9162k1627m0216J0308k062o104M290K6310J3854j3912k3287j695L966J3038
$$ plain form
4444 -17975 -15494 6457 5935 44022 33175 722 -7708 22679 16965 -79 -1195 6047 16510
4431 16510 5807 12207 15763 7218 -5411 -2728 27418 23333 24279 11612 -13995 -6325 12555
4418 12555 18234 -7356 -24924 -10435 23815 22730 43566 4316 -17674 -20125 -19134 13578 -39
4405 -39 -9154 2569 20390 8536 9170 42021 60863 45469 3545 21 16001 26890 17285
4392 17285 13484 34631 41780 50725 54795 44448 26881 -1291 -9761 5000 10453 -6272 -36838
4379 -36838 -44559 -1761 10565 -27712 -50900 -28376 -3137 -7607 -21822 -20489 -22524 -36158 -47015
4366 -47015 -37757 -29511 -34671 -48033 -22580 -35537 -46326 -37730 -17980 -19956 -15578 -7465 2558
4353 2558 910 5212 32219 45943 27617 57444 82658 67122 33059 -5651 -4754 16451 20335
$$ packed form
4444a7975K481K1951n22L8087j0847l2453q430L0387n714j7044j116P242J0463
4431A6510j0703O400L556q545j2629K683L0146m085R46j2667k5607P670J8880
4418A2555N679k5590j7568J4489L4250j085K0836l9250k1990k451R91L2712j3617
4405c9r115J1723J7821j1854O34L2851J8842j5394m1924l524J5980J0889r605
4392A7285l801K1147P149Q945M070j0347j7567k8172q470J4761N453j6725l0566
4379c6838p721M2798J2326l8277k3188K2524K5239m470j4215J333k035j3634j0857
4366d7015R258Q246n160j3362K5453j2957j0789Q596J9750j976M378Q113J0023
4353B558j648M302K7007J3724j8326K9827K5214j5536l4063l8710Q97K1205L884
$$ plain form
4340 20335 -1276 -10598 5212 18523 38784 29958 5378 -37974 -44354 -17309 13341 -4119
4328 -4119 -35629 -44202 4159 44829 20254 -16618 -31420 -29999 -4963 30705 49764 48990 32970
4315 32970 13554 -4040 -13075 -26611 -37696 -33648 -13587 -5512 -27693 -43635 -16769 -35087
4303 -35087 -41708 -31744 -8753 -5400 -1987 -29092 -38953 -26332 7936 20139 12915 30076 36465
4290 36465 12987 10561 27173 48971 45586 25721 3172 -12935 -2134 6384 3982 423 14241
4277 14241 -1731 -2821 -5610 -6552 -27325 -39303 -35248 -5873 -15265 -5830 36301 50803 41568
4264 41568 24004 21550 -1884 13682 -4481 -1591 15684 9191 29234 21845 2877 -11973 -4916
4251 -4916 1547 -2227 -21646 -23910 2532 26508 21422 -13302 -35812 -56199 -38500 -29105 -36566
$$ packed form
4340B0335k1611r322J5810J3311K0261q826k4580m3352o380K7045L0650j7460
4328d119l1510q573M8361M0670k4575l6872j4802J421K5036L5668J9059p74j6020
4315C2970j9416j7594r035j3536j1085M048K0061Q075k2181j5942K6866j8318
4303c5087o621R964K2991L353L413k7105r861J2621L4268J2203p224J7161O389
4290C6465k3478k426J6612K1798l385j9865k2549j6107J0801Q518k402l559J3818
4277A4241j5972j090k789r42k0773j1978M055K9375r392R435M2131J4502r235
4264D1568j7564k454k3434J5566j8163K890J7275o493K0043p389j8968j4850P057
4251d916O463l774j9419k264K6442K3976n086l4724k2510k0387J7699R395p461
$$ plain form
4238 -36566 -21806 2739 18487 9787 32865 36527 22172 55976 64713 61502 43235 135 -3241
4225 -3241 2175 17365 40362 22065 -456 7013 7134 -1867 228 6868 9809 5440 21736 6874
4211 6874 7246 4236 -21300 -30369 -18414 -32985 -16605 -3418 -3585 13735 19553 22035 22779 25586
4197 25586 16744 6072 -7906 -18723 -19985 -31092 2596 11018 38827 48579 31337 33367 3671
4184 3671 -26787 -2943 3354 33759 30693 26969 30821 10429 21799 31744 21429 5112 8911
4171 8911 37764 37399 42813 28210 25838 5117 -21080 -42181 -47531 -53855 -46623 -34354 -40508 -59027
4157 -59027 -38845 16421 52315 37874 21080 16030 4681 13328 2184 -12094 295 -980
4145 -980 -1128 -1473 943 -11076 -39515 -7365 11975 17322 -23259 -45245 -19065 -6926 -927 15247
$$ packed form
4238c6566J4760K4545J5748q700K3078L662j4355L3804Q737l211j8267m3100l376
4225c241N416J5190K2997j8297k2521P469J21r001K095O640K941m369J6296j4862
4211F874L72l010k5536r069J1955j4571J6380J3187j67J7320N818K482P44K807
4197B5586q842j0672j3978j0817j262j1107L3688Q422K7809R752j7242K030k9696
4184C671l0458K3844O297L0405l066l724L852k0392J1370R945j0315j6317L799
4171H911K8853l65N414j4603k372k0721k6197k1101n350o324P232J2269o154j8519
4157e9027K0182N5266L5894j4441j6794n050j1349Q647j1144j4278J2389j275
4145i80j48l45K416j2019k8439L2150J9340N347m0581k1986K6180J2139N999J6174
$$ plain form
4131 15247 226 13062 10898 -1959 11910 36859 32202 28877 24137 -5060 -20573 6210 19401
4118 19401 43111 38871 34518 32791 28595 30050 20588 -7563 18623 17705 7806 -5197 4733 13782
4104 13782 -1350 -29897 -36717 -24123 -4040 -5528 -11298 -1586 35626 53651 30671 17588 3225
4091 3225 10671 -14896 -7461 -9023 -6071 -6746 -19520 -14758 -15442 -6185 -202 14327 2455 -17168
4077 -17168 -21425 -16910 12802 5509 7274 24064 11717 -14384 -28281 -9007 -3638 13558 27678
4064 27678 21087 -3884 -14872 -7606 -40377 -52988 -13908 -4317 -30800 -39148 -27312 -28558 -20955
4051 -20955 -2344 19851 17500 -18944 -36655 -26394 -25214 -15905 5800 -22391 -26111 -22930 -20003
4038 -20003 -15951 -13894 15451 29426 25335 29620 20792 34467 17964 14417 10317 11147 7312 -8420
$$ packed form
4131A5247j5021J2836k164j2857J3869K4949m657l325m740k9197j5513K6783J3191
4118A9401K3710m240m353j727m196J455r462k8151K6186r18r899j3003R930R049
4104A3782j5132k8547o820J2594K0083j488n770R712L7212J8025k2980j3083j4363
4091C225P446k5567P435j562K952o75j2774M762o84R257N983J4529j1872j9623
4077a7168m257M515K9712p293J765J6790j2347k6101j3897J9274N369J7196J4120
4064B7678o591k4971j0988P266l2771j2611L9080R591k6483q348J1836j246P603
4051b0955J8611K2195k351l6444j7711J0261J180R309K1705k8191l720L181K927
4038b0003M052K057K9345J3975m091M285q828J3675j6503l547m100Q30l835j5732
$$ plain form
4024 -8420 -2703 -12511 17073 25002 4027 16407 35794 38011 8130 -9449 -6987 -2587 -19427
4011 -19427 -29571 -9453 -254 -21274 -27806 -3489 13053 -1157 -33672 -71535 -53913 -43463
3999 -43463 -13973 3003 -6832 -8352 -17571 7047 29463 15931 -20130 -31508 -48981 -24804
3987 -24804 -11576 -18219 1346 26209 9015 541 10398 -24382 -20898 -21958 -30830 -30877 4549 -9816
3973 -9816 -38957 -64234 -50364 -37674 -36879 -22667 -37755 2333 14621 28819 33611 18409 22874
3960 22874 40856 33006 11116 3841 5219 -13179 11998 33187 27075 24367 10836 -11272 -14745
3947 -14745 -22515 -33527 -26154 -14145 -8529 1830 8977 6797 -23280 -28775 -43905 -57456 -39835
3934 -39835 14212 39308 33685 14872 8410 8753 18876 32849 19392 18628 23579 32411 5982
$$ packed form
4024h420N717r808K9584P929k0975J2380J9387K217k9881j7579K462M400j6840
4011a9427j0144K0118R199k1020o532K4317J6542j4210l2515l7863J7622J0450
3999d3463K9490J6976r835j520r219K4618K2416j3532l6061j1378j7473K4177
3987b4804J3228o643J9565K4863j7194q474R857l4780L484j060q872m7L5426j4365
3973i816k9141k5277J3870J2690P95J4212j5088M0088J2288J4198M792j5202M465
3960B2874J7982p850k1890p275J378j8398K5177K1189o112k708j3531k2108l473
3947a4745p770j1012P373J2009N616J0359P147k180l0077n495j5130j3551J7621
3934c9835N4047K5096n623j8813o462L43J0123J3973j3457p64M951Q832k6429
$$ plain form
3921 5982 -18411 -31672 -13425 -6041 -38484 -34572 -20152 5509 33594 37378 28297 88 23594
3908 23594 20397 -9404 -33248 -53779 -39598 -18725 -12939 -17834 -15994 -19327 -24866 -13494 -41291
3895 -41291 -41549 -25014 13040 37004 29505 8150 39245 22110 21614 13404 8550 -8710 -30647
3882 -30647 -21153 -13290 -8251 -28326 -23292 -24206 -18456 -3287 11035 17850 7008 -993 -5533 -25722
3868 -25722 -15637 -34292 -8805 13660 2588 17733 53469 37476 30271 25699 18689 10309 1823
3855 1823 11485 2636 -1337 -9821 16282 46658 48283 46718 37410 45394 60490 51065 65541 59856
3841 59856 54618 47630 33903 26629 36507 39434 37934 22946 6570 6168 16603 16137 47661 62601
3827 62601 47318 55654 53126 38946 35901 29384 28022 35516 55724 27589 15210 16217 11619
$$ packed form
3921E982k4393j3261J8247P384l2443L912J4420K5661K8085L784r081k8209K3506
3908B3594l197k9801k3844k0531J4181K0873N786m895J840l333n539J1372k7797
3895d1291k58J6535L8054K3964p499k1355L1095j7135m96q210m854j7260k1937
3882c0647R494P863N039k0075N034r14N750J5169J4322O815j0842q001m540k0189
3868b5722J0085j8655K5487K2465j1072J5145L5736j5993p205m572p010q380q486
3855A823R662q849l973q484K6103L0376J625j565r308P984J5096r425J4476n685
3841E9856n238o988j3727p274R878K927j500j4988j6376m02J0435m66L1524J4940
3827F2601j5283Q336k528j4180l045o517j362P494K0208k8135j2379J007m598
$$ plain form
3814 11619 10318 34430 50538 25546 2721 -16020 -22967 -24102 -6652 -16969 -38998 -42292 -20547
3801 -20547 -23898 -28828 -8944 -20599 -9387 13432 -727 -18616 -3238 4759 5967 -32847 -32814
3788 -32814 -10368 2633 -7105 4910 28645 58064 36905 28479 37248 17448 -10689 -5360 -18775
3775 -18775 -23749 -19847 6514 -19705 -31797 -34804 -36222 -11738 12755 31396 35255 30924 3518
3762 3518 -32465 -26158 -42616 -34706 20228 -693 -6754 12645 14771 16522 4517 -9967 23966
3749 23966 39698 41416 21135 4045 -1632 -28503 -17647 -4440 8459 13676 -17795 -31831
3737 -31831 -47636 -17835 12612 -18841 -43603 -47575 -33939 -38798 -51382 -24509 -29363 -15892
3725 -15892 -10996 -2454 -10371 -30100 -20045 -9410 9470 21691 26446 15352 23092 25912 -8824
$$ packed form
3814A1619j301K4112J6108k4992k2825j8741o947j135J7450j0317k2029l294K1745
3801b0547l351m930J9884j1655J1212K2819j4159j7889J5378P997J208l8814L3
3788c2814K2446J3001r738J2015K3735K9419k1159q426Q769j9800k8137N329j3415
3775a8775m974L902K6361k6219j2092l007j418K4484K4493J8641L859m331k7406
3762C518l5983O307j6458P910N4934k0921o061J9399K126J751j2005j4484L3933
3749B3966J5732J718k0281j7090n677k6871J0856J3207J2899N217l1471j4036
3737c1831j5805K9801L0447l1453k4762l972J3636m859j2584K6873m854J3471
3725a5892M896Q542p917j9729J0055J0635J8880J2221M755j1094P740K820l4736
$$ plain form
3712 -8824 -71466 -38232 1962 8125 -2844 -15316 -19208 -12056 10922 11371 -23902 -21132 -7592
3699 -7592 21395 22422 -7641 -28312 -35491 -39700 -28756 -20916 -24688 -16646 1573 20562 18547
3686 18547 -27066 -35124 -29777 -42206 -39927 -16748 -21861 -15948 -27239 -21291 -4177 6006 2186
3673 2186 -11188 -7154 -7611 -1586 5411 -1794 -5712 -12460 -19414 -25250 -1900 -2581 -9569 -2606 20070
3658 20070 50335 35262 -13527 -56521 -56807 -52803 -40865 1010 2372 -10571 3432 1526 -15497
3645 -15497 -16504 1861 -5849 -13646 -9797 22078 33248 17347 7537 3214 37715 47652 1876
3632 1876 -14723 -10294 -27816 -14888 2918 7146 -13939 -22066 162 -5692 -12030 -21538 -36341
3619 -36341 -31745 -32095 -19806 -20841 -35542 -33533 -53484 -34603 -2125 -7347 -27307 -5597 15000
$$ packed form
3712h824o2642L3234M0194O163j0969j2472l892P152K2978M49l5273K770J3540
3699g592K8987J027l0063k0671p179m209J0944P840l772Q042J8219J8989k015
3686A8547m5613q058N347j2429K279K3179n113N913j1291N948J7114J0183l820
3673B186j3374M034m57O025O997p205l918o748o954n836K3350o81o988O963K2676
3658B0070L0265j5073m8789m2994k86M004J1938M1875J362j2943J4003j906j7023
3645a5497j007J8365p710p797L849L1875J1170j5901r810m323L4501R937m5776
3632A876j6599M429j7522J2928J7806M228k1085q127K2228n854o338r508j4803
3619c6341M596l50J2289j035j4701K009j9951J8881L2478n222j9960K1710K0597
$$ plain form
3606 15000 4972 23613 23872 4377 -19016 -16749 18933 20945 43370 35502 5091 -20578 -13945
3593 -13945 -5822 -21488 -16317 -8675 -7047 -6233 -31160 -36614 -8417 4683 14162 -4533 3568 -2930
3579 -2930 34116 48399 46884 30381 14430 4217 -15747 -56982 -57237 -39208 -38165 -23452 3126
3566 3126 4760 5871 7312 20674 7350 -15498 -32826 -35976 -3240 14608 137 12923 36613
3553 36613 30002 17791 -1772 -18395 -25543 -2368 13522 7839 -10706 -19750 -39648 -53507 -44455
3540 -44455 -14296 18697 25535 24124 2828 -3977 7122 33421 51588 22485 14375 13469 -8056
3527 -8056 -10461 17226 11947 12091 -3933 -1480 -18476 -46488 -40937 -16894 -427 4655 4356 -15072
3513 -15072 -15753 -8091 -17051 23991 39604 24312 2557 -10870 -19826 -43195 -34748 -4300 5727
$$ packed form
3606A5000j0028J8641K59j9495k3393K267L5682K012K2425p868l0411k5669O633
3593a3945Q123j5666N171P642J628Q14k4927n454K8197J3100R479j8695Q101o498
3579b930L7046J4283j515j6503j5951j0213j9964m1235k55J8029J043J4713K6578
3566C126J634J111J441J3362j3324k2848j7328l150L2736J7848j4471J2786K3690
3553C6613o611j2211j9563j6623p148K3175J5890n683j8545r044j9898j3859R052
3540d4455L0159L2993O838j411k1296o805J1099K6299J8167k9103q110r06k1525
3527h056k405K7687n279J44j6024K453j6996k8012N551K4043J6467N082k99j9428
3513a5072o81P662q960M1042J5613j5292k1755j3427q956k3369Q447L0448J0027
$$ plain form
3500 5727 38727 40426 18885 18800 29781 18595 10705 -10038 1977 27046 29415 25479 14550
3487 14550 4087 2359 14466 44561 31667 19194 30021 29802 10057 -2710 17583 4035
3475 4035 -24525 -36267 -15890 -15208 -12465 -1045 -2172 -12253 -11446 -15506 8750 17400 19085 55
3461 55 -43397 -26164 -9449 1214 -5841 -138 17346 5949 2420 16407 5857 22610 46449
3448 46449 58838 30189 -2458 9482 17797 2498 -9394 -25786 -30700 -27234 13223 9253 -10329
3435 -10329 -19996 -10856 15638 839 -13638 -10849 -22746 -24331 -10981 5716 21035 5952 -8151
3422 -8151 -2546 -11019 -16828 -24607 -16387 -4466 -1408 -30727 -30061 -18529 -31886 -36393 -52041 -68330
3408 -68330 -40867 -6441 -6028 -17545 -9548 -19841 -40359 -68190 -62593 -49721 -6719 -14313 -24573
$$ packed form
3500E727L3000J699k1541q5J0981j1186p890k0743J2015K5069K369l936j0929
3487A4550j0463j728J2107L0095j2894j2473J0827k19j9745j2767K0293j3548
3475D035k8560j1742K0377O82K743J1420j127j0081Q07m060K4256Q650J685j9030
3461E5m3452J7233J6715J0663p055N703J7484j1397l529J3987j0550J6753K3839
3448D6449J2389k8649l2647J1940Q315j5299j1892j6392m914L466M0457l970j9582
3435a0329r667R140K6494j4799j4477K789j1897j585J3350J6697J5319j5083j4103
3422h151N605q473n809p779Q220J1921L058k9319O66J1532j3357m507j5648j6289
3408f8330K7463L4426M13j1517P997j0293k0518k7831N597J2872M3002p594j0260
$$ plain form
3395 -24573 -7182 2935 5291 14558 27036 37045 22961 17792 5377 -3511 -17326 -24395 -33994
3382 -33994 -24832 9084 7348 5303 -9880 5520 25213 43918 27581 25730 23049 38031 35612
3369 35612 4617 -24864 -12643 4037 13810 33808 52891 54634 40801 6067 -30277 -24762
3357 -24762 -36249 -56457 -65711 -55052 -36139 -27998 -14780 -17944 -22760 -11551 -8445 -16729 -2891
3344 -2891 -466 -13008 -2521 10167 -2215 -3886 1718 -2017 -2146 5086 7369 2701 -30677 -41927
3330 -41927 -60010 -53063 -72064 -58068 -19140 2022 -23299 -45532 -33301 -7946 21233 -2956
3318 -2956 33731 40247 28914 46275 49412 48023 48348 37005 8450 15318 23058 32090 26912 5395
3304 5395 10576 1663 8141 -2192 22396 30810 1972 10086 18423 -1932 -1019 27984 11426 -14696
$$ packed form
3395b4573J7391J0117K356R267J2478J0009j4084n169j2415q888j3815p069r599
3382c3994R162L3916j736k045j5183J5400J9693J8705j6337j851k681J4982k419
3369C5612l0995k9481J2221J6680R773J9998J9083J743j3833l4734l6344N515
3357b4762j1487k0208r254J0659J8913Q141J3218l164m816J1209L106q284J3838
3344b891K425j2542J0487J2688j2382j671N604l735j29P232K283m668l3378j1250
3330d1927j8083O947j9001J3996L8928K1162k5321k2233J2231K5355K9179k4189
3318b956L6687O516j1333J7361L137j389L25j1343k8555O868P740R032n178k1517
3304E395N181q913O478j0333K4588Q414k8838Q114Q337k0355R13K9003j6558k6122
$$ plain form
3290 -14696 -24065 -21743 -27606 -41918 -36300 -18418 -19000 19533 52737 47715 16439 16138 1547 12671
3276 12671 35968 28118 -2002 -14794 6157 22054 11641 -2280 -1688 -27052 -20648 9091 22986
3263 22986 -912 -26437 -33284 -7454 -14326 -39424 -40511 -39185 -22194 -7295 -18430 -15395 -17191
3250 -17191 -24613 -13943 -20817 -19133 -36152 -46910 -45031 -26149 -4743 10073 -8548 -22295 -12914
3237 -12914 -17136 -13017 -2421 -5559 -5369 -15816 -8242 12012 13798 -3064 -22954 -25023 8483
3224 8483 4458 -2347 12084 9041 32533 3201 -19093 -32845 -17021 -26229 -10073 -20 -5099
3211 -5099 -17076 -42445 -54172 -42264 -10954 -5746 -1204 33567 23352 13697 -21303 -61562 -63984
3198 -63984 -50444 -6769 19368 17001 31969 24776 28355 40428 43708 32089 44590 38385 42837
$$ packed form
3290a4696r369K322n863j4312N618J7882n82L8533L3204n022l1276l01j4591J1124
3276A2671K3297p850l0120j2792K0951J5897j0413j3921N92k5364O404K9739J3895
3263B2986k3898k5525o847K5830o872k5098j087J326J6991J4899j1135L035j796
3250a7191p422J0670o874J684j7019j0758J879J8882K1406J4816j8621j3747R381
3237a2914m222M119J0596l138J90j0447P574K0254J786j6862j9890k069L3506
3224H483m025o805J4431l043K3492k9332k2294j3752J5824r208J6156J0053n079
3211e099j1977k5369j1727J1908L1310N208M542L4771j0215r655l5000m0259k422
3198f3984J3540M3675K6137k367J4968p193L579J2073L280j1619J2501o205M452
$$ plain form
3185 42837 23063 18231 812 -13207 -22538 -36119 -7689 5171 15802 8031 -7615 8790
3173 8790 12310 7556 -3053 -6218 -20700 -35129 -46454 -29346 -18550 -19219 -26074 -31464 -43820
3160 -43820 -45648 -10846 12144 -1150 6342 29218 35038 27373 33120 12118 8130 -13406 -18928
3147 -18928 -3238 -1252 -6620 -12595 -478 41257 46520 52747 36188 34881 32727 19581 37319
$$ packed form
3185D2837j9774m832j7419j4019r331j3581K8430J2860J0631p771j5646J6405
3173H790L520m754j0609l165j4482j4429j1325J7108J0796o69o855n390j2356
3160d3820j828L4802K2990j3294P492K2876N820p665N747k1002l988k1536n522
3147a8928J5690J986n368n975J2117M1735N263O227j6559j307k154j3146J7738
$$ [...]
##END NTUPLES=NMR SPECTRUM
##END=
