##TITLE=Analysis number 321448
Compound Code cc 53303
Book Reference 498/44/1
Project Code adrs
Chemist Name davec
##JCAMPDX= 6.0         $$ Bruker NMR JCAMP-DX V2.0
##DATA TYPE= NMR SPECTRUM
##DATA CLASS= NTUPLES
##ORIGIN= Bruker BioSpin GmbH
##OWNER= nmr
$$ XWIN-NMR		Version 3.5
$$ Thu Aug 10 11:01:32 2006 GMT Daylight Time (UT+1h)  MAYBRIDGE\nmr@NMR_250MHZ
##.OBSERVE FREQUENCY= 250.131544655141
##.OBSERVE NUCLEUS= ^1H
##.ACQUISITION MODE= SIMULTANEOUS (DQD)
##.ACQUISITION SCHEME= undefined
##.AVERAGES= 16
##.DIGITISER RES= 18
##SPECTROMETER/DATA SYSTEM= dpx250
##.PULSE SEQUENCE= zg30
##.SOLVENT NAME= Acetone
##.SHIFT REFERENCE= (INTERNAL, Acetone, 0, 16.522)
##AUDIT TRAIL= $$ (NUMBER, WHEN, WHO, WHERE, WHAT)
$$ ##TITLE= Audit trail, XWIN-NMR		Version 3.5
$$ ##JCAMPDX= 5.01
$$ ##ORIGIN= Bruker BioSpin GmbH
$$ ##OWNER= nmr
$$ C:\u/data/dgb/nmr/ADRS/630/pdata/1/auditp.txt
$$ ##AUDIT TRAIL=  $$ (NUMBER, WHEN, WHO, WHERE, WHAT)
(   1,<2006-08-10 11:01:13.27 +100>,<MAYBRIDGE\nmr>,<NMR_250MHZ>,
      <created by zg, POWCHK disabled, PULCHK disabled
       configuration hash MD5:
       E2 DF 36 D8 04 B2 41 60 5A D7 A3 38 5A 4B D0 FE
       data hash MD5: 64K
       B5 40 67 81 FE 8A A0 B1 A9 F2 91 34 E8 4E EA B5>)
(   2,<2006-08-10 11:01:24.65 +100>,<MAYBRIDGE\nmr>,<NMR_250MHZ>,
      <Start of raw data processing
       ef LB = 0.3 FT_mod = 6 PKNL = 1 SI = 32K 
       data hash MD5: 32K
       52 75 BE CA 55 81 D1 5D D7 E2 E6 CD 6F FB 44 CE>)
(   3,<2006-08-10 11:01:26.29 +100>,<MAYBRIDGE\nmr>,<NMR_250MHZ>,
      <apk 
       data hash MD5: 32K
       96 76 B1 48 2D 01 1E EE 43 2A 7F 0A C3 53 A7 F6>)
(   4,<2006-08-10 11:01:27.04 +100>,<MAYBRIDGE\nmr>,<NMR_250MHZ>,
      <abs ABSG = 5 
       data hash MD5: 32K
       30 C9 88 41 56 A1 9B 7F 2E 8D 55 07 A1 9E 86 B5>)
$$ ##END=
$$ 
$$ hash MD5
$$ E8 AE 5B 88 19 CD 4E BE 0F BF 8A 3C 73 FB E3 7D
##$RELAX= 
##$RELAX= 
##$RELAX= 
##$RELAX= 
##$RELAX= 
##$RELAX= 
##$RELAX= 
$$ Bruker specific parameters
$$ --------------------------
##$DU= <C:\u>
##$EXPNO= 630
##$NAME= <ADRS>
##$PROCNO= 1
##$TYPE= <nmr>
##$USER= <dgb>
##$AMP= (0..31)
100 100 100 100 100 100 100 100 100 100 100 100 100 100 100 100 100 100 
100 100 100 100 100 100 100 100 100 100 100 100 100 100 
##$AQSEQ= 0
##$AQ_mod= 3
##$AUNM= <au_zg>
##$AUTOPOS= <17 >
##$BF1= 250.13
##$BF2= 250.13
##$BF3= 250.13
##$BF4= 250.13
##$BF5= 500.13
##$BF6= 500.13
##$BF7= 500.13
##$BF8= 500.13
##$BYTORDA= 1
##$CFDGTYP= 0
##$CFRGTYP= 5
##$CHEMSTR= <none>
##$CNST= (0..31)
1 1 145 1 1 1 1 1 1 1 1 1 1 1 1 1 1 1 1 1 1 1 1 1 1 1 1 1 1 1 1 1 
##$CPDPRG= <>
##$CPDPRG1= <>
##$CPDPRG2= <>
##$CPDPRG3= <>
##$CPDPRG4= <mlev>
##$CPDPRG5= <mlev>
##$CPDPRG6= <mlev>
##$CPDPRG7= <mlev>
##$CPDPRG8= <mlev>
##$CPDPRGB= <>
##$CPDPRGT= <>
##$D= (0..31)
0 1 0 0 0 0 0 0 0 0.06 0 0 0 0 0 0 0.0002 0 0 0 0 0 0 0 0 0 0 0 0 0 0 
0 
##$DATE= 1155204072
##$DBL= (0..7)
120 120 120 120 120 120 120 120 
##$DBP= (0..7)
150 150 150 150 150 150 150 150 
##$DBP07= 0
##$DBPNAM0= <>
##$DBPNAM1= <>
$$ [...]
##$SUBNAM7= <"">
##$SUBNAM8= <"">
##$SUBNAM9= <"">
##$SW= 20.6930455092707
##$SWIBOX= (0..15)
0 0 3 0 0 0 0 0 0 0 0 0 0 0 0 0 
##$SW_h= 5175.983436853
##$TD= 65536
##$TD0= 1
##$TE= 294.16
##$TE2= 300
##$TE3= 300
##$TEG= 300
##$TL= (0..7)
0 120 120 120 120 120 120 120 
##$TP= (0..7)
150 150 150 150 150 150 150 150 
##$TP07= 0
##$TPNAME0= <>
##$TPNAME1= <>
##$TPNAME2= <>
##$TPNAME3= <>
##$TPNAME4= <>
##$TPNAME5= <>
##$TPNAME6= <>
##$TPNAME7= <>
##$TPOAL= (0..7)
0.5 0.5 0.5 0.5 0.5 0.5 0.5 0.5 
##$TPOFFS= (0..7)
0 0 0 0 0 0 0 0 
##$TUNHIN= 0
##$TUNHOUT= 0
##$TUNXOUT= 0
##$USERA1= <user>
##$USERA2= <user>
##$USERA3= <user>
##$USERA4= <user>
##$USERA5= <user>
##$V9= 5
##$VALIST= <valist>
##$VCLIST= <CCCCCCCCCCCCCCC>
##$VD= 0
##$VDLIST= <DDDDDDDDDDDDDDD>
##$VPLIST= <PPPPPPPPPPPPPPP>
##$VTLIST= <TTTTTTTTTTTTTTT>
##$WBST= 1024
##$WBSW= 4
##$XGAIN= (0..3)
0 0 0 0 
##$XL= 0
##$YL= 0
##$YMAX_a= 314097
##$YMIN_a= -455586
##$ZGOPTNS= <>
##$ZL1= 120
##$ZL2= 120
##$ZL3= 120
##$ZL4= 120
##$ABSF1= 16.522
##$ABSF2= -4.171173
##$ABSG= 5
##$ABSL= 3
##$ALPHA= 0
##$AQORDER= 0
##$ASSFAC= 0
##$ASSFACI= 0
##$ASSFACX= 0
##$ASSWID= 0
##$AUNMP= <proc_1d>
##$AZFE= 0.1
##$AZFW= 0.1
##$BCFW= 0
##$BC_mod= 0
##$BYTORDP= 0
##$COROFFS= 0
##$CY= 12.5
##$DATMOD= 1
##$DC= 0
##$DFILT= <>
##$DTYPP= 0
##$F1P= 14.0000005364418
##$F2P= -0.99999901652339
##$FCOR= 0.5
##$FTSIZE= 32768
##$FT_mod= 6
##$GAMMA= 0
##$GB= 0
##$INTBC= 1
##$INTSCL= 1
##$ISEN= 128
##$LB= 0.3
##$LEV0= 0
##$LPBIN= 0
##$MAXI= 10000
##$MC2= 0
##$MEAN= 0
##$ME_mod= 0
##$MI= 0
##$NCOEF= 0
##$NC_proc= -5
##$NLEV= 6
##$NOISF1= 0
##$NOISF2= 0
##$NSP= 0
##$NTH_PI= 0
##$NZP= 0
##$OFFSET= 16.522
##$PC= 1
##$PHC0= 150.0456
##$PHC1= 7.562286
##$PH_mod= 1
##$PKNL= yes
##$PPARMOD= 0
##$PSCAL= 4
##$PSIGN= 0
##$REVERSE= no
##$SF= 250.13
##$SI= 32768
##$SIGF1= 0
##$SIGF2= 0
##$SINO= 400
##$SIOLD= 32768
##$SREGLST= <1H.Acetone>
##$SSB= 0
##$STSI= 32768
##$STSR= 0
##$SW_p= 5175.98343685301
##$SYMM= 0
##$S_DEV= 0
##$TDeff= 65536
##$TDoff= 0
##$TI= <Analysis number 999999
Compound Code 99
Book Reference 9
Project Code 9>
##$TILT= no
##$TM1= 0
##$TM2= 0
##$TOPLEV= 0
##$USERP1= <user>
##$USERP2= <user>
##$USERP3= <user>
##$USERP4= <user>
##$USERP5= <user>
##$WDW= 1
##$XDIM= 32768
##$YMAX_p= 550315794
##$YMIN_p= -969042
$$ End of Bruker specific parameters
$$ ---------------------------------
##NTUPLES= NMR SPECTRUM
##VAR_NAME=  FREQUENCY,     SPECTRUM/REAL,   SPECTRUM/IMAG
##SYMBOL=    X,             R,               I
##VAR_TYPE=  INDEPENDENT,   DEPENDENT,       DEPENDENT
##VAR_FORM=  AFFN,          ASDF,            ASDF
##VAR_DIM=   32768,         32768,           32768
##UNITS=     HZ,            ARBITRARY UNITS, ARBITRARY UNITS
##FACTOR=    0.157963299565203, 1,           1
##FIRST=     4132.6476996994, 0,             0
##LAST=      -1043.33573715361, 0,           0
##MIN=       -1043.33573715361, -969042,     0
##MAX=       4132.6476996994, 550315794,     0
$$ Real data points
##PAGE= N=1
##DATA TABLE= (X++(R..R)), XYDATA
$$ [...]
17513c45618L36345m0383l5109J04880J92923K55068j89320J7480j6607J71548
$$ -345618 -9273 -49656 -84765 20115 213038 468106 278786 296266 279659 451207
17503D51207N5702L5450J16212O1591q9561k85000J22854l1900r3758o8048j22867
$$ 451207 506909 542359 658571 720162 630601 345601 468455 436555 342797 274749 151882
17492A51882L25927m5805r1067p5804J32690j07097k48279K5061P0024p206m40645
$$ 151882 477809 432004 340937 265133 397823 290726 42447 67508 137532 130326 -310319
17481c10319N2608L22116o0600K55242J8165j9073k52009N6548j22757l5983P0788
$$ -310319 -257711 64405 3805 259047 277212 258139 6130 62678 -60079 -96062 -25274
17470b5274R4214J61925k5156j49307j4669J41889M0971K06854q9829P3392P7246
$$ -25274 68940 230865 205709 56402 41733 183622 224593 431447 341618 415010 492256
17459D92256j14727P138N331R1410J62595j74278Q9211J46579L2794M69j08949
$$ 492256 377529 384667 389998 481408 644003 469725 558936 705515 738309 738778 629829
17448F29829j9855K13396k2764j6617q5150O8133j83810j01864k91248J66642
$$ 629829 609974 823370 800606 783989 698839 766972 583162 481298 190050 356692
17438C56692K4045j01770K03309J06615k38056q6475l17421m5949Q1708Q2291
$$ 356692 380737 278967 482276 588891 350835 264360 -53061 -99010 -17302 64989
17428F4989J4322M7317k37979j7175J53586M948M4794K3730q5443q3076n8696
$$ 64989 79311 126628 -111351 -128526 25060 30008 74802 98532 13089 -69987 -128683
17417a28683k44604K2727K87393j9566j74169n4106L61464J35114l7089Q9304
$$ -128683 -373287 -350560 -63167 -82733 -256902 -311008 50456 185570 148481 237785
17407B37785O8930n2245N5806q4669K91591L7688j98012l28059j88344K2480j28461
$$ 237785 306715 254470 310276 225607 517198 554886 356874 28815 -159529 -137049 -265510
17396b65510R3741J74786L4460J79693j30383J01546k4886j25701k59874K0826
$$ -265510 -171769 3017 37477 217170 86787 188333 163447 37746 -222128 -201302
17386b01302p0184N8400J03332J76780J741L7527k16569J04606J81003K03741
$$ -201302 -271486 -213086 -109754 67026 68767 106294 -110275 -5669 175334 379075
17376C79075n03769j21129J43535j0645J6645J95510J42733j6560j49483J077
$$ 379075 -124694 -245823 -102288 -112933 -96288 99222 241955 225395 75912 76989
17366G6989j94328k8326l7713r5695J1956J14725N7696J12654P4497K25249j66789
$$ 76989 -117339 -145665 -183378 -279073 -267117 -152392 -94696 17958 92455 317704 150915
17355A50915k58289j95056J06693L6132R8011L1770m0442J14711q9307j12752
$$ 150915 -107374 -302430 -195737 -159605 -61594 -29824 -70266 44445 -44862 -157614
17345a57614r0457k84441p9272K28418J74052J85j04832R3318M17723L94663l33602
$$ -157614 -248071 -532512 -611784 -383366 -209314 -209129 -313961 -220643 197080 591743 258141
17334B58141k98725l0217J56753k02946j92615K10613J21753j66367l40070Q6336
$$ 258141 -40584 -70801 85952 -116994 -309609 -98996 22757 -143610 -483680 -397344
17324c97344P9874n0917J44140R3373k9718o6275r5127m8694J28902K41213j55516
$$ -397344 -317470 -368387 -224247 -130874 -160592 -226867 -321994 -370688 -241786 -573 -156089
17313a56089k93637k2811R6046J94354K21997J16609l5675M2006n132j16262l5118
$$ -156089 -449726 -472537 -376491 -182137 39860 156469 120794 162800 157668 41406 6288
17302F288R4133N2795J90914m116j86620j47625j11088K2533Q8061J01970j81310
$$ 6288 100421 153216 344130 340014 153394 5769 -105319 -82786 5275 107245 -74065
17291g4065k32154K6191J44299P8079l6861j19951J97580j15283k61385l1170
$$ -74065 -306219 -280028 -135729 -57650 -94511 -214462 -16882 -132165 -393550 -424720
17281d24720N3001L5035k0127J51749J40299j12150k07004l4508J01777J20131
$$ -424720 -371719 -336684 -356811 -205062 -64763 -176913 -383917 -418425 -316648 -196517
17271a96517J25246j29459k99858K1993K82809J59328J04563J24637m7216p0790
$$ -196517 -71271 -200730 -500588 -478595 -195786 -36458 68105 192742 145526 74736
17261G4736k38100l04045K7302J3691J17118J86390K36164l9657n3861M0640N771
$$ 74736 -163364 -467409 -440107 -426416 -309298 -122908 113256 73599 19738 60378 66149
17250F6149N4853q6016k52288k35413J48008j2080J12013L0349J52000q3411k18544
$$ 66149 121002 34986 -217302 -452715 -304707 -316787 -204774 -174425 -22425 -105836 -324380
17239c24380o983K02148K00285l4111M3075m845Q6058j11355j32976j80391n4744
$$ -324380 -331363 -129215 71070 36959 80034 75189 161247 49892 -83084 -263475 -318219
17228c18219k37014j95060R7550L24014L4607J2152q2181J39363k53051k25869
$$ -318219 -555233 -750293 -652743 -328729 -294122 -281970 -364151 -224788 -477839 -703708
17218g03708J41759M05264J11825J93933J37842Q54j63089k91423j26427J30010
$$ -703708 -561949 -156685 -44860 149073 286915 287769 124680 -166743 -293170 -163160
17208a63160K52884j27544J80938J60576q3990j5546k3270N7944j08519m0859
$$ -163160 89724 -37820 143118 303694 219704 204158 180888 238832 130313 89454
17198H9454O4166j41502j05242K6385K0173P9914j7650j79214K23817J96765j9508
$$ 89454 153620 12118 -93124 -66739 -46566 33348 15698 -163516 60301 257066 237558
17187B37558k05598j34471k12458j8658J42434K01405J17551k23142m39455J09280
$$ 237558 31960 -102511 -314969 -333627 -191193 10212 127763 -95379 -534834 -425554
17177d25554J23634N4047K10690L5433n2962J35957J43056k92439j94015J84078
$$ -425554 -301920 -247873 -37183 -1750 -54712 81245 224301 -68138 -262153 -78075
17167g8075K5708J31650L083j19767j24393j71158L0838J4176J00382J34430k553
$$ -78075 -52367 79283 82366 -37401 -161794 -332952 -302114 -287938 -187556 -53126 -55679
17156e5679n6287j81872L44476J96627Q529o9525J84903K7074q9444j15251k04588
$$ -55679 -111966 -293838 50638 247265 255794 186269 371172 398246 308802 193551 -11037
17145a1037J16849k4343J30695j37815j02911J5928j97270k80068k8842L71094
$$ -11037 105812 81469 212164 74349 -28562 -12634 -209904 -489972 -518814 -147720
17135a47720K52422P8525r098k05887n5464J80803n620J0713K14245M8702r2680
$$ -147720 104702 183227 174129 -31758 -87222 93581 87961 98674 312919 361621 268941
17124B68941q2684J14127n856l12397j75219m9487P7955j12826J75670J37732
$$ 268941 186257 300384 294528 -17869 -193088 -242575 -164620 -277446 -101776 35956
17114C5956N1877K4691j28827j43382r0179o7237R3805j0454l1611J25795J21364
$$ 35956 87833 112524 -16303 -159685 -249864 -317101 -223296 -233750 -265361 -139566 -18202
17103a8202k6721k67424K3854K70049K17235j07767K12009J79043k54914m1456
$$ -18202 -44923 -312347 -288493 -18444 198791 91024 303033 482076 227162 185706
17093A85706m1325K1534L095j84733p0134J44522k44784l4300M16443J21556r0049
$$ 185706 144381 165915 169010 -15723 -85857 58665 -186119 -220419 196024 317580 227531
17082B27531l1250J475J0116J46232j55920P5964m0524L8966m2784l4965j11102
$$ 227531 196281 197756 207872 354104 198184 274148 233624 272590 229806 194841 83739
17071H3739j61764L8770L9678N2627j28231O1428O0192l6114J86038q1600n4411
$$ 83739 -78025 -39255 423 53050 -75181 -13753 46439 10325 196363 114763 60352
17060F0352k4974r7422J47768l1547K17500m9341j46563j48209j14351k5630L355
$$ 60352 35378 -62044 85724 54177 271677 222336 75773 -72436 -186787 -212417 -209062
17049b09062k14367l09280K82759M40902J33359j33403M519j4196o3791O1254
$$ -209062 -423429 -732709 -449950 -9048 124311 -9092 -4573 -18769 -82560 -21306
17039b1306l6194j65707j57760J51215J67605J51688q3288K1526k38760K3761
$$ -21306 -57500 -223207 -380967 -229752 -62147 89541 6253 27779 -210981 -187220
17029a87220L06413L789P3035J38467j24683j24964K637l6512P5400j68339O2080
$$ -187220 119193 122982 196017 334484 209801 84837 87474 50962 126362 -41977 20103
17018B0103L1253Q6951K59729o0024k7411o9389P3468k5530k6080j53191j30130
$$ 20103 51356 138307 398036 338012 310601 241212 314680 289150 263070 109879 -20251
17007b0251m63Q6688L47753J45812r392k21124j12568J48213K2253j91846k34977
$$ -20251 -20714 65974 413727 559539 550147 329023 216455 364668 386921 195075 -39902
16996c9902J52074j3685m5504j32879K2452M2516Q0164j03820l8834K45315j60657
$$ -39902 112172 98487 52983 -79896 -57444 -14928 65236 -38584 -77418 167897 7240
16985G240m52372m8637J88739j18282l926M7583O4789K54883k8876j20780j05175
$$ 7240 -445132 -493769 -305030 -423312 -427238 -379655 -314866 -59983 -88859 -209639 -314814
16974c14814k53347M7727M8485n0670J45048R7099j68786l43310K5210M98754
$$ -314814 -568161 -520434 -471949 -522619 -377571 -280472 -449258 -792568 -767358 -268604
16964b68604o6884o7039j46374J67405J65711k8150J67083Q6834l7981J06158
$$ -268604 -335488 -402527 -548901 -381496 -215785 -243935 -76852 9982 -27999 78159
16954G8159j16242n8863R4981J09593N3203n3821j38561J92786P0044k47163m42915
$$ 78159 -38083 -96946 -1965 107628 160831 107010 -31551 161235 231279 -15884 -458799
16943d58799J95227K6162j04163J23510o3507J14184K79012m6411j68875j45490
$$ -458799 -263572 -237410 -341573 -218063 -281570 -167386 111626 65215 -103660 -249150
16933b49150N1069k8983J25185J14266j31535l7576j0668j99675j6182q5983J88722
$$ -249150 -198081 -227064 -101879 12387 -119148 -156724 -167392 -367067 -383249 -469232 -280510
16922b80510M24069Q0452j13964J9008M4058N1080J4091k56729j79452j32933
$$ -280510 143559 224011 110047 129055 173113 224193 238284 -18445 -197897 -330830
16912c30830K7553j11776L38432K03218j79262J00765K2031o2377m8227N9050
$$ -330830 -303277 -415053 -76621 126597 -52665 48100 70131 7754 -40473 18577
16902A8577l469J1333O3433Q7362L5617j64205j03047P1898P9024j55800k06138
$$ 18577 15108 26441 89874 177236 212853 48648 -54399 17499 96523 -59277 -265415
16891b65415m9605O8393J22285L9752J83334j23754k16088N1970J63755J9125
$$ -265415 -315020 -246627 -124342 -84590 98744 -25010 -241098 -189128 -25373 -6248
16881f248l6616J61214j148k01349M9015m5558j25641m0038j11471k14574J95608
$$ -6248 -42864 118350 117202 -84147 -35132 -80690 -206331 -246369 -357840 -572414 -376806
16870c76806K11720J24105L8072P210M6403j17434j83013J10379L9930k28080
$$ -376806 -165086 -40981 -2909 4301 50704 -66730 -249743 -139364 -99434 -327514
16860c27514P3499O3072k0686K461L17107J36836j98954K9316m0253j9199J01891
$$ -327514 -254015 -190943 -211629 -209168 107939 244775 45821 75137 34884 15685 117576
16849A17576k24345k65622p3219K57971L55092j415p9081j20564j23655k52925
$$ 117576 -106769 -372391 -445610 -187639 167453 166038 86957 -33607 -157262 -410187
16839d10187k3798L3074J56352J1920k29199J07039M2771j12760J80906L52891
$$ -410187 -433985 -400911 -244559 -232639 -461838 -354799 -312028 -424788 -243882 109009
16829A09009N6899J3114k42599m0191J05412k6800j58014L41631R2056j55074
$$ 109009 165908 179022 -63577 -103768 1644 -25156 -183170 158461 250517 95443
16819I5443l12634j45522j38764k27077P5077J38296K41681N5574R3310J68479
$$ 95443 -217191 -362713 -501477 -728554 -653477 -515181 -273500 -217926 -124616 43863
16809D3863k17749l2678J48322J15908M3555Q8914J47113m7836j16362p3187k43249
$$ 43863 -173886 -206564 -58242 57666 101221 190135 337248 289412 173050 99863 -143386
16798a43386l1096J25012o9765J69324K8865j93490K04501j9553k06802J0512
$$ -143386 -174482 -49470 -119235 50089 78954 -114536 89965 70412 -136390 -125878
16788a25878L9598m7058J53973j28217N995J45541K57943j37145j37633J40715
$$ -125878 -86280 -133338 20635 -107582 -101587 43954 301897 164752 27119 167834
16778A67834k07655l26240j05487J75419J95288L08668o8418k46269j00104N665
$$ 167834 -39821 -366061 -471548 -296129 -100841 207827 139409 -106860 -206964 -201299
16768b01299J09555j21915L6920Q9929J63002k61922j58183J21929K53219J95326
$$ -201299 -91744 -213659 -176739 -86810 76192 -185730 -343913 -221984 31235 226561
16758B26561K24652l0788l69548l6578j19388p5177l6098j13355J81997J28012
$$ 226561 451213 420425 50877 14299 -105089 -180266 -216364 -329719 -147722 -19710
16748a9710Q056p7406q0876L4863j02396j13733Q7751J27025j71448l5209J59514
$$ -19710 -11654 -89060 -169936 -135073 -237469 -351202 -263451 -136426 -307874 -343083 -183569
16737a83569j14008o1953m5760R0352J93383R7702O0170P1077Q4045q3997j93122
$$ -183569 -297577 -359530 -405290 -314938 -121555 -23853 36317 107394 191439 107442 -85680
16726h5680p7635J16942P8045L376j3098J0035j6615J95336J07987j18177q5586
$$ -85680 -163315 -46373 31672 35048 21950 31985 15370 210706 318693 200516 114930
16715A14930L4229K23900q4651k80565j96704j38456O7651J3461k52523K13260
$$ 114930 149159 373059 288408 7843 -188861 -327317 -259666 -246205 -498728 -285468
16705b85468K88001L8215j44263k26521M4828k1774J7615j18204j77751Q0287
$$ -285468 2533 40748 -103515 -330036 -285208 -306982 -289367 -407571 -585322 -505035
16695e05035R9113n8678j59507O6388P4220O8890K3198J17032K37782K92612R7981
$$ -505035 -405922 -464600 -624107 -557719 -483499 -414609 -391411 -274379 -36597 256015 353996
16684C53996n0594R735n4090L0172j54600k70858K88558j55915n6080j06816M3558
$$ 353996 303402 313137 259047 289219 134619 -136239 152319 -3596 -59676 -166492 -122934
16673a22934J72736K2036k34436j32205K48202J38932n2634l25302O7065N9952
$$ -122934 49802 71838 -162598 -294803 -46601 92331 39697 -285605 -218540 -158588
16663a58588j60266o3743K63376K11695R8039P2594P9981j81069l0057L9228r9939
$$ -158588 -318854 -382597 -119221 92474 190513 263107 343088 162019 131962 171190 71251
16652G1251j99645J41270o8030L3657k21387k8381J01278J02378K3057K2477o6103
$$ 71251 -128394 12876 -55154 -21497 -242884 -271265 -169987 -67609 -44552 -22075 -88178
16641h8178P9141K22385L29661J37147k30810l79138l9614l7398o6827J14257
$$ -88178 -9037 213348 543009 680156 449346 70208 30594 -6804 -73631 40626
16631D0626p3108q8868k32065q0552L2677K01209N8077J59634J660n4615o4564
$$ 40626 -32482 -121350 -353415 -433967 -401290 -200081 -142004 17630 19290 -35325 -99889
16620i9889J38288M2526J87236l1767k05836j12110J00089J07669q5438o0238
$$ -99889 38399 80925 268161 236394 30558 -81552 18537 126206 40768 -19470
16610a9470j44872j45988J87759J57686k83268j11325J15670J81980j12592j7341
$$ -19470 -164342 -310330 -122571 35115 -248153 -359478 -243808 -61828 -174420 -191761
16600a91761o5336k61853J5611n6543J26111M02659O4108n1248R2479j0850j67232
$$ -191761 -257097 -518950 -503339 -559882 -433771 -31112 32996 -18252 74227 63377 -103855
16589a03855L715K32390m695l9768j53354n2739M7664j63245N9196R7897l9295
$$ -103855 -100140 132250 127555 87787 -65567 -118306 -70642 -233887 -174691 -76794 -116089
16578a16089l9918l4888O7933k34773J21580K14878Q5959j11047p4932k617J17089
$$ -116089 -156007 -190895 -122962 -357735 -236155 -21277 64682 -46365 -121297 -123914 -6825
16567f825m2124k88385r9329j79193O7219J05104K61740P5779O411j18299k524
$$ -6825 -48949 -337334 -436663 -615856 -548637 -443533 -181793 -106014 -99603 -217902 -220426
16556b20426j3592K15453J33671o7768m77647j9184P2468k8897J34169K30873
$$ -220426 -234018 -18565 115106 47338 -430309 -449493 -377025 -405922 -271753 -40880
16546d0880R2159k5439L0138J00738K06681k13819p2859l7823M5806k57971j32077
$$ -40880 51279 25840 55978 156716 363397 149578 76719 38896 84702 -173269 -305346
16535c05346K10631Q2531n8025L7322J29201K34517p1542m61680k14810j39178
$$ -305346 -94715 -12184 -70209 -32887 96314 330831 259289 -202391 -417201 -556379
16525e56379p2621J4095M4915p207J43841K27214K39585j35310M9023j9215j502
$$ -556379 -629000 -614905 -569990 -577197 -433356 -206142 33443 -101867 -52844 -72059 -73561
16514g3561j58665j35338L3518k9145j53080l0967M340K86535J7798j23239J57362
$$ -73561 -232226 -367564 -334046 -363191 -516271 -547238 -542898 -256363 -238565 -361804 -204442
16503b04442j14639k63374J35112L09906l4426j52575o7068j65906r5753j4641
$$ -204442 -319081 -582455 -447343 -137437 -171863 -324438 -391506 -557412 -653165 -667806
16493f67806m6101J81667K71018L56264R5130j27342M106j28460l1817k01611
$$ -667806 -713907 -532240 -261222 95042 190172 62830 66936 -61524 -93341 -294952
16483b94952j73680O2143L30434m419q6302k7115K62911K64706J25781k9524J4313
$$ -294952 -468632 -406489 -76055 -80474 -166776 -193891 69020 333726 459507 429983 444296
16472D44296k77843j40095j2598o8610o3760j28631O4338J11715J24151k702n2058
$$ 444296 166453 26358 13760 -54850 -118610 -247241 -182903 -71188 52963 50261 -1797
16461a797N9532j8155R6061R9451O5444j12406k14600j68486K1388N8807k08218
$$ -1797 57735 39580 135641 235092 300536 188130 -26470 -194956 -173568 -114761 -322979
16450c22979j99597L7570J35418N740k3147n0122j73591J66149J59601J20426
$$ -322979 -522576 -485006 -349588 -343848 -366995 -417117 -590708 -424559 -264958 -144532
16440a44532N8328k04446j29950j10423J03274K75477K25080o0012j12816J2983
$$ -144532 -86204 -290650 -420600 -531023 -427749 -152272 72808 12796 -100020 -87037
16430h7037l9043p8519O2201j09830j24970K25118p5130M9341K29297L5870m8724
$$ -87037 -126080 -204599 -142398 -252228 -377198 -152080 -227210 -177869 51428 87298 38574
16419C8574K8132R978k8587J8928n4327j21163J4154J70512J3307L4982K8695
$$ 38574 66706 76684 48097 67025 12698 -108465 -94311 76201 89508 124490 153185
16408A53185j00999J7567J01429j33958l8348K04622J5405r732j20012r2528R0701
$$ 153185 52186 69753 171182 37224 -1124 203498 218903 209171 89159 -3369 87332
16397H7332m5830j56498Q2739J8208p7349r4167J12976J16133O3874P1979j13430
$$ 87332 41502 -114996 -32257 -14049 -91398 -185565 -72589 43544 107418 179397 65967
16386F5967q9452m8610K3436J16070Q6577o6443q4569j17463l7085R114N1489
$$ 65967 -23485 -72095 -48659 67411 153988 87545 2976 -114487 -151572 -142458 -90969
16375i0969P1489n3534O0907j8249l1440P9591q644n284K17578J34924K3926o3664
$$ -90969 -19480 -73014 -12107 -30356 -61796 17795 9151 3867 221445 356369 380295 316631
16363C16631k10518l61010N9402j5585j31940J55827K18846r406l4398j4105K1074
$$ 316631 106113 -254897 -195495 -211080 -343020 -187193 31653 22247 -12151 -26256 -5182
16352e182K42135K9819j56699k5797Q0697j30892Q8108j3411k66297K1847j7040
$$ -5182 236953 266772 110073 84276 164973 34081 122189 108778 -157519 -135672 -152712
16341a52712k6818J9189m1064J46571J0572j38011j37922j59109K62158k0869
$$ -152712 -179530 -160341 -201405 -54834 -44262 -182273 -320195 -479304 -217146 -238015
16331b38015P6742r1355l2217J12441K22848j23492j48089P4332p175k6566Q6007
$$ -238015 -161273 -252628 -284845 -172404 50444 -73048 -221137 -146805 -153980 -180546 -94539
16320i4539j37643o4896K86566r9927j71247j26491o8788j32288R8534K78524
$$ -94539 -232182 -297078 -10512 -110439 -281686 -408177 -476965 -609253 -510719 -232195
16310b32195J31585P8680k68435J51996J48331r3986j89413O4701j10657k5933
$$ -232195 -100610 -21930 -290365 -138369 9962 -84024 -273437 -208736 -319393 -345326
16300c45326m3002P2958L12019k2291L0268J1962l04178J17357J58718O7002p5073
$$ -345326 -388328 -315370 -3351 -25642 4626 16588 -287590 -170233 -11515 55487 -19586
16289a9586j10130O130r2507q7373N1697q6356L1604n4049J72517l4484J37837
$$ -19586 -129716 -123586 -216093 -303466 -251769 -338125 -306521 -360570 -188053 -222537 -84700
16278h4700K51004J17558j53358j3138l6937r4367k39182j20943Q6851K04278
$$ -84700 166304 283862 130504 117366 80429 -13938 -253120 -374063 -287212 -82934
16268h2934j15484J97792J5075n3396k15118o841J43228R4904J14341j33449m8876
$$ -82934 -198418 -626 14449 -38947 -254065 -260906 -117678 -22774 91567 -41882 -90758
16257i0758O374J41447r6082r3856n2176P2424N6435K0517l5701k7371J92607
$$ -90758 -84384 57063 -39019 -132875 -185051 -112627 -56192 -35675 -71376 -98747 93860
16246I3860k1840j33601K65113o320j98749n7122j67154Q3134J12515j90263J66450
$$ 93860 72020 -61581 203532 197212 -1537 -58659 -225813 -142679 -30164 -220427 -53977
16235e3977j64931j21571J87349J61779Q1918P129J20092K24563j53168n7160
$$ -53977 -218908 -340479 -153130 8649 90567 97696 217788 442351 289183 232023
16225B32023o8376j92829l00092j1560q4554R236j8148R8790K42975O2601j93434
$$ 232023 163647 -29182 -329274 -340834 -425388 -416152 -434300 -335510 -92535 -29934 -223368
16214b23368k8846K32064o8055K2371j53883k1326m082J0067O1671j5781q3628
$$ -223368 -252214 -20150 -88205 -65834 -219717 -241043 -245125 -235058 -173387 -189168 -272796
16203b72796l8289q3610K37524N336J11247n3026J34157J53547O3766l95259j77347
$$ -272796 -311085 -394695 -157171 -151835 -40588 -93614 40543 194090 257856 -137403 -314750
16192c14750N0190k1421J87738L12975l2880L3874J1356m9152j49229M5337P0834
$$ -314750 -264560 -285981 -98243 214732 181852 215726 227082 177930 28701 74038 144872
16181A44872j49414j24988l0478k9671j1110J5887k023Q705Q3374K99026J47018
$$ 144872 -4542 -129530 -160008 -189679 -200789 -184902 -186925 -178220 -94846 204180 351198
16170C51198j79818k37890m138j25645J11881k0859j42065J09874L14835j22877
$$ 351198 171380 -66510 -70648 -196293 -84412 -105271 -247336 -137462 177373 54496
16160E4496j67562m1349k3467K1361J8773J31061k934O6283J06709j74984j62663
$$ 54496 -113066 -154415 -177882 -156521 -137748 -6687 -9621 56662 163371 -11613 -174276
16149a74276o9696J23091K56586n6508j4766Q0438o4452k07920o3409J32039l5681
$$ -174276 -243972 -120881 135705 79197 64431 144869 80417 -127503 -190912 -58873 -94554
16138i4554J12874p0387j34403M8019Q2034m0219K70644M9648j13568J37354j49046
$$ -94554 18320 -52067 -186470 -138451 -56417 -96636 174008 223656 110088 247442 98396
16127I8396k18134l1870K05683M9697J69470j39403k42867j26039j5022P1836
$$ 98396 -119738 -151608 54075 103772 273242 133839 -109028 -235067 -250089 -178253
16117a78253K08749j37159Q3512P2719j21753k19224k07093M4653M3049J47922
$$ -178253 30496 -106663 -23151 49568 -72185 -291409 -498502 -453849 -410800 -262878
16107b62878J68862J07312r8426j45137k5418Q378j2536m2595K14747P0630j70486
$$ -262878 -94016 13296 -85130 -230267 -255685 -247307 -259843 -302438 -87691 -17061 -187547
16096a87547J5552J76161K62587m7406o0723p299R7544p6726k39264j22384J01018
$$ -187547 -171995 4166 266753 219347 158624 151325 248869 172143 -67121 -189505 -88487
16085h8487k0626O5434P7024J20954J35254j46509L913M6058l59760k83131J13896
$$ -88487 -109113 -43679 33345 154299 289553 143044 146957 193015 -166745 -449876 -335980
16074c35980K93658L2693J14206K26328j37215k23086j13712J88431L59932j23720
$$ -335980 -42322 -9629 104577 330905 193690 -29396 -143108 45323 405255 281535
16064B81535k40388N7598j43279J53765j3161j69046J51512J83871k23967k45506
$$ 281535 41147 98745 -44534 109231 96070 -72976 78536 262407 38440 -207066
16054b07066J65536K869m6160p8279k21036L9297K38459J61558M8756J01651k12608
$$ -207066 -41530 -38661 -84821 -163100 -384136 -344839 -106380 55178 103934 205585 -7023
16043g023j14593K3714j08356J6088K9277J71842k23466l38484L6687J94674J67434
$$ -7023 -121616 -97902 -206258 -190170 -160893 10949 -212517 -551001 -514314 -319640 -152206
16032a52206J19712J50089k07233k37703n7709Q3705J89209l1177K28378n1347
$$ -152206 -32494 117595 -89638 -327341 -385050 -301345 -112136 -143313 85065 33718
16022C3718j42685J30038J444l4594N2408l06659j35484K07710J15200p3620J12290
$$ 33718 -108967 21071 22515 -12079 40329 -266330 -401814 -194104 -78904 -152524 -40234
16011d0234P4222p4071n1687K35608L11463l3070j90461N5530o1524j75593o7365
$$ -40234 33988 -40083 -91770 143838 455301 422231 231770 287300 225776 50183 -17182
16000a7182l1657j95342j97928M7360K22294J18553q1504j51560L49219J59256
$$ -17182 -48839 -244181 -442109 -394749 -172455 -53902 -135406 -286966 62253 221509
15990B21509l02781p2021O0420q2102J07340J78841J85208k55114k67082J34877
$$ 221509 -81272 -153293 -92873 -174975 -67635 111206 296414 41300 -225782 -90905
15980i0905K29750j00694K6031N7771o4490q2366K2259J55696M5887k6379m9803
$$ -90905 138845 38151 64182 121953 57463 -24903 -2644 153052 198939 172560 122757
15969A22757m3504n5944P723j59921l21861J47291N7640k178Q7497L7280J07430
$$ 122757 79253 23309 31032 -128889 -450750 -303459 -245819 -247997 -160500 -123220 -15790
15958a5790M6344k25789j97794L0381o9116r684R414j9004K26537O6661J7445
$$ -15790 30554 -195235 -393029 -362648 -431764 -441448 -432034 -451038 -224501 -157840 -140395
15947a40395r5784M1671M5488K63919Q0698l5466J4829k77096j09959r782N6400
$$ -140395 -236179 -194508 -149020 114899 195597 160131 174960 -102136 -212095 -221877 -165477
15936a65477J94565J25232j22542q1130j73097l7753L84778j1043j34596j7603
$$ -165477 29088 154320 31778 -49352 -222449 -260202 124576 113533 -21063 -38666
15926c8666M4960j59669j34757J7593J76617j6527l03022j98793K09022j17530
$$ -38666 6294 -153375 -288132 -270539 -93922 -110449 -413471 -612264 -403242 -520772
15916e20772J81938q1133J48133R2953j86967K65305K15398J16970N4196j68399
$$ -520772 -338834 -419967 -271834 -178881 -365848 -100543 114855 231825 286021 117622
15906A17622j73141j45752j0696K9996K51645L31829J19761k20677k75121j66977
$$ 117622 -55519 -201271 -211967 -181971 69674 401503 521264 300587 25466 -141511
15896a41511j28353j83812M2529N672j3544Q04K7742N5600j11330J7184J03642
$$ -141511 -269864 -453676 -411147 -405475 -419019 -418215 -390473 -334873 -446203 -429019 -325377
15885c25377n262J246J74626n6729N4252L08050q754R8356l9008n5340L6343k31506
$$ -325377 -330639 -329393 -154767 -211496 -157244 150806 142052 240408 201400 146060 182403 -49103
15873d9103j02098M9562N8474J15173q9621k34784J20292K46005j12337l07703
$$ -49103 -151201 -101639 -43165 72008 -17613 -252397 -132105 113900 1563 -306140
15863c06140j70012P3977J65991K2526k73254L0537K73824k6854J72206K57765
$$ -306140 -476152 -402175 -236184 -213658 -486912 -456375 -182551 -209405 -37199 220566
15853B20566M5115j73353j13697q348j56876M5977O4112J9849j07421o8007J26491
$$ 220566 265681 92328 -21369 -29717 -186593 -140616 -76504 -56655 -164076 -232083 -105592
15842a05592j5588J73873L2671j16274j29418O4169j91744j69720J22150l642
$$ -105592 -121180 52693 85364 -30910 -160328 -96159 -287903 -457623 -335473 -339115
15832c39115K84393L03424J15545k053j1649p7112j86448l43935J05910J1026
$$ -339115 -54722 248702 364247 362194 350545 273433 86985 -256950 -151040 -140014
15822a40014K433j6768J90534P6426m3931J50401K69201j08335k3898j59970j55432
$$ -140014 -137581 -154349 36185 112611 68680 219081 488282 379947 356049 196079 40647
15811D0647j29929J26559L02749k90073M057J38208o028n1397J62521p7219j49569
$$ 40647 -89282 37277 340026 49953 54010 192218 186190 134793 297314 220095 70526
15800G0526k32081j46012j35J16911l3496M3797K51405N6571j43580K0062K2677
$$ 70526 -161555 -307567 -307702 -190791 -224287 -180490 70915 127486 -16094 3968 26645
15789B6645j33935k28747r1529K19570L7389l02627Q7559J4027j40311L5677Q1597
$$ 26645 -107290 -336037 -427566 -207996 -170607 -473234 -385675 -371648 -511959 -476282 -394685
15778c94685k35281Q5560J56755J45795J89040j0183l8147J11507o0393j58680
$$ -394685 -629966 -544406 -387651 -241856 -52816 -62999 -101146 10361 -50032 -208712
15768b08712r1041K12764J9018q449N3209j03581p873J51030N9413o9648K9571
$$ -208712 -299753 -86989 -67971 -76420 -23211 -126792 -134665 16365 75778 6130 35701
15757C5701l0983M9462k1333J42179M0367j54299N6145k3195J50983j0729j02600
$$ 35701 4718 54180 32847 175026 215393 61094 117239 94044 245027 234298 131698
15746A31698o3226p7172m0302j50433j24033J41813n363l11851J53500Q8527K1758
$$ 131698 68472 -8700 -49002 -199435 -323468 -181655 -187018 -498869 -345369 -256842 -235084
15735b35084k4530P8476J87508M7604j61967j5760L7042P3990J40191J11555m6988
$$ -235084 -259614 -181138 6370 53974 -107993 -123753 -86711 -12721 127470 239025 192037
15724A92037j28998R1387k15916O54M5485Q5410K1483j92359J26313K59988R7567
$$ 192037 63039 154426 -61490 -60836 -15351 70059 91542 -100817 25496 285484 383051
15713C83051j64366j8074k46718n580M4747j01750P5515L5016J94429J45261k88179
$$ 383051 218685 200611 -46107 -51687 -6940 -108690 -33175 1841 196270 341531 53352
15702E3352r978j23617q6324m7440K5834J30919m1170R2574j14720N7059L5208
$$ 53352 43374 -80243 -166567 -214007 -188173 -57254 -98424 -5850 -120570 -63511 -28303
15691b8303M5237k05889q4285P6723N223L3100N4318J23249m7701j44001L53514
$$ -28303 16934 -188955 -273240 -196517 -191294 -158194 -103876 19373 -28328 -172329 181185
15680A81185Q1559k25726N8894J63891j61704l41041J02297j57923J42145R09
$$ 181185 262744 37018 95912 259803 98099 -242942 -140645 -298568 -156423 -155514
15670a55514r0587K2498j1902R4106L0849k63619M5159J44315l941j58231n1794
$$ -155514 -246101 -223603 -235505 -141399 -110550 -374169 -329010 -184695 -188636 -346867 -398661
15659c98661R2558J36153J60503K60274j58942l59761j99577K5088M6463M01982
$$ -398661 -306103 -169950 -9447 250827 91885 -267876 -467453 -442365 -395902 6080
15649F080m326K4212j39842j38858o3561r7811O8934J09279o624l6389p987N5653
$$ 6080 1754 25966 -113876 -252734 -316295 -414106 -345172 -235893 -242517 -278906 -286893 -231240
15637b31240n6070J9960K82792Q0526k10475n4683j5794m7396J17396k18762O076
$$ -231240 -287310 -267350 15442 95968 -114507 -169190 -184984 -232380 -114984 -333746 -327670
15626c27670J05865J25801k18771N2463k7125J39262L011Q4620r7160J14185J47412
$$ -327670 -221805 -96004 -314775 -262312 -289437 -150175 -147164 -62544 -159704 -45519 101893
15615A01893j3053j544j82617J54103R4474k7967k0341J46037K2392j96808M1203
$$ 101893 88840 87296 -95321 58782 153256 125289 104948 250985 273377 76569 117772
15604A17772m3237K44211n6648k01250O6882m1808j74743K9314o7112j80159r7811
$$ 117772 74535 318746 262098 60848 127730 85922 -88821 -59507 -126619 -306778 -404589
15593d04589P2202J93160J95084o8162j2k0030M6962M190j0135J7989K2747J43152
$$ -404589 -332387 -139227 55857 -12305 -12317 -32347 14615 18805 8670 26659 49406 192558
15581A92558k2820j20461j14962Q7244O1431j55939j68202j9538K77444R2739
$$ 192558 169738 49277 -65685 21559 82990 -72949 -241151 -260689 16755 109494
15571A09494k06512j21085m4590N947K56989K72725Q1345j74219j11590R3534
$$ 109494 -97018 -218103 -262693 -256746 243 272968 354313 180094 68504 162038
15561A62038o4773R6858k71200j17816k6378J53300N3411k5146k78859j24453
$$ 162038 97265 194123 -77077 -194893 -221271 -67971 -14560 -39706 -318565 -443018
15551d43018J47101P2731q4212J34414J1182N3127k0717j18081j56698J64312
$$ -443018 -295917 -223186 -307398 -172984 -161802 -108675 -129392 -247473 -404171 -239859
15541b39859L87073j17804j21986J25320K68154j11903j13595J74460J38228R3571
$$ -239859 147214 29410 -92576 32744 300898 188995 75400 249860 388088 481659
15531D81659m722m6474J46112p1390j29889l04232K0871n1984m8270k68436P734
$$ 481659 476937 430463 576575 505185 375296 71064 91935 39951 -8319 -276755 -269021
15520b69021J88806K34244J85598J55070J16673K87518M87873L40146N21247N54295
$$ -269021 -80215 154029 339627 494697 611370 898888 1386761 1726907 2248154 2802449
15510B802449J068582K149567L954017P201931J1579707R396724n129282j0895558
$$ 2802449 3871031 6020598 9974615 17176546 28756253 38152977 33023695 22128137
15502B2128137p449981m311569k857943j598312r62944n80864k62165k52433l49939
$$ 22128137 14678156 10366587 7508644 5910332 4947388 4366524 4104359 3851926 3501987
15493C501987j79286j78550k52850o3988j23157j86711j67608r9248j52248j39965
$$ 3501987 3322701 3144151 2891301 2827313 2704156 2517445 2349837 2250589 2098341 1958376
15483A958376p2105j71914r0983K3512j05174n0143j28546r7753K46078J9952
$$ 1958376 1886271 1714357 1623374 1646886 1541712 1491569 1363023 1265270 1511348 1531300
15473A531300j24972n132k9498P2282N2324q4321N4861J28084j5849j80974M3174
$$ 1531300 1406328 1401196 1371698 1443980 1496304 1411983 1466844 1594928 1579079 1398105 1441279
15462A441279j05369k7737k84014l37060o5846p1104N5294K93708K58266l1996
$$ 1441279 1335910 1308173 1024159 687099 621253 550149 605443 899151 1157417 1125421
15452A125421k07484j62201k07749R0301K38653K51224L626m68386r1215J400
$$ 1125421 917937 755736 547987 638288 876941 1128165 1131791 663405 572190 573590
15442E73590k92734j07513K07441M8020o3178k5731j21615K95245l1270K8038
$$ 573590 280856 173343 380784 428804 365626 339895 218280 513525 482255 510293
15432E10293j30531l03259N22K39006J29539j48275j55843P2423J92288N5166
$$ 510293 379762 76503 77025 316031 445570 297295 141452 213875 406163 461329
15422D61329j39663k68948q1361M3235N7864O8418m373K061J10747p7756Q1028
$$ 461329 321666 52718 -28643 14592 72456 140874 136501 138562 249309 171553 252581
15411B52581J54444j10804l1096N2793J54336K53371k21664k57652J06149O7223
$$ 252581 407025 296221 265125 317918 472254 725625 503961 246309 352458 419681
15401D19681j35753j64696n1604N4256K481R5299K31032J22668k08891m26717
$$ 419681 283928 119232 67628 121884 124365 219664 450696 573364 364473 -62244
15391f2244j16681J55364J99526n4019j43250J76167k3909J14498Q2307m04342
$$ -62244 -178925 -23561 175965 121946 -21304 154863 130954 245452 327759 -76583
15381g6583k22743K20201r4918K24191K18096k36230k44049l1394M279o3704J32075
$$ -76583 -299326 -79125 -174043 50148 268244 32014 -212035 -243429 -239150 -302854 -170779
15370a70779K77917J76874j96254k0698j0341r1613j82634J48402J66897j35100
$$ -170779 107138 284012 87758 67060 56719 -34894 -217528 -69126 97771 -37329
15360c7329k05033J4491L87484K32921o2058j78937p0503k43988j09963K01863
$$ -37329 -242362 -227871 159613 392534 330476 151539 81036 -162952 -272915 -71052
15350g1052K29309J84663o2206k28452j38819j56926K15773j6119j48639o5115
$$ -71052 158257 342920 280714 52262 -86557 -243483 -27710 -43829 -192468 -257583
15340b57583K95002q4766n6459J82061M8633p5302n7842J7871J73730m2819K6591
$$ -257583 37419 -47347 -103806 78255 126888 51586 -6256 11615 185345 142526 169117
15329A69117K63720p4213M6868o0035l78295k20403o6013L03178K60964j07192
$$ 169117 432837 358624 405492 345457 -32838 -253241 -319254 -16076 244888 137696
15319A37696j52542p6784J15252J67715n1739j14057M4839n3818j00443m5394
$$ 137696 -14846 -91630 23622 191337 139598 25541 70380 16562 -83881 -129275
15309a29275k24779j36129J11874K87782J31201q7342l01343n4633K29006q6117
$$ -129275 -354054 -490183 -378309 -90527 40674 -46668 -348011 -402644 -173638 -259755
15299b59755M1889l7047m9515N8097l3400J17641J65016K2610P613l75673j57199
$$ -259755 -217866 -254913 -304428 -246331 -279731 -162090 2926 25536 33149 -342524 -499723
15288d99723K84749J09972j6705J79689J23195J56791r272K855j57881k94245
$$ -499723 -214974 -105002 -121707 57982 181177 337968 328696 331551 173670 -120575
15278a20575j21434J7197J07252M0762k65313j43381K43023J6946J36946l0496
$$ -120575 -242009 -224812 -117560 -76798 -342111 -485492 -242469 -225523 -88577 -119073
15268a19073K37510J9246k4425k0671k57052J80384K26282n2712k3539n956k50866
$$ -119073 118437 137683 113258 92587 -164465 15919 242201 189489 165950 159994 -90872
15257i0872k88161j0750K95404R2186j30547k40835J42024R6794j55215J19685
$$ -90872 -379033 -389783 -94379 -2193 -132740 -373575 -231551 -134757 -289972 -170287
15247a70287J44095J11866q2265j52093j52437O2415L16671J42725j50780j08977
$$ -170287 -26192 85674 3409 -148684 -301121 -238706 77965 220690 69910 -39067
15237c9067l4651j67236J1917R8067J5797j18329q558J35219J39860L5496R2689
$$ -39067 -73718 -240954 -229037 -130970 -115173 -233502 -242060 -106841 33019 68515 161204
15226A61204M8744m04007j96660Q9464J78728J19614j42224k62162p8220J93127
$$ 161204 209948 -194059 -390719 -301255 -122527 -2913 -145137 -407299 -485519 -292392
15216b92392K37375j11548J29099K90623j59159j63757Q1349J42433j17410K03685
$$ -292392 -55017 -166565 -37466 253157 93998 -69759 11590 154023 36613 240298
15206B40298q6763k11777P9469j22810j54806r1715k20429r1158K9828K11989
$$ 240298 153535 -58242 21227 -101583 -256389 -348104 -568533 -659691 -629863 -417874
15196d17874J53718O1487R4091j13483J47581j31952j34562J50838j0791J33426
$$ -417874 -264156 -202669 -108578 -222061 -74480 -206432 -340994 -190156 -200947 -67521
15186f7521K65775m6461j03999j11263K9388M9248J27314q1500k27659m0573J06144
$$ -67521 198254 151793 47794 -63469 -34081 15167 142481 60981 -166678 -207251 -101107
15175a01107j9741L2883J23417p7395j27133p2367K16892K7156R927O8283R1511
$$ -101107 -120848 -87965 35452 -41943 -169076 -241443 -24551 2605 12532 80815 172326
15164A72326k7180k42708K0635J39973m625O5858j52958r7001J13901J28802m5578
$$ 172326 145146 -97562 -76927 63046 58421 124279 -28679 -125680 -11779 117023 71445
15153G1445J8301J33382J13710Q8543j37795j92879l2318J74604l582Q3253k49919
$$ 71445 89746 223128 336838 425381 287586 94707 62389 236993 233411 316664 66745
15142F6745l15892j85982O8314R5363N0562m0291J64929K642M1015K3826n4575
$$ 66745 -249147 -435129 -366815 -271452 -220890 -261181 -96252 -93610 -52595 -28769 -83344
15131h3344K5212j21788j04920M2870J08163r0991m1050k3309j17325p6172J73366
$$ -83344 -58132 -179920 -284840 -241970 -133807 -224798 -265848 -289157 -406482 -482654 -309288
15120c09288Q4005J1736R1751K5472J02500K33578J72341p3872l25902r8378k29842
$$ -309288 -225283 -213547 -121796 -96324 6176 239754 412095 338223 12321 -86057 -315899
15109c15899K51477K2497j27076K4363K44694k0858k85159j35527K34918l4560
$$ -315899 -64422 -41925 -169001 -144638 100056 79198 -205961 -341488 -106570 -141130
15099a41130J16636k9951N9783n5337Q4536j60396k00039R8671J70113R5648Q9857
$$ -141130 -24494 -54445 5338 -49999 34537 -125859 -325898 -227227 -57114 38534 128391
15088A28391N3834j02269j96836j20666L0417P5524L10021M786R3290k27521j66889
$$ 128391 182225 79956 -116880 -237546 -207129 -131605 178416 183202 276492 48971 -117918
15077a17918j30595j22016J44392O8832j0304j07518J75102J04635O8342q4199
$$ -117918 -248513 -370529 -226137 -157305 -167609 -275127 -100025 4610 72952 -11247
15067a1247P1467k5497j22175m57852q5999K01347L83221J35429L2034K9094j5115
$$ -11247 60220 34723 -87452 -545304 -631303 -429956 -46735 88694 120728 149822 134707
15056A34707Q6032j19329K93979j19490L5622k53356j36511j10983j82588J25185
$$ 134707 220739 101410 395389 275899 311521 58165 -78346 -189329 -371917 -246732
15046b46732J35646J28776j83291N1166K42724J1820J88620r1905k17390m6358
$$ -246732 -111086 17690 -165601 -114435 128289 140109 328729 236824 19434 -26924
15036b6924m1487j34041J48204K97302P7117r8425j9706R670q6554j1028J72142
$$ -26924 -68411 -202452 -54248 243054 320171 221746 202040 211710 125156 114128 286270
15025B86270N7900j81083j24131k16880r2052o8581N3793M42484j54862k26945
$$ 286270 344170 163087 38956 -177924 -269976 -338557 -284764 157720 2858 -224087
15015b24087K72361K19029m8869j72362n3800J65842j05562k72143j81302J42877
$$ -224087 48274 267303 218434 46072 -7728 158114 52552 -219591 -400893 -258016
15005b58016K47936j48334j00744J77431J14615r2065l78561k23125K98279J45123
$$ -258016 -10080 -158414 -259158 -81727 32888 -59177 -437738 -660863 -362584 -217461
14995b17461K17365M28786j34312k99680j88422j30714j6020J26267N4202j19655
$$ -217461 -96 428690 294378 -5302 -193724 -324438 -340458 -214191 -159989 -279644
14985b79644k0735l9959r2734J40768r5596p7004k7811k4640J74215L09029l90
$$ -279644 -300379 -340338 -433072 -292304 -387900 -464904 -492715 -517355 -343140 -34111 -34501
14974c4501j51865J26998P9392J555R7052j77630k6955K26273j42632N1187R4279
$$ -34501 -186366 -59368 20024 21579 118631 -58999 -85954 140319 -2313 48874 143153
14963A43153m8678J02665k51877j00457K61241R4278k72633j32654p430R9182
$$ 143153 94475 197140 -54737 -155194 106047 200325 -72308 -204962 -212392 -113210
14953a13210J62032J4559K26450O6137m08596l0425J18621R158L02507l53819
$$ -113210 48822 63381 289831 355968 -52628 -83053 35568 44726 347233 -6586
14943f586j46390K15226J570j69539O5194q8962Q4564J06047k46462O2995K97180
$$ -6586 -152976 62250 63820 -105719 -40525 -129487 -44923 61124 -185338 -122343 174837
14932A74837J26164J47979m6598j96833N1354J48924J992j0878J51570n8095j9779
$$ 174837 301001 448980 402382 205549 256903 405827 407819 396941 548511 490416 470637
14921D70637j51309J8956K3707J56385k85094l56550j32922L5134j29701J41595
$$ 470637 319328 338284 361991 518376 233282 -123268 -256190 -221056 -350757 -209162
14911b09162J23900o3548k3163j64909j85778k5654K37317K4916N9901J39502
$$ -209162 -85262 -148810 -171973 -336882 -522660 -548314 -310997 -286081 -226180 -86678
14901h6678J2530M2763M9671q5817o200m3416j07604K1508L5625K63721J57685
$$ -86678 -74148 -31385 18286 -67531 -73731 -117147 -224751 -203243 -167618 96103 253788
14890B53788r9966j44683M1367k09J43896l8795l03557J40244l0008p7146j84752
$$ 253788 153822 9139 50506 50297 194193 155398 -148159 -7915 -37923 -115069 -299821
14879b99821j23161N8022J17193p1355K46429J82233l0690j10617n9989K7905
$$ -299821 -422982 -364960 -247767 -319122 -72693 109540 78850 -31767 -91756 -63851
14869f3851K23250p8168q228m9603j58971l3912j83575P8634K79747J21432m3295
$$ -63851 159399 81231 73003 23400 -135571 -169483 -353058 -274424 5323 126755 83460
14858H3460j72670J35332P8915j73526j44966N8878J62664k43133J90805J37704
$$ 83460 -89210 46122 125037 -48489 -193455 -134577 28087 -215046 -24241 113463
14848A13463j6571q3604k54602p3311l3896k699Q2174O3383Q2147l928K25070
$$ 113463 96892 13288 -241314 -314625 -348521 -351220 -269046 -205663 -123516 -127444 97626
14837I7626J18870o6621l60124p7810L03448K5882p7635J77446o3474j43816L43
$$ 97626 216496 149875 -210249 -288059 15389 41271 -36364 141082 77608 -66208 -65865
14826f5865p7283q581O0013J01344J39221l33458j76837J61967j43739j53175
$$ -65865 -143148 -151729 -91716 9628 148849 -184609 -361446 -199479 -343218 -496393
14816d96393J96428K8493j16154l6508K20132N0178Q6371q1409o4042J26168K7117
$$ -496393 -299965 -271472 -387626 -424134 -204002 -153824 -67453 -148862 -212904 -86736 -59619
14805e9619j35066M7004k6913j79920N3058N0581J91520N598j67054j5712J39733
$$ -59619 -194685 -147681 -174594 -354514 -301456 -250875 -59355 -53757 -220811 -236523 -96790
14794i6790L90819o2424j12906j00295l1245k55080N9862N5921N4669M5618j51021
$$ -96790 294029 231605 118699 18404 -12841 -267921 -208059 -152138 -97469 -51851 -202872
14783b02872j08540L9659J16612J38074J626r0868j6948K32353j17446j01999
$$ -202872 -311412 -271753 -155141 -17067 -15441 -106309 -123257 109096 -8350 -110349
14773a10349k953J04904k87048J10052J11189K7339J53896m3060k52993k0852
$$ -110349 -113302 -8398 -295446 -185394 -74205 -46866 107030 63970 -189023 -209875
14763b09875J07650R5179k37179Q9062Q1568K9859l3148o5322M3851m439J54356
$$ -209875 -102225 -7046 -244225 -155163 -73595 -43736 -76884 -142206 -98355 -102794 51562
14752E1562j92729k02234J20157o3127Q2075J79687j61682j01720n840j73146
$$ 51562 -141167 -343401 -223244 -286371 -204296 -24609 -186291 -288011 -293851 -466997
14742d66997R3492J44191K05563K58616r8878k43702j03772R5077K16048j16359
$$ -466997 -373505 -229314 -23751 234865 135987 -107715 -211487 -116410 99638 -16721
14732a6721L9053J66993L9660J52328j58331l08370k75226j19820R7765J61856
$$ -16721 22332 189325 228985 381313 222982 -85388 -360614 -480434 -382669 -220813
14722b20813L00392R4225J35211M2954j12610o2341l08723j3226m8815L5829J88761
$$ -220813 79579 173804 309015 351969 239359 177018 -131705 -144931 -193746 -157917 30844
14711C0844j2482k48289k08843O4217J89419O8788J09111O1980P7540N0042j26873
$$ 30844 18362 -229927 -438770 -374553 -185134 -116346 -7235 54745 132285 182327 55454
14700E5454J02527j81991k13348j38855l354r8008N0546L3687K0140K51213L24347
$$ 55454 157981 -24010 -237358 -376213 -379567 -477575 -427029 -393342 -373202 -121989 202358
14689B02358J46894j27043j63933j5064J42146l0649l5682j22940N7874L8491
$$ 202358 349252 222209 58276 43212 185358 154709 119027 -3913 53961 92452
14679I2452j92546o8902J09740r841n4722r6384k18071J46620K22112Q4889O4601
$$ 92452 -100094 -168996 -59256 -69097 -123819 -220203 -438274 -291654 -69542 15347 79948
14668G9948j2254k25079K04147j23859k13969p4921K9189J41055J11380L3884
$$ 79948 67694 -157385 46762 -77097 -291066 -365987 -336798 -195743 -84363 -50479
14658e0479K6326L0005r045l7492l4678j57990p3685J11667J80503o135j42800
$$ -50479 -24153 5852 -3193 -40685 -75363 -233353 -307038 -195371 -14868 -21003 -163803
14647a63803j41162J7745J4045J27384M0371K4291L0916o9558m2222p8959L9618
$$ -163803 -304965 -287220 -273175 -145791 -105420 -81129 -50213 -119771 -161993 -240952 -201334
14636b01334L33082J41133j32816J7868k10502k62002L542o0299j53987K57234
$$ -201334 131748 272881 140065 157933 -52569 -314571 -311029 -371328 -525315 -268081
14626b68081J79311k35790p6944J21481m4596j02989l367P2417J15407K36522
$$ -268081 -88770 -324560 -401504 -280023 -324619 -427608 -430975 -358558 -243151 -6629
14616f629O192j12211j31564k17605K78573J37676j78681n4292Q5822K24756N4106
$$ -6629 -437 -112648 -244212 -461817 -183244 -45568 -224249 -278541 -192719 32037 86143
14605H6143k40258n54M3389N7838P6841J93772J21356j91693k40876k28049l4739
$$ 86143 -154115 -154669 -111280 -53442 23399 217171 338527 146834 -94042 -322091 -356830
14594c56830J7798k4788K13222J94086k70342j43819J8861J12217J83156J86959
$$ -356830 -339032 -363820 -150598 43488 -226854 -370673 -351812 -239595 -56439 130520
14584A30520o9890o0133Q2453O0917K55340R7287k05549Q1254j6071j20157j41332
$$ 130520 60630 497 82950 143867 399207 496494 290945 372199 356128 235971 94639
14573I4639O9748M4402r2720l072j72806J89452j84114j05094r3940J69829m1094
$$ 94639 164387 208789 116069 112997 -59809 129643 -54471 -159565 -253505 -83676 -124770
14562a24770l71544l8163J24671K60173J01043k25819k66558K37139N62456O6903
$$ -124770 -496314 -534477 -409806 -149633 -48590 -274409 -540967 -303828 258628 325531
14552C25531l64023M1785J95073m8773k07870j03654l28474L87063N1291l3670
$$ 325531 -38492 3293 198366 149593 -58277 -161931 -490405 -103342 -52051 -85721
14542h5721n8440J56615J46980n079O4091k01711L4778M406l3028M11237j25278
$$ -85721 -144161 12454 159434 154355 218446 16735 51513 55919 22891 434128 308850
14531C08850j44912j15453J05341q4199j91416P703L7099P6043j67J0911J68470
$$ 308850 163938 48485 153826 69627 -121789 -114086 -76987 -944 -1111 9800 178270
14520A78270J30512k56750j91114l3956j15140J08197J94785K23436j09614j38197
$$ 178270 308782 52032 -139082 -173038 -288178 -179981 14804 238240 128626 -9571
14510i571J38365k77941o6193k3935l7182O3249n7734j5587p8411j34414O5014
$$ -9571 128794 -149147 -215340 -239275 -276457 -213208 -270942 -286529 -364940 -499354 -434340
14499d34340J10068k80883l5629J87901J23793j35874j81188J39987J10640L57443
$$ -434340 -324272 -605155 -640784 -452883 -329090 -464964 -646152 -506165 -395525 -38082
14489c8082L34109o2662j04031Q2820j07974j74465l4989j3555l17515J11252
$$ -38082 296027 233365 129334 212154 104180 -70285 -105274 -118829 -436344 -325092
14479c25092o3809o5524K10002m066Q2088n426J09018K39999K8505j64964j79326
$$ -325092 -388901 -454425 -244423 -248489 -166401 -171827 -62809 177190 205695 40731 -138595
14468a38595j46147k7299o357L9856O0558K9273o3220J48157L31332J6317j06787
$$ -138595 -284742 -312041 -318398 -278542 -217984 -188711 -251931 -103774 227558 243875 137088
14457A37088j18037j55536K8720q3480Q7057j47172j00488N3976J47409j10660
$$ 137088 19051 -136485 -107765 -191245 -104188 -251360 -351848 -297872 -150463 -261123
14447b61123J43368K7083j43858j6256J32075M5245O056O6031R652k6783M3828
$$ -261123 -117755 -90672 -234530 -250786 -118711 -73466 -67410 -1379 8273 -18510 25318
14436B5318j36633k32175j0582K38390K15287J75717K23967m2462Q5303j40942
$$ 25318 -111315 -343490 -354072 -115682 99605 275322 499289 456827 542130 401188
14426D01188l57101j19810p4570j7671n7351j46863k6207M13837K98258p8952
$$ 401188 44087 -75723 -150293 -167964 -225315 -372178 -398385 15452 313710 234758
14416B34758l2348p650j86716J13608j722j37038k0727J21644k6987k142O2250
$$ 234758 202410 194760 8044 121652 119930 -17108 -37835 83809 56822 54680 116930
14405A16930k259j86701J1822k38784j38726k14504j27718Q0732K00775J63990
$$ 116930 114671 -72030 -60208 -298992 -437718 -652222 -779940 -699208 -498433 -334443
14395c34443J71262R3407J471p2773m091J04306O3051Q4819j35030k60813q2463
$$ -334443 -163181 -69774 -68303 -141076 -145167 -40861 22190 107009 -28021 -288834 -371297
14384c71297j24077J19711M4666r0872l7993l2016n4439L51971L28707O1009k55260
$$ -371297 -495374 -375663 -330997 -421869 -459862 -491878 -546317 -194346 134361 195370 -59890
14373e9890q7481k4089J82284O3091L6924j1535j89323k45609k18021L6975J11802
$$ -59890 -147371 -171460 10824 73915 110839 99304 -90019 -335628 -553649 -516674 -404872
14362d04872J7614J91485O6003j82426l4477k2100N0304k648L26124j790k32499
$$ -404872 -387258 -195773 -129770 -312196 -346673 -368773 -318469 -321117 5007 3217 -229282
14351b29282Q3792m9410r5862P8126m1177R4607J46585j66501k6442K77174r6912
$$ -229282 -145490 -194900 -290762 -212636 -253813 -159206 -12621 -179122 -205564 71610 -25302
14340b5302K0868P6934o7439L7788j41254k39469O604J2107J07205J21167L1329
$$ -25302 -4434 72500 5061 42849 -98405 -337874 -331270 -319163 -211958 -90791 -59462
14329e9462Q6127J31231k09584k07830Q9081L49691J32641r3239m7010M8J4387
$$ -59462 26665 157896 -51688 -259518 -170437 179254 311895 218656 171646 171694 186081
14318A86081J46640K6909N2295l30085K0510n9358j57419k74449j50382j08346
$$ 186081 332721 359630 411925 81840 102350 42992 -114427 -388876 -539258 -647604
14308f47604O4951K68325L2020K2663J54657M6313j7314j13403j66598N519N030
$$ -647604 -582653 -314328 -282308 -259645 -104988 -58675 -75989 -189392 -355990 -350471 -345441
14297c45441j16403J20435K84617J27562j52509k05035j60744J97973K61337J77408
$$ -345441 -461844 -341409 -56792 70770 -81739 -286774 -447518 -249545 11792 189200
14287A89200K7736r1461k87377j87886L379P342j56049J24302J66104O0249K26677
$$ 189200 216936 125475 -161902 -349788 -346409 -339067 -495116 -370814 -204710 -144461 82216
14276H2216J05968j00084r3515J34538R726j22665j49756M0669l7145j58901k70292
$$ 82216 188184 88100 -5415 129123 138849 16184 -133572 -92903 -130048 -288949 -559241
14265e59241M668o512J09876P5706l6373r3688j88460P9133L32278j581k13359
$$ -559241 -554573 -561085 -451209 -375503 -411876 -505564 -694024 -614891 -282613 -284194 -497553
14254d97553K35743j01816j31478p7821Q3412K22715J88487J09399K11866j3229
$$ -497553 -261810 -363626 -495104 -572925 -489513 -266798 -78311 31088 242954 229725
14244B29725n2948K40264o3654j18155j97447j49047j65921J10022K27035J01574
$$ 229725 176777 417041 353387 235232 37785 -111262 -277183 -167161 59874 161448
14234A61448j06798m3166M813j98438J05919r0112O5741L0501q6901j43047p4364
$$ 161448 54650 11484 16297 -182141 -76222 -166334 -100593 -70092 -156993 -300040 -374404
14223c74404j54618R5288J17683Q4568K01937j5134n7392j62633o5861J01955
$$ -374404 -529022 -433734 -316051 -231483 -29546 -44680 -102072 -264705 -330566 -228611
14213b28611m4546j77988k2168J16750L49060L03510J2132j07550K9814j66540
$$ -228611 -273157 -451145 -473313 -356563 -7503 296007 308139 200589 230403 63863
14203F3863Q7420n9398q9435K89559J12311k77597p2241k28862n3319M9425M7171
$$ 63863 151283 91885 2450 292009 404320 126723 54482 -174380 -227699 -178274 -131103
14192a31103J45422j1248J52630K79015j08420j56276K22797j71046l36947j16122
$$ -131103 14319 3071 155701 434716 326296 170020 392817 221771 -115176 -231298
14182b31298j46349j07070J08464J0525k0461O2706K70419j6987k6992O6769J33270
$$ -231298 -377647 -484717 -376253 -365728 -386189 -323483 -53064 -70051 -97043 -30274 102996
14171A02996J31502j77760k95268k6901K59373K52126l86480p0360J32721L5567
$$ 102996 234498 56738 -238530 -265431 -6058 246068 -140412 -210772 -78051 -42484
14161d2484M3382O7751L3764j545J80685n9800j88335j37365n5541R779J56106
$$ -42484 898 68649 102413 100868 281553 221753 33418 -103947 -159488 -149709 6397
14150F397K25477J00149k11285j73319N0451K16420K8861j18375j85940p9378
$$ 6397 231874 332023 120738 -52581 -2130 214290 243151 124776 -61164 -140542
14140a40542N4626j71126k49J77p1127k3906k0450J59114K11545J76138j27022
$$ -140542 -85916 -257042 -257291 -257114 -328241 -352147 -372597 -213483 -1938 174200 47178
14129D7178l9363O1526J58802N4180j28621j68256j71999n438R107O9359J73312
$$ 47178 7815 69341 228143 282323 153702 -14554 -186553 -191991 -182884 -113525 59787
14118E9787j84004j58162o9804M6934J46667J21446O6425J73777j72484q4467
$$ 59787 -124217 -282379 -352183 -305249 -158582 -37136 29289 203066 30582 -53885
14108e3885k5030j07409L788q2441K24524J14591K6300O3571p1121L1687L5307
$$ -53885 -78915 -186324 -182536 -264977 -40453 74138 100438 164009 92888 124575 159882
14097A59882j24991j67125k01945j00579J9472J7323J54527L88192J11909j81903
$$ 159882 34891 -132234 -334179 -434758 -415286 -397963 -243436 144756 256665 74762
14087G4762j42167j05132J3416K0945O7035J32702J47826m60199k42298J92452
$$ 74762 -67405 -172537 -159121 -138176 -71141 61561 209387 -250812 -493110 -300658
14077c00658j63391o0978J98490R6267Q9742J47975R9830M0821P2698r4891k88806
$$ -300658 -464049 -525027 -326537 -230270 -140528 7447 107277 148098 220796 125905 -162901
14066a62901j56055O4887L12728J51916j86582k78826Q4599K62575p7086k8939
$$ -162901 -318956 -254069 58659 210575 23993 -254833 -170234 92341 15255 -13684
14056a3684P173j23368R6189L5474J31283K03695J81820J714k25142k36877L6162
$$ -13684 -6511 -129879 -33690 1784 133067 336762 518582 520296 295154 58277 94439
14045I4439k42843k5950L49199N0978k18769k0654K3157k0996p3479j30511n7007
$$ 94439 -148404 -174354 174845 225823 7054 -13600 9557 -11439 -84918 -215429 -272436
14034b72436p2005j11314K13194J26118J21580J29874J02772J49506Q8729k89798
$$ -272436 -344441 -455755 -242561 -116443 5137 135011 237783 387289 476018 186220
14024A86220j96893p2506j10891O764J26918J26905j92052l7119M3530k26096
$$ 186220 -10673 -83179 -194070 -187306 -60388 66517 -125535 -162654 -119124 -345220
14014c45220j86645M3822J24826K21248n5927J11571J58872K49591J8973l21462
$$ -345220 -531865 -488043 -363217 -141969 -197896 -86325 72547 322138 341111 19649
14004A9649j3551M6259k7871o4207o463j64826O0200K49736J24836j83378k76216
$$ 19649 6098 52357 24486 -39721 -46184 -211010 -150810 98926 223762 40384 -235832
13993b35832M7462J79053J16343p4357j39755j12272k08318o4342J93226k1717
$$ -235832 -188370 -9317 107026 32669 -107086 -219358 -427676 -492018 -298792 -320509
13983c20509P6862L18547j00422l09017j00071J59646K89484k2129J64303j3462
$$ -320509 -243647 74900 -25522 -334539 -434610 -274964 14520 -7609 156694 143232
13973A43232j80146l2835l608l10671k06021j29894Q3157K93916K52554j68525
$$ 143232 -36914 -69749 -73357 -384028 -590049 -719943 -636786 -342870 -90316 -258841
13963b58841Q7229J24536J0252J16062M4735j12677o3447j23882K724K03193J69348
$$ -258841 -171612 -47076 -36824 79238 123973 11296 -52151 -176033 -173309 29884 199232
13952A99232J45231q2656n8696j18180N1177q9802k9975P1539L5625m0013j616
$$ 199232 344463 261807 203111 84931 136108 46306 16331 87870 123495 83482 81866
13941H1866J58560j08609K51080j51804k48520m0131p1976J652k9006K59073J69660
$$ 81866 240426 131817 382897 231093 -17427 -57558 -129534 -127882 -156888 102185 271845
13930B71845J71546k37788k40655k83365R3514Q1937j39628K9801L34746P1850
$$ 271845 443391 205603 -35052 -318417 -224903 -142966 -282594 -252793 81953 153803
13920A53803K0751O0982j68075k17899l3723o4007O8897L1840n4977o5396p9141
$$ 153803 174554 235536 67461 -150438 -184161 -248168 -179271 -147431 -202408 -267804 -346945
13909c46945J94276p7563j11043K29652o8239j65396l9484J31090J67382N6446
$$ -346945 -152669 -230232 -341275 -111623 -179862 -345258 -384742 -253652 -86270 -29824
13899b9824n0222m0715q6881J8649O7703j6996J49946K08975J78784J06339j42789
$$ -29824 -80046 -120761 -207642 -188993 -121290 -138286 11660 220635 399419 505758 362969
13888C62969m25678j39953L9519Q9140k9135j85714R526K56315K28369J34243
$$ 362969 -62709 -202662 -163143 -74003 -103138 -288852 -279326 -23011 205358 339601
13878C39601k00623j75659q3522j13528k16675n2143O1063k02284K93964M34159
$$ 339601 138978 -36681 -120203 -233731 -450406 -502549 -441486 -643770 -349806 84353
13868H4353j95381j62821O7495J3485P6603J06338j17342J43770J18808N7576
$$ 84353 -111028 -273849 -206354 -192869 -116266 -9928 -127270 16500 135308 192884
13858A92884l95441j94813J40945J08959J15000M0283j68566R5594J7717M816
$$ 192884 -202557 -397370 -256425 -147466 -32466 7817 -160749 -65155 -47438 -42622
13848d2622J05899J10438R6667k0668K32121M6295m99572l43181R9389J00682
$$ -42622 63277 173715 270382 249714 481835 528130 28558 -314623 -215234 -114552
13838a14552m7731J602j53225J90209M74279k4504r8974K3977J04300k85015q5402
$$ -114552 -162283 -160681 -313906 -123697 350582 326078 227104 251081 355381 70366 -15036
13827a5036K5272L44429k14942l63866r3955K12054J6924J97510K70478k21854
$$ -15036 10236 354665 139723 -224143 -318098 -106044 -89120 108390 378868 157014
13817A57014j04895j35381k34088J69304K75154o7858j93110o1736L4450k1838
$$ 157014 52119 -83262 -317350 -148046 127108 59250 -133860 -195596 -161146 -182984
13807a82984K81105j31878j70838r0276J32318N738m7526J39185J74121M9898
$$ -182984 98121 -33757 -204595 -294871 -162553 -156815 -204341 -65156 108965 158863
13797A58863j68763J61770J20358P1103k98300o1791k7841l7997K36773K05788
$$ 158863 -9900 151870 272228 343331 45031 -16760 -44601 -82598 154175 359963
13787C59963K16939j17446j63552M525J411J20414L2675l7061P185j65066n4051
$$ 359963 576902 459456 295904 300429 301840 422254 454929 417868 425053 259987 205936
13776B05936o0175j76112J716K00577K03409J62123q8260j44418n2287K1559J22789
$$ 205936 145761 -30351 -28635 171942 375351 537474 449214 304796 252509 274068 396857
13765C96857k30099q6033m668J85210Q672l1911r1884l58327k15460K72119J00895
$$ 396857 166758 80725 76057 261267 269939 238028 146144 -212183 -427643 -155524 -54629
13754e4629k04239J66553K71033k01125l51798j1899N58L80569l6458k33246k5264
$$ -54629 -258868 -92315 178718 -22407 -374205 -386104 -385546 -4977 -41435 -274681 -299945
13743b99945K34566j3649O8917K01560k8306O6742k40781M1955J91940j03083
$$ -299945 -65379 -79028 -10111 191449 163143 229885 -10896 31059 222999 119916
13733A19916L5610Q4410q4415k40067m6373N0624k8490r4817K8170o7179p7185
$$ 119916 155526 239936 155521 -84546 -130919 -80295 -108785 -203602 -175432 -242611 -319796
13722c19796K07368K70208J50741R6714L4503m6223k05121j73710j39713j86072
$$ -319796 -112428 157780 308521 405235 439738 393515 188394 14684 -125029 -311101
13712c11101q660K27999J58873J60232L15872j40849k20025j71733K51352J79649
$$ -311101 -319761 -91762 67111 227343 543215 402366 182341 10608 261960 441609
13702D41609n3208K19044J23943k21379l28795k45798k26073O3707L7247P975
$$ 441609 388401 607445 731388 510009 181214 -64584 -290657 -226950 -189703 -181728
13692a81728J44479J86244J03165Q0398q2428o1705K19331k7115m16838j12646
$$ -181728 -37249 148995 252160 332558 250130 188425 407756 380641 -36197 -148843
13682a48843J44471j4099J30747k1140o6004n859l69867J48397M830k1564m8688
$$ -148843 -4372 -18471 112276 91136 25132 19273 -350594 -202197 -197367 -218931 -267619
13671b67619K14619O235j02947J34518M9696J44606R4733j87397K1955K34470
$$ -267619 -53000 -46765 -149712 -15194 34502 179108 273841 86444 108399 342869
13661C42869j14308m0226j42082l4449J67608q272k89794J9901p1976j0292o9789
$$ 342869 228561 188335 46253 11804 179412 171140 -118654 -98753 -170729 -181021 -250810
13650b50810J25727K47907L41297L05442k3336k53403j72871r0971Q675K18729
$$ -250810 -125083 122824 464121 769563 746227 492824 319953 228982 237657 456386
13640D56386j4707o7610l1800o2764r1029K5391M3458j02159l7281j02068J09613
$$ 456386 441679 374069 342269 279505 188476 213867 257325 155166 117885 15817 125430
13629A25430l4698J35405j86498o8254J06024j03666N978j7705l9470k5281l15644
$$ 125430 90732 226137 39639 -28615 77409 -26257 -20279 -37984 -77454 -102735 -418379
13618d18379k30000K08755J79542J40168J278k55397k5207J09900L7528J26143
$$ -418379 -648379 -439624 -260082 -119914 -118636 -374033 -399240 -289340 -251812 -125669
13608a25669J33159K95493o8647j02585j93419J17662K78555K350j9050j13632
$$ -125669 7490 302983 234336 131751 -61668 55994 334549 336899 317849 204217
13598B04217l8730K2088j37069K4179J09432k50512k18989q8359J24732k92255
$$ 204217 165487 187575 50506 74685 184117 -66395 -285384 -373743 -249011 -541266
13588e41266Q5174L75360J50207p4024j05932r5449K04910K6748k32011K9422
$$ -541266 -456092 -80732 69475 -4549 -110481 -205930 -1020 25728 -206283 -176861
13578a76861k62750l53744R6507L08643K59144K49407j17931k44450l8883M2449
$$ -176861 -439611 -793355 -696848 -388205 -129061 120346 2415 -242035 -280918 -238469
13568b38469P8979M2270K89004R36n8757n9502L1153R6871K1324q3834k25699
$$ -238469 -159490 -117220 171784 172720 113963 54461 85614 182485 203809 119975 -105724
13557a05724j49883J64648K67436O0994N3858j820n2690k47799m4624M3391J7786
$$ -105724 -255607 -90959 176477 237471 291329 289509 236819 -10980 -55604 -12213 5573
13546E573k09756K20916n5554j17806K45177K92408j80741k42649J51749K20352
$$ 5573 -204183 16733 -38821 -156627 88550 380958 200217 -42432 109317 329669
13536C29669k58632k50824n342K93211J04545k52320k18992J03058K98195l5637
$$ 329669 71037 -179787 -185129 108082 212627 -39693 -258685 -155627 142568 106931
13526A06931J22344K38903j06215j91421J2875N7714j05834j90381R195k9930
$$ 106931 229275 468178 361963 170542 183417 241131 135297 -55084 -45889 -75819
13516g5819m9167j3466j35579J70166J70305K94570l2851k33154k2684K81028
$$ -75819 -124986 -138452 -274031 -103865 66440 361010 328159 95005 72321 353349
13506C53349j6620j08644K2806l0670R3545j63286j05591p5392O372l0317K63988
$$ 353349 336729 228085 250891 220221 313766 150480 44889 -30503 -24131 -54448 209540
13495B09540K99318M6556M9722J72129j59782k48727q4749P9217q0400R0085J8740
$$ 209540 508858 555414 605136 777265 617483 368756 284007 363224 282824 372909 391649
13484C91649R4475q1107N3766j20501r0462J0182O4244J7642L4903K3639j9891
$$ 391649 486124 405017 458783 338282 247820 258002 322246 339888 374791 398430 378539
13473C78539j3748N2727k27093j72217j93400M5941K4672L05359P822J20188m0754
$$ 378539 364791 417518 190425 18208 -175192 -129251 -104579 200780 208602 328790 288036
13462B88036K12415p9885N0870K02638r1247l29163M8496M6419j68249J11507
$$ 288036 500451 420566 471436 674074 582827 253664 302160 348579 180330 291837
13452B91837j09787o6759R9780K21640J33367l0805p0653k30015j07567p6498
$$ 291837 182050 115291 215071 436711 570078 539273 468620 238605 131038 54540
13442E4540o3675J39295M36487J13162m9843j31240j51790P1738J00302k4185
$$ 54540 -9135 130160 566647 679809 629966 498726 346936 418674 518976 494791
13432D94791k17266o0562M1051p4981R0684o5050J7762o6041K0012N7981K9708
$$ 494791 277525 216963 258014 183033 273717 208667 226429 160388 180400 238381 268089
13421B68089K49743m4852k02840m3250J38441J63580p1963j29695n3745j6475
$$ 268089 517832 472980 270140 226890 365331 528911 456948 327253 273508 257033
13411B57033K25995N1146o8935m6184M4778p8291J03296R3035Q2071r5788j37977
$$ 257033 483028 534174 465239 419055 463833 385542 488838 581873 663944 568156 430179
13400D30179J83505q4298M6548L5410P0952N9943J10381p0303k64560j35904K49136
$$ 430179 613684 529386 575934 611344 682296 742239 852620 782317 517757 381853 630989
13389F30989j18480K7101K6529j05940J24730N094K8735Q7973N5159k17944j59085
$$ 630989 512509 539610 566139 460199 584929 590023 618758 706731 761890 543946 384861
13378C84861q2633o1716K12301j18154j8206O2562Q390K01942L9713j6874m7888
$$ 384861 302228 240512 452813 334659 316453 379015 387405 589347 629060 612186 564298
13367E64298l0537j08967R3m7475k6624K74285J64821j44246k05513K33958L75551
$$ 564298 533761 424794 424887 377412 350788 625073 789894 645648 440135 674093 1049644
13356A049644O3328K8022J56756j68096k46692k11373j28784m115j1394J50300
$$ 1049644 1112972 1140994 1297750 1129654 882962 671589 542805 538690 527296 677596
13346F77596Q5191R3934J02673o8178o600J18916j51056k07856J30784Q4263m9218
$$ 677596 762787 856721 959394 891216 884616 1003532 852476 644620 775404 859667 810449
13335H10449L9401J96170K59944L0636n3420r3258l14101k66816n2040j53631
$$ 810449 849850 1046020 1305964 1336600 1283180 1189922 875821 609005 556965 403334
13325D03334j07915K19389J85174J18168N3776r3808k56088L190j01363L0690
$$ 403334 295419 514808 699982 818150 871926 778118 522030 525220 423857 454547
13315D54547M61087J04886J41061J13689j5054j53778J33055N2899r8717j38J51100
$$ 454547 915634 1020520 1161581 1275270 1260216 1106438 1239493 1292392 1193675 1193537 1344637
13304A344637Q6129k7333j59367K52205P43q8309J40411R9198o083l27475k9453
$$ 1344637 1430766 1403433 1244066 1496271 1497014 1408705 1549116 1648314 1642231 1314756 1285303
13293A285303J81841J63395K2860K31147l3655k20540K9019Q2300J25452P1928
$$ 1285303 1467144 1630539 1653399 1884546 1850891 1630351 1659370 1741670 1867122 1939050
13283A939050K31337K99657K31963J78423k74606l41812j64423j76825K08068
$$ 1939050 2170387 2470044 2702007 2880430 2605824 2264012 2099589 1922764 2130832
13274B130832L4708k7394k1727k6056K78121K5240k34653J29087K89798o0980
$$ 2130832 2165540 2138146 2116419 2090363 2368484 2393724 2159071 2288158 2577956 2516976
13264B516976K3972J0317R7045j8421J2584j16693Q8032Q9512J04638Q6814k0519
$$ 2516976 2540948 2551265 2648310 2629889 2642473 2525780 2613812 2703324 2807962 2894776 2874257
13253B874257J31353J49709K49482M53337M2352j99441J07328j6720J42548M56706
$$ 2874257 3005610 3155319 3404801 3858138 3900490 3701049 3808377 3791657 3934205 4390911
13243D390911L17570M2577j6317O5343N7363J62267M1813P8666J78725J37718
$$ 4390911 4708481 4751058 4734741 4800084 4857447 5019714 5061527 5140193 5318918 5456636
13233E456636J52535K52691P1930J16152O9296J05695k6321K78565K10209L59474
$$ 5456636 5609171 5861862 5933792 6049944 6119240 6224935 6198614 6477179 6687388 7046862
13223G046862K27786J194J35898K42706J49377K88568M84693M24010N30256L46687
$$ 7046862 7274648 7275842 7411740 7654446 7803823 8092391 8577084 9001094 9531350 9878037
13213I878037L63958M37591M99575N42010N73964O2454l9526K85470L75142O50257
$$ 9878037 10241995 10679586 11179161 11721171 12295135 12357589 12318063 12603533 12978675 13628932
13203A3628932N81752P90480O90008Q96997R73495Q05151R10367R52225J153238
$$ 13628932 14210684 15001164 15691172 16588169 17561664 18366815 19277182 20229407 21382645
13194B1382645J131138J377522J492828J493522J925329K085750K000082K151952
$$ 21382645 22513783 23891305 25384133 26877655 28802984 30888734 32888816 35040768
13186C5040768K419705K828138K955660L260634L815572M295258M680701N379550
$$ 35040768 37460473 40288611 43244271 46504905 50320477 54615735 59296436 64675986
13178F4675986O112540O639269P244868Q274787R628500J0779208J1718443J2623354
$$ 64675986 70788526 77427795 84672663 92947450 102575950 113355158 125073601 137696955
13170A37696955J3768325J4588940J4948632J4788180J3777834J1929991R581193
$$ 137696955 151465280 166054220 181002852 195791032 209568866 221498857 231080050
13163B31080050O334336K497851j268046m581992p554871r905208j1220333j1533667
$$ 231080050 237414386 239912237 238644191 234062199 226507328 216602120 205381787 193848120
13155A93848120j1329327j1284373j0411596r844101r365227q292919p441653
$$ 193848120 182518793 171234420 160822824 150978723 141613496 133320577 125878924
13148A25878924o898181o399332n883850n342592m928931m655897m204610l866358
$$ 125878924 118980743 112581411 106697561 101354969 96426038 91770141 87565531 83699173
13140H3699173l977408l524958l144988l003891k801735k626837k431488k117191
$$ 83699173 79721765 76196807 73051819 70047928 67246193 64619356 62187868 60070677
13132F0070677k283804k269045j849469j715803j570639j493537j659915j594369
$$ 60070677 57786873 55517828 53668359 51952556 50381917 48888380 47228465 45634096
13124D5634096j323760j254284j263971j246604j107394r65757o39753j117326
$$ 45634096 44310336 43056052 41792081 40545477 39438083 38472326 37832573 36715247
13116C6715247j403961j166962q60726n93099p67848o39675o05230n06141p71749
$$ 36715247 35311286 34144324 33283598 32690499 31922651 31282976 30677746 30171605 29399856
13107B9399856q09678n99976o93970o23704n74464o30560p51366l45160k40133
$$ 29399856 28590178 27990202 27296232 26672528 26098064 25467504 24716138 24370978 24130845
13098B4130845o20774n57873m73990m12624m34967p00577m54396k87620l83578
$$ 24130845 23510071 22952198 22478208 22065584 21630617 20930040 20475644 20188024 19804446
13089A9804446j98197o31198m60484l93077M3162l67286n10721l5487l70107j57781
$$ 19804446 19606249 18975051 18514567 18121490 18164652 17797366 17286645 17251158 16881051 16723270
13079A6723270j06105n44802m39724k80526r6984j76045l50901l50229j48192
$$ 16723270 16617165 16072363 15632639 15352113 15255129 15079084 14728183 14377954 14229762
13070A4229762k40926j43819k95373o73387l03059j16400k39919m5584j30462
$$ 14229762 13988836 13845017 13549644 12876257 12573198 12456798 12216879 12171295 12040833
13061A2040833j27771k85037n4989j76858k39279k60419m00310j83770J21605
$$ 12040833 11913062 11628025 11573036 11396178 11156899 10896480 10496170 10312400 10434005
13052A0434005J03998j57532n24952j70233j55952p3065q8707k1752m3149L8610
$$ 10434005 10538003 10380471 9855519 9685286 9529334 9456269 9367562 9345810 9302661 9341271
13042I341271l68237o48118k05100n2046j23632n6527j04033j65544m06745j89888
$$ 9341271 8973034 8324916 8119816 8067770 7944138 7887611 7783578 7618034 7211289 7021401
13032G021401r0809k93047k48942q7473P9624N6085N5707l67515k65189o2198
$$ 7021401 6930592 6637545 6388603 6301130 6380754 6436839 6492546 6125031 5859842 5797644
13022E797644k17130j83291l7689q8001L1055j9061j15161j45594k61575k84165
$$ 5797644 5580514 5397223 5359534 5271533 5302588 5283527 5168366 5022772 4761197 4477032
13012D477032l0720j44129M4169K73913j70044k16746l03325q2087j59122M0007
$$ 4477032 4446312 4302183 4346352 4620265 4450221 4233475 3930150 3848063 3688941 3728948
13002C728948J7107k16047o317j04926l22141r0915Q8990J12403L1313k5488j52226
$$ 3728948 3746055 3530008 3523691 3418765 3096624 3005709 3094699 3207102 3238415 3212927 3060701
12991C060701j06920O1659l7509j07847j28681j22865R5734J11591m1748k83060
$$ 3060701 2953781 3015440 2977931 2870084 2741403 2618538 2714272 2825863 2784115 2501055
12981B501055m8356r6449m3165p8650l204o1517k59785k06660j80409P5271P577
$$ 2501055 2452699 2356250 2313085 2234435 2231231 2169714 1909929 1703269 1522860 1598131 1605708
12970A605708J03768J13409j75837J31094K11181o2284k30912K25468J43683j21040
$$ 1605708 1709476 1822885 1647048 1778142 1989323 1927039 1696127 1921595 2065278 1944238
12960A944238l63143o8625k63762j60173K37672J79909j9137K7216J32280l5401
$$ 1944238 1581095 1512470 1248708 1088535 1326207 1506116 1486979 1514195 1646475 1611074
12950A611074j37503J4233K61943R2362k86327k60465k1123J08835K53448q388
$$ 1611074 1473571 1487804 1749747 1842109 1555782 1295317 1274194 1383029 1636477 1628089
12940A628089Q4247j24280J116j2065J66209J1689n0202j95868j36729k03401
$$ 1628089 1712336 1588056 1589172 1577107 1743316 1755005 1704803 1508935 1372206 1168805
12930A168805q915J01609J07182j12516N7760O2492q9713j88447k62703L37540
$$ 1168805 1159890 1261499 1368681 1256165 1313925 1376417 1286704 1098257 835554 1173094
12920A173094K47721l2540n2865j23053j53247j52934O6851K27041K852j54920
$$ 1173094 1420815 1388275 1335410 1212357 1059110 906176 973027 1200068 1202920 1048000
12910A048000J03858K29699m511k07935k30223o0499J03487J75655J00195n4704
$$ 1048000 1151858 1381557 1377046 1169111 938888 878389 981876 1157531 1257726 1203022
12900A203022J82898K71871k07334P7585K43845L11741K79912J363Q4122L09821
$$ 1203022 1385920 1657791 1450457 1528042 1771887 2083628 2363540 2364903 2449025 2758846
12890B758846K61343J92013n8568q7875J03957K51544j9507j45282k22160k26536
$$ 2758846 3020189 3212202 3153634 3065759 3169716 3421260 3401753 3256471 3034311 2807775
12880B807775r1911k09585J44404j50670l71165k99374k75250k15931j01750J9929
$$ 2807775 2715864 2506279 2650683 2500013 2128848 1829474 1554224 1338293 1236543 1256472
12870A256472m5299r255P5521m9575k92082k51224J08841K90190m3582m21174
$$ 1256472 1211173 1201918 1277439 1227864 935782 684558 793399 1083589 1040007 618833
12860F18833L9525K24805j08752k48053J55399L01002L1658k59433k79653m9765
$$ 618833 658358 883163 774411 526358 681757 982759 1014417 754984 475331 425566
12850D25566Q7998L3637J66428L5836n5274O8694O3238N8469J72923j09506j36312
$$ 425566 513564 547201 713629 749465 694191 762885 826123 884592 1057515 948009 811697
12839H11697J76429j3472R3274n7973j44007q8236N6533j73222j68544P6738Q2574
$$ 811697 988126 974654 1067928 1009955 865948 777712 834245 661023 492479 569217 651791
12828F51791L480J22453J17654L9814j54695j97671K8364J80149j63843K7983
$$ 651791 655271 777724 895378 935192 780497 582826 611190 791339 627496 655479
12818F55479j13336o4115J68543N2434j76661l10653N8347K47656J41587k07748
$$ 655479 542143 478028 646571 699005 522344 211691 270038 517694 659281 451533
12808D51533j77406j60599J35889j10220l3973J32317k8027L3377J55459j02539
$$ 451533 274127 113528 249417 139197 105224 237541 209514 242891 398350 295811
12798B95811p0638Q2120K10158K9057j91860q3930J14030J32601k1270r0668j94991
$$ 295811 225173 307293 517451 546508 354648 270718 384748 517349 496079 405411 210420
12787B10420j38411J53875L61005j68963j48145J71248N7649l0910k31761q128
$$ 210420 72009 225884 586889 417926 269781 441029 498678 467768 236007 227879
12777B27879M5748N4899k43474K6342J27555K15176R625J7978P908M5871K0155
$$ 227879 273627 328526 85052 111394 238949 454125 463750 481728 489636 535507 555662
12766E55662p5663j5071q9066l5942j57359l4694J72771Q0809n9509J70892P1395
$$ 555662 479999 464928 375862 339920 182561 147867 320638 401447 341938 512830 584225
12755E84225j81580o5978N4208J45486K8177j11230M0173l8978P2169r2254J13581
$$ 584225 402645 336667 390875 536361 564538 453308 493481 454503 526672 434418 547999
12744E47999Q3050M6142j02718k652m8318n2923N3686q9012j68661p7833J08311
$$ 547999 631049 677191 574473 571821 523503 470580 524266 435254 266593 188760 297071
12733B97071m6048J91799J84491k49379q8812K08913m1019m69652L0492K29422
$$ 297071 251023 442822 627313 377934 289122 498035 457016 -12636 17856 247278
12723B47278L32267J62656k9716o993l5257Q416k6969R6519J32931J36866j72370
$$ 247278 579545 742201 712485 705492 670235 678651 651682 748201 881132 1017998 845628
12712H45628k88539R3513K4398k50456n0161M4471J48126p960r6700l1469m0490
$$ 845628 557089 650602 675000 424544 374383 418854 566980 559020 462320 430851 390361
12701C90361J17602M5783l8379J04753N0331J7614l515j41921k77234j85022n7711
$$ 390361 507963 553746 515367 620120 670451 688065 684550 542629 265395 80373 22662
12690B2662K00101J04071L51167K74645l71619l45193l1063j83408M5325K43085
$$ 22662 222763 326834 678001 952646 581027 235834 204771 21363 66688 309773
12680C09773O4507K7384R593K1906J89122K12495l43273j23979j13474j28272
$$ 309773 374280 401664 411257 433163 622285 834780 491507 367528 254054 125782
12670A25782O2591j02228l7143J4384p4684K6298k62351j4416J10789K33359J45822
$$ 125782 188373 86145 49002 63386 -11298 15000 -247351 -261767 -150978 82381 228203
12659B28203j41836R1602J42858J38817J55245j32990j76235K00025j59529j31314
$$ 228203 86367 177969 320827 459644 614889 481899 305664 505689 346160 214846
12649B14846M5318o2680j40488J51970k1101p5082j35526j49129L5889K08603
$$ 214846 260164 197484 56996 208966 187865 112783 -22743 -171872 -135983 72620
12639G2620O8456j24904j23180J19566R0303L9117R8661j0327K2585j70509M5736
$$ 72620 141076 16172 -107008 12558 102861 141978 240639 230312 252897 82388 128124
12628A28124L04159J65685j46049k34005j78938k34389j0072K9320P9880k1177
$$ 128124 432283 597968 451919 217914 38976 -195413 -205485 -176165 -96285 -117462
12618a17462O1005P0794J61894P5797o267j55110j39319P2687o1427N4854P4863
$$ -117462 -56457 14337 176231 252028 245761 90651 -48668 24019 -37408 17446 92309
12607I2309j50764J19128R8279J22914J7135o7676k5034j58680p898M28114P8529
$$ 92309 -58455 60673 158952 281866 299001 231325 206291 47611 39713 467827 546356
12596E46356j72440J2548p1801K72539j05304r7977L51973k5973q3829M197J81847
$$ 546356 373916 386464 314663 587202 481898 383921 735894 709921 626092 630289 812136
12585H12136M5422j57893k73738q9682L5841K47461j05306k33384K30413J18755
$$ 812136 857558 699665 425927 336245 372086 619547 514241 280857 511270 630025
12575F30025k39833L4802J35905k01852k0119j74042j13721J37980j0944Q4505
$$ 630025 390192 424994 560899 359047 338928 164886 51165 189145 178201 262706
12565B62706j73817r5933N4573J75374M04758K29216r7356M2606r7110j38173
$$ 262706 88889 -7044 47529 222903 627661 856877 759521 802127 705017 566844
12555E66844P0521j78508r5962M8845p1881L65j7752J67957R9357J83013k32438
$$ 566844 637365 458857 362895 411740 339859 340224 322472 490429 589786 772799 540361
12544E40361J48173Q1547o3452o0752R6483j27519j55881j420j26588L1572K3978
$$ 540361 688534 770081 706629 645877 742360 614841 458960 457540 330952 362524 386502
12533C86502K20422L19185K45480M3888J5345J4522J4627O318n2381J22129j45191
$$ 386502 606924 926109 1171589 1215477 1230822 1245344 1259971 1266289 1213908 1336037 1190846
12522A190846J56164R821j22544m231j08658R4422J56363J86012J45012O5035
$$ 1190846 1347010 1356831 1234287 1230056 1121398 1215820 1372183 1558195 1703207 1768242
12512A768242R0394j21252j25142K11819J46435k1106o0262R1849N2255j1990
$$ 1768242 1858636 1737384 1612242 1824061 1970496 1949390 1889128 1980977 2033232 2021242
12502B021242K40633L58214J67635J84414L6722J8205K75449L42732J89629J73300
$$ 2021242 2261875 2620089 2787724 2972138 3008860 3027065 3302514 3645246 3834875 4008175
12492D008175L78320N09511M47464Q34083Q64241R78015J188693J039563R92889
$$ 4008175 4386495 4896006 5343470 6177553 7041794 8019809 9208502 10248065 11240954
12483A1240954J452845J754938K326106K428918K590997K900056L859190M942293
$$ 11240954 12693799 14448737 16774843 19203761 21794758 24694814 28554004 33496297
12475C3496297O342583Q214522J1568638J7595259K7167387M0237978M9075579
$$ 33496297 39838880 48053402 59622040 77217299 104384686 144622664 193698243
12468A93698243M1917533K9622070L2725413M1340936L7369825K8235214K3904227
$$ 193698243 235615776 265237846 297963259 339304195 376674020 404909234 428813461
12461D28813461K5712144K6438619J6832968q472706l1003189l3215943l1624897
$$ 428813461 454525605 480964224 497797192 489324486 458321297 425105354 393480457
12454C93480457l1176914k3342005k2187299l6478860m4972506l8548038k7321033
$$ 393480457 362303543 338961538 316774239 280295379 235322873 196774835 169453802
12447A69453802j8150476j3242235j0305503q168720o940243o023457m820827
$$ 169453802 151303326 138061091 127755588 119586868 112646625 106623168 101802341
12440A01802341m524076m704986m565594m095891l627127l243370k804708k935520
$$ 101802341 97278265 92573279 88007685 83911794 80284667 77041297 74236589 71301069
12432G1301069k809746k333284j978555j849667j832544j629439j299983j426282
$$ 71301069 68491323 66158039 64179484 62329817 60497273 58867834 57567851 56141569
12424E6141569j480622j522889j564266j294221j475052j629910j321788o60186
$$ 56141569 54660947 53138058 51573792 50279571 48804519 47174609 45852821 45192635
12416D5192635j130877j127466o83800p63079q12126q26578p07672n83580n70255
$$ 45192635 44061758 42934292 42250492 41487413 40675287 39848709 39141037 38557457 37987202
12407C7987202o25403o64806r23445r38180p41136p36834p17116r42591j282105
$$ 37987202 37361799 36696993 35773548 34835368 34094232 33357398 32640282 31697691 30415586
12398C0415586j253773q74389l81174n62255p34599j061717j086027r34142p47597
$$ 30415586 29161813 28287424 27906250 27343995 26609396 25547679 24461652 23527510 22779913
12389B2779913n84589n46234l70459k58579n49707m75868q17738p79235l98150
$$ 22779913 22195324 21649090 21278631 21020052 20470345 19994477 19176739 18397504 17999354
12380A7999354k65703l73230j66211p4136n71461o63358n14122k40017q4560k44603
$$ 17999354 17733651 17360421 17194210 17120074 16548613 15885255 15371133 15131116 15046556 14801953
12370A4801953n51518k12037l30886j15179l51379l11779q5852k84901l07914
$$ 14801953 14250435 14038398 13707512 13592333 13240954 12929175 12843323 12558422 12250508
12361A2250508k09856j81435j96427r6187k34650l26306l34739k83669l17099
$$ 12250508 12040652 11859217 11662790 11566603 11331953 11005647 10670908 10387239 10070140
12352A0070140k30923j6418j09459j18645k27565j55147j0022j34779j08404j82407
$$ 10070140 9839217 9822799 9713340 9594695 9367130 9211983 9201961 9067182 8958778 8776371
12342H776371j39173k14552k40249q6047o9521k05253j06641k62976j92191j73514
$$ 8776371 8637198 8422646 8182397 8096350 8026829 7821576 7714935 7451959 7259768 7086254
12332G086254j41238o3690j67538k61517k59804j86745m8035n1977M7523j61076
$$ 7086254 6945016 6881326 6713788 6452271 6192467 6005722 5957687 5905710 5953233 5792157
12322E792157l04775o9053J11027j08965k08753k26125q3954k39541m8906N9367
$$ 5792157 5487382 5418329 5529356 5420391 5211638 4985513 4901559 4662018 4613112 4672479
12312D672479p0939p6013J29168n2160j12171K05768J38669j28217k7341J0336
$$ 4672479 4601540 4525527 4654695 4602535 4490364 4696132 4834801 4706584 4679243 4689579
12302D689579J45813J37705K43107O38242P33236M83768J43474L82455M29497
$$ 4689579 4835392 4973097 5216204 5854446 6587682 7071450 7214924 7597379 8026876
12293H026876K72039J77099K34182J96354K48218J51526j94104n23262o08733
$$ 8026876 8298915 8476014 8710196 8906550 9154768 9306294 9112190 8588928 7980195
12284G980195o22101l85992j53617j62681m48092o00524m17728l27795m08642
$$ 7980195 7358094 6972102 6818485 6655804 6207712 5607188 5189460 4861665 4453023
12275D453023m23506j36275j28962j58319l6337j3921J6446k41257p4170j91498
$$ 4453023 4029517 3893242 3764280 3605961 3569624 3555703 3572149 3330892 3256722 3065224
12265C065224r1265K53702L44227j87414m89039k59558l5802j26510m3385J87192
$$ 3065224 2973959 3227661 3571888 3384474 2895435 2635877 2600075 2473565 2430180 2617372
12255B617372K38721J30226k93233O5470J02674j49845J77737R796k93359j92736
$$ 2617372 2856093 2986319 2693086 2758556 2861230 2711385 2889122 2898918 2605559 2412823
12245B412823j42044K25958l7212j8310o6883k18029k72436m4176J79666K13303
$$ 2412823 2270779 2496737 2459525 2441215 2374332 2156303 1883867 1839691 2019357 2232660
12235B232660j6967k34535j75977J94826K4037L9275p0233q4321P8713J65075
$$ 2232660 2215693 1981158 1805181 2000007 2024044 2063319 1993086 1908765 1987478 2152553
12225B152553j8238k9603j75353p8773P4478K48058r2845j48266K0134j35583
$$ 2152553 2134315 2104712 1929359 1850586 1925064 2173122 2080277 1932011 1952145 1816562
12215A816562j00070J65565J62029j47124j59621j65155j09925k1720q183l05452
$$ 1816562 1716492 1882057 2044086 1896962 1737341 1572186 1462261 1440541 1432358 1126906
12205A126906J0120J21802q8018J97073K51527k98264m3695P0826q3352j55323
$$ 1126906 1137026 1258828 1170810 1367883 1619410 1321146 1277451 1348277 1264925 1109602
12195A109602j79685M7557j0751j49668P41J39071R5966n109n9656j88189p5070
$$ 1109602 929917 977474 966723 817055 817796 956867 1052833 1047724 988068 799879 724809
12184G24809k9890J1066K03535Q7733J32991n8071q4588m2186J52353q6761J46292
$$ 724809 694919 705985 909520 997253 1130244 1072173 987585 945399 1097752 1010991 1157283
12173A157283J1505o9592j2264j71275q8524J1545M66j47890p185J04317M8055
$$ 1157283 1168788 1099196 1086932 915657 827133 838678 839144 691254 684069 788386 836441
12162H36441n3456J9640K27456K14243m33151j29937M9375J94010o3330K4028
$$ 836441 782985 802625 1030081 1244324 811173 681236 730611 924621 861291 885319
12152H85319o572j16951J17609K1014l70303k09928K08986N3047J44485K76691
$$ 885319 878747 761796 879405 900419 530116 320188 529174 582221 726706 1003397
12142A003397j2751j66638j23456j79152j01507J72568n8063j32377K56031J48347
$$ 1003397 990646 824008 700552 521400 419893 592461 534398 402021 658052 806399
12132H06399Q2008p4143L9011q5953l17925P71J59857R0029r5976K478J2554J13074
$$ 806399 888407 814264 853275 767322 449397 450168 610025 700054 604078 606556 619110 732184
12120G32184J18976o841p3444l6244m9251j52839J00912L001m59899n3545R2978
$$ 732184 851160 844319 770875 734631 685380 532541 633453 636454 176555 123010 215988
12109B15988j4655J62126K8157K19297M8040j22060m0382k731Q3053m3326N6227
$$ 215988 201333 363459 391616 610913 658953 536893 496511 493780 576833 533507 589734
12098E89734J00715J38742J22727j12660n5428q2196M0145L63486N120l27501
$$ 589734 690449 829191 951918 839258 783830 701634 741779 1105265 1110385 782884
12088G82884j24716q3889K01699K43604k97699j16446j57536L07484q3298p8716
$$ 782884 658168 574279 775978 1019582 721883 605437 447901 755385 672087 593371
12078E93371k4863l16069k4825M5606k33486m690J24877O4492J33567j0944J57443
$$ 593371 568508 252439 227614 273220 39734 35044 159921 224413 357980 347036 504479
12067E04479J06042j00654J07068L643j0005J72115k29253n8975K05272o353j63093
$$ 504479 610521 509867 616935 620578 610573 782688 553435 494460 699732 693379 530286
12056E30286L4794k35563O1660Q3705L1982J8977j25042Q1373J16187K57931j67138
$$ 530286 565080 329517 391177 474882 506864 525841 400799 482172 598359 856290 689152
12045F89152j77473M4794J79049r5915P0331J24572J76284M4026K72577R1104
$$ 689152 511679 556473 735522 639607 709938 834510 1010794 1054820 1327397 1418501
12035A418501J8165M15555J90912K7288L504J35422M04051M29310Q6027j25677
$$ 1418501 1436666 1852221 2043133 2070421 2073925 2209347 2613398 3042708 3128735 3003058
12025C003058k75663j12028j81163n6302j12618l50194m8035r0280j86480j91761
$$ 3003058 2727395 2615367 2434204 2377902 2265284 1915090 1867055 1776775 1590295 1398534
12015A398534p5539j43407q4202q6770o7152j18927j0744Q9320j24907j68763
$$ 1398534 1322995 1179588 1095386 1008616 941464 822537 811793 901113 776206 607443
12005F07443j03068J10254M9751K16067n8195j66169j17216J75657J52883l1942
$$ 607443 504375 614629 664380 880447 822252 656083 538867 714524 867407 835465
11995H35465k41104n5870R5978M5803k94255r6171J02746j21840j01023J82348
$$ 835465 594361 538491 634469 680272 386017 289846 392592 270752 169729 352077
11985C52077Q5316j06875o5718l0721j45050J47421Q5383J58501K6501k548p9781
$$ 352077 437393 330518 264800 234079 89029 236450 321833 480334 506835 504287 424506
11974D24506M0259K62751L14810R1104j60428l82146l05703q1631p1768J04830
$$ 424506 464765 727516 1042326 1133430 973002 590856 285153 203522 131754 236584
11964B36584J41081J37486j7883j28363P1079j83293J30146J31107Q800J0407
$$ 236584 377665 515151 497268 368905 439984 256691 386837 517944 526744 537151
11954E37151J053m943k91233j44485K1496p9761Q7972K58572j45529j64006o3266
$$ 537151 538204 533261 242028 97543 119039 39278 127250 385822 240293 76287 13021
11943A3021Q1228j2003n4297M0790J16788J95721K48806n8090j2794o8429j574
$$ 13021 94249 82246 27949 68739 185527 381248 630054 571964 559170 490741 489167
11932D89167m4405k69157k21006J11418J46561J06366m5064P3715m05106R4484
$$ 489167 444762 175605 -45401 66017 212578 318944 273880 347595 -57511 36973
11922C6973J20894p7281r491k6354r0608o7236N2327J63257q7397o1735M0869
$$ 36973 157867 80586 71095 44741 -45867 -113103 -60776 102481 15084 -46651 -5782
11911e782J31365o7049k7792J97518Q0413K2084L13986P3877m51716r830j03000
$$ -5782 125583 58534 30742 228260 308673 330757 644743 718620 266904 257074 154074
11900A54074m4010J49558m1055K9069J19825J05655k57041R2159k21729r7611
$$ 154074 110064 259622 218567 247636 367461 473116 216075 308234 86505 -11106
11890a1106j70569n1915K06410J11379Q5663J71221q4963l0892J09962R2629j38990
$$ -11106 -181675 -233590 -27180 84199 169862 341083 256120 225228 335190 427819 288829
11879B88829j87797j91041J84494Q3152k14369k35193k6950Q7794J71261q3198
$$ 288829 101032 -90009 94485 177637 -36732 -271925 -298875 -211081 -39820 -123018
11869a23018p4900J65522K06440K1288j90780k97262J51273K74657j50113m5316
$$ -123018 -197918 -32396 174044 195332 4552 -292710 -141437 133220 -16893 -62209
11859f2209j578K53725J80158k3896k03457j12630J40907N0592j73304k51954
$$ -62209 -63787 189938 370096 346200 142743 30113 171020 221612 48308 -203646
11849b03646J2410P9412O3621R0287K6476J54066J0082k6835m0948p7049m6736
$$ -203646 -191236 -111824 -48203 42084 68560 222626 232708 205873 164925 87876 41140
11838D1140N5936J35242K95014M7155M91766J58509l26167m04827k85446J12181
$$ 41140 97076 232318 527332 574487 1066253 1224762 898595 493768 208322 320503
11828C20503J02408J06298j73204j23328k44933r9070J13249N7158K55560K31945
$$ 320503 422911 529209 356005 232677 -12256 -111326 1923 59081 314641 546586
11818E46586J61669j70349j64348j19740R041j5990k3378j0704j68469j56780
$$ 546586 708255 537906 373558 253818 262859 246869 223491 212787 44318 -112462
11808a12462P1470J6442O5296M0245O1667M7407J47976Q5481J09211q0267j58851
$$ -112462 -40992 -24550 40746 80991 142658 190065 338041 423522 532733 452466 293615
11797B93615k8313q4114J02415p0449j21730O0357P9085j77753j09223P5893K57833
$$ 293615 265302 181188 283603 213154 91424 151781 230866 53113 -56110 19783 277616
11786B77616J38202j67536J13884M2949j50431K7822R4058l8942j18401K6265
$$ 277616 415818 248282 362166 405115 254684 282506 376564 337622 219221 245486
11776B45486L7520n4938o6667j27975m9432j50034k17403r1561L69832M3187k2624
$$ 245486 283006 228068 161401 33426 -16006 -166040 -383443 -475004 -105172 -61985 -84609
11765h4609J57230J40769k23718J09386L2038j28331j63818J03153J28896L0594
$$ -84609 72621 213390 -10328 99058 131096 2765 -161053 -57900 70996 101590
11755A01590N3614k7538K24604L3180j78448j23981j56748K8792N1724P4938K1776
$$ 101590 155204 127666 352270 385450 207002 83021 -73727 -44935 6789 81727 103503
11744A03503J2387K55299J09759j37350k04715k29679j30675J25402m1410K05214
$$ 103503 115890 371189 480948 343598 138883 -90796 -221471 -96069 -137479 67735
11734F7735J85568k46280j45885j43155J65770k6043J87998J79145K0299M4754
$$ 67735 253303 7023 -138862 -282017 -116247 -142290 45708 224853 245152 289906
11724B89906q9077j9952q0412Q7416L7382l75986k39234K11561P0704J1038J46834
$$ 289906 200829 180877 100465 187881 225263 -150723 -389957 -178396 -107692 -96654 50180
11713E0180j05890j21967J15533K10146P9176n5070J08255O9798j91058r9503
$$ 50180 -55710 -177677 -62144 148002 227178 172108 280363 350161 159103 59600
11703E9600j8504P7590m909k28038k99678l75873M24475M41505r0873k8170J2685
$$ 59600 41096 118686 113777 -114261 -413939 -789812 -365337 76168 -14705 -42875 -30190
11692c0190j1355P4416k3664j62967p0944O8816K3497n441k3296Q4857J20012
$$ -30190 -41545 32871 9207 -153760 -224704 -155888 -132391 -137832 -161128 -76271 43741
11681D3741Q7234K5928j46015j91570k92M5921J25206r920j361j09080l56315
$$ 43741 130975 156903 10888 -180682 -180974 -135053 -9847 -19767 -21128 -130208 -486523
11670d86523l9546L20884M214l2740K5429P6247M9325j87454M1323j17816n6635
$$ -486523 -526069 -205185 -200971 -233711 -208282 -132035 -82710 -270164 -228841 -346657 -403292
11659d03292J35560L06863r0283K29609J07244m3937k46498m9893K09653J4424
$$ -403292 -267732 39131 -51152 178457 285701 241764 -4734 -54627 155026 169450
11649A69450j39637J1910p1238j04767j20581J42431J26305q7955P6773q2113
$$ 169450 29813 41723 -29515 -134282 -254863 -112432 13873 -74082 2691 -79422
11639g9422q297J68484J17699Q6554o337j23347j56544j37543O004K61931j67319
$$ -79422 -87719 80765 198464 285018 278681 155334 -1210 -138753 -132749 129182 -38137
11628c8137j5725J44054L5642J84426l8319N5329j7339k98268j53882l28277j56555
$$ -38137 -53862 90192 125834 310260 271941 327270 309931 11663 -142219 -470496 -627051
11617f27051K07448P9309K16920M47803J75946l56573j96239J52337j15644j81731
$$ -627051 -419603 -340294 -123374 324429 500375 143802 -52437 99900 -15744 -197475
11607a97475n0868L89652K16309n6834j38065q5551R2935J59714k6626J2J32670
$$ -197475 -248343 141309 357618 300784 162719 77168 170103 329817 303191 303203 435873
11596D35873L4762j00757q0238r1794j68601J1518k0375j57588l05312J40823
$$ 435873 470635 369878 289640 197846 29245 40763 20388 -137200 -442512 -301689
11586c01689M02652N7274J84964l3026O5391k70579k09760R2311k09369j39507
$$ -301689 100963 158237 343201 310175 375566 104987 -104773 -12462 -221831 -361338
11576c61338K24978q8517J83071j22142J02Q0955J90711L9150J08126Q3402q9462
$$ -361338 -136360 -224877 -41806 -163948 -163846 -82891 107820 146970 255096 338498 249036
11565B49036r5369m6596L20732j43412N506L1997k41179L7349n8770j09412j2666
$$ 249036 153667 107071 427803 284391 289897 321894 80715 118064 59294 -50118 -62784
11554f2784j43398j45485M5336J66803k8597K511J91654j42768J58958k5679j09746
$$ -62784 -206182 -351667 -306331 -139528 -168125 -165614 26040 -116728 42230 16551 -93195
11543i3195L8796Q7056j21616l84121j79607k0348L58962J98954L01159M2696
$$ -93195 -54399 32657 -88959 -473080 -652687 -673035 -314073 -115119 186040 228736
11533B28736m22601o4996J01207K35482k2665N4185J46325J06038J05233j44809
$$ 228736 -193865 -258861 -157654 77828 55163 109348 255673 361711 466944 322135
11523C22135K7289L4680j55754N8694J86125j76643k96467k30830K43728M571
$$ 322135 349424 384104 228350 287044 473169 296526 59 -230771 12957 17528
11513A7528j0912K2432J04494J86658Q300j13423o4639K2591n3593R8367J46540
$$ 17528 6616 29048 133542 320200 328500 215077 150438 173029 119436 217803 364343
11502C64343j00979Q4910l6557k01673k98841r2189R0389J46167P8374L2675R0508
$$ 364343 263364 348274 311717 110044 -188797 -280986 -190597 -44430 33944 66619 157127
11491A57127k25709l22831q9667J71941K88143J26272J38945L7928o191k24568
$$ 157127 -68582 -391413 -481080 -309139 -20996 105276 244221 282149 275958 51390
11481E1390j7429q3586J28717r981n3083j01466k19942K06289L78458J39212k70303
$$ 51390 33961 -49625 79092 69111 16028 -85438 -305380 -99091 279367 418579 148276
11470A48276j78414P8599J4555J3459J6334L0014K00144j001K0440J20174k36714
$$ 148276 -30138 48461 63016 76475 92809 122823 322967 321966 342406 462580 225866
11459B25866j14129J36852P1390j91946k3864j44136j28542R2937j7106M4191
$$ 225866 111737 248589 319979 128033 104169 -39967 -168509 -75572 -92678 -48487
11449d8487N5768p1339O7219j9607J93238K28428k67968R99J85065J02617j67616
$$ -48487 7281 -64058 3161 -16446 176792 405220 137252 138251 323316 425933 258317
11438B58317k2229J82899m5672j58513o5200r6736K53199K33471j66991p3001
$$ 258317 236088 418987 373315 214802 149602 52866 306065 539536 372545 299544
11428B99544j32545k23441J0746P0525R715J9282j60122Q2005L22130k48428j86101
$$ 299544 166999 -56442 -45696 24829 34544 53826 -106296 -24291 297839 49411 -136690
11417a36690L47786J33145P0340q2127k60061j56832j22987M9690J9780J58749
$$ -136690 211096 344241 414581 332454 72393 -84439 -207426 -157736 -137956 20793
11407B0793P2601j36090j04765J95372L47696M34775L0692k58972l3375n9897
$$ 20793 93394 -42696 -147461 47911 395607 830382 861074 602102 568727 508830
11397E08830k355l7084r5378J3836J08328L61213J56390m3539j71824J10595J76745
$$ 508830 506475 469391 374013 387849 496177 857390 1013780 970241 798417 909012 1085757
11386A085757L7083j3772Q0202l6074k38899j46082n9566k46793j02729j36416
$$ 1085757 1122840 1109068 1189270 1153196 914297 768215 708649 461856 359127 222711
11376B22711k93326m3341J40821Q1005M3056R052O6976J44198N0363k10799k06001
$$ 222711 -70615 -113956 26865 107870 150926 159978 226954 371152 421515 210716 4715
11365D715P1029P4447l6322p7323J42992J45240M4180o6284p5518j38996M6471
$$ 4715 75744 150191 113869 36546 179538 324778 368958 302674 227156 88160 134631
11354A34631k35828j0237K04802L27967m5530m2399J67566k7603j5984L4080r4834
$$ 134631 -101197 -111434 93368 421335 375805 333406 500972 473369 457385 491465 396631
11343C96631J513j13687Q904r758L2421M0341j20780P8281j10034j1651J87420
$$ 396631 398144 284457 293361 283603 316024 356365 235585 313866 203832 192181 379601
11332C79601J18929k26478K4550J41457l1478J0824l02199J1107J75692R9709
$$ 379601 498530 272052 296602 438059 406581 417405 115206 126313 302005 401714
11322D01714k60505k03732j84705j02462M6543J17854J93342p4623K99J41201
$$ 401714 141209 -62523 -247228 -349690 -303147 -185293 8049 -66574 -66275 74926
11312G4926M2588k04068L2736M7675n7192L5413j77198o6995K75551O1803k22264
$$ 74926 117514 -86554 -53818 -6143 -63335 -27922 -205120 -272115 3436 65239 -157025
11301a57025N7410M3927J95947L46644m9879j04039j65691r9733M2069R7669M9957
$$ -157025 -99615 -55688 140259 486903 437024 332985 167294 67561 109630 207299 257256
11290B57256J07452j94716M69K5627o1502q3223K49786K44523j30027N9973j8262
$$ 257256 364708 169992 170461 196088 134586 51363 301149 545672 415645 475618 457356
11279D57356k94703j31705O7990J60361k7139j22180j06265N7862k3549j38056
$$ 457356 162653 30948 98938 259299 232160 109980 3715 61577 38028 -100028
11269a00028J78861J05003j12196o7612K29704J71103j07843l40403l4938J25364
$$ -100028 78833 183836 71640 4028 233732 404835 296992 -43411 -78349 47015
11259D7015k4590j63637n4379p2836J56948R4396j62899O377J47827J2150K29925
$$ 47015 22425 -141212 -195591 -268427 -111479 -17083 -179982 -173605 -25778 -13628 216297
11248B16297j37138j77001p5546R4569o7461k14936N7213L13541J73432o1221
$$ 216297 79159 -97842 -173388 -78819 -146280 -361216 -304003 9538 182970 121749
11238A21749j65918J94319J42575M6131l9078j9965p3701K1362J30822J57617
$$ 121749 -44169 150150 292725 338856 299778 279813 206112 227474 358296 515913
11228E15913J8621J3726j18671J22593q6406j16155k10574K1086m5641r6407N5952
$$ 515913 534534 548260 429589 552182 465776 349621 139047 160133 114492 18085 74037
11217G4037J52441P5099L9602p0908K7769r1095p5334J6912P4915j79113M0300
$$ 74037 226478 301577 341179 270271 298040 206945 131611 148523 223438 44325 84625
11206H4625j33420J29216j0526K9329N9492o6115J10291K0485k13235l11256J47750
$$ 84625 -48795 80421 69895 99224 158716 92601 202892 223377 10142 -301114 -153364
11195a53364J59777k15596q7054K28387N5391K04083j58036Q5292J36381r7524
$$ -153364 6413 -209183 -296237 -67850 -12459 191624 33588 118880 255261 157737
11185A57737L7902p6601j5724P4660j1244l6471n9707J30184R0414j75766j30354
$$ 157737 195639 119038 103314 177974 166730 130259 70552 200736 291150 115384 -14970
11174a4970l2337P7704J5802J9744K6692J32428j02069m3107O1604j38962j91707
$$ -14970 -47307 30397 46199 65943 92635 225063 122994 79887 141491 2529 -189178
11163a89178n3153R3083J68602l1724r8631J078K19419Q5839k14326k21066J28475
$$ -189178 -242331 -149248 19354 -12370 -111001 -109923 109496 195335 -18991 -240057 -111582
11152a11582J16651j8368l07591O7777K13345K32526j2973O3660j5860J08187
$$ -111582 5069 -13299 -320890 -253113 -39768 192758 179785 243445 227585 335772
11142C35772J0786L5895j10755j01549l4056j22421k22506j42124K50559o125
$$ 335772 346558 382453 271698 170149 136093 13672 -208834 -350958 -100399 -106524
11132a06524k5268J27743o1133K01349j4689K107p1664R2383O3389j01182j43966
$$ -106524 -131792 -4049 -65182 136167 121478 123585 51921 144304 207693 106511 -37455
11121c7455j41967P9837K79035J4800O7550K44958M08795K98626l05502m84086
$$ -37455 -179422 -99585 179450 194250 261800 506758 915553 1214179 908677 424591
11111D24591m8005j09700j28893q754J23498J0602J42598j67620l1573J9200Q6912
$$ 424591 376586 266886 137993 129239 252737 263339 405937 238317 206744 225944 312856
11100C12856K60252O9164o7846m8493P6606j04155l7319n5291J0808k33569q8252
$$ 312856 573108 642272 574426 525933 602539 498384 461065 405774 416582 183013 94761
11089I4761j9222j95651r400K02131R0621k3563K13795J15067j53794O1163O0330
$$ 94761 75539 -120112 -129512 72619 163240 139677 353472 468539 314745 375908 436238
11078D36238j2201l62736J58708J67530l19542j72825J5195q857m0867n429M2110
$$ 436238 424037 61301 220009 387539 67997 -104828 -89633 -98490 -139357 -144786 -102676
11067a02676J71402J92483k06221R7013O9712j19373O8034J33631J21245j63365
$$ -102676 68726 261209 54988 152001 221713 102340 170374 304005 425250 261885
11057B61885j63782o5780n8385R8181j29817o4488k1982P4965j97775L8153J06117
$$ 261885 98103 32323 -26062 72119 -57698 -122186 -144168 -69203 -266978 -228825 -122708
11046a22708L0039o1409j04580n1966J13664J49979R6067J10030J13161J00831
$$ -122708 -92669 -154078 -258658 -310624 -196960 -46981 49086 159116 272277 373108
11036C73108P1706k20983l86526j15011K64699J92533j18936k47615K80971J10883
$$ 373108 444814 223831 -162695 -277706 -13007 179526 60590 -187025 93946 204829
11026B04829j65080k57715m7272P6850n6323j31069R8794L06459k8437j45888
$$ 204829 39749 -217966 -265238 -188388 -244711 -375780 -276986 29473 1036 -144852
11016a44852K16783J00100k25539j07241K5114K38255K09315k12098j1265j81025
$$ -144852 71931 172031 -53508 -160749 -135635 102620 311935 99837 88572 -92453
11006i2453j54765J92591J4013n7455j68377J816l4810k103j01441M6907J55675
$$ -92453 -247218 -54627 -40614 -98069 -266446 -264630 -299440 -301543 -402984 -356077 -200402
10995b00402J7450M1926L3083K07099M39977k4730l2217l9829j17917k83018r6644
$$ -200402 -182952 -141026 -107943 99156 539133 514403 482186 442357 324440 41422 -55222
10984e5222l60806j31123J06543J23435J21124J09610J30951J2103o8317J21690
$$ -55222 -416028 -547151 -440608 -317173 -196049 -86439 44512 56615 -11702 109988
10974A09988J8410O8832J20936J07226P5139O2970k55551k38p690j55511k00051
$$ 109988 128398 197230 318166 425392 500531 563501 307950 307712 300022 144511 -55540
10963e5540N0198M3353l4416k9848K76587K35909J12090j54596m23801k28653
$$ -55540 -5342 38011 3595 -26253 250334 486243 598333 443737 19936 -208717
10953b08717j86183J36847K01588J56198p3403j92514M8252K4382j67735J21075
$$ -208717 -394900 -258053 -56465 99733 26330 -166184 -117932 -93550 -261285 -140210
10943a40210J08104L20925m9089o2238K29492J67308j26309k23190R8310j42073
$$ -140210 -32106 288819 239730 177492 406984 574292 447983 224793 323103 181030
10933A81030k5624Q025k66385M6114J18391j02716J51884K30604o282P8624P3959
$$ 181030 155406 163431 -102954 -56840 61551 -41165 110719 341323 335041 413665 487624
10922D87624j32192j18621j38519j01931O4652j59478k02861q1142J14260J62604
$$ 487624 355432 236811 98292 -3639 61013 -98465 -301326 -382468 -268208 -105604
10912a05604L06742J73175L5261k84685k38946o3789k4091J10392J03447L8959
$$ -105604 201138 374313 409574 124889 -114057 -177846 -201937 -91545 11902 50861
10902E0861j95919l4740j29486K07959j5862J2615K32895k4196K7329j55227m4772
$$ 50861 -145058 -179798 -309284 -101325 -117187 -104572 128323 104127 131456 -23771 -68543
10891f8543m0652j45366M4426J0675K74818l2003L458K4562k7808j13595j43666
$$ -68543 -109195 -254561 -210135 -199460 75358 43355 46813 71375 43567 -70028 -213694
10880b13694J90015J71217R1356o062r2804J43903J74591k85062k7125m3247K36161
$$ -213694 -23679 147538 238894 232832 140028 283931 458522 173460 146335 103088 339249
10869C39249k9917m95166q8877L93721K71598o9998l30837K569J91066O6019j49033
$$ 339249 309332 -185834 -274711 119010 390608 320610 -10227 -7658 183408 249427 100394
10858A00394R1945M0310K8041m1220k5988L62667K922j32651k97322k31829q4510
$$ 100394 192339 232649 260690 219470 193482 556149 559071 426420 129098 -102731 -187241
10847a87241q726P7872p493j31208K4000j5016j97457k5680L34967J79177J28030
$$ -187241 -195967 -118095 -125588 -256796 -232796 -247812 -445269 -470949 -135982 43195 171225
10836A71225O4384l2414p6956m9955R0815q1552j8708J9544q4986k03519n6708
$$ 171225 235609 203195 126239 76284 167099 85547 66839 86383 1397 -202122 -258830
10825b58830k2523q2477J63512K3615K47121j03900J85277J93266j55184m24990
$$ -258830 -281353 -363830 -200318 -176703 70418 -33482 151795 345061 189877 -235113
10815b35113n2747N3510J87988K05525q2023k67110j04295K11474J31537m4503
$$ -235113 -287860 -234350 -46362 159163 77140 -189970 -294265 -82791 48746 4243
10805D243J22974N4447q2148r6627Q0552l2714j53959j57845J92243j90806J20131
$$ 4243 127217 181664 99516 2889 83441 50727 -103232 -261077 -68834 -259640 -139509
10794a39509L52660k67211n8784J17346j0057R093j21692j84531l6008k4945N3960
$$ -139509 213151 -54060 -112844 4502 -5555 3538 -118154 -302685 -338693 -363638 -309678
10783c09678J36460K35428J14652l1049J77503J8966k00546J13145j28227J6226
$$ -309678 -173218 62210 176862 145813 323316 342282 141736 254881 126654 142880
10773A42880J18671N2734p5961l24402k05281J63422L33653Q5998p9405J0885
$$ 142880 261551 314285 238324 -86078 -291359 -127937 205716 291714 212309 223194
10763B23194j81485j31637j42251j05996L57994M26389l45926l30541j58173n630
$$ 223194 41709 -89928 -232179 -338175 19819 446208 100282 -230259 -388432 -394062
10753c94062P7017M00450N6106J15396l8205j32222k28897O293O4337q4540p4129
$$ -394062 -317045 83405 139511 254907 216702 84480 -144417 -138124 -73787 -158327 -232456
10742b32456J94264K68688j92969k85581L1003J71673k6601p251j73332j07540
$$ -232456 -38192 230496 37527 -248054 -217051 -45378 -71979 -79230 -252562 -360102
10732c60102J31750J58999l0234o0574l8500r4706p398k7903o6734J05882K18175
$$ -360102 -228352 -69353 -99587 -160161 -198661 -293367 -300765 -328668 -395402 -289520 -71345
10721g1345O7047J14891j71582j24526K8299J45987k1721J51581k61492j1716
$$ -71345 -4298 110593 -60989 -185515 -157216 -11229 -32950 118631 -142861 -154577
10711a54577O4004L8117J800J87178J72197M2406k39496l12859J09052K54316
$$ -154577 -90573 -52456 -50656 136522 308719 351125 111629 -201230 -92178 162138
10701A62138J80724m358l31918j33963q235J14204j5424k58469J97649K63364
$$ 162138 342862 338504 6586 -127377 -135612 -21408 -36832 -295301 -97652 165712
10691A65712K0673k00642R0191P5102l5477L1396J65925o5809J57768o4738j35599
$$ 165712 186385 -14257 75934 151036 115559 146955 312880 247071 404839 340101 204502
10680B04502l34022j75551J43260K21920Q8933j30635k44000j21900L92552J28386
$$ 204502 -129520 -305071 -161811 60109 149042 18407 -225593 -347493 45059 173445
10670A73445k12083j07100P1755J08898N5181l0744l8066M3781O7683n3741j42061
$$ 173445 -38638 -145738 -73983 34915 90096 59352 21286 65067 132750 79009 -63052
10659f3052j46324L6604J43091k8259K6226M4026k04311r8288J56536L56619o6190
$$ -63052 -209376 -172772 -29681 -57940 -31714 12312 -191999 -290287 -133751 222868 156678
10648A56678L5609n7920j31553j74869J70967n2883J95687Q3775j4601K27488
$$ 156678 192287 134367 2814 -172055 -1088 -53971 141716 225491 210890 438378
10638D38378j41666j61355j81367k78758J12187j6167j06005j21240J51645K96566
$$ 438378 296712 135357 -46010 -324768 -212581 -228748 -334753 -455993 -304348 -7782
10628g782r7089K2986K64731L9177m1734J56617r83j25500j21661k73449j03202
$$ -7782 -104871 -81885 182846 222023 180289 336906 335923 210423 88762 -184687 -287889
10617b87889K1218J07543P0612J18728K02515l5072j15368J98904R8890K8767
$$ -287889 -266671 -159128 -88516 30212 232727 197655 82287 281191 380081 408848
10607D08848M7678k38894l00097n2134K5977j79703J46296J47788r8776L6822
$$ 408848 456526 217632 -82465 -134599 -108622 -288325 -142029 5759 -93017 -56195
10597e6195N9938P0523j83027m8687K10832p929k04030r2509j1756O1843k950
$$ -56195 3743 74266 -108761 -157448 53384 45455 -158575 -251084 -262840 -200997 -203947
10586b03947J6000k3941j07851J26100r3389M0102K42262J96389J16827R567K2132
$$ -203947 -187947 -211888 -319739 -193639 -287028 -246926 -4664 191725 308552 318119 340251
10575C40251j27386o9357o2557j08969j1225j05056n7524Q2694J51806q8053o8245
$$ 340251 212865 143508 80951 -28018 -39243 -144299 -201823 -119129 32677 -55376 -123621
10564a23621J26201j61305j15950J58088m055n0550J08018j23210o9291R1477
$$ -123621 2580 -158725 -274675 -116587 -120642 -171192 -63174 -186384 -255675 -164198
10554a64198K17782L2032n1497O5589M8114J73118K00154M1408M4537l81842m54142
$$ -164198 53584 85616 34119 99708 147822 320940 521094 562502 607039 225197 -228945
10543b28945J21054k33j50949j40259j2202o8064K1538J33027J47818J68410j5275
$$ -228945 -107891 -108124 -259073 -399332 -411534 -479598 -458060 -325033 -177215 -8805 -24080
10532b4080j03382Q8669J70702K33333l83495k90612J2732K574J21940N8865R5805
$$ -24080 -127462 -38793 131909 365242 -18253 -308865 -296133 -293559 -171619 -112754 -16949
10521a6949L5410j14002L5683Q9290j79305j56979L3839K68260J44482k09945
$$ -16949 18461 -95541 -59858 29432 -149873 -306852 -273013 -4753 139729 -70216
10511g0216l6372J28972l23267Q5181J13552k12996j15046n7058O0266j30554
$$ -70216 -106588 22384 -300883 -215702 -102150 -315146 -430192 -487250 -426984 -557538
10501e57538K71361N0947q0655J30876Q8931p2344k9623J18439j21985q0839K30416
$$ -557538 -286177 -235230 -315885 -185009 -96078 -168422 -198045 -79606 -201591 -282430 -52014
10490e2014J61044j59072j17185q4317p8944K34026o66P7321J62030M1359o8188
$$ -52014 109030 -50042 -167227 -251544 -330488 -96462 -97128 -19807 142223 183582 115394
10479A15394J18613j81351J0590k3907j48456m8295N0738j4825M3176j72678O6495
$$ 115394 234007 52656 63246 39339 -109117 -157412 -106674 -121499 -78323 -251001 -184506
10468a84506J59364K29278J0088J17589j9164p8506K2948k57519j20667K05313
$$ -184506 -25142 204136 214224 331813 312649 234143 257091 -428 -121095 84218
10458H4218J40727j36679j12340p4799q6869m8281j79174R2732k55646n134R2506
$$ 84218 224945 88266 -24074 -98873 -185742 -234023 -413197 -320465 -576111 -581245 -488739
10447d88739J66179K68796P1680k22502j26734O6153L7528M2920o2005J14696
$$ -488739 -322560 -53764 17916 -204586 -331320 -265167 -227639 -184719 -246724 -132028
10437a32028j35030j62516K5303M4472K1710k5836K3501J62384k20715j3559O222
$$ -132028 -267058 -429574 -404271 -359799 -338089 -363925 -340424 -178040 -398755 -412314 -406092
10426d06092P444J82665K21562N0055J27123K50426j38415j62375j93558N7806
$$ -406092 -398648 -215983 5579 55634 182757 433183 294768 132393 -61165 -3359
10416c359m860J02098K94789J63113o1648q7530l94898m00241j04195R4500Q5876
$$ -3359 -8219 93879 388668 551781 490133 402603 7705 -392536 -496731 -402231 -316355
10405c16355K45059k22893j17263L9128K94198Q9175l9503N4187r1659m8207K35179
$$ -316355 -71296 -294189 -411452 -372324 -78126 11049 -28454 25733 -65926 -114133 121046
10394A21046K16045J43573n401l9249L6997n8230l15972j47279K0226J53810k0563
$$ 121046 337091 480664 475263 436014 473011 414781 98809 -48470 -28244 125566 105003
10383A05003J4887J8882k0398j27637K7841k055R4300N0183n0990J5231o2213
$$ 105003 119890 138772 118374 -9263 18578 16523 110823 161006 110016 125247 63034
10372F3034l16529M565K48366O7695j49165J7098K37649J1078j69407J23375j083
$$ 63034 -253495 -248930 -564 67131 -82034 -64936 172713 183791 14384 137759 136676
10361A36676l17391o5801J99510R8002M5923o9831j81410j17447k19853k31513
$$ 136676 -180715 -246516 -47006 50996 96919 27088 -154322 -271769 -491622 -723135
10351g23135K01290J93804J40142J24836P6455k27589j28209j2457j3324n3995
$$ -723135 -521845 -328041 -187899 -63063 13392 -214197 -342406 -354863 -368187 -422182
10341d22182J56728J85219R5094J88680K5869j33157K5548J5576j0341l21983
$$ -422182 -265454 -80235 14859 203539 229408 96251 121799 137375 127034 -194949
10331a94949l46165R6047L46184j0936n7700n4203M4551K03860O172j06054J04431
$$ -194949 -541114 -445067 -98883 -109819 -167519 -221722 -177171 26689 32861 -73193 31238
10320C1238J12531l852P3624M2896j12655N6457l491J50392j20487j94678j25226
$$ 31238 143769 139917 213541 256437 143782 200239 196748 347140 226653 31975 -93251
10309i3251M5872J58505m2247N4432l3975j24557j69506n6687p2386l2978P0531
$$ -93251 -47379 111126 68879 123311 89336 -35221 -204727 -261414 -333800 -366778 -296247
10298b96247J53410J74530J44421k3528l62434O9127J03303o4717o4578j52552
$$ -296247 -142837 31693 176114 152586 -209848 -140721 -37418 -102135 -166713 -319265
10288c19265J94070K96294J26388l7591J4645l43696j37784K11564l6901j69453
$$ -319265 -125195 171099 297487 259896 274541 -69155 -206939 4625 -32276 -201729
10278b01729J54661L4750p053k46012N3686N7776Q6349M23926L35492K58949k96435
$$ -201729 -47068 -12318 -19371 -265383 -211697 -153921 -67572 356354 691846 950795 654360
10267F54360m32782o25L30297j22290q9146O3826R9133n0897j78468K78569P77833
$$ 654360 221578 220953 551250 428960 339814 403640 502773 451876 273408 551977 1329810
10256A329810N25745l712l12042o92702l44437p6939k47797m7418L12645R1308
$$ 1329810 1855555 1851843 1539801 847099 502662 425723 177926 130508 443153 534461
10246E34461Q6472J78141L06693N51606O83195N66956j61421o74131o58337k36406
$$ 534461 620933 799074 1105767 1657373 2340568 2907524 2746103 2071972 1413635 1177229
10236A177229l62327j80104j03987K23985o3838J73517L03666K88559L15933K12806
$$ 1177229 814902 634798 530811 754796 690958 864475 1168141 1456700 1772633 1985439
10226A985439k07929o04117l62662j70702M1030p0030j12524m5307j1017L5451
$$ 1985439 1777510 1173393 810731 640029 681059 611029 498505 453198 442181 477632
10216D77632K6131K30731K65520J15214j91709j47040j36095K4671l6989j30300
$$ 477632 503763 734494 1000014 1115228 923519 776479 640384 665055 628066 497766
10206D97766k8788k2194k04607q5200j72779l9227J18601J90106k8639p1006K19025
$$ 497766 468978 446784 242177 156977 -15802 -55029 63572 253678 225039 154033 373058
10195C73058K6192j97594N7774j94539k63846K8454K75516J12468j9053J34383
$$ 373058 399250 201656 259430 64891 -198955 -170501 105015 217483 198430 332813
10185C32813j18342k43319k89828j9922n4785R0268O0899m5266K33141J32669
$$ 332813 214471 -28848 -318676 -338598 -393383 -303115 -242216 -287482 -54341 78328
10175G8328p2818P925J05814j03021k04672M8308o5556Q559J63095L18328Q0198
$$ 78328 5510 13435 119249 16228 -188444 -140136 -205692 -197133 -34038 284290 364488
10164C64488j94519r9123j62208k0172K6787q4815m3939m3638l0127m0103r6864
$$ 364488 169969 70846 -91362 -111534 -84747 -169562 -213501 -257139 -287266 -327369 -424233
10153d24233J85269J17951Q2302K8753K65804R8034r5067N0326q7935j47722K11977
$$ -424233 -238964 -121013 -38711 -9958 255846 353880 258813 309139 221204 73482 285459
10142B85459J58489j76591j44654J52589K15188o4729l87615m60162k4620Q909
$$ 285459 443948 267357 122703 275292 490480 425751 38136 -422026 -446646 -437737
10132d37737K64847K28020k8808O0307L8973o2341r416n6829P1436q8703l895
$$ -437737 -172890 55130 26322 86629 125602 63261 53845 -2984 68452 -20251 -24146
10121b4146K59748K5714m2055n6306N3968j53928j73666k2331M3007m6526J86314
$$ -24146 235602 261316 219261 162955 216923 62995 -110671 -133002 -89995 -136521 49793
10110D9793j67134n6522J13854k3291J45030p3030l8734K60065N3509k33888L2720
$$ 49793 -117341 -173863 -60009 -83300 61730 -11300 -50034 210031 263540 29652 62372
10099F2372j09793l5240k06569j44905K36896L84944J17339J59565r6091Q0187
$$ 62372 -47421 -82661 -289230 -434135 -197239 187705 305044 464609 368518 448705
10089D48705N0708l39211j7365J40149N3189j86455k3006J84617N0613j80394
$$ 448705 499413 160202 142837 282986 336175 149720 126714 311331 361944 181550
10079A81550j36779J64095k4618J20180j48509j42793J82531J39700k7363j79290
$$ 181550 44771 208866 184248 304428 155919 13126 195657 335357 307994 128704
10069A28704j23130O891J93395q3921j15207R0327j77714l31491k393K11320M5120
$$ 128704 5574 12465 205860 121939 6732 97059 -80655 -412146 -414539 -203219 -158099
10058a58099M7489J20177j14472j6888j91571J20274L33086n6309k22614K9667
$$ -158099 -110610 9567 -104905 -121793 -313364 -193090 139996 83687 -138927 -109260
10048a09260J18464L7528j04368k66891j09637m9427J92273J56626J04304K2274
$$ -109260 9204 46732 -57636 -324527 -434164 -483591 -291318 -134692 -30388 -8114
10038h114K02366k5259k2150k68473N8607J57453k71380M4551j73090j22425N2235
$$ -8114 194252 168993 146843 -121630 -63023 94430 -176950 -132399 -305489 -427914 -375679
10027c75679M7811j23271K25953K07864j02138k8432K2101j1095J51837j88916
$$ -375679 -327868 -451139 -225186 -17322 -119460 -147892 -125791 -136886 14951 -173965
10017a73965l5094O3160L53695K02903k12842j55122l5308o0737j1696j01530
$$ -173965 -209059 -145899 207796 410699 197857 42735 7427 -53310 -65006 -166536
10007a66536k55945J62027N03454Q3153k46907k41513J366K75863J44683L3575
$$ -166536 -422481 -260454 243000 326153 79246 -162267 -160901 114962 259645 293220
9997B93220m64678k80414N1182K41017Q273J20213J84655J10674j32216j1505
$$ 293220 -171458 -451872 -400690 -159673 -151400 -31187 153468 264142 131926 120421
9987A20421J23195j83084j81876m3318P4408K23652o9272j31821l1062R2343L9994
$$ 120421 243616 60532 -121344 -164662 -90254 133398 64126 -67695 -98757 -6414 33580
9976C3580J36981J23569K1548j91384o207N6188O495j56416Q6502R2625L7273
$$ 33580 170561 294130 315678 124294 118087 174275 180770 24354 110856 203481 240754
9965B40754q8920R0553r9051O0772K85717j25384m3241m2703M8355J96145N557
$$ 240754 151834 242387 143336 204108 489825 364441 321200 278497 326852 522997 528554
9954E28554j20508j98316Q5862j36848J01576m2041L6992j38667n0901J49385
$$ 528554 408046 209730 295592 158744 260320 218279 255271 116604 65703 215088
9944B15088K03604K17747k21454l41371J87902K33226j186j7806j70866M1929
$$ 215088 418692 636439 414985 73614 261516 494742 493556 475750 304884 346813
9934C46813K5383J24097J06093j9753k80552M7415J08666K15111p8628r6772K1857
$$ 346813 372196 496293 602386 582633 302081 349496 458162 673273 594645 497873 519730
9923E19730l1289L5775J15032L01253Q7974j11462j42309O8276Q551n7676K40583
$$ 519730 488441 524216 639248 940501 1028475 917013 774704 842980 851531 793855 1034438
9912A034438Q6415k74885N965M54641L20224N7657J82666K27113O69856R89866
$$ 1034438 1120853 845968 851933 1306574 1626798 1684455 1867121 2094234 2764090 3753956
9902C753956R60712Q62466M73001N71061P48647L29281o33211q72978m96691K5214
$$ 3753956 4714668 5577134 6050135 6621196 7369843 7699124 7065913 6192935 5696244 5721458
9892E721458P45349J137533J483115J435985J395829K002129K742487J278914
$$ 5721458 6466807 7604340 9087455 10523440 11919269 13921398 16663885 17942799
9884A7942799p69509r03207K12800J802777L229396N685813R233594J4589397
$$ 17942799 17173290 16270083 16482883 18285660 21515056 27200869 36434463 51023860
9876E1023860K3989528L8531353M5570118K5261889j4928557l6323173l2664277
$$ 51023860 75013388 113544741 159114859 184376748 169448191 133125018 100460741
9869A00460741k0761799j0831010l959934J812502Q026391J5703809K7253023
$$ 100460741 79698942 68867932 64907998 66720500 74746891 90450700 117703723
9862A17703723M7017425P6427247Q9651320M3591422l8921209p7611353o4441511
$$ 117703723 164721148 241148395 330799715 374391137 335469928 257858575 193417064
9855A93417064m0032521k2066822j0173311p01134Q773111K0615447L8928080
$$ 193417064 153384543 131317721 121144410 120443276 129216387 149831834 188759914
9848A88759914O9781228J11792937J26576294N3405421o7101323j17759386r4700529
$$ 188759914 258541142 370334079 496910373 550315794 483214471 365455085 270754556
9841B70754556n9008336l4322461j9909243r911709m90573R717400K3513923M5246406
$$ 270754556 211746220 177423759 157514516 147602807 147112234 156829634 180343557 225589963
9833B25589963P3004379Q1400430K9727803n0876479q1582153o4079644m0038329
$$ 225589963 298594342 379994772 409722575 358846096 277263943 213184299 173145970
9826A73145970k4268842j5321436r164485l664858K369860R933039K0766184L4440685
$$ 173145970 148877128 133555692 124391207 120726349 123096209 133029248 153795432 188236117
9818A88236117L7546548J0933565k8016585m1474983l2613093k1210595j3774358
$$ 188236117 225782665 236716230 208699645 167224662 134611569 113400974 99626616
9811I9626616r871053p317254n552545m291520l406167k795104k604921k319498
$$ 99626616 89755563 82438309 76885764 72594244 69188077 66392973 63788052 61468554
9803F1468554j836364j591986j856142j814819j704152j522421j553962j534045
$$ 61468554 59632190 58040204 56184062 54369243 52665091 51142670 49588708 48054663
9795D8054663j491758j607762j434834j336634j118492r83162j222189j058245
$$ 48054663 46562905 44955143 43520309 42183675 41065183 40082021 38859832 37801587
9787C7801587r18941p71118r09783o09845o96279r16868q87956q25495p25871
$$ 37801587 36882646 36111528 35201745 34591900 33895621 32978753 32090797 31265302 30539431
9778C0539431o23050p45224q90704p03792m67171n13259n86032n95857l30278
$$ 30539431 29916381 29171157 28280453 27576661 27109490 26596231 26010199 25414342 25084064
9769B5084064k89268o23037p19390o55797m85193l89626n74513l44538j76569
$$ 25084064 24794796 24171759 23452369 22796572 22311379 21921753 21347240 21002702 20826133
9760B0826133l30178j48704k56275l62167o79483l36278m68279m86193l27284
$$ 20826133 20495955 20347251 20090976 19728809 19049326 18713048 18244769 17758576 17431292
9751A7431292m55360j47559k16972m20357m45610m17929j66034j86055l96717
$$ 17431292 16975932 16828373 16611401 16191044 15745434 15327505 15161471 14975416 14578699
9742A4578699m27541m04767l4168r1706k98479j18700l05350k00276k65427k25377
$$ 14578699 14151158 13746391 13712223 13620517 13322038 13203338 12897988 12697712 12432285 12206908
9732A2206908l22861j84767k60388l89959j88715l13258j17075j21300k94040
$$ 12206908 11884047 11699280 11438892 11048933 10860218 10546960 10429885 10308585 10014545
9723A0014545k04000j34590j22390j94664j89262j82206J36013j54538l64512
$$ 10014545 9810545 9675955 9553565 9358901 9169639 8987433 9123446 8968908 8604396
9714H604396l14880k30341j74910J3136J97800j40917o771J60023P3683l50869
$$ 8604396 8289516 8059175 7884265 7897401 8095201 7954284 7947513 8107536 8181219 7830350
9704G830350k49577j69358k29245J3723j15280l22167n05870l57357l0214J73547
$$ 7830350 7580773 7411415 7182170 7195893 7080613 6758446 6252576 5895219 5865005 6038552
9694F038552P3999r8425k63527k18944m7677R0444q0243n00238L2139l8292k34516
$$ 6038552 6112551 6014126 5750599 5531655 5483978 5574422 5494179 4993941 5026080 4987788 4753272
9683D753272J60379J9401j61795j9815j91738k79263j42277j10150q1953k14732
$$ 4753272 4913651 4933052 4771257 4751442 4559704 4280441 4138164 4028014 3946061 3731329
9673C731329m7806p815p643j5288p7868q1200j79808j67820J6000j91454j05125
$$ 3731329 3683523 3675708 3668065 3652777 3574909 3493709 3313901 3146081 3162081 2970627 2865502
9662B865502J07580P6305J7454J3505k80649j72350o4186O8138l1421J839K16739
$$ 2865502 2973082 3049387 3066841 3080346 2799697 2627347 2563161 2631299 2599878 2601717 2818456
9651B818456J90782j96770j0455L47892N2202j92826q4606J56668k18501l25132
$$ 2818456 3009238 2812468 2802013 3149905 3202107 3009281 2924675 3081343 2862842 2537710
9641B537710j42596k13552j82474P4536Q1670j28799J21392K09719R815k25640
$$ 2537710 2395114 2181562 1999088 2073624 2155294 2026495 2147887 2357606 2367421 2141781
9631B141781p5085n3534j31733J7840R0189K4851j42673Q9198K41505K31498r454
$$ 2141781 2066696 2013162 1881429 1899269 1989458 2014309 1871636 1960834 2202339 2433837 2424383
9620B424383j50166J3654M8107k28153j13821O6595j98363N9598r2477k83537
$$ 2424383 2274217 2287871 2335978 2107825 1994004 2060599 1862236 1921834 1829357 1545820
9610A545820k58648j37822J54267K57132P1187n8369R3427J19099J65783j76130
$$ 1545820 1287172 1149350 1303617 1560749 1631936 1573567 1666994 1786093 1951876 1775746
9600A775746k36190j02081O3848n4884k29330l22457K53114K31960P1836k45995
$$ 1775746 1539556 1437475 1501323 1446439 1217109 894652 1147766 1379726 1451562 1205567
9590A205567n4151k3545J48059p2734n3595p3268j98069J16738P7662Q8963r3486
$$ 1205567 1151416 1127871 1275930 1203196 1149601 1076333 878264 995002 1072664 1161627 1068141
9579A068141p9009j49926j15271r2829k6603P6182p3164K1865K33224l5319j14456
$$ 1068141 989132 839206 723935 631106 604503 680685 607521 629386 862610 827291 712835
9568G12835Q9758j06563J41539K18156j32906n3748Q9565j14510j24720J14389
$$ 712835 802593 696030 837569 1055725 922819 869071 958636 844126 719406 833795
9558H33795n5941j45105K89853J760k09254k1458J85258o4595q5179R4740J25874
$$ 833795 777854 632749 922602 924362 715108 693650 878908 814313 729134 823874 949748
9547I49748J48004q9058j46946J45201N4480j55867k33081k44945R0506K09770
$$ 949748 1097752 1008694 861748 1006949 1061429 905562 672481 427536 518042 727812
9537G27812K81446R4157m855o7784j87529J12894n8584k60787J14777J97287J65404
$$ 727812 1009258 1103415 1098560 1030776 843247 956141 897557 636770 751547 948834 1114238
9526A114238j27931r0249k05377K8221o2271m0132r9778P6191J37084M4342j66941
$$ 1114238 986307 896058 690681 718902 656631 616499 516721 592912 729996 774338 607397
9515F07397O554K821k00881r4553J77199R585m0000K42186N7375k42374o387P3175
$$ 607397 613951 616772 415891 321338 498537 508122 468122 710308 767683 525309 518922 592097
9503E92097N0573N2954N8432j65020r7794K1234L1668o7767P7271j5506r774R817
$$ 592097 642670 695624 754056 589036 491242 512476 544144 476377 553648 538142 528368 538185
9491E38185K20800J3711J3371j90542J93379J44385j18295k92747R8427K03751
$$ 538185 758985 772696 786067 595525 788904 933289 814994 522247 620674 824425
9481H24425J7470j03253j40101j75553J94874K56707l53247J47690N23945M64058
$$ 824425 841895 738642 598541 422988 617862 874569 521322 669012 1192957 1657015
9471A657015m733n38614q3375j70357k20214J93272J39929q6857n014p357J22962
$$ 1657015 1652282 1113668 1030293 859936 639722 832994 972923 886066 881052 873695 996657
9460I96657L39418M94949N47664k3420m36131l50850k83637l87807J47359L22027
$$ 996657 1336075 1831024 2378688 2355268 1919137 1568287 1284650 896843 1044202 1366229
9450A366229J81727j9072J0086J48468N24317N72310K53078K8552m66996o01295
$$ 1366229 1547956 1528884 1538970 1687438 2211755 2784065 3037143 3065695 2598699 1997404
9440A997404j50227j58847k06268k24526k67592K55993j39715n4733K56490O68394
$$ 1997404 1847177 1688330 1482062 1257536 989944 1245937 1106222 1051489 1307979 1976373
9430A976373N59269K8151k89774m03537m17563m46799j49412j76244k31730L09589
$$ 1976373 2535642 2563793 2274019 1870482 1452919 1006120 856708 680464 448734 758323
9420G58323K05189p7448J74615R6502K46985J69151k24959l42298j61419J7692
$$ 758323 963512 886064 1060679 1157181 1404166 1573317 1348358 1006060 844641 862333
9410H62333j2026k05524j04519K36674L0122j32655j94430N3376j97963J44441
$$ 862333 850307 644783 540264 776938 807060 674405 479975 533351 335388 479829
9400D79829K32214l0473j13104m6422O9693j20234j22305j26290l64097J57167
$$ 479829 712043 681570 568466 522044 591737 471503 349198 222908 -141189 15978
9390A5978M18156M5002n0040J35488l9163K44869J34702p1018m8603m92485j92405
$$ 15978 434134 479136 429096 564584 525421 770290 904992 833974 785371 292886 100481
9379A00481M91130Q1165o6465J08891k041j17046k40325j23662O5562k17225k9587
$$ 100481 591611 672776 606311 715202 713161 596115 355790 232128 297690 80465 50878
9368E0878J48328K39361K7865j00554J4749p6123n1007R1029r0686j53385m3622
$$ 50878 199206 438567 466432 365878 380627 304504 253497 344526 253840 100455 56833
9357E6833J70574o3469N3469Q5038R8354J81523J94501j48315l8344q1399k26191
$$ 56833 227407 163938 217407 302445 400799 582322 776823 628508 590164 508765 282574
9346B82574j59345l34560m2267L5902J27809J62996K94428M7713j55262j39864
$$ 282574 123229 -211331 -253598 -217696 -89887 73109 367537 415250 259988 120124
9336A20124J21746K12497L927q7746j29451q6332o6927J02136r5908J7822K84541
$$ 120124 241870 454367 458294 370548 241097 154765 87838 189974 94066 111888 396429
9325C96429k2857l799j85841k30813j41199K34425K63354L52534l44250j18183
$$ 396429 373572 369773 183932 -46881 -188080 46345 309699 662233 317983 199800
9315A99800k4476M345j02184P3635j16813K41420Q4373R6860q8535k14727J15104
$$ 199800 175324 179669 77485 151120 34307 275727 360100 456960 368425 153698 268802
9304B68802N4743p117K57931p2370K6186l17293j74662L0746J54841L4737j47814
$$ 268802 323545 316428 574359 501989 528175 210882 36220 66966 221807 256544 108730
9293A08730j74821J29838O2714N8059N0181L0589Q7362O868j35117m2955j84843
$$ 108730 -66091 63747 126461 184520 234701 265290 352652 359520 224403 181448 -3395
9282c395J07508J48055J3388O450J5818K6093K13319J99911l11642q4747p7135
$$ -3395 104113 252168 265556 272006 287824 313917 527236 727147 415505 330758 253623
9271B53623j35553j05208l20030K08372Q0984K03580J51439J16463N3473j32611
$$ 253623 118070 12862 -307168 -98796 -17812 185768 337207 453670 507143 374532
9261C74532m6612j060j01883P6251r7022l25743L6151K99477j5689J13644k2628
$$ 374532 327920 326860 224977 301228 204206 -121537 -85386 214091 198402 312046 289418
9250B89418k43856o685J84668J47103L4396k17384j81750R818J10154J47441q5501
$$ 289418 45562 38877 223545 370648 405044 187660 5910 15728 125882 273323 187822
9239A87822J67222j12555j24820P2014q6767k22534L9384L44742Q8170n1476l53168
$$ 187822 355044 242489 117669 189683 102916 -119618 -80234 264508 352678 301202 -51966
9228e1966J35627L81609p9240j94311l0067k19879m589q2912K6820M4648J44561
$$ -51966 83661 465270 386030 191719 161652 -58227 -62816 -145728 -118908 -74260 70301
9217G0301Q2314j08141k8041p6180J2416K16151n5224k59191k1359J57371J39362
$$ 70301 152615 44474 16433 -59747 -47331 168820 113596 -145595 -166954 -9583 129779
9206A29779j11227m7999M9477L33034j15229l2894n9970p9560l6917m1349n1542
$$ 129779 18552 -29447 20030 353064 237835 204941 144971 65411 28494 -12855 -64397
9195f4397j4116j82380Q9732P6354j15015J54410L0493J91459J49134J73283j09247
$$ -64397 -78513 -260893 -171161 -94807 -209822 -55412 -24919 166540 315674 488957 379710
9184C79710M820j08598k55369k1606P9900J89354m6663k57694k25414q5047J03641
$$ 379710 384530 275932 20563 -1043 78857 268211 221548 -36146 -261560 -346607 -242966
9173b42966J22576j43117K82151J56475J78968J56913j66316o3603k33560r8279
$$ -242966 -120390 -263507 18644 175119 354087 511000 344684 281081 47521 -50758
9163e0758k012J33477K36360K10204l24727k46747l1570K17804O2899j41389j7352
$$ -50758 -52770 80707 317067 527271 202544 -44203 -75773 142031 204930 63541 46189
9152D6189j22233j15480K49914N4217J54771m0910M6020J81326J31256j16694
$$ 46189 -76044 -191524 58390 112607 267378 226468 272488 453814 585070 468376
9142D68376o1577M3062j06574m1134J4302P2897j00641k26101q5213K40394q8192
$$ 468376 406799 449861 343287 302153 316455 389352 288711 62610 -22603 217791 129599
9131A29599M1249j48294n9197n8135J85920M0421k15488O1645j8471j59131J08317
$$ 129599 170848 22554 -36643 -94778 91142 131563 -83925 -22280 -40751 -199882 -91565
9120i1565L3637J82970j64001k37840K45755K0523j65082K14852Q2132l5496j05079
$$ -91565 -57928 125042 -38959 -276799 -31044 -10521 -175603 39249 121381 85885 -19194
9109a9194k13546p5727J81719K13222J16510J19305k11016L6081J77228J59370
$$ -19194 -232740 -308467 -126748 86474 202984 322289 111273 147354 324582 483952
9099D83952K5816m8892p7391j22523Q3829j45470j88393P2047J06094R1086j41991
$$ 483952 509768 460876 383485 260962 344791 199321 10928 82975 189069 280155 138164
9088A38164l2362P2383Q6003K3823L2735M7753L6560j81633r129n8526j00442
$$ 138164 105802 178185 264188 288011 320746 368499 405059 223426 214297 155771 55329
9077E5329Q8247Q0816j68098r7251Q4901M3195o7626N4235L7704R9157K35026
$$ 55329 143576 224392 56294 -40957 43944 87139 19513 73748 111452 210609 445635
9066D45635K6814j25758k2779P1893n7097O2195r5438j10367j7439J8287Q3755
$$ 445635 472449 346691 323912 395805 338708 400903 305465 195098 177659 195946 279701
9055B79701j33425O93M6892n4775O6192n7569J29515q434j73176k07919J33623
$$ 279701 146276 146969 193861 139086 205278 147709 277224 268790 95614 -112305 21318
9044B1318K3682J06422J28730M4475M0115j51637k17116n3378K7578j2999J22960
$$ 21318 45000 151422 280152 324627 364742 213105 -4011 -57389 -29811 -42810 80150
9033H0150M6183J18857n4918J76743k58173J36854k13598j02799m510K23642J30863
$$ 80150 126333 245190 190272 367015 108842 245696 32098 -70701 -75211 148431 279294
9022B79294j30071j97635j39139J30416k05087q8270K91494K43969Q9656J65381
$$ 279294 149223 -48412 -187551 -57135 -262222 -350492 -58998 184971 274627 440008
9012D40008j80760k2427m4446j62826J5572r8803Q8257J9632J8331r0390M7733
$$ 440008 259248 236821 192375 29549 45121 -53682 34575 54207 72538 -17852 29881
9001B9881O8291N1963n2208j00298J51037j55107j33887J31328J70395j01486
$$ 29881 98172 150135 97927 -2371 148666 -6441 -140328 -9000 161395 59909
8991E9909j99540J01181O2880l3754j01618n8235p595J18520J26222l9219K9768
$$ 59909 -139631 -38450 24430 -9324 -110942 -169177 -176772 -58252 67970 28751 58519
8980E8519J25332P4173j00627j9265j0225R3471J11769P9057O491L0674l7434
$$ 58519 183851 258024 157397 138132 127907 221378 333147 412204 418695 449369 411935
8969D11935j64842p9221J46499n7414j25799J42097l4890M2533j21986l1837q146
$$ 411935 247093 167872 314371 256957 131158 273255 238365 280898 158912 127075 118929
8958A18929J85481M2450N064l01698k25103J66313K32333P4961k77997k14157
$$ 118929 304410 346860 351924 50226 -174877 -8564 223769 298730 20733 -193424
8948a93424J57711K10627J54448L2678k14156k56127J40542M0056r1603J25383
$$ -193424 -35713 174914 329362 362040 147884 -108243 32299 72355 -19248 106135
8938A06135K43821k43485j65195k55399O6298J75315J7575j22668J96114q2775
$$ 106135 349956 106471 -58724 -314123 -247825 -72510 -54935 -177603 18511 -64264
8928f4264J17858o6517k86373L7018Q2667J9628J72736L14970r4017k30172l6881
$$ -64264 53594 -12923 -299296 -262278 -179611 -159983 12753 327723 233706 3534 -33347
8917c3347k15003Q1859k6305K44230M7308j35244R4805j4255Q3206j45265j22007
$$ -33347 -248350 -166491 -192796 51434 98742 -36502 58303 44048 127254 -18011 -140018
8906a40018J27004R2975K26898N576k69580l49077J01742K4612o9475J03409M7935
$$ -140018 -13014 79961 306859 312435 42855 -306222 -204480 -179868 -249343 -145934 -97999
8895i7999K88148o413j09902R6703j01988k24663k7052o8021J21800J27903j10504
$$ -97999 190149 183736 73834 170537 68549 -156114 -183166 -251187 -129387 -1484 -111988
8884a11988J02715N4535J12414j4528l8293M5214j61400R3956K28643p1157j72591
$$ -111988 -9273 45262 157676 143148 104855 150069 -11331 82625 311268 240111 67520
8873F7520Q14L2266j24048l6231J12600k98595J32764J60689N1530J75507r9176
$$ 67520 68334 100600 -23448 -59679 52921 -245674 -112910 47779 99309 274816 175640
8862A75640j75962n1315J81169K95041q2236l05690M74p1162j8455K02305n7494
$$ 175640 -322 -51637 129532 424573 342337 36647 37121 -34041 -52496 149809 92315
8851I2315M1010K40780K19916Q4139k1741J03990o8477l45709k18374j7490o0317
$$ 92315 133325 374105 594021 678160 656419 760409 691932 346223 127849 110359 50042
8840E0042j0841M0808m9342q6025M6156L09295k45160j79752j36024j86620L39338
$$ 50042 39201 80009 30667 -55358 -9202 300093 54933 -124819 -260843 -447463 -108125
8829a08125K30203K78909J51472j01841j63339q2324l1402J75953j11802l08329
$$ -108125 122078 400987 552459 450618 287279 204955 173553 349506 237704 -70625
8819g0625n0900j0347n7130K7030N831K82100o4134q2232j65311n6420K70584
$$ -70625 -121525 -131872 -189002 -161972 -156141 125959 61825 -20407 -185718 -242138 28446
8808B8446K59168M0555j08736J1588K13048N1974j61022k80374L1865q3827O1661
$$ 28446 287614 328169 219433 231021 444069 496043 335021 54647 86512 2685 64346
8797F4346J47227J0703J39672j23267Q9042q8979k09386m0514L7513J02717l7511
$$ 64346 211573 222276 361948 238681 327723 238744 29358 -11156 26357 129074 91563
8786I1563q8496r8595J4417j07877R3481J3759K2018L3975m1917p6989N5248m9410
$$ 91563 3067 -95528 -81111 -188988 -95507 -81748 -59730 -25755 -67672 -144661 -89413 -138823
8774a38823q4643K06909L14751J80817J18031Q0636j27702k41929R6772M4809
$$ -138823 -223466 -16557 298194 479011 597042 677678 549976 308047 404819 449628
8764D49628J36851k36813m79369N7646K2654L54915J13258m38396p5865m0551
$$ 449628 586479 349666 -129703 -72057 -49403 305512 418770 -19626 -95491 -136042
8754a36042Q6125J17601k92043J51343J02743J9887M1496O4496j04305K67461
$$ -136042 -49917 67684 -224359 -73016 29727 49614 91110 155606 51301 318762
8744C18762k0917j61165J24668k01719j73498K30748Q1103j13446R1094j29202
$$ 318762 297845 136680 261348 59629 -113869 116879 197982 84536 175630 46428
8734D6428p8266J25241P0980Q2854R7722j353J23126O0369m68115l32234N2872
$$ 46428 -31838 93403 164383 247237 344959 343606 466732 527101 58986 -273248 -220376
8723b20376J6784N0484j73129m323J12965Q4830J84379J59677k1608M7071J78558
$$ -220376 -203592 -153108 -326237 -330560 -217595 -132765 51614 211291 189683 236754 415312
8712D15312j50262j07099j43455j53561k9222k28380J26725K11158P9978k5469
$$ 415312 265050 157951 14496 -139065 -168287 -396667 -269942 -58784 21194 -4275
8702d275P5261L8603K33126j21666m65381j40091J86426l8206j8025P2727P9495
$$ -4275 70986 109589 342715 221049 -244332 -384423 -197997 -236203 -254228 -181501 -102006
8691a02006J26728J2660j03235k07082j67454K92843K69642Q9073J3498j19193
$$ -102006 24722 37382 -65853 -272935 -440389 -147546 122096 211169 224667 105474
8681A05474q8422n1830K56280N7428p6311m2527J92328k63007j01124j2253J00926
$$ 105474 17052 -34778 221502 278930 202619 160092 352420 89413 -11711 -23964 76962
8670G6962O9526m143p2855j61523J05020K54656N7484M6088j92697k50422k84324
$$ 76962 146488 142345 69490 -92033 12987 267643 325127 371215 178518 -71904 -356228
8659c56228J75641L72558K04390j27519k21364j82763k31376J71362J80254l48185
$$ -356228 -180587 191971 396361 268842 47478 -135285 -366661 -195299 -15045 -363230
8649c63230N9535K89687K48568J29554J50324R93k30246l61501l28954L3240J1368
$$ -363230 -303695 -14008 234560 364114 514438 515431 285185 -76316 -405270 -372030 -360662
8638c60662Q6559O2262J80643K7325k76074j33278M07188J29953k45260j10652
$$ -360662 -274103 -211841 -31198 -3873 -279947 -413225 -6037 123916 -121344 -231996
8628b31996O3247k816R9645j9965p7303J49022J54810Q5168j31881q793K24677
$$ -231996 -168749 -171565 -71920 -91885 -169188 -20166 134644 219812 87931 79138 303815
8617C03815j80393k90553q018K61995K5639J28192m8303j48096J5270n6365p6591
$$ 303815 123422 -167131 -175149 86846 112485 240677 192374 44278 59548 3183 -73408
8606g3408Q385j00207k48236j58325J3854l6077J42385J59979J52152J66877R4139
$$ -73408 -65023 -165230 -413466 -571791 -557937 -594014 -451629 -291650 -139498 27379 121518
8595A21518K2521r449j19243p0505j2057K81372M03532o3428l9813o4556j46747
$$ 121518 144039 134590 15347 -55158 -67215 214157 617689 554261 514448 449892 303145
8584C03145j78138L2485K9398K61785j07476k13855q0415q7710N5011n2356q7583
$$ 303145 125007 157492 186890 448675 341199 127344 46929 -40781 14230 -38126 -125709
8573a25709J25159K06358r1293k12577J68407J7077j98425K1762j44108M5601
$$ -125709 -550 205808 114515 -98062 70345 87422 -111003 -89241 -233349 -187748
8563a87748n4389M4656j1337J26088K37272K66652O3818l67561r1715J37744k37970
$$ -187748 -242137 -197481 -208818 -82730 154542 421194 485012 117451 25736 163480 -74490
8552g4490k04868k9353L5238l6382o0660K37843J97746k05600l36563K67487M30873
$$ -74490 -279358 -308711 -273473 -309855 -370515 -132672 65074 -140526 -477089 -209602 221271
8541B21271n3892k23164L427L2939M3638q6897k5401N4652K02752K06380J26765
$$ 221271 167379 -55785 -52358 -19419 24219 -62678 -88079 -33427 169325 375705 502470
8530E02470K99927k08542j79934k40522M2969o3039o1642j66096l05369R8773
$$ 502470 802397 593855 413921 173399 216368 153329 91687 -74409 -379778 -281005
8520b81005J57785J35115q1257j07694K39765K16764p1220o7512m783J00737p4897
$$ -281005 -123220 11895 -69362 -177056 62709 279473 208253 140741 135958 236695 161798
8509A61798n0801Q8318J28588r9936J14808k1401j83595o2208J4867J8968n8287
$$ 161798 110997 199315 327903 227967 342775 321374 137779 75571 90438 109406 51119
8498E1119j23731j26279J2149R4331J05832J45935P6341p97j2119l5649J15321
$$ 51119 -72612 -198891 -186742 -92411 13421 159356 235697 234900 222781 187132 302453
8487C02453r3679k61144j26679q7957r0374j28676K1287M16117K2594N301J7805
$$ 302453 208774 -52370 -179049 -267006 -357380 -486056 -464769 -48652 -26058 -20757 -2952
8476b952J76565K16913J06934j76232j16555j23192k20758p6516J9134J97710
$$ -2952 173613 390526 497460 321228 204673 81481 -139277 -215793 -196659 1051
8466A051m0111j00679M5046l0267j00495J54716K24819l38982j98439J15560J50792
$$ 1051 -39060 -139739 -94693 -124960 -225455 -70739 154080 -184902 -383341 -267781 -116989
8455a16989o4333P1750q1074p7409K19976M6266L0579J54034J78932j14662j92831
$$ -116989 -181322 -109572 -190646 -268055 -48079 -1813 28766 182800 361732 247070 54239
8444E4239k05301l7082J80915Q6372l40k18148k87380K03415J95485R6528j4079
$$ 54239 -151062 -188144 -7229 79143 78803 -139345 -426725 -223310 -27825 68703 54624
8433E4624J78950j70616K8132P606j13149J4001j51252k55597j03159J68958K78245
$$ 54624 233574 62958 91090 98696 -14453 -452 -151704 -407301 -510460 -341502 -63257
8422f3257R1220J90630r307j39476l1034m2719J61953l630k45139k99271L25743
$$ -63257 27963 218593 209286 69810 38776 -3943 158010 154380 -90759 -390030 -64287
8411f4287L15727n5880k31093P6302L52927J51527J09282j37509j77136R5498
$$ -64287 251440 195560 -35533 40769 393696 545223 654505 516996 339860 435358
8401D35358j95261l56193k94981J4820J94129J25535J0801N0625k6180n0817n7926
$$ 435358 240097 -116096 -411077 -396257 -202128 -76593 -65792 -15167 -41347 -92164 -150090
8390a50090J42505J22394p8660J75474K17633k19930l12416j04908k7194O1774
$$ -150090 -7585 114809 36149 211623 429256 209326 -103090 -207998 -235192 -173418
8380a73418j19895M1693K93395k62557l14308n9469P3333J54086K34094J05964
$$ -173418 -293313 -251620 41775 -220782 -535090 -594559 -521226 -367140 -133046 -27082
8370b7082P9717P3335P0089j85318j26403L2799k73997j31789n3983K9758K3521
$$ -27082 52635 125970 196059 10741 -115662 -82863 -356860 -488649 -542632 -512874 -489353
8359d89353K26458N8213M6996m6649q4352L14231K43293M4254j37745k70366r3859
$$ -489353 -262895 -204682 -157686 -204335 -288687 25544 268837 313091 175346 -95020 -188879
8348a88879P5627P5305Q440j41793J26710K04954K40804L810k30017j5360N3178
$$ -188879 -113252 -37947 -29507 -171300 -44590 160364 401168 404978 174961 159601 212779
8337B12779j54408k35257J61123N7973n7938P9087J30308m0685j31533J1406r3513
$$ 212779 58371 -176886 -15763 42210 -15728 63359 193667 152982 21449 32855 -60658
8326f0658l9370J00588J68068L970L2103r1197l16894n4876k7345L8564j71674
$$ -60658 -100028 560 168628 172598 204701 113504 -203390 -258266 -285611 -247047 -418721
8315d18721O5618N7827P2761N5970m0276K31214L42818J1027j97909j50191n7550
$$ -418721 -353103 -295276 -222515 -166545 -206821 24393 367211 378238 180329 30138 -27412
8304b7412K35052O2641l9225j73338j34309O0656J74921m464K06951j83701k40184
$$ -27412 207640 270281 231056 57718 -76591 -15935 158986 154522 361473 177772 -62412
8293f2412N5902p3599j57764q5034R4436k1111J28318J96807j3786J03801k03011
$$ -62412 -6510 -80109 -237873 -322907 -228471 -249582 -121264 75543 61757 165558 -37453
8282c7453k15951K45344N5134N8652m474m6299j0215k66172k69320n9399L96219
$$ -37453 -253404 -8060 47074 105726 101252 54953 44738 -221434 -490754 -550153 -153934
8271a53934o7065j93570q1780J93187K7375K9460K19137N7348l33295l3154R6992
$$ -153934 -220999 -414569 -496349 -303162 -275787 -246327 -27190 30158 -303137 -336291 -239299
8260b39299J74704J96631P4141k13525j72179j49497O9279K9302k05184p9567
$$ -239299 -64595 132036 206177 -7348 -179527 -329024 -259745 -230443 -435627 -515194
8250e15194j03800J29670N5015J70583J97661q9579k17414j38434J89797J10918
$$ -515194 -618994 -489324 -434309 -263726 -66065 -155644 -373058 -511492 -321695 -210777
8240b10777r059K17822Q7779j35061k59128j35335J11549M64658J69869N0321
$$ -210777 -219836 -2014 85765 -49296 -308424 -443759 -332210 132448 302317 352638
8230C52638L3702n4897k68080k51179J72390j7454L5994R8706k5239o249k17432
$$ 352638 386340 331443 63363 -187816 -15426 -32880 3114 101820 76581 70332 -147100
8219a47100P9565K51477J18010j35788k51131q8951K59653j5187j51330J12702
$$ -147100 -67535 183942 301952 166164 -84967 -173918 85735 70548 -80782 31920
8209C1920m380j25075j57748j52981j31516K20390J68420O6997J21614q2169k467
$$ 31920 27540 -97535 -255283 -408264 -539780 -319390 -150970 -83973 37641 -44528 -46995
8198d6995O798L383J35281J21808K0011j42500j17139k3840n0652Q6165J62671
$$ -46995 -40197 -36814 98467 220275 240286 97786 -19353 -43193 -93845 -7680 154991
8187A54991N185P9077J91891j72580O5106K47979j73358l35225j40944k49618
$$ 154991 160176 239253 431144 258564 323670 571649 398291 63066 -77878 -327496
8177c27496k39687K49075K13653Q8616J59954p0751l56817j84369K33624R3502
$$ -327496 -567183 -318108 -104455 -15839 144115 73364 -283453 -467822 -234198 -140696
8167a40696q2029K18837k6533j53163J98541J36883O2874j1751j24806K21559
$$ -140696 -222725 -3888 -30421 -183584 14957 151840 214714 202963 78157 299716
8157B99716p3967j36466o4624j334J70918O9437k67981j31025k126L18468J40984
$$ 299716 225749 89283 24659 23325 194243 263680 -4301 -135326 -137452 181016 322000
8146C22000j84063J6938P9397j33605j22399j88628J02176l6347L6951J56871
$$ 322000 137937 154875 234272 100667 -21732 -210360 -108184 -144531 -107580 49291
8136D9291l088Q8027J75842K71502J1940j36278o2373k18685P1095J13924j56009
$$ 49291 46203 134230 310072 581574 593514 457236 394863 176178 247273 361197 205188
8125B05188j76912j75012R5444o6027j39517J11537L0910K05376J11578L5741
$$ 205188 28276 -146736 -51292 -117319 -256836 -145299 -114389 90987 202565 238306
8115B38306j67340j1157O5636j04825k00970N7108J47017J15443J9246J05048
$$ 238306 70966 59809 125445 20620 -180350 -123242 23775 139218 158464 263512
8105B63512j7585n3154j23852j07965M6165o532K72297l4809m6973J18129j87295
$$ 263512 245927 192773 68921 -39044 7121 589 272886 238077 191104 309233 121938
8094A21938l95693l2877K04733K52614j21163k6682l2913j44243J48615R3099
$$ 121938 -273755 -306632 -101899 150715 29552 2870 -30043 -174286 -25671 67428
8084F7428j54727L9618K55871K00959n5575j68654K923J27571o2244k17532r0429
$$ 67428 -87299 -47681 208190 409149 353574 184920 187843 315414 253170 35638 -54791
8073e4791L66749J22525n9759r4835O1500j44366J22479J73074m828k71574k01377
$$ -54791 311958 434483 374724 279889 341389 197023 319502 492576 487748 216174 14797
8062A4797J07782J36684j64197j07681J32429J148l9318O1052K4681j24400L6087
$$ 14797 122579 259263 95066 -12615 119814 120962 81644 142696 167377 42977 79064
8051G9064K86470K06626l20336k07131R7831M0676n0895j74461K55573j83583
$$ 79064 365534 572160 251824 44693 142524 183200 132305 -42156 213417 29834
8041B9834k71736R1886K24487j74088j19701J31371q3350k09013N0973L56669
$$ 29834 -241902 -150016 74471 -99617 -219318 -87947 -171297 -380310 -329337 27332
8031B7332L51099k0558j71449j74625n7791n233M7997R6690P0674J32819k6295
$$ 27332 378431 357873 186424 11799 -45992 -51225 -3228 93462 164136 296955 270660
8020B70660j87341J1178K67669p8579m3785J90234r0237m9559j55932j46723p5804
$$ 270660 83319 94497 362166 283587 239802 430036 339799 290240 134308 -12415 -88219
8009h8219k70107K74633J49117l7413M6704j45954l32739P6747O7069Q1979J60614
$$ -88219 -358326 -83693 65424 28011 74715 -71239 -403978 -327231 -260162 -178183 -17569
7998a7569k50043k13710Q1672J34565o2287j48258J03083L09420j46484J62885
$$ -17569 -267612 -481322 -399650 -265085 -327372 -475630 -372547 -63127 -209611 -46726
7988d6726j00811m8011K12295o901l5208k50795j24962j0640J53941k4123K10389
$$ -46726 -147537 -195548 16747 9846 -25362 -276157 -401119 -411759 -257818 -281941 -71552
7977g1552M1050q627J47737Q8591l9586j45049n903J13121J62856Q8744j26478
$$ -71552 -30502 -39129 108608 197199 157613 12564 6661 119782 282638 371382 244904
7966B44904k63716J6937K7824M0475p5638P6138P9503J22882q0449l60761j95210
$$ 244904 -18812 -1875 25949 66424 -9214 66924 146427 269309 188860 -171901 -367111
7955c67111Q0475O4366J24845K41691K48490o2977k80362J1089j26303O6033J25579
$$ -367111 -286636 -222270 -97425 144266 392756 329779 49417 60506 -65797 236 125815
7944A25815K7943J5953o2640o5008J19077M1017L8138J9592L4945j64967j93347
$$ 125815 153758 169711 107071 42063 161140 202157 240295 259887 294832 129865 -63482
7933f3482J09119m334j03556J02492q0451k43080O3538L84025J24337j97929L3738
$$ -63482 45637 41303 -62253 40239 -40212 -283292 -219754 164271 288608 90679 124417
7922A24417Q4378R7396m8654p6168j82478j23605j18668Q6715J91293j29706o5888
$$ 124417 208795 306191 257537 181369 -1109 -124714 -243382 -156667 34626 -95080 -160968
7911a60968J55174L9386K2726j00977j90221K508K55492n9851k90495J1029R4507
$$ -160968 -5794 33592 56318 -44659 -234880 -232372 23120 -36731 -327226 -316197 -221690
7900b21690R9366J54325j6491q7423j41101m4449J65005N3048k11798J45979J42471
$$ -221690 -122324 32001 15510 -71913 -213014 -257463 -92458 -39410 -251208 -105229 37242
7889C7242o5149J51375j85336j14244j11640J32078Q8664L2885o626J64060J28491
$$ 37242 -27907 123468 -61868 -176112 -287752 -155674 -67010 -34125 -40751 123309 251800
7878B51800l3579J68621j33100k24780J82682N3710l21359J01995L719J34778
$$ 251800 218221 386842 253742 28962 211644 265354 -56005 45990 49709 184487
7868A84487p6339J73232J93537j54166j64855q3158j1331J10061K03181q257j84515
$$ 184487 108148 281380 474917 320751 155896 72738 61407 171468 374649 366392 181877
7857A81877p392R8112J09828o898p9187j36338j7037j51184M8384J71154O2847
$$ 181877 174485 272597 382425 375527 296340 160002 142965 -8219 40165 211319 274166
7846B74166l00118k31224J67848J24473j05132J46087P8973J18370J21480k68896
$$ 274166 -25952 -257176 -89328 35145 -69987 76100 155073 273443 394923 126027
7836A26027o4671K41443K58367l9065k50890k23526o6052k0343R762O264Q7266
$$ 126027 61356 302799 561166 522101 271211 47685 -18367 -38710 -28948 -22684 64582
7825F4582m2330N389j49137j81651J54666L50385R8976j98353p9393P1727Q302
$$ 64582 22252 27641 -121496 -303147 -148481 201904 300880 102527 23134 94861 103163
7814A03163K38985j28848k54658P2216J8126K05443m9687k32211K5409L8313k91425
$$ 103163 342148 213300 -41358 30858 48984 254427 204740 -27471 -2062 36251 -255174
7803b55174j58712J9981k43616j18259M40852L71646o1941N5767J66745R5595
$$ -255174 -413886 -393905 -637521 -755780 -314928 56718 -5223 50544 217289 312884
7793C12884j36240j17258N4054P6912j49234j77153L2566J55194J4445J01226
$$ 312884 176644 59386 113440 190352 41118 -136035 -103469 51725 66170 167396
7783A67396q9263j73616k50616J6549Q4775J92449K10464q7696R436J71495j49869
$$ 167396 78133 -95483 -346099 -329550 -244775 -52326 158138 70442 79878 251373 101504
7772A01504j64055j06020M3337N0376j8227K00912P7140k6708N2157N4643K43800
$$ 101504 -62551 -168571 -125234 -74858 -93085 107827 184967 158259 210416 265059 508859
7761E08859J36138j35890o1852k86009l58384k6567o5095j41001P9651J17967
$$ 508859 644997 509107 447255 161246 -197138 -223705 -288800 -429801 -350150 -232183
7751b32183J1820p3738p521m1404J60671K77993o7907k50863K5330K34205m5952
$$ -232183 -220363 -294101 -301622 -343026 -182355 95638 27731 -223132 -197802 36403 -9549
7740i549j36112j39928n9566J63236O9421r3611m8708J44484O748K38749q7594
$$ -9549 -145661 -285589 -345155 -181919 -112498 -206109 -254817 -110333 -103585 135164 47570
7729D7570j13145m8956J06154J18498Q0080M4019p429k90296N2745j49703J977
$$ 47570 -65575 -114531 -8377 110121 190201 234220 226791 -63505 -10760 -160463 -158486
7718a58486o5112q7626J47141J06316M06959J27372j35817j04531J09807k34127
$$ -158486 -223598 -311224 -164083 -57767 349192 476564 340747 236216 346023 111896
7708A11896J42523J88215o0506k50426N06j96651k5291j2956k84920J12477J09009
$$ 111896 254419 442634 382128 131702 132208 -64443 -89734 -102690 -387610 -275133 -166124
7697a66124K73N3609k43044j11203L58454l2133k79120Q5768K07198o3685j5645
$$ -166124 -165851 -112242 -355286 -466489 -108035 -140168 -419288 -333520 -126322 -190007 -205652
7686b05652K4323l1725j53626j10831J63121L42879J38630k6748Q3903J73389
$$ -205652 -181329 -213054 -366680 -477511 -314390 28489 167119 140371 224274 397663
7676C97663r4125J27729l59812l51844N8503J47840K9578j10136L1787Q9553K92114
$$ 397663 303538 431267 71455 -280389 -221886 -74046 -44468 -154604 -122817 -33264 258850
7665B58850K10722J2405k65850l49785k82729j89599N9761K13296l322j64277
$$ 258850 469572 481977 216127 -133658 -416387 -605986 -546225 -332929 -336251 -500528
7655e00528Q1331N2933p9792n0434j55169n5945J05827J96990K10960K77204k27930
$$ -500528 -419197 -366264 -446056 -496490 -651659 -707604 -601777 -404787 -193827 83377 -144553
7644a44553k03727l0210K4787K8834k5802K70529J36967O0901J259j14409j58039
$$ -144553 -348280 -378490 -353703 -324869 -350671 -80142 56825 117726 118985 4576 -153463
7633a53463J25466k44206l610K22748K55241K5126k77392k32434j7240L09136
$$ -153463 -27997 -272203 -275813 -53065 202176 227302 -50090 -282524 -299764 9372
7623I372J28466J06718J05835l6575k62998j42689r4220o2154J08865P0564Q2458
$$ 9372 137838 244556 350391 313816 50818 -91871 -186091 -248245 -139380 -68816 13642
7612A3642P4699j12866j1735N2588j79387O9289Q8108q6165n3209l0077J57654
$$ 13642 88341 -24525 -36260 16328 -163059 -93770 -5662 -91827 -145036 -175113 -17459
7601a7459R5592J57423J51326j92222l06239m3875n4398J8264J63474P9888k59737
$$ -17459 78133 235556 386882 194660 -111579 -155454 -209852 -191588 -28114 51774 -207963
7590b07963J32459J03142p3266J24968J92628j30928j6137j5151M0831j31378
$$ -207963 -75504 27638 -45628 79340 271968 141040 124903 109752 150583 19205
7580A9205l56904K63289J94539k14759o1590K20383L56932K1638l77918j57808
$$ 19205 -337699 -74410 120129 -94630 -156220 64163 421095 442733 64815 -92993
7570i2993K1406O6427K2118P9004r552J3858J0790N1873j1710j52705l7861J01616
$$ -92993 -71587 -5160 16958 95962 86410 100268 111058 162931 151221 -1484 -39345 62271
7558F2271j57875K03299q5770k43484k1766M9693J15108o3083r1828J34417J82272
$$ 62271 -95604 107695 21925 -221559 -243325 -193632 -78524 -141607 -233435 -99018 83254
7547H3254p0320m0560k2134k06840J4114k25079n1740J14431K62413N6822j7105
$$ 83254 12934 -27626 -49760 -256600 -242486 -467565 -519305 -404874 -142461 -85639 -102744
7536a02744K3700j21807J36640L2831O228N8087Q8121K16892R9122j74964n9149
$$ -102744 -79044 -200851 -64211 -31380 -25152 32935 121056 337948 437070 262106 202957
7525B02957Q1367j45204Q381j42017j83397J55707N3126j33719J47322J33393
$$ 202957 284324 139120 147501 5484 -177913 -22206 30920 -102799 44523 177916
7515A77916j85378j93941K5175J26842J05674j22584l6774L28558j49122P8514
$$ 177916 -7462 -201403 -176228 -49386 56288 -66296 -103070 225488 76366 154880
7505A54880k48831k71888n5180R4120J05569R4487J48918j098J0188J51603k2223
$$ 154880 -93951 -365839 -421019 -326899 -221330 -126843 22075 20977 31165 182768 160545
7494A60545p2523m08706k83092M7494L34545K4096J08556J53847p8275j78797
$$ 160545 88022 -320684 -603776 -556282 -221737 -197641 -89085 64762 -13513 -192310
7484a92310j856o4384L1767K29308L0803P4435j17165L6245j36606j10964J40998
$$ -192310 -194166 -258550 -226783 2525 33328 107763 -9402 26843 -109763 -220727 -79729
7473g9729K01320k95301j23684L7843P5086n3943k48057J86336J09082p3299R9732
$$ -79729 121591 -173710 -297394 -259551 -184465 -238408 -486465 -300129 -191047 -264346 -164614
7462a64614N0908k03756L4891Q7062j8381N6847q3495O8263K07266N8806r3591
$$ -164614 -113706 -317462 -282571 -195509 -213890 -157043 -240538 -172275 34991 93797 206
7451B06j46820j54186K24196J13159J76776q0113k35606j64498j55381K16391
$$ 206 -146614 -300800 -76604 36555 213331 133218 -102388 -266886 -422267 -205876
7441b05876K16864k87984N3788J16258j83706j66085N7762J23529N0281K64829
$$ -205876 10988 -276996 -223208 -106950 -290656 -456741 -398979 -275450 -225169 39660
7431C9660J8052o6335k6669n1616j37005m09271O6240L98211K88273j63777j11358
$$ 39660 57712 -8623 -35292 -86908 -223913 -633184 -566944 -168733 119540 -44237 -155595
7420a55595L1571k14475k03102K602O04K33619L41583J40313r8245l5207k0398
$$ -155595 -124024 -338499 -541601 -538999 -538395 -304776 36807 177120 78875 43668 23270
7409B3270Q0710k4497N231L5212k0504P26l4766n3765j61469j3728J76522L15061
$$ 23270 103980 79483 84714 119926 99422 100148 65382 11617 -149852 -163580 12942 328003
7397C28003j21182l66066K502N6971j18758k0989J29789O8661j84069N0964J37864
$$ 328003 206821 -159245 -156743 -99772 -218530 -239519 -109730 -41069 -225138 -174174 -36310
$$ [...]
##END NTUPLES=NMR SPECTRUM
##END=
