##TITLE=Analysis number 321451
Compound Code cc 53404
Book Reference 472/193/6
Project Code adrs
Chemist Name victoriam
##JCAMPDX= 6.0         $$ Bruker NMR JCAMP-DX V2.0
##DATA TYPE= NMR SPECTRUM
##DATA CLASS= NTUPLES
##ORIGIN= Bruker BioSpin GmbH
##OWNER= nmr
$$ XWIN-NMR		Version 3.5
$$ Thu Aug 10 13:26:28 2006 GMT Daylight Time (UT+1h)  MAYBRIDGE\nmr@NMR_250MHZ
##.OBSERVE FREQUENCY= 250.131544655141
##.OBSERVE NUCLEUS= ^1H
##.ACQUISITION MODE= SIMULTANEOUS (DQD)
##.ACQUISITION SCHEME= undefined
##.AVERAGES= 16
##.DIGITISER RES= 18
##SPECTROMETER/DATA SYSTEM= dpx250
##.PULSE SEQUENCE= zg30
##.SOLVENT NAME= CDCl3
##.SHIFT REFERENCE= (INTERNAL, CDCl3, 0, 16.522)
##AUDIT TRAIL= $$ (NUMBER, WHEN, WHO, WHERE, WHAT)
$$ ##TITLE= Audit trail, XWIN-NMR		Version 3.5
$$ ##JCAMPDX= 5.01
$$ ##ORIGIN= Bruker BioSpin GmbH
$$ ##OWNER= nmr
$$ C:\u/data/dgb/nmr/ADRS/650/pdata/1/auditp.txt
$$ ##AUDIT TRAIL=  $$ (NUMBER, WHEN, WHO, WHERE, WHAT)
(   1,<2006-08-10 13:26:07.24 +100>,<MAYBRIDGE\nmr>,<NMR_250MHZ>,
      <created by zg, POWCHK disabled, PULCHK disabled
       configuration hash MD5:
       E2 DF 36 D8 04 B2 41 60 5A D7 A3 38 5A 4B D0 FE
       data hash MD5: 64K
       5F D1 42 0E D0 7E 92 D9 9E F9 D6 87 90 EC 24 7E>)
(   2,<2006-08-10 13:26:20.23 +100>,<MAYBRIDGE\nmr>,<NMR_250MHZ>,
      <Start of raw data processing
       ef LB = 0.3 FT_mod = 6 PKNL = 1 SI = 32K 
       data hash MD5: 32K
       29 92 03 FE 97 4E 41 B4 E4 77 D8 11 11 80 49 78>)
(   3,<2006-08-10 13:26:22.07 +100>,<MAYBRIDGE\nmr>,<NMR_250MHZ>,
      <apk 
       data hash MD5: 32K
       D9 22 4F 01 50 4E 03 05 72 B4 5E 7D EA 3D AB 17>)
(   4,<2006-08-10 13:26:22.85 +100>,<MAYBRIDGE\nmr>,<NMR_250MHZ>,
      <abs ABSG = 5 
       data hash MD5: 32K
       23 E5 4A F7 9F 5B 15 6F A9 3F 30 D4 06 C3 1B 6A>)
$$ ##END=
$$ 
$$ hash MD5
$$ AD 4D 07 86 C9 06 4A 5D D7 DD AD 80 CF 6D A9 4A
##$RELAX= 
##$RELAX= 
##$RELAX= 
##$RELAX= 
##$RELAX= 
##$RELAX= 
##$RELAX= 
$$ Bruker specific parameters
$$ --------------------------
##$DU= <C:\u>
##$EXPNO= 650
##$NAME= <ADRS>
##$PROCNO= 1
##$TYPE= <nmr>
##$USER= <dgb>
##$AMP= (0..31)
100 100 100 100 100 100 100 100 100 100 100 100 100 100 100 100 100 100 
100 100 100 100 100 100 100 100 100 100 100 100 100 100 
##$AQSEQ= 0
##$AQ_mod= 3
##$AUNM= <au_zg>
##$AUTOPOS= <30 >
##$BF1= 250.13
##$BF2= 250.13
##$BF3= 250.13
##$BF4= 250.13
##$BF5= 500.13
##$BF6= 500.13
##$BF7= 500.13
##$BF8= 500.13
##$BYTORDA= 1
##$CFDGTYP= 0
##$CFRGTYP= 5
##$CHEMSTR= <none>
##$CNST= (0..31)
1 1 145 1 1 1 1 1 1 1 1 1 1 1 1 1 1 1 1 1 1 1 1 1 1 1 1 1 1 1 1 1 
##$CPDPRG= <>
##$CPDPRG1= <>
##$CPDPRG2= <>
##$CPDPRG3= <>
##$CPDPRG4= <mlev>
##$CPDPRG5= <mlev>
##$CPDPRG6= <mlev>
##$CPDPRG7= <mlev>
##$CPDPRG8= <mlev>
##$CPDPRGB= <>
##$CPDPRGT= <>
##$D= (0..31)
0 1 0 0 0 0 0 0 0 0.06 0 0 0 0 0 0 0.0002 0 0 0 0 0 0 0 0 0 0 0 0 0 0 
0 
##$DATE= 1155212766
##$DBL= (0..7)
120 120 120 120 120 120 120 120 
##$DBP= (0..7)
150 150 150 150 150 150 150 150 
##$DBP07= 0
##$DBPNAM0= <>
##$DBPNAM1= <>
$$ [...]
##$SUBNAM7= <"">
##$SUBNAM8= <"">
##$SUBNAM9= <"">
##$SW= 20.6930455092707
##$SWIBOX= (0..15)
0 0 3 0 0 0 0 0 0 0 0 0 0 0 0 0 
##$SW_h= 5175.983436853
##$TD= 65536
##$TD0= 1
##$TE= 295.16
##$TE2= 300
##$TE3= 300
##$TEG= 300
##$TL= (0..7)
0 120 120 120 120 120 120 120 
##$TP= (0..7)
150 150 150 150 150 150 150 150 
##$TP07= 0
##$TPNAME0= <>
##$TPNAME1= <>
##$TPNAME2= <>
##$TPNAME3= <>
##$TPNAME4= <>
##$TPNAME5= <>
##$TPNAME6= <>
##$TPNAME7= <>
##$TPOAL= (0..7)
0.5 0.5 0.5 0.5 0.5 0.5 0.5 0.5 
##$TPOFFS= (0..7)
0 0 0 0 0 0 0 0 
##$TUNHIN= 0
##$TUNHOUT= 0
##$TUNXOUT= 0
##$USERA1= <user>
##$USERA2= <user>
##$USERA3= <user>
##$USERA4= <user>
##$USERA5= <user>
##$V9= 5
##$VALIST= <valist>
##$VCLIST= <CCCCCCCCCCCCCCC>
##$VD= 0
##$VDLIST= <DDDDDDDDDDDDDDD>
##$VPLIST= <PPPPPPPPPPPPPPP>
##$VTLIST= <TTTTTTTTTTTTTTT>
##$WBST= 1024
##$WBSW= 4
##$XGAIN= (0..3)
0 0 0 0 
##$XL= 0
##$YL= 0
##$YMAX_a= 344965
##$YMIN_a= -522730
##$ZGOPTNS= <>
##$ZL1= 120
##$ZL2= 120
##$ZL3= 120
##$ZL4= 120
##$ABSF1= 16.522
##$ABSF2= -4.171173
##$ABSG= 5
##$ABSL= 3
##$ALPHA= 0
##$AQORDER= 0
##$ASSFAC= 0
##$ASSFACI= 0
##$ASSFACX= 0
##$ASSWID= 0
##$AUNMP= <proc_1d>
##$AZFE= 0.1
##$AZFW= 0.1
##$BCFW= 0
##$BC_mod= 0
##$BYTORDP= 0
##$COROFFS= 0
##$CY= 12.5
##$DATMOD= 1
##$DC= 0
##$DFILT= <>
##$DTYPP= 0
##$F1P= 14.0000005364418
##$F2P= -0.99999901652339
##$FCOR= 0.5
##$FTSIZE= 32768
##$FT_mod= 6
##$GAMMA= 0
##$GB= 0
##$INTBC= 1
##$INTSCL= 1
##$ISEN= 128
##$LB= 0.3
##$LEV0= 0
##$LPBIN= 0
##$MAXI= 10000
##$MC2= 0
##$MEAN= 0
##$ME_mod= 0
##$MI= 0
##$NCOEF= 0
##$NC_proc= -5
##$NLEV= 6
##$NOISF1= 0
##$NOISF2= 0
##$NSP= 0
##$NTH_PI= 0
##$NZP= 0
##$OFFSET= 16.522
##$PC= 1
##$PHC0= 148.9532
##$PHC1= 14.83548
##$PH_mod= 1
##$PKNL= yes
##$PPARMOD= 0
##$PSCAL= 4
##$PSIGN= 0
##$REVERSE= no
##$SF= 250.13
##$SI= 32768
##$SIGF1= 0
##$SIGF2= 0
##$SINO= 400
##$SIOLD= 32768
##$SREGLST= <1H.CDCl3>
##$SSB= 0
##$STSI= 32768
##$STSR= 0
##$SW_p= 5175.98343685301
##$SYMM= 0
##$S_DEV= 0
##$TDeff= 65536
##$TDoff= 0
##$TI= <Analysis number 999999
Compound Code 99
Book Reference 9
Project Code 9>
##$TILT= no
##$TM1= 0
##$TM2= 0
##$TOPLEV= 0
##$USERP1= <user>
##$USERP2= <user>
##$USERP3= <user>
##$USERP4= <user>
##$USERP5= <user>
##$WDW= 1
##$XDIM= 32768
##$YMAX_p= 490484005
##$YMIN_p= -1032803
$$ End of Bruker specific parameters
$$ ---------------------------------
##NTUPLES= NMR SPECTRUM
##VAR_NAME=  FREQUENCY,     SPECTRUM/REAL,   SPECTRUM/IMAG
##SYMBOL=    X,             R,               I
##VAR_TYPE=  INDEPENDENT,   DEPENDENT,       DEPENDENT
##VAR_FORM=  AFFN,          ASDF,            ASDF
##VAR_DIM=   32768,         32768,           32768
##UNITS=     HZ,            ARBITRARY UNITS, ARBITRARY UNITS
##FACTOR=    0.157963299565203, 1,           1
##FIRST=     4132.6476996994, 0,             0
##LAST=      -1043.33573715361, 0,           0
##MIN=       -1043.33573715361, -1032803,    0
##MAX=       4132.6476996994, 490484005,     0
$$ Real data points
##PAGE= N=1
##DATA TABLE= (X++(R..R)), XYDATA
$$ [...]
17755A20200J14428q2472J17600o5423l1686k93214n097K06241J26925R2700M087
$$ 120200 234628 152156 269756 204333 172647 -120567 -125664 80577 207502 300202 304289
17744C04289q3648J13120j31297j42679J30550J29724q2082k14332J13386J02617
$$ 304289 220641 333761 202464 59785 190335 320059 237977 23645 137031 239648
17734B39648k5774j35128Q8951R0933j66791J58321K03023N242r0322o4184l7569
$$ 239648 213874 78746 167697 258630 91839 250160 453183 458425 368103 303919 266350
17723B66350k3550k79239P7750J32589P6270k72937L1357J31841R4601k2425j78206
$$ 266350 242800 -36439 41311 173900 250170 -22767 8590 140431 235032 212607 34401
17712C4401p0071r9989j20090J89343m4059n6791J9684K10649l4623j41099j37260
$$ 34401 -35670 -135659 -255749 -66406 -110465 -167256 -147572 63077 28454 -112645 -249905
17701b49905j47507j24978K04806K29321j58467p8040K61948L13632j18923n68513
$$ -249905 -397412 -522390 -317584 -88263 -246730 -324770 -62822 250810 131887 -436626
17691d36626k12001j6990J20634K05498j28647N0227O8548p514P0155L42862K83413
$$ -436626 -648627 -665617 -544983 -339485 -468132 -417905 -349357 -356871 -286716 56146 339559
17680C39559j5741j78256l42215L6027O5689N718R1937j31881J75889J67588l1697
$$ 339559 323818 145562 -196653 -160626 -94937 -89219 2718 -129163 46726 214314 182617
17669A82617j31734M950M0480J93562J06800j79281n9809J39656J58881M1044
$$ 182617 50883 55833 96313 289875 396675 217394 157585 297241 456122 497166
17659D97166j29107j47838J12431k67350j80527o5543o1755k787j86412N4039
$$ 497166 368059 220221 332652 65302 -115225 -180768 -242523 -245310 -431722 -377683
17649c77683K64197L35054j15709k38874K7307L41970J31159J37781j17879J43794
$$ -377683 -113486 221568 105859 -133015 -105708 236262 367421 505202 387323 531117
17639E31117j09331k17469j57542j68529j5766L3223K06552K62364K14258k80280
$$ 531117 421786 204317 46775 -121754 -137520 -104297 102255 364619 578877 298597
17629B98597j95268j11880J39183o1757l6592R0835j33932k22557J050J95692
$$ 298597 103329 -8551 130632 68875 32283 123118 -10814 -233371 -232321 -36629
17619c6629K71827n8191P6149J0223m2065j55868l41977j28013J16159N8166J32074
$$ -36629 235198 177007 253156 263379 221314 65446 -276531 -404544 -288385 -230219 -98145
17608i8145J09769J93419N4693j5177j88128q6384j09940O817K88001J74786o5983
$$ -98145 11624 205043 259736 244559 56431 -29953 -139893 -133076 154925 329711 263728
17597B63728m25617k20827K1474P7590L3350l3687K41808j15081L1862L4179J43977
$$ 263728 -161889 -382716 -361242 -283652 -250302 -283989 -42181 -157262 -125400 -91221 52756
17586E2756o7631N6336j24567k78159k5305K24197K72833J63396m3580K74396
$$ 52756 -14875 41461 -83106 -361265 -386570 -162373 110460 273856 230276 504672
17576E04672L98556K6751j33242j99631l36099j38302r3027J92457k630k33716
$$ 504672 903228 929979 796737 597106 261007 122705 29678 222135 219505 -14211
17566a4211j79124j12790n0624J41384R1931K02209j16041j98231J23063K53387
$$ -14211 -193335 -306125 -356749 -215365 -123434 78775 -37266 -235497 -112434 140953
17556A40953N2991j82678J42661j44462j88153N1031L8459J24542n7887L5977
$$ 140953 193944 11266 153927 9465 -178688 -127657 -89198 35344 -22543 13434
17546A3434n3323N6791r0329J57219o7066l2951J24397J2275o9155r1488p6894
$$ 13434 -39889 16902 -73427 83792 16726 -16225 108172 120447 51292 -40196 -117090
17535a17090k49499J9480M0469J78598K71213N7074j11779K7054o5718k4187n8242
$$ -117090 -366589 -347109 -306640 -128042 143171 200245 88466 115520 49802 25615 -32627
17524c2627j8338j01037j48807K83508J78650j54780R0004N3169N7359r7963n5682
$$ -32627 -50965 -152002 -300809 -17301 161349 6569 96573 149742 207101 109138 53456
17513E3456k45339L7851K86080m8626j67562j76054j55738J87063L27549K4093
$$ 53456 -191883 -154032 132048 83422 -84140 -260194 -415932 -228869 98680 122773
17503A22773m5713M4060j09008j63055K13216L1415j36080R7260K93039R3938
$$ 122773 77060 121120 12112 -150943 62273 93688 -42392 54868 347907 441845
17493D41845J1097n0699Q0595J16241J04121j64589P2035K2186l26484j91149
$$ 441845 452942 402243 482838 599079 703200 538611 610646 632832 306348 115199
17483A15199J16454j03156L9467l20774L2324K87627j29077P8058r5547j16418
$$ 115199 231653 128497 167964 -152810 -120486 167141 38064 116122 20575 -95843
17473i5843j4272L7765J52648K10889J63355j7279j65408J67466J67922K63360
$$ -95843 -110115 -72350 80298 291187 454542 437263 271855 439321 607243 870603
17463H70603M4236p3526k9722l9708k61740q0705M3622J1974J68982p0829l51931
$$ 870603 914839 841313 811591 771883 510143 429438 473060 485034 654016 583187 231256
17452B31256j40564J13250J82411m6942K5328j40791j24066K8823J43289J82319
$$ 231256 90692 203942 386353 339411 364739 223948 99882 128705 271994 454313
17442D54313L32592K45804P5882L21712J81373j56569k16493m07274q1365P5777
$$ 454313 786905 1032709 1108591 1430303 1611676 1455107 1238614 831340 749975 825752
17432H25752M5932j64962j56487k0253M7999q9234J04568l3083l12356l07574
$$ 825752 871684 706722 550235 529982 577981 488747 593315 560232 247876 -59698
17422e9698k7341J75305q6457K12445j2164k36177l1777m5924j64077J12126L34420
$$ -59698 -87039 88266 1809 214254 202090 -34087 -65864 -111788 -275865 -163739 170681
17411A70681Q2385r2020K40491J16323M5735j25582k77057P1274m5634l0290Q3968
$$ 170681 253066 161046 401537 517860 563595 438013 160956 232230 186596 156306 240274
17400B40274L0605j92286N9928J73420P7164N4797J76180j63069l21792K0281
$$ 240274 270879 78593 138521 311941 389105 443902 620082 457013 135221 155502
17390A55502j43880j0501L0497K5585N7706j53398M7432K13124j19255k86936
$$ 155502 11622 1121 31618 57203 114909 -38489 8943 222067 102812 -184124
17380a84124N1715K63347Q9975j75314j1105J3976Q6599J8523j42624n2173M1878
$$ -184124 -132409 130938 220913 45599 34494 48470 135069 153592 10968 -41205 673
17369F73N6066j8205o2773K2213k1740K7849k55964j68753O1142K06026N8571
$$ 673 56739 38534 -24239 -2026 -23766 4083 -251881 -420634 -359492 -153466 -94895
17358i4895l2878J62802J444Q3352n3711j86694J01560J28560j23263j12361j0420
$$ -94895 -127773 35029 36473 119825 66114 -120580 -19020 109540 -13723 -126084 -136504
17347a36504l6881j0021L26401P6557m7104k71254j83903L64963m9678N220l1392
$$ -136504 -173385 -183406 142995 219552 172448 -98806 -282709 82254 32576 37796 6404
17336F404N5792K7413j15984m3719k57210p5187m9781J28712K43900Q0129J55669
$$ 6404 62196 89609 -26375 -70094 -327304 -402491 -452272 -323560 -79660 469 156138
17325A56138L56450K9826q8283l87233l61041K8339J09983J13869m6474Q9648
$$ 156138 512588 542414 454131 66898 -294143 -265804 -155821 -41952 -88426 1222
17315A222J78507N2410L2833r5279p3758K17885k2667k40632K9677K9875Q7460
$$ 1222 179729 232139 264972 169693 95935 313820 291153 50521 80198 110073 197533
17304A97533L1960J79334k08888M9232J54964Q4665K7578j91821K1907M4430r7924
$$ 197533 229493 408827 199939 249171 404135 488800 516378 324557 346464 390894 292970
17293B92970k10193q7824k4862j6688l8750J23978J81079J60149k18173j43100
$$ 292970 82777 -5047 -29909 -46597 -85347 38631 219710 379859 161686 18586
17283A8586r4434k25656j43139P4158M4522J27767J77408R4719Q6816M1944p4581
$$ 18586 -75848 -301504 -444643 -370485 -325963 -198196 -20788 73931 160747 202691 128110
17272A28110j22170p9609j99873j21066K48848K5257r785O0462O994j514J9828
$$ 128110 5940 -73669 -273542 -394608 -145760 -120503 -130288 -69826 -62832 -64346 -44518
17261d4518l5024k8514O5782L22112q8610j59781K09368M539j25932j07850r6230
$$ -44518 -79542 -108056 -42274 279838 191228 31447 240815 245354 119422 11572 -84658
17250h4658Q2263L12292m694k68360j30457J11865P0583j41175k0112K75323J19228
$$ -84658 -2395 309897 305203 36843 -93614 18251 88834 -52341 -72453 202870 322098
17239C22098M2585K55711l2974K6621j78641k713J12357J20212j70220Q1025J15113
$$ 322098 364683 620394 587420 614041 435400 432687 545044 665256 495036 576061 691174
17228F91174k34010N4343j6958j28573J1790J67984j5573P6340l30963j18230
$$ 691174 457164 511507 494549 365976 377766 545750 530177 606517 275554 157324
17218A57324M3489L99143K25438k12147j24303j895l6476p2617n400j67468p067
$$ 157324 200813 599956 825394 613247 488944 487049 450573 377956 372556 205088 198021
17207A98021j53706K33440K14395K41340k75289j62915j9275k4943M0392k83604
$$ 198021 44315 277755 492150 733490 458201 295286 276011 251068 291460 7856
17197G856M6509J32837j92965j04585M0372L9669o9524l0925J87757N208M2126
$$ 7856 54365 187202 -5763 -110348 -69976 -30307 -99831 -130756 57001 62209 104335
17186A04335J31037j8615r2750K6720J84350n915m4669l71408J93970J29973O6821
$$ 104335 235372 216757 124007 150727 335077 329162 284493 -86915 107055 237028 303849
17175C03849J14886j08864k9917k0522j87810k96345O2185K24594j33222k44825
$$ 303849 418735 309871 279954 259432 71622 -224723 -162538 62056 -71166 -315991
17165c15991m522J09128N0861J23428O3022n1277o8923J09230m8311k75514r6948
$$ -315991 -320513 -211385 -160524 -37096 25926 -25351 -94274 14956 -33355 -308869 -405817
17154d05817p6578J09763k2687R0478Q3657Q3012j51971J38292K56961K85650
$$ -405817 -482395 -372632 -395319 -304841 -221184 -138172 -290143 -151851 105110 390760
17144C90760L7610n9054M2892J42847m21688l64561M1661N2974N3372N4535J73650
$$ 390760 428370 369316 412208 555055 133367 -231194 -189533 -136559 -83187 -28652 144998
17133A44998L44134n7961L8989n4071k47326R6724K8325j20414J4420K42481K97048
$$ 144998 489132 431171 470160 416089 168763 265487 293812 173398 187818 430299 727347
17122G27347J02861N6306r0634k17070j10455q407L7333J27200k4204r0533m46785
$$ 727347 830208 886514 795880 578810 468355 459948 497281 624481 600277 509744 62959
17111F2959l45922K08981L88287l2021j93234o6478K39050k8504j49802O6225
$$ 62959 -282963 -73982 314305 282284 89050 22572 261622 233118 83316 149541
17101A49541L35984l5406o245j28139j30166K90176j56749l00829j71877M1504
$$ 149541 485525 450119 443874 315735 185569 475745 318996 18167 -153710 -112206
17091a12206J49049k21111j5194Q0059K26936K03370p0656j77848j02746M2200
$$ -112206 36843 -184268 -199462 -119403 107533 310903 240247 62399 -40347 1853
17081A853M4281k7425k6784k2429J05314J92349q1002k81019k51471j3218R0781
$$ 1853 46134 18709 -8075 -30504 74810 267159 186157 -94862 -346333 -359551 -268770
17070b68770j04417J66353l4058K99164K83749N238k22588j07258J45852M38594
$$ -268770 -373187 -206834 -240892 58272 342021 347259 124671 17413 163265 601859
17060F01859J16550m18601k57790j08661l3310o8421m0377O7147J62407J84537
$$ 601859 718409 299808 42018 -66643 -99953 -168374 -208751 -141604 20803 205340
17050B05340j79248J27788P0164k53320m12136k11513J83407L28635J3067J56173
$$ 205340 26092 153880 224044 -29276 -441412 -652925 -469518 -140883 -127816 28357
17040B8357o7026P52J0576J9503L10704K43930Q1087J7722j21318N1065R9184
$$ 28357 -38669 -37917 -27341 -7838 302866 546796 627883 645605 524287 575352 674536
17029F74536j74041k28908J65605K14585K15907j76417l16982j27765K74102L203
$$ 674536 500495 271587 437192 651777 867684 691267 374285 246520 520622 523825
17019E23825j862J16860K41089J51070j5679k85910j69248P1045o5423j30265
$$ 523825 521963 638823 879912 1030982 1015303 729393 560145 631190 565767 435502
17009D35502J43298j18538K3568j38737Q480K3271L0724m7831k0948L5295Q4907
$$ 435502 578800 460262 483830 345093 353573 376844 407568 359737 338789 374084 458991
16998D58991O4728O2061J29459j87440j14181R7598j09236J61164j9990k28513
$$ 458991 523719 585780 715239 527799 413618 511216 401980 563144 543154 314641
16988C14641k08267N3967N6906Q8946J430M205J16965P3572Q666j48102m383J89888
$$ 314641 106374 160341 217247 306193 307623 311828 428793 502365 511031 362929 358546 548434
16976E48434L3866l19190K04052O8735r9825N9063Q3308j92855Q688r4442j5980
$$ 548434 582300 263110 467162 535897 436072 495135 578443 385588 394276 299834 283854
16965B83854j2862j40033j84097R1943J46435k94533k06115P1330R4739J90625
$$ 283854 270992 130959 -53138 38805 185240 -109293 -315408 -244078 -149339 41286
16955D1286L30370j41430j17987j37143J77660m5890R3828K61663j863j10201
$$ 41286 371656 230226 112239 -24904 152756 106866 200694 462357 460494 350293
16945C50293j71816J61389L62604k18902j93945m3504j40126P06O835o3366N8271
$$ 350293 178477 339866 702470 483568 289623 246119 105993 106699 113534 50168 108439
16934A08439P8855J6307M9558n8543l2698j57711J32369r2125o0667r1094J33519
$$ 108439 187294 203601 253159 194616 161918 4207 136576 44451 -16216 -107310 26209
16923B6209J72922N6345K14742j26349l5737j16090j28964J5800J97065l870q8892
$$ 26209 199131 255476 470218 343869 308132 192042 63078 78878 275943 272073 183181
16912A83181J35961j79626q4739j13815j23165J60082r3798M5365K8420k5019
$$ 183181 319142 139516 54777 -59038 -182203 -22121 -115919 -70554 -42134 -67153
16902f7153j91958j46263Q2176K92978m947Q1653j49123j50747k08167M5616L47587
$$ -67153 -259111 -405374 -323198 -30220 -35167 46486 -102637 -253384 -461551 -415935 -68348
16891f8348J71055L8802j7399o0233j15280J6373j03437l21866J49118j4268j08335
$$ -68348 102707 141509 124110 63877 -51403 -35030 -138467 -460333 -311215 -325483 -433818
16880d33818J98983L14101p328j67999q1186M16606P3452k6682J02417L04240
$$ -433818 -234835 79266 71938 -96061 -177247 239359 312811 286129 388546 692786
16870F92786L08552K88896J07557j61833q3237k32263l87341k14756J844n124
$$ 692786 1001338 1290234 1397791 1235958 1152721 920458 533117 318361 320205 315081
16860C15081J86185K16015O8214k97537r4362O1025j44191n912j37467J02394
$$ 315081 501266 717281 785495 487958 393596 454621 310430 304518 167051 269445
16850B69445j0620J75003L77282o9982J16669J56450L7114N7550J20720N522m5665
$$ 269445 258825 433828 811110 741128 857797 1014247 1051361 1108911 1229631 1235153 1189488
16839A189488j80616l6400J15689k71943k62668J27098O210l117J82504K5731
$$ 1189488 1008872 972472 1088161 816218 553550 680648 686858 683741 866245 891976
16829H91976k79714l27385J14615K19997j4322R9443j53545p9554j53685j32883
$$ 891976 612262 284877 399492 619489 605167 704610 551065 471511 317826 184943
16819A84943l0839j36904L8000K23763O7977k6800k38385k42273m6469K91936
$$ 184943 154104 17200 55200 278963 346940 320140 81755 -160518 -206987 84949
16809H4949J21019j55074K74834M7835j99804j10347j40676J09281K29318R5181
$$ 84949 205968 50894 325728 373563 173759 63412 -77264 32017 261335 356516
16799C56516J32809p5507k34299j44915q6791j79551J09878P4016j41991j66720
$$ 356516 489325 413818 179519 34604 -52187 -231738 -121860 -47844 -189835 -356555
16789c56555o7281L3968K61080P6216Q4403K2400L9368J43154L05683N1635J98685
$$ -356555 -423836 -389868 -128788 -52572 31831 54231 93599 236753 542436 594071 792756
16778G92756j58964k56567j71176j94728Q4858K51626l6154l5799j36730j99521
$$ 792756 633792 377225 206049 11321 96179 347805 311651 275852 139122 -60399
16768f0399o9094L31622N7185j63371j5785m950j75733l6146j13J79568Q1509
$$ -60399 -129493 202129 259314 95943 80158 75208 -100525 -136671 -136784 42784 124293
16757A24293p6736j66141R2965p7588K5478J1176j26540j19938L85538K16864
$$ 124293 47557 -118584 -25619 -103207 -77729 -66553 -193093 -313031 72507 289371
16747B89371j72787j13021Q5634j06485J34094J12779j33147o2012J21941K34743
$$ 289371 116584 3563 89197 -17288 116806 229585 96438 34426 156367 391110
16737C91110o0878j15741M4011j73721l86184o307K47821K50024r2094k86110
$$ 391110 330232 214491 258502 84781 -301403 -307710 -59889 190135 98041 -188069
16727a88069r3622M2960J30682L06175k9369J8297j01525o3731L3314l5062O0689
$$ -188069 -281691 -238731 -108049 198126 168757 187054 85529 21798 55112 20050 80739
16716H0739N429j46579J2665J54829n48j51107j3321k7102L3423J52K24538K2107
$$ 80739 86168 -60411 -47746 107083 106535 -44572 -57893 -84995 -51572 -51420 173118 195225
16704A95225K8549r7413j56278k01619j88368P898J26937J55538L3487K90322
$$ 195225 223774 126361 -29917 -231536 -419904 -412006 -285069 -129531 -96044 194278
16694A94278J54223K9177m5881l44396m19509q2451R8430K00269J10969j95570
$$ 194278 348501 377678 331797 -12599 -432108 -514559 -416129 -215860 -104891 -300461
16684c00461Q0815K03248L07260j32567j76347p7698j76548J53176J57080k27445
$$ -300461 -219646 -16398 290862 158295 -18052 -95750 -272298 -119122 37958 -189487
16674a89487Q7842J50818r4809j03701J0843J27176K61148J71859k64319l98245
$$ -189487 -101645 49173 -45636 -149337 -138494 -11318 249830 421689 157370 -240875
16664b40875J74268p5038O8953j1290p3524j36881J24646J26093Q9941N81k51528
$$ -240875 -66607 -141645 -72692 -83982 -157506 -294387 -169741 -43648 46293 46874 -204654
16653b04654K6847o7132k12000p6438J58956j64601P7281J51008P1682J40323
$$ -204654 -177807 -244939 -456939 -533377 -374421 -539022 -461741 -310733 -239051 -98728
16643i8728k3995J19143J43373j55626p7462r4489Q5213J19404J5763j34506q1180
$$ -98728 -122723 -3580 139793 -15833 -93295 -187784 -102571 16833 32596 -101910 -183090
16632a83090j3113K33257K0550l25024k04091j60042K78861k5687p0114K27903
$$ -183090 -196203 37054 57604 -267420 -471511 -631553 -352692 -378379 -448493 -220590
16622b20590L04184N9649l0694m1313n1498J85833p9874l17065k05363J52173
$$ -220590 83594 143243 112549 71236 19738 205571 125697 -191368 -396731 -244558
16612b44558J12996M484J16421m3673p3126J34712L73223O8517k86540j83217
$$ -244558 -131562 -127078 -10657 -54330 -127456 7256 380479 448996 162456 -20761
16602b0761j01227j62995K03144K43870P1886p7891q2786l1576j15075J36454
$$ -20761 -121988 -284983 -81839 162031 233917 156026 73240 41664 -73411 63043
16592F3043N8640j50370M0959n9640N2608K9731K00918Q225j47072j37846k06995
$$ 63043 121683 -28687 12272 -47368 5240 34971 235889 244114 97042 -40804 -247799
16581b47799n3433O5219o7330J43065L11307O0936p4020k0844k09542q499o9619
$$ -247799 -301232 -236013 -303343 -160278 151029 211965 137945 117101 -92441 -100940 -170559
16570a70559r0582J40374K15262R5479K2002j1830K63478L0419r5527J5115K24786
$$ -170559 -261141 -120767 94495 189974 211976 200146 463624 494043 398516 413631 638417
16559F38417J1440p9985N051l22377j56594k1315K90895j0185r4785N115j86817
$$ 638417 649857 569872 574923 252546 95952 74637 365532 355347 260562 265677 78860
16548G8860J9238o6093j816m7325J36143R7601j51102J8136J9623L6254l3158
$$ 78860 98098 32005 30189 -17136 119007 216608 65506 83642 103265 139519 106361
16537A06361J18058J65938l6578q352j13519L579k75870j28140j76085J3556K6343
$$ 106361 224419 390357 353779 345427 231908 235487 -40383 -168523 -344608 -331052 -304709
16526c04709K12053M34653K9901k27771o6449J62566K0409n298j07205k5979j46636
$$ -304709 -92656 341997 371898 144127 77678 240244 260653 255355 148150 122171 -24465
16515b4465K27645O8621j56121r8987r5681j51569j02871J85335P4502K7159L1455
$$ -24465 203180 271801 115680 16693 -78988 -230557 -333428 -148093 -73591 -46432 -14977
16504a4977j41930O6387K08689l8885j06268J9459M6039p8993n8197l6343j9054
$$ -14977 -156907 -90520 118169 79284 -26984 -7525 38514 -40479 -98676 -135019 -154073
16493a54073m7551J74550K60813J66393K7394j05364j68426k00366j28635q0915
$$ -154073 -201624 -27074 233739 400132 427526 322162 153736 -46630 -175265 -256180
16483b56180L93050J78525k3040R5952o5471l63405k59217j36599J10759O7476
$$ -256180 136870 315395 292355 388307 322836 -40569 -299786 -436385 -325626 -258150
16473b58150M4380O1379J10977J91084p529k07847j8228j0634L41473J31969k8642
$$ -258150 -213770 -152391 -41414 149670 142141 -65706 -83934 -94568 246905 378874 350232
16462C50232J18424n2803O2199m7532j64733r051J7376r3827o5584l4472J36264
$$ 350232 468656 415853 478052 430520 265787 256736 274112 180285 114701 80229 216493
16451B16493M121r4875j10176j50078j08432L21405K85552O945R6481l411M5937
$$ 216493 220614 125739 15563 -134515 -242947 78458 364010 370955 467436 464025 509962
16440E09962k41566J30084K73535J41024L47108K04979m1418l57208j84504P7335
$$ 509962 268396 398480 672015 813039 1160147 1365126 1323708 966500 781996 859331
16430H59331K13764J02082k35507n5301N0229L1637r8606J88678r5240j17306
$$ 859331 1073095 1175177 939670 884369 934598 966235 867629 1056307 961067 843761
16420H43761k81472q5298r638J50356K71001r2768r1975l2412J71867P2944j16452
$$ 843761 562289 476991 467353 617709 888710 795942 703967 671555 843422 916366 799914
16409G99914r3599q7224K94785L07525N7150j07039k10026r2025K06332K74256
$$ 799914 706315 619091 913876 1221401 1278551 1171512 961486 869461 1075793 1350049
16399A350049l60677K2163J93162J664J5389L8130m9872j51041J54273J24222
$$ 1350049 989372 1011535 1204697 1206361 1221750 1259880 1210008 1058967 1213240 1337462
16389A337462L0936P1908J27462L1082q0353Q7981J0201J67072m5959m2723N7235
$$ 1337462 1368398 1440306 1567768 1598850 1518497 1606478 1616679 1783751 1737792 1695069 1752304
16378A752304J24321J06182J15950K43754J06995j184M20676K97065L19663M69925
$$ 1752304 1876625 1982807 2098757 2342511 2449506 2448322 2868998 3166063 3485726 3955651
16368C955651K23170J23080j6179J032J0820K1967J81114N01845O55089K85578
$$ 3955651 4178821 4301901 4285722 4286754 4297574 4319541 4500655 5002500 5657589 5943167
16358E943167J49224M54422N36187Q13114J070993J095576J210795J337550J723993
$$ 5943167 6092391 6546813 7083000 7896114 8967107 10062683 11273478 12611028 14335021
16349A4335021K265906K684376L534935N440147Q029442J2383583J9533607K8730017
$$ 14335021 16600927 19285303 22820238 28260385 36289827 48673410 68207017 96937034
16341I6937034L7111084L9732895L3108328J6244883q012677k9908459l9870439
$$ 96937034 134048118 173781013 206889341 223134224 215121547 185213088 145342649
16334A45342649l6115371k5901125j6453940j0293775o985747m812602l310841
$$ 145342649 109227278 83326153 66872213 56578438 49592691 44780089 41469248
16327D1469248k383267j783117p53787p76018n39747L66163Q53037J430962K482674
$$ 41469248 39085981 37302864 36549077 35773059 35233312 35599475 36452512 37883474 40366148
16318D0366148M099747P222877J2309555J9512681K8734087L6206164L7641554
$$ 40366148 44465895 51688772 63998327 83511008 112245095 148451259 186092813
16311A86092813K9304899J1144332j2988928l3123517l9963426l4290912k3983246
$$ 186092813 215397712 226542044 213553116 180429599 140466173 106175261 82192015
16304H2192015j5547021j0056593o895845n199980l851486l227309k874825k449662
$$ 82192015 66644994 56588401 49692556 44492576 40641090 37413781 34538956 32089294
16296C2089294k073123j593595j732543j647894j383640j429983j377479j227851
$$ 32089294 30016171 28422576 26690033 25042139 23658499 22228516 20851037 19623186
16288A9623186j019358q69195o48392m50507l85165m00075k64085m05037m86554
$$ 19623186 18603828 17734633 17086241 16635734 16250569 15850494 15586409 15181372 14694818
16279A4694818m37195n73122o61100n06095l23828p1507j88617m42345m63201
$$ 14694818 14257623 13684501 13023401 12517306 12193478 12121971 11933354 11491009 11027808
16270A1027808m58489n36862o11889m13038n18890r0407j09700m98395k10910
$$ 11027808 10569319 10032457 9420568 9007530 8488640 8398233 8288533 7790138 7579228
16261G579228L0485j36903l49144k88364j68339q8168j89689k95097j77225N2280
$$ 7579228 7609713 7472810 7123666 6835302 6666963 6578795 6389106 6094009 5916784 5969064
16251E969064j61986j45087l57617m01954o3641j58127j48805j37005j89416j68843
$$ 5969064 5807078 5661991 5304374 4902420 4838779 4680652 4531847 4394842 4205426 4036583
16241D036583j2954j66869k69755j47060j24224j81855j27269k1152J44128N6613
$$ 4036583 4023629 3856760 3587005 3439945 3315721 3133866 3006597 2985445 3129573 3186186
16231C186186l6643j06646m05826j85800l0061o1564k08418r4429L03913Q85l00782
$$ 3186186 3149543 3042897 2637071 2451271 2421210 2359646 2151228 2056799 2360712 2361597 2060815
16220B060815j31924P6350k69998k54016o1019j109n3411k21173K16288J55160
$$ 2060815 1928891 2005241 1735243 1481227 1420208 1419099 1365688 1144515 1360803 1515963
16210A515963J36158J90668m3162j97117N3910K54652k74791j23702O5585n30822
$$ 1515963 1652121 1842789 1799627 1602510 1656420 1911072 1636281 1512579 1578164 1047342
16200A047342k2643J91230j89899k86996j07100M8564Q7475K3194j79832P511
$$ 1047342 1024699 1215929 1026030 739034 631934 680498 767973 791167 611335 618846
16190F18846l3715R9145r1373l9138k6035R1325Q415K94827J18543J84818l6187
$$ 618846 585131 684276 592903 553765 527730 619055 627470 922297 1040840 1225658 1189471
16179A189471k63356n4454j5555J6741l2371j68133P95r059m1512r8573j28686
$$ 1189471 926115 871661 856106 872847 840476 672343 673138 664079 622567 523994 395308
16168C95308j7098K66551j17200n64847j45372L07119L50550r7880k29540k28343
$$ 395308 378210 644761 527561 -37286 -182658 124461 475011 377131 147591 -80752
16158h0752N1185J22270j25510L1597J17457J1606o4046r8899O8306J47613M5306
$$ -80752 -29567 92703 -32807 -1210 116247 127853 63807 -35092 33214 180827 226133
16147B26133j70967j39320j22270L5534J87554R1653J44431k22232n0857K91137
$$ 226133 55166 -84154 -206424 -170890 16664 108317 252748 30516 -20341 270796
16137B70796j9489j74796j3470K63260K81525K9915j33961j64548j12835j06353
$$ 270796 251307 76511 63041 326301 607826 637741 503780 339232 226397 120044
16127A20044L5063K02369q3888j28048J14981j30476l05185Q2151k09408o3658
$$ 120044 155107 357476 273588 145540 260521 130045 -175140 -92989 -302397 -366055
16117c66055J88165Q1100O0213K44892j44290J55010K65923l09261k01593J95744
$$ -366055 -177890 -96790 -36577 208315 64025 219035 484958 175697 -25896 169848
16107A69848L13346M0260l7178k1004k34776j25667j31555o5530N5880O527J13891
$$ 169848 483194 523454 486276 465272 230496 104829 -26726 -92256 -36376 -29849 84042
16096H4042J03486N8450K41081K5310k42018p51J12372l16161k00216L0636O5014
$$ 84042 187528 245978 487059 512369 270351 269600 381972 65811 -134405 -103769 -38755
16085c8755J49561L804o8102k31991J44095Q1060l6645L8662Q2615K30066J3609
$$ -38755 110806 114610 46508 -185483 -41388 39672 3027 41689 124304 354370 367979
16074C67979k6094q9126P8612J2285o4919L7957k09792o8064R1001J02894j30228
$$ 367979 341885 252759 331371 343656 278737 316694 106902 38838 129839 232733 102505
16063A02505j99241l22778K81316K82359j47329P4467J05419p9294o5448k51352
$$ 102505 -96736 -419514 -138198 144161 -3168 71299 176718 97424 31976 -219376
16053b19376j37077K37147N1324k0626q7364N8580J94746j73958L0667K33636
$$ -219376 -356453 -119306 -67982 -88608 -175972 -117392 77354 -96604 -65937 167699
16043A67699r5395j44030Q7557K43368O5688m9669k09028l28381L349J21319J33416
$$ 167699 72304 -71726 15831 259199 324887 275218 66190 -262191 -258842 -137523 -4107
16032d107P0258J71668J61705m09135l78672J02K14017K72382J30006r0288k94917
$$ -4107 66151 237819 399524 -9611 -388283 -388181 -174164 98218 228224 137936 -156981
16021a56981k01012L61359L61976l7867j42789K5354k23080Q0460N39535M26017
$$ -156981 -357993 3366 365342 327475 184686 210040 -13040 67420 606955 1032972
16011A032972J60296O6720J93824O2512k19633L6042l1245l7181j46275L5878
$$ 1032972 1193268 1259988 1453812 1516324 1296691 1332733 1301488 1264307 1118032 1153910
16001A153910k53521l69962k00690j54029r620J61642p4676j1996J58993J63230
$$ 1153910 900389 530427 329737 175708 166088 327730 253054 241058 400051 563281
15991E63281J45044Q9324K6812K93118N01077K19050j2651m55257m36116j16540
$$ 563281 708325 797649 824461 1117579 1618656 1837706 1825055 1369798 933682 817142
15981H17142J44303o6426j55713q1402J32610N3626m7101j18142p5884j42465
$$ 817142 961445 895019 739306 657904 790514 844140 797039 678897 603013 460548
15971D60548r6962o5937O6349j6236j7600q1224k02425K056P8581J10372N197
$$ 460548 363586 297649 363998 347762 330162 248938 46513 48569 127150 237522 242719
15960B42719N2957j03718J1725p0572j32960P6964r827J22353o4658J45977J30054
$$ 242719 295676 191958 203683 133111 151 77115 67288 189641 124983 270960 401014
15949D01014j19312q5195j68842L096l5762q0598J09230n5224L3400K99319O5427
$$ 401014 281702 196507 27665 30761 -5001 -85599 23631 -31593 1807 301126 366553
15938C66553m6935O11j20789o5601j9214L3414r6562Q6151m0164K13156n6275
$$ 366553 319618 320229 199440 133839 114625 148039 51477 137628 97464 310620 254345
15927B54345k5742m4297j22010P9496o5972P6100r3919k46713l789L29085J15849
$$ 254345 228603 184306 62296 141792 75820 151920 58001 -188712 -192501 136584 252433
15916B52433l7j14846J32898o1967j57969Q0223Q7988Q7936j99202k53305K36905
$$ 252433 252396 137550 270448 208481 50512 130735 218723 306659 107457 -145848 91057
15905I1057O4105r3738j69574P905J92726r8852j74942M8868O699m9697n831J8634
$$ 91057 155162 61424 -108150 -100245 92481 -6371 -181313 -132445 -125746 -175443 -181274 -162640
15893a62640j3343o727J6555j34230l40254j32415p6085j50886R1512L96385J94208
$$ -162640 -175983 -182710 -166155 -300385 -640639 -773054 -849139 -1000025 -908513 -512128 -317920
15882c17920N3168K58440o3979j53578J11250j2578Q4762J4406J46860M9562k31825
$$ -317920 -264752 -6312 -70291 -223869 -112619 -125197 -40435 -26029 120831 170393 -61432
15871f1432N4216J10272r6075l9692J35523J02336J02773j22072j81096l65412
$$ -61432 -7216 103056 6981 -32711 102812 205148 307921 185849 4753 -360659
15861c60659J08246J96035J3805j78903m1085K05341N3914J92687p9901o1235
$$ -360659 -252413 -56378 -42573 -221476 -262561 -57220 -3306 189381 109480 48245
15851D8245o5879k7740j09368Q9203J1054K31962M35858n112k99573m03445j28818
$$ 48245 -17634 -45374 -154742 -65539 -54485 177477 613335 608223 308650 -94795 -223613
15840b23613j35579j07603L10154M5667R1465J45555j57616j87171K45644m3449
$$ -223613 -359192 -466795 -156641 -110974 -19509 126046 -31570 -218741 26903 -16546
15830a6546l6040Q5462m6137K47170j3687k64997L486J05436o3764k62831j51553
$$ -16546 -52586 32876 -13261 233909 220222 -44775 -41289 64147 383 -262448 -414001
15819d14001M7820P6399K78868m0954R0859J53624J20442k36761j36430J15899
$$ -414001 -366181 -289782 -10914 -51868 38991 192615 313057 76296 -60134 55765
15809E5765J68990j12332k058K6884K47097K80910J60069K14221Q34l33276r5062
$$ 55765 224755 112423 110365 137249 384346 665256 825325 1039546 1040380 707104 612042
15798F12042J45692k01562j16746O7675R812N0745j40975k02012m029M5523j11034
$$ 612042 757734 556172 439426 507101 516913 567658 426683 224671 220642 266165 155131
15787A55131Q2062J80903J06907j67786j56048j342J53742o514N5414J28486J91065
$$ 155131 237193 418096 525003 357217 201169 199827 353569 347055 402469 530955 722020
15776G22020J10936K44087L56558Q2930j05920l73497k53732j08840k45609k62108
$$ 722020 832956 1077043 1433601 1516531 1410611 1037114 783382 674542 428933 166825
15766A66825j7628P1073Q3304p8020P38j44386j40512J32162m2461j40100j76954
$$ 166825 149197 220270 303574 225554 226292 81906 -58606 73556 31095 -109005 -285959
15755b85959m3187J73004j40420N6080M1744J19331R2825J07724N4073j29074
$$ -285959 -329146 -156142 -296562 -240482 -198738 -79407 13418 121142 175215 46141
15745D6141j74660o6791J22245n0415K28917o1063m0170J7205j36808j1701J39393
$$ 46141 -128519 -195310 -73065 -123480 105437 44374 4204 21409 -115399 -127100 12293
15734A2293q729k0920k35520o3289o0252p5343J44787N7524L65j57879J61116
$$ 12293 3564 -17356 -252876 -316165 -376417 -451760 -306973 -249449 -249084 -406963 -245847
15723b45847K9739m8128k04083k60335m6986R0463L72660J67080N0599J28167
$$ -245847 -216108 -264236 -468319 -728654 -775640 -685177 -312517 -145437 -94838 33329
15713C3329K04534Q8564p0443J9307m3261j06420m10219l75496p1153M84803O87765
$$ 33329 237863 326427 255984 275291 232030 125610 -284609 -660105 -731258 -246455 441310
15702D41310k4627k15749k47618j39607P7470R9963J47415O4900k43720J05340
$$ 441310 416683 200934 -46684 -186291 -108821 -8858 138557 203457 -40263 65077
15692F5077l5151L3166l3259k38611j93616K2031M2741L2693J61350r4203m861
$$ 65077 29926 63092 29833 -208778 -402394 -380363 -337622 -304929 -143579 -237782 -242643
15681b42643J53577P8391L7472k03458j72530n7238J33005L1641K38696Q716q9247
$$ -242643 -89066 -10675 26797 -176661 -349191 -406429 -273424 -241783 -3087 5629 -83618
15670h3618J08402L3835O8136K9565O2480k27601j35526K01767K30602k00391
$$ -83618 24784 58619 126755 156320 218800 -8801 -144327 57440 288042 87651
15660H7651k06935Q2026K48796o5151k35934j2147j60016m2563K5536r3452O6484
$$ 87651 -119284 -37258 211538 146387 -89547 -101694 -261710 -304273 -278737 -372189 -305705
15649c05705p1755J48038J83692K5435L3730k5227j32204k05504R4339J46479
$$ -305705 -377460 -229422 -45730 -20295 13435 -11792 -143996 -349500 -255161 -108682
15639a08682J1299j56182k01052J53030j25578r6485k21439j09440J40429J54061
$$ -108682 -97383 -253565 -454617 -301587 -427165 -523650 -745089 -854529 -714100 -560039
15629e60039J76155L48129K09114P539k70141k9866J22209p9605r2376j5885J68459
$$ -560039 -383884 -35755 173359 180898 -89243 -119109 3100 -76505 -168881 -184766 -16307
15618a6307J44403J38559p4063J6915J48022p8061J8504o9973k50364J08084m8051
$$ -16307 128096 266655 192592 209507 357529 279468 297972 227999 -22365 85719 37668
15607C7668L8091L027n7410J02544m0944k07689j78155J11529N8941n5862M4321
$$ 37668 75759 78786 21376 123920 82976 -124713 -302868 -191339 -132398 -188260 -143939
15596a43939j23930M400N4808J7870P2181m2817J25992L61578k8873l16711l8734
$$ -143939 -267869 -263469 -208661 -190791 -118610 -161427 -35435 326143 297270 -19441 -58175
15585e8175j30618J02391R2181N8956R9662N830p3830j31876K30102K53811k22779
$$ -58175 -188793 -86402 5779 64735 164397 170227 96397 -35479 194623 448434 225655
15574B25655l28296k18593k30451m4551J05568K97808L6989M5813J97787m5802
$$ 225655 -102641 -321234 -551685 -596236 -490668 -192860 -155871 -110058 87729 41927
15564D1927k28087j82027P1816K30521J39828j60497j92668m6030J01281J66051
$$ 41927 -186160 -368187 -296371 -65850 73978 -86519 -279187 -325217 -223936 -57885
15554e7885K0908o2522O2834R4933j15508j471J30097N3563j39402n2792p1872
$$ -57885 -36977 -99499 -36665 58268 -57240 -58711 71386 124949 -14453 -67245 -139117
15543a39117N5805J0951q5976J37p3945O8070J73851k05778k91956j5728J47710
$$ -139117 -83312 -72361 -158337 -158200 -232145 -164075 9776 -196002 -487958 -503686 -355976
15532c55976J47989m6523k3758k8983K9846L00811O1942j72448j33444q7132j92289
$$ -355976 -207987 -254510 -278268 -307251 -277405 23406 85348 -87100 -220544 -307676 -499965
15521d99965r0466J79415K53203J71645R5329L3694k76585l7658J47608N3662
$$ -499965 -590431 -411016 -157813 13832 109161 142855 -133730 -171388 -23780 29882
15511B9882o3776j13086J87753K52852j33554j57402L217j04866J80579R3268
$$ 29882 -33894 -146980 40773 293625 160071 2669 5886 -98980 81599 174867
15501A74867j56485P0997j84677n3649J78695J4140j04042m0362O5165Q1300N8784
$$ 174867 18382 89379 -95298 -148947 29748 43888 -60154 -100516 -35351 45949 104733
15490A04733K08718k7701k90841m5305J48776K24678p7734k23984K9376K38921
$$ 104733 313451 285750 -5091 -50396 98380 323058 245324 21340 50716 289637
15480B89637k03361l25328k4779J39566J94784K42083q941l09163j71346j12932
$$ 289637 86276 -239052 -263831 -124265 70519 312602 303661 -5502 -176848 -289780
15470b89780K80899R4935j25382q28N8822j9275J49132r3617j62230q216N7314
$$ -289780 -8881 86054 -39328 -40156 18666 -609 148523 54906 -107324 -115540 -58226
15459e8226N1229L6970k11391j16179l301K24190j00398O0863J15243P6912o8895
$$ -58226 -6997 29973 -181418 -297597 -300898 -76708 -177106 -116243 -1000 75912 7017
15448G017j51811K14J00606J0470J90884J16534k04238k61165j3293m9434J42512
$$ 7017 -144794 -144580 -43974 -33504 157380 273914 69676 -191489 -204782 -254216 -111704
15437a11704J24678K12735L0410l76479k20704j4128N6520K5664J55963K9848
$$ -111704 12974 225709 256119 -120360 -341064 -355192 -298672 -273008 -117045 -87197
15427h7197P2051J9009Q265j47497P0480p6183j65423l8071J69361N7585n7529
$$ -87197 -15146 3863 12128 -135369 -64889 -141072 -306495 -344566 -175205 -117620 -175149
15416a75149j24444J83694j07200r8668N1938j31796K42685j54997l4229r2186
$$ -175149 -299593 -115899 -223099 -321767 -269829 -401625 -158940 -313937 -348166 -440352
15406d40352J00603Q2934K54259N3939m1337l2668m5470j42768M4385k7238r5608
$$ -440352 -339749 -256815 -2556 51383 10046 -22622 -68092 -210860 -166475 -193713 -289321
15395b89321j2085R5877J06271K52667R1717N2912J19977j44073K3479n7954j35276
$$ -289321 -301406 -205529 -99258 153409 245126 298038 418015 273942 297421 239467 104191
15384A04191Q0268o14J32668l4472j08249o3533j2926k96408k74336K18941K16352
$$ 104191 184459 183845 316513 282041 173792 110259 97333 -199075 -473411 -254470 -38118
15373c8118K4861j77303j99541J79428Q9761K5418Q6737n0760K3385O890p8183
$$ -38118 -13257 -190560 -390101 -210673 -120912 -95494 -8757 -59517 -36132 -29242 -107425
15362a07425O3570J49777j26962j8920K05750K54502J88775k92139k23586j87747
$$ -107425 -43855 105922 -21040 -39960 165790 420292 609067 316928 93342 -94405
15352i4405J6648J08M3842J15047J14041k14727k18829J56892O6431J08756M1480
$$ -94405 -77757 -77649 -33807 81240 195281 -19446 -238275 -81383 -14952 93804 135284
15341A35284j75131L02372j9614j91849j60588q6870j12039Q0408J0069j765j38968
$$ 135284 -39847 262525 242911 51062 -109526 -196396 -308435 -228027 -217958 -219723 -358691
15330c58691r0108O9653r6528J62561K18199K29101j5603J04001k82771j11059
$$ -358691 -448799 -379146 -475674 -313113 -94914 134187 118584 222585 -60186 -171245
15320a71245o5399J13275K10564J42172l1879J45660Q7246n2775j26831j6843
$$ -171245 -236644 -123369 87195 229367 197488 343148 430394 377619 250788 233945
15310B33945K5006K0007j07624J98996J18763j04263j02844k29060j10713j8857
$$ 233945 258951 278958 171334 370330 489093 384830 281986 52926 -57787 -76644
15300g6644J2548o0671o5081R0906j52326M4631K63268j25833l0658R4750N6886
$$ -76644 -64096 -124767 -189848 -98942 -251268 -206637 56631 -69202 -99860 -5110 51776
15289E1776m2614R1903R2196m8967l46983k26454j01951L7909J7647k8199J46242
$$ 51776 9162 101065 193261 144294 -202689 -429143 -531094 -493185 -475538 -503737 -357495
15278c57495J58496L6056j5099N4689l8969j26339k71875j1970J56729K3879k18960
$$ -357495 -198999 -162943 -178042 -123353 -162322 -288661 -560536 -572506 -415777 -391898 -610858
15267f10858q527J59425J21610J73378Q7547n1872k52571J7026l0329O2624L3680
$$ -610858 -619385 -459960 -338350 -164972 -77425 -129297 -381868 -364842 -395171 -332547 -298867
15256b98867J96680Q1818j29224k6930P262M5336J92408J40435j6233k71645k75791
$$ -298867 -102187 -20369 -149593 -176523 -169261 -123925 68483 208918 192685 -78960 -354751
15245c54751J13219J46762L7467j77063l2036L09431J79793j48019k16473K98956
$$ -354751 -241532 -94770 -57303 -234366 -266402 43029 222822 74803 -141670 157286
15235A57286M03115j08173k53075j27971k77150J06186L19590m8616j77358o4626
$$ 157286 560401 452228 199153 71182 -205968 -99782 219808 171192 -6166 -70792
15225g0792j79080r447k19965K65381K67020j59813j46818M5370j08830J03547
$$ -70792 -249872 -259319 -479284 -213903 53117 -106696 -253514 -208144 -316974 -213427
15215b13427m4518k34234j66732k1648K42057Q0582J18024P1154J51023J71619
$$ -213427 -257945 -492179 -658911 -680559 -438502 -357920 -239896 -168742 -17719 153900
15205A53900P6912j25739r0047j48095P6985l9333M2514L0530k5705j67803j73912
$$ 153900 230812 105073 15026 -133069 -56084 -95417 -52903 -22373 -48078 -215881 -389793
15194c89793K89845K06197n3755k11835j56724R3203l0513K0949k295k5619O132
$$ -389793 -99948 106249 52494 -159341 -316065 -222862 -253375 -232426 -234721 -260340 -254208
15183b54208K0178J39278j59502J7167J87812K28157p9431L4215k07907l02695
$$ -254208 -234030 -94752 -254254 -237087 -49275 178882 99451 133666 -74241 -376936
15173c76936j18550J0118J35938J6626o5133J42760j6166P5194Q6861P5720M8286
$$ -376936 -495486 -485368 -349430 -332804 -397937 -255177 -271343 -196149 -109288 -33568 14718
15162A4718Q5969l7384l6550m2324Q8617R265j18095j26792K44773J94826J13740
$$ 14718 100687 63303 26753 -15571 73046 82311 -35784 -162576 82197 277023 390763
15151C90763j74188O8003p5468k93944M2701N1611K46905j73932p3624k26753
$$ 390763 216575 284578 209110 -84834 -42133 9478 256383 82451 8827 -217926
15141b17926k7980m9642j23976J90731J95552J2609q474P2265j7792j33066j97869
$$ -217926 -245906 -295548 -419524 -228793 -33241 -20632 -29106 43159 25367 -107699 -305568
15130c05568j11716n0315O3631l2128l11816K39989K98588J90848k1904l9931
$$ -305568 -417284 -467599 -403968 -436096 -747912 -507923 -209335 -18487 -40391 -80322
15120h0322N2726N38l1342j11393k1696q8532J42213N3373N8940J68551Q6891
$$ -80322 -27596 -27058 -58400 -169793 -191489 -280021 -137808 -84435 -25495 143056 229947
15109B29947n437j65518P0897r3724k17469K07117J48296j9250k58089j52978
$$ 229947 224510 58992 129889 36165 -181304 25813 174109 154859 -103230 -256208
15099b56208M9134J07972j01877j53006q0937q1662J41472M14962J13874M127
$$ -256208 -207074 -99102 -200979 -353985 -434922 -516584 -375112 39850 153724 157851
15089A57851J27197l0246o4703N037q4257k3552j9667J13978J37758O6737o5629
$$ 157851 285048 254802 190099 195136 110879 87327 67660 181638 319396 386133 320504
15078C20504q8994m2115j02350P3936k31193l48494m5298O4555R517K31870N6327
$$ 320504 231510 189395 87045 160981 -70212 -418706 -464004 -399449 -389932 -158062 -101735
15067a01735k24532j61447j6249O452J76641K8063L3527o7304j22854N2054k8533
$$ -101735 -326267 -487714 -503963 -497511 -320870 -292807 -259280 -326584 -449438 -397384 -425917
15056d25917j75269J6866K34509L04985r3533J353J31518o4131k74363j29791
$$ -425917 -601186 -584320 -349811 -44826 -138359 -137006 -5488 -69619 -343982 -473773
15046d73773K23135j31107p7119L69218K53994p6819k18718J97731J38735j58107
$$ -473773 -250638 -381745 -458864 -89646 164348 87529 -131189 66542 205277 47170
15036D7170Q7495m8756J05664R3470j60560N3313K0657k61561k93227n5800j02496
$$ 47170 134665 85909 191573 285043 124483 177796 198453 -63108 -356335 -412135 -514631
15025e14631J89015K41072p6549j03552P8620j77790o4590P1947r5694q9003K39371
$$ -514631 -325616 -84544 -161093 -264645 -186025 -363815 -428405 -356458 -452152 -541155 -301784
15014c01784j20582j44291K5092J26922J03869r1279j700J87896J92787p0P1137
$$ -301784 -422366 -566657 -541565 -414643 -310774 -402053 -403753 -215857 -23070 -23140 47997
15003D7997l6275k0480R4311Q9531j58570q2404N7888k01209j74605j74785N9397
$$ 47997 11722 -8758 85553 175084 16514 -65890 -8002 -209211 -383816 -558601 -499204
14992d99204K27534k2365p878J08011K14619j07772j32419K8035J62301O6401
$$ -499204 -271670 -294035 -301913 -193902 20717 -87055 -219474 -191439 -29138 37263
14982C7263j53175K6592J19794j1370Q9598j47253j96699j5669o117j39156l083
$$ 37263 -115912 -89320 30474 19104 108702 -38551 -235250 -250919 -257036 -396192 -399275
14971c99275L09258P2500l10263n3146J61886l1522R7275J56647K8545j16802
$$ -399275 -90017 -17517 -327780 -380926 -219040 -250562 -153287 3360 31905 -84897
14961h4897P3355K00614j19479j01977m6005k9181R2554K51684j02925k49356
$$ -84897 -11542 189072 69593 -32384 -78389 -107570 -15016 236668 133743 -115613
14951a15613R001j53223j35665O2140Q2903J29453j98663J7940J11804K22075
$$ -115613 -106612 -259835 -395500 -333360 -250457 -121004 -319667 -301727 -189923 32152
14941C2152k65880k07164J544J20666K46620P2188j5022P4315j43801k52634J11497
$$ 32152 -233728 -440892 -439348 -318682 -72062 126 -14896 59419 -84382 -337016 -225519
14930b25519K09345M4902m5805k43364q5412M198K29083J87203o2542k82262j87577
$$ -225519 -16174 28728 -17077 -260441 -345853 -341655 -112572 74631 12089 -270173 -457750
14919d57750Q0099J71872M9134Q3115K22508J2802n2171p0484j09436J29491r3107
$$ -457750 -377651 -205779 -156645 -73530 148978 161780 109609 39125 -70311 59180 -33927
14908c3927j54518K57234K66226k5797k23353k1886n3749k1058q6385q6889J28082
$$ -33927 -188445 68789 335015 309218 85865 63979 10230 -10828 -97213 -184102 -56020
14897e6020j79107j92136o9565j87378K95733J57742M8931K84076Q899J8295j86620
$$ -56020 -235127 -427263 -496828 -684206 -388473 -230731 -181800 102276 111175 129470 -57150
14886e7150n3322j21287M0367Q4965j07889N493K23550j80639l0827N8443j48927
$$ -57150 -110472 -231759 -191392 -106427 -214316 -208823 14727 -165912 -196739 -138296 -287223
14875b87223N8142r2592M297J16145J21032j32225j86693K2700J95051R2378P9134
$$ -287223 -229081 -321673 -317376 -201231 -80199 -212424 -399117 -376417 -181366 -88988 -9854
14864i854J00057J08316n5911Q919j74560j4895K10514J20283j11253j53759J12200
$$ -9854 90203 198519 142608 151527 -23033 -37928 172586 292869 181616 27857 140057
14853A40057r8709j99794p5497L3967m0092n1296R1619J13182j39669Q1320J07388
$$ 140057 41348 -158446 -233943 -199976 -240068 -291364 -199745 -86563 -226232 -144912 -37524
14842c7524j47629K2023j46844n5279Q7949j1736M7280J08641J3901J29995j29046
$$ -37524 -185153 -163130 -309974 -365253 -277304 -289040 -241760 -133119 -119218 10777 -118269
14831a18269j45416M0839o8864M1291J9079l17396l7457L69202J51416m0506P255
$$ -118269 -263685 -222846 -291710 -250419 -231340 -548736 -586193 -216991 -65575 -106081 -98826
14820i8826l8897J94941P9951K35118j32259j9617J53899m00226j74530m9560
$$ -98826 -137723 57218 137169 372287 240028 220411 374310 -25916 -200446 -250006
14810b50006N7963K0095j17184l5989k54351j24827n5489L34575K82393J93717
$$ -250006 -192043 -171948 -289132 -325121 -579472 -704299 -759788 -425213 -142820 50897
14800E0897O7734j42998r9392J28502k0508J11761K8526n6844J82069j27484j83626
$$ 50897 118631 -24367 -123759 4743 -15765 95996 124522 67678 249747 122263 -61363
14789f1363R6589K05312m1892j57229k61132j24350J33188k5777m7964K3458O6709
$$ -61363 35226 240538 198646 41417 -219715 -344065 -210877 -236654 -284618 -261160 -194451
14778a94451k98174K4558Q7542J7366J05759K48856n2119L346J97398j3586m05026
$$ -194451 -492625 -468067 -380525 -363159 -257400 -8544 -60663 -57317 140081 126495 -278531
14767b78531k48863J38570K92302R4555j8602j26304K58940K47796j77961k49710
$$ -278531 -527394 -388824 -96522 -1967 -20569 -146873 112067 359863 181902 -67808
14757f7808q5765j50442k19577R798R7353J78394K7701j5757O1547J47064J31839
$$ -67808 -153573 -304015 -523592 -513794 -416441 -238047 -210346 -226103 -164556 -17492 114347
14746A14347j38641M3896J88192l7189l9660J46148P1916k30425l15820M71J98783
$$ 114347 -24294 19602 207794 170605 130945 277093 349009 118584 -197236 -196765 2018
14735B018M1773j47604p5872q3925n6257j5468K4905L5116j79299R4229J42441
$$ 2018 43791 -103813 -179685 -263610 -319867 -335335 -310430 -275314 -454613 -360384 -217943
14724b17943O1944j43266j02400j02760M3400J24679P2862l189k2294N6798j03751
$$ -217943 -155999 -299265 -401665 -504425 -461025 -336346 -263484 -266673 -288967 -232169 -335920
14713c35920m9008m0203j5334m3332L08214K69669Q2284j37416j52671l2037q2397
$$ -335920 -384928 -425131 -440465 -483797 -175583 94086 176370 38954 -113717 -145754 -228151
14702b28151M6219j5040L4623K3586L23786J85801m91297j33541N0481L6623j24922
$$ -228151 -181932 -196972 -162349 -138763 185023 370824 -120473 -254014 -203533 -166910 -291832
14691b91832o4741N4063J19355j2208j25466J05747Q2046o1636p9845m567J65144
$$ -291832 -356573 -302510 -183155 -195363 -320829 -215082 -133036 -194672 -274517 -279084 -113940
14680a13940L9016J08353k41960m52012j06963K69761K97293K24396R0052j34414
$$ -113940 -74924 33429 -208531 -660543 -767506 -497745 -200452 23944 113996 -20418
14670b0418Q6350J1535j06255n6631j33582J0243j53416j3779J81754L8582P5782
$$ -20418 65932 77467 -28788 -85419 -219001 -208758 -362174 -375953 -194199 -155617 -79835
14659g9835L7882J13071o5341o0724j17645r4506j34214J02667r4611j24565J52647
$$ -79835 -41953 71118 5777 -54947 -172592 -267098 -401312 -298645 -393256 -517821 -365174
14648c65174O4943k77285Q4831L08846K08513j06674n6817j61393k65200J74640
$$ -365174 -300231 -577516 -492685 -183839 24674 -82000 -138817 -300210 -565410 -390770
14638c90770J95770o2339o2141K60519J82948q7417j69500k2699p1868m9521j9130
$$ -390770 -195000 -257339 -319480 -58961 123987 36570 -132930 -155629 -227497 -277018 -296148
14627b96148j18122o4452J82250P8438k8676l4585k40939K18694N3383j09000
$$ -296148 -414270 -478722 -296472 -218034 -246710 -281295 -522234 -303540 -250157 -359157
14617c59157J93723P4862J23441k5918J3102k50392K21278P7113p0110P2390M1529
$$ -359157 -165434 -90572 32869 6951 20053 -230339 -9061 68052 -2058 70332 111861
14606A11861L0108j23134K4449O8198J76545p6409j10660l03732J33161J79675
$$ 111861 141969 18835 43284 111482 288027 211618 100958 -202774 -69613 110062
14596A10062j16274J24813k18472k57079k7850L05761P8368j16292j00563m1822
$$ 110062 -6212 118601 -99871 -356950 -384800 -79039 -671 -116963 -217526 -259348
14586b59348J95595n477o5543Q052j05297n4459K11629p0170R2783K541j37191
$$ -259348 -63753 -69230 -134773 -126721 -232018 -286477 -74848 -145018 -52235 -49694 -186885
14575a86885n5616Q1763k02588j49043J78332L461k19121j38284P2083k6824J32877
$$ -186885 -242501 -160738 -363326 -512369 -334037 -330576 -549697 -687981 -615898 -642722 -509845
14564e09845K58275J38745J11099l3333J24631K6631k58965j40243J37900l4698
$$ -509845 -251570 -112825 -1726 -35059 89572 116203 -142762 -283005 -145105 -179803
14554a79803r7096O5799J8532p491J83152j32042j34146k8936K68224J09638P804
$$ -179803 -276899 -211100 -192568 -200059 -16907 -148949 -283095 -312031 -43807 65831 73635
14543G3635j34445j05200k16547k17443M3229P4428O453J00822j82977j17150
$$ 73635 -60810 -166010 -382557 -600000 -556771 -482343 -475890 -375068 -558045 -675195
14533f75195J22970K08213L90409k3780l09097k8496K48363m6625k17115J9259
$$ -675195 -552225 -344012 46397 22617 -286480 -314976 -66613 -113238 -330353 -311094
14523c11094O0903O4978K7009k9140m328j46564m4423K9941N3289K45438J426
$$ -311094 -250191 -185213 -158204 -187344 -191672 -338236 -382659 -352718 -299429 -53991 -52565
14512e2565O8448R4888j45065n6484m5886o9141J88356R2798k72027j48042L03363
$$ -52565 15883 110771 -34294 -90778 -136664 -205805 -17449 75349 -196678 -344720 -41357
14501d1357J36971k79755K062J99660J7109j45362j48966j04802o7202J39164
$$ -41357 95614 -184141 -182079 17581 34690 -110672 -259638 -364440 -431642 -292478
14491b92478J72071L8763M6705k96628j89162J06694J91117J22238k19291j65482
$$ -292478 -120407 -81644 -34939 -331567 -520729 -414035 -222918 -100680 -319971 -485453
14481d85453m7207j23151K18179O637o0920J36L5588L27273J55889j58455j33276
$$ -485453 -532660 -655811 -437632 -430995 -491915 -491779 -456191 -128918 26971 -131484 -264760
14470b64760J10714K5569j35012K0940R1886n2147m8059J45697K18091P0510P2546
$$ -264760 -154046 -128477 -263489 -242549 -150663 -202810 -250869 -105172 112919 183429 255975
14459B55975J948k8685K59164k5939j97622k42152j24041J82046J2875P4906r35
$$ 255975 257923 229238 488402 462463 264841 22689 -101352 80694 93569 168475 167540
14448A67540j2434J50759j7158k82874j82652N5104N5451q1698j39056j24448
$$ 167540 155106 305865 288707 5833 -176819 -121715 -66264 -147962 -287018 -411466
14438d11466J87272Q0050j91791M7654J40209J35138J4815k11844P5160J84601
$$ -411466 -224194 -144144 -335935 -288281 -148072 -12934 1881 -209963 -134803 49798
14428D9798O9750o2742J8929n2627j0124N5429K5783P1734j43406J5550J05920
$$ 49798 119548 56806 75735 23108 12984 68413 94196 165930 22524 38074 143994
14417A43994n7778k59544r6491m196J13693k2375M1674k5537q1099j69431L49178
$$ 143994 86216 -173328 -269819 -274015 -160322 -182697 -141023 -166560 -247659 -417090 -67912
14406f7912J26453j78642j47860j90382p3426m100J00575o990J10646j70485K51632
$$ -67912 58541 -120101 -267961 -458343 -531769 -535869 -435294 -442284 -331638 -502123 -250491
14395b50491J96907N0957L2015n7510j60781r598o7431L9955N4034p6630M9684
$$ -250491 -53584 -2627 29388 -28122 -188903 -198501 -265932 -225977 -171943 -248573 -198889
14384a98889M6665l794j69097m1865L22622j80228j34226l3233J6399L0744j50887
$$ -198889 -152224 -156018 -325115 -366980 -44358 -224586 -358812 -392045 -375646 -344902 -495789
14373d95789M1239O8964m4478K61943l5345j83435j49320M5871J99926L29600
$$ -495789 -454550 -385586 -430064 -168121 -203466 -386901 -536221 -490350 -290424 39176
14363C9176p4528j65088m2475j78275j10228l7958K38313J46325j05573j30644
$$ 39176 -35352 -200440 -242915 -421190 -531418 -569376 -331063 -184738 -290311 -420955
14353d20955j27649n0220K01000P5380O2481m423p3948J50804J1670K25215q620
$$ -420955 -548604 -598824 -397824 -322444 -259963 -264386 -338334 -187530 -175860 49355 40735
14342D0735j67463O8463n7154j12099j30707P9728K91674l8008j86974o4121o4609
$$ 40735 -126728 -58265 -115419 -227518 -358225 -278497 13177 -24831 -211805 -275926 -340535
14331c40535p91p946j43744K07654o5643j93193J04166J94272Q3560J14712J15369
$$ -340535 -341326 -349272 -493016 -285362 -351005 -544198 -440032 -245760 -162200 -47488 67881
14320F7881M6812j56014l85012L0262M3338k43866N4577K61375j03764j3887N0190
$$ 67881 114693 -41321 -426333 -396071 -352733 -596599 -542022 -280647 -384411 -398298 -348108
14309c48108J9617k10788m3023L03424L23347j17732k28496j09104K3249L26828
$$ -348108 -328491 -539279 -582302 -278878 44469 -73263 -301759 -410863 -387614 -60786
14299f0786K23990o9110j19185K02321j06761r6558Q4461p7179n7929J43671M2454
$$ -60786 163204 94094 -25091 177230 70469 -26089 58372 -18807 -76736 66935 109389
14288A09389j46306K1031J94515J7375J55549O506K5019K21912l6642l95152j21139
$$ 109389 -36917 -15886 178629 196004 351553 358059 383078 604990 568348 173196 52057
14277E2057R5329J07009j15852j85099K3990j24438l0417J41989J4269J3980k008
$$ 52057 147386 254395 138543 -46556 -22566 -147004 -177421 -35432 -21163 -7183 -9191
14266i191j95754p1868J41837r6392j18376L48049R3019j6513j55932N0662J31182
$$ -9191 -204945 -276813 -134976 -231368 -349744 -1695 91324 74811 -81121 -30459 100723
14255A00723N2588j85965K2456J00712M7390k4107O2324m17499j88314L52190
$$ 100723 153311 -32654 -10198 90514 137904 113797 176121 -241378 -429692 -77502
14245g7502P9492l12008j23188R7692J50626O4389R613O7813K20222K11041l87552
$$ -77502 1990 -310018 -433206 -335514 -184888 -120499 -110886 -43073 177149 388190 638
14234F38r8382J59853r843J10429O6056j90583k59548j73897l4228R8534L51695
$$ 638 -97744 62109 52266 162695 228751 38168 -221380 -395277 -429505 -330971 20724
14223B0724J80681j6934k10668k00700q3976j2933R1536P6170J15458M1038N599
$$ 20724 201405 184471 -26197 -226897 -310873 -323806 -232270 -156100 -40642 396 5995
14212E995r4112P3704j10517j47980P2652J01507N4339k67631q6053r8103K05344
$$ 5995 -88117 -14413 -124930 -272910 -200258 -98751 -44412 -312043 -398096 -496199 -290855
14201b90855M83365L7202l37137L8390M0613K34347k33140o9900J57159M4341
$$ -290855 192510 229712 -107425 -69035 -28422 205925 -27215 -97115 60044 104385
14191A04385j93277j28475O1715J52121J2920k31936j52200K23997J64574p6944
$$ 104385 -88892 -217367 -155652 -3531 9389 -222547 -374747 -150750 13824 -63120
14181f3120J49209P2153Q9631j33372p8430J59808J63351q451l6204l7115J39489
$$ -63120 86089 158242 247873 114501 36071 195879 359230 350779 314575 277460 416949
14170D16949k11631J0746J88159M0178K27725j98384k10641J7533n4083j16813
$$ 416949 205318 216064 404223 444401 672126 473742 263101 280634 226551 109738
14160A09738m9525k2561j78748j0475p0962j80521M3356J82665K39137Q8498J04937
$$ 109738 60213 37652 -141096 -151571 -222533 -403054 -359698 -177033 62104 150602 255539
14149B55539M0038j69921N8698J18396O1213q208k00113k62145K27806P0112k01216
$$ 255539 295577 125656 184354 302750 363963 355755 155642 -106503 121303 191415 -9801
14138i801j28054o2709n2577K83008O0164r073p5633j41954k37729l5637N2544
$$ -9801 -137855 -200564 -253141 29867 90031 80958 5325 -136629 -374358 -409995 -357451
14127c57451j66336R5958J65334J34422j77906Q2877J21412M6635r3156M3407
$$ -357451 -523787 -427829 -262495 -128073 -305979 -223102 -101690 -55055 -148211 -104804
14117a04804L675O3819J43124j22415k09671K6526J19647P1862P0349j14128L8802
$$ -104804 -101129 -37310 105814 -16601 -226272 -199746 -80099 -8237 62112 -52016 -13214
14106a3214k54399j55801N114j54204J7318J60682J60686o7629q2130L19540K38689
$$ -13214 -267613 -423414 -418300 -572504 -555186 -394504 -233818 -301447 -383577 -64037 174652
14095A74652j798k9610j17766m4307J4264q0840k07081j44871K05581N376l6727
$$ 174652 172854 143244 25478 -18829 -4565 -85405 -292486 -437357 -231776 -226400 -263127
14084b63127k83275J73266R1922j34787l4851Q3797P7525J77301p0326K42846
$$ -263127 -546402 -373136 -281214 -416001 -450852 -367055 -289530 -112229 -182555 60291
14074F0291J7022J1708j47821J10928J42073L730k13938j15203l7648O2761K69340
$$ 60291 77313 89021 -58800 52128 194201 197931 -16007 -131210 -168858 -106097 163243
14063A63243j38639m2889M228o2155N5149j22870M9794j18066j1738P9229J0349
$$ 163243 24604 -18285 -14057 -76212 -21063 -143933 -94139 -212205 -223943 -144714 -134365
14052a34365J3755J27230p3041l50804q7828K97389J14827p7544k27093O9422
$$ -134365 -120610 6620 -66421 -417225 -505053 -207664 -92837 -170381 -397474 -328052
14042c28052K03715j1834k52136K0260K54857K3085n2170J12701l1926l4447R4197
$$ -328052 -124337 -136171 -388307 -368047 -113190 -90105 -142275 -29574 -61500 -95947 -1750
14031a750O3713Q573n9781o6382k2908m3932K278K71189J94359J0234q8254p9004
$$ -1750 61963 70536 10755 -55627 -78535 -122467 -120189 151000 345359 355593 267339 188335
14019A88335j52597q4664j09818J96698J14230j09338O3927J30695k49177m04169
$$ 188335 35738 -48926 -158744 37954 152184 42846 106773 237468 -11709 -415878
14009d15878r3180K66445n4164q3031R3730L4442n8417j0806L1550J05753K0168
$$ -415878 -509058 -242613 -296777 -379808 -286078 -251636 -310053 -320859 -289309 -183556 -163388
13998a63388J9352o1969O8566j45666P2936l2177j84802K92925J37694j63415
$$ -163388 -144036 -206005 -137439 -283105 -210169 -242346 -427148 -134223 3471 -159944
13988a59944o8701K19314k23088j43306P4674J93191q7458K06051L02348l8317
$$ -159944 -228645 -9331 -232419 -375725 -301051 -107860 -195318 10733 313081 274764
13978B74764n00682l15620N5244j8681m2994J45260K38028j1545o9170l330j70598
$$ 274764 -225918 -541538 -486294 -504975 -547969 -402709 -164681 -176226 -245396 -248726 -419324
13967d19324J9094p1167O5145J61268K9620j08442J07380j65957j0794J61855
$$ -419324 -400230 -471397 -406252 -244984 -215364 -323806 -216426 -382383 -393177 -231322
13957b31322m0681o2346M9757Q1853J03365J77672j27458Q1691K73383m7029k6816
$$ -231322 -272003 -334349 -284592 -202739 -99374 78298 -49160 32531 305914 258885 232069
13946B32069k15133o4764J28691j72662q4074j17555M6970j09130Q7158M9373
$$ 232069 16936 -47828 80863 -91799 -175873 -293428 -246458 -355588 -268430 -219057
13936b19057j12576j28700K9889j43441R3789L68075K82661m9138j88327L1897
$$ -219057 -331633 -460333 -430444 -573885 -480096 -112021 170640 121502 -66825 -34928
13926c4928J2553k17057k64406K52124K59221r7311J07375J6321Q9622J8258l11591
$$ -34928 -22375 -239432 -503838 -251714 7507 -89804 17571 33892 123514 141772 -169819
13915a69819k31195K15823m0914q9784m1192N8817j15232q1469l2074R1430N9602
$$ -169819 -401014 -185191 -226105 -315889 -357081 -298264 -413496 -494965 -527039 -435609 -376007
13904c76007N8407k703j78704K21204J19161n2838m3435M5439m9569K05441r2816
$$ -376007 -317600 -320303 -499007 -277803 -158642 -211480 -254915 -209476 -259045 -53604 -146420
13893a46420j63845n5676J68975K39302Q6390N7559o9043M4755j25050j60118
$$ -146420 -310265 -365941 -196966 42336 128726 186285 117242 161997 36947 -123171
13883a23171j43527J75323q1033j28012J11669J93804L22799P9712j87307m98604
$$ -123171 -266698 -91375 -172408 -300420 -188751 5053 327852 407564 220257 -278347
13873b78347j93021J6059R8387K23620P2621k36656j12848j558M2986K27693K33774
$$ -278347 -471368 -455309 -356922 -133302 -60681 -297337 -410185 -411743 -368757 -141064 92710
13862I2710N2509j7696J00741k39848j73028j3261o8022j68695R226K0832j49665
$$ 92710 145219 127523 228264 -11584 -184612 -197873 -265895 -434590 -425364 -404532 -554197
13851e54197K965J68555Q9470q3755k7241K02342m4116Q5979R1543j27468j15588
$$ -554197 -551232 -382677 -293207 -376962 -404203 -201861 -245977 -159998 -68455 -195923 -311511
13840c11511r5533O0433J47690J48148J28100j80748k35495K4591N0624K4181
$$ -311511 -407044 -346611 -198921 -50773 77327 -103421 -338916 -314325 -263701 -239520
13830b39520j21677j12495J83557J86813K1973p8602j43898j40287k5947J44905
$$ -239520 -361197 -473692 -290135 -103322 -81349 -159951 -303849 -444136 -470083 -325178
13820c25178L49145J1861r8530j51264j47504K32731J29425j6113k1739J38522
$$ -325178 23967 35828 -62702 -213966 -361470 -128739 686 -15427 -37166 101356
13810A01356K70359j84986k75299j05676R5956n2211N8545K4381n349j26408o2193
$$ 101356 371715 186729 -88570 -194246 -98290 -150501 -91956 -67575 -72924 -199332 -261525
13799b61525K6764N9940R9782J46714l8431j86601k745j09097K26166L05713J89065
$$ -261525 -234761 -174821 -75039 71675 33244 -153357 -156102 -265199 -39033 266680 455745
13788D55745j7448N4385k77643R951J71727o3764l15915j03476l9277K64747K24419
$$ 455745 438297 492682 215039 224990 396717 332953 17038 -86438 -125715 139032 363451
13777C63451J20484j07297k36208k36608n2608R5944J01916J08230R6654j36522
$$ 363451 483935 376638 140430 -96178 -148786 -52842 49074 157304 253958 117436
13767A17436k50590p9605j64190j1216K68302j18850j21546j19959j0177J18548
$$ 117436 -133154 -212759 -376949 -388165 -119863 -238713 -360259 -480218 -490395 -371847
13757c71847J7242j04908Q3952K46593j5786J8845J48924J17759m829J35645m7137
$$ -371847 -354605 -459513 -375561 -128968 -144754 -125909 23015 140774 135945 271590 224453
13746B24453J59941p8921j01751k42368J49333J45793j03733l9637Q154q3355
$$ 224453 384394 305473 203722 -38646 110687 256480 152747 113110 121264 37909
13736C7909j67806R5389P1919m4235o4724R4924K8637j65409J8453N5507j74246
$$ 37909 -129897 -34508 37411 -6824 -71548 23376 52013 -113396 -94943 -39436 -213682
13725b13682k69720j96133O3885L47107J35792k26390O6531M47480O7932j25180
$$ -213682 -483402 -679535 -615650 -268543 -132751 -359141 -292610 154870 222802 97622
13715I7622P9676k8531k10613k8855J02357J96910J81124l27454k28586R6732
$$ 97622 177298 148767 -61846 -90701 11656 208566 389690 62236 -166350 -69618
13705f9618m3897j05567m8671j65936k44342R6138J97950j6219n7473J7991Q859
$$ -69618 -113515 -219082 -267753 -433689 -678031 -581893 -383943 -400162 -457635 -439644 -430785
13694d30785k4664O0923j75073K0685j8176o7202J47659Q2001J36079o0200j20390
$$ -430785 -455449 -394526 -569599 -548914 -567090 -634292 -486633 -404632 -268553 -328753 -449143
13683d49143j10573m7570J99174p1935M9806K33328M0373j24066N8062J38235
$$ -449143 -559716 -607286 -408112 -480047 -430241 -196913 -156540 -280606 -222544 -84309
13673h4309K52513j29815j00145j36666J13781J9567l09058K3163l8582N3088
$$ -84309 168204 38389 -61756 -198422 -84641 -65074 -374132 -350969 -389551 -336463
13663c36463L38247J06788q1739j02054J00509J35337j40408j03139J81448J00210
$$ -336463 1784 108572 26833 -75221 25288 160625 20217 -82922 98526 198736
13653A98736r5596J0708M0009k18858k13609k0859J84893r24k12747J49341M2785
$$ 198736 103140 113848 153857 -65001 -278610 -299469 -114576 -115500 -328247 -178906 -136121
13642a36121K50056J21169o3134n4553q3086p5142j28443K50149K02574l2094
$$ -136121 113935 235104 171970 117417 34331 -40811 -169254 80895 283469 251375
13632B51375k23993K1663J09984k2794j10575j61862J4722j71439j86171L38065
$$ 251375 27382 49045 159029 136235 25660 -136202 -121480 -292919 -479090 -141025
13622a41025K03513L21567L44294N1366m54023m41863P3249J33711J44607L2091
$$ -141025 62488 384055 728349 779715 325692 -116171 -42922 90789 235396 267487
13612B67487k73043j89684k3342J13139P0541J8797l05183J32408L10227M1588
$$ 267487 -5556 -195240 -218582 -105443 -34902 -16105 -321288 -188880 121347 162935
13602A62935m5266q0258k7002K00229j33984r4144j03219o4404o2300N2319K22367
$$ 162935 117669 37411 10409 210638 76654 -17490 -120709 -185113 -247413 -195094 27273
13591B7273J3824j75114j1771K78531j49940p5767j55154K47734K45553k17536
$$ 27273 41097 -134017 -145788 132743 -17197 -92964 -248118 -384 245169 27633
13581B7633k31658j18987J53878J2900j6779Q6548K68721J85908k63075R2287
$$ 27633 -204025 -323012 -169134 -156234 -173013 -86465 182256 368164 105089 197376
13571A97376M7175j04187j10097R4742l3552j03668j95236J00125J45033R9849
$$ 197376 244551 140364 30267 125009 91457 -12211 -207447 -107322 37711 137560
13561A37560P1853l7483j17267J99656J79475j40210p300l6718l311o689j86430
$$ 137560 209413 171930 54663 254319 433794 293584 286284 249566 246255 239566 53136
13550E3136k41013k27125p5436L87963M7881L772j34915P7125J34508j79440l98809
$$ 53136 -187877 -415002 -490438 -102475 -54594 -50822 -185737 -108612 25896 -153544 -552353
13539e52353n2806J62830R3721N2957J42898j21494o0925J96647P8898L65353
$$ -552353 -605159 -442329 -348608 -295651 -152753 -274247 -335172 -138525 -59627 305726
13529C05726J94164n317p7666k17081j45750j4644j13924k86437j6846J28970
$$ 305726 499890 494573 416907 199826 54076 39432 -74492 -360929 -377775 -248805
13519b48805N0596J21711K0320r0003J02201R5552q9459p294J3268L3736J3748
$$ -248805 -198209 -76498 -56178 -146181 -43980 51572 -37887 -45181 -31913 1823 15571
13508A5571M02149q7065j49135j12392k6737m4576j34702J30896J14084j13229
$$ 15571 417720 330655 181520 69128 42391 -2185 -136887 -5991 108093 -5136
13498e136j64773O2159J60397n2345O3023M3669l079j1029j48894P8188l5632
$$ -5136 -169909 -107750 52647 302 63325 106994 103915 92886 -56008 22180 -13452
13487a3452J68023j28053j80606J7536R775J24773k6715k15256J81824N2145k6269
$$ -13452 154571 26518 -154088 -136552 -126777 -2004 -28719 -243975 -62151 -10006 -36275
13476c6275j78930j25715p6677J9285R7255o078J961R7884O3211q3443j65565
$$ -36275 -215205 -340920 -417597 -398312 -301057 -307135 -305174 -207290 -144079 -227522 -393087
13465c93087j5725J22736l4962J40878J39623J72424j65501p6319P8759o3505
$$ -393087 -408812 -286076 -321038 -180160 -40537 131887 -33614 -109933 -31174 -94679
13455i4679K5381J99395j12495m54868Q1796L42524J19056J10433j40457j86422
$$ -94679 -69298 130097 17602 -437266 -355470 -12946 106110 216543 76086 -110336
13445a10336J50950n4688q1722j16249P6323j21273P4845J24799N3945n2562j77577
$$ -110336 40614 -14074 -95796 -212045 -135722 -256995 -182150 -57351 -3406 -55968 -233545
13434b33545J98985J84080R2721J72075J4062J9278j44111r797j24319l72590
$$ -233545 -34560 149520 242241 414316 428378 447656 303545 293748 169429 -203161
13424b03161l82083Q9505K65135N7184k9772O7501K72747K6985j4208J39226q0771
$$ -203161 -585244 -495739 -230604 -173420 -203192 -135691 137056 164041 149833 289059 208288
13413B08288k8124q2317j6566j13072M921J49743J33111K5075o5881o2111o8544
$$ 208288 180164 97847 81281 -31791 -26870 122873 255984 281059 215178 153067 84523
13402H4523j0595J87569p8884m0895J33544M1571j67852N525J6186j62239j15697
$$ 84523 73928 261497 182613 141718 275262 316833 148981 154506 170692 8453 -107244
13391a07244j28638J9694K66226P6482k5414Q1939O9363j01850r0559L6529K21919
$$ -107244 -235882 -216188 50038 126520 101106 183045 252408 150558 59999 96528 318447
13380C18447j00723K07581M8795q7873m7744N824j04013M2598P7035j90146j08622
$$ 318447 217724 425305 474100 386227 338483 344307 240294 282892 359927 169781 61159
13369F1159k81803J4497K20010j98981j21265K99709J51000j94112P340M315J13278
$$ 61159 -220644 -206147 13863 -185118 -306383 -6674 144326 -49786 -42446 -38131 75147
13358G5147M7359J02952K8247k9232P6231l00720j36092O4677L4068J7770N0034
$$ 75147 122506 225458 253705 224473 300704 -16 -136108 -71431 -37363 -19593 30441
13347C0441k3728q7468O8218J9630M7089k9528k07909O8439J68556O0847j77896
$$ 30441 6713 -80755 -12537 7093 54182 24654 -183255 -114816 53740 114587 -63309
13336f3309j57271J02565L38913p0822j84127P4652j02723J16800N8402j98989
$$ -63309 -220580 -118015 220898 150076 -34051 40601 -62122 54678 113080 -85909
13326h5909K212L14358j7377j06030O1556o5156q5829N2449J15620j31237j07672
$$ -85909 -83697 230661 213284 107254 168810 103654 17825 70274 185894 54657 -53015
13315e3015J98802L9037j64265J72714l8707j26569q1890M4492j30306p9551N7813
$$ -53015 145787 184824 20559 193273 154566 27997 -53893 -9401 -139707 -219258 -161445
13304a61445L9610N1805P1734N5981j29790J08343Q5260j29419k7488j41846L06224
$$ -161445 -121835 -70030 1704 57685 -72105 36238 121498 -7921 -35409 -177255 128969
13293A28969N9264k68906j33419K803J23488K11973j86675j14669n1101K25902
$$ 128969 188233 -80673 -214092 -211289 -87801 124172 -62503 -177172 -228273 -2371
13283b371K00049k39314k01721Q4428o3390M2759J71687o1651M5261R5157n9372
$$ -2371 197678 -41636 -243357 -158929 -222319 -179560 -7873 -69524 -24263 70894 11522
13272A1522O1952k8999j54352R8575k8073j00666M9293Q8537K9409J36062m3207
$$ 11522 73474 44475 -109877 -11302 -39375 -140041 -90748 -2211 27198 163260 120053
13261A20053m2014J06524j8603O4587L2666q8907j107l29127l7504N8213J82898
$$ 120053 78039 184563 165960 230547 263213 174306 173199 -155928 -193432 -135219 47679
13250D7679J08768j092k69480l87684K8809Q374j53924n1188J76403K02649O4874
$$ 47679 156447 155355 -114125 -501809 -473000 -464626 -618550 -669738 -493335 -290686 -225812
13239b25812J11554p4775l29265m2899M1668J50638Q5381K18070J41481K69307
$$ -225812 -114258 -189033 -518298 -561197 -519529 -368891 -283510 -65440 76041 345348
13229C45348j1266j83358j05652L1763R9234L6784q4141J44357J37427n4108j47985
$$ 345348 334082 150724 45072 76835 176069 212853 128712 273069 410496 356388 208403
13218B08403j32548k2412j18991J46643O5488M1840r3652M2055M9130j04713j15057
$$ 208403 75855 53443 -65548 81095 146583 188423 94771 136826 185956 81243 -33814
13207c3814R2018q6461l7170J48960K80461k91634o8521J34145P6408K01132j03937
$$ -33814 58204 -28257 -65427 83533 363994 72360 3839 137984 214392 415524 311587
13196C11587J3321J07863R73m4283j52715l0051K18784J60303L45170K25568L06220
$$ 311587 324908 432771 433744 389461 236746 206695 425479 585782 930952 1156520 1462740
13185A462740K75150K46212N5171n0210l95309l79273r3924j16407k99944j74113
$$ 1462740 1737890 1984102 2039273 1989063 1593754 1214481 1120557 1004150 704206 530093
13175E30093P0580O2927j92795k70248M5364L10710K73006Q1978P5618J15504
$$ 530093 600673 663600 470805 200557 245921 556631 829637 911615 987233 1102737
13165A102737p4411j14945n1115K76900K48373k1338q7869J90854J58355J30866
$$ 1102737 1028326 913381 862266 1139166 1387539 1366201 1278332 1469186 1627541 1758407
13155A758407J94436K30811J36283j86224p9181k37516p6475M6722j1637k50881
$$ 1758407 1952843 2183654 2319937 2133713 2054532 1817016 1740541 1787263 1775626 1524745
13145A524745m2811k5579K0323q1784J10450j21045j02295N1942J00250k33067
$$ 1524745 1481934 1456355 1476678 1394894 1505344 1384299 1282004 1333946 1434196 1201129
13135A201129l82301j78986J56538J5863n497M8434k0676J05369o0869O9378R4410
$$ 1201129 818828 639842 796380 812243 806746 855180 834504 939873 879004 948382 1042792
13124A042792o8482J63233L42287L75995J65802n6282j18499n01329l76820n7032
$$ 1042792 974310 1137543 1479830 1855825 2021627 1965345 1846846 1345517 968697 911665
13114I11665l18167m4264P9885j07168k4791j02012j08069J16165O4146J16502
$$ 911665 593498 549234 629119 521951 497160 395148 287079 403244 467390 583892
13104E83892p6039j1983j12142M2880K9130j22183P4866o7842j41280J34211L2365
$$ 583892 507853 495870 383728 426608 455738 333555 408421 340579 199299 333510 365875
13093C65875j79487r4439k15210J89993K19150J6827q9605K05364J10571j34128
$$ 365875 186388 91949 -123261 66732 285882 302709 213104 418468 529039 394911
13083C94911j60782k13652k05249m2632Q9922j66522J03412O1842r1807O6841
$$ 394911 234129 20477 -184772 -227404 -137482 -304004 -200592 -138750 -230557 -163716
13073a63716O52K5933n0273N0139J64609J40369r6909J53929J40546J18860j88681
$$ -163716 -163064 -137131 -187404 -137265 27344 167713 70804 224733 365279 484139 295458
13062B95458r4459j60637n8555R443J25512K7502m0475J40861q2583j70853J52625
$$ 295458 200999 40362 -18193 -8750 116762 144264 103789 244650 162067 -8786 143839
13051A43839K58546N0257J88041j27165k70979m1248j4629r0689k6439l72066
$$ 143839 402385 452642 640683 513518 242539 201291 186662 95973 69534 -302532
13041c02532M5355K67566K01722J6846J82331k0531j74085j6090k5591M3876j77756
$$ -302532 -257177 10389 212111 228957 411288 390757 216672 200582 174991 218867 41111
13030D1111k08717Q8779J67328L6398k9445l2776j17089O0980J07928M0118L4650
$$ 41111 -167606 -78827 88501 124899 95454 62678 -54411 6569 114497 154615 189265
13019A89265j00316Q518k9460l49217j8631Q7522L35186k6483j89125J94499o5095
$$ 189265 88949 97467 68007 -281210 -299841 -212319 122867 96384 -92741 101758 36663
13008C6663j06321P6665k39J04415J16445q2824j81518j40626j2054J10997J05839
$$ 36663 -69658 7007 6768 111183 227628 144804 -36714 -177340 -189394 -78397 27442
12997B7442O3838r683j19855J11119K20105O8264j91959k28104j10926R2429R4901
$$ 27442 91280 81597 -38258 72861 292966 361230 169271 -58833 -169759 -77330 17571
12986A7571o9280Q7184K8874M8209J71067n0866j37641R454J93935Q5863J13539
$$ 17571 -51709 35475 64349 112558 283625 232759 95118 104572 298507 384370 497909
12975D97909k60007k00104J82991K63132j54471j02891l9031k1899j00823j13374
$$ 497909 237902 37798 220789 483921 329450 226559 187528 165629 64806 -48568
12965d8568N7908J06598P6927J99700p7738j34481J17686J5682j02438L9944P6621
$$ -48568 9340 115938 192865 392565 314827 180346 298032 313714 211276 251220 327841
12954C27841P0058K47495J08822j5597q7994J1310l1578K2973J915m6204L0762
$$ 327841 397899 645394 754216 738619 650625 661935 630357 653330 655245 609041 639803
12943F39803O607Q013k29297j04983J13642J27433k29844j10559j15098j0105
$$ 639803 646410 654423 425126 320143 433785 561218 331374 220815 105717 95612
12933I5612O0342k11342k8902M5500J97282L41477L5351P0209J24897R0631K6102
$$ 95612 155954 -55388 -84290 -38790 158492 499969 535320 605529 730426 821057 847159
12922H47159k30693j08460j46227r0207J4994p6932J47755J36751j86533m01021
$$ 847159 616466 508006 361779 271572 286566 209634 357389 494140 307607 -93414
12912i3414O978L05595K33472P3358j51495l8288J16262j94634o002R580n018
$$ -93414 -86436 219159 452631 525989 374494 336206 452468 257834 251832 261412 256394
12901B56394P3409j13365k42879J03101J57108R8520L6415R5831n8955k44709
$$ 256394 329803 216438 -26441 76660 233768 332288 368703 464534 405579 160870
12891A60870O2960K0426O1755J07398o9302J52262J44985j12889O3009k39901
$$ 160870 223830 244256 306011 413409 344107 496369 641354 528465 591474 351573
12881C51573r8346J31603L6601L7673j52219j73626J02775l4431R6995J78580
$$ 351573 253227 384830 421431 459104 306885 133259 236034 201603 298598 477178
12871D77178Q2757k19341r406M31526j68667l33410j61214k51610J24608R5247
$$ 477178 559935 340594 331188 762714 594047 260637 99423 -152187 -27579 67668
12861F7668J77640K90295L1246J13958L7809j24761j85354J84344J53165M60870
$$ 67668 245308 535603 566849 680807 718616 593855 408501 592845 746010 1206880
12851A206880Q1324r5350R5058j27451j03825p8908n994L02141k8994r5306j93924
$$ 1206880 1288204 1192854 1287912 1160461 1056636 977728 971734 1273875 1244881 1149575 955651
12840I55651r4835J65311J95927K01763k09849p4838J30040N1645j07794P2454
$$ 955651 860816 1026127 1222054 1423817 1213968 1139130 1269170 1320815 1213021 1285475
12830A285475J03550J88828L026j96166o7195n2948J35164K59118L4004m9845
$$ 1285475 1389025 1577853 1580879 1384713 1317518 1264570 1399734 1658852 1692856 1643011
12820A643011J40347K1409p5109J78886J73466k02141N1883N4649o101j4421J79697
$$ 1643011 1783358 1804767 1729658 1908544 2082010 1879869 1931752 1986401 1980300 1965879 2145576
12809B145576N7235K32158J25940L0691j24154k7934j43309j28209j2417L66678
$$ 2145576 2202811 2434969 2560909 2591600 2467446 2439512 2296203 2167994 2155577 2522255
12799B522255P2540L7584q2101K4305K57701J47453J08745K11061K47047L06530
$$ 2522255 2594795 2632379 2550278 2574583 2832284 2979737 3088482 3299543 3546590 3853120
12789C853120m3218j25231P7868k6897J46046J09088J3947K5057p7269k30163
$$ 3853120 3809902 3684671 3762539 3735642 3881688 3990776 4004723 4029780 3952511 3722348
12779C722348M84236L20815j98221J96095K32996K49048K19979J42802J33506
$$ 3722348 4206584 4527399 4329178 4525273 4758269 5007317 5227296 5370098 5503604
12770E503604j31626L4374L63315J60043o9536P5318K37584L18042L16324K62952
$$ 5503604 5371978 5406352 5769667 5929710 5860174 5935492 6173076 6491118 6807442 7070394
12760G070394M50193K90432M97090K95065L31769L10382O61331Q60492P42698
$$ 7070394 7520587 7811019 8308109 8603174 8934943 9245325 9906656 10767148 11509846
12751A1509846Q38945R42022J264756J455337J537040J671001J916831K052115
$$ 11509846 12348791 13290813 14555569 16010906 17547946 19218947 21135778 23187893
12743B3187893K265620L084055L841910M919191O362127Q530348J2344979J7345280
$$ 23187893 25453513 28537568 32379478 37298669 43660796 52191144 64536123 81881403
12735H1881403K4357457L4631779M6175230N5185028N5168699M3278253J9426321
$$ 81881403 106238860 140870639 187045869 242230897 297399596 340677849 360104170
12728C60104170j2490121l9803608n0725573m6887262l6509260k6092467j7793730
$$ 360104170 347614049 307810441 257084868 210197606 173688346 147595879 129802149
12721A29802149j2128426p649864m438997k069317K84857L107416N931659R599861
$$ 129802149 117673723 110023859 105584862 103515545 103800402 106907818 112839477 122439338
12713A22439338J3382263J7180696K0230370K1740735K1072492J8119694J3695762
$$ 122439338 135821601 153002297 173232667 194973402 216045894 234165588 247861350
12706B47861350R866052R142274J2249847J9741420L0441090L9518348M1594555
$$ 247861350 257727402 266869676 279119523 298860943 329302033 368820381 410414936
12699D10414936L2110957J1739395j4323655l6960301m5249593l9011100k6345619
$$ 410414936 442525893 454265288 439941633 402981332 357731739 318720639 292375020
12692B92375020j4427992n874736n38150K211185J923044j278493o471374j3225108
$$ 292375020 277947028 272072292 271534142 273745327 275668371 274389878 267918504 254693396
12684B54693396j8363572k0925234k0768940j8456235j4813892j1041436p309032
$$ 254693396 236329824 215404590 194635650 176179415 161365523 150324087 143015055
12677A43015055l999872n1529L932425Q318442J4660217K3142218L4212071M7341662
$$ 143015055 139015183 138963654 142896079 151214521 165874738 189016956 223229027 270570689
12669B70570689N8071576O0069739M7569565K2094407j2317962m5853023o3924229
$$ 270570689 328642265 388712004 436281569 458375976 446058014 400204991 336280762
12662C36280762o1606659m8814337l5785107k5976056j8864333j3924534j0728921
$$ 336280762 274674103 225859766 190074659 164098603 145234270 131309736 120580815
12655A20580815q845215p895371o969764o069182n236361m789794m321832m066028
$$ 120580815 111735600 103840229 96870465 90801283 85564922 80775128 76453296 72387268
12647G2387268l908295l498148l048679k714592k615752k276955j810774j745012
$$ 72387268 68478973 64980825 61932146 59217554 56601802 54324847 52514073 50769061
12639E0769061j719205j637861j191043q91652j140243j083689o95658q39233
$$ 50769061 49049856 47411995 46220952 45329300 44189057 43105368 42409710 41570477
12631D1570477r37477r00288j197762j066422j114514j106812q60793o77724r26066
$$ 41570477 40633000 39732712 38534950 37468528 36354014 35247202 34386409 33708685 32782619
12622C2782619q88010r64841q24390r51265q62504p23840q50554p61758q13870
$$ 32782619 31894609 30929768 30105378 29154113 28291609 27567769 26717215 25955457 25141587
12613B5141587o41616q08342o72756o21654o12491p89924n53102m92175n13766
$$ 25141587 24499971 23691629 23018873 22397219 21784728 20994804 20441702 19949527 19435761
12604A9435761m72690n89992n37984k55521m32681l43443k78581k48615m36170
$$ 19435761 18963071 18373079 17835095 17579574 17146893 16803450 16524869 16276254 15840084
12595A5840084m38805j69964k29576k39768k97592n24062n13197o55760n91865
$$ 15840084 15401279 15231315 15001739 14761971 14464379 13940317 13427120 12771360 12179495
12586A2179495l61055m02254n14861l70364o5656l08169j92152l18658m10862
$$ 12179495 11818440 11416186 10901325 10530961 10465305 10157136 9964984 9646326 9235464
12577I235464l16128j89022k12194L4197n1407j62479j73085l63598j03787j5401
$$ 9235464 8919336 8730314 8518120 8552317 8500910 8338431 8165346 7801748 7697961 7682560
12567G682560j63598l41407j95203j32515j71252j35625j32255k09296k05426
$$ 7682560 7518962 7177555 6982352 6849837 6678585 6542960 6410705 6201409 5995983
12558E995983j85326M5491r4647k75848j39524r7441J06942O2878k17550M3777
$$ 5995983 5810657 5856148 5761501 5485653 5346129 5248688 5355630 5418508 5200958 5244735
12548E244735q3731Q3115J59317Q614l90857l21751j12334o2375k60849j15586
$$ 5244735 5161004 5244119 5403436 5412050 5021193 4699442 4587108 4524733 4263884 4148298
12538D148298p6690K42275M7140r7569j29829k17947k63132k44376m8217K20748
$$ 4148298 4071608 4313883 4361023 4263454 4133625 3915678 3652546 3408170 3359953 3580701
12528C580701J71368j37293j47679r3114j17299j34681Q308p4650l60231J38467
$$ 3580701 3752069 3614776 3467097 3373983 3256684 3122003 3130311 3055661 2695430 2833897
12518B833897o3981j98874j2606K13460Q3170j25809n0352Q8893J23698M7009
$$ 2833897 2769916 2571042 2558436 2771896 2855066 2729257 2678905 2767798 2891496 2938505
12508B938505j07978L1426J8552O8257N7477J15847J44988k42194n0474J72892
$$ 2938505 2830527 2861953 2880505 2948762 3006239 3122086 3267074 3024880 2974406 3147298
12498C147298R8177k10661p8338m6349k62072k31825R7273l2557m4241J706K43293
$$ 3147298 3245475 3034814 2956476 2910127 2648055 2416230 2513503 2480946 2436705 2438411 2681704
12487B681704K48261N9138R6799l3927r3839o2756o9887l20275J8736p1300N4613
$$ 2681704 2929965 2989103 3085902 3051975 2958136 2895380 2825493 2505218 2523954 2452654 2507267
12476B507267Q648j68241K88807K56887O234J36537p100r6162j13318k59920l33447
$$ 2507267 2515915 2347674 2636481 2893368 2899602 3036139 3029039 2932877 2819559 2559639 2226192
12465B226192J20250K69172K64986K4407m39013l61896j42725R9764K55332Q003
$$ 2226192 2346442 2615614 2880600 2905007 2465994 2104098 1961373 2061137 2316469 2324472
12455B324472k00135j14258J74178L59777J9930k01611k07682L1509p9637N216
$$ 2324472 2124337 2010079 2184257 2544034 2563964 2362353 2154671 2186180 2106543 2111759
12445B111759J30078j76392j51078J5759k62163r9181J95146L34946K53609l2681
$$ 2111759 2241837 2065445 1914367 1930126 1667963 1568782 1763928 2098874 2352483 2319802
12435B319802j97250l09476j82800o5108N8174J34671j04210J14669Q614k76978
$$ 2319802 2122552 1813076 1630276 1565168 1623342 1758013 1653803 1768472 1777086 1500108
12425A500108l4663j1731p4913Q4098k05798p0322K13720r966r9967j57015j04965
$$ 1500108 1465445 1453714 1378801 1462899 1257101 1186779 1400499 1390533 1290566 1133551 1028586
12414A028586j38239j39016p6264K32774o7962o0725j02780j20223J053J74145
$$ 1028586 890347 751331 675067 907841 839879 779154 676374 556151 557204 731349
12404G31349J04896L46092p2190j19854Q3814l7598q2423p3932j10428l2893J14458
$$ 731349 836245 1182337 1110147 990293 1074107 1036509 954086 880154 769726 736833 851291
12393H51291o945J12525K8232j63458q6824q0517j30339p3139J09827j35893k2507
$$ 851291 844346 956871 985103 821645 734821 654304 523965 450826 560653 424760 402253
12382D02253N32K3825o0922J19474j76734k5931L8483j58173K29040J88167m9872
$$ 402253 402785 426610 365688 485162 308428 282497 320980 162807 391847 580014 530142
12371E30142k5783O3187Q0709J32795O5569n5030j08658N1158J10528r4067l4895
$$ 530142 504359 567546 648255 781050 846619 791589 682931 734089 844617 750550 715655
12360G15655q2312r7609k47968L3208J15848J23600j40249j20427q8561L1271
$$ 715655 633343 535734 287766 320974 436822 560422 420173 299746 211185 242456
12350B42456J84330K5401J73122J69512J6865n5361q2805o8838j2693L63010J68240
$$ 242456 426786 452187 625309 794821 811686 756325 673520 604682 591989 954999 1123239
12339A123239n0820J11734J29852R2168J9316K7659M43612L60369J63591L49048
$$ 1123239 1072419 1184153 1314005 1406173 1425489 1453148 1896760 2257129 2420720 2769768
12329B769768P1422m44948m65135j32944l10297n54635N497O4388l9387J46969
$$ 2769768 2841190 2396242 1931107 1798163 1487866 933231 938728 1003116 963729 1110698
12319A110698L7822R7631J76072m3911j8308j3135l5687r3587J3002L10146K05935
$$ 1110698 1148520 1246151 1422223 1378312 1360004 1346869 1311182 1217595 1230597 1540743 1746678
12308A746678M9053L5174j07743k41388l6860L81306M19635J1756l45692K22833
$$ 1746678 1795731 1830905 1723162 1481774 1444914 1826220 2245855 2257611 1911919 2134752
12298B134752L05387L96444K04778j46429j80599Q9200j60888o1256k11690k54537
$$ 2134752 2440139 2836583 3041361 2894932 2714333 2803533 2642645 2581389 2369699 2115162
12288B115162j76485j14819k01046j2393j03286J19662K8800j68085k670k76587
$$ 2115162 1938677 1823858 1622812 1610419 1507133 1626795 1655595 1487510 1484840 1208253
12278A208253j36800K45861J14981L11427Q5052K82609M71553K22286L01240K42712
$$ 1208253 1071453 1317314 1432295 1743722 1828774 2111383 2582936 2805222 3106462 3349174
12268C349174K74796K01682m05306l76458j58911k85439j14757l12956l56385
$$ 3349174 3623970 3825652 3420346 3043888 2884977 2599538 2484781 2171825 1815440
12259A815440k80874j20580N2858L8009m2685k26831j09334P9914J58274K2607
$$ 1815440 1534566 1413986 1466844 1504853 1462168 1235337 1126003 1205917 1364191 1386798
12249A386798O6509K02754P5298K75375J79082l3833Q4502J37179L7063J19549
$$ 1386798 1453307 1656061 1731359 2006734 2185816 2151983 2236485 2373664 2410727 2530276
12239B530276M5684n52j56566l04873l46291l03236m9376J96288J16145K02159
$$ 2530276 2575960 2575408 2418842 2113969 1767678 1464442 1415066 1611354 1727499 1929658
12229A929658j36896j51419J14256L13645m7120l44875k1290M6134j18654j32533
$$ 1929658 1792762 1641343 1755599 2069244 2022124 1677249 1655959 1702093 1583439 1450906
12219A450906m4680J14181j45631l02271O27k8848j0126K99172L63815J74823
$$ 1450906 1406226 1520407 1374776 1072505 1073132 1044284 1034158 1333330 1697145 1871968
12209A871968L75923L12397J50946K4390O2463j13083l34107o4166j83317k76466
$$ 1871968 2247891 2560288 2711234 2735624 2798087 2685004 2350897 2286731 2103414 1826948
12199A826948j02759k09875j27628P9020J3879j53425k6200P2682j92911l31452
$$ 1826948 1724189 1514314 1386686 1465706 1479585 1326160 1299960 1372642 1179731 848279
12189H48279k26428J57965l661q9205J24867j93486k57209J9766J06120R5934
$$ 848279 621851 779816 776155 686950 811817 618331 361122 380888 487008 582942
12179E82942M0323K78508j4551j57272j58671j00393n1143j17183J08954J01788
$$ 582942 623265 901773 887222 729950 571279 470886 419743 302560 411514 513302
12169E13302k42320j87415M9909J79646M3314J13069P0219j1686k20809q1056
$$ 513302 270982 83567 133476 313122 356436 469505 539724 528038 307229 226173
12159B26173J74261P6440j12933j60239M5768J75595o0815j66370K71241J39890
$$ 226173 400434 476874 363941 203702 249470 425065 364250 197880 469121 609011
12149F09011R854k22989j19823O6079p6455R9491L54543j52839N360r3903P3531
$$ 609011 618865 395876 276053 342132 265677 365168 719711 566872 572232 478329 551860
12138E51860L27301L4322j09010J40064M0733l9750l11274k0912j17595j10969
$$ 551860 879161 913483 804473 944537 985270 945520 634246 613334 495739 384770
12128C84770J01184r692K3119J04216J51786k3340q2884o8980k8986J81472p1392
$$ 384770 485954 476262 499381 603597 755383 732043 649159 580179 551193 732665 661273
12117F61273p3263l6062k54792r4748j03696J63998J54865r4671K18357j91572
$$ 661273 588010 551948 297156 202408 98712 262710 417575 322904 541261 349689
12107C49689p4089J9057P1000l9405M1027n0238L8700J58827n4512R72K86111
$$ 349689 275600 294657 365657 326252 367279 317041 355741 514568 460056 461028 747139
12096G47139j98884p7419L181K44497L1532j81496J36814M35837p1748k46782
$$ 747139 548255 470836 474017 718514 750046 568550 705364 1141201 1069453 822671
12086H22671k74206j68882r1359k15257R711J72620o3491n2547j10615j02278
$$ 822671 548465 379583 288224 72967 82678 255298 191807 139260 28645 -73633
12076g3633P585R5557J53852P4041q6634P0839L24716K3222k31529j10687j18180
$$ -73633 -66048 29509 183361 257402 170768 241607 566323 589545 358016 247329 129149
12065A29149K47433J71675j04848j36349j40859j02906J80177K10824J4475q8385
$$ 129149 376582 548257 443409 307060 166201 63295 243472 454296 468771 380386
12055C80386L2832J01904k51853o2851J56349K89133o9545k20238j0867O7615
$$ 380386 413218 515122 263269 200418 356767 645900 576355 356117 345250 412865
12045D12865M0099N9652j33799n4429j35581o7029j72530j33339O0742K66703
$$ 412865 452964 512616 378817 324388 188807 121778 -50752 -184091 -123349 143354
12035A43354M439J70225n1726Q1012n6847Q7252j09333j51607J89902K80609K46727
$$ 143354 147793 318018 266292 347304 290457 377709 268376 116769 306671 587280 834007
12024H34007L88126M00564K82768N4648N0041j83283K1939n2854k08036k62890
$$ 834007 1222133 1622697 1905465 1960113 2010154 1826871 1848810 1795956 1587920 1325030
12014A325030j28194l9740m1225o4425k58431Q4174j90954o9984J18213J57975
$$ 1325030 1196836 1157096 1115871 1051446 793015 877189 686235 616251 734464 892439
12004H92439R5286L23247L1883j33315L8838P6821j18157K2661J80274K37835
$$ 892439 987725 1310972 1342855 1209540 1248378 1325199 1207042 1229703 1409977 1647812
11994A647812J95380l70424k6014J94536K50443j70078L23488J5729L9945j62671
$$ 1647812 1843192 1472768 1446754 1641290 1891733 1721655 2045143 2060872 2100817 1938146
11984A938146j13103K17689J87547K0259j3003J54513K70553Q7223j19107k47783
$$ 1938146 1825043 2042732 2230279 2250538 2237535 2392048 2662601 2749824 2630717 2382934
11974B382934l19472j67333J66712J24372Q1764j96008j25097R0521O3160J15924
$$ 2382934 2063462 1896129 2062841 2187213 2268977 2072969 1947872 2038393 2101553 2217477
11964B217477J86915M05784K91414o8936L7153O1228N2409R407j68702q8058J57128
$$ 2217477 2404392 2810176 3101590 3032654 3069807 3131035 3183444 3192851 3024149 2936091 3093219
11953C093219L7314J24310J22154j46105j5580R050K77748K54266k7643J32408
$$ 3093219 3130533 3254843 3376997 3230892 3215312 3224362 3502110 3756376 3728733 3861141
11943C861141K03244K51428M88696J00707N4409L09390R3174Q67m1478j5135L75145
$$ 3861141 4064385 4315813 4804509 4905216 4959625 5269015 5362189 5363056 5321578 5306443 5681588
11932E681588J50611J40906L47725N22850M48711M66211L85283M02404K84620
$$ 5681588 5832199 5973105 6320830 6843680 7292391 7758602 8143885 8546289 8830909
11923H830909M58249N51296O61729O53921J132277R30143J278691J822276J900947
$$ 8830909 9289158 9840454 10502183 11156104 12288381 13218524 14497215 16319491 18220438
11914A8220438K114512K716934L308743L958266N142242O585787Q222179J0619232
$$ 18220438 20334950 23051884 26360627 30318893 35461135 42046922 50269101 60888333
11906F0888333J4361245K0253496K8313847L9435772N2722401O2462981O2180205
$$ 60888333 75249578 95503074 123816921 163252693 215975094 278438075 340618280
11899C40618280M8286337K0734903j4321218m4205576n7095345n3664617m1403448
$$ 340618280 388904617 409639520 395318302 351112726 294017381 240352764 198949316
11892A98949316k9312967j9928215j3258514q722855n221412k236763Q53927M225032
$$ 198949316 169636349 149708134 136449620 127726765 122505353 120268590 121122517 125347549
11884A25347549Q606763J2548714J6054296J8227190J8491265J7316702J4656023
$$ 125347549 133954312 146503026 162557322 180784512 199275777 216592479 231248502
11877B31248502J0855181N983734J029229k269248q26283O592428J8698097L2047686
$$ 231248502 242103683 248087417 249116646 246847398 246021115 252613543 271311640 303359326
11869C03359326M1966137M4196858L6389619J9164136l378353k3631656l4166041
$$ 303359326 345325463 389522321 425911940 445076076 441697723 418066067 383900026
11862C83900026l2488885k2914964j2977638p415258p219284j0837107j5453612
$$ 383900026 351411141 328496177 315518539 308103281 300883997 290046890 274593278
11855B74593278j8338342j9696993k0781057k1170505j9648828j6521319j2539414
$$ 274593278 256254936 236557943 215776886 194606381 174957553 158436234 145896820
11848A45896820q213325m668306k008083Q90604L613201P103234J1659978J8336415
$$ 145896820 137683495 133015189 131007106 131897710 135510911 142614145 154274123 172610538
11840A72610538K7302997L7588551M6473358M8527199L9704555K0155569p730959
$$ 172610538 199913535 237502086 283975444 332502643 372207198 392362767 384631808
11833C84631808l5727485n2083952n1876706m2276903l1654543k2656637j6437002
$$ 384631808 348904323 296820371 244943665 202666762 171012219 148355582 131918580
11826A31918580j2562490j0014673q264336p018019o281243n963979n300854m792566
$$ 131918580 119356090 109341417 101077081 94059062 87777819 81813840 76512986 71720420
11818G1720420m318925l791185l176338k835660k736201k631812k166995k052879
$$ 71720420 67401495 63610310 60433972 57598312 54862111 52230299 50063304 48010425
11810D8010425j807404j629488j424495j245763j139619j177091j064282r60031
$$ 48010425 46203021 44573533 43149038 41903275 40763656 39586565 38522283 37562252
11802C7562252q58029r17150j079850r80982j047968j166178r56603q94101r58238
$$ 37562252 36704223 35787073 34707223 33726241 32678273 31512095 30555492 29661391 28703153
11793B8703153j019535j160779q49122p53568o48803o76477n61054o43153o23494
$$ 28703153 27683618 26522839 25673717 24920149 24271346 23594869 23033815 22390662 21767168
11784B1767168o10086q00069o15090n99935o96978n03766k91308k41783p39076
$$ 21767168 21157082 20357013 19741923 19141988 18445010 17941244 17649936 17408153 16669077
11775A6669077o77626m54315m53558l96575j52023l2300l53579l22438l96339
$$ 16669077 15991451 15537136 15083578 14687003 14534980 14502680 14149101 13826663 13430324
11766A3430324o72920n24137m22938l35304r3785k5953j83168l43746n33784l88458
$$ 13430324 12757404 12233267 11810329 11475025 11381240 11355287 11172119 10828373 10294589 9906131
11756I906131l43826j30599l02251n17753K5556K1920k63338m16411l24656k59862
$$ 9906131 9562305 9431706 9129455 8611702 8637258 8659178 8395840 7979429 7654773 7394911
11746G394911j37484k08626j00984j64888k9596k77455M1315j66132j04786j70535
$$ 7394911 7257427 7048801 6947817 6782929 6753333 6475878 6517193 6351061 6246275 6075740
11736F075740n6851j22413m81677j91565N0471j20264K1248n2348o5107j14069
$$ 6075740 6018889 5896476 5414799 5223234 5273705 5153441 5174689 5122341 5057234 4943165
11726D943165l55943j53541k7189m336n1229L6198l79537j17926K6901J04965
$$ 4943165 4587222 4433681 4406492 4402156 4350927 4387125 4007588 3889662 3916563 4021528
11716D021528j42347j84895K77194K7078j86676r1306l25869j20799O7324J80172
$$ 4021528 3879181 3694286 3971480 3998558 3811882 3720576 3394707 3273908 3341232 3521404
11706C521404K37804j20120r3827o8311k42476j57072j26818K46380o0759l13858
$$ 3521404 3759208 3639088 3545261 3476950 3234474 3077402 2950584 3196964 3136205 2822347
11696B822347k1580J52927k26881j86859R1077l3564j32901j08215P4431N481
$$ 2822347 2800767 2953694 2726813 2539954 2631031 2597467 2464566 2356351 2430782 2436263
11686B436263r3223o5127Q3296J9007o5636L8706Q5112j69863R3670K5005q8709
$$ 2436263 2343040 2277913 2361209 2380216 2314580 2353286 2438398 2268535 2362205 2387210 2298501
11675B298501J34888K61975R687m23903j71157K70045o7819p7287k27557l697
$$ 2298501 2433389 2695364 2705051 2281148 2109991 2380036 2312217 2234930 2007373 2003676
11665B003676M407o1684P5121j39796M2638n8702J52123j1674o2397q7233J869
$$ 2003676 2008083 1946399 2021520 1881724 1924362 1865660 2017783 2006109 1943712 1856479 1858348
11654A858348N0751J4211l00168Q9379L59638J22996l73691M826J62104j63179
$$ 1858348 1909099 1923310 1623142 1712521 2072159 2195155 1821464 1826290 1988394 1825215
11644A825215n722K3620j08349j75113j68661n3746p8338K45326J40064j48324
$$ 1825215 1819493 1843113 1734764 1559651 1390990 1337244 1258906 1504232 1644296 1495972
11634A495972n4695K5866O0681L7948j45717J4575J51814q9303r5913m7581q7366
$$ 1495972 1441277 1467143 1527824 1565772 1420055 1434630 1586444 1497141 1401228 1353647 1266281
11623A266281O6461N8013k07356j0218P4482n0490k99468J59468Q2328q579q0767
$$ 1266281 1332742 1390755 1183399 1173181 1247663 1197173 897705 1057173 1139501 1130922 1050155
11612A050155J67961K2243j18812N9266m2193m1095Q6548J49199j36127q3913
$$ 1050155 1218116 1240359 1121547 1180813 1138620 1097525 1184073 1333272 1197145 1113232
11602A113232R992J93119P2479J6379j14484k02144j7502m1675M2390M573J53492
$$ 1113232 1123224 1316343 1388822 1405201 1290717 1088573 1071071 1029396 1071786 1076359 1229851
11591A229851m3857q1082l35967j60170l1557J06531K15410K13029K45711k26374
$$ 1229851 1185994 1104912 768945 608775 577218 683749 899159 1112188 1357899 1131525
11581A131525j69499q287J91615m2957j24659r8798J06331q228j63919l4317N5366
$$ 1131525 962026 953739 1145354 1102397 977738 878940 985271 977043 813124 778807 834173
11570H34173m8878j60711M71581p3508n22759k76611J19636O957L48420L6048
$$ 834173 785295 624584 1096165 1022657 499898 223287 342923 349880 698300 734348
11560G34348p3458L8516O3733l7689k17252K3054R2885m8117K24550J15968K54112
$$ 734348 660890 699406 763139 725450 508198 531252 624137 576020 800570 916538 1170650
11549A170650K83153J56922o4020K9006j94110p7570K45031K08447l65095l54031
$$ 1170650 1453803 1610725 1546705 1575711 1381601 1304031 1549062 1757509 1392414 1038383
11539A038383k51351J9879k34401L01765M70273Q2889L9751r2408j16669j23724
$$ 1038383 787032 806911 572510 874275 1344548 1427437 1467188 1374780 1258111 1134387
11529A134387L0105J74080p6411m691q7208r3826O7967J07210K45878K12714M0252
$$ 1134387 1164492 1338572 1262161 1257470 1170262 1076436 1144403 1251613 1497491 1710205 1750457
11518A750457N055K49685N41123m8665p1830M2220R9482J33785m2661q2743K45362
$$ 1750457 1755512 2005197 2546320 2497655 2425825 2468045 2567527 2701312 2658651 2575908 2821270
11507B821270J83796J77272j43339P5124j2696K55628J4568k1915k28806q6686
$$ 2821270 3005066 3182338 3038999 3114123 3101427 3357055 3371623 3349708 3120902 3034216
11497C034216J09607o7329j7873j26565k9598J00693K57360J49921p0053J28596
$$ 3034216 3143823 3076494 3058621 2932056 2902458 3003151 3260511 3410432 3340379 3468975
11487C468975K21209p8257R3357J73381l267j4931N9843l2946j55219j20356j86591
$$ 3468975 3690184 3611927 3705284 3878665 3875398 3860467 3920310 3887364 3732145 3611789 3425198
11476C425198O3078J59847J36019O7207J5522J29364K72073J94268M9807k41484
$$ 3425198 3488276 3648123 3784142 3851349 3866871 3996235 4268308 4462576 4512383 4270899
11466D270899n4097J54583L0525J03046K07339K17031k2257J66070l1588q5286
$$ 4270899 4216802 4371385 4401910 4504956 4712295 4929326 4907069 5073139 5041551 4956265
11456D956265k69666r5898O8250j32631k0933k55724j83047r2056m6459p1357
$$ 4956265 4686599 4590701 4658951 4526320 4505387 4249663 4066616 3974560 3928101 3856744
11446C856744J39926j89660j04130K55994J83197K67673J42102k04691J8178K2126
$$ 3856744 3996670 3807010 3702880 3958874 4142071 4409744 4551846 4347155 4365333 4387459
11436D387459l1493j56435j16217M5901j84814j14093n9776M2714R3117K9735
$$ 4387459 4355966 4199531 4083314 4129215 3944401 3830308 3770532 3813246 3906363 3936098
11426C936098n4941r1093o0330j94440k31368j91065n7390Q070m7537j87645k07993
$$ 3936098 3881157 3790064 3729734 3535294 3303926 3112861 3055471 3063541 3016004 2828359 2620366
11415B620366J50416Q3375q6008l11174m3709j61693j35935j13736j47412J08997
$$ 2620366 2770782 2854157 2768149 2456975 2413266 2251573 2115638 2001902 1854490 1963487
11405A963487Q3247P4384q0940J10200K34421K06406L10678J18714J71752O5410
$$ 1963487 2046734 2121118 2040178 2150378 2384799 2591205 2901883 3020597 3192349 3257759
11395C257759k68157j53053k0161k00146m76768l04351l31653j22874j14400j23628
$$ 3257759 2989602 2836549 2816388 2616242 2139474 1835123 1503470 1380596 1266196 1142568
11385A142568N6504L53414k6680k24309l96620k2305P5988N235k79689p0071K96801
$$ 1142568 1199072 1552486 1525806 1301497 904877 882572 958560 963795 684106 614035 910836
11374I10836R2667j38418L9920O528j72257K625L6908j13925N7516l6590K94753
$$ 910836 1003503 865085 905005 911533 739276 741901 778809 664884 722400 685810 980563
11363I80563j24490m58478Q896J65541N2354M4091q6781J21100N7054J16808K2761
$$ 980563 856073 397595 406491 572032 624386 668477 581696 702796 759850 876658 899419
11352H99419l401n8203r709k58348j75429q0223L4457n7730J68925j60139L5577
$$ 899419 896018 837815 828106 569758 394329 314106 348563 290833 459758 299619 335196
11341C35196L3540J77789J7668j62981m822L61606Q0334k20451k00431K21479
$$ 335196 368736 546525 564193 401212 396390 757996 838330 617879 417448 638927
11331F38927J6219m7776J60301J15547K5117k30493j22775j43696p6322L8683
$$ 638927 655146 607370 767671 883218 908335 677842 555067 411371 335049 373732
11321C73732K61418q6032k24333j9610m3192o495l3893k7328Q3293P7200n6009
$$ 373732 635150 549118 324785 305175 261983 255488 221595 194267 277560 354760 298751
11310B98751n0515M2897m7857K36044N609Q4429k4564j54338q5313P69R7701j30896
$$ 298751 248236 291133 243276 479320 484929 569358 544794 390456 305143 305912 403613 272717
11298B72717J05466J77388j10484k60776k23536J17472J18508J33648K33611L72055
$$ 272717 378183 555571 445087 184311 -39225 78247 196755 330403 564014 936069
11288I36069L4206k98275j22787j34638J9206Q4466J76619N9735r862j87424K9935
$$ 936069 970275 672000 549213 414575 433781 518247 694866 754601 744739 557315 587250
11277E87250L0972k8776j86060l321n2514j38442J57935L2032o5117J28715j42371
$$ 587250 618222 589446 403386 400065 347551 209109 367044 399076 333959 462674 320303
11266C20303j91297Q5656j74737j98709k07869j48701K11189K01453K28940m5009
$$ 320303 129006 214662 39925 -158784 -366653 -515354 -304165 -102712 126228 81219
11256H1219j40288J25560J89446L3428O9050k39498k12184q608J40686K18521
$$ 81219 -59069 66491 255937 289365 358415 118917 -93267 -101875 38811 257332
11246B57332J18860J54219J00132l34894l03236J45179J39464N2201o0301J12041
$$ 257332 376192 530411 630543 295649 -7587 137592 277056 329257 268956 380997
11236C80997M9976m3861j50135j26501j18953N1013O8353j71229K04958K36485
$$ 380997 430973 387112 236977 110476 -8477 42536 110889 -60340 144618 381103
11226C81103j51194m5590N8971N940j78171n9291n5488o9283n4727M8059n8423
$$ 381103 229909 184319 243290 249230 71059 11768 -43720 -113003 -167730 -119671 -178094
11215a78094R2821m7944K28060L04533R9052j81750o4555q3229J87069j30269
$$ -178094 -85273 -133217 94843 399376 498428 316678 252123 168894 355963 225694
11205B25694R7144j02150k4006l2003N0395K13955J26939j78360L3041j42879
$$ 225694 322838 220688 196682 164679 215074 429029 555968 377608 410649 267770
11195B67770j78896m3987J25368N9647j94855M7801M8494J42923Q2327p886l4253
$$ 267770 88874 44887 170255 229902 35047 82848 131342 274265 356592 348706 314453
11184C14453J1419m6192J42155j5196j53972j42880J25021R0950l15280K37532
$$ 314453 325872 279680 421835 406639 252667 109787 234808 325758 10478 248010
11174B48010O1100j1893j9152Q420O3482r9253m47422k0839L8113K59192R3896
$$ 248010 309110 297217 278065 286485 349967 250714 -196708 -217547 -179434 79758 173654
11163A73654L3528P0941k392j91219j92004J56368N0866r2219Q352q2503n9072
$$ 173654 207182 278123 275731 84512 -107492 48876 99742 7523 15875 -66628 -125700
11152a25700J23591j8154R4127j0310o7821m8562m9974J28101K5487J4947r0472
$$ -125700 -2109 -20263 73864 63554 -4267 -52829 -102803 25298 50785 65732 -24740
11141b4740j26385k2691M2914Q5056M4174M5379j00307O2586L3161K9203K81515
$$ -24740 -151125 -173816 -130902 -45846 -1672 43707 -56600 5986 39147 68350 349865
11130C49865l3206k25249M7264J9184o1680k07261j64126J40384J06040r9921
$$ 349865 316659 91410 138674 157858 96178 -111083 -275209 -134825 -28785 -128706
11120a28706R0547P8037J25002n4467K41975J3831r0445k46938q4296k5060j15413
$$ -128706 -38159 39878 164880 110413 352388 366219 275774 28836 -55460 -80520 -195933
11109a95933R4147M28403K550m3865o8667j06873J04419J67692l4879m8452k8397
$$ -195933 -101786 326617 329167 285302 216635 109762 214181 381873 346994 298542 270145
11098B70145m2127j35568K2126n4194J51212J6181L77141J23086j44305l4938
$$ 270145 228018 92450 114576 60382 211594 227775 604916 728002 583697 548759
11088E48759k2587K5229p2056M3279P068L1956J37597j08391p2782m312j65763
$$ 548759 526172 551401 479345 522624 529692 561648 699245 590854 518072 513760 347997
11077C47997j91590N308P036j00329J02747K22301M9254J98660K49606j22276
$$ 347997 156407 161715 168751 68422 171169 393470 442724 641384 890990 768714
11067G68714k34249P9979R6471p678m4271O1112j32175j12289l96699q5797M72511
$$ 768714 534465 614444 710915 703237 658966 720078 587903 475614 78915 -6882 465629
11056D65629L63803O7723r8216o6122J85818j4524j29912p5064J9329J1628Q6564
$$ 465629 829432 897155 798939 732817 918635 904111 774199 699135 718464 730092 816656
11045H16656J04547p0790k9744j5751j8583J47628k27814m3440N7535j73094k85743
$$ 816656 921203 850413 820669 804918 786335 933963 706149 662709 720244 547150 261407
11034B61407J71982K40865l14p2975K30117j16461j74339l40585j59303O9618
$$ 261407 433389 674254 673940 600965 831082 714621 540282 199697 40394 110012
11024A10012L9660K24920P3037K07651l6431k15722M8382R4057k59419l32443
$$ 110012 149672 374592 447629 655280 618849 403127 451509 545566 286147 -46296
11014d6296K12795R956J14469K91397L4117Q175k7960j82688j12480j12441k619
$$ -46296 166499 176455 290924 582321 616438 624613 596653 413965 301485 189044 186425
11003A86425J74377q6790m0096K10568l6631k57552Q0851l68660j35258J03187
$$ 186425 360802 274012 233916 444484 407853 150301 231152 -137508 -272766 -169579
10993a69579K41096P1041P3868l95061k13706L10587L25961l82k58037j29931
$$ -169579 71517 142558 216426 -178635 -392341 -81754 244207 243825 -14212 -144143
10983a44143J06376K28528n4240J58497K29112l1526M1947k03455J37661K50697
$$ -144143 -37767 190761 136521 295018 524130 492604 534551 331096 468757 719454
10973G19454O9713j89857n38315l65826j25184J22596M53045J55710j92492J35358
$$ 719454 789167 599310 60995 -304831 -430015 -307419 145626 301336 108844 244202
10963B44202k9848q8711k91355l5620j07442k6445O2279N8825K05927J70359J52294
$$ 244202 214354 125643 -165712 -201332 -308774 -335219 -272940 -214115 -8188 162171 314465
10952C14465j60607j92392J63637j0442k46485n607k2256J11808R2734j47473
$$ 314465 153858 -38534 125103 114661 -131824 -137431 -159687 -47879 44855 -102618
10942a02618k7120K63341L8117j45875R2960Q1240k4629J90471l1571k51663j41670
$$ -102618 -129738 133603 171720 25845 118805 200045 175416 365887 334316 82653 -59017
10931e9017o3270J41677J27827j08258q701J77472R2110N976K84333J88125m1720
$$ -59017 -122287 19390 147217 38959 30258 207730 299840 305816 590149 778274 736554
10920G36554J1569K2969j72954l58277k12770j36641J79945K68020R4843k8606
$$ 736554 748123 771092 598138 239861 27091 -109550 70395 338415 433258 404652
10910D04652j66401p8487k94184j45421o519l525L02223K24299O8250j55157k18085
$$ 404652 238251 159764 -134420 -279841 -286360 -289885 12338 236637 304887 149730 -68355
10899f8355o1985O1929O0298J54757j55137K6702r6885k6415J43174Q9630n435
$$ -68355 -130340 -68411 -8113 146644 -8493 18209 -78676 -105091 38083 127713 122278
10888A22278K1229K293j4257p7928p0245j21875J58624M4411J72371J78208K7483
$$ 122278 143507 145800 131543 53615 -16630 -138505 20119 64530 236901 415109 442592
10877D42592k27444k69635n2781k08998j06993L76260j6350N2047J11101K26178
$$ 442592 215148 -54487 -107268 -316266 -423259 -46999 -63349 -11302 99799 325977
10867C25977q224j04804j5640M0257l9549j60182p8761O6272J36147j99573l37882
$$ 325977 317753 212949 197309 237566 198017 37835 -40926 25346 161493 -38080 -375962
10856c75962j40450K68048k2536j79645L05558L96477O1237n9154k51280k08674
$$ -375962 -516412 -248364 -270900 -450545 -144987 251490 312727 253573 2293 -206381
10846b06381j45425j23100N9715M9619n2434J13866J83033Q3089J29557o3471
$$ -206381 -351806 -474906 -415191 -365572 -418006 -304140 -121107 -38018 91539 28068
10836B8068N0866l9259j45960J44848J3508k35622j18310j21442N7765K51060
$$ 28068 78934 39675 -106285 38563 52071 -183551 -301861 -423303 -365538 -114478
10826a14478J56013p9264o0039k0296K0742Q6259L2474J67366P5366k07679k59868
$$ -114478 41535 -37729 -97768 -118064 -97322 -11063 21411 188777 264143 56464 -203404
10815b03404j18553R6110J86607J62222m5251k3719j0216j00078J84631m7146
$$ -203404 -321957 -225847 -39240 122982 77731 54012 43796 -56282 128349 81203
10805H1203J01830N1663r5450l30751O1865L17190p1544N8336k3685l60397m5539
$$ 81203 183033 234696 139246 -191505 -129640 187550 116006 174342 150657 -209740 -255279
10794b55279N1874j7244k1917n2975K71564J704j48258j23895K5400q6717m1316
$$ -255279 -203405 -220649 -242566 -295541 -23977 -22273 -170531 -294426 -269026 -355743 -397059
10783c97059J07935j90055o3967L17533J83112J30550j56910j03448J43751J2309
$$ -397059 -289124 -479179 -543146 -225613 -42501 88049 -68861 -172309 -28558 -16249
10773a6249j41927m6731m7334K24336J72751K33907J47616k2659m7564L106k92779
$$ -16249 -158176 -204907 -252241 -27905 144846 378753 526369 503710 456146 459252 166473
10762A66473j44072l53833J40081J85334J39220M6339l6737k3711L08654J52106
$$ 166473 22401 -331432 -191351 -6017 133203 179542 142805 119094 427748 579854
10752E79854k50429k17517k01163l5568J61565J19674l9728k71236J24584J87813
$$ 579854 329425 111908 -89255 -124823 36742 156416 116688 -154548 -29964 157849
10742A57849N2277j90014M6002l3423L0033L25775P1849k29033j54747o8214M0229
$$ 157849 210126 20112 66114 32691 62724 388499 460348 231315 76568 8354 48583
10731D8583K42119M5320j44172l10200j45095o3456P9093K12842j70513J31856
$$ 48583 290702 336022 191850 -118350 -263445 -326901 -247808 -34966 -205479 -73623
10721g3623o3345l21002p6243O1947J02110P4418J57232k36812j9423Q6030K29638
$$ -73623 -136968 -457970 -534213 -472266 -370156 -295738 -138506 -375318 -394741 -308711 -79073
10710g9073J63855k02893N5536K58330j35721l38354m785K38q659J82914K44319
$$ -79073 84782 -118111 -62575 195755 60034 -278320 -283105 -282867 -291526 -108612 135707
10699A35707Q6129J71401q3403j22921j89667j51271L0338j55693j19872r6713
$$ 135707 221836 393237 309834 186913 -2754 -154025 -123687 -279380 -399252 -495965
10689d95965R1461K50938k04395J8197J44514J01467j22676o4810J10995O9383
$$ -495965 -404504 -153566 -357961 -339764 -195250 -93783 -216459 -281269 -170274 -100891
10679a00891J10176L0977k5408q6596j20712k4178N0509J88751K8771l2456j9640
$$ -100891 9285 40262 14854 -71742 -192454 -216632 -166123 22628 51399 18943 -697
10668f97J16110o6989q6123J8717k0993K15494o9216j93337k27267j14607J4167
$$ -697 115413 48424 -37699 -18982 -39975 175519 106303 -87034 -314301 -428908 -414741
10657d14741J44819L19483L46157R4543j28521k55373m4046j82789L3310J2428
$$ -414741 -269922 49561 395718 490261 361740 106367 62321 -120468 -87158 -74730
10647g4730l3172n5075J71168J16286n3546q2383P88k07309k91463K19905M69776
$$ -74730 -107902 -162977 8191 124477 70931 -11452 -10664 -217973 -509436 -289531 180245
10636A80245J40557j26998p471l4140M4098l6345k25795o307J13290l2885J08855
$$ 180245 320802 193804 186333 152193 196291 159946 -65849 -72156 41134 8249 117104
10625A17104M5521R4554o3083j5635r6836p7892J40389P211p601K554j24796N8381
$$ 117104 162625 257179 194096 178461 81625 3733 144122 151333 143732 146286 21490 79871
10613G9871k5808J21311Q046j44718J16244J58295J2045k5840l42202M9464p8482
$$ 79871 54063 175374 183420 38702 154946 313241 325286 299446 -42756 6708 -71774
10602g1774j53903r3292o0217P9372j67576k2351L17406J43506o2500n6804J4968
$$ -71774 -225677 -318969 -379186 -299814 -467390 -489741 -172335 -28829 -91329 -148133 -133165
10591a33165O1877L15153P8132J96647j6000j9627N2287J25246J4132m6884o1070
$$ -133165 -71288 243865 321997 518644 502644 483017 535304 660550 674682 627798 566728
10580E66728j9939J13660J27943r0530q7288o9570m97Q9795K29199J00274n4580
$$ 566728 546789 660449 788392 697862 610574 541004 540507 630302 859501 959775 905195
10569I05195j90137q0327Q3150l7849J6248r7969M1590J17451J29684K25582p3676
$$ 905195 715058 634731 717881 680032 696280 598311 639901 757352 887036 1112618 1038942
10558A038942q3015n4361L23673J48940j70957j84304j12055K12887M0667k21937
$$ 1038942 955927 901566 1225239 1374179 1203222 1018918 906863 1119750 1160417 938480
10548I38480k70895J25332K85249M3650k19650j33351J02334j50889o3171j1506
$$ 938480 667585 792917 1078166 1121816 902166 768815 871149 720260 657089 645583
10538F45583R6950J73866J31482j07294j17181j9161p1934J27353K02303J31008
$$ 645583 742533 916399 1047881 940587 823406 804245 732311 859664 1061967 1192975
10528A192975J61520j32889k27735l1271J46948k4944j56547m0506j49892r6024
$$ 1192975 1354495 1221606 993871 962600 1109548 1084604 928057 887551 737659 641635
10518F41635o2017R5115O7578J65594L11362p5270l4841J04755k39746l35068
$$ 641635 579618 674733 742311 907905 1219267 1143997 1109156 1213911 974165 639097
10508F39097j86687P0538j8756j54745j9363K1528l039k9992J20119l2093j99138
$$ 639097 452410 522948 504192 349447 330084 351612 348573 318581 438700 406607 207469
10497B07469J47945j46850L1110l781p0384J82482J09490J35535J27655q2135
$$ 207469 355414 208564 239674 235893 165509 347991 457481 593016 720671 638536
10487F38536j01731J28134j26083K8555j30164j17288j14139Q3342R338K4191
$$ 638536 536805 664939 538856 567411 437247 319959 205820 289162 298500 322691
10477C22691o7733J339j6471m3377j70305j06935K91124K15760k2210j24934r4409
$$ 322691 254958 256297 239826 196449 26144 -80791 210333 426093 403883 278949 184540
10466A84540N4134J85602k20945p4963J2759K92535j63228j97521l15664r56J87617
$$ 184540 238674 424276 203331 128368 141127 433662 270434 72913 -242751 -243707 -56090
10455e6090K21814K5178k12764q9279Q7855J26939m17915k8487J47236J60961
$$ -56090 165724 190902 -21862 -111141 -23286 103653 -314262 -342749 -195513 -34552
10445c4552j0076J8498Q0646q0909N0104j62901p2961o2978k2703J287N8576N2506
$$ -34552 -44628 -26130 54516 -26393 23711 -139190 -212151 -275129 -297832 -296545 -237969 -185463
10433a85463J7564l9504K70274J26831o9339r7946R7417p7019l5774q0883L1461
$$ -185463 -167899 -207403 62871 189702 120363 22417 119834 42815 7041 -73842 -42381
10422d2381K11248J65442o5560j91444j29430K08148N9957K395k1483N6986K45945
$$ -42381 168867 334309 268749 77305 -52125 156023 215980 218375 196892 253878 499823
10411D99823J76378j99408r4323l5864r7853K5513r2634j66658Q8616j44773o5506
$$ 499823 676201 476793 382470 346606 248753 274266 181632 14974 103590 -41183 -106689
10400a06689J49492N28883P6885l99605m9991j65240l2533q1409o7840k50K02695
$$ -106689 42803 571686 648571 248966 198975 33735 1202 -80207 -148047 -148297 54398
10389E4398Q2624L381j68836m2747o3104j82428N0924P6092K08851m0884j67935
$$ 54398 137022 140403 -28433 -71180 -134284 -316712 -265788 -189696 19155 -21729 -189664
10378a89664p5355K43267N0961k63207J05587J77567R5554q1382j75463K6483
$$ -189664 -265019 -21752 29209 -233998 -128411 49156 144710 63328 -112135 -85652
10368h5652j6864j53174J19846J20892p2424j42223K60609J12443n0167J11989
$$ -85652 -102516 -255690 -135844 -14952 -87376 -229599 31010 143453 93286 205275
10358B05275j2977k09947r1424J03521J81585l0939k86642p3997K65988M7136
$$ 205275 192298 -17649 -109073 -5552 176033 145094 -141548 -215545 50443 97579
10348I7579j07753L732K13344j51441n7391k54895j24036K854Q3132M217n2044
$$ 97579 -10174 -6442 206902 55461 -1930 -256825 -380861 -378007 -294875 -290658 -342702
10337c42702K0968j20697k1189J78977K52603K85786j30973j06709p3787j01241
$$ -342702 -321734 -442431 -463620 -284643 -32040 253746 122773 16064 -57723 -158964
10327a58964K624Q8883K7643r6277R5106o3728M0916l9244J36408J61126j82417
$$ -158964 -156340 -67457 -39814 -136091 -40985 -104713 -63797 -103041 33367 194493 12076
10316A2076j51765m4853p0623N0926K58536J33994q7809J43783j23721k86724
$$ 12076 -139689 -184542 -255165 -204239 54297 188291 100482 244265 120544 -166180
10306a66180r5668K52685J83940k7751J03154J23365J008J5945l65307r4260J87719
$$ -166180 -261848 -9163 174777 147026 250180 373545 374553 390498 25191 -69069 118650
10295A18650L61782k19680l93123O8064O996K36074j17443O6825K67666m0700
$$ 118650 480432 260752 -132371 -64307 -57311 178763 61320 128145 395811 355111
10285C55111j67451j12141o4255l6859l79490j38370J33954j7807o5755L03161
$$ 355111 187660 75519 11264 -25595 -405085 -543455 -409501 -427308 -493063 -189902
10275a89902K1844j13432j76450m9882j9323M9447O397j8314J10243K79822q8465
$$ -189902 -168058 -281490 -457940 -507822 -527145 -477698 -471301 -489615 -379372 -99550 -188015
10264a88015m8693K55983J89624L9859l2475m2410M3036j27030q5867k12917j78907
$$ -188015 -236708 19275 208899 248758 216283 173873 216909 89879 4012 -208905 -387812
10253c87812R0842J61671J94875O0403k69855K3619O8841Q9212P1929k06397j22853
$$ -387812 -296970 -135299 59576 119979 -149876 -126257 -57416 31796 103725 -102672 -225525
10242b25525K45890J11191K48614N1680k94380p8549K31767R7322j93324L3304
$$ -225525 20365 131556 380170 431850 137470 58921 290688 388010 194686 227990
10232B27990q7894K9619j13464k22308Q018l9392K0566K56682K258Q2984K17901
$$ 227990 140096 169715 56251 -166057 -158039 -197431 -176865 79817 82075 165059 382960
10221C82960J25028k04989l83231M1638J33984J95036k2307j8739j74686n0992
$$ 382960 507988 302999 -80232 -38594 95390 290426 268119 249380 74694 23702
10211B3702N677J5294p2006j56253O5437P9364k5167j15731J77859K4277J69767
$$ 23702 29379 44673 -27333 -183586 -118149 -38785 -63952 -179683 -1824 22453 192220
10200A92220J6256O155j8932j85686j10656j9228R3310M1445J54932j14881l11154
$$ 192220 208476 214631 195699 10013 -100643 -119871 -26561 14884 169816 54935 -256219
10189b56219K31699K25414J14067l4442r2415j11068J75332Q2343J52580j6043
$$ -256219 -24520 200894 314961 280519 188104 77036 252368 334711 487291 471248
10179D71248j47221P8785J05582j05322l0623j17405q3619O1028k36965p2344
$$ 471248 324027 402812 508394 403072 372449 255044 171425 232453 -4512 -76856
10169g6856J68310M8397r2316J71351r8418L4946R775J56743Q223j01248o074
$$ -76856 91454 139851 47535 218886 120468 155414 165189 321932 330155 228907 222833
10158B22833J88488j69043j17l65292j18048J80709M3398j6412j3501m7780q2084
$$ 222833 411321 242278 242161 -123131 -241179 -60470 -17072 -33484 -46985 -94765 -176849
10147a76849j43454k9420K01901j03861j8228o1401j97935J93367K62901L26J52058
$$ -176849 -320303 -349723 -147822 -251683 -269911 -331312 -529247 -335880 -72979 -72653 79405
10136G9405J96597J3935k23308k41840l90028p4829J61003K81939L74455p7468
$$ 79405 276002 289937 66629 -175211 -565239 -640068 -479065 -197126 177329 99861
10126I9861k44871j13911M1445M54276K87033Q9993o9461r3457p3705j27719j8462
$$ 99861 -145010 -258921 -217476 236800 523833 613826 544365 450908 377203 249484 231022
10115B31022r8823l0997o5580k60219J47307K09853J41169k8232k15618N8325
$$ 231022 132199 101202 35622 -224597 -77290 132563 273732 245500 29882 88207
10105H8207K24760j58788m5018j36015k11590j22165j5518k4115J58628K04754
$$ 88207 312967 154179 109161 -26854 -238444 -360609 -376127 -400242 -241614 -36860
10095c6860o528M4785J45033j21945m8372J86776J45668j19282j27524n8218K21917
$$ -36860 -43388 1397 146430 24485 -23887 162889 308557 189275 61751 3533 225450
10084B25450J95508m660n5017l78095k21739K46241K51713j83222M3256k2114
$$ 225450 420958 416298 361281 -16814 -238553 7688 259401 76179 119435 97321
10074I7321j19999r7367O6639J26306q608j81242L8027J02224j11053L4876o1765
$$ 97321 -22678 -120045 -53406 72900 64292 -116950 -78923 23301 -87752 -52876 -114641
10063a14641P6154l971l9265J34452J25391k19640J42081q0613Q6745l6232K1851
$$ -114641 -38487 -42458 -81723 52729 178120 -41520 100561 19948 106693 70461 92312
10052I2312j9517P5494p0509J40292l13613L2428M21697j24599k7536p1342j2887
$$ 92312 72795 148289 77780 218072 -95541 -63113 358584 233985 206449 135107 122220
10041A22220J41799J00297p5888k08523l2733J71433M5559p1967k6773j21669
$$ 122220 264019 364316 288428 79905 47172 218605 264164 192197 165424 43755
10031D3755j71725j24015O3493J52045J72806m9668j69126j08200m3231p5604
$$ 43755 -127970 -251985 -188492 -36447 136359 86691 -82435 -190635 -233866 -309470
10021c09470O8957J60608K07050o4457j30980R1981r0154K58784j10222J25365
$$ -309470 -240513 -79905 127145 62688 -68292 23689 -66465 192319 82097 207462
10011B07462m940j82579k73226n7521K52391j42681j07027Q5721O8110L07964
$$ 207462 202522 19943 -253283 -310804 -58413 -201094 -308121 -222400 -154290 153674
10001A53674J0665k85075j6977R1835J5206q8653K5903l3359k6826J35767l2930
$$ 153674 164339 -120736 -137713 -45878 -30672 -119325 -93422 -126781 -153607 -17840 -50770
9990e0770m1933o6444J07130p6745J7647J77795r5662j8055J62495j93699j31764
$$ -50770 -92703 -159147 -52017 -128762 -111115 66680 -28982 -47037 115458 -78241 -210005
9979b10005m0964J47400M0674J30292p8976j15940L7068m9197j18092L55797L08948
$$ -210005 -250969 -103569 -62895 67397 -11579 -127519 -90451 -139648 -257740 98057 407005
9968D07005j49640o29046o6525K67558K16570j8042n2150K65885m2499l0489j05340
$$ 407005 257365 -371681 -438206 -170648 45922 27880 -24270 241615 199116 168627 63287
9957F3287J55215Q3733k77014J88640m2592P824j54466k66549P8986M8902m1278
$$ 63287 218502 302235 25221 213861 171269 179093 24627 -241922 -162936 -114034 -155312
9946a55312j32709P7446K9519Q7970K19240O2000k44139M082J09750r0905j09631
$$ -155312 -288021 -210575 -181056 -93086 126154 188154 -55985 -51903 57847 -33058 -142689
9935a42689p4040J80488K43365K18411P2179m38239j26235o9563j38431j42109
$$ -142689 -216729 -36241 207124 425535 497714 59475 -66760 -136323 -274754 -416863
9925d16863L22807J96643n4717M4775k51955p4741L20398K82880n6101P766O1803
$$ -416863 -94056 102587 47870 92645 -159310 -234051 86347 369227 313126 320892 382695
9914C82695j81076j74376J20420N6701M6445p0243K1426j2828q4027j68723J20864
$$ 382695 201619 27243 147663 204364 250809 180566 201992 189164 105137 -63586 57278
9903E7278J18869m0329Q1756n2198k06148k3841j92233m8971L10511J52339r2984
$$ 57278 176147 135818 217574 165376 -40772 -64613 -256846 -305817 4694 157033 64049
9892F4049K5606J40563L20834L3392k84261j0433K32967k29713k1667j27088n5020
$$ 64049 89655 230218 551052 584444 300183 289750 522717 293004 271337 144249 89229
9881H9229j82091l10924q3186K46200K53150j03239k6280N9069q1238j44915k581
$$ 89229 -92862 -403786 -486972 -240772 12378 -90861 -117141 -58072 -139310 -284225 -286806
9870b86806J63767K905J61001N6043P2018K4057j75360j07221J42525J29345j91787
$$ -286806 -123039 -120134 40867 96910 168928 192985 17625 -89596 52929 182274 -9513
9859i513k4762k0572m3533k7726K86717M45047J41771k82729L6497j63013j07396
$$ -9513 -34275 -54847 -98380 -126106 160611 605658 747429 464700 501197 338184 230788
9848B30788R2997P6693J1551J68802K20467p3558n00871m29633k6368N9554l43724
$$ 230788 323785 400478 412029 580831 801298 727740 226869 -202764 -229132 -169578 -513302
9837e13302N8482J74286K01110K20242j5487k78220J67895J93223m3234j23906
$$ -513302 -454820 -280534 -79424 140818 125331 -152889 15006 208229 164995 41089
9827D1089k61594k1431J69873J44808q1359p3706N482L97951K34179q4053k32817
$$ 41089 -220505 -241936 -72063 72745 -8614 -82320 -76838 321113 555292 471239 238422
9816B38422l79217K52864o5030j26693j24141J35946J24588K2204p3846J30093
$$ 238422 -140795 112069 47039 -79654 -203795 -67849 56739 78943 5097 135190
9806A35190k7033J52288j58781j26601j03599q0557K77561J33295k70340l1112
$$ 135190 108157 260445 101664 -24937 -128536 -209093 68468 201763 -68577 -99689
9796i9689r2668o0452l6546K64288R7045n5960J67977p7262m62413J79211K00580
$$ -99689 -192357 -252809 -289355 -25067 71978 16018 183995 106733 -355680 -176469 24111
9785B4111J05538j02553m8112J7969q3283k16141O4653K45292J28904R226n3031
$$ 24111 129649 27096 -21016 -3047 -86330 -302471 -237818 7474 136378 145604 92573
9774I2573L7069j9157j172j88255J16390Q5489L9688J5531r4055j31785J38339
$$ 92573 129642 110485 109313 -78942 37448 122937 162625 178156 84101 -47684 90655
9763I0655J83153J46139j00545o8119J27335j26042o8241J44333j22599j19002
$$ 90655 273808 419947 319402 251283 378618 252576 184335 328668 206069 87067
9753H7067J94270r1960K8080J59354j67401r0331l41961k21586K2281l7457J33866
$$ 87067 281337 189377 217457 376811 209410 119079 -222882 -444468 -422187 -459644 -325778
9742c25778K48817j12899K5357j15328J2939J92940r2280J24959k2001k41783
$$ -325778 -76961 -189860 -164503 -279831 -266892 -73952 -166232 -41273 -63274 -305057
9732c05057P384j5119L753R6349K2564l8024K38314L10311k00686j38284k4264
$$ -305057 -297673 -312792 -309039 -212690 -190126 -228150 10164 320475 119789 -18495 -42759
9721d2759j60122P7977N4442Q0288K11184p8970j52519j99496j74476n8341J29560
$$ -42759 -202881 -124904 -70462 9826 221010 142040 -10479 -209975 -384451 -442792 -313232
9710c13232J18435J60218k4882k8038j0625q8022r7010L3392J61236O2495J04097
$$ -313232 -194797 -34579 -59461 -87499 -98124 -186146 -283156 -249764 -88528 -26033 78064
9699G8064o7027j4105M9888J07859L5514Q3326r8512k15639J29592k33398q744
$$ 78064 11037 -3068 46820 154679 190193 273519 175007 -40632 88960 -144438 -153182
9688a53182J29587L668J64384Q3208p3100k01771n9563M2888R7067k756L32j36817
$$ -153182 -23595 -19927 144457 227665 154565 -47206 -106769 -63881 33186 30430 30762 -106055
9676a06055r3241L0292P7259J7992L4829K97711J17285M8756Q0308q9206l13764
$$ -106055 -199296 -169004 -91745 -73753 -38924 258787 376072 424828 505136 415930 102166
9665A02166k30432r016j00348j50863K66921M7541m1982J25960m397P808n7030
$$ 102166 -128266 -137282 -237630 -388493 -121572 -74031 -116013 9947 5550 13358 -43672
9654d3672p5105L31445L7865j28349M8139Q0407k495n3560k53519j64950L2741
$$ -43672 -118777 212668 250533 122184 170323 250730 248235 194675 -58844 -223794 -191053
9643a91053K69815J36555j28146J28817J50597J7608k28837k75572J7374l1836
$$ -191053 78762 215317 87171 215988 366585 384193 155356 -120216 -102842 -134678
9633a34678j6226Q4919J23489k0934Q4007N3796N5318L9965k0661k82181k18715
$$ -134678 -150904 -65985 57504 36570 120577 174373 229691 269656 248995 -33186 -251901
9622b51901J49875J54048P1796j76353j78699j03607R6480k479p1526J1174K70717
$$ -251901 -102026 52022 123818 -52535 -231234 -334841 -238361 -240840 -312366 -301192 -30475
9611c0475l519J93622J5956Q6874K2731N4741m1277j68676m4687j09848j86642
$$ -30475 -33994 159628 175584 262458 285189 339930 298653 129977 85290 -24558 -211200
9600b11200l7219M8566j21576m2815p5705J46090J3350j98158R7955J44509L76360
$$ -211200 -248419 -199853 -321429 -364244 -439949 -293859 -280509 -478667 -380712 -236203 140157
9589A40157j23544k21580j81751J43398K65968q4281o212l07823j80382K19334
$$ 140157 16613 -204967 -386718 -243320 22648 -61633 -67845 -375668 -556050 -336716
9579c36716J65466M0253j92537J58432L27320K048j12639n3401q7417O4052O1376
$$ -336716 -171250 -130997 -323534 -165102 162218 164266 51627 -1774 -89191 -25139 36237
9568C6237O8293K70704j7249k11883j839M7159o5058p2022K32408K424k05873
$$ 36237 104530 375234 357985 146102 144263 191422 126364 54342 286750 289174 83301
9557H3301k16115J45859K25167j59030j40629K02711J12594n2555o430J82244
$$ 83301 -132814 13045 238212 79182 -61447 141264 253858 201303 194873 377117
9547C77117O2896l45862q9605Q2349N6552L04929j03446l57082L3693J57517K10317
$$ 377117 440013 94151 4546 86895 143447 448376 344930 -12152 21541 179058 389375
9536C89375L60j17734l64704M860J41334Q6610R6642M5181r7589j88320l2P7356
$$ 389375 389735 272001 -92703 -87843 53491 140101 236743 281924 184335 -3985 -4017 73339
9524G3339m3542q8630L28q3105K4841K23749K94737J71329p7444k63222o7810
$$ 73339 29797 -58833 -58505 -141610 -116769 106980 401717 573046 495602 232380 164570
9513A64570J8751k32164r8184K5100l2337r984q2995K45895J42939j28277j11157
$$ 164570 183321 -48843 -147027 -121927 -154264 -164248 -247243 -1348 141591 13314 -97843
9502i7843k1984J6913J75187J86155K5355p3036J27887n7666k59017j05668J59000
$$ -97843 -119827 -102914 72273 258428 283783 210747 338634 280968 21951 -83717 75283
9491G5283K8598L5973j29372j025J86001J82290k74339k60412J11593K5579K76894
$$ 75283 103881 139854 10482 9457 195458 377748 103409 -157003 -45410 -19831 257063
9480B57063L46733j02057o5205J13450l1776j55375j40425j26411J8726J11068
$$ 257063 603796 501739 436534 549984 518208 362833 222408 95997 114723 225791
9470B25791q820Q8929R3917k23102r989p6023j44439l078j60840k6888J01230
$$ 225791 216971 305900 399817 176715 166726 90703 -53736 -56814 -217654 -244542 -143312
9459a43312n9446J45313l1633k08262n2732j18083p7674L8374o699l9815Q0383
$$ -143312 -202758 -57445 -89078 -297340 -350072 -468155 -545829 -507455 -514154 -553969 -473586
9448d73586K36471K65432m8874P1565J75973P3619p594O9674j19485j95793m8946
$$ -473586 -237115 28317 -20557 51008 226981 300600 293006 362680 243195 47402 -1544
9437a544K9969P2719K44648n6868k9525L9031N598m3066j97318l7272m2788P4178
$$ -1544 28425 101144 345792 288924 259399 298430 304028 260962 63644 26372 -16416 57762
9425E7762k4070j2769p7143J79348l9221M899l22791j38935Q1654J61402l7263
$$ 57762 33692 20923 -56220 123128 83907 88806 -233985 -372920 -291266 -129864 -167127
9414a67127N8717J1361K768L6399P0625j90917J19141K07679p8138J28413n7922
$$ -167127 -108410 -97049 -94281 -57882 12743 -178174 -59033 148646 70508 198921 140999
9403A40999o7301p8891J80446K68773J03582k14k14648j67650K39006J46514p6126
$$ 140999 73698 -5193 175253 444026 547608 547394 332746 165096 404102 550616 474490
9392D74490k04957l5000k11543k09492q2948J00584K9002L4932O2571J58598K20632
$$ 474490 269533 234533 22990 -186502 -269450 -168866 -139864 -104932 -42361 116237 336869
9381C36869k77251j03619j89l981J02958j6955M5017J44209J68641N0993j28041
$$ 336869 59618 -44001 -44190 -48171 54787 37832 82849 227058 395699 446692 318651
9370C18651k21268l31187N7134J61744K80440J67191J85864k79667q3213l6487
$$ 318651 97383 -233804 -176670 -14926 265514 432705 618569 338902 255689 219202
9360B19202J50121J64383j40370q1625l2781L711J79456J03051j28866p8428m1234
$$ 219202 369323 533706 393336 311711 278930 282641 462097 565148 436282 357854 316620
9349C16620K8526j12130J19586J95762k59091j36956r664Q8643J32374J71635
$$ 316620 345146 233016 352602 548364 289273 152317 142653 231296 363670 535305
9339E35305N494j41917J25591k51154k34038K32612j57850R5542K15062J01941
$$ 535305 540799 398882 524473 273319 39281 271893 114043 209585 424647 526588
9329E26588J50500j15350l6572j41559l5698J41539J19648l4021n61263j20715
$$ 526588 677088 561738 525166 383607 347909 489448 609096 575075 13812 -106903
9319a06903J50461K65643k7611J0508k1819j74557J06295J36964k00567N5976
$$ -106903 43558 309201 281590 292098 270279 95722 202017 338981 138414 194390
9309A94390k0670j3042j03795J27162K57539k3042j89523r123N0925P8281O4395
$$ 194390 173720 160678 56883 184045 441584 418542 229019 219896 270821 349102 413497
9298D13497J77057o587R9629K2545p7315j09010j65163J03861J6110r1820j25483
$$ 413497 590554 583967 683596 706141 628826 519816 354653 458514 474624 382804 257321
9287B57321N0140K80151K44200O9041k67447j7402R6580Q267p9330N7455J07916
$$ 257321 307461 587612 831812 900853 633406 616004 712584 720851 641521 698976 806892
9276H06892J68272m7878m8017O5778J45185P9724J30459p0562j76840o6637j30380
$$ 806892 975164 927286 879269 945047 1090232 1169956 1300415 1229853 1053013 986376 855996
9265H55996j89680J22705L3825J67706Q3324J42413K05978R1067o3544j61785
$$ 855996 666316 789021 822846 990552 1073876 1216289 1422267 1513334 1449790 1288005
9255A288005k30807J56738K28012k79054j46074R9206N5449P1432j47643j56588
$$ 1288005 1057198 1213936 1441948 1162894 1016820 1116026 1171475 1242907 1095264 938676
9245I38676n4214n5752K3558m8782Q9183N5180R5202k1475L2242L45945J19269
$$ 938676 884462 828710 852268 803486 892669 947849 1043051 1021576 1053818 1399763 1519032
9234A519032l54473k28032Q6347J27649J72023j12671j11545K46740K34862J33756
$$ 1519032 1164559 936527 1022874 1150523 1322546 1209875 1098330 1345070 1579932 1713688
9224A713688p8607Q1039O6499R1990J2301j9472j58294L154J04221k7013J01301
$$ 1713688 1635081 1716120 1782619 1874609 1886910 1867438 1709144 1712298 1816519 1789506 1890807
9213A890807K80381K70078J04627j04340l3433J79572L69604K63505J76973k21152
$$ 1890807 2171188 2441266 2545893 2441553 2408120 2587692 2957296 3220801 3397774 3176622
9203C176622j74713j41528J25356K02586J18341P5059M6702K54299K15682L6696
$$ 3176622 3001909 2860381 2985737 3188323 3306664 3381723 3428425 3682724 3898406 3935102
9193C935102N0606J59004K55231K04468J20916J55469K79617L82663j20293J21598
$$ 3935102 3985708 4144712 4399943 4604411 4725327 4880796 5160413 5543076 5422783 5544381
9183E544381J47999J91442K91376k63K33575N55575L67350L16942K09467O9963
$$ 5544381 5692380 5883822 6175198 6174935 6408510 6964085 7331435 7648377 7857844 7927807
9173G927807K98742L38672L12610L68609O44432M03152K59714J2914J37227K27793
$$ 7927807 8226549 8565221 8877831 9246440 9890872 10294024 10553738 10566652 10703879 10931672
9163A0931672K93172K57660N07303O73849L34449K56670J04182J28838K51339
$$ 10931672 11224844 11482504 11989807 12663656 12998105 13254775 13358957 13487795 13739134
9154A3739134M6860J7920K77125J26906K01455L77999J60910P9018k59506k98921
$$ 13739134 13785994 13803914 14081039 14207945 14409400 14787399 14948309 15027327 14767821 14468900
9144A4468900K0995q5830j68672k81397l75101l27178j18599n4084k15351k42830
$$ 14468900 14489895 14404065 14235393 13953996 13578895 13251717 13133118 13079034 12863683 12620853
9134A2620853j02926k83499k56870l56672m00116n7484j83781k73966l52154k27381
$$ 12620853 12517927 12234428 11977558 11620886 11220770 11163286 10979505 10705539 10353385 10126004
9124A0126004j24961m39827m16755k42503j89294r0193j55401r9309m4026k49897
$$ 10126004 10001043 9561216 9144461 8901958 8712664 8622471 8467070 8367761 8323735 8073838
9114H073838j48067k56191m25269k17840j64395l48718l7584m5093k53063m1469
$$ 8073838 7925771 7669580 7244311 7026471 6862076 6513358 6475774 6430681 6177618 6136149
9104F136149k3044j18640l37737k95107m5634J86872J0191L6166k77251m66487
$$ 6136149 6113105 5994465 5656728 5361621 5315987 5502859 5513050 5549216 5271965 4805478
9094D805478r2696k67822k17632n7621j63277p428n1293j97646j18860j42604
$$ 4805478 4712782 4444960 4227328 4169707 4006430 3999002 3947709 3750063 3631203 3488599
9084C488599p0812j28609j4684O387k1840j04803J3760L488R2349k20418j994
$$ 3488599 3417787 3289178 3274494 3280881 3259041 3154238 3167998 3171486 3263835 3043417 3041423
9073C041423r3003q9899k51754l32471l3029O4108o5808N2245p1371O4603N0223
$$ 3041423 2948420 2858521 2606767 2274296 2241267 2305375 2239567 2291812 2220441 2285044 2335267
9062B335267m8229j66626l93379R6990K32507K9728J13253J34161j38402k61225
$$ 2335267 2287038 2120412 1727033 1824023 2056530 2086258 2199511 2333672 2195270 1934045
9052A934045n6574j56982l6690J28546J61671j3468k11805P4461M0194k53852
$$ 1934045 1877471 1720489 1683799 1812345 1974016 1960548 1748743 1823204 1863398 1609546
9042A609546j01005k22068J47734J39896k15857k07091P1594N3002k5662o5298
$$ 1609546 1508541 1286473 1434207 1574103 1358246 1151155 1222749 1275751 1250089 1184791
9032A184791J4292J0319q2078J57799j24913L6120Q2904J04175M7287J6540j15911
$$ 1184791 1199083 1209402 1127324 1285123 1160210 1196330 1279234 1383409 1430696 1447236 1331325
9021A331325j63733l19182O645J8387J25714K33430J56330m7909q8698j56307
$$ 1331325 1167592 848410 855055 873442 999156 1232586 1388916 1341007 1252309 1096002
9011A096002n091Q9584p7464k0965l5579j0952J77293K82508M9602l53791k70512
$$ 1096002 1090911 1180495 1103031 1082066 1046487 1035535 1212828 1495336 1544938 1191147 920635
9000I20635k49889k9725Q4389J43128J70254L3515n5767J1445L7879j40261j63851
$$ 920635 670746 641021 725410 868538 1038792 1072307 1016540 1027985 1065864 925603 761752
8989G61752j9847p8083M7355K04991K2939l84128r2344j36983O4780J03547j83562
$$ 761752 741905 663822 711177 916168 939107 554979 462635 325652 390432 493979 310417
8978C10417j8871L1477J09392n9007k5073J71052J4392k20630k83305P6766L6801
$$ 310417 291546 323023 432415 373408 348335 519387 533779 313149 29844 106610 143411
8967A43411J6178l117j41515j9666L41973J99613M316j78517l71883J03374N20322
$$ 143411 159589 156472 14957 -4709 337264 536877 541193 362676 -9207 94167 614489
8956F14489J9427m9279O0513M3798j21072k964j83546k21768l5956j8789N4570
$$ 614489 633916 584637 645150 688948 567876 564912 381366 159598 123642 104853 159423
8945A59423K26574L77J7332o6206j7804K32980J21407j06828j43797K5430K6083
$$ 159423 385997 386374 403706 337500 319696 552676 674083 567255 423458 448888 474971
8934D74971l008L7708k4513p5301R6753l18392m5775J39470R1246q2422J36120
$$ 474971 471963 509671 485158 409857 506610 188218 142443 281913 373159 290737 426857
8923D26857K11772j43693q5808k7900R5727k39071j31350J68777K00352K44018
$$ 426857 638629 494936 409128 381228 476955 237884 106534 275311 475663 719681
8913G19681R3155J61529l03094k95738J21750K76324k04629l13527j11254k53810
$$ 719681 812836 974365 671271 375533 497283 773607 568978 255451 144197 -109613
8903a09613J51859K17776L7066K8336L3293q0228k6593j16619K22027J59874J47599
$$ -109613 42246 260022 297088 325424 358717 278489 251896 135277 357304 517178 664777
8892F64777p9341l09749j63704J37274M05873K1814k08351j09974n3358j637J12183
$$ 664777 585436 275687 111983 249257 655130 676944 468593 358619 305261 303624 415807
8881D15807J49241k29742l23304k145K01635J31774j19653J48242j29368j53428
$$ 415807 565048 335306 12002 9857 211492 343266 223613 371855 242487 89059
8871H9059J42506L8497q3829K55806j2742j34922O7492j39663l63029p8204K42758
$$ 89059 231565 270062 186233 442039 429297 294375 361867 222204 -140825 -219029 23729
8860B3729Q4556J17054k05211j09333L50218R6206J18109J08408k13643l64274
$$ 23729 108285 225339 20128 -89205 261013 357219 475328 583736 370093 5819
8850E819J60273R8577J26551r4370L062K76070l40201j97393m751L7532J55025
$$ 5819 166092 264669 391220 296850 299912 575982 235781 38388 33637 71169 226194
8839B26194K13607q3968j32561p1673K88537l6128n4130n619q4429Q1187j7278
$$ 226194 439801 355833 223272 151599 440136 404008 349878 344259 259830 341017 323739
8828C23739M857q8268K4006l9176J90680K53349j16039l16726n9454j48151k7930
$$ 323739 328596 240328 264334 225158 415838 669187 553148 236422 176968 28817 887
8817H87l1375J94646R3882J52552j01636o5241O5599j18498j06175n7344O4244
$$ 887 -30488 164158 258040 410592 308956 243715 309314 190816 84641 27297 91541
8806I1541K5294J52185K01288L7557j08924k92813k30829o8628L54378K5941L5166
$$ 91541 116835 269020 470308 507865 398941 106128 -124701 -193329 161049 186990 222156
8795B22156L7308J13132P3973q5789j70389M7464j86964k4812J16301L3949n4614
$$ 222156 259464 372596 446569 360780 190391 237855 50891 26079 142380 176329 121715
8784A21715K2158L52701p9990j91150j87376j09503l6663M4365j19991q2495M623
$$ 121715 143873 496574 416584 225434 38058 -71445 -108108 -63743 -183734 -266229 -261606
8773b61606l7131l90527O7733L02736J36935L44019J93706j74256o0759k1422
$$ -261606 -298737 -689264 -621531 -318795 -181860 162159 355865 181609 120850 99428
8763I9428l77935o9766O5515j68998K54471K22506K38472K7435k46123M9915K6176
$$ 99428 -278507 -348273 -282758 -451756 -197285 25221 263693 291128 45005 94920 121096
8752A21096j58944J4667M0756k75155k6291L27558J04499q7982P3154K79206j93944
$$ 121096 -37848 -23181 17575 -257580 -283871 43687 148186 60204 133358 412564 218620
8741B18620l23354k7386J19754J9953n6155j63392J5697K47035J34035r553Q8093
$$ 218620 -104734 -132120 -12366 7587 -48568 -211960 -196263 50772 184807 175254 263347
8730B63347O5881O3516j77947j96072K3421J20307q9221n6198j29515l4159P76
$$ 263347 329228 392744 214797 18725 42146 162453 73232 17034 -112481 -146640 -145864
8719a45864P1159Q5597o2357q0843k25689q647J37606J28203K83878k07538N8754
$$ -145864 -74705 10892 -51465 -132308 -357997 -366644 -229038 -100835 183043 -24495 34259
8708C4259K57957j0289j65266L0693n1171j24176o9991Q8158J12038k1922o8692
$$ 34259 292216 281927 116661 147354 96183 -27993 -97984 -9826 102212 80290 11598
8697A1598J66325K49132q2574k44743q707J07083L412r9669l0532j31103j00457
$$ 11598 177923 427055 344481 99738 91031 198114 201526 101857 71325 -59778 -160235
8686a60235L1641K39749K889j55129K35532j31922m04468m6566J14358L14084
$$ -160235 -128594 111155 114044 -41085 194447 62525 -341943 -388509 -274151 39933
8676C9933K60025l41555j55071M4467J35061Q554r3971j05938m4792J73297l0627
$$ 39933 299958 -41597 -196668 -152201 -17140 -8586 -102557 -208495 -253287 -79990 -110617
8665a10617j98331O6078L15113j22048l0507J96193n4069j3537J47410O074Q3192
$$ -110617 -308948 -242870 72243 -49805 -80312 115881 61812 48275 195685 201759 284951
8654B84951K7523P0507J79034j25164k22711M6214L6485l07167j30183J57421
$$ 284951 312474 382981 562015 436851 214140 260354 296839 -10328 -140511 16910
8644A6910J41743J69992j28125j13399o5657Q0694J01758K01170O0481j70171
$$ 16910 158653 328645 200520 87121 21464 102158 203916 405086 465567 295396
8634B95396k43701J08347P59m3227j87170k2436j3449K24134J78442R7357q9643
$$ 295396 51695 160042 160801 117574 -69596 -92032 -105481 118653 297095 394452 304809
8623C04809j93798J30788p4218O7829j00605k35L86085K26373l07433m5202K5179
$$ 304809 111011 241799 167581 235410 134805 134570 520655 747028 439595 394393 419572
8612D19572j57605j5868q813k76481O8262J95912k01002k6867J09600j45420o9538
$$ 419572 261967 246099 237286 -39195 29067 224979 23977 -2890 106710 -38710 -108248
8601a08248j45747r148M6863M5475L8869K1927j2000j4160j07791K4141K65493
$$ -108248 -253995 -263143 -216280 -170805 -131936 -110009 -122009 -136169 -243960 -219819 45674
8590D5674K06977j04930l41428m2670L9081j07712J67324J0377p264J8150R0874
$$ 45674 252651 147721 -193707 -236377 -197296 -305008 -137684 -127307 -134571 -116421 -25547
8579b5547J7648L7424L3061J28552K9158Q4802J0597o8422P4859J80403J21075
$$ -25547 -7899 29525 62586 191138 220296 305098 315695 247273 322132 502535 623610
8568F23610k05829j40873j28937K28507L17329j222p1379N2850m5704j64897k50679
$$ 623610 417781 276908 147971 376478 693807 692585 621206 674056 628352 463455 212776
8557B12776K4584o5314O2831J41304p16j44138k22754M6943J5919J6568J14651
$$ 212776 237360 172046 234877 376181 375465 231327 8573 55516 71435 88003 202654
8546B02654k10650j7267J16264l575J36893m0540K4889M6763n2429p0465Q6068
$$ 202654 -7996 -25263 91001 87426 224319 183779 208668 255431 203002 132537 218605
8535B18605P8814k4423k28517M5029J04587J94937O6202j43783j74138l01214
$$ 218605 297419 272996 44479 89508 194095 389032 455234 311451 137313 -163901
8525a63901K15253J37652J77012j37939j09045K02842q4304k8514J81626J76653
$$ -163901 51352 189004 366016 228077 119032 321874 237570 209056 390682 567335
8515E67335l0822l85339n1937m9230N2311j61002O2783K76028J73436l16866k35014
$$ 567335 536513 151174 99237 50007 102318 -58684 4099 280127 453563 136697 -98317
8504i8317p2685Q8364J45631P1598M9129L06706k1080k95484k93334j5508L364
$$ -98317 -171002 -82638 62993 134591 183720 490426 469346 173862 -119472 -134980 -131616
8493a31616k91440P8090K92793L81996m9646K5126k60918j78005Q9910P3005Q7867
$$ -131616 -423056 -344966 -52173 329823 280177 305303 44385 -133620 -43710 29295 117162
8482A17162J01379q6581r2335J21832j31185K8216L1022P0159J12112m7199l2621
$$ 117162 218541 131960 39625 161457 30272 58488 89510 159669 271781 224582 191961
8471A91961K97589N8391k04188k5718j14002J44041Q239k55032M9765L03066L7809
$$ 191961 489550 547941 343753 318035 204033 348074 356313 101281 151046 454112 491921
8460D91921o3537j78141p7011L5866K4435M1891R1728l01525k63575j77568J60735
$$ 491921 428384 250243 173232 209098 233533 275424 367152 65627 -197948 -375516 -214781
8449b14781L11189j80963k59606k20537j2873K44519j3681J31828J13171j15719
$$ -214781 96408 -84555 -344161 -564698 -577571 -333052 -346733 -214905 -101734 -217453
8439b17453J24129q113p3248J28010N7198j44609j28270J2006K28718L13028j14766
$$ -217453 -93324 -101437 -174685 -46675 10523 -134086 -262356 -250350 -21632 291396 176630
8428A76630k52917K09322M1054j90672K07530J20424k80438q2984N9438p1809
$$ 176630 -76287 133035 174089 -16583 190947 311371 30933 -52051 7387 -64422
8418f4422j08497J30590r5385j5147l1380J49908N1651J33988j43510J4663N1740
$$ -64422 -172919 -42329 -137714 -152861 -184241 -34333 17318 151306 7796 22459 74199
8407G4199r3251P05J39666N5323k9000j24562j69484q3545K90130J66992J9086
$$ 74199 -19052 -18347 121319 176642 147642 23080 -146404 -229949 60181 227173 246259
8396B46259k67739j34157Q9360J42631k99175q8830J21064m4617J13925L74593
$$ 246259 -21480 -155637 -66277 76354 -222821 -311651 -190587 -235204 -121279 253314
8386B53314n008k24343J31247j07046O4732J39432P1325l1040k82683j20951j9759
$$ 253314 248306 23963 155210 48164 112896 252328 323653 292613 9930 -111021 -130780
8375a30780J75034j12565Q8692m0705L7668j5607O8284R636k2454J0173J74721
$$ -130780 44254 -68311 20381 -20324 17344 1737 70021 79657 57203 67376 242097
8364B42097j92400r3257J13555N8945j90801J5852K00479M6121K1774r4386j47083
$$ 242097 49697 -43560 69995 128940 -61861 -46009 154470 200591 222365 127979 -19104
8353a9104j0872n879q3939j77964n7144m3829N0189j21161J48052Q165R2551j12878
$$ -19104 -29976 -35855 -119794 -297758 -354902 -398731 -348542 -469703 -321651 -313486 -220935 -333813
8341c33813Q9403J80793N585Q1757J7010K0158j84096K52766K9432k94536p2404
$$ -333813 -244410 -63617 -58032 23725 40735 60893 -123203 129563 158995 -135541 -207945
8330b07945k9122L3018j884K76597J21944j11412M7644j18469l4514K83571L3471
$$ -207945 -237067 -204049 -205933 70664 192608 81196 128840 10371 -24143 259428 292899
8319B92899L451K1857J7963p8357j51166M0810K14630J886j14755j55391m2877
$$ 292899 296350 318207 336170 257813 106647 147457 362087 363973 249218 93827 50950
8308E0950O5355K7467R7594j52266k25251l6206J65460j50757N5249K39565k5385
$$ 50950 116305 143772 241366 89100 -136151 -172357 -6897 -157654 -102405 137160 111775
8297A11775j60820J36608n4615j02290J69649J5790Q0829r8298Q1851k580k74725
$$ 111775 -49045 87563 32948 -69342 100307 116097 196926 98628 180479 177899 -96826
8286i6826j68005J12319J29894l0352M2371m1707k3241j816J11420R2608J88806
$$ -96826 -264831 -152512 -22618 -52970 -10599 -52306 -75547 -77363 34057 126665 315471
8275C15471K7910k34047j24931J03165J92164P1810J12339j33860k37275K15658
$$ 315471 343381 109334 -15597 87568 279732 351542 463881 330021 92746 308404
8265C08404j39843j71820j70803m5371M8986J63352J84949j41450k06863J17003
$$ 308404 168561 -3259 -174062 -219433 -170447 -7095 177854 36404 -170459 -53456
8255e3456J03651J03880j94419j4954j15102o3325O5095K2422j16301n7950m7962
$$ -53456 50195 154075 -40344 -55298 -170400 -233725 -168630 -146208 -262509 -320459 -368421
8244c68421M0785J76551j90541j24684J17074L46660J53725J52420Q017j20987
$$ -368421 -327636 -151085 -341626 -466310 -349236 -2576 151149 303569 311586 190599
8234A90599l9010k09076M7890J43109M615J16483P5251j4502j13008J28565q1612
$$ 190599 151589 -57487 -9597 133512 138127 254610 329861 315359 202351 330916 249304
8223B49304j245K16226N4845k79321l41163m4796J30116k5153n2332j25257J1591
$$ 249304 248059 464285 519130 239809 -101354 -146150 -16034 -41187 -93519 -218776 -207185
8212b07185J04729r5494R2969N7372M4724L9944j9560r1272j16400J73123Q4928
$$ -207185 -102456 -197950 -104981 -47609 -2885 37059 17499 -73773 -190173 -17050 67878
8201F7878K71439R6454l4422j86066M6484j48317K2309n3265n5209J5663O8377
$$ 67878 339317 435771 401349 215283 261767 113450 135759 82494 27285 42948 111325
8190A11325J89718J26701j25261k24992J03553N2524R5158r8939j79207j21762
$$ 111325 301043 427744 302483 77491 181044 233568 328726 229787 50580 -71182
8180g1182n8636j48837J82688K00468J83377J82676j47980j88582Q5175O7097
$$ -71182 -129818 -278655 -95967 104501 287878 470554 322574 133992 219167 286264
8170B86264l88771l16617j34972J79219K45555J75149r4300J64944J93201j32933
$$ 286264 -102507 -419124 -554096 -374877 -129322 45827 -48473 116471 309672 176739
8160A76739Q9837J5138l53493j45368j04937k09374J17848J05599k4732K14885
$$ 176739 266576 281714 -71779 -217147 -322084 -531458 -413610 -308011 -332743 -117858
8150a17858J22068K16782K2656j91763p6608L3442J2973O212M5987R1602j69307
$$ -117858 4210 220992 243648 51885 -24723 8719 21692 27904 73891 165493 -3814
8139c814P1949K38535N7356n6900k14978R1002q7809p0211o9523J815l6230j4991
$$ -3814 68135 306670 364026 307126 92148 183150 95341 25130 -44393 -42578 -78808 -93799
8127i3799K58171N7703j39863P956J55112n9177j80045J6518k6356K5821K01555
$$ -93799 164372 222075 82212 90168 245280 186103 6058 22576 -3780 22041 223596
8116B23596j13715o3152j32043l7330J36399n6120p8275J36898O6759j03001j23521
$$ 223596 109881 46729 -85314 -122644 13755 -42365 -120640 16258 83017 -19984 -143505
8105a43505j27598K66130J08413o9973o6374j95247J42824L57425M6272k07361
$$ -143505 -271103 -4973 103440 33467 -32907 -228154 -85330 272095 318367 111006
8095A11006r1083l38275k61606K40164K43193j44198n5051J3275j38674K11007
$$ 111006 19923 -318352 -579958 -339794 -96601 -240799 -295850 -282575 -421249 -210242
8085b10242K43189m8922l31130K5581K40830j2935j50278k0421m7383J58436J80954
$$ -210242 32947 -15975 -347105 -321524 -80694 -93629 -243907 -264328 -311711 -153275 27679
8074B7679L5407p9435j80995J3646K17281J12361J54731k25980q8581N94R38M4577
$$ 27679 63086 -16349 -197344 -183698 33583 145944 300675 74695 -13886 -13292 -12354 32223
8062C2223p5483j28371j51845j77609J393K72091L82715j29092l02900o8866J919
$$ 32223 -43260 -171631 -323476 -501085 -499692 -227601 155114 26022 -276878 -345744 -343825
8051c43825K12081J71493M7137j57127L089R7362K62389O5893L63661L5923o698
$$ -343825 -131744 39749 86886 -70241 -67152 30210 292599 358492 722153 758076 751378
8040G51378k74653l29830j5553j8309K6879q9552j0741K959j26242Q601K69599
$$ 751378 476725 146895 131342 113033 139912 50360 39619 42578 -83664 -75063 194536
8029A94536J05830j48149j57673J2041J92226j00396k84582j90739k74938J86501
$$ 194536 300366 152217 -5456 6585 198811 98415 -186167 -376906 -651844 -465343
8019d65343K50686J30662O8050j57833m864J94768L9643O7885j5270l6580K0547
$$ -465343 -214657 -83995 -15945 -173778 -178642 16126 55769 123654 108384 71804 92351
8008I2351O8393L8811q8K949K7568j34480k14943K5526r458j17527N4787K06168
$$ 92351 160744 199555 199467 202416 229984 95504 -119439 -93913 -103371 -220898 -166111 40057
7996D0057L28710M2273j84268j25327j08764J72435K499j12438J40617J02595
$$ 40057 368767 411040 226772 101445 -7319 165116 167615 55177 195794 298389
7986B98389j8049p5228k4795k91616j10937J36086K07619m372j43688J86965K18917
$$ 298389 280340 205112 180317 -111299 -222236 -86150 121469 117097 -26591 160374 379291
7975C79291J77218j55192r0083r8230L9671J37039N0258l08441k21353l2695J42660
$$ 379291 556509 401317 311234 213004 252675 389714 439972 131531 -89822 -122517 20143
7964B0143j3614L5938j68859j842M25919L00431r7599l23299m4577J58562j02796
$$ 20143 6529 42467 -126392 -128234 297685 598116 500517 177218 132641 291203 188407
7953A88407l27947j4225J54243R0396j51285n5398J67659J47798j09803j67007
$$ 188407 -139540 -153765 478 90874 -60411 -115809 51850 199648 89845 -77162
7943g7162q3516L1043L3414q770O322L0533M1874J9085P9437q2444J96656J31737
$$ -77162 -160678 -129635 -96221 -104991 -98669 -68136 -26262 -7177 72260 -10184 186472 318209
7931C18209j55285K1686q5447m538m5772J02611J50596k16069m85351R9240O00998
$$ 318209 162924 184610 99163 94625 48853 151464 302060 85991 -399360 -300120 300878
7920C00878O6489o3522n898J83322K9042l82244k38431O2188j94439N0005K15737
$$ 300878 367367 303845 297947 481269 510311 128067 -110364 -48176 -242615 -192610 23127
7909B3127r0290o5367p992j61946k3853J27866J58770o8773j3192M4164J99401
$$ 23127 -67163 -132530 -140522 -302468 -326321 -198455 -39685 -108458 -121650 -77486 121915
7898A21915R9517k21063k09241J90571J13867p3977o1396N9776J5010J76359j13316
$$ 121915 221432 369 -208872 -18301 95566 21589 -39807 19969 34979 211338 98022
7887I8022j0627n7240J0920j31320Q3107P3166m9393p7394m1363p5550J59153
$$ 98022 87395 30155 41075 -90245 -7138 66028 16635 -60759 -102122 -177672 -18519
7876a8519J63885N8609j1546j33195m4389K52985J62096j09657l81475q4823J10759
$$ -18519 145366 203975 192429 59234 14845 267830 429926 320269 -61206 -146029 -35270
7865c5270l0544J49465m3360l3407J94835L6029R1494K13592k07840k45250j22154
$$ -35270 -65814 83651 40291 6884 201719 237748 329242 542834 334994 89744 -32410
7854c2410o794J58910K3204k11303j04836K91084M7061j84745j89268j23562k35423
$$ -32410 -39204 119706 142910 -68393 -173229 117855 164916 -19829 -209097 -332659 -568082
7843e68082L25279L09841p21j14611k40790j94563M4375J12879K39271K99432
$$ -568082 -242803 67038 66317 -48294 -289084 -483647 -439272 -326393 -87122 212310
7833B12310J43990q3243J24676J65099k88102j07556M7656j72859k42550L5912
$$ 212310 356300 273057 397733 562832 274730 167174 214830 41971 -200579 -164667
7823a64667m7648l1996K35339K53333J84063n9328l01260j44584j37493l781j56762
$$ -164667 -212315 -244311 -8972 244361 428424 369096 67836 -76748 -214241 -218022 -374784
7812c74784j02331Q8551O9887J526P8514l8240J88168O102K6676k9689K82426
$$ -374784 -477115 -388564 -318677 -317151 -238637 -276877 -88709 -82607 -55931 -85620 196806
7801A96806J4886P0576k53807j09960M0385J5389L8232j1113k1128o2473J32080
$$ 196806 211692 282268 28461 -81499 -41114 -25725 12507 1394 -19734 -82207 49873
7790D9873j5513l6424J17491k0691Q1640Q4615N9316q1720l25711j16577O9571
$$ 49873 34360 -2064 115427 94736 176376 260991 320307 238587 -87124 -203701 -134130
7779a34130J85183k1115P0171j10710q8611q6805n1287J27257K04063p0155l94556
$$ -134130 51053 29938 100109 -10601 -99212 -186017 -237304 -110047 94016 23861 -370695
7768c70695r733M48813L74012k4866j69546j22882J13831k1750k77183J41022
$$ -370695 -380428 68385 442397 417531 247985 125103 238934 217184 -59999 81023
7758H1023J80058K1582N5391p0314j20893L3174o1254J91068O8861j77103j06923
$$ 81023 261081 282663 338054 267740 146847 180021 118767 309835 378696 201593 94670
7747I4670j63536j76655N138j32009m0391K28960J01982j52976n4702J23792K12382
$$ 94670 -68866 -245521 -240383 -372392 -412783 -183823 -81841 -234817 -289519 -165727 46655
7736D6655M0157q1874J04720N5806K34491J69939l84130k98135j02309J0128k32205
$$ 46655 86812 4938 109658 165464 399955 569894 185764 -112371 -214680 -204552 -436757
7725d36757k7492K44760L3510N1444M08310j18545k96947q2045J04344L07964
$$ -436757 -464249 -219489 -185979 -134535 273775 155230 -141717 -223762 -119418 188546
7715A88546o9309m68463k17513K96035L74702k47148q4433J8172J84724J28850
$$ 188546 119237 -349226 -566739 -270704 103998 -143150 -227583 -209411 -24687 104163
7705A04163k21866m6814r5092P919K27312J8341R762q1037k45516j1239K07730
$$ 104163 -117703 -164517 -259609 -251690 -24378 -6037 3725 -77312 -322828 -334067 -126337
7694a26337K662M2182O430j8402j9652p0707o6656o4769J56067J36686j81596
$$ -126337 -123675 -81493 -75063 -93465 -113117 -183824 -250480 -315249 -159182 -22496 -204092
7683b04092r9947N8505J07434Q0393O1377j50379J13608K33144r4711k61283J13771
$$ -204092 -304039 -245534 -138100 -57707 3670 -146709 -33101 200043 105332 -155951 -42180
7672d2180J27724N8805K59639J58455k73371j85397L8385k46114j74630K54539
$$ -42180 85544 144349 403988 562443 289072 103675 142060 -104054 -278684 -24145
$$ [...]
##END NTUPLES=NMR SPECTRUM
##END=
