##TITLE=Analysis number 321355
Compound Code cc 55639
Book Reference 423/82/9
Project Code adrs
Chemist Name bruced
##JCAMPDX= 6.0         $$ Bruker NMR JCAMP-DX V2.0
##DATA TYPE= NMR SPECTRUM
##DATA CLASS= NTUPLES
##ORIGIN= Bruker BioSpin GmbH
##OWNER= nmr
$$ XWIN-NMR		Version 3.5
$$ Mon Aug  7 11:03:12 2006 GMT Daylight Time (UT+1h)  MAYBRIDGE\nmr@NMR_250MHZ
##.OBSERVE FREQUENCY= 250.131544655141
##.OBSERVE NUCLEUS= ^1H
##.ACQUISITION MODE= SIMULTANEOUS (DQD)
##.ACQUISITION SCHEME= undefined
##.AVERAGES= 16
##.DIGITISER RES= 18
##SPECTROMETER/DATA SYSTEM= dpx250
##.PULSE SEQUENCE= zg30
##.SOLVENT NAME= CDCl3
##.SHIFT REFERENCE= (INTERNAL, CDCl3, 0, 16.4493)
##AUDIT TRAIL= $$ (NUMBER, WHEN, WHO, WHERE, WHAT)
$$ ##TITLE= Audit trail, XWIN-NMR		Version 3.5
$$ ##JCAMPDX= 5.01
$$ ##ORIGIN= Bruker BioSpin GmbH
$$ ##OWNER= nmr
$$ C:\u/data/dgb/nmr/ADRS/330/pdata/1/auditp.txt
$$ ##AUDIT TRAIL=  $$ (NUMBER, WHEN, WHO, WHERE, WHAT)
(   1,<2006-08-07 11:02:50.70 +100>,<MAYBRIDGE\nmr>,<NMR_250MHZ>,
      <created by zg, POWCHK disabled, PULCHK disabled
       configuration hash MD5:
       E2 DF 36 D8 04 B2 41 60 5A D7 A3 38 5A 4B D0 FE
       data hash MD5: 64K
       26 E1 6A 6C A3 75 E2 01 02 40 91 96 EE A7 26 76>)
(   2,<2006-08-07 11:03:02.98 +100>,<MAYBRIDGE\nmr>,<NMR_250MHZ>,
      <Start of raw data processing
       ef LB = 0.3 FT_mod = 6 PKNL = 1 SI = 32K 
       data hash MD5: 32K
       41 FD B6 CE FC 72 AD 5C EA 3B 70 75 24 F3 2D 01>)
(   3,<2006-08-07 11:03:04.67 +100>,<MAYBRIDGE\nmr>,<NMR_250MHZ>,
      <apk 
       data hash MD5: 32K
       37 97 86 48 8C 14 FE D7 5B FF CE CE BE 4D 11 FD>)
(   4,<2006-08-07 11:03:05.39 +100>,<MAYBRIDGE\nmr>,<NMR_250MHZ>,
      <abs ABSG = 5 
       data hash MD5: 32K
       35 89 C1 D5 25 D4 0D E2 4F 79 74 D8 18 0B 08 50>)
$$ ##END=
$$ 
$$ hash MD5
$$ 51 13 40 8E 5D F4 18 1E 95 AA E5 21 C5 09 AD CE
##$RELAX= 
##$RELAX= 
##$RELAX= 
##$RELAX= 
##$RELAX= 
##$RELAX= 
##$RELAX= 
$$ Bruker specific parameters
$$ --------------------------
##$DU= <C:\u>
##$EXPNO= 330
##$NAME= <ADRS>
##$PROCNO= 1
##$TYPE= <nmr>
##$USER= <dgb>
##$AMP= (0..31)
100 100 100 100 100 100 100 100 100 100 100 100 100 100 100 100 100 100 
100 100 100 100 100 100 100 100 100 100 100 100 100 100 
##$AQSEQ= 0
##$AQ_mod= 3
##$AUNM= <au_zg>
##$AUTOPOS= <12 >
##$BF1= 250.13
##$BF2= 250.13
##$BF3= 250.13
##$BF4= 250.13
##$BF5= 500.13
##$BF6= 500.13
##$BF7= 500.13
##$BF8= 500.13
##$BYTORDA= 1
##$CFDGTYP= 0
##$CFRGTYP= 5
##$CHEMSTR= <none>
##$CNST= (0..31)
1 1 145 1 1 1 1 1 1 1 1 1 1 1 1 1 1 1 1 1 1 1 1 1 1 1 1 1 1 1 1 1 
##$CPDPRG= <>
##$CPDPRG1= <>
##$CPDPRG2= <>
##$CPDPRG3= <>
##$CPDPRG4= <mlev>
##$CPDPRG5= <mlev>
##$CPDPRG6= <mlev>
##$CPDPRG7= <mlev>
##$CPDPRG8= <mlev>
##$CPDPRGB= <>
##$CPDPRGT= <>
##$D= (0..31)
0 1 0 0 0 0 0 0 0 0.06 0 0 0 0 0 0 0.0002 0 0 0 0 0 0 0 0 0 0 0 0 0 0 
0 
##$DATE= 1154944969
##$DBL= (0..7)
120 120 120 120 120 120 120 120 
##$DBP= (0..7)
150 150 150 150 150 150 150 150 
##$DBP07= 0
##$DBPNAM0= <>
##$DBPNAM1= <>
$$ [...]
##$SUBNAM7= <"">
##$SUBNAM8= <"">
##$SUBNAM9= <"">
##$SW= 20.6930455092707
##$SWIBOX= (0..15)
0 0 3 0 0 0 0 0 0 0 0 0 0 0 0 0 
##$SW_h= 5175.983436853
##$TD= 65536
##$TD0= 1
##$TE= 295.16
##$TE2= 300
##$TE3= 300
##$TEG= 300
##$TL= (0..7)
0 120 120 120 120 120 120 120 
##$TP= (0..7)
150 150 150 150 150 150 150 150 
##$TP07= 0
##$TPNAME0= <>
##$TPNAME1= <>
##$TPNAME2= <>
##$TPNAME3= <>
##$TPNAME4= <>
##$TPNAME5= <>
##$TPNAME6= <>
##$TPNAME7= <>
##$TPOAL= (0..7)
0.5 0.5 0.5 0.5 0.5 0.5 0.5 0.5 
##$TPOFFS= (0..7)
0 0 0 0 0 0 0 0 
##$TUNHIN= 0
##$TUNHOUT= 0
##$TUNXOUT= 0
##$USERA1= <user>
##$USERA2= <user>
##$USERA3= <user>
##$USERA4= <user>
##$USERA5= <user>
##$V9= 5
##$VALIST= <valist>
##$VCLIST= <CCCCCCCCCCCCCCC>
##$VD= 0
##$VDLIST= <DDDDDDDDDDDDDDD>
##$VPLIST= <PPPPPPPPPPPPPPP>
##$VTLIST= <TTTTTTTTTTTTTTT>
##$WBST= 1024
##$WBSW= 4
##$XGAIN= (0..3)
0 0 0 0 
##$XL= 0
##$YL= 0
##$YMAX_a= 542594
##$YMIN_a= -598911
##$ZGOPTNS= <>
##$ZL1= 120
##$ZL2= 120
##$ZL3= 120
##$ZL4= 120
##$ABSF1= 16.44926
##$ABSF2= -4.243912
##$ABSG= 5
##$ABSL= 3
##$ALPHA= 0
##$AQORDER= 0
##$ASSFAC= 0
##$ASSFACI= 0
##$ASSFACX= 0
##$ASSWID= 0
##$AUNMP= <proc_1d>
##$AZFE= 0.1
##$AZFW= 0.1
##$BCFW= 0
##$BC_mod= 0
##$BYTORDP= 0
##$COROFFS= 0
##$CY= 12.5
##$DATMOD= 1
##$DC= 0
##$DFILT= <>
##$DTYPP= 0
##$F1P= 14.0000005364418
##$F2P= -0.99999901652339
##$FCOR= 0.5
##$FTSIZE= 32768
##$FT_mod= 6
##$GAMMA= 0
##$GB= 0
##$INTBC= 1
##$INTSCL= 1
##$ISEN= 128
##$LB= 0.3
##$LEV0= 0
##$LPBIN= 0
##$MAXI= 10000
##$MC2= 0
##$MEAN= 0
##$ME_mod= 0
##$MI= 0
##$NCOEF= 0
##$NC_proc= -2
##$NLEV= 6
##$NOISF1= 0
##$NOISF2= 0
##$NSP= 0
##$NTH_PI= 0
##$NZP= 0
##$OFFSET= 16.44926
##$PC= 1
##$PHC0= 149.0537
##$PHC1= 3.469185
##$PH_mod= 1
##$PKNL= yes
##$PPARMOD= 0
##$PSCAL= 4
##$PSIGN= 0
##$REVERSE= no
##$SF= 250.13001819334
##$SI= 32768
##$SIGF1= 0
##$SIGF2= 0
##$SINO= 400
##$SIOLD= 32768
##$SREGLST= <1H.CDCl3>
##$SSB= 0
##$STSI= 32768
##$STSR= 0
##$SW_p= 5175.98343685301
##$SYMM= 0
##$S_DEV= 0
##$TDeff= 65536
##$TDoff= 0
##$TI= <Analysis number 999999
Compound Code 99
Book Reference 9
Project Code 9>
##$TILT= no
##$TM1= 0
##$TM2= 0
##$TOPLEV= 0
##$USERP1= <user>
##$USERP2= <user>
##$USERP3= <user>
##$USERP4= <user>
##$USERP5= <user>
##$WDW= 1
##$XDIM= 32768
##$YMAX_p= 287943103
##$YMIN_p= -29309
$$ End of Bruker specific parameters
$$ ---------------------------------
##NTUPLES= NMR SPECTRUM
##VAR_NAME=  FREQUENCY,     SPECTRUM/REAL,   SPECTRUM/IMAG
##SYMBOL=    X,             R,               I
##VAR_TYPE=  INDEPENDENT,   DEPENDENT,       DEPENDENT
##VAR_FORM=  AFFN,          ASDF,            ASDF
##VAR_DIM=   32768,         32768,           32768
##UNITS=     HZ,            ARBITRARY UNITS, ARBITRARY UNITS
##FACTOR=    0.157963299565203, 1,           1
##FIRST=     4114.45388107699, 0,            0
##LAST=      -1061.52955577602, 0,           0
##MIN=       -1061.52955577602, -29309,      0
##MAX=       4114.45388107699, 287943103,    0
$$ Real data points
##PAGE= N=1
##DATA TABLE= (X++(R..R)), XYDATA
$$ [...]
15106a6340L645O721N584N056m533j403l311O23L638M391j735p258p811k358J488
$$ -16340 -12695 -5974 -390 4666 133 -1270 -4581 -3958 -320 4071 2336 -4922 -12733 -15091 -13603
15091a3603n728k826K007K705Q712N512Q22j464P3l378M72n71j863j320o192M165
$$ -13603 -19331 -22157 -20150 -17445 -8733 -3221 -2399 -3863 -3790 -7168 -6696 -7267 -9130 -10450 -16642 -12477
15075a2477J490O69k424l810l667n32M906M386L752N75m286M156J098L438P058
$$ -12477 -10987 -10318 -12742 -16552 -20219 -20751 -15845 -11459 -7707 -7132 -11418 -7262 -6164 -2726 4332
15060D332r772K96j0910l392M672K149l387M330J03k18M151M541o476k144P010
$$ 4332 -5440 -5144 -16054 -19446 -14774 -12625 -16012 -11682 -11579 -11797 -7646 -3105 -9581 -11725 -4715
15045d715P087k303n759j476O490L626P02N026o832n765m405m069n329J106K572
$$ -4715 2372 69 -5690 -7166 -676 2950 3652 8678 1846 -3919 -8324 -12393 -17722 -16616 -14044
15030a4044M867k532p019j127L239J471l952O662K229P022L78k571K333Q16M051
$$ -14044 -9177 -11709 -18728 -19855 -16616 -15145 -19097 -12435 -10206 -3184 -2806 -5377 -3044 -2228 1823
15015A823N895n028q927j975K190j892m315J75N950J874l732N34O230O111l275
$$ 1823 7718 2690 -6237 -8212 -6022 -7914 -12229 -12054 -6104 -4230 -7962 -7428 -1198 4913 1638
15000A638n010m045K66M585N365k538p515k475M679L77n400M329J237J15L978
$$ 1638 -3372 -7417 -7151 -2566 2799 261 -7254 -9729 -5050 -4673 -10073 -5744 -4507 -4392 -414
14985d14J355l029k56k440q317M443K881k097k913J978O409R74o14n990k934j989
$$ -414 941 -2088 -2344 -4784 -13101 -8658 -5777 -7874 -10787 -8809 -2400 -1426 -2040 -8030 -10964 -12953
14969a2953J473K673N529J352J932j580n716k796L561r5J731P66J127J621J779
$$ -12953 -11480 -8807 -3278 -1926 6 -1574 -7290 -10086 -6525 -6620 -4889 -4123 -2996 -1375 404
14954D04J514k67o666l454m217l993j588j680K768O950Q389Q81j040o779p767
$$ 404 1918 1651 -5015 -8469 -12686 -16679 -18267 -19947 -17179 -10229 -1840 -959 -1999 -8778 -16545
14939a6545L728K374K336K836K265j97J462J866j4396r773M60N832Q460J223m970
$$ -16545 -12817 -10443 -8107 -5271 -3006 -3203 -1741 125 -14271 -24044 -23584 -17752 -9292 -8069 -13039
14924a3039K036m156J963M73j11o773l907M644J565k868K521k91l962N245L443
$$ -13039 -11003 -15159 -13196 -12723 -12834 -19607 -23514 -18870 -17305 -20173 -17652 -17943 -21905 -16660 -13217
14909a3217J573L870Q140J174l229J612J340n865n115K033N538M328k185j148
$$ -13217 -11644 -7774 366 1540 -1689 -77 1263 -4602 -9717 -7684 -2146 2182 -3 -1151
14895a151L663J405m461o609m528N533J827l599j674K516N411n103J003J916p6
$$ -1151 2512 3917 -544 -7153 -11681 -6148 -4321 -7920 -9594 -7078 -1667 -6770 -5767 -3851 -3927
14880c927k892j551k779J869L12M898n344J884R65K580J1342k538j1002p978J24
$$ -3927 -6819 -8370 -11149 -9280 -8968 -4070 -9414 -7530 -6565 -3985 7357 4819 -6183 -14161 -14037
14865a4037M71K824q223l228R344l342M424J792L258J336K219k084o95m604p965
$$ -14037 -13566 -10742 -18965 -22193 -12849 -16191 -11767 -9975 -6717 -5381 -3162 -5246 -5941 -10545 -18510
14850a8510O23l060N382K126k884p901m391J875J46r41P158J771M299P926l022
$$ -18510 -17887 -20947 -15565 -13439 -16323 -24224 -28615 -26740 -26594 -27535 -20377 -18606 -14307 -6381 -9403
14835i403o553m371k323N276M383k378j066J313J619K777J872N547K608p405j3802
$$ -9403 -15956 -20327 -22650 -17374 -12991 -15369 -16435 -15122 -13503 -10726 -8854 -3307 -699 -8104 -21906
14820b1906L128J6013O728k478j0411O947M848l871m448j411m35k947R13m139
$$ -21906 -18778 -2765 3963 1485 -8926 -1979 2869 -1002 -5450 -6861 -7296 -10243 -9330 -13469
14806a3469P210J300p297p90O485P295N648j376k218o798J357K421j464n789L116
$$ -13469 -6259 -4959 -12256 -13046 -6561 734 6382 5006 2788 -4010 -2653 -232 -1696 -7485 -4369
14791d369k667k706K922k184r38K891Q66M644O888p29r410l403K814o570k058
$$ -4369 -7036 -9742 -6820 -9004 -9942 -7051 -6185 -1541 5347 4618 -4792 -8195 -5381 -11951 -14009
14776a4009j213j132K288L572o065n612R063Q236L352p71N262m755j1581J093
$$ -14009 -15222 -16354 -14066 -10494 -16559 -22171 -13108 -4872 -1520 -2291 2971 -1784 -13365 -12272
14762a2272J245K45j971l906P218J3457k589r227K499M000L53n097L786j084l948
$$ -12272 -11027 -10782 -12753 -16659 -9441 4016 1427 -7800 -5301 -1301 -948 -6045 -2259 -3343 -7291
14747g291J185P51o071l608m389O332P109L89J236M320k487o908r20O489M112
$$ -7291 -6106 -5355 -11426 -15034 -19423 -13091 -5982 -5593 -4357 -37 -2524 -9432 -10352 -3863 249
14732B49J130j117l392L931j948n378l544q892n682m230J900Q851L812J578p93
$$ 249 1379 262 -3130 801 -1147 -6525 -10069 -18961 -24643 -28873 -26973 -18122 -14310 -12732 -13525
14717a3525M94J397L736l631o929P468Q593K469k944m553j4O963n988k846O994
$$ -13525 -13031 -11634 -7898 -11529 -18458 -10990 -2397 72 -2872 -7425 -7439 -476 -6464 -9310 -2316
14702b316j129j186K598j191j258j97M053J282k700k918q39j145r128l197R36
$$ -2316 -3445 -4631 -2033 -3224 -4482 -4679 -626 656 -2044 -4962 -5801 -6946 -16074 -19271 -18335
14687a8335Q67M560N296k554Q978K167l233o65q565k191K612L375L540J860Q69
$$ -18335 -17468 -12908 -7612 -10166 -1188 979 -2254 -2919 -11484 -13675 -11063 -7688 -4148 -2288 -1419
14672a419l148l81L711J196J898o617r536n557l114N892P699j632j443J664K164
$$ -1419 -4567 -4948 -1237 -41 1857 -4760 -14296 -19853 -22967 -17075 -9376 -11008 -12451 -10787 -8623
14657h623o23O583P6K662L74l781n932m274k37n358L833O020P7M736l461p972
$$ -8623 -9246 -2663 -2587 75 449 -3332 -9264 -13538 -13775 -19133 -15300 -9280 -9203 -4467 -7928 -15900
14641a5900l003O59N250p52k222L264L565J662L565J2773m187o222j921k08k754
$$ -15900 -18903 -18244 -12994 -13746 -15968 -12704 -9139 -7477 -3912 8861 4674 -1548 -3469 -3677 -6431
14626f431K424J035l608q713L16L168J244K222K386l306l302K305L373p936k864
$$ -6431 -4007 -2972 -6580 -15293 -14977 -11809 -10565 -8343 -5957 -9263 -12565 -10260 -6887 -14823 -17687
14611a7687J549K980N581N44k472K513l489l728l906j524K454P592O683Q35n090
$$ -17687 -16138 -13158 -7577 -7033 -9505 -6992 -10481 -14209 -18115 -19639 -17185 -9593 -2910 -2075 -7165
14596g165K178L206m452J674l032o484n800R3p68k049Q90K367M336N530l599K154
$$ -7165 -4987 -1781 -6233 -4559 -7591 -14075 -19875 -19782 -20550 -22599 -21709 -19342 -15006 -9476 -13075 -10921
14580a0921J840K607jj790R46O095O903j171r136n201N847O925j162k55m133M356
$$ -10921 -9081 -6474 -6475 -8265 -7319 -1224 5679 4508 -4628 -9829 -3982 2943 1781 1526 -2607 1749
14564A749L098j617q032n867K391R1L302N800k649J728K449O014K520L750m711
$$ 1749 4847 3230 -4802 -10669 -8278 -8187 -4885 915 -1734 -6 2443 8457 10977 14727 10016
14549A0016q270k082j842j689M8l524l074m519m104l867j763l733M972o15M941
$$ 10016 1746 -336 -2178 -3867 -3819 -7343 -10417 -14936 -19040 -22907 -24670 -28403 -23431 -24046 -19105
14534a9105M381N621N964J375o093m451k185j121l571K908J147N156Q014r48r14
$$ -19105 -14724 -9103 -3139 -1764 -7857 -12308 -14493 -15614 -19185 -16277 -15130 -9974 -1960 -2908 -3822
14519c822n114m210O50J683L435l421K642M18L28l16j994J283j733j074o413l815
$$ -3822 -8936 -13146 -12496 -10813 -7378 -10799 -8157 -7739 -7411 -7727 -9721 -8438 -10171 -11245 -17658 -21473
14503b1473M750n177N506J1649P427j0646q219L579P884O90q165j0640K177J2260
$$ -21473 -16723 -21900 -16394 -4745 2682 -7964 -16183 -12604 -4720 -4030 -12195 -22835 -20658 -8398
14489h398L910o637n80J05J320J41j2552K717J1813J552O456N295n68p145o065
$$ -8398 -4488 -11125 -11705 -11600 -10280 -10139 -22691 -19974 -8161 -6609 -153 5142 4574 -2571 -8636
14474h636l733K181kk067r59L7k339m935L977M302L449m992N56O850L214J954
$$ -8636 -12369 -10188 -10190 -12257 -13216 -13179 -15518 -20453 -16476 -12174 -8725 -13717 -13161 -6311 -3097 -1143
14458a143L26M10p188J896J352q75q003P0m986N660j802k687l280j696P510N278
$$ -1143 -817 -407 -7595 -5699 -4347 -5222 -13225 -13155 -18141 -12481 -14283 -16970 -20250 -21946 -14436 -9158
14442i158N251O784m30j704q780l723O523L247o33P30L941N681k126o489J862
$$ -9158 -3907 2877 2447 743 -8037 -11760 -5237 -1990 -2623 -1893 2048 7729 5603 -886 976
14427I76n554n514M417M40n427j1M685k002J073j890J030J491k196k502j34j89
$$ 976 -4578 -10092 -5675 -5235 -10662 -10673 -5988 -7990 -6917 -8807 -7777 -6286 -8482 -10984 -11118 -11307
14411a1307M077n53n211l705K542J322J306N176P498k019L416R80l332L60k205
$$ -11307 -7230 -7783 -12994 -16699 -14157 -12835 -11529 -6353 1145 -874 2542 3522 190 550 -1655
14396a655p465j877M045k18r3O234M402m521K493J725p093k929k813p017k251
$$ -1655 -9120 -10997 -6952 -7170 -7263 -1029 3373 -1148 1345 3070 -4023 -6952 -9765 -16782 -19033
14381a9033P31K883K387L785k067l771M034N056Q41n261m716L665R216j556m41
$$ -19033 -18302 -15419 -13032 -9247 -11314 -15085 -11051 -5995 -5154 -10415 -15131 -11466 -2250 -3806 -4247
14366d247M410K273k649k514m92R17j862q108j898j117J690M427j477m059l021
$$ -4247 163 2436 -213 -2727 -3219 -2302 -4164 -12272 -14170 -15287 -13597 -9170 -10647 -14706 -17727
14351a7727K671N896P553k894q965k197Q506l175k582M969P037Q30j0654n568
$$ -17727 -15056 -9160 -1607 -4501 -13466 -15663 -7157 -10332 -12914 -7945 -908 -78 -10732 -16300
14337a6300K651L275j167k32k130o52K125R45K176L476o907m561j264k75J567
$$ -16300 -13649 -10374 -11541 -11773 -13903 -14555 -12430 -11485 -9309 -5833 -12740 -17301 -18565 -18840 -17273
14322a7273l767K922Q02L115L222K990J218j329l208k987j457j624O08K265J0844
$$ -17273 -21040 -18118 -17316 -14201 -10979 -7989 -6771 -8100 -11308 -14295 -15752 -17376 -16768 -14503 -3659
14307c659k39l11k347o767l345r09l281j756J744k848P583Q8j822o09M466O421
$$ -3659 -3898 -4209 -6556 -13323 -16668 -17577 -20858 -22614 -20870 -23718 -16135 -16047 -17869 -18478 -14012 -7591
14291g591p81K571M374R54l44m956k930O707J080m539k947p89k627M764l27O527
$$ -7591 -8372 -5801 -1427 -473 -817 -5773 -8703 -1996 -916 -5455 -8402 -9191 -11818 -7054 -7381 -854
14275h54L473l35j677J660j0480q2Q564N681N73M22J725k769o953j0639j2378
$$ -854 2619 2284 607 2267 -8213 -8295 269 5950 6523 6945 8670 5901 -1052 -11691 -24069
14260b4069N870J1528L689l916n716K335N42o39J663J254r88p40K317K379k445
$$ -24069 -18199 -6671 -2982 -6898 -12614 -10279 -9737 -10376 -8713 -7459 -8447 -9187 -6870 -4491 -6936
14245f936k01M26k673l19K000l47k428N891O6k110J333m628k382O38J096n74M162
$$ -6936 -7137 -6711 -9384 -9703 -7703 -8050 -10478 -4587 -4521 -6631 -5298 -9926 -12308 -11670 -10574 -11148 -6986
14228f986J909j208l112l480k265K022K339k288l548K457O889o512N50K560R408
$$ -6986 -5077 -6285 -9397 -12877 -15142 -13120 -10781 -13069 -16617 -14160 -7271 -13783 -13233 -10673 -1265
14213a265K987J583O036L178m236k892n964q058l414j475K837J315m64L051N26
$$ -1265 1722 3305 9341 12519 8283 5391 -573 -8631 -12045 -13520 -10683 -9368 -9832 -6781 -6255
14198f255j366j196n794o024K844k883M16M190M194o478q806P06L396K821r41
$$ -6255 -7621 -8817 -14611 -20635 -17791 -20674 -20258 -16068 -11874 -18352 -27158 -26452 -23056 -20235 -21176
14183b1176o671j462K190J575L803Q637K948O116Q25o17M222l391r673K636n21
$$ -21176 -27847 -29309 -27119 -25544 -21741 -13104 -10156 -4040 -3215 -3832 390 -3001 -12674 -10038 -10559
14168a0559k479O58Q917n647j615L377j05m102q36l014o07M744K156K723N900
$$ -10559 -13038 -12380 -3463 -9110 -10725 -7348 -7453 -11555 -12391 -15405 -16012 -11268 -9112 -6389 -489
14153d89m020l771q326j807j77L078N77O478l30J687K87n99L08p016k304L229
$$ -489 -4509 -8280 -16606 -18413 -18590 -15512 -14935 -8457 -8787 -7100 -6813 -7412 -7104 -14120 -16424 -13195
14137a3195l307k9N97P253N244m008L225J034k363j417j214P54P84K123J992P59
$$ -13195 -16502 -16531 -15934 -8681 -3437 -7445 -4220 -3186 -5549 -6966 -8180 -7426 -6642 -4519 -2527 -1768
14121a768k600M26J12M505M398p340n003k521p31N787L626o242o322L08J0440
$$ -1768 -4368 -3942 -3830 675 5073 -2267 -7270 -9791 -10522 -4735 -1109 -7351 -13673 -13365 -2925
14106b925k130o527k300Q25l983R274N154j40j743L980m530q1J44k246n6L30k286
$$ -2925 -5055 -11582 -13882 -13057 -17040 -7766 -2612 -2752 -4495 -515 -5045 -5126 -4982 -7228 -7284 -6954 -9240
14089i240O988L887K81m092n535j152J555r95j636J120P303j00N331m295j0015
$$ -9240 -2252 1635 1916 -2176 -7711 -8863 -7308 -8303 -9939 -8819 -1516 -1616 3715 -580 -10595
14074a0595j808l951O451K434N509N931L022k919L855L610l4J204Q465N735n63
$$ -10595 -12403 -16354 -9903 -7469 -1960 3971 6993 4074 7929 11539 11505 12709 21174 26909 26346
14059B6346r05K336K601P841K874N331r95j403j90j272j560K408K826k463M93
$$ 26346 25441 27777 30378 38219 41093 46424 45429 44026 43836 42564 41004 43412 46238 43775 44268
14044D4268N060J455k827n137n612p738k761r34j485J750o927p715n194j978L623
$$ 44268 49328 50783 47956 42819 37207 29469 26708 25774 24289 26039 19112 11397 6203 4225 7848
14029G848M707k901q599j546O795K618n94J506J517k606q522p363k054M663M611
$$ 7848 12555 9654 1055 -491 6304 8922 8328 9834 11351 8745 223 -7140 -9194 -4531 80
14014H0q735M07M532p115O255N512R74m253n569l228J802N839J456k010N63j9
$$ 80 -8655 -8248 -3716 -10831 -4576 936 1910 -2343 -7912 -11140 -9338 -3499 -2043 -4053 -3490 -3509
13998c509M098j078M20M472L138J998l818r252l817K509M457J804K408m979J83
$$ -3509 589 -489 -69 4403 7541 9539 5721 -3531 -7348 -4839 -382 1422 3830 -1149 -966
13983i66K720J1l716o67K686l170r057m051M747R582O188o451j294Q229K996n619
$$ -966 1754 1765 -1951 -2618 68 -3102 -12159 -16210 -11463 -1881 4307 -2144 -3438 4791 7787 2168
13967B168k128o537l705j219j0M498r01K699J748K615m459N49j498M4L560N403
$$ 2168 40 -6497 -10202 -11421 -11431 -6933 -7834 -5135 -3387 -772 -5231 -4682 -6180 -6136 -2576 2827
13951B827P720k961l505n024n381n515j098J108P93N817O055l02n100j134k44
$$ 2827 10547 7586 4081 -943 -6324 -11839 -12937 -11829 -11036 -5219 836 534 -4566 -5700 -5944
13936e944N57k262l421j500o560p06k786M237n77J706M351R473J389p039J469
$$ -5944 -5387 -7649 -11070 -12570 -19130 -19836 -22622 -18385 -18962 -17256 -12905 -3432 -2043 -9082 -7613
13921g613K613L554Q76l176J152l80m937j300K335n039m75m708m54L905J2448
$$ -7613 -5000 -1446 -570 -3746 -2594 -2974 -7911 -9211 -6876 -11915 -12390 -17098 -17552 -13647 -1199
13906a199J089l770n455j006j797M155O283M118l081K397n224n105j184m605j718
$$ -1199 -110 -3880 -9335 -10341 -12138 -7983 -1700 2418 -663 1734 -3490 -8595 -9779 -14384 -16102
13891a6102N59m564K122K014M489J694k24J496N745o445m827K293k90J165L632
$$ -16102 -15543 -20107 -17985 -15971 -11482 -9788 -10012 -8516 -2771 -9216 -14043 -11750 -12040 -10875 -7243
13876g243O41P22J63N338J753r569q390M231k59m231j606m437r6j850O967M637
$$ -7243 -6602 -5880 -5717 -379 1374 -8195 -16585 -12354 -12613 -16844 -18450 -22887 -22983 -24833 -17866 -13229
13860a3229N448L867K927j83l373K26k040O08k074N84k48J046l763O766n951j948
$$ -13229 -7781 -3914 -987 -1170 -4543 -4317 -6357 -5749 -7823 -7239 -7487 -6441 -10204 -3438 -9389 -11337
13844a1337j2551k318O695M548P131J514m379K342r93M490j690K565M567m072
$$ -11337 -23888 -26206 -19511 -14963 -7832 -6318 -10697 -8355 -9348 -4858 -6548 -3983 584 -3488
13830c488q604J940R39J938r10J455r29J939N564l9M768j478k769K61O470k438
$$ -3488 -12092 -10152 -9213 -7275 -8185 -6730 -7659 -5720 -156 -195 4573 3095 326 587 7057 4619
13814D619p585j1667L097R573O145L505q773m69m11K122N895L362l823j267k388
$$ 4619 -2966 -14633 -11536 -1963 4182 7687 -1086 -1555 -1966 156 6051 9413 5590 4323 1935
13799A935n974M177l37j251l30L962M369k197o442N43M25J840K65o597K522N872
$$ 1935 -4039 138 -199 -1450 -1780 2182 6551 4354 -2088 -1545 -1120 720 985 -5612 -3090 2782
13783B782K210p84P590L954K468M077n060K612K744p46M937l025p445j0549o304
$$ 2782 4992 4208 11798 15752 18220 22297 17237 19849 22593 21847 26784 23759 16314 5765 -539
13768e39L534J1931L894k546j2394o970M162P881J84j101o428m555N189l23n934
$$ -539 2995 14926 18820 16274 3880 -3090 1072 8953 9137 8036 1608 -2947 2242 1919 -4015
13753d015r304M62Q988Q646Q036K957L345q665n209l375l597L445K930J287l08
$$ -4015 -13319 -12857 -3869 4777 12813 15770 19115 10450 5241 1866 -1731 1714 4644 5931 5623
13738E623p84j954L942k907K030O657k415j928M8m071k287N857J541j412N96M968
$$ 5623 4839 2885 6827 3920 5950 12607 10192 8264 8312 4241 1954 7811 9352 7940 8536 13504
13722A3504j172J227o80k762O01M767Q446J147r549K937J501P25R435J421K480
$$ 13504 12332 13559 12879 10117 10718 15485 23931 25078 15529 18466 19967 20692 30127 31548 34028
13707C4028k426p348R77O921J39k141k685k058K184p072o804o215N370O477J114
$$ 34028 31602 24254 25231 32152 32291 30150 27465 25407 27591 20519 13715 7500 12870 19347 20461
13692B0461o406J34j165J485P770J281o955k58L431o9p52L508Q165l080K650M93
$$ 20461 14055 14189 13024 14509 22279 23560 16605 16347 19778 19709 18957 22465 30630 27550 30200 30693
13676C0693m156m303J188p71J409L491O44N429J231p54j0832J425O344o49K139
$$ 30693 26537 22234 23422 22651 24060 27551 28195 33624 34855 34101 23269 24694 31038 30389 32528
13661C2528Q160k60q450p479J0747K766p05L856k392n305m998M67O200N316K498
$$ 32528 40688 40428 31978 24499 35246 38012 37307 41163 38771 33466 28468 28935 35135 40451 42949
13646D2949K736k536j3130J746L824L353L244K587M786J585J66p357k112O262
$$ 42949 45685 43149 30019 31765 35589 38942 42186 44773 49559 51144 51310 43953 41841 48103
13632D8103l044o720l833r70O601O379K605M012L467l525L962l058o558k551k329
$$ 48103 45059 38339 34506 33536 40137 46516 49121 53133 56600 53075 57037 53979 47421 44870 42541
13617D2541l102K574M247L218j695q573n292k09L70k824m067o096q275K145L978
$$ 42541 39439 42013 46260 49478 47783 39210 33918 33709 34079 31255 27188 21092 12817 14962 18940
13602A8940l7l783J466J053K223k005j568P532J864p762n312J0008O525p96L487
$$ 18940 18903 15120 16586 17639 19862 17857 16289 23821 25685 17923 12611 22619 29144 28348 31835
13587C1835k213l365q250r082j483Q540O539j664p913J922j32j002o591O469Q861
$$ 31835 29622 26257 18007 8925 7442 15982 22521 20857 12944 14866 14734 13732 7141 13610 22471
13572B2471K684m463R11M559J0089K621l316r910p46j354j244J2982J2155O141
$$ 22471 25155 20692 21603 26162 36251 38872 35556 25646 24900 23546 22302 35284 47439 53580
13558E3580n508n688J803L32m190K511P879M466j853l416Q88J082n196J170l491
$$ 53580 48072 42384 44187 44519 40329 42840 50719 55185 53332 49916 50804 51886 46690 47860 44369
13543D4369j426p62N244L043N84n783R79L154L480l868K375o343N4M483j633J740
$$ 44369 42943 42181 47425 50468 51052 45269 46248 49402 52882 49014 51389 45046 45100 49583 47950 49690
13527D9690N325P675m19j0228n973k394J846L701k872N110L664r769j166M729
$$ 49690 55015 62690 62271 52043 46070 43676 45522 49223 46351 51461 55125 45356 44190 48919
13513D8919K696O565j468K575M680j88J247J782L049O020L260L292k846j1496
$$ 48919 51615 58180 56712 59287 63967 63779 65026 66808 69857 75877 79137 82429 79583 68087
13499F8087M333K324n679k043J0023L064J995l281q106k202k51Q87J140N90j480
$$ 68087 72420 74744 69065 67022 77045 80109 82104 78823 70717 68515 68264 69151 70291 70881 69401
13484F9401o087k79j645o585o549p762J73J381P261N548q36P62q937j5598j1872
$$ 69401 63314 63035 61390 54805 48256 40494 40667 42048 49309 54857 54021 54783 45846 30248 18376
13469A8376j78l528Q034J1276L32q931m830j188m650m214J560l045k640L473k206
$$ 18376 18198 14670 22704 33980 34312 25381 20551 19363 14713 10499 12059 9014 6374 9847 7641
13454G641r76J365N967N650J366J196r184n026L109n66j910m336L802K142L133
$$ 7641 6665 8030 13997 19647 21013 22209 13025 7999 11108 10542 8632 4296 8098 10240 13373
13439A3373p210n568l206N082r25Q61j258o57o16l493K67N504j254n926P448l294
$$ 13373 6163 595 -2611 2471 1546 2407 1149 492 -124 -3617 -3350 2154 900 -5026 2422 -872
13423h72k046R863L69m461n979q95O47j39Q42j780K840N723L880j757k685q80
$$ -872 -2918 6945 7314 2853 -3126 -4021 -3374 -3513 -2671 -4451 -1611 4112 7992 6235 3550 2670
13407B670K630r01p554l472m200l17M608p70K015O102J529l608n868l784N413
$$ 2670 5300 4399 -3155 -6627 -10827 -11144 -6536 -7306 -5291 811 2340 -1268 -7136 -10920 -5507
13392e507N634l93Q32o268r683J075N630p644L494P867M791j670J963N644k335
$$ -5507 127 -266 566 -5702 -15385 -14310 -8680 -16324 -12830 -4963 -172 -1842 121 5765 3430
13377C430p219j890L083Q240J002o283j656J1325l91q719j285M126L61p227p629
$$ 3430 -3789 -5679 -2596 5644 6646 363 -1293 10032 9641 922 -363 3763 4124 -3103 -10732
13362a0732l462n027K485K128O305O929L576J47m516k96Q57M461o534k312J46
$$ -10732 -14194 -19221 -16736 -14608 -8303 -1374 2202 2349 -2167 -2463 -1606 2855 -3679 -5991 -5845
13347e845J932K011l901M553O569p28p23M284q20l461l590j755K899K75L13l86
$$ -5845 -3913 -1902 -5803 -1250 5319 4591 3868 8152 7332 3871 281 -1474 1425 1700 2013 1627
13331A627Q17k4j933j905L696j097L123M76L49l200l510M364R856m851l114k888
$$ 1627 2444 2420 487 -1418 2278 1181 4304 4780 5129 1929 -1581 2783 12639 7788 4674 1786
13315A786j029J343L630k94J264M800O468k34k174o895J368q08l247K741j878
$$ 1786 757 2100 5730 5436 6700 11500 17968 17734 15560 8665 10033 9225 5978 8719 6841
13300F841m304J777k345m500K171K839N215K057n367j07L925J418P022O735K417
$$ 6841 2537 4314 1969 -2531 -360 2479 7694 9751 4384 4277 8202 9620 16642 23377 25794
13285B5794N291n747K289P459Q946J2198J7710K5080K8656K076K802Q344n963
$$ 25794 31085 25338 27627 35086 44032 56230 73940 99020 127676 129752 132554 140898 134935
13272A34935n114j0237j7619k0377j1763o386o501m557j474j712m17K831K673
$$ 134935 129821 119584 101965 81588 69825 63439 56938 52381 50907 49195 48778 51609 54282
13259E4282J0204J5111K1389K4082K5299O507l559K176J1211J1041r809j8468
$$ 54282 64486 79597 100986 125068 150367 156874 153315 155491 166702 177743 167934 149466
13247A49466j7479j1482m659J5250J7867J8156K8473L7523M1179L8722M8912L7583
$$ 149466 131987 120505 115846 131096 148963 167119 195592 233115 274294 313016 361928 399511
13235C99511J8667J2543r624j9851k5098l0553l9976l6988m4091l8364k2174j6845
$$ 399511 418178 430721 421097 401246 376148 345595 305619 268631 224540 186176 164002 147157
13223A47157j9460j0761p983j5430r208r051n496n907O33L10r948p901j326J380
$$ 147157 127697 116936 108953 93523 84315 75264 69768 63861 64494 64804 54856 46955 45629 47009
13209D7009n664n946k822L91J380k024j187K941Q10p592n094N520j156P738j391
$$ 47009 41345 35399 32577 32968 34348 32324 31137 34078 34888 27296 22202 27722 26566 34304 32913
13194C2913l014j345P583P616J0855J7542J6277K7032L0577J9949J72M264L087
$$ 32913 29899 28554 36137 43753 54608 72150 88427 115459 146036 165985 166157 170421 173508
13181A73508m050q685k0409l2944k3260j7724o863r740o710k283m814o111k271
$$ 173508 169458 160773 140364 107420 84160 66436 59573 49833 43123 40840 36026 29915 27644
13168B7644m176j0738j91Q589n37j123n136K4L638J198j220K446j533p363m280
$$ 27644 23468 12730 12539 21128 20591 19468 14332 14356 17994 19192 17972 20418 18885 11522 7242
13153G242m062P20O936k55q280l261M806L22j531K667P514m498l140k462o73p132
$$ 7242 3180 3900 10836 10581 2301 -960 3846 4168 2637 5304 12818 8320 5180 2718 2045 -5087
13137e087r75Q302M967j386M531n06L71N03k701q13P13l532L450P807L312O96
$$ -5087 -6062 2240 7207 5821 10352 9846 10217 10720 8019 7206 7919 4387 7837 15644 18956 19652
13121A9652J860J656o648j675j042L241O603N27M895P748R349Q817M778M289K234
$$ 19652 21512 23168 16520 14845 13803 17044 23647 24174 29069 36817 46166 54983 59761 64050 66284
13106F6284m134J0654R232K004j1717p947L350J151J230m605M30k222k346n795
$$ 66284 62150 72804 82036 84040 72323 64376 67726 68877 70107 65502 65932 63710 61364 55569
13092E5569l976q262o855L493R230J1228P937N698N026J0965P386l269p548j1181
$$ 55569 51593 43331 36476 39969 49199 60427 68364 74062 79088 90053 97439 94170 86622 75441
13078G5441j2882q495l709n815l538M953P824M257K045J074l285J037J1759R823
$$ 75441 62559 54064 50355 44540 41002 45955 53779 58036 60081 61155 57870 58907 70666 80489
13064H0489j222K907P734J3537K2014J8319J6599K3025K7862Q009J5674J4952
$$ 80489 79267 82174 89908 103445 125459 143778 160377 183402 211264 219273 234947 249899
13052B49899J3733J3929M541P854J851J0480K706m022q552j2916j2271l018n175
$$ 249899 263632 277561 282102 289956 291807 302287 304993 300971 292419 279503 267232 264214 259039
13039B59039o604q742j2053q457o637m648n602j8907k3622k2707j9796j9839j5175
$$ 259039 252435 243693 231640 223183 216546 211898 206296 187389 163767 141060 121264 101425 86250
13026H6250j0157o852m636q87L286j175L373K347k409j765M25j678m456r837J274
$$ 86250 76093 69241 64605 63718 67004 65829 69202 71549 69140 67375 67800 66122 61666 51829 53103
13011E3103j787j520p536J658k658m859r320q234j460p971m9M6k73r53n285M797
$$ 53103 51316 49796 42260 43918 41260 36401 27081 18847 17387 9416 9367 9413 9140 8187 2902 7699
12995G699P695K64n743l669N026J990K760n369j501N17k627j94P84j108Q29k844
$$ 7699 15394 15658 9915 6246 11272 13262 16022 10653 9152 9669 7042 6848 7632 6524 7353 4509
12979D509J143k404j863M603J0473N879l460P31k564o188n475j731O309J591l107
$$ 4509 5652 3248 1385 5988 16461 22340 18880 19611 17047 10859 5384 3653 9962 11553 8446
12964H446P51J243R69o43j293L59L003K940m692k633k920j599l675n711O40O399
$$ 8446 9197 10440 11409 10766 9473 9832 12835 15775 11083 8450 5530 3931 256 -5455 -4815 1584
12948A584J030o476K12n37l001L22k151J659N008M65Q39K43L283j279k91m265
$$ 1584 2614 -3862 -3650 -4187 -7188 -6866 -9017 -7358 -2350 -1885 -1046 -803 2480 1201 910 -3355
12932c355K675R62k097L089r55o895N12m37l479P059N376M653p713l424j888n232
$$ -3355 -680 282 -1815 1274 319 -6576 -6064 -6501 -9980 -2921 2455 7108 -605 -4029 -5917 -11149
12916a1149K450O362M225l786q130j950K496N308K357j164j439Nj725M855K236
$$ -11149 -8699 -2337 1888 -1898 -10028 -11978 -9482 -4174 -1817 -2981 -4420 -4415 -6140 -1285 951
12901I51M420j993m27Q263J644k190J178K993m64k877n723k752m084J363L372
$$ 951 5371 3378 2951 11214 12858 10668 11846 14839 14375 11498 5775 3023 -1061 302 3674
12886C674K311n266m299L039O214J340K741J072Q43P00p402l302M222M105o5j20
$$ 3674 5985 719 -3580 -541 5673 7013 9754 10826 11669 12369 4967 1665 5887 9992 9927 9807
12870I807K96n916o787m383k41l68J410M949N702M840r89l148r015j49N306j634
$$ 9807 10103 4187 -2600 -6983 -7224 -7592 -6182 -1233 4469 9309 8320 5172 -3843 -3992 1314 -320
12854c20R63K59k968K147M336j200j156m308m654J102O013J013j501k481j290
$$ -320 643 902 -2066 81 4417 3217 2061 -2247 -6901 -5799 214 1227 -274 -2755 -4045
12839d045k959n040L697O055P987L444l486J428p740j372J983J247k140l930P38
$$ -4045 -7004 -12044 -8347 -2292 5695 9139 5653 7081 -659 -2031 -48 1199 -941 -4871 -4133
12824d133n9J760K108K619J72l209L659M264p756j232O46m426L474O905J024J294
$$ -4133 -4192 -2432 -324 2295 2467 -742 2917 7181 -575 -1807 -1161 -5587 -2113 4792 5816 7110
12808G110L08l982qm66m349K049N14J1387M85p971n101K365k995N932l092k393
$$ 7110 7418 3436 3428 2962 -1387 662 1176 12563 13048 5077 -24 2341 -654 5278 2186 -207
12792b07M05N323P039Q667K089p952n357m177P523J0362Q512l069M809Q79J602
$$ -207 198 5521 12560 21227 23316 15364 10007 5830 13353 23715 32227 29158 33967 34846 36448
12777C6448J203R952J3543K0053K4818J9661K2836K4309J6249N562M719O967K157
$$ 36448 37651 47603 61146 81199 106017 125678 148514 172823 189072 194634 199353 206320 208477
12764B08477p501j5863j5986j6711j1596j3505k2212j8441j5881j9035o880J95
$$ 208477 200976 185113 169127 152416 140820 127315 105103 86662 70781 51746 44866 45061
12752D5061k846q223j1136n306L539K882p16n836L041K388j0046o661p575Q334
$$ 45061 42215 33992 22856 17550 21089 23971 23255 17419 20460 22848 12802 6141 -1434 6900
12738F900M963J760n631L60o161j829J898M087L703o737N90N561M375j842o00
$$ 6900 11863 13623 7992 8352 2191 362 2260 6347 10050 3313 3903 9464 13839 11997 11397
12723A1397J864o914m886k646o9j464R240L659n822l102L789Q9L293L358K04q503
$$ 11397 13261 6347 1461 -1185 -1254 -2718 6522 10181 4359 1257 5046 5135 8428 11786 11990 3487
12707C487m089N79K590n114o460L813J845o920r07R033L932l763o61N952K399
$$ 3487 -602 -23 2567 -2547 -9007 -5194 -3349 -10269 -11176 -2143 1789 -1974 -2635 3317 5716
12692E716K447K788k39M23l063j729l664M49L06P699k88l070M711q665j038M795
$$ 5716 8163 10951 10712 11135 8072 6343 2679 3128 3434 11133 10845 7775 12486 3821 2783 7578
12676G578P806j178n921K636N271K444P633m55q293q871n66o93L71N721L424l318
$$ 7578 15384 14206 8285 10921 16192 18636 26269 25814 17521 8650 8084 7391 7762 13483 16907 13589
12660A3589N841K495O168L467O886o25l737P851K419o039O942J1458N688R02K605
$$ 13589 19430 21925 28093 31560 38446 37821 34084 41935 44354 38315 45257 56715 62403 63305 65910
12645F5910Q313Q081J6008J8796K0993K6696K7573J0996J1742J2110J1122R958
$$ 65910 74223 82304 98312 117108 138101 164797 192370 203366 215108 227218 238340 248298
12633B48298Q62l467m915j8139k1120j4837q272j2870j8139j7106j0868o898j2709
$$ 248298 249160 245693 240778 222639 201519 186682 178410 165540 147401 130295 119427 112529 99820
12620I9820j0056m724K531m833k441pQ8l356m751k05N650Q474P147N767n179n264
$$ 99820 89764 85040 87571 82738 80297 80290 80378 77022 72271 72066 77716 86190 93337 99104 93925 88661
12604H8661m103J215n709o339j5741j4792m939N368Q11n484p88j520M137r096
$$ 88661 84558 85773 80064 73725 57984 43192 38253 43621 44432 38948 38160 36640 40777 31681
12590C1681o376m658J948J2570k846L2j104r61k608l057l997q021K298k458j846
$$ 31681 25305 20647 22595 35165 32319 32351 31247 30286 27678 24621 20624 12603 14901 12443 10597
12575A0597M842N756N53k45n025m994J396K877k383o540p257k658L520Q764j228
$$ 10597 15439 21195 21748 21503 16478 11484 12880 15757 13374 6834 -423 -3081 439 9203 7975
12560G975L221K546j586P29K280M300K929K484j360o743j0550K2M659M123J086
$$ 7975 11196 13742 12156 12885 15165 19465 22394 24878 23518 16775 6225 6247 10906 15029 16115
12545A6115K39q138q379K421J143N929J0531L465Q89l961m263L043K834K238L026
$$ 16115 16354 8216 -163 2258 3401 9330 19861 23326 24215 20254 15991 19034 21868 24106 27132
12530B7132K699m91q92J139p034j0416o787L004j050M723q14M22P32n521l301
$$ 27132 29831 29340 28448 29587 22553 12137 5350 8354 7304 12027 11213 11635 12367 6846 3545
12515C545N775L573K568j371o01j557j042m502J665M048K14N199N30p639J017
$$ 3545 9320 12893 15461 14090 13489 11932 10890 6388 8053 12101 12315 17514 18044 10405 11422
12500A1422O893R56j177k401m487P77n91M488L948r31J205k295j537l963k725
$$ 11422 18315 19271 18094 15693 11206 11983 11392 15880 19828 18897 20102 17807 16270 12307 9582
12485I582l218n057m795R987N479r02j009L738R295J4459J0831R344L015J06j279
$$ 9582 6364 1307 -3488 6499 11978 11076 10067 13805 23100 37559 48390 57734 60749 60855 59576
12470E9576l455m402K701M503M435J265K660k369n988K754N202R56m035N362p130
$$ 59576 56121 51719 54420 58923 63358 64623 67283 64914 58926 61680 66882 67838 63803 69165 62035
12455F2035n07J3477m40l455N696P048K586k044q9j59O693J325K999N445L440
$$ 62035 61528 75005 74565 71110 76806 83854 86440 84396 84307 84148 90841 92166 95165 100610 104050
12440A04050L35j40j515r105J429J371N595P917M022K063j983M621J0192R675
$$ 104050 104385 104245 102730 93625 95054 96425 102020 109937 113959 116022 114039 118660 128852 138527
12426A38527Q917J1321J130k998J895j77m526l68L610N825L155M788j338O81J5820
$$ 138527 147444 158765 159895 156897 158792 158615 154089 153721 157331 163156 166311 171099 169761 170442 186262
12411A86262Q769N811K077J0177O246R179J0073J4426J6729J6778L493P614J5604
$$ 186262 195031 200842 202919 213096 219342 228521 238594 253020 269749 286527 290020 297634 313238
12398C13238R761J7978K8880J8500K2391K3695K4615K7734L8196L5857L9443M2746
$$ 313238 322999 340977 369857 388357 410748 434443 459058 486792 524988 560845 600288 643034
12386F43034N2046N8070O2291N4490N6787O7990Q4896R2349J01296J16416J38759
$$ 643034 695080 753150 815441 869931 926718 994708 1079604 1171953 1273249 1389665 1528424
12375A528424J69441K08994K42936K72074L18702L54414M02695M62376N27265
$$ 1528424 1697865 1906859 2149795 2421869 2740571 3094985 3497680 3960056 4487321
12366D487321O31641P79356J005613J347116J815244K390571K999837L546880
$$ 4487321 5118962 5898318 6903931 8251047 10066291 12456862 15456699 19003579
12358A9003579M005120M310023M365596M071169L379356K391379J239407K2146
$$ 19003579 23008699 27318722 31684318 35755487 39134843 41526222 42765629 42787775
12350D2787775j191966k328447l234132l784898l967278l862014l566802l133418
$$ 42787775 41595809 39267362 36033230 32248332 28281054 24419040 20852238 17718820
12342A7718820k608033k068399j594944j224596r55288p85267o67033n85514n28743
$$ 17718820 15110787 13042388 11447444 10222848 9267560 8482293 7815260 7229746 6701003
12333F701003m73765m31389m02035l71366l37991l00448k66158k39230k11382
$$ 6701003 6227238 5795849 5393814 5022448 4684457 4384009 4117851 3878621 3667239
12324C667239j91763j71936j49152j44234j37026j32192j20443j08325r7146r1051
$$ 3667239 3475476 3303540 3154388 3010154 2873128 2740936 2620493 2512168 2415022 2323971
12314B323971q9784p3751p4625p2272o7137o0037p0553n9325m8417n2900n2587
$$ 2323971 2234187 2160436 2085811 2013539 1946402 1886365 1815812 1756487 1708070 1655170 1602583
12303A602583n3340m2443k8662l1300l5301l9248l2743k3714l1546l6345l1586
$$ 1602583 1549243 1506800 1478138 1446838 1411537 1372289 1339546 1315832 1284286 1247941 1216355
12292A216355l4351l9060l7972m2154m9050m2401l8781l8088l3592l2613l0521
$$ 1216355 1182004 1142944 1104972 1062818 1013768 971367 932586 894498 860906 828293 797772
12281G97772k7710k8085k2238j8288j9999k6671k2064j7051o937p514j3410j5687
$$ 797772 770062 741977 719739 701451 681452 654781 632717 615666 608729 601215 587805 572118
12269E72118j5599p630j1023j7188j3045j3857j1879j3228o266n249q889j5587
$$ 572118 556519 548889 537866 520678 507633 493776 481897 468669 462403 457154 448265 432678
12257D32678j6701j2498o143j7954j3884j7130j3197j1854j2179j8758j3958q161
$$ 432678 415977 403479 397336 379382 365498 348368 335171 323317 311138 292380 278422 270261
12245B70261j4944j4742q615M9q629j7730j6103q902m159o938l810p881l389p715
$$ 270261 255317 240575 231960 232009 223380 205650 189547 180645 176486 169548 165738 157857 154468 146753
12231A46753J289J752J936M807K808O502k385J390J515p481j0095p734k797l406
$$ 146753 148042 149794 151730 156537 159345 165847 163462 164852 166367 158886 148791 141057 138260 134854
12217A34854m719L59j734p037p948j306j3K507K297K269K85N72o481J81j233q072
$$ 134854 130135 130494 128760 121723 113775 112469 112456 114963 117260 119529 119814 120386 113905 114086 112853 104781
12201A04781N64M705K608m19K681J442N231Q21n521q224j286O91P890l49m863
$$ 104781 105345 110050 112658 112239 114920 116362 121593 122414 116893 108669 107383 108074 115964 115615 110752
12186A10752j411N054N779Q511P724M056O361L886j932o41l05n234m503j3576
$$ 110752 109341 114395 120174 128685 136409 140465 146826 150712 148780 148139 147834 142600 138097 124521
12172A24521r318p436m247n297j045k992o15R4M977K759r167n424j527r68l836
$$ 124521 115203 107767 103520 98223 97178 94186 93571 93665 98642 101401 92234 86810 85283 84315 80479
12157H0479n113N051l767o5j384k78m945o51L066R15p621J358p123r160j168j024
$$ 80479 75366 80417 76650 76585 75201 74923 69978 69327 72393 73308 65687 67045 59922 50762 49594 48570
12141D8570n384K593R075K705M144K231m972n56l431n953p285j923k443K13R391
$$ 48570 43186 45779 54854 57559 61703 63934 58962 58406 54975 49022 41737 39814 37371 37584 46975
12126D6975Q899j054J163O25p153L73k002m357J771L930l423j971K417k339n794
$$ 46975 55874 54820 55983 56608 49455 49828 47826 43469 45240 49170 45747 43776 46193 43854 38060
12111C8060k93K508p500m1N136n08m110n224j1809J259J304j204J687O212K536
$$ 38060 37767 40275 32775 32734 37870 37362 33252 28028 16219 17478 18782 17578 19265 25477 28013
12096B8013O184j024j5488p082J040N640M845J735j489m599n780j637j17m633
$$ 28013 34197 33173 17685 10603 11643 17283 22128 23863 22374 17775 11995 10358 10241 5608
12082E608M576K791n008J760J564n069J880M416J338P655j362q951n112K118J659
$$ 5608 10184 12975 7967 9727 11291 6222 8102 12518 13856 21511 20149 11198 6086 8204 9863
12067I863n760N012O230P174J758k307j0430n603L222P01l49J152M301P281J356
$$ 9863 4103 9115 15345 22519 24277 21970 11540 5937 9159 9860 9511 10663 14964 22245 23601
12052B3601m658n564N18k035j142m418K022P11O620Q251O60M58k37n474m059j589
$$ 23601 18943 13379 13897 11862 10720 6302 8324 9035 15655 23906 24566 25024 24787 19313 15254 13665
12036A3665j941k596j998o119J979N729Q75P76J905p33O77J53J55J549L90k5l5
$$ 13665 11724 9128 7130 1011 2990 8719 9594 10370 12275 11542 12219 12372 12527 14076 14466 14441 14406
12019A4406q264r255K255N605P28k3l389N051K239R97l8L61O146K81l558j302
$$ 14406 6142 -3113 -858 4747 5475 5452 2063 7114 9353 10350 10312 10673 16819 17100 13542 12240
12003A2240l765K28l504j4628r75P952P403R354K062j172k172J474K027M116o322
$$ 12240 8475 8703 5199 -9429 -10404 -2452 4951 14305 16367 15195 13023 14497 16524 20640 14318
11988A4318j437J041k433N88J673K811R05M090M676J079o484n830k071m95m636
$$ 14318 12881 13922 11489 12077 13750 16561 17466 21556 26232 27311 20827 14997 12926 12431 7795
11973G795K187N239K857j952N393k024l334K66K471o06J110j466o460K16N154
$$ 7795 9982 15221 18078 16126 21519 19495 16161 16427 18898 18292 19402 17936 11476 11692 16846
11958A6846L678O435L783m206k825l444N010K572M05Q06L962J3717L552N037l276
$$ 16846 20524 26959 30742 26536 23711 20267 25277 27849 28254 29060 33022 46739 50291 55328 52052
11943E2052J384J3445J2677P166K2153J9560J4181K0837K3283J7025J3422J4285
$$ 52052 53436 66881 79558 86724 108877 128437 142618 163455 186738 203763 217185 231470
11931B31470Q264n299j1428q990j5730j7603k1849j9795j4022p967r403j7506
$$ 231470 239734 234435 223007 214017 198287 180684 158835 139040 125018 117051 107648 90142
11919I0142j2658o685j1798P504M198k892q989j1691K24L445q353K574M894k540
$$ 90142 77484 70799 59001 66505 70703 67811 58822 47131 47355 50800 42447 45021 49915 47375
11905D7375n167j611K638M639J597n418p557M538O54m520J622j659k457L094j626
$$ 47375 42208 40597 43235 47874 49471 44053 36496 41034 41688 37168 38790 37131 34674 37768 36142
11890C6142k154k949K75L294k826j586K572j42l63M048M066L959M39L457M993
$$ 36142 33988 31039 31314 34608 31782 30196 32768 32626 32263 36311 40377 44336 44775 48232 53225
11875E3225pM04j787j174p30o504J162M930N756m091q228n203j475K944k586M34
$$ 53225 53218 53622 51835 50661 49931 43427 44589 49519 55275 51184 42956 37753 36278 39222 36636 37070
11859C7070K936K845N372q755p927J0932j750l684j534K281K336k272j726O53
$$ 37070 40006 42851 48223 39468 31541 42473 40723 37039 35505 37786 40122 37850 36124 36777
11845C6777N043Q896P960P124k949Q17K31o74R105M225m219k202J095K920N628
$$ 36777 41820 50716 58676 65800 62851 63668 63899 63225 72330 76555 72336 70134 71229 74149 79777
11830G9777k576o663p092k534N74j453k972k809K255n379l633n465j275K371j261
$$ 79777 77201 70538 63446 60912 61486 60033 57061 54252 56507 51128 47495 42030 40755 43126 41865
11815D1865m6l495K005N746Q670M043M346m258J026L658m26o19J2483o601j0248
$$ 41865 41819 38324 40329 46075 54745 58788 63134 58876 59902 63560 63134 62515 74998 68397 58149
11800E8149k881J294J566l600j382j680m257p113K763Q340Q50K060M003p702k818
$$ 58149 55268 56562 58128 54528 53146 51466 47209 40096 42859 51199 52049 54109 58112 50410 47592
11785D7592J986j389l399q13m645j605K085N22M122l47k243J573j317l926n82
$$ 47592 49578 48189 44790 43977 39332 37727 39812 40334 44456 44109 41866 43439 42122 38196 37614
11770C7614k890l116O584j992n126L903J326L934K046R29J64n666n212k568R205
$$ 37614 34724 31608 38192 36200 31074 34977 36303 40237 42283 43212 43376 37710 32498 29930 39135
11755C9135N766n896l230j941p890m744o259K773J12m259L375M872J72k739n159
$$ 39135 44901 39005 35775 33834 25944 21200 14941 17714 17826 13567 16942 21814 21986 19247 14088
11740A4088m39l804j582n183n43M329J096K875n827l150K774n072k619m302J249
$$ 14088 13649 9845 8263 3080 2537 6866 7962 10837 5010 1860 4634 -438 -3057 -7359 -6110
11725f110N615r84K430J2061o8q486j544m762M317M325J586m536n701k471l96
$$ -6110 -495 -1479 951 13012 12944 4458 2914 -1848 2469 6794 8380 3844 -1857 -4328 -4724
11710d724K31J795J196P515m2J982m957j2065P24O424M484n794j519L736K994
$$ -4724 -4493 -2698 -1502 6013 5971 7953 2996 -9069 -8345 -1921 2563 -3231 -4750 -1014 1980
11695A980M52M026l44r764R96J456J392J834K057n906n084L84k22j605K206M616
$$ 1980 2432 6458 6114 -3650 -2654 -1198 194 2028 4085 -1821 -6905 -6521 -6743 -8348 -6142 -1526
11679a526o01J315M873k638l663J469J52Q55j538K853P101K90o319o410N128m50
$$ -1526 -2127 -812 4061 1423 -2240 -771 -619 236 -1302 1551 8652 8942 2623 -3787 1341 891
11663H91l521j0151L790L111N860r32L008M099k591j0515m797K444l012l166n67
$$ 891 -2630 -12781 -8991 -5880 -20 -952 2056 6155 3564 -6951 -11748 -9304 -12316 -15482 -16049
11648a6049l609k43K478P821R579k50n288m825J104M817M221J798J046l072J793
$$ -16049 -19658 -19901 -17423 -9602 -23 -273 -5561 -10386 -9282 -4465 -244 1554 2600 -472 1321
11633A321n060q891n27Q304O526j001q17K947l338m364j768k095m044j866J931
$$ 1321 -3739 -12630 -13157 -4853 1673 672 -145 2802 -536 -4900 -6668 -8763 -12807 -14673 -12742
11618a2742L73o81K699q55M689J469l437K667O492k003J267J121k97n289J001
$$ -12742 -12369 -13050 -10351 -11206 -6517 -5048 -8485 -5818 674 -1329 -62 1059 762 -4527 -3526
11603c526O480j762j825M478n939n126J117k977l36o03k994M154L484k821k762
$$ -3526 2954 1192 -633 3845 -2094 -7220 -6103 -9080 -9416 -10019 -13013 -8859 -5375 -8196 -10958
11588a0958k241k642M372O916P996r107r62l341n6O048K049N172M537j721m476
$$ -10958 -13199 -15841 -11469 -4553 3443 -5664 -6626 -9967 -10023 -3975 -1926 3246 7783 6062 1586
11573A586k134K215l837N50M279K621K729n655j0118m410K557M410Q73K893l391
$$ 1586 -548 1667 -2170 -1620 2659 5280 8009 2354 -7764 -12174 -9617 -5207 -4334 -1441 -4832
11558d832P151P93J180L260j07O90K995N91k936k227K538L100j360M702l703j0554
$$ -4832 2319 3112 4292 7552 7445 8135 11130 11721 8785 6558 9096 12196 10836 15538 11835 1281
11542A281N994L661n271O72L828M725L51n43K186J956n594m232J730O391K2k956
$$ 1281 7275 10936 5665 6337 10165 14890 15241 14698 16884 18840 13246 9014 10744 17135 17157 14201
11526A4201j596r620K529R370N348l942n956k862K383M883K698l909m92J013R24
$$ 14201 12605 2985 5514 14884 20232 16290 10334 7472 9855 14738 17436 13527 13035 14048 14972
11511A4972K790K024M682M504M164p468l820j893n031K992j66j506o33N199j749
$$ 14972 17762 19786 24468 28972 33136 25668 21848 19955 14924 17916 17750 16244 15611 20810 19061
11496A9061n93M669M33j942l28q985k703P402R977O050J20J789K839l744j695
$$ 19061 18468 23137 23570 21628 21300 12315 9612 17014 26991 33041 33161 34950 37789 34045 32350
11481C2350O590j522O496O865n169r042j384K909j671k602l420Q32M503j049n909
$$ 32350 38940 37418 43914 50779 45610 36568 35184 38093 36422 33820 30400 31232 35735 34686 28777
11466B8777o457l49O801q50k479n743M421n759l75P721L37J90q860r87R023Q55
$$ 28777 22320 21971 28772 27922 25443 19700 24121 18362 17987 25708 26045 26235 17375 16388 25411 26266
11450B6266N166k96N78R617P621l527o862n626j629J306N223L072R17l553j088
$$ 26266 31432 31136 31714 41331 48952 45425 38563 32937 31308 32614 37837 40909 41826 38273 37185
11435C7185r466q419P16K307N294J002j711Q14k131j349N494M163o2k887J711
$$ 37185 27719 19300 20016 22323 27617 28619 26908 27722 25591 24242 29736 33899 33837 30950 32661
11420C2661L571k749m947m252o174N976P117J834M855O549J959l393p359L604
$$ 32661 36232 33483 28536 24284 18110 24086 31203 33037 37892 44441 46400 43007 35648 39252
11406C9252P755K628P872L219r241J961K553k263k281k573n530n005p902m464
$$ 39252 47007 49635 57507 60726 51485 53446 55999 53736 51455 48882 43352 38347 30445 25981
11392B5981K214L654K659m100k457M159L729l037O413k242n369p36n11k366Q72
$$ 25981 28195 31849 34508 30408 27951 32110 35839 32802 39215 36973 31604 30868 30357 27991 28863
11377B8863l522o89o08M930l349o590J67P107P803Q011N337j990M792J216L716
$$ 28863 25341 24652 24044 28974 25625 19035 19202 26309 34112 42123 47460 45470 50262 51478 55194
11362E5194M796m24m147l356L891J202N551P844J010K303k909n049o91M955r03
$$ 55194 59990 59566 55419 52063 55954 57156 62707 70551 71561 73864 70955 65906 65215 70170 69267
11347F9267q389J920r59J513k134l018N25Q50n506K304m245j429Q006N054r996
$$ 69267 60878 62798 61839 63352 61218 58200 58725 59575 54069 56373 52128 50699 58705 63759 53763
11332E3763o892K510P261K329j463j571l04o7L2k424o90j09M177q7M89M230N549
$$ 53763 46871 49381 56642 58971 57508 55937 55633 55566 55598 53174 52484 52375 56552 56465 56954 61184 66733
11315F6733m063p400K775P639j188j34r16k651j214M68J376q00O541l630n451
$$ 66733 62670 55270 58045 65684 64496 64362 63446 60795 59581 60049 61425 60625 67166 63536 58085
11300E8085r37l901l550N431M372l50j0276m390P200K824P140N92q664m571K343
$$ 58085 57148 53247 49697 55128 59500 59150 48874 44484 51684 54508 61648 62240 53576 49005 51348
11285E1348L048J662N755j911q235L266J530l458o075m927L22M068Q160L367p470
$$ 51348 54396 56058 61813 59902 51667 54933 56463 53005 46930 42003 42325 46393 54553 57920 50450
11270E0450r265K579N904k264o812m712j579L576M790j208K804J212K993k2l635
$$ 50450 41185 43764 49668 47404 40592 35880 34301 37877 42667 41459 44263 45475 48468 48446 44811
11255D4811m745L804M256N836P729K636q48Q266J2748N891J0823N624J2420Q069
$$ 44811 40066 43870 48126 53962 61691 64327 63479 71745 84493 90384 101207 106831 119251 127320
11241A27320J3633K0219K0019J5641K5871K3998J7142O804q39k023r749j4667
$$ 127320 140953 161172 181191 196832 222703 246701 263843 270647 269808 267785 258036 243369
11229B43369k1557k4569k0395j6512j7942j5390j5052j6427r665p605j275k525
$$ 243369 221812 197243 176848 160336 142394 127004 111952 95525 85860 78255 76980 74455
11217G4455R40m555p562o076k527L63k343l376P175P97o04l3q18o001n404K196
$$ 74455 75395 70840 63278 57202 54675 55038 52695 49319 56494 57291 56687 56654 55836 49835 44431 46627
11201D6627p966j721J094N207k360r329K547M502l647o33M829k327q603p38Q49
$$ 46627 38661 36940 38034 43241 40881 31552 34099 38601 34954 34321 39150 36823 28220 27482 28331
11186B8331m492k336M017J5738j438l787n999p060R7P662K364N349l031l247j274
$$ 28331 23839 21503 25520 41258 39820 36033 30034 22974 23071 30733 33097 38446 35415 32168 30894
11171C0894K622j680l634J070L365m082j101J441k241P40J706n294M207P315K28
$$ 30894 33516 31836 28202 29272 32637 28555 27454 28895 26654 27394 29100 23806 28013 35328 35556
11156C5556j562J918K369O49l51r45m870m060j803N532L934K874l034l600J547
$$ 35556 33994 35912 38281 38930 38579 37634 32764 28704 26901 32433 36367 39241 36207 32607 34154
11141C4154O186l940m136k042N128M764J634j066R13M226O11M070O199K5k008
$$ 34154 40340 36400 32264 30222 35350 40114 41748 40682 41595 45821 46432 50502 56701 56726 54718
11126E4718k984l343J244q26m174o53k339l816L533l699N523k550K866K908m17
$$ 54718 51734 48391 49635 48809 44635 43982 41643 37827 41360 37661 43184 40634 43500 46408 45991
11111D5991o32j1563m04M615K412p50Q83k490k6m271j007j564O098Q214J221n77
$$ 45991 45359 33796 33392 38007 40419 39669 40552 38062 38036 33765 32758 31194 37292 45506 46727 46150
11095D6150l706m019O801M691m415o293M60N124j584j826m89k534J308N779l416
$$ 46150 42444 38425 45226 49917 45502 39209 39669 44793 43209 41383 40894 38360 39668 45447 42031
11080D2031j698K998l33P17N189l523P18J219o5j991m857j795l27N66O833J997
$$ 42031 40333 43331 42998 43715 48904 45381 46099 47318 47253 45262 40405 38610 38283 38849 45682 47679
11064D7679n81j150K49J002l087k900m723n19l383N143k490J829n467k664J0834
$$ 47679 47098 45948 46197 47199 44112 41212 36489 35970 32587 37730 35240 37069 31602 28938 39772
11049C9772K435n057k295O856N895j036k837q49k001l268m25O98O707m388r371
$$ 39772 42207 37150 34855 41711 47606 46570 43733 42884 40883 37615 37190 37888 44595 40207 30836
11034C0836L194k1R53O794K946J0941R643L545O174L767j035J661j434J480N085
$$ 30836 34030 34009 34962 41756 44702 55643 65286 68831 75005 78772 77737 79398 77964 79444 84529
11019H4529m52r031L098L662K760q21N27r46o66l067N07J193j647k614k070L324
$$ 84529 84077 75046 78144 81806 84566 83745 84272 83326 82660 79593 80100 81293 79646 77032 74962 78286
11003G8286M234R082R080m493p4o527J568k986r20m12m296L158R687J1857K564
$$ 78286 82520 91602 100682 96189 96115 89588 91156 88170 87250 86838 82542 85700 95387 107244 109808
10988A09808M233M332Q590J5721Q9n854j00R917Q288N151r61j1020j2410p187
$$ 109808 114041 118373 126963 142684 142773 136919 136819 146736 155024 160175 159214 148194 135784 128597
10974A28597o038k527q367k414n357j960J176q682k294P18M128k98m598J722o635
$$ 128597 122559 120032 111665 109251 103894 101934 103110 94428 92134 92852 96980 96682 92084 93806 87171
10959H7171l915o4m906M345M868L313J103K029j599o721p466M509q007j348l186
$$ 87171 83256 83192 78286 82631 87499 90812 91915 93944 92345 85624 78158 82667 74660 73312 70126
10944G0126N743o10L191K371J021k443l409l802m061K422n210j0549k046l386
$$ 70126 75869 75259 78450 80821 81842 79399 75990 72188 68127 70549 65339 54790 52744 49358
10930D9358l240n563L52L204k811p938L797k866l924k279k960m096l918N372P542
$$ 49358 46118 40555 40907 44111 41300 33362 37159 34293 30369 28090 25130 21034 17116 22488 30030
10915C0030j378l441j956L396J223p68n33p242j41J996K92j44L144J0016J595
$$ 30030 28652 25211 23255 26651 27874 27106 26573 19331 19190 21186 21478 21334 24478 34494 36089
10900C6089k876p922n029o009j821k603J006j570M408j095l911j346j313k660
$$ 36089 33213 25291 20262 14253 12432 9829 10835 9265 13673 12578 8667 7321 6008 3348
10886C348n528N294N704O480L437n357M963N581l402l625k60N445k12p510q255
$$ 3348 -2180 3114 8818 15298 18735 13378 18341 23922 20520 16895 16635 22080 21868 14358 6103
10871F103M227O906K408m074P095l252J222j981n755j35o613P47M924J22j600
$$ 6103 10330 17236 19644 15570 22665 19413 20635 18654 12899 12764 6151 6898 11822 11944 10344
10856A0344N10q37j322K282N556K952Q489J111L104Q558m778r016p049M122Q832
$$ 10344 10854 10017 8695 10977 16533 19485 27974 29085 32189 40747 35969 26953 19904 24026 32858
10841C2858p094m379J176Q025j718m296K987M292J57O166M826m871p054L145L502
$$ 32858 25764 21385 22561 30586 28868 24572 27559 31851 32008 38174 43000 38129 31075 34220 37722
10826C7722J379k793J194L06J837n227L146L845l136N287N492O371l950p898m661
$$ 37722 39101 36308 37502 37808 39645 34418 37564 41409 38273 43560 49052 55423 51473 43575 38914
10811C8914O033R864J941N286l50p31Q412M21j354n452q336l684m497n595q405
$$ 38914 44947 54811 56752 62038 61688 60957 69369 69790 68436 62984 54648 50964 46467 40872 32467
10796C2467O10Q737J0589K402J127k860n140M060J0755N212N481P674N005M054
$$ 32467 33077 41814 52403 54805 55932 53072 47932 51992 62747 67959 73440 81114 86119 90173
10782I0173M35r85j925j74k007o259m842Q872k624j5323P55Q8M438m106j621K636
$$ 90173 90608 89623 87698 87524 85517 79258 74416 83288 80664 65341 66096 66184 70622 66516 64895 67531
10766F7531J516M71o206k351r756p188P838L108n585O66R883Q626j263p7N497
$$ 67531 69047 69518 63312 60961 51205 44017 51855 54963 49378 50044 59927 68553 67290 67213 72710
10751G2710K853M442M650N381J932L043L782O90L097J0384P406J797J846M515
$$ 72710 75563 80005 84655 90036 91968 95011 98793 99483 102580 112964 120370 122167 124013 128528
10737A28528J253j000l22Q522k0r203r987r325j449n409k355l069l712n311j748
$$ 128528 129781 128781 128459 136981 136961 127758 117771 108446 106997 101588 99233 96164 92452 87141 85393
10722H5393k363P07j437O940N540j998m721J002q50M777L89K932N038k721Q325
$$ 85393 83030 83737 82300 89240 94780 92782 88061 89063 88213 92990 93379 96311 101349 98628 106953
10707A06953N179l264k216O670O539Q850R821J1899r16J4622J0599P406J6795
$$ 106953 112132 108868 106652 113322 119861 128711 138532 150431 149515 164137 174736 182142 198937
10694A98937J0389L469M932Q286O508L837N456R495Q321O121J1606Q977O438P18
$$ 198937 209326 212795 217727 226013 232521 236358 241814 251309 259630 265751 277357 286334 292772 293490
10680B93490J000P032P327J067L143J68j89m706J675M048P795Q665R330L136L468
$$ 293490 294490 301522 308849 309916 313059 313227 313038 308332 310007 314055 321850 330515 339845 342981 346449
10665C46449L421N596L350J0058J1977O613M149k722L417N685Q447P680J0070
$$ 346449 349870 355466 358816 368874 380851 387464 391613 388891 392308 397993 406440 414120 424190
10652D24190J4074J2675J9485J6351J7010J3533J0892K4505L7220L6747M6930
$$ 424190 438264 450939 470424 486775 503785 517318 528210 552715 589935 626682 673612
10641F73612L6001L2753L2832L6406L8049L4681L3319M5952N3830N9881O8241
$$ 673612 709613 742366 775198 811604 849653 884334 917653 963605 1017435 1077316 1145557
10630A145557P6215Q0405R2128R2066Q7295Q3603Q3549P4468O9522O3433O0899
$$ 1145557 1221772 1302177 1394305 1486371 1573666 1657269 1740818 1815286 1884808 1948241 2009140
10619B009140N7448K9782K5226J8704K1344K5288K8666M0543N4835Q8021J31275
$$ 2009140 2066588 2096370 2121596 2140300 2161644 2186932 2215598 2256141 2310976 2398997 2530272
10608B530272J73159K43294L45580M61430O01720P52476Q74757Q98866Q18713
$$ 2530272 2703431 2946725 3292305 3753735 4355455 5107931 5982688 6881554 7700267
10599G700267O99594N98709N00958L95959K72308J52741P5309M9535P1613J09063
$$ 7700267 8399861 8998570 9499528 9895487 10167795 10320536 10395845 10445380 10516993 10626056
10589A0626056J44443J53969J69127J56733J13581M9810J5328L9008J06149J89323
$$ 10626056 10770499 10924468 11093595 11250328 11363909 11413719 11429047 11468055 11574204 11763527
10579A1763527K57389L16067L65681M09813M35901M35547M10829L79312L62681
$$ 11763527 12020916 12336983 12702664 13112477 13548378 13983925 14394754 14774066 15136747
10570A5136747L39076L14853L02704L10940L58813M35152N19452O34490P95585
$$ 15136747 15475823 15790676 16093380 16404320 16763133 17198285 17717737 18352227 19147812
10561A9147812R93959J179286J315377J299776J072117P30713M43500K32552j4543
$$ 19147812 20141771 21321057 22636434 23936210 25008327 25739040 26182540 26415092 26400549
10552B6400549l59589p27829r84242j006578q54777o70943n41170m20977l30017
$$ 26400549 26040960 25313131 24328889 23322311 22467534 21796591 21255421 20834444 20504427
10543B0504427k60422k58283l37290m04743m37316m56037m83516n25630n50499
$$ 20504427 20244005 19985722 19648432 19243689 18806373 18350336 17866820 17341190 16790691
10534A6790691n27279m71402l98887l40462k93350k45448j62621o3134j6944j1334
$$ 16790691 16263412 15792010 15393123 15052661 14759311 14513863 14351242 14288108 14271164 14259830
10524A4259830j9442m0155o1270o8090n1889j8139K8085Q8881J29139O0710r6265
$$ 14259830 14240388 14200233 14138963 14070873 14018984 14000845 14028930 14117811 14246950 14307660 14211395
10513A4211395k75954m01338n02653o36233q19625j005824j092658j033294q84328
$$ 14211395 13935441 13534103 13031450 12395217 11575592 10569768 9477110 8443816 7559488
10504G559488p10531n57355m43371l39666k57290j98325j53541j23255r9737p4498
$$ 7559488 6848957 6291602 5848231 5508565 5251275 5052950 4899409 4776154 4676417 4601919
10494D601919o1686o6413o9059p5669q5608j00649j00698j05809j17531j26358
$$ 4601919 4540233 4473820 4404761 4329092 4243484 4142835 4042137 3936328 3818797 3692439
10484C692439j34108j41689j45553j33383j27367j35184j27940j12647r9447r8686
$$ 3692439 3558331 3416642 3271089 3137706 3010339 2875155 2747215 2634568 2535121 2436435
10474B436435r3691q6394q3275q6745p9788p3144o2682p4185p8882p1948o2538
$$ 2436435 2342744 2256350 2173075 2086330 2006542 1933398 1870716 1796531 1717649 1645701 1583163
10463A583163o3135o0423l9423m4534l9690l7793l4274k7826l7645k8350k1588
$$ 1583163 1520028 1459605 1420182 1375648 1335958 1298165 1263891 1236065 1198420 1170070 1148482
10452A148482k2306l1040k7305k3962l0949j7440j4846j1579k4162k7488j7621
$$ 1148482 1126176 1095136 1067831 1043869 1012920 995480 980634 969055 944893 917405 899784
10441H99784j6559j5496j8570j2238j4825j4438p451j659l970k700q990j2489
$$ 899784 883225 867729 849159 836921 822096 807658 800207 798548 794578 791878 782888 770399
10429G70399j1128j3972j2714j5698k4430k2305k4206k4679k4359j1230j4609
$$ 770399 759271 745299 732585 716887 692457 670152 645946 621267 596908 585678 571069
10418E71069j5626o156M628M24n222m878O119P999M312R699M739O028P852O872
$$ 571069 555443 549287 553915 554339 549117 544239 550358 558357 562669 572368 577107 583135 590987 597859
10404E97859P108M283N343N895l063q893K226L561k434j373r933p024o761j8070
$$ 597859 604967 609250 614593 620488 617425 608532 610758 614319 611885 610512 600579 593555 586794 568724
10390E68724j5960o767n630q946r514j3587j6905j5663j5169j1437q851r437q074
$$ 568724 552764 545997 540367 531421 521907 508320 491415 475752 460583 449146 440295 430858 422784
10377D22784j0622o021r113j6585l740r7o548j857o495j1445m342j262k410J770
$$ 422784 412162 406141 397028 380443 376703 376606 370058 368201 361706 350261 345919 344657 342247 344017
10363C44017l372n170p616k576m097n731k021j822K536j920m367m685l773l501
$$ 344017 340645 335475 327859 325283 321186 315455 313434 311612 314148 312228 307861 303176 299403 295902
10349B95902q451l467l376j199m394q017r310p659p266l560M41N265O258L08r599
$$ 295902 287451 283984 280608 279409 275015 266998 257688 250029 242763 239203 239644 244909 251167 251475 241876
10334B41876j426K324R080J0112J388k436O781J2616J0413J5795J7820J8167K1574
$$ 241876 240450 242774 251854 261966 263354 260918 267699 280315 290728 306523 324343 342510 364084
10321C64084J4656K2528J9756Q682Q135R100O636P274M002o107q348r985j6358
$$ 364084 378740 401268 421024 429706 437841 446941 453577 460851 464853 458746 450398 440413 424055
10308D24055j3598j9455j7500j2623j6494j2665j7663j5478j4131j2250n949j408
$$ 424055 410457 391002 373502 360879 344385 331720 314057 298579 284448 272198 266249 264841
10296B64841j2588j7743j2976n290p195j0616q228j0101r707m799j597L24o169
$$ 264841 252253 234510 221534 216244 209049 198433 190205 180104 170397 165598 164001 164325 158156
10283A58156k908q734j4204Q48O345n827q385j975p398j779K520K664N042L581
$$ 158156 155248 146514 132310 133158 139503 133676 125291 123316 115918 114139 116659 119323 124365 127946
10269A27946l525K811J474l57o17N17K65P004J0747M762R424J1683R529P17M293
$$ 127946 124421 127232 128706 128349 127732 128249 128514 135518 146265 151027 160451 172134 181663 182380 186673
10254A86673l32o498o51M265n806j930r164p907m558j1137p937j501l137j1362
$$ 186673 186341 179843 179192 183457 177651 175721 166557 158650 154092 142955 135018 133517 130380 119018
10240A19018l903J931m011j061k713J74p950m604m97n597k101l718l45J929j571
$$ 119018 115115 117046 113035 111974 109261 109435 101485 96881 96384 90787 88686 84968 84623 86552 84981
10225H4981m664n113K011M051l427n054J539P83o88j699l120J213n014n103K936
$$ 84981 80317 75204 77215 81266 77839 72785 74324 75107 74419 72720 69600 70813 65799 60696 63632
10210F3632n749K369L546K067q579q35P414O849m889n914k970J281P453n879p423
$$ 63632 57883 60252 63798 65865 57286 56451 63865 70714 65825 59911 56941 58222 65675 59796 52373
10195E2373L971L445m528Q405N025J661N511J555P664J0400M066P790J0753K050
$$ 52373 56344 59789 55261 63666 68691 70352 75863 77418 85082 95482 99548 107338 118091 120141
10181A20141L580J1223Q043N499O53k887k089J275l103m405m857m353q957l670
$$ 120141 123721 134944 142987 148486 149139 146252 144163 145438 142335 137930 133073 128720 119763 116093
10167A16093L90M329l723j621p2K329J654j806j945O93l720J175K806k227p056
$$ 116093 116483 120812 117089 115468 115396 117725 119379 117573 115628 116321 112601 113776 116582 114355 107299
10152A07299k547N624N067K187L239Q622O265m692j4795k034O51O166N449J104
$$ 107299 104752 110376 115443 117630 120869 129491 135756 131064 116269 114235 114886 121052 126501 127605
10138A27605L860J892K108P338O236k17l759n173K945J133M200J0363R399P201
$$ 127605 131465 133357 135465 142803 149039 148822 145063 139890 142835 143968 148168 158531 167930 175131
10124A75131O271J0300M400O065l499q511o019o047r394o170o033p417p235l884
$$ 175131 181402 191702 196102 202167 198668 190157 184138 178091 168697 162527 156494 149077 141842 137958
10110A37958p10j123N841R131j632j479m636K465M708N71m901O948J540n123K147
$$ 137958 137248 136125 141966 151097 149465 147986 143350 145815 150523 151094 146193 153141 154681 149558 151705
10095A51705o592j1176p979j86L392J526l12N88J706m988L900J881Q66K090N302
$$ 151705 145113 133937 125958 125772 129164 130690 130378 130966 132672 127684 131584 133465 134331 136421 141723
10080A41723J821J312Q40j0391j2255o250m193p812q16K587o481j1432m413l337
$$ 141723 143544 144856 145696 135305 123050 116800 112607 104795 103979 106566 100085 88653 84240 80903
10066H0903j326K915Q029k642O498J819l064P38L565O57P286N391j567r59l964
$$ 80903 79577 82492 90521 87879 94377 96196 93132 93870 97435 98092 105378 110769 109202 108243 104279
10051A04279j116N07r61j706l553J188k693q613J2907l14l16K342n609m794l805
$$ 104279 103163 103670 102709 101003 97450 98638 95945 87332 100239 99925 99609 101951 96342 91548 87743
10036H7743J708L036J715r4j0113p86m766n056P067N676k030m018l661m911M638
$$ 87743 89451 92487 94202 94108 83995 83209 78443 73387 80454 86130 84100 80082 76421 71510 76148
10021G6148J22q5N8l83M634N107Q93J479Q157j452n882K91l671l221k289K524
$$ 76148 76270 76185 76243 75860 80494 85601 86494 87973 96130 94678 88796 89087 85416 82195 79906 82430
10005H2430l23N371K765k68J400M030m543O428M649m005o203j602n32l323k395
$$ 82430 82107 87478 90243 89975 91375 95405 90862 97290 101939 97934 91731 90129 89597 86274 83879
9990H3879k535o730J490l678n981j982K890R68j853n506K418M199K456J654o86
$$ 83879 81344 74614 76104 72426 66445 64463 67353 68321 66468 60962 63380 67579 70035 71689 71003
9975G1003K367N858j073j824l268N915Q795K281O36j325l731j658p728l390Q765
$$ 71003 73370 79228 78155 76331 73063 78978 87773 90054 90690 89365 85634 83976 76248 72858 81623
9960H1623j728l493P385j788k684M384N828O07j1702m646M440L444O73L340o905
$$ 81623 79895 76402 83787 81999 79315 83699 89527 90134 78432 73786 78226 81670 82343 85683 78778
9945G8778o011K516J31K353M875k778q298q03P838K399n503J68Q09O692N290P962
$$ 78778 72767 75283 75414 77767 82642 79864 71566 70763 78601 81000 75497 75665 76474 83166 88456 96418
9929I6418j602N277P013P211O395Q02r466m61q79j345o427k904k230n046l659
$$ 96418 94816 100093 107106 114317 120712 121514 112048 111587 110708 109363 102936 100032 97802 92756 89097
9914H9097q3L538K495J614J0206Q234j729j0164n671L309J2019j52q743k748M530
$$ 89097 89014 92552 95047 96661 106867 115101 113372 103208 97537 100846 112865 112713 103970 101222 105752
9899A05752L563n812L196R012k727K285Q746J3285J0329K042o85M930K109J827
$$ 105752 109315 103503 106699 115711 112984 115269 124015 137300 147629 149671 148986 153916 156025 157852
9885A57852R881J1896k936q504Q32M052O971L505m62P03l874p695o028k774j51
$$ 157852 167733 179629 176693 168189 169021 173073 180044 183549 183087 183790 179916 172221 166193 163419 163268
9870A63268r3N181j1739l768J0227J728L414j683k14J328L028N763O762M102l404
$$ 163268 163175 168356 156617 152849 163076 164804 168218 166535 166321 167649 170677 176440 183202 187304 183900
9855A83900J933M513P039L080m236n211P042Q750L597J024j855P907J644R460
$$ 183900 185833 190346 197385 200465 196229 191018 198060 206810 210407 211431 209576 217483 219127 228587
9841B28587N811L846J983L328K88L744O040L869O144J942K744L942K862L218o916
$$ 228587 234398 238244 240227 243555 243843 247587 253627 257496 263640 265582 268326 272268 275130 278348 271432
9826B71432r24K067K671p795m920m251o98J478j451J991P686N613k547K831l459
$$ 271432 270508 272575 275246 267451 262531 258280 257582 259060 257609 259600 267286 272899 270352 273183 269724
9811B69724l601m301K885l534K20J958J900O063M465L395M809R13K983P997K262
$$ 269724 266123 261822 264707 261173 261393 263351 265251 271314 275779 279174 283983 284896 287879 295876 298138
9796B98138n828n267j861M616J0124K235k847L586M823K836N685J0406R964n406
$$ 298138 292310 287043 285182 289798 299922 302157 299310 302896 307719 310555 316240 326646 336610 331204
9782C31204J710O586J144N175N807j5k086l871Q11j0838j0913n136k680j668j169
$$ 331204 332914 339500 340644 345819 351626 351611 349525 345654 346465 335627 324714 319578 316898 315230 314061
9767C14061N540J0180k07p145j907J780j397l156n90k75Q79O361K692J704K884
$$ 314061 319601 329781 329574 322429 320522 322302 320905 317749 317159 316884 317763 324124 326816 328520 331404
9752C31404R056Q139k484m840m513J697O729K703K246K675L419M950P347N678
$$ 331404 340460 348599 346115 341275 336762 338459 345188 347891 350137 352812 356231 361181 368528 374206
9738C74206M148n54L163q87j438r018O488O880k215l626M95k730o714K68o194
$$ 374206 378354 377800 380963 380076 378638 369620 376108 382988 380773 377147 377642 374912 368198 368466 362272
9723C62272K379P829N372n023l125r54J412o94M328J0952K975q067r760o698P34
$$ 362272 364651 372480 377852 372829 369704 368750 370162 369468 373796 384748 387723 379656 369896 363198 363932
9708C63932N258N845K306k611M083J503j345J890n187l752Q174K248n239J013
$$ 363932 369190 375035 377341 374730 378813 380316 378971 380861 375674 371922 380096 382344 377105 378118
9694C78118j121N49j372r250L737J061O177k272m186n269n053Q13J796L591m53
$$ 378118 376997 377546 376174 366924 370661 371722 377899 375627 371441 366172 361119 361932 363728 367319 366866
9679C66866o257k836K028oO093k939p288m430r71n691j0163M975N513J607n544
$$ 366866 360609 357773 359801 359795 365888 362949 355661 351231 350260 344569 334406 339381 344894 346501 340957
9664C40957l425n262o273l536j1031K016P148l605n359p921L333K483l632j883
$$ 340957 337532 332270 325997 322461 311430 313446 320594 316989 311630 303709 307042 309525 305893 304010
9650C04010p354r093j696k206o756k74K704q52m431K832K594k152o360q093l517
$$ 304010 296656 287563 285867 283661 276905 276631 279335 278483 274052 276884 279478 277326 270966 262873 259356
9635B59356O072k519n731O274M424q009r521P24l289j303P11j110o842M736K252
$$ 259356 265428 262909 257178 263452 267876 259867 250346 251070 247781 246478 247189 246079 239237 243973 246225
9620B46225l310n911k736j3982j235J2005L605k853l987p08J972l185q191l932
$$ 246225 242915 237004 234268 220286 219051 231056 234661 231808 227821 227113 229085 225900 217709 213777
9606B13777j793m562N70R637j384n195L428J871N497q57r754r146p585m53P425
$$ 213777 211984 207422 207992 217629 216245 211050 214478 216349 221846 220989 211235 202089 194504 194051 201476
9591B01476O221o748j0626j289Q902N586m91M01k919J152k277l006P025L806n382
$$ 201476 207697 200949 190323 189034 197936 203522 203031 203432 200513 201665 199388 196382 203407 207213 201831
9576B01831o646j798Q08L450L59J647k77K133N310P535N67Q227Q495k840M019
$$ 201831 195185 193387 194195 197645 198004 199651 199374 201507 206817 214352 214919 223146 231641 228801 232820
9561B32820M724N861N855m94n44N894P437J1479J2762N729P733R184J5450J1718
$$ 232820 237544 243405 249260 248766 248222 254116 261553 273032 285794 291523 299256 308440 323890 335608
9547C35608J1853J6972K4494K2807J4393J7088J9473L2134K9243L2336K8917K5608
$$ 335608 347461 364433 388927 411734 426127 443215 462688 494822 524065 556401 585318 610926
9535F10926J2747J238O665M778p872j5794j8775j6452q36o708q695m992L340J593
$$ 610926 623673 624911 631576 636354 628482 612688 593913 577461 576625 569917 561222 556230 559570 561163
9521E61163N630K1875K3984K0272M3307N9147O8376P7270R0955Q7149Q6041P4989
$$ 561163 566793 588668 612652 632924 676231 735378 803754 881024 971979 1059128 1145169 1220158
9509A220158O7687N5712L1643R769p480k6017l6234m3225m5973l8933l6529k5815
$$ 1220158 1287845 1343557 1375200 1384969 1377489 1351472 1315238 1272013 1226040 1187107 1150578 1124763
9497A124763j9118o632k198Q947J3919K4079K7425M1797N8200O5782Q6731J05021
$$ 1124763 1105645 1099013 1096815 1105762 1119681 1143760 1171185 1212982 1271182 1336964 1423695 1528716
9485A528716J17121J24291J27453J14317J05187Q9653O2947N4588K6584J2386
$$ 1528716 1645837 1770128 1897581 2011898 2117085 2206738 2269685 2324273 2350857 2363243
9475B363243J044J2257M3195P2944J24318J88756K59384L45898M59740N89342
$$ 2363243 2364287 2376544 2419739 2492683 2617001 2805757 3065141 3411039 3870779 4460121
9465D460121P29032Q78540R93834R93096Q82325P05308N42223L95921K37696M4583
$$ 4460121 5189153 6067693 7061527 8054623 8936948 9642256 10184479 10580400 10818096 10862679
9455A0862679j20150k15804j87843p5797K6243J19093K28357L59349M72471N41944
$$ 10862679 10742529 10526725 10338882 10263085 10289328 10408421 10636778 10996127 11468598 12010542
9445A2010542O09865O66968O98451O87233O07157N12273M10368L02612J56193
$$ 12010542 12620407 13287375 13985826 14673059 15280216 15792489 16202857 16505469 16661662
9436A6661662k7608j91714k52380k53446k02091j11845k1363Q3655K01489L25146
$$ 16661662 16634054 16442340 16189960 15936514 15734423 15622578 15601215 15684870 15886359 16211505
9426A6211505M85200O85835R11349J146391J426024J752850J993002J948368J561558
$$ 16211505 16696705 17382540 18293889 19440280 20866304 22619154 24612156 26560524 28122082
9417B8122082R97554N01039O1840m35367j022182j574918j890720j889605j663136
$$ 28122082 29119636 29620675 29682515 29247148 28224966 26650048 24759328 22869723 21206587
9408B1206587j371616j091388q34028n94117l91550k36618j25605n0903M6736
$$ 21206587 19834971 18743583 17909555 17315438 16923888 16687270 16561665 16510762 16557498
9399A6557498J74564K96543L71112L60833K50933P0219j19792k99939m64426o16490
$$ 16557498 16732062 17028605 17399717 17760550 18011483 18081702 17961910 17661971 17197545 16581055
9389A6581055p15962p73579p65697p16115o41410n37852m16231k85394j77931
$$ 16581055 15865093 15091514 14325817 13609702 12968292 12430440 12014209 11728815 11550884
9380A1550884q8714J4572J23175J89679J80701O2023r6334k39330l74340n21829
$$ 11550884 11462170 11476742 11599917 11789596 11970297 12032320 11935986 11696656 11322316 10800487
9370A0800487o79216q28197r03645q70229p61724o30611n15616m22286l32714
$$ 10800487 10121271 9293074 8389429 7519200 6757476 6126865 5611249 5188963 4856249
9361D856249k55316j98148j64236j18305p9150o2255o7811p4774r0726r7001j12646
$$ 4856249 4600933 4402785 4238549 4120244 4041094 3978839 3911028 3836254 3745528 3648527 3535881
9350C535881j25332j34588j41226j48841j54741j31156j13512j00819q9728q2101
$$ 3535881 3410549 3275961 3134735 2985894 2831153 2699997 2586485 2485666 2395938 2313837
9340B313837p6393o0859n3448m2123l7696k9107j6839j3895q912o997Q387O710
$$ 2313837 2237444 2176585 2123137 2081014 2043318 2014211 1997372 1983477 1974565 1967568 1975955 1982665
9328A982665J194m86j1285k4724m2585o0371o8952q2665q5945r2196r4480p9520
$$ 1982665 1983859 1983373 1972088 1947364 1904779 1844408 1775456 1692791 1606846 1514650 1420170 1340650
9316A340650o2273n1710l3821l7486m1818l1566k5732k2486j7652k4171k2123
$$ 1340650 1278377 1226667 1192846 1155360 1113542 1081976 1056244 1033758 1016106 991935 969812
9305I69812j2870j1812j2359j2044m211m356j2572j6910j4575j1584j2561k0708
$$ 969812 956942 945130 932771 920727 916516 912160 899588 882678 868103 856519 843958 823250
9293H23250j9116k1250k9416k1161k4089k3570k5289j2172j8273k7115j8488k5509
$$ 823250 804134 782884 753468 732307 708218 684648 659359 647187 628914 601799 583311 557802
9281E57802j7940j3600j5239k2048j5998j5738q068r434r261n475l165n17n531
$$ 557802 539862 526262 511023 488975 472977 457239 449171 439737 430476 425001 421836 421319 415788
9268D15788n396l330p138j4614j4081o933j3908r072k04k332j231o803n622m984
$$ 415788 410392 407062 399924 385310 371229 364296 350388 341316 341112 338780 337549 330746 325124 320140
9254C20140r477m399p362l207m581m126N591n853j474l673K278n861j0592q252
$$ 320140 310663 306264 298902 295695 291114 286988 292579 286726 285252 281579 283857 277996 267404 259152
9240B59152N230L640m946p380j665j842r767l731N652P910j207q077K911L515
$$ 259152 264382 268022 263076 255696 254031 252189 242422 238691 244343 252253 251046 242969 245880 249395
9226B49395l288q386r628m720m319k093j0170j005K928k018J052o48r25j148j841
$$ 249395 246107 237721 228093 223373 219054 216961 206791 205786 208714 206696 207748 207100 206175 205027 203186
9211B03186j696l64J663k605K552k931p945o934l060M537Q30j808P273J0565k574
$$ 203186 201490 201126 202789 200184 202736 199805 191860 184926 181866 186403 187233 185425 192698 203263 200689
9196B00689M7J0511R038K997K731O531N04N77k336j6925r175k674l943m943j0467
$$ 200689 200736 211247 220285 223282 226013 232544 233048 233625 231289 214364 205189 202515 198572 193629 183162
9181A83162n887P1n967o105o09l052O66R170N867q288L09R720L973L732Q51l015
$$ 183162 177275 177346 171379 165274 164665 161613 162279 171449 177316 169028 169337 179057 183030 186762 187613 184598
9165A84598r25r505r224p664K776m658k277m923l423l994j00L639P639R034l223
$$ 184598 183673 174168 164944 157280 160056 155398 153121 148198 144775 140781 140681 144320 151959 160993 157770
9150A57770j891Q438M841J1031K944J4018N988P748J7554J8069J4623J9798K4996
$$ 157770 155879 164317 169158 180189 183133 197151 203139 210887 228441 246510 261133 280931 305927
9137C05927L8619M2436M9334O0349Q6462R8639J07671J16581J21957J19493R9632
$$ 305927 344546 386982 436316 496665 583127 681766 789437 906018 1027975 1147468 1247100
9126A247100P9174N3281J9673j9516n4291q2884r9444j12716j08996j00102r2599
$$ 1247100 1326274 1379555 1399228 1379712 1325421 1242537 1143093 1030377 921381 821279 728680
9115G28680q5124o9432o1912m3553l5316k7304k5910k4939k8547k4640j7422j3643
$$ 728680 643556 574124 512212 468659 433343 406039 380129 355190 326643 302003 284581 270938
9103B70938o369o749j1276j877J821K630o263o325j1207r855l697j846n807M06
$$ 270938 264569 257820 246544 244667 246488 249118 242855 236530 225323 215468 211771 209925 204118 204524
9089B04524N541j118l574o615l132N055o468q076r05J822o232j3837o197l02m313
$$ 204524 210065 208947 205373 198758 195626 200681 194213 186137 185232 187054 180822 166985 160788 160486 156173
9074A56173k735M305n505o987m644l65l456j581K968L90Q567M339J71K447P44
$$ 156173 153438 157743 152238 145251 140607 140242 136786 135205 138173 138563 147130 151469 151640 154087 154831
9059A54831O895O082J479J191K1m18j741j176J966J0106N256P812P929K603O871
$$ 154831 161726 167808 169287 170478 170499 170081 168340 167164 169130 179236 184492 192304 200233 202836 209707
9044B09707J0855N503o617m020n426k524l756n286r110q579m191p520K524o896
$$ 209707 220562 226065 219448 215428 210002 207478 203722 198436 189326 180747 176556 169036 171560 164664
9030A64664p58j007J995k925m15L430k942o605o957k165M389O137L194N651j97
$$ 164664 163906 162899 164894 161969 161554 164984 162042 155437 148480 146315 150704 156841 160035 165686 165489
9015A65489R995O029j380J203P216O401J697m613K095P290Q049M145L169L307
$$ 165489 175484 181513 180133 181336 188552 194953 196650 192037 194132 201422 209471 213616 216785 220092
9001B20092M278N492M596R757O962L912J128J591N208P202P780R022J6582K0371
$$ 220092 224370 229862 234458 244215 251177 255089 256217 257808 263016 270218 277998 287020 303602 323973
8987C23973J8180J5603J2698Q42P231P942k256p153j3720j1635j5815k0432n192
$$ 323973 342153 357756 370454 371296 378527 386469 384213 377060 363340 351705 335890 315458 310266
8974C10266J296O354k817j3733k0444k1852o009p565m317m091r470k733K267M165
$$ 310266 311562 317916 315099 301366 280922 259070 253061 245496 241179 237088 227618 224885 227152 231317
8960B31317N943P05J378K083Q018L982J29k738M098N051M57M590K892q150m660
$$ 231317 237260 237965 239343 241426 249444 253426 253555 250817 254915 259966 260423 265013 267905 259755 255095
8945B55095M379l889j3621m142j858j359j1141r103l678j0616o869q195p685m204
$$ 255095 259474 255585 241964 237822 235964 234605 223464 214361 210683 200067 193198 185003 177318 173114
8931A73114p460q319N486L881k163o428m826l31L393J1638Q769M030J239J2603
$$ 173114 165654 157335 162821 166702 164539 158111 153285 152954 156347 167985 176754 180784 182023 194626
8917A94626R430N565N241J6175J7734P416j904N360R550J6076J0726K77q172j2593
$$ 194626 204056 209621 214862 231037 248771 256187 254283 259643 269193 285269 295995 296272 288100 275507
8903B75507o781q187j5563j6419j5646j3881r567j2298J102O744j456p683M656
$$ 275507 268726 260539 244976 228557 212911 199030 189463 177165 178267 185011 183555 175872 180528
8890A80528J3747Q415j785K481q72k57q26k827M346M991L900O819K860Q180J8531
$$ 180528 194275 202690 200905 203386 202514 202257 201431 198604 202950 207941 211841 218660 221520 229700 248231
8875B48231P045J436M098R474K536p228n240J945m062k498J122J1463P354o8j0033
$$ 248231 255276 256712 260810 270284 272820 265592 260352 262297 258235 255737 256859 268322 275676 275608 265575
8860B65575j8195l9352l0549M864L1639J3604j5368k1651J7304R3793J82618J77300
$$ 265575 247380 208028 177479 182343 213982 227586 212218 190567 207871 301664 484282 661582
8848F61582P4085k8606n3924n3924l8131j3330O13Q972L570L263J679M081N570
$$ 661582 735667 707061 653137 599213 561082 547752 548365 557337 560907 564170 565849 569930 575500
8835E75500O192J872K470K286M908J9495J6303J0423J8108K8580L2128K2014J1355
$$ 575500 581692 583564 586034 588320 593228 612723 629026 639449 657557 686137 718265 740279 751634
8822G51634J1173J2839M137R950Q803J185k354k45k759R822N047J2506J3554K3003
$$ 751634 762807 775646 779783 789733 798536 799721 797367 797122 794363 804185 809232 821738 835292 858295
8808H58295L0204L7096M0076L9225L2499L4450K9646J9955J5770J2196M140R104
$$ 858295 888499 925595 965671 1004896 1037395 1071845 1101491 1121446 1137216 1149412 1153552 1162656
8796A162656J1755K0912L3087L0254L7069M6675M6440M8487M6402N0781N2118
$$ 1162656 1174411 1195323 1228410 1258664 1295733 1342408 1388848 1437335 1483737 1534518 1586636
8785A586636N4031N0417M9697N3008N9702O0454O7066P6555P3092O7468P4751
$$ 1586636 1640667 1691084 1740781 1793789 1853491 1913945 1981011 2057566 2130658 2198126 2272877
8774B272877Q9380R5523J13080J19446J21179J37623J63071J89351K01019K16527
$$ 2272877 2362257 2457780 2570860 2690306 2811485 2949108 3112179 3301530 3502549 3719076
8764C719076K45980K66833K80277L06707L38388L67203L93141M41468M84908N40037
$$ 3719076 3965056 4231889 4512166 4818873 5157261 5524464 5917605 6359073 6843981 7384018
8754G384018O12806P09427Q40438J012683J228268J469320J663779J798077J962784
$$ 7384018 7996824 8706251 9546689 10559372 11787640 13256960 14920739 16718816 18681600
8745A8681600K238866K544764K789173L002063L299476L798741M589422N755446
$$ 18681600 20920466 23465230 26254403 29256466 32555942 36354683 40944105 46699551
8737D6699551P495510J0047093J3769716J9163777K6599196L5584815M2696265
$$ 46699551 54195061 64242154 78011870 97175647 123774843 159359658 202055923
8730B02055923M0644791K6409069J1385681N160867K286772m538979j6932976
$$ 202055923 242700714 269109783 280495464 285656331 287943103 283404124 266471148
8723B66471148l1651378l9629684l6813591k8858776k1317622j5740080j1829812
$$ 266471148 234819770 195190086 158376495 129517719 108200097 92460017 80630205
8716H0630205r090317p168807n817480m819652m092167l585625l209225k906358
$$ 80630205 71539888 64371081 58553601 53733949 49641782 46056157 42846932 39940574
8708C9940574k662547k415794k187625k015713j870708j712601j525683j355220
$$ 39940574 37278027 34862233 32674608 30658895 28788187 27075586 25549903 24194683
8700B4194683j209837j100112j015994r64676r15197q50089p88283p22596o65010
$$ 24194683 22984846 21884734 20868740 19904064 18988867 18138778 17350495 16627899 15962889
8691A5962889o19211n79628n41573n18675m98947m87563m77906m78287m75137
$$ 15962889 15343678 14764050 14222477 13703802 13204855 12717292 12239386 11761099 11285962
8682A1285962m50093m19942l94430l71420l44549l12348k86823k62528k58017
$$ 11285962 10835869 10415927 10021497 9650077 9305528 8993180 8706357 8443829 8185812
8673H185812k46864k26466k20986k23267k18911k09831k00736j90706j77352j85412
$$ 8185812 7938948 7712482 7491496 7268229 7049318 6839487 6638751 6448045 6270693 6085281
8663F085281j88608j89964j88791j74631j69417j73256j71190j71778j58566j41981
$$ 6085281 5896673 5706709 5517918 5343287 5173870 5000614 4829424 4657646 4499080 4357099
8653D357099j27813j14266j02524r1303q5579r0288p5265p7854p9864p9590p7322
$$ 4357099 4229286 4115020 4012496 3921193 3835614 3745326 3670061 3592207 3512343 3432753 3355431
8642C355431q2068p9488p1110p1107o9887o5044o3003o5660o9066q4606r3488
$$ 3355431 3273363 3193875 3122765 3051658 2981771 2916727 2853724 2788064 2718998 2634392 2540904
8631B540904r1106q8284q6051q9846q8247p7833o6285p4462p3210p3922o2884
$$ 2540904 2449798 2361514 2275463 2185617 2097370 2019537 1953252 1878790 1805580 1731658 1668774
8620A668774o9931p1566o2607o1877n2613m7925m3721m6057m8917l5964l1369
$$ 1668774 1598843 1527277 1464670 1402793 1350180 1302255 1258534 1212477 1163560 1127596 1096227
8609A096227l0645j5168R89J8601K4805K6076J6533J0915K6259M5618M0035M033
$$ 1096227 1065582 1050414 1051403 1070004 1094809 1120885 1137418 1148333 1174592 1220210 1260245 1264278
8597A264278n1194p5858o4740m5494k8481j9899p57n961k2787k0285j8111n244
$$ 1264278 1213084 1137226 1072486 1026992 998511 978612 977855 971894 949107 928822 910711 905467
8585I05467j0603j2249q970p160J931L997J4391J7334J5853K8245M3804L2995
$$ 905467 894864 882615 873645 866485 868416 872413 886804 904138 919991 948236 992040 1025035
8573A025035M4865O7209R5410J40769J73407J58441J43866J90878K47309K47880
$$ 1025035 1069900 1137109 1232519 1373288 1546695 1705136 1849002 2039880 2287189 2535069
8563B535069J54452J5494m1405m5547n9476j23749k11035k51153k41291k02973
$$ 2535069 2689521 2705015 2663610 2618063 2558587 2434838 2223803 1972650 1731359 1528386
8553A528386j62411j23199r1881p9224o1463m8495m4679l0311j7661j2141k969
$$ 1528386 1365975 1242776 1150895 1071671 1010208 961713 917034 886723 869062 856921 853952
8542H53952q646j2423r044l175N422Q706Q854Q718J8408L8480P0288J07502J46144
$$ 853952 845306 832883 823839 820664 826086 834792 843646 852364 870772 909252 979540 1087042 1233186
8529A233186J93608J87837R9921K5434J4114M886k9904r0808j81200k02776j67516
$$ 1233186 1426794 1614631 1714552 1739986 1754100 1758986 1729082 1638274 1457074 1254298 1086782
8518A086782j21618q8842o1851l4165l3548k8608k7982k6460l3419j9852j4018
$$ 1086782 965164 876322 814471 780306 746758 718150 690168 663708 630289 610437 596419
8507E96419j6318j1950j2421j9222j0178l954q811o032p212R90j912p144p330
$$ 596419 580101 568151 555730 536508 526330 522376 513565 507533 500321 501311 499399 492255 484925
8494D84925k402o154n694l669r388j8663j0584j4268j1759j2809j2648j3398j0746
$$ 484925 482523 476369 470675 467006 457618 438955 428371 414103 402344 389535 376887 363489 352743
8481C52743j8519j4015m571r942m774o939n637l852o986o229l256m704n901n101
$$ 352743 334224 320209 315638 305696 300922 293983 288346 284494 277508 271279 268023 263319 257418 252317
8467B52317m999j0061j0095k973J673p177j537m139K670P07q042m848j848n597
$$ 252317 247318 237257 227162 224189 225862 218685 217148 213009 215679 216386 208344 203496 201648 196051
8453A96051j5205m858O971J409m634Q324O003n89K04k893M160J349m845m492j789
$$ 196051 180846 175988 182959 184368 179734 188058 194061 193472 193676 190783 194943 196292 191447 186955 185166
8438A85166P251j396n254o620L654J297p515L073k150l152K063J985j575p735
$$ 185166 192417 191021 185767 179147 182801 184098 176583 179656 177506 174354 176417 178402 176827 169092
8424A69092J25j557l713k632L067n947l237O08j0241l682M833K61M716L901m972
$$ 169092 169217 167660 163947 161315 164382 158435 155198 155806 145565 141883 146716 146977 151693 155594 150622
8409A50622m488o274J604k29j135p53k243K285m073p442k642N94O00n104K45R541
$$ 150622 146134 139860 141464 141235 140100 139347 137104 139389 135316 127874 125232 125826 126426 121322 121567 131108
8393A31108L657m308l646j790k058l409L43J592M955j580M838O508k841k333n618
$$ 131108 134765 130457 126811 125021 122963 119554 119897 121489 126444 124864 129702 136210 133369 131036 125418
8378A25418M118K174K433l1o25o286J0898K303m415J039j231n361J1103Q903k415
$$ 125418 129536 131710 134143 134112 133487 127201 138099 140402 135987 137026 135795 130434 141537 150440 148025
8363A48025J248K409p59K977m726k212L528n12k82j558J439R497R776M765M705
$$ 148025 149273 151682 150923 153900 149174 146962 150490 149978 149696 148138 149577 159074 168850 173615 178320
8348A78320O32J679J1883J2047N490N193J1632J4247O783J9310K2013L1764L8367
$$ 178320 178952 180631 192514 204561 210051 215244 226876 241123 247906 267216 289229 320993 359360
8335C59360M7241N3259P1547Q5707Q9911J10092J18224J32015J23257J03568P5852
$$ 359360 406601 459860 531407 617114 707025 817117 935341 1067356 1190613 1294181 1370033
8324A370033M4318J1961j3809m8152q1400j06692j25068j20759j08909j01626
$$ 1370033 1414351 1426312 1412503 1364351 1282951 1176259 1051191 930432 821523 719897
8314G19897p8675p0036n7733m9644l8415k8518k3534j8355j1467k0416k1520q710
$$ 719897 641222 571186 513453 463809 425394 396876 373342 354987 343520 323104 301584 292874
8302B92874n983p134j1382r776j1156j2707m43j5185j1413n839j4700j1862j5426
$$ 292874 286891 279757 268375 258599 247443 234736 234293 219108 207695 201856 187156 175294 159868
8289A59868j4864n231L186N65k198L798k340l878J2153K723l375o037o996j97
$$ 159868 145004 139773 142959 143524 141326 145124 142784 138906 151059 153782 150407 144370 137374 137177
8275A37177k110l476k881q701q898m17m692n684p533p524o251J322j449o831j0013
$$ 137177 135067 131591 128710 120009 111111 110694 106002 100318 92785 85261 79010 80332 78883 72052 62039
8260F2039N26N627J906j30J8365M647K621Q145Q95J608R856L995o614o710k579
$$ 62039 62565 68192 70098 69968 88333 92980 95601 103746 104641 106249 116105 120100 113486 106776 104197
8245A04197k157l177k694M337j78k898J718J305M673j085j930k427q383l473J784
$$ 104197 102040 98863 96169 100506 100328 97430 99148 100453 105126 104041 102111 99684 91301 87828 89612
8230H9612K953L387j558m403J446j043k072j444p702j220J496N911L454l110j1219
$$ 89612 92565 95952 94394 89991 91437 90394 88322 86878 79176 77956 79452 85363 88817 85707 74488
8215G4488k724J0590L590p20rL922l80r693k547j656M31n24K342Q89L747j526
$$ 74488 71764 82354 85944 85224 85215 89137 88757 79064 76517 74861 75292 74768 77110 77999 81746 80220
8199H0220n754N075J677l2l126r43j509k321k185K981N267K593N430n499m971
$$ 80220 74466 79541 81218 81186 78060 77117 75608 73287 71102 74083 79350 81943 87373 81874 76903
8184G6903m150k813O678r89K749M573j643j786k82n435j787M210K082j141K241
$$ 76903 72753 69940 76618 75629 78378 82951 81308 79522 79240 73805 72018 76228 78310 77169 79410
8169G9410m971k521k309M334Q169O260L754p592J544O975L190r175l868M179O009
$$ 79410 74439 71918 69609 73943 82112 88372 92126 84534 86078 93053 96243 87068 83200 87379 93388
8154I3388K559m916p134L181l72n685j091J992r81q72m619o955q679m8l741j457
$$ 93388 95947 91031 83897 87078 86706 81021 79930 81922 80941 80069 75450 68495 59816 59768 56027 54570
8138E4570R495N506k307J487J275L363K271M249n843k150J904l048J746J091j178
$$ 54570 64065 69571 67264 68751 70026 73389 75660 79909 74066 71916 73820 70772 72518 73609 72431
8123G2431R126P096j096q972o442m27L586L861r12m178l259K564k640p226l896
$$ 72431 81557 88653 87557 78585 72143 71716 75302 79163 78251 74073 70814 73378 70738 63512 59616
8108E9616M345Q38j343K113l90p389k095k189M23N436P030j334j687M740L85j207
$$ 59616 63961 64799 63456 65569 65179 57790 55695 53506 53929 59365 66395 65061 63374 68114 68499 67292
8092F7292N272K654N060J224N691Q099L603l510J0649J4737J0948J7045J0575
$$ 67292 72564 75218 80278 81502 87193 95292 98895 95385 106034 120771 131719 148764 159339
8079A59339J3627J0682M924k060m046m761q969j0469j4785j5391j5407o421o994
$$ 159339 172966 183648 188572 186512 182466 177705 168736 158267 143482 128091 112684 106263 99269
8066I9269k224j545n770J4J326N263m872j875J053p269j0091k935J049K507K235
$$ 99269 97045 95500 89730 89744 91070 96333 91461 89586 90639 83370 73279 70344 71393 73900 76135
8051G6135j977n979l448P731J5186P658M480K085p91Q44K362J2197J2411J5153
$$ 76135 74158 68179 64731 72462 87648 95306 99786 101871 101080 101924 104286 116483 128894 144047
8037A44047J8569J3700J9789J7479J1004R168J2435O086m590o079j4026k1128
$$ 144047 162616 176316 196105 213584 224588 233756 246191 252277 247687 241608 227582 206454
8025B06454j3016j6034j5901j4763j1125j1827j1766j292M47j453k185o607k237
$$ 206454 193438 177404 161503 146740 135615 123788 112022 110730 111177 109724 107539 100932 98695
8012I8695m54O11l138M287K577N84L058m619o493J0493P448M255j662k142n648
$$ 98695 98241 98852 95714 100001 102578 103162 106220 101601 95108 105601 113049 117304 115642 113500 107852
7997A07852J121J518m350P224J3131M554O306j207R954M613k212J264k302l621
$$ 107852 108973 110491 106141 113365 126496 131050 137356 136149 146103 150716 148504 149768 147466 143845
7983A43845K368r53k28k229l482r577r616j1088k819p56q3l45k314k31p841j576
$$ 143845 146213 145260 145032 142803 139321 129744 120128 109040 106221 105465 105382 105037 102723 102492 94651 93075
7967I3075N874J309q514j1069J303K378j337N02O215N921l203j709K350k108k782
$$ 93075 98949 100258 91744 80675 81978 84356 83019 83521 89736 95657 92454 90745 93095 90987 88205
7952H8205m61K817M489L378J376p042q919r346j33o84n174Q16L107j10j394K253
$$ 88205 87744 90561 95050 98428 99804 92762 83843 74497 74364 73680 68506 69322 72429 72319 70925 73178
7936G3178J17k221k075K178Q363l79m394n308O977J208L798Q09L473K020J751
$$ 73178 73295 71074 68999 71177 79540 79161 74767 69459 76436 77644 81442 82251 85724 87744 89495
7921H9495k972n995o872L609J959N410J734j551j443K001J666p665j782L890K565
$$ 89495 86523 80528 73656 77265 79224 84634 86368 84817 83374 85375 87041 79376 77594 81484 84049
7906H4049j867j467L847n043m127N752n0l893l732m279l8n550M306K515m575o740
$$ 84049 82182 80715 84562 79519 75392 81144 81094 77201 73469 69190 69152 63602 67908 70423 65848 59108
7890E9108k668N151N655n166q068l417R130J72n465o203L112M732m939l461n23
$$ 59108 56440 61591 67246 62080 54012 50595 59725 59897 54432 48229 51341 56073 51134 47673 47150
7875D7150k166J494J247O686R99J603L920J768K97n496n814n670m34P958K901
$$ 47150 44984 46478 47725 54411 55410 57013 60933 62701 62998 57502 51688 46018 45584 53542 56443
7860E6443J611m94K52M615J82j218m66l104n800n856N15P465j629o756n499l425
$$ 56443 58054 57560 57812 62427 62609 61391 60925 57821 52021 46165 46680 54145 52516 45760 40261 36836
7844C6836o188L113K265K202m74O582j025q859J93k263n306J546O240K821P079
$$ 36836 30648 33761 36026 38228 37754 44336 43311 34452 34645 32382 27076 28622 34862 37683 44762
7829D4762N316L930k493n144n001K364L040L2P222J228j224K727Q005J837p901
$$ 44762 50078 54008 51515 46371 41370 43734 46774 46806 54028 55256 54032 56759 64764 66601 58700
7814E8700p241K38n73j010n721k612m38n882m299Q14m752o74N513j928k27O678
$$ 58700 51459 51697 51124 50114 44393 41781 41343 35461 31162 31976 27224 26550 32063 30135 29908 36586
7798C6586m416m202P146j227N066M976n894m059l099L933l884R99K916M489n036
$$ 36586 32170 27968 35114 33887 38953 43929 38035 33976 30877 34810 30926 31925 34841 39330 34294
7783C4294m580m57P041O651M858j817j146K539J368J671K065l556o711K77J778
$$ 34294 29714 29257 36298 42949 47807 45990 44844 47383 48751 50422 52487 48931 42220 42497 44275
7768D4275k659n068j186p475R13K69N768Q168J256n606j636j811m666m374J360
$$ 44275 41616 36548 35362 27887 28800 29069 34837 43005 44261 38655 37019 35208 30542 26168 27528
7753B7528k563l597M959o01J366n9l084P22m574L50L696o038K258K337r00K969
$$ 27528 24965 21368 26327 25726 27092 27033 23949 24671 20097 20447 24143 18105 20363 22700 21800 24769
7737B4769N57l768j6j297K22L711R220l85m076n361k847J367J0022N529n831k637
$$ 24769 25326 21558 21542 20245 20467 24178 33398 33013 28937 23576 20729 22096 32118 37647 31816 29179
7721B9179j582l47n160q697M035L191n951l866L792Q631N890l500l559n06K23
$$ 29179 27597 27250 22090 13393 17428 20619 14668 10802 14594 23225 29115 25615 22056 21550 21773
7706B1773M110K692N378k756O80K0j860j0798p180Q323L834m108J750J49L166
$$ 21773 25883 28575 33953 31197 31877 31897 30037 19239 12059 20382 24216 20108 21858 22007 25173
7691B5173n874p345k048N367N933j425k451o201k399n211J398M612M711M568L327
$$ 25173 19299 11954 9906 15273 21206 19781 17330 11129 8730 3519 4917 9529 14240 18808 22135
7676B2135L995P62p475j1350m628K708k606j000l978L650J216P232m130o47j374
$$ 22135 26130 26892 19417 8067 3439 6147 3541 2541 -1437 2213 3429 10661 6531 5884 4510
7661D510L053p413k844K791N822J0029L896o392k961K998R626J060o905q271k563
$$ 4510 7563 150 -2694 97 5919 15948 19844 13452 10491 13489 23115 24175 17270 8999 6436
7646F436K189M718L016o28K583p93p170q616J152R114M563p03L242L96p355k910
$$ 6436 8625 13343 16359 15731 18314 17521 10351 1735 2887 12001 16564 15861 19103 19499 12144 9234
7630I234O3k78J735q25L093P483j915q189k735J285K18P44jL628o710r919O605
$$ 9234 9297 9019 10754 9929 13022 20505 18590 10401 7666 8951 9169 9913 9912 13540 6830 -3089 3516
7613C516K683J315P201L327K3K064j732j2808m778L01M832K634L167j932n932
$$ 3516 6199 7514 14715 18042 18065 20129 18397 5589 811 1112 5944 8578 11745 9813 3881
7598C881q68L018j794m02p82k306J306M156j13o409m315J622M795R108K281J085
$$ 3881 3013 6031 4237 3835 3053 747 2053 6209 6096 -313 -4628 -3006 1789 10897 13178 14263
7582A4263M410k522r649j230L942L037M3J279O839m620o920M146L284m390k785
$$ 14263 18673 16151 6502 5272 9214 12251 12294 13573 20412 15792 8872 13018 16302 11912 9127
7567I127J173j981l830K024J891J537J346j672m502M055N460j73K687O10J609
$$ 9127 10300 8319 4489 6513 8404 9941 11287 9615 5113 9168 14628 14455 17142 17752 19361
7552A9361N42j326L646N098l586r401q905r939O638R89m887L15m224L63R545K635
$$ 19361 19903 18577 22223 27321 23735 14334 5429 -4510 2128 3117 -1770 -1455 -5679 -5316 4229 6864
7536F864Q29m477l065M908k560L983P535L286k864r406J335N216L002J932O312
$$ 6864 7693 3216 151 5059 2499 6482 14017 17303 14439 5033 6368 11584 14586 16518 22830
7521B2830j59n184j577K540M44p510k723j70k454m340L539j716l131j075J516
$$ 22830 22671 17487 15910 18450 18894 11384 8661 8491 6037 1697 5236 3520 389 -686 830
7506H30K984J738k490M420K008N68j633J522J475n875n866k50O717L659J122j460
$$ 830 3814 5552 3062 7482 9490 10058 8425 9947 11422 5547 -319 -569 6148 9807 10929 9469
7490I469j054K11M552j264q180l709O831p92k192Q045J1303j724j5185m627m413
$$ 9469 8415 8626 13178 11914 3734 25 6856 6064 3872 11917 23220 21496 6311 1684 -2729
7475b729R87M486P27J841p16K559J401k345m350j491N424K637n752k733J525o747
$$ -2729 -1742 2744 3471 5312 4596 7155 8556 6211 1861 370 5794 8431 2679 -54 1471 -5276
7459e276l112L045J372J45L618M693L201k877L2j254j240k13L919L012k814k747
$$ -5276 -8388 -5343 -3971 -3826 -208 4485 7686 4809 4841 3587 2347 2134 6053 9065 6251 3504
7443C504K716k89j460q567N090J354n607J828P559k538m6O150j842n464j69M232
$$ 3504 6220 5931 4471 -4096 994 2348 -3259 -1431 6128 3590 3544 9694 7852 2388 2219 6451
7427F451K182j816p154j542Q49L30M223L333n348l587L756L256K165J185j617
$$ 6451 8633 6817 -337 -1879 -1030 -700 3523 6856 1508 -2079 1677 4933 7098 8283 6666
7412F666K270J780j300J046K883M26J654p58l199l728j360l030K088K109k355
$$ 6666 8936 10716 9416 10462 13345 13771 15425 14667 11468 7740 6380 3350 5438 7547 5192
7397E192o565M674N126l033m714L609j882N22K737k145k289J01M423J536l471
$$ 5192 -1373 3301 8427 5394 680 4289 2407 2929 5666 3521 1232 1333 5756 7292 3821
7382C821R97J935J671J655k4l399K223N664L44n021k302M099j764k132j933o169
$$ 3821 4818 6753 8424 10079 10055 6656 8879 14543 14887 9866 7564 11663 9899 7767 5834 -335
7366c35m073j054L965K627l34q87Q647O2k699n931j718J998K551m155l455M034
$$ -335 -4408 -5462 -1497 1130 796 -91 8556 8618 5919 -12 -1730 268 2819 -1336 -4791 -757
7350g57P872K175p124J184J882J286m507K089K658N84K924J597l650l475O17m468
$$ -757 7115 9290 2166 3350 5232 6518 2011 4100 6758 7342 10266 11863 8213 4738 5355 887
7334H87q85J241K454N739R011j774o781k454M071O45K741Q64l172k34n528j1126
$$ 887 2 1243 3697 9436 18447 16673 9892 7438 11509 12154 14895 15759 12587 12353 6825 -4301
7318d301o399L616Q930O484o9N186M311R75j980l430l036j0705m925K213M572
$$ -4301 -10700 -7084 1846 8330 8261 13447 17758 18733 16753 13323 10287 -418 -5343 -3130 1442
7303A442J723j221p003O087J770K619Q14Q788J539m841n773J905J29O722J06j58
$$ 1442 3165 1944 -5059 1028 2798 5417 6231 15019 16558 11717 5944 7849 7978 14700 14806 14648
7287A4648K806n522l531M167L86j0286m42N376O108r141r560P5o069N882P568
$$ 14648 17454 11932 8401 12568 12954 2668 2226 7602 13710 4569 -4991 -4916 -10985 -5103 2465
7272B465O89L861Q491m433l303N216l707m961O072l329n806O57O850J368k160
$$ 2465 3154 7015 15506 11073 7770 12986 9279 4318 10390 7061 1255 1912 8762 10130 7970
7257G970k530n10j73K36P886k04J757k561k041K263Q770m302O71P940m13r033
$$ 7970 5440 4930 4757 4993 12879 12675 14432 11871 9830 12093 20863 16561 17232 25172 24759 15726
7241A5726j0276k826K04N989N143L253k838q41j713l589p711n065N225j018M281
$$ 15726 5450 2624 2828 8817 13960 17213 14375 13534 11821 8232 521 -4544 681 -337 3944
7226C944N443M268k809p405J2J902J749j136R39j310j670J607o745n556P182n326
$$ 3944 9387 13655 10846 3441 3453 5355 7104 5968 6907 5597 3927 5534 -1211 -6767 415 -4911
7210d911k008P574K309q84J792m632l624O181k088n389n16O429P70K307K515M374
$$ -4911 -6919 655 2964 2080 3872 -760 -4384 1797 -291 -5680 -6196 233 1003 3310 5825 10199
7194A0199P98J855k625m037k247K013J515n799j566k746m290K833K196J029J885
$$ 10199 10997 12852 10227 6190 3943 5956 7471 1672 106 -2640 -6930 -4097 -1901 -872 1013
7179A013J052K652L834M541O26l630j980k799K2O49q184l960L778J081N980N399
$$ 1013 2065 4717 8551 13092 13718 10088 8108 5309 5331 5980 -2204 -6164 -2386 -1305 4675 10074
7163A0074m589r93o245L140K439m56r94l047J9m95l259k70k697j380O232M420
$$ 10074 5485 4492 -1753 1387 3826 3370 2376 -671 -652 -1147 -4406 -4676 -7373 -8753 -2521 1899
7147A899M873J575j429K235J268o78J715l835l188Q95P560K014k479R49n059J23
$$ 1899 6772 8347 6918 9153 10421 9743 11458 7623 4435 5330 12890 14904 12425 13374 8315 8438
7131H438O257J478o735k539m287J025l934j143J850o417j241L880M316P77k118
$$ 8438 14695 16173 9438 6899 2612 3637 -297 -1440 410 -6007 -7248 -3368 948 1725 -393
7116c93j570M664J1779K590l262k607l409J915k407l337L187k260n207K152M393
$$ -393 -1963 2701 14480 17070 13808 11201 7792 9707 7300 3963 7150 4890 -317 1835 6228
7101F228j567n655k221J989K808k123L958m85R857L087k836l188J457J840m74
$$ 6228 4661 -994 -3215 -1226 1582 -541 3417 2932 12789 15876 13040 9852 11309 13149 12675
7086A2675J421L029N566m85l835j864j30N95L432n785o704n437o67n063J478K765
$$ 12675 14096 17125 22691 22206 18371 16507 16377 16972 20404 14619 7915 2478 1811 -3252 -1774 991
7070I91k296K480l632J927M676o31n305r84O279L662l312m883j70K541R079o508
$$ 991 -1305 1175 -2457 -530 4146 3515 -1790 -2774 3505 7167 3855 -1028 -1198 1343 10422 3914
7054C914k883q69k035N424N661o055M197M043O97n42k961m387L69q86n280Q53
$$ 3914 1031 162 -1873 3551 9212 3157 7354 11397 12094 11552 8591 4204 4573 3687 -1593 -740
7038g40k448K31K219K831J889M524j16j514o022n038m485J663k721o082N632J0303
$$ -740 -3188 -2957 -738 2093 3982 8506 8390 6876 854 -4184 -8669 -7006 -9727 -15809 -10177 126
7022A26N134L56K554M255k729q767K794M827L718L600q153j2475J287N648P841
$$ 126 5260 5616 8170 12425 9696 929 3723 8550 12268 15868 7715 -4760 -3473 2175 10016
7007A0016M0k778j090o014l060k09J6p54K20N52K088L232o531m429l087O391M132
$$ 10016 10056 7278 6188 174 -2886 -3095 -3079 -3833 -3613 -3061 -973 2259 -4272 -8701 -11788 -5397 -1265
6990a265J817J609M027K987K691k155j440Q92k617O44j646N04j456M378n6j090
$$ -1265 552 2161 6188 9175 11866 9711 8271 9163 6546 7190 5544 6048 4592 8970 8914 7824
6974G824m747j915L88l279N58O196O695L025k153q673p887j0711m564P879M637
$$ 7824 3077 1162 1550 -1729 -1171 5025 11720 14745 12592 3919 -3968 -14679 -19243 -11364 -6727
6959f727n446l088O742N918k175l012J943N45r16J462l087M703K558M517K989
$$ -6727 -12173 -15261 -8519 -2601 -4776 -7788 -5845 -5300 -6216 -4754 -7841 -3138 -580 3937 6926
6944F926O385M818m436j0927J114J1861k808n533j364m455K740k966k457N960
$$ 6926 13311 18129 13693 2766 3880 15741 12933 7400 6036 1581 4321 1355 -1102 4858
6930D858M646K866j411K662j347n913p209p382J0089L127K543k096m206J850k629
$$ 4858 9504 12370 10959 13621 12274 6361 -848 -8230 1859 4986 7529 5433 1227 3077 448
6915D48m679l659j763K397O849m519O15P049M916l735L148M518k50n009K765L536
$$ 448 -4231 -7890 -9653 -7256 -407 -4926 -4311 2738 7654 3919 7067 11585 11335 6326 9091 12627
6899A2627o47p33m620m954p60n992N91Q2L206R15R94o907k671J834R240M16K8
$$ 12627 11980 11247 6627 1673 913 -5079 -4488 -4406 -1200 -285 709 -6198 -8869 -7035 2205 2621 2649
6882B649l309l505k126l391P95N060n129J445Q459l421j9p72j961J15Q446N836
$$ 2649 -660 -4165 -6291 -9682 -8887 -3827 -8956 -7511 948 -2473 -2492 -3264 -5225 -5110 3336 9172
6866I172k613K47l211J610k17J687J347m617n136k620O68N157J484L167O528J29
$$ 9172 6559 6806 3595 5205 4988 6675 8022 3405 -1731 -4351 -3683 1474 2958 6125 12653 12782
6850A2782j751J277j212m163o077n025N224Q184M6l545j290J625Q92k459J338
$$ 12782 11031 12308 11096 6933 856 -4169 1055 9239 9285 5740 4450 6075 6967 4508 5846
6835E846j524o206m886l189L045K881J870m205j36K32P146P564K430l753p052
$$ 5846 4322 -1884 -6770 -9959 -6914 -4033 -2163 -6368 -6504 -6272 874 8438 10868 7115 63
6820F3j654K720J167M288K532J855O789n860q881P242J439L450N720n178o709
$$ 63 -1591 1129 2296 6584 9116 10971 17760 11900 3019 10261 11700 15150 20870 15692 8983
6805H983q53l809L837j282J304R51L256J057q591q85k268m272L303M650J1945
$$ 8983 8130 4321 8158 6876 8180 9131 12387 13444 4853 3968 1700 -2572 731 5381 17326
6790A7326j025n721j315O080J313o409J248K607%o730O52J869M526l57o655J705
$$ 17326 16301 10580 9265 15345 16658 10249 11497 14104 14104 7374 8026 9895 14421 14064 7409 9114
6774I114j595N829L038J802M830J26k326q42m92n5l54N522O843J003L423J3767
$$ 9114 7519 13348 16386 18188 23018 23144 20818 19976 19484 19429 19075 24597 31440 32443 35866 49633
6758D9633L757m323J598J595q14O868J4790J1903J3551J8608J4467J8860J2976
$$ 49633 53390 49067 50665 52260 51446 58314 73104 85007 98558 117166 131633 150493 163469
6745A63469O726L58N40K135l961l564L054O269o23J7215K0547K0813L4139N0367
$$ 163469 170195 170553 171093 173228 169267 165703 168757 175026 174403 191618 212165 232978 267117 317484
6731C17484O4455R9356J47022K06032K82491L98742M87443M39290K33949M9304
$$ 317484 381939 481295 628317 834349 1116840 1515582 2003025 2442315 2676264 2725568
6721B725568K9443J8038p7182k46579m27413m62324l59058k47867j65509j16242
$$ 2725568 2755011 2773049 2695867 2449288 2021875 1559551 1200493 952626 787117 670875
6711F70875r1374p3160n8913m2747l3299k8752k3879o715m406p372n116p031p961
$$ 670875 579501 506341 447428 404681 371382 342630 318751 312036 307630 300258 295142 288111 280150
6698B80150r708j0670j0961j2502k3485j7769k5561k1232o674l04L835o367p143
$$ 280150 270442 259772 248811 236309 212824 195055 169494 148262 141588 141284 145119 138752 131609
6685A31609M818M236L74n127j589o218j3601q382p215k355j989o680p445q329
$$ 131609 136427 140663 141037 135910 134321 128103 114502 106120 98905 96550 94561 87881 80436 72107
6671G2107l350k897m158o744n800L012j41j604o79j770j922K582N876N295m095
$$ 72107 68757 65860 61702 54958 49158 52170 52029 50425 49746 47976 46054 48636 54512 59807 55712
6656E5712m221k014J624l668l892J50m738k895n689J689L577J896o199p272m176
$$ 55712 51491 49477 51101 47433 43541 43691 38953 36058 30369 32058 35635 37531 31332 24060 19884
6641A9884L341K718M51q17k477j227n86N88M35J319J583m534m154k988l107O155
$$ 19884 23225 25943 26394 25577 23100 21873 21287 21875 22310 23629 25212 20678 16524 13536 10429 16584
6625A6584O76Q83K103J35m59K799K814q466q158n29N459p545o288r73J885j05
$$ 16584 17260 18143 20246 20381 19922 22721 25535 17069 8911 8382 13841 6296 8 -965 920 815
6609H15j706M074N033j24O054K321l084k308m604K0n17l083J998O370K539L388
$$ 815 -891 3183 8216 8092 14146 16467 13383 11075 6471 6491 5974 2891 4889 11259 13798 17186
6593A7186J552k646n15q44m984l061k519m315n653P225l666K473P846k769j821
$$ 17186 18738 16092 15577 14733 9749 6688 4169 -146 -5799 1426 -2240 233 8079 5310 3489
6578C489J937o498k945N532K106n66K61l59k461J157n630m130K810K614P566r5
$$ 3489 5426 -1072 -4017 1515 3621 3055 3316 2957 496 1653 -3977 -8107 -5297 -2683 4883 4788
6562D788m163L995N149l521l572l448L797J730J037j350l970O639N265K662k715
$$ 4788 625 4620 9769 6248 2676 -772 3025 4755 5792 4442 472 7111 12376 15038 12323
6547A2323q957K707R38l118n520p02L571O403J327k504K978K994l5o248j325m766
$$ 12323 3366 6073 7011 3893 -1627 -2329 1242 7645 8972 6468 9446 12440 12405 6157 4832 66
6531F6K180K391l58l231j149Q96P48K920P633J668p600p364k667N433m622K878
$$ 66 2246 4637 4279 1048 -101 795 1543 4463 12096 13764 6164 -1200 -3867 1566 -3056 -178
6515a78l65l869K342M032K625l443m324m561M471j94Q11r26R38m306J016J886
$$ -178 -543 -4412 -2070 1962 4587 1144 -3180 -7741 -3270 -3464 -2653 -3579 -2641 -6947 -5931 -4045
6499d045l126l70M450k01n760O706L30m278Q63N824L157J78n895l911P120O462
$$ -4045 -7171 -7541 -3091 -3292 -9052 -2346 -2016 -6294 -5431 393 3550 3728 -2167 -6078 1042 7504
6483G504N98o391q793j776L612N080l958K092q120M152L729l825K880N691m383
$$ 7504 8102 1711 -7082 -8858 -5246 -166 -4124 -2032 -10152 -6000 -2271 -6096 -3216 2475 -1908
6468a908m268l192R14k785j566o4J982p623K240M609L574L227L231N178L49K450
$$ -1908 -6176 -9368 -8454 -11239 -12805 -12869 -10887 -18510 -16270 -11661 -8087 -4860 -1629 3549 3898 6348
6452F348j73M58l567j554p605r194L548J143K981k146j122Q92n37K046j64k41
$$ 6348 6175 6633 3066 1512 -6093 -15287 -11739 -10596 -7615 -9761 -10883 -9991 -10528 -8482 -8646 -8887
6436h887Q762R755M055n341o850o847J386K772l136J572R713L560m647r448o946
$$ -8887 -125 9630 13685 8344 1494 -5353 -3967 -1195 -4331 -2759 6954 10514 5867 -3581 -10527
6421a0527M948L242K04K676p31l808k838k40j163O109Q470K59m447k062P02m466
$$ -10527 -5579 -2337 -2133 543 -188 -3996 -6834 -7074 -8237 -2128 6342 6601 2154 92 794 -3672
6405c672L533K316r152K758K132N854N994l432N301M304m671J59J126m151o07
$$ -3672 -139 2177 -6975 -4217 -2085 3769 9763 6331 11632 15936 11265 11424 12550 8399 7792
6390G792j0428m803j868P05J893K464M854j517l515l831P615L260L389m035j051
$$ 7792 -2636 -7439 -9307 -8602 -6709 -4245 609 -908 -4423 -8254 -639 2621 6010 1975 924
6375I24L16l339n485l566Q036O682q291m277M485J293K468Q759k991n167P241
$$ 924 1240 -2099 -7584 -11150 -3114 3568 -4723 -9000 -4515 -3222 -754 8005 5014 -153 7088
6360G088Q424m714K34j125M795M504p461l435N161M592l605n102K34R305N212
$$ 7088 15512 10798 11032 9907 14702 19206 11745 8310 13471 18063 14458 9356 9590 18895 24107
6345B4107L497m756r171O15P344K449o24j0055n822n077q41m316J330r90m003
$$ 24107 27604 22848 13677 14292 21636 24085 23461 13406 7584 2507 1666 -2650 -1320 -2310 -6313
6330f313l467m87M145o15k902J854K812O12K884l018n09j260K585J392p68n06
$$ -6313 -9780 -10267 -6122 -6737 -9639 -7785 -4973 -4361 -1477 -4495 -5004 -6264 -3679 -2287 -3055 -3561
6314c561K032l826j964N715L087q01n664k95Q25k226J399K244k216n337k377R572
$$ -3561 -1529 -5355 -7319 -1604 1483 682 -4982 -5277 -4452 -6678 -5279 -3035 -5251 -10588 -12965 -3393
6298c393L870J359m53k959Q20n353r516l753P686N314j045R3J823L009j735P24
$$ -3393 477 1836 1383 -1576 -756 -6109 -15625 -19378 -11692 -6378 -7423 -7330 -5507 -2498 -4233 -3509
6282c509K415J51l85k333m928O937N630J943l381r153J565P104K009n24k605m147
$$ -3509 -1094 -943 -1328 -3661 -8589 -1652 3978 5921 2540 -6613 -5048 2056 4065 3541 936 -3211
6266c211O94K779l300n519L853J3325J0656R032j2343j3306k358N071N29n289
$$ -3211 -2517 262 -3038 -8557 -4704 8621 19277 28309 15966 2660 302 5373 5902 613
6252F13N85m208M18O298n618n216o76P556j485l64k221L164j707l594k144N738
$$ 613 1198 -3010 -2592 3706 -1912 -7128 -7804 -248 -1733 -2097 -4318 -1154 -2861 -6455 -8599 -2861
6236b861j156K944M646N730k731r534J329L319j546j668j600l579M25m136Q34
$$ -2861 -4017 -1073 3573 9303 6572 -2962 -1633 1686 140 -1528 -3128 -6707 -6282 -10418 -9584
6221i584M742q58J1703J682l660l034l019m390n27L773n22J172k340r033J26L640
$$ -9584 -4842 -5700 6003 7685 4025 991 -2028 -6418 -6945 -3172 -3694 -2522 -4862 -13895 -13769 -10129
6205a0129N648M350J895l501o101m47O965M592l305n351q58l565K365Q171k377
$$ -10129 -4481 -131 1764 -1737 -7838 -8285 -1320 3272 -33 -5384 -6242 -9807 -7442 729 -1648
6190a648J589L02K321J969r580L069K612K481Q19l176K350p12m485J845j493l427
$$ -1648 -59 243 2564 4533 -5047 -1978 634 3115 3934 758 3108 2396 -2089 -244 -1737 -5164
6174e164j80k607J310k593m732m12J149M711N777k353j824K165o32k898j961k734
$$ -5164 -5344 -7951 -6641 -9234 -13966 -14378 -13229 -8518 -2741 -5094 -6918 -4753 -5385 -8283 -10244 -12978
6158a2978N864R06o488R53M462o40k462j659j017O64J0314K632K756j281j878
$$ -12978 -7114 -6208 -12696 -11743 -7281 -7921 -10383 -12042 -13059 -12395 -2081 551 3307 2026 148
6143A48N69L189O642l796q100m335m268J2748L709m094l086J050M124N109q626
$$ 148 717 3906 10548 6752 -1348 -5683 -9951 2797 6506 2412 -674 376 4500 9609 983
6128I83p8n23l229k822J234L092j062o9M441k812q516l33J446o55N2J231p22M43
$$ 983 905 382 -2847 -5669 -4435 -1343 -2405 -2474 1967 -845 -9361 -9694 -8248 -8903 -8851 -7620 -8342 -7899
6110g899n40O063Q121j084o747n083j032L731J281k577L504k962j840k923l580
$$ -7899 -8439 -2376 5745 4661 -2086 -7169 -8201 -4470 -3189 -5766 -2262 -5224 -7064 -9987 -13567
6095a3567j545R132p10J719J475K289J688k068J368j298N076J17j277k869m02
$$ -13567 -15112 -5980 -6690 -4971 -3496 -1207 481 -1587 -219 -1517 3559 3676 2399 -470 -872
6080h72l244j942L31o584L351K602j868R49K783k747j796n88j12P872q74J32O9
$$ -872 -4116 -6058 -5727 -12311 -8960 -6358 -8226 -7277 -4494 -7241 -9037 -9625 -9737 -1865 -2739 -2607 -2538
6063b538l330K871l430L652P56O407l20m607n181o842k384j603R507P789k867
$$ -2538 -5868 -2997 -6427 -2775 -2019 4388 4068 -539 -5720 -12562 -14946 -16549 -7042 747 -2120
6048b120l137k20k45J964J0m832M447M36n051l755q91N021O677j618j930q41o430
$$ -2120 -5257 -5477 -5722 -3758 -3748 -8580 -4133 -3697 -8748 -12503 -13394 -8373 -1696 -3314 -5244 -6085 -12515
6031a2515n236M954M869K951J549n878l652L572L029O874j081n914j021P554R031
$$ -12515 -17751 -12797 -7928 -4977 -3428 -9306 -12958 -9386 -6357 517 -564 -6478 -7499 55 9086
6016I086Q49q166n505o750j627P987J456l300l547P700m124l596K135K091L776
$$ 9086 9935 1769 -3736 -10486 -12113 -4126 -2670 -5970 -9517 -1817 -5941 -9537 -7402 -5311 -1535
6001a535p82j458R853j955L230j161r278K529m472j457m334J456R241j407p292
$$ -1535 -2317 -3775 6078 4123 7353 6192 -3086 -557 -5029 -6486 -10820 -9364 -123 -1530 -8822
5986h822J332N690L545J615L946l996k588L750l012p543J247O463L531L805j514
$$ -8822 -7490 -1800 1745 3360 7306 3310 722 4472 1460 -6083 -4836 1627 5158 8963 7449
5971G449q136l724n063J335J201N167j455n463M59j828J151K025l897L035l33
$$ 7449 -687 -4411 -9474 -8139 -6938 -1771 -3226 -8689 -8230 -10058 -8907 -6882 -10779 -7744 -8077
5956h077Q129Q279j311j1157m552N820k643L99L605J624m162J814J803j78k362
$$ -8077 52 8331 7020 -4137 -8689 -2869 -5512 -5113 -1508 116 -4046 -2232 -429 -607 -2969
5941b969m747k010N47O62M169N471L309j802m474R94m420j949M961M15j554K264
$$ -2969 -7716 -9726 -9179 -8517 -4348 1123 4432 2630 -1844 -850 -5270 -7219 -2258 -1843 -3397 -1133
5925a133k052o678l713J1473N494Q23r14q143j904L217N765J954L260L137k494
$$ -1133 -3185 -9863 -13576 -2103 3391 4214 3300 -4843 -6747 -3530 2235 4189 7449 10586 8092
5910H092n899l111p973L663R252k319m490l093Q54J215P045m21m317K502P15k554
$$ 8092 2193 -918 -8891 -5228 4024 1705 -2785 -5878 -5024 -3809 3236 2815 -1502 1000 1715 -839
5894h39r262R94j461k051m409k926L967K447K832K411J146K873m511p635r65O456
$$ -839 -10101 -9107 -10568 -12619 -17028 -19954 -15987 -13540 -10708 -8297 -7151 -4278 -8789 -16424 -17389 -10933
5878a0933N189K696K695j617n503o823K124O260L960K593n365J246M822k690n802
$$ -10933 -5744 -3048 -353 -1970 -7473 -14296 -12172 -5912 -1952 641 -4724 -3478 1344 -1346 -7148
5863g148k507j812J244O538K954k961l436M179R024j686o114j453J12o11j593
$$ -7148 -9655 -11467 -10223 -3685 -731 -3692 -7128 -2949 6075 4389 -1725 -3178 -3066 -3677 -5270
5848e270k174n405N466J2796N479l275n002m111n557K72J684k69P141P147R92
$$ -5270 -7444 -12849 -7383 5413 10892 7617 2615 -1496 -7053 -6781 -5097 -5366 1775 8922 9914
5833I914o076m057J796m051k037p057l109q95j58K491J300N882N179J797j485
$$ 9914 3838 -219 1577 -2474 -4511 -11568 -14677 -15572 -15730 -13239 -11939 -6057 -878 919 -566
5818e66j087m87P17r535l836J642J362J581O396R650l217m542J686L900l698k435
$$ -566 -1653 -2140 -1423 -10958 -14794 -13152 -11790 -10209 -3813 5837 2620 -1922 -236 3664 -34 -2469
5802b469j79K033L161l226J807k30k874j750K700l77M532k178r337n387K349O060
$$ -2469 -2648 -615 2546 -680 1127 897 -1977 -3727 -1027 -1404 3128 950 -8387 -13774 -11425 -5365
5786e365j350L108L570K905j3844J125M087Q431j999j926J306J997l007N51Q947
$$ -5365 -6715 -3607 -37 2868 -10976 -9851 -5764 2667 668 -1258 48 2045 -962 -411 8536
5771H536K374k845m727q79o484K097l1o070K998K429j48K55K883j704k726K294
$$ 8536 10910 8065 3338 2459 -4025 -1928 -1959 -8029 -5031 -2602 -2750 -2495 388 -1316 -4042 -1748
5755a748k454L639k969L881M826M10N04n093l438M258M29m902q605M61Q587R613
$$ -1748 -4202 -563 -3532 349 5175 5585 6089 996 -2442 1816 2245 -2657 -11262 -10801 -2214 7399
5739G399J820q107n576K338J769k882q856K64P235L838K176k91m133k263N528
$$ 7399 9219 1112 -4464 -2126 -357 -3239 -12095 -11831 -4596 -758 1418 1127 -3006 -5269 259
5724B59n205o167L659J0259j772m308N032l707k634K180r22q21l824q1J184M879
$$ 259 -4946 -11113 -7454 2805 1033 -3275 1757 -1950 -4584 -2404 -3326 -4147 -7971 -8052 -6868 -1989
5708a989O529O970j879j0083n42k173J791q62k935j798k066N823O425j892O87
$$ -1989 4540 11510 9631 -452 -994 -3167 -1376 -2238 -5173 -6971 -9037 -3214 3211 1319 2006
5693B006k366Q41l67l580k382P321O557K508j779p414L574K551L036m948n969
$$ 2006 -360 481 114 -3466 -5848 1473 8030 10538 8759 1345 4919 7470 10506 5558 -411
5678d11j604K474L452L218J44K834q764j0244N469K448J673R1K92J595k971l177
$$ -411 -2015 459 3911 7129 7273 10107 1343 -8901 -3432 -984 689 780 1072 2667 -304 -3481
5662c481R204r88M624L153j977o808J681k830P0K217l257k569J405l275M761o299
$$ -3481 5723 4735 9359 12512 10535 3727 5408 2578 2648 4865 1608 -961 444 -2831 1930 -4369
5646d369k236K218l415m497O722P84O110J077m87L05K597l224m275m812K046j180
$$ -4369 -6605 -4387 -7802 -12299 -5577 -4793 1317 2394 1907 2212 4809 1585 -2690 -7502 -5456 -6636
5630f636j425m632M005O475R97J078k693l869M40L287M760J2492l340p547n733
$$ -6636 -8061 -12693 -8688 -2213 -1216 -138 -2831 -6700 -6260 -2973 1787 14279 10939 3392 -2341
5615b341n754l763M397M549J42K193p845p541R09k988M162M784n76k94K003L672
$$ -2341 -8095 -11858 -7461 -2912 -2770 -577 -8422 -15963 -15054 -18042 -13880 -9096 -9672 -9966 -7963 -4291
5599d291j284N315M222m860p226m168M518N658M137k040r46J16J818l588l031
$$ -4291 -5575 -260 3962 -898 -8124 -12292 -7774 -2116 2021 -19 -965 -849 969 -2619 -5650
5584e650l013J099j644q66n349j217J342M845K612M067m448l79n794r26P006J821
$$ -5650 -8663 -7564 -9208 -10074 -15423 -16640 -15298 -10453 -7841 -3774 -8222 -8601 -14395 -15321 -8315 -6494
5568f494O02j065N416m61L162L679j16k60J399m684k568l105k506N328L324p897
$$ -6494 -5892 -6957 -1541 -2002 1160 4839 4723 4463 5862 1178 -1390 -4495 -7001 -1673 1651 -6246
5552f246m63N334N543M699R19p441M167K756n307j0916o17K930N247L60L496m03
$$ -6246 -6709 -1375 4168 8867 9786 2345 6512 9268 3961 -6955 -7572 -4642 605 965 4461 4058
5536D058n444j640l189q679q786l685K158J1941L523M155O601J802L125n959r975
$$ 4058 -1386 -3026 -6215 -14894 -23680 -27365 -25207 -13266 -9743 -5588 1013 2815 5940 -19 -9994
5521i994M251L286K385l94O061m936m208K845L330r399j471Q018k185m016o465
$$ -9994 -5743 -2457 -72 -466 5595 659 -3549 -704 2626 -6773 -8244 -226 -2411 -6427 -12892
5506a2892k367R150N402J19L89j951l832R65K572P12k412K523P593p97o273j121
$$ -12892 -15259 -6109 -707 -588 -199 -2150 -5982 -5017 -2445 -1733 -4145 -1622 5971 5174 -1099 -2220
5490b220j33K651M174r71r456j1713L48L318L794N45J196K103L606M106K698J372
$$ -2220 -2353 298 4472 3501 -5955 -17668 -17320 -14002 -10208 -9663 -8467 -6364 -2758 1348 4046 5418
5474E418j502j488p578K384P902l18m649J986M379q276n344L402K276j296k328
$$ 5418 3916 2428 -5150 -2766 5136 4818 169 2155 6534 -1742 -7086 -3684 -1408 -2704 -5032
5459e032r57m664Q95M005K568j507K020m915n5O940N640n077k960N86J258k314
$$ -5032 -5989 -10653 -9758 -5753 -3185 -4692 -2672 -7587 -7642 -702 4938 -139 -3099 -2513 -1255 -3569
5443c569n76k716L167L473l24M83q531M50l027m32k642K231N870r62m297k422
$$ -3569 -4145 -6861 -3694 -221 -545 -62 -8593 -8143 -11170 -11602 -14244 -12013 -6143 -7105 -11402 -13824
5427a3824O638o48J472r9n370O347P620k703J25j019n506J756J064J715L234l10
$$ -13824 -7186 -7834 -6362 -6461 -11831 -5484 2136 -567 -442 -1461 -6967 -5211 -4147 -2432 802 492
5411D92L94p94m633j602j189P5j641j984j729J241L034j812k34n07M813k034K136
$$ 492 886 92 -4541 -6143 -7332 -7257 -8898 -10882 -12611 -11370 -8336 -10148 -10382 -10889 -6076 -8110 -5974
5394e974K104l904P98L155j868J716K804L230j253K027j653j87l566j084L99K200
$$ -5974 -3870 -7774 -6976 -3821 -5689 -3973 -1169 2061 808 2835 1182 995 -2571 -3655 -3256 -1056
5378a056K0K927m181l067j578k712j833J981l436j27K540M644k028J447L876M05
$$ -1056 -1036 1891 -2290 -5357 -6935 -9647 -11480 -9499 -12935 -13062 -10522 -5878 -7906 -6459 -2583 -2178
5362b178k470j2958l148M752k414j643m39j502Q589N959l118j687k890N783M065
$$ -2178 -4648 -17606 -20754 -16002 -18416 -20059 -20498 -22000 -13411 -7452 -10570 -12257 -15147 -9364 -5299
5347e299K712P76k557k987L74j411O84M630J498l063Q48n264L905Q10l448n042
$$ -5299 -2587 -1811 -4368 -7355 -6981 -8392 -7708 -3078 -1580 -4643 -3795 -9059 -5154 -4344 -7792 -12834
5331a2834n034L190R663O189J861J217n230k714K673O57J36q72L813K699o698
$$ -12834 -17868 -14678 -5015 1174 3035 4252 -978 -3692 -1019 -362 -226 -1098 2715 5414 -1284
5316a284q723j1539k807O601N395O094q071n924N210M447Q336N367K542m185O69
$$ -1284 -10007 -21546 -24353 -17752 -12357 -6263 -14334 -20258 -15048 -10601 -2265 3102 5644 1459 2128
5301B128O012m841j2541l497J038l248N935R255l76n693k039N300n07L343k091
$$ 2128 8140 3299 -9242 -12739 -11701 -14949 -9014 241 -135 -5828 -7867 -2567 -3074 269 -1822
5286a822n956j305J349m848k36K710P579p72J271K703k737M365j811l758o567
$$ -1822 -7778 -9083 -7734 -12582 -12818 -10108 -2529 -3301 -2030 673 -2064 2301 490 -3268 -9835
5271i835J280Q333r16j162N973m433p939o975O053J982k835N153l517o690k59
$$ -9835 -8555 -222 -1138 -2300 3673 -760 -8699 -15674 -9621 -7639 -10474 -5321 -8838 -15528 -15787
5256a5787N297K085j288M666Q256q075m445j292K68J220K094L140k202j110p83
$$ -15787 -10490 -8405 -9693 -5027 3229 -4846 -9291 -10583 -10315 -9095 -7001 -3861 -6063 -7173 -7956
5241g956J982J76K927L32M926j737k668p56j547K298r2j526o955J260J159K907
$$ -7956 -5974 -5798 -2871 -2539 2387 650 -2018 -2774 -4321 -2023 -2115 -3641 -10596 -9336 -8177 -5270
5225e270l052n912q20N953K693j02L530K19J744n016P206L095p480q496M790M168
$$ -5270 -8322 -14234 -15054 -9101 -6408 -6510 -2980 -2761 -1017 -6033 1173 4268 -3212 -11708 -6918 -2750
5209b750Q6p496Q94M80k751K50o86P49l319q86P28n837M067Q336L339J113j759
$$ -2750 -2664 -10160 -9266 -8786 -11537 -11287 -11973 -11224 -14543 -15429 -14701 -20538 -16471 -8135 -4796 -3683 -5442
5192e442k788O3M848N538J607p438o378l953L389j45j897n719L214J166L626P781
$$ -5442 -8230 -8167 -3319 2219 3826 -3612 -9990 -13943 -10554 -10699 -12596 -18315 -15101 -13935 -10309 -2528
5176b528k625O71O103l55N81k018n938n44J015n00m256m497K4j541R071L03J032
$$ -2528 -5153 -4482 1621 1266 1847 -171 -6109 -6653 -5638 -6138 -10394 -14891 -14867 -16408 -7337 -7034 -6002
5159f002k898p803L542J4n005J628Q619K530p63m027J89N590L925j480Q53J256
$$ -6002 -8900 -16703 -13161 -13147 -18152 -16524 -7905 -5375 -6138 -10165 -9976 -4386 -461 -1941 -1088 168
5143A68K263L197K067l427o151L850j778q620L891l85o388p29L612N373k270l454
$$ 168 2431 5628 7695 4268 -1883 1967 189 -8431 -4540 -4925 -11313 -12042 -8430 -3057 -5327 -8781
5127h781l298j941K299k776N847Q40m935J172Q826M882j764J0091p152j0658k731
$$ -8781 -12079 -14020 -11721 -14497 -8650 -7810 -12745 -11573 -2747 2135 371 10462 3310 -7348 -10079
5112a0079O167R063n468r43j054Q87n859n394Q909k60K158M54k421o09k150r77
$$ -10079 -3912 5151 -317 -1260 -2314 -1427 -7286 -12680 -3771 -4031 -1873 -1419 -3840 -4449 -6599 -7576
5096g576l26J411K712J246k0K239J332J642n84n960r15l410r7j962p06P269Q826
$$ -7576 -7902 -6491 -3779 -2533 -2553 -314 1018 2660 2076 -3884 -4799 -8209 -8306 -10268 -10974 -3705 5121
5079E121P01o01N50n136L203J844m599j0767L207L994j408j739O724j570l268
$$ 5121 5822 5221 5771 635 3838 5682 1083 -9684 -6477 -2483 -3891 -5630 1094 -476 -3744
5064c744m170n335N231M112L777L395K137l289o910o064L407O254J472K091L121
$$ -3744 -7914 -13249 -8018 -3906 -129 3266 5403 2114 -4796 -10860 -7453 -1199 273 2364 5485
5049E485j367J598L507k714n80o6j848k659j329L131j860o27n893L692j746j935
$$ 5485 4118 5716 9223 6509 5929 5863 4015 1356 27 3158 1298 671 -5222 -1530 -3276 -5211
5033e211N772P11o32L083K831j094j507R36K94l958l671J958M101j879j436l378
$$ -5211 561 1272 640 3723 6554 5460 3953 4889 5183 1225 -2446 -488 3613 1734 298 -3080
5017c080J138l248k915k048J859N173Q930M411K628q86n901n755P80m015m220
$$ -3080 -1942 -5190 -8105 -10153 -8294 -3121 5809 10220 12848 11962 6061 306 1086 -2929 -7149
5002g149N759P245k012q21o159J514p227n161p60M918k251M773J0840M215j020
$$ -7149 -1390 5855 3843 3022 -3137 -1623 -8850 -14011 -14771 -9853 -12104 -7331 3509 7724 6704
4987F704l151l153k268K492j044j452M550L823m180Q03k565q337K999N230K217
$$ 6704 3553 400 -1868 624 -420 -1872 2678 6501 2321 3124 559 -7778 -4779 451 2668
4972B668O701q43l284k885p076L043N042l986r540k809P225m784l336n205R85
$$ 2668 9369 8526 5242 2357 -4719 -1676 3366 -620 -10160 -12969 -5744 -10528 -13864 -19069 -18084
4957a8084M816P329j529N54L305N836m360r20R54k588j225M953Q44n939m39N241
$$ -18084 -13268 -5939 -7468 -6914 -3609 2227 -2133 -3053 -2099 -4687 -5912 -959 -115 -6054 -6493 -1252
4941a252k127K01j310Q43J137J151k173o9L915q913j587p30K5J864K996n121k584
$$ -1252 -3379 -3178 -4488 -3645 -2508 -1357 -3530 -3599 316 -8597 -10184 -10914 -10889 -9025 -6029 -11150 -13734
4924a3734J771L657O02l844L006L031L504N828p330n734j479O580k630m757N799
$$ -13734 -11963 -8306 -7704 -11548 -8542 -5511 -2007 3821 -3509 -9243 -10722 -4142 -6772 -11529 -5730
4909e730k234O42K410q61O81K931M697M474J550o527j890M93l694m780o76l73
$$ -5730 -7964 -7322 -4912 -5773 -5092 -2161 2536 7010 8560 2033 143 636 -3058 -7838 -8514 -8887
4893h887O022O690K307j189J007K863M54q114o856K366j725L72j810P025M551
$$ -8887 -2865 3825 6132 4943 5950 8813 9267 1153 -5703 -3337 -5062 -4690 -6500 525 5076
4878E076o407Q94q99J362K524%k654m108K148K203M507N319K013l140r191q072
$$ 5076 -1331 -437 -1336 26 2550 2550 -104 -4212 -2064 139 4646 9965 11978 8838 -353 -8425
4862h425K992j985k754j977P582K670J177M107m253j418l70K266k531o229K313
$$ -8425 -5433 -7418 -10172 -12149 -4567 -1897 -720 3387 -866 -2284 -2654 -388 -2919 -9148 -6835
4847f835M196Q10j146J504j838k512r057K565J903n651N916J916m990J926M709
$$ -6835 -2639 -1829 -2975 -1471 -3309 -5821 -14878 -12313 -10410 -16061 -10145 -8229 -13219 -11293 -6584
4832f584j781l177N084K968k883k932j352N872O641J051j259m100j39k316M560
$$ -6584 -8365 -11542 -6458 -3490 -6373 -9305 -10657 -4785 1856 2907 1648 -2452 -2591 -4907 -347
4817c47L172k404q713M945J1512M364q100j3742k624P520J0243O37p019L180j98
$$ -347 2825 421 -8292 -3347 8165 12529 4429 -9313 -11937 -4417 5826 6463 -556 2624 2426
4802B426m485j398r34j473q58m235J331O594l399l561k84o382p88O885k019J0381
$$ 2426 -2059 -3457 -4391 -5864 -6722 -10957 -9626 -3032 -6431 -9992 -10276 -16658 -17446 -10561 -12580 -2199
4786b199J3340p595m756K756K466n21l154o793q871n78K169J0651L150K950J272
$$ -2199 11141 3546 -1210 1546 4012 3491 337 -6456 -15327 -15905 -13736 -3085 65 3015 4287
4771D287k18K165l229M20j577K383j735o139M680M066r566J951J1434m221K414
$$ 4287 4069 6234 3005 3425 1848 4231 2496 -3643 1037 5103 -4463 -2512 8922 4701 7115
4756G115K359j354M68n509N785j584o926k882n259M786M213J31n796K40L84m598
$$ 7115 9474 8120 8588 3079 8864 7280 354 -2528 -7787 -3001 1212 1343 -4453 -4213 -3829 -8427
4740h427j739k093L773j300j932L651O18N78L099K626j651k213m070k034O257
$$ -8427 -10166 -12259 -8486 -9786 -11718 -8067 -7449 -6871 -3772 -1146 -2797 -5010 -9080 -11114 -4857
4725d857K317L774j315l234l575N206j23K578M673j952j588O5l314k982L378L965
$$ -4857 -2540 1234 -81 -3315 -6890 -1684 -1807 771 5444 3492 1904 1969 -1345 -4327 -949 3016
4709C016j896j516N25k978q359o466M462M135o863j791M269K145J0323K203m84
$$ 3016 1120 -396 129 -2849 -11208 -17674 -13212 -9077 -15940 -17731 -13462 -11317 -994 1209 725
4694G25k954L6o198k950K98j595k550J707L600O014j734j65M412K271l39L717
$$ 725 -2229 -2193 -8391 -11341 -11043 -12638 -15188 -13481 -9881 -3867 -5601 -5766 -1354 917 578 4295
4678D295o889j1752j301N813R750J624m060Q88r685m582k355l09N356P961k628
$$ 4295 -2594 -14346 -15647 -9834 -84 1540 -2520 -1632 -11317 -15899 -18254 -18563 -13207 -5246 -7874
4663g874L308J604p17m583j613J906J06j717k621J381L941J3861N582k144n544
$$ -7874 -4566 -2962 -3679 -8262 -9875 -7969 -7863 -9580 -12201 -10820 -6879 6982 12564 10420 4876
4648D876j3237n161N207J467o452k250J313L589J2101n4m098m094o187J468N893
$$ 4876 -8361 -13522 -8315 -6848 -13300 -15550 -14237 -10648 1453 1399 -2699 -6793 -12980 -11512 -5619
4633e619J964J898O669j518r147m843j678k765N352R174r19q886o816O15P789
$$ -5619 -3655 -1757 4912 3394 -5753 -10596 -12274 -15039 -9687 -513 -1432 -10318 -17134 -16519 -8730
4618h730Q376P39k87R34j845j207j896K537J512K677L193l910p276j690K495M701
$$ -8730 -354 385 98 1032 -813 -2020 -3916 -1379 133 2810 6003 2093 -5183 -6873 -4378 323
4602C23k150m062L241k774n287Q612K568q264L61m501K347Q114Q061l418m323
$$ 323 -1827 -5889 -2648 -5422 -10709 -2097 471 -7793 -7432 -11933 -9586 -1472 6589 3171 -1152
4587a152l149K711Q95o147J663O322j355k720l986J706J1108K767n497o096Q515
$$ -1152 -4301 -1590 -695 -6842 -5179 1143 -212 -2932 -6918 -5212 5896 8663 3166 -2930 5585
4572E585k348l180l287J166j496o1M264L559K367n526n235o00m817O66L566M216
$$ 5585 3237 57 -3230 -2064 -3560 -3621 643 4202 6569 1043 -4192 -4792 -9609 -8943 -5377 -1161
4556a161N055j689r53k68n152P624J395r96N274l030M42L843j092n588n527K434
$$ -1161 3894 2205 1252 984 -4168 3456 4851 3855 9129 6099 6541 10384 9292 3704 -1823 611
4540F11o421j104J515K015K138L637N193l730r409p21P165J612k910N662l939
$$ 611 -5810 -6914 -5399 -3384 -1246 2391 7584 3854 -5555 -6276 889 2501 -409 5253 1314
4525A314l339Q232K774n810j658n20J505k176K2o416m087J238P692J780P416N369
$$ 1314 -2025 6207 8981 3171 1513 993 2498 322 344 -6072 -10159 -8921 -1229 551 7967 13336
4509A3336o350K120R256m236j0093j847j87O845L748o951j616L480j731p11m712
$$ 13336 6986 9106 18362 14126 4033 2186 1999 8844 12592 5641 4025 7505 5774 5063 351
4494C51k785K845L748n919j687P142k716o750k926K931N229n995m493q364J006
$$ 351 -2434 411 4159 -1760 -3447 3695 979 -5771 -8697 -5766 -537 -6532 -11025 -19389 -18383
4479a8383P127O749K038K334K733l683j473j124L830J590k36L147K745o372o108
$$ -18383 -11256 -4507 -2469 -135 2598 -1085 -2558 -3682 148 1738 1502 4649 7394 1022 -5086
4464e086L492M757K728j457m212K641J047q623l08M78k855p693l218l93M755k351
$$ -5086 -1594 3163 5891 4434 222 2863 3910 -4713 -5021 -4543 -7398 -15091 -18309 -18702 -13947 -16298
4448a6298O047Q584J608m474L901n66J506K407k62n39K217o20L298l119l875k164
$$ -16298 -10251 -1667 -59 -4533 -632 -1198 308 2715 2453 1914 4131 3511 6809 3690 -185 -2349
4432b349o81j215L492N192n131p928j297L223j878p51Q874k372j342K406Q017
$$ -2349 -3030 -4245 -753 4439 -692 -8620 -9917 -6694 -8572 -9323 -449 -2821 -4163 -1757 6260
4417F260l466l870l669k985m525n31J0502N538j614n513q77p94O95k663l182J120
$$ 6260 2794 -1076 -4745 -7730 -12255 -12786 -2284 3254 1640 -3873 -4750 -5544 -4849 -7512 -10694 -9574
4401i574J654N940K026J266n539m715m937M113L642L47P14M248J985k317K38j284
$$ -9574 -7920 -1980 46 1312 -4227 -8942 -13879 -9766 -6124 -5777 -5063 -815 1170 -1147 -909 -2193
4385b193J248l319M711M266k838K6p359o31J536k074k900R01k154j995j91R222
$$ -2193 -945 -4264 447 4713 1875 1901 -5458 -6089 -4553 -6627 -9527 -8626 -10780 -12775 -12966 -3744
4369c744j038l090k919j15L726M482p68l73m772k595N292j114P028k602j819Q501
$$ -3744 -4782 -7872 -10791 -10906 -7180 -2698 -3466 -3839 -8611 -11206 -5914 -7028 0 -2602 -4421 4080
4353D080J626l384k975J789M469m740Q046R144j454K82p343m365l590k120J298
$$ 4080 5706 2322 -653 1136 5605 865 8911 18055 16601 16883 9540 5175 1585 -535 763
4338G63L443M016p994k353N558K621l392l520j390l64N16m40j210L23M825k1k641
$$ 763 4206 8222 228 -2125 3433 6054 2662 -858 -2248 -2612 -2096 -2536 -3746 -3423 1402 1381 -1260
4321a260q323k086M100R718M875r406m420Q810J153O49K216N78j069o869O523
$$ -1260 -9583 -11669 -7569 2149 7024 -2382 -6802 2008 3161 3810 6026 6604 5535 -1334 5189
4306E189j223N35p502j4050M007L694L272N290j244k562M334J545j455l188M850
$$ 5189 3966 4501 -3001 -17051 -13044 -9350 -6078 -788 -2032 -4594 -260 1285 -170 -3358 1492
4291A492J251l054j376O674o42l106K765l65M413K900m225o096J220l91k647l077
$$ 1492 2743 -311 -1687 4987 4345 1239 4004 3639 8052 10952 6727 631 1851 1460 -1187 -4264
4275d264K702k766j7k714K350j877J421k640j245N695M912J246m878m893O068
$$ -4264 -1562 -4328 -4345 -7059 -4709 -6586 -5165 -7805 -9050 -3355 1557 2803 -2075 -6968 -900
4260i00J1922j299p860l632p07J145r27j493O282k894m885j359o6J753K835Q849
$$ -900 11022 9723 1863 -1769 -2476 -1331 -2258 -3751 2531 -363 -5248 -6607 -6673 -4920 -2085 6764
4244F764k292k387K436M177p886o692N39m520l043P428K941n54n620L217N730
$$ 6764 4472 2085 4521 8698 812 -5880 -5341 -9861 -12904 -5476 -2535 -3089 -8709 -5492 238
4229B38N984P47n480l701J857j555m577n784l195L303M592k683N549L137j744
$$ 238 6222 6969 1489 -2212 -355 -1910 -6487 -12271 -15466 -12163 -7571 -10254 -4705 -1568 -3312
4214c312o412K620J336K522r67J244L356M960j757l561k454N76j015k702k223
$$ -3312 -9724 -7104 -5768 -3246 -4213 -2969 387 5347 3590 29 -2425 -1849 -2864 -5566 -7789
4199g789J842N86n29j654J063n32l153L981O842Q378J423j0971n563K743O317
$$ -7789 -5947 -5361 -5890 -7544 -6481 -7013 -10166 -6185 657 9035 10458 -513 -6076 -3333 2984
4184B984k206m210m104Q47p56n426L95O291K990l481l48K882K054J870j567k948
$$ 2984 778 -3432 -7536 -6689 -7445 -12871 -12476 -6185 -3195 -6676 -7024 -4142 -2088 -218 -1785 -4733
4168d733L616q97J622q7k213M20N898l499J081K733j642o803m079O61l02N50J367
$$ -4733 -1117 -2014 -392 -479 -2692 -2272 3626 127 1208 3941 2299 -4504 -8583 -7922 -8224 -7674 -6307
4151f307J1359N542J295n13j0378J642J057m391J961l571k45J730N211N568l58
$$ -6307 5052 10594 11889 11376 998 2640 3697 -694 1267 -2304 -2549 -819 4392 9960 9602
4136I602m673m688k705M496J200Q4m764l101J912n19j570l837L405K391J169N00
$$ 9602 4929 241 -2464 2032 3232 3316 -1448 -4549 -2637 -3156 -4726 -8563 -5158 -2767 -1598 -1098
4120a098K267J793L346l759n895l151l49L256J526n017m296K247O825j911k723
$$ -1098 1169 2962 6308 2549 -3346 -6497 -6846 -3590 -2064 -7081 -11377 -9130 -2305 -4216 -6939
4105f939p262J687K348Q0N169J933K81o726q726K023N491K869l692o95L631j47
$$ -6939 -14201 -12514 -10166 -10086 -4917 -2984 -2703 -9429 -18155 -16132 -10641 -7772 -11464 -12159 -8528 -8675
4089h675l46K155j341N477L167j829N130K680k440k667M119j943R49j781m573
$$ -8675 -9021 -6866 -8207 -2730 437 -1392 3738 6418 3978 1311 5430 3487 4436 2655 -1918
4074a918M553N335j800j3440n827K478j762m56N152J201m756L814J619k231n725
$$ -1918 2635 7970 6170 -7270 -13097 -10619 -12381 -12837 -7685 -6484 -11240 -7426 -5807 -8038 -13763
4059a3763o62K219L040r0n293N384O843M491K132K469l787q853K294J0019J385
$$ -13763 -14425 -12206 -9166 -9256 -14549 -9165 -2322 2169 4301 6770 2983 -5870 -3576 6443 7828
4044G828j275k725L437p300l776O0j595L009m45k540q59k762Q883n49l160J266
$$ 7828 6553 3828 7265 -35 -3811 -3751 -5346 -2337 -2782 -5322 -6181 -8943 -60 -609 -3769 -2503
4028b503L946o747m793L482R648L201k098k233n385j296k179J818J132J115M005
$$ -2503 1443 -5304 -10097 -6615 3033 6234 4136 1903 -3482 -4778 -6957 -5139 -4007 -2892 1113
4013A113m751j424R83L433j845n714P88J521n214J50K359N704J97q349n955L815
$$ 1113 -3638 -5062 -4079 -646 -2491 -8205 -7417 -5896 -11110 -10960 -8601 -2897 -2700 -11049 -17004 -13189
3997a3189N683M239k573m354J520j636k735K520L570J050q37o453p71J217J839
$$ -13189 -7506 -3267 -5840 -10194 -8674 -10310 -13045 -10525 -6955 -5905 -6742 -13195 -13966 -12749 -10910
3982a0910M619O613l691k311J954m218m564J298M105K550J3913j055o286R78K354
$$ -10910 -6291 322 -3369 -5680 -3726 -7944 -12508 -11210 -7105 -4555 9358 8303 2017 2995 5349
3967E349n350O0j186q42k017j146N343j584k742P28L045K470k398m141P37n150
$$ 5349 -1 59 -1127 -1969 -3986 -5132 211 -1373 -4115 -3387 -342 2128 -270 -4411 -3674 -8824
3951h824k565L948L389n41j446P233L525K6q874L322P754L08J371k858m024P15
$$ -8824 -11389 -7441 -4052 -4593 -6039 1194 4719 4745 -4129 -807 6947 7255 8626 5768 1744 2459
3935B459p076m493n627m543M464j813j199J860M451K306m119K398P301K907K751
$$ 2459 -4617 -9110 -14737 -19280 -14816 -16629 -17828 -15968 -11517 -9211 -13330 -10932 -3631 -724 2027
3920B027K11o961m790j080j819M224O413l862q766M921M608k868K530O39L472
$$ 2027 2238 -4723 -9513 -10593 -12412 -8188 -1775 -5637 -14403 -9482 -4874 -7742 -5212 -4573 -1101
3905a101l872l616l14k77N72N095J1499m815n89K779M63l110o263p73j705j785
$$ -1101 -4973 -8589 -8903 -9180 -8608 -3513 7986 3171 2582 5361 5824 2714 -3549 -4322 -6027 -7812
3889g812N677o6l246o808P67R87M001N923N196L086K107q364m384L118O254l050
$$ -7812 -2135 -2201 -5447 -12255 -11488 -10501 -6500 -577 4619 7705 9812 1448 -2936 182 6436 3386
3873C386j1258N992m194m493M982M676l40k49L521L514K514n45n892j986K141
$$ 3386 -7872 -1880 -6074 -10567 -5585 -909 -1249 -1498 2023 5537 8051 7506 1614 -372 1769
3858A769L482j415l710J301M181r21m721m552k421M784K177L984k78k775m430
$$ 1769 5251 3836 126 1427 5608 4687 -34 -4586 -7007 -2223 -46 3938 3660 885 -3545
3843c545K916L983n466L123k675j1045k055J136M580N603r64J771L427O809K514
$$ -3545 -629 3354 -2112 1011 -1664 -12709 -14764 -13628 -9048 -3445 -4409 -2638 789 7598 10112
3828A0112m876m904L241M653j12j544k182m456j382J783m049k816N83N172M046
$$ 10112 5236 332 3573 8226 8114 6570 4388 -68 -1450 333 -3716 -6532 -5949 -777 3269
3813C269l52J520L14M070M625o009l821P71L22k725n741n281J267M173N696M989
$$ 3269 2917 4437 4751 8821 13446 7437 3616 4387 4709 1984 -3757 -9038 -7771 -3598 2098 7087
3797G087j260o54Lo557M320J55P79L784k646n804j468M759L402l38J12m416K615
$$ 7087 5827 5173 5176 -1381 2939 3094 3873 7657 5011 -793 -2261 2498 5900 5562 5674 1258 3873
3780C873J791j968L164n805k767R38K146L219m077k255P356N72j450r40q485J699
$$ 3873 5664 3696 6860 1055 -1712 -774 1372 4591 514 -1741 5615 6187 4737 3797 -4688 -2989
3764b989L316K408n73l718l463P137M450k527o933m113k433m734Q379N852l065
$$ -2989 327 2735 2162 -1556 -5019 2118 6568 4041 -2892 -7005 -9438 -14172 -5793 59 -3006
3749c006K690r63l032m747N774k991o801l058O093K115n88K964l192n49J101R29
$$ -3006 -316 -1279 -4311 -9058 -3284 -6275 -13076 -16134 -10041 -7926 -8514 -5550 -8742 -9291 -8190 -7261
3733g261l512l476k16Q91O30P526R406k59k180j6j142j625k058m80k46L966m032
$$ -7261 -10773 -14249 -14465 -13574 -12944 -5418 3988 3729 1549 1533 391 -1234 -3292 -3772 -4018 -52 -4084
3716d084r981j717J726L083L157M839q3J081K816k277k605k618L192l156l009
$$ -4084 -14065 -15782 -14056 -10973 -7816 -2977 -3060 -1979 837 -1440 -4045 -6663 -3471 -6627 -9636
3701i636K52N760k464n574O89R36r01m162j648j016K357L59N889M001m266k202
$$ -9636 -9384 -3624 -6088 -11662 -10973 -10037 -10938 -15100 -16748 -17764 -15407 -15048 -9159 -5158 -9424 -11626
3685a1626k93J596N550j484o67L736l876j590J270m402N6J777P618O001J257n985
$$ -11626 -11919 -10323 -4773 -6257 -6924 -3188 -7064 -8654 -7384 -11786 -11730 -9953 -2335 3666 4923 -1062
3669a062l719R13Q93J255k236j553k995m950j519M944R185N750p077m837J532
$$ -1062 -4781 -3868 -2975 -1720 -3956 -5509 -8504 -13454 -14973 -10029 -844 4906 -2171 -7008 -5476
3654e476N413k868k465L234j196k041n192k728K014O571M214r462n096J114M432
$$ -5476 -63 -2931 -5396 -2162 -3358 -5399 -10591 -13319 -11305 -4734 -520 -9982 -15078 -13964 -9532
3639i532n57K078m805J859K318P815L758q152J477L892Q486K085l298j464L093
$$ -9532 -10089 -8011 -12816 -10957 -8639 -824 2934 -5218 -3741 151 8637 10722 7424 5960 9053
3624I053l542r581O506L863L928q46K534p367j0394M68o93K127q31M522N229k459
$$ 9053 5511 -4070 2436 6299 10227 9381 11915 4548 -5846 -5378 -6071 -3944 -4775 -253 4976 2517
3608B517l562J848L981J441o541K639O454L868q740r57M438j383n875k724k137
$$ 2517 -1045 803 4784 6225 -316 2323 8777 12645 3905 2948 7386 6003 128 -2596 -4733
3593d733M679N520J502j0334k363N639k436m285R622Q54r650l678j836k726J20
$$ -4733 -54 5466 6968 -3366 -5729 -90 -2526 -6811 2811 3665 -5985 -9663 -11499 -14225 -14105
3578a4105j764J779J1024O621L948L07o150l104J023n191l545N613L833R86M07
$$ -14105 -15869 -14090 -3066 3555 7503 7810 1660 -1444 -421 -5612 -9157 -3544 289 1275 1682
3563A682m671m343L409j059k339J159K156K401J1977O496p391r494j12r90N999
$$ 1682 -2989 -7332 -3923 -4982 -7321 -6162 -4006 -1605 10372 16868 9477 -17 -129 -1119 4880
3548D880N425o338n370K368M22K704r83j896J393m704j154M604k185m515j863
$$ 4880 10305 3967 -1403 965 1387 4091 3108 1212 2605 -2099 -3253 1351 -834 -5349 -7212
3533g212K943O90Q043k111M983k528l647L404m420r609l319J29L127N354M475
$$ -7212 -4269 -3579 4464 2353 7336 4808 1161 4565 145 -9464 -12783 -12654 -9527 -4173 302
3518C02j607J953N065k303p363L988K276o69N657k952p500r96j960l549K012K349
$$ 302 -1305 648 5713 3410 -3953 35 2311 1642 7299 4347 -3153 -4149 -6109 -9658 -7646 -5297
3502e297K702L283l87K495l64N980L225N410o397n118m187l967l276N166J505
$$ -5297 -2595 688 301 2796 2432 8412 11637 17047 10650 5532 1345 -2622 -5898 -732 773
3487G73r141r138k279J0403O223J231L652J535N12j0860m189L408M284o54J347
$$ 773 -8368 -17506 -19785 -9382 -3159 -1928 1724 3259 3771 -7089 -11278 -7870 -3586 -4240 -2893
3472b893j928K975P987N50m460l426m624K58N418K049M030j542K599o446l887
$$ -2893 -4821 -1846 6141 6691 2231 -1195 -5819 -5561 -143 1906 5936 4394 6993 547 -3340
3457c340k260M98p33o715m228P713K724K327k78l872J305J3126K519k958M938
$$ -3340 -5600 -5102 -5835 -12550 -16778 -9065 -6341 -4014 -4292 -8164 -6859 6267 8786 5828 10766
3442A0766R45n280n890m665q37j624o93L931O994J395n276j919K226j006j162
$$ 10766 11711 6431 541 -4124 -4961 -6585 -7278 -3347 3647 5042 -234 -2153 73 -933 -2095
3427b095J648l6O737M257m856o686l999M361L925J508L788l39k861J571n506r440
$$ -2095 -447 -483 6254 10511 5655 -1031 -5030 -669 3256 4764 8552 8213 5352 6923 1417 -8023
3411h023J005O366j023L664J153j247p46m776k366j449L308M749n092o56N148
$$ -8023 -7018 -652 -1675 1989 3142 1895 1149 -3627 -5993 -7442 -4134 615 -4477 -5133 15
3396A5K401R99j707o451J174m469r832m84N315O04J692k912P430K811o40J515
$$ 15 2416 3415 1708 -4743 -3569 -8038 -17870 -18354 -13039 -12435 -10743 -13655 -6225 -3414 -4054 -2539
3380b539l912N924J751J726N601K818m538j558L365J331j572n465j6516k842P753
$$ -2539 -6451 -527 1224 2950 8551 11369 6831 5273 8638 9969 8397 2932 -13584 -16426 -8673
3365h673J672j077K440n18M205L752l089L673K639m16l347r00j2j179m09o525
$$ -8673 -7001 -8078 -5638 -6156 -1951 1801 -1288 2385 5024 4608 1261 361 349 -830 -1239 -7764
3349g764O44Q647M996n309n302R17j229o2j993N043n124k4J1197J815l373n057
$$ -7764 -7120 1527 6523 1214 -4088 -3171 -4400 -4462 -6455 -1412 -6536 -6560 4637 6452 3079 -1978
3333a978m32k555M344M932J008k778o73m749j379M999N925j018p854k188K230
$$ -1978 -2410 -4965 -621 4311 5319 2541 1868 -2881 -4260 739 6664 5646 -2208 -4396 -2166
3318b166R635J552k818O28j410o465n402K717J829n067J340l576K008P308M66
$$ -2166 7469 9021 6203 6831 5421 -1044 -6446 -3729 -1900 -6967 -5627 -9203 -7195 113 579
3303E79m634J458k818k571J883L660R345j662m525m756K770L935K03K603M74j645
$$ 579 -4055 -2597 -5415 -7986 -6103 -2443 6902 5240 715 -4041 -1271 2664 2867 5470 5944 4299
3287D299r86m460m360j81J976r284L106j206J314L641j094j756l602N88L273J776
$$ 4299 3313 -1147 -5507 -5688 -3712 -12996 -9890 -11096 -9782 -6141 -7235 -8991 -12593 -12005 -8732 -6956
3271f956J087q78N463M626n846n81q31j648M324K001m995j135L908Q080N740n09
$$ -6956 -5869 -6747 -1284 3342 -2504 -3085 -3916 -5564 -1240 761 -4234 -5369 -1461 6619 12359 11850
3255A1850r220q366o595j816J240L391M228P576K706k414l198L461m255k74l716
$$ 11850 2630 -5736 -12331 -14147 -12907 -9516 -5288 2288 4994 2580 -618 2843 -1412 -1686 -5402
3240e402M941L017j456k21o128K840k875K693L838m300k719O86j718k477L202
$$ -5402 -461 2556 1100 879 -5249 -2409 -5284 -2591 1247 -3053 -5772 -5086 -6804 -9281 -6079
3225f079j72k136M72K961j042m759J380J942K464k438M097M67p46j283K693M44
$$ -6079 -6251 -8387 -7915 -4954 -5996 -10755 -9375 -7433 -4969 -7407 -3310 -2843 -3589 -4872 -2179 -1735
3209a735L886M65K210m134q00K480K415n483J095K733J342p63m77n560j0875j009
$$ -1735 2151 2616 4826 692 -108 2372 4787 -696 399 3132 4474 3711 3234 -2326 -13201 -14210
3193a4210L880K086j065n960K949N789J337L7L040N091n92m141j022Q002M999
$$ -14210 -10330 -8244 -9309 -15269 -12320 -6531 -5194 -5157 -2117 2974 2382 -1759 -2781 5221 10220
3178A0220J578j381n958J247M214L458q103m690l952J820k284m698M290J607O667
$$ 10220 11798 10417 4459 5706 9920 13378 5275 585 -3367 -1547 -3831 -8529 -4239 -2632 4035
3163D035J701K137l338q259n15k439L285P33J556K420J096m734j067K728L361
$$ 4035 5736 7873 4535 -3724 -4239 -6678 -3393 -2660 -1104 1316 2412 -2322 -3389 -661 2700
3148B700k253k616K309m06o839M05Q486L717n592k562L513l161j978J892n229
$$ 2700 447 -2169 140 -266 -7105 -6700 1786 5503 -89 -2651 862 -2299 -4277 -2385 -7614
3133g614P51Q595K323j131k623O656p62m436l871O066N682L622j0190j5470J694
$$ -7614 -6863 1732 4055 2924 301 6957 6195 1759 -2112 3954 9636 13258 3068 -12402 -10708
3118a0708j284P033L417O652Q27L525k144n02m027M605j062n07N939K547n278
$$ -10708 -11992 -4959 -1542 5110 5937 9462 7318 6816 2789 7394 6332 5825 11764 14311 9033
3103I033m157n209M94L89p034j726L150O175l421L934R675k51l805m058r621j662
$$ 9033 4876 -333 161 550 -6484 -8210 -5060 1115 -2306 1628 11303 11052 7247 3189 -6432 -8094
3087h094j926K406O097l188j7J159k78M272J089l356p281J659L059k872K651N915
$$ -8094 -10020 -7614 -1517 -4705 -4722 -3563 -3841 431 1520 -1836 -9117 -7458 -4399 -7271 -4620 1295
3071A295J071j367n609L762K002J689J843k519J50k839k048j566m087r168K953
$$ 1295 2366 999 -4610 -848 1154 2843 4686 2167 2317 -522 -2570 -4136 -8223 -17391 -14438
3056a4438N233L711M768J346r8l830l932Q14J416K060J79J887K61k901j639m728
$$ -14438 -9205 -5494 -726 620 522 -3308 -7240 -6426 -5010 -2950 -2771 -884 -623 -3524 -5163 -9891
3040i891N371k43R46Q13J974m1j999Q658K190k075j662r32Q319K579q509n687
$$ -9891 -4520 -4763 -3817 -3004 -1030 -1071 -3070 5588 7778 5703 4041 3109 11428 14007 5498 -189
3024a89L727O392o894r42j964k524n336M655M305r00k128J06m621K906J030L95
$$ -189 3538 9930 3036 2094 130 -2394 -7730 -3075 1230 330 -1798 -1692 -6313 -3407 -2377 -1982
3008a982K108K91M462n920n547p16J0282M196n1j743J524M877M424q705j662l852
$$ -1982 126 417 4879 -1041 -6588 -7304 2978 7174 7123 5380 6904 11781 16205 7500 5838 1986
2992A986k149P804o055J343N962l358m967j2308j390K362O553q34l253L950Q879
$$ 1986 -163 7641 1586 2929 8891 5533 566 -11742 -13132 -10770 -4217 -5051 -8304 -4354 4525
2977D525M569k209p912k397r96q859o906K12J20N503J3796Q249N964k076o489
$$ 4525 9094 6885 -1027 -3424 -4420 -13279 -20185 -19973 -19853 -14350 -554 7695 13659 11583 5094
2962E094p246l348K240N945M663m324p867K237K448J152o022o167l92J0398O617
$$ 5094 -2152 -5500 -3260 2685 7348 3024 -4843 -2606 -158 994 -5028 -11195 -11587 -1189 5428
2947E428q220j0076J3846N707o230o935K904P045k375l125N624l218k186l503
$$ 5428 -2792 -12868 978 6685 455 -6480 -3576 3469 1094 -2031 3593 375 -1811 -5314
2933e314L823K402o348K188J590M972N100m096n139M52q98K670M310P377k144
$$ -5314 -1491 911 -5437 -3249 -1659 3313 8413 4317 -822 -370 -1268 1402 5712 13089 10945
2918A0945o045n801k563J3403n00q350n838J90M986K079M67J961o578o530M212
$$ 10945 4900 -901 -3464 9939 9439 1089 -4749 -4559 427 2506 2973 4934 -1644 -8174 -3962
2903c962M589L000O644p7p540l595L100n313m107J444K037J588n262n73L922M546
$$ -3962 627 3627 10271 10194 2654 -941 2159 -3154 -7261 -5817 -3780 -2192 -7454 -8027 -4105 441
2887D41p4N368L069l483q450K917N759m461l170J249m180l318K158L626J142K314
$$ 441 367 5735 8804 5321 -3129 -212 5547 1086 -2084 -835 -5015 -8333 -6175 -2549 -1407 907
2871I07J427j464L59j675o157M69N167J747l044L891N90p295o056q202N125J0184
$$ 907 2334 870 1229 -446 -6603 -6134 -967 780 -2264 1627 2217 -5078 -11134 -19336 -14211 -4027
2855d027L680K761k304J356m637j1529K842P763j357l762O741k639j82j379l784
$$ -4027 -347 2414 110 1466 -3171 -14700 -11858 -4095 -5452 -9214 -2473 -5112 -5294 -6673 -10457
2840a0457M620L375M139J07k227j37j568j165k330K70M68M117J004Nj155k3K173
$$ -10457 -5837 -2462 1677 1784 -443 -580 -2148 -3313 -5643 -5373 -4905 -788 216 221 -934 -957 1216
2823A216J161J565J911r973m156j99j330N639M464K650j393m572k78j640k603
$$ 1216 2377 3942 5853 -4120 -8276 -8475 -9805 -4166 298 2948 1555 -3017 -3295 -4935 -7538
2808g538M865R864M372o250l881J931k90o35J420o48l121k180J933n460q402n400
$$ -7538 -2673 7191 11563 5313 1432 3363 3073 2438 3858 3210 89 -2091 -158 -5618 -14020 -19420
2792a9420M907J351M283L514k269l053j512P60R176q15p815N759n57M626N481
$$ -19420 -14513 -13162 -8879 -5365 -7634 -10687 -12199 -11439 -2263 -3078 -10893 -5134 -5691 -1065 4416
2777D416O9l746q9p69j351K83M0j33J909j3011o104P318J725k7M894N258N98j372
$$ 4416 4485 739 650 -119 -1470 -1187 -1147 -1280 629 -12382 -18486 -11168 -9443 -9470 -4576 682 1280 -92
2759i2k558M451K070j73p247k842Q310J54k629L917Q61j648p206m860L402M658
$$ -92 -2650 1801 3871 3698 -3549 -6391 1919 2073 -556 3361 4222 2574 -4632 -9492 -6090 -1432
2743a432Q055O80l364p107m104N663j222J319k412K651R680O869l477m651r993
$$ -1432 6623 7303 3939 -3168 -7272 -1609 -2831 -1512 -3924 -1273 8407 15276 11799 7148 -2845
2728b845m114R69N276M384J0259K290o563j2623q017n553J56l502K858P644K292
$$ -2845 -6959 -5990 -714 3670 13929 16219 9656 -2967 -10984 -16537 -16381 -19883 -17025 -9381 -7089
2713g089J410O575J641r090j314P166J978l447m229n72K230M540L390L069j014
$$ -7089 -5679 896 2537 -6553 -7867 -701 1277 -2170 -6399 -6971 -4741 -201 3189 6258 5244
2698E244q934O408J577L789J811n033n641N505k728K393o222p511J912p70r03
$$ 5244 -3690 2718 4295 8084 9895 4862 -779 4726 1998 4391 -1831 -9342 -7430 -8200 -9103
2683i103J763N794j368j6761R06K860R097N411N150n045m353R43O222N965k827
$$ -9103 -7340 -1546 -2914 -19675 -18769 -15909 -6812 -1401 3749 -1296 -5649 -4706 1516 7481 4654
2668D654k781J525L349k448q553q19M154k346P378P875j566m465j263n275m485
$$ 4654 1873 3398 6747 4299 -4254 -5073 -919 -3265 4113 11988 10422 5957 4694 -581 -5066
2653e066n888M285L5k453k309J146O841J85L01O234l082m186P449l99n951R26
$$ -5066 -10954 -6669 -6634 -9087 -11396 -10250 -3409 -3224 -2923 3311 229 -3957 3492 3093 -2858 -1932
2637a932N333Q54J75N912l074o147J907J044q524n475N276J161L533J1056M783
$$ -1932 3401 4255 4430 10342 7268 1121 3028 4072 -4452 -9927 -4651 -3490 43 11099 15882
2622A5882k470j1599p259J765J722N78L634k75o18M465J661p748L008L79m380
$$ 15882 13412 1813 -5446 -3681 -1959 -1381 2253 1978 1360 5825 7486 -262 2746 3125 -1255
2607a255j598O162K05n62L01J65o358q545m022K547K488J067j575J193o45N664
$$ -1255 -2853 3309 3514 2952 3253 3418 -2940 -11485 -15507 -12960 -10472 -9405 -10980 -9787 -10432 -4768
2591d768o9r578j183M420L612L360M587j07L833J032q044n073l532Q259K881J366
$$ -4768 -4837 -14415 -15598 -11178 -7566 -4206 381 274 4107 5139 -2905 -7978 -11510 -3251 -370 996
2575I96j340k70n29l071J424J205N299P98j140m417k312l04r927l588Q902P176
$$ 996 -344 -614 -1143 -4214 -2790 -1585 3714 4512 3372 -1045 -3357 -3661 -13588 -17176 -8274 -1098
2559a098n525m37k299J395O932M613j801m441K316L674J316j976m300J262J602
$$ -1098 -6623 -7060 -9359 -7964 -1032 3581 1780 -2661 -345 3329 4645 2669 -1631 -369 1233
2544A233n727M239J847K05j481R10L026O31J025K381m817k974j637r4O66j882
$$ 1233 -4494 -255 1592 1797 316 1226 4252 4883 5908 8289 3472 498 -1139 -1233 -567 -2449
2528b449M244P45J172L201k65k372K499M152n963j3l108o898O456l640k221M493
$$ -2449 1795 2540 3712 6913 6648 4276 6775 10927 4964 4951 1843 -5055 1401 -2239 -4460 33
2512C3M538l594Q853m218j576J0335k6j0839j1711L362Q426N606O59m634r322
$$ 33 4571 977 9830 5612 4036 14371 14345 3506 -8205 -4843 3583 9189 9848 5214 -4108
2497d108K416K329L000k46n299l704J0021N601p28q127L72K101k774M929M545
$$ -4108 -1692 637 3637 3391 -1908 -5612 4409 10010 9282 1155 1527 3628 854 5783 10328
2482A0328N353m016k085J14m023n853m54j983j042J502P98K342l035k731k582
$$ 10328 15681 11665 9580 9694 5671 -182 -636 -2619 -3661 -2159 -1361 981 -2054 -4785 -7367
2467g367N385K839k63j320N779J813n028o43k241r105q96L950l365L420J750J861
$$ -7367 -1982 857 594 -726 5053 6866 1838 1195 -1046 -10151 -11047 -7097 -10462 -7042 -5292 -3431
2451c431n680r23N451J0132M54L594k060r384k636m33K364J699k909L897j384
$$ -3431 -9111 -10034 -4583 5549 6003 9597 7537 -1847 -4483 -4916 -2552 -853 -3762 135 -1249
2436a249n505j104L919K198K389k012K116J424m02K30n896k834J182k367j594
$$ -1249 -6754 -7858 -3939 -1741 648 -1364 752 2176 1774 2004 -3892 -6726 -5544 -7911 -9505
2421i505r91L756j691N84N660q91l225l662M587M821L231l039n532P187L248O94
$$ -9505 -10496 -6740 -8431 -7847 -2187 -3078 -6303 -9965 -5378 -557 2674 -365 -5897 1290 4538 5232
2405E232o596k28p89N953k59j793n78j689l07L677m239j727K621L006O372k284
$$ 5232 -1364 -1592 -2381 3572 3313 1520 942 -747 -1054 2623 -1616 -3343 -722 2284 8656 6372
2389F372k867j815l320o190L480O686J270K496N184j277p382j653R84L109L782
$$ 6372 3505 1690 -1630 -7820 -4340 2346 3616 6112 11296 10019 2637 984 1968 5077 8859
2374H859j790l991o521K622N626J496k221n338l596R02N614Q61K308R13K714J05
$$ 8859 7069 3078 -3443 -821 4805 6301 4080 -1258 -4854 -3952 1662 2523 4831 5744 8458 8563
2358H563k098k508L892O889P68n253j1524q23p70l044M957O14r49k107o037j579
$$ 8563 6465 3957 7849 14738 15506 10253 -1271 -2094 -2864 -5908 -951 -337 -1286 -3393 -9430 -11009
2342a1009K878P449Q79J782l36l868J565j525N701N62j740K477l540K602M65j3544
$$ -11009 -8131 -682 197 1979 1643 -2225 -660 -2185 3516 4078 2338 4815 1275 3877 4342 -9202
2326i202m080L529K935M649L66o812k11J378K121j252m016l771o205k22N771P715
$$ -9202 -13282 -9753 -6818 -2169 -1803 -8615 -8826 -7448 -5327 -6579 -10595 -14366 -20571 -20793 -15022 -7307
2310g307M120J13J088L009K752N730m326n796L540j062o415j0029Q263O570K967
$$ -7307 -3187 -3074 -1986 1023 3775 9505 5179 -617 2923 1861 -4554 -14583 -6320 250 3217
2295C217l250M302M550j273l091j079l017R49q86O4P559P176j724q064j421l344
$$ 3217 -33 4269 8819 7546 4455 3376 359 1308 422 486 8045 15221 13497 5433 4012 668
2279F68m031j047J858O903K330l814N0l203m763M130M218M261K083m259m987J800
$$ 668 -3363 -4410 -2552 4351 6681 2867 2917 -286 -5049 -919 3299 7560 9643 5384 397 2197
2263B197M232n677n358R88l205r85J987K200M783M749j42l605k273o661o675J703
$$ 2197 6429 752 -4606 -3618 -6823 -7808 -5821 -3621 1162 5911 5769 2164 -109 -6770 -13445 -11742
2247a1742P821R84L254L621l020M86l385l367O634R567O811n352p119M754l157
$$ -11742 -3921 -2937 317 3938 918 1404 -1981 -5348 1286 10853 17664 12312 5193 9947 6790
2232F790n839o941K014j694L066R774M082m711j637k23m425j398K719L48J91j317
$$ 6790 951 -5990 -3976 -5670 -2604 7170 11252 6541 4904 4681 256 -1142 1577 1925 2116 799
2216G99k877L458M358Q76L090L189j285j907R2l489o518l430n633q64n42j91M575
$$ 799 -2078 1380 5738 6614 9704 12893 11608 9701 9793 6304 -214 -3644 -9277 -10141 -10683 -10874 -6299
2199f299J631M882J684k180j754k79n787l97P948O28L094j907L406P56N017n082
$$ -6299 -4668 214 1898 -282 -2036 -2315 -8102 -8499 -551 77 3171 1264 4670 5426 10443 5361
2183E361p349n179M467O150j257l057Q923M734K155m032J656k192n330n984M849
$$ 5361 -1988 -7167 -2700 3450 2193 -864 8059 12793 14948 10916 12572 10380 5050 -934 3915
2168C915Q550M676k064m869r40m619m848K246R01K898q65J268L878m95J106j407
$$ 3915 12465 17141 15077 10208 9268 4649 -199 2047 2948 5846 4981 6249 10127 9632 10738 9331
2152I331L654m101o514M389J084J063L548m354N713m492k984n102J468Q914Q114
$$ 9331 12985 8884 2370 6759 7843 8906 12454 8100 13813 9321 6337 1235 2703 11617 19731
2137A9731n249n66j981q786o001L059K702j0037l38J663J000L370Q324N437o147
$$ 19731 14482 13916 11935 3149 -2852 207 2909 -7128 -7466 -5803 -4803 -1433 6891 12328 6181
2122F181L18n9n659n575N48Q59M2N461M284K095K25l432l985j199N532K132p878
$$ 6181 6499 6440 781 -4794 -4246 -3387 -3345 2116 6400 8495 8720 5288 1303 104 5636 7768 -110
2105a10p29j392o324q3n360k005J12N209R416L367k687j383P977l440k899J735
$$ -110 -839 -2231 -8555 -8638 -13998 -16003 -15891 -10682 -1266 2101 -586 -1969 6008 2568 -331 1404
2089A404K846m422l354k072n44J652N629L347J121k470K946k223O71j324j769
$$ 1404 4250 -172 -3526 -5598 -6142 -4490 1139 4486 5607 3137 6083 3860 4531 3207 1438
2074A438k802o658P64M777L130m094l841L243L8M516M634o741M736J254k149m169
$$ 1438 -1364 -8022 -7258 -2481 649 -3445 -7286 -4043 -4005 511 5145 -1596 3140 4394 2245 -1924
2058a924o130j973R737K888M230k866m997n520j999O211J985r66J937L154j507
$$ -1924 -8054 -10027 -290 2598 6828 3962 -1035 -6555 -8554 -2343 -358 -1324 613 3767 2260
2043B260J529K842j506l674o89M25o44K069j535l620k634P396L7l064K919N32
$$ 2260 3789 6631 5125 1451 762 1187 543 2612 1077 -2543 -5177 2219 2256 -808 2111 2643
2027B643P052k822l753L157M102J714p1k519j0116q838o549K672R732L760j721
$$ 2643 9695 6873 3120 6277 10379 12093 12022 9503 -613 -9451 -16000 -13328 -3596 164 -1557
2012a557n70M161L497o249N03k103J580N759L777k474n189j308K508j094J910
$$ -1557 -2127 2034 5531 -718 -215 -2318 -738 5021 8798 6324 1135 -173 2335 1241 3151
1997C151k969l899k854K433J305J523L759j801J311j80j915m546l562k238M175
$$ 3151 182 -3717 -6571 -4138 -2833 -1310 2449 648 1959 1779 -136 -4682 -8244 -10482 -6307
1982f307Q101K503k633j628K770L601L956O65p450l175j626M553M169m816l381
$$ -6307 1794 4297 1664 36 2806 6407 10363 11028 3578 403 -1223 3330 7499 2683 -698
1967f98j261p521K62J4250O772q229j2152p81M427N440N584P98m224K815M13K583
$$ -698 -1959 -9480 -9218 5032 11804 3575 -8577 -9358 -4931 509 6093 6891 2667 5482 5895 8478
1951H478k080m368k307l252k917O552m737l758J938N712K602j568PJ222K190n196
$$ 8478 6398 2030 -277 -3529 -6446 106 -4631 -8389 -6451 -739 1863 295 302 1524 3714 -1482
1935a482p004K160L023k976L717N425R34N236r341q379j128M630K391o135J619
$$ -1482 -8486 -6326 -3303 -6279 -2562 2863 3797 9033 -308 -8687 -9815 -5185 -2794 -8929 -7310
1920g310K235K569J085j099j281m532j796m783N35P798R661J0337l850p065m316
$$ -7310 -5075 -2506 -1421 -2520 -3801 -8333 -10129 -14912 -14377 -6579 3082 13419 9569 2504 -1812
1905a812Q50l004m403l878M953N886m43n167k943n45L73M353J542O581m21P29
$$ -1812 -962 -3966 -8369 -12247 -7294 -1408 -1851 -7018 -9961 -10506 -10133 -5780 -4238 2343 1922 2651
1889B651J177n864J489N47J738L551l927R54j854j308O88K348L037k928p038j786
$$ 2651 3828 -2036 -547 0 1738 5289 1362 2316 462 -846 -158 2190 5227 2299 -4739 -6525
1873f525o983M045J0428J4432O533q10j3265p482q26J764R37j180N57P21P60j321
$$ -6525 -13508 -9463 965 15397 21930 21120 7855 373 -453 1311 2248 1068 1625 2346 3106 1785
1857A785m451K429N155L679k510k432M691p002K206N012O234m565q169j720L83
$$ 1785 -2666 -237 4918 8597 6087 3655 8346 1344 3550 8562 14796 10231 2062 342 725
1842G25L203J692k191J927Q09J49j225n801m994M680L323j063R40L547k61m678
$$ 725 3928 5620 3429 5356 6165 6314 5089 -712 -5706 -1026 2297 1234 2174 5721 5460 782
$$ [...]
##END NTUPLES=NMR SPECTRUM
##END=
