##TITLE=Analysis number 321416
Compound Code cc 58102
Book Reference 458/180
Project Code adrs
Chemist Name stevem
##JCAMPDX= 6.0         $$ Bruker NMR JCAMP-DX V2.0
##DATA TYPE= NMR SPECTRUM
##DATA CLASS= NTUPLES
##ORIGIN= Bruker BioSpin GmbH
##OWNER= nmr
$$ XWIN-NMR		Version 3.5
$$ Wed Aug  9 14:47:33 2006 GMT Daylight Time (UT+1h)  MAYBRIDGE\nmr@NMR_250MHZ
##.OBSERVE FREQUENCY= 250.131544655141
##.OBSERVE NUCLEUS= ^1H
##.ACQUISITION MODE= SIMULTANEOUS (DQD)
##.ACQUISITION SCHEME= undefined
##.AVERAGES= 16
##.DIGITISER RES= 18
##SPECTROMETER/DATA SYSTEM= dpx250
##.PULSE SEQUENCE= zg30
##.SOLVENT NAME= CDCl3
##.SHIFT REFERENCE= (INTERNAL, CDCl3, 0, 16.4564)
##AUDIT TRAIL= $$ (NUMBER, WHEN, WHO, WHERE, WHAT)
$$ ##TITLE= Audit trail, XWIN-NMR		Version 3.5
$$ ##JCAMPDX= 5.01
$$ ##ORIGIN= Bruker BioSpin GmbH
$$ ##OWNER= nmr
$$ C:\u/data/dgb/nmr/ADRS/570/pdata/1/auditp.txt
$$ ##AUDIT TRAIL=  $$ (NUMBER, WHEN, WHO, WHERE, WHAT)
(   1,<2006-08-09 14:47:08.77 +100>,<MAYBRIDGE\nmr>,<NMR_250MHZ>,
      <created by zg, POWCHK disabled, PULCHK disabled
       configuration hash MD5:
       E2 DF 36 D8 04 B2 41 60 5A D7 A3 38 5A 4B D0 FE
       data hash MD5: 64K
       9A 8C D6 FA DC 6C 01 1A 54 D3 E8 70 F1 6B 74 CD>)
(   2,<2006-08-09 14:47:23.77 +100>,<MAYBRIDGE\nmr>,<NMR_250MHZ>,
      <Start of raw data processing
       ef LB = 0.3 FT_mod = 6 PKNL = 1 SI = 32K 
       data hash MD5: 32K
       D8 DA 74 A7 75 48 46 B4 44 28 FC 4D 96 72 D4 D3>)
(   3,<2006-08-09 14:47:25.49 +100>,<MAYBRIDGE\nmr>,<NMR_250MHZ>,
      <apk 
       data hash MD5: 32K
       CD 18 04 FF F3 02 79 E0 CE DD AB 89 F5 90 6F B3>)
(   4,<2006-08-09 14:47:26.26 +100>,<MAYBRIDGE\nmr>,<NMR_250MHZ>,
      <abs ABSG = 5 
       data hash MD5: 32K
       DB 3E 7F 78 AB 78 16 00 28 F6 B1 61 E8 77 34 00>)
$$ ##END=
$$ 
$$ hash MD5
$$ 42 4B C4 AA AD 83 00 EE 99 93 78 EB 8A 1A 68 6B
##$RELAX= 
##$RELAX= 
##$RELAX= 
##$RELAX= 
##$RELAX= 
##$RELAX= 
##$RELAX= 
$$ Bruker specific parameters
$$ --------------------------
##$DU= <C:\u>
##$EXPNO= 570
##$NAME= <ADRS>
##$PROCNO= 1
##$TYPE= <nmr>
##$USER= <dgb>
##$AMP= (0..31)
100 100 100 100 100 100 100 100 100 100 100 100 100 100 100 100 100 100 
100 100 100 100 100 100 100 100 100 100 100 100 100 100 
##$AQSEQ= 0
##$AQ_mod= 3
##$AUNM= <au_zg>
##$AUTOPOS= <29 >
##$BF1= 250.13
##$BF2= 250.13
##$BF3= 250.13
##$BF4= 250.13
##$BF5= 500.13
##$BF6= 500.13
##$BF7= 500.13
##$BF8= 500.13
##$BYTORDA= 1
##$CFDGTYP= 0
##$CFRGTYP= 5
##$CHEMSTR= <none>
##$CNST= (0..31)
1 1 145 1 1 1 1 1 1 1 1 1 1 1 1 1 1 1 1 1 1 1 1 1 1 1 1 1 1 1 1 1 
##$CPDPRG= <>
##$CPDPRG1= <>
##$CPDPRG2= <>
##$CPDPRG3= <>
##$CPDPRG4= <mlev>
##$CPDPRG5= <mlev>
##$CPDPRG6= <mlev>
##$CPDPRG7= <mlev>
##$CPDPRG8= <mlev>
##$CPDPRGB= <>
##$CPDPRGT= <>
##$D= (0..31)
0 1 0 0 0 0 0 0 0 0.06 0 0 0 0 0 0 0.0002 0 0 0 0 0 0 0 0 0 0 0 0 0 0 
0 
##$DATE= 1155131227
##$DBL= (0..7)
120 120 120 120 120 120 120 120 
##$DBP= (0..7)
150 150 150 150 150 150 150 150 
##$DBP07= 0
##$DBPNAM0= <>
##$DBPNAM1= <>
$$ [...]
##$SUBNAM7= <"">
##$SUBNAM8= <"">
##$SUBNAM9= <"">
##$SW= 20.6930455092707
##$SWIBOX= (0..15)
0 0 3 0 0 0 0 0 0 0 0 0 0 0 0 0 
##$SW_h= 5175.983436853
##$TD= 65536
##$TD0= 1
##$TE= 295.16
##$TE2= 300
##$TE3= 300
##$TEG= 300
##$TL= (0..7)
0 120 120 120 120 120 120 120 
##$TP= (0..7)
150 150 150 150 150 150 150 150 
##$TP07= 0
##$TPNAME0= <>
##$TPNAME1= <>
##$TPNAME2= <>
##$TPNAME3= <>
##$TPNAME4= <>
##$TPNAME5= <>
##$TPNAME6= <>
##$TPNAME7= <>
##$TPOAL= (0..7)
0.5 0.5 0.5 0.5 0.5 0.5 0.5 0.5 
##$TPOFFS= (0..7)
0 0 0 0 0 0 0 0 
##$TUNHIN= 0
##$TUNHOUT= 0
##$TUNXOUT= 0
##$USERA1= <user>
##$USERA2= <user>
##$USERA3= <user>
##$USERA4= <user>
##$USERA5= <user>
##$V9= 5
##$VALIST= <valist>
##$VCLIST= <CCCCCCCCCCCCCCC>
##$VD= 0
##$VDLIST= <DDDDDDDDDDDDDDD>
##$VPLIST= <PPPPPPPPPPPPPPP>
##$VTLIST= <TTTTTTTTTTTTTTT>
##$WBST= 1024
##$WBSW= 4
##$XGAIN= (0..3)
0 0 0 0 
##$XL= 0
##$YL= 0
##$YMAX_a= 419644
##$YMIN_a= -479740
##$ZGOPTNS= <>
##$ZL1= 120
##$ZL2= 120
##$ZL3= 120
##$ZL4= 120
##$ABSF1= 16.45644
##$ABSF2= -4.236732
##$ABSG= 5
##$ABSL= 3
##$ALPHA= 0
##$AQORDER= 0
##$ASSFAC= 0
##$ASSFACI= 0
##$ASSFACX= 0
##$ASSWID= 0
##$AUNMP= <proc_1d>
##$AZFE= 0.1
##$AZFW= 0.1
##$BCFW= 0
##$BC_mod= 0
##$BYTORDP= 0
##$COROFFS= 0
##$CY= 12.5
##$DATMOD= 1
##$DC= 0
##$DFILT= <>
##$DTYPP= 0
##$F1P= 14.0000005364418
##$F2P= -0.99999901652339
##$FCOR= 0.5
##$FTSIZE= 32768
##$FT_mod= 6
##$GAMMA= 0
##$GB= 0
##$INTBC= 1
##$INTSCL= 1
##$ISEN= 128
##$LB= 0.3
##$LEV0= 0
##$LPBIN= 0
##$MAXI= 10000
##$MC2= 0
##$MEAN= 0
##$ME_mod= 0
##$MI= 0
##$NCOEF= 0
##$NC_proc= -5
##$NLEV= 6
##$NOISF1= 0
##$NOISF2= 0
##$NSP= 0
##$NTH_PI= 0
##$NZP= 0
##$OFFSET= 16.45644
##$PC= 1
##$PHC0= 147.2749
##$PHC1= 18.9016
##$PH_mod= 1
##$PKNL= yes
##$PPARMOD= 0
##$PSCAL= 4
##$PSIGN= 0
##$REVERSE= no
##$SF= 250.130016396563
##$SI= 32768
##$SIGF1= 0
##$SIGF2= 0
##$SINO= 400
##$SIOLD= 32768
##$SREGLST= <1H.CDCl3>
##$SSB= 0
##$STSI= 32768
##$STSR= 0
##$SW_p= 5175.98343685301
##$SYMM= 0
##$S_DEV= 0
##$TDeff= 65536
##$TDoff= 0
##$TI= <Analysis number 999999
Compound Code 99
Book Reference 9
Project Code 9>
##$TILT= no
##$TM1= 0
##$TM2= 0
##$TOPLEV= 0
##$USERP1= <user>
##$USERP2= <user>
##$USERP3= <user>
##$USERP4= <user>
##$USERP5= <user>
##$WDW= 1
##$XDIM= 32768
##$YMAX_p= 488648246
##$YMIN_p= -795441
$$ End of Bruker specific parameters
$$ ---------------------------------
##NTUPLES= NMR SPECTRUM
##VAR_NAME=  FREQUENCY,     SPECTRUM/REAL,   SPECTRUM/IMAG
##SYMBOL=    X,             R,               I
##VAR_TYPE=  INDEPENDENT,   DEPENDENT,       DEPENDENT
##VAR_FORM=  AFFN,          ASDF,            ASDF
##VAR_DIM=   32768,         32768,           32768
##UNITS=     HZ,            ARBITRARY UNITS, ARBITRARY UNITS
##FACTOR=    0.157963299565203, 1,           1
##FIRST=     4116.24960000636, 0,            0
##LAST=      -1059.73383684665, 0,           0
##MIN=       -1059.73383684665, -795441,     0
##MAX=       4116.24960000636, 488648246,    0
$$ Real data points
##PAGE= N=1
##DATA TABLE= (X++(R..R)), XYDATA
$$ [...]
18629a66510K01190K41267J52329K3540j09158j94483j46141j37928j01472r4281
18619c31647r3152O2631m721o8766M8511l425J312K61136N347J68099J64988J02491
18607C12804o190j27991K4254j86810J06057J99715j06117N7043l9854r5397P316
18596A44830j52361j58664j22554J01089J49422j17450q0958o670J29550J02247
18586a1519N4730J2886l06864J78876J52664l5078K21710K618j65221j69543J27387
18575F2646J23983M3640k09540j18301K9571M7841K6901J74119Q4961q4350k00028
18564a8557j78766J62027k5185j21091Q9641n6840J0371L62153k3468l11212K8444
18553h2483P7852N5638K0301k49634j70349J54017J18762O5452k34443o5611K93541
$$ y = [-166510, 34680, 275947, 428276, 451816, 342658, 148175, 2034, -135894, -237366, -331647, -424799, -362168, -366889, -435655, -387144, -390569, -389257, -128121, -122774, 45325, 210313, 312804, 306614, 178623, 202877, 16067, 122124, 321839, 215722, 272765, 232911, 137514, 144830, -7531, -166195, -288749, -187660, -38238, -155688, -236646, -243316, -113766, -11519, 43211, 56097, -250767, -71891, 80773, 45695, 267405, 270023, 104802, -64741, 62646, 186629, 230269, 20729, -97572, -68001, -20160, 6741, 180860, 265821, 181471, -18557, -197323, -35296, -60481, -181572, -91931, -148771, -138400, 223753, 200285, -110927, -82483, -4631, 51007, 71308, -178326, -348675, -194658, -75896, -10444, -244887, -310498, -16957]
18542a6957K1116l7637J47026J00715j74984K5816K07184j48995j38117J35155
18532A20322j91835j61191k28270M5487N78325K09379k19601j82261J49360M4655
18522A64370P5265O7723o0924J22590R3077k70342j4702J21722j68680J50786
18512B80885J07883j10141j60085j26904N1940J02179L079j0879k6052L858l4857
18501H0906j15588J66568J85039j14614j51529q5318q7891K7057K41199L26590
18491D72419j63045l5836l6289k55835J41727J60754l7182M5500N1559k26445
18481A17327n395r1955J45110j44407j63349n6504R3695m443j20632p7963l6877
18470c45393K27933K92754L018k04639K86866J24441k38069Q6510K897J39740
$$ y = [-16957, 4159, -33478, 113548, 214263, 39279, 65095, 272279, 123284, -14833, 120322, -71513, -232704, -460974, -415487, 162838, 372217, 152616, -29645, 119715, 164370, 239635, 307358, 246434, 369024, 462101, 191759, 177057, 298779, 130099, 280885, 388768, 278627, 118542, -8362, 43578, 145757, 148836, 137957, 111905, 115763, 80906, -34682, 131886, 316925, 202311, 50782, -34536, -122427, -95370, 145829, 472419, 309374, 273538, 237249, -18586, 123141, 283895, 246713, 292213, 343772, 117327, 111932, 19977, 165087, 20680, -142669, -199173, -105478, -109921, -230553, -308516, -345393, -117460, 175294, 178312, -26327, 260539, 384980, 146911, 233421, 236318, 376058]
18460C76058j46946o9629k28716r3601J46989K98130j04906m26623J1024L01862
18450F3642K93785j66710l93929j17663K45607l8698k33403j00734l0749J15598
18440c63254L84132J95767k66494k02156J4604O7995M06041N1866k00900j7110
18430G0491O5993J80571l2948l48875J0046m0299J14201J91866n1608j19058K70559
18419C10939j88582k00550J98705L6942o3122K0155K91680J00049o8946l09696
18409A27574j64641Q9844K36974J14317j88782M4512K35764J00175j43818J38948
18399E90867R912j55532k22317k15352M0684K20173J08810k36309r9955K60197
18389C01178R3833q5075m19170l1608L05633J15020j6096o593M5755l10846J23926
$$ y = [376058, 229112, 159483, -69233, -162834, -15845, 282285, 177379, -249244, -238220, 63642, 357427, 190717, -203212, -320875, -75268, -113966, -347369, -448103, -478852, -363254, 20878, 216645, -49849, -252005, -237401, -169406, 236635, 288501, 87601, 70491, 136484, 317055, 284107, -64768, -54722, -95021, 19180, 211046, 159438, 40380, 310939, 122357, -78193, 120512, 157454, 94332, 114487, 406167, 506216, 437270, 127574, -37067, 52777, 289751, 404068, 215286, 259798, 495562, 595737, 451919, 590867, 600779, 445247, 222930, 7578, 48262, 268435, 377245, 140936, 40981, 301178, 395011, 309936, -109234, -140842, 164791, 279811, 263715, 257122, 302877, -7969, 115957]
18378A15957K01250Q0692m88566p5652L63136J89297P230R8200K34078k05659
18368E19963o4699r9047l16348J32669J67893J21602j10479j82746L286j2011
18358A60083J47447j28967Q6342r9585k47497P6124J70481J23113o8826j95652
18348B3063r3177J35847J64217k84528l2824J24227J53873K56083N2921j72966
18338C26736m7233J87574J61361q0194j69577k00975K14535K23815r7328m4760
18328D73954j32241j52171K14466J01268K32685q54k31397K32J87214j0198r9123
18317E83835o0360R2207J20379K38016k04427j75092Q0701r4134m7574J90996
18307G24547L59116R2818k13360n8341j00666l10420j77131J83563K1470J36906
$$ y = [115957, 317207, 397899, -90667, -166319, 196817, 386114, 393344, 491544, 725622, 519963, 455264, 356217, 39869, 172538, 340431, 462033, 351554, 168808, 172094, 160083, 307530, 178563, 264905, 165320, -82177, -6053, 164428, 287541, 218715, 23063, -70114, 65733, 229950, -54578, -87402, 36825, 190698, 446781, 499702, 326736, 279503, 467077, 628438, 548244, 378667, 177692, 392227, 616042, 518714, 473954, 341713, 189542, 404008, 505276, 737961, 737107, 505710, 505942, 693156, 682958, 583835, 523475, 615682, 736061, 974077, 769650, 594558, 675259, 581125, 533551, 724547, 1083663, 1176481, 963121, 904780, 804114, 493694, 316563, 500126, 521596, 658502]
18297F58502J10582J46396j2620j26105j4987q4616K58476K49190j19650j97124
18287H68044j670K5023J39353J42308R6173l58876K2048m4949j0621j08102o5508
18276G03223P485r4153J39668j14483J29759K82932J21091J52116j472K0074J1887
18265A358127J72151k0926j34064q7505k85154n2254J65238J32812o255k85659
18255I56511j79413j73898J11212L9341J06779J94786j63909k02870j02878m198
18245E81463m3401L1643n469L2103O9419M5502K46166k36309j39973K85797O0100
18234I27041M2346J75565j61915j20021J58679J08266K22800L3712M6318K05542
18224A638333M8694l10976j86049M6741K16734l82245l61057K28531J94415N7504
$$ y = [658502, 769084, 915480, 902860, 776755, 761768, 677152, 935628, 1184818, 1065168, 868044, 866374, 891397, 1030750, 1173058, 1269231, 910355, 932403, 887454, 876833, 768731, 703223, 710708, 616555, 756223, 641740, 771499, 1054431, 1175522, 1327638, 1326166, 1346240, 1358127, 1530278, 1509352, 1375288, 1287783, 1002629, 950375, 1115613, 1248425, 1242170, 956511, 777098, 603200, 714412, 753753, 860532, 1055318, 891409, 688539, 585661, 581463, 538062, 569705, 564236, 596339, 665758, 711260, 957426, 721117, 581144, 866941, 927041, 969387, 1144952, 983037, 863016, 1021695, 1129961, 1352761, 1386473, 1432791, 1638333, 1687027, 1376051, 1190002, 1236743, 1453477, 1071232, 710175, 938706, 1133121, 1190625]
18214A190625K2101l03108n1554J41291n7990r8933K4203K02559j05955J24364
18204A087603j9244k13426k1079M3811N666N5905j03658L02349J44394Q532j46934
18193A143919L2191m0580n270k34028k15M16612N7436j85799j80542K2899L05376
18182A331999j52222L3014n5530j27539K5941K95771m0554j58778P4981o9091
18172A157992k56953l3186J59713p3014J11630l4796n9435J36434J56266K39962
18162A504613j39028l2449K45070J84025k9984k66820r3344K34586j34035Q1306
18152A553940Q2330Q7503J22214r2331P657L38185o7760j12641N2094P2608M3997
18141B087796J40676Q9044k99104j19042n0375N1939J28662J40370K86028J57613
$$ y = [1190625, 1212726, 909618, 858064, 999355, 941365, 842432, 866635, 1069194, 963239, 1087603, 1068359, 854933, 833854, 877665, 883331, 939236, 835578, 1137927, 1282321, 1290853, 1143919, 1176110, 1135530, 1130260, 896232, 896017, 1312629, 1370065, 1184266, 1003724, 1026623, 1331999, 1179777, 1212791, 1157261, 1029722, 1055663, 1351434, 1310880, 1152102, 1227083, 1157992, 901039, 867853, 1027566, 954552, 1066182, 1031386, 971951, 1108385, 1264651, 1504613, 1365585, 1333136, 1578206, 1762231, 1732247, 1465427, 1372083, 1606669, 1472634, 1553940, 1636270, 1723773, 1845987, 1753656, 1761313, 2099498, 2031738, 1919097, 1971191, 2043799, 2087796, 2228472, 2317516, 2018412, 1899370, 1848995, 1900934, 2029596, 2169966, 2455994, 2613607]
18131B613607M07176J65306Q3024J64094M90303L21606L68694M02314P04621N82477
18121F303222M83345P43753J093985J326919J295233K023514K647419L224616
18113A9142006M472316O658855J0955243J8773843L3065027N0135900M7172396
18106A90375586K3925388L0344119M7738287j4390607r0579097p0142286l5581122
18099H1690268j9610325j2408331q673883o412875m930638l560735k437161j817091
18091B1839229j497608j056045q02400p07826q43876o89213r09936j034818q15356
18082A3482151m53481l69667n91971n73230n24010n16289k06333m26905j83102
18073I637163j65797m34328m20020j13530j44970j84666m05780o8257p6920p20734
$$ y = [2613607, 3020783, 3186089, 3269113, 3433207, 3923510, 4245116, 4613810, 5016124, 5720745, 6303222, 6786567, 7530320, 8624305, 9951224, 11246457, 13269971, 15917390, 19142006, 23614322, 30273177, 41228420, 60002263, 93067290, 143203190, 190375586, 214300974, 244645093, 292383380, 277992773, 187413676, 117271390, 81690268, 62079943, 49671612, 40997729, 34584854, 29654216, 26093481, 23656320, 21839229, 20341621, 19285576, 18483176, 17775350, 16931474, 16242261, 15332325, 14297507, 13482151, 13028670, 12659003, 12067032, 11493802, 10969792, 10453503, 10247170, 9820265, 9637163, 9471366, 9037038, 8617018, 8503488, 8358518, 8173852, 7768072, 7699815, 7622895, 6902161]
18063F902161k71519j50569r4025p5657j58280m48200n27801r5118l38986q0048
18053D661958M40008p1798k94802k44974j54038k90082k70387Q9577j18714k00249
18043C546499k27100m4011k79175k93757J09841J3470r7414k79912l12694j9699
18033B116048L06496J73922o7462q1443k07293p7161P0601l3277j35851k03960
18023A860620j57915J43179R8450K64006J3088J06410k64697p9131q461o986N8083
18012B026646J7955N354L1370j78259k50712r1974l7979j69787P2581Q4894J46229
18001A656318j72365j89241l23748k09786j49P0226K06386J14695m962j17342
17991A030032j25489m2810j66697j06439j31102k10295k06566k6238K51180q0531
$$ y = [6902161, 6630642, 6480073, 6386048, 6310391, 6152111, 5703911, 5176110, 5080992, 4742006, 4661958, 5101966, 5030168, 4735366, 4490392, 4336354, 4046272, 3775885, 3865462, 3746748, 3546499, 3319399, 3275388, 2996213, 2702456, 2812297, 2825767, 2728353, 2448441, 2135747, 2116048, 2422544, 2596466, 2529004, 2447561, 2240268, 2163107, 2233708, 2200431, 2064580, 1860620, 1702705, 1845884, 1944334, 2208340, 2221428, 2327838, 2063141, 1984010, 1975549, 1968563, 2026646, 2044601, 2049955, 2081325, 1903066, 1652354, 1560380, 1522401, 1352614, 1425195, 1510089, 1656318, 1483953, 1294712, 970964, 761178, 761029, 831255, 1037641, 1152336, 1147374, 1030032, 904543, 861733, 695036, 588597, 457495, 247200, 40634, 14396, 265576, 185045]
17981A85045k38535L01813L13462l2844K36956k2854k42034j34023j9018j31129
17971B16839j22062J3618M63320J88035l27469j26751q7655N5003j33442Q888
17961A48324m811K869l532N1070j74319j3903J78915P1290j07235L5250k38252
17950e4334J17508M9533J4389j56062N1377k2703J4012j82369Q3058M1373R1432
17939D7214K38779o1840l8438O7772M4004j53283j6490Q4189j46842J58250p0541
17928A52774K7539r622q7174l2541j54537k59732K3742J35198J81750K43333J79532
17917D00262j31929j46477k6760K9248j93648M978J24736j31762k43738Q1326
17907b33764J80766J5378O0820J08166J38207j18237j58906p3001J5126m4165
$$ y = [185045, -53490, 248323, 561785, 528941, 765897, 743043, 501009, 366986, 347968, 216839, 94777, 108395, 571715, 759750, 432281, 305530, 217875, 272878, 139436, 148324, 143513, 146382, 142850, 193920, 19601, 5698, 184613, 255903, 148668, 183918, -54334, 63174, 112707, 127096, -28966, 22411, -292, 13720, -168649, -85591, -44218, 47214, 285993, 224153, 185715, 253487, 297491, 144208, 127718, 211907, 65065, 223315, 152774, 180313, 170691, 83517, 50976, -103561, -363293, -339551, -204353, -22603, 220730, 400262, 268333, 121856, 95096, 124344, -69304, -64326, 60410, -71352, -315090, -233764, -52998, -37620, 23200, 131366, 269573, 151336, -7570, -80571, -65445, -109610]
17897a09610j78273l1560p8358J97479q637l7577J20648R4657J59723j28361N8537
17886E8668R4576o5885J19005N4460O4812M3819M6122j88371j43241R4504M0023
17875B18492j20539Q4043O5599m5948J9598r220k79764j1084j82055j33364L7861
17864c56381n7565M6650j00793K20915J64533q2209p8318K77578l8586Q5945J25978
17853B07747k63224j18847J98855J86196r5464k23469p003K284J57845n2471M4028
17842C6477j0678n5280l9807l3384k4102j7917P1788o2339j06803r0385J74413
17831a58017K18180p562l0810j1378P9498j48429N2902J64125j09894J46885J12305
17820C07805j23460j08872p1355J70472j22052k23105M3113k7471O4359j32306
$$ y = [-109610, -287883, -319443, -397801, -200322, -208959, -246536, -125888, -31231, 128492, 131, 58668, 153244, 87359, 206364, 260824, 325636, 369455, 415577, 227206, 83965, 178469, 218492, 97953, 181996, 247595, 201647, 221245, 212025, -67739, -78823, -260878, -394242, -356381, -413946, -367296, -468089, -247174, -82641, -164850, -243168, 34410, -4176, 81769, 207747, -55477, -174324, 24531, 210727, 115263, -108206, -115209, -112925, 44920, -7551, 36477, 25799, -29481, -69288, -102672, -126774, -144691, -72903, -135242, -242045, -332430, -158017, 60163, 52601, 21791, 10413, 89911, -58518, -5616, 158509, 48615, 195500, 307805, 184345, 75473, 4118, 174590, 52538, -170567, -127454, -154925, -90566, -222872]
17810b22872k23982J51870l7877j37790J86918J80361J73642Q0428r8717j92561
17800a40580k08820k1314k7675j7365r6375J21011K32238J89358j21576J5277
17790g5821j51525j21242J07987j02197J68871R9528n986N7531p7034K3011N3803
17779b3074j48568M8246K36643N4395j50664M7889k13946o9876J21909k19411
17769c16457K8564K53957k75603J18702K62767j7951R6285R0291n0919j16213
17759G3423j09975j0958k1683l03324k08782J25918J33966J78583l01848j13451
17749e58131J75781n7695N0862K46648J71420L8693k69735j62063j02512P8134
17739c88598r86q5090M9196N623K37488L35968j6221j89372M1151J05964l3692
$$ y = [-222872, -446854, -294984, -332861, -470651, -283733, -103372, 70270, 150698, 51981, -140580, -349400, -370714, -398389, -415754, -512129, -391118, -158880, 30478, -91098, -75821, -227346, -348588, -240601, -342798, -173927, -74399, -80385, -22854, -99888, -76877, -23074, -171642, -123396, 113247, 167642, 16978, 64867, -149079, -218955, -97046, -316457, -287893, -33936, -309539, -190837, 71930, 53979, 150264, 240555, 189636, 73423, -36552, -47510, -69193, -372517, -581299, -455381, -321415, -142832, -444680, -558131, -382350, -440045, -389183, -142535, 28885, 67578, -202157, -364220, -466732, -388598, -389584, -474674, -425478, -419855, -182367, 153601, 137380, -51992, -10841, 95123, 61431]
17728F1431k666j2163m1368N1883Q2515p6986k57228k02282j20339J92412L14886
17717i905l7522O7896j09912j23831P163q9865J72404N4958j99316k35890J22769
17706c81051L6430k23137r8889J46467J90689l9610L5324m1242j84196n7732J4365
17695f02582L07269J68734k2622o380r062p4038q6375n5291J79562o4843L1351
17684b34277M0523k64727K1362K33848O4066o6784l5584J16120K7690L9670r7113
17673a55206J14950n9400j6382K0473L4923j00534j59436J89843K82084K290j37060
17662A6545l00471p5464O3606q7150J08614K02361M7674q2299j03475j5891O8959
17651a56991P2395K6540J2099p0608p5744L09056J85350j60877l12081j29183
$$ y = [61431, 58765, 46602, 5234, 57117, 139632, 62646, -194582, -396864, -517203, -324791, -9905, -47427, 20469, -89443, -213274, -206111, -295976, -123572, -68614, -267930, -503820, -381051, -344621, -567758, -666647, -520180, -329491, -369101, -333777, -375019, -559215, -616947, -602582, -295313, -126579, -149201, -155581, -164643, -238681, -325056, -380347, -200785, -265628, -234277, -193754, -458481, -437119, -203271, -139205, -205989, -241573, -125453, -97763, -58093, -155206, -40256, -99656, -116038, -95565, -60642, -161176, -320612, -130769, 151315, 153605, 16545, -283926, -359390, -295784, -382934, -274320, -71959, -24285, -106584, -210059, -225950, -156991, -84596, -58056, -45957, -116565, -192309, 116747, 302097, 141220, -170861, -300044]
17641c00044J86844K0579k39292j32070L0740m9243j20550O4300L34889J47149
17631e6698j97236j4936J23812L2403K03300q5703k45384n1959K60020p0168j9365
17620a21914p7880O4569N8538j43644J16914J10011J47998q2012l05600j73647
17610d06667L9066J07669J32529K02073j87809k17488M9527o2218J47437m3783
17600b39664R9482K2796p9542k72520K016J21886K20785K06944N7534L3501q3354
17589H9864R842j78974k15026O6214q5823k1470p7230L338K1592Q4886K3348k99037
17577e78476j22912O8539K50801J32489J42950P7905k20r8905k8649k6841j6353
17566a99672r9511N8446k13231o2358J41089j6117N9465R2800m000L58317J09971
$$ y = [-300044, -113200, -92621, -331913, -463983, -433243, -482486, -603036, -538736, -203847, -56698, -253934, -268870, -145058, -112655, 90645, 4942, -240442, -292401, -32381, -102549, -121914, -199794, -135225, -76687, -220331, -103417, 6594, 154592, 72580, -233020, -406667, -367601, -259932, -127403, 74670, -113139, -330627, -281100, -343318, -195881, -239664, -140182, -117386, -196928, -469448, -467432, -345546, -124761, 82183, 139717, 173218, 89864, 99706, -79268, -294294, -228080, -313903, -335373, -412603, -409265, -387673, -302787, -279439, -578476, -701388, -632849, -382048, -249559, -106609, -28704, -28924, -127829, -156478, -183319, -199672, -299183, -240737, -453968, -516326, -375237, -391354, -331889, -239089, -243089, 115228, 225199]
17555B25199l75650j55728p94M8021q3465K28600Q5023O2091J09353P5484L9873
17544B58007k19852j42930j1145R5307J83833K61159Q6302k28460j33604j81787
17534c3170j45222l0200R8695O9071n9936L1635O5512q0710J795Q7292J28329
17523A33091J51019j61879j97456L0441P8272j4587j01300m5000J24859R7862
17513I5322l6176j12648k27559o2893J38021O0284l8451j7816J25262K22263L4692
17502A80301m1941n6093P2521r283m1374o115J9902n6165m1387p9362l2317J42616
17490E1303K57583R9981j28954j47568k79949Q3384N0134L6628l22284R7806K12227
17479A0291K0272J84503j93204k0973J03895j9245M3342k11558n1899L16093k4461
$$ y = [225199, -150451, -306179, -306973, -258952, -342417, -113817, -28794, 33297, 142650, 218134, 258007, 38155, -104775, -115920, -20613, 163220, 424379, 510681, 282221, 148617, -33170, -178392, -208592, -109897, -40826, -100762, -69127, -3615, -84325, -82530, 4762, 133091, 284110, 122231, -75225, -44784, 33488, 18901, -82399, -127399, -2540, 95322, 59146, -53502, -281061, -343954, -205933, -145649, -184100, -201916, -76654, 145609, 180301, 138360, 82267, 154788, 145505, 104131, 98016, 117918, 61753, 20366, -58996, -91313, 51303, 308886, 408867, 279913, 132345, -147604, -64220, -14086, 22542, -299742, -201936, 10291, 30563, 215066, 21862, 889, 104784, 85539, 128881, -82677, -134576, 181517, 157056]
17468A57056q9436L1391k45031Q427J24836k40301L79k7297J01496J06688m0329
17457a12121J6984O4147R4968o8641r2472K25234J34690l7313R5007Q1230j16891
17446B84822n8865k27325J83388L38596L16835N8180L50724J52723o9860o1088
17436A268130m15099k61336l03565m5321m8363j04090O9888J81848k18619k60287
17426a36814K29474N6859K42629j49274m8065N5725p8007k8314j17894Q6713k1787
17415I1245j41734m6112O8266J67120p3694k89322j40839L06741K17617j1376
17405A47912J2889Q5325l6288j1758l0871j57177j96488K6079J18817l0479j04056
17394a76095O5119J92498J10666r152r4524o3873J3230j22397p4540j34380m1630
$$ y = [157056, 67620, 99011, -146020, -137593, -12757, -253058, -252679, -279976, -178480, -71792, -112121, -95137, -30990, 63978, -4663, -97135, 128099, 262789, 225476, 320483, 401713, 284822, 225957, -1368, 182020, 520616, 837451, 895631, 1246355, 1399078, 1329218, 1268130, 853031, 591695, 288130, 242809, 194446, 90356, 160244, 342092, 123473, -136814, 92660, 149519, 392148, 242874, 194809, 250534, 172527, 144213, 26319, 113032, 91245, -50489, -96601, -28335, 138785, 65091, -224231, -365070, -58329, 159288, 147912, 160801, 246126, 209838, 198080, 167209, 10032, -186456, -160377, -41560, -72039, -176095, -110976, 81522, 192188, 183036, 88512, 24639, 37869, -84528, -159068, -293448, -335078]
17383c35078K6775J17013K62187J96214J42863j11252j30888p3204l14036J8293
17373b01113R0110M690J48487Q409j12403P5344n6766J46126j49092n0843M9380
17362d7671n4922j98409j24549J36180l390j22937J10729K97921J43514P8136
17352B14602K2976j11615j46289O5396j5043o3695J3201p81J33589R6290K28460
17341D37091j20189o123j39963q5684J12305J90302J13173k73144p5641j51617
17331E10k98552j0521K10860l3642j36101k71047L8153O9626q4828M9758m1120
17320e06904j31378J54474J24352J45223Q5958J09201K29356j97056k60458p1981
17310c19213J56360J06113j90516J9039K41200K1483l3908q2500j08888j78518
$$ y = [-335078, -308303, -191290, 70897, 267111, 409974, 298722, 167834, 94630, -219406, -201113, -111003, -106313, 42174, 50583, -61820, 13524, -43242, 102884, -46208, -97051, -47671, -102593, -301002, -425551, -289371, -292761, -415698, -304969, -7048, 136466, 214602, 237578, 125963, -20326, 45070, 30027, -33668, -20467, -21248, 112341, 208631, 437091, 316902, 310779, 170816, 85132, 197437, 387739, 500912, 227768, 152127, 510, -298042, -308563, -97703, -131345, -267446, -538493, -500340, -430714, -515542, -465784, -506904, -638282, -483808, -359456, -214233, -128275, -19074, 210282, 13226, -247232, -319213, -162853, -56740, -247256, -228217, 12983, 34466, 558, -81942, -190830, -369348]
17300c69348l607m1539O2148j36840M8309K91866n6919K1349J19715R3432R2886
17289A21452J01669j25498p8156K480j01143m4900J33973K78427j24058l4818
17279A29428q1787j38697q0194o3062J31721q7926M9064K69020o2106j0613p7470
17268b2622j29759L1601O8525R4932j42689k85184j18353K96029L01428l18135
17258b24227j41862l9370K87997j18035l90745K04294M41399J287k94151j5395
17248b88808K936N8980N9432N9113J87390K37467m2181m78018p0973j4742j86389
17237d75793k20069K44346L07978q795j3724J04932P582R3218j78610j36728l9057
17226c14720l3211n2609M923r0938l5028L1861J67022N8446J06118J93865j4417
$$ y = [-369348, -372955, -414494, -352346, -489186, -440877, -149011, -205930, -184581, -64866, 28566, 121452, 223121, 97623, 19467, 21947, -79196, -124096, 9877, 288304, 164246, 129428, 47641, -91056, -171250, -234312, -102591, -190517, -141453, 127567, 65461, 54848, -22622, -152381, -120780, -52255, 42677, -100012, -385196, -503549, -207520, 93908, -224227, -366089, -405459, -117462, -235497, -626242, -421948, 19451, 20738, -273413, -288808, -285872, -226892, -167460, -108347, 79043, 316510, 274329, -203689, -274662, -289404, -475793, -695862, -451516, -143538, -152333, -166057, -61125, -53543, 39675, -138935, -275663, -314720, -347931, -400540, -395617, -486555, -521583, -489722, -322700, -264254, -158136, 35729, 21312]
17215B1312J95123k26391j90394m1086J53259J54910J21349j21491l38666J23173
17205a48902O7341J49572J63468j38385l86069J3520J30557K23680Q0396j5481
17195A39697O4927K13988K22817r189j23260j20515L2559q4561O5933j81659L0931
17184B51668k3279o5906k60678j20594L5408k0124k1156l7530J18520j20668N3367
17173b10972J59392K329o9391R1816j47329p8432J56357J66145l0857L0069P682
17162G6809O2551j04985J6846J25411J18259j8878j22967l8832J93734P9480J09451
17151D96879r8954l1523k00994j58756m7779J4599J63057m1442M3596o4735j08992
17140c5044O6610j03174r0854J39667O6661p9449r5310J45119P230L6274J28859
$$ y = [21312, 216435, -9956, -200350, -241436, -88177, 66733, 188082, 66591, -272075, -148902, -81561, 68011, 231479, 93094, -292975, -279455, -148898, 74782, 155178, 139697, 204624, 418612, 641429, 632240, 508980, 388465, 421024, 336463, 402396, 220737, 251668, 228389, 162483, -98195, -218789, -183381, -203505, -224661, -262191, -143671, -264339, -210972, -51580, -49251, -118642, -26826, -174155, -252587, -96230, 69915, 39058, 69127, 76809, 139360, 34375, 51221, 176632, 294891, 276013, 153046, 114214, 307948, 387428, 496879, 397925, 366402, 165408, 6652, -41127, -26528, 136529, 95087, 138683, 73948, -35044, 31566, -71608, -162462, -22795, 43866, -35583, -130893, 14226, 21456, 57730, 186589]
17129A86589j084j8040M8617p5584p4570k9933J3466J61764j06415l3726j2117
17118E8967p3707j06780j34006j41966R4092K26058q4979j85594J05438K70444
17108B7967p6127j77578l7914M5081P6434L8135J62098j7342j98690J90921K02016
17097B35001J59839p5839k63512k88979j16419O3632K37256J24180J44208j7618
17087B01749j80433L3083K39883K1789N4012j10255k28943K3172n1113J948r4551
17076h9659J17985J67622n4749j384j07648q6133j88796J06575K38117K50508
17066C52438o5080j46704k62798J4154J50215r0988J50609J13066j92522k14356
17056a91966o8031J25260K54988N5885J17049p2506j09567l18887J4844P0347
$$ y = [186589, 185505, 167465, 216082, 140498, 65928, 35995, 49461, 211225, 104810, 71084, 58967, -14740, -121520, -255526, -397492, -303400, -77342, -162321, -347915, -242477, 27967, -48160, -225738, -263652, -218571, -142137, -104002, 58096, 40754, -157936, 32985, 235001, 394840, 319001, 55489, -233490, -349909, -286277, -49021, 75159, 219367, 201749, 21316, 54399, 294282, 316071, 370083, 259828, 30885, 54057, 2944, 4892, -89659, 28326, 195948, 141199, 139815, 32167, -53966, -242762, -136187, 101930, 352438, 287358, 140654, -122144, -107990, 42225, -48763, 101846, 214912, 22390, -191966, -259997, -134737, 120251, 176136, 293185, 220679, 111112, -207775, -192931, -122584]
17046a22584j25563P1810K68318J50828j08387p6688j74300j07562M940R7629
17036a21559o0979K03675J58455K1775j80950q1299O3872J28041L633o5653m2339
17025B6672O7137L4389j43049n5590J88129L1830r3768n9207M6783N3661j09250
17014a2263l4289J67297J11480J90828P8484j1850j40012j43970j59814r169J08726
17003A45448N5871o1653R7350l39810j61270L05261k38767q422m4021j45675O5793
16992c29895K6864j56418K0256n1821k19708J65641R4349k0323N0703O062J24715
16981b89575K92390N6115k09179j1050J21378J12511j36844k006q1966J22214
16971b6012n8056J11343J1145k5207P1599j43660r4483j12364j56030P3224K21558
$$ y = [-122584, -248147, -176337, 91981, 242809, 134422, 57734, -116566, -224128, -219188, -121559, -182538, 21137, 179592, 201367, 20417, -60882, 2990, 131031, 134664, 69011, 26672, 93809, 128198, -14851, -70441, 117688, 149518, 55750, -3457, 43326, 96987, -12263, -46552, 120745, 232225, 423053, 501537, 489687, 349675, 205705, 45891, 36722, 145448, 201319, 139666, 237016, -102794, -264064, 41197, -197570, -205992, -250013, -395688, -329895, -303031, -459449, -439193, -491014, -710722, -545081, -450732, -471055, -420352, -414290, -289575, 2815, 58930, -150249, -161299, -39921, 72590, -64254, -66260, -148226, -26012, -84068, 27275, 38420, 13213, 84812, -58848, -153331, -265695, -421725, -348501, -126943]
16960a26943M5170m3944k12381Q8639J51002M2904j94422m4538j68701p1607N3097
16949d81724m0011J45263J01068J68095Q9008k48946j0860P9777j04816l5300
16939c38446J76764p2613n7587m6418K26094P4385J37640j8187j16924m5610j04796
16928a85698m3877k84896j3215L15247J30554m1179k97331j62275K08473K59512
16918a14685k61175m4857L18815L270j78821K20566K89046N0936r5510k7826K23340
16907C83099M6730k22451q3277j65374k29537n2297M7381N7212n0869R9805K0702
16896a48876J51233J7500j07069N8751k30960l2690J49707J23090R005q0555Q9938
16885i26n9347j74058K1680M0026j86690Q6146P7044O0942J31174K6469j11719
$$ y = [-126943, -81773, -125717, -338098, -249459, -98457, -55553, -249975, -294513, -463214, -534821, -481724, -521735, -376472, -275404, -107309, -18301, -267247, -278107, -198330, -303146, -338446, -161682, -234295, -291882, -338300, -112206, -37821, 99819, 81632, -35292, -80902, -185698, -229575, -514471, -527686, -212439, -81885, -123064, -420395, -582670, -374197, -114685, -375860, -420717, -101902, -98632, -277453, -56887, 232159, 283095, 187585, 159759, 383099, 429829, 207378, 124101, -41273, -270810, -323107, -275726, -218514, -269383, -169578, -148876, 2357, 19857, -87212, -28461, -259421, -292111, -142404, -19314, -10309, -90864, -926, -60273, -234331, -212651, -172625, -359315, -273169, -196125, -135183, -4009, 22460, -89259]
16874h9259L36922N5643m01828j22200J76055j74585j44902L41073j40291p7669
16864b41041L00459j64128K6358J18975J14807j32193o0271j3255P2686j46123
16854a23726O5477r2290J70659J20532j02389o3462J18899J7197r3950J28018
16844A44965P9306k30494j59909m0800K3667R1086J59629m0374O6356j81073J19567
16833C1926R5917J77136K25834j12041k92669k22661j77448o3005J32120L7513
16823a67378J84444N3319J6582L7658l2548j33816L1516J73031K53598k92730
16813A23676j52818j98586m4791j22737L11452K79822k38677j67441P2360K03788
16803F6048j84815r5973N3298l2341N6074k33692K6436J62943R8180n7608j80294
$$ y = [-89259, 247663, 303306, -98522, -220722, -44667, -219252, -364154, -23081, -163372, -241041, 59418, -104710, -78352, 40623, 155430, 23237, -37034, -50289, 22397, -123726, -58249, -150539, 20120, 140652, 38263, -25199, 93700, 110897, 16947, 144965, 224271, -6223, -166132, -206932, -183265, -92179, 67450, 27076, 93432, -87641, 31926, 127843, 304979, 530813, 418772, 126103, -96558, -274006, -337011, -204891, -167378, 17066, 70385, 86967, 124625, 92077, -41739, -10223, 162808, 416406, 123676, -29142, -227728, -272519, -395256, -83804, 196018, -42659, -210100, -137740, 66048, -118767, -214740, -161442, -193783, -137709, -371401, -344965, -182022, -83842, -141450, -321744]
16792c21744j25595K3635J19299K92113J47496j92420L8444r9918j90460J6610
16782b92540L08452J80763J42946N0503P2356j58946j72582l2614k32269k29119
16772c63050k81937M497J75140r5447J30428k2270J90746K03889J6731j83575
16762b24848O7067j52238o2501j2614l1376o9441J92333R0328j41916Q5849l4863
16751b94220k4724J2850j25669j35405J79306J68062n3223L4684k1906Q4324m4939
16740b20860j46166q1411n2672P416L57832l3183j15696J50498K08678N6488j81900
16729e0976k37746J69583K35096m1754j17340N0789J41131o0638l51635J66637
16719i6853K33861k02139m5755j64304P0570J17259N4007J0038Q9096J37318j08983
$$ y = [-321744, -447339, -423704, -304405, -12292, 135204, -57216, -18772, -118690, -309150, -292540, 15912, 196675, 339621, 390124, 462480, 303534, 130952, 98338, -133931, -363050, -644987, -640490, -465350, -560797, -430369, -452639, -261893, -58004, -41273, -224848, -157781, -310019, -372520, -385134, -416510, -485951, -293618, -203290, -345206, -259357, -294220, -318944, -306094, -431763, -567168, -387862, -219800, -273023, -238339, -260245, -175921, -220860, -367026, -448437, -501109, -493693, -135861, -169044, -284740, -134242, 74436, 130924, -50976, -288722, -119139, 115957, 74203, -43137, 7652, 148783, 88145, -263490, -96853, 137008, -65131, -110886, -275190, -204620, -87361, -33354, -23316, 65780, 203098, 94115]
16708I4115K14732q5790m48425k52083L21292j3820O738J65112J76062q8816j20128
16697c1011r5297j32302J16171Q0451R4417r1147l39831O0928K91432L9445r3814
16686a00558L7021P4237j2971m7044M3627L713q7467j4355j7457k25512r2631
16675d39397K72015R9659K01819n7552k59866j52590J6992l3115k1722K22008
16665a51749K63801K4299k12340M203K7352P168o0640l090R1833o9325k15517
16654b94005K30680q0138p502J03122m0717R2562J53148k3153l68998j73372l0105
16643d38478q6062K9007K20473O750j876J03258L45822o7425k6590j9086q6915
16632b1122q971m9958o6751R453j6764J9799J86701j09646m1160q8157K27847
$$ y = [94115, 308847, 223057, -225368, -477451, -156159, -169979, -163241, 1871, 177933, 89117, -31011, -126308, -258610, -142439, -61988, 32429, -58718, -398549, -337621, -46189, -6744, -100558, -63537, 10700, -2271, -49315, -5688, -1975, -89442, -103797, -121254, -346766, -439397, -167382, -67723, 134096, 76544, -183322, -335912, -318920, -352035, -373757, -151749, 112052, 136351, -75989, -71786, -44434, -37266, -97906, -100996, -9163, -78488, -294005, -63325, -143463, -150965, -47843, -88560, 4002, 157150, 133997, -235001, -408373, -438478, -524540, -495533, -275060, -268310, -270186, -166928, 178894, 111469, 84879, 65793, -21122, -30093, -80051, -146802, -137349, -154113, -134314, 52387, -57259, -98419, -186576, 41271]
16621D1271J96598k64628j67909K04197L1162R80p3597j53131L9012O0836K64138
16610A78929P4196j73654j37673K79159Q705l22187k22833J37222j97809n0218
16600d26163M7991K08602N1711M0594j5699M00235M8398k82454j14659j98619
16590b40063K19585k2726j76000P725q1649Q0378K46116j12318k64403j27465
16580d70820K9943o3583O8524J98953J74229j63398o5759j42223j38554J15504
16570d57184K23998j47597N538J97407J24693J65914k09258k43359p0338p2195
16560d82381J22860K68163J66184K79929l0342n9767p0470j99721j81925M04406
16550B16936J85951j92182l26504j06448m1585K2519j7612j63863M1531K1467
$$ y = [41271, 237869, -26759, -194668, 9529, 40691, 41671, -31926, -185057, -146045, -85209, 178929, 253125, 79471, -58202, 220957, 229662, -92525, -315358, -178136, -375945, -426163, -378172, -169570, -117859, -77265, -92964, 307271, 355669, 73215, -41444, -240063, -20478, -43204, -219204, -211479, -293128, -212750, 33366, -78952, -343355, -470820, -440877, -504460, -435936, -236983, -62754, -226152, -291911, -434134, -572688, -457184, -233186, -380783, -375245, -177838, -53145, 112769, -96489, -339848, -410186, -482381, -359521, -91358, 74826, 354755, 324413, 264646, 194176, -5545, -187470, 216936, 402887, 210705, -115799, -222247, -263832, -241313, -258925, -422788, -381257, -359790]
16540c59790K39182J17305K0763n8403p2681l4910M4707O0663K72943J19544j89674
16529A59649j43495j65707M9297j1096j34114k88104j7724M11905J65477j54247
16519a28159j28067j57294R0898Q7348J44040K04146j20989L5999k80351k10190
16509d62619q5295K71917L13299L10337j03848j21206j08984j42957k79737l0520
16499d39613L0928J49431M7664m1403k08164q473k1652K64908k7550r3148L4214
16488c12858k9141r6356J1819K85257L9559o1867J03025J47486r8468K2833J41631
16477A52920k25896k13838J99744J76456J456r1306k07764O1288l6640j26041
16467c09621l3604O5552m7127P34J05983J24368p3905l6013j90427p1029p264
$$ y = [-359790, -120608, -3303, 17460, -40943, -113624, -148534, -103827, -43164, 229779, 349323, 159649, 16154, -149553, -100256, -111352, -245466, -533570, -551294, -139389, 26088, -128159, -256226, -413520, -322622, -235274, -91234, 112912, -8077, 27922, -252429, -462619, -547914, -275997, 37302, 347639, 243791, 122585, 13601, -129356, -409093, -439613, -408685, -259254, -211590, -252993, -461157, -469630, -491282, -226374, -253924, -347072, -312858, -341999, -438355, -426536, -141279, -101720, -163587, -60562, 86924, -11544, 11289, 152920, -72976, -286814, -87070, 89386, 90842, -464, -208228, -146940, -183580, -309621, -343225, -277673, -324800, -324066, -218083, -93715, -167620, -203633, -394060, -465089, -472353]
16456d72353J50533n6204J23725K50856j2580o1112J78463P5381j44236J29000
16446A61473q9709n1140P8047j04592j65978k23758j30699r8542J95805O5386
16436c63707O9669n0829P3346K26200j3294j92629J139J19237R1527m8965J06337
16425A8031Q8171K5214j20870j99324q5943N6008K18995K1886L17484M1800k12153
16414A69299n0684j14518J73773j17266q063J1930j03737L1303l7663K85062j80998
16403E8438j65050J40897K08192L834j71846j57054K02593K545k50617j99158
16393c27226J0273J55439K5860P0183l356J4224P0705q4381j9083Q8700l3649
16382c2311o4964J00181o7204N0779j59819j93013K21578L71199K70994o4162
$$ y = [-472353, -321820, -378024, -254299, -3443, -16023, -77135, 101328, 176709, 32473, 161473, 71764, 20624, 98671, -5921, -171899, -395657, -526356, -624898, -429093, -363707, -294038, -344867, -271521, -45321, -58615, -251244, -250105, -130868, -39341, -88306, 18031, 106202, 131416, 10546, -188778, -274721, -218713, 282, 22168, 339652, 381452, 169299, 118615, 4097, 177870, 60604, 52541, 64471, -39266, -7963, -45626, 239436, 58438, -106612, 34285, 242477, 246311, 74465, -82589, 120004, 122549, -128068, -327226, -316953, -161514, -135654, -65471, -68827, -54603, 16102, -68279, -87362, 1338, -32311, -97275, 2906, -64298, -13519, -173338, -366351, -144773, 226426, 497420, 433258]
16372D33258p5309j98911j22769j13795J54216K10077J53428J25649k60708m87321
16362a82185K00153J4937n2467n1700r7299O3147K62638p1056k43997J32809J73960
16351A48940J89260p0244k31001J97933j80553r7882P813K09174J9144r8589p0646
16340B3349o5901n6197j22465P3209N5541J5589M8824j23076k4571R235m1068
16329b07531j55942j5812K69937L57086R8520r1049j52862k1374M0142j46154
16319b5039j14546p1333q1406N7031O3539k12310Q9680L90337k722n9250M9372
16308H3353m7353J08713L5506J4948P1782j96118l03599j33101K34736J17604
16298a3529J56091J08341j83347p0634o6121L51183O4292J18764j55496j38125
$$ y = [433258, 357949, 159038, 36269, -77526, 76690, 286767, 440195, 565844, 305136, -182185, 17968, 32905, -19562, -71262, -168561, -105414, 157224, 86168, -157829, -25020, 148940, 338200, 267956, 36955, 234888, 54335, -43547, -35734, 173440, 192584, 93995, 23349, -42552, -98749, -221214, -148005, -92464, -76875, -28051, -151127, -175698, -166463, -207531, -363473, -379285, -109348, 247738, 346258, 255209, 102347, 80973, 121115, -25039, -139585, -210918, -292324, -235293, -171754, -384064, -294384, 95953, 93231, 33981, 83353, 36000, 144713, 180219, 195167, 266949, 70831, -232768, -365869, -131133, -13529, 142562, 250903, 67556, -3078, -69199, 281984, 346276, 465040, 309544, 171419]
16288A71419p5404L4267k98989j67698q127J88563J13509K050l1904k9007R5684
16277e637k29778j80074J04515K63653J25525R6117p477k35717k69078j07064
16267d45015J40026J27377r4663J13874K17091q2009j5470j59465k2949j28697
16257c49900q1188L6925J31287J42275j00780Q7143p9587R6461j37951p8897n4798
16246c89010j13343m7637Q1279J72114L52953j56568k49683J09210J61338J09917
16236C0570J66967M8902j52049J56216N2422j38064N4702R2036j07108m51333
16226b46739l4472K57368m7429k50323l42018J04379K52625J00862M7740K40379
16216H2372K56011k62154j22250J34943p5162r2179j55459n2692P4692m6088L2849
$$ y = [171419, 96015, 130282, -168707, -336405, -344532, -155969, -42460, -40410, -72314, -101321, -5637, -235415, -415489, -310974, -47321, 78204, 174321, 166844, -68873, -337951, -445015, -304989, -177612, -272275, -158401, 58690, -23319, -38789, -198254, -221203, -349900, -431088, -394163, -262876, -120601, -221381, -134238, -213825, -117364, -255315, -334212, -389010, -502353, -549990, -468711, -296597, 56356, -100212, -349895, -240685, -79347, 30570, 197537, 246439, 94390, 250606, 303028, 164964, 219666, 311702, 204594, -246739, -281211, -23843, -71272, -321595, -663613, -559234, -306609, -205747, -158007, 82372, 338383, 76229, -46021, 88922, 13760, -78419, -233878, -286570, -211878, -257966, -225117]
16205b25117j68597k11807P7520K63715L76032J7931N8088J56389j37024k70100
16195f2970l08494j81422L41254J99290j15500j01501n1966m7890K4634R7304
16185b07261J44420L3843L001j3207J17620o7130k09311q9896m7537J09691J33051
16174i2716P8258K1492K1929J38643M3317P4140K1616k74835n49427Q915M35599
16163g3069J27313J13485N5843K51598l133m83121j95684p0738p8552J28419R3644
16152a33995o3972P1227m0221J05220J35637p6081k8712k37417k58950J21558
16142d05706N9508k20498m893J10100J5219K30168K74415O5726P4005L8552j87502
16131D9094p3950j8633k33229J15741P296J76988M4297k62515k90547R0286L92360
$$ y = [-225117, -393714, -605521, -528001, -264286, 111746, 129677, 187765, 344154, 207130, -62970, -371464, -552886, -211632, -12342, -127842, -229343, -281309, -329199, -304565, -207261, -62841, -28998, -25997, -39204, 78416, 11286, -198025, -287921, -335458, -225767, -92716, -14458, 7034, 28963, 167606, 210923, 285063, 306679, 31844, -517583, -508668, -73069, 54244, 167729, 223572, 475170, 472037, -11084, -206768, -277506, -356058, -227639, -133995, -197967, -126740, -166961, -61741, 73896, -2185, -30897, -268314, -527264, -405706, -346198, -566696, -571589, -461489, -446270, -216102, 58313, 124039, 198044, 236596, 49094, -24856, -43489, -276718, -160977, -153681, 23307, 67604, -194911, -485458, -395172, -2812]
16120b812L61679J1478J10470l94529k34711n3868J9014J33412j32285p1201j35403
16109c88756R4468L31865q5426N8986P6407k7262j23787o0295K0299K5604J58719
16098H0822O7182j28593K10879r8253k17037M9559J94884J87725k58448k43066
16088a54346m6089r261k26302J37794J29584K50133k7731j41710j30621k72991
16078d91540K12572l7558N0978Q134q1476K36271J97806J52815l823l12976j86597
16067b55394K27213O0982r3499O7056O0951J62419L0460j18364J17663K9307P3446
16056C62240k09766j78076l501j8528k9023K05763J77550k8794j01490p0093J10011
16045B16293P5405L4445j08494J04528K19467Q1807k05686j82858O053J75726
$$ y = [-2812, 358867, 370345, 480815, 86286, -148425, -202293, -183279, -49867, -182152, -253353, -388756, -294288, 37577, -47849, 11137, 87544, 60282, -63505, -123800, -103501, -77897, 80822, 148004, 19411, 230290, 132037, -85000, -35441, 159443, 347168, 88720, -154346, -200435, -209696, -435998, -298204, -168620, 81513, 53782, -87928, -218549, -491540, -278968, -316526, -265548, -257414, -338890, -102619, 95187, 248002, 244179, -68797, -255394, -28181, 32801, -60698, 6358, 67309, 229728, 260188, 141824, 259487, 288794, 362240, 152474, -25602, -29103, -47631, -76654, 129109, 306659, 277865, 176375, 106282, 216293, 291698, 326143, 217649, 322177, 541644, 623451, 417765, 234907, 240960, 416686]
16035D16686j64763k49671o2310J96566r6443L3724L00579k16285o4682j25481
16025c2080k8490J09740n0170R9441m0668j06616J81109j56152j15678J92906
16015E3342L9050q086l17143J9704J61842J06677R6716p2599l00599P9728K4292
16004a17076J23627l4523M276J80900P3432P9295j07190l72974j15932J30366
15994a55799M5179J40595J01202l01810p0973M6527j42976n7294j5294M04621
15984f022j91616k79106R1809M2190J93094n9860k33007L3727J11522J46592R4767
15973e5910M6009J6721J20446R9855r3223j53193r7319Q5605J29949J56154J92494
15962D47588L3166j11773j98482k92235n8866J330R714J05216o1410k7630J73506
$$ y = [416686, 251923, 2252, -60058, 136508, 40065, 73789, 374368, 158083, 93401, -32080, -60570, 49170, -1000, 98441, 57773, -48843, 132266, -23886, -139564, 53342, 92392, 84306, -232837, -213133, -51291, 55386, 152102, 79503, -221096, -141368, -117076, 6551, -27972, -23696, 157204, 230636, 309931, 202741, -170233, -286165, -155799, -110620, 29975, 131177, -170633, -241606, -195079, -338055, -395349, -410643, -6022, -197638, -476744, -384935, -342745, -149651, -209511, -442518, -408791, -297269, -150677, -55910, -9901, 6820, 127266, 227121, 133898, -19295, -116614, -31009, 98940, 255094, 447588, 480754, 368981, 170499, -121736, -180602, -179272, -169558, -64342, -125752, -153382, 20124]
15951B0124J5569k19776J56177p8257j50059j41865J4783J60661O6484q2751j967
15940b40877K9380R3973J57771j28902r1146J93211J66565R5851j80910j67405
15930g2489j87263p1856J63089K06996j892k07344J9717J13386Q5540j44937J1885
15919h5168R011k7946J73500K27000j95832j51300j24669J80457K6604m9341J06829
15908H9145q5508K8574j222o5032j22050O5742J12540Q892j01791J78660Q4780
15897A92730P9230m21759j02225J3091Q7702K05337J89032p6048j60685l0167
15887b3762J54811j21534l0223k7L5269n9458p1774K480n3072o3600J56515q5217
15875a59592p2056Q6399J42601j92049j9850j19700L2079P8102K81505M4314j03483
$$ y = [20124, 35693, -184083, -27906, -106163, -256222, -398087, -383304, -222643, -156159, -238910, -240877, -211497, -117524, 40247, -88655, -179801, 13410, 179975, 275826, 94916, -72489, -259752, -331608, -168519, 38477, 36585, -170759, -151042, -37656, 47884, -97053, -85168, -76157, -104103, 69397, 296397, 100565, -50735, -175404, 5053, 31657, -17684, 89145, 3637, 32211, 30989, -34043, -156093, -90351, 22189, 31081, -70710, 107950, 192730, 271960, -149799, -252024, -238933, -151231, 54106, 243138, 167090, 6405, -23762, 131049, 9515, -20708, -20735, 14534, -44924, -116698, -114218, -167290, -230890, -74375, -159592, -231648, -145249, -2648, -194697, -214547, -334247, -302168, -224066, 57439, 101753, -1730]
15864a730m1918J38123j04604L4124J05666Q6368o6216k56827j23833J04846K04831
15853G8830r0160j6574q9720j97882n9143M2688p3382O8927K70703J93800L5927
15842A64014P0394m0064o9115J98504l9526k94152k97908j48439R6020Q9088j7869
15831b89053R6438K20999L4943j5597J10537j50721N7846j84412k51603J83J24570
15820b45870P5444M5245j30415p1773M7774J50458O6142J34497j99273K5959J14366
15809A2554k37175k6125J16646J23361q5239q5189R6762K64187j09431j84432
15799a14081p9811j32489J7697L3007J63467k7263n4922J09812N8092N8317j67839
15788a36013J28891J13328L1699O8221q8100r5073j81808P2117J54554j09281
$$ y = [-1730, -43648, 94475, -10129, 23995, 129661, 216029, 149813, -107014, -230847, -126001, 78830, -11330, -27904, -117624, -315506, -374649, -331961, -405343, -336416, -65713, 128087, 164014, 234408, 194344, 125229, 323733, 284207, -9945, -307853, -456292, -360272, -271184, -289053, -192615, 28384, 63327, 47730, 158267, 7546, 65392, -119020, -370623, -370440, -245870, -170426, -125181, -255596, -327369, -279595, -129137, -62995, 71502, -127771, -101812, 12554, -224621, -250746, -134100, -10739, -95978, -181167, -84405, 179782, 70351, -114081, -193892, -326381, -308684, -275677, -112210, -139473, -194395, -84583, -26491, 31826, -136013, -7122, 106206, 137905, 206126, 118026, 22953, -158855, -86738, 67816, -41465]
15778d1465J19490j09642L1579j49645l15131j04363M27019L47660k11764k89360
15768b95622K57985M0868r324j84152j51911j02260J64207p998O8508j09083O1993
15757b66789J13851j36262o7578J44826K87011P0133J9380m8376k01524j33676
15747b19004r7384n4066m1123J42639J19950P8894L0200m8028k72455k7753L7073
15736c51057l9279k03939J03673O0424p1882L2453K4499M4368J76377J23977m3421
15725a43807j73530J82124K01057r5235j59688k19928O959J85871j21288J38408
15715a99057K56500O7450J82384L16544j59167n23944k58179K61048M17891K6339
15705C87809K548p944j65659P7686q7880j19260j5333J06920j35051o1321K29170
$$ y = [-41465, 78025, -31617, -38, -149683, -464814, -569177, -142158, 205502, -6262, -295622, -37637, 3231, -6093, -190245, -342156, -444416, -280209, -288207, -219699, -328782, -266789, -152938, -289200, -356778, -211952, 75059, 145192, 164572, 116196, -85328, -219004, -316388, -370454, -411577, -268938, -148988, -70094, -39894, -87922, -360377, -388130, -351057, -390336, -594275, -490602, -430178, -502060, -469607, -445108, -400740, -224363, -100386, -143807, -317337, -135213, 65844, -29391, -189079, -409007, -402048, -216177, -337465, -199057, 57443, 124893, 307277, 623821, 464654, -59290, -317469, -56421, 361470, 387809, 390357, 382413, 216754, 294440, 206560, 87300, 71967, 178887, 43836, -17485, 211685]
15694B11685j46875l25999j22404q8270J55438J28514J32885J03783J89890P1955
15684C10602j20630j93239o4731K15255j07882L2380j68862J10360j0641j12807
15674a10195l6571j16100j33490l31465O5700L50674K43312J77306j6985j55205
15664f3019J02511J69576R9441j08215k08769k61946K49042Q8677J38782K3274
15654B29354N530o1845l44119l27102j0015J1978J21771L34710l6045J842L5718
15643c8223l10867R6930J35930l40j88073J26503R4808q4074J5510N0661K29505
15632A28270K781j53606j8411J72454M1551j62589j06672Q521J92658Q5305P4948
15621B65210J3844j80400k65927k28635k14520J40427K31189O8308N0742K47430
$$ y = [211685, 64810, -261189, -383593, -471863, -316425, -187911, -55026, 48757, 238647, 310602, 189972, -3267, -67998, 147257, 39375, 71755, -97107, 13253, 2612, -110195, -146766, -262866, -396356, -727821, -662121, -311447, -68135, 109171, 92186, -63019, 39492, 209068, 308509, 200294, -8475, -270421, -21379, 67298, 206080, 229354, 234884, 173039, -171080, -498182, -508197, -496219, -374448, -39738, -75783, -73941, -38223, -349090, -252160, -116230, -116570, -304643, -178140, -83332, -167406, -151896, -101235, 128270, 131051, -22555, -40966, 131488, 173039, 10450, -96222, -87701, 104957, 190262, 265210, 279054, 98654, -167273, -395908, -610428, -470001, -238812, -170504, -119762, 127668]
15611A27668K77568j26555k79460n8194Q7910j6565M9964K2549r8643m2628j00185
15600a56571j93322n993J51978R4896O9559q3804J04940Q9091q6652k03202P6373
15589a42707J44081n8855n6341J32863j78980J26807k622P7451P6478J68894Q77
15578B87946j5007j13869k96569R5977J52470O5594k8098l07700J598r7880j00546
15567c56084L8571J49382J10530J01567j75766K3063L22310j648N3658l17138
15557e1555j10505J88061O4934l28900j56847k2749r7086K91329J01745k1361
15547a42934l8225p4677Q8956L02775K14507m1710m34128j88027j11549k2067
15537d47079J02853J81295J24101K94030l5407l32854Q0787K00702L5141m1936
$$ y = [127668, 405236, 278681, -779, -58973, 28937, 12372, 62336, 84885, -13758, -56386, -156571, -349893, -355886, -203908, -109012, -39453, -123257, -18317, 70774, -15878, -219080, -142707, 1374, -57481, -113822, 19041, -159939, -33132, -35754, 41697, 118175, 287069, 287946, 272939, 159070, -137499, -41522, 110948, 176542, 148444, -159256, -157658, -255538, -356084, -317513, -168131, -57601, 43966, -131800, -108737, 213573, 211925, 265583, -51555, -162060, 26001, 90935, -237965, -394812, -417561, -514647, -223318, -121573, -142934, -181159, -255836, -166880, 135895, 350402, 308692, -125436, -313463, -425012, -447079, -344226, -162931, -38830, 255200, 219793, -113061, -32274, 168428, 203569, 161633]
15527A61633N765j69554j35926n783p4302L141K15242m0602k34823K8594Q4806
15516a61809P8196j04383k5703J60330k7432m6438o5331K28109K76694r2479j5006
15505B04748o9456J4921j9726r635J87611L2402j16985J45718K463n4687k79884
15494C7490j58807L5316N0867J63408J19403j65320j61313k4110j09589j57832
15484c70487j87238J28777J89304K71297N8596j29725k17540p8345P8230K0357
15474b36774J59769J0028k75354j00139K88221O409j58640L7633k7880j60806
15464d57533K72202P5372p0755N0026m1610m4138k703j67760o5950J68577J25947
15453a58325K9131K9054m2486Q3630k72999N1537J48128R6972K5701P7171J13656
$$ y = [161633, 167398, -2156, -138082, -143865, -218167, -215026, 216, -40386, -275209, -246615, -161809, -83613, -187996, -213699, -53369, -80801, -127239, -192570, 35539, 312233, 219754, 204748, 135292, 150213, 130487, 120852, 308463, 340865, 223880, 369598, 372061, 317374, 37490, -121317, -86001, -35134, 128274, 247677, 82357, -78956, -103066, -212655, -370487, -557725, -428948, -239644, 31653, 90249, -39476, -257016, -335361, -257131, -236774, -77005, -66977, -342331, -442470, -154249, -147840, -306480, -268847, -296727, -457533, -185331, -109959, -180714, -130688, -172298, -216436, -219139, -386899, -452849, -284272, -158325, -129194, -100140, -142626, -58996, -331995, -280458, -132330, -35358, -9657, 67514, 181170]
15442A81170j11899j70972K2830p2277m3522k811J63149j16783j08179K17453
15432d1841K51800j76080k93469J56649J45379l55999m1269J84421K03544k07644
15422a74509p7437L7422L35954k43909o9065j43982J74968K92717J16419k77988
15412b9410K6276K15688l4416j00296j11493J79040j917j39228R022K1904j44845
15401a09675o3619J05902k0146O1768m4096m0645J07320j5327j3791J14474j48288
15390f6123k89264P7538K09505K05724j54690j40977o8393L2199K71595J15041
15380A92155N8491Q8061k00600r371J49071J50778k4074o9582l17462q2210J96194
15369A31451M9784o0460q6553l6793O8166k9078J87044R707j32677j63804p3282
$$ y = [181170, 69271, -101701, -78871, -151148, -194670, -197481, -34332, -151115, -259294, -41841, 209959, 33879, -259590, -102941, 42438, -313561, -354830, -170409, 33135, -174509, -251946, -214524, 121430, -122479, -191544, -335526, -160558, 132159, 248578, -29410, -3134, 212554, 178138, 77842, -33651, 145389, 143472, 4244, 13266, 35170, -109675, -173294, -67392, -87538, -25770, -69866, -110511, -3191, -18518, -32309, 82165, -66123, -355387, -277849, -68344, 137380, -17310, -158287, -226680, -194481, 77114, 192155, 250646, 338707, 138107, 128736, 277807, 428585, 404511, 334929, 17467, -64743, 131451, 181235, 120775, 34222, -2571, 65595, 36517, 223561, 233268, 100591, -63213, -136495]
15358a36495j01832j6133O6249n0244n5897O2257m0073J47796O7677M389N4160
15347A854r6885Q216p8428q2364q664J15753K07271j50326j70133J22719J52025
15336B1038R429j36683k76725J07837K03954j00130Q0010K62072l2676J71412
15326C09538p0644j73533L947J73265j29837O0102k37495k67721l1407j26321
15316d90106J68026L76833n496j93194k0217j31977J63485J74301q4357n750Q3237
15305C4785o1139j22550k4446m8479N9025K45261j84502q2335K8006P4316L9177
15294d2881j80237j26511Q6362Q6396K51078L6355K14432N8835j69087j83793
15284C0949K06718q44k68100o2527k6745j527j2368K49067j72223j22081J05408
$$ y = [-136495, -238327, -254460, -188211, -238455, -294352, -232095, -272168, -124372, -56695, -52306, 1854, -95031, -86815, -165243, -247607, -256271, -140518, 66753, -83573, -253706, -130987, 21038, 30467, -106216, -382941, -275104, -71150, -171280, -91270, 170802, 138126, 309538, 238894, 65361, 69308, 242573, 112736, 172838, -64657, -332378, -363785, -490106, -322080, 54753, 49257, -143937, -164154, -296131, -132646, 41655, -42702, -48452, 34785, -26354, -148904, -173350, -221829, -162804, 82457, -102045, -184380, -156374, -82058, -42881, -223118, -349629, -263267, -176871, 74207, 110562, 324994, 383829, 214742, 30949, 237667, 236823, -31277, -93804, -120549, -122076, -134444, 114623, -57600, -179681, -74273]
15273g4273j33040R5373J05201o3477K83930O3758l19156k84164j02144K57798
15263a70194K15809N8861R0247N1498k42875j59269j07429K03463J85508k09366
15253h3747j17370J4195Q3813M8724l4796k98540K13355J92397j6209q8002k71866
15242c58046j02825L56264J66464n6539j40564J65049j11795J5814q3440m1574
15232a91192J22892o097m5347M4484J43928k4911j30719J84837j71307j18318
15222a91750K44051Q3053j03567j55053K4906J90982j14582q0812j11970n8716
15212b73458M4177P9854j01893p1522j51151K02660M97762J22553k02208j39659
15202G115L24202j90107j39451l6474M8592J43156M566J2039M6464j84148k59531
$$ y = [-74273, -207313, -111940, -6739, -70216, 213714, 277472, -41684, -325848, -427992, -170194, 45615, 104476, 194723, 246221, 3346, -155923, -263352, -59889, 125619, -83747, -201117, -186922, -103109, -54385, -89181, -387721, -174366, 18031, 1822, -86180, -358046, -460871, -104607, 61857, 5318, -135246, 29803, -81992, -66178, -149618, -191192, -68300, -74397, -119744, -75260, 68668, 43757, -86962, 97875, -73432, -191750, 52301, 135354, 31787, -123266, -98360, 92622, -21960, -102772, -214742, -273458, -229281, -149427, -251320, -322842, -473993, -271333, 226429, 348982, 146774, 7115, 331317, 141210, 1759, -34715, 13877, 157033, 161599, 173638, 220102, 35954, -223577]
15191b23577m2065P1541L47455R6162J59519j72641j10087R6379j74302j15948
15181f7564K1727J65389n1877j47871m7813k15724j40347K265J63674P1623J25972
15170a20546J15054r9808j8679J55415L24343Q674J6746p7239k4508l915j58892
15159A16645L1809K91773j36746j81111j31528j9522m7644K64709M7696R1092
15149C27173j58893n6807j23130L15088K68312n8386k34123j79081k01746P6291
15139b5302j44325J41085L47408r6954q8240o9261J7327j70300j46004j12830
15129c47396O0166J68150j05242k19459p3752n9287j06635J12344K84279Q5640
15119b01192o9737j44273n2990M6537J57327J8395j9649R767J02515K58297k1982
$$ y = [-223577, -265642, -194101, 153354, 249516, 409035, 236394, 126307, 222686, 48384, -67564, -45837, 119552, 67675, -80196, -128009, -343733, -484080, -481815, -318141, -246518, -120546, -5492, -105300, -123979, 31436, 355779, 364453, 381199, 303960, 279452, 275537, 116645, 148454, 440227, 303481, 122370, -9158, -28680, -76324, 188385, 236081, 327173, 168280, 111473, -11657, 303431, 571743, 513357, 279234, 100153, -101593, -25302, -169627, -28542, 318866, 221912, 133672, 64411, 81738, -88562, -234566, -347396, -287230, -119080, -224322, -443781, -517533, -576820, -683455, -571111, -286832, -201192, -270929, -415202, -468192, -421655, -264328, -245933, -265582, -255815, -153300, 104997, 83015]
15108H3015n0629Q2583Q5553j58492q161K63876j73969j05911l8432j79888N3999
15097a46456J01765J0016k7109k1375j92840j70327J58870J71619J15674J0906
15087A0743j45737r0532K68365J49953j16579j86767J20310O3048k04338j05962
15077b37496M3055k77840J9765m97P19K57860K11886K727M3862j72291J47657
15066C9407K46034J90940k17002k37289O4341K17049p9537r7413J18079R8888
15056C43497K5655M808m6l91466k16025J47313L32812j50424k41194L1596K9963
15045h3511L8230P4118j25821m6059n1944J2487j00715Q1321J43249j31941L7604
15034a52982K18692J07252o8809N2461O6466l3421j00236J27461l7077l1373O1609
$$ y = [83015, 32386, 114969, 200522, 42030, 33869, 297745, 123776, 17865, -20567, -200455, -146456, -44691, -34675, -61784, -83159, -275999, -446326, -287456, -115837, -163, 10743, -134994, -225526, 42839, 192792, 76213, -110554, 9756, 72804, -131534, -237496, -194441, -472281, -452516, -453013, -452294, -194434, 17452, 20179, 64041, -108250, 39407, 285441, 476381, 259379, 22090, 86431, 303480, 223943, 126530, 244609, 343497, 369152, 373960, 373914, -17552, -233577, -86264, 246548, 96124, -145070, -113474, -83511, -45281, 28837, -96984, -143043, -194987, -182500, -283215, -201894, -58645, -190586, -152982, 65710, 172962, 104153, 156614, 223080, 189659, 89423, 216884, 179807, 148434, 210043]
15023B10043k36060k40296P629J66257J11409n6038L10510j9202l0155J08562
15013C32659K72040P2515j342j01170J65773K23573J36284N67891N21295R08022
15003C097540J883758K997765L894521K576969J395711L234952K041047m686304
14995A6435959o077667l327667j816796j238374r29861l23315k98086j25463j29834
14986B168896l15850p0336K02484N2706m30117o2732J73880l52055j99197J982
14976A169661J45185l887L6807k44165l12697l8504j45684r6664J13533j6111
14966F07474l5764O0189r3424j92254j66356l2176j57205J01115J65208J25719
14956C82526N1352k19358o9643J4248j3306L4014p0195P0184j09041N0404j01335
$$ y = [210043, -26017, -266313, -258684, -92427, 18982, -37056, 273454, 254252, 224097, 332659, 604699, 677214, 675872, 574702, 740475, 964048, 1100332, 1668223, 2189518, 3097540, 4981298, 7979063, 11873584, 14450553, 15846264, 19081216, 21122263, 16435959, 10358292, 7030625, 5213829, 3975455, 3045594, 2722279, 2424193, 2298730, 2168896, 1853046, 1782710, 1985194, 2037900, 1607783, 1545051, 1718931, 1366876, 1167679, 1169661, 1314846, 1310959, 1347766, 1103601, 790904, 752400, 606716, 510052, 623585, 607474, 571710, 631899, 538475, 346221, 179865, 147689, -9516, 91599, 256807, 382526, 433878, 214520, 144877, 159125, 145819, 179833, 109638, 179822, 70781, 121185, 19850]
14945A9850m464K16168K20296j05909j51526r3039j32959J34221K50920P456J73131
14934E34145j73018k23244J50703m2261l18942j35249Q5347k17213r0801l4841
14924d65374J53464o4866j76467J21386J03716K80438J68488K32598K02786Q1010
14914F37179J13435O1316j83117j02076j46223k65864r8704l6224r5536P1679
14904d4135p4154j67183K22731L11942k2742k50502J23335P4327J17400K9270
14894C20289k03257J03710n8060j40531j68635O6563L25124K05231k84286j75381
14884i233K49604P8072o5932q8990l9699l33014j80507R5633J20509J03967J18088
14873D8498J19669J03713m9429k84539m7466J06196N9275P0994q6647j62201k2985
$$ y = [19850, 15386, 231554, 451850, 345941, 194415, 101376, -31583, 102638, 353558, 361014, 534145, 361127, 137883, 288586, 246325, -72617, -207866, -122519, -339732, -430533, -465374, -311910, -376776, -553243, -431857, -328141, -47703, 120785, 353383, 556169, 637179, 750614, 811930, 628813, 526737, 380514, 114650, 15946, -20278, -115814, -44135, -118289, -285472, -62741, 249201, 226459, -24043, 99292, 173619, 291019, 320289, 117032, 220742, 162682, 22151, -146484, -79921, 245203, 450434, 166148, -9233, 240371, 318443, 252511, 163521, 123822, -209192, -389699, -294066, -173557, -69590, 48498, 168167, 271880, 222451, -62088, -109554, -3358, 55917, 126911, 40264, -121937, -144922]
14862a44922O9665o3096J6852K40916j50645k51036j4340J31111l8467Q0284j01744
14851b25422o1111p0654J42716J61932M9888J50519m0997J90815j45789j77260
14841b5363n9440p656R9466m6497l22763o7780J24015J20799M8057j13287R5382
14830a55067n7671J96309j20581j69331K41786j45298k41353J18638j0895j37026
14820d80489J07757J90636J3648M7847K85265j322L13006p2339k37215j23156
14810D3638O1938l2427l95556J6107K0460J88556J59816J14544J5877j81715j88617
14799a77379j24650K36702J58344m2802P5173J21698p7398k4361j22878m3430
14789b0981l5751j76568L11384K43816r6298j76954j57519j7489R3101l7261J99909
$$ y = [-144922, -75257, -138353, -121501, 119415, -31230, -282266, -296606, -165495, -203962, -123678, -225422, -286533, -357187, -214471, -52539, -2651, 147868, 106871, 297686, 151897, -25363, -84803, -92459, 7007, -39490, -362253, -430033, -306018, -185219, -137162, -250449, -155067, -212738, -16429, -137010, -306341, -64555, -209853, -451206, -332568, -343463, -480489, -372732, -182096, -168448, -120601, 164664, 163342, 476348, 404009, 166794, 43638, 105576, 73149, -322407, -306300, -285840, -97284, 62532, 177076, 192953, 11238, -177379, -302029, -65327, 93017, 50215, 125388, 247086, 169688, 145327, 22449, -20981, -56732, -233300, 78084, 321900, 225602, 48648, -108871, -126360, -33259, -70520, 129389]
14778A29389j74053k48757J20017K37126J32499L18331j47945m5686k20456j91105
14768i0640R4692r6109j64138K0014j0581j71797r7031N4457K78414p850k80366
14757d70935j2410Q2817R0276K64196J5401l2291k2646j35251J37246K09727k4184
14746A01946j64310j24533L13406J454k05714r5782M1230Q5526J91287J90263
14736C34773k5266n3731k2805m7096K66425J42719k64439l13652j56454m1574
14726a81100Q8711J35553K1695k81843O0620j28580j03798L40472K03867j97411
14716d1814l54330o4389L19949j6703K03243N5867l0768j5041N8927k4360j67775
14705g7194p9772N0558K5394R3526r3319j33668J47734J22437J95272M7459r1839
$$ y = [129389, -44664, -293421, -173404, 63722, 196221, 514552, 366607, 320921, 100465, -90640, 4052, -92057, -256195, -236181, -246762, -418559, -515590, -461133, -182719, -190569, -470935, -483345, -400528, -310252, -46056, -30655, -62946, -85592, -220843, -83597, 126130, 101946, -62364, -186897, 126509, 127963, -77751, -173533, -132303, -46777, 144510, 334773, 309507, 255776, 232971, 185875, 452300, 595019, 330580, 16928, -139526, -181100, -92389, 43164, 64859, -216984, -156364, -284944, -388742, -48270, 155597, -41814, -396144, -460533, -140584, -157287, 45956, 101823, 71055, 56014, 114941, 90581, -77194, -156966, -106408, -81014, 12512, -80807, -214475, -66741, 55696, 250968, 298427, 206588]
14694B06588J29542p6308k70251O3294J15644k08835Q9788K2223l50572N1885
14684b27002K25138K94049m2078k21457j96895j82368k642J41744J29298L70250
14674B88037k07842j45143Q984k8771K22435j9437j69551J57806K01830k2927
14664B85421N2797k36603j13059r6728N1149K22250m0709M5618J1518k18263j44358
14653a80967O2489k10661j89690J03368L17228J94110M9466p0004k54880P679
14643a71862j56546Q3440K08694M655Q3348j97851K1953j4628K30128J7343p9846
14632B8828r8442j8244Q6562K9106J98046O8182j01871L5796n2488j76852o1437
14621f2814n8275J27508J57122j10589j33268k25081l7204R1817j53568M1826
$$ y = [206588, 336130, 259822, -10429, 52865, 168509, -40326, 49462, 71685, -278887, -227002, -1864, 292185, 250107, 28650, -168245, -350613, -353255, -211511, -82213, 288037, 80195, -64948, -55964, -84735, 137700, 118263, -51288, 106518, 308348, 285421, 338218, 101615, -11444, -108172, -57023, 165227, 124518, 170136, 181654, -36609, -180967, -118478, -329139, -518829, -415461, -98233, 95877, 145343, 75339, -179541, -171862, -328408, -244968, -36274, -31619, 51729, -146122, -124169, -138797, 91331, 108674, 28828, -69614, -87858, -1296, 27810, 225856, 294038, 192167, 227963, 175475, -1377, -62814, -121089, 6419, 163541, 52952, -80316, -305397, -342601, -250784, -404352, -362526]
14611c62526K16004R9942P0919J44475j51502j94080K02103k20793L9480J82692
14601B6714J7103m1746j72626j3526L9290j0352J17272P5519j9245q0050l8281
14590i9928J66322K57424l3506j65732K13k71744o3781R9725M9918R8511J16436
14579A53858J5605L3688N4511k74312j10870K75933m6677k55181p8004m55M6460
14568a85444J25729J4404j68326O5904O0637p2573r4076j4019P9241J19791K30500
14557A61768p4375K2923K06008K0254j79178j59422j95891K16016k3911j10278
14547a16086j97512K11733K22422J77256m8481l70490k54814M7375k8636L04446
14537e2787J17590l9857l9191L7920O2144M0651j53126J1982J25440K18147l1806
$$ y = [-362526, -146522, -46580, 24339, 168814, 17312, -176768, 25335, -195458, -155978, 26714, 43817, 2071, -170555, -184081, -144791, -155143, -37871, 37648, 18403, -61647, -99928, 66394, 323818, 290312, 124580, 124793, -146951, -210732, -111007, -61089, 37422, 153858, 169463, 203151, 257662, -16650, -127520, 148413, 101736, -153445, -231449, -231904, -185444, -59715, -45311, -213637, -147733, -87096, -159669, -253745, -267764, -188523, -68732, 161768, 87393, 110316, 316324, 336578, 157400, -2022, -197913, 18103, -5808, -116086, -313598, -101865, 120557, 297813, 249332, -121158, -375972, -328597, -357233, -52787, 64803, 24946, -14245, 23675, 85819, 126470, -26656, -14674, 110766, 328913, 297107]
14526B97107P1762j34922m70654j62603J86499J2638r5695R9207O6912m9797K7642
14515a51904M9144k09793J8726L02771L8468K8873J31722M3138k98395k03404
14505b50654L0761J54626K74814K83539M5103j53120j51667K0650L2443J2524
14495B99019j8414K5539k06938J02174K31319R261k38449l32958l3800J27358
14485c5889R4651k13700l04215J51177m7183k15386K16642L39694M8651j55354
14475a20912Q7556J06315K67969L7185n2410r3927k03463R243q9381J14210j44981
14464h2596m1310j17064j27511Q2690P4303n7019P1608O5580o0103K4185K61201
14453I3964K0789j35668J72160J37024l8517O4648R040n41k9904J3428Q8719o0907
$$ y = [297107, 368869, 233947, -236707, -399310, -212811, -200173, -295868, -196661, -129749, -179546, -151904, -102760, -312553, -293827, 8944, 47412, 76285, 208007, 251145, -47250, -250654, -219893, -65267, 209547, 493086, 538189, 385069, 233402, 254052, 286495, 299019, 280605, 306144, 99206, 201380, 432699, 441960, 203511, -129447, -163247, -35889, 58762, -154938, -459153, -307976, -355159, -570545, -353903, -14209, 34442, -120912, -33356, 72959, 340928, 378113, 325703, 231776, 28313, 37556, -51825, 62385, -82596, -123906, -240970, -368481, -285791, -211488, -268507, -196899, -131319, -191422, -167237, 93964, 114753, -20915, 151245, 288269, 249752, 314400, 323440, 322899, 292995, 306423, 395142, 334235]
14441C34235j9438k55944o0024L808M3766j86729q6633R2072N4074J68089n105
14430H2171k71873K20537l6717l06219n6128J42311J35712j0779L27755K19457
14420D46227J30246l24157k7863K30979k99471l79616K7973L16778J23951M9762
14410B94809p0427k13444p2162J79055Q1963N318Q7372j23631j14192J4622J55748
14399B25031m7949k60553J7113j4892J63309P9903n8618J19911q2550k054k50344
14388a11693j26317j56835K1010K75676O3967n4639J11168J27451j36250J51917
14378A65455K17123l06501k48443j62414N124J38910J88865j11097r0378p5370
14368b78726j08936q9430J14972P0680N2960j82289N8261r4981L703K30933O0598
$$ y = [334235, 314797, 58853, -1171, 2637, 46403, -140326, -226959, -134887, -80813, 87276, 82171, -189702, 30835, -5882, -312101, -368229, -225918, -90206, -100985, 226770, 446227, 576473, 252316, 224453, 455432, 155961, -223655, -195682, 121096, 245047, 294809, 224382, 10938, -61224, 117831, 199794, 205112, 292484, 168853, 54661, 69283, 225031, 177082, -83471, -66358, -81250, 82059, 161962, 103344, 223255, 140705, 138651, -111693, -238010, -394845, -373835, -98159, -34192, -88831, 22337, 149788, 13538, 165455, 382578, 76077, -172366, -334780, -329656, -190746, -1881, -112978, -203356, -278726, -387662, -477092, -362120, -291440, -238480, -420769, -362508, -457489, -453786, -222853, -162255]
14357a62255Q4960K37166j59044k08333K19643L01261L9878k29605M4082J79565
14347C47318j979j69358N8329n8835l5768r3857j68490J71142L46545m7967j20773
14336B26307j59334j68117M1503K61602k21L271j84946l27j93835L9392J24600
14325a0105J33727j74509o2182k70061N8103K41607J97075N8031Q0435k09621
14315D2500k33106J05153R0611K81795j219o2270q5978m1810N4799J24947m2826
14304B32596k8473j10969j09385k68404Q4301K0119N3802Q2150o218J52244n3858
14293D7905j21622J29054o6124Q602Q4041o5738m17442l1884K62326J46667k6115
14282e0330Q4741J58615O5325j03679O3245j11822j94387p3178J37264l5294Q1267
$$ y = [-162255, -77295, 159871, 827, -207506, 12137, 313398, 353276, 123671, 167753, 347318, 345339, 175981, 234310, 175475, 139707, 45850, -122640, 48502, 395047, 347080, 226307, 66973, -101144, -59641, 201961, 201740, 205011, 20065, 19738, -174097, -134705, -10105, 123622, -50887, -113069, -383130, -325027, -83420, 113655, 171686, 252121, 42500, -190606, -85453, 5158, 286953, 285734, 223464, 137486, 95676, 150475, 275422, 232596, 204123, 93154, -16231, -284635, -200334, -180215, -126413, -44263, -50481, 101763, 47905, -73717, 55337, -10787, -2185, 81856, 16118, -401324, -433208, -170882, -24215, -50330, 34411, 193026, 258351, 154672, 217917, 106095, -88292, -161470, -24206, -59500, 21767]
14271B1767l4167j81037O8324J47384Q2617j33685l6600J58700K29444O1279l7137
14260C46889k64018K87485J16955j05012M8693l3345n4668M408j73661R7267R33
14249B71926k33521K07286K46263m5117m20304j56698k4120N8879J03651N6684
14239F4929J25354L218n5146o7026j108j00503q3031J5629J37922l4384j94110
14228a88256L3344L37136J45103l54787j02280O6313R6134k60466k5321K08106
14218d4974r483J38528J17823j76835j81372J38641R7346J52606K3222j35019
14208A20483K6026J05539o2194j02919J4985q3849J1562J409k07514O756k8027
14197a97743o7577J21474J10481J55171o9558J37551M9816J1017l0763j26163
$$ y = [21767, -12400, -193437, -125113, 22271, 104888, -28797, -65397, 93303, 322747, 384026, 346889, 82871, 370356, 487311, 382299, 430992, 397647, 342979, 347387, 173726, 270993, 271926, 38405, 245691, 491954, 446837, 26533, -130165, -154285, -95406, 8245, 64929, 190283, 193501, 138355, 71329, 70221, -30282, -113313, -97684, 40238, 5854, -188256, -154912, 182224, 327327, -27460, -129740, -63427, 32707, -227759, -253080, -44974, -54457, 84071, 201894, 25059, -156313, -17672, 79674, 232280, 255502, 120483, 146509, 252048, 189854, 86935, 101920, 18071, 29633, 31042, -176472, -169716, -197743, -265320, -143846, -33365, 121806, 52248, 189799, 239615, 250632, 219869, 93706]
14187I3706O5446P9934Q3018j02419m9279o8805j71606J83624J84651J30968k36386
14176A92852n0689r812j22564j33528O1098K47353P0605K0462n3604j82997p4758
14165c5582j8122J00325p4150O7500J88737j77605P8096M1904j0275J66820L34980
14154F62628J48284L0985L9600j56537k91986j20335J15868n937j84909L2190
14144B69851K07406o2493j94811M4929K26406J87122j26781k40248j25014R3683
14134B80050K28032O2194R0653Q0583M03094M39352L89517J12966j28270r573
14124A948598K44801j088k98663k77120m84987M140m4036j93173r6740M743K78587
14113A085062M12533O2359j52583J12476K07517J22984k63821k73613J53252L02996
$$ y = [93706, 159152, 239086, 322104, 219685, 170406, 101601, -70005, 113619, 298270, 429238, 192852, 142163, 132351, 9787, -123741, -62643, 184710, 255315, 275777, 222173, 39176, -35582, -53704, 46621, -27529, 39971, 228708, 51103, 129199, 171103, 160828, 327648, 662628, 810912, 841897, 881497, 724960, 432974, 312639, 428507, 422570, 237661, 269851, 477257, 414764, 219953, 264882, 491288, 678410, 551629, 311381, 186367, 280050, 508082, 570276, 660929, 741512, 1144606, 1583958, 1973475, 2086441, 1958171, 1948598, 2193399, 2192311, 1893648, 1616528, 1131541, 1135681, 1091645, 898472, 801732, 806475, 1085062, 1497595, 1559954, 1407371, 1519847, 1727364, 1850348, 1586527, 1312914, 1466166, 1769162]
14103A769162K16688K913K99887K14377k6929k409j15780j37228m08716k98427
14093A513538j7516J54939J82772K2847j67071J75047M1045j73386l1489m1342
14083A659384l01839j64600L41153l7217J86194J697K4826K50636P4802P2987
14073B108023N20207L50367j41724j2136j05434p33419n76188k28043J8055J59950
14063A359658j87102k36272m107J63641L47800Q5741q7011j22362j67370L3274
14053A185890J2070p5025j29060k35505J55600L9833J08274Q7426j10547k04069
14043H34887k70612k90226R3106P1148q6058J59218p6478k45328j53648J83503
14033B19512R2515M6391J92072R6990l53982k8599P2641J1658j91829J29696l3188
$$ y = [1769162, 1985850, 1988763, 2288650, 2503027, 2476098, 2473689, 2357909, 2220681, 1811965, 1513538, 1496022, 1650961, 1833733, 1856580, 1689509, 1864556, 1905601, 1732215, 1700726, 1659384, 1357545, 1192945, 1534098, 1496881, 1683075, 1684772, 1709598, 1960234, 2035036, 2108023, 2628230, 2978597, 2836873, 2824737, 2719303, 1985884, 1409696, 1181653, 1199708, 1359658, 1172556, 936284, 932177, 1095818, 1443618, 1529359, 1442348, 1319986, 1152616, 1185890, 1197960, 1122935, 993875, 758370, 913970, 953803, 1062077, 1149503, 1038956, 834887, 564275, 274049, 367155, 438303, 352245, 511463, 434985, 189657, 36009, 219512, 312027, 358418, 550490, 647480, 293498, 264899, 337540, 349198, 157369, 287065, 253877]
14022B53877j66282J79318J57905k6109q5261j55041M1453J15975O7866L0077
14012D13778J89486R4443J2662j28736j60269K3122O892j65477K86323m0876j83889
14001C47459P9583Q8080p2645j50977j37695J16029K46471M3471j94443Q7362
13991D52695k2520k6477n8705j46146K8341K5642K26302J76655M82474L63735
13981A501996J99983R1515M66774P4550k15115k02209m73403k47760Q68O5533
13971A262732M4334j30741j42202k68024k46808K90348M21886J78983N4233M31508
13961A896249j35910J12587K19312j21716j21790J20674K58391J69348J09330
13952B506475k22326J4289P1642j35781j78366k64040m67135l29323L61334L3567
$$ y = [253877, 87595, 266913, 424818, 398709, 313448, 158407, 199860, 315835, 383701, 413778, 603264, 697707, 710369, 581633, 421364, 444486, 451378, 285901, 572224, 531348, 347459, 427042, 515122, 442477, 291500, 153805, 269834, 516305, 559776, 365333, 452695, 430175, 403698, 344993, 198847, 227188, 252830, 479132, 655787, 1138261, 1501996, 1701979, 1793494, 2260268, 2334818, 2119703, 1917494, 1444091, 1196331, 1197199, 1262732, 1307066, 1176325, 1034123, 766099, 519291, 809639, 1231525, 1410508, 1464741, 1896249, 1760339, 1872926, 2092238, 1970522, 1848732, 1969406, 2227797, 2397145, 2506475, 2284149, 2298438, 2370080, 2234299, 2055933, 1791893, 1324758, 995435, 1356769, 1390336]
13942A390336J42068O4794R8051R0569L7112L04300K0182k48206n8595j33093
13932A707518l53596p5077K78874N23993K58036P5847J95768P5388J34809j03375
13922B718185l69435j84993l62315l86180j34509l02139j54744N9208Q9742j56190
13912H16630R1472j97279k52297P3724M3545J92735n468k71480j38744J33859
13902D86697k7767N272k48394m4514J16375J0412j01958K37174L17175P089j0358
13891G47203j18117P6984n4931k10159n5848K11063J41500j57582q3742J48971
13881F45342K77201J33865n3354l50082o6663k28624J30125N9626j32034J88778
13871F04180K85555J23005j08666q3615j35034j6678J33850k6556k3185j1083
$$ y = [1390336, 1532404, 1597198, 1695249, 1785818, 1822930, 2127230, 2147412, 1899206, 1840611, 1707518, 1353922, 1278845, 1557719, 2081712, 2339748, 2415595, 2611363, 2686751, 2821560, 2718185, 2348750, 2163757, 1801442, 1415262, 1280753, 978614, 823870, 883078, 972820, 816630, 908102, 710823, 458526, 532250, 575795, 768530, 763062, 491582, 352838, 486697, 458930, 464202, 215808, 171294, 287669, 298081, 196123, 433297, 750472, 757561, 747203, 629086, 706070, 651139, 440980, 385132, 596195, 737695, 580113, 496371, 645342, 922543, 1056408, 1003054, 652972, 586309, 357685, 487810, 547436, 415402, 604180, 889735, 1012740, 904074, 820459, 685425, 668747, 802597, 776041, 752856, 741773]
13861G41773J5810J84374o4485j95096P0874K25345q699j63425q3635M4827L5301
13850H02964k8335j36843j9499O5236q7723j99107Q1587J52277J29412j67857
13840E92112j23552L30396j59197K3939K13503j85371j88549j06882R023L24267
13830G29689j37293k95146r909L29854K8374J37636n7327k22039j38709L9965
13820D05095K03077l32388l63342j88730J39017J94499K72526J78849K3133R209
13810E40945J27261l17564p4717J62364j15122o0024R7673J74464J79588k44131
13800D70737j19690r8182k07923L51481K49774O5094j69133J17560J14037m04852
13790C68903n9095K47814J19347N4217k0582m2965j32505j15806n3444M61423
$$ y = [741773, 757583, 941957, 877472, 682376, 753250, 978595, 969896, 806471, 722836, 767663, 802964, 774629, 637786, 618287, 683523, 595800, 396693, 478280, 630557, 759969, 592112, 468560, 798956, 639759, 663698, 877201, 691830, 503281, 396399, 405422, 729689, 592396, 297250, 287341, 617195, 645569, 783205, 725878, 503839, 365130, 405095, 608172, 275784, -87558, -276288, -137271, 57228, 329754, 508603, 531736, 540945, 668206, 350642, 275925, 438289, 323167, 263143, 360816, 535280, 714868, 470737, 351047, 252865, 44942, 396423, 646197, 711291, 542158, 659718, 773755, 368903, 309808, 557622, 676969, 731186, 710604, 667639, 535134, 419328, 365884, 827307]
13780H27307J05761k66993K50330J46739r6713j19341Q7238K6037J34266j16312
13770I78319k4849k03140K4104L18334L5100k1491O5585J22778o0975K96571R3555
13759A623891J15120J27008J31915n6527J36449j36660K3808m6482K76139K41192
13749B435853K7148j4814l45133k37138j14056M9812P1420J02844K16545K48456
13739B440937N0449K8929p4081j65082k73869j13128K25625j06534K1718K03520
13729B238484O7248p3472R1349O2656L60150J83102P2053L57203L20284J60928
13719C839985P3626k33667j52382j27699j07584j13380k21350J50774j69135Q7367
13709C026555J13836k87668O1901L5522n6999J5695K86757K25768O9764n6377
$$ y = [827307, 933068, 666075, 916405, 1063144, 966431, 847090, 934328, 960365, 1094631, 978319, 953470, 750330, 774434, 1092768, 1127868, 1106377, 1171962, 1294740, 1233765, 1530336, 1623891, 1739011, 1866019, 1997934, 1941407, 2077856, 1941196, 1965004, 1918522, 2194661, 2435853, 2463001, 2448187, 2103054, 1865916, 1751860, 1801672, 1873092, 1975936, 2192481, 2440937, 2491386, 2520315, 2446234, 2281152, 2007283, 1894155, 2119780, 2013246, 2034964, 2238484, 2305732, 2232260, 2323609, 2386265, 2746415, 2929517, 3001570, 3358773, 3679057, 3839985, 3913611, 3679944, 3527562, 3399863, 3292279, 3178899, 2957549, 3108323, 2939188, 3026555, 3140391, 2852723, 2914624, 2950146, 2893147, 2908842, 3195599, 3421367, 3491131, 3434754]
13699C434754N43K19807J29699p4169n3136K52383J91438m3055J47043p783j68322
13688D029202K74027J05246N6202L61917J97003K77914M31812M35520O57996L20197
13678G147036J54850J45467L19082L25405N01111P40504Q30059J034966J454001
13669A2652481J530108J508375K072926K417714L088687L913927N086708O761943
13661C9032869R630875J4123141K0530486K6742956K8415886K7332760L0413788
13654A96222761L2683530J8040751l581791r514605k851683k029580j7407896
13647B11561487l1847292k8837304j8667650r426900k022435N569100J4811671
13640A41140677K6745952L6242149L5278796L1493095M0166308M3846163J3414267
$$ y = [3434754, 3435297, 3655104, 3784803, 3710634, 3657498, 3909881, 4101319, 4058264, 4205307, 4197524, 4029202, 4303229, 4408475, 4464677, 4826594, 5023597, 5301511, 5733323, 6168843, 6826839, 7147036, 7301886, 7447353, 7766435, 8091840, 8592951, 9333455, 10163514, 11198480, 12652481, 14182589, 15690964, 17763890, 20181604, 23270291, 27184218, 32270926, 39032869, 48663744, 62786885, 83317371, 110060327, 138476213, 165808973, 196222761, 228906291, 246947042, 243365251, 233850646, 230998963, 228969383, 211561487, 179714195, 150876891, 132209241, 122782341, 120759906, 126329006, 141140677, 167886629, 204128778, 239407574, 270900669, 311066977, 354913140, 368327407]
13633C68327407j4915473r579016R320589K0480293Q860074j0986159j6757055
13626C54750660j0510333k798292j1773330l5398808m4217226l4095471k0072295
13619A95884905p294246M621199J9164511L5181355M2073282L2232716K7428257
13612C49291979L4295936J0265934m4854393n9349530l5070854r097857J2227735
13605B57708950L0711012M1523257M0297890L8262325M3860781L4760768J523263
13598D88648246j7978141j4511752o710567P53730r315049m5427774o9593056
13591C25865637o1746199m3628740k9988024k2196527j6762114j2959664j0480048
13584A28104321q855657p510558o197421n326152m729372m468154m163926l927496
$$ y = [368327407, 353411934, 343832918, 353153507, 373633800, 382493874, 371507715, 354750660, 344240327, 341442035, 329668705, 294269897, 250052671, 215957200, 195884905, 188590659, 193211858, 212376369, 247557724, 289631006, 321863722, 349291979, 383587915, 393853849, 348999456, 289649926, 254579072, 245481215, 257708950, 288419962, 329943219, 370241109, 408503434, 452364215, 487124983, 488648246, 470670105, 456158353, 449447786, 450201516, 440886467, 395458693, 325865637, 264119438, 220490698, 190502674, 168306147, 151544033, 138584369, 128104321, 119248664, 111738106, 105540685, 100214533, 95485161, 91017007, 86853081, 82925585]
13576H2925585l967153l154634k770835k460021k451877k173739j841469j591426
13568F2514431j379858j547177j463303j449896j564502j685443j599813j537628
13560E0286811r70452n84533l93691o28982p78257p40169j058149j283806j186574
13551D2662198j240410j076153j324659j424664j240936j029924j023819p92017
13543C3509616j018950p94683n49799o31251o39586m57903m13078l92085j96076
13534B8416205j28170j25940j11j22040K7252L63440N10572N08721M34461Q88328
13524C0772718J049968J218807J441129K050696K396343K678298L551582M246587
13516D9406128N768292P507194R671206J3941049K0111368K9304810M1492198
$$ y = [82925585, 78958432, 75803798, 73032963, 70572942, 68121065, 65947326, 64105857, 62514431, 61134573, 59587396, 58124093, 56674197, 55109695, 53424252, 51824439, 50286811, 49316359, 48731826, 48338135, 47709153, 46930896, 46190727, 45132578, 43848772, 42662198, 41421788, 40345635, 39020976, 37596312, 36355376, 35325452, 34301633, 33509616, 32490666, 31695983, 31146184, 30514933, 29875347, 29417444, 29004366, 28612281, 28416205, 28288035, 28162095, 28161984, 28039944, 28067196, 28430636, 28941208, 29449929, 29884390, 30772718, 31822686, 33041493, 34482622, 36533318, 38929661, 41607959, 45159541, 49406128, 55174420, 62681614, 72352820, 86293869, 106405237, 135710047, 177202245]
13509A77202245N1317323N1385496M5921933M8162721M5276007J9500985o505347
13502D32261363j0072871m832856M738299O451596k3412290n8492694n7869935
13495B88770612l5705453j2926963Q477127K7818278L3917309K4392176K3247703
13488C57990789K9581138k262884n6867053o3717551m0133493k0071624o577095
13481A97942227M277815J5726530K5740990L0009687K9162912L1903335L4375589
13474C69139085K1433193p14142q652314j061106J2523245J5704663n74119j7703879
13466C90094626j9328968m852375P80815l0300126n7514340m7713276k9060296
13459B02106060j6150486p674349k18312P016590J4667357K0238745K1106838
$$ y = [177202245, 228519568, 279905064, 325826997, 373989718, 419265725, 438766710, 432261363, 422188492, 417355636, 422093935, 428545531, 405133241, 346640547, 288770612, 253065159, 240138196, 248615323, 276433601, 310350910, 334743086, 357990789, 387571927, 385309043, 328441990, 264724439, 224590946, 204519322, 197942227, 202220042, 217946572, 243687562, 273697249, 302860161, 334763496, 369139085, 390572278, 389858136, 381205822, 380144716, 392667961, 408372624, 407798505, 390094626, 370765658, 365913283, 366694098, 336393972, 278879632, 231166356, 202106060, 185955574, 178281225, 178062913, 185079503, 199746860, 219985605, 241092443]
13452B41092443K0478194K4035759K1965549M335636j3799269j5748324q411193
13445B73948795j1037398k8693088l8782506l2839435k2910299j6177805j1986158
13438A11522106r104849p645307o102146n132745m309637l643310l358346l142808
13430F9082958k947199k566509k382973k428976k452342j932707j829591j714580
13422E0828081j516242j568594j703888j333198j070316j215979j243984j358996
13414C9816884r54814r41212j101727r53850q56028r05157p97319r86859r25916
13405C1394002q29079o76544n11837n37622m76526l75508k88215j29340L91773
13396B7961104M30261J219725J764270K772586L701465L953567L953196L221364
$$ y = [241092443, 261570637, 285606396, 307571945, 311907581, 298108312, 282359988, 273948795, 262911397, 234218309, 195435803, 162596368, 139686069, 123508264, 111522106, 102417257, 94771950, 88669804, 83537059, 79227422, 75584112, 72225766, 69082958, 66135759, 63569250, 61186277, 58757301, 56304959, 54372252, 52542661, 50828081, 49311839, 47743245, 46039357, 44706159, 43635843, 42419864, 41175880, 39816884, 38862070, 37920858, 36819131, 35865281, 35009253, 34104096, 33306777, 32319918, 31394002, 30564923, 29888379, 29376542, 28838920, 28362394, 27986886, 27698671, 27569331, 27961104, 28391365, 29611090, 31375360, 34147946, 37849411, 41802978, 45756174, 48977538]
13388D8977538J656152o21058m369957o044979n692531m194804k914523k371279
13380B4424559j619305j302387j151078n87232m15907m71345l00264n57828o57705
13371A7361508m45361J34748P37906R17899N40574K83632O65726Q08339p42107
13362B0262864k223214k004454j299607r41470j011795o70579l42809k60982m16155
13353A1091799n19090j92694n47436n49509j89477l87457m22083k91813L3114
13344H025354j50314k28222j08089j74922k76315j35547l38919j81975k8010k31255
13334F171786j42541J63505j30229l03238j9477k31139n43217J13003q0651k62306
13324D735496n93590o6772L8856L7771Q5280k3746n0435n3611j74743Q6885m0692
$$ y = [48977538, 50633690, 50012632, 45642675, 39597696, 33905165, 29710361, 26795838, 24424559, 22805254, 21502867, 20351789, 19764557, 19348650, 18877305, 18577041, 18019213, 17361508, 16916147, 17050895, 17788801, 18706700, 19247274, 19530906, 20196632, 21004971, 20262864, 18039650, 16035196, 14735589, 13794119, 12782324, 12111745, 11768936, 11507954, 11091799, 10572709, 10380015, 9832579, 9283070, 9093593, 8706136, 8284053, 7992240, 8025354, 7875040, 7646818, 7538729, 7363807, 7087492, 6951945, 6613026, 6431051, 6403041, 6171786, 6029245, 6192750, 6062521, 5759283, 5739806, 5508667, 4965450, 5078453, 4997802, 4735496, 4141906, 4075134, 4113990, 4151761, 4237041, 4213295, 4162860, 4109249, 3934506, 4021391, 3980699]
13313C980699j67130j18904j75209J41117Q619k3303k7071j21174k17728p042
13303C272874K00467j73628M4644l47658m3088r8065j9310p7513j34577j05515
13293B518631J41065K92241R5442N5360k74576k84499K66312j4615k0466p247
13283B767648l7643M4295j29916j53839j00570J74170m5314j56228J89276J13228
13273B665107J36005n7965m8127k19034l6145k48678Q7793K55374j7284j48505
13263B368541j27245k04890J9794j32003j27711M7939J6010j71161J72261J03727
13253A965262r4964j3006o2421k12416j45750P3840J42673J63016P7518j06704
13243A787048j87967o3274N0868J56635j86839o3311J20356k21995l87939k2767
$$ y = [3980699, 3813569, 3694665, 3519456, 3660573, 3669192, 3645889, 3618818, 3497644, 3279916, 3272874, 3473341, 3299713, 3344357, 2996699, 2953611, 2855546, 2836236, 2758723, 2624146, 2518631, 2659696, 2951937, 3047379, 3102739, 2828163, 2543664, 2809976, 2795361, 2774895, 2767648, 2730005, 2774300, 2644384, 2490545, 2389975, 2564145, 2518831, 2362603, 2551879, 2665107, 2801112, 2743147, 2695020, 2475986, 2439841, 2191163, 2278956, 2534330, 2517046, 2368541, 2241296, 2036406, 2056200, 1924197, 1796486, 1844425, 1860435, 1689274, 1861535, 1965262, 1870298, 1857292, 1794871, 1582455, 1436705, 1510545, 1653218, 1816234, 1893752, 1787048, 1599081, 1535807, 1586675, 1743310, 1556471, 1493160, 1613516, 1391521, 1003582, 980815]
13233I80815J03400K20657J79277j00728k03275j19676n5184K40407K16375J31179
13223A593247j51887j54109j44111r7067k90251l6445L33950j82190n3427R5853
13213I13563K52038Q5246O202R9408Q2112n8907j24512j54735q4856K23118K5291
13202A263968p2677k50380O5224j07256n3335K1432J49618M4819J12070K6712
13192A200195j24780l5532K84326r1646m4733K35113Q4209r7972n12P890N8704
13181A475262j2219j38068o8372k73018R4252J78804N8568k6910j7420M5669J29103
13170A445651J82487N50782O07388L67274J31153j6366k03677k59289n74264k58437
13160A972702k97861l07825p1833J96862L30104J17314J62720J83817J38666L3806
$$ y = [980815, 1084215, 1304872, 1484149, 1383421, 1180146, 1060470, 1005286, 1245693, 1462068, 1593247, 1441360, 1287251, 1143140, 1046073, 755822, 719377, 1053327, 871137, 817710, 913563, 1165601, 1250847, 1257049, 1356457, 1438569, 1379662, 1255150, 1100415, 1015559, 1238677, 1263968, 1191291, 940911, 1006135, 898879, 845544, 866976, 1016594, 1061413, 1173483, 1200195, 1075415, 1039883, 1324209, 1232563, 1187830, 1422943, 1507152, 1409180, 1408668, 1416558, 1475262, 1463043, 1324975, 1256603, 983585, 1077837, 1256641, 1315209, 1288299, 1270879, 1316548, 1445651, 1628138, 2178920, 2786308, 3153582, 3284735, 3268369, 3064692, 2805403, 2231139, 1972702, 1674841, 1367016, 1295183, 1492045, 1822149, 1939463, 2102183, 2286000, 2424666, 2458472]
13150B458472l13947j15417j17864o5087J67239K37693p6895j06413K37046Q2502
13140B387329J66605J89614L02457p9492k14761k44107j47510j50268k78009J22682
13130B054540L34233k49758k80194k49151j71784j34413q7276J08005j47478K10015
13120A386739k0494j34738M3672J10554K83021L53492J54350O8515K19782j16594
13110B348299k40622j44528j72381l66717k68850l56645j71630K19633n3329j24545
13100F68685j96598M8123Q6844J72218J46491m1078p012k81209M6773j29503J1909
13089E25643M0000L2964k53395J26801Q1137l3316L6848j04215l1067J3241P7028
13078E11669K0404r3082R9128j1814j71444j99149K54026m2400N3521J56949j16176
$$ y = [2458472, 2144525, 2029108, 1911244, 1846157, 2013396, 2251089, 2174194, 2067781, 2304827, 2387329, 2553934, 2743548, 3046005, 2966513, 2751752, 2507645, 2360135, 2209867, 1931858, 2054540, 2388773, 2139015, 1858821, 1609670, 1437886, 1303473, 1216197, 1324202, 1176724, 1386739, 1366245, 1231507, 1275179, 1385733, 1668754, 2022246, 2176596, 2245111, 2464893, 2348299, 2107677, 1963149, 1790768, 1424051, 1155201, 798556, 626926, 846559, 793230, 668685, 472087, 520210, 607054, 779272, 925763, 884685, 877673, 596464, 643237, 513734, 525643, 565643, 598607, 345212, 472013, 553150, 519834, 556682, 452467, 421400, 434641, 511669, 532073, 438991, 538119, 526305, 354861, 155712, 409738, 367338, 420859, 577808, 461632]
13067D61632j11575j54952K9969N3133O7245O9183P1815L2654L0323l22012k71335
13056d3920k32292n419K61381J88654J20553J7637q8908p233N8167m6307J5412
13045B37725j68256J22903M4641K15799N6779k40225j13875l4117J06597L3659
13035B61630J46465J14003P0923J49042J69054Q2510q002O7577N44784M72649
13025B070635L07707N09057J296m18853k15123l33662l54939n7660j93599m3795
13015A271064N8225j7500k9589J70968J08170L52473L11953L5722k10270k2931
13005B028285j35582k58916l38506j01660L45898K57018J65489L76931L69549
12996B708506m9820k60446m03677k06270j7640j45326j88861J29648J73111P0780
$$ y = [461632, 350057, 195105, 225074, 278207, 345452, 414635, 486450, 519104, 549427, 227415, -43920, -276212, -281631, -20250, 168404, 288957, 306594, 217686, 210453, 268620, 222313, 237725, 69469, 192372, 237013, 452812, 509591, 269366, 155491, 121374, 227971, 261630, 408095, 522098, 593021, 742063, 911117, 993627, 985625, 1053202, 1597986, 2070635, 2378342, 2887399, 2888695, 2469842, 2254719, 1921057, 1566118, 1508458, 1314859, 1271064, 1329289, 1311789, 1282200, 1453168, 1561338, 1913811, 2225764, 2261486, 2051216, 2028285, 1892703, 1633787, 1295281, 1193621, 1539519, 1796537, 1962026, 2338957, 2708506, 2658686, 2398240, 1994563, 1788293, 1770653, 1625327, 1436466, 1566114, 1739225, 1810005]
12986A810005R5939J9705J3801j69813k29028J1377j07672p646K6533M8527J16539
12975A628267K7618K73108J94158K16580L45824J02919j74898j92101l43106n80084
12965A498285k21907k94369r394o508p1314j09375j75230J7244n6423j48871l8172
12954C83966j97264J06025R4156K02464k2878j05877m4505j8431J09644j14574
12944C92726m7915K9257l90820o406L39921j10342n4353O7471K46362J71108K521
12933F39530M0681J64793o5324n7968k19490k28521k40754p7318J47540K08658
12923C11827m4531q2179J26327J59057R4830j27384p8732k26479J65357J83361
12913D81454r1967k00582m9086K20693N5676m4290L9458J12957P9615K0433j48415
$$ y = [1810005, 1905944, 1925649, 1939450, 1769637, 1540609, 1551986, 1444314, 1436668, 1463201, 1511728, 1628267, 1655885, 1928993, 2123151, 2339731, 2685555, 2788474, 2613576, 2421475, 2078369, 1498285, 1276378, 982009, 972615, 966107, 894793, 785418, 610188, 627432, 571009, 422138, 383966, 186702, 292727, 386883, 589347, 566469, 460592, 416087, 397656, 507300, 392726, 344811, 374068, -16752, -23158, 316763, 206421, 152068, 219539, 465901, 637009, 639530, 680211, 845004, 779680, 721712, 502222, 273701, 32947, -44371, 103169, 311827, 267296, 185117, 311444, 470501, 565331, 437947, 359215, 132736, 298093, 481454, 389487, 188905, 139819, 360512, 416188, 371898, 411356, 524313, 603928, 624361, 475946]
12902D75946k36360j35456n0332O0600P7050n2093n0588J3964J6275j77432j19631
12891a78057K50079K29918m693J3587J62400J34759j34478k81899l63422k07594
12881c79400J4875L35756J95092K7905j17642m6254J41064O2613k9763j03160
12871A01086r2094J59825k1379n2760j02767k98680j22601J20554K10771r4285
12861a92330k1234P6367p2930O9738k2513j79390K35582K94591K2830k35923j47407
12850a72619l991q5398k2695j78601R7294L22941L07606K46145j86303o8581P2026
12839C27824j59958j94852j6631J5484j9934n7635O5377K77541M2235J04950k81496
12828A02905k03579P5447P1038m969K77245n4729j78128J1211p419n9595J50210
$$ y = [475946, 239586, 104130, 53798, 114398, 191448, 139355, 88767, 102731, 119006, -58426, -178057, 72022, 301940, 297247, 310834, 473234, 607993, 473515, 191616, -171806, -379400, -364525, -28769, 166323, 194228, 76586, 30332, 171396, 234009, 204246, 101086, 8992, 168817, 147438, 94678, -8089, -306769, -429370, -308816, -98045, -192330, -213564, -137197, -210127, -140389, -162902, -342292, -106710, 187881, 210711, -25212, -172619, -176610, -262008, -284703, -463304, -366010, -43069, 264537, 510682, 324379, 255798, 327824, 167866, -26986, -43617, -28133, -48067, -105702, -40325, 237216, 279451, 384401, 102905, -100674, -25227, 45811, 40842, 318087, 263358, 85230, 96441, 89022, 29427, 179637]
12817A79637j25712j05832q280J55254K45350J62311k31519j89061P1822J25324
12807B79294j60935j20170r427q3466K03642N2243J05313M2407J22471M705Q0730
12796E16807m3167j20245j2854L04099J03779L7820k34956j84220J49509P7047
12786E93619n1226J70666J14913j54626N7159j1131N1343J93427m3914l74156
12776E46074l7442L0992J04661l6458J38846j3025k57424j36023J37805j21856
12766C56150k43932J51244K72584j02487k24044j34093j24626J55758j02721J22045
12756A25878K84322r6968J03619j03987r6216j6911K77711o0875k06934k7791
12746A81848J90494R0520K55686J04405j1610k67900J68598m5391n931j25542
$$ y = [179637, 53925, -51907, -60187, 95067, 340417, 502728, 271209, 82148, 153970, 279294, 118359, -1811, -11238, -94704, 108938, 161181, 266494, 308901, 431372, 436077, 516807, 473640, 353395, 340541, 644640, 748419, 786239, 551283, 367063, 516572, 593619, 542393, 713059, 827972, 673346, 730505, 719374, 770717, 964144, 920230, 546074, 508632, 539624, 644285, 607827, 746673, 733648, 476224, 340201, 478006, 356150, 112218, 263462, 536046, 433559, 209515, 75422, -49204, 106554, 3833, 125878, 410200, 313232, 416851, 312864, 216648, 199737, 477448, 416573, 209639, 181848, 372342, 462862, 718548, 822953, 811343, 543443, 712041, 666650, 660719, 535177]
12736E35177j87173l10668m6011J04237J39422o162p4682J8187K464J12673M2479
12725C29943j29072k31814R7847P0469j20955j60091n8857k26147O584K33915
12715a88178J16954L7512J90495j05792q5888n1461k23891J68362K10860j4466
12705E4507k158l8256r8155K08938K22637n9873Q0960Q4469j89037j46769p4201
12694D3062j05976M2531O105l04175L5152K11111l8094R9410K31095J1985j05299
12683A26907J4784j94967O7679J32473K86048j69879R256j11454k28740j43607
12673b11500K7987K04291K25372p8362J29378J66206m5648k99638k09065J39434
12663D8455J60364j13411j54398j41874Q8697K33570R2244j42476J4194M3922
$$ y = [535177, 348004, 37336, -8675, 95562, 234984, 228822, 154140, 172327, 174791, 287464, 329943, 200871, -30943, 66904, 137373, 16418, -143673, -202530, -428677, -422093, -188178, -71224, -33712, 156783, 50991, -34897, -86358, -310249, -141887, 68973, 54507, 52349, 14093, -84062, 124876, 347513, 287640, 368600, 453069, 264032, 117263, 43062, -62914, -20383, -14278, -318453, -283301, -72190, -110284, -10874, 220221, 232206, 126907, 141691, -53276, 14403, 146876, 432924, 263045, 272301, 160847, -67893, -211500, -183513, 20778, 246150, 167788, 297166, 463372, 417724, 118086, -90979, 48455, 208819, 95408, -58990, -200864, -112167, 121403, 213647, 71171, 85365, 129287]
12653A29287j41790O3715L3377J1922Q4930o8744J03138L8159j06573o0702l05517
12642b18798q9990K55457P0658n8811K18771J94158p8497R6058k4023n8052m3873
12631B63058j29638k05430m0271L5683r8949P6633L7814O3649r9966p1820N9396
12620a09841m5569m1604J58255P8346P4213m246l9539j68067k9067K10354k9234
12609E4001o0013K917j69959Q3422J49575L8430n0230J4053r9094K29531R8656
12598B91289j29810K9618n6921K63914J45500j44826J9469r0253j16866L7171
12588B48285l7727k24978J08978J37040K45j8346r8831K2170m6945J12678k18102
12577a5533j99446j10707J58991K99778J14029p91l1013m2247j72931o0614J45975
$$ y = [129287, -12503, 51212, 84589, 96511, 181441, 112697, 215835, 253994, 147421, 86719, -218798, -308788, -53331, 17327, -41484, 177287, 371445, 292948, 389006, 364983, 306931, 263058, 133420, -72010, -112281, -76598, -175547, -98914, -61100, 2549, -97417, -169237, -109841, -155410, -197014, -38759, 39587, 113800, 109554, 70015, -98052, -127119, 83235, 54001, -6012, -3095, -173054, -89632, 59943, 98373, 48143, 62196, -36898, 192633, 291289, 161479, 191097, 134176, 398090, 543590, 398764, 418233, 327980, 211114, 248285, 210558, -14420, 94558, 231598, 231843, 213497, 114666, 136836, 89891, 202569, -15533, -214979, -325686, -166695, 133083, 247112, 246321, 215308, 173061, 130, -60484, 85491]
12566H5491j04793k38375m5647r9694K15029L47151j59068j47469K4857J1604
12556a10914K2664Q9255M570j03034n1703k44396R6241K68100n8674J98008p374
12545A02743j06784O8799j13151j36268o9300M3466K03861J45695j04885M0322
12535G4498Q7919r1620k30767L456L8492J78023O678j63476N3458j07756k14404
12524c65499P9895M34371n6274J04167o713m3513p6737L9498O9688K72797L0359
12513D82039j54253j00473L7896p9088J0141L45059j69905k14997j11547M76J63222
12502B08570j66081j06800J18184j7233j19927k11587l7776J91959K88791J73441
12492C21541K8699p3349J15737j95829k5548J28515K4311j29223L276L21330j68735
$$ y = [85491, -19302, -257677, -303324, -403018, -187989, 159162, 94, -147375, -122518, -110914, -88250, 1005, 5575, -97459, -149162, -393558, -297317, -29217, -87891, 110117, 102743, -4041, 64758, -48393, -184661, -253961, -210495, -6634, 139061, 34176, 74498, 162417, 70797, -159970, -156514, -118022, 60001, 66679, -96797, -43339, -151095, -365499, -285604, 148767, 92493, 196660, 189947, 146434, 69697, 109195, 178883, 451680, 482039, 327786, 227313, 265209, 186121, 196262, 541321, 371416, 156419, 44872, 45348, 208570, 42489, -64311, 53873, 36640, -83287, -294874, -332650, -140691, 148100, 321541, 350240, 276891, 392628, 196799, 171251, 299766, 324077, 194854, 198130, 519460, 350725]
12481C50725j01376j72680k06805J46368J94358J22720J28874j20789M1743r2800
12471B90338p6550j11792j79744l221l04127p9079P2128L20932m475l6556o2792
12460a74938K04813m3808p8047o5202n799j62887K16297J02770j2808j81557J9774
12449a81392J49763J35667k877k46037k24878O2228q2808P7646J58719L97385
12439B43416j12451l66669k2136r6384N5816K80196N6731K27407K32945k70035
12429B28836k81034p1908o2097j17266K02900K01594J38917k7889j03319K34369
12419C43103O7062k21609j20320K17426j9290k7045j16075k74254j24694n353
12409b81049J01128k8734J84151J54272J86905P5109j12578j51773p6274k22599
$$ y = [350725, 249349, 76669, -130136, 16232, 210590, 333310, 462184, 341395, 383138, 290338, 213788, 101996, -77748, -80969, -385096, -464175, -392047, -71115, -75590, -112146, -174938, 29875, -13933, -91980, -157182, -162981, -325868, -109571, -6801, -19609, -201166, -181392, -31629, 104038, 101161, -144876, -369754, -307526, -390334, -312688, -153969, 243416, 130965, -235704, -257840, -354224, -298408, -18212, 38519, 265926, 498871, 228836, -52198, -124106, -186203, -303469, -100569, 101025, 239942, 212053, 108734, 343103, 410165, 188556, 68236, 285662, 266372, 239327, 123252, -151002, -275696, -281049, -179921, -208655, -24504, 129768, 316673, 391782, 279204, 127431, 51157, -171442]
12399a71442p4214K88727J14192r0392O0410l4080n7589m8108J60765J54853P8912
12388C82034j70139j00935j32214O6276k2684J09137J12706p4143j52735Q3911
12378A01214J84845L9069k23470k38301k04910k03845j40829J39361K02704K95288
12368d8874K32502l0825j06638n0960L3303j63601k08553J67812K79734K49531
12358C53431q910o5417j04322j1663J09674J01617j53416k4708o2881k66303j21927
12347b54825j70967K94170K49675l8472J32717O007j00455j25218K5513J98127
12337B16272l5319l5257M3477j51684j60334K4753J93969r1661K7491J40286M0300
12326B12293r8694k44048Q0195q5779J0925K21084j2083J07646J5769J42449n1910
$$ y = [-171442, -245656, 43071, 157263, 66871, 127281, 93201, 35612, -12496, 148269, 303122, 382034, 211895, 110960, -21254, 45022, 22338, 131475, 244181, 170038, 17303, 101214, 286059, 325128, 101658, -136643, -341553, -545398, -686227, -546866, -344162, -48874, 183628, 152803, 46165, -4795, 28508, -135093, -343646, -175834, 103900, 353431, 344521, 279104, 174782, 163119, 272793, 374410, 220994, 196286, 133405, -132898, -254825, -425792, -131622, 118053, 79581, 212298, 218305, 117850, -7368, 18145, 216272, 180953, 145696, 189173, 37489, -122845, -98092, 95877, 4216, 31707, 171993, 212293, 113599, -130449, -50254, -136033, -125108, 95976, 83893, 191539, 207308, 349757, 297847]
12315B97847j12672k5055k38056j00064Q6647J62526j7161m6119J06354N1419
12305A65666j58101k1035O3507n9803j40340j67604j5346J37847L39482R3293
12295B37566o4471R6249Q1168j52414k0470n5501k35558M5007j16114J60359J70538
12284A46359j82412O5705L8510J43360k40294J41173j54415O4250r3811l5536
12274a07111P8360J30247J2278K8305L3870k9195o7029J09530K33280O4565l22273
12263A64827k01794j09317p8547l16742L5558j556J15986K47529J24634J18640
12253I9218K42084O4003j69355m4982l9611K95214P126k38122Q8393j3151k05511
12242H5306J72279J29937j7540p3386J1311L00675j7921k06300J68499L9883l08610
$$ y = [297847, 185175, 160120, -77936, -178000, -91353, 71173, 54012, 7893, 114247, 165666, 7565, -13470, 50037, -9766, -150106, -317710, -333056, -195209, 144273, 237566, 173095, 269344, 350512, 198098, 177628, 122127, -113431, -68424, -184538, -24179, 146359, -36053, 29652, 68162, 211522, -28772, 112401, -42014, 22236, -71575, -107111, -28751, 101496, 113774, 142079, 175949, 146754, 79725, 189255, 422535, 487100, 164827, -36967, -146284, -224831, -541573, -506015, -507571, -391585, -144056, -19422, 99218, 341302, 405305, 235950, 190968, 151357, 446571, 453697, 215575, 303968, 290817, 85306, 257585, 387522, 369982, 296596, 307907, 608582, 590661, 384361, 552860, 592743, 284133]
12231B84133k49714k38378j08929K12561L28561J7366j67730k68298j35560K15161
12221a10827J17759Q3889N7029k0191q0081n6252J45349J80143K26786j07543
12211D36061k07935l40196o7656J88558l8655J2934J26696o7472j05739L70990
12201C07586N7761o5994L1448q2735r115j60047k3575q9664J8986J37065J3250
12190A34966m895J44185R3900J01845k70185k05648M037j18244J22579L6021k7973
12179A0588K09806p4014p3905k6603N2471J12694j53097O6782J48514N3330j91157
12168A35409k22092P825J07594J74242k06349l40L43949K32291j76233j06650
12158B89646p8107j8754j18419L7449J33950j3938Q7671n0986j86666o8980q0284
$$ y = [284133, 34419, -203959, -312888, -100327, 228234, 245600, 77870, -190428, -325988, -110827, 6932, 90821, 147850, 127659, 47578, -8674, 136675, 316818, 543604, 436061, 228126, -112070, -179726, 8832, -29823, -16889, 109807, 42335, -63404, 307586, 365347, 299353, 330801, 248066, 238951, 78904, 55329, -34335, -15349, 121716, 134966, 130071, 274256, 368156, 470001, 199816, -5832, -1795, -120039, 2540, 38561, 10588, 220394, 146380, 72475, 45872, 98343, 211037, 57940, 124722, 273236, 326566, 135409, -86683, -78858, 28736, 202978, -3371, -3711, 340238, 572529, 396296, 289646, 211539, 192785, 74366, 111815, 245765, 231827, 319498, 268512, 81846, 12866, -67418]
12147f7418k77024j47113J25805K01035j09782K9277L5792J89950M1062M2077
12137F3661k279N4722J42655j06778O2245j32654k39098O2496r8675k18258J58653
12126b53310J94656J47440O5633M6184j15490j27563k60190J02498K44483k7816
12116A6525L2585m5762o7548J51187K5939j49046k1470J86319K46348R2060j42807
12105C24330k61676r0917j04583P3132p1737K47970l0306j39918j89628k24106
12095d67439j46001L5802j0043O4180K1973M51070K90909m0060k63708m5392K48731
12084A40022o1986J62681j43370r3442o5845j15342r7045J98645j6600p4713K707
12073a64288M8925l6912j14215n8644k7264J06769p1261k0968K03142j1581j55853
$$ y = [-67418, -344442, -491555, -365750, -164715, -274497, -245220, -209428, -19478, 21584, 63661, 61382, 116104, 258759, 151981, 214226, 81572, -157526, -95030, -193705, -411963, -253310, -58654, 88786, 154419, 200603, 85113, -42450, -302640, -200142, 44341, 16525, 49110, 3348, -64200, 86987, 112926, -36120, -57590, 128729, 375077, 467137, 324330, 62654, -28263, -132846, -59714, -131451, 116519, 86213, -53705, -243333, -467439, -613440, -577638, -587681, -523501, -501528, -50458, 240451, 200391, -63317, -108709, 140022, 78036, 240717, 97347, 3905, -61940, -177282, -274327, -75682, -92282, -166995, -164288, -115363, -152275, -266490, -325134, -352398, -245629, -316890, -337858, -134716, -146297, -302150]
12062c02150K75774L13957j1356j75364j21216K13276L43115l0683k42790j32544
12052A30019m3265j32161J00901l9237m05608k29813L02420P1942J10119J06339
12042b8344j72680m2084R2167j07281K1104K20334k77050n1133K33412L44639
12032B33084K04618o5333m9471j35994O0485Q6738j92473k6385K51416o6114k79341
12021B1230j07971j15009K43210K81043J57718j1936j69000j2590J53479M043
12011D44217n6957p8362P2804K41989j41784k77375j95308j53617Q8282q4884
12001a40995l3896K7391k4853K59740J39292o7962q7612J1680N7697O9217n5105
11990A54594N6308r0320n2305J43206j20117o8036J15918q7759j34972J11856
$$ y = [-302150, -26376, 287581, 276225, 100861, -20355, 192921, 536036, 505353, 262563, 130019, 86754, -45407, 55494, 16257, -389351, -619164, -316744, -244802, -134683, -28344, -201024, -243108, -150941, -258222, -237118, -16784, -293834, -344967, -111555, 233084, 437702, 372369, 322898, 186904, 247389, 334127, 141654, 115269, 366685, 300571, 21230, -86741, -201750, 41460, 322503, 480221, 468285, 299285, 286695, 440174, 444217, 387260, 308898, 381702, 623691, 481907, 204532, 9224, -144393, -56111, -140995, -174891, -147500, -172353, 87387, 226679, 158717, 71105, 82785, 140482, 209699, 154594, 210902, 120582, 68277, 211483, 91366, 23330, 139248, 51489, -83483, 28373]
11980B8373L8645j890m3592O9027n1376l31008q4119K75K53021J72916Q6103O9547
11968B05922J87229L8788K996j47725o6830j9221l5727l40768l0346J76678P5075
11957D6071Q3616M3423J5250O1774k01971m5652l4854p9948j25073J71602J0449
11946e5313l0785k71904M7979J20682j62802m9958k8944J5426J22710L29125O7728
11935A03944J03349k4144j62267j23518j61384R311R9268n0614j60107J82427
11925a83735r9489K23439K14609K07525r5146q8904P1423n1887k7149k7192k11366
11914f7872L1833r3411J66099J28372O0236n2594j37400K14597J69552j28025
11904B91387l82429k62665K92316K7547r2619N5302j25282o0967K11467L56431
$$ y = [28373, 67018, 65128, 21536, 90563, 39187, -291821, -375940, -375665, -122644, 50272, 136375, 205922, 393151, 431939, 434935, 287210, 220380, 201159, 165432, -175336, -205682, -29004, 46071, 129687, 173110, 188360, 250134, 48163, 2511, -32343, -112291, -237364, -65762, -55313, -86098, -358002, -310023, -189341, -352143, -402101, -431045, -415619, -292909, 36216, 103944, 207293, 183149, 20882, -102636, -264020, -254709, -155441, -206055, -366162, -183735, -283224, -59785, 154824, 362349, 267203, 178299, 249722, 197835, 170686, 143494, -67872, -36039, -129450, 36649, 165021, 225257, 172663, 35263, 249860, 419412, 291387, -91042, -353707, -61391, -33844, -126463, -71161, -196443, -257410, -45943, 310488]
11894C10488M9895k07754l01007R4700J489N0383m7239o0921n952l1828J27122
11883b0624J00850n3565j454J48632R0125o2035M1308q3160j86108L2586K23650
11872B30205J29929k3858m20571j56202J19393K06221l3926j67379Q9504j29702
11862a56386j02128K09366K6868o0301R9795Q2809j56701o8113k3687k5097k34043
11851d07618l8502R1154K02518J1392m1574L4104L07424P2139m9003J7348k26776
11840b7394r5400N2634Q2917j7561P1958j25458l1167N7308J25960p5470m23290
11829d04963j93165J64672P8029K02429k07594l05822M7712J34972M4990r2633
11819e31373q4226K24926J88137n9543p0113P5352P1442n3271j41441J8842Q7244
$$ y = [310488, 360383, 152629, -148378, -53678, -52189, -1806, -49045, -109966, -115918, -147746, -20624, 80226, 26661, 25207, 173839, 263964, 201929, 243237, 160077, -26031, 6555, 230205, 360134, 336276, -84295, -240497, -121104, 85117, 51191, -116188, -26684, -156386, -258514, -49148, -22280, -82581, 17214, 100023, -56678, -124791, -148478, -173575, -407618, -446120, -354966, -152448, -141056, -182630, -148526, 158898, 231037, 182034, 199382, -27394, -122794, -70160, 12757, -4804, 67154, -58304, -89471, -32163, 93797, 18327, -404963, -598128, -433456, -355427, -152998, -360592, -666414, -618702, -483730, -438740, -531373, -615599, -390673, -202536, -262079, -332192, -256840, -185398, -238669, -380110, -361268, -274024]
11808b74024L51238j604O5797O6096R6951J19731m49202j63868k80l8533l8791
11797b66489N9406o3860l10400j46565P643J99551J59478j21531Q9046o9912R8831
11786c64802J67680L9199n6912J42219n633p7832j9477j08471J3349M5271R9541
11775a25868R9482R8854O7533p9011J70089J87490k2638k17904j46313K959n3506
11764a8833q6915n2792j08185M4520O8246J1474j94676J0148K46643R2851K09964
11753B22445q381j32245k01165L80919L70538l00950l6975o0629p0186M8589N4509
11742B66469k2714j52611j41675j97518j64141J02065K63691J9321r8950J74707
11732D8644l1068o0165J97623K31105p3499j51456L5594j86577m5511n1369j17578
$$ y = [-274024, 77214, 75610, 141407, 207503, 304454, 424185, -25017, -188885, -189165, -227698, -266489, -207083, -270943, -581343, -727908, -720265, -520714, -361236, -482767, -393721, -463633, -364802, -197122, -157923, -214835, -72616, -78249, -156081, -175558, -284029, -270680, -225409, -125868, -26386, 72468, 140001, 60990, 231079, 418569, 395931, 178027, 31714, 34673, -18833, -105748, -158540, -266725, -222205, -153959, -142485, -337161, -327013, -80370, 12481, 222445, 214064, 81819, -119346, 261573, 632111, 331161, 294186, 233557, 163371, 211960, 266469, 243755, 91144, -50531, -248049, -412190, -310125, -46434, -27113, -126063, 48644, 17576, -42589, 155034, 386139, 312640, 161184, 196778, 10201, -35310, -86679, -204257]
11721b04257l4236j05669j2670N5421O2505j2157o9000P3264K80204J12088j97644
11710e2151L6461P2265J9401j18206m6455P0716O7773p8127j98615j9765J45716
11699a00987J88318N211j28064L8437k00980j31023p4661J18997N5261J28714
11689a00777j07360J07441K80741Q5975Q1022N2123k9749j1150Q998k38546k92095
11678a63377J51725J67984r6222q684K11029r8517k54052O3172J32697m8983M6055
11667A02827j9157q6801j2353m6530j24385L10237J70344Q950j62258j72370K84336
11656B52840J58866M8604j27153j35827q2128k53732L4861K6130j93787k44019
11646e15345K01594J71850R8114j15921j5642L8426Q5295L5824Q6249J21907J09335
$$ y = [-204257, -238493, -344162, -356832, -301411, -238906, -251063, -320063, -246799, 33405, 145493, -52151, -15690, 56575, 75976, -42230, -88685, -17969, 49804, -28323, -226938, -246703, -100987, 87331, 92542, -35522, 2915, -198065, -329088, -403749, -284752, -229491, -100777, -208137, -100696, 180045, 266020, 347042, 399165, 369416, 358266, 367264, 128718, -163377, -11652, 156332, 60110, 51426, 262455, 163938, -90114, -26942, 105755, 56772, 102827, 83670, -3131, -15484, -62014, -186399, 123838, 294182, 303132, 140874, -31496, 252840, 411706, 460310, 333157, 197330, 115202, -138530, -103669, -77539, -271326, -515345, -313751, -141901, -43787, -159708, -175350, -136924, -51629, -15805, 70444, 192351, 301686]
11635C01686j68504m5822Q1432l351R29K0447j46398P1283J4534k3367j65505
11624f2636K55883J41917k0379j91186j22623N9647J53751K67714r9168j14428
11614B68492J57441L0631j48561l1814j8300j52452K15788Q6909L4359J22025
11604E64518J31411j40174j71656j5800j11638j37839J57767m7749O899M4970
11594B80709N6430o2513j92198Q6892J23882J16157o5343l3262L68023j4511k00181
11583D64085P5636r2832j41517J66507q9375l38043j25652R9435K86714K9560
11573C34518m8472Q3986k3783o391J5860r3086l52821j12K12689k9599L60317
11562D53106n2755L7812K52768q815n2388j06588k8753m8443j58162j87972k16304
$$ y = [301686, 133182, 87360, 168792, 165441, 166370, 186817, 40419, 111702, 126236, 102869, -62636, 193247, 335164, 314785, 123599, 976, 60623, 214374, 482088, 382920, 268492, 425933, 456564, 308003, 276189, 257889, 105437, 321225, 408134, 442493, 564518, 695929, 555755, 384099, 368299, 256661, 118822, 276589, 228840, 235739, 280709, 337139, 274626, 82428, 169320, 293202, 409359, 344016, 310754, 678777, 664266, 464085, 539721, 446889, 305372, 471879, 382504, 44461, -81191, 18244, 304958, 334518, 286046, 370032, 346249, 339858, 355718, 262632, -90189, -90301, 122388, 92789, 453106, 400351, 438163, 690931, 682116, 629728, 523140, 494387, 445944, 287782, 99810, -116494]
11551a16494L3450K51615Q6583M0759k6361k74438O7268O1432r0777J79765R5898
11540C08700P8684n0180j02079j23438N0260K05731J30899l4748K2842j08189
11530C78482k55385j43106J6857r8287J09872M2674r5019J69484J16529r1740
11520A50361J33223J28853M2062O5473J04907M5044j11031m04160L7192K42535
11510D34459K33765L04089Q3892j40830M8674j93177J2446K1446J9815L8486j3950
11499H49115P0524J59499K52231J17348N4911J44623J06230K13727L24217L75233
11489B667658K63649K39768O22959Q02346O79239R37163J154309J465034K204728
11480A1036853K940118L808385N240960N955805N132327M392220L382741P57668
$$ y = [-116494, -83044, 168571, 255154, 295913, 269552, -4886, 62382, 123814, 33037, 212802, 308700, 387384, 337204, 235125, 111687, 161947, 367678, 498577, 463829, 486671, 378482, 123097, -20009, -3152, -101439, 8433, 51107, -43912, 125572, 242101, 150361, 283584, 412437, 454499, 519972, 624879, 669923, 558892, 154732, 191924, 434459, 668224, 972313, 1056205, 915375, 964049, 770872, 783318, 804764, 824579, 863065, 849115, 919639, 1079138, 1331369, 1448717, 1503628, 1648251, 1754481, 1968208, 2292425, 2667658, 2931307, 3171075, 3794034, 4596380, 5275619, 6212782, 7367091, 8832125, 11036853, 13976971, 17785356, 23026316, 28982121, 34114448, 38506668, 41889409, 42647077]
11472D2647077l223036o062208o452933n242028l749138k969868k189876j490962
11464A1267028j321124j037335q56073n06098m12864m22178o73915o08990l70591
11455E057860l1984l68433l48962p0637P8611k32388k80545k78524j859J13758
11445C636897j42599j35646k9386j89910k98242P3287j91467l80902Q4943J77602
11435B604577k415M1727J49346j58967j07469r0872J00804m8624k69104q1963
11425B137040j30193k05054j81322K92155K06923j59044k1240j55704J40641l2402
11415A891800j24026j83660r2609p8553j11733N3608m4169j91338q5938Q3476
11405A116858L7045k96447k99858O351K68677K34523R0989j67482l95464J83812
$$ y = [42647077, 39424041, 33361833, 26908900, 21666872, 17917734, 14947866, 12757990, 11267028, 9945904, 8908569, 8052496, 7546398, 7133534, 6711356, 6037441, 5428451, 5057860, 5025876, 4657443, 4308481, 4237844, 4316455, 4084067, 3803522, 3524998, 3523139, 3636897, 3494298, 3358652, 3329266, 3139356, 2841114, 2914401, 2722934, 2342032, 2426975, 2604577, 2602162, 2643889, 2793235, 2634268, 2526799, 2435927, 2536731, 2488107, 2219003, 2137040, 2006847, 1801793, 1620471, 1912626, 2119549, 1960505, 1939265, 1783561, 1924202, 1891800, 1767774, 1584114, 1491505, 1412952, 1301219, 1354827, 1310658, 1119320, 1033382, 1116858, 1153903, 857456, 557598, 563949, 832626, 1067149, 1158138, 990656, 595192, 779004]
11395G79004L19298p6082k76537m6647m3995r7531N0268J51705K2749K67542J94581
11384A244355m7082j08867o2012j92807j40002L95863K67641n3474j72223j95348
11374I36044j54913j99552l8475k7451j41716l2648J88891p372J84404K16046
11364I23258P5378J03088J14702N3567l13097p7422j1346q861j60212J3711J1570
11353G24336J82033J67531q5674j88418m6258K6270j02399j24127L2886n373R0835
11342F71642l9545J04627M3553j45872R8563L5849k39646K7848K88543n4577j66606
11331F24379l61831n0912o6470j92510j67600j09237q6537K08719L16223L04988
11321D19212j62494Q2208J87291M5155Q5666j46302K27796J05786J38975L57285
$$ y = [779004, 1098302, 1022220, 745683, 699036, 655041, 557510, 607778, 759483, 782232, 1049774, 1244355, 1197273, 1088406, 1026394, 833587, 693585, 1089448, 1357089, 1303615, 1131392, 936044, 781131, 581579, 543104, 515653, 373937, 341289, 530180, 522808, 707212, 923258, 998636, 1101724, 1216426, 1269993, 956896, 879474, 868128, 859267, 699055, 712766, 724336, 906369, 1073900, 988226, 799808, 753550, 779820, 677421, 553294, 586180, 580807, 671642, 632097, 736724, 780277, 634405, 732968, 768817, 529171, 557019, 845562, 790985, 624379, 262548, 211636, 145166, -47344, -214944, -324181, -410718, -201999, 114224, 419212, 256718, 338926, 526217, 571372, 657038, 510736, 738532, 844318, 983293, 1340578]
11311A340578M61786M29483J88532M3604L21689l49380o63249m76008m11247j49216
11301G36572j64027Q5163P6088k7561q8865K4706J35401j33410k83239o3266p465
11290B90097K34278M18092r476k9675J29474m6994J51329M2470J28237K40067
11280A547899J95706L22293K54297R5156j06307k04362m35741l13916l73240j34238
11270H47547j29885l9093q2356N3779N8616O8398j79758o3433n5690l2078j42191
11259C03856P0037J44416J02708p1640l0898l0882N6010K67793l2936l09820l38142
11248A30502j3995K21834O3422j62120L842J42817J05503O1262l02456q5652l4273
11237A30686L7811J09028k0320j87240k56045p1789K65801K32895K12355j24141
$$ y = [1340578, 1802364, 2231847, 2420379, 2463983, 2785672, 2436292, 1773043, 1297035, 885788, 736572, 572545, 657708, 733796, 706235, 617370, 642076, 777477, 644067, 360828, 297562, 290097, 524375, 942467, 932991, 903316, 1032790, 985796, 1137125, 1179595, 1307832, 1547899, 1743605, 2065898, 2320195, 2415351, 2309044, 2104682, 1668941, 1355025, 981785, 847547, 717662, 678569, 596213, 649992, 708608, 777006, 597248, 533815, 478125, 446047, 303856, 373893, 518309, 621017, 549377, 518479, 487597, 543607, 811400, 778464, 468644, 130502, 116507, 338341, 401763, 239643, 243485, 386302, 491805, 553067, 250611, 164959, 130686, 168497, 277525, 257205, 69965, -186080, -257869, 7932, 240827, 453182, 329041]
11227C29041j62535o8279Q109j46567j38040J31139P5501J16597M6217j53037
11217C8146k09998j79534J86659J64306j7867J78607O0530k8153J04682r336L905
11206B91947j5483n7022j19041j03285J24846J06177q7358R3027l7475J68760
11196C65093j20857l24689l29789R2221K58381J47335j25737j72857L79563J32608
11186C01272J0771r9730m5836j73840Q1806P6578N9345j75796j08559J444M5624
11175b6921R0719J24745m1896J34717k35344j4750J02546K38698j1932j66599
11165A93983j48219N8479J99877P3036j08065k08324L4156L3860j53437k4752
11155d9406J44468J10654m6734K1447j01573o6314j72249J87133K44815m8714
$$ y = [329041, 166506, 98227, 106336, -40231, -178271, -47132, 28369, 144966, 191183, 38146, -171852, -351386, -164727, -421, -18288, 160319, 220849, 192696, 297378, 288042, 291947, 276464, 219442, 100401, -2884, 121962, 228139, 140781, 233808, 196333, 365093, 244236, -80453, -410242, -318021, -59640, 87695, -38042, -210899, 168664, 301272, 312043, 212313, 166477, -7363, 74443, 151021, 210366, 34570, -73989, -72545, -26921, 63798, 188543, 146647, 281364, 46020, 31270, 133816, 372514, 360582, 193983, 45764, 104243, 304120, 377156, 269091, 60767, 94923, 128783, -24654, -49406, 95062, 205716, 158982, 180429, 78856, 12542, -159707, 27426, 272241, 223527]
11145B23527m3236m9002l34729J06782K02382P1909l7428J92112k5294k7836l7544
11134B41643M8639K9390l9015r6307M5699q1129p203j18258j40129k86957n1124
11123d54751J46420K50662Q1310j97183p7031J87133P9576Q4659l0405k3687o5838
11112a9135n4644J80048N8328r8395j99401j32404j26675Q6993K49625p8748j56691
11101b91099P1762K14944J73692N0582j78625j54843L5907k6701R3540L8088j99329
11090a72082j88390q061K66403J58216M9249J18387k18653R3416L48862J02961
11080E50308J3481j12253l22226j72601J74647J1239j57607l8778J98914J77554
11070C22678M5840m1471K75827J66935j13741j55756j26526J77114o536j24025
$$ y = [223527, 180291, 131289, -203440, -96658, 105724, 177633, 140205, 332317, 307023, 279187, 241643, 290282, 319672, 280657, 184350, 230049, 148920, 141717, 23459, -116670, -403627, -454751, -308331, -57669, 23641, -173542, -250573, -63440, 16136, 100795, 70390, 46703, -19135, -73779, 106269, 164597, 66202, -133199, -265603, -392278, -305285, -55660, -134408, -291099, -219337, -4393, 169299, 219881, 41256, -113587, -77680, -104381, -10841, 27247, -172082, -360472, -368533, -102130, 56086, 105335, 223722, 5069, 98485, 447347, 550308, 563789, 451536, 129310, -43291, 131356, 142595, -15012, -53790, 145124, 322678, 368518, 327047, 602874, 769809, 656068, 500312, 373786, 550900, 544364, 420339]
11060D20339q6928L9316m1234m9014j11756Q6201K11766j67967n6584J84377Q9593
11049E18109m7201p5052k65995k64867n402K65992p2869j64282J23076N7728J66570
11038B35807K22234k77662J4189J06253L502r657j26605L9526P8331L8537L5692
11027C60147j93222J05766Q1090J1516J36984k7842r7137k25114k01218M0740
11017h290j16853J4723M2162L25343P1481J06404L0522j47685r4489n4193j60208
11006H917K2661L5107K21166m3235k9084J71774M62966l38297l07676m48345J5880
10995b28166o1869J19242J11367N716K01288R430J9574k9773j23467M8767L71
10984G2480k05293j19758K32298J36597J16484k06123J94054J78978j10441k43340
$$ y = [420339, 333411, 372727, 331493, 282479, 170723, 256924, 468690, 300723, 244139, 428516, 518109, 470908, 395856, 129861, -135006, -140408, 125584, 52715, -111567, 11509, 69237, 235807, 458041, 180379, 194568, 300821, 304323, 294666, 168061, 207587, 285918, 324455, 360147, 166925, 272691, 353781, 365297, 502281, 474439, 377302, 152188, -49030, -8290, -125143, -110420, -68258, 257085, 328566, 434970, 465492, 317807, 223318, 169125, 8917, 31578, 66685, 287851, 244616, 215532, 387306, 850272, 511975, 204299, -244046, -228166, -290035, -170793, -59426, -53710, 147578, 157008, 176582, 146809, 23342, 72109, 72480, -132813, -252571, -20273, 116324, 232808, 26685, 220739, 399717, 289276, 45936]
10974D5936m7005J63766M2592K5647j6902k49711M6418L24484K38481j13250j3767
10963D46689j59591k64687q5178O3517J83926J65343m02892P0262J82333j16609
10953H3113j62100J02347j0125R7925j4368l9967P5699j75575J97652K4693m6392
10942A32902J7150O7582J92346r5129n10671l00074N7543L01349Q3516R7764J04564
10931A48842n1623j73495K3451O2284K30385N5554j67830J95185p4809n8514j10184
10920G9246O0084k79825r13j27373l1261K08099K04408j23158L6824j9061j48559
10909a41489J38291J73730Q9478j57316J04676J47142n1804K39413j21140k58065
10899A62916j14983j13987J62665k0312r0369j58901j30972q9251q2600j45677
$$ y = [45936, -1069, 162697, 205289, 230936, 214034, -35677, 10741, 335225, 573706, 460456, 446689, 287098, 22411, -62767, 750, 184676, 350019, -52873, 17389, 199722, 83113, -78987, 23360, 13235, 111160, 96792, 56825, 132524, -43051, 154601, 179294, 132902, 150052, 217634, 409980, 314851, -195820, -495894, -438351, -137002, -53486, 44278, 148842, 97219, -76276, -52825, 9459, 239844, 295398, 127568, 322753, 247944, 189430, 79246, 139330, -140495, -141408, -268781, -300042, -91943, 112465, -10693, 26131, 7070, -141489, -3198, 170532, 260010, 102694, 207370, 354512, 302708, 542121, 420981, 162916, 47933, -66054, 96611, 76299, -14070, -172971, -303943, -393194, -475794, -621471]
10889f21471K02730M25766M4599N1365q2751L2181p2483l15186j42874J43951
10879c34173K01773Q4129O6354J9927k6258N757j9790j63877j47034K60347k71
10868e3116K04357L39313R1745j95862k99410p8256k0559n9707j99334L59J19368
10857a51102K8360O6647Q6918J1207j17062j61230J98371R2398j1404J26345L8733
10846B08181P0192j62526j20028R1074j02798L19461l2434j52798j1084n1349
10836E5891q7260j11379K8388O9668J09206J2479p8347L3458j49618N3391j0989
10825g5112k17081R936K94749K17255m3461k16158r0889O8622l1559j40481q6370
10814c10549R2893k7527J35555j61719o3694Q9084K7651k2480P281K6025J10688
$$ y = [-621471, -418741, 7025, 51624, 102989, 20238, 52419, -20064, -335250, -478124, -334173, -132400, -48271, 18083, 38010, 11752, 17509, -2281, -166158, -313192, -52845, -53116, 151241, 490554, 582299, 386437, 87027, 8771, -11788, -71495, -270829, -270470, -151102, -122742, -56095, 30823, 42030, -75032, -236262, -37891, 54507, 43103, 169448, 208181, 278373, 115847, -4181, 86893, -15905, 303556, 271122, 118324, 107240, 55891, -31369, -142748, -114360, -44692, 64514, 76993, -1354, 32104, -117514, -64123, -75112, -292193, -282257, 12492, 229747, 186286, -29872, -120761, -52139, -83698, -224179, -310549, -217656, -245183, -109628, -271347, -335041, -245957, -218306, -240786, -233505, -207480, -96792]
10803i6792r0497j32422O550l2735J71120Q9825j23305M1334J53818P6645J43007
10792B06548Q3265k04453Q299Q9390R2823J4877o1298j84329j47764J28213j15633
10781i0062j51910j78422P2796J92480J27583j91895j00124L00872J58124k45896
10771a06454k16106J2903M2361l2853j64939j5031K813K00455K37792O9625j34382
10760a03816R090P8140J5058l8520J08043J40612m9149l67855J09379J92992J82432
10749B76406L5944p8192J10583J3710R6514l8320j66800j28320r2715j80822R354
10738a42658J22170O8515j923j50187J81525K9054j20050o2292K64381J93274
10728C81809P0715j05404j04029j14222K2502k3200n1654K01376L95518j07697
$$ y = [-96792, -187289, -319711, -313161, -345896, -174776, -84951, -208256, -166922, -13104, 63541, 206548, 289813, 85360, 93659, 183049, 275872, 290749, 229451, 45122, -102642, 25571, -90062, -241972, -420394, -347598, -155118, -27535, -219430, -319554, -18682, 139442, -106454, -322560, -309657, -267296, -300149, -465088, -480119, -477306, -276851, -39059, 30566, -103816, -94726, -16586, -1528, -40048, 67995, 208607, 159458, -208397, -99018, 93974, 276406, 312350, 234158, 344741, 358451, 454965, 416645, 249845, 121525, 28810, -152012, -142658, -20488, 48027, 46104, -104083, 77442, 106496, -13554, -75846, 188535, 381809, 452524, 347120, 243091, 128869, 151371, 128171, 76517, 277893, 673411, 565714]
10718E65714j37836J04641r9128q3367l6685j35677j47272K5907P867j01853K10568
10707A72879J56195l32609M0130K33757j3638J8301j21644l54477J2403J05460
10697h3243o9739r2453o956J14871J21930p6474j88532J15174k6671j41771k016
10686c35880R0272L0838J41717O4594J29458J5934l5348l9003m5124O8258R0896
10675A76612l2198j01455k81521j56628J91475N21325L31002N9897j31718k26288
10665C50503k01674P1174L37209q482k57609l28279k74896r6987M7258K12702
10655a49081J40189K05968j41791n6828K29209j61544j83250J00601M8548N2718
10645H4739m2722p8415j57235K44979M19063K65803r2244o8041j88118l02137
$$ y = [565714, 427878, 532519, 433391, 350024, 313339, 177662, 30390, 56297, 64164, -37689, 172879, 329074, -3535, 36595, 270352, 256714, 275015, 153371, -201106, -188703, -83243, -152982, -245435, -252391, -137520, -15590, -92064, -280596, -165422, -192093, -333864, -335880, -245608, -214770, -73053, -8459, 120999, 136933, 101585, 62582, 17458, 85716, 176612, 144414, 42959, -238562, -395190, -203715, 317610, 648612, 708509, 576791, 350503, 148829, 220003, 557212, 548730, 291121, -37158, -312054, -409041, -361783, -149081, -8892, 197076, 55285, -1543, 227666, 66122, -117128, -16527, 32021, 84739, 42017, -36398, -193633, 51346, 470409, 736212, 643968, 575927, 387809, 85672]
10635H5672l08231r7484n1642J6825J05591J02886O5296p6266j16530m4606P1803
10624b46686P3053r003j33680J04777K72726k1151j99035k0247J58089O8620l8295
10613I168M8819q9550k54664K9814k03343q7028J64862J28834k0273j2777L1498
10602b54640k6933K75298Q6371p2554J22172j11859o7714k14640K34347L6511
10592F359L1501j17075j78250J27271K25862J78104j8500L0902j57030j99135
10582f9991l991j01106j41133j31068M9679L1127K3346q66J26159L6898L5453
10571a45493J17403r230J71509r4827k13419R2587K0630k35058J13471O9088J20142
10560F803o5619N1334J76191P8767l00555P5101L49764N9104j43954k25895o7819
$$ y = [85672, -222559, -320043, -371685, -354860, -249269, -146383, -81087, -157353, -273883, -318489, -246686, -173633, -182636, -316316, -211539, 61187, 40036, -158999, -179246, -21157, 47463, 9168, 57987, -31563, -286227, -256413, -459756, -546784, -381922, -253088, -273361, -286138, -254640, -281573, -6275, 80096, 7542, 129714, 17855, -49859, -264499, -30152, 6359, 37860, -79215, -257465, -130194, 95668, 273772, 255272, 286174, 129144, -69991, -73982, -175088, -316221, -447289, -397610, -366483, -343137, -344003, -217844, -180946, -145493, -28090, -37320, 134189, 39362, -174057, -81470, -60840, -295898, -182427, -113339, 6803, -58816, -7482, 168709, 247476, -53079, 22022, 371786, 430890, 286936, 61041, -6778]
10549f778j7850j78184N510J82455L0930r1482Q4025J5923N2303K76301j10271
10538B42882m22940L7561K66207R1295R027j96111k19529m5620L36o2068J13320
10527a85640L30693K6736P0700k28839k04739p4779J63427K61130O3806j37216
10517H5279j45696l8803L3482J00904k98155l7865K78283L70752L4325J73K47129
10506F29808M4249l58719k18248P8884K71992k7926r5930p4636J6402J77759P7223
10495E20858J83027j10555k30214j67115j93539Q8075k9203l15105R454R2582
10485a51735J74927K14255K92104j50506m86648k22152j17025L06087J27045J65060
10475A51412n3667j19498M6575M22885o277L8769O2788l00631k55125J19866J43084
$$ y = [-6778, -24628, -202812, -197302, -14847, 16083, -75399, 8626, 24549, 76852, 353153, 242882, -180058, -142497, 123710, 215005, 224032, 27921, -191608, -237228, -236892, -298960, -185640, 145053, 171789, 242489, 13650, -191089, -265868, -102441, 158689, 222495, 85279, -60417, -99220, -65738, 35166, -262989, -300854, -22571, 348181, 382506, 382679, 629808, 674057, 315338, 97090, 175974, 447966, 420040, 324110, 249474, 265876, 443635, 520858, 703885, 593330, 363116, 196001, 2462, 90537, 61334, -253771, -244317, -151735, 23192, 237447, 529551, 379045, -107603, -329755, -446780, -140693, -13648, 151412, 97745, -21753, 24822, 447707, 441430, 480199, 542987, 242356, -12769, 107097, 250181]
10464B50181J51484q2362r1293j02326n5564j76893n0508K95906L56292k4008
10454D70909j33778J64318J61525k55567j22624K2942J12106J09768j88830j64593
10444A76176J1682P4317p1249j39362J48836K48938k14688j83438J33488l592
10434A81108l1403L9459N0565J70380J45218j67336j46219j63494k2443J73168
10424B29003K37941J94254J21358j64544n3660J27391J15260R4706j86130p9318
10414F36261R0265r3565k35031j69810n9367n097M4027j52525j43026O6953N0853
10403B9938J77701j26390J84399j54405J6968J37331J93886m0624j96294j9531
10393B02979J53117j20548o7566k3737Q3731p8304J18883l0998j98326r4086q1076
$$ y = [250181, 401665, 319303, 228010, 125684, 70120, -106773, -157281, 138625, 494917, 470909, 337131, 501449, 662974, 407407, 284783, 307725, 419831, 529599, 340769, 176176, 187858, 262175, 190926, 51564, 200400, 449338, 234650, 51212, 184700, 181108, 149705, 189164, 239729, 410109, 555327, 387991, 241772, 78278, 55835, 229003, 466944, 661198, 782556, 618012, 564352, 691743, 807003, 901709, 715579, 636261, 726526, 632961, 397930, 228120, 168753, 163656, 207683, 55158, -87868, -20915, 29938, 207639, 81249, 265648, 111243, 128211, 265542, 459428, 418804, 222510, 202979, 356096, 235548, 167982, 144245, 227976, 149672, 268555, 237557, 39231, -54855, -135931]
10382a35931m8095m2487r420J67759K59926K6183K14935J27839j5388l22473j41635
10371H1213j4340N24P0668J20808l7858J6954j23184n5639j00367q5686K18921
10360I2014J85529L2962j9670R6835k29525j81984J90463R0918k86192J66198
10350A37548R9781k03336j07813j11634J57208K00491J39123K23850J29456j68935
10340D95739j81473l19282m6251K96064J08400J38854r7242k86339L1086K94618
10330D34174l8980j64258n1344K2257K31765j4906J1481l4304J03276J8709k68786
10319B49084l05578J50279K57777K19957k10931j1749J61568o2453J6610J56611
10309F21175R6474j52251j47344k45719j88977P4651R8063J60377N9837J52910
$$ y = [-135931, -184026, -226513, -235933, -68174, 191752, 217935, 432870, 560709, 545321, 222848, 81213, 66873, 67397, 138065, 258873, 221015, 237969, 114785, 59146, -41221, -126907, 92014, 277543, 310505, 290835, 387670, 158145, -23839, 166624, 257542, -28650, 137548, 237329, 33993, -73820, -185454, -28246, 172245, 311368, 535218, 664674, 495739, 314266, -5016, -51267, 244797, 353197, 492051, 394809, 108470, 139556, 434174, 395194, 230936, 179592, 201849, 433614, 418708, 430189, 395885, 499161, 517870, 249084, -56494, 93785, 351562, 571519, 360588, 348839, 510407, 447954, 464564, 621175, 717649, 565398, 418054, 172335, -16642, 58009, 156072, 316449, 376286, 529196]
10299E29196p6754k4533q812N6031Q9425J42976k54616q3372o6651j74919O8422
10288A96393Q3426J55210j07872l60379j15891J22472K21441K07939p9164k96695
10278B6880j08660J71445J72307J33751p5114j43354j71123J32269L18088k4975
10268D31514j56739M0140L6449q104K06120K58783J75553j26331j80461j61798
10258E15126j46404j92891l89082j7404P5071J08929J05762Q3852j9578J93723
10248C17104m965o1861p601o9253j79568K26405P949k8185j79875j67871n6589
10237b04310J24953K40162M1226J37487o9426l19467n1977K31197P2516O3249
10227B65610N1180j4205k55501K129L19702K68146p6450j9312J08101K8345j1742
$$ y = [529196, 452442, 427909, 419097, 475128, 564553, 707529, 452913, 369541, 302890, 127971, 196393, 279819, 435029, 327157, -33222, -149113, -26641, 194800, 402739, 323575, 26880, -81780, 89665, 261972, 395723, 320609, 177255, 6132, 138401, 456489, 431514, 274775, 314915, 351364, 343260, 549380, 808163, 983716, 857385, 676924, 515126, 368722, 175831, -213251, -230655, -155584, -46655, 59107, 142959, 123381, 317104, 312139, 250278, 242677, 173424, -6144, 220261, 228210, 200025, 20150, -147721, -204310, -79357, 160805, 202031, 339518, 270092, -49375, -101352, 129845, 202361, 265610, 316790, 302585, 47084, 49213, 368915, 637061, 560611, 541299, 649400, 677745, 666003]
10216F66003j65442j68678k19861j30488R2306o709j6817L57318Q0321j31647
10206C56306k17542j19339k5807k11472j1869K66780n1088j53435P6464L6103
10196e4899J46886J49026J6535R3309O6508j45750k98081j57309m0735l1457K7707
10185b28260R6570Q2335k23337J35397K21735K01772o2550k33304k19620J78290
10175e0972J57943J36626K14510K741j87051k3935j91445j38542J35677M0930
10165I6482J89096j06376k09544l4253J63643J09656k0568p9754o4481r9436p7845
10154a33380K39830J298l169J1747J50591J67683J45395K55j87071k01667J46582
10143C38094j51257j5405K5827q8554k6167Q0331J20386k7136j06100J45191K42625
$$ y = [666003, 500561, 331883, 112022, -18466, 73840, 67131, 50314, 407632, 487953, 356306, 138764, 19425, -6382, -217854, -229723, 37057, -14031, -167466, -91002, -54899, 91987, 241013, 257548, 350857, 417365, 271615, -26466, -183775, -224510, -255967, -228260, -131690, -49355, -272692, -137295, 84440, 286212, 223662, -9642, -229262, -50972, 106971, 243597, 458107, 460848, 273797, 249862, 58417, -80125, 55552, 96482, 285578, 179202, -30342, -64595, 99048, 208704, 188136, 108382, 43901, -55535, -133380, 106450, 107748, 104579, 116326, 266917, 434600, 579995, 580250, 393179, 191512, 338094, 186837, 171432, 197259, 108705, 82538, 162869, 283255, 256119, 150019, 295210, 537835]
10132E37835p9116j76645R7728P5264k31266j71297M2469j61461k30808J57149
10122a40148J4633o7353k1921J9120L43990K68671j20649j96441L7720J02786
10112B40408J71976K7594r4371l52030k07J02811l8816j414L3082J90693l6125
10101B43601J6007Q3344j16848j40195j19045l6040J54315K7067q5321o9143j23100
10090a65358k702K99629k7454k8013P7053J63108O1049m2611K4933n3452j28094
10079A78088J08287l8155J11611M4899J27007j0130j39846k16916l01172K42228
10069A05901J7307p6066j34893J68090K67088P7605j88030j58799M62L53142K91460
10058G23267O3380o6161k433m2738Q6424m7908j06736J72998L96127M92409J140970
$$ y = [537835, 458719, 282074, 379802, 455066, 223800, 52503, 94972, -66489, -297297, -140148, -125515, -192868, -214789, -195669, 148321, 416992, 296343, 99902, 137622, 240408, 412384, 439978, 345607, -6423, -6630, 96181, 57365, 55951, 89033, 279726, 243601, 259608, 342952, 226104, 85909, -33136, -69176, 85139, 112206, 26885, -42258, -165358, -168060, 131569, 104115, 76102, 153155, 316263, 377312, 334701, 359634, 306182, 178088, 286375, 248220, 359831, 404730, 531737, 521607, 381761, 164845, -136327, 105901, 123208, 47142, -87751, 80339, 347427, 425032, 237002, 78203, 78665, 431807, 723267, 786647, 720486, 718053, 675315, 761739, 713831, 607095, 780093, 1176220, 1668629, 2809599]
10047B809599K184481K047222J170517P60754J750403K91716l139292k876885
10039D998515j512239p19641n16840k97681n91829j52594l0732J9866r4376k43316
10029H59133k0052N6075m5675N1761j46134k00708j34977q7677q9222R9155J92013
10018E33692Q8622p9490N6342P1731J5118j645j50678r4381L3393r133J00237
10007E63808J08288J15092L7195q94J15997j41477l25565J17259J68648l5348
9997G23003p9710O1062K39171o6465l05093k65373J34282j23490m0103p8305P1127
9986B70106K87994J79355j02015l07755j13568J54010J65758K9713M6277j50023
9976D59852J53246m5039j34327N2028j34715j04027k8585l1489o2519K928K2779
$$ y = [2809599, 4994080, 7041302, 8211819, 8972573, 10722976, 11014692, 7875400, 4998515, 3486276, 2766635, 2249795, 1952114, 1360285, 1207691, 1176959, 1196825, 1102449, 859133, 839081, 895156, 849481, 901242, 755108, 554400, 419423, 331746, 242524, 341679, 533692, 622314, 542824, 599166, 670897, 686015, 684370, 533692, 439311, 472704, 463571, 563808, 672096, 787188, 824383, 823489, 939486, 798009, 472444, 589703, 758351, 723003, 643293, 704355, 943526, 877061, 571968, 306595, 440877, 317387, 277284, 198979, 270106, 558100, 737455, 635440, 327685, 214117, 368127, 533885, 563598, 609875, 459852, 613098, 568059, 433732, 485760, 351045, 247018, 218433, 186944, 124425, 127353, 150132]
9965A50132M2287J06307N2039j2440n3305n5604k22259j37598M16144K58762J02055
9954F46520k05867k2613J06219j62347J8699j23509K5829O1114J82605J72280
9944F98930J22093k54818j32012M5821m2856j29618J89467K43739R1737j07492
9934G24991k71960l27914j46910J76403m9873j5071N1047l1508K66109J41919
9924E17233k94848j23913l7115M0893j2295r9611k6427p8206J27950J69421K17828
9913D00910j51739j20116J49422M5863o4606K838J9081l9791r7606n5315K71608
9902C60549J72891Q0928r0566L5384R1145j44801k57163m3668K11810J77677j43416
9891D50770j9718q1479O0767j76089j15354J04245J24582L2802P4262l3416O4298
$$ y = [150132, 192419, 298726, 350765, 338325, 285020, 229416, 7157, -130441, 285703, 544465, 646520, 440653, 418040, 524259, 361912, 380611, 257102, 282931, 344045, 526650, 698930, 821023, 566205, 434193, 480014, 437158, 307540, 497007, 740746, 832483, 724991, 453031, 125117, -21793, 154610, 104737, 89666, 140713, 109205, 375314, 517233, 222385, 98472, 61357, 102250, 89955, -9656, -36083, -114289, 13661, 183082, 400910, 249171, 129055, 278477, 324340, 259734, 262572, 281653, 241862, 144256, 88941, 360549, 533440, 614368, 523802, 559186, 650331, 505530, 248367, 204699, 416509, 594186, 450770, 431052, 349573, 410340, 234251, 118897, 223142, 347724, 380526, 454788, 421372, 485670]
9880D85670p7572p8125k31158j18880K41877L05756J49611n1394j43883M9997
9870E31899J72894j40356j94078j93067R9330J66183k3560J45961Q3843l3181
9860F15868j60951N6522M5572j53394R0861J29872j90279j31875L31469K66579
9850I00244L0397l56864k27272O0993N7323q5504K7522O5305M9499k18595P5536
9839C78584J53475N781J9506Q7241R7230p0062j15284j3644j08010k0155j2075
9828D02587J19883J16824p718L5516j22187k05051l2900Q1301J47434j52179j30706
9817B52804L7274p1491K5321M4263J99366j55671p6504n4066j80027J42742K4995
9806A89006k66804R4426K736K79298K16207J75464l7518m02749m8696J51655J37638
$$ y = [485670, 408098, 329973, 98815, -20065, 221812, 527568, 677179, 625785, 481902, 531899, 704793, 564437, 370359, 177292, 276622, 442805, 419245, 565206, 649049, 615868, 454917, 511439, 557011, 403617, 494478, 624350, 434071, 302196, 633665, 900244, 930641, 573777, 346505, 407498, 464821, 379317, 406839, 472144, 521643, 303048, 378584, 532059, 537840, 557346, 644587, 741817, 671755, 556471, 542827, 434817, 414662, 402587, 522470, 639294, 631576, 667092, 544905, 339854, 306954, 388255, 535689, 383510, 252804, 290078, 218587, 243908, 288171, 487537, 331866, 255362, 201296, 21269, 164011, 189006, -77798, 16628, 19364, 298662, 514869, 690333, 652815, 250066, 201370, 353025, 490663]
9795D90663q3311p3380j09032m9177K74313J98054J32984m172r0917j93349L5527
9784E28203J12584J86724J20328l5464n15841M6576K48801r1639m3926R9522o5385
9773E90483l3470M6299j00586Q3608K58027J06414k98971o7817K07299k17089
9763E74197l41545J19849m3139k22387J4196M9672J18727J11009J6314K8606J39908
9752E65407m3445M4396M736K0591j17238m18787l5047K70159L34863J63248J76469
9741I65352j58972p7058J30747p2012k15055l17717k03615L5776j7906J81144
9731B50684L57327J60531q5297k04870j35664K68759J61608J7882l5096n3973
9721G01891r0262l7881M9834k81190n5045P4117K96609R4761k32959j45626l2564
$$ y = [490663, 407352, 333972, 224940, 175763, 450076, 648130, 781114, 776942, 686025, 492676, 528203, 640787, 827511, 947839, 912375, 396534, 443110, 691911, 600272, 556346, 655868, 590483, 557013, 603312, 502726, 586334, 844361, 950775, 651804, 583987, 791286, 574197, 232652, 352501, 309362, 86975, 101171, 150843, 269570, 380579, 396893, 425499, 565407, 521962, 566358, 571094, 591685, 474447, 55660, 20613, 290772, 625635, 788883, 965352, 806380, 729322, 860069, 788057, 573002, 255285, 51670, 87446, 69540, 250684, 608011, 768542, 683245, 478375, 342711, 611470, 773078, 790960, 755864, 701891, 611629, 573748, 623582, 342392, 287347, 361464, 658073, 752834, 519875, 374249, 341685]
9710C41685J49751L3941O1251k1515k06951J59526j3353l7158K9351l41964K0082
9699A74646J2244j26765k070r283J32159q6150K38960K86734P1598j3386j45209
9688E33478j53015k46713j5889K03543R8888K88884J75587k21913l39076r6368
9678B27406P1147M45030L9272N9632k30254k88508L23919j0672J60304n4621q3545
9667F59110j60533K62788J97810n0686j48896j61424J36396m8369j28139k8610
9657E29447o0608J42377K15128r3510L6018q5704j28394J23007q2205M7455n8106
9646E84905K4339L23865P1069j88187O840J36331j24450j09614J5651R8141R9435
9635I38325k06245R8319R1461n4210j54763p9180m9744l204J43143p9670J42815
$$ y = [341685, 491436, 525377, 586628, 565113, 358162, 517688, 504335, 467177, 496528, 154564, 174646, 186890, 60125, 58055, 48772, 180931, 94781, 333741, 620475, 692073, 678687, 533478, 380463, 133750, 117861, 321404, 420292, 709176, 884763, 662850, 323774, 227406, 298553, 743583, 782855, 842487, 612233, 323725, 647644, 636972, 797276, 742655, 659110, 498577, 761365, 959175, 908489, 759593, 598169, 734565, 686196, 558057, 529447, 468839, 611216, 826344, 732834, 768852, 683148, 554754, 677761, 595556, 643011, 584905, 609244, 933109, 1004178, 815991, 822831, 959162, 834712, 725098, 740749, 838890, 938325, 732080, 830399, 921860, 867650, 712887, 633707, 583963, 580759, 723902, 644232, 787047]
9624G87047k397p0906K2768l5295J21662K5523L2979J7171o6881J18685J67589
9613A117945J9230p3454P5689l23052j56033j5802Q3396O5804L7724j221J02145
9602I32371K22830K44422l44919j72061P2806l9149K14573J45345j65905j13903
9592I96410k20781o1974J92985J60672k04572l04703J82134L3904l8688J36857
9582H72244R5941Q7829J01528j17598n8753N4424Q2882O2024Q5011k56197j55448
9571H53887j52452l019K74988L22347p5059j1504j41705r4712J20875j14188J6584
9560I96042m7082J19330J09035j59015j4955K0778J43922j28747o477J62237j5574
9549A179494j54497j82637m9695K39660L19920L8503L9363O079R2612r3073j65505
$$ y = [787047, 784650, 713744, 736512, 701217, 822879, 848402, 881381, 898552, 831671, 950356, 1117945, 1137175, 1063721, 1139410, 816358, 660325, 644523, 727919, 793723, 831447, 830226, 932371, 1155201, 1399623, 1054704, 882643, 955449, 916300, 1130873, 1276218, 1110313, 996410, 775629, 713655, 906640, 1067312, 862740, 558037, 740171, 774075, 735387, 872244, 968185, 1056014, 1157542, 1039944, 981191, 1035615, 1118497, 1180521, 1265532, 1009335, 853887, 701435, 698416, 973404, 1295751, 1220692, 1209188, 1067483, 972771, 1093646, 979458, 996042, 948960, 1068290, 1177325, 1018310, 1003355, 1024133, 1168055, 1039308, 1032831, 1195068, 1179494, 1024997, 842360, 792665, 1032325, 1352245, 1390748, 1430111, 1436190, 1528802, 1435729, 1270224]
9538A270224r617l7997j6880j4087j56888P1359Q0327j24541O3078J73289L7829
9527A336096j22173J2863R4728J31592j09863k03714j70862J61575N3797L5608
9517A219647m1973j32249n9065J61890M21042J35399j44307j99410j04894r0780
9507A165300K37554L84627J68232j10163j1747j70954j44975N3860J81241M7169
9497A800144o9638j75751J76627J10134n9350q3847m5134L6166K4259J31427K95584
9486B140621q2053k01715q8758J2454O7626K73217j9850K65330K08760j8273J3955
9475B571314j50536r7889j44146j56475J07781J90297j16569j73707L690K06393
9465B240153k5635J82329J11283k28675m6800J20056l6723j52574m1902o2421
$$ y = [1270224, 1260607, 1222610, 1205730, 1191643, 1034755, 1106114, 1186441, 1061900, 1124978, 1298267, 1336096, 1213923, 1226786, 1321514, 1453106, 1343243, 1139529, 968667, 1130242, 1184039, 1219647, 1177674, 1045425, 986360, 1148250, 1569292, 1704691, 1560384, 1360974, 1256080, 1165300, 1402854, 1787481, 1955713, 1845550, 1833803, 1662849, 1517874, 1571734, 1752975, 1800144, 1730506, 1554755, 1731382, 1841516, 1782166, 1698319, 1653185, 1689351, 1713610, 1845037, 2140621, 2058568, 1856853, 1768095, 1780549, 1848175, 2121392, 2101542, 2366872, 2575632, 2557359, 2571314, 2420778, 2322889, 2178743, 2022268, 2130049, 2320346, 2203777, 2030070, 2033760, 2240153, 2214518, 2396847, 2508130, 2279455, 2232655, 2352711, 2315988, 2163414, 2121512, 2059091]
9455B059091p3955j00977j93074m8979K27481J51966J9111J2492m2858j15723
9445A894575k55969J5339j90123J825K56640j10186K10644K51322j00744L833
9435A977156R954o0747J43354K00753m2283k51654j52671l37120P901p2397j605
9424A420641J9706R6720N5180J2178O0341J72626k2580k11324q4961j82817Q9803
9413A425513K09084k0014N8066j73114p0975K49104Q0227J94789Q6968J72917
9403B212565j42229l57776J41536J03209m2063j3689m3363j36836o1943K15110
9393A874521Q6320n3870k25937o9389K84376l7685j66636N656K3815j34459J68582
9382A755294l14771k29705O70J35342k0935K19984J89868j35042l4022Q1172Q6973
$$ y = [2059091, 1985136, 1884159, 1691085, 1642106, 1869587, 2021553, 2040664, 2053156, 2010298, 1894575, 1638606, 1653945, 1463822, 1465647, 1722287, 1612101, 1822745, 2074067, 1973323, 1977156, 1987110, 1926363, 2069717, 2270470, 2228187, 1976533, 1823862, 1486742, 1494643, 1422246, 1420641, 1440347, 1537067, 1592247, 1604425, 1664766, 1837392, 1814812, 1603488, 1518527, 1335710, 1425513, 1634597, 1614583, 1672649, 1499535, 1428560, 1677664, 1757891, 1952680, 2039648, 2212565, 2070336, 1712560, 1854096, 1957305, 1915242, 1901553, 1858190, 1721354, 1659411, 1874521, 1960841, 1906971, 1681034, 1611645, 1896021, 1858336, 1691700, 1697356, 1721171, 1586712, 1755294, 1440523, 1210818, 1211488, 1346830, 1325895, 1545879, 1735747, 1600705, 1566683, 1647855, 1734828]
9371A734828r2626J55839L85231J43769l39406n6431L6665q1161j48777j15927
9361A622004K8192l800j15261N9048P1989p4334J61839K7854N0332J31303K54091
9350B213257j38263l43333P0383J82878N1879K08086Q6612J51303J01711n8388
9340B526125k30170o3605j22195k07980J32122L03581J96430O1260j52364j95782
9330B247422J4063k6453J94977j47878N6658n5733j51198O3747J47540J4512j0429
9319B347228j05860j88544K22173L04454j1781m0141p6504j41218K2260j67942
9309B164125J17860N2751j7817k67816O6788Q831j9177K13301J55804L7965j86674
9298B325941M3655l6409p6631j02826K1678J69735J40658O6722K7999K30767K18595
$$ y = [1734828, 1642202, 1798041, 2183272, 2327041, 1987635, 1931204, 1967869, 1886708, 1737931, 1622004, 1650196, 1646396, 1531135, 1590183, 1662172, 1587838, 1749677, 1777531, 1827863, 1959166, 2213257, 2074994, 1731661, 1802044, 1984922, 2036801, 2244887, 2331499, 2482802, 2584513, 2526125, 2295955, 2232350, 2110155, 1902175, 2034297, 2337878, 2534308, 2595568, 2443204, 2247422, 2261485, 2235032, 2430009, 2282131, 2338789, 2283056, 2131858, 2195605, 2343145, 2357657, 2347228, 2241368, 2052824, 2274997, 2579451, 2567670, 2527529, 2451025, 2309807, 2332067, 2164125, 2281985, 2334736, 2316919, 2049103, 2115891, 2124722, 2105545, 2318846, 2474650, 2512615, 2325941, 2369596, 2333187, 2256556, 2153730, 2175408, 2345143, 2485801, 2552523, 2580522, 2811289, 3029884]
9287C029884m2406j61152j4408j67635j7392J00696l2264l4450j43761L9847l2505
9276B524454J66244p6396j41865M0202K85580r2043k35838j19858J80683o3095
9266B468068P227K11368j41346O6109L6863o7333l9069P8873r4933j69107k6474
9255B330246R4781m7427j32068k4783R1866k8679j19079N3712N2164n5684K78108
9244B493157L42970j5804L06910k16371l01535L4331Q1878q2417k60281J00434
9234B483272R8695Q5168m0654J06448j40233j57106L5208K1691J40311q2139p1540
9223B479121J59975n5546N9366j62708K4675o8899J01301K64151r2695l5766r0586
9212B582389q9086K03899K20757j549j84114j17359J4866R7617K73987K83512
$$ y = [3029884, 2987478, 2826326, 2811918, 2644283, 2626891, 2727587, 2695323, 2660873, 2517112, 2556959, 2524454, 2690698, 2614302, 2472437, 2512639, 2798219, 2706176, 2470338, 2350480, 2531163, 2468068, 2475295, 2686663, 2545317, 2611426, 2648289, 2580956, 2541887, 2620760, 2525827, 2356720, 2330246, 2425027, 2377600, 2245532, 2220749, 2312615, 2283936, 2164857, 2218569, 2270733, 2215049, 2493157, 2836127, 2820323, 3127233, 2910862, 2609327, 2643658, 2725536, 2643119, 2382838, 2483272, 2581967, 2667135, 2626481, 2732929, 2592696, 2435590, 2470798, 2492489, 2632800, 2550661, 2479121, 2639096, 2583550, 2642916, 2480208, 2504883, 2435984, 2537285, 2801436, 2708741, 2672975, 2582389, 2493303, 2697202, 2917959, 2916410, 2732296, 2614937, 2629803, 2727420, 3001407, 3284919]
9202C284919k37266o0310j0726j48620o7656J2759J76661k02368p5695J31423
9192B803121N6013k74605l9938J13232L64460K0517j10121j94238L9809N9560
9182B837810j83643k51187J41545J47782K01779J10985J03982o7574j48293k16589
9172B676597m2784J06097J40503Q1977J96366P2269q8189j65343k2318l40682
9162B614493j83757L79570L87505p7031j32486j03450k78123M8437o9407R7465
9152B683216j74720j40518O7071L2984j99337J16618l4676j27047m2639J55907
9142B336859K50089N1804m8158k58857M465J02014o8225j17893m3554J34508j16491
9131B226561K17436j86172j49542J33031J18942P0843j65610K4944J19699J38260
$$ y = [3284919, 3047653, 2987343, 2976617, 2827997, 2760341, 2773100, 2949761, 2747393, 2671698, 2803121, 2859134, 2584529, 2544591, 2657823, 3022283, 3042800, 2932679, 2738441, 2778250, 2837810, 2654167, 2402980, 2544525, 2692307, 2894086, 3005071, 3109053, 3041479, 2893186, 2676597, 2633813, 2739910, 2880413, 2962390, 3158756, 3231025, 3142836, 2977493, 2955175, 2614493, 2430736, 2810306, 3197811, 3120780, 2988294, 2884844, 2606721, 2655158, 2585751, 2683216, 2508496, 2367978, 2435049, 2468033, 2268696, 2385314, 2350638, 2223591, 2180952, 2336859, 2586948, 2638752, 2590594, 2331737, 2336202, 2438216, 2369991, 2252098, 2208544, 2343052, 2226561, 2443997, 2257825, 2108283, 2241314, 2360256, 2431099, 2265489, 2290433, 2410132, 2548392]
9121B548392r3588J15957J91528o8141l52678N5026M94j90135m4173n1366P7113
9110B188429J90052j5115m5179j12322J68454j58679j77219K7318j7299J29423
9100B177863j02775L2707m137j65862m8693j7165J95729N3989K02797n7958k54303
9089B012192j01202q8015R824n2441m1441j4686J84175J04303J7059j24462j6709
9078A888597k2418m1583m836J35171j68275j84274J01980N9680K55271O3909l4869
9067B048353q0740K1880l4546K1278O4201j67162J5113k8099k10460q9289M6690
9056A607219j75320K51971J63508J08114r9185Q1050J85432r0140K3415j20705
9046A935359r7064l6466J25622k37452J07045N175r4421J270o0007J51756R3038
$$ y = [2548392, 2454804, 2570761, 2762289, 2694148, 2341470, 2396496, 2396990, 2206855, 2162682, 2111316, 2188429, 2378481, 2363366, 2318187, 2205865, 2374319, 2215640, 2038421, 2065739, 2048440, 2177863, 2075088, 2107795, 2103658, 1937796, 1889103, 1871938, 2067667, 2121656, 2324453, 2266495, 2012192, 1910990, 1822975, 1832799, 1780358, 1738917, 1724231, 1908406, 2012709, 2029768, 1905306, 1888597, 1866179, 1824596, 1819760, 1954931, 1786656, 1602382, 1704362, 1764042, 2019313, 2083222, 2048353, 1967613, 1989493, 1954947, 1976225, 2040426, 1873264, 1888377, 1860278, 1649818, 1560529, 1607219, 1431899, 1683870, 1847378, 1955492, 1856307, 1937357, 2122789, 2032649, 2056064, 1935359, 1838295, 1801829, 1927451, 1689999, 1797044, 1802219, 1707798, 1709068, 1649061, 1800817, 1893855]
9035A893855J58561j1585p9538n0147l17388O5601L05947N2991J63612J50484
9025B332393k87302j69756l04301l05122k5369j71302j00299J50685L49648p105
9015A462170j27116j92710l0555L6057j2170N8730J3735K01020j01987j10710
9005A196464K24418K25650j34929k8509J48468j50997j87198O8426K25787q1344
8995A506236K3380K02747j62245l78062m1603L6450p7159m8812J39911K74546
8985A475389j4896k60380j89542Q4541J95051J6548j81827k17681J3854q4587
8975H36470P5459K08288O0811J84956j21885k21203q25K28772k3298j12264J70536
8964A285817J12608r1684K3598K6839Q9921j56084o8215R4616K1282j69131k12110
$$ y = [1893855, 2052416, 2040831, 1961293, 1911146, 1593758, 1659359, 1965306, 2018297, 2181909, 2332393, 2045091, 1875335, 1571034, 1265912, 1240543, 1069241, 968942, 1119627, 1469275, 1462170, 1335054, 1142344, 1111789, 1147846, 1135676, 1194406, 1208141, 1409161, 1307174, 1196464, 1420882, 1646532, 1511603, 1483094, 1631562, 1480565, 1293367, 1361793, 1587580, 1506236, 1529616, 1732363, 1570118, 1192056, 1150453, 1186903, 1109744, 1060932, 1200843, 1475389, 1460493, 1200113, 1010571, 1095112, 1290163, 1306711, 1124884, 907203, 921057, 836470, 911929, 1120217, 1181028, 1365984, 1244099, 1022896, 1022071, 1250843, 1227545, 1115281, 1285817, 1398425, 1306741, 1330339, 1357178, 1447099, 1291015, 1222800, 1317416, 1338698, 1169567, 957457]
8953I57457J39066k0638l024J8773q8951n4507L27904K3222k09693o1686K1308
8942A049231j96023J73409j75480k0262P5398J57047j54166j25711R1764K2953
8932H98160l9494J20120K50853J74684k43499j68367J11462K61195r8954J88j91049
8921A075299n5294K3828Q6927k3766J23705m5070K62744P900k65327o4508j44483
8910I81955o962O0457J10407m8297P5255P1734R8556J86999K95497n2937j76719
8899A595945k51209k85802J1127M958k8118K6908r7214q1218M9497J26552J26636
8888A198062J98983k9244l18852k08878M4909p5565j07551N2458J01004J30069
8878I85395n745n90J04942N0948k24027P4180J52855k15467l1178K10751J69334
$$ y = [957457, 1096523, 1075885, 1072861, 1091634, 1002683, 948176, 1276080, 1299302, 1089609, 1027923, 1049231, 853208, 1026617, 851137, 830875, 906273, 1063320, 909154, 783443, 875207, 898160, 858666, 978786, 1229639, 1404323, 1160824, 992457, 1103919, 1365114, 1266160, 1266348, 1075299, 1020005, 1043833, 1130760, 1106994, 1230699, 1185629, 1448373, 1456273, 1190946, 1126438, 981955, 974993, 1035450, 1145857, 1097560, 1172815, 1244549, 1343105, 1530104, 1825601, 1772664, 1595945, 1344736, 1058934, 1070061, 1075019, 1046901, 1073809, 976595, 895377, 944874, 1071426, 1198062, 1397045, 1367801, 1048949, 840071, 884980, 809415, 701864, 754322, 855326, 985395, 979650, 979060, 1084002, 1134950, 910923, 985103, 1137958, 922491, 891313, 1102064, 1271398]
8867A271398K93124q323r610k30646k07667N6815M69949M53639K40506O0352J01135
8856B490672L33051J43701j32436n34488k80270o5738j41494j18375k12748j54892
8846A326983n8323N0173K68259J06212m61349k27294J80349J34875j07570k38430
8836I73885J10637J04377r1742R3212O7437q6020Q4349J09388n6804o8863J54930
8825A394786j8718j99220j05348j09404Q7649N179J32507R8966l87710j29861
8815G68826Q8415J2153j47485j70345L1339K14927K76748J21461o2505l43738
8805G89796j16893j79284N8956j76986r2027L8218Q0166J01613K68955q0162K08038
8794I00390J16101j48940Q9224k25758O4375J66518k6265k0977q1485j63546R4324
$$ y = [1271398, 1564522, 1556199, 1546589, 1315943, 1108276, 1165091, 1635040, 2088679, 2329185, 2389537, 2490672, 2823723, 2967424, 2834988, 2300500, 2020230, 1954492, 1812998, 1694623, 1481875, 1326983, 1268660, 1318833, 1587092, 1693304, 1231955, 1004661, 1185010, 1319885, 1212315, 973885, 1084522, 1188899, 1097157, 1190369, 1257806, 1171786, 1256135, 1365523, 1308719, 1239856, 1394786, 1376068, 1176848, 1071500, 962096, 1049745, 1054924, 1187431, 1286397, 898687, 768826, 857241, 869394, 721909, 551564, 582903, 797830, 1074578, 1196039, 1133534, 789796, 672903, 493619, 552575, 375589, 283562, 321780, 401946, 503559, 772514, 692352, 900390, 1016491, 867551, 956775, 731017, 795392, 961910, 935645, 914668, 833183, 669637, 763961]
8783G63961J07206r2112m29532o2728K00009K16230J7147j21730J08791K14759
8773I22001R7182r8926j47426j59605O6201m7516P4274o1571j87891o7156J43429
8762E32996R668J05922k0732J88804k58969j46351M1978j08417J70170O4767q8195
8751D91641N5256n7276k69298L1208L8028j35985J11616M75718K45122j70834
8741H15196j48887N7939M4581k82839j67781J53685j1653k1648J99152L10349
8731I48094N01m7048q9729k26903j38896l5507j55059J66370K43778n6620j14539
8720D94442O6024P0332j50130J5202P4346K28306J55106j73222k06124J86819
8710G61101q3985K9390M8695j56620m5803J15460J12491L5434J03905J39998q5187
$$ y = [763961, 871167, 779055, 349523, 286795, 486804, 703034, 720181, 598451, 707242, 922001, 1019183, 920257, 772831, 613226, 679427, 631911, 706185, 644614, 456723, 389567, 532996, 542664, 648586, 627854, 816658, 557689, 411338, 453316, 344899, 515069, 579836, 491641, 546897, 489621, 220323, 251531, 289559, 153574, 265190, 740908, 986030, 815196, 666309, 724248, 768829, 485990, 318209, 471894, 460241, 438593, 637745, 948094, 948595, 901547, 811818, 584915, 446019, 410512, 255453, 421823, 665601, 608981, 494442, 560466, 630798, 480668, 495870, 570216, 798522, 953628, 780406, 574282, 761101, 677116, 706506, 755201, 598581, 552778, 668238, 780729, 816163, 920068, 1060066, 974879]
8699I74879k95565k7933O3044J12627J11086k20895j21615J0651K5060L8320M8314
8688G17973j10031r7475j5449L8120k00314J14812J93734j18587K351l5537j62579
8677C27018j10112j02593m3471N9691K41124M14996j59513j26472M0600P5908
8667F17176m4948K69621M71573l5614k10130l46722j91251Q6897P9991j28898
8657E67695J9633K30033K02726j72353j51177K14134P0343j7901j10714j6854
8647H35565p6656R819K2648Q2104l1099m13731N4103J26458J12409J64706J24963
8636A011289j33923n9409l5678O0909R2894J00961N4950j30368j80146n6926Q3010
8625H07563J0554M6755l49794O0514K03191K3114j48688P1032R492n4338K2724
$$ y = [974879, 679314, 651381, 714425, 827052, 938138, 717243, 595628, 606279, 631339, 669659, 717973, 607942, 510467, 495018, 533138, 332824, 447636, 641370, 522783, 525134, 489597, 327018, 216906, 114313, 70842, 130533, 371657, 786653, 627140, 500668, 541268, 617176, 572228, 841849, 1313422, 1277808, 1067678, 720956, 529705, 616602, 696593, 567695, 587328, 817361, 1020087, 847734, 696557, 910691, 981034, 963133, 852419, 835565, 758909, 768728, 791376, 873480, 842381, 428650, 482753, 609211, 721620, 886326, 1011289, 877366, 817957, 782279, 843188, 936082, 1037043, 1091993, 961625, 781479, 724553, 807563, 818117, 864872, 515078, 575592, 778783, 801897, 653209, 724241, 733733, 679395, 702119]
8614G02119j04422P7500R8771j4646J95058r1858J6856O3130K43874Q2079J1387
8603A279848o5833N0967k0291j32512r9865j0952n2399r3662J54306L03377l6747
8592A276237j13543K16417J28755p08j87181j66987J06588r8104L54318M6395
8582A562187j83732j09605J6708l4547m9769k0812j09696J03385P6433k06896
$$ y = [702119, 597697, 675197, 773968, 759322, 954380, 862522, 879378, 942508, 1186382, 1268461, 1279848, 1214015, 1264982, 1244691, 1112179, 1012314, 1001362, 948963, 855301, 1009607, 1312984, 1276237, 1162694, 1379111, 1507866, 1507158, 1319977, 1152990, 1259578, 1161474, 1515792, 1562187, 1378455, 1268850, 1285558, 1251011, 1201242, 1180430, 1070734, 1174119, 1250552, 1043656]
$$ [...]
##END NTUPLES=NMR SPECTRUM
##END=
