##TITLE=Analysis number 321415
Compound Code cc 58146
Book Reference 458/178
Project Code adrs
Chemist Name stevem
##JCAMPDX= 6.0         $$ Bruker NMR JCAMP-DX V2.0
##DATA TYPE= NMR SPECTRUM
##DATA CLASS= NTUPLES
##ORIGIN= Bruker BioSpin GmbH
##OWNER= nmr
$$ XWIN-NMR		Version 3.5
$$ Wed Aug  9 14:40:10 2006 GMT Daylight Time (UT+1h)  MAYBRIDGE\nmr@NMR_250MHZ
##.OBSERVE FREQUENCY= 250.131544655141
##.OBSERVE NUCLEUS= ^1H
##.ACQUISITION MODE= SIMULTANEOUS (DQD)
##.ACQUISITION SCHEME= undefined
##.AVERAGES= 16
##.DIGITISER RES= 18
##SPECTROMETER/DATA SYSTEM= dpx250
##.PULSE SEQUENCE= zg30
##.SOLVENT NAME= CDCl3
##.SHIFT REFERENCE= (INTERNAL, CDCl3, 0, 16.522)
##AUDIT TRAIL= $$ (NUMBER, WHEN, WHO, WHERE, WHAT)
$$ ##TITLE= Audit trail, XWIN-NMR		Version 3.5
$$ ##JCAMPDX= 5.01
$$ ##ORIGIN= Bruker BioSpin GmbH
$$ ##OWNER= nmr
$$ C:\u/data/dgb/nmr/ADRS/560/pdata/1/auditp.txt
$$ ##AUDIT TRAIL=  $$ (NUMBER, WHEN, WHO, WHERE, WHAT)
(   1,<2006-08-09 14:39:28.97 +100>,<MAYBRIDGE\nmr>,<NMR_250MHZ>,
      <created by zg, POWCHK disabled, PULCHK disabled
       configuration hash MD5:
       E2 DF 36 D8 04 B2 41 60 5A D7 A3 38 5A 4B D0 FE
       data hash MD5: 64K
       23 5B 71 15 AA 61 30 3A AD 38 3B 7C 90 E2 0D 12>)
(   2,<2006-08-09 14:39:48.10 +100>,<MAYBRIDGE\nmr>,<NMR_250MHZ>,
      <Start of raw data processing
       ef LB = 0.3 FT_mod = 6 PKNL = 1 SI = 32K 
       data hash MD5: 32K
       17 60 10 4F 3B 79 31 38 28 DB 69 1F B4 42 3E 2C>)
(   3,<2006-08-09 14:39:52.99 +100>,<MAYBRIDGE\nmr>,<NMR_250MHZ>,
      <apk 
       data hash MD5: 32K
       F6 B4 49 EB 66 80 70 1A E4 00 B0 CF A8 A6 19 7E>)
(   4,<2006-08-09 14:39:54.63 +100>,<MAYBRIDGE\nmr>,<NMR_250MHZ>,
      <abs ABSG = 5 
       data hash MD5: 32K
       D8 5E CB 19 74 5B 3B D7 B4 BB 50 1D FD 66 4C 59>)
$$ ##END=
$$ 
$$ hash MD5
$$ 1C E7 CF 1D 62 6A 7A 59 6A 35 64 40 26 EA 18 11
##$RELAX= 
##$RELAX= 
##$RELAX= 
##$RELAX= 
##$RELAX= 
##$RELAX= 
##$RELAX= 
$$ Bruker specific parameters
$$ --------------------------
##$DU= <C:\u>
##$EXPNO= 560
##$NAME= <ADRS>
##$PROCNO= 1
##$TYPE= <nmr>
##$USER= <dgb>
##$AMP= (0..31)
100 100 100 100 100 100 100 100 100 100 100 100 100 100 100 100 100 100 
100 100 100 100 100 100 100 100 100 100 100 100 100 100 
##$AQSEQ= 0
##$AQ_mod= 3
##$AUNM= <au_zg>
##$AUTOPOS= <28 >
##$BF1= 250.13
##$BF2= 250.13
##$BF3= 250.13
##$BF4= 250.13
##$BF5= 500.13
##$BF6= 500.13
##$BF7= 500.13
##$BF8= 500.13
##$BYTORDA= 1
##$CFDGTYP= 0
##$CFRGTYP= 5
##$CHEMSTR= <none>
##$CNST= (0..31)
1 1 145 1 1 1 1 1 1 1 1 1 1 1 1 1 1 1 1 1 1 1 1 1 1 1 1 1 1 1 1 1 
##$CPDPRG= <>
##$CPDPRG1= <>
##$CPDPRG2= <>
##$CPDPRG3= <>
##$CPDPRG4= <mlev>
##$CPDPRG5= <mlev>
##$CPDPRG6= <mlev>
##$CPDPRG7= <mlev>
##$CPDPRG8= <mlev>
##$CPDPRGB= <>
##$CPDPRGT= <>
##$D= (0..31)
0 1 0 0 0 0 0 0 0 0.06 0 0 0 0 0 0 0.0002 0 0 0 0 0 0 0 0 0 0 0 0 0 0 
0 
##$DATE= 1155130767
##$DBL= (0..7)
120 120 120 120 120 120 120 120 
##$DBP= (0..7)
150 150 150 150 150 150 150 150 
##$DBP07= 0
##$DBPNAM0= <>
##$DBPNAM1= <>
$$ [...]
##$SUBNAM7= <"">
##$SUBNAM8= <"">
##$SUBNAM9= <"">
##$SW= 20.6930455092707
##$SWIBOX= (0..15)
0 0 3 0 0 0 0 0 0 0 0 0 0 0 0 0 
##$SW_h= 5175.983436853
##$TD= 65536
##$TD0= 1
##$TE= 295.16
##$TE2= 300
##$TE3= 300
##$TEG= 300
##$TL= (0..7)
0 120 120 120 120 120 120 120 
##$TP= (0..7)
150 150 150 150 150 150 150 150 
##$TP07= 0
##$TPNAME0= <>
##$TPNAME1= <>
##$TPNAME2= <>
##$TPNAME3= <>
##$TPNAME4= <>
##$TPNAME5= <>
##$TPNAME6= <>
##$TPNAME7= <>
##$TPOAL= (0..7)
0.5 0.5 0.5 0.5 0.5 0.5 0.5 0.5 
##$TPOFFS= (0..7)
0 0 0 0 0 0 0 0 
##$TUNHIN= 0
##$TUNHOUT= 0
##$TUNXOUT= 0
##$USERA1= <user>
##$USERA2= <user>
##$USERA3= <user>
##$USERA4= <user>
##$USERA5= <user>
##$V9= 5
##$VALIST= <valist>
##$VCLIST= <CCCCCCCCCCCCCCC>
##$VD= 0
##$VDLIST= <DDDDDDDDDDDDDDD>
##$VPLIST= <PPPPPPPPPPPPPPP>
##$VTLIST= <TTTTTTTTTTTTTTT>
##$WBST= 1024
##$WBSW= 4
##$XGAIN= (0..3)
0 0 0 0 
##$XL= 0
##$YL= 0
##$YMAX_a= 439199
##$YMIN_a= -449422
##$ZGOPTNS= <>
##$ZL1= 120
##$ZL2= 120
##$ZL3= 120
##$ZL4= 120
##$ABSF1= 16.522
##$ABSF2= -4.171173
##$ABSG= 5
##$ABSL= 3
##$ALPHA= 0
##$AQORDER= 0
##$ASSFAC= 0
##$ASSFACI= 0
##$ASSFACX= 0
##$ASSWID= 0
##$AUNMP= <proc_1d>
##$AZFE= 0.1
##$AZFW= 0.1
##$BCFW= 0
##$BC_mod= 0
##$BYTORDP= 0
##$COROFFS= 0
##$CY= 12.5
##$DATMOD= 1
##$DC= 0
##$DFILT= <>
##$DTYPP= 0
##$F1P= 14.0000005364418
##$F2P= -0.99999901652339
##$FCOR= 0.5
##$FTSIZE= 32768
##$FT_mod= 6
##$GAMMA= 0
##$GB= 0
##$INTBC= 1
##$INTSCL= 1
##$ISEN= 128
##$LB= 0.3
##$LEV0= 0
##$LPBIN= 0
##$MAXI= 10000
##$MC2= 0
##$MEAN= 0
##$ME_mod= 0
##$MI= 0
##$NCOEF= 0
##$NC_proc= -3
##$NLEV= 6
##$NOISF1= 0
##$NOISF2= 0
##$NSP= 0
##$NTH_PI= 0
##$NZP= 0
##$OFFSET= 16.522
##$PC= 1
##$PHC0= 145.6266
##$PHC1= 12.86743
##$PH_mod= 1
##$PKNL= yes
##$PPARMOD= 0
##$PSCAL= 4
##$PSIGN= 0
##$REVERSE= no
##$SF= 250.13
##$SI= 32768
##$SIGF1= 0
##$SIGF2= 0
##$SINO= 400
##$SIOLD= 32768
##$SREGLST= <1H.CDCl3>
##$SSB= 0
##$STSI= 32768
##$STSR= 0
##$SW_p= 5175.98343685301
##$SYMM= 0
##$S_DEV= 0
##$TDeff= 65536
##$TDoff= 0
##$TI= <Analysis number 999999
Compound Code 99
Book Reference 9
Project Code 9>
##$TILT= no
##$TM1= 0
##$TM2= 0
##$TOPLEV= 0
##$USERP1= <user>
##$USERP2= <user>
##$USERP3= <user>
##$USERP4= <user>
##$USERP5= <user>
##$WDW= 1
##$XDIM= 32768
##$YMAX_p= 379274027
##$YMIN_p= -149730
$$ End of Bruker specific parameters
$$ ---------------------------------
##NTUPLES= NMR SPECTRUM
##VAR_NAME=  FREQUENCY,     SPECTRUM/REAL,   SPECTRUM/IMAG
##SYMBOL=    X,             R,               I
##VAR_TYPE=  INDEPENDENT,   DEPENDENT,       DEPENDENT
##VAR_FORM=  AFFN,          ASDF,            ASDF
##VAR_DIM=   32768,         32768,           32768
##UNITS=     HZ,            ARBITRARY UNITS, ARBITRARY UNITS
##FACTOR=    0.157963299565203, 1,           1
##FIRST=     4132.6476996994, 0,             0
##LAST=      -1043.33573715361, 0,           0
##MIN=       -1043.33573715361, -149730,     0
##MAX=       4132.6476996994, 379274027,     0
$$ Real data points
##PAGE= N=1
##DATA TABLE= (X++(R..R)), XYDATA
$$ [...]
$$ plain form
16281 24035 -25057 -42546 -16410 -12912 -34065 -8442 -16926 -15651 -8951 -19535 -5476 -492 3738
16268 3738 673 -15009 -39094 -48813 -34257 -42420 -44919 -52484 -57179 -39328 -8914 -4401 -26516
16255 -26516 -31460 -21597 -10842 -29517 -36357 -32158 -31656 -1197 20475 12005 -6228 -40179 -38119
16242 -38119 -27191 -9050 24404 43147 58436 48712 33394 391 -8585 -18970 -31245 -18721
16230 -18721 -15584 -32555 -39140 -25085 -1844 -6970 -28337 -21424 -18674 11761 29043 36321 25091
16217 25091 24445 14153 27185 41853 56477 72702 63658 56598 50687 34021 27203 21158 52618
16204 52618 60471 19291 -5744 -1864 -3495 -17797 -11778 -5971 2196 2364 -24392 -44390 -20643
16191 -20643 -12521 -35357 -64631 -48106 3073 -8520 -7028 -8907 -8700 -26234 -13298 3249 11338
$$ packed form
16281B4035m9092j7489K6136L498k1153K5623q484J275O700j0584J4059M984M230
16268C738l065j5682k4085r719J4556q163k499p565m695J7851L0414M513k2115
16255b6516m944R863J0755j8675o840M199N02L0459K1672q470j8233l3951K060
16242c8119J0928J8141L3454J8743J5289r724j5318l3003q976j0385j2275J2524
16230a8721L137j6971o585J4055K3241n126k1367O913K750L0435J7282P278j1230
16217B5091o46j0292J3032J4668J4624J6225r044p060n911j6666o818o045L1460
16204E2618P853m1180k5035L880j631j4302O019N807Q167J68k6756j9998K3747
16191b0643Q122k2836k9274J6525N1179j1593J492j879K07j7534J2936J6547Q089
$$ plain form
16178 11338 7324 -9423 -27998 -26768 -10679 16040 6951 -176 3779 -10067 -19140 -21714 -24728
16165 -24728 -27334 -5615 -35124 -38646 -50623 -39468 -27240 -34130 -16249 -10511 -3789 9639 2575
16152 2575 14817 -1067 -15544 -9099 -2023 -15930 -28938 -28886 4147 15659 -7034 -7210 -16045
16139 -16045 -23879 -42005 -66624 -69588 -44517 -58264 -48825 -26071 -21539 -7107 10461 21726
16127 21726 19733 1651 -9936 -20911 -35087 -38095 -23381 -33653 -46365 -19158 -5611 -23967
16115 -23967 -25586 -6964 -8650 -22232 -4812 50537 66290 25940 1710 13699 2604 11937
16103 11937 22174 8476 11464 5658 5701 -179 -16139 -23269 -12756 -4272 -12674 -2818 1019 -16141
16089 -16141 -14585 -13383 -41656 -50250 -18804 -472 -11918 -34844 -23352 1993 5428 10321 6451
$$ packed form
16178A1338m014j6747j8575J230J6089K6719r089p127L955j3846r073k574l014
16165b4728k606K1719k9509l522j1977J1155J2228o890J7881N738O722J3428p064
16152B575J2242j5884j4477O445P076j3907j3008N2L3033J1512k2693j76q835
16139a6045p834j8126k4619k964K5071j3747R439K2754M532J4432J7568J1265
16127B1726j993j8082j1587j0975j4176l008J4714j0272j2712K7207J3547j8356
16115b3967j619J8622j686j3582J7420N5349J5753m0350k4230J1989j1095R333
16103A1937J0237j3698K988n806M3n880j5960p130J0513Q484q402R856L837j7160
16089a6141J556J202k8273q594L1446J8332j1446k2926J1492K5345L435M893l870
$$ plain form
16076 6451 -264 -15311 -7829 -1081 -8043 6879 -22315 -21082 -16070 -5727 2896 -27959 -13123
16063 -13123 -28397 -65657 -75004 -53380 -44503 -48950 -14630 -6873 -18425 -533 9704 10131 1225
16050 1225 -303 -3415 -26732 -45037 -43541 -32313 -18209 -15140 -20987 6033 45922 50716 31102
16037 31102 52281 71826 68683 55073 38153 55775 51206 36095 36055 39147 479 -4882 -6920
16024 -6920 -14887 16141 777 3977 -978 -10252 -28704 -23375 -10421 -7151 -2857 -15016 -36523
16011 -36523 -50624 -29467 -40338 -46497 -22520 -18009 -52947 -71380 -51921 -40497 -23621 1829
15999 1829 8736 14152 44076 53606 42705 29815 38677 16925 -7321 -43034 -74623 -74746 -65753
15986 -65753 -26174 20250 57463 53889 21003 10966 -17440 -13652 -21885 -24255 -28076 -15650 -6630
$$ packed form
16076F451o715j5047P482O748o962J4922k9194J233N012J0343Q623l0855J4836
16063a3123j5274l7260r347K1624Q877m447L4320P757j1552J7892J0237M27q906
16050A225j528l112k3317j8305J496J1228J4104L069n847K7020L9889M794j9614
16037C1102K1179J9545l143j3610j6920J7622m569j5111m0L092l8668n361k038
16024f920p967L1028j5364L200m955r274j8452N329J2954L270M294j2159k1507
16011c6523j4101K1157j0871o159K3977M511l4938j8433J9459J1424J6876K5450
15999A829O907N416K9924R530j0901j2890Q862k1752k4246l5713l1589j23Q993
15986f5753L9579M6424L7213l574l2886j0037k8406L788q233k370l821J2426R020
$$ plain form
15973 -6630 25447 15059 3248 -7910 -17761 -13104 -27353 -31881 985 4310 10157 1484 -32454
15960 -32454 -14931 2917 -18128 -49716 -58047 -51522 -44230 -35036 2945 48660 56558 32447 30011
15947 30011 17628 -5965 -8982 -991 -1765 -14535 -32783 -38204 -10334 21085 34742 18836 6394
15934 6394 -7374 -10470 -10323 2289 8816 -17132 -34733 -42509 -6144 -5914 -35089 -38161 -39230 -27246
15920 -27246 -8072 22716 27752 21259 32365 20524 43620 60755 34408 13132 -2298 8128
15908 8128 17281 38145 48302 12984 -17657 930 6680 -10234 -28699 -22980 -261 14593
15896 14593 4970 -11906 -39240 -50260 -43320 -16146 -3996 17534 15489 2850 5755 26156
15884 26156 4242 -259 19358 2737 24268 14859 8327 -721 -10350 -12433 -11251 -12599 -6163
$$ packed form
15973f630L2077j0388j1811j1158r851M657j4249m528L2866L325N847q673l3938
15960c2454J7523J7848k1045l1588q331O525P292R194L7981M5715P898k4111k436
15947C0011j2383k3593l017P991p74j2770j8248n421K7870L1419J3657j5906j2442
15934F394j3768l096J47J2612O527k5948j7601p776L6365K30k9175l072j069J1984
15920b7246J9174L0788N036o493J1106j1841K3096J7135k6347k1276j5430J0426
15908H128R153K0864J0157l5318l0641J8587N750j6914j8465N719K2719J4854
15896A4593r623j6876k7334j1020O940K7174J2150K1530k045j2639K905K0401
15884B6156k1914m501J9617j6621K1531r409o532r048r629k083J182j348O436
$$ plain form
15871 -6163 -16012 -29828 -21166 -26197 -18354 -9475 7336 9606 -9003 -18461 -10346 -5789 -6917 -4481
15857 -4481 11138 -35770 -50880 -45386 -33113 -11561 -9609 -15340 -23248 -13032 6978 7133 -5673
15844 -5673 -4507 -9245 -20484 -5958 5320 8408 1486 571 -12145 -14258 -15339 7816 11485 26178
15830 26178 12874 -27149 -4854 -17528 -15788 -2813 -16877 -7835 8425 34410 29513 9159
15818 9159 -30264 -45798 -30174 -8770 -23729 -6432 33927 29504 15534 47699 36299 22192
15806 22192 -15668 -54938 -63629 -23105 8806 3114 3903 18039 23851 35119 30574 33864 11338
15793 11338 15109 14793 -550 -13741 -1124 23945 -3868 -24477 -1284 3145 16659 7581 8177
15780 8177 9060 -3673 10722 9129 -28966 -45536 -4814 14484 -10952 1938 27214 26078 21958
$$ packed form
15871f163r849j3816Q662n031P843Q879J6811K270j8609r458Q115M557j128K436
15857d481J5619m6908j5110N494J2273K1552J952n731p908J0216K0010J55j2806
15844e673J166m738j1239J4526J1278L088o922r15j2716k113j081K3155L669J4693
15830B6178j3304m0023K2295j2674J740J2975j4064R042J6260K5985m897k0354
15818I159l9423j5534J5624K1404j4959J7297M0359m423j3970L2165j1400j4107
15806B2192l7860l9270q691M0524L1911n692P89J4136N812J1268m545L290k2526
15793A1338L771l16j5343j3191J2617K5069k7813k0609K3193M429J3514r078N96
15780H177Q83j2733J4395j593l8095j6570M0722J9298k5436J2890K5276j136m120
$$ plain form
15767 21958 14508 8401 -8226 -3620 5623 35828 28148 -79 5783 26402 48032 23847 11307
15754 11307 5930 -2032 -31867 -51968 -53061 -5610 9790 19644 12938 -7849 -17919 1980 -7464
15741 -7464 -28356 -46165 -61675 -20939 23655 14408 -6868 -36944 -16621 -14611 -75353 -94929
15729 -94929 -70517 -26857 -20721 7158 9513 -5244 -8979 -26942 -15159 -4398 -20335 -7087
15717 -7087 -24217 -28749 -13865 7423 3351 8340 7704 -16315 -7558 13698 7025 -34434 -34984 -12767
15703 -12767 8555 -6243 -5293 -6626 4798 4247 6973 40814 44016 41211 16203 -4311 1513
15690 1513 -4444 -1470 28010 55408 45914 53235 34426 -11012 -31303 -41180 -25127 -58620 -78225
15677 -78225 -58663 -45706 -33337 -30029 -36346 13717 7002 -13439 -17249 -242 808 3042 -24424
$$ packed form
15767B1958p450o107j6627M606R243L0205p680k8227N862K0619K1630k4185j2540
15754A1307n377p962k9835k0101j093M7451J5400R854o706k0787j0070J9899r444
15741g464k0892j7809j5510M0736M4594r247k1276l0076K0323K010o0742j9576
15729i4929K4412M3660O136K7879K355j4757l735j7963J1783J0761j5937J3248
15717g087j7130m532J4884K1288m072M989o36k4019Q757K1256o673m1459n50K2217
15703a2767K1322j4798R50j333J1424n51K726L3841L202k805k5008k0514N824
15690A513n957K974K9480K7398r494P321j8809m5438k0291r877J6053l3493j9605
15677g8225J9562J2957J2369L308o317N0063o715k0441l810J7007J050K234k7466
$$ plain form
15664 -24424 -10528 7258 13994 5372 -12803 -35366 -53974 -67961 -76781 -37179 -15587 8036
15652 8036 -11400 -6476 -21257 -27537 -4090 9808 2544 -14805 -12860 -17578 -33136 -48914 -65157
15639 -65157 -32472 53 -6368 -911 15661 1594 -21288 -31374 -16910 -15766 -25825 -32743
15627 -32743 -13588 -19671 3966 20238 31449 25640 26801 21909 12651 1678 -24086 -10951 778
15614 778 -14482 -19767 -43396 -72929 -59264 -48700 -21683 -24827 1019 3808 3523 29200 36764
15601 36764 31451 25676 -20899 -37392 -33739 -11118 -6384 -16209 -5679 -32107 -12736 -5982 -26971
15588 -26971 -29331 -11066 5176 -9321 -25555 -16013 -6324 -36343 -35610 1191 8802 2754 23224
15575 23224 3271 -27897 -14080 -7490 -18936 -56704 -80655 -69425 -41589 -49779 -50778 -47088 -29776
$$ packed form
15664b4424J3896J7786O736q622j8175k2563j8608j3987q820L9602K1592K3623
15652H036j9436M924j4781o280K3447J3898p264j7349J945m718j5558j5778j6243
15639f5157L2685L2525o421N457J6572j4067k2882j0086J4464J144j0059o918
15627c2743J9155o083K3637J6272J1211n809J161m892r258j0973k5764J3135J1729
15614G78j5260n285k3629k9533J3665J0564K7017l144K5846K789k85K5677P564
15601C6764n313n775m6575j6493L653K2621M734r825J0530k6428J9371O754k0989
15588b6971k360J8265J6242j4497j6234R542R689l0019P33L6801P611o048K0470
15575B3224j9953l1168J3817O590j1446l7768k3951J1230K7836q190r99L690J7312
$$ plain form
15562 -29776 -16517 12363 6162 -45283 -43912 -9430 8337 24990 48313 41640 32712 14321
15550 14321 -774 10213 -7295 9166 13379 13941 -4743 -12889 -26874 -8626 -7153 2014 -7028
15537 -7028 2873 38800 47062 59848 66184 45493 22122 27531 12287 12185 17252 8047 15933 15742
15523 15742 20503 14194 7426 2342 -13734 1565 11232 8333 8450 -21780 8323 46200 51269
15510 51269 17075 -11533 -47365 -67601 -50289 -53195 -59173 -47264 12343 11928 -28305 -24638 6154
15497 6154 -22277 -44278 1885 30769 29470 52388 50251 33385 31266 20369 27909 -14580 -21834
15484 -21834 -14931 29661 15197 -15606 -25857 401 12890 3119 7623 2746 -6307 276 13000
15471 13000 21839 7024 -13328 -16665 -16324 -16814 -23577 -31095 -47063 -44019 -13102 -6420 -10339 -36266
$$ packed form
15562b9776J3259K8880o201n1445J371L4482J7767J6653K3323o673q928j8391
15550A4321j5095J0987j7508J6461M213N62j8684q146j3985J8248J473R167r042
15537g028R901L5927Q262J2786O336k0691k3371N409j5244j02N067r205P886j91
15523A5742M761o309o768n084j6076J5299R667k899J17l0230L0103L7877N069
15510E1269l4194k8608l5832k0236J7312k906n978J1909N9607m15m0233L667L0792
15497F154k8431k2001M6163K8884j299K2918k137j6866k119j0897P540m2489p254
15484b1834O903M4592j4464l0803j0251K6258J2489r771M504m877r053O583J2724
15471A3000Q839j4815k0352l337L41m90o763p518j5968L044L0917O682l919k5927
$$ plain form
15457 -36266 -39026 -9349 -19597 -35706 -36978 -34886 -70210 -92598 -77521 -59997 -41695 -2042
15445 -2042 5237 -63 -13611 -19717 -19573 -30691 -38759 -16021 -34291 -16780 28554 30155 -5840
15432 -5840 -37580 -35448 -15531 6242 23231 25508 17269 -12905 -18682 -14572 -18017 -25594 -39138
15419 -39138 -36022 -37765 -67221 -85368 -58533 -58202 -52287 -44010 -21765 -1225 -25796 -47264 -61339
15406 -61339 -62549 -75228 -55173 -22157 -29241 -35647 -55222 -54350 -53850 -14126 -29969 -18508 -24188
15393 -24188 -15895 -9644 -19672 -21 33804 42573 27279 -8191 436 -6128 -6874 31346 44712
15380 44712 53394 36798 11493 16050 8618 -3512 4273 14589 31274 30646 28088 35314 35251 30334
15366 30334 9412 -12271 -22004 -17864 -11776 8510 10533 5367 11211 11335 4240 -1005 23239 20679
$$ packed form
15457c6266k760K9677j0248j6109j272K092l5324k2388J5077J7524J8302L9653
15445b042P279n300j3548o106J44j1118q068K2738j8270J7511M5334J601l5995
15432e840l1740K132J9917K1773J6989K277q239l0174n777M110l445p577j3544
15419c9138L116j743k9456j8147K6835L31N915Q277K2245K0540k4571k1468j4075
15406f1339j210j2679K0055L3016p084o406j9575Q72N00L9724j5843J1461n680
15393b4188Q293O251j0028J9651L3825Q769j5294l5470Q627o564p46L8220J3366
15380D4712Q682j6596k5305M557p432j2130P785J0316J6685o28k558P226o3m917
15366C0334k0922k1683r733M140O088K0286K023n166N844J24p095n245K4244k560
$$ plain form
15352 20679 20447 4799 -11956 -39972 -62356 -60857 -69335 -69287 -51343 -38825 -31525 -32538 -2648
15339 -2648 -6682 -12415 -13359 -19654 -28149 -26173 -18555 -13689 -13625 -29555 -33359 -29823 -20684 18402 22072
15324 22072 -57 12224 73632 89748 54811 21810 -18 -4992 15749 1568 -12137 -42643
15312 -42643 -32242 -32499 -34607 5426 25841 47256 50084 40595 43368 56747 49450 13097 -6730
15299 -6730 6685 13895 -9141 -22770 -18461 912 -4334 -49387 -45241 -40588 -31251 -38479 -32268
15286 -32268 -39690 -50721 -25702 17831 36682 36132 23576 13811 -19726 -23399 -27954 -55568 -62356
15273 -62356 -49561 -30397 -26093 923 22118 15492 -2697 -6955 7002 3174 711 -9645 -13199
15260 -13199 -2973 15584 -5459 -19667 -44867 -37974 -42344 -22273 -34181 -14943 -19487 -13171
$$ packed form
15352B0679k32j5648j6755k8016k2384J499q478M8J7944J2518P300j013K9890
15339b648m034n733r44o295q495J976P618M866O4j5930l804L536R139L9086L670
15324B2072k2129J2281O1408J6116l4937l3001k1828m974K0741j4181j3705l0506
15312d2643J0401k57k108M0033K0415K1415K828r489K773J3379p297l6353j9827
15299f730J3415P210k3036j3629M309J9373n246m5053M146M653R337p228O211
15286c2268p422j1031K5019M3533J8851n50j2556r765l3537l673m555k7614o788
15273f2356J2795J9164M304K7016K1195o626j8189m258J3957l828k463j0356l554
15260a3199J0226J8557k1043j4208k5200O893m370K0071j1908J9238m544O316
$$ plain form
15248 -13171 -6379 28757 43837 12760 8364 19838 4603 -33226 -56214 -63649 -60120 -55470 -46503
15235 -46503 -39557 15438 15763 4884 33831 20105 2625 -6245 -1204 4453 43298 46408 17861
15222 17861 -161 -12914 6050 -17695 -31331 -16107 -24418 -53873 -59654 -46084 -26616 -28432
15210 -28432 -29752 -39767 -79410 -74710 -45480 -13334 -13410 -21369 -28136 -3991 859 -4456 -16947
15197 -16947 -28150 -48813 -28792 9179 17686 -6777 -12356 -17358 -33515 -18728 24096 41591
15185 41591 52776 39910 36049 34899 21307 19626 -3202 -11542 -14563 -35125 -12349 -13418 -50457
15172 -50457 -52828 -30896 1780 5908 4609 43473 55831 43066 13639 10738 20873 48969
15160 48969 60094 24689 -7984 -6948 152 -14160 -22263 -38694 -34001 -11710 436 -3185 24092
$$ packed form
15248a3171O792L5136J5080l1077m396J1474j5235l7829k2988p435L529M650Q967
15235d6503O946N4995L25j0879K8947j3726j7480q870N041N657L8845L110k8547
15222A7861j8022j2753J8964k3745j3636J5224q311k9455n781J3570J9468j816
15210b8432j320j0015l9643M700K9230L2146p6p959o767K4145M850n315j2491
15197a6947j1203k0663K0021L7971Q507k4463n579n002j6157J4787M2824J7495
15185D1591J1185j2866l861j150j3592j681k2828q340l021k0562K2776j069l7039
15172e0457k371K1932L2676M128j299L8864J2358j2765k9427k901J0135K8096
15160D8969J1125l5405l2673J036P100j4312q103j6431M693K2291J2146l621K7277
$$ plain form
15147 24092 25779 39027 30703 -11404 -19426 -31689 -32091 -17771 -5496 16795 10594 28994 47386
15134 47386 25360 28324 12510 -6583 3986 -6547 -13225 11385 -15118 -46276 -16676 8372
15122 8372 28535 6883 -25488 -30082 -27279 -14967 21917 27839 34276 36927 28962 16136 -17248
15109 -17248 -22917 -7604 -11242 14375 1121 -24964 -6023 41939 63397 56835 32622 -1444
15097 -1444 -9785 -580 1215 -25003 -1774 15855 18307 26444 31377 41994 40714 20941 -4561
15084 -4561 -1153 4645 24924 15869 -13706 2356 27066 31495 10271 -8340 9212 36772 32820
15071 32820 55477 42195 17739 -5523 -22325 10852 19027 16613 28880 16888 13797 6375
15059 6375 15034 17221 -16932 -19524 -15611 -16187 -20039 -18333 -20984 6429 26726 39809 22046 31280
$$ packed form
15147B4092J687J3248q324m2107q022j2263m02J4320J2275K2291o201J8400J8392
15134D7386k2026K964j5814j9093J0569j0533o678K4610k6503l1158K9600K5048
15122H372K0163k1652l2371m594K803J2312L6884N922O437K651p965j2826l3384
15109a7248n669J5313l638K5617j3254k6085J8941M7962K1458o562k4213l4066
15097a444q341R205J795k6218K3229J7629K452Q137M933J0617j280j9773k5502
15084d561L408N798K0279r055k9575J6062K4710M429k1224j8611J7552K7560l952
15071C2820K2657j3282k4456k3262j6802L3177Q175k414J2267j1992l091p422
15059F375Q659K187l4153k592L913n76l852J706k651K7413K0297J3083j7763R234
$$ plain form
15045 31280 27349 48124 45883 18346 2022 8342 35377 47723 52791 27548 -10086 -16700 -12334
15032 -12334 8257 37168 40280 29846 24933 40470 55991 50250 35265 34530 20165 -4003 -31832
15019 -31832 -58486 -46647 -17355 14067 25922 5309 22984 60498 68861 82215 81900 77625
15007 77625 80875 90227 104702 142472 175929 182671 212222 274011 378203 557027 843939 1331231
14995 1331231 2258699 3467185 4291185 5082731 5081156 3472370 2068995 1403336 1068932
14986 1068932 872458 722108 628540 559615 495873 469523 425820 383831 341367 317896 316066
14975 316066 310246 259889 263911 256152 225848 205996 207280 208078 208602 204936 178192 168796 152569
14962 152569 135220 137729 169657 167519 168778 135210 96854 102418 106974 95262 86028 89656 90468
$$ packed form
15045C1280l931K0775k241k7537j6324O320K7035J2346N068k5243l7634o614M366
15032a2334K0591K8911L112j0434m913J5537J5521n741j4985p35j4365k4168k7829
15019c1832k6654J1839K9292L1422J1855k0613J7675L7514Q363J3354l15m275
15007G7625L250R352J4475L7770L3457O742K9551O1789J04192J78824K86912M87292
14995A331231R27468J208486Q24000P91546j575j608786j403375o65659l34404
14986A068932j96474j50350r3568o8925o3742k6350m3703m1989m2464k3471j830
14975C16066n820n0357M022p759l0304j9852J284P98N24l666k6744r396j6227
14962A52569j7349K509L1928k138J259l3568l8356N564M556j1712r234L628Q12
$$ plain form
14949 90468 111040 100811 90846 66908 62177 73559 55529 55672 63888 87153 65247 31983 30898
14936 30898 17669 21587 63906 100813 97988 107977 120405 109616 65776 31756 20084 47648
14924 47648 41038 23383 15451 25161 36008 13604 -6831 -32145 -28230 -13866 15349 49853
14912 49853 43971 47126 45347 34037 23627 28776 47508 27293 -11239 -1101 22116 27245 24521
14899 24521 -257 19496 17574 21650 17641 12312 24933 47559 33026 20260 50518 73772
14887 73772 41552 11674 12419 22880 14524 5121 7871 28755 32238 24508 15358 -19642 -35933
14874 -35933 -15645 -24987 -28952 -22175 -6253 -15381 -18700 1068 17570 38462 61789 34616 6230
14861 6230 -8844 166 -1459 -5167 -1784 11784 15915 12520 -1325 -6496 970 5705 -1450 -1703
$$ packed form
14949I0468K0572j0229r965k3938m731J1382j8030J43Q216K3265k1906l3264j085
14936C0898j3229L918M2319L6907k825R989J2428j0789m3840l4020j1672K7564
14924D7648o610j7655p932R710J0847k2404k0435k5314L915J4364K9215L4504
14912D9853n882L155j779j1310j0410N149J8732k0215l8532J0138K3217N129k724
14899B4521k4778J9753j922M076m009n329J2621K2626j4533j2766L0258K3254
14887G3772l2220k9878P45J0461q356r403K750K0884L483p730r150l5000j6291
14874c5933K0288r342l965O777J5922r128l319J9768J6502K0892K3327k7173k8386
14861F230j5074R010j625l708L383J3568M131l395j3845n171P466M735p155k53
$$ plain form
14847 -1703 9297 12674 8241 -1747 -24805 -21244 -21263 -18671 -4071 18453 28414 23576 18271 21843
14833 21843 6847 -11063 1234 11367 3280 -10337 -20352 -21702 -31294 -26510 -3091 -1490 26500
14820 26500 31739 19911 22718 43056 34241 27371 36354 32180 40208 15305 27069 38073 4761
14807 4761 -14373 -14248 -8237 -4595 -2293 -12578 -29239 -40481 -1441 -11655 -44188 -32140 -3361
14794 -3361 -3076 -8827 -21181 -5738 -22346 -23064 -40607 -45844 -4150 -4851 -15295 1949 -7980 -2478
14780 -2478 10980 41035 39312 20064 22420 28736 25723 5951 -15166 -11640 -10976 -17777 -26114 -46186
14766 -46186 -36505 15268 12945 4125 19934 26403 29351 -5219 -36058 -4629 -351 18107 57669
14753 57669 55649 26473 -6656 -42823 -27895 17361 12790 7026 50329 36300 11871 12897
$$ packed form
14847a703J1000L377m433r988k3058L561j9K592J4600K2524R961m838n305L572
14833B1843j4996j7910J2297J0133q087j3617j0015j350r592M784K3419J601K7990
14820B6500N239j1828K807K0338q815o870Q983m174Q028k4903J1764J1004l3312
14807D761j9134J25O011L642K302j0285j6661j1242L9040j0214l2533J2048K8779
14794c361K85n751j2354J5443j6608p18j7543n237M1694p01j0444J7244r929N502
14780b478J3458L0055j723j9248K356O316l013j9772k1117L526O64o801q337k0072
14766d6186R681N1773k323q820J5809O469K948l4570l0839L1429M278J8458L9562
14753E7669k020k9176l3129l6167J4928M5256m571n764M3303j4029k4429J026
$$ plain form
14741 12897 4985 -28079 -54516 -55522 -45973 -23517 -23265 -20327 -612 -30101 -29010 -23122 -48031
14728 -48031 -48596 -27766 -10838 -9369 4031 18479 29112 40993 22224 12651 -8216 -45298
14716 -45298 -55298 -30408 -19938 -7396 -1271 -35925 -43393 -9692 -3797 6770 25090 11290
14704 11290 4894 -11284 -30117 -36988 -18579 19320 22055 35657 56497 51353 19156 25038 43883
14691 43883 42284 33371 47135 36626 18092 -20583 -21024 7567 10157 10882 20175 27202 27632 26028
14677 26028 -6299 -9236 18894 20079 -6568 2302 22032 44239 33926 30699 14790 14327 11491
14664 11491 697 -31884 -36703 -18042 -9975 8760 28873 26063 19152 23435 -6382 -13864 475
14651 475 -4542 -21305 -26797 -8837 -5444 15990 40152 39041 6250 -21452 -12876 -7553 -13482
$$ packed form
14741A2897p912l3064k6437j006R549K2456K52K938J9715k9489J091N888k4909
14728d8031n65K0830J6928J469J3400J4448J0633J1881j8769r573k0867l7082
14716d5298j0000K4890J0470J2542O125l4654p468L3701N895J0567J8320j3800
14704A1290o396j6178j8833o871J8409L7899K735J3602K0840n144l2197N882J8845
14691D3883j599q913J3764j0509j8534l8675m41K8591K590P25R293P027M30j604
14677B6028l2327k937K8130J185k6647Q870J9730K2207j0313l227j5909m63k836
14664A1491j0794l2581m819J8661Q067J8735K0113k810o911M283k9817p482J4339
14651D75n017j6763n492J7960L393K1434K4162j111l2791k7702Q576N323n929
$$ plain form
14638 -13482 -25250 -27616 -23090 -47335 -44191 -7512 6796 -19269 -3473 10604 11847 15835 2857
14625 2857 -1364 -23901 -33925 -18326 -10442 -3488 2547 -22952 -26149 -27403 -8068 747 12156
14612 12156 33880 21546 7687 4885 -28046 -68724 -46228 -3655 -26366 -29443 -14370 -14628
14600 -14628 -12465 -30406 -59305 -76107 -29880 -21751 -16118 -11881 -8560 9352 -21911 -25346 -45315
14587 -45315 -63688 -70301 -66884 -54156 -34599 -18960 -3046 23049 16571 -16821 -43634 -44286 -23946
14574 -23946 -18685 -28847 -29513 -31884 -15705 2438 12365 22566 32199 16952 -15346 3830 -15488
14561 -15488 -15091 -5506 3439 12283 -14900 -38488 -11182 12480 22813 1330 -1367 31176 34143
14548 34143 26152 20694 13801 -15666 -38647 -11037 27780 48796 28915 20995 46251 67074
$$ packed form
14638a3482j1768k366M526k4245L144L6679J4308k6065J5796J4077J243L988j2978
14625B857m221k2537j0024J5599P884O954O035k5499l197j254J9335Q815J1409
14612A2156K1724j2334j3859k802l2931m0678K2496M2573k2711l077J5073k58
14600a4628K163j7941k8899j6802M6227Q129N633M237L321J7912l1263l435j9969
14587d5315j8373o613L417J2728J9557J5639J5914K6095o478l3392k6813o52K0340
14574b3946N261j0162o66k371J6179J8143R927J0201R633j5247l2298J9176j9318
14561a5488L97R585Q945Q844k7183k3588K7306K3662J0333k1483k697L2543K967
14548C4143p991n458o893k9467k2981K7610L8817K1016j9881p920K5256K0823
$$ plain form
14536 67074 32248 24145 25533 17689 8336 2205 -29716 -13818 -1435 -4247 -38577 -7263 9962
14523 9962 14979 -13700 -28015 1806 9352 -29622 -32904 -27299 -8466 16569 4674 1065 -15447
14510 -15447 -13129 2387 -7994 -15054 -36940 -39352 -22482 -37738 -24198 40 -12010 -24122
14498 -24122 -39756 -45851 -22850 -4754 12717 11774 23193 9174 -24869 -26817 -38497 -76224
14486 -76224 -82135 -40317 -14511 -17102 -26537 -15189 -6227 -6834 4984 -10198 -6521 -5124 4250
14473 4250 12499 35033 37206 -11810 -38923 -48703 -52990 -52999 -29734 -5921 -7659 -17761 -20552 -43029
14459 -43029 -39378 -21947 -10969 -24207 -35738 -40742 -42560 -2845 11109 -20556 -19820 -24807 -24926
14446 -24926 -3843 -6570 -3852 -34535 -18570 -19485 6700 -18488 -54913 -67193 -44903 -18779
$$ packed form
14536F7074l4826q103J388p844r353o131l1921J5898J2383k812l4330L1314J7225
14523I962N017k8679j4315K9821P546l8974l282N605J8833K5035j1895l609j6512
14510a5447K318J5516j0381p060k1886k412J6870j5256J3540K4238j2050j2112
14498b4122j5634o095K3001J8096J7471r43J1419j4019l4043j948j1680l7727
14486g6224n911M1818K5806k591r435J1348Q962o07J1818j5182L677J397R374
14473D250Q249K2534K173m9016k7113r780m287rK3265K3813j738j0102k791k2477
14459d3029L651J7431J0978j3238j1531n004j818L9715J3954l1665P36m987j19
14446b4926K1083k727K718l0683J5965r15K6185k5188l6425j2280K2290K6124
$$ plain form
14434 -18779 -3934 17862 19216 32886 34286 31258 5071 688 36636 33152 7151 -15433 -21168
14421 -21168 -24350 -21861 -27226 -20391 2510 35540 18243 18386 21764 8608 -32890 -59844 -46385
14408 -46385 -25703 -37399 -30663 -17974 -9130 -18994 -35456 -40919 -39205 -36520 -23440 -12872 4071
14395 4071 -19610 -8739 -10576 14843 24015 1229 -25764 -26371 -28697 -40671 -69900 -45785 -8726
14382 -8726 -8050 -30883 -29892 -34299 -30767 -24794 -27505 -37774 -36231 -22522 -33543 -28513 -14525 2861
14368 2861 40496 39956 18432 -24626 -48319 -35145 -10363 -1169 24170 34418 17751 8649 -5252
14355 -5252 -16221 -30780 1594 9879 23013 51624 49103 6239 -34622 -26382 -9131 -24758
14343 -24758 -48232 -27091 20035 40443 18152 -197 -23831 -16337 -9075 15474 43082 91149
$$ packed form
14434a8779J4845K1796J354J3670J400l028k6187m383L5948l484k6001k2584n735
14421b1168l182K489n365O835K2901L3030j7297J43L378j3156m1498k6954J3459
14408d6385K0682j1696O736J2689Q844r864j6462n463J714K685J3080J0568J6943
14395D071k3681J0871j837K5419R172k2786k6993o07k326j1974k9229K4115L7059
14382h726O76k2833R91m407L532N973k711j0269J543J3709j1021N030J3988J7386
14368B861L7635n40k1524m3058k3693J3174K4782R194K5339J0248j6667r102j3901
14355e252j0969j4559L2374Q285J3134K8611k521m2864m0861Q240J7251j5627
14343b4758k3474K1141M7126K0408k2291j8349k3634P494P262K4549K7608M8067
$$ plain form
14331 91149 77468 53654 31070 13377 33585 59297 57567 41190 5121 6732 19248 1697
14319 1697 5496 10015 -2143 -10117 -16916 -37297 -57194 -43924 21535 34742 38008 66109 60098
14306 60098 45483 45465 29799 25503 35267 10637 5773 18211 7143 -10938 813 -7472 -2553
14293 -2553 13551 33198 27698 17923 -563 -26654 -31817 -19078 -30736 -9881 4755 17146
14281 17146 14123 31540 19719 13929 31983 31893 13440 27714 26672 -4674 -26938 -29955 -36915
14268 -36915 -11537 2039 -9049 -3746 6452 18688 38937 26751 17849 -1476 -24295 -12624
14256 -12624 -7 32682 68556 60021 59501 53937 47382 47729 37319 36400 3005 -14333 -21232 -3225
14242 -3225 41873 76126 65001 72154 67837 53104 32993 6917 -9188 -1928 26950 55289
$$ packed form
14331I1149j3681k3814k2584j7693K0208K5712j730j6377l6069J611J2516j7551
14319A697L799M519j2158p974o799k0381j9897J3270O5459J3207L266K8101o011
14306F0098j4615j8j5666m296R764k4630m864J2438j1068j8081J1751q285M919
14293b553J6104J9647n500r775j8486k6091n163J2739j1658K0855J4636J2391
14281A7146l023J7417j1821n790J8054r0j8453J4274j042l1346k2264l017o960
14268c6915K5378J3576j1088N303J0198J2236K0249j2186q902j9325k2819J1671
14256a2624J2617L2689L5874q535n20n564o555L47j0410r19l3395j7338o899J8007
14242c225M5098L4253j1125P153m317j4733k0111k6076j6105P260K8878K8339
$$ plain form
14230 55289 44560 12059 -4070 -10662 -6738 164 -2521 9342 26554 55463 52444 1616 -34634
14217 -34634 -8390 37051 38129 34918 32691 14783 7526 17763 14135 23451 -5344 -9081 9477
14204 9477 19755 32599 37280 48529 33249 7026 -8494 -2166 14867 32799 31194 15859
14192 15859 7983 12015 25664 24784 7886 5317 -13253 -32182 -12689 1488 19192 16526 13535
14179 13535 15285 16089 10877 -6830 -23177 -2921 21429 5418 -17233 -27157 -60045 -48536 -9232
14166 -9232 32184 36780 6076 9436 10186 14518 13635 36108 39299 29346 10646 9016 34044 22590
14152 22590 15552 17614 16819 16298 -25127 -44421 -31930 -2828 2127 7610 35813 43296 44095 12510
14138 12510 -14810 -24963 -9720 -16445 -30608 -3231 -175 2568 22716 15055 11830 44506 71272
$$ packed form
14230E5289j0729l2501j6129o592L924O902k685J1863J7212K8909l019n0828l6250
14217c4634K6244M5441J078l211k227j7908p257J0237l628R316k8795l737J8558
14204I477J0278J2844M681J1249j5280k6223j5520O328J7033J7932j605j5335
14192A5859p876M032J3649q80j6898k569j8570j8929J9493J4177J7704k666k991
14179A3535J750Q04n212j7707j6347K0256K4350j6011k2651r924l2888J1509L9304
14166i232M1416M596l0704L360P50M332q83K2473L191r953j8700j630K5028j1454
14152B2590p038K062p95n21m1425j9294J2491K9102M955N483K8203P483P99l1585
14138A2510k7320j0153J5243o725j4163K7377L056K743K0148p661l225L2676K6766
$$ plain form
14125 71272 76662 22798 -3174 -6045 18784 24645 20766 15715 9194 17754 52287 73655 69941
14112 69941 23466 23258 51355 72879 38787 3048 20081 56448 46945 12063 2051 5628
14100 5628 2835 6520 -13312 4651 22196 33603 20575 18139 8730 -743 -11605 -11516 -7069 8110
14086 8110 -2410 10142 14504 -3482 -15365 -10866 -1119 4126 4473 -7496 16343 28006 -26550
14073 -26550 -18968 -22431 -21409 15322 29976 9332 10677 23032 30823 19275 19289 17407 -7081
14060 -7081 5252 33227 5588 -11811 -5787 -3990 33980 18622 -1756 -22663 -32914 -43151
14048 -43151 -25861 -27661 5005 11525 -13786 -3752 11299 22901 8768 -17523 -11072 -25502
14036 -25502 -20444 -6880 1210 27284 31204 61926 61925 40495 37993 37813 64279 40417 12201 21542
$$ packed form
14125G1272N390n3864k5972k871K4829N861l879n051o521Q560L4533K1368l714
14112F9941m6475k08K8097K1524l4092l5739J7033L6367r503l4882j0012L577
14100E628k793L685j9832J7963J7545J1407j3028k436r409r473j0862Q9M447J5179
14086H110j0520J2552M362j7986j1883M499R747N245L47j1969K3839J1663n4556
14073b6550P582l463J022L6731J4654k0644J345J2355P791j1548J4j882k4488
14060g081J2333K7975k7639j7399O024J797L7970j5358k0378k0907j0251j0237
14048d3151J7290j800L2666O520k5311J0034J5051J1602j4133k6291O451j4430
14036b5502N058J3564Q090K6074L920L0722jk1430k502j80K6466k3862k8216R341
$$ plain form
14022 21542 6676 21410 29500 7872 1581 -13885 -14709 -18692 -42064 -32138 -2867 -7553 -26332
14009 -26332 -12846 -10586 -10902 -2517 35198 33889 59262 57241 83751 84924 68616 42078 32471
13996 32471 25181 33417 5761 9161 1030 2331 17460 36105 66848 86834 61599 38881 14815
13983 14815 37119 44678 32128 22350 19711 17806 25511 -6279 18802 53478 50057 62015 72696
13970 72696 62168 71170 68438 41706 29442 8823 824 19588 30896 21179 15796 46845 41471
13957 41471 48966 74115 72448 66697 65623 50571 65618 74347 74515 50859 28795 50102 67236
13944 67236 79221 63660 74316 73578 48952 11858 6099 14990 17665 10740 22523 72420 54537
13931 54537 44350 29198 10418 10683 -4458 4937 43432 64395 72597 23471 15625 35891 21228
$$ packed form
14022B1542j4866J4734Q090k1628o291j5466q24l983k3372R926K9271m686j8779
14009b6332J3486K260l16Q385L7715j309K5373k021K6510J173j6308k6538r607
13996C2471p290Q236k7656L400q131J301J5129J8645L0743J9986k5235k2718k4066
13983A4815K2304P559j2550r778k639j905P705l1790K5081L4676l421J1958J0681
13970G2696j0528R002k732k6732j2264k0619p999J8764J1308r717n383L1049n374
13957D1471P495K5149j667n751j074j5052J5047Q729J68k3656k2064K1307J7134
13944F7236J1985j5561J0656p38k4626l7094n759Q891K675o925J1783M9897j7883
13931E4537j0187j5152j8780K65j5141R395L8495K0963Q202m9126p846K0266j4663
$$ plain form
13918 21228 -920 -1341 13999 30583 27325 35280 29692 516 17350 50868 51937 39641 51515
13905 51515 65652 53762 95518 121906 128000 135691 144427 117057 43779 21359 33717 10534
13893 10534 20479 9415 -1472 12664 33308 44181 38566 25974 43810 52035 71023 74399
13881 74399 57048 35347 44652 24989 10098 33767 44599 38729 26608 14673 16156 9710
13869 9710 6354 -4213 -10119 322 -4786 18365 54551 57082 82722 74327 62416 43778 31783
13856 31783 38061 -1556 -11628 21284 30611 22664 50018 69262 64262 55981 24504 24378 29935
13843 29935 61139 63186 47893 45183 52624 100559 128789 108673 74209 110901 182067 234529
13831 234529 271493 279598 270731 266371 232970 208940 184444 192438 209890 203389 209026 197706 196410
$$ packed form
13918B1228k2148m21J5340J6584l258P955n588k9176J6834L3518J069j2296J1874
13905E1515J4137j1890M1756K6388O094P691Q736k7370p3278k2420J2358k3183
13893A0534R945j1064j0887J4136K0644J0873n615j2592J7836Q225J8988L376
13881G4399j7351k1701R305j9663j4891K3669J0832n870j2121j1935J483o446
13869I710l356j0567n906J0441n108K3151L6186K531K5640q395j1911j8638j1995
13856C1783O278l9617j0072L2912R327p947K7354J9244n000q281l1477j26N557
13843B9935L1204K047j5293k710P441M7935K8230k0116l4464L6692P1166N2462
13831B34529L6964Q105q867m360l3401k4030k4496P994J7452o501N637j1320j296
$$ plain form
13818 196410 216676 217876 229909 226171 205535 171460 150415 148667 167775 211021 237051 238169
13806 238169 249563 289564 319530 324689 321974 265569 196735 183959 178213 195682 239242 268951
13794 268951 278515 279107 251656 270752 265796 244621 250759 204319 181116 195956 192357 207898 236773
13781 236773 283587 333483 376245 426684 387645 325284 272037 233131 221575 169190 150516
13770 150516 138700 100987 67619 77594 125091 138108 126960 118092 131219 121743 96245 75647
13758 75647 58753 46338 93733 133165 133566 132763 155936 186637 173737 142659 140631 172148 148942
13745 148942 118563 97560 124173 131271 138959 147188 146556 193665 212757 228745 251092 281952
13733 281952 311518 343591 306647 263437 239442 209624 171182 126684 114357 123181 140203 173117
$$ packed form
13818A96410K0266J200J2033l738k0636l4075k1045j748J9108M3246K6030J118
13806B38169J1394M0001K9966N159k715n6405o8834j2776n746J7469M3560K9709
13794B68951R564N92k7451J9096m956k1175O138m6440k3203J4840l599J5541K8875
13781B36773M6814M9896M2762N0439l9039o2361n3247l8906j1556n2385j8674
13770A50516j1816l7713l3368R975M7497J3017j1148q868J3127r476k5498k0598
13758G5647j6894j2415M7395L9432M01q03K3173L0701j2900l1078k028L1517k3206
13745A48942l0379k1003K6613P098P688Q229o32M7109J9092J5988K2347L0860
13733B81952K9566L2073l6944m3210k3995k9818l8442m4498j2327Q824J7022L2914
$$ plain form
13721 173117 196265 219144 267115 274730 271876 263988 270388 231207 182269 178280 214557 218786 260134
13708 260134 308174 334051 337405 343316 354883 316343 262450 227812 188410 190284 198136 199175
13696 199175 190580 196900 243727 294451 292214 282755 266661 244148 213530 208379 207696 236668 239952
13683 239952 259038 329395 380438 421401 460662 470093 434248 358945 278325 227495 183376 172039
13671 172039 146748 160534 153028 143386 140943 142466 157040 147115 118118 122520 128637 110785 106298
13658 106298 118073 109942 91210 79888 83653 99945 138773 133575 111853 80249 73919 81662
13646 81662 47400 31209 45777 59607 93442 95001 123375 104662 73865 97846 142197 131804
13634 131804 137429 114176 96610 66754 70810 76193 66903 63506 58541 69238 67868 62577 84406
$$ packed form
13721A73117K3148K2879M7971P615k854p888O400l9181m8938l989L6277M229M1348
13708B60134M8040K5877L354N911J1567l8540n3893l4638l9402J874P852J039
13696A99175q595O320M6827N0724k237r459j6094k2513l0618n151o83K8972L284
13683B39952J9086P0357N1043M0963L9261R431l5845p5303q0620n0830m4119j1337
13671A72039k5291J3786p506r642k443J523J4574r925k8997M402O117j7852m487
13658A06298J1775q131j8732j1322L765J6292L8828n198k1722l1604o330P743
13646H1662l4262j6191J4568J3830L3835J559K8374j8713l0797K3981M4351j0393
13634A31804N625k3253j7566k9856M056N383r290l397m965J0697j370n291K1829
$$ plain form
13621 84406 91877 91407 72182 53618 43002 65956 84624 63419 46250 57398 45021 70778
13609 70778 77193 85820 107879 111042 113141 94659 84861 103201 100341 115951 120533 132004 122904
13596 122904 111641 98674 103297 100343 92306 85592 78110 60942 71122 102741 97354 105444 110795
13583 110795 106224 122358 111592 140614 158734 168400 181258 193458 195947 204224 242360 260805
13571 260805 230232 203318 209925 203801 183643 198249 193298 164205 158536 188614 201865 206017
13559 206017 210178 201163 150384 120843 124828 142343 160294 150264 149448 115423 98527 108268 118637
13546 118637 119972 132349 163208 167631 156658 180940 185506 178423 160506 153718 125024 109717
13534 109717 108859 109574 110749 126307 116395 129111 139237 96528 81058 100054 117926 115017 129821
$$ packed form
13621H4406P471m70j9225j8564j0616K2954J8668k1205j7169J1148j2377K5757
13609G0778O415Q627K2059L163K099j8482r798J8340k860J5610M582J1471r100
13596A22904j1263j2967M623k954q037o714p482j7168J0180L1619n387Q090N351
13583A10795m571J6134j0766K9022J8120R666J2858J2200K489Q277L8136J8445
13571B60805l0573k6914O607o124k0158J4606m951k9093n669L0078J3251M152
13559B06017M161r015n0779k9541L985J7515J7951j0030q16l4025j6896R741J0369
13546A18637J335J2377L0859M423j0973K4282M566p083j7917o788k8694j5307
13534A09717q58P15J175J5558r912J2716J0126m2709j5470J8996J7872k909J4804
$$ plain form
13521 129821 132420 129251 186256 199778 200534 216733 198686 203319 207589 210916 199275 175194 168776
13508 168776 171871 192526 194499 191454 206153 206376 200583 206956 198056 184036 180803 172756 158684
13495 158684 187138 205184 192859 178173 220179 237826 218307 221341 236318 231311 220767 218980
13483 218980 232362 229171 206732 207247 205906 233395 223318 210818 211401 244520 260807 255750 229184
13470 229184 230850 251413 229678 236519 244974 250564 254000 259053 229958 228400 234224 248309 261550
13457 261550 248073 216451 228376 280631 300053 294049 275292 286013 271960 246919 251069 259349
13445 259349 282474 312976 316139 336551 352836 376879 376109 395636 416264 405925 400274 408378
13433 408378 433421 450905 462937 492786 506854 502820 461285 406879 425996 475991 489386 531862
$$ packed form
13521A29821K599l169N7005J3522P56J6199j8047M633M270L327j1641k4081o418
13508A68776L095K0655J973l045J4699K23n793O373q900j4020l233q047j4072
13495A58684K8454J8046j2325j4686M2006J7647j9519L034J4977n007j0544j787
13483B18980J3382l191k2439N15j341K7489j0077j2500N83L3119J6287n057k6566
13470B29184J666K0563k1735O841Q455N590L436N053k9095j558N824J4085J3241
13457B61550j3477l1622J1925N2255J9422o004j8757J0721j4053k5041M150Q280
13445B59349K3125L0502L163K0412J6285K4043p70J9527K0628j0339n651Q104
13433D08378K5043J7484J2032K9849J4068m034m1535n4406J9117M9995J3395M2476
$$ plain form
13421 531862 553477 551647 533295 503226 508602 516388 505408 531923 547790 533467 528077 528682 530819
13408 530819 562583 606628 610931 654177 677795 656358 660358 676423 712203 746026 784007 800864
13396 800864 837046 895391 974061 1006220 1016382 1064020 1128097 1200505 1304030 1451902 1597066
13385 1597066 1710240 1819846 1913775 2034708 2212154 2419374 2718936 3058108 3502962 4114571
13375 4114571 5010654 6370674 8441727 11361558 14802735 17988376 20534162 21468670
13367 21468670 20328434 19173377 19764925 21813608 24074875 25700620 25665393 23150515
13359 23150515 19702439 17138878 15886396 15804812 16833261 19341718 23887048 30430474
13351 30430474 37550539 44464826 49494472 48819074 44467818 39486395 34062081 29649281
$$ packed form
13421E31862K1615j830j8352l0069N376P786j0980K6515J5867j4323n390O05K137
13408E30819L1764M4045M303M3246K3618k1437M000J6065L5780L3823L7981J6857
13396H00864L6182N8345P8670L2159J0162M7638O4077P2408J03525J47872J45164
13385A597066J13174J09606R3929J20933J77446K07220K99562L39172M44854O11609
13375D114571Q96083J360020K071053K919831L441177L185641K545786R34508
13367B1468670j140236j155057N91548K048683K261267J625745l5227k514878
13359B3150515l448076k563561j252482q1584J028449K508457M545330O543426
13351C0430474P120065O914287N029646o75398m351256m981423n424314m412800
$$ plain form
13343 29649281 27430765 27573450 29810995 33429502 36941768 39319539 39411514 35760370
13335 35760370 30233644 25747035 23084541 21968868 22146156 23707589 27245602 33566130
13327 33566130 42103515 50016390 56173813 58609631 53216686 45000550 40696139 41439784
13319 41439784 46650350 54851719 63484187 71358848 76739625 77446720 76620047 76823372
13311 76823372 76979694 74364919 65707818 53491807 42890112 35510185 30528686 26988831
13303 26988831 24274167 22062603 20286022 18758579 17428385 16283024 15306912 14485091
13295 14485091 13744254 13105917 12601838 12162990 11735777 11357931 11056721 10781322 10530513
13286 10530513 10291325 10123272 9960413 9856421 9796124 9764742 9780589 9867554 10042721 10291742
$$ packed form
13343B9649281k218516J42685K237545L618507L512266K377771R1975l651144
13335C5760370n526726m486609k662494j115673J77288J561433L538013O320528
13327C3566130Q537385P912875O157423K435818n392945q216136m304411P43645
13319D1439784N210566Q201369Q632468P874661N380777P07095q26673K03325
13311G6823372J56322k614775q657101j2216011j0601695p379927m981499l539855
13303B6988831k714664k211564j776581j527443j330194j145361r76112q21821
13295A4485091p40837o38337n04079m38848m27213l77846l01210k75399k50809
13286A0530513k39188j68053j62859j03992o0297l1382J5847Q6965J75167K49021
$$ plain form
13276 10291742 10647890 11105099 11684445 12437093 13474322 14893463 16928584 19926402 24392439
13267 24392439 31111988 40480671 51240112 61323184 69578996 73732522 73479380 72586354
13259 72586354 72561942 72525288 69328805 60730959 51242413 45471479 44472733 47897069 53675776
13250 53675776 58611901 61965434 60301122 51083852 40915236 34266501 30650941 28897687
13242 28897687 28264235 28719908 30637070 34150603 38477385 42249721 44625415 44194479
13234 44194479 40312506 35823135 33148629 32749139 34542627 38204283 43055447 48759498
13226 48759498 53805164 55317002 53920517 49702612 41775117 34084663 29171524 26420288
13218 26420288 25061129 24718461 25350913 27021820 29424360 31681300 33232663 33196752 31023686
$$ packed form
13276A0291742L56148M57209N79346P52648J037229J419141K035121K997818M466037
13267B4392439O719549R368683J0759441J0083072Q255812M153526k53142q93026
13259G2586354k4412l6654l196483q597846r488546n770934r98746L424336N778707
13250E3675776M936125L353533j664312r217270j0168616o648735l615560j753254
13242B8897687o33452M55673J917162L513533M326782L772336K375694m30936
13234D4194479l881973m489371k674506l99490J793488L661656M851164N704051
13226D8759498N045666J511838j396485m217905p927495p690454m913139k751236
13218B6420288j359159l42668O32452J670907K402540K256940J551363l5911k173066
$$ plain form
13209 31023686 28496694 27564398 28192839 29216647 29810532 29052049 25958318 21834019 18527231
13200 18527231 16289457 14733259 13547513 12565300 11736766 10990838 10368857 9874739 9419847
13191 9419847 9022662 8655987 8345120 8060933 7757341 7434817 7162867 6898744 6663474
13182 6663474 6454783 6262723 6031547 5848325 5672289 5494626 5330806 5201370 5059952
13173 5059952 4899482 4723227 4553436 4385878 4266111 4157655 4051236 3918248 3776112
13164 3776112 3671447 3577234 3476250 3388984 3325347 3242574 3172131 3079207 2950621 2845347
13154 2845347 2749757 2696980 2658454 2572058 2486228 2423293 2376438 2346201 2271089 2167126 2110243
13143 2110243 2056954 1999052 1981419 1938313 1878536 1829694 1778388 1737324 1673780 1637924 1612785
$$ packed form
13209C1023686k526992r32296O28441J023808N93885p58483l093731m124299l306788
13200A8527231k237774j556198j185746r82213q28534p45928o21981m94118m54892
13191I419847l97185l66675l10867k84187l03592l22524k71950k64123k35270
13182F663474k08691j92060k31176j83222j76036j77663j63820j29436j41418
13173E059952j60470j76255j69791j67558j19767j08456j06419j32988j42136
13164C776112j04665r4213j00984q7266o3637q2773p0443r2924j28586j05274
13154B845347r5590n2777l8526q6396q5830o2935m6855l0237p5112j03963n6883
13143B110243n3289n7902j7633m3106n9777m8842n1306m1064o3544l5856k5139
$$ plain form
13132 1612785 1592122 1549134 1507557 1504361 1480121 1413096 1347179 1316402 1307094 1261701 1242208 1201597
13120 1201597 1163344 1145349 1131251 1119001 1094703 1067109 1053788 1002097 953493 944355 938014 910330
13108 910330 888252 872698 837068 849813 835301 807494 786111 768682 754466 755151 744010 714136
13096 714136 714500 704591 687208 669127 639566 622548 621129 584057 556826 544373 532591 522994
13084 522994 461789 448252 485732 502681 499298 466373 425795 436720 430841 422388 439386 432044
13072 432044 404632 373551 347068 352248 381953 369429 341322 318894 314152 322309 294222 269063
13060 269063 281540 247372 257498 305269 301475 300517 296736 323227 319180 308289 299038 288917 295909
13047 295909 315685 268250 239816 241551 232955 177205 142784 159255 184077 168005 175171 181444
$$ packed form
13132A612785k0663m2988m1577l196k4240o7025o5917l0777r308m5393j9493m0611
13120A201597l8253j7995j4098j2250k4298k7594j3321n1691m8604r138o341k7684
13108I10330k2078j5554l5630J2745j4512k7807k1383j7429j4216O85j1141k9874
13096G14136L64r909j7383j8081k9561j7018j419l7072k7231j2453j1782r597
13084E22994o1205j3537L7480J6949l383l2925m0578J0925n879q453J6998p342
13072D32044k7412l1081k6483N180K9705j2524k8107k2428m742Q157k8087k5159
13060B69063J2477l4168J0126M7771l794r58l781K6491m047j0891r251j0121O992
13047B95909J9776m7435k8434J735q596n5750l4421J6471K4822j6072P166O273
$$ plain form
13035 181444 168931 178700 187080 209605 204764 209411 240492 268823 243373 206196 193976 193905 173785
13022 173785 158029 178304 141334 118340 128559 120133 161898 199525 214641 207977 209788 206990
13010 206990 189593 175038 147026 131880 160713 164133 153930 137099 114300 100706 115523 111944
12998 111944 113898 115567 109204 141896 181025 161268 113562 126287 115730 116344 137994 152422
12986 152422 139525 126877 103814 78616 85460 111680 94489 83274 98476 91042 81616 58974
12974 58974 30580 29756 49033 59939 34975 7617 42430 75192 98757 89298 71575 62926
12962 62926 43852 16801 17444 81025 126457 120044 108603 112817 149516 163462 171169 148607 123743
12949 123743 165516 218140 232870 226212 257339 374031 522440 696570 895770 1062461 1214370
$$ packed form
13035A81444j2513R769Q380K2525m841M647L1081K8331k5450l7177j2220p1k0120
13022A73785j5756K0275l6970k2994J0219q426M1765L7627J5116o664J811k798
13010B06990j7397j4555k8012j5146K8833L420j0203j6831k2799j3594J4817l579
12998A11944J954J669o363L2692L9129j9757m7706J2725j0557O14K1650J4428
12986A52422j2897j2648k3063k5198O844K6220j7191j1215J5202p434r426k2642
12974E8974k8394q24J9277J0906k4964k7358L4813L2762K3565r459j7723q649
12962F2926j9074k7051O43O3581M5432o413j1441M214L6699J3946P707k2562k4864
12949A23743M1773N2624J4730o658L1127J16692J48409J74130J99200J66691J51909
$$ plain form
12938 1214370 1264742 1144972 906896 707819 556639 444375 389648 333769 317330 300662
12928 300662 288909 269869 274979 287100 267881 244317 223919 194977 167734 143945 138499 138613
12916 138613 135823 119467 105605 135166 128931 85907 77812 121945 146492 144740 137199 114376
12904 114376 97534 77930 95470 122512 117767 111785 107168 131833 168583 174633 138203 116866
12892 116866 146570 179047 210026 284014 335502 344856 378880 383390 361153 309812 285920 273423
12880 273423 211611 182856 178903 218053 262983 271960 256935 275694 295198 281209 255085 235780
12868 235780 195838 188457 178082 167013 174228 210282 276328 317794 346344 351592 335644 295477
12856 295477 257404 246051 223098 237895 251057 236807 235497 279102 297897 257090 218633 188213
$$ packed form
12938A214370N0372j19770k38076j99077j51180j12264n4727n5879j6439j6668
12928C00662j1753j9040N110J2121j9219k3564k0398k8942k7243k3789n446J14
12916A38613k790j6356j3862K9561o235m3024q095M4133K4547j752p541k2823
12904A14376j6842j9604J7540K7042m745n982m617K4665L6750O050l6430k1337
12892A16866K9704L2477L0979P3988N1488R354L4024M510k2237n1341k3892j2497
12880B73423o1812k8755l953L9150M4930Q977j5025J8759J9504j3989k6124j9305
12868B35780l9942p381j0375j1069P215L6054O6046M1466K8550N248j5948m0167
12856B95477l8073j1353k2953J4797J3162j4250j310M3605J8795m0807l8457l0420
$$ plain form
12844 188213 178548 169664 175578 185502 191464 216231 210872 219585 272403 343191 370496 377419 369034
12831 369034 330335 290763 230979 178176 169368 154581 125484 91496 92439 120998 141342 135073
12819 135073 136096 134173 116983 87038 62190 24234 8596 18923 31056 17955 54514 74713
12807 74713 55460 69883 85224 113254 91305 82865 85155 92505 108171 122549 134885 146485
12795 146485 173521 212831 261146 320605 368915 400400 350349 297024 282890 248061 222988
12784 222988 212389 222864 214878 230875 252755 288105 289126 283745 294525 298337 261624 211268
12772 211268 191186 168170 179285 217279 267577 270086 317697 395915 451934 501036 475804 390897
12760 390897 303970 281616 288294 290793 311424 371787 397347 377910 347815 357005 327010 286656
$$ packed form
12844A88213r665q884N914R924N962K4767n359Q713N2818P0788K7305O923q385
12831C69034l8699l9572n9784n2803q808j4787k9097l3988R43K8559K0344o269
12819A35073J023j923j7190k9945k4848l7956j5638J0327J2133j3101L6559K0199
12807G4713j9253J4423J5341K8030k1949q440K290P350J5666J4378J2336J1600
12795A46485K7036L9310M8315N9459M8310L1485n0051n3325j4134l4829k5073
12784B22988j0599J0475p986J5997K1880L5350J021n381J0780L812l6713n0356
12772B11268k0082k3016J1115L7994N0298K509M7611P8218N6019M9102k5232q4907
12760C90897q6927k2354O678K499K0631O0363K5560j9437l0095R190k9995m0354
$$ plain form
12748 286656 242917 252189 246084 228611 220751 250818 279096 309736 332930 370099 399402 379730
12736 379730 335116 312548 278657 223772 216497 226635 225186 174772 137014 132268 140022 145935
12724 145935 148732 147485 128388 116815 92333 100039 118102 101036 77063 91520 101283 74327
12712 74327 51298 78554 109526 110200 98798 118291 133194 114496 103180 87388 83823 91094
12700 91094 109717 91525 85560 101039 102981 95385 89868 115436 125785 130654 112833 69075 37636
12687 37636 57530 84847 75866 64729 75299 98732 102102 63562 66259 92719 104215 71972
12675 71972 74080 76568 90566 87473 113879 187022 182209 149725 131379 100312 86731 86234 42169
12662 42169 47548 49837 42530 19426 2393 7435 8652 25651 27178 37696 82685 101688 102709
$$ packed form
12748B86656m3739R272o105j7473p860L0067K8278L0640K3194L7169K9303j9672
12736C79730m4614k2568l3891n4885p275J0138j449n0414l7758m746P754N913
12724A45935K797j247j9097j1573k4482P706J8063j7066k3973J4457R763k6956
12712G4327k3029K7256L0972O74j1402J9493J4903j8698j1316j5792l565P271
12700I1094J8623j8192n965J5479J942p596n517K5568J0349M869j7821m3758l1439
12687C7636J9894K7317q981j1137J0570K3433L370l8540K697K6460J1496l2243
12675G1972K108K488J3998l093K6406P3143m813l2484j8346l1067j3581m97m4065
12662D2169N379K289p307k3104j7033N042J217J6999J527J0518M4989J9003J021
$$ plain form
12649 102709 68356 44262 72518 108461 135376 117181 59617 56567 92490 95629 76133 53589
12637 53589 109215 167224 213520 241999 274832 277310 257796 259361 286457 300242 308237 297189
12625 297189 308898 300724 294654 312077 322625 302054 286337 287549 265038 274290 256286 243969
12613 243969 225268 226500 256530 292170 306627 314025 309826 316566 335394 320557 311420 290478
12601 290478 305057 306917 273424 276341 298048 326918 326794 351237 358069 319644 314881 303149 310676
12588 310676 336506 401512 425450 455718 451019 420214 428671 432749 432379 457332 451997 474606 496473
12575 496473 504389 578051 729012 916929 1146570 1464821 1761987 1908173 1923590 1749868
12565 1749868 1504284 1265290 1088308 959114 883570 854855 873596 881514 899727 917306 937644
$$ packed form
12649A02709l4353k4094K8256L5943K6915j8195n7564l050L5923L139j9496k2544
12637E3589N5626N8009M6296K8479L2833K478j9514J565K7096J3785P995j1048
12625B97189J1709q174o070J7423J0548k0571j5717J212k2511R252j8004j2317
12613B43969j8701J232L0030L5640J4457P398m199O740J8828j4837r137k0942
12601B90478J4579J860l3493K917K1707K8870j24K4443O832l8425m763j1732P527
12588C10676K5830O5006K3938L0268m699l0805Q457M078l70K4953n335K2609K1867
12575D96473P916P3662J50961J87917K29641L18251K97166J46186J5417j73722
12565A749868k45584k38994j76982j29194p5544k8715J8741P918J8213J7579K0338
$$ plain form
12554 937644 958445 969237 972754 981909 1043517 1095244 1121666 1140397 1175122 1225730 1266738 1341225
12542 1341225 1406637 1503920 1622431 1772484 1909343 2088355 2232954 2386624 2576956 2821738
12532 2821738 3083789 3334033 3633717 4051188 4599102 5313826 6247547 7497934 8972749
12523 8972749 10544444 12074509 13496888 14785621 16239354 18282747 21478985 26440358
12515 26440358 33938959 45494418 63665902 91841870 131368241 176147741 215154396
12508 215154396 238885845 234808938 198614298 150236851 110911707 85114520 68757590
12501 68757590 57752851 49821678 43818110 39128597 35489010 32645688 30344967 28388189
12493 28388189 26574460 24784718 22982393 21205489 19648222 18354775 17298517 16376090
$$ packed form
12554I37644K0801J0792L517R155O1608N1727K6422J8731L4725N0608M1008P4487
12542A341225O5412R7283J18511J50053J36859J79012J44599J53670J90332K44782
12532B821738K62051K50244K99684M17471N47914P14724R33721J250387J474815
12523H972749J571695J530065J422379J288733J453733K043393L196238M961373
12515B6440358P498601J1555459J8171484K8175968L9526371M4779500L9006655
12508B15154396K3731449m076907l6194640m8377447l9325144k5797187j6356930
12501F8757590j1004739p931173o003568m689513l639587k843322k300721j956778
12493B8388189j813729j789742j802325j776904j557267j293447j056258r22427
$$ plain form
12485 16376090 15572601 14864898 14227298 13641676 13086568 12575600 12133349 11748342 11362723
12476 11362723 10972713 10583940 10220378 9869646 9513887 9142729 8812345 8508450 8188025
12467 8188025 7873179 7597850 7366925 7111739 6881385 6680708 6447840 6270486 6095610
12458 6095610 5953697 5855413 5739982 5575486 5396703 5231767 5038997 4834668 4680700 4537038
12448 4537038 4434613 4319549 4245107 4179679 4098668 4000341 3921060 3847166 3752542 3633222 3500000
12437 3500000 3392107 3334710 3278888 3197673 3076897 2962491 2894679 2851099 2805499 2748565 2708414
12426 2708414 2650345 2579218 2478718 2401544 2338968 2282188 2255731 2226382 2173007 2142827 2147452
12415 2147452 2152595 2186017 2257900 2308674 2407750 2513942 2603263 2668567 2662326 2573419 2414492
$$ packed form
12485A6376090q03489p07703o37600n85622n55108n10968m42251l85007l85619
12476A1362723l90010l88773l63562l50732l55759l71158l30384l03895l20425
12467H188025l14846k75329k30925k55186k30354k00677k32868j77354j74876
12458F095610j41913r8284j15431j64496j78783j64936j92770k04329j53968j43662
12448D537038j02425j15064p4442o5428q1011r8327p9281p3894r4624j19320j33222
12437C500000j07893n7397n5822q1215j20776j14406o7812m3580m5600n6934m0151
12426B708414n8069p1127j00500p7174o2576n6780k6457k9349n3375l0180M625
12415B147452N143L3422P1883N0774R9076J06192Q9321O5304o241q8907j58927
$$ plain form
12404 2414492 2247714 2076059 1921009 1775678 1660806 1563393 1467851 1403840 1364060 1303002
12394 1303002 1249099 1201430 1181424 1145121 1109695 1057190 1030039 1027731 1005853 1008227 1006593 1019915
12382 1019915 1017783 1012110 978945 918757 893358 917482 938796 912449 876029 835758 802743 755993
12370 755993 737901 721699 716780 704911 665982 596923 550591 543331 550431 531349 526714 563807
12358 563807 538747 513809 492561 474727 450531 440228 410973 377985 348929 345716 339767 291948
12346 291948 272713 284367 304383 276530 272897 309578 342182 335132 291740 237728 226286 249420
12334 249420 287667 289820 314856 314930 265806 253391 224521 226766 232551 200248 189285 197205 175587
12321 175587 143392 151862 194333 200998 183285 181969 179300 182305 141817 148596 128944 122354 138143
$$ packed form
12404B414492j66778j71655j55050j45331j14872r7413r5542o4011l9780o1058
12394A303002n3903m7669k0006l6303l5426n2505k7151k308k1878K374j634J3322
12382A019915k132n673l3165o0188k5399K4124K1314k6347l6420m0271l3015m6750
12370G55993j8092j6202m919j1869l8929o9059m6332p260P100j9082m635L7093
12358E63807k5060k4938k1248j7834k4196j0303k9255l2988k9056l213n949m7819
12346B91948j9235J1654K0016k7853l633L6681L2604p050m3392n4012j1442K3134
12334B49420L8247K153K5036P4m9124j2415k8870K245N785l2303j0963P920k1618
12321A75587l2195Q470M2471O665j7713j316k669L005m0488O779j9652o590J5789
$$ plain form
12308 138143 165109 186087 189166 181857 164381 189294 178782 175723 181003 183160 185664 173238 165893
12295 165893 151992 126768 123583 123023 102343 129185 128788 141202 160147 174595 169345 172297 165377
12282 165377 185813 185210 163334 162217 142085 134884 126860 126740 135795 112429 150971 172134 146661
12269 146661 126621 96631 87039 83477 87631 98409 115732 123452 91283 78356 113421 96748
12257 96748 74542 93137 107239 105980 81934 134004 184277 161958 127271 114385 120160 143417
12245 143417 142542 128416 92557 72959 53682 50578 79418 108486 109541 86718 64514 76414
12233 76414 98045 101062 101262 115667 127194 107365 70059 77085 116566 120230 107675 74790 82026
12220 82026 92232 78795 110561 120656 110774 64738 68655 84987 67981 61513 61889 54406 43578
$$ packed form
12308A38143K6966K0978L079p309j7476K4913j0512l059N280K157K504j2426p345
12295A65893j3901k5224l185n60k0680K6842l97J2414J8945J4448n250K952o920
12282A65377K0436o03k1876j117k0132p201q024j20R055k3366L8542K1163k5473
12269A46661k0040k9990r592l562M154J0778J7323P720l2169j2927L5065j6673
12257I6748k2206J8595J4102j259k4046N2070N0273k2319l4687j2886N775K3257
12245A43417q75j4126l5859j9598j9277l104K8840K9068J055k2823k2204J1900
12233G6414K1631L017K00J4405J1527j9829l7306P026L9481L664j2555l2885P236
12220H2026J0206j3437L1766J0095r882m6036L917J6332j7006o468L76p483j0828
$$ plain form
12207 43578 33884 64139 90401 108464 92044 56941 60866 34692 33539 60846 86950 82393
12195 82393 76630 49985 40604 20165 5755 12418 22578 54449 71101 64348 59802 61815 47425
12182 47425 43530 35533 22975 37937 31046 12764 -5072 -5356 -5575 -5787 3463 -2546 13177 28980
12168 28980 22383 19206 14527 17709 27086 11865 19208 23491 -1043 -14048 -24834 -9863 -15575
12155 -15575 -18191 25263 42999 13224 -15760 -35087 -28385 -15454 -20305 -19352 -1797 1794 -19454
12142 -19454 -22067 -6869 14078 11713 6462 -29574 -547 34805 31669 20696 38157 78356
12130 78356 83756 77746 39089 39061 51725 31336 33406 3752 30267 21228 -1930 -5601 -9090
12117 -9090 -13326 -3565 6312 15008 4906 -29632 -32121 -27433 267 23502 4273 10264 18970
$$ packed form
12207D3578r694L0255K6262J8063j6420l5103L925k6174j153K7307K6104m557
12195H2393n763k6645r381k0439j4410O663J0160L1871J6652o753m546K013j4390
12182D7425l895p997j2558J4962o891j8282j7836k84k19k12R250o009J5723J5803
12168B8980o597l177m679L182R377j5221P343M283k4534j3005j0786J4971n712
12155a5575k616M3454J7736k9775k8984j9327O702J2931m851R53J7555L591k1248
12142a9454k613J5198K0947k365n251l6036K9027L5352l136j0973J7461M0199
12130G8356N400o010l8657k8J2664k0389K070k9654K6515r039k3158l671l489
12117i090m236R761R877Q696j0102l4538k489M688K7700K3235j9229N991Q706
$$ plain form
12104 18970 18828 -8504 11660 63356 72383 59312 45259 56381 60080 41620 48428 55113 78075
12091 78075 55747 70565 65044 71847 90104 87984 80989 89849 124846 160691 181417 213821 211877
12078 211877 260522 349924 454196 624092 858904 1110417 1324904 1452350 1477226 1426443
12068 1426443 1298717 1174131 1211567 1388745 1723098 2176704 2758009 3388912 3866091 4045805
12058 4045805 3895551 3468902 2881224 2308628 1812044 1468241 1260061 1107847 999636
12049 999636 900221 828754 764334 742896 714253 649981 557725 487108 445633 427365 390493
12038 390493 397557 359804 313313 308438 286728 284406 265926 263526 259014 278695 288785 279997 300416
12025 300416 303362 291466 286721 261211 223393 215055 210500 210343 192984 156968 155081 173559 178867
$$ packed form
12104A8970j42k7332K0164N1696R027j3071j4053J1122L699j8460O808O685K2962
12091G8075k2328J4818n521O803J8257k120o995Q860L4997L5845K0726L2404j944
12078B11877M8645Q9402J04272J69896K34812K51513K14487J27446K4876n0783
12068A426443j27726j24586L7436J77178L34353M53606N81305O30903M77179J79714
12058D045805j50254m26649n87678n72596m96584l43803k08180j52214j08211
12049I99636r9415p1467o4420k1438k8643o4272r2256p0617m1475j8268l6872
12038C90493P064l7753m6491m875k1710k322j8480k400m512J9681J0090q788K0419
12025C00416K946j1896m745k5510l7818q338m555j57j7359l6016j887J8478N308
$$ plain form
12012 178867 192895 187358 151461 111009 95878 88574 96428 112200 125581 115598 91587 124406
12000 124406 141276 112978 91960 83309 88451 104330 107434 125633 161326 165201 137429 78383
11988 78383 56600 37028 38756 94579 139606 150609 143294 136002 115576 90041 53768 43857
11976 43857 53884 33070 49934 67713 71338 37229 36567 54602 83984 90859 114280 102880
11964 102880 79641 58196 14696 16015 34495 36264 36027 37019 11978 7029 19196 -784 -1228
11951 -1228 11492 13598 -112 -791 6352 13025 9568 -1718 5339 45921 72414 71585 57734 44565
11937 44565 45579 32447 25695 -10672 6533 26735 47660 53176 21697 21947 17667 23327 26390
11924 26390 35780 35565 13208 923 -5172 -25200 -23282 -28267 -35670 -43793 -45786 -39321 -34185 -26564
$$ packed form
12012A78867J4028n537l5897m0452j5131p304P854J5772J3381r983k4011L2819
12000A24406J6870k8298k1018q651N142J5879L104J8199L5693L875k7772n9046
11988G8383k1783j9572J728N5823M5027J1003p315p292k0426k5535l6273r911
11976D3857J0027k0814J6864J7779L625l4109o62J8035K9382O875K3421j1400
11964A02880k3239k1445m3500J319J8480J769k37R92k5041m949J2167j9980m44
11951a228J2720K106j3710o79P143O673l457j1286P057M0582K6493q29j3851j3169
11937D4565J014j3132o752l6367J7205K0202K0925N516l1479K50m280N660L063
11924B6390R390k15k2357j2285o095k0028J918m985p403q123j993O465N136P621
$$ plain form
11910 -26564 -40278 -42362 -31769 -57103 -42978 -50598 -51318 -26654 -18120 -24301 -34165 -34399 -65345
11897 -65345 -74509 -69549 -62979 -44303 -20274 -36233 -66454 -24626 -3407 -34689 -49780 -24226
11885 -24226 -53667 -91768 -87137 -70016 -39354 6843 4334 -43168 -52259 -14136 26015 19680
11873 19680 20853 21798 3762 2751 29992 18653 401 -17705 -25615 -33023 4031 33491 32116
11860 32116 2633 -3371 21520 20577 17219 5875 -23493 -10709 -21407 -23496 -2712 -2257 -19468
11847 -19468 -39961 -40223 -42025 -27973 -11696 -41915 -63572 -7574 17125 34036 58747 39538
11835 39538 -18234 -25073 -16718 -215 9932 -499 19728 33891 17572 4105 -15229 -7716
11823 -7716 1768 19426 37444 29285 28481 19315 10196 4326 -27147 -20997 -1797 15561 8649 -31950
$$ packed form
11910b6564j3714k084J0593k5334J4125p620p20K4664Q534o181r864k34l0946
11897f5345r164M960O570J8676K4029j5959l0221M1828K1219l1282j5091K5554
11885b4226k9441l8101M631J7121L0662M6197k509m7502r091L8123M0151o335
11873A9680J173R45j8036j011K7241j1339j8252j8106p910p408L7054K9460j375
11860C2116k9483o004K4891r43l358j1344k9368J2784j0698k089K0784M55j7211
11847a9468k0493k62j802J4052J6277l0219k1657N5998K4699J6911K4711j9209
11835C9538n7772o839Q355J6503J0147j0431K0227J4163j6319j3467j9334P513
11823g716R484J7658J8018q159q04r166r119n870l1473O150J9200J7358o912m0599
$$ plain form
11809 -31950 -58034 -78508 -45194 -30185 -37566 -70515 -58174 -44369 -22142 -23941 -25468 -22634
11797 -22634 -31103 -31275 -35167 -17740 7259 -1348 -50871 -57538 -55377 -36630 -15678 -25064 -28209
11784 -28209 -50824 -64380 -46047 -58093 -29273 -1490 2171 12972 5473 -20114 -30850 6005
11772 6005 13524 6349 9090 -314 -29528 -34777 774 25759 21101 11046 9226 -10125 -35415
11759 -35415 -12192 -7361 6879 10126 16545 8874 -4297 19026 -7628 -9562 11799 -7097 -5968
11746 -5968 19355 19359 -7159 -30538 -27845 -53702 -53474 -65556 -68740 -74252 -61987 -7025 -4428 -37076
11732 -37076 -43178 -45379 -41336 -28276 -3777 3468 -10379 -42753 -32274 -28115 554 6148 4617
11719 4617 -16225 -19055 -14077 -4832 -3889 -26216 -33543 -30054 -16667 -19676 -31464 -38633 -73153 -61428
$$ packed form
11809c1950k6084k0474L3314J5009p381l2949J2341J3805K2227j799j527K834
11797b2634q469j72l892J7427K4999q607m9523o667K161J8747K0952r386l145
11784b8209k2615j3556J8333j2046K8820K7783L661J0801p499k5587j0736L6855
11772F005P519p175K741r404k9214n249L5551K4985m658j0055j820j9351k5290
11759c5415K3223M831J4240L247O419p671j3171K3323k6654j934K1361j8896J129
11746e968K5323Mk6518k3379K693k5857K28j2082l184n512J2265N4962K597l2648
11732c7076o102k201M043J3060K4499P245j3847l2374J0479M159K8669N594j531
11719D617k0842k830M978R245R43k2327p327L489J3387l009j1788p169l4520J1725
$$ plain form
11705 -61428 -49682 -37456 -6699 1465 -9898 -248 -3380 -6916 8471 13031 22027 20111 -7266
11692 -7266 -27978 -56907 -60706 -26510 -8667 -8882 -26447 -43320 -28318 -16494 -29018 -22172 -10138
11679 -10138 -31978 -26361 -1281 6987 22457 32817 28644 40810 29449 12767 2864 -694 8228
11666 8228 -18058 -68443 -51266 4572 4202 -1288 -18797 -30478 1412 37449 6790 -48591
11654 -48591 -57531 -44465 -39617 -22665 -37303 -33700 -22145 -26463 -46263 -32003 -19562 12728
11642 12728 28474 12069 -42173 -56129 -69401 -58963 879 20983 462 -25263 6474 45022
11630 45022 47604 24264 5878 -18307 -21360 18776 30918 -3071 -23456 -23997 -16682 -316 2827
11617 2827 -10240 33762 36377 7546 -15202 -49726 -49335 -30539 9354 14557 -18442 -36445 -25613
$$ packed form
11705f1428J1746J2226L0757Q164j1363R650l132l536J5387M560Q996j916k7377
11692g266k0712k8929l799L4196J7843k15j7565j6873J5002J1824j2524O846J2034
11679a0138k1840N617K5080Q268J5470J0360m173J2166j1361j6682r903l558Q922
11666H228k6286n0385J7177N5838l70n490j7509j1681L1890L6037l0659n5381
11654d8591q940J3066M848J6952j4638L603J1555m318j9800J4260J2441L2290
11642A2728J5746j6405n4242j3956j3272J0438N9842K0104k0521k5725L1737L8548
11630D5022K582k3340j8386k4185l053M0136J2142l3989k0385n41P315J6366L143
11617B827j3067M4002K615k8831k2748l4524L91J8796L9893N203l2999j8003J0832
$$ plain form
11604 -25613 -8981 16313 57969 34313 26771 26106 8535 -19874 -47936 -20938 6039 -25369
11592 -25369 -41022 -47827 -39653 -54880 -44410 -69387 -99441 -67776 -57898 -80790 -95670 -101728
11580 -101728 -68331 -25961 14365 5486 -59444 -74507 -70405 -70991 -61270 -19059 -4846 -13346 -15643
11567 -15643 -12359 -18339 -22784 17655 40676 1397 -34196 -43529 -52924 -41871 -62492 -85271 -88141
11554 -88141 -52650 -26357 -8917 -8701 2828 21198 53729 38978 9326 4238 -14702 -42224
11542 -42224 -67403 -51171 2426 14672 2570 6205 33009 1547 -18481 -1745 14142 14807
11530 14807 26795 26513 4409 -9888 -8018 -845 -37262 -26866 -2442 -7915 -4257 2343 8627
11517 8627 16005 -9601 -16707 -18145 -30825 -49283 -65623 -53489 -15315 -171 -7331 -6079 2011
$$ packed form
11604b5613J6632K5294M1656k3656p542o65j7571k8409k8062K6998K6977l1408
11592b5369j5653o805Q174j5227J0470k4977l0054L1665R878k2892j4880o058
11580a01728L3397M2370M0326q879o4930j5063M102n86R721M2211J4213q500k297
11567a5643L284n980m445M0439K3021l9279l5593r333r395J1053k0621k2779k870
11554h8141L5491K6293J7440K16J1529J8370L2531j4751k9652n088j8940k7522
11542d2224k5179J6232N3597J2246j2102L635K6804l1462k0028J6736J5887O65
11530A4807J1988k82k2104j4297J870P173l6417J0396K4424n473L658O600O284
11517H627P378k5606p106j438j2680j8458j6340J2134L8174J5144p160J252Q090
$$ plain form
11504 2011 28161 -2550 -29822 -23995 -20616 -2905 6392 15571 3823 -7458 5760 41905 55348
11491 55348 40394 51383 54223 23505 -6146 -4359 -11841 -310 20994 5109 4202 4398 15899
11478 15899 -9797 -13235 -28362 -37405 -40257 -23802 -14493 -20056 -17870 -169 -10149 -15679 -45083
11465 -45083 -42666 -34107 -33479 -11063 -631 -36446 -32100 2101 10321 -17622 -28773 -19349 -20239
11452 -20239 -28331 -16034 -15085 5254 16833 49894 50973 1342 -19804 -10414 34660 56238 42415
11439 42415 21429 1061 -21399 -38670 -19138 -786 -5677 -17033 -5249 -33430 -59097 -99122
11427 -99122 -102606 -64718 -37948 -22033 -20094 -33266 -5565 -1691 -1745 -39 3105 -31714 -62253
11414 -62253 -28890 -42662 -43091 -3622 40027 41802 30922 17717 2625 7170 10006 -15706 -22331
$$ packed form
11504B011K6150l0711k7272N827L379J7711R297R179j1748j1281J3218L6145J3443
11491E5348j4954J0989K840l0718k9651J787p482J1531K1304j5885r07J96J1501
11478A5899k5696l438j5127r043k852J6455R309n563K186J7701r980n530k9404
11465d5083K417Q559O28K2416J0432l5815M346L4201Q220k7943j1151R424q90
11452b0239q092J2297R49K0339J1579L3061J079m9631k1146R390M5074K1578j3823
11439D2415k0986k0368k2460j7271J9532J8352m891j1356J1784k8181k5667m0025
11427i9122l484L7888K6770J5915J939j3172K7701L874n4J706L144l4819l0539
11414f2253L3363j3772m29L9469M3649J775j0880j3205j5092M545K836k5712o625
$$ plain form
11401 -22331 -22951 -19140 -13934 -22874 -42718 -23042 -2753 -8406 -15688 -23421 -7120 21952 20306
11388 20306 5637 6303 8214 29740 58546 67293 49793 6934 -18660 -8278 3389 7200 -1395
11375 -1395 -3527 -7898 -20695 7067 23961 36859 57670 52950 35195 34657 37904 17782 28728
11362 28728 62379 93154 146271 211030 265337 348564 429485 492512 513116 525056 500123 453781
11350 453781 350989 292025 235364 198008 199820 166402 140032 124914 97480 58901 18315
11339 18315 44467 104883 104504 59505 41478 20533 36841 57412 45767 30813 6184 -18278
11327 -18278 -24847 -19528 765 507 4114 -9571 -12260 2991 64 23062 32490 14641 -5152
11314 -5152 4134 20814 45774 46918 51494 64499 55948 62615 42672 28273 47459 32466 -3817
$$ packed form
11401b2331o20L811N206q940j9844J9676K0289n653p282p733J6301K9072j646
11388B0306j4669O66J911K1526K8806Q747j7500m2859k5594J0382J1667L811q595
11375a395k132m371j2797K7762J6894J2898K0811m720j7755n38L247k0122J0946
11362B8728L3651L0775N3117O4759N4307Q3227Q0921O3027K0604J1940k4933m6342
11350D53781j02792n8964n6661l7356J812l3418k6370j5118k7434l8579m0586
11339A8315K6152O0416l79m4999j8027k0945J6308K0571j1645j4954k4629k4462
11327a8278o569N319K0293k58L607j3685k689J5251k927K2998R428j7849j9793
11314e152R286J6680K4960J144M576J3005q551O667j9943j4399J9186j4993l6283
$$ plain form
11301 -3817 -28549 -24390 -5475 19820 13286 11450 6521 18981 17930 6670 -17203 -36003 -43154
11288 -43154 -15799 -45218 -50884 -21524 -15236 -17538 -29344 -27012 -42047 -29116 -40196 -44487 -23318
11275 -23318 166 25797 -10746 -38948 -26718 -18354 16725 61152 67514 40444 19452 45872
11263 45872 51487 41219 5007 -20336 -22575 -6293 -886 -283 12287 -11064 -10973 24207 55320
11250 55320 53353 47086 60834 82724 71897 17181 -21733 -11750 -28674 -24728 -19513 -7274 -3676
11237 -3676 6034 -14972 -30924 -9706 5164 16905 -702 -25863 -40623 -33766 -26570 -12945
11225 -12945 -19383 19538 41497 31604 18324 18439 15364 12284 16412 33666 57581 46078 3529
11212 3529 -27997 -28941 -32832 5927 65353 64917 62823 59314 34332 -1838 -3294 -7424 -4415 -1076
$$ packed form
11301c817k4732M159J8915K5295o534j836m929J2460j051j1260k3873j8800p151
11288d3154K7355k9419n666K9360O288k302j1806K332j5035J2931j1080m291K1169
11275b3318K3484K5631l6543k8202J2230Q364L5079M4427O362k7070k0992K6420
11263D5872N615j0268l6212k5343k239J6282N407O03J2570k3351R1L5180L1113
11250E5320j967o267J3748K1890j0827n4716l8914R983j6924L946N215J2239L598
11237c676R710k1006j5952K1218J4870J1741j7607k5161j4760O857P196J3625
11225a2945o438L8921K1959r893j3280J15l075l080M128J7254K3915j1503m2549
11212C529l1526r44l891L8759N9426m36k094l509k4982l6170j456m130L009L339
$$ plain form
11198 -1076 8033 4728 2528 3639 -11457 -20143 -47941 -39203 -33044 -46791 -53892 -16177 -2906
11185 -2906 13812 54135 27445 -12734 -28302 5630 31802 3688 1808 10884 -1075 2084
11173 2084 43715 54057 26010 45034 39449 26241 1531 23290 22898 -24471 -23553 -206 -1467
11160 -1467 -24402 -23576 -16772 -10199 21529 46564 13743 -16005 -41556 -38046 -41839 -51113 -42501
11147 -42501 -19404 -1235 -60 -8116 9171 30102 11648 -12245 -5538 9277 42746 47698
11135 47698 19427 14687 22446 27307 23975 7526 22893 32307 32580 7189 6323 -40848 -36691 -13407
11121 -13407 17006 32790 15747 5769 -8740 26398 79929 59757 10996 -7125 -1548 3781
11109 3781 -13879 -23427 -39208 -62262 -54359 -35491 -40693 -63765 -85962 -72636 -56312 -22482
$$ packed form
11198a076R109l305k200J111j5096q686k7798Q738O159j3747p101L7715J3271
11185b906J6718M0323k6690m0179j5568L3932K6172k8114j880R076j1959L159
11173B084M1631J0342k8047J9024n585j3208k4710K1759l92m7369R18K3347j261
11160a467k2935Q26O804O573L1728K5035l2821k9748k5551L510l793r274Q612
11147d2501K3097J8169J175q056J7287K0931j8454k3893O707J4815L3469M952
11135D7698k8271m740P759M861l332j6449J5367R414K73k5391q66m7171M157K3284
11121a3407L0413J5784j7043r978j4509L5138N3531k0172m8761j8121N577N329
11109C781j7660r548j5781k3054P903J8868n202k3072k2197J3326J6324L3830
$$ plain form
11097 -22482 2356 -371 8957 18228 9175 -9023 2404 11939 907 6530 30169 43661 47706
11084 47706 47105 41648 41453 19764 6412 -3279 13397 11530 -9325 4380 21946 21159 16959 -7424
11070 -7424 1594 15078 5145 -12086 -20844 -15136 10151 14956 7005 -34068 -55429 -58395 -67100
11057 -67100 -59187 -54079 -24623 -10482 -12175 3542 26776 41794 17586 13512 -7936 -22877
11045 -22877 -27772 -1272 9410 -6488 -37780 -60351 -58796 -24354 -9983 348 13500 14950
11033 14950 38482 35462 26347 17243 -4351 -2827 -7030 5080 33105 85837 106925 113318 117817
11020 117817 91752 92034 82628 53506 32742 16556 35390 24254 -20957 -31343 -39594 -26288
11008 -26288 -34513 -16457 21033 31989 371 -9988 1052 -5260 -29370 -50641 -25301 -12309
$$ packed form
11097b2482K4838k727R328R271r053j8198J1427R535j1032N623K3639J3492M045
11084D7706o01n457j95k1689j3352r691J6676j867k0855J3705J7566p87m200k4383
11070g424R018J3484r933j7231q758N708K5287M805p951m1073k1361k966q705
11057f7100P913N108K9456J4141j693J5717K3234J5018k4208m074k1448j4941
11045b2877m895K6500J0682j5898l1292k2571J555L4442J4371J0331J3152J450
11033A4950K3532l020r115r104k1594J524m203J2110K8025N2732K1088O393M499
11020A17817k6065K82r406k9122k0764j6186J8834j1136m5211j0386q251J3306
11008b6288q225J8056L7490J0956l1618j0359J1040o312k4110k1271K5340J2992
$$ plain form
10996 -12309 -39371 -17715 -27401 -37728 20160 24937 -5973 -29674 -8054 41354 53127 38123
10984 38123 36382 39157 15886 32270 22830 37118 45047 25121 -3882 -31774 -24492 -4360 -4626
10971 -4626 21002 40185 4980 -9884 -41576 -31246 6781 7145 -20225 -3497 9972 11452
10959 11452 -9178 1995 -1474 -36784 -33595 -1987 11458 283 -3378 4596 -34257 -22509
10947 -22509 -4193 -27245 -9823 -2793 979 5548 -1957 -27337 -28891 -24780 -20104 1363 -17452
10934 -17452 -35415 -41875 -67203 -72575 -81670 -103283 -149730 -136368 -127277 -127539 -123459 -95124 -82097
10921 -82097 -16845 12027 23889 41213 52512 45615 45662 10165 -4118 37007 61764 34508
10909 34508 18812 4334 36744 47983 32435 36905 44589 19044 12542 15015 38702 46942 67421
$$ packed form
10996a2309k7062K1656r686j0327N7888M777l0910k3701K1620M9408J1773j5004
10984C8123j741K775k3271J6384r440J4288P929j9926k9003k7892P282K0132k66
10971d626K5628J9183l5205j4864l1692J0330L8027L64k7370J6728J3469J480
10959A1452k0630J1173l469l5310L189L1608J3445j1175l661P974l8853J1748
10947b2509J8316k3052J7422P030L772M569p505k5380j554M111M676K1467j8815
10934a7452j7963o460k5328n372r095k1613m6447J3362R091k62M080K8335J3027
10921h2097O5252K8872J1862J7324J1299o897M7l5497j4283M1125K4757k7256
10909C4508j5696j4478L2410J1239j5548M470P684k5545o502K473K3687Q240K0479
$$ plain form
10896 67421 93166 101780 170064 234421 293191 399127 553560 794523 1096624 1447583 1763853
10885 1763853 1950208 1927786 1638716 1258632 920272 711052 573569 479633 396765 362331
10875 362331 339880 304930 279574 237525 185530 194999 198380 187201 177202 163742 164629 150228
10863 150228 143600 163637 161535 138770 131290 95071 74319 51238 68926 64108 69167 77577 95168
10850 95168 69326 50387 48135 53848 48665 29820 37535 23883 34919 21124 -18739 -21810 1937
10837 1937 46810 84108 60609 50898 65647 38981 40973 63847 79570 79941 61185 64691 71629
10824 71629 74369 87587 48360 4570 -5076 -12230 10037 22751 30486 11380 18067 26413 37177
10811 37177 50875 23702 16143 21709 12925 9996 11084 20872 31009 28224 8761 -1930 25091
$$ packed form
10896F7421K5745Q614O8284O4357N8770J05936J54433K40963L02101L50959L16270
10885A763853J86355k2422k89070l80084l38360k09220j37483r3936q2868l4434
10875C62331k2451l4950k5356m2049n1995R469L381j1179r999j3460Q87j4401
10863A50228o628K0037k102k2765p480l6219k0752k3081J7688m818N059Q410J7591
10850I5168k5842j8939k252N713n183j8845P715j3652J1036j3795l9863l071K3747
10837A937M4873L7298k3499r711J4749k6666J992K2874J5723L71j8756L506O938
10824G1629K740J3218l9227m3790r646p154K2267J2714P735j9106O687Q346J0764
10811C7177J3698k7173p559N566q784k929J088R788J0137k785j9463j0691K7021
$$ plain form
10798 25091 29043 2303 -8588 16857 19818 7151 -13151 -23050 1446 32903 -8173 -19478
10786 -19478 9672 -6482 882 -10437 -34771 -46081 -53681 -36891 -10619 7438 -21682 -35604
10774 -35604 -51916 -73356 -86154 -57079 -30485 -40527 -37930 -35899 -34618 -11183 -19338 -14707 -16377
10761 -16377 -21300 -21215 -19932 -23826 -4164 -9392 -31995 -33021 -35064 -68112 -65309 -37231 -34069 -24409
10747 -24409 4974 -7288 -26115 -41252 -39117 -7810 -3045 11851 3520 -18999 -13106 6396
10735 6396 42157 43131 15035 -22636 -22270 -26523 -11814 2592 24613 3804 10433 18830 74998
10722 74998 159655 184934 191450 189752 132740 90184 65534 70870 78147 108177 138698 126740
10710 126740 81137 67700 82485 93325 91932 98233 88532 109948 102257 75295 58994 51579
$$ packed form
10798B5091L952k6740j0891K5445K961j2667k0302r899K4496L1457m1076j1305
10786a9478K9150j6154P364j1319k4334j1310p600J6790K6272J8057k9120j3922
10774c5604j6312k1440j2798K9075K6594j0042K597K031J281K3435q155M631j670
10761a6377m923Q5J283l894J9662n228k2603j026k043l3048K803K8078L162R660
10747b4409K9383j2262j8827j5137K135L1307M765J4896q331k2519N893J9502
10735F396L5761R74k8096l7671L66m253J4709J4406K2021k0809O629Q397N6168
10722G4998Q4657K5279O516j698n7012m2556k4650N336P277L0030L0521j1958
10710A26740m5603j3437J4785J0840j393O301r701K1416p691k6962j6301p415
$$ plain form
10698 51579 13947 -7925 13583 30488 40704 79290 112788 122910 133961 79076 79264 92095
10686 92095 79375 65603 42884 20823 -15708 -13808 2221 34803 42335 43927 50310 61155
10674 61155 80326 67139 47718 52145 49146 39705 41103 41172 27081 23231 59434 84880 100105
10661 100105 63160 19776 10244 22678 15500 4380 -7923 -15275 -10044 42333 55490 18604
10649 18604 14701 5756 14174 10553 17767 25490 7830 2280 19132 7552 -6160 11540 51629
10636 51629 51927 5435 19752 32509 33368 10428 19232 28149 50235 53456 40280 31417 24246
10623 24246 8604 3378 -9502 -28737 -62010 -97289 -83511 -46519 -36530 -63383 -59790 -42795
10611 -42795 -27526 -19628 8261 44961 57013 66899 70464 70051 95351 111206 104181 98901 82809
$$ packed form
10698E1579l7632k1872K1508J6905J0216L8586L3498J0122J1051n4885J88J2831
10686I2095j2720j3772k2719k2061l6531J900J6029L2582P532J592O383J0845
10674F1155J9171j3187j9421M427k999r441J398O9j4091l850L6203K5446J5225
10661A00105l6945m3384r532J2434p178j1120j2303p352N231N2377J3157l6886
10649A8604l903q945Q418l621P214P723j7660n550J6852j1580j3712J7700M0089
10636E1629K98m6492J4317J2757Q59k2940Q804Q917K2086L221j3176q863p171
10623B4246j5642n226j2880j9235l3273l5279J3778L6992R989k6853L593J6995
10611d2795J5269P898K7889L6700J2052R886L565m13K5300J5855p025n280j6092
$$ plain form
10598 82809 73260 60020 84369 116223 154755 200374 257387 308723 351287 363862 340806 329181
10586 329181 334220 331975 348871 372239 369668 341812 314959 302209 306148 279321 272935 309074
10574 309074 287532 237832 208690 219337 188317 176888 191346 190559 181586 181518 184451 198792 211644
10561 211644 264738 243179 220737 228346 242130 283797 288325 273439 292425 289460 256884 256246
10549 256246 235696 230759 242994 242926 286850 323946 339989 374090 429340 420407 402649 401347 384481
10536 384481 354906 354355 330982 323279 344236 376631 386539 388560 392171 471773 557810 586905 604044
10523 604044 586481 567805 584370 608841 588068 585883 592786 650584 759813 866655 937824
10512 937824 984368 1037209 1099580 1144535 1156409 1183885 1228854 1281837 1319119 1365094 1402240
$$ packed form
10598H2809r549j3240K4349L1854L8532M5619N7013N1336M2564J2575k3056j1625
10586C29181N039k245J6896K3368k571k7856k6853j2750L939k6827o386L6139
10574C09074k1542m9700k9142J0647l1020j1429J4458p87q973o8K933J4341J2852
10561B11644N3094k1559k2442P609J3784M1667M528j4886J8986k965l2576o38
10549B56246k0550m937J2235o8M3924L7096J6043L4101N5250q933j7758j302j6866
10536C84481k9575n51k3373p703K0957L2395R908K021L611P9602Q6037K9095J7139
10523F04044j7563j8676J6565K4471k0773k185O903N7798J09229J06842P1169
10512I37824M6544N2841O2371M4955J1874K7476M4969N2983L7282M5975L7146
$$ plain form
10501 1402240 1468596 1568695 1715779 1911900 2158727 2447634 2761500 3109073 3541499 4039434
10491 4039434 4656983 5412941 6211280 6991594 7645381 8104585 8490510 9019334 9675592
10482 9675592 10372137 11193269 12314514 13750229 15570890 17920798 20985035 25119745
10474 25119745 30882075 39127804 51378122 70342478 100829947 149120907 216360130
10467 216360130 288623852 347291736 379274027 359898672 288864479 210723507 154767634
10460 154767634 120199806 98504848 83597085 72451569 63689472 56565333 50638826
10453 50638826 45661199 41558966 38273604 35681831 33669642 32072049 30651561 29330516
10445 29330516 27917127 26341429 24839658 23557075 22429393 21440300 20558182 19774842
$$ packed form
10501A402240O6356J00099J47084J96121K46827K88907L13866L47573M32426M97935
10491D039434O17549P55958P98339P80314O53787M59204L85925N28824O56258
10482I675592O96545Q21132J121245J435715J820661K349908L064237M134710
10474B5119745N762330Q245729J2250318J8964356L0487469M8290960O7239223
10467B16360130P2263722N8667884L1982291j9375355p1034193p8140972n5955873
10460A54767634l4567828k1694958j4907763j1145516q762097p124139n926507
10453E0638826m977627m102233l285362k591773k012189j597593j420488j321045
10445B9330516j413389j575698j501771j282583j127682r89093q82118p83340
$$ plain form
10437 19774842 19054436 18424242 17805584 17178535 16589618 16018704 15482260 14944638 14398022
10428 14398022 13835337 13328980 12878235 12420830 11984705 11576664 11183436 10770803 10390801
10419 10390801 10045421 9772255 9558979 9329421 9134222 8943040 8713520 8450811 8176109
10410 8176109 7915551 7647554 7384231 7170550 6956334 6775702 6630165 6455462 6301088
10401 6301088 6153283 6006783 5854636 5684500 5512702 5354846 5202090 5058834 4891788
10392 4891788 4730880 4588064 4458001 4346576 4227544 4129916 4049123 3999269 3924493 3822137
10382 3822137 3682685 3583708 3490548 3402781 3312780 3250857 3215907 3132031 3038425 2953302 2926042
10371 2926042 2893559 2835031 2735170 2639460 2582691 2558966 2511629 2431897 2336058 2263033 2215337
$$ packed form
10437A9774842p20406o30194o18658o27049n88917n70914n36444n37622n46616
10428A4398022n62685n06357m50745m57405m36125m08041l93228m12633l80002
10419A0390801l45380k73166k13276k29558j95199j91182k29520k62709k74702
10410H176109k60558k67997k63323k13681k14216j80632j45537j74703j54374
10401F301088j47805j46500j52147j70136j71798j57856j52756j43256j67046
10392D891788j60908j42816j30063j11425j19032r7628q0793m9854p4776j02356
10382C822137j39452r8977r3160q7767r0001o1923l4950q3876r3606q5123k7260
10371B926042l2483n8528r9861r5710n6769k3725m7337p9732r5839p3025m7696
$$ plain form
10360 2215337 2146264 2098898 2055136 1962549 1883249 1806536 1749327 1709035 1688974 1622883 1551726
10349 1551726 1509149 1489669 1473770 1459275 1434757 1408652 1381931 1357192 1412869 1404717 1379020
10338 1379020 1381857 1367606 1332207 1318838 1338973 1323819 1294949 1276605 1197834 1131487 1103526
10327 1103526 1084887 1056169 1020789 954234 905961 885226 873735 849082 821798 836779 824685
10316 824685 785453 769025 750861 761835 747968 727184 679415 589733 519487 495327 477235
10305 477235 466582 471314 461058 439046 435849 421837 413373 412925 399461 379783 347413 362405
10293 362405 379663 357521 352194 363541 376313 370521 359725 373339 396695 373703 353965 364077
10281 364077 340770 329360 316177 324933 345458 337767 335564 361760 341270 303824 316873 310299
$$ packed form
10360B215337o9073m7366m3762r2587p9300p6713n7209m0292k0061o6091p1157
10349A551726m2577j9480j5899j4495k4518k6105k6721k4739N5677q152k5697
10338A379020K837j4251l5399j3369K0135j5154k8870j8344p8771o6347k7961
10327A103526j8639k8718l5380o6555m8273k0735j1491k4653k7284J4981j2094
10316H24685l9232j6428j8164J0974j3867k0784m7769q9682p0246k4160j8092
10305D77235j0653M732j0256k2012l197j4012q464m48j3464j9678l2370J4992
10293C62405J7258k2142n327J1347J2772n792j0796J3614K3356k2992j9738J0112
10281C64077k3307j1410j3183Q756K0525p691k203K6196k0490l7446J3049o574
$$ plain form
10269 310299 305098 272349 263193 277660 303103 302408 303777 319781 321403 328440 328283 305861 284707
10256 284707 287478 319187 343482 349658 328596 289739 276954 274584 245695 218345 200209 186682
10244 186682 189578 215217 274356 283748 273759 235049 233051 272570 310748 309384 271082 244425
10232 244425 214213 214012 233449 223053 239439 238618 238282 256283 252259 270294 252199 218156 220824
10219 220824 213273 235688 253547 269284 308569 361369 389970 398249 383918 412575 444384 451740
10207 451740 479173 496141 541333 600917 685150 785223 903164 1076303 1295968 1551743
10197 1551743 1863510 2178884 2383366 2470636 2438986 2270694 2058556 1898209 1803268 1767917
10187 1767917 1850956 2056676 2403024 3001512 4006654 5532521 7548792 9795044 11789903
$$ packed form
10269C10299n201l2749r156J4467K5443o95J369J6004J622P037j57k2422k1154
10256B84707K771L1709K4295O176k1062l8857j2785k370k8889k7350j8136j3527
10244A86682K896K5639N9139R392r989l8710j998L9519L8178j364l8302k6657
10232B44425l0212k01J9437j0396J6386q21l36J8001m024J8035j8095l4043K668
10219B20824p551K2415J7859J5737L9285N2800K8601Q279j4331K8657L1809P356
10207D51740K7433J6968M5192N9584Q4233J00073J17941J73139K19665K55775
10197A551743L11767L15374K04482Q7270l1650j68292k12138j60347r4941l5351
10187A767917Q3039K05720L46348N98488J005142J525867K016271K246252J994859
$$ plain form
10178 11789903 12981274 12802243 11136578 8802810 6689892 5179422 4179778 3505273
10170 3505273 3012974 2649512 2392815 2172505 1978277 1824415 1689908 1581608 1495351 1450293
10160 1450293 1393767 1325221 1243138 1173171 1095175 1029924 969418 918161 887000 865362 837117
10149 837117 830367 825507 794098 723354 675469 669097 678568 664634 666003 646593 644984 636756 585215
10136 585215 559179 540961 521325 519508 490936 472677 445826 433811 435294 432370 415969 404271
10124 404271 393433 371093 371658 387812 364337 370027 369553 389999 399455 392680 362084 336115 347179
10111 347179 369105 366828 394060 434005 471491 505527 541515 562218 587879 599235 623063 617671
10099 617671 636670 625339 591151 556765 494050 417884 372651 313022 309535 319347 322398 306083
$$ packed form
10178A1789903J191371j79031j665665k333768k112918j510470r99644o74505
10170C505273m92299l63462k56697k20310j94228j53862j34507j08300q6257m5058
10160A450293n6526o8546q2083o9967p7996o5251o0506n1257l1161k1638k8245
10149H37117o750m860l1409p0744m7885o372R471j3934J369j9410j609q228n1541
10136E85215k6036j8218j9636j817k8572j8259k6851j2015J483k924j6401j1698
10124D04271j0838k2340N65J6154k3475N690m74K0446R456o775l0596k5969J1064
10111C47179K1926k277K7232L9945L7486L4036L5988K0703K5661J1356K3828n392
10099F17671J8999j1331l4188l4386o2715p6166m5233n9629l487R812L051j6315
$$ plain form
10087 306083 326788 323911 276154 246200 218925 224638 217962 192328 197366 195965 163231 158236 151335
10074 151335 171586 178034 155653 144599 145830 137759 140812 164926 164377 170651 157200 145941 116189
10061 116189 111916 125798 173635 187944 181120 197568 186660 165677 150784 177552 207179 257115
10049 257115 299176 350874 380001 421160 559026 747032 1016304 1386881 1879851 2415711
10039 2415711 2792401 2879946 2690795 2057092 1443389 1073488 846494 731217 683510 623244
10029 623244 514264 478200 459380 428763 382955 330265 324992 327951 315859 308535 330652 281134
10017 281134 266738 276626 266949 232156 219286 249299 265926 268443 269843 242243 239687 265311
10005 265311 238430 228130 243449 238697 209097 222621 219275 207152 159747 109065 150572 174500
$$ packed form
10087C06083K0705k877m7757k9954k7275N713o676k5634N038j401l2734m995o901
10074A51335K0251O448k2381j1054J231q071L053K4114n49O274j3451j1259k9752
10061A16189m273J3882M7837J4309o824J6448j0908k0983j4893K6768K9627M9936
10049B57115M2061N1698K9127M1159J37866J88006K69272L70577M92970N35860
10039B415711L76690Q7545j89151o33703o13703l69901k26994j15277m7707o0266
10029F23244j08980l6064j8820l0617m5808n2690n273K959j2092p324K2117m9518
10017B81134j4396R888r677l4793j2870L0013J6627K517J400k7600k556K5624
10005B65311k6881j0300J5319m752k9600J3524l346j2123m7405n0682M1507K3928
$$ plain form
9993 174500 180823 146427 101708 110422 113905 102000 117499 128820 118303 129697 130250 121449 115126
9980 115126 137686 125635 114190 89238 56778 68727 99661 114334 138493 108858 73228 87424
9968 87424 85647 88501 79760 45095 21361 34802 51483 49862 48291 63149 40597 17358 33699
9955 33699 61239 37833 36571 53812 43054 -246 6990 6619 26791 62032 34419 21249 32209
9942 32209 47972 61807 61411 49982 43332 56790 66609 65491 59634 70874 67850 66083 46074
9929 46074 38585 62215 79596 75742 65213 66850 78946 78988 96441 96224 96637 120348 138351 112228
9915 112228 109946 106916 63990 70366 70233 45141 48834 79079 62016 44808 18907 23595 35133
9902 35133 40859 -19053 -18283 14772 62095 74900 78668 44951 32118 31202 40394 40527 27825 16664
$$ packed form
9993A74500O323l4396m4719Q714L483j1905J5499J1321j0517J1394N53q801o323
9980A15126K2560j2051j1445k4952l2460J1949L0934J4673K4159k9635l5630J4196
9968H7424j777K854q741l4665k3734J3441J6681j621j571J4858k2552k3239J6341
9955C3699K7540k3406j262J7241j0758m3300P236l71K0172L5241k7613j3170J0960
9942C2209J5763J3835l96j1429o650J3458R819j118n857J1240l024j767k0009
9929D6074p489K3630J7381l854j0529J637J2096M2J7453k17M13K3711J8003k6123
9915A12228k282l030m2926O376j33k5092L693L0245j7063j7208k5901M688J1538
9902C5133N726n9912P70L3055M7323J2805L768l3717j2833r16R192J33j2702j1161
$$ plain form
9888 16664 20905 37532 32933 22963 32214 74114 72937 70792 61947 53929 38581 47572 63315 59544
9874 59544 87028 126391 95781 49150 31920 222 18242 44766 39579 40425 33250 60170 71968
9861 71968 31037 3535 2850 12417 1955 -1486 -13670 -7953 -17116 -34008 -37075 -17385 -15946
9848 -15946 14525 25856 54586 60340 58377 32742 14278 40976 42511 74509 101057 96960 109569
9835 109569 94816 77429 74210 61315 29005 62388 48978 32743 37426 48236 44390 9664
9823 9664 -8107 -4500 6380 13585 36180 57967 55136 48990 36829 2452 36425 19506 17601
9810 17601 10606 20700 34745 22977 -748 -6214 -10542 345 14246 19907 -2345 -17055 -19706
9797 -19706 20797 29801 22546 9418 -11544 -4138 10398 -8313 -24545 10700 29316 38195 33192
$$ packed form
9888A6664M241J6627m599r970R251M1900j177k145q845q018j5348Q991J5743l771
9874E9544K7484L9363l0610m6631j7230l1698J8020K6524n187Q46p175K6920J1798
9861G1968m0931k7502o85R567j0462l441j2184N717r163j6892l067J9690J439
9848a5946L0471J1331K8730N754j963k5635j8464K6698J535L1998K6548m097J2609
9835A09569j4753j7387l219j2895l2310L3383j3410j6235M683J0810l846l4726
9823I664j7771L607J0880P205K2595K1787k831o146j2161l4377L3973j6919j905
9810A7601o995J0094J4045j1768k3725n466m328J0887J3901N661k2252j4710k651
9797a9706M0503R004p255j3128k0962P406J4536j8711j6232L5245J8616Q879n003
$$ plain form
9784 33192 34602 22525 44043 46878 42590 54632 67470 45217 45864 48770 15642 19651 1443
9771 1443 18328 50785 51415 53123 48828 43176 38139 69858 106187 102609 72066 49760 52279 41391
9757 41391 38485 55099 57942 84687 130576 148450 135050 99033 102189 117299 71373 29086
9745 29086 32395 3048 -18000 -7300 -9861 -22351 2262 -18530 1749 35654 46250 42928
9733 42928 25162 28177 16615 11742 23546 35352 8432 -6112 10085 32020 18766 9131
9721 9131 19737 -2014 23708 31934 55822 57269 69579 77581 71255 52275 43934 57199 41058
9708 41058 61041 61952 48770 92343 75927 34936 -15231 -13037 1236 -13566 -33714 -12902
9696 -12902 8110 2786 4911 9910 -7364 5669 386 15206 8826 8967 48987 85688 61035
$$ packed form
9784C3192J410j2077K1518K835m288J2042J2838k2253O47K906l3128M009j8208
9771A443J6885L2457O30J708m295n652n037L1719L6329l578l0543k2306K519j0888
9757D1391k906J6614K843K6745M5889J7874j3400l6017L156J5110m5926m2287
9745B9086L309k9347k1048J0700k561j2490K4613k0792K0279L3905J0596l322
9733D2928j7766L015j1562m873J1804J1806k6920j4544J6197K1935j3254r635
9721I131J0606k1751K5722Q226K3888J447J2310Q002o326j8980q341J3265j6141
9708D1058J9983R11j3182M3573j6416m0991n0167K194J4273j4802k0148K0812
9696a2902K1012n324K125M999j7274J3033n283J4820o380J41M0020L6701k4653
$$ plain form
9683 61035 13594 2556 23644 4332 -11696 238 31312 64585 54724 45048 61143 53942
9671 53942 41375 12847 7330 8515 -7728 20078 4803 16241 48648 34816 -2046 8847
9659 8847 21540 26139 4000 7016 17158 7629 1162 16475 21473 -8761 12659 41532 49483
9646 49483 41721 19527 -14958 9199 27587 8 -18486 -12920 -18439 -18457 10777 11654 28624
9633 28624 43815 58949 34983 14185 -1978 -20497 -12245 -9944 -13724 -32172 -29122 -7147 -18836
9620 -18836 -31327 -18247 -17551 -22290 -103 -2474 11529 4540 5165 15507 46731 63783 45481
9607 45481 48786 45155 36466 30531 1428 -15465 -7143 25580 51563 69753 39555 -9732 -4434
9594 -4434 24877 15271 -685 23422 1166 -12017 -2322 25229 42601 12059 21251 15746 1896
$$ packed form
9683F1035m7441j1038K1088j9312j6028J1934L1074L3273r861r676J6095p201
9671E3942j2567k8528n517J185j6243K7806j5275J1438L2407j3832l6862J0893
9659H847J2693M599k2139L016J0142r529o467J5313M998l0234K1420K8873P951
9646D9483p762k2194l4485K4157J8388k7579j8494N566n519j8K9234Q77J6970
9633B8624J5191J5134k3966k0798j6163j8519Q252K301l780j8448L050K1975j1689
9620a8836j2491J3080O96m739K2187k371J4003o989O25J0342L1224J7052j8302
9607D5481L305l631q689n935k9103j6893Q322L2723K5983J8190l0198m9287N298
9594d434K9311r606j5956K4107k2256j3183R695K7551J7372l0542R192n505j3850
$$ plain form
9581 1896 23443 7440 -3732 -6137 1172 183 -1762 -27136 -5446 17743 27594 23182 13897 31753
9567 31753 67967 90036 71284 75049 94587 96542 50539 35097 50752 46253 48434 63666 52213
9554 52213 36117 38293 36510 14700 2964 28669 40166 30739 17789 37662 51346 52642 48357
9541 48357 44580 46076 35896 18562 33963 31373 18178 -19781 -17508 12765 10878 34334 60021
9528 60021 7696 9990 54624 68154 74936 81084 46468 39329 39100 29085 25499 16195 -8505
9515 -8505 -16321 2014 33044 34198 26996 8422 14730 -15009 -22963 -35077 -41146 -27866 -7890
9502 -7890 9710 44543 50972 27773 -3192 20263 43396 48163 23277 18194 24138 22125 21571
9489 21571 31034 19352 -2414 4534 16304 12205 805 25438 21763 5518 28789 57525 57579
$$ packed form
9581A896K1547j6003j1172k405P309r89j945k5374K1690K3189R851m412r285J7856
9567C1753L6214K2069j8752L765J9538J955m6003j5442J5655m499K181J5232j1453
9554E2213j6096K176j783k1810j1736K5705J1497r427j2950J9873J3684J296m285
9541D8357l777J496j0180j7334J5401k590j3195l7959K273L0273j887K3456K5687
9528F0021n2325K294M4634J3530O782O148l4616p139k29j0015l586r304k4700
9515h505p816J8335L1030J154p202j8574O308k9739p954j2114o069J3280J9976
9502g890J7600L4833O429k3199l0965K3455K3133M767k4886n083N944k013n54
9489B1571R463j1682k1766O948J1770m099j1400K4633l675j6245K3271K8736N4
$$ plain form
9476 57579 50769 48337 41996 46892 54450 34028 38466 55501 53911 36498 3688 2254 15072
9463 15072 37161 49222 53329 31112 7438 13666 1748 -12437 26101 52476 31741 43410
9451 43410 36117 52238 48676 48960 40674 20994 1554 25626 50535 30693 19443 26781 -4553
9438 -4553 -6333 11496 20620 16749 19809 32013 49370 71671 67311 56876 72287 50671 17982
9425 17982 -6521 -13232 -4705 -19855 -3996 2739 14701 36466 50719 60230 53466 6375 -8855
9412 -8855 -23745 3383 15624 6535 -14485 7925 9145 12028 20116 -12006 -1996 10033 -1509
9399 -1509 -32221 -50221 -29051 -17778 -2384 7971 29398 51916 35677 4369 14591 -8522
9387 -8522 13483 45538 -2821 11139 31352 -2045 -26262 -69477 -77405 -39219 -15512 -22435
$$ packed form
9476E7579o810k432o341M896P558k0422M438J7035j590j7413l2810j434J2818
9463A5072K2089J2061M107k2217k3674O228j1918j4185L8538K6375k0735J1669
9451D3410p293J6121l562K84q286j9680j9440K4072K4909j9842j1250P338l1334
9438d553j780J7829R124l871L060J2204J7357K2301m360j0435J5411k1616l2689
9425A7982k4503o711Q527j5150J5859O735J1962K1765J4253R511o764m7091j5230
9412h855j4890K7128J2241r089k1020K2410J220K883Q088l2122J0010J2029j1542
9399a509l0712j8000K1170J1273J5394J0355K1427K2518j6239l1308J0222k3113
9387h522K2005L2055m8359J3960K0213l3397k4217m3215p928L8186K3707o923
$$ plain form
9375 -22435 -894 -7448 -25371 -16727 20407 20553 16720 13052 7744 11291 17262 10348 -1955 -9907
9361 -9907 -10954 7672 -1541 -11099 -4752 -23751 -24382 -1260 18066 17597 -21194 -37102 -36151 -6375
9347 -6375 21669 16198 13911 -1874 -10870 3013 8512 13194 6310 -12406 -13954 7172 5726 -4706
9333 -4706 -3925 12036 10263 -20549 -38496 717 36959 9262 37472 43636 22900 9096 6120
9320 6120 10157 27618 16141 778 -13783 -29655 -4899 42461 41771 32201 24960 28489 28512 -6306
9306 -6306 -14536 7244 6608 -28387 -8481 34346 43885 34033 9852 -9663 985 22096 16343
9293 16343 4794 31506 43852 24391 24023 22256 50369 49253 54951 44305 32130 29447 36805
9280 36805 30892 34472 16812 11118 36266 -4553 -34467 -23977 20402 44843 21999 9179
$$ packed form
9375b2435K1541o554j7923Q644L7134J46l833l668n308L547N971o914j2303p952
9361i907j047J8626r213r558O347j8999o31K3122J9326m69l8791j5908R51K9776
9347f375K8044n471k287j5785q996J3883N499M682o884j8716j548K1126j446j0432
9333d706P81J5961j773l0812j7947L9213L6242k7697K8210O164k0736j3804k976
9320F120M037J7461j1477j5363j4561j5872K4756M7360o90r570p241L529K3l4818
9306f306q230K1780o36l4995J9906M2827R539r852k4181j9515J0648K1111n753
9293A6343j1549K6712J2346j9461l68j767K8113j116N698j0646j2175k683P358
9280C6805n913L580j7660n694K5148m0819k9914J0490M4379K4441k2844j2820
$$ plain form
9268 9179 19825 40235 10047 -29191 -9036 -16714 -1631 16159 34180 18370 -6179 -18419
9256 -18419 -5906 19613 61251 71216 39234 -14748 -5871 12374 31598 51996 33116 15312
9244 15312 13054 24505 25031 40173 59291 57996 23611 20374 32840 61622 37099 13308 10340
9231 10340 -6047 -6942 -30196 -45755 -28656 -14670 -2674 27159 31836 12250 8497 33837 52075
9218 52075 41140 19740 19356 18996 7971 38291 32492 31835 36185 42579 48885 18235 8199 30728
9204 30728 44792 75252 67045 49917 49533 41106 22597 28556 63061 81377 69480 47914 22094
9191 22094 28563 36089 31375 29590 -5919 7701 15593 38997 42268 62620 45762 38896 47096
9178 47096 49106 68409 81477 64646 51108 5856 9589 10421 22388 44449 44588 60866 43587
$$ packed form
9268I179J0646K0410l0188l9238K0155p678J5083J7790J8021j5810k4549j2240
9256a8419J2513K5519M1638R965l1982n3982Q877J8245J9224K0398j8880j7804
9244A5312k258J1451N26J5142J9118j295l4385l237J2466K8782k4523k3791k968
9231A0340j6387q95k3254j5559J7099J3986J1996K9833M677j9586l753K5340J8238
9218E2075j0935k1400l84l60j1025L0320n799o57M350O394O306l0650j0036K2529
9204C0728J4064L0460q207j7128l84q427j8509N959L4505J8316j1897k1566k5820
9191B2094O469P526m714j785l5509J3620P892K3404L271K0352j6858o866Q200
9178D7096K010J9303J3068j6831j3538m5252L733Q32J1967K2061J39J6278j7279
$$ plain form
9165 43587 30396 33517 31290 40678 54540 47199 58139 81935 95392 96204 73677 55214 42707
9152 42707 27438 67137 71757 77753 82058 84822 92511 74021 75271 75196 75513 75728 68607 75113 58502
9137 58502 54844 58658 80468 81672 66636 68575 78412 77664 94477 95932 93967 103347 93661 95921
9123 95921 89623 90370 62326 64921 78973 48333 33074 63490 78450 95360 88556 104899 125576
9110 125576 112698 102114 80559 54713 49730 56526 61477 53476 43645 70808 103347 116462 145252
9097 145252 164010 161654 153163 134340 101306 87113 82516 74963 94760 122986 110927 109855 113658
9084 113658 102580 109221 100468 79119 99528 115431 118791 120493 112740 124818 128594 111071 95826
9071 95826 106104 116066 106555 130535 109001 136269 131893 100721 96487 97879 87351 105817 114379
$$ packed form
9165D3587j3191L121k227R388J3862p341J0940K3796J3457Q12k2527j8463j2507
9152D2707j5269L9699M620N996M305K764P689j8490J250p5L17K15p121O506j6611
9137E8502l658L814K1810J204j5036J939R837p48J6813J455j965R380r686K260
9123I5921o298P47k8044K595J4052l0640j5259L0416J4960J6910o804J6343K0677
9110A25576j2878j0584k1555k5846m983O796M951q001r831K7163L2539J3115K8790
9097A45252J8758k356q491j8823l3034j4193m597p553J9797K8226j2059j072L803
9084A13658j1078O641q753k1349K0409J5903L360J702p753J2078L776j7523j5245
9071I5826J0278R962r511K3980k1534K7268m376l1172m234J392j0528J8466Q562
$$ plain form
9058 114379 112868 134294 109606 90753 95367 105732 123818 153573 161122 177574 169429 153305
9046 153305 127958 116687 101087 90334 100998 93250 92873 143337 161939 141937 116552 130846
9034 130846 133215 125454 144105 143088 165242 192658 191703 207691 228476 204536 193828 177142 171648
9021 171648 182482 190461 205048 190933 191279 215866 203945 221481 223281 245998 295981 318443
9009 318443 308973 280616 280109 289194 306590 318825 325760 347237 333081 355026 394566 406246 389296
8996 389296 354451 322998 316335 296296 307775 346140 365065 413614 435615 412616 410935 403518
8984 403518 395707 424243 410044 405210 418042 409237 430737 446976 490609 511034 504874 510588 520523
8971 520523 525795 560241 603314 622681 616063 610115 633327 663081 717080 770481 768083 762155 757098
$$ packed form
9058A14379j511K1426k4688j8853M614J0365J8086K9755P549J6452q145j6124
9046A53305k5347j1271j5600j0753J0664p748l77N0464J8602k0002k5385J4294
9034A30846K369p761J8651j017K2154K7416r55J5988K0785k3940j0708j6686n494
9021A71648J0834P979J4587j4115L46K4587j1921J7536J800K2717M9983K2462
9009C18443r470k8357n07R085J7396J2235O935K1477j4156K1945L9540J1680j6950
8996C89296l4845l1453o663k0039J1479L8365J8925M8549K2001k2999j681p417
8984D03518p811K8536j4199m834J2832q805K1500J6239M3633K0425o160N714R935
8971E20523N272L4446M3073J9367o618n948K3212K9754N3999N3401k398n928n057
$$ plain form
8958 757098 773708 790860 792469 837817 872564 892690 939997 970546 997079 1041952 1071542 1060665
8946 1060665 1071614 1122205 1166816 1238949 1313510 1361558 1398077 1474249 1525877 1539062 1589712
8935 1589712 1669252 1746244 1862603 1984847 2055494 2136613 2245572 2351545 2463439 2555019
8925 2555019 2681179 2858694 3068433 3250798 3428635 3631438 3868307 4115167 4384019 4698331
8915 4698331 5102212 5529922 5954073 6427369 6987379 7614161 8293464 9070181 9980344 11028675
8905 11028675 12220265 13588773 15133508 16939151 19056903 21576510 24515507 27949677
8897 27949677 31961379 36526610 41627642 47173687 52903853 58384470 63131201 66583516
8889 66583516 68276575 68000049 65891377 62417980 58088293 53356869 48679097 44282289
$$ packed form
8958G57098J6610J7152J609M5348L4747K0126M7307L0549K6533M4873K9590j0877
8946A060665J0949N0591M4611P2133P4561M8048L6519P6172N1628J3185N0650
8935A589712P9540P6992J16359J22244P0647Q1119J08959J05973J11894R1580
8925B555019J26160J77515K09739J82365J77837K02803K36869K46860K68852L14312
8915D698331M03881M27710M24151M73296N60010O26782O79303P76717R10163J048331
8905A1028675J191590J368508J544735J805643K117752K519607K938997L434170
8897B7949677M011702M565231N101032N546045N730166N480617M746731L452315
8889F6583516J693059k76526k108672l473397m329687m731424m677772m396808
$$ plain form
8881 44282289 40220182 36577935 33338195 30519508 28016742 25784856 23869009 22192419
8873 22192419 20702198 19366171 18155626 17093387 16138417 15272839 14489372 13734719 13086491
8864 13086491 12523066 11973817 11454662 11006319 10558818 10165310 9781346 9421982 9103673
8855 9103673 8827238 8584165 8339813 8096598 7833533 7513280 7174499 6896660 6691395 6502932
8845 6502932 6282464 6045464 5832547 5663433 5509614 5340430 5184570 5037726 4880041 4730394
8835 4730394 4599083 4479467 4359257 4221331 4113766 4001824 3911354 3804952 3690525 3570591
8825 3570591 3450100 3386346 3292171 3199365 3127148 3063937 2995747 2939368 2882665 2800748 2695946
8814 2695946 2623791 2584798 2529290 2471204 2378849 2290231 2251142 2212924 2189525 2145360 2050860
$$ packed form
8881D4282289m062107l642247l239740k818687k502766k231886j915847j676590
8873B2192419j490221j336027j210545j062239r54970q65578p83467p54653o48228
8864A3086491n63425n49249n19155m48343m47501l93508l83964l59364l18309
8855I103673k76435k43073k44352k43215k63065l20253l38781k77839k05265j88463
8845F502932k20468k37000k12917j69114j53819j69184j55860j46844j57685j49647
8835D730394j31311j19616j20210j37926j07565j11942r0470j06402j14427j19934
8825C570591j20491o3754r4175r2806p2217o3211o8190n6379n6703q1917j04802
8814B695946p2155l8993n5508n8086r2355q8618l9089l8218k3399m4165r4500
$$ plain form
8803 2050860 1992099 1975719 1911311 1854251 1824755 1803499 1769044 1736109 1722496 1715492 1688548 1641933
8791 1641933 1600348 1555136 1533388 1492545 1437404 1395452 1378847 1359387 1312508 1294774 1252330
8780 1252330 1226081 1189053 1155061 1157799 1126512 1072919 1040010 1022469 1033130 1004583 966189 981739
8768 981739 972168 932064 922735 943985 907920 846350 816013 819007 826874 823457 820272 842292 836856
8755 836856 826496 823746 814325 783769 727893 680559 666441 645727 676137 688154 669205 630128
8743 630128 621318 561985 520176 525569 535748 547640 524211 509981 536904 498318 474910 465163
8731 465163 434666 430568 425235 406447 411669 387138 380757 402993 387392 391328 394699 381649 377465
8718 377465 370158 348988 340588 368805 377016 361711 352692 293816 287347 314080 326095 325478 307425
$$ packed form
8803B050860n8761j6380o4408n7060k9496k1256l4455l2935j3613p004k6944m6615
8791A641933m1585m5212k1748m0843n5141m1952j6605j9460m6879j7734m2444
8780A252330k6249l7028l3992K738l1287n3593l2909j7541J0661k8547l8394J5550
8768I81739r571m0104r329K1250l6065o1570l0337K994P867l417l185K2020n436
8755H36856j0360k750r421l0556n5876m7334j4118k0714L0410J2017j8949l9077
8743F30128q810n9333m1809N393J0179J1892k3429j4230K6923l8586k3408r747
8731D65163l0497m098n333j8788N222k4531o381K2236j5601L936L371j3050m184
8718C77465p307k1170q400K8217Q211j5305r019n8876o469K6733J2015o17j8053
$$ plain form
8705 307425 308724 319784 318074 304903 294941 298595 267506 225392 256152 288817 309413 333817
8693 333817 321517 305642 281321 248414 231119 234625 240418 209429 257397 282748 270920 234261
8681 234261 222469 245939 242907 219669 246585 300786 291877 272187 265691 275829 257866 256203
8669 256203 262355 246008 265503 263899 224808 215211 211942 215559 214707 232532 243098 209954 188464
8656 188464 214990 227273 198399 208491 212664 198489 212745 190698 179052 207878 213064 217647
8644 217647 221282 246800 248462 206955 178097 184198 234496 247242 221899 216847 207120 184966 172021
8631 172021 160192 153904 175055 187970 194439 212002 200379 188481 150104 147643 147139 150962 174932
8618 174932 197214 180249 172596 190962 209374 235109 219157 192644 178231 169152 143080 151732
$$ packed form
8705C07425J299J1060j710j3171r962L654l1089m2114L0760L2665K0596K4404
8693C33817j2300j5875k4321l2907j7295L506N793l0989M7968K5351j1828l6659
8681B34261j1792K3470l032k3238K6916N4201q909j9690o496J0138j7963j663
8669B56203O152j6347J9495j604l9091r597l269L617q52J7825J0566l3144k1490
8656A88464K6526J2283k8874J0092M173j4175J4256k2047j1646K8826N186M583
8644B17647L635K5518J662m1507k8858O101N0298J2746k5343n052r727k2154j2945
8631A72021j1829o288K1151J2915O469J7563j1623j1898l8377k461n04L823K3970
8618A74932K2282j6965p653J8366J8412K5735j5952k6513j4413r079k6072Q652
$$ plain form
8606 151732 168008 183558 165757 146447 156043 194840 207949 164835 147707 153991 164809 187062
8594 187062 181554 185386 177024 176641 206330 223602 246035 242450 226697 228591 230291 241515 249511
8581 249511 223295 220768 224416 229780 234288 230361 198922 198228 224162 178808 139140 120544 127713
8568 127713 156076 159497 138884 122989 144291 141704 110434 112592 132057 112914 95769 124815
8556 124815 165607 178476 127510 92274 92081 91208 118436 114579 120862 119433 116583 111756 129984
8543 129984 153192 148684 105322 82374 62879 54798 64991 49445 31391 36480 63779 83732
8531 83732 75144 80726 103085 116007 139491 122204 71571 63484 92277 143895 138940 143518 131322
8518 131322 114562 112399 106539 117366 106911 79790 84852 98605 84635 53924 61157 63024 61172
$$ packed form
8606A51732J6276J5550j7801j9310R596L8797J3109m3114j7128O284J0818K2253
8594A87062n508L832q362l83K9689J7272K2433l585j5753J894J700J1224P996
8581B49511k6216k527L648N364M508l927l1439o94K5934m5354l9668j8596P169
8568A27713K8363L421k0613j5895K1302k587l1270K158J9465j9143j7145K9046
8556A24815M0792J2869n0966l5236j93q73K7228l857O283j429k850m827J8228
8543A29984K3208m508m3362k2948j9495q081J0193j5546j8054N089K7299J9953
8531H3732q588N582K2359J2922K3484j7287n0633q087K8793N1618m955M578j2196
8518A31322j6760k163n860J0827j0455k7121N062J3753j3970l0711P233J867j852
$$ plain form
8505 61172 75476 85401 47310 36422 69961 68322 66472 71463 79455 63265 63894 78613 99682
8492 99682 84676 87059 100561 98832 105759 80317 72040 74076 91482 75316 75109 80847 76066 47992
8478 47992 55933 50290 44230 47543 52310 29364 35189 52462 33072 16518 22103 41411 59656
8465 59656 66535 31077 33085 56667 55415 42869 25195 12543 36819 55783 63496 68711 88703
8452 88703 81897 88089 120497 124506 72900 52633 23095 15098 48004 67368 64641 84279 102548
8439 102548 83978 52469 49983 42233 40666 70658 85511 118741 120035 90441 66444 61265 81045
8426 81045 103868 173530 228004 248179 234892 175669 136785 109395 70627 60374 71808 71010
8414 71010 75456 86348 83572 59599 30454 21579 4796 -4518 -6434 -557 27654 54386 64950
$$ packed form
8505F1172J4304R925l8091j0888L3539j639j850M991P992j6190O29J4719K1069
8492I9682j5006K383J3502j729O927k5442q277K036J7406j6166k07N738m781k8074
8478D7992P941n643o060L313M767k2946N825J7273j9390j6554N585J9308J8245
8465E9656O879l5458K008K3582j252j2546j7674j2652K4276J8964P713N215J9992
8452H8703o806O192L2408M009n1606k0267k9538p997L2906J9364k727J9638J8269
8439A02548j8570l1509k486p750j567K9992J4853L3230J294k9594k3997n179J9780
8426H1045K2823O9662N4474K0175j3287n9223l8884k7390l8768j0253J1434p98
8414G1010M446J0892k776k3973k9145q875j6783r314j916N877K8211K6732J0564
$$ plain form
8401 64950 31305 39248 36256 11400 -8766 -2531 41953 82398 59574 38052 47029 23586 4683
8388 4683 30167 13342 -18783 -9807 2256 -7125 -12857 -1242 17395 37631 62871 48239 57935
8375 57935 37705 25851 29517 6839 -31458 -25938 -30882 -20723 26024 75411 76003 38188 30243
8362 30243 46100 41843 34676 46450 45638 -5924 -25079 -22750 -5556 39114 55941 48158 37105
8349 37105 21745 46391 39507 18537 40520 47916 26635 26016 35975 35591 30472 30031 44874 32083
8335 32083 47584 73531 65732 52673 61878 51891 52522 66772 71491 44584 43324 22820 28038
8322 28038 57675 41180 16314 29402 -2391 -3163 27797 42725 19483 -10336 -24362 12714
8310 12714 59339 93630 72652 48753 31006 40346 63179 58563 61029 85521 90056 64317 65667
$$ packed form
8401F4950l3645P943k992k4856k0166O235M4484M0445k2824k1522Q977k3443j8903
8388D683K5484j6825l2125Q976J2063r381n732J1615J8637K0236K5240j4632R696
8375E7935k0230j1854L666k2678l8297N520m944J0159M6747M9387N92l7815p945
8362C0243J5857m257p167J1774q12n1562j9155K329J7194M4670J6827p783j1053
8349C7105j5360K4646o884k0970K1983P396k1281o19R959l84n119m41J4843j2791
8335C2083J5501K5947p799j3059R205r987O31J4250M719k6907j260k0504N218
8322B8038K9637j6495k4866J3088l1793p72L0960J4928k3242k9819j4026L7076
8310A2714M6625L4291k0978k3899j7747R340K2833m616K466K4492M535k5739J350
$$ plain form
8297 65667 58937 57073 44465 37128 35873 50717 78252 78281 51602 18664 38287 45270 35682 22798
8283 22798 28991 48957 47536 54163 20070 11729 13803 -14319 -16221 3334 5444 4809 49713 50014
8269 50014 50442 17706 7622 31433 10433 22094 22431 -6512 -26296 -16419 -14806 7314 -1760
8256 -1760 -2674 60010 60117 12836 27886 61089 78431 97849 85823 68148 69634 49577 34434
8243 34434 31344 47784 33618 35260 47708 60253 54394 45877 33349 28125 67426 102708 106790
8230 106790 59188 32610 19445 2917 15746 58169 50548 18223 48552 53237 24906 28677
8218 28677 35733 67543 53678 21617 31114 29686 18541 -2132 -12088 19323 29567 14260 12131
8205 12131 39237 51198 54180 53237 25094 41569 57142 58907 65794 57902 50390 47396 49774 24125
$$ packed form
8297F5667o730j864j2608p337j255J4844K7535K9k6679l2938J9623O983r588j2884
8283B2798O193J9966j421O627l4093q341K074k8122j902J9555K110o35M4904L01
8269E0014M28l2736j0084K3811k1000J1661L37k8943j9784R877J613K2120r074
8256a760r14O2684J07m7281J5050L3203J7342J9418j2026j7675J486k0057j5143
8243C4434l090J6440j4166J642J2448J2545n859q517j2528n224L9301L5282M082
8230A06790m7602k6578j3165j6528J2829M2423p621l2325L0329M685k8331L771
8218B8677P056L1810j3865l2061R497j428j1145k0673r956L1411J0244j5307k129
8205A2131K7106J1961K982r43k8143J6475J5573J765O887p892p512k994K378k5649
$$ plain form
8191 24125 9366 8205 11398 139 59398 75744 81188 113563 87598 56036 53924 66574 59755
8178 59755 64814 40675 56446 83046 86548 57094 55313 74618 93004 84052 65622 79989 94203
8165 94203 83582 62192 22964 19786 27553 13409 -3203 -10060 -573 8465 7728 4648 5878 -12222
8151 -12222 -33387 154 13983 21479 27627 35729 13244 5338 -15892 -3309 -4700 14195 33281
8138 33281 33868 27812 30295 40514 85051 84179 99915 99763 74158 40454 30069 47569 58135
8125 58135 47057 53808 72917 61435 52499 53273 35543 3708 23928 42088 35840 60575 61176
8112 61176 40092 51835 54004 35287 32970 32033 44143 35736 36260 35955 14526 28097 52201 36639
8098 36639 31305 24478 25071 -9804 -22260 -16875 4544 27050 39103 53427 70147 53812 34160
$$ packed form
8191B4125j4759j161L193j1259N9259J6346N444L2375k5965l1562k112J2650o819
8178E9755N059k4139J5771K6600L502k9454j781J9305J8386q952j8430J4367J4214
8165I4203j0621k1390l9228l178P767j4144j6612o857R487R038p37l080J230j8100
8151a2222k1165L3541J3829P496O148Q102k2485p906k1230J2583j391J8895J9086
8138C3281N87o056K483J0219M4537q72J5736j52k5605l3704j0385J7500J0566
8125E8135j1078O751J9109j1482q936P74j7730l1835K0220J8160o248K4735O01
8112F1176k1084J1743K169j8717k317r37J2110q407N24l05k1429J3571K4104j5562
8098C6639n334o827N93l4875j2456N385K1419K2506J2053J4324J6720j6335j9652
$$ plain form
8085 34160 39043 36966 31290 23441 39298 55857 56751 44711 -1008 -11896 30736 64390 63432
8072 63432 85982 64483 34153 55134 81075 79072 43523 -5767 -20806 -955 -2304 -17411
8060 -17411 -26813 3582 25890 38454 22503 33680 26940 28956 50396 73528 75293 46498 29624
8047 29624 39248 46957 53268 16400 1439 -10932 -13051 -41919 -43759 -32550 12160 49129 71854
8034 71854 74174 44302 74521 105632 66339 50624 42467 38289 40042 51700 61901 75825 82851
8021 82851 65296 54000 43301 6457 -9843 -12835 10816 33344 24922 27563 41026 36737 43389
8008 43389 24209 52767 24257 -6707 -16980 9004 30770 45139 34850 36237 48813 49577
7996 49577 43758 44934 65502 66048 51852 37704 79793 85806 79658 82819 105583 103833 86578
$$ packed form
8085C4160M883k077n676p849J5857J6559Q94j2040m5719j0888M2632L3654r58
8072F3432K2550k1499l0330K0981K5941k003l5549m9290j5039J9851j349j5107
8060a7411r402L0395K2308J2564j5951J1177o740K016K1440K3132J765k8795j6874
8047B9624R624P709O311l6868j4961j2371k119k8868j840J1209M4710L6969K2725
8034G1854K320k9872L0219L1111l9293j5715q157m178J753J1658J0201J3924P026
8021H2851j7555j1296j0699l6844j6300k992K3651K2528q422K641J3463m289O652
8008D3389j9180K8558k8510l0964j0273K5984K1766J4369j0289J387J2576P64
7996D9577n819J176K0568N46j4196j4148M2089O013o148L161K2764j750j7255
$$ plain form
7983 86578 46775 31389 41530 57719 55604 53393 55734 56521 41909 31521 36382 19358 35828
7970 35828 40503 38796 55415 69268 63348 48525 26352 14798 43311 70390 126555 100764
7958 100764 51836 65577 121140 112420 85248 76743 73708 86825 70983 46647 52218 63423
7946 63423 84298 86526 73903 92175 75320 62958 84403 104274 96372 99606 59423 30191
7934 30191 33181 32358 37677 72875 90121 83461 48544 33846 41261 40391 43292 50344 69493 65884
7920 65884 56808 56528 27211 13796 22039 33505 53365 45925 48737 60616 56216 36271 46021
7907 46021 64827 68948 65376 55908 47447 62114 52362 47795 38227 31624 26496 51959 53090 36327
7893 36327 -23547 -19655 3034 8179 8301 1251 27291 47037 45007 35169 20544 -12424 -11123
$$ packed form
7983H6578l9803j5386J0141J6189k115k211K341P87j4612j0388M861j7024J6470
7970C5828M675j707J6619J3853n920j4823k2173j1554K8513K7079N6165k5791
7958A00764m8928J3741N5563q720k7172q505l035J3117j5842k4336N571J1205
7946F3423K0875K228j2623J8272j6855j2362K1445J9871p902L234m0183k9232
7934C0191K990q23N319L5198J7246o660l4917j4698P415q70K901P052J9149l609
7920F5884r076k80k9317j3415Q243J1466J9860p440K812J1879m400j9945R750
7907D6021J8806M121l572r468q461J4667r752m567r568o603n128K5463J131j6763
7893C6327n9874L892K2689N145J22p050K6040J9746k030r838j4625l2968J301
$$ plain form
7880 -11123 -5733 6912 180 -18237 8406 37892 13282 3437 22539 3341 -10777 18663
7868 18663 53181 51747 46161 35782 32281 7713 12448 35765 49811 27502 10701 -15322 930
7855 930 5131 -5735 9893 -14475 7443 10183 9269 14118 43978 53653 51621 32364 12352 6024
7841 6024 -5962 -27805 -41635 -42851 -15556 12598 16511 33158 24294 1723 1431 -11859 9345
7828 9345 27421 38979 36622 23047 31074 26805 10258 -720 25443 70409 70636 63761 64189 35689
7814 35689 18595 27927 23273 15384 30942 31953 21281 -19026 -30554 -12379 15740 20114 -955
7801 -955 -8281 -17007 -21787 15167 30917 26444 16625 37850 36860 21230 21261 15804 -2896 31925
7787 31925 33810 12674 8111 38307 23541 13697 680 -38962 -33861 -30977 5643 34999 16983
$$ packed form
7880a1123N390J2645o732j8417K6643K9486k4610r845J9102j9198j4118K9440
7868A8663L4518j434n586j0379l501k4568M735K3317J4046k2309j6801k6023J6252
7855I30M201j0866J5628k4368K1918K740r14M849K9860R675k032j9257k0012o328
7841F024j1986k1843j3830j216K7295K8154L913J6647q864k2571k92j3290K1204
7828I345J8076J1558k357j3575Q027m269j6547j0978K6163M4966K27o875M28k8500
7814C5689j7094R332m654p889J5558J011j0672m0307j1528J8175K8119M374k1069
7801i55p326q726m780L6954J5750m473r819K1225r90j5630L1n457j8700L4821
7787C1925J885k1136m563L0196j4766r844j3017l9642N101K884L6620K9356j8016
$$ plain form
7774 16983 11704 8190 12704 6297 5595 26446 37777 28473 6770 -10903 -33891 -45272 -32629
7761 -32629 -26882 -8565 13274 21933 20701 35576 36164 30289 4247 4233 44867 57720 47202 20355
7747 20355 3767 40257 45939 24130 -3307 4888 8059 15107 3892 11162 41236 11488 -7773
7734 -7773 -19646 -23107 -6892 15139 14482 21602 37755 42672 55582 54563 41173 13414 6246
7721 6246 -13808 -33484 -3466 11431 13056 6277 7293 21728 11610 -15901 -16729 -5157 -14983
7708 -14983 -21402 -3987 6826 20624 22103 34790 47611 -10705 -26738 -15739 15054 34467
7696 34467 4576 23656 37119 3236 11940 12520 11826 -22356 -25312 -8385 -4364 -17397 -37310
7683 -37310 -56829 -52133 -41784 -11051 47595 59261 45426 71154 76167 60073 70692 58028
$$ packed form
7774A6983n279l514M514o407p02K0851J1331r304k1703j7673k2988j1381J2643
7761c2629N747J8317K1839Q659j232J4875N88n875k6042j4M0634J2853j0518k6847
7747B0355j6588L6490N682k1809k7437Q195L171P048j1215P270L0074k9748j9261
7734g773j1873l461J6215K2031o57P120J6153M917J2910j019j3390k7759p168
7721F246k0054j9676L0018J4897J625o779J016J4435j0118k7511q28J1572r826
7708a4983o419J7415J0813J3798J479J2687J2821n8316j6033J0999L0793J9413
7696C4467k9891J9080J3463l3883Q704N80o94l4182k956J6927M021j3033j9913
7683c7310j9519M696J0349L0733N8646J1666j3835K5728N013j6094J0619j2664
$$ plain form
7671 58028 28053 -3028 -20869 2581 31376 19208 22162 28054 4389 -8200 15995 34216
7659 34216 30889 13450 -6145 5445 6840 -8982 -17330 -11598 -17887 -29543 -23293 -15937 -3872
7646 -3872 -20295 -27800 -18591 23038 23632 -1603 -938 -2740 -12279 2835 20951 39664 32001 -10817
7632 -10817 -15283 -20961 -17013 -14713 -2470 8487 -2157 -15992 -32321 -5999 9419 389 -18880
7619 -18880 -46754 -48473 -47350 -38439 -31538 -1760 20143 16824 -8488 -6077 -11085 -7507 -6111 -15040
7605 -15040 -24582 -2249 15085 22171 -14169 -21236 5291 723 1686 -14534 -9949 -15093 -17062 -16554
7591 -16554 6567 26396 30690 24753 20940 50985 53814 43463 30897 10685 9560 -5629 -13708
7578 -13708 8569 10977 -15217 -3928 21867 28719 25250 32572 48037 18597 7687 21488 25930
$$ packed form
7671E8028k9975l1081j7841K3450K8795j2168K954N892k3665j2589K4195J8221
7659C4216l327j7439j9595J1590J395j5822q348N732o289j1656O250P356J2065
7646c872j6423p505R209M1629N94k5235O65j802r539J5114J8116J8713p663m2818
7632a0817m466n678L948K300J2243J0957j0644j3835j6329K6322J5418r030j9269
7619a8880k7874j719J123Q911O901K9778K1903l319k5312K411n008L578J396q929
7605a5040r542K2333J7334P086l6340p067K6527m568R63j6220M585n144j969N08
7591a6554K3121J9829M294n937l813L0045K829j0351j2566k0212j125j5189q079
7578a3708K2277K408k6194J1289K5795O852l469P322J5465k9440j0910J3801M442
$$ plain form
7565 25930 49297 33179 995 -19616 -30740 -16666 15468 28026 9610 3306 1541 2092 5212
7552 5212 32053 38386 6672 -28216 -25135 -38723 -39923 -12339 6913 228 -5992 -23326 -71661
7539 -71661 -46789 -15742 -32837 -17640 12721 40388 33262 -18990 -51738 -70354 -46248 -36321
7527 -36321 -58122 -55875 -35130 -2469 -18866 -7326 20975 -1868 -5415 10199 7909 -6584
7515 -6584 -42272 -82314 -80248 -30289 -12910 -30350 -43196 -28270 -8365 7185 20017 9568
7503 9568 676 -11187 -48341 -59154 -54151 -35642 -20605 -20790 -14627 -4436 -8028 -18842 -9205
7490 -9205 1578 13095 24703 29682 2973 -12890 -34955 -12239 -14360 -19931 -30559 -34414 -22846
7477 -22846 22942 29806 33101 51527 37079 28399 29205 20362 -16924 -47222 -18169 -11432 -4499
$$ packed form
7565B5930K3367j6118l2184k0611j1124J4074L2134J2558j8416o304j765N51L120
7552E212K6841O333l1714l4888L081j3588j200K7584J9252o685o220j7334m8335
7539g1661K4872L1047j7095J5197L0361K7667p126n2252l2748j8616K4106R927
7527c6321k1801K247K0745L2661j6397J1540K8301k2843l547J5614k290j4493
7515f584l5688m0042K066M9959J7379j7440j2846J4926J9905J5550J2832j0449
7503I568q892j1863l7154j0813N003J8509J5037j85O163J0191l592j0814R637
7490i205J0783J1517J1608M979k6709j5863k2065K2716k121n571j0628l855J1568
7477b2846M5788O864L295J8426j4448q680Q06q843l7286l0298K9053O737O933
$$ plain form
7464 -4499 2055 24931 34581 36025 28274 21117 18494 13106 -8114 -8806 -700 7457 7863 -2449 14572
7449 14572 12238 20104 32902 14816 -13152 9725 26978 -5824 -15540 -31877 -15387 -11470 8010
7436 8010 -2740 -30492 -29807 -38050 -39409 -22688 -69 2346 -10730 -5215 -5573 -21999 14856 32275
7422 32275 8521 -19416 -33113 -9868 839 -17822 -18916 17827 22528 -17785 -29865 -39470
7410 -39470 -21251 -2913 9430 -7752 -32561 -52991 -31977 -26875 -1784 16083 18497 13784
7398 13784 14895 8120 12 -4296 -14893 -11912 21772 25728 29912 24384 34358 41407 24080 -4087
7384 -4087 4099 31881 7293 -19726 -22458 -6810 -194 -12012 -8938 13831 21199 16962 -13685
7371 -13685 -21557 23765 60851 28597 -2706 -23388 -26483 -46076 -48773 -33342 -15138 9270
$$ packed form
7464d499O554K2876R650J444p751p157k623n388k1220o92Q106Q157M06j0312J7021
7449A4572k334P866J2798j8086k7968K2877J7253l2802r716j6337J6490L917J9480
7436H010j0750k7752O85q243j359J6721K2619K415j3076N515l58j6426L6855J7419
7422C2275k3754k7937j3697K3245J0707j8661j094L6743M701m0313j2080r605
7410c9470J8219J8338J2343j7182k4809k0430K1014N102K5091J7867K414m713
7398A3784J111o775q108m308j0597K981L3684L956M184n528R974P049j7327k8167
7384d087Q186K7782k4588k7019k732J5648O616j1818L074K2769P368m237l0647
7371a3685p872M5322L7086l2254l1303k0682l095j9593k697J5431J8204K4408
$$ plain form
7359 9270 4032 2517 -19167 -26321 -21950 -29128 -1664 -8766 -34829 -32900 -27661 -23078 -12327 -6221
7345 -6221 8571 5434 5244 -6607 -1427 1432 12074 19279 9799 23831 31862 21312 13757 -4362
7331 -4362 5221 25319 1703 -30372 -31944 -45191 -30341 8611 8471 23886 38071 51130 5004
7318 5004 -22913 -14035 -25871 -31400 -18920 -22746 -23530 -6397 -10588 -4995 -5089 -15730 5144 5618
7304 5618 -2889 2236 22104 36490 16302 -944 -29040 -26794 -48276 -47006 -43985 -39734 5699
7291 5699 16000 11168 24397 40248 37842 42054 40624 -9943 -38075 -19237 -7535 -12980 -16530
7278 -16530 11408 41047 14868 3828 -2814 8582 -26187 -51191 -30957 -16766 -29171 -13896
7266 -13896 23205 5762 -16485 -21085 -23825 1062 4770 -29335 -24581 -14892 -19010 -24708 -21730
$$ packed form
7359I270n238j515k1684p154M371p178K7464p102k6063J929N239M583J0751O106
7345f221J4792l137j90j1851N180K859J0642P205r480J4032Q031j0550p555j8119
7331d362R583K0098k3616l2075j572j3247J4850L8952j40J5415J4185J3059m6126
7318E004k7917Q878j1836n529J2480l826p84J7133m191N593r4j0641K0874M74
7304E618q507N125J9868J4386k0188j7246k8096K246k1482J270L021M251M5433
7291E699J0301m832J3229J5851k406M212j430n0567k8132J8838J1702n445l550
7278a6530K7938K9639k6179j1040o642J1396l4769k5004K0234J4191j2405J5275
7266a3896L7101j7443k2247m600k740K4887L708l4105M754R689m118n698K978
$$ plain form
7253 -21730 -19131 -20304 -7385 10073 -32293 -32707 392 218 11793 19178 39674 30331 23616 1751
7239 1751 -24495 -10665 -14076 -20859 -35373 -53449 -47414 -33409 -26307 3751 8508 12420 26426
7226 26426 31015 27619 35093 39856 35315 35625 27446 34504 17225 -14537 -24592 -34251 -38555 8217
7212 8217 -354 -9540 -25988 -61927 -45612 -29357 -54034 -58907 -62394 -14702 14885 3927 12275
7199 12275 23983 7072 7158 -414 10763 -26983 -52258 -51227 -80379 -80340 -46464 -39633 -34794 -32578
7185 -32578 -43089 -47810 -67430 -81455 -47181 -18088 -34882 -21953 -17599 -5019 15610 25755
7173 25755 1118 -1161 9277 14152 28400 9543 -10263 -10702 -22251 -54043 -31861 -29950 -27657
7160 -27657 -39927 -57830 -14900 4228 -14178 6130 22772 39606 178 -26247 -23422 -19620
$$ packed form
7253b1730K599j173J2919J7458m2366m14L3099j74J1575P385K0496r343o715k1865
7239A751k6246J3830l411o783j4514j8076O035J4005P102L0058M757L912J4006
7226B6426M589l396P474M763m541L10q179P058j7279l1762j0055r659m304M6772
7212H217q571r186j6448l5939J6315J6255k4677m873l487M7692K9587j0958Q348
7199A2275J1708j6911Q6p572J1177l7746k5275J031k9152L9L3876O831M839K216
7185c2578j0511m721j9620j4025L4274K9093j6794J2929M354J2580K0629J0145
7173B5755k4637k279J0438M875J4248j8857j9806m39j1549l1792K2182J911K293
7160b7657j2270j7903M2930J9128j8406K0308J6642J6834l9428k6425K825L802
$$ plain form
7148 -19620 -14640 1450 21394 29255 22845 -5181 -15268 -25882 -42054 -19727 -2767 -16147
7136 -16147 -38641 -44958 -29057 -2235 -9066 -9822 33204 35303 22133 10707 -11210 -24509 -8218
7123 -8218 15918 -282 5147 8681 5624 44627 43363 13785 -1396 -623 26024 13972 3525
7110 3525 22879 31662 73345 92943 62751 26558 11097 -3204 4795 19916 18254 18765 6560
7097 6560 5862 1740 14999 37233 29026 27030 14989 13813 48774 45312 12535 -12535 -8625 676
7083 676 19887 4139 -29611 -22711 -7948 -9085 -14943 -17470 11724 26860 6802 2158 3272
7070 3272 14101 7691 -202 -1990 -16817 -35065 -49542 -29523 -32141 5987 21374 34818 67750
7057 67750 77602 62112 45438 9739 2367 428 -2243 -10767 -16037 -26726 -48405 -43654 -48905
$$ packed form
7148a9620M980J6090J9944P861o410k8026j0087j0614j6172K2327J6960j3380
7136a6147k2494o317J5901K6822o831p56M3026K099j3170j1426k1917j3299J6291
7123h218K4136j6200N429L534l057L9003j264k9578j5181P73K6647j2052j0447
7110C525J9354Q783M1683J9598l0192l6193j5461j4301P999J5121j662N11j2205
7097F560o98m122J3259K2234q207j996j2041j176L4961l462l2777k5070L910R301
7083F76J9211j5748l3750O900J4763j137n858k527K9194J5136k0058m644J114
7070C272J0829o410p893j788j4827j8248j4477K0019k618L8128J5387J3444L2932
7057F7750R852j5490j6674l5699p372j939k671q524n270j0689k1679M751n251
$$ plain form
7044 -48905 -66159 -31101 -20193 -20615 -9711 -21299 -43667 -38048 -5995 -20619 -37650 -21148
7032 -21148 -13594 -11427 -12662 -21804 -4190 10815 -9062 4849 -5256 5961 21027 17909 -17102
7019 -17102 -53540 -52216 -46450 -32973 -39932 -57059 -63255 -65432 -66398 -54299 -44907 -38865 -25545 -17519
7005 -17519 -32280 -33676 -35302 -37373 -14203 -37345 -45277 -46860 -43522 -19484 -11431 -37670 -43168
6992 -43168 -42143 -15646 -23852 -8060 17166 -7421 -21260 -29818 -24535 23306 28535 27599 25247
6979 25247 7464 14990 21097 -14229 -37916 -38794 -25355 -13127 -18550 -33845 -6760 17949 24452
6966 24452 67914 37770 -14125 -45685 -75086 -36071 -19714 -2815 20970 18115 -20666 -35862
6954 -35862 -6476 -4359 -11117 5535 12847 20331 33482 23767 20044 -2930 2769 -5363 -34341
$$ packed form
7044d8905j7254L5058J0908m22J0904j1588k2368N619L2053j4624j7031J6502
7032b1148P554K167j235r142J7614J5005j9877J3911j0105J1217J5066l118l5011
7019a7102l6438J324N766J3477o959j7127o196k177r66J2099R392O042J3320Q026
7005a7519j4761j396j626k071K3170k3142p932j583L338K4038Q053k6239n498
6992d3168J025K6497q206J5792K5226k4587j3839q558N283M7841N229r36k352
6979B5247j7783P526O107l5326k3687q78J3439J2228n423j5295K7085K4709O503
6966B4452M3462l0144n1895l1560k9401L9015J6357J6899K3785k855l8781j5196
6954c5862K9386K117o758J6652P312P484J3151r715l723k2974N699q132k8978
$$ plain form
6941 -34341 -63395 -47867 -27570 -9741 -12212 -6709 -12431 11329 48906 37579 1448 -26546
6929 -26546 -54822 -51582 -55027 -18069 -1287 1653 3370 -32832 -29829 -4252 2021 -9127 4654
6916 4654 -89 12349 -14951 -40292 -20520 30025 19330 4230 -4940 -30038 -36582 -39802 -32919
6903 -32919 -4182 35980 26324 4056 -40927 -52420 -13789 11367 16149 44884 36323 13275
6891 13275 23497 10327 5360 -16741 -21931 -22403 22 32061 36477 5826 7938 21771 43516
6878 43516 65280 43821 38486 -7267 -20530 -24239 -4064 -9801 -50340 -38204 6868 -947 -22914
6865 -22914 -30939 -24070 -54113 -52861 -37379 -28320 -47117 -53908 -32560 -23383 -13624 -7580 21542
6852 21542 28643 25155 20274 14577 20324 -34304 -41243 -35594 -27102 -16924 -26932 -27482 -12833 10249
$$ packed form
6941c4341k9054J5528K0297J7829k471N503n722K3760L7577j1327l6131k7994
6929b6546k8276L240l445L6958J6782K940J717l6202L003K5577O273j1148J3781
6916D654m743J2438k7300k5341J9772N0545j0695j5100r170k5098o544l220O883
6903c2919K8737M0162r656k2268m4983j1493L8631K5156M782K8735q561k3048
6891A3275J0222j3170m967k2101n190m72K2425L2039M416l0651K112J3833K1745
6878D3516K1764k1459n335m5753j3263l709K0175n737m0539J2136M5072p815k1967
6865b2914q025O869l0043J252J5482R059j8797o791K1348R177R759O044K9122
6852B1542P101l488m881n697N747n4628o939N649Q492J0178j0008n50J4649K3082
$$ plain form
6838 10249 38765 41016 52654 64270 65309 36576 5771 -13268 21072 36436 36290 29070 34984
6825 34984 26837 41465 34008 26430 33135 42292 44158 37250 25040 21170 -26560 -44123 -50141 -25493
6811 -25493 -7240 -4905 -8892 9865 45306 63450 31037 27264 39293 18361 -24850 -21532 -41137
6798 -41137 -37885 -6191 17307 29127 53094 28610 -23836 -34772 -10353 -9384 -7224 29814 32667
6785 32667 7210 -27276 -36769 -28513 -32473 -42196 -40935 -51894 -24497 -18417 -15724 -1705 -12650
6772 -12650 2175 24117 3198 -12417 -20940 -40033 -38417 -34241 -41314 -10242 -14804 -40591 -27433
6759 -27433 13873 34808 22632 24139 44643 47144 47476 45957 48509 53796 50128 18776 -6973
6746 -6973 -3180 33657 44847 35803 44816 53795 65464 54131 11985 27588 33746 56464 38740
$$ packed form
6838A0249K8516K251J1638J1616J039k8733l0805j9039L4340J5364j46p220N914
6825C4984q147J4628p457p578O705R157J866o908j2210l870m7730j7563o018K4648
6811b5493J8253K335l987J8757L5441J8144l2413l773J2029k0932m3211L318j9605
6798d1137L252L1694K3498J1820K3967k4484n2446j0936K4419R69K160L7038K853
6785C2667k5457l4486r493Q256l960r723J261j0959K7397O080K693J4019j0945
6772a2650J4825K1942k0919j5615q523j9093J616M176p073L1072m562k5787J3158
6759b7433M1306K0935j2176J507K0504K501L32j519K552N287l668l1352k5749
6746f973L793L6837J1190r044R013Q979J1669j1333m2146J5603O158K2718j7724
$$ plain form
6733 38740 15979 12953 5865 -9978 -19957 -45021 -63065 -63612 -47555 -41840 -11098 -9555 -11590
6720 -11590 -6079 -1356 615 7057 -13228 -52650 -17090 20829 29422 21892 20251 25024 3796
6707 3796 18601 57028 73832 24360 2240 12570 -3595 -5571 -5867 -7535 -20404 -7821 5403
6694 5403 22663 -28461 -72796 -73127 -56694 -13376 -16574 -3322 -27066 -35960 -22116 -34517 -67840
6681 -67840 -68832 -27532 5346 14950 19228 25046 -760 -40086 -23234 -7764 -11278 -21090 -20695 -4630
6667 -4630 -35344 -25284 -11134 5716 -4572 -9737 628 -33967 -24005 -41 -1579 -27031 -16391
6654 -16391 -34132 -30726 -7444 17214 32404 11794 20207 14605 -301 -23060 -56638 -68591
6642 -68591 -31882 -4504 -29518 -18103 -12859 -32454 -22840 -23092 -25139 -35487 -21052 -39368 -41343
$$ packed form
6733C8740k2761l026p088j5843r979k5064j8044n47J6057N715L0742J543k035
6720a1590N511M723J971O442k0285l9422L5560L7919Q593p530j641M773k1228
6707C796J4805L8427J6804m9472k2120J0330j6165j976k96j668j2869J2583J3224
6694E403J7260n1124m4335l31J6433M3318l198J3252k3744q894J3844j2401l3323
6681f7840r92M1300L2878R604M278N818k5806l9326J6852J5470l514r812L95J6065
6667d630l0714J0060J4150J6850j0288n165J0365l4595R962K3964j538k5452J0640
6654a6391j7741L406K3282K4658J5190k0610Q413n602j4906k2759l3578j1953
6642f8591L6709K7378k5014J1415N244j9595R614k52k047j0348J4435j8316j975
$$ plain form
6629 -41343 -37306 -30569 -23804 -21409 -26026 -5352 13094 -14777 -25702 -40078 -36092 12724 20922
6616 20922 16771 6350 -6144 -2079 7104 35653 8348 -11152 -40702 -21958 4070 -21473
6604 -21473 -34045 -27771 -33059 -42799 -48319 -47243 -28244 -22217 -4609 -6255 -7826 -11408 -52391 -62260
6590 -62260 -47176 -45881 -77214 -79676 -59621 -22516 -10900 -15060 -17445 8017 -7033 -22487 -9452
6577 -9452 -7108 4850 4742 -30834 -65271 -36293 -29272 -22588 -20145 -38105 -14999 -30047 -34855
6564 -34855 9364 18005 -6417 -14859 -19218 -15736 -26796 194 28770 35115 12311 -6677 617
6551 617 -989 -287 3922 -13216 -8653 -13070 -11036 -12357 -9680 -5435 12932 22690 -1869 -15532
6537 -15532 -34778 -38419 -54785 -31762 -19181 -109 28003 12319 29705 1124 -15039 -40107
$$ packed form
6629d1343M037O737O765K395m617K0674J8446k7871j0925j4376L986M8816Q198
6616B0922m151j0421j2494M065R183K8549k7305j9500k9550J8744K6028k5543
6604b1473j2572O274n288r740n520J076J8999O027J7608j646j571l582m0983r869
6590f2260J5084J295l1333k462K0055L7105J1616m160k385K5462j5050j5454J3035
6577i452K344J1958j08l5576l4437K8978P021O684K443j7960K3106j5048m808
6564c4855M4219Q641k4422q442m359L482j1060K6990K8576O345k2804j8988P294
6551F17j606P02M209j7138M563m417K034j321K677M245J8367R758k4559j3663
6537a5532j9246l641j6366K3023J2581J9072K8112j5684J7386k8581j6163k5068
$$ plain form
6525 -40107 -77639 -88327 -74739 -42927 -25492 -8248 23350 50485 60116 56407 28399 3761
6513 3761 11217 29624 -11664 -26914 -41526 -56819 -53359 -76331 -55418 -31195 -17749 6648
6501 6648 1208 5726 852 -11667 -35733 -58784 -52666 -28671 -13099 -14055 10866 -1649 -6533
6488 -6533 -19782 -38428 -37320 -45738 -42144 -5323 788 -21852 -19863 1535 5150 -8054 2689
6475 2689 6963 -11036 12192 49916 57870 50853 40143 13476 799 -11600 29499 33143 16918
6462 16918 3939 3275 -5394 -1634 49717 45754 -6158 10748 3454 -25991 -22991 -21013 -35516
6449 -35516 -41233 -23107 16031 22870 2775 4943 5916 -1154 -17626 -17162 -16929 -33838 -4125 -4801
6435 -4801 -27538 -6517 -434 -3516 18431 30924 46083 4235 -39517 -33524 -26068 -18869 -13612
$$ packed form
6525d0107l7532j0688J3588L1812J7435J7244L1598K7135R631l709k8008k4638
6513C761P456J8407m1288j5250j4612j5293L460k2972K0913K4223J3446K4397
6501F648n440M518m874j2519k4066k3051O118K3995J5572r56K4921j2515m884
6488f533j3249j8646J108q418L594L6821O111k2640J989K1398L615j3204J0743
6475B689M274j7999K3228L7724P954p017j0710k6667j2677j2399M1099L644j6225
6462A6918j2979o64q669L760N1351l963n1912J6906p294k9445L000J978j4503
6449c5516n717J8126L9138O839k0095K168R73p070j6472M64K33j6909K9713o76
6435d801k2737K1021O083l082K1947J2493J5159m1848m3752N993P456P199N257
$$ plain form
6422 -13612 -17650 -28488 4063 -6204 -29129 -20537 -10432 -7634 -314 -2146 3320 24796 18276
6409 18276 1890 -20948 -28921 -13164 6012 5764 -9244 -4340 26064 40018 49405 70115 66242
6396 66242 47924 52635 27586 18332 30680 20957 -11143 8416 32403 25030 -743 -21327 -20802
6383 -20802 -28271 -56210 -51989 -63371 -52687 -34654 -38443 -18111 965 5562 -2818 -15270 -15141
6370 -15141 -9264 -1161 -2595 -1548 -1582 6693 46897 34472 27625 34260 34445 9892 26573 32666
6356 32666 60043 63326 22482 -25918 -34141 -29466 -25570 -23389 2728 -973 -538 11151 1704 15893
6342 15893 43854 16807 3271 10137 1575 -775 10816 40853 10754 -19444 -12942 3602 1058
6329 1058 23051 25055 40080 28615 11760 33722 45943 49173 9574 -13148 -56153 -60829 -58291
$$ packed form
6422a3612m038j0838L2551j0267k2925Q592J0105K798P320j832N466K1476o520
6409A8276j6386k2838p973J5757J9176k48j5008M904L0404J3954R387K0710l873
6396F6242j8318M711k5049r254J2348r723l2100J9559K3987p373k5773k0584N25
6383b0802p469k7939M221j1382J0684J8033l789K0332J9076M597q380j2452J29
6370a5141N877Q103j434J047l4Q275M0204j2425o847O635J85k4553J6681O093
6356C2666K7377L283m0844m8400q223M675L896K181K6117l701M35J1689r447J4189
6342A5893K7961k7047j3536O866q562k350J1591L0037l0099l0198O502J6544k544
6329A058K1993K004J5025j1465j6855K1962J2221L230l9599k2722m3005m676K538
$$ plain form
6316 -58291 -28769 25197 22191 8782 42161 56671 42172 46573 68034 61919 63475 56014 28824
6303 28824 53383 44659 -6015 -45727 -30168 -25292 -31730 -38992 -21241 -35399 -34791 6620 15174
6290 15174 38508 42608 19676 9108 5710 843 32081 38785 27310 27408 30471 18848 31771
6277 31771 8541 -3139 31319 42158 16972 3905 17554 7187 -7481 2709 663 5112
6265 5112 -17339 13630 48407 35273 20347 -728 -6772 -8588 -23891 20130 66739 37368
6253 37368 16106 7373 30546 37782 14000 19797 7472 -10636 21337 21544 10284 -7268 -30334
6240 -30334 2233 37010 20510 -25349 -64668 -36570 -13402 -14415 -26963 -27328 -36034 -35651 -52837
6227 -52837 -30610 -30539 -7886 11733 23202 27290 6648 24690 23960 20408 24775 2970 -12624
$$ packed form
6316e8291K9522N3966l006j3409L3379J4510j4499M401K1461o115J556p461k7190
6303B8824K4559q724n0674l9712J5559M876o438p262J7751j4158O08M1411Q554
6290A5174K3334M100k2932j0568l398m867L1238O704j1475R8L063j1623J2923
6277C1771k3230j1680L4458J0839k5186j3067J3649j0367j4668J0190k046M449
6265E112k2451L0969L4777j3134j4926k1075o044j816j5303M4021M6609k9371
6253C7368k1262q733K3173P236k3782N797j2325j8108L1973K07j1260j7552k3066
6240c0334L2567L4777j6500m5859l9319K8098K3168j013j2548l65q706L83j7186
6227e2837K2227P1K2653J9619J1469M088k0642J8042p30l552M367k1805j5594
$$ plain form
6214 -12624 10741 34847 29451 1671 -21050 -21092 -38018 -20045 32317 47009 27425 15233 20569
6201 20569 29750 -2314 -38352 -56252 -50884 -15854 -7462 -1741 -3735 -31439 -51692 -14944 23604
6188 23604 17046 8360 234 -7268 -33213 -34396 -6277 46247 43216 59376 59993 43230 33931 7369
6174 7369 24113 9643 3126 -27187 -26701 -12264 -8365 -18397 -21021 1452 434 -27202 -41293
6161 -41293 -25447 -27560 -13922 -11783 21848 36052 23968 9216 -7394 10197 -47073 -81536
6149 -81536 -69420 -66608 -67203 -53129 -56491 -38823 -23518 3759 3299 774 667 1371 -6624 8404
6135 8404 -11228 14954 34674 21104 31887 17088 30755 19003 43345 2895 -12495 -17256
6123 -17256 -6134 10491 6718 -9859 -11752 17372 11880 10277 2400 12319 26571 33713 33737 -17052
$$ packed form
6214a2624K3365K4106n396k7780k2721m2j6926J7973N2362J4692j9584j2192N336
6201B0569R181l2064l6038j7900N368L5030Q392N721j994k7704k0253L6748L8548
6188B3604o558q686q126p502k5945j183K8119N2524l031J6160O17j6763r299k6562
6174G369J6744j4470o517l0313M86J4437L899j0032k624K2473j018k7636j4091
6161d1293J5846k113J3638K139L3631J4204j2084j4752j6610J7591n7270l4463
6149h1536J2116K812n95J4074l362J7668J5305K7277m60k525j07P04p995J5028
6135H404j9632K6182J9720j3570J0783j4799J3667j1752K4342m0450j5390m761
6123a7256J1122J6625l773j6577j893K9124n492j603p877R919J4252P142K4n0789
$$ plain form
6109 -17052 -40796 -18414 12565 32223 54666 76749 42806 37324 19313 21193 39902 42327
6097 42327 11187 10998 9226 14817 16711 23278 37250 38727 6612 -11522 -23146 -7760 9601
6084 9601 -19920 -42402 -46303 -71191 -46436 -22130 -18128 -21387 -5543 -44068 -36926 -2308 1506
6071 1506 -1977 -8974 -2748 -17745 -29289 -24066 -27747 -43874 -33435 -21509 22540 52131 89719
6058 89719 85734 27099 29921 33257 22916 29210 9067 -6011 -24810 2043 -11620 -13679 -1763
6045 -1763 15792 18446 10140 10707 -11168 5676 22622 49364 18978 9958 22221 11201 -21403
6032 -21403 2691 11220 -1445 -24195 -40069 -37805 -31317 11939 41891 32794 5393 -14942 -25975
6019 -25975 -32284 -11093 1333 -2516 -18329 -5044 -15301 1680 -5856 -30174 -49536 -34832
$$ packed form
6109a7052k3744K2382L0979J9658K2443K2083l3943n482j8011J880J8709K425
6097D2327l1140j89j772N591J894O567J3972J477l2115j8134j1624J5386J7361
6084I601k9521k2482l901k4888K4755K4306M002l259J5844l8525P142L4618L814
6071A506l483o997O226j4997j1544N223l681j6127J0439J1926M4049K9591L7588
6058H9719l985n8635K822L336j0341O294k0143j5078j8799K6853j3663k059J1916
6045a763J7555K654q306N67k1875J6844J6946K6742l0386r020J2263j1020l2604
6032b1403K4094Q529j2665k2750j5874K264O488M3256K9952r097k7401k0335j1033
6019b5975o309K1191J2426l849j5813J3285j0257J6981p536k4318j9362J4704
$$ plain form
6007 -34832 -24134 -21921 -1765 -13450 -15389 4646 30057 47382 23847 170 -13870 -26488
5995 -26488 -7348 -4980 4404 -21877 -72048 -64791 -45803 -48086 -36906 270 12686 36565 32500
5982 32500 12573 14924 54233 42684 -3194 -22321 -20125 -33828 -60493 -49285 -42223 -35189 -42898
5969 -42898 -52468 -58467 -29833 -2252 5322 -14862 -17442 -26285 -27022 -46532 -45811 -40010 -5782 40155
5955 40155 22324 10744 -20336 -66482 -85201 -52978 -21634 -3140 -25160 -28607 -43823 -29399
5943 -29399 -11135 -2563 23789 23120 31800 41726 17421 344 9019 7169 -424 -11963 -32795
5930 -32795 2392 20688 99 -11468 -5999 -20434 -3113 -4084 -16472 -32243 -54135 -57170 -79177
5917 -79177 -76832 -26059 632 -8201 8574 20798 30455 31298 26217 50530 11378 -32976 -22793
$$ packed form
6007c4832J0698K213K0156j1685j939K0035K5411J7325k3535k3677j4040j2618
5995b6488J9140K368R384k6281n0171P257J8988k283J1180L7176J2416K3879m065
5982C2500j9927K351L9309j1549m5878j9127K196j3703k6665J1208P062P034p709
5969d2898r570n999K8634K7581P574k0184k580q843p37j9510P21N801L4228M5937
5955D0155j7831j1580l1080m6146j8719L2223L1344J8494k2020l447j5216J4424
5943b9399J8264Q572K6352o69Q680R926k4305j7077Q675j850p593j1539k0832
5930c2795L5187J8296k0589j1567N469j4435J7321r71j2388j5771k1892l035k2007
5917g9177K345N0773K6691q833J6775J2224R657Q43n081K4313l9152m4354J0183
$$ plain form
5904 -22793 -13835 -9462 -17259 -15147 -37089 -48762 -67203 -100100 -115713 -60143 -38104 -28349 -18780
5891 -18780 1632 -12435 -22010 -35398 -25075 -12387 -3294 -6754 9069 13933 8210 753 10420
5878 10420 20572 5854 -7983 -21597 -5165 18107 41805 21193 -2552 -1837 -3975 -12222 -24387
5865 -24387 -31030 -16574 -162 -17574 -22281 -4597 52272 59742 76971 56796 1951 -19891
5853 -19891 -27367 -36448 -25603 -10495 -12316 -38112 -53274 -32817 -760 -9711 25348 32900 34788
5840 34788 25971 -2017 5284 13766 30437 41217 3185 -15811 -11722 -17556 13514 36343 26243
5827 26243 5151 -3969 -4807 5919 19376 25639 37309 38676 50084 62396 34937 -3810 11135
5814 11135 351 -1542 19699 14103 -11180 -9211 4490 8795 -11138 -57793 -49222 -5997 24069
$$ packed form
5904b2793Q958M373p797K112k1942j1673j8441l2897j5613N5570K2039R755R569
5891a8780K0412j4067r575j3388J0323J2688R093l460J5823M864n723p457R667
5878A0420J0152j4718j3837j3614J6432K3272K3698k0612k3745P15k138q247j2165
5865b4387o643J4456J6412j7412m707J7684N6869P470J7229k0175n4845k1842
5853a9891p476r081J0845J5108j821k5796j5162K0457L2057q951L5059P552J888
5840C4788q817k7988P301Q482J6671J0780l8032j8996M089n834L1070K2829j0100
5827B6243k1092r120q38J0726J3457O263J1670J367J1408J2312k7459l8747J4945
5814A1135j0784j893K1241n596k5283J969J3701M305j9933m6655Q571M3225L0066
$$ plain form
5801 24069 3481 13874 13694 -17582 -30801 -3067 22119 9075 -20613 -1895 30052 29651 21850
5788 21850 8324 -19327 10032 29216 4540 -4780 -7974 -16913 -6137 -1856 22548 15880 18314
5775 18314 21256 -11901 -48904 -47308 -46639 -25200 -30440 -38280 -17744 -16175 -38074 -49430 -18443
5762 -18443 17029 4777 13340 37712 27574 29050 19492 20023 19240 19161 13369 6648 -23056 -53625
5748 -53625 -91384 -86403 -51959 -59002 -72774 -47102 -45362 -38953 -65184 -65826 -48869 -31308 -25537
5735 -25537 -38410 -47091 -52581 -27209 -28474 -38917 -8446 9156 1290 -34111 -45306 -7761 9251
5722 9251 -7575 -1279 -13636 -15198 -11363 -10864 -39683 -23640 9440 -1304 -17695 -11791 -13216
5709 -13216 287 -10397 -48864 -72256 -44450 -19726 -12402 -8460 -9794 1499 28278 3316
$$ packed form
5801B4069k0588J0393j80l1276j3219K7734K5186j3044k9688J8718L1947m01p801
5788B1850j3526k7651K9359J9184k4676r320l194q939J0776M281K4404o668K434
5775A8314K942l3157l7003J596O69K1439n240p840K0536J569k1899j1356L0987
5762a8443L5472j2252Q563K4372j0138J476r558N31p83p9n792o721k9704l0569
5748e3625l7759M981L4444p043j3772K5672J740O409k6231o42J6957J7561N771
5735b5537j2873q681n490K5372j265j0443L0471J7602p866l5401j1195L7545J7012
5722I251j6826O296j2357j562L835M99k8819J6043L3080j0744j6391N904j425
5709a3216J3503j0684l8467k3392K7806K4724P324L942j334J1293K6779k4962
$$ plain form
5697 3316 -1231 13754 12513 12589 14322 -8854 -14220 8584 34260 46133 52491 66523 46076 39509
5683 39509 35484 45581 53678 82251 59947 40570 23129 24771 30806 50655 4582 -31454 -50473
5670 -50473 -37116 -35581 -57722 -61106 -52325 -24313 -34004 -57905 -60628 -51666 -25070 16762 7138
5657 7138 -3585 -3251 4996 30722 10081 4008 10504 18127 -21791 -23818 -1259 5327 -8556 -6651
5643 -6651 27663 48621 28130 -4810 -22125 -7427 806 -14368 -40953 -21942 -20941 -32437
5631 -32437 -17823 -41954 -52596 -46457 -33243 -34618 -41004 -25498 -4763 -13210 -13888 -8980 -12195
5618 -12195 -25072 -21404 8582 4881 -13749 -25880 -13339 10581 8926 2618 13866 -8827 -42808
5605 -42808 -38882 -33257 -8020 -5576 -27752 -32936 -17427 18029 20391 -5846 -18049 1195 -8738
$$ packed form
5697C316m547J4985j241P6J733k3176n366K2804K5676J1873O358J4032k0447o567
5683C9509m025J0097Q097K8573k2304j9377j7441J642O035J9849m6073l6036j9019
5670e0473J3357J535k2141l384Q781K8012r691k3901k723Q962K6596M1832r624
5657G138j0723L34Q247K5726k0641o073O496P623l9918k027K2559O586j3883J905
5643f651L4314K0958k0491l2940j7315J4698Q233j5174k6585J9011J001j1496
5631c2437J4614k4131j0642O139J3214j375o386J5506K0735q447o78M908l215
5618a2195j2877L668K9986l701j8630j2131J2541K3920j655o308J1248k2693l3981
5605d2808L926N625K5237K444k2176n184J5509L5456K362k6237j2203J9244r933
$$ plain form
5592 -8738 -34559 -13996 12551 22902 16002 16915 14528 31538 36124 27207 20246 -17131 -56287
5579 -56287 -63969 -83898 -81849 -50056 -32509 -5388 -8380 2788 26190 23251 30059 21174 29864
5566 29864 22505 8491 -24397 -56581 -36563 -19561 -19433 13322 48094 25585 15057 -7900
5554 -7900 4360 15678 18413 1633 20 -3801 -4732 22608 37504 35644 25747 -25421 -51399
5541 -51399 -20117 17496 7478 -553 -5463 -6619 -17110 -19879 -20418 -23960 3952 10608 -10549
5528 -10549 -20044 -43672 -43530 -29745 -35614 -58275 -28135 -4112 -14295 -35197 -61388 -65004 -46688
5515 -46688 -52062 -44631 -46907 -17262 7336 1822 -594 14156 32485 118 -10797 1391 25067
5502 25067 44836 36418 1518 -6238 -17129 -34071 -28078 -11866 -17340 4560 11764 -2060 -20773
$$ packed form
5592h738k5821K0563K6547J0351o900R13k387J7010M586q917o961l7377l9156
5579e6287p682j9929K049L1793J7547K7121k992J1168K3402k939O808q885Q690
5566B9864p359j4014l2888l2184K0018J7002J28L2755L4772k2509j0528k2957
5554g900J2260J1318K735j6780j613l821r31K7340J4896j860r897n1168k5978
5541e1399L1282L7613j0018q031m910j156j0491k769n39l542K7912O656k1157
5528a0549r495k3628J42J3785n869k2661L0140K4023j0183k0902k6191l616J8316
5515d6688n374P431k276K9645K4598n514k416J4750J8329l2367j0915J2188K3676
5502B5067J9769q418l4900p756j0891j6942N993J6212n474K1900P204j3824j8713
$$ plain form
5489 -20773 -25926 -28218 -10811 -7618 -3636 -39686 -37285 -10821 21633 21679 -1048 -5003 -28965 -2615
5475 -2615 -28019 -15487 13513 41872 70950 41715 8063 25112 50484 45295 27982 36110
5463 36110 15291 -12084 7481 3806 -17647 -3895 -9731 -25437 -27826 -12318 18468 18480 -10590
5450 -10590 -33649 -23877 -9450 16845 62890 45278 9797 5958 -7612 -5166 -36877 -24275
5438 -24275 -71500 -93581 -57982 -76809 -80807 -50438 -33840 12585 49902 36959 37305 65691
5426 65691 46459 -1783 -33086 -56297 -47907 -24056 2376 -1275 22237 50663 21416 14472
5414 14472 36177 25388 14288 1055 -12870 -21907 -33674 -27813 18295 46071 18359 14747
5402 14747 4017 17950 15561 -14626 -9093 -5199 2759 -3276 -10588 -15184 17102 20030 -11847
$$ packed form
5489b0773n153k292J7407L193L982l6050K401K6464L2454M6k2727l955k3962K6350
5475b615k5404J2532K9000K8359K9078k9235l3652J7049K5372n189j7313Q128
5463C6110k0819k7375J9565l675k1453J3752n836j5706k389J5508L0786J2k9070
5450a0590k3059R772J4427K6295M6045j7612l5481l839j3570K446l1711J2602
5438b4275m7225k2081L5599j8827l998L0369J6598M6425L7317j2943L46K8386
5426F5691j9232m8242l1303k3211Q390K3851K6432l651K3512K8426k9247o944
5414A4472K1705j0789j1100j3233j3925r037j1767N861M6108K7776k7712l612
5402A4747j0730J3933k389l0187N533L894P958o035p312m596L2286K928l1877
$$ plain form
5389 -11847 -8706 -12713 -8426 -36981 -69343 -58460 -26532 -7731 -14668 -6575 -4243 -9376 -46627
5376 -46627 -37709 -25437 -40371 -59813 -40093 -21788 -6900 2916 -11041 -8828 -45920 -28311
5364 -28311 -907 5880 1589 96 -2759 8119 9501 -590 -25891 -35742 -44213 -49484 -23172
5351 -23172 -1483 -21874 -54872 -59612 -36380 -7763 1246 -8386 -30029 -23193 590 28811 26265
5338 26265 5453 -11159 -26038 -21891 -5584 -8864 -4989 36941 25301 -18523 -20902 -3305 -1842
5325 -1842 -169 6349 -3352 15211 55433 25194 -16317 11050 32290 32063 14562 2462 4078
5312 4078 -20315 -23582 -21948 1151 -3642 -11948 -3853 4281 28372 49397 62316 46685 10950
5299 10950 -1469 20741 23925 4481 -5893 25008 26133 13501 -22246 -33926 2679 -27022
$$ packed form
5389a1847L141m007M287k8555l2362J0883L1928J8801o937Q093K332n133l7251
5376d6627Q918J2272j4934j9442J9720J8305J4888R816j3957K213l7092J7609
5364b8311K7404O787m291j493k855J0878J382j0091k5301r851q471n271K6312
5351b3172K1689k0391l2998m740K3232K8617R009r632k1643O836K3783K8221k546
5338B6265k0812j6612j4879M147J6307l280L875M1930j1640m3824k379J7597J463
5325a842J673O518r701J8563M0222l0239m1511K7367K1240k27j7501j2100J616
5312D078k4393l267J634K3099m793q306Q095Q134K4091K1025J2919j5631l5735
5299A0950j2419K2210L184j9444j0374L0901J125j2632l5747j1680L6605k9701
$$ plain form
5287 -27022 -52460 -33935 -35266 -59681 -35755 -39995 -30699 -6977 -12216 -21555 -11927 -20712 -27302
5274 -27302 2835 -3334 6853 19431 2415 -15000 -15525 -31240 -26548 -62396 -84945 -83941 -61594
5261 -61594 -38542 -9347 -5489 -13796 -6379 -545 32461 30235 -23429 -30670 -18796 -21104 -2755
5248 -2755 35328 5511 -22667 -25587 -13979 1819 9896 26427 -4578 17424 31330 15534
5236 15534 16029 12734 -12893 -27056 -41707 -25755 13589 14551 -11899 -48946 -49390 -45848 -17259
5223 -17259 9528 -5354 -29495 -52740 -35696 -14664 -5459 -43930 -65725 -41145 -31825 -20231
5211 -20231 -6484 -21304 -27833 -49039 -40540 -26257 -4524 -20331 -18487 -16146 -30461 -43550 -45099
5198 -45099 -36066 -26477 -44497 -16512 -11331 21346 39923 41716 8478 -45072 -47814 -33828 -43498
$$ packed form
5287b7022k5438J8525j331k4415K3926m240R296K3722n239r339R628q785o590
5274b7302L0137o169J0187J2578j7016j7415n25j5715M692l5848k2549J004K2347
5261f1594K3052K9195L858q307P417N834L3006k226n3664p241J1874k308J8349
5248b755L8083k9817k8178k920J1608J5798Q077J6531l1005K2002J3906j5796
5236A5534M95l295k5627j4163j4651J5952L9344R62k6450l7047m44L542K8589
5223a7259K6787j4882k4141k3245J7044K1032R205l8471k1795K4580R320J1594
5211b0231J3747j4820o529k1206Q499J4283K1733j5807J844K341j4315j3089j549
5198d5099R033R589j8020K7985N181L2677J8577J793l3238n3550k742J3986r670
$$ plain form
5185 -43498 -39143 -44966 -43098 -24910 -20863 -43218 -62361 -47953 -29733 -15825 -40359 -29901 -36079
5172 -36079 -19423 -7277 2421 10584 10526 3751 -14484 -21109 -48688 -55054 -15925 3279 10606 31462
5158 31462 18719 22568 32821 4746 -3327 -10495 -2011 12042 1338 1033 -288 11481 9805
5145 9805 13667 11032 -17993 -43137 -27014 -12979 -42866 -55292 -56694 -42743 -14837 8202 -6412
5132 -6412 -4117 21550 16577 -16656 -38078 -59983 -59756 -31144 -21779 -1469 27354 46589 58815
5119 58815 47818 28519 47438 32585 -3509 -19160 -17648 -3309 -3624 -929 333 13846 6976
5106 6976 19337 17020 24421 26307 1990 893 -19510 -18501 -4066 9307 -803 -22427 -36937
5093 -36937 -20288 12051 6616 -7396 -44913 -69090 -33840 -50813 -30983 -18043 13696 20460
$$ packed form
5185d3498M355n823J868J8188M047k2355j9143J4408J8220J3908k4534J0458o178
5172c6079J6656J2146R698Q163n8o775j8235o625k7579o366L9129J9204P327K0856
5158C1462j2743L849J0253k8075q073p168Q484J4053j0704l05j321J1769j676
5145I805L862k635k9025k5144J6123J4035k9887j2426j402J3951K7906K3039j4614
5132f412K295K5667m973l3233k1422k1905K27K8612R365K0310K8823J9235J2226
5119E8815j0997j9299J8919j4853l6094j5651J512J4339l15K695J262J3513o870
5106F976J2361k317P401J886k4317j097k0403J009J4435J3373j0110k1624j4510
5093c6937J6649L2339n435j4012l7517k4177L5250j6973J9830J2940L1739O764
$$ plain form
5081 20460 -27984 -42449 -25817 519 29855 23348 -2878 10706 14405 10697 23082 40442
5069 40442 23946 8905 -11893 -10075 15000 -8616 -4091 7126 6906 91 11165 35163 41857
5056 41857 4221 22192 12896 -3687 -24707 -1019 21720 15852 7417 10184 -2188 -3311 -5542
5043 -5542 -38607 -40616 -34024 -28017 -31076 -43796 -42597 -39284 -7343 16603 6909 -18882 -15002 -25668
5029 -25668 -56993 -49948 -16311 -1897 25923 17302 -4496 -3496 16701 208 -7066 14541 25288
5016 25288 9979 5956 594 -2079 -25942 -64914 -69128 -65155 -43114 -24244 -14516 -13632 -35334
5003 -35334 -41969 -50280 -11289 20663 25800 19477 21083 6664 -32628 -23526 -12850 -3231 -11952
4990 -11952 -15683 -1301 -4925 3180 7033 26493 17858 5231 -10915 13863 13563 3680 -32334
$$ packed form
5081B0460m8444j4465J6632K6336K9336o507k6226J3584L699l708J2385J7360
5069D0442j6496j5041k0798J818K5075k3616M525J1217k20o815J1074K3998O694
5056D1857l7636J7971r296j6583k1020K3688K2739n868q435K767j2372j123k231
5043e542l3065k009O592O007l059j2720J199L313L1941K3946r694k5791L880j0666
5029b5668l1325P045L3637J4414K7820q621k1798J000K0197j6493p274K1607J0747
5016B5288j5309m023n362k673k3863l8972m214L973K2041J8870R728Q84k1702
5003c5334o635q311L8991L1952N137o323J606j4419l9292R102J0676R619q721
4990a1952l731J4382l624Q105L853J9460q635j2627j6146K4778l00r883l6014
$$ plain form
4977 -32334 -49958 -47571 -27052 -25448 -26229 -36625 -22684 -7466 -14589 6299 -11234 3469 42413
4964 42413 31841 -2734 -27587 -41614 -27187 2489 -20718 -15775 -1152 -968 -53552 -70284
4952 -70284 -73140 -66673 -72728 -39039 -15244 -6611 -23001 -2939 19889 17443 -13312 -22641 4107
4939 4107 -12220 -4646 21646 10403 -18285 -20928 -16125 -2913 14461 234 -37890 -27926 -9717
4926 -9717 1031 -9978 7575 9708 6051 -17140 -53216 -48974 -42640 -41723 -22608 22985 46452
4913 46452 14826 27786 40931 29907 13550 -16236 -46914 -36659 -13772 42865 46145 32553
4901 32553 17689 -3764 18816 31620 8534 1407 -16751 -17620 10628 31940 44950 23918
4889 23918 -386 6347 -2731 -23313 -53356 -77257 -56912 -33019 -23452 -17632 -11586 -13258 2958
$$ packed form
4977c2334j7624K387K0519J604p81j0396J3941J5218p123K0888j7533J4703L8944
4964D2413j0572l4575k4853j4027J4427K9676k3207M943J4623J84n2584j6732
4952g0284k856O467o055L3689K3795Q633j6390K0062K2828k446l0755r329K6748
4939D107j6327P574K6292j1243k8688k643M803J3212J7374j4227l8124R964J8209
4926i717J0748j1009J7553K133l657k3191l6076M242O334R17J9115M5593K3467
4913D6452l1626J2960J3145j1024j6357k9786l0678J0255K2887N6637L280j3592
4901C2553j4864k1453K2580J2804k3086p127j8158q69K8248K1312J3010k1032
4889B3918k4304O733r078k0582l0043k3901K0345K3893R567N820O046j672J6216
$$ plain form
4876 2958 -9856 -45539 -35480 -18642 -13912 -31747 -21455 -15187 -15005 -2690 6185 15517 11823
4863 11823 870 10208 1977 -340 2094 3319 15248 16360 12433 4393 4920 -1757 245 12194
4849 12194 14931 -644 -27417 -18383 -33044 -48876 -54520 -29772 7552 11959 -14035 -61013 -31427
4836 -31427 -4929 -8884 -36430 -29375 -14039 3900 2189 -19160 8203 15210 22103 34752 16610
4823 16610 -10313 -3875 859 1835 2512 6529 19459 40742 19562 11194 15539 3527 23434 28443
4809 28443 -20756 -46192 -61639 -59705 -57300 -63732 -60100 -45935 -19882 -3973 -562 -8657 -13316
4796 -13316 -35126 -29415 -51883 -80771 -65292 -44076 -49019 -31337 -20023 -17170 -21295 -24661 -32977
4783 -32977 -26701 -38012 -80194 -73758 -27209 -9011 -6290 1889 16741 18175 -5053 -6843 -7287
$$ packed form
4876B958j2814l5683J0059J6838M730j7835J0292O268J82J2315Q875R332l694
4863A1823j0953R338q231k317K434J225J1929J112l927q040N27o677K002J1949
4849A2194K737j5575k6773R034j4661j5832n644K4748L7324M407k5994m6978K9586
4836c1427K6498l955k7546P055J5336J7939j711k1349K7363P007O893J2649j8142
4823A6610k6923O438M734R76O77M017J2930K1283k1180q368M345j2012J9907N009
4809B8443m9199k5436j5447J934K405o432L632J4165K6053J5909L411q095m659
4796a3316k1810N711k2468k8888J5479K1216m943J7682J1314K853m125l366q316
4783c2977O276j1311m2182O436M6549J8198K721Q179J4852J434k3228j790m44
$$ plain form
4770 -7287 -21107 -24570 -29800 -34386 -2840 -17093 -42489 -9553 11244 -13485 -11865 -19516 -35250
4757 -35250 -21727 -19512 -35202 -38235 -58157 -68786 -52098 -55646 -66266 -49881 -3355 11562
4745 11562 8409 -29652 -47406 -61471 -58813 -38103 6673 6705 25154 21014 21964 -9490 -13441 -20967
4731 -20967 -25355 -21217 -25959 -38967 -42532 -17967 13168 -45843 -73850 -56945 -27597 -36552 -34937
4718 -34937 -17604 -7240 -7789 -17805 -97 11619 -7473 -53905 -58624 -51170 -8527 -18986 -33383
4705 -33383 -20226 17132 4348 -16320 -2253 17566 4907 -3092 -6137 -19277 4080 10895
4693 10895 36899 17256 18648 33100 9619 40484 47224 21127 -12890 -37031 -25001 -223
4681 -223 -13532 -26321 -37504 -21716 -7612 21123 31977 19349 -22494 -18585 -6991 -29606
$$ packed form
4770g287j3820l463n230m586L1546j4253k5396L2936K0797k4729J620p651j5734
4757c5250J3523K215j5690l033j9922j0629J6688l548j0620J6385M6526J4917
4745A1562l153l8061j7754j4065K658K0710M4776L2J8449m140R50l1454l951p526
4731b0967m388M138m742j3008l565K4565L1135n9011k8007J6905K9348q955J615
4718c4937J7333J0364n49j0016J7708J1716j9092m6432m719P454M2643j0459j4397
4705c3383J3157L7358j2784k0668J4067J9819j2659p999l045j3140K3357O815
4693A0895K6004j9643J392J4452k3481L0865O740k6097l4017k4141J2030K4778
4681b23j3309j2789j1183J5788J4104K8735J0854j2628m1843L909J1594k2615
$$ plain form
4669 -29606 -8591 -10437 -24835 -20488 -21168 8549 8429 -31808 -8956 13763 29685 20963 15615
4656 15615 1579 -7137 -11981 -14778 -12199 -2663 8232 6132 -1834 12006 21086 8779 -8104
4643 -8104 -14520 -10727 -1092 -1515 -15445 -5464 14051 -4971 361 -24817 -49138 -44406 -34670 -36141
4629 -36141 -21776 14299 26855 46657 48939 20475 24310 19029 15880 -21926 -11810 5546 24559
4616 24559 31030 22242 1971 5918 13214 25294 18472 -22714 -23567 6184 3641 -2739 16156 12038
4602 12038 20575 17438 1346 -15204 -46528 -58330 -51158 -66635 -34228 -18720 -2719 6760 -22789
4589 -22789 -21970 9587 18324 -1043 -979 -3779 -29648 -21584 -8801 7682 2443 -20771 -25699 -14258
4575 -14258 764 -7541 -38499 -46244 -24222 -11424 -7635 -25945 -43068 -29766 -3780 -13424 -34256
$$ packed form
4669b9606K1015j846j4398M347o80K9717j20m0237K2852K2719J5922q722n348
4656A5615j4036q716m844k797K579R536J0895k100p966J3840R080j2307j6883
4643h104o416L793R635m23j3930R981J9515j9022N332k5178k4321M732R736j471
4629c6141J4365L6075J2556J9802K282k8464L835n281l149l7806J0116J7356J9013
4616B4559O471q788k0271L947P296J2080o822m1186q53K9751k543o380J8895m118
4602A2038Q537l137j6092j6550l1324j1802P172j5477L2407J5508J6001R479k9549
4589b2789Q19L1557Q737j9367O4k800k5869Q064J2783J6483n239k3214m928J1441
4575a4258J5022q305l0958p745K2022J2798L789j8310j7123J3302K5986r644k0832
$$ plain form
4562 -34256 -14579 8750 12135 3462 -451 13839 -4339 -36151 -12883 -19241 -8024 11840 -12027
4549 -12027 -12338 -13460 -21511 -25657 -35467 -30034 -20246 -33525 -66011 -68843 -43043 -48982 -62305 -55063
4535 -55063 15202 22234 20290 11310 -23493 -26890 17043 -19826 -19118 -22740 -25396 -14207 -17897 -28777
4521 -28777 -21897 -28868 -47003 -42348 -25134 11158 47850 65506 69282 66795 42004 31200 -394
4508 -394 -48783 -37553 12134 14084 5941 8592 -3766 -13011 13193 31752 32104 42655 62976
4495 62976 58264 20414 6108 32776 15998 -2057 -2053 -7868 7729 26052 18816 26894 32411 46517
4481 46517 45711 19813 -889 -7660 -14366 -16156 13546 14560 847 17031 -1247 -5419 -14607
4468 -14607 -6437 1081 -18332 -24983 -37306 -35477 -14420 -9258 9457 45556 57401 37713 -1633
$$ packed form
4562c4256J9677K3329L385q673l913J4290j8178l1812K3268o358J1217J9864k3867
4549a2027l11j122q051m146r810N433R788j3279l2486k832K5800n939j3323P242
4535e5063P0265P032j944q980l4803l397M3933l6869P08l622k656J1189l690j0880
4521b8777O880o971j8135M655J7214L6292L6692J7656L776k487k4791j0804l1594
4508c94m8389J1230M9687J950q143K651j2358r245K6204J8559L52J0551K0321
4495F2976m712l7850j4306K6668j6778j8055Mn815J5597J8323p236Q078N517J4106
4481D6517q06k5898k0702o771o706j790K9702J014j3713J6184j8278m172r188
4468a4607Q170P518j9413o651j2323J829K1057N162J8715L6099J1845j9688l9346
$$ plain form
4455 -1633 -31300 2967 13525 19719 21570 48305 37248 10596 8035 27031 17994 13263 24198
$$ packed form
4455a633k9667L4267J0558O194J851K6735j1057k6652k561J8996r037m731J0935
$$ [...]
##END NTUPLES=NMR SPECTRUM
##END=
