##TITLE=Analysis number 321249
Compound Code cc 58502
Book Reference 196/180
Project Code adrs
Chemist Name jimp
##JCAMPDX= 6.0         $$ Bruker NMR JCAMP-DX V2.0
##DATA TYPE= NMR SPECTRUM
##DATA CLASS= NTUPLES
##ORIGIN= Bruker BioSpin GmbH
##OWNER= nmr
$$ XWIN-NMR		Version 3.5
$$ Tue Aug  1 10:24:30 2006 GMT Daylight Time (UT+1h)  MAYBRIDGE\nmr@NMR_250MHZ
##.OBSERVE FREQUENCY= 250.131544655141
##.OBSERVE NUCLEUS= ^1H
##.ACQUISITION MODE= SIMULTANEOUS (DQD)
##.ACQUISITION SCHEME= undefined
##.AVERAGES= 16
##.DIGITISER RES= 18
##SPECTROMETER/DATA SYSTEM= dpx250
##.PULSE SEQUENCE= zg30
##.SOLVENT NAME= CDCl3
##.SHIFT REFERENCE= (INTERNAL, CDCl3, 0, 16.4444)
##AUDIT TRAIL= $$ (NUMBER, WHEN, WHO, WHERE, WHAT)
$$ ##TITLE= Audit trail, XWIN-NMR		Version 3.5
$$ ##JCAMPDX= 5.01
$$ ##ORIGIN= Bruker BioSpin GmbH
$$ ##OWNER= nmr
$$ C:\u/data/dgb/nmr/ADRS/3910/pdata/1/auditp.txt
$$ ##AUDIT TRAIL=  $$ (NUMBER, WHEN, WHO, WHERE, WHAT)
(   1,<2006-08-01 10:24:08.43 +100>,<MAYBRIDGE\nmr>,<NMR_250MHZ>,
      <created by zg, POWCHK disabled, PULCHK disabled
       configuration hash MD5:
       E2 DF 36 D8 04 B2 41 60 5A D7 A3 38 5A 4B D0 FE
       data hash MD5: 64K
       E9 A0 A3 0E E8 C1 EE AF 88 A0 61 DB 79 D5 5E A0>)
(   2,<2006-08-01 10:24:20.89 +100>,<MAYBRIDGE\nmr>,<NMR_250MHZ>,
      <Start of raw data processing
       ef LB = 0.3 FT_mod = 6 PKNL = 1 SI = 32K 
       data hash MD5: 32K
       FE BA 4E 45 E6 32 EE 43 65 55 B7 D3 C0 D4 8B DA>)
(   3,<2006-08-01 10:24:22.51 +100>,<MAYBRIDGE\nmr>,<NMR_250MHZ>,
      <apk 
       data hash MD5: 32K
       EA D2 94 9B 1B 32 D5 59 65 FD 96 64 BA 3E 09 01>)
(   4,<2006-08-01 10:24:23.23 +100>,<MAYBRIDGE\nmr>,<NMR_250MHZ>,
      <abs ABSG = 5 
       data hash MD5: 32K
       5F 7D 6F F4 E8 70 9B 20 41 DB A4 01 BD 45 A0 52>)
$$ ##END=
$$ 
$$ hash MD5
$$ CD D1 CD 44 F7 09 BA 46 F9 D4 85 D6 61 2D E9 2D
##$RELAX= 
##$RELAX= 
##$RELAX= 
##$RELAX= 
##$RELAX= 
##$RELAX= 
##$RELAX= 
$$ Bruker specific parameters
$$ --------------------------
##$DU= <C:\u>
##$EXPNO= 3910
##$NAME= <ADRS>
##$PROCNO= 1
##$TYPE= <nmr>
##$USER= <dgb>
##$AMP= (0..31)
100 100 100 100 100 100 100 100 100 100 100 100 100 100 100 100 100 100 
100 100 100 100 100 100 100 100 100 100 100 100 100 100 
##$AQSEQ= 0
##$AQ_mod= 3
##$AUNM= <au_zg>
##$AUTOPOS= <26 >
##$BF1= 250.13
##$BF2= 250.13
##$BF3= 250.13
##$BF4= 250.13
##$BF5= 500.13
##$BF6= 500.13
##$BF7= 500.13
##$BF8= 500.13
##$BYTORDA= 1
##$CFDGTYP= 0
##$CFRGTYP= 5
##$CHEMSTR= <none>
##$CNST= (0..31)
1 1 145 1 1 1 1 1 1 1 1 1 1 1 1 1 1 1 1 1 1 1 1 1 1 1 1 1 1 1 1 1 
##$CPDPRG= <>
##$CPDPRG1= <>
##$CPDPRG2= <>
##$CPDPRG3= <>
##$CPDPRG4= <mlev>
##$CPDPRG5= <mlev>
##$CPDPRG6= <mlev>
##$CPDPRG7= <mlev>
##$CPDPRG8= <mlev>
##$CPDPRGB= <>
##$CPDPRGT= <>
##$D= (0..31)
0 1 0 0 0 0 0 0 0 0.06 0 0 0 0 0 0 0.0002 0 0 0 0 0 0 0 0 0 0 0 0 0 0 
0 
##$DATE= 1154424247
##$DBL= (0..7)
120 120 120 120 120 120 120 120 
##$DBP= (0..7)
150 150 150 150 150 150 150 150 
##$DBP07= 0
##$DBPNAM0= <>
##$DBPNAM1= <>
$$ [...]
##$SUBNAM7= <"">
##$SUBNAM8= <"">
##$SUBNAM9= <"">
##$SW= 20.6930455092707
##$SWIBOX= (0..15)
0 0 3 0 0 0 0 0 0 0 0 0 0 0 0 0 
##$SW_h= 5175.983436853
##$TD= 65536
##$TD0= 1
##$TE= 295.16
##$TE2= 300
##$TE3= 300
##$TEG= 300
##$TL= (0..7)
0 120 120 120 120 120 120 120 
##$TP= (0..7)
150 150 150 150 150 150 150 150 
##$TP07= 0
##$TPNAME0= <>
##$TPNAME1= <>
##$TPNAME2= <>
##$TPNAME3= <>
##$TPNAME4= <>
##$TPNAME5= <>
##$TPNAME6= <>
##$TPNAME7= <>
##$TPOAL= (0..7)
0.5 0.5 0.5 0.5 0.5 0.5 0.5 0.5 
##$TPOFFS= (0..7)
0 0 0 0 0 0 0 0 
##$TUNHIN= 0
##$TUNHOUT= 0
##$TUNXOUT= 0
##$USERA1= <user>
##$USERA2= <user>
##$USERA3= <user>
##$USERA4= <user>
##$USERA5= <user>
##$V9= 5
##$VALIST= <valist>
##$VCLIST= <CCCCCCCCCCCCCCC>
##$VD= 0
##$VDLIST= <DDDDDDDDDDDDDDD>
##$VPLIST= <PPPPPPPPPPPPPPP>
##$VTLIST= <TTTTTTTTTTTTTTT>
##$WBST= 1024
##$WBSW= 4
##$XGAIN= (0..3)
0 0 0 0 
##$XL= 0
##$YL= 0
##$YMAX_a= 246605
##$YMIN_a= -494003
##$ZGOPTNS= <>
##$ZL1= 120
##$ZL2= 120
##$ZL3= 120
##$ZL4= 120
##$ABSF1= 16.44439
##$ABSF2= -4.248783
##$ABSG= 5
##$ABSL= 3
##$ALPHA= 0
##$AQORDER= 0
##$ASSFAC= 0
##$ASSFACI= 0
##$ASSFACX= 0
##$ASSWID= 0
##$AUNMP= <proc_1d>
##$AZFE= 0.1
##$AZFW= 0.1
##$BCFW= 0
##$BC_mod= 0
##$BYTORDP= 0
##$COROFFS= 0
##$CY= 12.5
##$DATMOD= 1
##$DC= 0
##$DFILT= <>
##$DTYPP= 0
##$F1P= 14.0000005364418
##$F2P= -0.99999901652339
##$FCOR= 0.5
##$FTSIZE= 32768
##$FT_mod= 6
##$GAMMA= 0
##$GB= 0
##$INTBC= 1
##$INTSCL= 1
##$ISEN= 128
##$LB= 0.3
##$LEV0= 0
##$LPBIN= 0
##$MAXI= 10000
##$MC2= 0
##$MEAN= 0
##$ME_mod= 0
##$MI= 0
##$NCOEF= 0
##$NC_proc= -5
##$NLEV= 6
##$NOISF1= 0
##$NOISF2= 0
##$NSP= 0
##$NTH_PI= 0
##$NZP= 0
##$OFFSET= 16.44439
##$PC= 1
##$PHC0= 148.4828
##$PHC1= 3.723484
##$PH_mod= 1
##$PKNL= yes
##$PPARMOD= 0
##$PSCAL= 4
##$PSIGN= 0
##$REVERSE= no
##$SF= 250.13001941104
##$SI= 32768
##$SIGF1= 0
##$SIGF2= 0
##$SINO= 400
##$SIOLD= 32768
##$SREGLST= <1H.CDCl3>
##$SSB= 0
##$STSI= 32768
##$STSR= 0
##$SW_p= 5175.98343685301
##$SYMM= 0
##$S_DEV= 0
##$TDeff= 65536
##$TDoff= 0
##$TI= <Analysis number 999999
Compound Code 99
Book Reference 9
Project Code 9>
##$TILT= no
##$TM1= 0
##$TM2= 0
##$TOPLEV= 0
##$USERP1= <user>
##$USERP2= <user>
##$USERP3= <user>
##$USERP4= <user>
##$USERP5= <user>
##$WDW= 1
##$XDIM= 32768
##$YMAX_p= 472219782
##$YMIN_p= -590148
$$ End of Bruker specific parameters
$$ ---------------------------------
##NTUPLES= NMR SPECTRUM
##VAR_NAME=  FREQUENCY,     SPECTRUM/REAL,   SPECTRUM/IMAG
##SYMBOL=    X,             R,               I
##VAR_TYPE=  INDEPENDENT,   DEPENDENT,       DEPENDENT
##VAR_FORM=  AFFN,          ASDF,            ASDF
##VAR_DIM=   32768,         32768,           32768
##UNITS=     HZ,            ARBITRARY UNITS, ARBITRARY UNITS
##FACTOR=    0.157963299565203, 1,           1
##FIRST=     4113.23542563275, 0,            0
##LAST=      -1062.74801122026, 0,           0
##MIN=       -1062.74801122026, -590148,     0
##MAX=       4113.23542563275, 472219782,    0
$$ Real data points
##PAGE= N=1
##DATA TABLE= (X++(R..R)), XYDATA
$$ [...]
20032H6032n09Q7008K09301l9080j00857p0067j12161q9288J19416J60420R6200
20021C46415q41j92391L1356o2237j09388j29914m9145j58185j0668K97138L9845
20010A985n266N9292r2221n9423l5341j5157J01348J65728J23838P3923J16063
19999D34769j55205o5867J47032o4338k2392r0814n9286M6606m7087r9725j05577
19988h1884J60402N1101m7243o7883O7654L4069R5417K4417l6188m9773n3163
19977I6926p6585N4782N5341J21931J1258j24680Q9382L8456K1961M4979q0346
19966B53405k2623j31157J4491R2598k2754j88014M6945j8972p0134Q4402J26683
19955A64870J28074O7338j76809k25782P4560J41418j2682r9859q4057j06328
$$ plain form
20032 86032 85523 172531 381832 342752 241895 171828 59667 -29621 89795 250215 346415
20021 346415 345574 153183 184539 122302 12914 -117000 -166145 -324330 -334998 -37860 1985
20010 1985 -3281 56011 -36210 -95633 -130974 -146131 -44783 120945 244783 318706 434769
19999 434769 279564 213697 360729 296391 273999 183185 123899 170505 123418 23693 -81884
19988 -81884 78518 129619 82376 14493 82147 116216 211633 236050 199862 150089 96926
19977 96926 20341 75123 130464 252395 263653 138973 228355 266811 288772 333751 253405
19966 253405 230782 99625 114116 206714 183960 -4054 42891 23919 -46215 38187 164870
19955 164870 292944 360282 183473 -42309 32251 173669 160987 61128 -22929 -129257
19945a29257J6623J30845J15131P4604j7876j84924r1392K11361J18615J3910
19935B57640K1298p8163O0767j40130j7774R4833M4699K0855N8489K3763j81073
19924A65204J60283k0935l06228J68639J88961j15186o7507K06861N53p8236N5055
19913C57464j00965J27132n5527m1463J44151O4003k26810j10910k0644N5609
19903A92040J12818Q8030J13492J48639l3304Q2680j43420j12284O0124l945l7260
19892D67610m458J68575J24900j72477Q0939L3035n3740P2966P129j9054N2517
19881G57942L8587Q0465j30637M9798J93828J60719K5050N8125J47241Q3432K4014
19870A488564O7462R5809L06539L90752J04676J95833L35450K62658J82687L12237
$$ plain form
19945 -129257 -112634 18211 133342 207946 190070 5146 -86246 125115 243730 257640
19935 257640 278938 200775 261542 121412 103638 198471 243170 264025 322514 346277 165204
19924 165204 325487 304552 -1676 166963 355924 240738 173231 380092 380645 302409 357464
19913 357464 256499 383631 328104 286641 430792 494795 267985 157075 136431 192040
19903 192040 304858 392888 506380 655019 621715 704395 560975 448691 508815 504870 467610
19892 467610 463152 631727 756627 584150 665089 698124 644384 717350 724479 705425 757942
19881 757942 796529 876994 746357 796155 989983 1150702 1175752 1233877 1381118 1464550 1488564
19870 1488564 1556026 1651835 1958374 2349126 2453802 2649635 2985085 3247743 3430430 3742667
19860C742667K41793j625J45396K80097L11434O57473P34316J062959J316685
19851H491195J902700L103213M848718P377005J1097092J4434566J5913531J4271710
19843H1439730Q991420L035276j946855n677295n841478j121297N243662Q837688
19835I2960851P605256K355375l625419r191526j3855918j5399754j3238717r557401
19827C8052747o172761m066146k725088k032259j374334j204989j121401p01404
19819A8654365m71318m77539m13199l57136l75378k89980k14154k59492k48962
19810A5547207j42626k60861j86054k44329k47953O1277J62074O72848R22715
19801A6284298J569441K446867L938846O246287R756705J3595592J6637504J6971825
$$ plain form
19860 3742667 3984460 3982835 4128231 4408328 4719762 5377235 6111551 7174510 8491195
19851 8491195 10393895 13497108 18345826 25722831 36819923 51254489 67168020 81439730
19843 81439730 90431150 93466426 91519571 85842276 80000798 78879501 84123163 92960851
19835 92960851 100566107 102921482 99296063 90104537 76248619 60848865 47610148 38052747
19827 38052747 31879986 27813840 25088752 23056493 21682159 20477170 19355769 18654365
19819 18654365 18183047 17705508 17292309 16935173 16559795 16269815 16055661 15796169 15547207
19810 15547207 15404581 15143720 14957666 14713337 14465384 14526661 14688735 15361583 16284298
19801 16284298 17853739 20300606 24239452 30485739 40242444 53838036 70475540 87447365
19793H7447365J3180808O583157N75n176199p676073m650464J984565P842601
19785I9536335R355195N802411j051141p671969j3207274j6677430j6033885j2356512
19777D7695730q166788n288999l722950k711514j932983j526308j390345j260598
19769B1695245j033892q41038q44966q07260n94900m09883n92612q12178p04815
19760A5053701o25999m54998n05648p18511o33283l96483m05690m98911l12880
19751A0501298l08176k71203l09617j25097k69430k76978l88462l17143k14687
19742H020505k09894n4504k97661l19871r522j07214j53099n09849m78563j27760
19732E752568l4113q0295p5981j94169k29397j54435j6077k26523k00783p7679
$$ plain form
19793 87447365 100628173 107211330 107211905 102035706 94359633 89709169 91693734 99536335
19785 99536335 108891530 114693941 113642800 105970831 92763557 76086127 60052242 47695730
19777 47695730 39528942 34239943 30516993 27805479 25872496 24346188 22955843 21695245
19769 21695245 20661353 19820315 18975349 18168089 17573189 17163306 16570694 15758516 15053701
19760 15053701 14427702 13972704 13467056 12748545 12115262 11718779 11313089 10814178 10501298
19751 10501298 10193122 9921919 9612302 9487205 9217775 8940797 8552335 8235192 8020505
19742 8020505 7810611 7756107 7458446 7138575 7129053 7021839 6868740 6358891 5880328 5752568
19732 5752568 5718455 5638160 5562179 5368010 5138613 4984178 4968101 4741578 4540795 4463116
19722D463116k39156q6187j62998k35999j9282p2963n1930j33267j53682p2495
19712C235157O5176j4688o9349o3726j06993j01853j47565k3799k24603j146O2308
19701B608919j01966j5798J8590j17062M1222Q3936j51488r6162J6350l7206N6129
19690B305464j98997j34664k15606j66225J51445Q0472p3653p5339J85089q994
19680A848992j85363J3681L781m9870P8129j43111j06666m3151j09778N7969N6227
19669A420840J56582O139k18978l04325j24245J07104l9120r3822l5861J10454
19659I84768r9899J8568j32060j68241K512J80404J79041M3483N5354j24145k61542
19648F78243p3413r1940n3476j0716r801P3495K09387L476N0183q289n9653m5516
$$ plain form
19722 4463116 4223960 4137773 3974775 3738776 3719494 3646531 3594601 3461334 3307652 3235157
19712 3235157 3300333 3285645 3216296 3152570 3045577 2943724 2796159 2772360 2547757 2546611 2608919
19701 2608919 2506953 2491155 2509745 2392683 2433905 2517841 2366353 2270191 2286541 2249335 2305464
19690 2305464 2106467 1971803 1756197 1589972 1741417 1821889 1748236 1672897 1857986 1848992
19680 1848992 1663629 1677310 1681091 1631221 1709350 1566239 1459573 1416422 1306644 1364613 1420840
19669 1420840 1577422 1583561 1364583 1060258 936013 1043117 1003997 910175 874314 984768
19659 984768 884869 903437 771377 603136 605648 786052 965093 1008576 1063930 939785 678243
19648 678243 604830 512890 459414 448698 438897 512392 721779 725255 775438 767149 707496 661980
19636F61980P672M5377k0068j95652j36462N7064O1324J32112o1151l7868J30752
19625F45080l4117j36005j92756Q2393q106P604K7033l6553k6891J82977J02439
19614F13098o3988j14190j1973J53356Q8283m1127n6129K54051J64086k31922
19604G53545J1424P1419o2053Q6815N3716L2298Q1917J50643j33875r3823n8155
19593H93871J46899J47473L33978J90818R60l4412l2092q7353n342P5960j4763
19582A615997K5699J59656K2626k38274k35709l8739k56245k01299j30884Q1229
19572H04057l3240J09211j10495j10391j2345P088n409k0324R8625J52067R1964
19561I70808j0158J4926j5864q6947j0947q6138O4573k8313O7098r624M4223r3722
$$ plain form
19636 661980 669652 715029 694961 499309 362847 419911 481235 613347 552196 514328 645080
19625 645080 610963 474958 282202 364595 356489 364093 391126 354573 327682 510659 613098
19614 613098 549110 434920 422947 576303 664586 623459 567330 821381 985467 753545
19604 753545 764969 836388 774335 861150 914866 947164 1029081 1179724 1045849 952026 893871
19593 893871 1040770 1188243 1522221 1713039 1713999 1679587 1647495 1560142 1554800 1630760 1615997
19582 1615997 1641696 1801352 1823978 1585704 1349995 1311256 1055011 853712 722828 804057
19572 804057 770817 880028 769533 659142 646797 653885 648476 628152 726777 878844 970808
19561 970808 960650 975576 959712 872765 861818 775680 840253 811940 879038 869414 913637 819915
19549H19915l1103J53268n1522J33621J28834M7763K10103L82774R0813P6514
19539A960980j08625j61166J4134N3580q6363j23019p404J7853M7011p0000n5695
19528A481286M4738m5019j56307k08711k07531n1819q3963r4495K199M477j27908
19517E56947K0910N1702J3982k47257j17350p0494k3772J14026n5019N1541P7370
19506C72586J93898N4937K6494K8766J47023k9799n669k27591j35397o6318p6396
19495B82534J19368J7198Q6786Q6194m2059j21598k5923j58231Q3646J56016p8662
19484D05269J5795J36181J20376j19346k0256J8436j85224j73831m3444j3749
19474A40207n5083K1193j16441N2998J42617J82347j2857P9980o4460k35027k37005
$$ plain form
19549 819915 788812 942080 890558 1024179 1153013 1200776 1410879 1793653 1884466 1960980
19539 1960980 1852355 1691189 1705323 1758903 1672540 1549521 1542117 1559970 1606981 1536981 1481286
19528 1481286 1526024 1481005 1324698 1115987 908456 856637 772674 678179 680378 684855 556947
19517 556947 577857 629559 643541 396284 278934 208440 184668 298694 243675 295216 372586
19506 372586 566484 621421 647915 676681 823704 793905 788236 560645 425248 358930 282534
19495 282534 401902 419100 505886 592080 550021 428423 402500 244269 327915 483931 405269
19484 405269 421064 557245 677621 558275 538019 556455 371231 197400 153956 140207
19474 140207 85124 106317 -10124 42874 185491 367838 354981 434961 370501 135474 -101531
19463a01531l2059O3103O4613P1473j81788L5587J69286J5848j19462J54872O6161
19452B06103J30308J847J05312k7284j73160j9336n7992M3551J29220o0543J25368
19441D03394l53p2157r2140P5243P2322q4689Q2072K9283K78304J08954j26635
19430F73598m1732k63579j68414R2928P0734M8777R6264R7077r1197j34126j04253
19419B76077j63929j70262m7361J56576J6164l9117o7996K76j0741J49795p3852
19408B5630r7788J48201N31k41857j41258J41298J67620N2106j2041j0946J59274
19397A90770P9551o3910j06520m9061j8784q2173Q076K20337K0774p1027Q7945
19386B15978o5765J9913Q7795J22004J21101n6179N9802J8909l0443p6892o3290
$$ plain form
19463 -101531 -133590 -70487 -5874 65599 -116189 -80602 88684 104532 -14930 139942 206103
19452 206103 336411 338258 443570 416286 243126 223790 165798 209349 338569 278026 403394
19441 403394 403041 330884 238744 313987 386309 301620 383692 412975 691279 800233 673598
19430 673598 631866 368287 199873 292801 363535 412312 508576 605653 514456 380330 276077
19419 276077 112148 -58114 -105475 51101 67265 28148 -39848 -39572 -50313 99482 25630
19408 25630 -72158 76043 76574 -165283 -306541 -165243 2377 54483 42442 31496 190770
19397 190770 270321 206411 99891 50830 32046 -50127 -42051 178286 199060 128033 215978
19386 215978 150213 170126 257921 379925 501026 444847 504649 523558 493115 416223 352933
19375C52933j60449o7639k6544J07194l8387k9623R7009J08270j11163j5114N5785
19364B72272O9388m0819K8170K73106p0857j97077j96739J2215j98150P5761J37364
19353A64634k4054o1548J63623L2013J0678o7692L413j02289j03793J10780P8508
19342B04273M9384J407J08792J02663r2112j0975J04791o6580q0366K5961K2620
19331C69858O3978r6529o6249n7497J94415J82779J34009p2096p7055J31987J72843
19320H80443L7668k55639q5875r126J14679J64520l0930k14209n4537O1657j03663
19309E04988l1349o1506J36701J95663r2347p9050O1458M1616R75m0184J02562
19298G39527j28519j60685q157K02677R3155r2839r6084j02335O2722J82353Q466
$$ plain form
19375 352933 192484 124845 98301 205495 167108 137485 234494 342764 231601 216487 272272
19364 272272 341660 300841 329011 602117 531260 334183 137444 149659 -48491 27270 164634
19353 164634 140580 79032 242655 274668 285346 217654 221067 118778 14985 125765 204273
19342 204273 253657 255064 363856 466519 374407 363432 468223 401643 321277 347238 369858
19331 369858 433836 337307 271058 213561 407976 590755 724764 652668 575613 707600 880443
19320 880443 918111 662472 576597 567471 682150 846670 815740 601531 546994 608651 504988
19309 504988 473639 412133 548834 744497 652150 573100 634558 676174 677149 636965 739527
19298 739527 611008 450323 442166 644843 737998 645159 549075 446740 509462 691815 700281
19287G00281j43000n2526j28989j5761Q5349J6309j11955K9964N2237J2720M4337
19276D88966n2245K27315J52500K2769P8487r5443j27783k4670k5780k7017J55144
19265G72243J07424k6293N5458K099j52518j7744O043j05958j4083k1954j04499
19254E00218o5573K0487R7661o5034p5013l5631J05495J91321j42417l006k8475
19243E00033J14356K34101o936k62075k81075r8103J47369j0646j19007K3299
19233B41316m1247j51464P113o7617J71614P9374Q4018q669o6464l6182J7532
19222B29324R5114R0303L2008l7606j01418j2862j28225k6073J20210R5806Q2811
19211D39392j8456j71503J95582L7665r2457j4858m7061j14344J90546M3775k14405
$$ plain form
19287 700281 557281 504755 375766 360005 445354 461663 349708 379672 431909 444629 488966
19276 488966 436721 664036 816536 839305 917792 822349 694566 669896 644116 617099 772243
19265 772243 879667 853374 908832 910931 758413 740669 746712 640754 626671 604717 500218
19254 500218 434645 455132 552793 487759 412746 377115 482610 673931 531514 528508 500033
19243 500033 614389 848490 841554 579479 298404 200301 347670 337024 218017 241316
19233 241316 200069 48605 55718 -11899 159715 239089 323107 314438 247974 211792 229324
19222 229324 324438 414741 446749 409143 307725 294863 166638 140565 260775 356581 439392
19211 439392 420936 249433 445015 482680 390223 375365 328304 213960 404506 448281 233876
19200B33876J06590n5629J24612O2304J0766J27535j78589l4747N3933o252R158
19189D53557J61821J94986j44174P5065Q59k50721j25876J47911K46987J02311
19179H62726J9523P4133J18477J12728l4804M4378J21149j67084n6749O8867J46525
19168A309869r221l9301k66747p9752k7858J9850Q937P3825k08896k20416j09794
19157D50496J88778l3746n4286J03446l1410j27980O2064K03275J32527j73921
19147G19243j27965M4329k7327K2819l8292p2840j4645K77888N920K85910K34072
19136A309112Q7179M6039J2060J17773J73535R7758l6413m6979J15918J06053
19126A982035Q747K7429P7910J42514J34294m2341l6120P2755J5432J00249O1831
$$ plain form
19200 233876 340466 284837 409449 471753 482519 610054 431465 396718 450651 444399 453557
19189 453557 615378 810364 666190 741255 742114 491393 365517 513428 760415 862726
19179 862726 882249 956382 1074859 1187587 1152783 1197161 1318310 1151226 1094477 1163344 1309869
19168 1309869 1300648 1261347 994600 914848 886990 906840 915777 989602 780706 560290 450496
19157 450496 639274 605528 551242 654688 623278 495298 557362 760637 893164 719243
19147 719243 591278 635607 608280 631099 592807 519967 505322 783210 789130 1075040 1309112
19136 1309112 1396291 1442330 1454390 1572163 1745698 1843456 1807043 1760064 1875982 1982035
19126 1982035 1990782 2018211 2096121 2238635 2372929 2330588 2294468 2367223 2382655 2482904 2544735
19115B544735j7315P8135l4163J16907K53787J50060J60857P1517N4662K55359
19105C634541L96959M73059O64916N97136J061458J421092K211478L022584L865003
19096A7348226M719275M549385L861470M246637N131473N896902O716216O823952
19088E9293536N156085L967742K343107k39766k43047J410485J805823J579300
19080G5073265l58517l832869n023390n414864o003461n180924l929124l516663
19072D1813453l784890m001337m634722m077264k894140j868641j169276r83887
19064A8399296r62650q30173m87979l36902l52530j36915q4912K5217m1407j793
19054A5189252L20503M82403P36984J373550K446135L731179M945254N976748
$$ plain form
19115 2544735 2527420 2605555 2571392 2688299 2942086 3092146 3253003 3324520 3379182 3634541
19105 3634541 4031500 4504559 5169475 5766611 6828069 8249161 10460639 13483223 17348226
19096 17348226 22067501 26616886 30478356 34724993 39856466 45753368 52469584 59293536
19088 59293536 64449621 68417363 70760470 70520704 70277657 71688142 73493965 75073265
19080 75073265 74714748 70881879 65858489 60443625 54440164 49259240 45330116 41813453
19072 41813453 38028563 34027226 29392504 25315240 22421100 20552459 19383183 18399296
19064 18399296 17436646 16606473 16118494 15781592 15429062 15292147 15207235 15232452 15191045 15189252
19054 15189252 15509755 15992158 16729142 18102692 20548827 24280006 29225260 35202008
19046C5202008O008048N570249N537731O586779P952446Q965591R792254Q343959
19038I3959065O240460M746792J175834j198177M84146J837622J943380P73642
19030A09962764l495712o718404p367226q359089q320754o401112n635842n635500
19022E8029125n667129o407738o550038n248268l614615k654960k036140j669900
19014B4180337j254072j118506j031004r64082q43634q02881n99737m89161n09794
19005A6567466m44827n87526p27309o49679l68228l78468n60785n87433l55210
18996A1908001m24830m91876l29095j43195l61541l64369j71978j95996l53922
18987I071199j15817j89765k47103l38578l58687k54663k45148l33290p1708j78745
$$ plain form
19046 35202008 41210056 46780305 52318036 58904815 66857261 75822852 85615106 93959065
19038 93959065 100199525 104946317 106122151 104923974 105408120 107245742 109189122 109962764
19030 109962764 106467052 99748648 92381422 84022333 75701579 69300467 63664625 58029125
19022 58029125 52361996 45954258 39404220 34155952 30541337 27886377 25850237 24180337
19014 24180337 22926265 21807759 20776755 19812673 18969039 18166158 17566421 17077260 16567466
19005 16567466 16122639 15535113 14807804 14158125 13789897 13411429 12850644 12263211 11908001
18996 11908001 11483171 10991295 10662200 10519005 10157464 9793095 9621117 9425121 9071199
18987 9071199 8955382 8765617 8518514 8179936 7821249 7566586 7321438 6988148 6916440 6737695
18977F737695k98838k16127j78782q3922j31212k82786j17320j98462l19225j75838
18967D735183l6025K57175J37372Q7925k44587l47065j15290N2577k5819j76410
18957D325036k75358j12354L8599p5357j52312K2021L4952j01861N8988J02703
18947C865057j61656n5085j29609k13676N2004m5932k1280m7384l0814j56327
18937C055298q0481k35961j01794K5185K4641k02333l4016l4012j62266k93785
18927A960476j54582l9425q8680n1383J7570q1250n0379O2430J33976m4889k6370
18916A637494J20454j6446p7081n7367L0843k9497j26218J43566K0991k25978
18906A420761q8213l1356N0946R3164m1235Q027L5701P3988K6540m4543j65920
$$ plain form
18977 6737695 6438857 6222730 6043948 5960026 5828814 5546028 5428708 5230246 4911021 4735183
18967 4735183 4699158 4956333 5093705 5181630 4937043 4589978 4474688 4527265 4501446 4325036
18957 4325036 4049678 3937324 3975923 3900566 3748254 3770275 3805227 3703366 3762354 3865057
18947 3865057 3703401 3648316 3518707 3305031 3357035 3311103 3289823 3242439 3211625 3055298
18937 3055298 2974817 2738856 2637062 2662247 2686888 2484555 2450539 2416527 2254261 1960476
18927 1960476 1805894 1766469 1677789 1626406 1643976 1562726 1512347 1574777 1708753 1663864 1637494
18916 1637494 1757948 1741502 1664421 1607054 1637897 1608400 1482182 1625748 1646739 1420761
18906 1420761 1332548 1301192 1352138 1445302 1404067 1412094 1447795 1521783 1548323 1503780 1337860
18895A337860j0719j73243R965j8465o9669L8448J03977j07958J15846J27452
18885A353494J51327o1292K7217o4124o7862k7264O5126R6256K5016J37119j34323
18874A500690k9793J41319N4473N7875l958J55660J05971L440O1762O2837P4150
18863B184426K80329P1041p8527Q7636R7727J55980K85201L71663J69578K41782
18853C866836M28145L51778L67620L89774N81538P73651J465545K376215L555514
18844A4156616N233618O855174P881396P886282O363682L794870j18769l045052
18836D9007817k928893j288312J206011L377412M176514K890666K18509m194668
18828E2465056p007783p365874p335646n983932m219891k938721j752726j082779
$$ plain form
18895 1337860 1327141 1153898 1163863 1145398 1075729 1114177 1218154 1110196 1226042 1353494
18885 1353494 1504821 1443529 1470746 1406622 1338760 1311496 1376622 1472878 1497894 1635013 1500690
18874 1500690 1470897 1612216 1666689 1724564 1720606 1876266 1982237 1985677 2047439 2110276 2184426
18863 2184426 2464755 2535796 2457269 2544905 2642632 2798612 3083813 3455476 3625054 3866836
18853 3866836 4294981 4646759 5014379 5404153 5985691 6759342 8224887 10601102 14156616
18844 14156616 19390234 26245408 34126804 42013086 48376768 52171638 52052869 49007817
18836 49007817 46078924 44790612 45996623 49374035 53550549 56441215 56659724 52465056
18828 52465056 45457273 38091399 30755753 24771821 20551930 17613209 15860483 14777704
18820A4777704p62481o90771l94724m02791m42925k03012l2102j58910j62538
18811A1527450j1588K29101K30339J92814K97898K47010J40826M18024N27427
18802A3799301Q81429J667412K343204L483400N286335P813746J0782423J3158737
18794E9215987J3915231J2664230R619029L872490j126950k847072l400251j391090
18786I0521604K147703M514028M667183K392025k945673p327800j0200709j2808335
18778G0960026j2237137j0203163q041636n825440l872459k820446k186731j736302
18770B4036712j240246p17168o81114o38691p90495o85785l92933m61780o49992
18761A7778508n09942m08547k34264k10990l02054k03612k12298q7535j26296
$$ plain form
18820 14777704 14015223 13324452 12929728 12526937 12084012 11881000 11848898 11689988 11527450
18811 11527450 11515862 11744963 11975302 12168116 12466014 12713024 12853850 13271874 13799301
18802 13799301 14680730 16348142 18691346 22174746 27461081 35274827 46057250 59215987
18794 59215987 73131218 85795448 95414477 99286967 98160017 95312945 91912694 90521604
18786 90521604 92669307 97183335 101850518 104242543 101296870 93969070 83768361 70960026
18778 70960026 58722889 48519726 40478090 34652650 30780191 27959745 25773014 24036712
18770 24036712 22796466 22079298 21398184 20759493 19968998 19283213 18890280 18428500 17778508
18761 17778508 17268566 16860019 16625755 16414765 16112711 15909099 15696801 15609266 15482970
18752A5482970L25639R61211J715485K685418L944909N620217P374144P845353
18744D5955346O584571M513568J168526k928060l905548k458565m97254J815491
18736E0248075L327018L101794J201703k313187n794312o796507o991149o498867
18728B9484568m857197l261584k153843j584343j414984j017799q23018n73008
18720A3798792n99042o37955n21199m15882m59993o18233k74365k19072j40934
18711I912117k53871k36597k91720l14968k17596j80609k76311l12599m08092
18702G419754j5703J1433j23194j39632j73058l02490k75372k68483p4476l7291
18692F021488j74940j27239j77932j33542q2455j27416j60922k43110N3790J9451
$$ plain form
18752 15482970 15808609 16769820 18485305 21170723 25115632 30735849 38109993 45955346
18744 45955346 52539917 57053485 58222011 55293951 51388403 48929838 48432584 50248075
18736 50248075 53575093 56676887 57878590 55565403 49771091 42974584 35983435 29484568
18728 29484568 24627371 21365787 19211944 17627601 16212617 15194818 14371800 13798792
18720 13798792 13199750 12561795 12040596 11624714 11164721 10546488 10272123 10053051 9912117
18711 9912117 9658246 9421649 9129929 8814961 8597365 8416756 8140445 7827846 7419754
18702 7419754 7404051 7415484 7292290 7152658 6979600 6677110 6401738 6133255 6058779 6021488
18692 6021488 5846548 5719309 5541377 5407835 5325380 5197964 5037042 4793932 4847722 4867173
18682D867173J59015j63680k42742j30514k24337j38705k65084j2235O9855j41328
18672C777418j63296j19396k23647L399p6111k14944j06261m1493J49760J44836
18662C130265j85513m8779k2375K751Q7659j06953j19151L2016n0571j26332r5225
18651B497792k34156R5131n2728K17715K81572J17873j16547k96147j92517l9897
18641B278091j3423J45335j83269j74957l2366J73897J6959L4141j35017q9160
18631B020231l18763r4422P3834q7276O2964J52912q7219q3163j91034m3026r5898
18620A309140j9898o5472l3735J76744K0478Q941O8611K54724J31835k20487j86253
18609A444628j4752j4784j67409J02300J12640n3929N2886P5497o6111N8096q8884
$$ plain form
18682 4867173 5026188 4862508 4619766 4489252 4264915 4126210 3861126 3848891 3918746 3777418
18672 3777418 3614122 3494726 3271079 3274478 3198367 2983423 2877162 2835669 2985429 3130265
18662 3130265 2944752 2895973 2873598 2876349 2964008 2857055 2737904 2769920 2719349 2593017 2497792
18651 2497792 2263636 2358767 2306039 2523754 2805326 2923199 2806652 2510505 2317988 2278091
18641 2278091 2264668 2410003 2226734 2051777 2019411 2193308 2210267 2244408 2109391 2020231
18631 2020231 1701468 1607046 1680880 1593604 1656568 1809480 1722261 1639098 1448064 1405038 1309140
18620 1309140 1289242 1223770 1190035 1366779 1387257 1396198 1464809 1719533 1851368 1630881 1444628
18609 1444628 1429876 1415092 1247683 1349983 1462623 1408694 1461580 1537077 1470966 1529062 1440178
18598A440178j7564L7837q5591o6131P3180K1495r7241O0713P6235J65289P6648
18587A685048L7201j76822J09639K00228J16465r3889K1468K7705m252m7773j26288
18576A748730j00606j26276o7793N4254J20769J14894J0364l5455j10318q9458
18566A519105O9614L65336L22305K13494J38616l5607J9122K94947K16610J87893
18556C311435J82304J97450N8609J29260O0707K16926O19419P41840P65124R37669
18546G220743J529342K478762L391880M685832N844967N843452N063873M970476
18538D1029327O037595N764012K632901q40575J859J992346J662279o31978r50729
18529E6697037P12464O74416k825892o325862n477638l937416m211453n482452
$$ plain form
18598 1440178 1422614 1460451 1374860 1308729 1381909 1403404 1306163 1366876 1443111 1608400 1685048
18587 1685048 1722249 1545427 1655066 1855294 1971759 1877870 1899338 1927043 1922791 1875018 1748730
18576 1748730 1648124 1521848 1454055 1508309 1629078 1743972 1754336 1718881 1608563 1519105
18566 1519105 1588719 1954055 2276360 2489854 2628470 2592863 2611985 2906932 3123542 3311435
18556 3311435 3493739 3691189 3749798 3879058 3939765 4156691 4776110 5517950 6283074 7220743
18546 7220743 8750085 11228847 14620727 19306559 25151526 30994978 36058851 41029327
18538 41029327 47066922 52830934 55463835 54623260 54625119 56617465 58279744 57647766 56697037
18529 56697037 57409501 58083917 55258025 48932163 43454525 39517109 35305656 29823204
18521B9823204n031544l530069k424075j732233j316903r75965p21829l26231
18513A3764355l94627l52964k34169j77934o1801L1280r3251q7403o3222J12305
18503A2442569Q1297M14908N96568P23550J301224K165966L203763M576270N799275
18494C1305390O887532P493430Q458031R564121Q855841N973339M081026N478696
18486H8097406N482468J409121j455858K79287K456213L92184l664107m310998
18478H8685716k890437l819155q103038r999124p900264o200100o471017o321335
18470C6981246m951480l484126k325184j664755j559112j090773j004381q72034
18462B0029401p77555o17842o01987m19533m61910m85242m62512l92027k58821
$$ plain form
18521 29823204 24791660 21261591 18837516 17105283 15788380 14812415 14090586 13764355
18513 13764355 13369728 13016764 12782595 12604661 12542860 12574140 12480889 12393486 12330264 12442569
18503 12442569 12523866 12938774 13535342 14258892 15560116 17726082 20929845 25506115 31305390
18494 31305390 38192922 45686352 54144383 63708504 72564345 78537684 82618710 88097406
18486 88097406 93579874 94988995 93533137 93812424 96268637 96660821 92996714 88685716
18478 88685716 85795279 81976124 73873086 63873962 55973698 49773598 43302581 36981246
18470 36981246 32029766 28545640 26220456 24555701 22996589 21905816 20901435 20029401
18462 20029401 19251846 18634004 18032017 17612484 17150574 16665332 16202820 15810793 15551972
18453A5551972r7980m305L8154q410L47130R83931J693474K679473L505030L805575
18443B8494044L499842L129290L579407M032085K864346J40950q26131O64822
18435D5578655J210033j17964j003050k88434L56580j251749m150090m394483
18427C5939498l066703k808684l744002m040519l123207k038741j495264q84935
18419A4737443o18443o21802p29219l02653l90532l73389m39562m66826l79199
18410A0415818j88199k64888l45526m09237k47857j61173m27897m87236l63781
18401G520024j85546j30872l21335j56623k63785k32674p8891o0664n8161j33985
18391E897488j63048K101J4702j47786k69890j61618M1184N3762K5322j25839
$$ plain form
18453 15551972 15453992 15449687 15487841 15479431 15826561 16810492 18503966 21183439 24688469 28494044
18443 28494044 31993886 35123176 38702583 42734668 45599014 45739964 44913833 45578655
18435 45578655 46788688 46670724 45667674 45379240 45735820 44484071 40333981 35939498
18427 35939498 32872795 30064111 26320109 22279590 19156383 17117642 15622378 14737443
18419 14737443 14119000 13497198 12767979 12465326 12074794 11701405 11261843 10795017 10415818
18410 10415818 10227619 9962731 9617205 9207968 8960111 8798938 8371041 7883805 7520024
18401 7520024 7334478 7203606 6882271 6725648 6461863 6229189 6150298 6089634 6031473 5897488
18391 5897488 5734440 5736541 5751243 5603457 5333567 5171949 5213133 5266895 5292217 5166378
18381E166378j10336m21311m36860j5988n1184l6720k3708n3527n7431M7164p8950
18370C927527Q308j2944k17659M2249j22969r6404j64656j5625M6596K4681j8310
18359C400794p2293k78886j11174k22381p3745K28082R5489l99372j72474o9051
18349B324989j36306N1623M6746L7288J37499M6343j3284k56968k0785J90845
18339B407990J41827K2451Q3191j84826j68675p4049j03656j14586J44573l5479
18329B118761J065J00977q5891j69659p625l7930J3060q5555K33179Q8875k02031
18318A967226R6580q0224J5953p1052O5290K21834p0600j85100p7817N8771k342
18307A938519J09675l4579k07189k76133N3395J48330l3347j7083j12391k8850
$$ plain form
18381 5166378 5056042 4634731 4197871 4181883 4130699 4093979 4070271 4016744 3959313 4006477 3927527
18370 3927527 3935835 3922891 3705232 3747481 3624512 3528108 3363452 3347827 3394423 3419104 3400794
18359 3400794 3328501 3049615 2938441 2716060 2642315 2870397 2965886 2566514 2394040 2324989
18349 2324989 2188683 2240306 2287052 2324340 2461839 2508182 2494898 2237930 2217145 2407990
18339 2407990 2549817 2572268 2655459 2470633 2301958 2227909 2124253 2009667 2154240 2118761
18329 2118761 2119826 2220803 2134912 1965253 1957628 1919698 1932758 1847203 2080382 2169257 1967226
18318 1967226 2063806 1983582 1999535 1928483 1993773 2215607 2145007 1959907 1882090 1940861 1938519
18307 1938519 2048194 2013615 1806426 1530293 1583688 1732018 1698671 1681588 1569197 1540347
18297A540347l4738Q0095P5924j15401j98719j9430K31218K41790K30261O7920
18287B099267o9724j09560o4156P2400J42978k668J19851J34497K36806Q1794
18277B641485K48904K80669J84895P0068K3963J67565L05103J44073R6196L93695
18267D556616M42371N01212O87181J260247J869012K117325J922341P75432j035451
18258A3096286j856422j178200m29021J69715O19107R38667J493980K341441L857820
18249A9053373O456616J0260960J5138709J9934225K0827498J4579661K660713
18242A08911755o905557j2251017j2448424q872458p897284q896803p055676k941390
18234D1643146R94628L343899L899441J994062k441107o704183p163139n047794
$$ plain form
18297 1540347 1505609 1585704 1661628 1546227 1347508 1328078 1559296 1801086 2031347 2099267
18287 2099267 2029543 1919983 1855827 1928227 2071205 2068537 2188388 2322885 2559691 2641485
18277 2641485 2890389 3171058 3355953 3426021 3449984 3617549 3922652 4066725 4162921 4556616
18267 4556616 4998987 5500199 6187380 7447627 9316639 11433964 13356305 14131737 13096286
18258 13096286 11239864 10061664 9632643 9802358 10421465 11360132 12854112 15195553 19053373
18249 19053373 25509989 35770949 50909658 70843883 91671381 106251042 108911755
18242 108911755 102006198 89755181 77306757 68434299 60537015 51640212 44584536 41643146
18234 41643146 42637774 45981673 49881114 51875176 49434069 42729886 35566747 30518953
18226C0518953k890318j587129r73360l40843N034O3512L05101Q52721J596283
18217B7549954K184780J955832J589691J401651J666199K236627J687646n4749
18209D0217631r89007N21995L303404O352329Q563001Q938548O480345K878436
18201G6266682L636954J0209353J8158049K2875435K1310039J4787077R134060
18194A76377649O646654J887322m298871j2841560j4720480o206027M911825R171071
18186A60927583K279009j2351154k3313589k3788895j7599427j1518365p201975
18179F7433187m227357j368260J430301M131656O102226O073416K795542k525337
18171G9845374o278332q083205q181309o004140l673902k520473j733785j576637
$$ plain form
18226 30518953 27628635 26041506 25068146 24727303 24732337 24795849 25100950 25953671 27549954
18217 27549954 29734734 31690566 33280257 34681908 36348107 38584734 40272380 40217631
18209 40217631 39228624 39750619 43054023 49406352 57969353 66907901 73388246 76266682
18201 76266682 79903636 90112989 108271038 131146473 152456512 167243589 176377649
18194 176377649 183024303 184911625 180612754 167771194 153050714 146844687 151756512 160927583
18186 160927583 163206592 150855438 127541849 103752954 86153527 74635162 67433187
18179 67433187 63205830 61837570 63267871 67399527 73501753 79575169 82370711 79845374
18171 79845374 73567042 65483837 57302528 51298388 47624486 45104013 43370228 41793591
18163D1793591j722578j842935j693389j053157m51177J36690J284957K415795
18155C8867797M144240O108932Q076212Q627313O963879M102684L846485O799608
18147H7537150R067634R215056J1078550J7933087K2262602J6927527J729148
18140A75750754j4460938k8794216l1547988k2649361j3851658q725257n907656
18133D9813680m020906k909928j946645j176765l7092J333326K166856J719607
18125D4942133k11103l162139m001687l284082k470205j209521o98855m95212
18117B9409329l32385j31808N04357J184294K204242L582129O107728J0922556
18109E3450442K0314170L4322046N0530163N8654704L8834726j6514787o8699967
$$ plain form
18163 41793591 40071013 38228078 36534689 35481532 35030355 35167045 36452002 38867797
18155 38867797 43012037 49120969 57197181 65824494 72788373 76891057 80737542 87537150
18147 87537150 96604784 105819840 116898390 134831477 157094079 174021606 175750754
18140 175750754 161289816 132495600 100947612 78298251 64446593 55721336 49813680
18133 49813680 45792774 42882846 40936201 39759436 39722344 41055670 43222526 44942133
18125 44942133 44731030 41568891 37567204 34283122 31812917 30603396 29904541 29409329
18117 29409329 29076944 28945136 29449493 30633787 32838029 36420158 42527886 53450442
18109 53450442 73764612 108086658 158616821 217271525 256106251 239591464 170891497
18102A70891497n7843185l2065694j7167638j0257234o717086m796672l479137
18095C8564851k831210k492513j991884j765643j778967j350191j193942r69317
18087B4191184r19915j068462q64049p66768n80858o26732o60760q33621o73799
18078A7196220n96022n95439o03367o29783l62938j97100l78688m55140k84459
18069A3093284l21753n28544l80741k79630m21726l66971k93830M6583k94770
18060A0251902k98305j67492l47868k86786j06767k12303l27390l14331k85262
18051G905398j87534k55985l10527l56039l3875J29172k27078l12110j91430j94349
18041E965643j64619N6620l8818k87749r4018j02863N4208j41654o1912k05948
$$ plain form
18102 170891497 113048312 80982618 63814980 53557746 46840660 42043988 38564851
18095 38564851 35733641 33241128 31249244 29483601 27704634 26354443 25160501 24191184
18087 24191184 23271269 22202807 21338758 20571990 19991132 19364400 18703640 17870019 17196220
18078 17196220 16600198 16004759 15401392 14771609 14408671 14211571 13832883 13377743 13093284
18069 13093284 12771531 12242987 11862246 11582616 11160890 10793919 10500089 10546672 10251902
18060 10251902 9953597 9786105 9438237 9151451 9044684 8832381 8504991 8190660 7905398
18051 7905398 7717864 7461879 7151352 6795313 6761438 6890610 6663532 6351422 6159992 5965643
18041 5965643 5801024 5857644 5818826 5531077 5437059 5334196 5388404 5246750 5184838 4978890
18031D978890k24762j73573k67355k07389j73943j01119J02366J70873l3132j24320
18021C946536k6669M7052r5139k22995n7181j27385p9050k1160o9859p3634J26958
18010C347474M0279k27067j78224j15982n9201p1656J2969M6051J91912k08915
18000B777640l29139k08140L6287L6064j15325q5526K1843j2251k0153j41525
17990A959775j4286R82J5354j3587j92315j64801L2450J18651j37710j64134j04498
17979A335881O5129K69463L5162R062o1564M4981l4605j76846J11626j20144o3274
17968A414871P5112J83321K21428j25746j76303O6639J23859M1359p3413K0505
17958A771632K0644j66804R3216Q4978k20603j00203j84776j20675M3927n9998
$$ plain form
18031 4978890 4754128 4580555 4313200 4105811 3931868 3830749 3933115 4103988 4070856 3946536
18021 3946536 3919867 3966919 3871780 3648785 3591604 3464219 3385169 3364009 3294150 3220516 3347474
18010 3347474 3387753 3160686 2982462 2866480 2807279 2735623 2748592 2794643 2986555 2777640
18000 2777640 2448501 2240361 2276648 2312712 2197387 2111861 2133704 2121453 2101300 1959775
17990 1959775 1945489 1946471 1961825 1948238 1755923 1591122 1623572 1742223 1604513 1440379 1335881
17979 1335881 1401010 1670473 1705635 1714697 1653133 1698114 1663509 1486663 1598289 1478145 1414871
17968 1414871 1489983 1673304 1894732 1768986 1592683 1659322 1783181 1824540 1751127 1771632
17958 1771632 1792276 1625472 1718688 1803666 1583063 1482860 1298084 1177409 1221336 1161338
17948A161338n6171L9319M077m1286j4723K7934m5200q1508j8614l6190K09644
17937A148620J51897m3746j63526J5711j3034J61940o221P9971j98868o1807K7496
17926A098433l7081R0615k0019n1574J31987j09737l0018N8109N0407k01977n0875
17915I28270K17618J67513j03396j07424j5131O3144l5881j38531m4596M3057
17905I74643p9273j01819j03392J6910O6366J11849J8970m3149J4979j34562k753
17894G38769P5700R0893j96711j24383J82107J88688p1753r9814O777j6716o0211
17883G13346j43702n9861r1260J64951l363P1543q3550M76n3913j71422J79988
17872E23233K4411j86930M2636J51511N5937n1691Q0314k6047j3156J55081k0142
$$ plain form
17948 1161338 1105167 1144486 1148563 1107277 1092554 1120488 1075288 993780 975166 938976 1148620
17937 1148620 1300517 1256771 1093245 1108956 1095922 1257862 1251641 1331612 1132744 1070937 1098433
17926 1098433 1061352 1151967 1131948 1080374 1212361 1102624 1072606 1130715 1181122 979145 928270
17915 928270 1145888 1313401 1210005 1102581 1087450 1150594 1114713 976182 931586 974643
17905 974643 895370 793551 690159 707069 773435 885284 904254 861105 876084 741522 738769
17894 738769 814469 905362 708651 584268 766375 955063 883310 783496 790273 773557 713346
17883 713346 569644 509783 418523 583474 580111 651654 568104 568580 514667 343245 523233
17872 523233 547644 360714 403350 554861 610798 559107 639421 613374 600218 755299 735157
17861G35157j98852L0502J11080j38265j98725k1881M7259J39598J89116r2487
17851F02502j40871R3246O8380Q327m6046k7457R6319J07733M3941q9744j78043
17840E38287r0550J02601N8198N1429j11221K4095J25647n8911j68807R5887N4574
17829F21229J41133J3702N4015J74465l1017q613j8668q0339l9618q7630J2245
17818G50904n6387N7027J98378N2816m3382j29872K1762L3509j81493j65577J22922
17807F60607K35033K7023r9056N2856j09768K4941J51471k9779L5416J27297J41778
17796A217819J11317M2637M0827J8425j63813p9452P0588o8381M413N2750K13629
17785A460759R1583R1778q1101L6846J16762J14551J45352j8292L2124M9939N4682
$$ plain form
17861 735157 536305 566807 677887 539622 340897 319016 366275 505873 694989 602502
17851 602502 461631 554877 623257 631584 585538 558081 654400 762133 806074 716330 538287
17840 538287 447737 550338 608536 659965 548744 572839 698486 639575 470768 566655 621229
17829 621229 762362 776064 830079 1004544 973527 964914 946246 865907 826289 738659 750904
17818 750904 694517 751544 949922 1002738 959356 829484 851246 884755 703262 537685 660607
17807 660607 895640 922663 823607 876463 766695 791636 943107 913328 948744 1076041 1217819
17796 1217819 1329136 1371773 1412600 1431025 1267212 1187760 1258348 1189967 1194380 1247130 1460759
17785 1460759 1552342 1644120 1563019 1599865 1716627 1831178 1976530 1958238 1990362 2040301 2094983
17774B094983O6085J68623J63779o9948J05201J88887Q2336M7553J4342R9582
17764B961423O7396Q6652J30110M70873M42469M08327K63708J67781J46325J99381
17754E344445K37861K95389N29999N89916L51364k6278j58780j9992J51761K72742
17744G568427L95270N15932Q32754J528792K430973L659077M482775M909813M358157
17735C0681970L081567K809030M501026N981642O143829N441438O130062P619413
17727G2389977O780438N126338P708465J0451184P113523k586147j1630710j2129779
17719H3223289q893718o232435k411740K431022Q241275J4573675K1656009K8206589
17711A40793966L2461055K9402856J5712727l123035j2744231p269077L665517
$$ plain form
17774 2094983 2161068 2329691 2493470 2423522 2528723 2717610 2799946 2847499 2861841 2961423
17764 2961423 3028819 3115471 3245581 3716454 4158923 4567250 4830958 4998739 5145064 5344445
17754 5344445 5582306 5877695 6407694 6997610 7348974 7322696 7163916 7143924 7295685 7568427
17744 7568427 7963697 8479629 9312383 10841175 13272148 16931225 21414000 26323813 30681970
17735 30681970 33763537 36572567 41073593 47055235 53199064 58640502 64770564 72389977
17727 72389977 79170415 84296753 92005218 102456402 109569925 106983778 95353068 83223289
17719 83223289 74329571 68097136 65685396 68116418 76357693 90931368 112587377 140793966
17711 140793966 173255021 202657877 218370604 215247569 202503338 195234261 198899778
17704A98899778Q002901K728600n443385j0061230j3226024j7529327k0676008
17697A42695305j9013245j2038795m274025K333566Q209157J2572646J2693696
17690A43178305O942695k519863r556025q975493m035153O11104O402300J4416261
17682A46464131J9942794J7353272M523720j2365150k1975259k0387851j4541306
17675A19014351j1093742r559675o079899j521174J794915L806987M817012N250406
17667A06429181L466582k56338k270213N08077M594596O866383N416959J526269
17659A26281496M25385M829120J1992612J6631421J4861292O496447j298684k115262
17651A78103827L619284J1409733J2399444K83671j9443813k9851881k4117768
$$ plain form
17704 198899778 206902679 209631279 204187894 194126664 180900640 163371313 142695305
17697 142695305 123682060 111643265 107369240 109702806 117911963 130484609 143178305
17690 143178305 150121000 147601137 138045112 129069619 125034466 125645570 132047870 146464131
17682 146464131 166406925 183760197 188283917 175918767 153943508 133555657 119014351
17675 119014351 107920609 98360934 92281035 90759861 92554776 96361763 101178775 106429181
17667 106429181 109895763 109639425 107369212 107877289 112471885 119338268 124755227 126281496
17659 126281496 126706881 131536001 143528613 160160034 175021326 181517773 180219089 178103827
17651 178103827 181723111 193132844 205532288 205815959 186372146 156520265 132402497
17644A32402497j2017771k631731J356010p49091p163976j1538430q322538k135855
17636H9199115K369536M098296J286372m875642q450935p577777n207028l797509
17628F7044428l114540l494568n086338n747836m693452l464306k685386k118327
17620C6639675j832189j636433j306163j079716j101850j025071p87894p91920
17612B7078439q33148o89419n58550p52718q65615q85227o48218n58987m06248
17603B0880309m20226p57963p86034n84079n17304o24971m85876n24777n89379
17594A5589700m76197n99569m99569l82613l47292k06463k60727k64678l42217
17585A2210375m12006l24071n0959l17398n05524l35677k23686j72236l12421
$$ plain form
17644 132402497 120384726 117752995 119109005 118359914 111195938 99657508 91334970 89199115
17636 89199115 91568651 95666947 96953319 92077677 83626742 76048965 70841937 67044428
17628 67044428 63929888 60435320 55348982 49601146 44907694 41443388 38758002 36639675
17620 36639675 34807486 33171053 31864890 30785174 29683324 28658253 27870359 27078439
17612 27078439 26245291 25555872 24997322 24244604 23378989 22493762 21845544 21286557 20880309
17603 20880309 20460083 19702120 18916086 18332007 17814703 17189732 16703856 16179079 15589700
17594 15589700 15113503 14513934 14014365 13631752 13284460 13077997 12817270 12552592 12210375
17585 12210375 11798369 11474298 11423339 11105941 10600417 10264740 10041054 9868818 9556397
17576I556397l78425k52238j18732j46650k53738k58092k77894j91651L039j41512
17566G540504k73741l44345k31787j20537j86892L0699k3713k45075k37985j90388
17556E716740j10732j57639n6460J17592p0377j65738j81727j68992j98662j61841
17546D562164j42757j52626j0929j17019m0915r0323j02464j87305j04330m0176
17536C573320j93295k18045j19627j08957K9983j35398q0898j78998r2760p5924
17526B399401m5003R2069Q055M985j15783j38491j08736P9605J57677j07643J4040
17515B240176p7871k28551j58547J54395p9758k46944Q763p4291o7553R0562J25361
17504A685742j36239j57818n6586O8889J57208l4517M6221N0610j00191j88646
$$ plain form
17576 9556397 9177972 8925734 8807002 8660352 8406614 8148522 7870628 7678977 7682016 7540504
17566 7540504 7266763 6922418 6690631 6570094 6383202 6413901 6390188 6145113 5907128 5716740
17556 5716740 5606008 5448369 5391909 5509501 5439124 5273386 5091659 4922667 4724005 4562164
17546 4562164 4419407 4266781 4255852 4138833 4097918 4007595 3905131 3717826 3613496 3573320
17536 3573320 3380025 3161980 3042353 2933396 2963379 2827981 2747083 2568085 2475325 2399401
17526 2399401 2354398 2446467 2454522 2459507 2343724 2205233 2096497 2176102 2333779 2226136 2240176
17515 2240176 2162305 1933754 1775207 1929602 1849844 1602900 1611663 1537372 1469819 1560381 1685742
17504 1685742 1549503 1391685 1335099 1403988 1561196 1526679 1572900 1623510 1523319 1334673
17494A334673k1163k24835k2462J54279J1799q2007R9954J34364q9647n8920K7016
17483A263051L7072j53132k00502m2467o3276o7055N0025N4147j34688j20623
17473F22552m1964j0900j28829M447J26133q360L5151p5546J34533K38813N8190
17462I54220j88542j61127J29883j6236J7811O416j71361j1844P7512R1382l6118
17451F91996p4298L0612r8317j09641N3942L5095J36892N4518O1681J53781L90435
17440A326696K12953J61607l884k80396o6658l20947k67888r0184k6621l0700
17430F13978l4215N5541K38142K4390k68109j44598J32168m8293K7136l686p0560
17419E21894j6298k5310L7902j26399r2749l2728J61362j9454K727m323M4618
$$ plain form
17494 1334673 1313510 1088675 1066213 1220492 1232291 1150284 1250238 1384602 1294955 1236035 1263051
17483 1263051 1300123 1146991 946489 904022 840746 773691 823716 877863 743175 622552
17473 622552 580588 569688 440859 445306 571439 563079 598230 522684 657217 896030 954220
17462 954220 765678 604551 734434 718198 736009 742425 571064 559220 636732 728114 691996
17451 691996 617698 648310 549993 440352 494294 529389 666281 720799 782480 936261 1326696
17440 1326696 1539649 1701256 1697372 1416976 1350318 1029371 761483 671299 644678 613978
17430 613978 579763 635304 873446 897836 629727 485129 617297 569004 596140 592454 521894
17419 521894 505596 480286 518188 391789 299040 266312 427674 408220 410947 406624 451242
17408D51242p6879j37535O1624N0174M3412Q4635j465K1036j29119m4178K9160
17397C52107l419J33967J30137L8345L7546j23740j28420j36113n3447J75379
17387D22342J73622K7152j62284j639P4846n5591j25798l0776N2080O4794j84456
17376B54292k02560K7218j37489l3233k9433J21391M4485o2548Q7214M0180P341
17365A16858j1173M6482j6153j54701r6460P4058Q7182P2571r1474J2092J46567
17354A85849J23437o5097l5373K6785O3003L2003o7347r9129j16558K7246q3780
17343h961j05607J51924J16530j18281j57670K3167j659j49645j7592J6432j6665
17332b68027j2848L8089N0948L2166Q5952J10271J35803K08683j90959k20390
$$ plain form
17408 451242 374363 236828 298452 348626 392038 476673 475208 496244 367125 322947 352107
17397 352107 348688 482655 612792 651137 688683 564943 436523 300410 246963 422342
17387 422342 595964 623116 460832 459193 534039 478448 352650 321874 373954 438748 254292
17376 254292 51732 78950 -58539 -91772 -121205 186 44671 -17877 69337 109517 116858
17365 116858 105685 152167 136014 -18687 -115147 -41089 46093 118664 27190 39282 185849
17354 185849 309286 244189 208816 235601 298604 330607 263260 164131 47573 74819 -8961
17343 -8961 -114568 37356 153886 35605 -122065 -98898 -100557 -250202 -267794 -251362 -268027
17332 -268027 -280875 -242786 -191838 -159672 -73720 36551 172354 381037 190078 -30312
17322c0312o6079N6286J05889n7117M5992Q2047J1329J9474N8973j03848k7169
17311I5465P7899l9738K8655o8593j12209l6183J16309k1591j087j54406J00248
17300a5231J19311N2505k9037O8485K3411j48184J9971n0308K5083J07505O6857
17289B40368j22410r4757M8859P8747J08509O5037j21732J5373l6031k27123l8475
17278h3635K0401M6169J23081N6793J22283r6361p0312K5465j9352j65052L9130
17267a390J58827J36089j3075q8626p6904j15270q9069j41360J0508K41991J20492
17256A42213N4350J9543j14701j45161j16783l9889K05862K97151k5519K0420
17246B97486o5577k88033j31187R3862J08745J11826J80050J57278l0722j26581
$$ plain form
17322 -30312 -96391 -40105 65784 8667 54659 136706 148035 167509 226482 122634 95465
17311 95465 173364 133626 162281 93688 -18521 -54704 61605 40014 38927 -115479 -15231
17300 -15231 104080 156585 127548 196033 219444 71260 91231 40923 66006 173511 240368
17289 240368 117958 23201 72060 150807 259316 324353 202621 217994 181963 -45160 -83635
17278 -83635 -63234 -17065 106016 162809 285092 188731 118419 143884 124532 -40520 -1390
17267 -1390 157437 293526 280451 191825 114921 -349 -89418 -230778 -220270 21721 142213
17256 142213 196563 216106 101405 -43756 -160539 -200428 5434 302585 277066 297486
17246 297486 231909 -56124 -187311 -93449 15296 127122 307172 464450 433728 307147
17236C07147n4362K999p3754o6474O7762p6664o1981J09913J53483L6140m8676
17225B95533q8044O7849J82876o3620r5679N7053P2359N9967J42467J20339O4202
17214H15302n4496N6936R639r004Q4534k7816k17821j68149J3881r7261m2771
17203C62974R8624r661L7632J81152J85454J42204J07785K9383n6929j24594j55600
17192G98424j92114J9959J72484p0570r9555K9500p8421k20402j56684J18326
17182C20947K41399P2466O1237r9933l774J57998Q5437j2277l3603m8045l3494
17171G08358q1378j50515R5200J76719J12031M838q500o814J55176J4012R7921
17160A117048m8890m6050q6956r9281p9831j77562N947L0540J22349L4421j05325
$$ plain form
17236 307147 252785 255784 182030 115556 183318 106654 44673 154586 308069 344209 295533
17225 295533 207489 275338 458214 394594 298915 355968 428327 488294 630761 751100 815302
17214 815302 760806 817742 827381 818377 902911 875095 657274 489125 503006 405745 362974
17203 362974 461598 451937 489569 670721 856175 998379 1106164 1135547 1078618 954024 798424
17192 798424 606310 626269 798753 728183 628628 658128 579707 359305 202621 320947
17182 320947 562346 634812 696049 596116 592342 750340 835777 823500 789897 741852 708358
17171 708358 626980 476465 571665 748384 860415 865253 856753 849939 1005115 1019127 1117048
17160 1117048 1068158 1022108 935152 835871 756040 578478 584425 614965 737314 771735 666410
17149F66410k16960k0730n5402L6237Q3179J82990O6470o6159N3438n9217j28027
17138E42229P406M7975P7482l7353O3669K2657n8464J01430J2847J0527j33029
17127F57376j46620k0438m6680J1397m6423K9164J32949p2312K366j4627O2529
17116E48681l2171L7430O2478j13530J7487R3413l2323j49638j86634J0316Q2840
17105C38349l7232p7861j10131j1298r057o5975J18068J95295J35231k9116j64173
17094B82100M7091N7839j18132m6357m0661m7602K8323o5442k4514j4442l1817
17083B6386j63845L1822O9517P0411o0418k114J11963K33561O7107l4618j99301
17072A50471l5704o9243q3637O6349K3559j12202j63905K12412J88939o938j4289
$$ plain form
17149 666410 449450 428720 373318 409555 492734 675724 742194 676035 729473 670256 542229
17138 542229 549635 597610 675092 637739 701408 724065 665601 767031 779878 790405 657376
17127 657376 510756 490318 443638 455035 408612 437776 570725 498413 500779 486152 548681
17116 548681 516510 553940 616418 502888 520375 613788 581465 431827 245193 255509 338349
17105 338349 301117 223256 113125 101827 92770 26795 144863 340158 475389 446273 282100
17094 282100 329191 387030 268898 222541 181880 134278 162601 97159 72645 58203 26386
17083 26386 -137459 -105637 -36120 34291 -26127 -28241 83722 317283 384390 349772 150471
17072 150471 114767 45524 -38113 28236 51795 -60407 -224312 -11900 177039 170101 155812
17061A55812j501m2056N8563j07309q9189j54303K4050N9686N9861R9297m481
17050E8430o7189R8013M4594m906o2523k6418L8261p214M3630p1219j55910j96715
17038c09166M5494J63092J89650o2046j13995K24893J17187Q1114j303j05609
17028B29311n7112n9542L8624j86725o3256O4033M0026N1674P6684j66610m6796
17017g9689l5852J19082L7308q6651l6693L2351j83973k45342J20894K16679J89047
17006D7161K5444k28458m8582K13594R9531j0429P1517o0676j40236j84465J03954
16995a11645p164m0519K569J69377R8075K9683o8089J25058K7488j18925J07732
16984B13640J64241p0541k27034j69457J40129R1571l9239N8316m9417k9330J81027
$$ plain form
17061 155812 154311 112255 170818 63509 -25680 -179983 -155933 -96247 -36386 62911 58430
17050 58430 -8759 89254 133848 128942 66419 40001 78262 71048 114678 43459 -112451 -309166
17038 -309166 -263672 -100580 89070 27024 -86971 137922 255109 336223 334920 229311
17028 229311 172199 112657 151281 -35444 -98700 -34667 5359 57033 133717 -32893 -79689
17017 -79689 -115541 3541 40849 -45802 -82495 -50144 -234117 -479459 -358565 -141886 47161
17006 47161 72605 -155853 -204435 9159 108690 98261 169778 109102 -31134 -215599 -111645
16995 -111645 -118809 -159328 -156759 12618 110693 140376 72287 197345 224833 105908 213640
16984 213640 377881 307340 80306 -89151 50978 142549 103310 161626 112209 82879 263906
16973B63906P012N0130r1037j09428j4195j12237J15237P9975q105M1060k7096
16962A95222p4358j6353N2264k2593J83309P6698j47256k5245p9477l3901L4010
16951A42320J43970n4959L907q6854R9166J6436n5847o7596J24377j9315r1138
16940A54467r2175k7443K1817l1518m3268p0127M4526l9855o0599L3477J34519
16929B3821r0871j06793J73821k0073J16171o1170m6007O4760N3848j35853j17847
16918a46193O5507R8925P9675j85587j93105J00174K0995j12349n4360o8858J37014
16907b58162K16523J53039M6220J8112q7361k32640l2907J35093l6335K78612
16897B00194j0859l10059N5601M2769J8257O3394K70467k4453R9892j8828j80118
$$ plain form
16973 263906 270918 321048 230011 120583 106388 -5849 109388 189363 181258 222318 195222
16962 195222 120864 104511 156775 134182 317491 394189 246933 221688 142211 108310 142320
16951 142320 286290 231331 235238 148384 247550 263986 208139 140543 264920 245605 154467
16940 154467 62292 34849 56666 25148 -18120 -88247 -43721 -83576 -144175 -110698 23821
16929 23821 -67050 -173843 -22 -20095 96076 34906 -11101 53659 107507 -28346 -146193
16918 -146193 -80686 18239 97914 -87673 -280778 -180604 -159609 -271958 -326318 -395176 -258162
16907 -258162 -41639 111400 157620 175732 88371 -144269 -177176 -42083 -78418 200194
16897 200194 189335 -120724 -65123 -22354 -4097 59297 329764 305311 405203 386375 206257
16886B06257r4899j3466Q1870J3582M5872J0091o3484m0410Q6226Q4824k27322
16875H9141j55581k412N5558J46791p6592r8102N6735R0880J39505M6520K0211
16864C12654K9664m5008j25560r3776O8445J49633n2903k11448j16548J30724
16854D5877L2335o2403J1684q8098m7989p8711N4703L1597J7872N9394J22080
16843I8341M1935l6152P6621J30206k3841o9075p8975M4522R008o9558j2999l8172
16831G1861J21330q0308j71062J3905J7977L9576j8261r6759J01723Q4927j62175
16820g7266J65778J51254P7090l4504j06039j66859p5591m820N6074Q3422O1342
16809A29881o5758J9401J80698n2610l7186k9509j12401l8354J23390M8313J549
$$ plain form
16886 206257 111358 97892 179762 193344 239216 249307 185823 145413 231639 316463 89141
16875 89141 -66440 -68852 -13294 133497 56905 -41197 15538 106418 245923 292443 312654
16864 312654 342318 297310 171750 77974 146419 296052 243149 31701 -84847 45877
16854 45877 78212 15809 27493 -60605 -108594 -187305 -132602 -101005 -83133 -23739 98341
16843 98341 140276 104124 180745 310951 287110 218035 139060 183582 192590 123032 110033 71861
16831 71861 193191 112883 -58179 -44274 -26297 13279 -4982 -101741 -18 84909 -77266
16820 -77266 88512 239766 316856 282352 176313 9454 -66137 -70957 -14883 68539 129881
16809 129881 64123 83524 264222 211612 174426 144917 32516 -5838 117552 165865 167414
16798A67414K11218M2490m8254p3621j40114N0409J96020o7879j21020j91927
16788B4736j07075J00401M6756l2120J98404J409j69072j29306J02053O1383j07058
16777i489j20822r7620l5876K3220Q1612J10163j5525k0752k7514k7729o0140
16766b00472l1553J52844Q6427M8542k2111r0192j00252N5894Q781N3061L8861
16755a70r6370r2272K07152O0468p7505l0378j29776L9350j00397j26950J91771
16744a55077J88922m0099J3565J2516o0872n7945p8686J4085J07888J15308J34743
16733A94348K4322r5555o6378O7020j71485J69842J00463r3748j09976r7259Q4001
16722E595K8677j28338J55055J22578L2976q1261l6983J4312j7771q2972q9503
$$ plain form
16798 167414 378632 421122 372868 299247 159133 209542 405562 337683 216663 24736
16788 24736 -82339 18062 64818 32698 231102 232511 63439 -65867 36186 97569 -9489
16777 -9489 -130311 -227931 -263807 -240587 -158975 -48812 -64337 -85089 -112603 -140332 -200472
16766 -200472 -232025 -79181 7246 55788 33677 -56515 -156767 -100873 -92092 -39031 -170
16755 -170 -96540 -188812 18340 78808 1303 -29075 -158851 -119501 -219898 -346848 -155077
16744 -155077 33845 -6254 7311 19827 -41045 -98990 -177676 -163591 -55703 59605 194348
16733 194348 218670 123115 56737 123757 -47728 122114 222577 128829 18853 -78406 5595
16722 5595 34272 -94066 60989 183567 216543 135282 98299 112611 94840 11868 -77635
16711g7635r9027J06231M9706J38796L6667r8842j29639P1725n4390P2991M6459
16700F3042k8060q445j62489J5893K12661N9498k11292j9981J43231P3092j37505
16689c55j36879q6663k0770J6181J51611P1236J38785m4225o6821o5441k13198
16678b56539k3842R2152R3327Q4810p2520K614M1912J09125R6065j24285j26510
16667h3691r2870Q9501Q8098q4216Q832K15424J55623l3772l03439k58627O724
16656b92413J4204M3790K43945m4759K4675m8916m6534o274k1789k1325j18747
16645b74143L534J23051J31541L2552n0637Q529j91793j6338M28l7197J02438
16634a68035k4765J14521q4382k97457j24480M9471J90560K86800Q1529L4864
$$ plain form
16711 -77635 -176662 -70431 -20725 118071 154738 55896 -73743 -2018 -56408 16583 63042
16700 63042 34982 26537 -135952 -120059 92602 152100 -59192 -79173 64058 137150 -355
16689 -355 -137234 -223897 -244667 -228486 -76875 -5639 133146 88921 22100 -43341 -256539
16678 -256539 -280381 -188229 -94902 -10092 -82612 -79998 -38086 71039 167104 42819 -83691
16667 -83691 -176561 -87060 1038 -83178 -74346 141078 296701 262929 -40510 -299137 -292413
16656 -292413 -278209 -234419 9526 -35233 -10558 -59474 -106008 -112282 -134071 -155396 -274143
16645 -274143 -270609 -147558 -16017 16535 -34102 -25573 -217366 -233704 -233276 -270473 -168035
16634 -168035 -192800 -78279 -162661 -460118 -584598 -535127 -344567 -57767 23762 58626
16624E8626K180k2181J60024N1361j35832m3249K75084j06168N0322n2859j37088
16613A00220m6204j07662M9481L2171M1332M0761q7270n6179p1570o2583J55058
16602a2445J68204J01185m4593j21800n9747o9310n1043J5778J05538o9927o0009
16591i8169n0712L2210J07926N3072J28783O6630o9138j64454r4393M2516R3861
16580D8132j02193m9686N5793n176m5786r6830L2169j25478J1164J16223n938
16569a67606K3714r4142l962J02722J08957K22452j36195k17672J80084J95478
16559B13830n9943q6509l3951L8246n8772O4537K9321O7977j36693j46903k7572
16548a36432J04913j5825O0971O2795n0961r9081j97871q0237M6374J53976O0608
$$ plain form
16624 58626 60806 38625 198649 250010 114178 70929 346013 239845 290167 237308 100220
16613 100220 54016 -53646 -4165 28006 69338 110099 22829 -33350 -104920 -167503 -12445
16602 -12445 155759 256944 212351 90551 30804 -38506 -89549 -73771 31767 -38160 -98169
16591 -98169 -148881 -116671 -8745 44327 173110 239740 170602 6148 -88245 -45729 48132
16580 48132 -54061 -103747 -47954 -53130 -98916 -195746 -163577 -289055 -277891 -161668 -167606
16569 -167606 -143892 -238034 -241996 -139274 -30317 192135 55940 -161732 18352 213830
16559 213830 153887 67378 33427 71673 12901 77438 106759 174736 38043 -108860 -136432
16548 -136432 -31519 -47344 13627 76422 25461 -73620 -271491 -351728 -305354 -151378 -90770
16537i0770J00404J02605K239o2135k32008q3108J80808K56731K1473j03301j34003
16526d1065m944J02484M680j53992r648K1266J95198r187q2007l4989n8565n640
16514g6409L2342P6145R3430j08040l6111J63269J02339M700j47487k68474n2635
16503b16931m8020j9778K0853K55476J49743j14201O0964J201n3289l7385j46742
16492a48109N0199K1101L9475J50770o2148j05443J81586J11152O677j09746j53289
16481a7775j20324j36307P3415P1328J8560l7172K53283J3909N6946j34098k82579
16470b40814j56980K21112J42284K6702P7278L8817R8009q8495j10823O8841l4666
16459D1265j855N1334K670k0875j7592r8753j425J03206o701J14103j13690j30471
$$ plain form
16537 -90770 9634 112239 114478 52343 -179665 -262773 -81965 174766 196239 92938 -41065
16526 -41065 -46009 56475 61155 -92837 -102485 -81219 113979 104792 22785 -12204 -70769 -76409
16514 -76409 -44067 32078 125508 17468 -18643 144626 246965 251665 104178 -164296 -216931
16503 -216931 -264951 -284729 -263876 -8400 141343 27142 88106 89307 36018 -1367 -148109
16492 -148109 -97910 -76809 -37334 113436 51288 -54155 127431 238583 245260 135514 -17775
16481 -17775 -138099 -274406 -200991 -129663 -111103 -148275 105008 118917 175863 41765 -240814
16470 -240814 -397794 -176682 -34398 -7696 69582 108399 206408 117913 7090 75931 41265
16459 41265 39410 90744 93414 72539 54947 -43806 -45231 57975 51274 165377 51687 -78784
16447g8784N8462k9273k56420l5416K35183J52282R2926J06194j84497k14936
16437a54279k07463J4778L6120J98202N5403L4553N6390J33012J92704L5194j33257
16426B61357j07909K9166k7043j17383j16130j8770q575N416l8614P2737P2887
16415G139K71086R997m2826o7015j79417j38941O2760L1130K8381O6742J32388
16404A81424j62774j17482K885K10681Q045l07708j81367J86692J15651j31241
16394a95194J871K01622L2614j60933K8666j87975r6426J5746O486J03889J13941
16383a35693N8015o11l275M363l0006m3464J41775j35380p4565J40729J7304K19679
16371A58871P703j46796K5336J67297J0586q0520j01812K5500m9071o3424M8309
$$ plain form
16447 -78784 -20322 -49595 -306015 -341431 -106248 46034 138960 245154 60657 -154279
16437 -154279 -361742 -346964 -310844 -112642 -57239 -22686 33704 166716 359420 394614 261357
16426 261357 153448 182614 155571 38188 -77942 -96712 -105287 -99871 -138485 -65748 7139
16415 7139 278225 288222 245396 178381 -1036 -139977 -77217 -46087 -17706 49036 181424
16404 181424 18650 -98832 -95947 114734 122779 -184929 -366296 -179604 -63953 -195194
16394 -195194 -193323 8299 40913 -120020 -91354 -279329 -375755 -360009 -353523 -249634 -135693
16383 -135693 -77678 -78289 -81564 -77201 -107207 -150671 -8896 -144276 -218841 -78112 -60808 158871
16371 158871 166574 19778 45114 212411 222997 142477 40665 66165 17094 -46330 1979
16360A979J35155J05804R828n2753N4625j15245J0876J0133m0416J31495N6821
16349C08302p7072j24665j45362Q132N4953l4823m5357J10592J28891k36150j10264
16338a62823k9912J99463J63274J11703m6762r6405Q4345P269j72003n1427O9043
16327G5765J9377l911m8819n8906L1301L6892J2522j57560j58114J57940J81325
16316H7812k1291K7032P5896O6078n8239k34901l564p5293m1808P1162N6190n2381
16304a03307J4751j47815o6752J07457Q8030P6377J24150N5056M8131k2075k0306
16293A53697o6461j71798R9455p7180j41314n794k02350J56459J94314R6258J00431
16282A35717J09885L2311o7955j40879r3378P7041o5593j63189n2857R2268J95349
$$ plain form
16360 1979 137134 242938 252766 200013 254638 139393 150269 160402 119986 251481 308302
16349 308302 231230 106565 -38797 -30665 24288 -10535 -55892 54700 183591 -52559 -162823
16338 -162823 -192735 6728 170002 281705 234943 138538 222883 230152 58149 6722 75765
16327 75765 95142 91231 42412 -16494 14807 51699 64221 -93339 -251453 -93513 87812
16316 87812 66521 93553 169449 235527 177288 -57613 -61177 -136470 -178278 -107116 -50926 -103307
16304 -103307 -88556 -236371 -303123 -195666 -107636 -31259 92891 147947 196078 174003 153697
16293 153697 87236 -84562 14893 -62287 -203601 -209395 -411745 -255286 -60972 35286 135717
16282 135717 245602 277913 209958 69079 -24299 52742 -12851 -176040 -228897 -136629 58720
16271E8720J38137M0323k44699k56797o2467O8229J62101J10154L9985N1861j05621
16260g4l8383j49681K8060p813P2917O4837n4975l4969R0411p9214N7163J4317
16248c7404j11237q122M8728J18328L2988n9554j2648j70430L3543K48653O708
16237H9553k58854L7442L5506n0581r0392N536j68160K2800J2791J8003J07929
16226b38427J23975k8214J39437J23188m1047p4517p3069l0006m3348n1888p7406
16215b71322R6295J29450J27386J26654q9545r2002p6789j0550j42235k5901J17021
16204a11538K67991M8757m5098n0698j13473o1293J24595J4471K5884m3433p9166
16193b3001K3944J49890O9392j06636j1556q529L1818J25703j69389j89659k0653
$$ plain form
16271 58720 196857 237180 -7519 -264316 -326783 -258554 -96453 13701 53686 105547 -74
16260 -74 -38457 -188138 -160078 -167891 -94974 -30137 -85112 -120081 -29670 -108884 -51721 -37404
16248 -37404 -148641 -156763 -108035 10293 43281 -16273 -28921 -199351 -165808 82845 89553
16237 89553 -169301 -131859 -96353 -146934 -237326 -231790 -399950 -377150 -364359 -346356 -238427
16226 -238427 -114452 -142666 -3229 119959 78912 4395 -68674 -98680 -142028 -193916 -271322
16215 -271322 -175027 -45577 81809 208463 118918 26916 -49873 -60423 -202658 -228559 -111538
16204 -111538 156453 205210 160112 109414 -4059 -65352 59243 73714 99598 56165 -23001
16193 -23001 943 150833 220225 113589 102033 93504 125322 251025 81636 -108023 -128676
16182a28676J66051P249L456r2494r82p4783K3242J02350o2817P9752J30745O6856
16170B19949j37738j95108k849p8623m716M5116M4253P84q8114n1086L4583J15682
16158i7867P7513p3977M3396N8456r8635M2934K01246R537j23904j94307q8153
16147b43761J8915M2149r97J42766m541K1803J79972j45666o4595P5986N668r1803
16135f4104l4062P9383j09526j02892K6206J56809p0637L6496K17041Q9404j0363
16124B13755m4313L0682J25131Q0636k36823k58607L6288m9461n9920J6162n3871
16113b00341m7518J58128M2062L3989j4526J20812p9326Q9938J6026J1853K3595
16102A54692J6555k24994P4459R3040J21778P7154k48186j01580J10536J3877
$$ plain form
16182 -128676 37375 44624 48080 -44414 -45396 -120179 -96937 5413 -57404 22348 153093 219949
16170 219949 82211 -112897 -115746 -194369 -199085 -153969 -109716 -108932 -197046 -248132 -213549 -97867
16158 -97867 -20354 -94331 -50935 7521 -91114 -48180 153066 162603 38699 -155608 -243761
16147 -243761 -224846 -182697 -183694 -40928 -45469 -23666 156306 10640 -53955 22031 27699 -64104
16135 -64104 -98166 -18783 -128309 -231201 -204995 -48186 -118823 -82327 134714 224118 213755
16124 213755 169442 200124 325255 405891 169068 -89539 -53251 -102712 -162632 -146470 -200341
16113 -200341 -247859 -89731 -47669 -13680 -28206 92606 13280 103218 119244 131097 154692
16102 154692 171247 -53747 20712 113752 235530 312684 64498 -37082 73454 87331
16092H7331q2069K699R189k9330j50671p6136J7013r693N0602Q584p6780J19322
16080a29939J79451j69614k39107J4303R0341K20470P2643m3112m2092M182J5441
16069b7033j165o8731J15044O88m6302O3542J2230Q8898Q741j23587p0192K3904
16057b3963R4605j5144O0843K35079r1380j02521j13080q2725o8143m2612L1862
16046a17179K3728J08585r6656o1173P3149K37813J13102p9238J6707r5570k56632
16035a33364j38814J4088J38414O7133J27099J13173J15202k34627J8993J69525
16025B56822l9130K1907j41767r6576K037J0947q3885k7519J06272L7328M737
16014E1173n1244j3663J37076J58276l5992r5128K4262j03099m4625J93400J68619
$$ plain form
16092 87331 5262 7961 17150 -12180 -162851 -238987 -221974 -231667 -181065 -172481 -249261 -129939
16080 -129939 49512 -120102 -359209 -344906 -254565 -34095 38548 -4564 -46656 -42474 -27033
16069 -27033 -28198 -96929 18115 18803 -27499 36043 48273 137171 145912 22325 -47867 -23963
16057 -23963 70642 55498 116341 351420 260040 157519 44439 -38286 -106429 -149041 -117179
16046 -117179 -93451 15134 -81522 -142695 -69546 168267 281369 202131 218838 123268 -133364
16035 -133364 -272178 -258090 -119676 -52543 74556 187729 302931 68304 87297 256822
16025 256822 217692 239599 97832 1256 3293 14240 -69645 -97164 9108 46436 51173
16014 51173 -71 -13734 123342 281618 245626 150498 174760 71661 27036 220436 389055
16003C89055j5785j83311q1998n153N4024K0948R1341k7855k13548j82581m0332
15992a95195O3406L5487K04462L5083j9242k59017n5210K15764M7659j17323k0097
15981f4223Q5459J52521J2942R2600N9133j48783r8837J84176l3882j30020K1150
15970A32236L0031M0738L4740j25340r348m1016O3876J16621l4017m2141o5426
15959A00954k4335k4932p9454J9831J59166P0040j47604j97846j490J67542p2762
15948c0890M1778M1484m4165M4375j27227j9598P9540j6065r5997K6666N7255
15937d2844J55936L5364j02568j77535J5018r510m9634L5804K25193J90567j5437
15926B60354k42040m5473P5089R2880j45781l5209j3992Q3170k8903j65778J49952
$$ plain form
16003 389055 373270 189959 107961 102808 156832 177780 269121 241266 27718 -154863 -195195
15992 -195195 -131789 -96302 108160 143243 124001 -135016 -190226 25538 73197 -44126 -64223
15981 -64223 21236 173757 186699 279299 338432 189649 90812 274988 241106 111086 132236
15970 132236 162267 203005 237745 112405 103057 62041 125917 242538 208521 166380 100954
15959 100954 76619 51687 -27767 -7936 151230 221270 73666 -124180 -125670 41872 -30890
15948 -30890 10888 52372 8207 52582 -74645 -94243 -14703 -30768 -126765 -100099 -42844
15937 -42844 113092 148456 45888 -131647 -116629 -126139 -175773 -139969 85224 275791 260354
15926 260354 18314 -27159 47930 140810 -4971 -40180 -54172 28998 95 -165683 -15731
15915a5731J28729M2235o1426j06209M5300K1485K0082j65039p2605P773j3392
15904a68798R1384Q1934K2493Q3236Q7994K8151M7223J30751r852k20139k94982
15893a20605l9252M2452J69601j1201k7789j12637r1635J27879K5621J2858n1707
15882g6415r2034O1540J83061J35288Q6979q7337j43282K8018k59051j68339J58523
15871a73049L8751l9929M6653m0170P8143J82655L7157l2401r670J7215o739k773
15859I5843k32542P5332K16771n965j03425j8614m6670J7336K28523p6129l7663
15848A12797J30708l4259j30420k7318J24554k76557q7946n8921R431j9099J06042
15837a50988J47851M7151j47547k6112J9874J46106K0517j6486j199J6061k4106
$$ plain form
15915 -15731 112998 155233 93807 -12402 32898 54383 74465 -90574 -163179 -155406 -168798
15904 -168798 -77414 4520 27013 110249 198243 226394 273617 404368 394516 174377 -120605
15893 -120605 -159857 -117405 52196 40995 13206 -99431 -191066 -63187 -37566 -24708 -76415
15882 -76415 -168449 -106909 76152 211440 298419 211082 67800 95818 -163233 -331572 -173049
15871 -173049 -134298 -174227 -127574 -167744 -89601 93054 130211 97810 88140 105355 98616 95843
15859 95843 -136699 -61367 155404 149439 46014 27400 -19270 -1934 226589 150460 112797
15848 112797 243505 209246 78826 51508 176062 -100495 -188441 -247362 -237931 -257030 -150988
15837 -150988 -3137 44014 -103533 -129645 -109771 36335 56852 40366 39167 55228 31122
15826C1122k3411M9725K4513K8220K03121l450l6457m868j44242q9355P8652O9721
15814A83291l0402j6262r823J06472O635j41555R5652J81023J43651n1895r029
15803D57758m499j14086j20271r0122P78O7515J66901o3512j15796j90085k623
15792h042j0358P7581j5854Q8083R9030l6874n4297p5534J05374J68465j2527
15781C25047k20806j81865L2706L3598L6606j55065n7335j5719J08397M8586J32086
15770H6236J8016O3306O4087l1771k7500j3513Q0558j35038P3288J1035j62047
15759B6657J8355q4224n2694L6748N2552l2766N3274J66125j42903r1498J67347
15748A16973O9365q6484m8611k8489P8118J38892J9052l0168P8300j25557j43874
$$ plain form
15826 31122 7711 57436 81949 110169 313290 309840 273383 268515 124273 34918 113570 183291
15814 183291 152889 136627 126804 233276 239911 98356 194008 375031 518682 466787 457758
15803 457758 453259 339173 218902 128780 129558 197073 363974 300462 184666 -5419 -8042
15792 -8042 -18400 59181 43327 131410 230440 193566 139269 63735 169109 337574 325047
15781 325047 104241 -77624 -44918 -11320 25286 -129779 -187114 -202833 -94436 -45850 86236
15770 86236 104252 167558 231645 199874 172374 158861 239419 104381 177669 188704 26657
15759 26657 45012 -39212 -91906 -55158 -2606 -35372 17902 184027 41124 -50374 116973
15748 116973 186338 99854 51243 22754 100872 239764 258816 228648 306948 181391 37517
15737C7517q0224j6254n1024p8234J47604J58909l6858L2342n8716l2543q007
15726A4512K6666J28036j47970m6864L5153L8205n642Q3049P7765o5894r4404
15715D2612K4958R6115o88j59788J7810J01386J24621n2326r5176K479K2437j0846
15703A13594m5173N9840p6123r9182j5726J46082j18492k47034J1045K32018K29856
15692A90705J67407J30437o1932k32952j65138j02630j35061O7082K30569N1676
15682A40163j11024j5930O3457R081p5413p7852J06495J71850J79112M8963j82628
15671B56274j80072K7581P1748o9958L2610m7913n4119R314L8151N7008J31534
15660B72158j33239r2098n5710k1257l5039K6689J0672j10350o785K31939J25429
$$ plain form
15737 37517 -42707 -58961 -109985 -188219 -40615 118294 81436 113778 55062 22519 14512
15726 14512 41178 169214 21244 -25620 9533 47738 42096 125145 202910 137016 42612
15715 42612 67570 163685 162997 3209 21019 122405 247026 194700 99524 102003 124440 113594
15703 113594 68421 128261 52138 -47044 -62770 83312 -35180 -282214 -271169 -39151 190705
15692 190705 358112 488549 426617 193665 28527 -74103 -209164 -142082 88487 140163
15682 140163 29139 13209 76666 85747 10334 -67518 38977 210827 389939 438902 256274
15671 256274 76202 103783 175531 105573 138183 90270 36151 45465 83616 140624 272158
15660 272158 138919 46821 -8889 -30146 -65185 -38496 -27824 -138174 -144959 86980 212409
15649B12409j5590q6128k80359N7615O371J12477J016n0237J3788P7404r3651
15638d4885P8758q259J73891J8146j82093j15642o064J20326l2799J44082P0672
15627B16133l1861l7993O433l3917n4763k9220J18641K00140O2797j6855J12663
15616E12198r1489L9070n4330j04658J01163R5916j56292j00448J18258J2579
15606C71967p0556J93864J6121K62439J52603J85252K22483J43288K14263K02552
15596A894276K02617M0250P7867K9327m3723K6597J67135O6161k29760k67686
15586A963061k18243k78202k23821o2094j19597m5239q5259O0859q4649j32362
15576G74454k875L2907j96951l9628M5191r1766K8129j25671M9814J57276j20285
$$ plain form
15649 212409 196819 110691 -169668 -112053 -105682 6795 7811 -42426 -28638 48766 -44885
15638 -44885 33873 25614 199505 217651 35558 -80084 -86148 34178 1379 145461 216133
15627 216133 184272 146279 152712 118795 64032 34812 153453 353593 416390 399535 512198
15616 512198 420709 459779 405449 300791 401954 497870 341578 241130 359388 371967
15606 371967 301411 495275 511396 773835 926438 1111690 1334173 1477461 1691724 1894276
15596 1894276 2096893 2137143 2215010 2244337 2200614 2227211 2394346 2460507 2230747 1963061
15586 1963061 1744818 1466616 1242795 1180701 1061104 1015865 930606 991465 906816 774454
15576 774454 771579 804486 607535 567907 613098 521332 549461 423790 473604 630880 510595
15565E10595k9546L3546o6940M7200j7031j36011j34980j1590o6505J22239J47659
15554C98636j2177k5018M365J77993l0949j18480J05329j83140j21756O3164m1670
15543B16297L3642L2114P1628J01670J10772K9925j99105p7167L1059L9421J17469
15532E07725m9029l1645J04233Q7930j31610k21482j05562J3299P1030k117o9485
15521A73287M9894q4262q0219O6515N2766J88598k9294j87973m5103Q0703J81595
15510C66507N1187m9828j36129j52945L4002k666j36995K3249o5383M9200L3245
15499A3444J18622R4436m4058l608k8504j8505R6657K7011M6893J17931m4076
15488C76243n7143k28365j60487J25598R7378J25110o8661n7894k5555M6786J46307
$$ plain form
15565 510595 481049 514595 447655 494855 477824 341813 206833 195243 128738 250977 398636
15554 398636 386459 361441 365806 543799 512850 394370 499699 316559 194803 257967 216297
15543 216297 249939 282053 353681 455351 566123 596048 396943 319776 350835 390256 507725
15532 507725 458696 427051 531284 619214 487604 266122 160560 173859 244889 242772 173287
15521 173287 223181 138919 58700 125215 177981 366579 337285 149312 104209 184912 366507
15510 366507 417694 367866 231737 78792 112794 110128 -26867 -3618 -69001 -19801 13444
15499 13444 132066 226502 182444 178836 150332 131827 228484 255495 302388 420319 376243
15488 376243 319100 90735 -69752 55846 153224 278334 209673 151779 126224 173010 319317
15477C19317O6850j22240k64639q0958J87979J34272J14986J3403P3245J2672
15467D54887n4564p1715L4929j27067j2771K36427J3739J2645K6688k4482p3156
15456D15560j27354l667P5803k1578J05913K10944q0207l9755Q3641J76310R8023
15445H93633L984L4589P4673J53847K73198M64649N67075M20253L04613N03847
15435C694361N28377M38593N34537K48508J44763j40761j59438o468j68592l07608
15425D806272o09079n22682l95846m43408m45639k75429k86450j46748o4891j23
15415A615977j19072j81573o6940J11739m4815k16860q818p2311j8739m6301j1904
15404I40383o6255m4685k599j11872l3303j9366L8384p427p5739L518p8743J21130
$$ plain form
15477 319317 386167 263927 -712 -81670 106309 240581 355567 368970 442215 454887
15467 454887 400323 328608 363537 236470 223699 460126 473865 486510 513198 488716 415560
15456 415560 288206 284539 360342 338764 444677 655621 575414 535659 619300 795610 893633
15445 893633 897617 932206 1006879 1160726 1433924 1898573 2465648 2885901 3190514 3694361
15435 3694361 4222738 4661331 5195868 5444376 5589139 5448378 5288940 5282472 5113880 4806272
15425 4806272 4197193 3674511 3278665 2835257 2389618 2114189 1827739 1680991 1616100 1615977
15415 1615977 1496905 1315332 1248392 1360131 1315316 1098456 1089638 1017327 998588 952287 940383
15404 940383 874128 829443 826844 714972 681669 662303 700687 693260 617521 621039 542296 663426
15392F63426K18180k394k42813j53238J3122j49035r0099J53550J78699M3740
15382F33138q0146j38086J6509j5868J19747N4193J24379J23236J35099k1918
15372I50283J2278N1122K9709n7838k8481j22704m8248P5742K34925L9698J39288
15361A275774K47185K18428J57214J32325Q0998j03358k73235q4538J84332o9827
15351A765298l17066k05535k88915j67235k1387q1630j11336j6711m2895O4341
15341E76929M8747p2911K0848q4827P6595L12965p4089j75465O8688n7595j08182
15330E31703j33005K89909k3836m3859j08566l9412r165n4573o409L6529l3878
15319D05438R6151o2414k50411K1631R9988J51475L7465L3915q5577k04700J23191
$$ plain form
15392 663426 881606 879212 636399 483161 496283 347248 257149 410699 589398 633138
15382 633138 552992 414906 431415 415547 535294 589487 713866 837102 972201 950283
15372 950283 962561 1013683 1043392 985554 957073 834369 786121 861863 1096788 1136486 1275774
15361 1275774 1522959 1741387 1898601 2030926 2111924 2008566 1735331 1650793 1835125 1765298
15351 1765298 1448232 1242697 953782 786547 765160 683530 572194 555483 512588 576929
15341 576929 625676 552765 573613 488786 565381 878346 804257 628792 697480 639885 531703
15330 531703 398698 688607 664771 620912 512346 472934 463769 409196 402787 439316 405438
15319 405438 501589 439175 188764 210395 310383 461858 499323 533238 447661 242961 366152
15308C66152J00751j13646j45074o7578J10901j1225m509J27658J13674m9449
15298D27655m3283m5176R513j5620k6654K2406q6523k07957k2823K3877K9624
15287F5039J16741l349N8490O0017k9715P2836o1296k7878J0641J27652M882J6515
15275D10575R5413J13924k49295r2997L5512k7826l690R4891J1155L6966J35235
15264E59863k9556K3016m6161Q6762j80661k0360P5051J63835L9411j01692k9334
15253E40174o0934J90826J37523J74354J48455L9411q4306r2913P6047o7052L6420
15242A038005j1760o3429k70983o3744J03140N9797j23891O3852Q6680j8567J74573
15231I73673N6506J10870m0623j89574j6256m8025k8624l6917K23839J46559R009
$$ plain form
15308 366152 466903 353257 208183 140605 251506 240281 235772 363430 477104 427655
15298 427655 384372 339196 348709 333089 306435 328841 242318 34361 11538 35415 65039
15287 65039 181780 178431 236921 296938 267223 340059 278763 250885 261526 389178 394060 410575
15275 410575 505988 619912 370617 277620 313132 285306 281616 376507 387662 424628 559863
15264 559863 530307 553323 507162 593924 413263 392903 467954 631789 671200 569508 540174
15253 540174 479240 670066 807589 981943 1130398 1169809 1085503 992590 1068637 1001585 1038005
15242 1038005 1026245 962816 691833 628089 731229 791026 667135 730987 817667 799100 973673
15231 973673 1030179 1141049 1100426 910852 894596 846571 817947 781030 1004869 1151428 1160437
15220A160437l0992m2249o229J8610j26165p6269K29316K35205k589p8739k6209
15209A254127m0631M5403q630P7051n8865k3223q2743O7293J71649J69156J46707
15198A717294o8247j84335m2977J07134P3444R5457P5162k040o2266J56613K3211
15187A888450K21476J19423m2900M877m4223k70002K1607J68528L5114N5257P1987
15176B229594O4920K8051J28439J21607K08202L06952J52197L7864J28125L5037
15166C440988K00577K08024K33119P7090J25039J22289K83734L29320L71866L94734
15156E786780L76931M27988N03525L71185M49325Q66779J032839J075948J359400
15147A2250700J684371J893964K160289K623199L361168L881747M953585O293940
$$ plain form
15220 1160437 1129445 1087196 1080967 1099577 973412 897143 1126459 1361664 1359075 1280336 1254127
15209 1254127 1213496 1258899 1250269 1327320 1268455 1245232 1162489 1229782 1401431 1570587 1717294
15198 1717294 1649047 1464712 1421735 1528869 1602313 1697770 1772932 1770892 1708626 1865239 1888450
15187 1888450 2109926 2229349 2186449 2191326 2147103 1877101 1898708 2067236 2102350 2157607 2229594
15176 2229594 2294514 2322565 2451004 2572611 2780813 3087765 3239962 3277826 3405951 3440988
15166 3440988 3641565 3849589 4082708 4159798 4284837 4407126 4690860 5020180 5392046 5786780
15156 5786780 6163711 6591699 7095224 7466409 7915734 8782513 9815352 10891300 12250700
15147 12250700 13935071 15829035 17989324 20612523 23973691 27855438 32809023 39102963
15139C9102963Q497845J1957586J7359922K4712150L3421782M1589792M6774762
15132B23416802M8107804M6474261M3874742M0035824L3602818K4297418J2410113
15125D72219782m64480j3239008k4098147l1826516l7160254m0614719m2516971
15118B82299687m2831078m0040792l3433629k5334546j8185477j3193814r999413
15111I9280938q182664o897770n745478n248663m474311l881686l530038l007135
15103E8313193l048233k944234k510489k319589j922154j635334j630059j598342
15095D0704759j487980j291764j285262j235582j179871j284522j122711q53098
15087C0963969r00060r53380q82599q58670r54762q04856n11623o54512p38000
$$ plain form
15139 39102963 47600808 59558394 76918316 101630466 135052248 176642040 223416802
15132 223416802 271524606 317998867 361873609 401909433 435512251 459809669 472219782
15125 472219782 471755302 458516294 434418147 402591631 365431377 324816658 282299687
15118 282299687 239468609 199427817 165994188 140659642 122474165 109280351 99280938
15111 99280938 91098274 84200504 78455026 73206363 68732052 64850366 61320328 58313193
15103 58313193 55264960 52320726 49810237 47490648 45568494 43933160 42303101 40704759
15095 40704759 39216779 37925015 36639753 35404171 34224300 32939778 31817067 30963969
15087 30963969 30063909 29110529 28227930 27369260 26414498 25609642 25098019 24443507 23705507
15078B3705507n63434o31631o43826o48562p21775o81119n03817o56487n54411
15069A8100445m73269m75120n22828o78632m97994k36950m09257n55919l57931
15060A3892545l05278k41733l07826m13950m90474m76840l63211k78708j78889
15051A0835636j51559q3029k99856k84667l22743l21879j38284k04649k57864
15042H771106l13322j93473q9451l52775k58736j58184k54965j69794j62567k76269
15032F541570j39666q3006O8963J8940j37749l42755l09270k81658j14235k71390
15022D949744k00933j13956J02003o3760k36324j15290n3470j08488q7219P834
15012D080141m3448k53933m986m9716j27872j80452J1614m8855p6710j18498p2968
$$ plain form
15078 23705507 23142073 22510442 21866616 21218054 20496279 19815160 19311343 18654856 18100445
15069 18100445 17627176 17152056 16629228 15950596 15452602 15215652 14806395 14250476 13892545
15060 13892545 13587267 13345534 13037708 12623758 12133284 11656444 11293233 11014525 10835636
15051 10835636 10684077 10601048 10301192 10016525 9693782 9371903 9233619 9028970 8771106
15042 8771106 8457784 8264311 8174860 7822085 7563349 7405165 7150200 6980406 6817839 6541570
15032 6541570 6401904 6318898 6387861 6406801 6269052 5926297 5617027 5335369 5221134 4949744
15022 4949744 4748811 4634855 4736858 4673098 4436774 4321484 4268014 4159526 4072307 4080141
15012 4080141 4036693 3782760 3777774 3728058 3600186 3419734 3431348 3382493 3305783 3187285 3114317
15001C114317l4704k21600l39181p7671J06814j6243K5458M2009j97431Q1933
14991B483701M448j23011j66332j9416m2496q8585q0666O9911J5665k1225j70773
14980A861221n7443R7670N5872j88888j56843K8977J54492J86945j18532O5045
14970A928516O6846n0204j4042j2734n8786L4806O2229j32985k30927j17866k20522
14959A254331N175O8989J17807n7441r1398k00171O5886O8033j40242k0183o5694
14948A005092j87278J26925J49948k03564r3305J449N5292j57266J89863J40513
14938A027669j17670o0347j59691K8509K44931K39476L41460M11775L53089L45014
14928B654215j15767p2700k09777k54659j98474q3313k07308k61518j20197k80920
$$ plain form
15001 3114317 3079613 2858013 2518832 2441161 2547975 2531732 2557190 2599199 2401768 2483701
14991 2483701 2488149 2365138 2198806 2179390 2136894 2048309 1967643 2037554 2053219 2031994 1861221
14980 1861221 1803778 1901448 1957320 1768432 1611589 1640566 1795058 1982003 1863471 1928516
14970 1928516 1995362 1945158 1931116 1918382 1859596 1894402 1956631 1823646 1592719 1474853 1254331
14959 1254331 1259506 1328495 1446302 1388861 1297463 1097292 1163178 1231211 1090969 1070786 1005092
14948 1005092 817814 944739 1094687 891123 797818 799267 854559 697293 887156 1027669
14938 1027669 909999 849652 689961 718470 963401 1202877 1544337 1956112 2309201 2654215
14928 2654215 2538448 2465748 2255971 2001312 1802838 1719525 1512217 1250699 1130502 849582
14918H49582j09724J40952R0786k4863R1380o4019k43439j45622N9568j84317
14908D60284l110N0033k109R6143L2507N3320j32897p3580J1848O2108J2095r4419
14896D72223Q0596K3182j04052q5762M5175p8975n1439k6469n395p877L7287q7102
14884B11392J24398o0070M1172J10176L7377j158j01970q9040J35024p2791j38523
14873A95987q6029O6609o097n5370J05239J03181M9191n4897m8893N7726M6834
14862C73481j68820m1732J9572J21906Q7339k9040r2759O8671q4891j18458L5305
14851A70574o3075P9942J42690R3878j40033r6435J11315j447l1092R8371K7934
14840C92622K5739Q7911J2131j87521j69226q1260L0006p2584q6692N5283m0977
$$ plain form
14918 849582 739858 880810 971596 946733 1038113 974094 730655 585033 644601 460284
14908 460284 457174 507207 505098 601241 633748 687068 554171 480591 492439 554547 566642 472223
14896 472223 552819 576001 471949 386187 431362 352387 300948 274479 269084 261207 298494 211392
14884 211392 335790 275720 316892 427068 464445 463287 361317 272277 407301 334510 195987
14873 195987 109958 176567 170470 115100 220339 323520 372711 317814 268921 326647 373481
14862 373481 204661 162929 182501 304407 391746 362706 269947 338618 253727 135269 170574
14851 170574 107499 187441 330131 424009 283976 187541 298856 297409 266317 364688 392622
14840 392622 418361 506272 518403 330882 161656 80396 110402 37818 -48874 6409 -34568
14829c4568k9713n3992M3072J64185O0406m888j05573O024J88139P3849j94762
14818A12179k4294M032j7631p1799K4344J8520j40244L8330Q6214J36914l8591
14807A27974j07419J12457J01684j6301r763j01426j47038k22666j4889Q6049
14797a91338Q1710l968m6494O1975M9222L0865J037k7454q3472J02345K2459L8605
14785C5492k33810j42057J4735J81185J93403M0254R7313J38785j57425j80605
14775a2730J4095J26056J49592o6768k57084m7053l0204J13990J93121o3967n5608
14764F3440m5754K31972Q8065j04639m8966j33914j53811j26283J16173P8286
14754c5431R9481q0092l9358N3092l5891J87715J6794r5787o1634J7117N6121
$$ plain form
14829 -34568 -64281 -118273 -75201 88984 149390 144502 38929 44953 233092 306941 112179
14818 112179 87885 91917 74286 2487 26831 45351 -94893 -56563 29651 166565 127974
14807 127974 20555 133012 234696 218395 208632 107206 -39832 -262498 -277387 -191338
14797 -191338 -109628 -113596 -160090 -98115 -48893 -18028 -16991 -44445 -127917 -25572 -3113 35492
14785 35492 -198318 -340375 -325640 -144455 48948 89202 186515 325300 167875 -12730
14775 -12730 1365 127421 277013 210245 -46839 -93892 -124096 -10106 183015 119048 63440
14764 63440 17686 249658 337723 233084 184118 50204 -103607 -229890 -113717 -35431
14754 -35431 64050 -16042 -55400 -2308 -38199 149516 166310 70523 8889 26006 82127
14743H2127p8148n9910O6591N4916n0707k2512n5716J09726L7248r603N2789o5815
14731F0986J19923Q4718m7975n3895j54467j29048M4160o6467k8226P8029p4023
14720a66285J3289J27858K8227K8577O538J01603J10374j76085j07436k4371p1823
14709a29534j7788n6896N654J71580J10099m8646j1535J12J64227R90j433j04186
14697H2644L183L4180l0242J14886Q8794j16056p2725j00724O9283j18141j40417
14686a85335j38452K19149J64532n207P4416j07214j84104M5473P5945R8673l7674
14675B0202k7690j1769J72373K05589l9511M5964j4611j5518r6300J36557K32027
14664F07313j24264j7397K07632L42581K24481J69694N6202J83310M27858K65827
$$ plain form
14743 82127 3979 -55931 10660 65576 14869 -7643 -63359 46367 83615 74012 126801 60986
14731 60986 180909 265627 217652 163757 9290 -119758 -75598 -142065 -170291 -92262 -166285
14720 -166285 -152996 -25138 3089 31666 38204 139807 250181 74096 -33340 -57711 -129534
14709 -129534 -147322 -204218 -198564 -26984 83115 34469 22934 23046 187273 188263 186830 82644
14697 82644 85827 120007 89765 204651 293445 177389 104664 3940 73223 -44918 -185335
14686 -185335 -323787 -104638 59894 54687 129103 21889 -162215 -116742 -40797 57876 20202
14675 20202 -7488 -19257 153116 358705 319194 365158 350547 335029 238729 375286 607313
14664 607313 483049 465652 673284 1015865 1240346 1410040 1466242 1649552 2077410 2343237
14654B343237P7802N2376j3434j24620n7907M3553j56235j82893k43454l00932
14644A437493k99582k93200r1537n4390j20182j91748J2705J14658j40841p7908
14634B95468J00464l6129N2764j48989j26062K06286K9153j59213r2381M437q604
14623A17194m3591L8024m2745q7747p622J03475J43239R8069n390r7414p9541
14612A35951j17782m3869m712Q7495O5892K6313J16422k9287o4652j01227j85179
14601a14635r3551J11268J98149k3349L102M4627j61616r2827m7746L1736K98094
14590A53252N0773N0008R4737r8088m088J11258j2022j72512r4449j51808L4752
14579c8187J16215M4336J96207N5859k36754n3893q0422R7830K50034o2476j70495
$$ plain form
14654 2343237 2421039 2473415 2459981 2335361 2277454 2321007 2164772 1981879 1738425 1437493
14644 1437493 1137911 844711 753174 698784 578602 386854 399559 514217 373376 295468
14634 295468 395932 359803 412567 263578 137516 343802 372955 213742 121361 125798 117194
14623 117194 73603 111627 68882 -18865 -26487 76988 220227 318296 312906 215492 135951
14612 135951 18169 -25700 -30412 57083 122975 149288 265710 236423 171771 70544 -114635
14601 -114635 -208186 -96918 101231 77882 80984 125611 -36005 -128832 -176578 -144842 153252
14590 153252 204025 254033 348770 250682 246594 357852 345830 173318 78869 -72939 -38187
14579 -38187 78028 122364 318571 374430 137676 83783 3361 101191 351225 288749 118254
14568A18254m6597M3616l4624L3029N4928P7692j22132p0748J4828j02039J27037
14557I3244J11795L820j46850m1019L1138m788l2883j64808K8047m6911L4859
14546a34356J08505j3280Q1386J02931R5350K4583j34431R489J12645o122k06022
14535D0678j00143K05767J10631k85997o5440J23510J31888P3776q3097m0248
14525A11325l547j35311r8187J7560o3330J2344k3910J07505J52787J06034o841
14514A76429j64437k395K959p3761K1196n0610l0573J68918m3292J9741R1627
14503A15802j43099J12329O9078j36419Q2427O38q1908j5016r5440j55715J07622
14492a39701j0043J15266J33846k34172j73619Q1197P4283j281j21648P7173P3429
$$ plain form
14568 118254 71657 115273 80649 113678 168606 246298 124166 53418 68246 -33793 93244
14557 93244 205039 208859 62009 20990 52128 47340 14457 -150351 -122304 -169215 -134356
14546 -134356 -25851 -39131 42255 145186 240536 265119 130688 140177 252822 246700 40678
14535 40678 -59465 146302 256933 -29064 -94504 29006 160894 234670 151573 111325
14525 111325 107778 -27533 -125720 -108160 -171490 -159146 -183056 -75551 77236 183270 176429
14514 176429 11992 9597 12556 -61205 -40009 -90619 -121192 47726 4434 24175 115802
14503 115802 -27297 85032 154110 17691 100118 100756 18848 3832 -91608 -247323 -139701
14492 -139701 -149744 -34478 99368 -134804 -308423 -227226 -152943 -154224 -275872 -198699 -125270
14481a25270Q332o9620Q9729J00587Q6069p6750o7053P7800j09653r8248q3614
14470b67691J3019k969k3793r672J34139J8110K2007j8654K20737J21082k32165
14459b5850l1315N149p2804j73937J0549K74271Q362j58663J28833J00226N4373
14448A19194J5534k40280j23419j39114P4719J73581J58859J25243N1433P353
14438B23103n7428j61459k23228J75247p913k9501j43983K7627K06395J18287
14428A27147M3881N4436Q2674Q3865j5617l491k7044j88898J0540o6155o0135
14417D1203m5643J20054L7412j59823j24083J27440J08122k7113l7359P0240o7010
14406D3440o4104o0214j03309n1506j4786K794J05180J04489J39988J70641O89
$$ plain form
14481 -125270 -116938 -186558 -96829 3758 89827 13077 -53976 23824 -85829 -184077 -267691
14470 -267691 -254672 -257641 -281434 -291106 -156967 -138857 -116850 -135504 85233 206315 -25850
14459 -25850 -57165 -52016 -124820 -298757 -288208 -13937 -5575 -164238 -35405 64821 119194
14448 119194 134728 -105552 -228971 -368085 -293366 -119785 39074 164317 215750 223103
14438 223103 165675 4216 -219012 -43765 -51678 -81179 -225162 -197535 8860 127147
14428 127147 171028 225464 308138 392003 376386 372895 345851 156953 167493 101338 41203
14417 41203 -4440 115614 153026 -6797 -130880 -3440 104682 77569 40210 110450 43440
14406 43440 -20664 -80878 -184187 -235693 -250479 -247685 -142505 -38016 101972 272613 273302
14395B73302qM204p9008M4594k0213j26029j74438m6833l8056p2871N812R4492
14383a35052M5197o0567N711J13751J26423J34864J6761Q499j25925j71882k19753
14372b61973L4707J67271J64619j53622o8544j07255K6579M7747M2426J63998
14362E5953J92175p3512n5779p5753j22473N3062q163j80443N8141P7773L7587
14351d1432J74101J14198p3351j14711n6831o3970J6120M4928P4974M0991L1844
14340A46861j18922k4548P8162j39151k93015r6082Q8638J58121J70123P2239
14330D2426J7950o7935j76405l4526R2872K12471j21799n5234O3141J42173M0004
14319A55138j1650J2727m0380k42107l7089J36160K73180J51018j80453j93846
$$ plain form
14395 273302 273294 277498 198490 243084 222871 96842 -77596 -124429 -162485 -235356 -229544 -135052
14383 -135052 -89855 -150422 -144711 -30960 95463 230327 247088 255587 129662 -42220 -261973
14372 -261973 -227266 -59995 104624 -48998 -117542 -224797 -198218 -150471 -108045 55953
14362 55953 248128 174616 118837 43084 -79389 -26327 -34490 -214933 -156792 -79019 -41432
14351 -41432 132669 246867 173516 58805 1974 -61996 -45876 -948 74026 115017 146861
14340 146861 27939 3391 81553 -57598 -350613 -446695 -358057 -199936 -29813 42426
14330 42426 60376 -7559 -183964 -218490 -125618 86853 -34946 -90180 -27039 115134 155138
14319 155138 143488 156215 115835 -126272 -163361 -27201 245979 396997 216544 22698
14309B2698j59592K4088R7651P3858N4969M3538k3960J20740j3201j6761j5191
14298B08837n8132k5985p7010j11102p693K44478K21468m0734j63881J1677n9985
14287A41938j86602q4291J0596Q7834o1767K9722R8142j736R7403J0735j00029
14276D1945o0008o8102n4065p7474j97179r0491O5426K81811M992k46J8020Q8412
14264d6959k4993K8181P9549K2436o0532n5802Q0388r7904j4917R6141r4422j5832
14252a04666M8269R9415k1416n5174p8913J42885L7411k6583N1164Q1874R7032
14241B71298j9578j39159J57j171n5370j21529O2646K5013J41185K71705j84216
14230B50981r9960J42555J6734k77573m7068k567Q8576m9156L8632M8967k23509
$$ plain form
14309 22698 -136894 -112806 -15155 58703 113672 157210 133250 253990 240789 224028 208837
14298 208837 150705 124720 47710 -63392 -71085 173393 394861 354127 190246 201923 141938
14287 141938 -44664 -128955 -118359 -30525 -92292 -62570 35572 33836 131239 141974 41945
14276 41945 -18063 -86165 -140230 -217704 -414883 -505374 -439948 -158137 -153145 -153391 -135371 -46959
14264 -46959 -71952 -43771 35778 58214 -2318 -58120 22268 -75636 -90553 5588 -88834 -104666
14252 -104666 -56397 43018 21602 -33572 -112485 30400 67811 41228 92392 174266 271298
14241 271298 251720 112561 112718 111547 56177 -65352 -2706 22307 163492 435197 250981
14230 250981 151021 293576 310310 32737 -14331 -16898 71678 22522 61154 110121 -113388
14219a13388J5154J77375j8828r0259M7918j14044M3794N3021P532J18729m317
14208A22687j04444M1583p6401p8835P9783L8189r8158j21820L964L9280J23453
14197c0719N0961n459M0981M7722J15347J31056p6091j58932j09960j11845m0275
14186a47214l5235K0295n6957J25580J14772n8726j98689k41967J03316K47855
14176a26970K07237r5287r4137J18196j6144j80249N4369P4070o2360q6106r8097
14165c05478m9379R7015L5668L5762J16972Q0284j69736P5649R1298P6590m4724
14154C9921o0942J7093L3887R1515L2599P1927j96561j03381L9960j13497q0648
14143b28127J26923R9089k06421p0959N6373K78992J55357j845J1736o207n6470
$$ plain form
14219 -113388 -98234 79141 60313 -29946 17972 -96072 -52278 743 8275 127004 122687
14208 122687 18243 59826 -16575 -95410 -15627 22562 -75596 -197416 -193452 -154172 -30719
14197 -30719 20242 14783 55764 103486 218833 349889 273798 114866 4906 -106939 -147214
14186 -147214 -182449 -162154 -219111 -93531 21241 -37485 -236174 -478141 -374825 -126970
14176 -126970 80267 -15020 -109157 9039 -7105 -187354 -132985 -58915 -121275 -207381 -305478
14165 -305478 -354857 -257842 -222174 -186412 -69440 10844 -158892 -83243 8055 84645 39921
14154 39921 -21021 -3928 29959 121474 154073 226000 29439 -73942 -33982 -147479 -228127
14143 -228127 -101204 -2115 -208536 -279495 -223122 55870 211227 209382 221118 214911 158441
14132A58441j65956k20978l9522M0185Q5999r278m8001J1921m853L7160J52746
14121b136P5066o2564j09409k13551J9292q259Q2326p242L5928J48481R6978K6769
14109H1679k20965m0141N6267P5923J01170m6686j39020O7855r896m7400J80703
14098E9489M661k11788J0391J65289L5421j78073j41253j72466M0112K42092J60102
14087A3977L0613k6385J18092k63025o1182J54032N6333L2906J1084j43166J4038
14076f2683P6191J4623J03224N6440m2764n1518L1133n1142l2385k8475M9656
14065F2300j27960k4358q1297p8447j17678J52295K34277N6884j36012N1401O7447
14054E8852m7615o7934j49252j9775J19778M3185K4591J15432m840j09649m1054
$$ plain form
14132 158441 -7515 -228493 -268015 -227830 -141831 -151109 -199110 -187189 -192042 -154882 -2136
14121 -2136 72930 10366 -99043 -312594 -293302 -301561 -219235 -226477 -190549 -42068 54910 81679
14109 81679 -139286 -179427 -123160 -47237 53933 7247 -131773 -63918 -73814 -121214 59489
14098 59489 64150 -147638 -137247 28042 63463 -114610 -255863 -428329 -388217 -146125 13977
14087 13977 44590 18205 136297 -126728 -187910 -33878 22455 55361 66445 -76721 -62683
14076 -62683 13508 28131 131355 187795 145031 93513 124646 73504 41119 12644 62300
14065 62300 -65660 -90018 -171315 -249762 -367440 -215145 19132 76016 -59996 -8595 58852
14054 58852 11237 -56697 -205949 -225724 -105946 -62761 -38170 77262 72422 -37227 -78281
14043g8281p7014j1865j18377Q1012j6101j55383o6820O7414Q6229J73961J85226
14032G0001J10006K1293j78409k94289o7673M7371N584N140J69564K12637M9702
14021A50927j92025j17598n627l1909k8158m548Q9637J17627j00196l7397K55853
14010I6586o5703n0441J0620O8244o4652k2713o3728P4636Q4555K38204k3415
13999B82193l11801j13646k8019L003l0109O6627Q4532j2626j49697p3211J50655
13988a32099q3527o2645R0298P7773j0312K5144M2741j23408l1223L2377K31245
13977E6364l4834j98703n7574R1602K01696J08094j51217J8890J30038j1818m8086
13966A04452j58046Q16l7680j02276k2755J58625N0634p6632j12626j6629J73557
$$ plain form
14043 -78281 -155295 -167160 -285537 -204525 -220626 -376009 -442829 -375415 -289186 -115225 70001
14032 70001 180007 201300 22891 -271398 -339071 -291700 -286116 -280976 -111412 101225 150927
14021 150927 -41098 -158696 -164323 -196232 -224390 -228938 -139301 -21674 -121870 -159267 96586
14010 96586 30883 -19558 -8938 59306 -5346 -28059 -91787 -17151 67404 305608 282193
13999 282193 -29608 -143254 -171273 -168270 -198379 -131752 -47220 -59846 -209543 -282754 -132099
13988 -132099 -215626 -278271 -187973 -110200 -120512 -95368 -52627 -176035 -207258 -174881 56364
13977 56364 21530 -177173 -234747 -143145 58551 166645 15428 34318 164356 152538 104452
13966 104452 -53594 -52778 -90458 -192734 -215489 -56864 -6230 -82862 -195488 -212117 -38560
13955c8560J83774N7719n5964p7951j59521o5554K3165q1987P0321J28993K7103
13944A1538k36836L2092N4685O3755P5684j6631j9061K7625N5478j16145J46719
13933G8903L8737O1794L7522J11667J0729L6397o1521j68811r3232Q7223p8035
13922F1373l4132P3514l7897j54262L395J26942J30987N5271j82349n5192L9286
13911B6936M3640m735K6995J2800K7884o9009k1769L632O813J72152j21650r3508
13899A0181N585J29050L4454j79232q4877K996j3650M4550K30637m9016q7318
13888D3360m6335l3269p4122q7012P5429M5096o6923M6363k3344j1662Q2776j685
13876e1328N7507P0219n965j05842M6785n8526J5800O8657O0737r468m0343O2264
$$ plain form
13955 -38560 145214 202933 146969 69018 -90503 -156057 -132892 -214879 -144558 -15565 11538
13944 11538 -225298 -193206 -138521 -74766 918 -15713 -34774 -7149 48329 -67816 78903
13933 78903 117640 179434 216956 328623 339352 375749 314228 145417 52185 139408 61373
13922 61373 27241 100755 62858 -91404 -88009 38933 169920 225191 42842 -12350 26936
13911 26936 70576 65841 92836 105636 133520 64511 42742 46374 53187 225339 103689 10181
13899 10181 15766 144816 179270 38 -84839 -81843 -95493 -50943 179694 130678 43360
13888 43360 -2975 -36244 -110366 -197378 -121949 -76853 -143776 -97413 -120757 -132419 -49643 -51328
13876 -51328 6179 76398 70433 -35409 11376 -47150 -31350 37307 98044 88576 48233 110497
13864A10497J13351l7366k31203m2021J11416J41131r2521N2223j01522k2136
13854A849M1909r7916J5623R438m6128L4515j28162Q190J0810Q5243j5449N8589
13842b1489K2367p8636m9130n4296Q4284J9494o3792M352j3325N3327J89481j175
13830I1462l8315N3347K880J70037O8496k39442j84215M0316J20069M2498q0805
13819D6328O7758J01764j14566k16412j51731N4437J02387J38080K5182k4095
13809B9132Q5884k94372J0273J04740J6421l5506M8906J74620o154j22741L9930
13798E1133O6998j88334o3309J59934J12848j19909l7530o8952J7196j97292N8853
13787b08364O2225o266J43260J25410j11076n7708J15460K1604j03502K4175O1956
$$ plain form
13864 110497 223848 186482 -44721 -86742 24674 165805 73284 125507 23985 1849
13854 1849 43758 -54158 -38535 -29097 -75225 -40710 -168872 -160682 -149872 -64629 -80078 -21489
13842 -21489 878 -77758 -126888 -181184 -96900 -77406 -141198 -136846 -150171 -96844 92637 91462
13830 91462 53147 106494 109374 279411 347907 108465 -75750 -35434 84635 127133 46328
13819 46328 114086 215850 101284 -115128 -266859 -212422 -110035 28045 53227 29132
13809 29132 115016 -179356 -169083 -64343 -47922 -83428 -34522 140098 133944 11203 51133
13798 51133 118131 -70203 -133512 26422 139270 19361 -18169 -87121 -69925 -267217 -208364
13787 -208364 -146139 -152405 -9145 116265 5189 -52519 62941 84545 -18957 5218 67174
13776F7174k0793j47312j78859M8108R7228K31226k9377j96187M8511J15816M8868
13765H4403J31491L1692j55108J66470l5459k15499O2974N4785l0143N631j38193
13754c6956n9907K9083n3897n4584o0152J78788K9402J22415O738q7349O6016
13743G9597K81733J6575k57156j35510j52592M7223J58965q5941j42463J23536
13733f6033K1046J2307O9567K08455N470j11648k12173N1915N2824l138n8833
13722c0241n1179l3731J47770P2698R8995K23086J9887J6685p4924j71510k9443
13711A88093K1841q7793j15701k19951M9574J23484O0929N255M7644j04246r6318
13700a27189J41643N5982O5113j59718j00776m7170n7002J04725J23077P8130
$$ plain form
13776 67174 46381 -100931 -279790 -231682 -134454 96772 67395 -128792 -80281 35535 84403
13765 84403 215894 247586 92478 258948 223489 7990 70964 125749 95606 101237 -36956
13754 -36956 -96863 -67780 -121677 -176261 -236413 -57625 -28223 94192 100930 13581 79597
13743 79597 361330 377905 120749 -14761 -167353 -120130 38835 -47106 -189569 -66033
13733 -66033 -44987 -32680 36887 245342 250812 139164 -73009 -21094 31730 28592 -30241
13722 -30241 -81420 -115151 32619 105317 204312 427398 447285 463970 389046 217536 188093
13711 188093 209934 122141 6440 -213511 -163937 -40453 20476 25731 73375 -30871 -127189
13700 -127189 14454 70436 135549 -24169 -124945 -172115 -229117 -124392 -1315 76815
13690G6815p8859o7406R8910J42764j19393j33668L3077N1865K1054k3256P4399
13679G6302M6010J2562l091l1840J00515r5117m8326p3523R6015K7703P0376J3563
13667A91149N149j55436p9063J55127N9819j3285j57965l5834J34550Q4913o0135
13656A28989j16859n7229K4836o420j5155L9323m7875k4063j03516O4837P402
13645a05730J53647k8657j72954m8101p7220N0087O9018l8847Q7276R8127j6560
13634b9914n0415L428j02051L30R2391J34525J90969K2957q4430m2799J45427
13623B80418J27644k31651p0206P7452n968j38482m4252K2006J4845j62191j95508
13612c25893l874R8688l6621K47561K12455Q7183r9777l11413j42544J59851R2437
$$ plain form
13690 76815 -2044 -69450 29460 172224 52831 -80837 -47760 4105 25159 1903 76302
13679 76302 122312 134874 131783 99943 200458 105341 57015 -16508 79507 107210 177586 191149
13667 191149 196298 40862 -38201 116926 176745 163460 5495 -30339 104211 189124 128989
13656 128989 12130 -45099 -20263 -26683 -41838 -2515 -50390 -74453 -177969 -113132 -105730
13645 -105730 47917 19260 -153694 -201795 -279015 -228928 -159910 -198757 -111481 -13354 -29914
13634 -29914 -80329 -76901 -178952 -178622 -86231 48294 239263 262220 177790 134991 280418
13623 280418 408062 176411 106205 183657 177689 39207 -5045 16961 31806 -130385 -325893
13612 -325893 -329767 -231079 -267700 -20139 192316 279499 179722 -131691 -274235 -114384 -21947
13601b1947P439J47221Q1593j15326m1605l1497J13419p6532k15474O5656P3727
13590a3326j23210m8304P7996P0255j30432o0413J37614J13997J77121J00479
13580C01777q3771o150O141r5194J7931J6094N0130j10674L7982O4220j36291
13569F2195m1531p9535j41242k9160J94558L7140j22840R8906J62329j16609o2035
13558c7824l2456m561q16j30155J44708l7815j14197p386M8792j96153o0613J29918
13546b98558J77680J10034m3910m7432O6483J50977J04086K2517j20965j88436
13536f7524j13677m9662m3375j2144m5297J61032J85515N6262q855r408q0693
13525b7826p1220J1626j1454O0249Q6534j06850O092O3502j47560J86898Q2248
$$ plain form
13601 -21947 -14508 132713 214306 98980 57375 25878 139297 62765 -152709 -87053 -13326
13590 -13326 -136536 -184840 -106844 -36589 -167021 -227434 -89820 24177 201298 301777
13580 301777 218006 211856 217997 122803 140734 156828 206958 96284 134266 198486 62195
13569 62195 20664 -58871 -200113 -229273 -34715 2425 -120415 -21509 140820 24211 -37824
13558 -37824 -70280 -74841 -75657 -205812 -61104 -98919 -213116 -220502 -171710 -367863 -428476 -298558
13546 -298558 -120878 -10844 -54754 -102186 -35703 115274 219360 241877 120912 -67524
13536 -67524 -181201 -230863 -274238 -286382 -331679 -170647 14868 71130 62275 52867 -27826
13525 -27826 -99046 -87420 -98874 -38625 47909 -58941 -52849 10653 -136907 49991 132239
13514A32239r9185j7900j67720K1199j2623L4068J31958n519k02106j08768O9519
13503b24838K6527o708Q6935J38627j32535o6194O5716O7857P8282j8947p0979
13492e6257k30k6998r3818K5172P1507R2681M5298K5572L5549o9385P758j75421
13480a18572j28499P1153j3336M1165j1397J60651K0180Q3393K9907j79200j35011
13469a79566o4602l7842j16118K12079J98833K7896l4175q60m5274L847O9022
13458C3240M0O930q1881n47J06464K3929j3979j22074l2328j3027J5590L9504
13446c8139J23833j1627J50284p6586j20098K12580j0348k23668j34940P2672
13436e6037o0471o9821J85525K98201l7780j63016j62014j8644k7462Q5663J20360
$$ plain form
13514 132239 33054 15154 -152566 -131367 -143990 -109922 22036 16517 -185589 -294357 -224838
13503 -224838 -198311 -205019 -118084 20543 -111992 -178186 -112470 -44613 33669 14722 -56257
13492 -56257 -56487 -83485 -177303 -152131 -80624 12057 57355 82927 118476 49091 56849 -118572
13480 -118572 -247071 -175918 -189254 -148089 -159486 1165 21345 104738 134645 -44555 -179566
13469 -179566 -244168 -282010 -398128 -186049 12784 40680 6505 5645 -39629 -35782 33240
13458 33240 33280 40210 -41671 -42218 64246 88175 74196 -47878 -80206 -93233 -77643 -38139
13446 -38139 85694 74067 224351 147765 27667 240247 229899 6231 -128709 -56037
13436 -56037 -116508 -186329 -804 297397 259617 96601 -65413 -84057 -111519 -25856 94504
13425I4504J81456j6193P3459K2004j12315m5536p3763m9520J09883L5267j84707
13414C4539j19814n6925P4310j418p3657J6118N723j9469O9944o753P9953M2664
13402D5215j25452j0774l447J38231O2399m3217O6481o6645K8083N2424j9094
13391A24204j57007k71500l6356J16451R9359J61542J82829j82144q9639L645
13381d8616J21537P8447o3155n2213r6301p0610L9057j69955J21545K48739k8332
13370H0143j24445N0283J17145j9192j47131m9705K8089Q0838J1349r6254j58770
13359b27650N3267M0538j16212R4829R151K8085O4971J08992l3853N4089n0749
13348B5458K7336K2123j5175j12555r2982J96944K1390n1296J7693O3876j40871
$$ plain form
13425 94504 275960 259767 333226 355230 242915 197379 123616 74096 183979 219246 34539
13414 34539 -85275 -142200 -67890 -69308 -142965 -126847 -121124 -140593 -70649 -77402 2551 45215
13402 45215 -80237 -91011 -94458 43773 106172 62955 129436 62791 90874 143298 124204
13391 124204 -32803 -304303 -340659 -224208 -124849 36693 219522 37378 -52261 -48616
13381 -48616 72921 151368 88213 36000 -60301 -130911 -91854 -261809 -140264 108475 80143
13370 80143 -44302 5981 123126 103934 -43197 -92902 -64813 16025 27374 -68880 -227650
13359 -227650 -174383 -133845 -250057 -155228 -146077 -117992 -53021 55971 22118 76207 25458
13348 25458 52794 74917 59742 -52813 -145795 51149 72539 21243 38936 102812 -38059
13337c8059J21852R8743J08463j6980r5448q2699N9208N0450n5863m2270j05396
13326B001m6738l3600r7161o4993K83920k2664K6442J14892J55989O6837j30481
13315B54444j00661J4707r1868J8272j80092p1010j8853J25706K7968r7846j39380
13304b58613n8856J37265Q7012n3680Q6598N8672o7701J5718l2775K19797n6305
13293G7132q7032P1724r3764N1080L0414j14675M0957L721k7912j28840j17768
13282b94963R7737K64765j4227j39133P7350N8553j5260n1578m6147J86929J35385
13271B59411l7829j34257k30679j37271o9571K16419J15001O2142n1560L9984
13261C1790L9618o7907j63656K1305J5482n5031M5138J60799O4442j62091j17195
$$ plain form
13337 -38059 83793 182536 290999 274019 178571 95872 155080 205530 149667 107397 2001
13326 2001 -44737 -78337 -175498 -240491 43429 20765 47207 162099 318088 384925 254444
13315 254444 153783 168490 76622 94894 -85198 -156208 -175061 -49355 -21387 -119233 -258613
13304 -258613 -317469 -180204 -93192 -146872 -60274 -1602 -69303 -53585 -86360 133437 77132
13293 77132 -9900 61824 -31940 19140 49554 -65121 -24164 -20443 -48355 -177195 -294963
13282 -294963 -197226 67539 53312 -85821 -8471 50082 34822 -16756 -62903 124026 259411
13271 259411 221582 87325 -143354 -280625 -350196 -133777 -18776 43366 -8194 31790
13261 31790 71408 3501 -160155 -138850 -123368 -178399 -133261 27538 91980 -70111 -187306
13250a87306j05566J26916K55920J96820j12458j66415o6931R3630J40310j73133
13240A787j01198P1738K44488K4762K6427j47139j83360o4809M5341J15530K6533
13229F0100m6946l8808P7566k7825K7497J58218R1539l6951q4555J44586j16786
13218B07635k49828o3926L0030j32226j61985J65928M5222n5377J28451O4517
13208b1559M8010j30789M4718J39763j78579j00291P4574Q875m241k1243K00569
13197E9807O9641M8643q4621Q0923j92970j92133j4553P923J26834K76728m3984
13186A42238j93564n629R5828N5621R5650q1067j37323n994r87l1444q5591O974
13174a45288j16902M3531L12155J79703j1547r578J2387j09181j85981M4472N836
$$ plain form
13250 -187306 -292872 -165956 89964 286784 174326 7911 -59020 34610 174920 1787
13240 1787 -99411 -27673 216815 241577 268004 120865 -62495 -127304 -81963 33567 60100
13229 60100 13154 -25654 51912 24087 51584 209802 301341 264390 179835 324421 207635
13218 207635 -42193 -106119 -76089 -208315 -370300 -204372 -159150 -214527 -86076 -21559
13208 -21559 26451 -104338 -59620 80143 -98436 -198727 -124153 -115278 -119519 -140762 59807
13197 59807 129448 178091 93470 174393 -18577 -210710 -225263 -217340 -90506 186222 142238
13186 142238 -51326 -56955 38873 94494 190144 109077 -28246 -34240 -35227 -66671 -152262 -145288
13174 -145288 -262190 -218659 93496 273199 261652 252074 264461 155280 -30701 13771 19607
13163A9607p6754l7024n7557R1420j11340j20826q3329R4288Q6571l557J83831
13152a4670L1086j1183m8596l5001K47934K95090o5018k10421l13173k06917Q0280
13141b50589R8196Q1255J20991M9274k454q1173q6386o907Q4406J83576n3589
13130A36600k37856o0828J17756R3888n4230m1870N5115K3467m3417L0276J47027
13119A65928O3042j1729j7217o4872j961J04120k4875j38375j09106K5031O5579
13108E5565Q630R7794p5211j4151j51436k18696J9847N8520p6571o3924J61669
13097a97964p2580J08113J94571o4601j60730P8546R0940j74317j31621N3278
13087b76365J25852Q4167J19948M1344N5938j10162J5874Q1374J16310j10009
$$ plain form
13163 19607 -57147 -94171 -151728 -60308 -171648 -292474 -375803 -281515 -194944 -198501 -14670
13152 -14670 16416 5233 -43363 -78364 169570 464660 399642 189221 -123952 -330869 -250589
13141 -250589 -152393 -71138 49853 99127 96673 15500 -70886 -77793 6613 190189 136600
13130 136600 -101256 -162084 -44328 49560 -4670 -46540 8575 32042 -11375 18901 165928
13119 165928 228970 217241 200024 135152 133191 237311 212436 74061 -35045 -10014 55565
13108 55565 64195 161989 86778 72627 -78809 -297505 -277658 -219138 -295709 -359633 -197964
13097 -197964 -270544 -162431 32140 -32461 -193191 -114645 -23705 -198022 -329643 -276365
13087 -276365 -150513 -66346 53602 94946 150884 40722 56596 137970 254280 144271
13077A44271j69481P7107q060j10211O1946L1135j43172p9519Q5362k940N2509
13066f1053q4665j27357k0113k0771J74202Q7842p0652Q6066l1051M8043M1539
13055B2030N8399m4384N5090Q9665o0526j48188q9524m3692j02666o176J0938
13044b59034O0090N4269Q0277j3977l0166N6387k6723L5092j8259o3144J58318
13033C3130J3763J09564N898j42683j07262J27384L7887j17965K9338M5004j15676
13022h1618p9151o544J26888J16479J72149n6536k29923k17444o5014J80841L1451
13011a08422J25084Q5629p2578j50211j24405n6867J05585K11124Q6957L3089
13001A34985J37667j21155m3297J4384j90502p8469m2494K11693k6218l0384m8762
$$ plain form
13077 144271 -25210 51897 43837 -66374 -4428 26707 -116465 -195984 -110622 -113562 -61053
13066 -61053 -145718 -273075 -293188 -313959 -139757 -51915 -122567 -36501 -67552 -19509 22030
13055 22030 80429 36045 91135 180800 120274 -27914 -117438 -161130 -263796 -269972 -259034
13044 -259034 -198944 -144675 -64398 -78375 -108541 -52154 -78877 -43785 -62044 -125188 33130
13033 33130 46893 156457 162355 19672 -87590 39794 77681 -40284 -10946 34058 -81618
13022 -81618 -160769 -167313 -40425 76054 248203 191667 -38256 -255700 -320714 -139873 -108422
13011 -108422 16662 102291 29713 -120498 -244903 -301770 -196185 14939 101896 134985
13001 134985 272652 151497 108200 122584 -67918 -146387 -188881 22812 -3406 -33790 -82552
12990h2552L639p5514R4124j0905o9477j09682j52407j17948k3597Q8082K25684
12979b30553J35283J84036l5275p1591j41764n314l6421k7265l1373K6179L5516
12968a98542p7362J14048J22422P4240J29329m8629q2823j14017N3045p7012j08939
12957b14240K5721L1661j1683J58376J80254j16828l501J4769m1583j60519M7519
12946i0054R7219k9392J7935j45234j20723m0641O444J73790J8141J75624j1137
12935E1972L309N1776L676k66271k9813k7663p6773L6969L7858J23120j32088
12924b23928N9275J61471O9884n5822M103K1868j73252J01283Q815K15579M4560
12913B33836j44046r0657l9603m2351J5982p3641J42141M4730q3553j51799K141
$$ plain form
12990 -82552 -78913 -154427 -60303 -71208 -140685 -250367 -402774 -520722 -544319 -456237 -230553
12979 -230553 -95270 88766 53491 -18100 -159864 -165178 -201599 -228864 -260237 -234058 -198542
12968 -198542 -275904 -161856 -39434 34806 164135 115506 32683 -81334 -28289 -105301 -214240
12957 -214240 -188519 -156858 -168541 -10165 170089 53261 49760 64529 22946 -137573 -90054
12946 -90054 7165 -22227 -4292 -149526 -270249 -310890 -304446 -130656 -112515 63109 51972
12935 51972 55281 107057 110733 -155538 -185351 -213014 -289787 -252818 -214960 -91840 -223928
12924 -223928 -164653 -3182 66702 10880 14983 36851 -136401 -35118 -26303 189276 233836
12913 233836 89790 -867 -40470 -82821 -66839 -140480 1661 46391 -37162 -188961 -186820
12902a86820j844j2680J15042Q1566L590J17494j30417O3281O5142j1962j41322
12891c8930n0863J91042J08822l8309q3427o6625r3043o1151M5746O1439J53372
12880A28073R8274Q5764j47530r1873p2086j10399J53408J60611J23648j11716
12870B16174p7780j70483n9902L2809J38990j65198j66758J52648N3549p6355
12860a22306Q7376K50105R5237j29314j06299j16655k2396Q0695n755p4178N9451
12849d039k4387r8782J01855n6268j47436P2417j50081M4139P4998Q0529K447
12838a04608m4501J14491J40277J4596j54142j14641j1017J56675k1147j00872
12828a24889J2826J97769O7575k45417j48158N007J20711M3766K5849j77599l2270
$$ plain form
12902 -186820 -188664 -201344 -86302 -4736 -1146 116348 -14069 49212 114354 102392 -38930
12891 -38930 -89793 101249 210071 171762 88335 21710 -71333 -132484 -86738 -25299 128073
12880 128073 226347 312111 164581 72708 622 -109777 43631 204242 327890 216174
12870 216174 138394 -32089 -91991 -59182 79808 -85390 -252148 -99500 -45951 -122306
12860 -122306 -34930 215175 310412 181098 74799 -41856 -64252 16443 10688 -63490 -4039
12849 -4039 -28426 -127208 -25353 -81621 -229057 -156640 -306721 -262582 -187584 -107055 -104608
12838 -104608 -149109 -34618 105659 120255 -33887 -148528 -159545 -2870 -24017 -124889
12828 -124889 -112063 85706 153281 -92136 -240294 -235287 -114576 -70810 -44961 -222560 -254830
12817b54830O5649J9397Q7721N0652J5572j00843j387J17637J73198m7164N6605
12806A82207J33368l7843j8568o4266j05938j66070O9968p950Q124j0896j70501
12795a88365J41660J52837n5981j69288O9606P920K2524p4192l7477J45152l073
12784A1323j5750N651r5161n8584Q3925J99792J30317p4723m8376K0665j57224
12773A855K4424J15494j1289r7306J6327m3276j12581K1029o8031J69323K05917
12762B21886o5010j82755K1543M1943M886l4924Q6256M9383J0882M6526P9013
12751B79629J02291j74869k02195n3495k5578Q6779P5430L2423m3142l1367l0047
12740A5859J30973k10l9769r914j09002r7823J02501Q0203O8406J06554j66216
$$ plain form
12817 -254830 -189181 -169784 -82063 -31411 -15839 -116682 -118069 -432 172766 125602 182207
12806 182207 315575 277732 259164 194898 88960 -77110 -7142 -15092 -6968 -17864 -188365
12795 -188365 -46705 106132 50151 -119137 -49531 -41611 -19087 -93279 -130756 14396 11323
12784 11323 -4427 1224 -93937 -152521 -68596 131196 261513 186790 138414 159079 1855
12773 1855 26279 141773 130484 33178 49505 6229 -106352 -85323 -153354 15969 221886
12762 221886 156876 -25879 -4336 37607 42493 7569 93825 143208 154090 200616 279629
12751 279629 381920 207051 4856 -48639 -74217 12562 87992 120415 77273 45906 15859
12740 15859 146832 146622 106853 96939 -12063 -109886 -7385 72818 141224 247778 81562
12729H1562r5068J34093R7424J25680j38186j68611J52713O2084j56608j58840
12719f3757J6794K76802j21603j98236L0495K261M4338o6293J05082J95172J10026
12708C31081r2111j61702j30390j01665L6142P4771l8338J7203j04704j39576
12698c09289o8829R5199R3352Q5201n493m8872J6475J25333L6045q5114J84518
12687A18526j18078j53938l5043J50379r6521P7672J37479k7186J6630L0373r2536
12676G757q3277j47821J1495J81178P5358L9369R574J71441M442k75109m6303
12665e1896J14509N6490M5238m8397j83184j03539M7874j1132J59141q3525k21058
12654b79479l0271J9143J33320l938l1878l5436m6077J58458Q4753l234j8404
$$ plain form
12729 81562 -13506 120587 218011 343691 205505 36894 189607 251691 95083 -63757
12719 -63757 -46963 229839 108236 -90000 -59505 -57244 -12906 -79199 25883 221055 331081
12708 331081 238970 77268 -53122 -154787 -118645 -43874 -82212 -65009 -169713 -309289
12698 -309289 -378118 -282919 -189567 -104366 -109859 -158731 -142256 -16923 19122 -65992 118526
12687 118526 448 -153490 -188533 -38154 -134675 -57003 80476 53290 69920 100293 7757
12676 7757 -75520 -223341 -211846 -30668 44690 84059 93633 265074 269516 -5593 -51896
12665 -51896 62613 119103 164341 115944 -67240 -170779 -122905 -134037 25104 -58421 -279479
12654 -279479 -309750 -290607 -157287 -161225 -193103 -228539 -274616 -116158 -31405 -34639 -53043
12643e3043j23278P6296J53620J42075O0881O0445N848Q8945O9834n1720j52199
12632B77704j64667k57423N5984J68519o6327n6488J2975J31032J47593r781L1985
12621B71106n3816j33851q9291K2448l6234J7478O8499j25308k4890j14374p549
12610b05782N43J05771q0329Q3052N5185j16892J77980j63971j14966N1704Q5873
12599a21832J86800Q7555k5457j74524r1541k9930Q146L1452J19081M4708j24189
12588h9731j0498K07190j2802j6381m1366L4201K3290o5712Q2355j1736l5969
12577F2841m1686l0220N05Q479q0233m077l6556J43750K13725j33770j75906J38413
12565F5265J64481N4450O9767N4214j27146j43231L1396l383k6652j08829j78348
$$ plain form
12643 -53043 -176321 -100025 53595 195670 256551 316996 322844 411789 481623 429903 277704
12632 277704 113037 -144386 -88402 80117 13790 -42698 -29723 101309 248902 239121 271106
12621 271106 217290 83439 -5852 16596 -19638 -2160 66339 -58969 -83859 -198233 -205782
12610 -205782 -205239 -99468 -179797 -96745 -41560 -158452 19528 -144443 -259409 -207705 -121832
12599 -121832 64968 152523 127066 -47458 -138999 -168929 -160783 -129331 -10250 34458 -89731
12588 -89731 -100229 106961 94159 77778 36412 70613 93903 28191 110546 98810 62841
12577 62841 21155 -9065 -8560 -81 -80314 -84391 -120947 22803 236528 102758 -73148 65265
12565 65265 229746 284196 353963 408177 281031 137800 169196 165813 139161 30332 -148016
12554a48016J10622J71788j1149j08542r2207o7743J25078P9812L2521k1498P916
12543G8582K1743P7610K6243q4347j84063j02765M6514J97772n9634j14174j7246
12532a13765l6052P4626J04501K3825R424O0499j01747J27345J41148p8849j5116
12521A95839o1812K1833J04623P8746q4272j76940o1156K3188J08578j87070L9522
12510A079k47242j01770R0828J41395j12979l4238K05931O7130L6439o2249m3788
12499e9464J72335p8040j19277P1319q6715j48478l5393J8877O8427O0903J08178
12488b7328J40456k03785j42630J8453R3889J11584J6210j63621l0819J6675L7717
12477a33199J21924K9216P2028K3262P6114J01272j17201k93684j53979n9383
$$ plain form
12554 -148016 -37394 134394 123245 14703 -77504 -145247 -20169 59643 92164 70666 78582
12543 78582 100325 177935 204178 119831 -64232 -166997 -120483 77289 17655 -96519 -113765
12532 -113765 -149817 -75191 29310 53135 62559 123058 21311 148656 289804 210955 195839
12521 195839 134027 155860 260483 339229 254957 78017 16861 40049 148627 -38443 1079
12510 1079 -246163 -347933 -257105 -115710 -228689 -262927 -56996 10134 46573 -15676 -59464
12499 -59464 112871 34831 -84446 -13127 -99842 -248320 -283713 -264836 -196409 -135506 -27328
12488 -27328 113128 -90657 -233287 -214834 -120945 -9361 6849 -156772 -187591 -170916 -133199
12477 -133199 -11275 17941 89969 113231 189345 290617 173416 -120268 -274247 -333630
12467c33630m5516l0792q3936J886J25592J46317M1471L8085J81017j271k76231
12456b37008P7260L42462M6552j30725N6098J5115P3242m8263p6733o6649j07327
12445e5976L2645J07601j30712q8848P0646j3671K1069n1200J26644o5480N2501
12434E219N9581j07814r5928j71034R9735J51849L8341M5701l5220Q2048J451
12423G3929k08977k6087k0187o2380J24827K39054O5297l5043j70199O6918N5874
12412A03026n7094j9210j53136p3678K39097p8633j81283q554L7637Q4576K63461
12401A56209J9014j97328j75607O950M1820j3548l7176O4987q2518j0741j8522
12390b46460o629J61953k4644j47659O3490J60203j0615q4500K8706j5997N131
$$ plain form
12467 -333630 -379146 -409938 -493874 -491988 -366396 -220079 -178608 -140523 40494 39223 -237008
12456 -237008 -159748 182714 229266 98541 154639 169754 242996 194733 118000 51351 -55976
12445 -55976 -23331 84270 -46442 -135290 -64644 -78315 -57246 -108446 18198 -47282 5219
12434 5219 64800 -43014 -138942 -309976 -210241 -58392 -20051 25650 -9570 72478 73929
12423 73929 -135048 -161135 -181322 -243702 -118875 120179 185476 150433 -19766 47152 103026
12412 103026 45932 26722 -126414 -200092 39005 -39628 -220911 -229465 -191828 -107252 156209
12401 156209 175223 -22105 -197712 -190762 -148942 -162490 -199666 -134679 -217197 -227938 -246460
12390 -246460 -253089 -91136 -115780 -263439 -199949 -39746 -50361 -134861 -106155 -122152 -117021
12379a17021n374j28745r801O0633j3741l6760O963K5313J49530M1218r7952j44523
12367b70260O766Q5179M8646j08030J96768J91980J83651m1945l67517n968L5668
12356d5062p4209j13921J8452K835k4501J14062K10494O3140m1694p8130L0888
12345F2354M9188O340K0890j44204j87567j20512N9124J75417J48042n9044K8792
12334C8820O1000O1945N5582j5413j66219o1739L3920N2831J15953Q2032o6796
12323A91916j76881l0031K20529J46j68901r1559o3385P9689Q3585j52078j25857
12312b32827K9800P5354L4465J20856J12894l7625q2007j71279o0288j22398N5210
12301b77845q27J06188J44998K0240n4944L5247j18708o7087L0659Q5677J16839
$$ plain form
12379 -117021 -122395 -251140 -260941 -200308 -214049 -250809 -243846 -218533 -69003 -27785 -125737 -270260
12367 -270260 -263494 -178315 -129669 -237699 -40931 151049 334700 292755 -74762 -80730 -45062
12356 -45062 -119271 -233192 -214740 -211905 -236406 -122344 88150 151290 109596 31466 62354
12345 62354 111542 117882 138772 -5432 -192999 -313511 -254387 -78970 69072 10028 38820
12334 38820 99820 161765 217347 201934 35715 -26024 7896 60727 176680 258712 191916
12323 191916 15035 -14996 205533 205679 36778 -54781 -118166 -38477 45108 -106970 -232827
12312 -232827 -203027 -127673 -93208 27648 140542 102917 20910 -150369 -210657 -333055 -277845
12301 -277845 -278672 -172484 -27486 -7246 -62190 -26943 -145651 -212738 -182079 -96402 20437
12290B0437r3705Q0342J21530j00653j30885j21447J80623N0810j41220j8333
12280a52501j9464j01124q4793J64654K15599o057m1546l2957j0540p2073n0053
12269a90855j32642J75454J40139p3773K15932J6738L6993K2060j18294J4082
12259A05834q4229j73275j5918J31452J97317j2756p1788j18279P3612P8184n6886
12248E3268j08627l3845j5963M6429r5309N3741J404k3742R2884P6596p3348k8801
12236e5313Q9477J04782J2453j06895P9355m3391k25872j03712N1196R1360N9981
12225d6579Q4279K77442o9843n5839n1708j53280k0841l824P5354N6947j1358
12214H0750k36339j71090j8909l3004J37839K36000K2653J55389J71089J0645
$$ plain form
12290 20437 -73268 7074 128604 27951 -102934 -224381 -43758 7052 -134168 -152501
12280 -152501 -171965 -273089 -357882 -193228 22371 16314 -25232 -58189 -68729 -140802 -190855
12269 -190855 -323497 -148043 -7904 -81677 134255 150993 187986 210046 91752 105834
12259 105834 21605 -151670 -167588 -36136 161181 148425 76637 -41642 31970 110154 53268
12248 53268 -55359 -89204 -105167 -58738 -154047 -100306 -98902 -122644 -29760 46836 -26512 -55313
12236 -55313 34164 138946 151399 44504 123859 80468 -145404 -249116 -197920 -106560 -46579
12225 -46579 37700 315142 245299 189460 137752 -15528 -36369 -40193 35161 92108 80750
12214 80750 -155589 -326679 -345588 -378592 -240753 -4753 17900 173289 344378 355023
12204C55023k15341J810n1155n9918L4679k7601n1709o2167j18606P6596J46595
12193B8206k349l6247k2316J44467n3929M4744M3250Q474P7169L0178J7545j57845
12181A21347j34368j04807K01896K22027l51p5131m7814l3706L2749p5494k6267
12170H0081m0668k5077R2192J395n0738p794p8237L5636J7440j69417r5200L7845
12158b02542n7838L8481P5226j12582Q3911K66746P2963M0168l979j341l2256
12147A66957j29109l1421q6415M7696J14858j39205j9001K0494L1985n924j16605
12136a45690p17j894Q2295m1643j53790K122M4354J63606J28991M4020M4873j5505
12124A51022r1075J12126m5343q4825j56536k15605N772R6383K17650p0301p9942
$$ plain form
12204 355023 139682 141492 90337 30419 65098 37497 -14212 -76379 -194985 -118389 28206
12193 28206 25857 -10390 -32706 111761 57832 102576 145826 154300 231469 261647 279192 121347
12181 121347 -13021 -117828 84068 306095 305744 230613 182799 149093 181842 106348 80081
12170 80081 39413 14336 106528 107923 57185 49391 -28846 6790 24230 -145187 -240387 -202542
12158 -202542 -260380 -221899 -146673 -259255 -175344 91402 164365 204533 200554 199213 166957
12147 166957 37848 6427 -79988 -32292 82566 -56639 -75640 -55146 -23161 -29085 -145690
12136 -145690 -146407 -148301 -66006 -107649 -261439 -259317 -214963 -51357 77634 121654 166527 151022
12124 151022 59947 172073 126730 41905 -114631 -330236 -324464 -228081 -10431 -80732 -160674
12113a60674k4062q6299J06644K80832k9177O5554M1908m5228K5039l2140j00381
12102D2016o4497j51817j13262o649K76574R2752j29446j29928q422n1792k0242
12091b64713K5532J67192J03738j73294J8341j11886M201K18386J6469J2507N7514
12080G3987j51818N7450J91334q0065K3790q1360j31900q6345K90645N0469k34852
12069g8665k5577k06885o3935R8351K18505N0665j14003K43J63057j66116j62481
12058b86841j54655k6510M080J82419J71469J95880k2270j02221r2572o8141l244
12047b02606P8960P5030J45359J598j26646k00249O4963Q1731l6020M6689N4351
12036a6840L039k17016n6982J09499M3821m3648J07415M8139J2012R2724n2977
$$ plain form
12113 -160674 -184736 -271035 -164391 116441 87264 152818 194726 149498 174537 142397 42016
12102 42016 -22481 -174298 -287560 -294209 -17635 75117 -54329 -184257 -192679 -244471 -264713
12091 -264713 -239181 -71989 31749 -141545 -123204 -235090 -230889 -12503 3966 16473 73987
12080 73987 -77831 -20381 170953 90888 114678 33318 -98582 -184927 105718 156187 -78665
12069 -78665 -104242 -311127 -375062 -276711 -58206 -7541 -121544 -121301 41756 -124360 -286841
12058 -286841 -441496 -468006 -463926 -281507 -110038 85842 63572 -38649 -131221 -199362 -202606
12047 -202606 -123646 -48616 96743 98341 -28305 -228554 -163591 -81860 -117880 -71191 -16840
12036 -16840 -13801 -230817 -287799 -178300 -134479 -178127 -70712 -22573 -10561 82163 29186
12025B9186j16041n7092j54373Q4376J58450j3289P2797K32802J28425j82105
12015A83136j83760Q0052j06264M3195k1895o4353Q2302K5622O1875R8880L6899
12004B35689J37696r1186q6689j44327k24291M6302O6016j2947k949j9740M9362
11993d7064j7413P2082J67800P200j18204m2722M863J32502M7541l5516j22161
11982D8908j23146n8085J61288J19693r0481j48833p3382R2468R1474j17743j025
11971i8864o4505j01142J69510P7448O4105J1296L6685j04552j65955J64208J50910
11960A39144n276k8655p926m4062k62114j54854J15553J76257j65076j6616N6132
11949a97493J74552J65666m5576j19667N3472L8052j28978l6229P1688j9845k1261
$$ plain form
12025 29186 -86855 -143947 -298320 -213944 -55494 -68783 4014 236816 365241 183136
12015 183136 -624 79428 -26836 16359 -5536 -69889 12413 38035 99910 198790 235689
12004 235689 373385 282199 195510 51183 -173108 -126806 -60790 -73737 -76686 -96426 -47064
11993 -47064 -64477 7605 175405 182605 64401 21679 26542 159044 206585 171069 48908
11982 48908 -74238 -132323 28965 148658 58177 -90656 -164038 -71570 19904 -97839 -98864
11971 -98864 -163369 -264511 -95001 -17553 46552 57848 94533 -10019 -175974 -11766 139144
11960 139144 133868 105213 97287 53225 -208889 -363743 -248190 -71933 -237009 -253625 -197493
11949 -197493 -22941 142725 97149 -22518 30954 69006 -59972 -96201 -24513 -44358 -65619
11938f5619q8815J0817J30748J50711m1064j00817m7221o650L7954K1762l0214
11927b8408R8474J32694R7708q6437j22012p1845J24239n235k5898p2091j305
11916C9884r5293J02275K03373j50385r6782J38560m4820n5048m507K819L2138
11905G2214q5626j26859J01840O2488j26162n151L2599K7479O8450L3081j72740
11894a18387J1066k4513J96489J58140M670l5237k33988k02185p1653R805L8079
11883b67714O9349j5507P4763n9961l6947J89362r5634r8142M6317m868l3481
11872b32463Q5445O3333J90005j41265j21059q795K824p845K50823K14269p5238
11861B20034k23307j65814Q70L5010J14572m378j88762n9523J02835P438J26046
$$ plain form
11938 -65619 -154434 -143617 -12869 137842 96778 -4039 -51260 -57910 -19956 1806 -28408
11927 -28408 70066 202760 300468 214031 92019 20174 144413 139178 113280 41189 39884
11916 39884 -55409 46866 250239 99854 3072 141632 96812 41764 37257 40076 72214
11905 72214 -13412 -140271 -38431 24057 -102105 -107256 -74657 -47178 21272 54353 -118387
11894 -118387 -107321 -131834 64655 222795 227465 192228 -41760 -243945 -315598 -305793 -267714
11883 -267714 -198365 -213872 -139109 -199070 -236017 -46655 -142289 -240431 -194114 -198982 -232463
11872 -232463 -147018 -83685 106320 -34945 -156004 -164799 -161975 -169820 81003 295272 220034
11861 220034 -3273 -169087 -168217 -133207 -18635 -23013 -211775 -271298 -168463 -161025 -34979
11850c4979o4867K4481R9253M6573J080j60910J5662J66970M9685j06819k39747
11839b03618j6974Q5852J90024K6448p4948j55521r9581K51049K04634Q2546j10218
11828A79693j89468N3389q9982m2873k7289j25839l2566R0457J88169n9386n7456
11817a13151k7692J70435K62396j76735j26945n8210q5486p1423p6043N1452J57635
11806i3767J32777n767M092K34384M0120k41001k2859K4821j34361j2755J95927
11795A21611J12516Q4856j75027k36120j32163J26019J3037j3917k5372M3087
11785h1473m1869K7157O2776P5123J94597P6616m8115p1176l0886j25258j89715
11774a52223J55979K74355L6696p0652J26694j10635j65237j6369N3029j6720
$$ plain form
11850 -34979 -99846 -75365 23888 70461 71541 -89369 -73707 93263 142948 36129 -203618
11839 -203618 -220592 -134740 55284 81732 6784 -148737 -248318 2731 207365 289911 179693
11828 179693 -9775 43614 -46368 -89241 -116530 -242369 -274935 -184478 3691 -55695 -113151
11817 -113151 -140843 29592 291988 115253 -11692 -69902 -155388 -226811 -302854 -251402 -93767
11806 -93767 39010 33243 37335 271719 311839 70838 47979 72800 -61561 -74316 121611
11795 121611 234127 318983 143956 -92164 -224327 -98308 -85271 -99188 -124560 -81473
11785 -81473 -123342 -96185 -33409 41714 236311 312927 264812 193636 162750 37492 -152223
11774 -152223 3756 278111 314807 244155 370849 260214 94977 78608 131637 114917
11764A14917N6512J2216j31801j38365J33326J87933Q3298j03240r3114k11612
11754h9930l3438J20941j9057j25143j32790p6258p411n4399R1916J17210R5618
11743a12741j7534j84273J864J90604J37069N5101j95591j30966j68157K45816
11733a78808P7714L2712n7367m6029K23157J19628N9947j67890R5537q501k56524
11722a06424j59587J14563J26657J7541L8048j15141p4898j09953N3272O0532
11712a55390J97798K023l21224N8300J49912L44733J44185j58355j92338P7172
11702A46816p3066j20156j9166M0178j41144J96461J18440l4306q0268P2475m8337
11691E7927k32273j9911N2261j65501J97530Q7153l6828q7054o0208K1283J30702
$$ plain form
11764 114917 171429 183645 51844 -86521 46805 234738 318036 214796 121682 -89930
11754 -89930 -123368 -2427 -21484 -146627 -279417 -355675 -363086 -417485 -325569 -208359 -112741
11743 -112741 -130275 -314548 -312684 -122080 14989 70090 -125501 -256467 -424624 -178808
11733 -178808 -101094 -68382 -125749 -171778 51379 171007 230954 63064 158601 150100 -106424
11722 -106424 -266011 -151448 -24791 -7250 30798 -84343 -159241 -269194 -215922 -155390
11712 -155390 42408 44431 -276793 -218493 -68581 276152 420337 261982 69644 146816
11702 146816 73750 -46406 -65572 -25394 -166538 29923 148363 114057 33789 106264 57927
11691 57927 -174346 -194257 -141996 -307497 -109967 -22814 -59642 -146696 -206904 -185621 -54919
11680e4919j8334P025l4510J3263R2838Q9160J15074L8654k84197l5446N0496
11669b0896q2466j90542J17457K62134L1409k04463J60439J21118j22092j04787
11659c2689Q72P2801R6817J26472J37125n3503k06501p8833p6830M4115O669L7778
11647G4293j23032j3745m0536k4897j16121J9467N4064n1859M3731R2976m2014
11636a27673j55440K5576O8945m1464M0771j7408N0159j99186J1221J63686k8709
11625b09522l2304K7907l5392L3856J97601j4135p7417k7225l1198J03363r7556
11614a62022q4513K72840O0673l0027j10359j99495O4868J05991M2048J05664
11604F5668N6850j6294M5705j7471r1708k27177k31112n5603J09324J56308J23458
$$ plain form
11680 -54919 -73253 -66228 -100738 -87475 5363 94523 209597 248251 -35946 -71392 -20896
11669 -20896 -103362 -293904 -176447 85687 117096 -87367 73072 194190 72098 -32689
11659 -32689 -31817 40984 137801 264273 401398 347895 141394 62561 -14269 29846 36515 74293
11647 74293 -48739 -62484 -103020 -127917 -244038 -224571 -170507 -222366 -178635 -85659 -127673
11636 -127673 -283113 -257537 -188592 -230056 -189285 -206693 -156534 -355720 -344499 -180813 -209522
11625 -209522 -241826 -213919 -249311 -215455 -17854 -31989 -109406 -136631 -167829 -64466 -162022
11614 -162022 -246535 26305 86978 56951 -53408 -252903 -188035 -82044 -39996 65668
11604 65668 122518 106224 151929 134458 42750 -184427 -415539 -471142 -361818 -205510 -82052
11593h2052K726k4686J92570P3684J2035R0583K0209j29325q1412j31712P7576
11582B0196r1340k13842O2356N3413K8530r4040j70460J57771M5325J06412J17434
11571B1755m9411J08705O0331p7981M5205j17574L0178L5217n1858j13115j8040
11560a26588k3358j05141m9000R694P8732J54085J64713J1196j11615j35178m3064
11549a75524p9492O4496J12783o0868m7189m753j8233Q3429l7288P1577J82508
11538I1446j16760j3603N7478L7204j39815m709k1449Q7862Q8882n9051o8367
11527f0882O3669K2055n1493j24089P690P2596J0517K906j7564J72263j2318O4930
11515A50280N3661j35252O4302j50514j83904m3832R7185K3667J09609L3252j89271
$$ plain form
11593 -82052 -79326 -104012 88558 162242 174277 264860 285069 155744 74332 -57380 20196
11582 20196 -71144 -284986 -222630 -169217 -140687 -234727 -405187 -247416 -202091 -95679 21755
11571 21755 -27656 81049 141380 63399 108604 -8970 21208 56425 4567 -108548 -126588
11560 -126588 -149946 -255087 -304087 -294393 -215661 -61576 103137 114333 2718 -132460 -175524
11549 -175524 -255016 -190520 -77737 -138605 -185794 -190547 -208780 -125351 -162639 -91062 91446
11538 91446 -25314 -38917 18561 55765 -84050 -88759 -110208 -22346 66536 7485 -60882
11527 -60882 2787 24842 -26651 -150740 -143050 -70454 -59937 -57031 -74595 97668 85350 150280
11515 150280 203941 68689 132991 -17523 -201427 -245259 -148074 -124407 -14798 18454 -170817
11504a70817n8660N1887J2678P9006M3086q8171l2734R840M4494L0721J23018
11493D4348O6911P9174J6463m6238j34772r5869L1241N0982J5284o1814q8492
11482a22782j68611J29284K65683q1414m4163Q3781J5329j72861L3668J29798
11472F7712R7673K2701N2257L0110N5263k1278l8336j15185o6654n820O6067N4191
11460A98701P196N857P2379J43841j6388j80007p9999r6039j40636L0871N6582
11449B358n7620j01928J93786L1204m1945k2475n3079J5273r9971m906N1231L7245
11437e0827J04038l7443r5703j57085j13738J90303J562J06331K84425P40j57326
11426G5277R26l3846j51811j27685K19646J58814j88686K953P5200P5838l46367
$$ plain form
11504 -170817 -229477 -177590 -164912 -85906 -42820 -130991 -163725 -153885 -109391 -78670 44348
11493 44348 111259 190433 206896 160658 25886 -69983 -38742 12240 27524 -34290 -122782
11482 -122782 -291393 -162109 103574 22160 -22003 61778 77107 -95754 -62086 67712
11472 67712 165385 188086 240343 270453 325716 304438 266102 150917 84263 78443 144510 198701
11460 198701 205897 211754 284133 427974 411586 231579 151580 55541 -85095 -54224 2358
11449 2358 -55262 -157190 36596 67800 25855 3380 -49699 -34426 -134397 -139303 -88072 -50827
11437 -50827 53211 15768 -79935 -237020 -350758 -160455 -158893 -52562 231863 232603 75277
11426 75277 76203 42357 -109454 -237139 -17493 141321 -47365 -44412 30788 106626 -239741
11415b39741j83667q1123K75449K15790j9655m7552p9563m9908P5544O5429R6531
11404B7534o453j04525o8013L23317J88763o3261k17549j27556o1163k3866n34
11393a33306J00617o9994q5656p5811j8559j5601J06939K11591R3067j4082r6913
11382B292k05483L5442J37155J56576M3532r9809M3227k52527J0531K22463P1805
11371A65204j18306l2584k188o1208M0864L5608l4049r9076l9355l4797M2051
11360a37836m6631p6867J01902K12306M501o04l2097N7614J60196j22144r2067
11349B8273n2856L215J6307J10449J4647k925L5415J7626n0616j02670o3340j43257
11337a89732r4498K12548K47494m9520q25k1247j11984l0957j56449L1486K81150
$$ plain form
11415 -239741 -423408 -504531 -229082 -13292 -32947 -80499 -160062 -209970 -134426 -68997 27534
11404 27534 21081 -83444 -151457 171860 360623 297362 79813 -47743 -108906 -132772 -133306
11393 -133306 -32689 -102683 -188339 -264150 -282709 -298310 -191371 20220 113287 99205 2292
11382 2292 -203191 -167749 -30594 125982 169514 69705 112932 -139595 -129064 93399 165204
11371 165204 46898 14314 12126 -49082 -8218 27390 -6659 -105735 -145090 -179887 -137836
11360 -137836 -184467 -261334 -159432 52874 57375 56771 24674 82288 242484 120340 28273
11349 28273 -24583 -21368 -5061 105388 120035 117110 152525 170151 119535 16865 -46475 -189732
11337 -189732 -284230 -71682 175812 126292 125467 104220 -7764 -38721 -195170 -163684 117466
11326A17466N4541r3035k66096N2185l0263m3825M4327l5443p9434j8863r108
11315c07548k2301J64583O0205Q005K34515N6738R5140J22495J00533j17924k99416
11304I5025j87059J4405M2158l3622J5873r8545K39557J06991L3103j28474j2427
11293H6985M728q3726j65568J13741J08685k3448L0147k6390p2168J05068K32223
11282C10277m7093k09800j00063n8110J65090P6373k964n1249N9859R435m7159
11271A04596M8482l7682j16470K5809o1253n0705K13533n211j92898j94152m1360
11260c07311J89704J38437m5901l0402o1558k405j1619j14350J87719J26760r2227
11249b3153j4310l9238j07615l1238l6396J44202n1213n1263K1461M5695J14019
$$ plain form
11326 117466 172007 78972 -187124 -134939 -165202 -209027 -164700 -200143 -279577 -298440 -307548
11315 -307548 -329849 -165266 -105061 -97056 137459 194197 289337 411832 512365 394441 95025
11304 95025 -92034 -77629 -35471 -69093 -53220 -151765 87792 194783 227886 99412 86985
11293 86985 91713 7987 -157581 -43840 64845 41397 71544 45154 -27014 78054 310277
11282 310277 263184 53384 -46679 -104789 60301 136674 133710 82461 142320 151755 104596
11271 104596 153078 115396 -1074 24735 -36518 -87223 126310 121099 -71799 -265951 -307311
11260 -307311 -117607 20830 -25071 -55473 -117031 -119436 -131055 -245405 -57686 69074 -23153
11249 -23153 -37463 -76701 -184316 -215554 -251950 -107748 -158961 -210224 -188763 -143068 -29049
11238b9049p839J64578J24213m6606j74751p8550m0924J0160J38089J49916j37981
11227G1256j24496j72846K6329k9025k548M0193j85947j6385J20717Q9902J59372
11216b3478P8771k4731j59006j49121Q5992Q4255P2819N5747j81806k8204l5673
11205b24435L3384J41808O4433M0798N1107q1188P3156P0958k5615m873n9648
11194G9885k29768j07978J05385K0574L5392J04528m1501k7103K5583m8130j47410
11183b30543o1883Q606J6183J51608K30930j85105k41275j59646N3440J04745
11173c12940m2126J15242Q3213j6642l4440O4744j03355R6217J36395O6374P6891
11162A29573j84386j95266j9518r221R0897J76880m7520P8243Q0915o0425k40966
$$ plain form
11238 -29049 -36888 127690 251903 205297 30546 -48004 -88928 -78768 59321 209237 71256
11227 71256 -53240 -226086 -199757 -228782 -231330 -191137 -377084 -393469 -272752 -182850 -23478
11216 -23478 55293 30562 -128444 -277565 -191573 -107318 -34499 21248 -160558 -188762 -224435
11205 -224435 -191051 -49243 15190 55988 107095 25907 99063 170021 144406 139533 79885
11194 79885 -149883 -257861 -152476 -131902 -96510 8018 -33483 -60586 -35003 -83133 -230543
11183 -230543 -292426 -283820 -267637 -116029 114901 -70204 -311479 -471125 -417685 -312940
11173 -312940 -355066 -239824 -156611 -173253 -207693 -142949 -246304 -150087 -13692 52682 129573
11162 129573 -54813 -250079 -269597 -278818 -187921 -11041 -58561 19682 100597 40172 -200794
11151b00794q7481R3503O5585M6202j0522K3673L5118p0441o6730L6562J2631
11140a22694p9678J14498J3692L1600k2073q168J0896q7844J0814n0979K71500
11129H1564M3283k16681m7516O1076q027l7599m2221M8061J51787k1887k7915
11118a6075J2833J6763j04838L8999J58516l079J2936r1489J4075J30241k15932
11107d7050o1463J83928J10466J24100j12631j79870j93068j19643L3373R1360
11097a70498J28117q723o0871J69248n9574n4793j30322j59018J23959J42707
11087g9768J25372n1010o2391j9932O7516L1700j38399K5324J41794J40242J99539
11076C79987j55581k04498j78044l9333R8475N929J9489J18553j35502j8503J9269
$$ plain form
11151 -200794 -288275 -194772 -129187 -82985 -93507 -69834 -34716 -105157 -171887 -135325 -122694
11140 -122694 -202372 -87874 -74182 -42582 -64655 -72823 -61927 -149771 -138957 -189936 81564
11129 81564 124847 -91834 -139350 -78274 -86301 -123900 -166121 -118060 33727 11840 -16075
11118 -16075 -3242 13521 -91317 -52318 106198 103119 116055 24566 38641 168882 -47050
11107 -47050 -108513 75415 185881 309981 197350 17480 -175588 -295231 -261858 -170498
11097 -170498 -42381 -51104 -111975 57273 -2301 -57094 -187416 -346434 -222475 -79768
11087 -79768 45604 -5406 -67797 -87729 -20213 11487 -126912 -101588 40206 180448 379987
11076 379987 224406 19908 -158136 -197469 -98994 -93065 -73576 44977 -90525 -109028 -89759
11065h9759o0599J07613k7981J74057q989J2178o608j6079m8643J07246m5202
11054I7234j18933L4554R390K1690m8163L847J24638J21498r3970k33090j408
11043h2713m4615J42320J45421P9352j20599o3613j61213J4711k7390N6430K52474
11032A90565P8043M8064m0522k16744j43603k5777J05587L9265l4632R2331n5256
11021C7321j25150K6040L7160K9694R3332j1585j71329k5960J15997J00478j10134
11010d136k0742O61m022r6879q6372j33638k6487m6132J06135L15145L145R343
10998A6021K9656p5368m6175M3049n8025r4576O9790K59390J53466N3457k6785
10987C23900j4526R4120P277j31867l54550k6995K1989m0274j31666K8264J41333
$$ plain form
11065 -89759 -150358 -42745 -70726 103331 94342 106520 99912 83833 35190 142436 97234
11054 97234 -21699 12855 22245 43935 -4228 -381 124257 245755 151785 -81305 -82713
11043 -82713 -127328 14992 160413 239765 119166 55553 -105660 -90949 -118339 -61909 190565
11032 190565 268608 316672 276150 59406 -84197 -109974 -4387 34878 246 92577 37321
11021 37321 -87829 -61789 -24629 5065 98397 86812 -84517 -110477 5520 105998 -4136
11010 -4136 -24878 -24217 -28239 -125118 -211490 -345128 -371615 -417747 -311612 3533 6678 16021
10998 16021 45677 -29691 -75866 -32817 -90842 -185418 -115628 143762 297228 350685 323900
10987 323900 309374 403494 410771 278904 -75646 -102641 -80652 -120926 -252592 -224328 -82995
10976h2995R3752j53465m8263j3175K0389o0980j00475k7473J4611r0844J28266
10965c20652J78648J50063L7128m4200j57628j1566P9843O3283K1298O2774j0119
10954D8872M3858o4776j03057J01410Q3375j13732Q9225m4477j24515N8862L0991
10943F036J6235J21777R3191o4724r1856j30080L5297m2237n5184Q6810O606L5952
10931A7823n0683N4247J0203p1111M6755O4331l2259p5141N8480N9933j58202
10920g5624r1711M2743N9818j31741k9778J18735J34725J08506L213r9336O649
10909D6199J31032r3965j38133n719J28503J28968l9024j68153O5802N0064O50
10898A06224O8248Q4321J29868q9537j36489j63737O5834J02075K2982K2212k6923
$$ plain form
10976 -82995 10757 -142708 -190971 -204146 -183757 -244737 -345212 -372685 -358074 -448918 -320652
10965 -320652 -142004 8059 45187 987 -156641 -168207 -88364 -25081 -3783 58991 48872
10954 48872 92730 27954 -75103 26307 109682 -4050 85175 40698 -83817 -24955 6036
10943 6036 22271 144048 237239 172515 80659 -49421 -14124 -56361 -111545 -24735 -18129 17823
10931 17823 -32860 21387 31590 -39521 7234 71565 39306 -35835 22645 82578 -75624
10920 -75624 -167335 -124592 -64774 -196515 -226293 -107558 27167 135673 138886 39550 46199
10909 46199 177231 83266 -54867 -60586 67917 196885 157861 -10292 55510 105574 106224
10898 106224 174472 258793 388661 299124 162635 -1102 64732 166807 189789 212001 185078
10887A85078K4403j4968M1035K9149j8067l1757m7169j57464k35064n3635J2565
10876b65894K01902K80012K1471l0833M2448j54423r2644q9353m6331P3453M9211
10865a0981l3883O1251k1369J74923j69300j91314J43275Q591N6661n020j24736
10854a11902m8054N8266k5652j18613k3299J41227J37159o1237l2946J08558N9673
10843H3180o7644o1862K685n3133J2947j05896o918O3802p4639L5555O3898Q451
10831i9574R1349J54116j00356o0101j31998J19225p554l3677p6080j4707R7020
10820f2337O5757o7470j572M037n0642K13123J30826K7289r7236j72885m0834
10809e1944n5165N3963R5274O8218k24759j32676Q1632m7434Q9065J52523j04901
$$ plain form
10887 185078 209481 194513 235548 264697 246630 214873 167704 10240 -224824 -278459 -265894
10876 -265894 -63992 216020 237491 206658 249106 94683 2039 -87314 -133645 -60192 -10981
10865 -10981 -44864 16387 -4982 169941 641 -190673 -47398 -38807 17854 12834 -111902
10854 -111902 -159956 -101690 -127342 -245955 -269254 -128027 9132 -52105 -85051 23507 83180
10843 83180 15536 -46326 -43641 -96774 -83827 -189723 -196641 -132839 -207478 -171923 -108025 -99574
10831 -99574 -8225 145891 45535 -14566 -146564 -27339 -34893 -68570 -144650 -159357 -62337
10820 -62337 3420 -64050 -65622 -61585 -112227 100896 231722 259011 161775 -11110 -51944
10809 -51944 -107109 -53146 42128 110346 -114413 -247089 -165457 -212891 -123826 28697 -76204
10798g6204Q5990J12429M0844j12097L975J47008J86282N5422j16312j84722j8001
10787A24614j63131k54756l4310K35377Q9119j7514j7099j03982Q7248J82141
10777A27707L6195j13945j54786k8310q0388N3453J07720l3603O7933O2874q5851
10766d1001p307l1762m3614l7406J35454K11890m750l2018R1117p8356j07583
10755E4664J7191o4929R2990K5107o6004r6841m7882J4111L0223Q2701p6025J75872
10743A41178K2170q5134k03590m3691O7110J66402J13117j19266l9993J14101
10733A32404j45634k07727j68141K13005Q2305m5636j09219K23279J62735N8076
10723A95447p1170l1649O2453O522q9624L6596p550L9110m890k48412o4212m7160
$$ plain form
10798 -76204 9786 122215 163059 50962 54937 201945 388227 443649 327337 142615 124614
10787 124614 -38517 -293273 -327583 -92206 -3087 -20601 -37700 -141682 -54434 127707
10777 127707 163902 49957 -104829 -133139 -213527 -160074 -52354 -85957 -18024 44850 -41001
10766 -41001 -48308 -80070 -123684 -161090 -25636 186254 181504 149486 240603 162247 54664
10755 54664 71855 6926 99916 125023 59019 -37822 -85704 -71593 -41370 41331 -34694 141178
10743 141178 163348 78214 -125376 -169067 -101957 64445 177562 58296 18303 132404
10733 132404 -13230 -220957 -389098 -176093 -93788 -139424 -248643 -25364 137371 195447
10723 195447 124277 92628 155081 161603 71979 108575 101025 140135 135245 -113167 -177379 -224539
10711b24539J36415N0634n053O3937J00962l8001J34178l5107J96933R5603J4650
10700D90612k46511j86293n2886j46719o3161N0246L0773L9843o5405l2520n5989
10689b38010o9587p3828J38883Q5206J50639r9572j07824M7502r9912j8709N8633
10678b26579P2571J09602k7126J8447J27662J07687l09102j62843n8012J55385
10668a92308J37695M2755L551j1576O9347j21736O5151N055N1608M252q535n3351
10656h092M9985R5851J2859r0394K1208j87098j40069J32114M1440m4229k4899
10645a41324k0365K35920N4903r8229j08375j29289J56103J89472j166J21835
10635B59485J12744j30711j73407k14500N7340J37543p8951m3742J80443M3015
$$ plain form
10711 -224539 -88124 -37490 -42543 21394 122356 84355 218533 183426 380359 475962 490612
10700 490612 244101 57808 4922 -141797 -204958 -154712 -123939 -84096 -149501 -182021 -238010
10689 -238010 -307597 -381425 -242542 -157336 -6697 -106269 -214093 -166591 -266503 -285212 -226579
10678 -226579 -154008 -44406 -71532 -53085 74577 182264 -126838 -289681 -347693 -192308
10668 -192308 -54613 -11858 -8307 -19883 49464 -72272 -7121 -2066 49542 53794 45259 -8092
10656 -8092 41893 137744 150603 60209 81417 -105681 -245750 -113636 -72196 -116425 -141324
10645 -141324 -161689 74231 129134 30905 -77470 -206759 -50656 138816 137650 259485
10635 259485 372229 241518 68111 -146389 -89049 48494 -30457 -74199 106244 149259
10625A49259r1590N7030m0768L1742r0971m0600P5434J69601j25455j52439m6187
10614a04944L1968m4445j29992J36758K29379L2328J6977k2990R0009n8252j73258
10603C538j88239P5636O5386Q0519j10808O1547j80562j19179Q6022J50791J46840
10592G1491J62182J74576N9371j82785n5529j60128m2702m0265K3831P3229j0357
10581G2914n207O6369r4584k86086K3691J00707j89947k1630M7898R8523K20330
10570C2978n3854l3017J67829j81085o6357J40254K7569o5859k4731K1573j30912
10559a65612o000o2904p0116M8759M8750n678K7497K18573l7063j08493L6025
10548g6262r603R6214J08970J58483L1351j42024q8666m662o0448O6873J5543
$$ plain form
10625 149259 57669 114699 73931 105673 14702 -25898 49536 219137 93682 -58757 -104944
10614 -104944 -72976 -117421 -247413 -110655 118724 151052 168029 145039 235048 176796 3538
10603 3538 -184701 -109065 -43679 36840 -73968 -12421 -192983 -312162 -226140 -75349 71491
10592 71491 233673 408249 467620 284835 229306 69178 26476 -13789 10042 83271 72914
10581 72914 67707 134076 39492 -246594 -222903 -122196 -312143 -333773 -285875 -187352 32978
10570 32978 -20876 -53893 113936 -67149 -133506 6748 34317 -31542 -56273 -34700 -165612
10559 -165612 -171612 -234516 -304632 -255873 -207123 -212801 -185304 33269 -3794 -112287 -76262
10548 -76262 -85865 10349 119319 277802 309153 167129 78463 73801 13353 80226 95769
10537I5769O9604J28720K6523n1509J8395j90727l2623l9394q5113J15225j17869
10526f2999j79268k8568K3915K39836J86338j5726o4631p2073J32451J6521j11735
10515F4061N4811J52930j64061j87049P4751Q7658L6753K4381m3039k17878j3039
10504a29721m2152r6248j20545K06064P3234L0902J34744r7439k07443J26346
10494a22258Q5011K1661j35119j25273K982j02453Q5985L7381j41648O7964M7839
10483b77928J10740O1313J20355Q2191J61670n9766k48334j04714K60731J53985
10473B60243m2532r7828L8065J4909j09332o8994M3333J9746j38177J03352N6212
10462G8997m6881q8793k5386J15019m6680n969k1795m396j76488j61121J4336
$$ plain form
10537 95769 165373 294093 320616 269107 287502 96775 64152 24758 -60355 54870 -62999
10526 -62999 -242267 -270835 -246920 -7084 179254 163528 98897 26824 159275 175796 64061
10515 64061 118872 271802 107741 -79308 -4557 83101 119854 144235 101196 -116682 -129721
10504 -129721 -171873 -268121 -388666 -182602 -109368 -78466 56278 -41161 -248604 -122258
10494 -122258 -37247 -15586 -150705 -275978 -272996 -375449 -289464 -252083 -393731 -325767 -277928
10483 -277928 -167188 -105875 14480 96671 258341 198575 -49759 -154473 106258 260243
10473 260243 217711 119883 157948 172857 63525 -5469 37864 57610 -80567 22785 78997
10462 78997 32116 -56677 -82063 32956 -13724 -19693 -41488 -45884 -222372 -383493 -369157
10451c69157Q8703m3823K0705J76202J70707P4448L5829P9724K5901P2876O9534
10440D01649j40963j40634m4985L8886J21315m3297j47990p1744l7653J10926
10430D5510j6296O6194O7802j96532o4134r277o6943J1643J79908J26391l7300
10419A06966j74424j13700j69071J02227L24323q5115j40204j7594K5171O5817
10409g5604J54919p3403K0151q9586J8210k3376j62362O6581O1039N5868N9293
10398A1730m7535l8034R9922K1010j24695J79956j44882Q0836l7772P6363J11657
10387A88556j02651n7888R7309O7232j08364L5332m2294j15481j47395m8375K00005
10376c4014M0307l0508m1775J447J94015P3751k72090j59920Q5831l4911N2268
$$ plain form
10451 -369157 -280454 -324277 -303572 -127370 43337 117785 153614 233338 259239 332115 401649
10440 401649 260686 120052 75067 113953 235268 191971 43981 -27763 -65416 45510
10430 45510 29214 95408 163210 -33322 -97456 -106733 -173676 -162033 17875 144266 106966
10419 106966 -67458 -181158 -350229 -248002 76321 -8794 -148998 -166592 -141421 -75604
10409 -75604 79315 5912 26063 -63523 -45313 -68689 -231051 -164470 -103431 -47563 11730
10398 11730 -35805 -73839 26083 47093 -77602 102354 -42528 38308 536 76899 188556
10387 188556 85905 28017 125326 192558 84194 119526 77232 -38249 -185644 -234019 -34014
10376 -34014 6293 -24215 -65990 -64543 129472 203223 -68867 -228787 -142956 -177867 -125599
10365a25599J79975M3404J3568j17662p7533K2341O920p1088L0056K09724Q5520
10354A99626l4183j4105N7374J4947k3070r4344K5012L9271j95403J05641J01962
10343A82728p8381p4694p9946p8625J69975J58643j36115L0664m8671K0953r501
10332E7030J12522R296j32545j37622L588j10831L3611J48933J27085K1561L8006
10321A70634j72350p8973o4093O2225P7520J23283O0975j71635j29484J54039
10311C2141J50315J31811J16470R4157l43412k21404r6085j58276k5291J84309
10301a35265j6032j71079M0767O5247K13022p814j28533K3600m6255N1222R5939
10290a5181J70282j6059P8340m0917j64342l9180J8144k7583L0398n8462J48486
$$ plain form
10365 -125599 54376 97780 111348 -6314 -83847 -61506 -54586 -125674 -95618 114106 199626
10354 199626 165443 151338 208712 223659 200589 106245 131257 170528 -24875 80766 182728
10343 182728 104347 29653 -50293 -128918 41057 199700 63585 94249 45578 66531 57030
10332 57030 169552 178848 46303 -91319 -87731 -198562 -164951 -16018 111067 132628 170634
10321 170634 -1716 -80689 -144782 -82557 -5037 118246 179221 7586 -121898 32141
10311 32141 182456 314267 430737 524894 181482 -39922 -136007 -294283 -319574 -135265
10301 -135265 -151297 -322376 -281609 -216362 -3340 -11154 -139687 -116087 -162342 -111120 -15181
10290 -15181 155101 139042 217382 176465 12123 -27057 -8913 -36496 -6098 -64560 83926
10279H3926J53864n666j81628m1891n4545p8882R0886J02648J41202J13411K100
10268C25425o3816j26559J38691j26026k9295J06811O2356n5839j09604p8904
10258D3240j44820m8749J72957r7343l2736j8930N9420K15401K6820o6833r6429
10247A1998N4179o8334P8353J37302r8076o1185q8437R5298p381m9845J75783
10236A79655j2693j41893q9281Q0931l4178k9037K08720j60869j28412p8249K9776
10225a75530N5275O58l6149k7462R8462J9597p1770K2955J55809N317J51785J00494
10213B99441j25888Q2066m6234k58119j32850Q2278J40067J07414Q7363n1256
10203A84282M907o6864r9884m3063n3186O3136o9204r1210l3469J4715J31490
$$ plain form
10279 83926 237790 232124 50496 8605 -45940 -124822 -33936 68712 209914 323325 325425
10268 325425 261609 135050 273741 147715 118420 225231 287587 231748 122144 43240
10258 43240 -101580 -150329 22628 -74715 -107451 -126381 -66961 148440 175260 108427 11998
10247 11998 66177 -2157 76196 213498 115422 54237 -34200 61098 53717 3872 179655
10236 179655 166962 25069 -64212 16719 -17459 -46496 162224 1355 -127057 -205306 -175530
10225 -175530 -120255 -119597 -155746 -183208 -84746 -65149 -136919 -113964 41845 47162 198947 299441
10213 299441 173553 255619 209385 -48734 -181584 -99306 40761 148175 235538 184282
10203 184282 189189 122325 22441 -20622 -73808 -10672 -79876 -171086 -204555 -189840 -58350
10192e8350N5122q7347P6131l2904j23231n1413k7315Q7944K09397k2151J829
10181B7712j219J00492J02297m915j46494J6094P7315K8927j12924r7727J44812
10170A34370P5222j30966J40443q9839j00314p669M2752J6840J18396K2954j12572
10159A09617M0597K9399k7715n8658k6361j6919j29398m0528k0915k2975P3653
10148i0203o849J29589j12533k9767n9318j11577J70095J96628K01974K0583k24046
10137H4576J07007J08891j54239k55989M0413K38060J9139j60936j1437J50792
10127A66277j40810j05975L0717Q8224J68168J1503n7615r6537j74285j9041J15760
10116a3614N2694p3944O8109K7872P2121n9866l8959r4044j12271l5255K4219
$$ plain form
10192 -58350 -3228 -90575 -14444 -47348 -170579 -221992 -249307 -161363 48034 25883 27712
10181 27712 26493 126985 229282 224367 77873 93967 171282 200209 87285 -10442 134370
10170 134370 209592 78626 219069 129230 28916 21247 63999 80839 199235 222189 109617
10159 109617 150214 179613 151898 93240 66879 49960 -79438 -119966 -140881 -163856 -90203
10148 -90203 -97052 32537 -79996 -109763 -169081 -280658 -110563 86065 288039 308622 84576
10137 84576 191583 300474 146235 -109754 -69341 168719 187858 26922 15485 166277
10127 166277 25467 -80508 -49791 38433 206601 218104 160489 63952 -110333 -129374 -13614
10116 -13614 39080 -34864 33245 61117 133238 73372 34413 -59631 -171902 -207157 -182938
10105a82938R0059J90265J23273J00300j12560r9727N4919L69q4864O4599n7578
10094H6117j99841k5581P0874L3823P4616J11235o2793k6006K5201l6637n4989
10083c981n5270j5036O47J12073L8092p4237j6625N8976m432R5391L2114j52604
10071A5108q732M5624J9304l5680J39828J35763J10931l5664k16226Q904J31320
10060C10480P2574K67338M29909Q13769R57065N96215j41444q89379p68637n04172
10050A143718k49051j80697j32373o8581j03018L3753p134p4179n6978j47636
10040A57824R5471M8850L9606N9569j50597n4284j23293j78604o8151R3374K80183
10029A99948R2557N6001o4007q157m39j07392J740n8010j0866J2302j01207J93860
$$ plain form
10105 -182938 -92879 97386 220659 320959 208399 108672 163591 163960 79096 143695 86117
10094 86117 -113724 -139305 -68431 -34608 40008 151243 88450 62444 87645 51008 -3981
10083 -3981 -59251 -74287 -73640 38433 76525 2288 -14337 44639 40207 135598 167712 15108
10071 15108 6376 52000 71304 35624 175452 311215 422146 386482 170256 179160 310480
10060 310480 383054 650392 1080301 1894070 2851135 3447350 3305906 2416527 1647890 1143718
10050 1143718 894667 713970 581597 513016 409998 443751 436617 362438 305460 157824
10040 157824 253295 302145 341751 401320 250723 196439 73146 -105458 -173609 -80235 199948
10029 199948 292505 348506 284499 276342 275903 168511 170251 112241 101375 113677 12470 206330
10017B06330K02186J74383q8400j52172j26422P7203j7512K9898J40327n9676
10007C86145j58737j66715j6239Q0489J84165P8169K8377l675j68095k15524j43975
9996a15615K1486J31868N7199Q5664J34118q4389j09600l3588l2177o15J74547
9985B28898m6629m0768l2642r4723n791j453o4739J26085j7297m5143r9277n2430
9973a45909j88155n3346R1222M6298P1096J52709k48436o6693J93778k0270Q206
9962a59500J31968N8585j07390J02737J37402j99094m767j8561J00734q5882J305
9951d2463M7879J74540N1138L7664j47199q4014k4751J24958j58316j97877q1330
9940b99771L1189P7213K18659n1025q2626m1398K12429J00416p3215R9832J3967
$$ plain form
10017 206330 408516 582899 494499 342327 215905 293108 275596 305494 445821 386145
10007 386145 227408 60693 44454 124943 309108 387277 415654 411979 243884 28360 -115615
9996 -115615 -94129 37739 94938 180602 314720 230331 120731 87143 54966 54351 228898
9985 228898 182269 141501 108859 14136 8345 6892 -57847 68238 50941 5798 -93479 -145909
9973 -145909 -334064 -387410 -296188 -249890 -178794 -26085 -274521 -341214 -147436 -167706 -159500
9962 -159500 -27532 31053 -76337 26400 163802 -35292 -40059 -58620 42114 -43768 -42463
9951 -42463 5416 179956 231094 268758 121559 37545 12794 137752 -20564 -218441 -299771
9940 -299771 -268582 -191369 27290 -23735 -106361 -147759 64670 165086 91871 191703 205670
9929B05670j66338m4836J19555j1047j10132p7978O0693j2063R5768R4950k7410
9918A26832k66M2024J8115j41124j99053Q5005J28137R5890L7939l5352q8026
9907G0121k57499k5532K41285L5315n7348J7078P6034J39371N8859n9415l3755
9896B04514L1496K8200o9987K8755m0172q9399M2833m4439j44546o7863j39147
9885b59755J35715m0818J08885j7369p2953M5996Q8993J75650N5605j54781j0023
9874E5145l4220m259j6847j63954r5012J33937N9552L4551R8007k5817O0859K75818
$$ plain form
9929 205670 39332 -5504 114051 103004 -7128 -85106 -24413 -36476 59292 154242 126832
9918 126832 126566 168590 186705 45581 -153472 -68467 59670 155560 193499 158147 70121
9907 70121 -187378 -212910 28375 63690 6342 23420 99454 238825 297684 238269 204514
9896 204514 236010 264210 194223 222978 182806 93407 136240 91801 -52745 -120608 -259755
9885 -259755 -124040 -164858 -55973 -73342 -146295 -100299 -11306 164344 219949 65168 55145
9874 55145 20925 16666 -181 -164135 -259147 -125210 -65658 -31107 66900 41083 101942 377760
$$ [...]
##END NTUPLES=NMR SPECTRUM
##END=
