##TITLE=Analysis number 321365
Compound Code cc 58504
Book Reference 196/186
Project Code adrs
Chemist Name jimp
##JCAMPDX= 6.0         $$ Bruker NMR JCAMP-DX V2.0
##DATA TYPE= NMR SPECTRUM
##DATA CLASS= NTUPLES
##ORIGIN= Bruker BioSpin GmbH
##OWNER= nmr
$$ XWIN-NMR		Version 3.5
$$ Mon Aug  7 14:14:07 2006 GMT Daylight Time (UT+1h)  MAYBRIDGE\nmr@NMR_250MHZ
##.OBSERVE FREQUENCY= 250.131544655141
##.OBSERVE NUCLEUS= ^1H
##.ACQUISITION MODE= SIMULTANEOUS (DQD)
##.ACQUISITION SCHEME= undefined
##.AVERAGES= 16
##.DIGITISER RES= 18
##SPECTROMETER/DATA SYSTEM= dpx250
##.PULSE SEQUENCE= zg30
##.SOLVENT NAME= CDCl3
##.SHIFT REFERENCE= (INTERNAL, CDCl3, 0, 16.522)
##AUDIT TRAIL= $$ (NUMBER, WHEN, WHO, WHERE, WHAT)
$$ ##TITLE= Audit trail, XWIN-NMR		Version 3.5
$$ ##JCAMPDX= 5.01
$$ ##ORIGIN= Bruker BioSpin GmbH
$$ ##OWNER= nmr
$$ C:\u/data/dgb/nmr/ADRS/390/pdata/1/auditp.txt
$$ ##AUDIT TRAIL=  $$ (NUMBER, WHEN, WHO, WHERE, WHAT)
(   1,<2006-08-07 14:13:46.78 +100>,<MAYBRIDGE\nmr>,<NMR_250MHZ>,
      <created by zg, POWCHK disabled, PULCHK disabled
       configuration hash MD5:
       E2 DF 36 D8 04 B2 41 60 5A D7 A3 38 5A 4B D0 FE
       data hash MD5: 64K
       AC 1F 7B 55 84 8C 10 6F 5A CD 83 0E 64 D2 77 44>)
(   2,<2006-08-07 14:13:59.53 +100>,<MAYBRIDGE\nmr>,<NMR_250MHZ>,
      <Start of raw data processing
       ef LB = 0.3 FT_mod = 6 PKNL = 1 SI = 32K 
       data hash MD5: 32K
       5D F2 93 B5 D1 89 10 49 CF A4 1F 9A 3B 79 40 1A>)
(   3,<2006-08-07 14:14:01.31 +100>,<MAYBRIDGE\nmr>,<NMR_250MHZ>,
      <apk 
       data hash MD5: 32K
       F4 01 63 25 F9 6D 55 FC 7B E9 1E 11 5E FC 30 A5>)
(   4,<2006-08-07 14:14:02.12 +100>,<MAYBRIDGE\nmr>,<NMR_250MHZ>,
      <abs ABSG = 5 
       data hash MD5: 32K
       BE ED 27 15 28 68 A7 4B 83 F4 BB A3 3B 6E C6 47>)
$$ ##END=
$$ 
$$ hash MD5
$$ FE 82 5B EE CE BD 2B 18 C5 1B F1 A5 70 5F 87 BE
##$RELAX= 
##$RELAX= 
##$RELAX= 
##$RELAX= 
##$RELAX= 
##$RELAX= 
##$RELAX= 
$$ Bruker specific parameters
$$ --------------------------
##$DU= <C:\u>
##$EXPNO= 390
##$NAME= <ADRS>
##$PROCNO= 1
##$TYPE= <nmr>
##$USER= <dgb>
##$AMP= (0..31)
100 100 100 100 100 100 100 100 100 100 100 100 100 100 100 100 100 100 
100 100 100 100 100 100 100 100 100 100 100 100 100 100 
##$AQSEQ= 0
##$AQ_mod= 3
##$AUNM= <au_zg>
##$AUTOPOS= <36 >
##$BF1= 250.13
##$BF2= 250.13
##$BF3= 250.13
##$BF4= 250.13
##$BF5= 500.13
##$BF6= 500.13
##$BF7= 500.13
##$BF8= 500.13
##$BYTORDA= 1
##$CFDGTYP= 0
##$CFRGTYP= 5
##$CHEMSTR= <none>
##$CNST= (0..31)
1 1 145 1 1 1 1 1 1 1 1 1 1 1 1 1 1 1 1 1 1 1 1 1 1 1 1 1 1 1 1 1 
##$CPDPRG= <>
##$CPDPRG1= <>
##$CPDPRG2= <>
##$CPDPRG3= <>
##$CPDPRG4= <mlev>
##$CPDPRG5= <mlev>
##$CPDPRG6= <mlev>
##$CPDPRG7= <mlev>
##$CPDPRG8= <mlev>
##$CPDPRGB= <>
##$CPDPRGT= <>
##$D= (0..31)
0 1 0 0 0 0 0 0 0 0.06 0 0 0 0 0 0 0.0002 0 0 0 0 0 0 0 0 0 0 0 0 0 0 
0 
##$DATE= 1154956425
##$DBL= (0..7)
120 120 120 120 120 120 120 120 
##$DBP= (0..7)
150 150 150 150 150 150 150 150 
##$DBP07= 0
##$DBPNAM0= <>
##$DBPNAM1= <>
$$ [...]
##$SUBNAM7= <"">
##$SUBNAM8= <"">
##$SUBNAM9= <"">
##$SW= 20.6930455092707
##$SWIBOX= (0..15)
0 0 3 0 0 0 0 0 0 0 0 0 0 0 0 0 
##$SW_h= 5175.983436853
##$TD= 65536
##$TD0= 1
##$TE= 295.16
##$TE2= 300
##$TE3= 300
##$TEG= 300
##$TL= (0..7)
0 120 120 120 120 120 120 120 
##$TP= (0..7)
150 150 150 150 150 150 150 150 
##$TP07= 0
##$TPNAME0= <>
##$TPNAME1= <>
##$TPNAME2= <>
##$TPNAME3= <>
##$TPNAME4= <>
##$TPNAME5= <>
##$TPNAME6= <>
##$TPNAME7= <>
##$TPOAL= (0..7)
0.5 0.5 0.5 0.5 0.5 0.5 0.5 0.5 
##$TPOFFS= (0..7)
0 0 0 0 0 0 0 0 
##$TUNHIN= 0
##$TUNHOUT= 0
##$TUNXOUT= 0
##$USERA1= <user>
##$USERA2= <user>
##$USERA3= <user>
##$USERA4= <user>
##$USERA5= <user>
##$V9= 5
##$VALIST= <valist>
##$VCLIST= <CCCCCCCCCCCCCCC>
##$VD= 0
##$VDLIST= <DDDDDDDDDDDDDDD>
##$VPLIST= <PPPPPPPPPPPPPPP>
##$VTLIST= <TTTTTTTTTTTTTTT>
##$WBST= 1024
##$WBSW= 4
##$XGAIN= (0..3)
0 0 0 0 
##$XL= 0
##$YL= 0
##$YMAX_a= 534621
##$YMIN_a= -888672
##$ZGOPTNS= <>
##$ZL1= 120
##$ZL2= 120
##$ZL3= 120
##$ZL4= 120
##$ABSF1= 16.522
##$ABSF2= -4.171173
##$ABSG= 5
##$ABSL= 3
##$ALPHA= 0
##$AQORDER= 0
##$ASSFAC= 0
##$ASSFACI= 0
##$ASSFACX= 0
##$ASSWID= 0
##$AUNMP= <proc_1d>
##$AZFE= 0.1
##$AZFW= 0.1
##$BCFW= 0
##$BC_mod= 0
##$BYTORDP= 0
##$COROFFS= 0
##$CY= 12.5
##$DATMOD= 1
##$DC= 0
##$DFILT= <>
##$DTYPP= 0
##$F1P= 14.0000005364418
##$F2P= -0.99999901652339
##$FCOR= 0.5
##$FTSIZE= 32768
##$FT_mod= 6
##$GAMMA= 0
##$GB= 0
##$INTBC= 1
##$INTSCL= 1
##$ISEN= 128
##$LB= 0.3
##$LEV0= 0
##$LPBIN= 0
##$MAXI= 10000
##$MC2= 0
##$MEAN= 0
##$ME_mod= 0
##$MI= 0
##$NCOEF= 0
##$NC_proc= -4
##$NLEV= 6
##$NOISF1= 0
##$NOISF2= 0
##$NSP= 0
##$NTH_PI= 0
##$NZP= 0
##$OFFSET= 16.522
##$PC= 1
##$PHC0= 146.2992
##$PHC1= 5.372837
##$PH_mod= 1
##$PKNL= yes
##$PPARMOD= 0
##$PSCAL= 4
##$PSIGN= 0
##$REVERSE= no
##$SF= 250.13
##$SI= 32768
##$SIGF1= 0
##$SIGF2= 0
##$SINO= 400
##$SIOLD= 32768
##$SREGLST= <1H.CDCl3>
##$SSB= 0
##$STSI= 32768
##$STSR= 0
##$SW_p= 5175.98343685301
##$SYMM= 0
##$S_DEV= 0
##$TDeff= 65536
##$TDoff= 0
##$TI= <Analysis number 999999
Compound Code 99
Book Reference 9
Project Code 9>
##$TILT= no
##$TM1= 0
##$TM2= 0
##$TOPLEV= 0
##$USERP1= <user>
##$USERP2= <user>
##$USERP3= <user>
##$USERP4= <user>
##$USERP5= <user>
##$WDW= 1
##$XDIM= 32768
##$YMAX_p= 449990856
##$YMIN_p= -119600
$$ End of Bruker specific parameters
$$ ---------------------------------
##NTUPLES= NMR SPECTRUM
##VAR_NAME=  FREQUENCY,     SPECTRUM/REAL,   SPECTRUM/IMAG
##SYMBOL=    X,             R,               I
##VAR_TYPE=  INDEPENDENT,   DEPENDENT,       DEPENDENT
##VAR_FORM=  AFFN,          ASDF,            ASDF
##VAR_DIM=   32768,         32768,           32768
##UNITS=     HZ,            ARBITRARY UNITS, ARBITRARY UNITS
##FACTOR=    0.157963299565203, 1,           1
##FIRST=     4132.6476996994, 0,             0
##LAST=      -1043.33573715361, 0,           0
##MIN=       -1043.33573715361, -119600,     0
##MAX=       4132.6476996994, 449990856,     0
$$ Real data points
##PAGE= N=1
##DATA TABLE= (X++(R..R)), XYDATA
$$ [...]
20708F8301j4220q642k447j3471j74k7554r005j6060l904Q106M067K084o961j1567
$$ 68301 54081 45439 42992 29521 29347 1793 -7212 -23272 -27176 -19070 -15003 -12919 -19880 -31447
20694c1447n01j0704n610M4348J9058j8625l0572k559K5436K7440K4418J4998
$$ -31447 -31948 -42652 -48262 -3914 15144 -3481 -34053 -36612 -11176 16264 40682 55680
20682E5680k2806j1098j9608J21N837K6443J5703j3622p268J4063q26k9025R694
$$ 55680 32874 21776 2168 2289 8126 34569 50272 36650 29382 43445 42619 13594 23288
20669B3288k2599r189N841Q216P786j578Q251J4812l2706p720J1545J5922J5136
$$ 23288 689 -8500 -2659 5557 13343 11765 20016 34828 2122 -5598 5947 21869 37005
20656C7005K0966L400j8746j1677p383J0987j2573M777n519j1599K62L819j2652
$$ 37005 57971 61371 42625 30948 23565 34552 21979 26756 21237 9638 9900 13719 1067
20643A067r818j5958K583Q825M178J2579O367K190R767J1296l2629M166N986k1513
$$ 1067 -8751 -24709 -22126 -13301 -9123 3456 9823 12013 21780 33076 447 4613 10599 -10914
20629a0914l4114R702J1732J0036J1891O444K2659Q804n166j5802r596k270p68
$$ -10914 -45028 -35326 -23594 -13558 -1667 4777 27436 36240 31074 15272 5676 3406 2638
20616B638J2591k870k0954j9446n808J6718K9396L0626j5380k8580l7152j1062
$$ 2638 15229 12359 -8595 -28041 -33849 -17131 12265 42891 27511 -1069 -38221 -49283
20604d9283K9994L4244K0683j5727k1934J7113K24N338Q419k953j0707j3416J0078
$$ -49283 -19289 14955 35638 19911 -2023 15090 15314 20652 29071 26118 15411 1995 12073
20591A2073q51k7536J775J318l7270P812J3942J4075Q2j2242K8650K5279P019
$$ 12073 11222 -16314 -14539 -13221 -50491 -42679 -28737 -14662 -14580 -26822 1828 27107 34126
20578C4126j7699l8482k0647K0900K4109J6954j732M603R297k2365R684K4688
$$ 34126 16427 -22055 -42702 -21802 2307 19261 17529 22132 31429 9064 18748 43436
20566D3436j843J0892j9108j5044m878j2669k0586J6420K8537J7891r164l595
$$ 43436 41593 52485 33377 18333 13455 786 -19800 -3380 25157 43048 33884 30289
20554C0289j8296j0618q10J3617J5303J320n046q144j1449J1338l846L073J972
$$ 30289 11993 1375 565 14182 29485 30805 25759 17615 6166 17504 13658 16731 18703
20541A8703k3901J4053J5017p827j8860l4978J9913M8139j7763j3895m083K6919
$$ 18703 -5198 8855 23872 16045 -2815 -37793 -17880 30259 12496 -1399 -5482 21437
20529B1437Q759j5242j6358L1629K06m2435N428L2012r158j9259m39K0839J3996
$$ 21437 30196 14954 -1404 30225 30431 -12004 -6576 25436 16278 -2981 -3420 17419 31415
20516C1415l607k112k2180m554r646J2052j8837K3129j4070J955m488J1185J8345
$$ 31415 27808 25696 3516 -1038 -10684 1368 -17469 5660 -8410 -6455 -10943 242 18587
20503A8587J5920P162j0538k069k4183n239J8329K4550n662m0802o820K6217j9306
$$ 18587 34507 41669 31131 29062 4879 -360 17969 42519 36857 -3945 -10765 15452 -3854
20490c854q905K7163J595n743k2804r698j6938L854J0619r201O68M3097K9828
$$ -3854 -12759 14404 15999 10256 -12548 -22246 -39184 -35330 -24711 -33912 -33244 9853 39681
20477C9681p039j4399k2956L637J5004J4419k0242J2972J2871N883L1397j3330
$$ 39681 32642 18243 -4713 -1076 13928 28347 8105 21077 33948 39831 71228 57898
20465E7898n0646r749P588R999L0279N606k1112q346K4095N029l996k317l6463
$$ 57898 7252 -2497 5091 15090 45369 50975 29863 21517 45612 50641 46645 44328 7865
20452G865k9240M255J7836J0881l382J8339j9040O380L2203N672r851K589p406
$$ 7865 -21375 -17120 716 11597 8215 26554 7514 13894 46097 51769 41918 44507 37101
20439C7101J1936j8266M256j3507k1619j9222N934J6749L9212J7887k018l48p791
$$ 37101 49037 30771 35027 21520 -99 -19321 -13387 3362 42574 60461 58443 58095 50304
20426E0304j5345l660j235J088k9116m494K7258j4808p512j6604J5125O859J9069
$$ 50304 34959 31299 30064 31152 2036 -2458 24800 9992 2480 -14124 1001 7860 26929
20413B6929K227N686L538P79K916M706j8542j05K826K6644o325l545K2966l1302
$$ 26929 29156 34842 38380 39159 42075 46781 28239 28134 30960 57604 51279 47734 70700 39398
20399C9398k8560j5705J0037K662m207J8673q81J4745J5743J2087p410k292l231
$$ 39398 10838 -4867 5170 7832 3625 22298 21417 36162 51905 63992 56582 54290 51059
20386E1059j8030j6298J4847j1411p961k134j3581p81l355J7824J6Q876J7616
$$ 51059 33029 16731 31578 20167 12206 10072 -3509 -4290 -7645 10179 10195 19071 36687
20373C6687O257J5403j3630k4000J0577j505k3160j3611j2395j7385m810L9024
$$ 36687 42944 58347 44717 20717 31294 29789 6629 -6982 -19377 -36762 -41572 -2548
20361b548n343j4123j3090n85l277M8131K6883k1771J2084o607J579J3303J1845
$$ -2548 -7891 -22014 -35104 -35689 -38966 9165 36048 14277 26361 19754 21333 34636 46481
20348D6481j0868l3091k6874J1744J2316M032m387l1238j4554J7697r750Q581
$$ 46481 35613 2522 -24352 -12608 -292 3740 -647 -31885 -46439 -28742 -38492 -29911
20336b9911K5583K1145p250j3937O422k0730R201J5468k4850N205N097L721j0455
$$ -29911 -4328 16817 9567 -4370 2052 -18678 -9477 5991 -18859 -13654 -8557 -4836 -15291
20323a5291q073j765M430K3749L1425m5q67O549k8296k000M782R710J6078j5161
$$ -15291 -23364 -25129 -20699 3050 34475 34430 33563 40112 11816 9816 14598 24308 40386 25225
20309B5225K844k7831m181K0970p177L553K9333k683j0969j4008J2782K5463j3823
$$ 25225 28069 238 -3943 17027 9850 13403 42736 40053 29084 15076 27858 53321 39498
20296C9498r764j5925l832J5739P782q975k0508q778M020J4825L4792k5682m0323
$$ 39498 29734 13809 9977 25716 33498 24523 4015 -4763 -743 14082 48874 23192 -17131
20283a7131m00N423K2252K2755L5064j419k269K677O863j9889j1700r015P42J2791
$$ -17131 -17531 -12108 10144 32899 67963 66544 64275 66952 73815 53926 42226 33211 33953 46744
20269D6744K4587k943k4407k2020j8048j47P738K4242K1330K807m395k9459k1354
$$ 46744 71331 68388 43981 21961 3913 3766 11504 35746 57076 59883 55488 26029 4675
20256D675m523m530J8137O781j1389q34M504o033k7056K1541p366q846J4011M1814
$$ 4675 152 -4378 13759 20540 9151 8317 12821 6788 -20268 1273 -6093 -14939 -928 40886
20242D0886n304R575J4147k533K0948k4325N853j1987k9991l490j1401m335k766
$$ 40886 35582 45157 59304 56771 77719 53394 59247 47260 17269 13779 2378 -1957 -4723
20229d723k945p837K9041j391l2402r231K5474J7843K2491J6953j0030k271k0073
$$ -4723 -7668 -15505 13536 12145 -20257 -29488 -4014 13829 36320 53273 43243 40972 20899
20216B0899l995J0833L296j8796Q896K6527L271J8888k1917m6923l6280J2825
$$ 20899 16904 27737 31033 12237 21133 47660 50931 69819 47902 979 -35301 -22476
20204b2476L3067k2491J2038L4591j646J0523o056p668k928k1350j0494L9659
$$ -22476 10591 -11900 138 34729 33083 43606 37550 29882 26954 5604 -4890 34769
20192C4769N851l982R212K0064P339j6115m2454n933K5019J0602j2607l2942j6462
$$ 34769 40620 36638 45850 65914 73253 57138 14684 8751 33770 44372 31765 -1177 -17639
20179a7639k907L1239K4132r083j4051n789K0982j7183k0982L7023J8410J1762
$$ -17639 -20546 10693 34825 25742 11691 5902 26884 9701 -11281 25742 44152 55914
20167E5914M449j3474q482o266K7927L1682K786j6218m8715j8606n340J7794L2110
$$ 55914 60363 46889 38407 32141 60068 91750 94536 78318 29603 10997 5657 23451 55561
20154E5561L1302k976L589j4925r005j1697k631Q755k3402l3980j6858j3088K6017
$$ 55561 86863 83887 87476 72551 63546 51849 49218 57973 34571 591 -16267 -29355 -3338
20141c338J7586j0309Q824J4632K1402k195k4170J9055L4638l2982k6885J3301
$$ -3338 14248 3939 12763 27395 48797 46602 22432 41487 76125 43143 16258 29559
20129B9559k3779j8902J5474P226K7537N154m782O127j1387k9055J6102j0825
$$ 29559 5780 -13122 2352 9578 37115 42269 37487 43614 32227 3172 19274 8449
20117H449j3394K1601L4826k8066l0783J108K1004O494J398K2102O344k1867P98
$$ 8449 -4945 16656 51482 23416 -7367 -6259 14745 21239 22637 44739 51083 29216 30014
20104C0014m839P41J6532m042l424j5830j1097j2111J3268L563J6672m779J984
$$ 30014 25175 25916 42448 38406 34982 19152 8055 -4056 9212 12775 29447 24668 26652
20091B6652m157J7599l8473K3442N0119K9041j6404O887j5578q057n34l295l366
$$ 26652 22495 40094 1621 25063 75182 104223 87819 94706 79128 71071 70537 67242 63876
20078F3876k6853r417M969L425r352J2336R964j688o38J2344j1117m888L5099
$$ 63876 37023 27606 32575 36000 26648 38984 48948 47260 46622 58966 47849 42961 78060
20065G8060q442l5309j5539J2806M809N006M338J0448k170j8628q734J7849K3226
$$ 78060 69618 34309 18770 31576 36385 41391 45729 56177 54007 35379 26645 44494 67720
20052F7720k3400l243M800M893l37J3369k886j9021k5116j0894p993K2150L0470
$$ 67720 44320 41077 45877 50770 50433 63802 60916 41895 16779 5885 -2108 20042 50512
20039E0512K215q100k1796Q114R020J6418J9516o406j8836q600Q129j9861K2788
$$ 50512 52727 44627 22831 30945 39965 56383 75899 69493 50657 42057 50186 30325 53113
20026E3113L515j1665j4206p464j6966q468J4404L8903J5374n388O537l867m623
$$ 53113 56628 44963 30757 23293 6327 -2141 12263 51166 66540 61152 67689 63822 59199
20013E9199O241k0966k4473l8834j817R4J2220J921J0966J8266K1045O813p092
$$ 59199 65440 44474 20001 -18833 -20650 -20556 -8336 -6415 4551 22817 43862 50675 43583
20000D3583l6117J8254J7872j4989o648j8495O294N391j212K1559O057j2836k082
$$ 43583 7466 25720 43592 28603 21955 3460 9754 15145 13933 35492 41549 28713 26631
19987B6631k08J9959J1242n186J3819k82j6702N801k3590p025r376J7168J5416
$$ 26631 26423 46382 57624 52438 66257 65975 49273 55074 31484 24459 15083 32251 47667
19974D7667m6988j4723K8454O267J1864K0090J7739j6240q054m503J0582K897
$$ 47667 679 -14044 14410 20677 32541 52631 70370 54130 46076 41573 52155 55052
19962E5052q559j3796N184R763r161k0028P260K2488o795o261M183M70Q078p598
$$ 55052 46493 32697 37881 47644 38483 18455 25715 48203 41408 35147 39330 39800 47878 40280
19948D0280O971K7748m366j0899k7382q849J5875K7775K8476K116q93L315Q495
$$ 40280 47251 74999 70633 59734 32352 23503 39378 67153 95629 97745 96852 100167 108662
19935A08662k4666j3529L0766j1775k0468j1817J8584K2618O795j1570J57J0088
$$ 108662 83996 70467 101233 89458 68990 57173 75757 98375 105170 93600 93757 103845
19923A03845j8525k5922J5972j21l770J4950n57l0125j193J6999J687n457K7261
$$ 103845 85320 59398 75370 75249 71479 86429 85872 55747 54554 71553 73240 67783 95044
19910I5044R82l8433j241R141P936M038k4742j4690K3895J1170K2629P663O42
$$ 95044 96026 57593 56352 65493 73429 77467 52725 38035 61930 73100 95729 103392 104034
19897A04034k1031k1817R912m685k8538Q299M58J5325o295j1830k0144j9872K3619
$$ 104034 83003 61186 71098 66413 37875 46174 46632 61957 55662 43832 23688 3816 27435
19884B7435J4761J7913K8024J4572J7493R30l8493l363j1536j4323n17M627R722
$$ 27435 42196 60109 88133 102705 120198 121128 82635 79272 67736 53413 52896 57523 67245
19871F7245j8919p291k5638R27L3625K63j6897k7157j7979L5850K4511j5769K6054
$$ 67245 48326 41035 15397 16324 49949 50212 33315 6158 -11821 24029 48540 32771 58825
19858E8825j0002j219J310K0358r310j9724J1710l246k757L864K8021L871J3529
$$ 58825 48823 47604 48914 69272 59962 40238 51948 48702 45945 49809 77830 81701 95230
19845I5230K0770J1049k7504k7493P887L072j3607j5125k3261r679k607L1053
$$ 95230 116000 127049 99545 72052 79939 83011 69404 54279 31018 21339 18732 49785
19833D9785J7683K4406M235q429n629j5472K6819K724N93j4643J0083K0788M0755
$$ 49785 67468 91874 96109 87680 82051 66579 93398 96122 96715 82072 92155 112943 153698
19820A53698j4049j9497J9976k3385j0672P724K8394O214j6587k4479j2772n496
$$ 153698 139649 120152 140128 116743 106071 113795 142189 148403 131816 107337 94565 89069
19808H9069l6429k8124K429r680R720l278j1640J4207K7283p328p203L649p864
$$ 89069 52640 24516 26945 17265 26985 23707 12067 26274 53557 46229 39026 42675 34811
19795C4811r292K468K670J4429K7932J5612J99j157J2978R169P178m189l4755
$$ 34811 25519 27987 30657 45086 73018 88630 88829 87672 100650 109819 116997 112808 78053
19782G8053k5674j972L3132L1670J4828j4309j9453k9823Q440L5233o776m2501
$$ 78053 52379 50407 83539 115209 130037 115728 96275 66452 74892 110125 103349 60848
19770F0848j5444K3780L5563J5866K0406j4128m1882l8777J0941J0775L1427K0752
$$ 60848 45404 69184 104747 120613 141019 126891 85009 46232 57173 67948 99375 120127
19758A20127J376J5208j5020j6983k489K4916Q208k9473k1385p935M047m535M136
$$ 120127 121503 136711 121691 104708 102219 127135 135343 105870 84485 76550 80597 76062 80198
19745H0198o455M759J6120r471p855j2476P631Q057j8628J4694J0576q884n825
$$ 80198 73743 78502 94622 85151 77296 64820 72451 80508 61880 76574 87150 78266 72441
19732G2441O145N918M985j3961Q375l378J2550j3528j4113j2402N496J5384L4875
$$ 72441 78586 84504 89489 75528 83903 80525 93075 79547 65434 53032 58528 73912 108787
19719A08787K167K445O083J4991K4704n603k887o617j6429m3776m188M446m626
$$ 108787 110954 113399 119482 134473 159177 153574 150687 144070 127641 83865 79677 84123 79497
19706G9497k2500O715L1742J0785n068L7797N595k8376o040l076J8444J3749m892
$$ 79497 56997 63712 95454 106239 101171 138968 144563 116187 110147 107071 125515 139264 134372
19693A34372k694N1J5245j4103P462P721j7465j2442J8060P676J0713M193k3878
$$ 134372 131678 131729 146974 132871 140333 148054 130589 118147 136207 143883 154596 158789 134911
19680A34911Q340l080M975N559m220J213J655m137L187N047q474l749j4118J1880
$$ 134911 143251 140171 145146 150705 146485 147698 149353 145216 148403 153450 144976 141227 127109 138989
19666A38989J8591J0303l953J2557J121p879r46Q084o831N716J9751L8740M2709
$$ 138989 157580 167883 163930 176487 177608 169729 168783 176867 170036 175752 195503 234243 276952
19653B76952L4843M1453P4939N8752L3368L7294P883k6147J8662j645j1904P262
$$ 276952 311795 353248 428187 486939 520307 557601 565484 539337 557999 556354 544450 551712
19641E51712J7920m202O693k4401l3036k2019l4665k3144m2548o4512k7775m0871
$$ 551712 569632 565430 572123 547722 514686 492667 458002 434858 392310 327798 300023 259152
19629B59152m8939l4159J7187J2229j1045q811J0103R869l231L1854K5016j4956
$$ 259152 210213 176054 193241 205470 194425 185614 195717 205586 202355 234209 259225 244269
19617B44269l065o946o550o849q46l2018p598K9030L1497K2250M8980K9774L6083
$$ 244269 241204 234258 227708 220859 220013 187995 180397 209427 240924 263174 312154 341928 378011
19604C78011L8363N4052O6058L3048L4166K1112J6295J2294N568l0123l8664m939
$$ 378011 416374 470426 536484 569532 603698 624810 641105 653399 658967 628844 590180 585241
19592E85241K0583K7686M174l2608m2181l8556n0599m6973q242m2487o1064l1261
$$ 585241 605824 633510 637684 605076 562895 524339 473740 426767 418525 376038 314974 283713
19580B83713k5761j1240K9374n62l1362l365j7621k8623J3973r841r017k074q278
$$ 283713 257952 246712 276086 275524 244162 240797 223176 194553 208526 198685 189668 187594 179316
19567A79316K1463k26o873P007J7836J6413l6678k3597j8638p788R191j896R880
$$ 179316 200779 200553 193680 200687 218523 234936 198258 174661 156023 148235 157426 155530 165410
19554A65410J0459R021J5850j3072L714q630j574k017k2680p629K4351J8276J0647
$$ 165410 175869 184890 200740 187668 191382 182752 181178 179161 156481 148852 173203 191479 202126
19541B02126j4470P991J4891J5774q938j8528J8842L4548k6880k5320K9246M7002
$$ 202126 187656 195647 210538 226312 217374 198846 217688 252236 225356 200036 229282 276284
19529B76284J3701j187M1364K5389K8865L8825M2082L6271J1197J7241J1973J3367
$$ 276284 289985 288798 330162 355551 384416 423241 465323 501594 512791 530032 542005 555372
19517E55372J9957M0538P459o374J2067l235m0169l8353k8623J2279P061l1608
$$ 555372 575329 615867 623326 616952 629019 625784 585615 547262 518639 530918 537979 506371
19505E06371m0684m373k6157k3448m3833k6977k3620k9702l4103j2376q913k609
$$ 506371 465687 461314 435157 411709 367876 340899 317279 287577 253474 241098 232185 229576
19493B29576J2147K0627K1425N271j5059P010K3695L507J283K4K5665K0052J310
$$ 229576 241723 262350 283775 289046 273987 280997 304692 308199 309482 309506 335171 355223 356533
19480C56533K4240K6988P727K8881M0507M3419J6616J047M3069K7323J1098K5520
$$ 356533 380773 407761 415488 444369 484876 528295 544911 545958 589027 616350 627448 652968
19468F52968M5859J1717o193j4306l604J3421k8270m8219j5408l1423j4672m2946
$$ 652968 698827 710544 704351 690045 686441 699862 671592 623373 607965 576542 561870 518924
19456E18924m2903K415l8695m8926K979J1661j3805k4848j9065p370j1556N385
$$ 518924 476021 478436 439741 390815 393794 405455 391650 366802 347737 340367 328811 334196
19444C34196j5786k7189j9089l1709P630K3933J2539J2327p548P674o886l0216
$$ 334196 318410 291221 272132 240423 248053 271986 284525 296852 289304 296978 290092 259876
19432B59876N756R581K67k1312j293J2131j565j9119q976r828J7620p145k1692
$$ 259876 265632 275213 275480 254168 252875 265006 263441 244322 235346 225518 243138 235993 214301
19419B14301J7151P341j8337l9761K145K8428j1375J8529P528K3362M4586m395
$$ 214301 231452 238793 220456 180695 182840 211268 199893 218422 225950 249312 293898 289503
19407B89503j0555J8546J7405j1882P63j2219r746K1257K2803K5348m224k0009
$$ 289503 278948 297494 314899 303017 303780 291561 281815 303072 325875 351223 346999 326990
19395C26990K323M333l1140j1513O418K1608M770k7418J403j2305L646P873j370
$$ 326990 329313 333646 302506 290993 297411 319019 323789 296371 297774 285469 289115 296988 295618
19382B95618J0112j2567j1641r401J3246k745j7624r90P878M303k244j0213l5631
$$ 295618 305730 293163 281522 272121 285367 282622 264998 264008 271886 276189 273945 263732 228101
19369B28101M134j1770J93J9377L8295J4145k650P670J5454L6259K5860l6067
$$ 228101 232235 220465 220658 240035 278330 292475 289825 297495 312949 349208 375068 339001
19357C39001j9188l199J0131Q4J170N683J1566N464j0383J817o144r100K2298
$$ 339001 319813 316614 326745 326829 327999 333682 345248 350712 340329 342146 336002 326902 349200
19344C49200J969R688p582k371J1280L2q585j5848l736M707L342q215J8151K335
$$ 349200 351169 360857 353275 350904 362184 362216 353631 337783 334047 338754 342096 333881 352032 354367
19330C54367k107j0066n598j4618K4893K6570j5057l608q202R773r9M997K475
$$ 354367 352260 342194 336596 321978 346871 373441 358384 354776 346574 356347 356248 361245 363720
19317C63720N277J7837j1804j8383N010l606j6790R223J4088K8402L0925j4196
$$ 363720 368997 386834 375030 356647 361657 358051 341261 350484 364572 392974 423899 409703
19305D09703N49K263K171j2902Q599j1396Q758m729m21L0707n832J202n386j7625
$$ 409703 410252 412515 414686 401784 410383 398987 407745 403016 402595 433302 427470 428672 423286 405661
19291D05661p775O771K3985M9078N2000J6185j2100j950M0408N8094N4489Q2545
$$ 405661 397886 404657 428642 477720 529720 545905 533805 531855 572263 630357 684846 767391
19279G67391J22004K04968K46542J68118J02270Q3424N6050J5434j30937j88444
$$ 767391 889395 1094363 1340905 1509023 1611293 1694717 1750767 1766201 1635264 1446820
19269A446820j48853q0949l2444n0227o508R131K7174K7742J8753J7840M5332
$$ 1446820 1297967 1217018 1184574 1134347 1127839 1136970 1164144 1191886 1210639 1228479 1273811
19258A273811P7317J06858J48169J20875M5950K2845M8226K0419m8224j28592
$$ 1273811 1351128 1457986 1606155 1727030 1772980 1795825 1844051 1864470 1816246 1687654
19248A687654j58310j36347p5188N716O3340J11465J51115J28433J38625J26362
$$ 1687654 1529344 1392997 1317809 1323525 1386865 1498330 1649445 1777878 1916503 2042865
19238B042865J05781M5159l948q8114p7053m8861r498K2743O5943O6108L7717
$$ 2042865 2148646 2193805 2189857 2101743 2024690 1975829 1966331 1989074 2055017 2121125 2158842
19227B158842N7151M3471N6871P4308O4794J53857K15345K09392J27271P8054
$$ 2158842 2215993 2259464 2316335 2390643 2455437 2609294 2824639 3034031 3161302 3239356
19217C239356M7689P32q2297k39492l31441k98920k07616j27218r9908o5661m7346
$$ 3239356 3287045 3287777 3205480 2965988 2634547 2335627 2128011 2000793 1900885 1835224 1787878
19206A787878k6160j7520l0225k6892k9867q596J401K2353M883P525L0152J6655
$$ 1787878 1761718 1744198 1713973 1687081 1657214 1648618 1650019 1672372 1677255 1684780 1714932 1731587
19194A731587L4965M7534Q5360R3650N8347K8373N3814R2169Q9585J02716J21241
$$ 1731587 1766552 1814086 1899446 1993096 2051443 2079816 2133630 2225799 2315384 2418100 2539341
19183B539341O7093P6427J03051J19219J21133O4196L7745P0701P7601J29462
$$ 2539341 2606434 2682861 2785912 2905131 3026264 3090460 3128205 3198906 3276507 3405969
19173C405969J64396J62100J62333J71908K04866K15376K07273K19635K06925
$$ 3405969 3570365 3732465 3894798 4066706 4271572 4486948 4694221 4913856 5120781
19164E120781K26269K74933L66715M39183N74090P59920J005773J348530J843384
$$ 5120781 5347050 5621983 5988698 6427881 7001971 7761891 8767664 10116194 11959578
19155A1959578K641037L893930N585690P339992Q528184R121159R162675Q464423
$$ 11959578 14600615 18494545 24080235 31420227 39948411 49069570 58232245 66696668
19147F6696668O729814M028357J405423j41996o95539p54164n51000L22702J760986
$$ 66696668 73426482 77454839 78860262 78718266 78022727 77268563 76717563 77040265 78801251
19138G8801251K586066J656253r69529m054657o460269q043187r091521r395471
$$ 78801251 81387317 83043570 82074041 78019384 71559115 63515928 54424407 45028936
19130D5028936q613867o801537m802996l145770k059927j394976r74042p31281
$$ 45028936 36415069 29613532 24810536 21664766 19604839 18209863 17235821 16504540
19122A6504540n30851m02629l32043k50509j35270j14945q0400J9753J42949K69702
$$ 16504540 15973689 15571060 15239017 14988508 14853238 14738293 14657893 14677646 14820595 15090297
19112A5090297M61657P54316J114305J613296K347879L523278N259635P370082
$$ 15090297 15551954 16306270 17420575 19033871 21381750 24905028 30164663 37534745
19104C7534745R335164J0583898J0949048J0431241Q787671O053566K834616L05266
$$ 37534745 46869909 57453807 68402855 78834096 87621767 93675333 96509949 96815215
19096I6815215j169127j597606j321482l01397J533895K962312K693089K81230
$$ 96815215 95646088 94048482 92727000 92425603 93959498 96921810 99614899 99896129
19088I9896129l364842o672536r238127j1016933j1745322j1093958r083162o608824
$$ 99896129 96531287 89858751 80620624 69603691 57858369 46764411 37681249 31072425
19080C1072425m505988l067022k217067j715333j333107j097509r34698q24627
$$ 31072425 26566437 23499415 21282348 19567015 18233908 17136399 16201701 15377074
19072A5377074p28718o33137n68770n23752m95348n05083n33701n13191m72717
$$ 15377074 14648356 14015219 13446449 12922697 12427349 11922266 11388565 10875374 10402657
19063A0402657m62657m41231l80861l61449l78666l10849k83677k59709k60134
$$ 10402657 9940000 9498769 9117908 8756459 8377793 8066944 7783267 7523558 7263424
19054G263424k18356j62587j37054j43656j33247j01377j03281j02064r2007m2238
$$ 7263424 7045068 6882481 6745427 6601771 6468524 6367147 6263866 6161802 6069795 6027557
19044F027557l0043l3324p1559m6574n818J3089L5385O303M353J8294M7438O5839
$$ 6027557 5997514 5964190 5892631 5846057 5840239 5853328 5888713 5895016 5899369 5917663 5965101 6030940
19032F030940R1939J25769J40219J72425K04502K47562L57295M90008O62615R34743
$$ 6030940 6122879 6248648 6388867 6561292 6765794 7013356 7370651 7860659 8523274 9458017
19022I458017J352372J765849K068546K531575L206375L715110M048836M396558
$$ 9458017 10810389 12576238 14644784 17176359 20382734 24097844 28146680 32543238
19014C2543238M645613N056616N573271N042699M353849M335213M100373L611756
$$ 32543238 37188851 42245467 47818738 52861437 57215286 61550499 65650872 69262628
19006F9262628K538168R05997O33282N95949q02886k027460k754076l373000l641611
$$ 69262628 71800796 72706793 73340075 73936024 73133138 71105678 68351602 64978602 61336991
18997F1336991m361500n125859m904540m597798m495920m126334l826514l387743
$$ 61336991 56975491 51849632 46945092 42347294 37851374 33725040 29898526 26510783
18989B6510783k797504k400134k081466j615620j159666p78342n16514l46336
$$ 26510783 23713279 21313145 19231679 17616059 16456393 15678051 15161537 14815201
18981A4815201j97231j16457j6913J10962L44196N71634R19944J429270K029136
$$ 14815201 14617970 14501513 14484600 14595562 14939758 15511392 16431336 17860606 19889742
18972A9889742K457076K917850L836369M846209N375692N743053O115389O573797
$$ 19889742 22346818 25264668 29101037 33947246 39322938 45065991 51181380 57755177
18964E7755177P572493P712334O417560N802622N959543N610081M585856K275503
$$ 57755177 65327670 73040004 79457564 85260186 91219729 96829810 101415666 103691169
18956A03691169N35428R44135K90942k099277l455014m217769m730161n266461
$$ 103691169 104226597 105170732 105461674 103362397 99907383 95689614 90959453 85692992
18948H5692992o741459p480347o904288o637643o614675o275044n823283m956678
$$ 85692992 78951533 71471186 64566898 57929255 51314580 45039536 39216253 34259575
18940C4259575m047390l553682l043774k377069j827562j440446j121677q73720
$$ 34259575 30212185 26658503 23614729 21237660 19410098 17969652 16847975 15974255
18932A5974255p47505p12909o40948n18746m92819m88794m84806n03558n31189
$$ 15974255 15226750 14513841 13872893 13354147 12861328 12372534 11887728 11384170 10852981
18923A0852981n39624n41844n10273m29774l38848k64702j96598j37963j11491
$$ 10852981 10313357 9771513 9261240 8831466 8492618 8227916 8031318 7893355 7781864
18914G781864j45249j42890j62058j90404k42562k91103l77421l89568l28051
$$ 7781864 7636615 7493725 7331667 7141263 6898701 6607598 6230177 5840609 5512558
18905E512558k50177j74885j20142o6303j6898q947l9097j7610J3864O8393R4365
$$ 5512558 5262381 5087496 4967354 4901051 4884153 4875206 4836109 4818499 4832363 4900756 4995121
18894D995121N6970N683l7975n4464q8785j09947k28238l65304m01421l08323
$$ 4995121 5052091 5057774 5019799 4965335 4876550 4766603 4538365 4173061 3771640 3463317
18884C463317k08849j69918j12173q2848p2569j03787r2869r9313p9602m8440
$$ 3463317 3254468 3084550 2972377 2889529 2816960 2713173 2620304 2520991 2441389 2392949
18874B392949p2450n4849n8665k4935j3106m5117k4541m1737m3505n6355k9691
$$ 2392949 2320499 2265650 2206985 2182050 2168944 2123827 2099286 2057549 2014044 1957689 1927998
18863A927998k6127P010R123l0423n7561k2477J7204N116m233K4769M6114K5369
$$ 1927998 1901871 1908881 1918004 1887581 1830020 1807543 1824747 1829863 1825630 1850399 1896513 1921882
18851A921882M3606O8129P3327O0072J11371J16612L8955M1640N1720P1643N1852
$$ 1921882 1965488 2033617 2106944 2167016 2278387 2394999 2433954 2475594 2527314 2598957 2650809
18840B650809l0817n1994j8057j6076q9541j16326r8718q4883p4174j08049r6433
$$ 2650809 2619992 2567998 2549941 2533865 2444324 2327998 2229280 2144397 2070223 1962174 1865741
18829A865741q5291q8078n3643l4956k1071j2844l5368l8279k029p450l3221j1728
$$ 1865741 1780450 1692372 1638729 1603773 1582702 1569858 1534490 1496211 1494182 1486732 1453511 1441783
18817A441783J9118J4271r703J1449J8375N685J891k8753J6563O4392J6687K8340
$$ 1441783 1460901 1475172 1465469 1476918 1495293 1500978 1502869 1474116 1490679 1555071 1571758 1600098
18805A600098L9099P2045P7465Q8514J43076J27964J38383J75178J71115J25676
$$ 1600098 1639197 1711242 1788707 1877221 2020297 2148261 2286644 2461822 2632937 2758613
18795B758613J21190J13242J15100J11414J00750R2103Q0707P5158N9090Q4577
$$ 2758613 2879803 2993045 3108145 3219559 3320309 3412412 3493119 3568277 3627367 3711944
18785C711944O4842P2412P9309P4429J14812J30212J79091K11710L10010M44959
$$ 3711944 3776786 3849198 3928507 4002936 4117748 4247960 4427051 4638761 4948771 5393730
18775E393730O50741Q99034J314270J989230K997175M037797M781476N407368
$$ 5393730 6044471 6943505 8257775 10247005 13244180 17281977 22063453 27470821
18767B7470821N235995M083265L250116J992709P19536l49700j376502r89769
$$ 27470821 32706816 36790081 40040197 42032906 42752442 42402742 41026240 40036471
18759D0036471J1306J246647J650167J199386P33672o29585k092776l910481n531851
$$ 40036471 40047777 41294424 42944591 44143977 44877649 44248064 42155288 38244807 32712956
18750C2712956n476666m888470l913851k683672j690858j096527p63824n64655
$$ 32712956 27236290 22347820 18433969 15750297 14059439 12962912 12199088 11634433
18742A1634433m16006k97141k26947k26531j97099j38935p2088j4367N7876J82478
$$ 11634433 11218427 10921286 10694339 10467808 10270709 10131774 10059686 10045319 10103195 10285673
18732A0285673L37194M89964O48052Q64671J207560J686978K466711L742157N589281
$$ 10285673 10622867 11112831 11760883 12625554 13833114 15520092 17986803 21728960 27318241
18723B7318241P709432R571624J1178113J1298083R562841P589518N026498K322263
$$ 27318241 35027673 44599297 55777410 67075493 76638334 84227852 89254350 91576613
18715I1576613m19655k989385l408499k047454L12293J899553K407438J843287
$$ 91576613 91156958 88167573 84759074 82711620 83023913 84923466 87330904 89174191
18707H9174191k48437k790635o303230r485306j0784636j0764142r250362p089965
$$ 89174191 88925754 86135119 79831889 70346583 59561947 48797805 39547443 32457478
18699C2457478n022460l435421k382266j677971j240169j033164r23934q07427
$$ 32457478 27435018 23999597 21617331 19939360 18699191 17666027 16742093 15934666
18691A5934666p03866n97340n44147m72063l85053k80425j70430p5715J2351P3048
$$ 15934666 15230800 14633460 14089313 13617250 13232197 12951772 12781342 12705627 12717978 12791026
18681A2791026J70418L57872O04090J014470J682827K747258M099416N305869
$$ 12791026 12961444 13319316 13923406 14937876 16620703 19367961 23467377 28773246
18673B8773246O202555O692240N587880M194768K942422J089040n32885k320722
$$ 28773246 34975801 41668041 47255921 51450689 54393111 55482151 54949266 52628544
18665E2628544l020629k020537n70405J038863J413518J061135L57181j240576
$$ 52628544 49607915 47587378 47016973 48055836 49469354 50530489 50887670 49647094
18657D9647094k929718n090920o445632o129397n407662m251584k887836j911449
$$ 49647094 46717376 41626456 35180824 29051427 23643765 19392181 16504345 14592896
18649A4592896j325253r60470p90978o82055n91881n15413m89483m42606m02165
$$ 14592896 13267643 12307173 11516195 10834140 10242259 9726846 9237363 8794757 8392592
18640H392592l23390k33173k14060k24026j94080k17425k42311k20631k47922
$$ 8392592 8069202 7836029 7621969 7397943 7203863 6986438 6744127 6523496 6275574
18631F275574k39877k61725k78423k31180j73891j51372j19236j62499j60318
$$ 6275574 6035697 5773972 5495549 5264369 5090478 4939106 4819870 4657371 4497053
18622D497053j36997j13687q6322q2352n2966o1787n7618m1526k1268l5649l9017
$$ 4497053 4360056 4246369 4160047 4077695 4024729 3962942 3905324 3863798 3842530 3806881 3767864
18611C767864j6770k881O6251Q5548Q5330Q2775J12840J47000J61832J74278K10931
$$ 3767864 3751094 3748213 3814464 3900012 3985342 4068117 4180957 4327957 4489789 4664067 4874998
18600D874998K45498K61511K36062K05182K28421K68847L09323M00657M93009
$$ 4874998 5120496 5382007 5618069 5823251 6051672 6320519 6629842 7030499 7523508
18591G523508O96806R84782J466793K176478L100372L980319M417453M897987
$$ 7523508 8220314 9205096 10671889 12848367 15948739 19929058 24346511 29244498
18583B9244498O024641P020198O251458M239844L395198M040547L713645J247021
$$ 29244498 35269139 42289337 48540795 52780639 56175837 60216384 63930029 65177050
18575F5177050p78508M3845J464509K06720k305670k869045k134961k801611n263844
$$ 65177050 64398542 64442387 65906896 66113616 63807946 60938901 58803940 56002329 50738485
18566E0738485o813030o148002m978414m682016m481358l596460k449811j640684
$$ 50738485 43925455 37777453 32799039 28117023 23635665 20039205 17589394 15948710
18558A5948710j104083p59352n61134m45251l47829k88374k28974j41368j03416
$$ 15948710 14844627 14085275 13524141 13078890 12731061 12442687 12213713 12072345 11968929
18549A1968929k320P4237J84387K88806M91114P65945J096402J643191K502867
$$ 11968929 11966609 12040846 12225233 12514039 13005153 13771098 14867500 16510691 19013558
18540A9013558L750219N081427N885651O430701P765982R547912R379366O817396
$$ 19013558 22763777 27845204 33730855 40161556 47927538 57475450 66854816 73672212
18532G3672212M972635N460694N606163K803250p25516p32380J313743L68213
$$ 73672212 78644847 84105541 89711704 92514954 91789438 91057058 92370801 92739014
18524I2739014l038202m452806l477189l805984o813407r347322q873396p218609
$$ 92739014 89700812 85248006 81770817 77964833 71151426 61804104 52930708 45712099
18516D5712099o609574o435481n396678l876296k602973j800131j385216j072650
$$ 45712099 39102525 32667044 27270366 23394070 20791097 18990966 17605750 16533100
18508A6533100q09657o93250o31104n21058m52692m44996l74515l17652k78334
$$ 16533100 15723443 15030193 14399089 13878031 13425339 12980343 12605828 12288176 12009842
18499A2009842k20127j46204l1041J24657K84421O03127J073045J617168J980411
$$ 12009842 11789715 11643511 11612470 11737127 12021548 12624675 13697720 15314888 17295299
18490A7295299K146128K592521L368698L615602K730987J779305J859494K136122
$$ 17295299 19441427 22033948 25402646 29018248 31749235 33528540 35388034 37524156
18482C7524156J250246k32482n71290J70318Q806j223946j877186j533583j452785
$$ 37524156 38774402 38541920 37970630 38140948 38149754 36925808 35048622 33515039 32062254
18473C2062254k441937l476471l411401k810544k567662k462445k173450j629910
$$ 32062254 29620317 26143846 22732445 19921901 17354239 14891794 12718344 11088434
18465A1088434j108141p77742n88674m69812l86702l47136k94681l05322l11122
$$ 11088434 9980293 9202551 8613877 8144065 7757363 7410227 7115546 6810224 6499102
18456F499102k72326k68527k71472k05163k01162j99132k08487k12926j07968
$$ 6499102 6226776 5958249 5686777 5481614 5280452 5081320 4872833 4659907 4551939
18447D551939j02135j24072j40073j59156j39380j43918q4228l4957p8439j03424
$$ 4551939 4449804 4325732 4185659 4026503 3887123 3743205 3658977 3624020 3545581 3442157
18437C442157r0129o0996q3278p7991o8906n9615p2305l8534m2252j1639l5124
$$ 3442157 3352028 3291032 3207754 3129763 3060857 3001242 2928937 2890403 2848151 2836512 2801388
18426B801388k1039j6773o5043o7691o2815n2663m1503m0118o0663p2357n0625
$$ 2801388 2780349 2763576 2698533 2630842 2568027 2515364 2473861 2433743 2373080 2300723 2250098
18415B250098j3190k2319l1735n6577m1683p2261q7303j00749r7565q6459p4395
$$ 2250098 2236908 2214589 2182854 2126277 2084594 2012333 1925030 1824281 1726716 1640257 1565862
18404A565862p9186l4685k1791k5906j4509n081l4491k3768l0784j1180N962k5718
$$ 1565862 1486676 1451991 1430200 1404294 1389785 1384704 1350213 1326445 1295661 1284481 1290443 1264725
18392A264725k7471l5777l1474J6288j2867j7077Q945N6282K8459K5646j3547
$$ 1264725 1237254 1201477 1170003 1186291 1173424 1156347 1165292 1221574 1250033 1275679 1262132
18381A262132J4331M334r787R690J8985J3840J8242L2831r797k885J8051K5299
$$ 1262132 1276463 1280797 1271010 1280700 1299685 1313525 1331767 1364598 1354801 1351916 1369967 1395266
18369A395266M2038M4749N3480N2446O7313O5624J774k7991k3638p1535q0826
$$ 1395266 1437304 1482053 1535533 1587979 1655292 1720916 1722690 1694699 1671061 1599526 1518700
18358A518700p2943n6125m5894n4887k1618j2752M080m82j6254L0404M8241l2072
$$ 1518700 1445757 1389632 1343738 1288851 1267233 1254481 1258561 1258079 1241825 1272229 1320470 1288398
18346A288398n9776n7956k0171n00k560R911N9364N7040K1735K3581L7103O0033
$$ 1288398 1228622 1170666 1150495 1149995 1147435 1157346 1216710 1273750 1295485 1319066 1356169 1416202
18334A416202J05218M5549L1729N4087O0454P3097O0950M9395Q2799J26851J02330
$$ 1416202 1521420 1566969 1598698 1652785 1713239 1786336 1847286 1896681 1979480 2106331 2208661
18323B208661P3322J03712J08557Q7645M5369M9479K9065N9169N0287k6268n1379
$$ 2208661 2281983 2385695 2494252 2581897 2627266 2676745 2705810 2764979 2815266 2788998 2737619
18312B737619P731Q5578M9347J5341Q773J9749k637r5378q3007j18573j06243
$$ 2737619 2745350 2830928 2880275 2895616 2904389 2924138 2921501 2826123 2743116 2624543 2518300
18301B518300j17517q2164l3928J6091M1127O4162K6943N9866M4868M6705R0326
$$ 2518300 2400783 2318619 2284691 2300782 2341909 2406071 2433014 2492880 2537748 2584453 2674779
18290B674779Q6652J27412J83808K16539K18943J81097J89407K40846K06973J63283
$$ 2674779 2761431 2888843 3072651 3289190 3508133 3689230 3878637 4119483 4326456 4489739
18280D489739J74438K46101K84632L35095L82165N10471O81174J017356J508884
$$ 4489739 4664177 4910278 5194910 5530005 5912170 6422641 7103815 8121171 9630055
18271I630055J865728J540526R39960R99082J236074J102314L62527k12293M28212
$$ 9630055 11495783 13036309 13976269 14975351 16211425 17313739 17676266 17463973 17892185
18262A7892185J769636L549534O232566R949975J2676389J2276165J0662261Q187082
$$ 17892185 19661821 23211355 29443921 39393896 52070285 64346450 75008711 83195793
18254H3195793O026433M880994O84096n823060j1500236j2522216q453151m723255
$$ 83195793 89222226 94103220 94787316 88964256 77464020 64941804 56488653 51765398
18246E1765398l947348l862740j480779P93369K75246o50740k47879k8671j337071
$$ 51765398 47818050 43955310 42474531 43267900 43543146 42892406 42644527 42615856 41278785
18237D1278785m200163n751324m577434k785614j528076p32313j98765L72083
$$ 41278785 37078622 31327298 26749864 23964250 22436174 21703861 21505096 21877179
18229B1877179R78637J536753J348734O36455M61678O68181O87478J67460m85453
$$ 21877179 22855816 24392569 25741303 26377758 26839436 27507617 28195095 28362555 27877102
18220B7877102q3725J116269K656132M600093P128948R911788J1768830J4454024
$$ 27877102 27793377 28909646 31565778 36165871 43294819 53206607 64975437 79429461
18212G9429461J9943004K1517581J3633573O169833O231184R056575N283756n912556
$$ 79429461 99372465 120890046 134523619 140693452 146924636 155981211 161264967 155352411
18204A55352411r753059j402842R290314J1323605N138393K26967o88672j975289
$$ 155352411 145599352 144196510 153486824 164810429 169948822 170175789 169487117 167511828
18196A67511828q595287j7697142k2304460k0404300j7042767j4147958j0142230
$$ 167511828 158916541 141219399 118914939 98510639 81467872 67319914 57177684
18189E7177684o105306l043463j351909j352707j720285j245499p54912j016238
$$ 57177684 51072378 48028915 46677006 45324299 43604014 42358515 41603603 40587365
18181D0587365k463904l469426k846029j757548r42934n41627k33520K52263J056873
$$ 40587365 38123461 34654035 31808006 30050458 29107524 28565897 28332377 28584640 29641513
18172B9641513K187441L718001N450908O029665M095614K344955K488555K872717
$$ 29641513 31828954 35546955 40997863 47027528 51123142 53468097 55956652 58829369
18164E8829369J791106o36017q02639K103553L799867N081817R483520J5427106
$$ 58829369 60620475 59984458 59181819 61285372 65085239 70167056 79650576 95077682
18156I5077682J8194079J4580306Q809577L206098N87741j156163p582763j5399324
$$ 95077682 113271761 127852067 136661644 139867742 140455483 139299320 131716557 116317233
18148A16317233k2443244k2840639j6111724r759520n933400l651063k051572
$$ 116317233 93873989 71033350 54921626 45162106 39228706 35577643 33526071
18141C3526071o62560M00397L32379o53964r26835o00152o98390j836377l378783
$$ 33526071 32863511 33263908 33596287 32942323 32015488 31415336 30716946 28880569 25501786
18132B5501786l456217k504712j668064j115292p55455m75205l86467l87017l49371
$$ 25501786 22045569 19540857 17872793 16757501 16002046 15526841 15140374 14753357 14403986
18123A4403986k61947k35438k88247l72401l74128l28122k86642k07155j49068
$$ 14403986 14142039 13906601 13618354 13245953 12871825 12543703 12257061 12049906 11900838
18114A1900838j21163r0114K6632L20973P81000J679122L424203N886579N628466
$$ 11900838 11779675 11689561 11716193 12037166 12818166 14497288 17921491 23808070 29436536
18105B9436536J256912J96302J603232J847920j130119p030662p546161m434224
$$ 29436536 30693448 30889750 32492982 34340902 33210783 26180121 18633960 14199736
18097A4199736k388677j405643q67008o16382m58231l61966l04146k44163k46048
$$ 14199736 11811059 10405416 9538408 8922026 8463795 8101829 7797683 7553520 7307472
18088G307472l18340l20846k81780k20392j90485j65327j83177k07288j98713
$$ 7307472 6989132 6668286 6386506 6166114 5975629 5810302 5627125 5419837 5221124
18079E221124j93973j63222j70728j66778j29700j22498q3715o0304m6228n1389
$$ 5221124 5027151 4863929 4693201 4526423 4396723 4274225 4190510 4130206 4083978 4032589
18069D032589m6784j6846J0752K1723n1596r2668j08951j07441j12813j32237
$$ 4032589 3985805 3968959 3979711 4001434 3949838 3857170 3748219 3640778 3527965 3395728
18059C395728r5032j08209j63010j53496j33246j29538q4024n5578o2270m4405
$$ 3395728 3300696 3192487 3029477 2875981 2742735 2613197 2529173 2473595 2411325 2366920
18049B366920l9778m4763k5646m6812n7411j7683j7535K1723N9369N1726k0544
$$ 2366920 2327142 2282379 2256733 2209921 2152510 2134827 2117292 2139015 2198384 2250110 2229566
18038B229566l1971m6544l5457m0894j14082j31049j53783j03907p4618n1515
$$ 2229566 2197595 2151051 2115594 2074700 1960618 1829569 1675786 1571879 1497261 1445746
18028A445746m3507l2371m590m694K7536O6969M2938M5786L2240K9215L0285k662
$$ 1445746 1402239 1369868 1365278 1360584 1388120 1455089 1498027 1543813 1576053 1605268 1635553 1632891
18016A632891k8221j2648P389p978l4920k6808k2645j0940j8057l2343n4929m7529
$$ 1632891 1604670 1592022 1599411 1591433 1556513 1529705 1507060 1496120 1478063 1445720 1390791 1343262
18004A343262m8120l9394o0169k3187j4997m5552n2414j9101K0514N6808j13K1958
$$ 1343262 1295142 1255748 1195579 1172392 1157395 1111843 1059429 1040328 1060842 1117650 1117537 1139495
17992A139495M7271j8359j0474J9906K5108J5237M546Q256J6863j310K0224J9311
$$ 1139495 1186766 1168407 1157933 1177839 1202947 1218184 1222730 1230986 1247849 1246539 1266763 1286074
17980A286074L5465k8209r3672o2583k6959J3265j0675j0959K2839K1354r290
$$ 1286074 1321539 1293330 1199658 1137075 1110116 1123381 1112706 1101747 1124586 1145940 1136650
17969A136650l1302J5377J5004J2337L434m4919k5431J089r683k3490L87j3338
$$ 1136650 1105348 1120725 1135729 1148066 1151500 1106581 1081150 1082239 1072556 1049066 1049453 1036115
17957A036115l3502k9369k5065k8027m0186O542J3499K0720N3620K6941K523N3408
$$ 1036115 1002613 973244 948179 920152 879966 886508 900007 920727 974347 1001288 1003811 1057219
17945A057219N6312J5819j7551L344Q0669R9491J01440M6398N980Q593J6314l7149
$$ 1057219 1113531 1129350 1111799 1115143 1195812 1295303 1396743 1443141 1449121 1457714 1474028 1436879
17933A436879p3572o8005r3728p3430m5439n0147n2907k6243j4602j1267k9620
$$ 1436879 1363307 1295302 1201574 1128144 1082705 1032558 979651 953408 938806 927539 897919
17922H97919n3357n2517l3712k5802k2134J1469K2487P593P896m925k2932M0692
$$ 897919 844562 792045 758333 732531 710397 721866 744353 751946 759842 754917 731985 772677
17910G72677n021J2968J202j5229j5688q614m601M5144K3886K5619J5287N3096
$$ 772677 767656 780624 781826 766597 750909 742295 737694 782838 806724 832343 847630 900726
17898I00726O7814M8326O3501Q7919M5525P3716L6858J7140M6216N0336L096l6731
$$ 900726 968540 1016866 1080367 1168286 1213811 1287527 1324385 1341525 1387741 1438077 1441173 1404442
17886A404442l2673o0978m4443j1981Q38k6397o336k0931m1760k3559o865N571
$$ 1404442 1371769 1310791 1266348 1254367 1255205 1228808 1222472 1201541 1159781 1136222 1129357 1134928
17874A134928L087J1115r98k0076r895J2431L0363J5472K3177J5k347J6973J0252
$$ 1134928 1138015 1149130 1148132 1128056 1118161 1130592 1160955 1176427 1199604 1199619 1197272 1214245 1224497
17861A224497J0026J7092J4300J8367L2619L2506m271M555m778J1771R737J9019
$$ 1224497 1234523 1251615 1265915 1284282 1316901 1349407 1345136 1349691 1344913 1356684 1366421 1385440
17849A385440k987N82J0695K7066N0703J3189J9693J7423K2572M1427L2515P0451
$$ 1385440 1382453 1383035 1393730 1420796 1471499 1484688 1504381 1521804 1544376 1585803 1618318 1688769
17837A688769Q0169N2680J8952r188J4308o43L1563J7938M2973N5290N9457J0552
$$ 1688769 1768938 1821618 1840570 1831382 1845690 1845047 1876610 1894548 1937521 1992811 2052268 2062820
17825B062820K440J9254M6447L7004N0700J2153K6676L1848M6791N0832Q9047
$$ 2062820 2065260 2084514 2130961 2167965 2218665 2230818 2257494 2289342 2336133 2386965 2476012
17814B476012O5464J2296L9178P0206J08152J11005J05888J20545J40434J70256
$$ 2476012 2541476 2553772 2592950 2663156 2771308 2882313 2988201 3108746 3249180 3419436
17804C419436J42545J39152K23321K31752K77768L17285L57828M12375M64818
$$ 3419436 3561981 3701133 3924454 4156206 4433974 4751259 5109087 5521462 5986280
17795E986280M79361N51623O87136Q22365R98756J222521J695209K436132L128697
$$ 5986280 6465641 7017264 7704400 8526765 9525521 10748042 12443251 14879383 18008080
17786A8008080L321031L193354L481078L935580L523646K222274J290500J668480
$$ 18008080 21329111 24522465 28003543 31939123 35462769 37685043 38975543 40644023
17778D0644023K927419M538104P308024J1415119J4495487J4216594J2004664
$$ 40644023 43571442 48109546 55417570 66832689 81328176 95544770 107549434
17771A07549434J1310715J2989278J4845924J5574670J4993559J1630186O517703
$$ 107549434 118860149 131849427 146695351 162270021 177263580 188893766 195411469
17764A95411469N057595P727851O756843l860839j9283978k7041196k3370333
$$ 195411469 200469064 208196915 214953758 211092919 191808941 164767745 141397412
17757A41397412j5911444j1513626j0477785r691713p308255m514051l225687
$$ 141397412 125485968 113972342 103494557 93802844 86494589 81980538 78754851
17750G8754851k805377k174903j972176l233150n555341o736261n561037l290877
$$ 78754851 75949474 73774571 71802395 68569245 63013904 56277643 50716606 47425729
17742D7425729q97307J558208M472325P041633O481600L869598L945662O126375
$$ 47425729 46528422 48086630 52558955 59600588 66082188 69951786 73897448 80023823
17734H0023823P839049O473096K557438K182837M159389M424293M248133L728201
$$ 80023823 87862872 94335968 96893406 99076243 103235632 107659925 111908058 115636259
17726A15636259L704171L692966M86097k389903r81635K952892O038698O611517
$$ 115636259 119340430 123033396 123519493 121129590 120147955 123100847 129139545 135751062
17718A35751062N963462N700897M862604N141986P379082R736572Q531165K099368
$$ 135751062 141714524 147415421 152278025 157420011 164799093 174535665 183066830 185166198
17710A85166198o321190j1798288j0604495o533861o390388j2365403j9246477
$$ 185166198 178845008 167046720 156442225 149908364 143517976 131152573 111906096
17703A11906096j9677646j4568485q984962n165652k933309j513026L13767L168906
$$ 111906096 92228450 77659965 68675003 63509351 60576042 59063016 59376783 62545689
17695F2545689N620949N499828N025022O672607Q038134O434598L411678L576256
$$ 62545689 68166638 73666466 78691488 85364095 93402229 99836827 103248505 106824761
17687A06824761O859846P119310K117057j919029o39250Q16864k966779j0587116
$$ 106824761 113684607 120803917 122920974 121001945 120362695 121179559 118212780 107625664
17679A07625664j4505048j1645375p199917o015994p117833o389004m432538l703960
$$ 107625664 93120616 81475241 74275324 68259330 61141497 54752493 50319955 46615995
17671D6615995m597066n322906m460370l178234k285600j725899j380354j115161
$$ 46615995 42018929 36696023 32235653 29057419 26771819 25045920 23665566 22550405
17663B2550405r12518p49020o65633o36795n81547m87236l99427l20069k95165
$$ 22550405 21637887 20888867 20223234 19586439 19004892 18517656 18118229 17798160 17502995
17654A7502995k02550o1674J90183M99469R96744J899679L281954M248748L152822
$$ 17502995 17300445 17238771 17428954 17928423 18925167 20824846 24106800 28355548 31508370
17645C1508370J689601K072693L194021L844515L338526K258769M24473r18563
$$ 31508370 33197971 35270664 38464685 42309200 45647726 47906495 48330968 47412405
17637D7412405K40054J557148Q87811k580646n498193n332604l988806k301876
$$ 47412405 47652459 49209607 50097418 47516772 42018579 36685975 32697169 30395293
17629C0395293j300056j556092l210116m290160l502974k297409j528183j083135
$$ 30395293 29095237 27539145 24329029 20038869 16535895 14238486 12710303 11627168
17621A1627168q36574o78686n60129m51244l78476l57892l41006l37274k99961
$$ 11627168 10790594 10111908 9551779 9100535 8722059 8364167 8023161 7685887 7385926
17612G385926k42973k46076k31227k49374k57680k42987k44684k20272j64598
$$ 7385926 7142953 6896877 6665650 6416276 6158596 5915609 5670925 5450653 5286055
17603E286055j43258j54691k23830k13524j71395j50495j50948j39557j43207
$$ 5286055 5142797 4988106 4764276 4550752 4379357 4228862 4077914 3938357 3795150
17594C795150j50058j19753r2174r6073j25330o6231l9885k1823m5204k6894m162
$$ 3795150 3645092 3525339 3433165 3337092 3211762 3145531 3105646 3083823 3038619 3011725 3007563
17583C007563p375k7089m0576n6761l6028l1215j03182j38644r8805p0043p7623
$$ 3007563 3000188 2973099 2932523 2875762 2839734 2808519 2705337 2566693 2467888 2397845 2320222
17572B320222r9444j26639j00712o1081q4011j15689p9885n5861m9405n1322n2870
$$ 2320222 2220778 2094139 1993427 1932346 1848335 1732646 1652761 1596900 1547495 1496173 1443303
17561A443303l9589k7645k2381J4492l0420m2065j3131k4088j9506m6192r311
$$ 1443303 1403714 1376069 1353688 1368180 1337760 1295695 1282564 1258476 1238970 1192778 1183467
17550A183467j4735j6715k3487m983N902r25j8827k5213l2144k5798k8050K2661
$$ 1183467 1168732 1152017 1128530 1123547 1129449 1128524 1109697 1084484 1052340 1026542 998492 1021153
17538A021153M6285K3190J2366m2232o0301p037L8374J5359k0799l6099m0402
$$ 1021153 1067438 1090628 1102994 1060762 1000461 993424 1031798 1047157 1026358 990259 949857
17527I49857n6076m5470K7920J5899k0953l2859l6836m0642k9752j1141r504O087
$$ 949857 893781 848311 876231 892130 871177 838318 801482 760840 731088 719947 710443 716530
17515G16530J3623k6715L214K315j4775K9157J6802J1227J9977N7678Q7244Q6434
$$ 716530 730153 703438 706652 708967 694192 723349 740151 751378 771355 829033 916277 1002711
17503A002711J10823J03426O6133O1591P2820N2314J8903J8961j2447l2428J6065
$$ 1002711 1113534 1216960 1283093 1344684 1417504 1469818 1488721 1507682 1495235 1462807 1478872
17492A478872O0806M0527q7176j59110j51871q8526k6111n8734o2348l1684J446
$$ 1478872 1539678 1580205 1493029 1333919 1182048 1093522 1067411 1008677 946329 914645 916091
17481I16091m511J0995N7996N9306J12839J28963J35235J76033K45942K22832
$$ 916091 911580 922575 980571 1039877 1152716 1281679 1416914 1592947 1838889 2061721
17471B061721K14116J96286J32450L1267j02043j88581k19979k67286k42568k08878
$$ 2061721 2275837 2472123 2604573 2635840 2533797 2345216 2125237 1857951 1615383 1406505
17461A406505j68109q6113q8745o0514r005K1527j3796m8448k9833K0554Q2528
$$ 1406505 1238396 1152283 1063538 1003024 994019 1015546 1001750 953302 923469 944023 1026551
17450A026551P5092N8970K2010L8109J3439J0203N0070O0102o201p4908p6210
$$ 1026551 1101643 1160613 1182623 1220732 1234171 1244374 1294444 1354546 1348345 1273437 1197227
17439A197227k5723K39l5267q5154j44311j12947r9891p0216o8435n0166k7870
$$ 1197227 1171504 1171743 1136476 1051322 907011 794064 694173 623957 555522 505356 477486
17428D77486j3738j6075j6964J5230j9290m5148o460k1684l2796K5436K613k8970
$$ 477486 463748 447673 430709 445939 426649 381501 375041 353357 320561 345997 348610 319640
17416C19640j1118J473l0829j3349k2519k7545n087l9780R212O085l7401k21L035
$$ 319640 308522 309995 279166 265817 243298 215753 210666 170886 180098 186183 148782 148561 151596
17403A51596P234n636O697k3098k1161o974j0282J2649M4707K3259k5895K699
$$ 151596 158830 153194 159891 136793 115632 108658 98376 111025 155732 178991 153096 155795
17391A55795n702j1931r630J397j3365j5279j2413R530J8832j0269n681O170o563
$$ 155795 150093 138162 128532 129929 116564 101285 88872 98402 117234 106965 101284 107454 100891
17378A00891q940l622j7951j2327j748J4662J6335K465M143k206k4613l3411K1883
$$ 100891 91951 88329 70378 58051 56303 70965 87300 89765 93908 91702 67089 33678 55561
17365E5561M2584j7891l4973k54K0624P138j3759k5087K971J9255j642j2344n565
$$ 55561 98145 80254 45281 45027 65651 72789 59030 33943 36914 56169 54527 42183 36618
17352C6618j0834Q925k406K0661L6634L431j6272r612L276L9481O981l3349m6991
$$ 36618 25784 34709 32303 52964 89598 93029 76757 67145 70421 109902 116883 83534 36543
17339C6543k038j6298m421J0896j3389J0415J7957K9594R400j6879j3515j860
$$ 36543 34505 18207 13786 24682 11293 21708 39665 69259 78659 61780 48265 46405
17327D6405j3175J0322R612Q855j1690j5038l698k493j812R649K48J3041J391
$$ 46405 33230 43552 53164 62019 50329 35291 31593 29100 27288 36937 37185 50226 51617
17314E1617r908j1917k1498p641l2959M52O803j0305R358L40n69J8084j8098k2043
$$ 51617 41709 29792 8294 653 -32306 -31854 -25051 -35356 -25998 -25658 -26227 -8143 -26241 -48284
17300d8284j500L8021L0989k21k2832J8164j6340R888J7481l018j481K7670r477
$$ -48284 -49784 -11763 19226 19005 -3827 14337 -2003 7885 25366 22348 20867 48537 39060
17287C9060m264O103N14J4263O440J5129K9464K5637L2887M8810M0026N1312M4372
$$ 39060 34796 40899 41413 55676 62116 77245 106709 132346 165233 214043 254069 305381 349753
17274C49753J6404J3332N6552Q6480L0576Q179J5918n826K3488L0924j9493j2321
$$ 349753 366157 379489 436041 522521 553097 561276 577194 571368 594856 625780 606287 593966
17262E93966n9657l4596J7923L9291M7008Q536K1307K9307K9458j719j9829k7169
$$ 593966 534309 499713 517636 556927 603935 612471 633778 663085 692543 690824 670995 643826
17250F43826n6995l6018k3164m6948m9579o7228o3227m2207j9779J446n966Q935
$$ 643826 586831 550813 527649 480701 431122 363894 300667 258460 238681 240127 234161 243096
17238B43096k685j5285Q769K1468l2722p647J9768Q553M4951J1067N197K804P5604
$$ 243096 240411 225126 233895 255363 222641 214994 234762 243315 288266 299333 304530 307334 382938
17225C82938J05113P1332M8659N9888O9322Q3780N7305N4971L3032J1304j2949
$$ 382938 488051 559383 608042 667930 737252 821032 878337 933308 966340 977644 964695
17214I64695k5948m0997q0290n2402m2761n1861m3575m3322m3159l4053L277K1672
$$ 964695 938747 897750 817460 765058 722297 670436 626861 583539 540380 506327 509604 531276
17202E31276r55K4712K8630K3112N420j9650l6347j4788J5395k8313k1461j3959
$$ 531276 530321 555033 583663 606775 612195 592545 556198 541410 556805 528492 507031 493072
17190D93072m0200k5722o6256o4112j7494j2412M566K9718N1023M4946q539o531
$$ 493072 452872 427150 360894 296782 279288 266876 271442 301160 352183 397129 388590 382059
17178C82059M7363M9059L7771P610o216N2984L6078J6787J0886k4154p6742o5677
$$ 382059 429422 478481 516252 523862 517646 570630 606708 623495 634381 610227 533485 467808
17166D67808k1591J646m3758o8230k9644n8205m5886k8538k7303j2601m893K386
$$ 467808 446217 447863 404105 335875 306231 248026 202140 173602 146299 133698 128805 131191
17154A31191J88j5320k6843J575J3779N386r294L037q899j2022k0493K668j8596
$$ 131191 131379 116059 89216 90791 104570 109956 100662 103699 94800 82778 62285 64953 46357
17141D6357J07j0766K164K2745q713K6854K5248J4312l3Q301K4036L7039K7361
$$ 46357 46464 35698 37862 60607 51894 78748 103996 118308 118275 126576 150612 187651 215012
17128B15012K5146K0763j0924N397Q862K4925j2369m3712k7840r776P842k9815
$$ 215012 240158 260921 249997 255394 264256 289181 276812 233100 205260 195484 203326 173511
17116A73511m8336m420o073j8683l2124j7428M191j0028j0400m764M649K4961
$$ 173511 125175 120755 114682 95999 63875 46447 50638 40610 30210 25446 30095 55056
17104E5056j335k19j815J0404j5585j1265Q997K060J4911p194r425J5308K018
$$ 55056 53721 53502 51687 62091 46506 35241 44238 46298 61209 54015 44590 59898 61916
17091F1916k9442O82m557j2495m800j5707K478L607k1450j4228P073P452J4489
$$ 61916 32474 33156 28599 16104 11304 -4403 -1925 1682 -19768 -33996 -26923 -19471 -4982
17078d982j3668j262K9458j8167l1760Q746K0310j531j1691j6512J8486K6257
$$ -4982 -18650 -19912 9546 -8621 -40381 -31635 -11325 -12856 -24547 -41059 -22573 3684
17066C684Q309j6461k394L898m497K1688K3199r622J177l2420k3816K3036L0199
$$ 3684 11993 -4468 -6862 -2964 -7461 14227 37426 27804 28981 -3439 -27255 -4219 25980
17053B5980J7779m811l5106k1582k7570R766K7217K2223L395L2266K031j5905
$$ 25980 43759 38948 3842 -17740 -45310 -35544 -8327 13896 17291 49557 51588 35683
17041C5683J852J9938M254o074o944j082J5481J1712j8435j5158j1303k2315P850
$$ 35683 37535 57473 61727 55653 48709 47627 63108 74820 56385 41227 29924 7609 15459
17028A5459K974r294l675K70k050j8572R421L0348M638q826o27j9310l3941j2499
$$ 15459 18433 9139 5464 5734 3684 -14888 -5467 24881 29519 20693 20066 756 -33185 -45684
17014d5684n559L181P441J6328K0736O584r334l417J3567L102k3253p742R451
$$ -45684 -51243 -48062 -40621 -24293 -3557 3027 -6307 -9724 3843 6945 -16308 -24050 -14599
17001a4599M962N374j8434k1151O363J7894J4352J3649Q623n229k2031p702j4011
$$ -14599 -9637 -4263 -22697 -43848 -37485 -19591 -5239 8410 17033 11804 -10227 -17929 -31940
16988c1940j5077K1263M8460k566k5358K251J7843k941j735l935R843j1252j4648
$$ -31940 -47017 -25754 22706 20140 -5218 -2967 14876 11935 10200 6265 16108 4856 -9792
16975i792j8660M5401K1059n068K284M634L03j7551j7377j5077m57M0014J3432
$$ -9792 -28452 16949 38008 32940 35224 39858 40161 22610 5233 -9844 -10301 29713 43145
16962D3145q941q020K3399K5913M52L765K8666J7278R934K7097J5812j560l849
$$ 43145 34204 26184 49583 75496 75948 79713 108379 125657 135591 162688 178500 176940 173091
16949A73091Q2089J10948J26288J88137L42722N42296O19576L88874J45473J51282
$$ 173091 255180 366128 492416 680553 1023275 1565571 2185147 2574021 2719494 2870776
16939B870776J67225Q435m47085p65349o26252l53720j88101j19752p4483m4721
$$ 2870776 3038001 3046436 2599351 1834002 1207750 854030 665929 546177 471694 426973
16929D26973n7324l6444l1615k7340j7839l1684j8028K252J0245n056l031k16
$$ 426973 369649 333205 301590 274250 256411 224727 206699 208951 219196 214140 211109 210893
16917B10893j8430j9170j4531Q300p78p575j6182r810m169m8549k4575j2556M155
$$ 210893 192463 173293 158762 167062 166284 158709 142527 132717 128548 79999 55424 42868 47023
16904D7023K51R801j1900J2327K8989K3302j0486l2610l6969Q22L4371K0244J918
$$ 47023 47274 57075 45175 57502 86491 109793 99307 66697 29728 30550 64921 85165 87083
16891H7083l6059j5757o330r364J939j1816K3452R616j6016k2210j5771J9935
$$ 87083 51024 35267 28937 19573 21512 9696 33148 42764 26748 4538 -11233 8702
16879H702Q943L80j6421J7627K1539j9240o033J9802l1117k6264J236j121o491
$$ 8702 17645 18025 1604 19231 40770 21530 15497 35299 4182 -22082 -20846 -21967 -28458
16866b8458J1692J2869K3925j151k9535k5729J56k3468M086J6745K7792J3608
$$ -28458 -16766 -3897 20028 18877 -10658 -36387 -36231 -59699 -55613 -38868 -11076 2532
16854B532n049m196M192l505P893j1738k047O548J7808L3865j2451j5880l517
$$ 2532 -2517 -6713 -2521 -6026 1867 -9871 -11918 -5370 12438 46303 33852 17972 14455
16841A4455N770k411k7168m4619j06K1885J5604M166j1243k536M902Q967q199
$$ 14455 20225 17814 -9354 -53973 -54079 -32194 -16590 -12424 -23667 -26203 -21301 -12334 -20533
16828b0533L5805K5883l4234L696o491l0440q421J6676K983L326J6119J8748N289
$$ -20533 15272 41155 6921 10617 4126 -26314 -34735 -18059 -15076 -11750 4369 23117 28406
16815B8406o640l617j6986L731l2010K266p575l0109j7715O583o47O476K7902
$$ 28406 21766 18149 1163 4894 -27116 -24850 -32425 -62534 -80249 -73666 -74313 -67837 -39935
16802c9935K7063r7R311n432p972J2178L7595l0170k6245o232q001k325n065k570
$$ -39935 -12872 -12969 -3658 -9090 -17062 -4884 32711 2541 -23704 -29936 -37937 -40262 -45327 -47897
16788d7897J2806K3581j217k1107l830o174k9051j5502J7709L1228K6161R327
$$ -47897 -35091 -11510 -12727 -33834 -37664 -43838 -72889 -88391 -70682 -39454 -13293 -3966
16776c966j2062m196k0058r6j4922J4898J4974M089j5656j0253j2412K6897J6783
$$ -3966 -16028 -20224 -40282 -40378 -55300 -40402 -25428 -21339 -36995 -47248 -59660 -32763 -15980
16763a5980j0924j9303M4450J3107k1750J8665j0456J0060l866l713j6352J30
$$ -15980 -26904 -46207 -1757 11350 -10400 8265 -2191 7869 4003 290 -16062 -15932
16751a5932o406o47l9051Q284L4582J0387k020j2979K704K7012k3960r729L226
$$ -15932 -22338 -22985 -62036 -53752 -19170 -8783 -10803 -23782 -21078 5934 -18026 -27755 -24529
16738b4529M570j385j0475j0758L5587J8811J3925l609Q6K1416k6533k167O254
$$ -24529 -19959 -21344 -31819 -42577 -6990 11821 25746 22137 22223 43639 17106 14939 21193
16725B1193O232N171k499k9035r935p353P199l1502M512J7780L1420l606k2160
$$ 21193 27425 32596 30097 1062 -8873 -16226 -9027 -40529 -36017 -18237 13183 9577 -12583
16712a2583j9091N027K4674k370j3509j6317k4458K2625R82J8760m346J1624J4697
$$ -12583 -31674 -26647 -1973 -4343 -17852 -34169 -58627 -36002 -35020 -16260 -20606 -8982 5715
16699E715j8606k7915J0454l099O7J6395K479O107J0727K1556L758m2596k7048
$$ 5715 -12891 -40806 -30352 -33451 -33384 -16989 -14510 -8403 2324 23880 27638 -14958 -42006
16686d2006J0356K1671P4K3996K5692n776l4783k6047r179K7805O484j103j9178
$$ -42006 -31650 -9979 -9905 14091 39783 34007 -776 -26823 -36002 -8197 -1713 -2816 -21994
16673b1994j3070O221K3605K2135J6132J5996l3241l1023j0784o021K0254J9539
$$ -21994 -35064 -28843 -5238 16897 33029 49025 15784 -15239 -26023 -32044 -11790 7749
16661G749r430j1627J2337P630o795l576l638o469m881n777J0197J1901k6345
$$ 7749 -1681 -13308 -971 6659 -136 -3712 -7350 -13819 -18700 -24477 -14280 -2379 -28724
16648b8724j2631J939p824o321J2377p29k6962r965L3143k61L318L0119j8257
$$ -28724 -41355 -39416 -47240 -53561 -41184 -41913 -68875 -78840 -45697 -45958 -42640 -12521 -30778
16635c0778p59J0526J1830J9148J198j9739l1291J8954K696K0137K2649n388j3698
$$ -30778 -31537 -21011 -9181 9967 11165 -8574 -39865 -20911 -18215 1922 24571 19183 5485
16622E485k7008q470J2458K0640k0633j5474K194K2728j3219j1166J0847k047
$$ 5485 -21523 -29993 -17535 3105 -17528 -33002 -30808 -8080 -21299 -32465 -21618 -23665
16610b3665p867M784n100R99m187J0091K4334J3972k140J762p396R196j1058j0969
$$ -23665 -31532 -26748 -31848 -30849 -35036 -24945 -611 13361 11221 12983 5587 14783 3725 -7244
16596g244j3275l8592l2944K5846J2936N04J192J3674J3469O644J0988K556J1486
$$ -7244 -20519 -59111 -92055 -66209 -53273 -52769 -51577 -37903 -24434 -17790 -6802 -4246 7240
16583G240R630m5251k8626K389K4348L7202K375j2039j3807j1472j280J1663P27
$$ 7240 16870 -28381 -57007 -54618 -30270 6932 9307 -2732 -16539 -28011 -29291 -17628 -16901
16570a6901j2883o252l378L143J0984M414O034O037J8690O330R836k1807k1687
$$ -16901 -29784 -36036 -39414 -36271 -25287 -20873 -14839 -8802 9888 16218 26054 4247 -17440
16557a7440q929j6152M9243J4803q95J1517m702m3992l5541p409j347q5K8934
$$ -17440 -26369 -42521 6722 21525 20630 32147 27445 -16547 -52088 -59497 -60844 -60929 -31995
16544c1995N2945K0270k1131j9682r060J4050J9740q887k6637K304p261k3108
$$ -31995 20950 41220 20089 407 -8653 5397 25137 16250 -10387 -8083 -15344 -38452
16532c8452J909J8255K1174k8818Q78J0396J0046l866n217J7535j5081k0220J2720
$$ -38452 -36543 -18288 2886 -25932 -25054 -14658 -4612 -8478 -13695 3840 -11241 -31461 -18741
16519a8741n27j5978l5103J1001K608J8513K2809j0073j2647l52m084k7802P9
$$ -18741 -19268 -35246 -70349 -59348 -56740 -38227 -15418 -25491 -38138 -38490 -42574 -70376 -70297
16506g0297J6605J8207J9217R340k4846r280P017Q855p883l1824Q147Q637K1542
$$ -70297 -53692 -35485 -16268 -6928 -31774 -41054 -34037 -25182 -33065 -64889 -56742 -48105 -26563
16493b6563J5769j5646k6254K9912L461K316K573J3698q451k2838p458j669j6880
$$ -26563 -10794 -26440 -52694 -22782 -19321 -17005 -14432 -734 -9185 -32023 -39481 -41150 -58030
16480e8030j4025m372K6216L1033q053N701Q774M444J4205L0191K8438m836j7973
$$ -58030 -72055 -76427 -50211 -19178 -27231 -21530 -12756 -8312 5893 36084 64522 59686 41713
16467D1713j4041k3807j2921m584p988o231P86P227J8097j3604j7950J0961M5370
$$ 41713 27672 3865 -9056 -13640 -21628 -27859 -27073 -19846 -1749 -15353 -33303 -22342 23028
16454B3028J7738k2814k5221k2900j1523J0601k0312j51m213k0350j3035K0634
$$ 23028 40766 17952 -7269 -30169 -41692 -31091 -51403 -51554 -55767 -76117 -89152 -68518
16442f8518J2105L5125J5010j8311K7883Q593j4803j4298J4829j4401l585J7634
$$ -68518 -56413 -21288 -6278 -24589 3294 11887 -2916 -17214 -2385 -16786 -20371 -2737
16430b737J0458j3565J1900j6219K512j2120k3169j6326P703K6791m415p126J4356
$$ -2737 7721 -5844 6056 -10163 -7651 -19771 -42940 -59266 -51563 -24772 -29187 -36313 -21957
16417b1957J0845j1353r006J9728r847j8875J6785L7391j2391j3962j6239j7233
$$ -21957 -11112 -22465 -31471 -11743 -21590 -40465 -23680 13711 1320 -12642 -28881 -46114
16405d6114J9954L6217J0225K647J1834M665l6896k0446R250J6337O681P673K7542
$$ -46114 -26160 10057 20282 22929 34763 39428 2532 -17914 -8664 7673 14354 22027 49569
16392D9569o645j5154o395j0227R218K1648o632l7286k310M073j555j1823M544
$$ 49569 42924 27770 21375 11148 20366 42014 35382 -1904 -4214 -141 -1696 -13519 -8975
16379h975J80N826K6636j0304J1626j6632m1140M61L3636K4622P280k2413J657
$$ -8975 -8795 -2969 23667 13363 24989 8357 -32783 -32322 1314 25936 33216 10803 12460
16366A2460J9998J017j9570k572j5318m424J3072r292j6776p282K0639P14J2854
$$ 12460 32458 33475 13905 11333 -3985 -8409 4663 -4629 -21405 -28687 -8048 -7334 5520
16353E520r242m956j4307o222K5969l652p573r632p444K4465J1748j6473K695
$$ 5520 -3722 -8678 -22985 -29207 -3238 -6890 -14463 -24095 -31539 -7074 4674 -11799 -9104
16340i104J3990p659o696l189k716R82J9478q456r206m482R086k349k3611j4369
$$ -9104 4886 -2773 -9469 -12658 -15374 -14392 5086 -3370 -12576 -17058 -7972 -10321 -33932 -48301
16326d8301J2829J4217O862K1863l772k006M489k0543k17q723J9391L0580J999
$$ -48301 -35472 -21255 -14393 7470 3698 1692 6181 -14362 -14579 -23302 -3911 26669 28668
16313B8668j0914r372k057m530K0303J0997l1038m163J5138p066q256P305M6434
$$ 28668 17754 8382 6325 1795 22098 33095 2057 -2106 13032 5966 -2290 5015 51449
16300E1449J1131l0723J9443k3525m3384M572J5326J2484R342j3206n5357k4561
$$ 51449 62580 31857 51300 27775 -15609 -11037 4289 16773 26115 12909 -42448 -67009
16288f7009L3234J5144L0258J2299r933l2517k1009l872K7809L64J1651J2369
$$ -67009 -33775 -18631 11627 23926 13993 -18524 -39533 -43405 -15596 -15232 -3581 8788
16276H788n475k082L030j76N789k567J4371L084P362j0131k6508l1872J4866K3955
$$ 8788 3313 1231 4261 4085 9874 7307 21678 24762 32124 21993 -4515 -36387 -21521 2434
16262B434k5544j8539N743R098J0710o31j9122O796J1178K50j881j818Q672K0440
$$ 2434 -23110 -41649 -35906 -26808 -16098 -16729 -35851 -29055 -17877 -17627 -19508 -21326 -12654 7786
16248G786j2327M93j962l3301J9562L1334J8930k8450k9831J573j4830j4733o278
$$ 7786 -4541 -4048 -6010 -39311 -19749 11585 30515 2065 -27766 -26193 -41023 -55756 -62034
16235f2034K481q278K6287K0032L545m320r699J7697K9214J6316j9104J164m036
$$ -62034 -59553 -67831 -41544 -21512 -17967 -22287 -31986 -14289 14925 31241 12137 13301 9265
16222I265J9235n774j9227j1993lJ5071K1868j393j4894k0418k9770m588L4548
$$ 9265 28500 22726 3499 -8494 -8497 6574 28442 27049 12155 -8263 -38033 -42621 -8073
16209h073L1104R884k5984Q929J5254R197l325M797P945j5697q426j4489M556
$$ -8073 23031 32915 6931 15860 31114 40311 36986 41783 49728 34031 25605 11116 15672
16196A5672P580K646K6l937j4152K1787K5803Q975P848m4760j7788J6980j2383
$$ 15672 23252 25898 25924 21987 7835 29622 55425 64400 72248 27488 9700 26680 14297
16183A4297p888k990K2203l0249N313R184l9657J1648K8179j2657k4477J0623
$$ 14297 6409 3419 25622 -4627 686 9870 -29787 -18139 10040 -2617 -27094 -16471
16171a6471K5936K2034l3761k2062j8958l0725L518K7442K7452K1767j1532N083
$$ -16471 9465 31499 -2262 -24324 -43282 -74007 -70489 -43047 -15595 6172 -5360 -277
16159b77M020L177K1958N858n10k976l2158k090p138k684L0940j5754p075K590
$$ -277 3743 6920 28878 34736 34226 31250 -908 -2998 -10136 -12820 18120 2366 -4709 -2119
16145b119j0171j4885N933K0412K1607j4430j3996O910J3070K8819R084J7718
$$ -2119 -12290 -27175 -21242 -830 20777 6347 -7649 -739 12331 41150 50234 67952
16133F7952P034k7207j0894k3186j0652K9639K005j1076k6353K326K882L629J536
$$ 67952 74986 47779 36885 13699 3047 32686 34691 23615 -2738 -412 2470 6099 7635
16120G635K0518J4830J2669K5670l331m0940l1186J5355K9875j4268K7386k719
$$ 7635 28153 42983 55652 81322 77991 37051 5865 21220 51095 36827 64213 61494
16108F1494p000k9666R671J0129J7114J3115j4082l0492m340n924J1835J3156
$$ 61494 54494 24828 34499 44628 61742 74857 60775 30283 25943 20019 31854 45010
16096D5010j326n773K203J1733m810L360J0368n105K279R070j970L120J734q31
$$ 45010 43684 37911 40114 51847 47037 50397 60765 55660 57939 67009 65039 68159 69893 69062
16082F9062k142k2026k9J0695J1367r591M331J7861j9682J1706J0510p041k5635
$$ 69062 66920 44894 44865 55560 66927 57336 61667 79528 59846 71552 82062 75021 49386
16069D9386L36K1578J7158M137k8346J516K882M451O043K4083k0666k2720j529
$$ 49386 49722 71300 88458 92595 64249 65765 68647 73098 79141 103224 82558 59838 58309
16056E8309K163l23L703j6661n730O442K9985J384m899k503J2143J0145r057j4602
$$ 58309 60472 60149 63852 47191 41461 47903 77888 79272 74373 71870 84013 94158 85101 70499
16042G0499m0708n102K6423R237J4090k802l4891k0395M4708J1531N782j0949
$$ 70499 29791 24689 51112 60349 74439 71637 36746 16351 61059 72590 78372 67423
16030F7423o645J2094N88j9918j2205m762M156J8870j8940o842k879o452K5396
$$ 67423 60778 72872 73460 53542 41337 36575 40731 59601 40661 33819 30940 24488 49884
16017D9884r3k4628r460K4120J2099J1320J6873K2817O55j7017k2555l9107j4709
$$ 49884 49791 25163 15703 39823 51922 63242 80115 102932 103587 86570 64015 24908 10199
16004A0199j023j3332j0040M2575J4066o903n83j2699K0293K3319R083j9096p266
$$ 10199 9176 -4156 -14196 28379 42445 35542 34959 22260 42553 65872 74955 55859 48593
15991D8593j3291p781K0357J0749N382k897k0799q921J1311q315k164j5287O84
$$ 48593 35302 27521 47878 58627 64009 61112 40313 31392 42703 34388 32224 16937 17621
15978A7621K2940L311J1044K1988J0673j2116j0990J6877k3061k9759j6065l0465
$$ 17621 40561 43872 54916 76904 87577 75461 64471 81348 58287 28528 12463 -18002
15966a8002j970J0328J543l555j2740Q666K9712K848J4623K7382J8818n609J3859
$$ -18002 -19972 -9644 -8101 -11656 -24396 -15730 13982 16830 31453 58835 77653 72044 85903
15953H5903j7696j4932K8408n402j3961k389J1949n896l731K737j6127J3669j1548
$$ 85903 68207 53275 81683 76281 62320 59931 71880 65984 62253 64990 48863 62532 50984
15940E0984L570j6696M579L7775L393j6241k2552J6787K9398J4910K7495k109
$$ 50984 54554 37858 42437 80212 83605 67364 44812 61599 90997 105907 133402 131293
15928A31293j4904k6315n146j8152k3062j385m043j4065J8796J467J112L663K9619
$$ 131293 116389 90074 84928 66776 43714 42329 38286 24221 43017 44484 45596 49259 78878
15915G8878Q090K3231j5703k0544J0741J2361l367j9763j7133J0420J0443J5524
$$ 78878 86968 110199 94496 73952 84693 97054 93687 73924 56791 67211 77654 93178
15903I3178j6512l4841l1448P92K3765J7880O225J6293J172j639L696J2083k366
$$ 93178 76666 41825 10377 11169 34934 52814 59039 75332 76504 74865 78561 90644 88278
15890H8278j6468r540J2418N920J8926J0734j5499k741J5397Q058k9889j8930
$$ 88278 71810 62270 74688 80608 99534 110268 94769 92028 107425 115483 85594 66664
15878F6664J6412J1044p840R587M157o21j8902K7801L6470k5156j0408J6748j5965
$$ 66664 83076 94120 86280 95867 100024 99403 80501 108302 144772 119616 109208 125956 109991
15865A09991Q392k4723j9123o605K722J6621J7907P604L3893L845j767K6161J2133
$$ 109991 118383 93660 74537 67932 70654 87275 105182 112786 146679 150524 148757 174918 187051
15852A87051P274N82L4828L1175J8231M2830Q3408O2090L9251Q3357J18990J35785
$$ 187051 194325 194907 229735 260910 279141 321971 405379 467469 506720 590077 709067 844852
15840H44852K01673J92319J73728K04901K27306K18753J88581J20957M7524j767
$$ 844852 1046525 1238844 1412572 1617473 1844779 2063532 2252113 2373070 2420594 2418827
15830B418827l2057q7214j29160j53142k02470k30210k10538k02556j77735j43278
$$ 2418827 2386770 2299556 2170396 2017254 1814784 1584574 1374036 1171480 993745 850467
15820H50467j41225q2306m6080l3911m0838k6234l3805m0789k2304P875p459l8581
$$ 850467 709242 626936 580856 546945 506107 479873 446068 405279 382975 390850 383391 344810
15808C44810j1609p981k1278N792j337l6808m0857J973L2068K139k4815J9296
$$ 344810 333201 325220 303942 309734 308397 271589 230732 232705 264773 266912 242097 261393
15796B61393K1815j1760r308m2110k6856N80J9389N157j05p070r168k2044q644
$$ 261393 283208 271448 262140 220030 193174 193754 213143 218300 218195 211125 201957 179913 171269
15783A71269l316N091P153j4323p251o447p613j1011J356j9628J0146M8786K2594
$$ 171269 167953 173044 180197 165874 158623 152176 144563 133552 134908 115280 125426 174212 196806
15770A96806k0440n79j0713j3669l2253j4036J2233Q615k8567j3522J7579J4005
$$ 196806 176366 175787 165074 151405 119152 105116 117349 125964 97397 83875 101454 115459
15758A15459k5946j5879J3602L425K9926K0495p83l999J6390R812O125j1551p109
$$ 115459 89513 73634 87236 90661 120587 141082 140299 136300 152690 162502 168627 157076 149967
15745A49967j4165m748j77J8907j0020l671R58j9394K919J1732K4071N612j0766
$$ 149967 135802 131054 130877 149784 139764 136093 137051 117657 120576 132308 156379 161991 151225
15732A51225l5465k7182K9924K6449P711K2738J234q302J726o142r892Q590l2561
$$ 151225 115760 88578 118502 144951 152662 175400 176634 168332 170058 163916 154024 162614 130053
15719A30053l6600P964k524j8123Q425J3873J7259m723R316j8514k6488O347m727
$$ 130053 93453 101417 98893 80770 89195 103068 120327 115604 124920 106406 79918 86265 81538
15706H1538R67j2870o218K6123J3269J9611j7937R333L932M687M839m122L3208
$$ 81538 82505 69635 63417 89540 102809 122420 104483 113816 117748 122435 127274 123152 156360
15693A56360r073j2096L299K0358J3313o761q982q728K579J9437J1509O790k4632
$$ 156360 147287 135191 138490 158848 172161 165400 156418 147690 150269 169706 181215 188005 163373
15680A63373j9994M032K8732l1715l3535J739l803J6882J3646M390N566j0641
$$ 163373 143379 147411 176143 144428 110893 112632 108829 125711 139357 143747 149313 138672
15668A38672j8695J1696J1902j7962k3155j03j9061Q02J2707j782R795J0544j6556
$$ 138672 119977 131673 143575 125613 102458 102355 83294 84096 96803 95021 104816 115360 98804
15655I8804k3850O678K1308j3128j8069k3845L1520M485j5665L4463N402j2743
$$ 98804 74954 81632 102940 89812 71743 47898 79418 83903 68238 102701 108103 95360
15643I5360j9542o232p090J5576J8591J4837J5449M141j4036L2118O0098O3932
$$ 95360 75818 69586 62496 78072 96663 111500 126949 131090 117054 149172 209270 273202
15631B73202P3958K1583J8145J2580K0971L1974L3863J9353K4093K8237K3247
$$ 273202 347160 368743 386888 399468 420439 452413 486276 505629 529722 557959 581206
15620E81206J219l0080k680k075q440k8535l9802l1390P530m0595k5298l2073
$$ 581206 582425 552345 549665 547590 539150 510615 470813 439423 446953 406358 381060 348987
15608C48987m6701K0272L7102R824p596l528K846P540j228j5463j3223m9942j6455
$$ 348987 302286 322558 359660 369484 361888 358360 361206 368746 367518 352055 338832 288890 272435
15595B72435J1650J5568Q11o916K0118k502k8453j379J2601j5917k3414k0368
$$ 272435 284085 299653 300464 293548 313666 311164 282711 281332 293933 278016 254602 234234
15583B34234l3694o791R616j98L894j674j1808k5422j1415K6018R524N142J1081
$$ 234234 200540 193749 203365 203167 207061 205387 193579 168157 156742 182760 192284 197426 208507
15570B08507K4605N358O059q925K197J6238J0516J4035J1491J1556q008j7698
$$ 208507 233112 238470 244529 235604 237801 254039 264555 278590 290081 301637 293629 275931
15558B75931l659o183M5353K9544J3654J0459j0433J1375O093k0698r72J4134
$$ 275931 272272 266089 311442 340986 354640 365099 354666 366041 372134 351436 350464 364598
15546C64598l604J0738J6729M95j8775k1322K6101r06J17j1083J7595K1699q483
$$ 364598 360994 371732 388461 388956 370181 348859 374960 374054 374171 363088 380683 402382 393899
15533C93899j82m846K692k1000n425K5159R540O769p519J0068L779J5458N647
$$ 393899 393717 388871 391563 370563 365138 390297 399837 406606 399087 409155 412934 428392 434039
15520D34039j7014l642j9835K7360J9797K3076N091j99J3969R929K1185K2788
$$ 434039 417025 413383 393548 420908 440705 463781 468872 468673 482642 492571 513756 536544
15508E36544J2815J2860J3177L9139L1373K0591M5591R9848Q9621Q4767J05117
$$ 536544 549359 562219 575396 614535 645908 666499 712090 811938 901559 986326 1091443
15497A091443R5631Q7924N9772P0198N0976J0376q698k1338l1256r243k8814l4462
$$ 1091443 1187074 1274998 1334770 1404968 1455944 1466320 1457622 1436284 1405028 1395785 1366971 1332509
15485A332509k0033j3708k3203N313j5505j5491o386K5653K3962Q097j2578K248
$$ 1332509 1312476 1298768 1275565 1280878 1265373 1249882 1243496 1269149 1293111 1301208 1288630 1290878
15473A290878K1588p443m2420j4334Q453K920n625J6478M1959K6470Q247k077
$$ 1290878 1312466 1305023 1262603 1248269 1256722 1259642 1254017 1270495 1312454 1338924 1347171 1345094
15461A345094K9921K1508j0029L480K1875J0284o580j7844J7427O920l2319q893
$$ 1345094 1375015 1396523 1386494 1389974 1411849 1422133 1415553 1397709 1415136 1422056 1389737 1380844
15449A380844K2564o54P334J9800J8544K7553K5099K1535K0133L3830L2903P1975
$$ 1380844 1403408 1402754 1410088 1429888 1448432 1475985 1501084 1522619 1542752 1576582 1609485 1681460
15437A681460O4711M5903M7835P2653L7477N3116O8548M6655L3479N3335N5545
$$ 1681460 1746171 1792074 1839909 1912562 1950039 2003155 2071703 2118358 2151837 2205172 2260717
15426B260717M7946N0106M4227J1849L2836M0402M1942M5008M7139Q2050Q7398
$$ 2260717 2308663 2358769 2402996 2414845 2447681 2488083 2530025 2575033 2622172 2704222 2791620
15415B791620Q3043J06315J41154J76143J75414J62899J81261K03982K10266K58524
$$ 2791620 2874663 2980978 3122132 3298275 3473689 3636588 3817849 4021831 4232097 4490621
15405D490621K86949K78239K86920L24312L74027M13389M49056M75693N49597
$$ 4490621 4777570 5055809 5342729 5667041 6041068 6454457 6903513 7379206 7928803
15396G928803O43823P35426Q21976R52898J089561J332768J596373J887808K226275
$$ 7928803 8572626 9308052 10130028 11082926 12172487 13505255 15101628 16989436 19215711
15387A9215711K675080L230438L884754M736569N862199P458044R908344J3553371
$$ 19215711 21890791 25121229 29005983 33742552 39604751 47062795 56971139 70524510
15379G0524510J8549600K4337003L0024177L4980072L9327328M2778336M4443440
$$ 70524510 89074110 113411113 143435290 178415362 217742690 260521026 304964466
15372C04964466M2894537L7789507L0132163K1104746J1487807J617630q496267
$$ 304964466 347859003 385648510 415780673 436885419 448373226 449990856 441494589
15365D41494589j8518834k7671557l4934776l9361721m0640668l9673063l7381438
$$ 441494589 422975755 395304198 360369422 321007701 280367033 240693970 203312532
15358B03312532l3953928k9233187k3348558j7487780j2733663r490772p436503
$$ 203312532 169358604 140125417 116776859 99289079 86555416 77064644 69628141
15351F9628141o055153n102884m437079l924393l446723l053397k722121k411479
$$ 69628141 63572988 58470104 54033025 50108632 46661909 43608512 40886391 38474912
15343C8474912k167879j943341j765322j609174j448782j295664j177121j103903
$$ 38474912 36307033 34363692 32598370 30989196 29540414 28244750 27067629 25963726
15335B5963726j053954j003887r22235q66326q19145p91826p37042p30540p01877
$$ 25963726 24909772 23905885 22983650 22117324 21298179 20506353 19769311 19038771 18336894
15326A8336894o44749o15587o48812n97703n84412n61939n22236n46585n27217
$$ 18336894 17692145 17076558 16427746 15830043 15245631 14683692 14161456 13614871 13087654
15317A3087654m99384m73512m26822m24243l99953m25647l97382l56824l18523
$$ 13087654 12588270 12114758 11687936 11263693 10863740 10438093 10040711 9683887 9365364
15308I365364k86721k97365k95019k55431k60604k34563k07620k31316j89992
$$ 9365364 9078643 8781278 8486259 8230828 7970224 7735661 7528041 7296725 7106733
15299G106733j88701k25395j99119j62823j72263j81781j77351j55914j26945
$$ 7106733 6918032 6692637 6493518 6330695 6158432 5976651 5799300 5643386 5516441
15290E516441j55047j59363j58618j22471j38635j69799j38004j15478j24424
$$ 5516441 5361394 5202031 5043413 4920942 4782307 4612508 4474504 4359026 4234602
15281D234602j36768j18038j24940q3657j05603j02450j05524q5543r1864m2114
$$ 4234602 4097834 3979796 3854856 3771199 3665596 3563146 3457622 3372079 3280215 3238101
15271C238101l8016p1143n3971m536P364M062m893k2000j8350R142L0012j0277
$$ 3238101 3200085 3128942 3074971 3070435 3077799 3081861 3076968 3054968 3036618 3045760 3075772 3065495
15259C065495j0558k1266n0573p2861j34184j58496j46032j30780j38562j55304
$$ 3065495 3054937 3033671 2983098 2910237 2776053 2617557 2471525 2340745 2202183 2046879
15249B046879j65980j46237j31978j35925j06306p4557o6772m0181n1733q0370
$$ 2046879 1880899 1734662 1602684 1466759 1360453 1285896 1219124 1178943 1127210 1046840
15239A046840o5588k3329j194J0033j5214k8726k8560k4605k4819o40k9321k8781
$$ 1046840 981252 957923 956729 966762 951548 922822 894262 869657 844838 844198 814877 786096
15227G86096k5914k8508q906r975k3284k9413j1228N823O191J0324J648j6055
$$ 786096 760182 731674 722768 712793 689509 660096 648868 654691 660882 671206 672854 656799
15215F56799k4263o860l703P246J0771J3315L154k1304k202j0018L932k5548k0418
$$ 656799 632536 625676 621973 629219 639990 653305 656459 635155 632953 622935 626867 601319 580901
15202E80901m254j7703j2458J5898J8172N372j8763l93p401k8572j6210k3703
$$ 580901 576647 558944 546486 562384 580556 585928 567165 566772 559371 530799 514589 490886
15190D90886j7271k607j1810m2399L876J4065J6919J2484l0273j3511K2186J2347
$$ 490886 473615 471008 459198 416799 420675 434740 451659 464143 433870 420359 442545 454892
15178D54892K769m9347j5709P806j3989j0423n596J3502j2056N461R969j2433
$$ 454892 457661 408314 392605 400411 386422 375999 370403 383905 371849 377310 387279 374846
15166C74846K7009Q738k887J4112J4856j2852J7414k0072j1613j5183j5841k8912
$$ 374846 401855 410593 407706 421818 436674 423822 441236 421164 409551 394368 378527 349615
15154C49615J608J6231j6695J4480j8956k868O394J840l1941k8262J007j2845
$$ 349615 351223 367454 350759 365239 346283 343415 349809 351649 319708 291446 292453 279608
15142B79608j5003L510R555o311k6485j7904J0545Q826J195K0092K863Q413k5251
$$ 279608 264605 268115 277670 271359 244874 226970 237515 246341 247536 267628 270491 278904 253653
15129B53653J849J4915j2818j5435K181j0113m2425K481p664k8807n772j8259
$$ 253653 255502 270417 257599 242164 244345 234232 191807 194288 186624 157817 152045 133786
15117A33786J8702K4466K044l209o020K1272J1223j0641j3349k4188j5338k1691
$$ 133786 152488 176954 178998 175789 169769 191041 202264 191623 178274 154086 138748 117057
15105A17057J1943J0950J4161K3625N686R209K2745L4179o285k6404j8689j4104
$$ 117057 129000 139950 154111 177736 183422 192631 215376 249555 243270 216866 198177 184073
15093A84073j7338l099K072m976L4876J7997k5016n412o716k6365k3251l754J5620
$$ 184073 166735 163636 165708 160732 195608 213605 188589 183177 176461 150096 126845 123091 138711
15080A38711l026J8136r61l817j8085j0531j4502n845l423j5823L1577M115j3710
$$ 138711 135685 153821 152860 149043 130958 120427 105925 100080 96657 80834 112411 116526 102816
15067A02816r189K915J8015j6426l3907l4079Q666j6956j3695K683q562K1924
$$ 102816 93627 96542 114557 98131 64224 30145 38811 21855 8160 10843 2281 24205
15055B4205K3751o710j9122l438J953o443p889J1050M3316M7312J6928j5053j6059
$$ 24205 47956 41246 22124 18686 20639 14196 6307 17357 60673 107985 124913 109860 93801
15042I3801J8813O8443L4262L6772N6883J08251J01140N4891N8851N0977K9306
$$ 93801 112614 181057 215319 252091 308974 417225 518365 573256 632107 683084 712390
15031G12390N6169j6803l3522m1123o9678o2560m4637o9850n8356m3679o2292
$$ 712390 768559 751756 718234 677111 607433 544873 500236 430386 372030 328351 266059
15020B66059o2643n0932j9496j236k8394L818k4412J1319n380m378J582O187K3888
$$ 266059 203416 152484 132988 131752 103358 107176 82764 94083 88703 84325 85907 92094 115982
15007A15982q813k7160j1982O981j316P811J3807j4529k3832Q523K5003n181k5629
$$ 115982 107169 80009 68027 75008 73692 81503 95310 80781 56949 65472 90475 85294 59665
14994E9665j1867m033P065j0531j4825O88O391J4970N661j3164k310J1299J7365
$$ 59665 47798 43765 50830 40299 25474 26162 32553 47523 53184 40020 37710 49009 66374
14981F6374L5866j1479j5792k2604k862K0053L7483K4452L7111M6110J8237M7535
$$ 66374 102240 90761 74969 52365 49503 69556 107039 131491 168602 214712 232949 280484
14969B80484k700O6338R2679O7026N2960R0457N5005K5893K1360k6056p1576q9083
$$ 280484 277784 344122 436801 503827 556787 647244 702249 728142 749502 723446 651870 562787
14957E62787j04387r1607m0131n2700m3001m4752j5123j7331r397k8437m4457
$$ 562787 458400 366793 326662 273962 230961 186209 171086 153755 144358 115921 71464
14946G1464K2315Q291j5838j8103J80n07k5946J4339J6265J526r557j4330k132
$$ 71464 93779 102070 86232 68129 68309 67802 41856 56195 72460 73986 64429 50099 47967
14933D7967P788O952J9377o40j7611k889J1110L503K358K3142j8810L652J5481
$$ 47967 55755 62707 82084 81444 63833 60944 72054 75557 77915 101057 82247 85899 101380
14920A01380j3339R445k481J9148J9238R941J7581K2670L7253M7171Q0719O8543
$$ 101380 88041 97486 95005 114153 133391 143332 160913 183583 220836 268007 348726 417269
14908D17269R5605J26812J55702J97514J80974J76663K00874K21330K03532J61373
$$ 417269 512874 639686 795388 992902 1173876 1350539 1551413 1772743 1976275 2137648
14898B137648J13253Q0227L3238o0262j33300j73791j73178j86721j86248j94793
$$ 2137648 2250901 2331128 2364366 2304104 2170804 1997013 1823835 1637114 1450866 1256073
14888A256073j64980j78307j43299j18240j07996m9118n9740q7950n2166j8784
$$ 1256073 1091093 912786 769487 651247 543251 494133 434393 346443 294277 275493
14878B75493K318J5333k9111j9978l96l8822m7475j5017l2225j7984J6424J763
$$ 275493 277811 293144 264033 244055 243659 204837 157362 142345 110120 92136 108560 110323
14866A10323q150j8094j6845M6450k3195n663P454O343j0287M184n800k0540n774
$$ 110323 102173 84079 67234 113684 90489 84826 92280 98623 88336 92520 86720 66180 60406
14853F0406J5248N578N337J2962O231J4955J206M17K055j4527k4481l2404j513
$$ 60406 75654 81232 86569 99531 105762 120717 121923 122340 124395 109868 85387 52983 51470
14840E1470l447j30j3280M447R584J6396J1988k8602l037M067l805Q855J2608
$$ 51470 48023 47893 34613 39060 48644 65040 77028 48426 45389 49456 45651 54506 67114
14827F7114n3866j2641K9474k5298Q933N826j826J160n012J5975k303p56k5751
$$ 67114 13248 607 30081 4783 13716 19542 17716 18876 13864 29839 27536 26780 1029
14814A029p454j026j1838m203j0214j1308P525K9011R68L267j7249j105L7379
$$ 1029 -6425 -7451 -19289 -23492 -33706 -45014 -37489 -8478 -7510 -4243 -21492 -22597 14782
14801A4782K491R3j5887Q365j1014k2923K944m161J6174K4075j2915r381P279
$$ 14782 17273 17366 1479 9844 -1170 -24093 -21149 -25310 -9136 14939 2024 -7357 -78
14788g8n648r449P593J5310L153K7961K7026k4828k5634Q606K3379j4325q557
$$ -78 -5726 -15175 -7582 7728 10881 38842 65868 41040 15406 24012 47391 33066 24509
14775B4509j0725j4736K9166P252J8845l654m4678j6447p537o208j2137J8858
$$ 24509 13784 -952 28214 35466 54311 50657 5979 -10468 -18005 -24213 -36350 -17492
14763a7492Q816J1503O222N098j0029k1136m265J533J8022K4052l108J534j3482
$$ -17492 -8676 2827 9049 14147 4118 -17018 -21283 -19750 -1728 22324 19216 20750 7268
14750G268n148L351k160J1504J1690j9411j551p625j9355k865J5775J8825q996
$$ 7268 2120 5471 3311 14815 26505 7094 5543 -2082 -21437 -24302 -8527 10298 1302
14737A302n996J2560j269k4325K5914J579o235j5388j3771q226N608K3091K3716
$$ 1302 -4694 7866 6597 -17728 8186 9765 3530 -11858 -25629 -33855 -28247 -5156 18560
14724A8560M551J3806J26j5661k393j2205o924J5871k0335l8754q779J3696J449
$$ 18560 23111 36917 37043 21382 18989 6784 -140 15731 -4604 -43358 -52137 -38441 -36992
14711c6992J5291J0700K1145l108k3275R53J4354J3805k4190k2765M587o843J894
$$ -36992 -21701 -11001 10144 7036 -16239 -15286 -932 12873 -11317 -34082 -29495 -36338 -34444
14698c4444J4780n051l550Q248J6749j5892k4740j9750J7264L8947L7725k1585
$$ -34444 -19664 -24715 -28265 -20017 -3268 -19160 -43900 -63650 -46386 -7439 30286 8701
14686H701l8997k3015K3282n73j5135k370r144J2283m202R981n126j5015J1921
$$ 8701 -30296 -53311 -30029 -30602 -45737 -48107 -57251 -44968 -49170 -39189 -44315 -59330 -47409
14673d7409J5181j5008M477J929o745n886P724j8853j054Q964l0757K2313M0072
$$ -47409 -32228 -47236 -42759 -40830 -47575 -53461 -45737 -64590 -65644 -56680 -87437 -65124 -25052
14660b5052j071Q413J3493j6408j5733J4036K839K3889Q992j1862j0864O348J2689
$$ -25052 -26123 -17710 -4217 -20625 -36358 -22322 -19483 4406 13398 1536 -9328 -2980 9709
14647I709K3028l383j3192J0525J4900k9368o061k1083l4625M279K7559J7904
$$ 9709 32737 29354 16162 26687 41587 12219 6158 -14925 -49550 -45271 -17712 192
14635A92k4126p744p403o210r497K0164J8509o254J9819k1740k8986K0485j850
$$ 192 -23934 -31678 -39081 -45291 -54788 -34624 -16115 -22369 -2550 -24290 -53276 -32791 -34641
14622c4641j208j1547K5873R519J8322j3144k5857q177J318J6839L64K3366L254
$$ -34641 -35849 -47396 -21523 -12004 6318 -6826 -32683 -40860 -39542 -22703 -22339 1027 4281
14609D281l8052k3923o772J5454K0279N774M626P190k2243p259J958k86M706K4785
$$ 4281 -33771 -57694 -64466 -49012 -28733 -22959 -18333 -11143 -33386 -40645 -38687 -38973 -34267 -9482
14595i482J2870k8312j4036K1361J3851Q644M363j1335j4761j3623J8890K7902
$$ -9482 3388 -24924 -38960 -17599 -3748 4896 9259 -2076 -16837 -30460 -11570 16332
14583A6332j5899k2920M584J1913J780L3575k339k0551j654K3498j4253k9755
$$ 16332 433 -22487 -17903 -5990 -4210 29365 27026 6475 4821 28319 14066 -15689
14571a5689K886Q611Q027k6101J2204j741j5623R626L8013q39N633j5569l5524
$$ -15689 -12803 -4192 3835 -22266 -10062 -11803 -27426 -17800 20213 19374 25007 9438 -26086
14558b6086J737J6164R848j236l686j082J9071j168k2112J0922j5645j635J0239
$$ -26086 -24349 -8185 1663 427 -3259 -4341 14730 13562 -8550 2372 -13273 -14908 -4669
14545d669K375r99M486k4506k8248J1125l480j0734j549K1495m163J2973J1259
$$ -4669 -2294 -3293 1193 -23313 -51561 -40436 -43916 -54650 -56199 -34704 -38867 -25894 -14635
14532a4635M332j4292L55l37j4941j4116r913J451P358R029P92K3854J2662L6494
$$ -14635 -10303 -24595 -24240 -24577 -39518 -53634 -63547 -62096 -54738 -45709 -44917 -21063 -8401 28093
14518B8093K0575k2038j8877L64p743J6215o575k5156l0268J6948J283j6602P4
$$ 28093 48668 26630 7753 8117 374 16589 10014 -15142 -45410 -28462 -27179 -43781 -43707
14505d3707N285J2042K0145r578j4522m4559L3058L2980j3940O544k163J4558
$$ -43707 -38422 -26380 -6235 -15813 -30335 -74894 -41836 -8856 -22796 -16252 -18415 -3857
14493c857N981N491n240j6357j161M312r652r53N939k0931k946o139R134Q588
$$ -3857 2124 7615 2375 -13982 -15143 -10831 -20483 -21436 -15497 -36428 -39374 -45513 -36379 -27791
14479b7791R161K4948k412Q785m388m445j4804n961j327q457K911k5249J1461
$$ -27791 -18630 6318 3906 12691 8303 3858 -10946 -16907 -18234 -26691 -23780 -49029 -37568
14466c7568M4358k0354l2290J4871M587k4174J2896j3938j943J2750K8061J0584
$$ -37568 6790 -13564 -45854 -30983 -26396 -50570 -37674 -51612 -53555 -40805 -12744 -2160
14454b160P896j3089m410j1869j5903j521O830J5073k291m522j4979J433J3604
$$ -2160 5736 -7353 -11763 -23632 -39535 -41056 -34226 -19153 -21444 -25966 -40945 -39512 -25908
14441b5908k1487p413J0202L2646j0739N418J8558k0364k744M335k0946k500j0204
$$ -25908 -47395 -54808 -44606 -11960 -22699 -17281 1277 -19087 -21831 -17496 -38442 -40942 -51146
14428e1146P114O456m335L326L3253L8164k2106p22m04j0624R280Q733j8197l184
$$ -51146 -44032 -37576 -41911 -38585 -5332 32832 10726 10004 9600 -1024 8256 16989 -1208 -4392
14414d392Q623R762k929L4726K9946j9629j7249m408j4177k706K2121K820k3464
$$ -4392 4231 13993 11064 45790 75736 56107 38858 34450 20273 17567 39688 42508 19044
14401A9044J254N55j4753q756J4983L487Q664Q585j2607j5741Q54j986l5336J4133
$$ 19044 20298 20853 6100 -2656 12327 15814 24478 33063 20456 4715 5569 3583 -31753 -17620
14387a7620Q866q507p072k1121L248L3070K6136l399l820J7054M47k8539k2391
$$ -17620 -8754 -17261 -24333 -45454 -42206 -9136 17000 13601 9781 26835 27282 -1257 -23648
14374b3648j7411p591q21q860R207K0900j3872P437o40K0879m165k6411q61P002
$$ -23648 -41059 -48650 -49471 -58331 -49124 -28224 -42096 -34659 -35299 -14420 -18585 -44996 -45857 -38855
14360c8855K0028m437j7177N95k18k0001j2449r008J5633j84J7657K7738J9887
$$ -38855 -18827 -23264 -40441 -39846 -40064 -60065 -72514 -81522 -65889 -66073 -48416 -20678 -791
14347g91J138j076p44m060j2674P363o126k1629k3507K5289K9216L4623K1419
$$ -791 347 -729 -1473 -5533 -18207 -10844 -16970 -38599 -62106 -36817 -7601 27022 48441
14334D8441m654r195J7000J8306n675j1115j4296k3523J2374J8701L807j3384
$$ 48441 43787 34592 51592 69898 64223 53108 38812 15289 27663 46364 50171 36787
14322C6787R275p574l6066r693j8277r911N06l175j3793Q216K0454N429J4760
$$ 36787 46062 38488 2422 -7271 -25548 -35459 -34953 -38128 -51921 -43705 -23251 -17822 -3062
14309c062o488J265L6628P85m6031j1368P801R286j7441l4178O532K9021J244
$$ -3062 -9550 -8285 28343 29128 -16903 -28271 -20470 -11184 -28625 -62803 -56271 -27250 -26006
14296b6006Q505R138N999K630K4552J9367q954k1128L31j5877J8662L384j5097
$$ -26006 -17501 -8363 -2364 266 24818 44185 35231 14103 14434 -1443 17219 20603 5506
14283E506q053j2364L622J362l2127l6254J1013M6134R013k148P130n545K5940
$$ 5506 -2547 -14911 -11289 -9927 -42054 -78308 -67295 -21161 -12148 -14296 -7166 -12711 13229
14270A3229K9580l0020k7068k2257j2292o903j8143K0149L4587m742j983j0759
$$ 13229 42809 12789 -14279 -36536 -48828 -55731 -73874 -53725 -19138 -23880 -25863 -36622
14258c6622k441k724l269J8546j2098q551N188J6121O104p550J850n458k9971
$$ -36622 -39063 -41787 -45056 -26510 -38608 -47159 -41971 -25850 -19746 -27296 -25446 -30904 -60875
14245f0875J7435M6408K6796j0222k3577m5526P682K0781K470l3529j5982K0135
$$ -60875 -43440 2968 29764 19542 -4035 -49561 -41879 -21098 -18628 -52157 -68139 -48004
14233d8004K6619J9529k453j3417n133m01P514j1864r978r094K2906J8737K6892
$$ -48004 -21385 -1856 -4309 -17726 -22859 -23260 -15746 -27610 -37588 -46682 -23776 -5039 21853
14220B1853m1583k3736J1733K0269k821K5787n123j9041K5784Q771l8445j2316
$$ 21853 -19730 -43466 -31733 -11464 -14285 11502 6379 -12662 13122 21893 -16552 -28868
14208b8868k1558K427n839j2295K1250J1427o761p989o632q063K597j4493p198
$$ -28868 -50426 -47999 -53838 -66133 -44883 -33456 -40217 -48206 -54838 -62901 -60304 -74797 -81995
14195h1995N437m31M0189L2808N131j5094k1126k451o208j6272M0176M5722O562
$$ -81995 -76558 -76989 -36800 -3992 1139 -13955 -35081 -37532 -43740 -60012 -19836 25886 32448
14182C2448O10k3072j5757k3293M08J5734K11o007J3373N221k4891j784j766o49
$$ 32448 33058 9986 -5771 -29064 -28656 -12922 -12711 -18718 -5345 -124 -25015 -26799 -28565 -29214
14168b9214n983J9206J5815j717J4885K532j3672q024J282k078l8766J1284J5608
$$ -29214 -35197 -15991 -176 -1893 12992 15524 1852 -6172 -4890 -6968 -45734 -34450 -18842
14155a8842l746k3538j2140o887J050K6549L0533r781n715K8495l238j3595P865
$$ -18842 -22588 -46126 -58266 -65153 -64103 -37554 -7021 -16802 -22517 5978 2740 -10855 -2990
14142b990J1840P153n69l5187j1145J8442L109r900j4585j7396K485J8587o678
$$ -2990 8850 16003 15434 -19753 -30898 -12456 -9347 -19247 -33832 -51228 -48743 -30156 -36834
14129c6834L674q824K2813M6170J5913j2494p131J2002j7756m3407P235K1486
$$ -36834 -33160 -41984 -19171 26999 42912 30418 23287 35289 17533 -25874 -18639 2847
14117B847J999k5719m040Q944J2892J9908J4218n063l1887k957O912j6672k0775
$$ 2847 4846 -20873 -24913 -15969 -3077 16831 31049 25986 -5901 -8858 -1946 -18618 -39393
14104c9393j5964l392R640J5346l753Q824J4710M696J164Q592j9105l769m533
$$ -39393 -55357 -58749 -49109 -33763 -37516 -28692 -13982 -9286 -8122 470 -18635 -22404 -26937
14091b6937j404j7800J8910K0468N824j0467p1j9782j755J8679M336k588P326
$$ -26937 -28341 -46141 -27231 -6763 -939 -11406 -11477 -31259 -33014 -14335 -9999 -12587 -5261
14078e261j87J449k6589J9606j9968j8473J5666Q434J4321j736J4902J0859k5289
$$ -5261 -5448 -3999 -30588 -10982 -30950 -49423 -33757 -25323 -11002 -12738 2164 13023 -12266
14065a2266k3251j0436K07J1629J5750k4878J8473L628k0766m904K3935j3203
$$ -12266 -35517 -45953 -45746 -34117 -18367 -43245 -24772 -21144 -41910 -46814 -22879 -36082
14053c6082m59L141N866k0345Q641J3949J7022Q983j1328J464Q8J0472N303k4502
$$ -36082 -36541 -33400 -27534 -47879 -39238 -25289 -8267 716 -10612 -9148 -9060 1412 6715 -17787
14039a7787M456p535K600j7290j4957J7730M5530j7250r17K1085m232j3595l8116
$$ -17787 -13331 -20866 -18266 -35556 -50513 -32783 12747 -4503 -5420 15665 11433 -2162 -40278
14026d0278K1160K5853K1908o311K2179j4142l3317j733l401m308o571M662J758
$$ -40278 -19118 6735 28643 22332 44511 30369 -2948 -4681 -8082 -12390 -18961 -14299 -12541
14013a2541j6439n477K8521M209k2442j1456Q901L0400J573k3293k2351j2503
$$ -12541 -28980 -34457 -5936 -1727 -24169 -35625 -26724 3676 5249 -18044 -40395 -52898
14001e2898L6229K0003j7684o424q994j5287K1998J4023Q306r753k3720n3948
$$ -52898 -16669 3334 -14350 -20774 -29768 -45055 -23057 -9034 -728 -10481 -34201 -88149
13989h8149O288P442p187K5700K4709J8746K4309K4642J7473j7747j0857P090
$$ -88149 -81861 -74419 -81606 -55906 -31197 -12451 11858 36500 53973 36226 25369 32459
13977C2459k8277l5322p163O645J8045P507J7498j0171j6870K200R162J7778j4830
$$ 32459 4182 -31140 -38303 -31658 -13613 -6106 11392 1221 -15649 -13449 -4287 13491 -1339
13964a339M918j2106j4407M84J0896m559j6827J2889R50R067J8876J0250j9010
$$ -1339 3579 -8527 -22934 -22450 -11554 -16113 -32940 -20051 -19101 -10034 8842 19092 82
13951H2n854l2047j0551K4212K1776M668j2553O165J0726n012O873l509j9524
$$ 82 -5772 -37819 -48370 -24158 -2382 2286 -10267 -4102 6624 1612 8485 4976 -14548
13938a4548j1660j43j0891k180K455o596J9904r777J3235J5527K177j1361l837
$$ -14548 -26208 -26351 -37242 -39422 -36967 -43563 -23659 -33436 -20201 -4674 -2497 -13858 -17695
13925a7695J839K1383N332j6193m537J1622K4707J1583M548k2953l8436j2308
$$ -17695 -15856 5527 10859 -5334 -9871 1751 26458 38041 42589 19636 -18800 -31108
13913c1108j3760j4618k344N244O820J897n697J2999J693j7726K905J2220n349
$$ -31108 -44868 -59486 -61830 -56586 -49766 -47869 -53566 -40567 -38874 -56600 -53695 -41475 -46824
13900d6824l487j994L2798j3897j2776j6923j5703K6177K5218J0810l20M15p247
$$ -46824 -50311 -52305 -19507 -33404 -46180 -63103 -78806 -52629 -27411 -16601 -16921 -16506 -23753
13887b3753O838k6203l371J9090N990o056k1960K4088R598J2685j171p30m352
$$ -23753 -16915 -43118 -46489 -27399 -21409 -27465 -49425 -25337 -15739 -3054 -4225 -4955 -9307
13874i307J1222l493J1409j8530p145K2994R483j3421k9640J5106J0340p237j4979
$$ -9307 1915 -1578 9831 -8699 -15844 7150 16633 3212 -26428 -11322 -982 -8219 -23198
13861b3198j0798J2938L200j6635m015O159J7738J5170K2229J6207j4574j3462
$$ -23198 -33996 -21058 -17858 -34493 -38508 -32349 -14611 559 22788 38995 24421 10959
13849A0959j178k0586l1132q207K3362K1880J3302l179q505j8566o330J8638p600
$$ 10959 9781 -10805 -41937 -50144 -26782 -4902 8400 5221 -3284 -21850 -28180 -9542 -17142
13836a7142l95K3851P750l565j8495K413L963O552j335J100k1717K1987K887k6421
$$ -17142 -17537 6314 14064 10499 -7996 -5583 -1620 4932 3597 4697 -17020 4967 7854 -18567
13822a8567Q195L3747J6293k2339k6407j3103R193L7445K2156j5266l4342j1564
$$ -18567 -10372 23375 39668 17329 -9078 -22181 -12988 24457 46613 31347 -2995 -14559
13810a4559J8427j2088l4730l050M210J1570J2981J2980K4300j9002p740j0569
$$ -14559 3868 -8220 -42950 -46000 -41790 -30220 -17239 -4259 20041 1039 -6701 -17270
13798a7270m3417k6623K4236J8705J9576Q587K177j7910p311m961J2361j4295
$$ -17270 -60687 -87310 -63074 -44369 -24793 -16206 -14029 -31939 -39250 -44211 -31850 -46145
13786d6145j3303M094n327O190J2834J6360m095N477j0301J982J3446j7356p294
$$ -46145 -59448 -55354 -60681 -54491 -41657 -25297 -29392 -23915 -34216 -32234 -18788 -36144 -43438
13773d3438j2366K2183O498k1465J3327l134N550K3075K1332j0605q063O741Q97
$$ -43438 -55804 -33621 -27123 -48588 -35261 -38395 -32845 -9770 11562 957 -7106 -365 532
13760E32P610J043j7620k9007j00k6404o262n263M6229M0109j7337l261J649K1167
$$ 532 8142 9185 -8435 -37442 -37542 -63946 -70208 -75471 -29242 10867 -6470 -9731 -8082 13085
13746A3085M604l6752p345O928k326J598J4097K012k885J5959P396M458l3926
$$ 13085 17689 -19063 -26408 -19480 -21806 -20208 -6111 -4099 -6984 8975 16371 20829 -13097
13733a3097k3820j2618j2600L1099Q343n715L092k500Q63j0031n005O081J0752
$$ -13097 -36917 -49535 -62135 -31036 -22693 -28408 -25316 -27816 -26953 -36984 -41989 -35908 -25156
13720b5156j747K6681n202m5271K949J8249M7129K1898j6890J2695M677J3375
$$ -25156 -26903 -222 -5424 -50695 -47746 -29497 17632 39530 22640 35335 40012 53387
13708E3387k589l9735j4189J4467k5263j2511L1198M719k018j0794J4452q22r87
$$ 53387 50798 11063 -3126 11341 -13922 -26433 4765 9484 7466 -3328 11124 10302 9315
13695I315l9498l960J2601o232j1903M271P683J3863K2058j7406j9657Q256K0753
$$ 9315 -30183 -34143 -21542 -27774 -39677 -35406 -27723 -13860 8198 -9208 -28865 -20609 144
13682A44K1987K617k7115l8494k3715J904K1185n518j7838J2190K3422K6224K6806
$$ 144 22131 24748 -2367 -40861 -64576 -62672 -41487 -47005 -64843 -52653 -29231 -3007 23799
13669B3799j20l4894j2316j1470j4584Q339L5967q31j5512k6958J0220j2617J0000
$$ 23799 23679 -11215 -23531 -35001 -49585 -41246 -5279 -6110 -21622 -48580 -38360 -50977 -40977
13656d0977K7250J0599J7755J2395j080m3093j9155O8M576k8936k896j706J6776
$$ -40977 -13727 -3128 14627 27022 25942 -17151 -36306 -36238 -31662 -60598 -63494 -65200 -48424
13643d8424K4103p119j3666K6942K3584K1529L838j8489k3414j5779Q845j0060
$$ -48424 -24321 -31440 -45106 -18164 5420 26949 30787 12298 -11116 -26895 -18050 -28110
13631b8110l0129K9266J8504j4537J6602Q415j3521j2536J1657P24L296J0899
$$ -28110 -58239 -28973 -10469 -25006 -8404 11 -13510 -26046 -14389 -13665 -10369 530
13619E30J7533j3861l3119k7132k9241K4380M3266K4948J0818k5436J8381R381
$$ 530 18063 4202 -28917 -56049 -85290 -60910 -17644 7304 18122 -7314 11067 20448
13607B0448K348r180n290k1455J0026P216j9824n443J9011K2268j1159r346J8744
$$ 20448 22796 13616 8326 -13129 -3103 4113 -15711 -21154 -2143 20125 8966 -380 18364
13594A8364J8401j9990l1073J3192o887q122n020Q961K863L386J570k5995k0456
$$ 18364 36765 16775 -14298 -1106 -7993 -16115 -21135 -12174 -9311 -5925 -4355 -30350 -50806
13581e0806j4687K7486J7014l876j829r352j4980P107P441j670R15J0055K2408
$$ -50806 -65493 -38007 -20993 -24869 -26698 -36050 -51030 -43923 -36482 -38152 -37237 -27182 -4774
13568d774J5352l066j3756j0925j6586q428j5426l303l964M576j677Q726P259
$$ -4774 10578 7512 -6244 -17169 -33755 -42183 -57609 -60912 -64876 -60300 -61977 -53251 -45992
13555d5992P843M872O308O389J7292l580J267l663j2101j3896P28km738M980P619
$$ -45992 -38149 -33277 -26969 -20580 -3288 -6868 -5601 -9264 -21365 -35261 -34533 -34535 -39273 -34293 -26674
13540b6674J6414q810J3413j6516m682j0355P656j8253j6746J2968J4120j9698
$$ -26674 -10260 -19070 -5657 -22173 -26855 -37210 -29554 -47807 -64553 -51585 -37465 -57163
13528e7163l2089P038L0159j7641j612J5058K46J7232M576j057j5449k8457J8229
$$ -57163 -89252 -82214 -52055 -69696 -71308 -56250 -56004 -38772 -34196 -35253 -50702 -79159 -60930
13515f0930L6988N951N182m718P791j5871j5861j4956p007J1613M8383J7521j8977
$$ -60930 -23942 -17991 -12809 -17527 -9736 -25607 -41468 -56424 -63431 -51818 -3435 14086 -4891
13502d891m218r573j4036K0402L2568k6467k7563k4570J530R966J951L3055N393
$$ -4891 -9109 -18682 -32718 -12316 20252 -6215 -33778 -58348 -56818 -46852 -44901 -11846 -6453
13489f453K7720P743O674k6483j3174l576l0281j83k016J108K0828J572R484J7953
$$ -6453 21267 29010 35684 9201 -3973 -7549 -37830 -38013 -40029 -38921 -18093 -16521 -7037 10916
13475A0916j4094j4830l1775j888K3983J3309j523j0676P328J5791j482o809j2393
$$ 10916 -3178 -18008 -49783 -51671 -27688 -14379 -15902 -26578 -19250 -3459 -4941 -11750 -24143
13462b4143Q962q730o212J3195R645q893p125R081J1898l3145K759J2350M689
$$ -24143 -15181 -23911 -30123 -16928 -7283 -16176 -23301 -14220 -2322 -35467 -32708 -20358 -15669
13449a5669J1810K0049j3069Q423k4667J5470j6438Q267J7816j5332j1510J1874
$$ -15669 -3859 16190 3121 11544 -13123 2347 -14091 -5824 11992 -3340 -14850 -2976
13437b976M672J3163Q699q251k3198j2058J9155j8200J693p918q009q421l263
$$ -2976 1696 14859 23558 15307 -7891 -19949 -794 -18994 -17301 -25219 -33228 -41649 -44912
13424d4912J0599K9177R107j7377l0514j9166K3385J8185J4558j6861o654k0390
$$ -44912 -34313 -5136 3971 -13406 -43920 -63086 -39701 -21516 -6958 -23819 -30473 -50863
13412e0863n408Q709M464J1819J7974P93K6683k237R442m37k8315r047N877j3927
$$ -50863 -56271 -47562 -43098 -31279 -13305 -12512 14171 11934 21376 20939 -7376 -16423 -10546 -24473
13398b4473P789J0409k947N305R431j2211j8636L114k677M143J224O17j7582q704
$$ -24473 -16684 -6275 -9222 -3917 5514 -6697 -25333 -22219 -24896 -20753 -19529 -18912 -36494 -45198
13384d5198r50j6009J074q386l036M4747K5735k4657k4655K4762M7676j0210k1613
$$ -45198 -46148 -62157 -61083 -69469 -72505 -27758 -2023 -26680 -51335 -26573 21103 10893 -10720
13371a0720j9407J29P716j376O934J2863K8916l2994k2397L2072J1705j47k7887
$$ -10720 -30127 -29998 -22282 -23658 -16724 -3861 25055 -7939 -30336 1736 13441 13294 -14593
13358a4593r59M0698k995j7447j0437j949K0452J0901k146k1044q712j3427l293
$$ -14593 -15552 25146 22151 4704 -5733 -7682 12770 23671 21525 481 -8231 -21658 -24951
13345b4951r931j5239J5853J8934J5882l0265k4364K2551r008j4315Q44m363K0790
$$ -24951 -34882 -50121 -34268 -15334 548 -29717 -54081 -31530 -40538 -54853 -54009 -58372 -37582
13332c7582J4649K822m364j0917j520K9477k1809M6L1658N905Q467k2412k0182
$$ -37582 -22933 -20111 -24475 -35392 -36912 -7435 -29244 -29198 2460 8365 16832 -5580 -25762
13319b5762l847J3261J5527R451k1484n944L7269m0079j2437K9088J0793o550
$$ -25762 -29609 -16348 -821 8630 -12854 -18798 18471 -21608 -34045 -4957 5836 -714
13307g14J331O347m367Q649j0528k4295j0080o432q887K891J3865J5134J330j5531
$$ -714 617 6964 2597 11246 718 -23577 -33657 -40089 -48976 -46085 -32220 -17086 -15756 -31287
13293c1287J9381P247k8798J969J3099o183J8605M796k4493o197J3294K858P221
$$ -31287 -11906 -4659 -33457 -31488 -18389 -24572 -5967 -1171 -25664 -31861 -18567 -15709 -8488
13280h488j6241l2866O019J1629R219Q266j521R927L237l8579j0698K4053J1467
$$ -8488 -24729 -57595 -51576 -39947 -30728 -22462 -23983 -14056 -10819 -49398 -60096 -36043 -24576
13267b4576n513J8547J1712j2175J7257o888q624L633j2623k416p814L3598O157
$$ -24576 -30089 -11542 170 -12005 5252 -1636 -10260 -6627 -19250 -21666 -29480 4118 10275
13254A0275l3559M687J3102J8887o20p046n970N578L6980L0633j917m4632j9671
$$ 10275 -23284 -18597 -5495 13392 12772 5726 -244 5334 42314 72947 71030 26398 6727
13241F727P556J0371J4455j5270r012k9979J2308l838l2012o879L6834J8200r193
$$ 6727 14283 24654 39109 23839 14827 -15152 -2844 -6682 -38694 -45573 -8739 9461 268
13228B68M593Q448o523J700J2299q962m231j3939L22J1249j5456j6898n58J820
$$ 268 4861 13309 6786 8486 20785 11823 7592 -6347 -6025 5224 -10232 -27130 -27688 -25868
13214b5868m028K3672p5r994j1037Q242m028j7372L3750J7644r380J907p05k5746
$$ -25868 -29896 -6224 -6299 -16293 -27330 -19088 -23116 -40488 -6738 10906 1526 3433 2728 -23018
13200b3018r661k174J4060J3237r489j7868O384j822N824J941J0120J13k8548
$$ -23018 -32679 -34853 -20793 -7556 -17045 -34913 -28529 -30351 -24527 -22586 -12466 -12353 -40901
13187d0901k0833K1445J6859J655K3380K8488M309j7626q039J3912k1313q939
$$ -40901 -61734 -40289 -23430 -21775 1605 30093 34402 16776 8737 22649 1336 -7603
13175g603P674k1205l1567k357J0611K381L9438R345j1233k8657P355L7276j466
$$ -7603 71 -21134 -52701 -55058 -44447 -42066 -2628 6717 -4516 -33173 -25818 11458 9992
13162I992N804j0457n3940j2329L1481J6381Q851r566J0666q008j4218j8674J885
$$ 9992 15796 5339 -48601 -60930 -29449 -13068 -4217 -13783 -3117 -11125 -25343 -44017 -42132
13149d2132o380K9420L8556J3593m8036m3872O526N0312M3470j7094j9964K5973
$$ -42132 -48512 -19092 19464 33057 -14979 -58851 -52325 -2013 41457 24363 4399 30372
13137C0372P900j023l5446l2125R729L759P137R551J9820r39k5942k3768k161
$$ 30372 38272 37249 1803 -30322 -20593 -16834 -9697 -146 19674 18735 -7207 -30975 -33136
13124c3136R997K6470r480j3332o402N653J2945L585L1772Q387j6354q44K437
$$ -33136 -23139 3331 -6149 -19481 -25883 -20230 -7285 -3700 28072 36459 20105 19261 21698
13111B1698Q430j2877j4337k4538K393J1821J612n338M588O928J4759L3817O059
$$ 21698 30128 17251 2914 -21624 -19231 -7410 -5798 -11136 -6548 380 15139 48956 55015
13098E5015L966p506l5192k6702J0625K2940k3392k0983o451K8905Q199R522j4217
$$ 55015 58981 51475 16283 -10419 206 23146 -246 -21229 -27680 1225 9424 18946 4729
13085D729j1643n726k3135r367k4627j9146K4367J8262Q554j1306j610o331R743
$$ 4729 -6914 -12640 -35775 -45142 -69769 -88915 -64548 -46286 -37732 -49038 -50648 -56979 -47236
13072d7236j567K1896j7273k1376L0344K9290L3422m4013l6558p336R295M0855
$$ -47236 -48803 -26907 -44180 -65556 -35212 -5922 27500 -16513 -53071 -60407 -51112 -10257
13060a0257J3049j7175j33J1842k3002J0413P380J17M1923K8786j3828l1958j7634
$$ -10257 2792 -14383 -14516 -2674 -25676 -15263 -7883 -7766 34157 62943 49115 17157 -477
13047d77J354o106r263J5881K6255k4416k5520K0031M806l6213J9237M8185j3031
$$ -477 877 -5229 -14492 1389 27644 3228 -22292 -2261 2545 -33668 -14431 33754 20723
13034B0723l4292j1059N746Q70k1090K8806M232K5717j4472j8131K5532K335q177
$$ 20723 -13569 -24628 -18882 -18012 -39102 -10296 -6064 19653 5181 -12950 12582 14917 6740
13021F740Q03j0440j4281l924L0741J979k5379o258j1369J6734o290k4122n416
$$ 6740 7543 -2897 -17178 -21102 9639 11618 -13761 -20019 -31388 -14654 -20944 -45066 -50482
13008e0482k6791M868N5792J1231n442j4888l897K1587j2061J2363N097J7722
$$ -50482 -77273 -72405 -16613 -5382 -10824 -25712 -29609 -8022 -20083 -7720 -2623 15099
12996A5099K3457j8871j9986J6559j5714K439l56K1779K0849j1956n463p448o776
$$ 15099 38556 19685 -301 16258 544 2983 2627 24406 45255 33299 27836 20388 13612
12983A3612k4657j6546K975J8645O496k3636l4445J337M1323Q108J662m761M012
$$ 13612 -11045 -27591 -24616 -5971 525 -23111 -57556 -56219 -14896 -6788 -5126 -9887 -5875
12970e875K4959P474m2580k6273K1298L236M354l373q326J6484j6617O268K8145
$$ -5875 19084 26558 -16022 -42295 -20997 -17761 -13407 -16780 -25106 -8622 -25239 -18971 9174
12957I174j046p369J2381J2923k1585l0658k6038N135R611J5585o31j6313j2871
$$ 9174 8128 759 13140 26063 4478 -26180 -52218 -47083 -37472 -21887 -22518 -38831 -51702
12944e1702j3169l3287k1442J8676L6538J3864l833q622J5466K3277L284R79J8555
$$ -51702 -64871 -98158 -119600 -100924 -64386 -50522 -54355 -62977 -47511 -24234 -20950 -19971 -1416
12931a416O770J4533R49r98j8727j9047o225k568l267p961J9050L922p709K2843
$$ -1416 5354 19887 20836 19838 1111 -17936 -24161 -26729 -29996 -37957 -18907 -14985 -22694 149
12917A49R320M347k9483m034P455l142j5304L63K936p517J4983l649j107P616
$$ 149 9469 13816 -15667 -19701 -12246 -15388 -30692 -30329 -27393 -34910 -19927 -23576 -24683 -17067
12903a7067q86J2191n093j1457j1382R614q275j7585j2264J0742M1639K8500j0292
$$ -17067 -17953 -5762 -10855 -22312 -33694 -24080 -32355 -49940 -62204 -51462 -9823 18677 8385
12890H385m7010m051M1190M6821k1580j8333L3059j0814l8652l0021J5270O961
$$ 8385 -38625 -42676 -1486 45335 23755 5422 38481 27667 -10985 -41006 -25736 -18775
12878a8775o016m510K4678M040M998P713r102n131K5584R19j8381K5719J204p303
$$ -18775 -24791 -29301 -4623 -583 4415 12128 3026 -2105 23479 24398 6017 31736 32940 25637
12864B5637P248J6300j0465q555q415j3109j3727Q80k1403L08L2994L4497O352
$$ 25637 32885 49185 38720 30165 21750 8641 -5086 -4206 -25609 -25301 7693 42190 48542
12851D8542l1227l8420k4228J592n685j0905L5753K1792j2708j1471m258J653
$$ 48542 17315 -21105 -45333 -43741 -49426 -60331 -24578 -2786 -15494 -26965 -31223 -29570
12839b9570L6524J1693o928j745L290K951q453j7216k606p062J6304K9654J4204
$$ -29570 6954 18647 11719 9974 13264 16215 7762 -9454 -12060 -19122 -2818 26836 41040
12826D1040N669m4583q021j03R319K2205R154j4201m539q462r374m357j4286L841
$$ 41040 46709 2126 -5895 -5998 3321 25526 34680 20479 15940 7478 -1896 -6253 -20539 -16698
12812a6698K5736J2885j3768n693K0073J4337j8726k1870o928J1782l489J432
$$ -16698 9038 21923 8155 2462 22535 36872 18146 -3724 -10652 1130 -2359 -927
12800i27j0793j1522K1048j135J5096J0338J1499m3556k8424m163K2559K317Q005
$$ -927 -11720 -23242 -2194 -3329 11767 22105 33604 -9952 -38376 -42539 -19980 -17663 -9658
12787i658j9578l561j9880j67n732J1752K4157L6080P793k1396j208R940k6568
$$ -9658 -29236 -32797 -52677 -52844 -58576 -46824 -22667 13413 21206 -190 -1398 8542 -18026
12774a8026n876j1106j9040n82j100J9284J866k9556j073J2754J8611o86J1779
$$ -18026 -23902 -35008 -54048 -54630 -55730 -36446 -34580 -64136 -65209 -52455 -33844 -34530 -22751
12761b2751K1371q619m520N972j2326N503K3642q060p247j858j1272k1559J4377
$$ -22751 -1380 -9999 -14519 -8547 -20873 -15370 8272 212 -7035 -8893 -20165 -41724 -27347
12748b7347r924j0581r257k3630J157L7198M6187L0908O495k6448M901l530j2863
$$ -27347 -37271 -47852 -57109 -80739 -79582 -42384 3803 34711 41206 14758 19659 16129 3266
12735C266j2456Q436M409o398K953P347l6266k7701J2985K1353K7756L3664l2559
$$ 3266 -9190 -754 3655 -2743 210 7557 -28709 -56410 -43425 -22072 5684 39348 6789
12722F789k5663J2188j0720l3966k453Q043K1409o493k3043l3887j0530L7415
$$ 6789 -18874 -6686 -17406 -51372 -53825 -45782 -24373 -30866 -53909 -87796 -98326 -60911
12710f0911J7254J7783L8681L257K451k4435l7456n614L2647K1747P22k0641J0687
$$ -60911 -43657 -25874 12807 16064 18515 -5920 -43376 -48990 -16343 5404 6126 -14515 -3828
12697c828J1088l5521k5577n649J3550R400k5484k6616K5299M1910J3865L585
$$ -3828 7260 -28261 -53838 -59487 -45937 -36537 -62021 -88637 -63338 -21428 -7563 -3978
12685c978j4832k0688J4929o579Q04J2160K4519j1014l264J6538m081N843m010
$$ -3978 -18810 -39498 -24569 -31148 -30344 -18184 6335 -4679 -7943 8595 4514 10357 6347
12672F347R702J0525m3786j1813K1218j3103n812j1722K2747K9723k0669l7001
$$ 6347 16049 26574 -17212 -29025 -7807 -20910 -26722 -38444 -15697 14026 -6643 -43644
12660d3644L001K2470L4502J5026j8399k4714K783J7669l698J3014J2996p394
$$ -43644 -40643 -18173 16329 31355 12956 -11758 -8975 8694 4996 18010 31006 23612
12648B3612j0960l3195j8767K828J993L6013m435l300j7743J4034J0102J2588
$$ 23612 12652 -20543 -39310 -36482 -34489 1524 -2911 -6211 -23954 -9920 182 12770
12636A2770P233K2544k0073q066j754j3018J3794J855r920j338l4385n912L4602
$$ 12770 20003 42547 22474 14408 12654 -364 13430 15285 5365 4027 -30358 -36270 -1668
12623a668J1250j0412o229K295j0610n530k1790K3791K5288J3366R822j0036j1128
$$ -1668 9582 -830 -7059 -4764 -15374 -20904 -42694 -18903 6385 19751 29573 19537 8409
12610H409K6153L582j2222N070j6711j7919j1534K1534J5971K871j9556m3488
$$ 8409 34562 38144 25922 30992 14281 -3638 -15172 6362 22333 25204 5648 -37840
12598c7840n576O2k204m366K9151K7353k647m06j0507j1652j4486k1306J1730
$$ -37840 -43416 -43354 -45558 -49924 -20773 6580 3933 3527 -6980 -18632 -33118 -54424 -42694
12585d2694J7525O940J0035j1253Q44j795j9625J1499N808j0498K1229m598k9487
$$ -42694 -25169 -18229 -8194 -19447 -18603 -20398 -40023 -28524 -22716 -33214 -11985 -16583 -46070
12572d6070R695J561j0189J7376J5377k7467j2703J0306Q662J0199l975K088J9127
$$ -46070 -36375 -34814 -45003 -27627 -12250 -39717 -52420 -42114 -33452 -23253 -27228 -25140 -6013
12559f013k102k2648J2919K8725l665m916k635N295M331j2897j1289J6759K83
$$ -6013 -8115 -30763 -17844 10881 7216 2300 -335 4960 9291 -3606 -14895 1864 2147
12546B147K6057K0470l1649l910k7640j8389R068J8061K6199J5852K0864q767
$$ 2147 28204 48674 17025 13115 -14525 -32914 -23846 -5785 20414 36266 57130 48363
12534D8363l156k6377R493L5301J1472R88l787j2215l5197k2552J6428q046l939
$$ 48363 45207 18830 28323 63624 75096 76084 72297 60082 24885 2333 18761 10715 6776
12521F776J5985L9412Q388m3404j4647K1691J6858J1787k933K5651j6958k695
$$ 6776 22761 62173 70561 27157 12510 34201 51059 62846 59913 85564 68606 65911
12509F5911j2417k8683j7778j3101k988J1320O21M34K2326o950l1344j4849K1164
$$ 65911 53494 24811 7033 -6068 -9056 2264 2885 3319 25645 18695 -12649 -27498 -6334
12496f334J5774j3835p623J0373j2908J0240k7249J7296M547J501j706k9634p764
$$ -6334 9440 -4395 -12018 -1645 -14553 -4313 -31562 -14266 -9719 -8218 -9924 -39558 -47322
12483d7322J6733k245p119J063J0068Q349N5o884J2504K4629R790j8907j6249
$$ -47322 -30589 -32834 -39953 -38890 -28822 -20473 -20418 -27302 -14798 9831 19621 714 -15535
12470a5535Q289J3350k4002j7074r56k5574k1565J1914K5553K8967K4085J3075
$$ -15535 -7246 6104 -17898 -34972 -35928 -61502 -83067 -71153 -45600 -16633 7452 20527
12458B0527l5636j1171R558j476J3024J423Q624j3466l905P226k28l0798k0637
$$ 20527 -15109 -26280 -16722 -18198 -5174 -3751 4873 -8593 -12498 -5272 -5500 -36298 -56935
12445e6935J6839j5547Q297J9124j6200p571K0457j2949J3408j912j6640q1r998
$$ -56935 -40096 -55643 -47346 -28222 -44422 -51993 -31536 -44485 -31077 -32989 -49629 -49710 -59708
12432e9708k471K1744r308P70M687J3191L7336r11R512k787Q661J4878N334J3266
$$ -59708 -62179 -40435 -49743 -48973 -44286 -31095 6241 5330 14842 12055 20716 35594 40928 54194
12418E4194j9494o947j693j087L2587p359l6547j0208K6123M897k2765k9879m170
$$ 54194 34700 27753 26060 24973 57560 50201 13654 3446 29569 34466 11701 -18178 -22348
12405b2348j027K8880J1982J8478l3150k1661N424J9070m086j7648K1740K117
$$ -22348 -23375 5505 17487 35965 2815 -18846 -13422 5648 1562 -16086 5654 7771
12393G771k883K007K6763N186l7811j2833J662m79P796K634K846m039R948K3865
$$ 7771 4888 6895 33658 38844 1033 -11800 -10138 -10617 -2821 -187 2659 -1380 8568 32433
12379C2433k707k3487m291L188j2331L874K5437L2261r587R924p337j0535l2752
$$ 32433 29726 6239 1948 5136 -7195 -3321 22116 54377 44790 54714 47377 36842 4090
12366D090l128L6542L9074o528m5345j9526L025p919o199J94l7758j0960M7507
$$ 4090 962 37504 76578 70050 24705 5179 8204 285 -5914 -5720 -43478 -54438 -6931
12353f931j0944k1334J6906j7413j0812L3900Q637p686Q341n04n181r944O575
$$ -6931 -17875 -39209 -22303 -39716 -50528 -16628 -7991 -15677 -7336 -7840 -13021 -22965 -16390
12340a6390j7214r683P112N525J1203K1409j8880n274K120O496J1204J083q541
$$ -16390 -33604 -43287 -36175 -30650 -19447 1962 -16918 -22192 -20072 -13576 -2372 -1289 -9830
12327i830N004j5925k7033j3417p100L9598N0878Q407l106R299j436k4565Q140
$$ -9830 -4826 -20751 -47784 -61201 -68301 -28703 22175 30582 27476 36775 35339 10774 18914
12314A8914k98j1540j5259q753k3036j7980J9494K4992j1196o91J1459J5449n190
$$ 18914 18616 7076 -8183 -16936 -39972 -57952 -38458 -13466 -24662 -25353 -13894 1555 -3635
12301c635r21M227l222m791j5517j627O641j7088L5059Q596q448Q86J8688J0764
$$ -3635 -4556 -329 -3551 -8342 -23859 -25486 -18845 -35933 -874 7722 -726 160 18848 29612
12287B9612j6988K09J42J4880p261j7348k3892J856N512j4995j9307R017R650
$$ 29612 12624 12833 12975 27855 20594 3246 -20646 -18790 -13278 -28273 -47580 -38563 -28913
12274b8913k062J6843J6135j1974J3239k649J6438J158j5851k5015n119L1486
$$ -28913 -30975 -14132 2003 -9971 3268 619 17057 18215 2364 -22651 -27770 3716
12262C716J4439j542o805r808K1827J308l521j5169j2036j1717j8005O387q483
$$ 3716 18155 16613 9808 0 21827 23135 19614 4445 -7591 -19308 -37313 -30926 -39409
12249c9409k4148J2992L7692K5199J2136n915l0429l696k3158O371L3690O300
$$ -39409 -63557 -50565 -12873 12326 24462 18547 -11882 -15578 -38736 -32365 1325 7625
12237G625l0210P536L3544m462o993k5786j6462R895l203R649J1579L766K4123
$$ 7625 -22585 -15049 18495 14033 7040 -18746 -35208 -25313 -28516 -18867 -7288 -3522 20601
12224B0601K8437j189k7138j5319J0286m043L735J0750o68k4504r575m359J5885
$$ 20601 49038 47849 20711 5392 15678 11635 15370 26120 25452 948 -8627 -12986 2899
12211B899J2311J748o77Q35j8712j9446k5390j9002J6762R717j2582R68M978K4417
$$ 2899 15210 16958 16281 17116 -1596 -21042 -46432 -65434 -48672 -38955 -51537 -50569 -45591 -21174
12197b1174J7969k0432k269Q239j1098j6934J3663j4663m860n975k894K62K4590
$$ -21174 -3205 -23637 -25906 -17667 -28765 -45699 -32036 -46699 -51559 -57534 -60428 -60166 -35576
12184c5576L4202n836J161J2280q213R574J5486j6262m469k0417k9697K1107M82
$$ -35576 -1374 -7210 -6049 6231 -1982 7592 23078 6816 2347 -18070 -47767 -26660 -26178
12171b6178J3495J4768j9910J696N611l0622j4599Q418R258M968J3075K1389l547
$$ -26178 -12683 2085 -17825 -16129 -10518 -41140 -55739 -47321 -38063 -33095 -20020 1369 -2178
12158b178M690J4977k3344M32j4808P152L7004J6554j2525N176O06k3410k5322
$$ -2178 2512 17489 -5855 -5423 -20231 -13079 23925 40479 27954 33130 33736 10326 -14996
12145a4996j3405j075K4058R548K1510M2660j4229j9765J6924J421k5915k9697
$$ -14996 -28401 -29476 -5418 4130 25640 68300 54071 34306 51230 52651 26736 -2961
12133b961r253n956K2873K291k1847J281Q939r393J0990j8217J6606n422k5639
$$ -2961 -12214 -18170 4703 6994 -14853 -13572 -4633 -14026 -3036 -21253 -4647 -10069 -35708
12120c5708j4033Q548L3633J7862J5941L5636R358j3777j8589j5070r563k2359
$$ -35708 -49741 -41193 -7560 10302 26243 61879 71237 57460 38871 23801 14238 -8121
12108h121k4196K0555n214J3629j0697k4569k3360J410J8143J1908o770J9262
$$ -8121 -32317 -11762 -16976 -3347 -14044 -38613 -61973 -60563 -42420 -30512 -37282 -18020
12096a8020J6468j5781j8554K4698K6624k0026R56q800k9587k6753l772L3196
$$ -18020 -1552 -17333 -35887 -11189 15435 -4591 -3635 -12435 -42022 -68775 -72547 -39351
12084c9351L7056q594j0270K5901K1616Q406j8401l344j9404j1475j87R796R310
$$ -39351 -2295 -10889 -21159 4742 26358 34764 16363 13019 -6385 -17860 -18047 -8251 1059
12071A059j1844j5367Q86j4250J2911L3504J7487P407k0630Q608J4887j586k394
$$ 1059 -10785 -26152 -25266 -39516 -26605 6899 24386 31793 11163 19771 34658 33072 30678
12058C0678j2520j3358m405N370L007k1484R06R014j0176L2585l897j8143r190
$$ 30678 18158 4800 395 5765 8772 -12712 -11806 -2792 -12968 19617 15720 -2423 -11613
12045a1613J670k0736j7293n794r923K6503k0511j6011J6327O893j8690l650L3209
$$ -11613 -9943 -30679 -47972 -53766 -63689 -37186 -57697 -73708 -57381 -50488 -69178 -72828 -39619
12032c9619K821k3493J8281K8808p306P437K9035J1336R222m840q881J1022r645
$$ -39619 -36798 -60291 -42010 -13202 -20508 -13071 15964 27300 36522 31682 22801 33823 24178
12019B4178l269O409k540k4211k2896j4156k08n133p723J778J5405J3030l25k32
$$ 24178 20909 27318 24778 567 -22329 -36485 -36693 -41826 -49549 -47771 -32366 -19336 -19661 -19893
12005a9893J5098R537k534k9597l7776r050J4130L888P975L322K5443K827J9045
$$ -19893 -4795 4742 2208 -27389 -65165 -74215 -60085 -56197 -48222 -44900 -19457 -16630 2415
11992B415P173k1610J1206K175n538J0090k7612J1739n603P233K5869J662m4986
$$ 2415 9588 -12022 -816 1359 -4179 5911 -21701 -9962 -15565 -8332 17537 19199 -25787
11979b5787P707R444J3748j1921j7190N675J9029J7999q193j0851j2499k0798
$$ -25787 -18080 -8636 5112 -6809 -23999 -18324 705 18704 10511 -340 -12839 -33637
11967c3637k4870N352K2959J8642K2566n229q678k6690J5571M3322l094j5807
$$ -33637 -58507 -53155 -30196 -11554 11012 5783 -2895 -29585 -14014 29308 26214 10407
11955A0407R485K200j7096q644j0478r349J0592K6981j7589k4840j2479m615m373
$$ 10407 19892 22092 4996 -3648 -14126 -23475 -12883 14098 -3491 -28331 -40810 -45425 -49798
11942d9798K1425J9300Q574N043q283J8116J3868k070q77j7707j975r27K71j9718
$$ -49798 -28373 -9073 -499 4544 -3739 14377 28245 26175 25298 7591 5616 4689 4960 -14758
11928a4758j1511P52k9682P365M1391J7287j8852m5609k1204J7909O240M943j6689
$$ -14758 -26269 -25517 -55199 -47834 -6443 10844 -8008 -53617 -74821 -56912 -50672 -45729 -62418
11915f2418J176N463j7J5317K9706J5564j9360n431j2465r745R66J0022r921n458
$$ -62418 -61242 -55779 -55796 -40479 -10773 4791 -14569 -20000 -32465 -42210 -41244 -31222 -41143 -46601
11901d6601J1013J5584J6454P955K848l2511j5827n00N084Q677Q761j7382J8223
$$ -46601 -35588 -20004 -3550 4405 7253 -25258 -41085 -41585 -36501 -27824 -19063 -36445 -18222
11888a8222K0877j7953k0346K1148j6082q677K5758N516j3706k845O420R238J9862
$$ -18222 2655 -15298 -35644 -14496 -30578 -39255 -13497 -7981 -21687 -24532 -18112 -8874 10988
11875A0988K9450k9674k7483j674N978L761j0910m376R872L453J9569J034j3952
$$ 10988 40438 10764 -16719 -18393 -12415 -8654 -19564 -23940 -14068 -10615 8954 9988 -3964
11862c964p762k488N17o768K739J4548m418j3043r814k4840K818L1298L9502J1772
$$ -3964 -11726 -14214 -13697 -20465 -17726 -3178 -7596 -20639 -30453 -55293 -52475 -21177 18325 30097
11848C0097j6658j3762j6219J9547j74K2794R491n463j1879P856J9442k5337j5979
$$ 30097 13439 -323 -16542 3005 2831 25625 35116 29653 17774 25630 45072 19735 3756
11835C756j3390r254K2228J1662l792J1860j280n310j3238k4504j0568j8368j6968
$$ 3756 -9634 -18888 3340 15002 11210 23070 21790 16480 3242 -21262 -31830 -50198 -67166
11822f7166K4865J7243J6921m899l6729O960J3188J2111k541J2006J7611J73N309
$$ -67166 -42301 -25058 -8137 -13036 -49765 -42805 -29617 -17506 -20047 -8041 9570 9743 15052
11809A5052j7365m3305p426O316l2063J1194J6348K116k682l446K6761j3821k8963
$$ 15052 -2313 -45618 -53044 -46728 -78791 -67597 -51249 -49133 -51815 -55261 -28500 -42321 -71284
11796g1284O220J1553K5165N988o968L941J5799j4515k3047l168k0175J4623M3730
$$ -71284 -65064 -53511 -28346 -22358 -29326 -25385 -9586 -24101 -47148 -50316 -70491 -55868 -12138
11783a2138Q917j4478l496J0848j4546K4668R876M565j7228p829l1452P964L1265
$$ -12138 -3221 -17699 -21195 -10347 -24893 -225 9651 14216 -3012 -10841 -42293 -34329 -3064
11770c064J8199p492l091K4249K302m129k1020k3275k4565O586N087J5694J0988
$$ -3064 15135 7643 4552 28801 31103 26974 5954 -17321 -41886 -35300 -30213 -14519 -3531
11757c531R057J2418P865L5163k4055l5065M938p852l625J2155q983L71K1566
$$ -3531 5526 17944 25809 60972 36917 1852 6790 -1062 -4687 7468 -1515 -1144 20422
11744B0422J2881r701m2263k8550j2762j1011P192J7224O605j0918n256L7930
$$ 20422 33303 23602 -18661 -47211 -59973 -70984 -63792 -46568 -39963 -50881 -56137 -18207
11732a8207K7255n2892L19L7243Q427L359j4799p012P613P180k3396J925p494
$$ -18207 9048 -43844 -43525 -6282 2145 5504 -9295 -16307 -8694 -1514 -24910 -22985 -30479
11719c0479j709J5559R983K4986K6118k1484j6349k2558Q051o663p985N39N575
$$ -30479 -32188 -16629 -6646 18340 44458 22974 6625 -15933 -7882 -14545 -22530 -21991 -16416
11706a6416q884r092M892j334J3058o358J9110o340p445m258p436J3824J6587
$$ -16416 -25300 -34392 -29500 -30834 -17776 -24134 -5024 -11364 -18809 -23067 -30503 -16679 -92
11693i2j14l1704k6902K8308K3888k365l5711k871J2769P722q447R540p879j8655
$$ -92 -206 -31910 -58812 -30504 -6616 -8981 -44692 -47563 -34794 -27072 -35519 -25979 -33858 -52513
11679e2513J0789K2224K0864l536p414k6445J2294K4633L686j2606j2171M899
$$ -52513 -41724 -19500 1364 -2172 -9586 -36031 -23737 896 4582 -8024 -20195 -15296
11667a5296J5041K048P64j6491k9698P558K7628R728l339J3756J7493J5106Q759
$$ -15296 -255 1793 2557 -13934 -43632 -36074 -8446 1282 -2057 11699 29192 44298 53057
11654E3057l3569p735o779k1120L061K126J9129k5916k6982j7453K4004J2757
$$ 53057 19488 11753 4974 -16146 -13085 -10959 8170 -17746 -44728 -62181 -38177 -25420
11642b5420J9279K4535R404r933k2543L1911P715j2013k2948k6050J7130k7115
$$ -25420 -6141 18394 27798 17865 -4678 27233 34948 22935 -13 -26063 -8933 -36048
11630c6048J0791j222K5615J9619q117j8147j598O997J0953k5551J0400J1865
$$ -36048 -25257 -26479 -864 18755 10638 -7509 -9107 -2110 8843 -16708 -6308 5557
11618E557k1041l0889j4575O938K2092J0571n276O85L08o366J4468M796O890N091
$$ 5557 -15484 -46373 -60948 -54010 -31918 -21347 -26623 -25938 -25630 -31996 -17528 -12732 -5842 -751
11604g51k3258k0132j1898K4124J8507K064J5423L069q41k3450J2027K7479N575
$$ -751 -24009 -44141 -56039 -31915 -13408 -11344 4079 7148 6307 -17143 -5116 22363 27938
11591B7938J4558J9632q302m147j2459k1886l9304J2705J1349j5539q617n784
$$ 27938 42496 62128 53826 49679 37220 15334 -23970 -11265 84 -15455 -24072 -29856
11579b9856J7890K143j7089L104K7630m920j7479J6760J9384p753M863l0876j7158
$$ -29856 -11966 -9823 -26912 -23808 3822 -1098 -18577 -1817 17567 9814 14677 -16199 -33357
11566c3357K4780K5951J0292j0745N000K0559N748j5851l998l2730j9107j912
$$ -33357 -8577 17374 27666 16921 21921 42480 48228 32377 28379 -4351 -23458 -25370
11554b5370M2082m959l0085p089J9172l504L0j6803j8275n504j1726J3498L2447
$$ -25370 16712 11753 -18332 -25421 -6249 -9753 -9723 -26526 -44801 -50305 -62031 -48533 -16086
11541a6086K1815K7613L3008p640j3157p8l0514k9428K111j6475J8425J0635J5015
$$ -16086 5729 33342 66350 58710 45553 45475 14961 -14467 -12356 -28831 -10406 229 15244
11528A5244K6489J495j6116j2273l50j3864k7532J2066L2917k7698j8256l251
$$ 15244 41733 43228 27112 14839 14489 625 -26907 -14841 18076 -9622 -27878 -31129
11516c1129k21J3058J7184R571M11q547k8101l3674N866K0226J5500r369K5264
$$ -31129 -31350 -18292 -1108 8463 8874 327 -27774 -61448 -55582 -35356 -19856 -29225 -3961
11503c961L0311j4807j4384R1n87j3360o316j6637K8240K8885j8287k0950K1603
$$ -3961 26350 11543 -2841 -2750 -3337 -16697 -23013 -39650 -11410 17475 -812 -21762 -159
11490a59j3706j5050r187J2146K938k8936r699K617o360J4581L0697K9604k7393
$$ -159 -13865 -28915 -38102 -25956 -23018 -51954 -61653 -59036 -65396 -50815 -20118 9486 -17907
11477a7907J4880J7085J6545P094j6253o0365r298Q252Q092L0957J569k073j1996
$$ -17907 -3027 14058 30603 37697 21444 -38921 -48219 -39967 -31875 -918 651 -1422 -13418
11464a3418J5996J1916k2706n728p098j685J7519n481k0342j5265J033L1807P831
$$ -13418 2578 14494 -8212 -13940 -21038 -22723 -5204 -10685 -31027 -46292 -45259 -13452 -5621
11451e621m331m170J7450M917j9136l1223k3212o163j66N309K1679L0228J6613
$$ -5621 -9952 -14122 3328 8245 -10891 -42114 -65326 -71489 -71655 -66346 -44667 -14439 2174
11438B174o096j0100j0543j2075K0910L488L274J4394L36l271n444J6189L0223
$$ 2174 -3922 -14022 -24565 -36640 -15730 -12242 -8968 5426 5762 2491 -2953 13236 43459
11425D3459J8049k7787l2108j5116K328l280j4554r052K0512J3536J6560J4685
$$ 43459 61508 33721 1613 -13503 -11175 -14455 -29009 -38061 -17549 -4013 12547 27232
11413B7232m666L463O474M25l6967k3502j8086J3224L936K3140J6695q616j4249
$$ 27232 22566 26029 32503 32928 -4039 -27541 -45627 -32403 -28467 -5327 11368 2752 -11497
11400a1497j3242k9497k310L4917J1431L6151p493j7552k602J5645Q317J0170
$$ -11497 -24739 -54236 -56546 -21629 -10198 25953 18460 908 -1694 13951 22268 32438
11388C2438M005N501j0646k6792l04L2181L463j2497j1759j7693K558j2625j3
$$ 32438 36443 41944 31298 4506 4202 36383 39846 27349 15590 -2103 455 -12170 -12183
11375a2183p567J3092m924k215n020n282J2468j9608J6470j2747j5380K0489M2902
$$ -12183 -19750 -6658 -11582 -13797 -18817 -24099 -11631 -31239 -14769 -27516 -42896 -22407 20495
11362B0495j5911p689K8248j792j3490q431l1004k2161k1752J0333J0811K3147
$$ 20495 4584 -3105 25143 23351 9861 1430 -29574 -51735 -73487 -63154 -52343 -29196
11350b9196J4100K6467j5356J0525L0762k904l7552l6041j8115J8491M5907Q311
$$ -29196 -15096 11371 -3985 6540 37302 34398 -3154 -39195 -57310 -38819 7088 15399
11338A5399j1218p685M569q77J6917P117p610k2012r025Q083J2558K0899J1602
$$ 15399 4181 -3504 1065 188 17105 24222 16612 -5400 -14425 -6342 6216 27115 38717
11325C8717j0676k2230k1701P162M167j279n641O344k307K981j5919q988J5186
$$ 38717 28041 5811 -15890 -8728 -4561 -5840 -11481 -5137 -7444 -4463 -20382 -29370 -14184
11312a4184J2865k397Q386J5628j9968M99N785N946K5059m384k8396j6582J5096
$$ -14184 -1319 -3716 4670 20298 330 829 6614 12560 37619 33235 4839 -11743 3353
11299C353K8138L313m2154m209O0M275J1398L1298m275J4133J9670l037k3676
$$ 3353 31491 34804 -7350 -11559 -11499 -7224 4174 35472 31197 45330 65000 61963 38287
11286C8287j6521l762j7443K7811j8379l7814J3001j2310N065K1622l229J2027
$$ 38287 21766 18004 561 28372 9993 -27821 -14820 -27130 -22065 -443 -3672 8355
11274H355K1838J1821n827j0664k0112k4754M909P132J5025J1227m705O987L159
$$ 8355 30193 42014 36187 25523 5411 -19343 -14434 -7302 7723 18950 14245 21232 24391
11261B4391K521j9427j0124l292K2359J2569j8030k1740M779m844j0510J4919
$$ 24391 26912 7485 -2639 -5931 16428 28997 10967 -10773 -5994 -10838 -21348 -6429
11249f429N524J2071K0141m2329p606J1292j5922J642j31K212J9961K0409p782
$$ -6429 -905 11166 31307 -11022 -18628 -7336 -23258 -21616 -21747 -19535 426 20835 13053
11236A3053m1767k8328j156j1500l014K8611J2032k0126M945J068k2252k0169
$$ 13053 -28714 -57042 -58198 -69698 -72712 -44101 -32069 -52195 -47250 -46182 -68434 -88603
11224h8603K032J8683M9156N2372J4941n4146k7192J6845P128k787J1417J7404
$$ -88603 -86571 -67888 -18732 33640 48581 -5565 -32757 -15912 -8784 -11571 -154 17250
11212A7250k3582l335l1971p561O717K0354O46L900R179O485N557q347j254J1652
$$ 17250 -6332 -9667 -41638 -49199 -42482 -22128 -21482 -17582 -8403 -1918 3639 -4708 -5962 5690
11198E690P240N677J9354j1815l7495m058l852n968j7134J9700K8636n943o119
$$ 5690 12930 18607 37961 26146 -11349 -15407 -19259 -25227 -42361 -22661 5975 32 -6087
11185f087j5999j8053J8054J1691k7451O292p335l722K8607k211K0443K8175J8382
$$ -6087 -22086 -40139 -22085 -10394 -37845 -31553 -38888 -42610 -14003 -16214 4229 32404 50786
11172E0786k0921j2437L552r333O954L651k0772j5210J6093K4939p248j3800k634
$$ 50786 29865 17428 20980 11647 18601 22252 1480 -13730 2363 27302 20054 6254 3620
11159C620R736o628o208Q358J5254j6894p951M356m810P007j2946N98L158n033
$$ 3620 13356 6728 520 8878 24132 7238 -713 3643 -1167 5840 -7106 -6508 -3350 -8383
11145h383l0001j4638J2361J7456O781K6489L403j5078P504O885N095k884J3224
$$ -8383 -38384 -53022 -40661 -23205 -16424 10065 13468 -1610 5894 12779 17874 14990 28214
11132B8214J9650M504n680M880K6089J4456j6933J4539Q0622P6115Q1770J25849
$$ 28214 47864 52368 46688 51568 77657 92113 75180 89719 170341 246456 328226 454075
11120D54075J39694Q3482M8044O2726K8680m1681j45737j88604j08238p3016p8911
$$ 454075 593769 677251 725295 788021 816701 775020 629283 440679 332441 259425 180514
11109A80514m9758n7764K0553K5202k9143l0314j3731p317r4j25o007J1535Q686
$$ 180514 130756 72992 93545 118747 89604 59290 45559 38242 38148 38023 32016 43551 52237
11096E2237j7251k2719r89R803J013o144j4792n454R080J9982L2771k9722k9555
$$ 52237 34986 12267 11278 21081 22094 15950 1158 -4296 4784 24766 57537 27815 -1740
11083a740j165k057J1676n145r555J6882P867K385j1108p865p532K4682N758k2119
$$ -1740 -2905 -4962 6714 1569 -7986 8896 16763 19148 8040 175 -7357 17325 23083 964
11069I64k0113j0569J269J6241n287K347J3399J8229K193p490j9823L2695j3088
$$ 964 -19149 -29718 -28449 -12208 -17495 -15148 -1749 16480 18673 11183 -8640 24055 10967
11056A0967k9860j278k1885O477K3100N668j3595k8640r774q320K0134J4551K3467
$$ 10967 -18893 -20171 -42056 -35579 -12479 -6811 -20406 -49046 -58820 -67140 -47006 -32455 -8988
11043h988j4813m1075r139J8023L7794J2941j4200j5872Q096J8358J4806N156
$$ -8988 -23801 -64876 -74015 -55992 -18198 -5257 -19457 -35329 -27233 -8875 5931 11087
11031A1087K1500P976n193j9602k5723j3184o36J7127R501j346j494j6121N522
$$ 11087 32587 40563 35370 15768 -9955 -23139 -23775 -6648 2853 1507 13 -16108 -10586
11018a0586J506q277l349k1752j0165M3112J966j2747j3560R569m738J5677J9454
$$ -10586 -9080 -17357 -20706 -42458 -52623 -9511 -7545 -20292 -33852 -24283 -29021 -13344 6110
11005F110p712o485o873k0006J1287J202j131M998J9486M161j5681j9542J7382
$$ 6110 -1602 -8087 -14960 -34966 -23679 -22477 -23608 -18610 876 5037 -10644 -30186 -12804
10992a2804K6882K6971J7766j8226r249M140k5970L713M2698m786n0982n36J4777
$$ -12804 14078 41049 58815 40589 31340 35480 9510 13223 55921 51135 153 -383 14394
10979A4394J4843j1753J6842J1056j4912p068j4808k277J9292J5226P454r221
$$ 14394 29237 17484 34326 45382 30470 23402 8594 6317 25609 40835 48289 39068
10967C9068K660l871k2974k2591o900J1986j2085j2361p92Q582N966K1840j4340
$$ 39068 41728 37857 14883 -7708 -14608 -2622 -14707 -27068 -27860 -19278 -13312 8528 -5812
10954e812l510O157K552O43p239r807k0670J6238L4056O827j2114p247r517k2032
$$ -5812 -9322 -3165 -613 30 -7209 -17016 -37686 -21448 12608 19435 7321 74 -9443 -31475
10940c1475K0778J7910j5268j6164r998N0088K2017l3238j4463l3976J4224L6063
$$ -31475 -10697 7213 -8055 -24219 -34217 15871 37888 4650 -9813 -43789 -29565 6498
10928F498j9245l613K7644j397J5990r969O724K391l1064k2326L6179P050m815
$$ 6498 -12747 -16360 11284 9887 25877 15908 22632 25023 -6041 -28367 7812 14862 10047
10915A0047m703K8491J1237J6079p995l3726j5749P340P608n66q467j0856J1552
$$ 10047 5344 33835 45072 61151 53156 19430 3681 11021 18629 18063 9596 -1260 10292
10902A0292j5388k17J4336n061J6976J9k844J183J033L4072J4899q557l2048m039
$$ 10292 -5096 -5313 9023 3962 20938 20957 18113 19296 20329 54401 69300 60743 28695 24656
10888B4656J7845K1443J143m915J8789K8113K140L3145n483l200J2339K1137J4370
$$ 24656 42501 63944 65087 60172 78961 107074 109214 142359 136876 133676 146015 167152 181522
10875A81522R515L7016N7131M1231N8321J08401J75658K53992L38780L49313L95410
$$ 181522 191037 228053 285184 326415 384736 493137 668795 922787 1261567 1610880 2006290
10864B006290M76300M66510L94438L37856K33320J03314n577j70040k99003l66966
$$ 2006290 2482590 2949100 3343538 3681394 3914714 4018028 4012451 3842411 3543408 3176442
10854C176442m31521m36346m10119l50818l03062k73225k01250r6292p2147n8870
$$ 3176442 2744921 2308575 1898456 1547638 1244576 971351 770101 673809 601662 542792
10844E42792n6872k1892k6388l4446k1626k8251m5259m119k3066k6364k6952M495
$$ 542792 485920 464028 437640 403194 381568 353317 308058 303939 280873 254509 227557 232052
10832B32052j7864l1092o775r834P630J1355j0987j3031k3018j2965k816j6773
$$ 232052 214188 183096 176321 166487 174117 185472 174485 161454 138436 125471 122655 105882
10820A05882K0714L9269m4986n6240k2590K3783K1932K6267j4069K5255r043l4792
$$ 105882 126596 165865 120879 64639 42049 65832 87764 114031 99962 125217 116174 81382
10808H1382K505L7437J656N328Q113M259j5786l595r995j7411j3137j2398K2125
$$ 81382 83887 121324 122980 128308 136421 140680 124894 121299 111304 93893 80756 68358 90483
10795I0483n990L123K898K0219N936k7101j9455j3408J0084j6942j7268J2970
$$ 90483 84493 87616 90514 110733 116669 89568 70113 56705 66789 49847 32579 45549
10783D5549j620j8498M206k2295J030L240j8694k615K9847J5331j7286k7684P236
$$ 45549 43929 25431 29637 7342 8372 11612 -7082 -9697 20150 35481 18195 -9489 -2253
10770b253j4721j9756j499J0810L3855j1900k1684R568K2247q597j7270l795K0374
$$ -2253 -16974 -36730 -38229 -27419 6436 -5464 -27148 -17580 4667 -3930 -21200 -24995 -4621
10757d621J2014L675R418K7977j7390o658J3189M4449M8151p167j6469k1013j5748
$$ -4621 7393 11068 20486 48463 31073 24415 37604 82053 130204 123037 106568 85555 69807
10744F9807J3201k8432m3751k7344J3945k499K88L5787J2321l3248L015J5221
$$ 69807 83008 54576 10825 -16519 -2574 -5073 -4785 31002 43323 10075 13090 28311
10732B8311J6418J8362k6703m1257j223L9420K7153j6920n241n966m552k895j5812
$$ 28311 44729 63091 36388 -4869 -6092 33328 60481 43561 38320 32354 27802 24907 9095
10719I095k0726K3348j0408k3354L1953J9405k6347k2541j0568J6511K7944L8874
$$ 9095 -11631 11717 1309 -22045 9908 29313 2966 -19575 -30143 -13632 14312 53186
10707E3186J6805j4678q772k7543M84o646j2179K286L706O021j5735l8399j2079
$$ 53186 69991 55313 46541 18998 19482 12836 657 2943 6649 12670 -3065 -41464 -53543
10694e3543O599M4679P582N092k5786j5368j1978L257j2780l061K0552J5421K8190
$$ -53543 -46944 -2265 5317 10409 -15377 -30745 -42723 -39466 -52246 -55307 -34755 -19334 8856
10681H856Q194j7480k1721J4563J9961o380k3444P557K0944M986J9058J6256n586
$$ 8856 17050 -430 -22151 -7588 12373 5993 -17451 -9894 11050 16036 35094 51350 45764
10668D5764r558j8633N328J5195l1549k2379j2085R808K2613L1214P677l661p251
$$ 45764 36206 17573 22901 38096 6547 -15832 -27917 -18109 4504 35718 43395 39734 32483
10655C2483q115j7321j886n797k9461k6953K0185K4875K9341K9680r142k3591
$$ 32483 24368 7047 5161 -636 -30097 -57050 -36865 -11990 17351 47031 37889 14298
10643A4298J2411r683q226k3605m2660J5928L9570o019k3391j0126j395J4764
$$ 14298 26709 17026 8800 -14805 -57465 -41537 -1967 -7986 -31377 -41503 -42898 -28134
10631b8134j4265P653j969J3862J685l6586P513L2851J5280J5323k4877j2547
$$ -28134 -42399 -34746 -36715 -22853 -21168 -57754 -50241 -17390 -2110 13213 -11664 -24211
10619b4211j819K8521K0271k402J4344k0739J135M251Q148j0532k2819j0366K3036
$$ -24211 -26030 2491 22762 20360 34704 13965 15100 19351 27499 16967 -5852 -16218 6818
10606F818j0587j5692j0950J2819K5148k6844j4885L8275K0722n526k5089P696
$$ 6818 -3769 -19461 -30411 -17592 7556 -19288 -34173 4102 24824 19298 -5791 1905
10594A905k916K983P771P216L495K1325p436k4108q661K4183j4947J218P340k53
$$ 1905 -1011 1972 9743 16959 20454 41779 34343 10235 1574 25757 10810 12028 19368 19115
10580A9115o282k3738J0064K7317O608K6797n17j8182j6128k0731Q432J6837R015
$$ 19115 12833 -10905 -841 26476 33084 59881 59364 41182 25054 4323 12755 29592 38607
10567C8607j21L0548N556j6046q552n466j359p970R442j5597o149j1983k374l0579
$$ 38607 38486 69034 74590 58544 49992 44526 43167 35197 44639 29042 22893 10910 8536 -22043
10553b2043j6791R018n538k2702j088J4076K4532K5648L6238l0658k2950j2199
$$ -22043 -38834 -29816 -35354 -58056 -59144 -45068 -20536 5112 41350 10692 -12258 -24457
10541b4457p934m530J6863J0468k3727N794j75L5155J7125j5689m852L746K2014
$$ -24457 -32391 -36921 -20058 -9590 -33317 -27523 -27698 7457 24582 8893 4041 7787 29801
10528B9801r555j4663R113K045j1754j9061K3385q17j7767J2483j5089Q19J0486
$$ 29801 20246 5583 14696 16741 4987 -14074 9311 8494 -9273 3210 -11879 -11060 -574
10515e74K1962j6729j0914m519n917Q034J8294L093R677k5697j4712n50n941J6161
$$ -574 21388 4659 -6255 -10774 -16691 -8657 9637 12730 22407 -3290 -18002 -18552 -24493 -8332
10501h332L054K2703K9243j9624k8456r425m498J0154N583L0191J0210j2981p334
$$ -8332 -5278 17425 46668 27044 -1412 -10837 -15335 -5181 402 30593 40803 27822 20488
10488B0488K0534R72K554j9923P322K6445j3821k3639N494j79l6937j5375k8245
$$ 20488 41022 41994 44548 24625 31947 58392 44571 20932 26426 26247 -10690 -26065 -54310
10475e4310m0631K5911M3592J5313j6030J0303Q409K211j4182O185o810J0408
$$ -54310 -94941 -69030 -25438 -10125 -26155 -15852 -7443 -5232 -19414 -13229 -20039 -9631
10463i631j5695N818J0148J7870K9399J2038j5764k2306K619P786K3218j2218
$$ -9631 -25326 -19508 -9360 8510 37909 49947 34183 11877 14496 22282 45500 33282
10451C3282p98N985P244m939j1934m43O43K5932J1796k0972l9801n159n244j3429
$$ 33282 32484 38469 45713 40774 28840 28397 29040 54972 66768 45796 5995 836 -4408 -17837
10437a7837j9574n038J8263N350j353j3301j3041K2442J1428o552O554J5452J1671
$$ -17837 -37411 -42449 -24186 -18836 -20189 -33490 -46531 -24089 -12661 -19213 -12659 2793 14464
10424A4464J2494J1642j7636k0228j6537M8054K1025m9759k2759k479j812L4796
$$ 14464 26958 38600 20964 736 -15801 32253 53278 3519 -19240 -21719 -23531 11265
10412A1265L7268k0971k5438j3770N611K8789j0326l0733k0278j0236J4102J8820
$$ 11265 48533 27562 2124 -11646 -6035 22754 12428 -18305 -38583 -48819 -34717 -15897
10400a5897L34J4189O451J14J9279J3107J7625p982o826r525l577K7446P028j3779
$$ -15897 -15563 -1374 5077 5191 24470 37577 55202 47220 40394 30869 27292 54738 61766 47987
10386D7987j9307N124j7522j0074J7058m106j7774j749k3665j8298j6135K286
$$ 47987 28680 33804 16282 6208 23266 19160 1386 -363 -24028 -42326 -58461 -56175
10374e6175n060K3623J7336L690J7062j422j3590O99L0095K7692J0747k6479j7151
$$ -56175 -61235 -37612 -20276 -16586 476 -946 -14536 -13837 16258 43950 54697 28218 11067
10361A1067J727J228l434J6229j644l6837L46K1749p06r445M830P480o49J3490
$$ 11067 12794 14022 10588 26817 25173 -11664 -11318 10431 9725 280 5110 12590 11941 25431
10347B5431k1795J1605j5900j9804K132L323m957J660j568n91M404O611J838j7373
$$ 25431 3636 15241 -659 -20463 -18331 -15008 -19965 -18305 -19873 -20464 -16060 -9449 -7611 -24984
10333b4984j6069j2683K4091O2613o923l0209J0796k1305N028J886K9382J5019
$$ -24984 -41053 -53736 -29645 32968 26045 -4164 6632 -14673 -9645 -7759 21623 36642
10321C6642j2895j7067m627K5247P920n370M148j6766n678j598j0072K1125Q994
$$ 36642 23747 6680 2053 27300 35220 29850 33998 17232 11554 9956 -116 21009 30003
10308C0003R378j1927L3J2785J3390o735j7366M322k9659k5100M351O624M376
$$ 30003 39381 27454 27487 40272 53662 46927 29561 33883 4224 -20876 -16525 -9901 -5525
10295e525q100k2341r593J4675N27J3262J7171K3442K2593k650k2332k652k622
$$ -5525 -13625 -35966 -45559 -30884 -30357 -17095 76 23518 46111 43461 21129 18477 15855
10282A5855l8646j1745k855J8083N328j3617o15j590J5605J4164K8064P161P571
$$ 15855 -22791 -34536 -37391 -19308 -13980 -27597 -28212 -29802 -14197 -33 28031 35192 42763
10269D2763j3380k1313j1281p231M20j6487n924K457K5782J208j2711K4601j4804
$$ 42763 29383 8070 -3211 -10442 -10022 -26509 -32433 -29976 -4194 -2986 -15697 8904 -5900
10256e900q632K0142R165k2919r492J5402p041l1979J8643L1283L499l205j2406
$$ -5900 -14532 5610 14775 -8144 -17636 -2234 -9275 -41254 -22611 8672 12171 8966 -3440
10243c440K8885j742j0971j1119j2479L013L0790k1719k5195Q873L786N641M157
$$ -3440 25445 23703 12732 1613 -10866 -7853 22937 1218 -23977 -15104 -11318 -5677 -1520
10230a520K0270m417J678Q754M094p049J1988N082l6999j3246Q449L2889J3735
$$ -1520 18750 14333 16011 24765 28859 21810 33798 38880 1881 -11365 -2916 29973 43708
10217D3708j9096k8309k3111L293j9481N492N9991P340j2293n955o856p192k8909
$$ 43708 24612 -3697 -26808 -23515 -42996 -37504 22487 29827 17534 11579 4723 -2469 -31378
10204c1378l4543j5696K6378K8583J8400K483J6948O553J4341J7800q361n5865
$$ -31378 -65921 -81617 -55239 -26656 -8256 -5773 11175 17728 32069 49869 41508 -14357
10192a4357l1432L7007n556l5776L940K2417K1290N258j078j824O576j1428l7166
$$ -14357 -45789 -8782 -14338 -50114 -46174 -23757 -2467 2791 1713 -111 6465 -4963 -42129
10179d2129J0662L130j9358J0451K7151K5394j104k8435j6686J6699j5813J5152
$$ -42129 -31467 -28337 -47695 -37244 -10093 15301 14197 -14238 -30924 -14225 -30038 -14886
10167a4886J3866m29J1816J1992J7558j2082k9719j8385k2166J164M361L7605
$$ -14886 -1020 -1449 10367 22359 39917 27835 -1884 -20269 -42435 -41271 -36910 695
10155F95M8727R593J2597k5284m5204p583o255K2111J627m671K9727r929O777
$$ 695 49422 59015 71612 46328 1124 -6459 -12714 9397 11024 6353 36080 26151 32928
10142C2928Q584j1811Q492K8549j9820m1854J4071j339m328J5057p367j4923j6117
$$ 32928 41512 29701 38193 66742 46922 5068 19139 17800 13472 28529 21162 6239 -9878
10129i878m459j7323k1139m818N257J2513J4492J3935n386Q710o831M091r042
$$ -9878 -14337 -31660 -52799 -57617 -52360 -39847 -25355 -11420 -16806 -8096 -14927 -10836 -19878
10116a9878K084K533O630Q944o03J549m332r870k1736n718J7130J8687N31j3167
$$ -19878 -17794 -15261 -8631 313 -290 1259 -3073 -12943 -34679 -40397 -23267 -4580 -4049 -17216
10102a7216m60K9077j1071j5437M152J504K480L3598o892q504o988O794J0515
$$ -17216 -17676 11401 330 -15107 -10955 -9451 -6971 26627 19735 11231 4243 11037 21552
10089B1552j4698n3608k5834J6283Q431J4528J1275K8514Q650n318l006J0482
$$ 21552 6854 -46754 -72588 -56305 -47874 -33346 -22071 6443 15093 9775 6769 17251
10077A7251k6063L416p77L100j620j0849n621k8804m072J1816n634J5580J2455
$$ 17251 -8812 -5396 -6173 -3073 -4693 -15542 -21163 -49967 -54039 -42223 -47857 -32277 -19822
10064a9822J7803l081K097O043k7595k0875P732l223M340M846K5701o181j4711
$$ -19822 -2019 -5100 -3003 3040 -24555 -45430 -37698 -40921 -36581 -31735 -6034 -12215 -26926
10051b6926j3528L2605L4251n17M480n010m6955j0481M5708J4206k2661j4568
$$ -26926 -40454 -7849 26402 25885 30365 25355 -21600 -32081 13627 27833 5172 -9396
10039i396k8942J5197J5676r86k7498r367K1349o123K935K6801P162J365j3315
$$ -9396 -38338 -23141 -7465 -8451 -35949 -45316 -23967 -30090 -27155 -354 6808 8173 -5142
10026e142j2630j1n655m377J194n896o776k4574r747N4940J4545n0370q318J1505
$$ -5142 -17772 -17783 -23438 -27815 -26621 -32517 -39293 -63867 -73614 -18674 -4129 -54499 -62817 -51312
10012e1312R893J1843O984K3621K4865p82j0736j6442l776J513M253J0456N318
$$ -51312 -41419 -29576 -22592 1029 25894 25112 14376 -2066 -5842 -4329 -76 10380 15698
9999A5698K413P588Q223J3072l486L3494m958m3137j9578k936N693j2718P199
$$ 15698 18111 25699 33922 46994 43508 77002 72044 28907 9329 6393 12086 -632 6567
9986F567J2084l0921K4333m066J5402K8821l6913J2283J3918j6960l8300m034
$$ 6567 18651 -12270 12063 7997 23399 52220 15307 27590 41508 24548 -13752 -17786
9974a7786J9110L846O453J7710J8040j0204j3176k0701J5206K822n86o5k946J315
$$ -17786 1324 5170 11623 29333 47373 37169 23993 3292 18498 21320 20734 20669 17723 19038
9960A9038K0713k1163l6219J4095K0488K625o88j477k3091j0565J3391N111J7202
$$ 19038 39751 18588 -17631 -3536 16952 19577 18889 17412 -5679 -16244 -2853 2258 19460
9947A9460O433J8229k0782r445j5594J6526K3485j7744n362J4938j7048j4113
$$ 19460 25893 44122 23340 13895 -1699 14827 38312 20568 15206 30144 13096 -1017
9935a017j4507l635M129P117j207P833o676K9853K2294J974r576j4864q72O532
$$ -1017 -15524 -19159 -15030 -7913 -9120 -1287 -7963 21890 44184 46158 36582 21718 20846 27378
9921B7378J0365j6963l4235R569o505j3567j453L8747r657m537J5752J851p876
$$ 27378 37743 20780 -13455 -3886 -10391 -23958 -25411 13336 3679 -858 14894 16745 8869
9908H869l525J2324k048p982J9471o518q34Q769J8166J2640k818j1673j1561p400
$$ 8869 5344 17668 15620 7638 27109 20591 19757 28526 46692 59332 56514 44841 33280 25880
9894B5880K0294j7157J0810m729k3880J693j8518k575n255l542l192m224j9324
$$ 25880 46174 29017 39827 35098 11218 12911 -5607 -8182 -13437 -16979 -20171 -24395 -43719
9881d3719j493J9395J1550K783K2154J4146K252m618R85N363O435j9474J0457
$$ -43719 -45212 -25817 -14267 -11484 10670 24816 27068 22450 23435 28798 35233 15759 26216
9868B6216J5389K117j3561J0307l692n672j0779K604K0931r70k7254k6571k087
$$ 26216 41605 43722 30161 40468 36776 31104 20325 22929 43860 42890 15636 -10935 -13022
9855a3022J5116j6582k962J5716j2985P311k0278l6987J2243N7846m021l3181
$$ -13022 2094 -14488 -17450 -1734 -14719 -7408 -27686 -64673 -52430 5416 1395 -31786
9843c1786J2762J4997j5655J9191m725J5382o466j9453K5405q441l769J5749J9090
$$ -31786 -19024 -4027 -19682 -491 -5216 10166 3700 -15753 9652 1211 -2558 13191 32281
9830C2281K80j9269P704j7016l3487l220o512P407K0210J2104o000q661O48j2310
$$ 32281 32561 13292 20996 3980 -29507 -32727 -39239 -31832 -11622 482 -5518 -14179 -13531 -25841
9816b5841m950Q33J8083J8957J0703N552j5033j4286j076j0426J0538Q495L40
$$ -25841 -30791 -29958 -11875 7082 17785 23337 8304 -5982 -7058 -17484 -6946 1549 1889
9803A889l0808P466N840L846J58j074N958k2564J3483J1023J8357J1379K314j4806
$$ 1889 -28919 -21453 -15613 -11767 -11609 -12683 -6725 -29289 -15806 -4783 13574 24953 27267 12461
9789A2461j039N409J6822k6751j7486j239J1286L085p233j2701J0961K8531r466
$$ 12461 11422 16831 33653 6902 -10584 -11823 -537 2548 -4685 -17386 -6425 22106 12640
9776A2640l3631l452J6133R463n22j4171m297J3808J6183N824k664L809n596p033
$$ 12640 -20991 -24443 -8310 1153 631 -13540 -17837 -4029 12154 17978 15314 19123 13527 6494
9762F494J168k4646j9628l9647J3431K3519J6545O074k0161J9713K4492K723J544
$$ 6494 7662 -16984 -36612 -76259 -62828 -39309 -22764 -16690 -36851 -17138 7354 10077 11621
9749A1621K518J1409m2409j8830O927Q202R300M963L4423R658p495P897l837j819
$$ 11621 14139 25548 -16861 -35691 -28764 -20562 -11262 -6299 28124 37782 30287 38184 34347 32528
9735C2528j2745j5093r901K3626R978m240K5158J2185j2000p818l463N395R887
$$ 32528 19783 4690 -5211 18415 28393 24153 49311 61496 49496 41678 38215 43610 53497
9722E3497P798k132n488O542m594O689P469k3419j8090k576R588K0343j7295n337
$$ 53497 61295 59163 53675 60217 55623 62312 69781 46362 28272 25696 35284 55627 38332 32995
9708C2995J1779l113j4198L8290J4160k0900k3683k1947k4956j47P376O066P719
$$ 32995 44774 41661 27463 65753 79913 59013 35330 13383 -11573 -11720 -4344 1722 9441
9695I441J3754K6483K2523j5427k5277j5929J5322J1261m369l1549l3073K3999
$$ 9441 23195 49678 72201 56774 31497 15568 30890 42151 37782 6233 -26840 -2841
9683b841M2952J832M141K5968l213l0699j7164K0268K1248k322O539l214n255
$$ -2841 40111 41943 46084 72052 68839 38140 20976 41244 62492 60170 66709 63495 58240
9670E8240q598j6121o913j4193K709J0842k78j6869j3071j4299O288l701J7643
$$ 58240 49642 33521 26608 12415 15124 25966 25688 8819 -4252 -18551 -12263 -15964 1679
9657A679M668o791J7827J2004k8895k3778J1215j0563j2295K5993O049L534j5130
$$ 1679 6347 -444 17383 29387 492 -23286 -12071 -22634 -34929 -8936 -2887 647 -14483
9644a4483j8435r385j132K2969K4511Q829j4791M208K109j7909L742K2166j1467
$$ -14483 -32918 -42303 -43435 -20466 4045 12874 -1917 2291 4400 -13509 -9767 12399 932
9631I32n929K263J5295J2150o074k7719k0705R637m104K2940J3734J2885j2283
$$ 932 -4997 -2734 12561 24711 18637 -9082 -29787 -20150 -24254 -1314 12420 25305 13022
9618A3022m463j1322O205J1673K3649p295K3731J70l1373k4000n306p192J2658
$$ 13022 8559 -2763 3442 15115 38764 31469 55200 55370 23997 -3 -5309 -12501 157
9605A57M139O093L098M029M532L0955k1818j3742j0156Q297L426n944k002o57
$$ 157 4296 10389 13487 17516 22048 53003 31185 17443 7287 15584 19010 13066 11064 10407
9591A0407N941m036O85j3729j0516p185K5150N830l0273O795J437L2657l232j1891
$$ 10407 16348 12312 12997 -732 -11248 -18433 6717 12547 -17726 -10931 -9494 23163 19931 8040
9577H040j539J3858J930J5141n106j4370L50J5634n730k5050O396J7559k2332
$$ 8040 6501 20359 22289 37430 32324 17954 18304 33938 28208 3158 9554 27113 4781
9564D781l670j2769j6692J5058j8951l0494L1741J5694K0077K0061k3210l1058
$$ 4781 1111 -11658 -28350 -13292 -32243 -62737 -30996 -15302 4775 24836 1626 -29432
9552b9432j7746L005J7669j1506n035K3780P695k0730J5238l45R451K0351J9195
$$ -29432 -47178 -44173 -26504 -38010 -43045 -19265 -11570 -32300 -17062 -17407 -7956 12395 31590
9539C1590k268j6845R079J4480l3364J634K7919L1340l656l178K4893J6795K7317
$$ 31590 29322 12477 21556 36036 2672 4306 32225 63565 59909 56731 81624 98419 125736
9526A25736m131k7080l2757j3006p497L356n249j3141p944j3386k1729N428K6490
$$ 125736 121605 94525 61768 48762 41265 44621 39372 26231 18287 4901 -16828 -11400 15090
9513A5090N882j67r998k0228j3978P68j845O103R916J3482R0j5333j678K1637
$$ 15090 20972 20805 10807 -9421 -23399 -22631 -24476 -18373 -8457 5025 5115 -10218 -11896 9741
9499I741J7697j8736k2172l895J703L569P399L8830o24k6954l495N954j2064N399
$$ 9741 27438 8702 -13470 -17365 -15662 -12093 -4694 34136 33512 6558 3063 9017 -3047 2352
9485B352J526J3466k970r544o791K0291l336j1657J463J8155j051j285k9137m756
$$ 2352 3878 17344 14374 4830 -1961 18330 14994 3337 4800 22955 21904 20619 -8518 -13274
9471a3274P356J3223L303K4836K212j2243r277M76l2783P339r653k5470J6670
$$ -13274 -5918 7305 10608 35444 37656 25413 16136 16612 -16171 -8832 -18485 -43955 -27285
9458b7285m802k0121r021J2664p779m1822j2346K6969J7444j4526M098M8475J4931
$$ -27285 -32087 -52208 -61229 -48565 -56344 -98166 -110512 -83543 -66099 -80625 -76527 -28052 -13121
9445a3121J0233J5373j557J9869M702j2100J4331k011k2138j7850r649J310q945
$$ -13121 -2888 12485 10928 30797 35499 23399 37730 35719 13581 -4269 -13918 -12608 -21553
9432b1553j0264J4948p786p249M552J2239K3105K3403j0683k359r934j3000K4411
$$ -21553 -31817 -16869 -24655 -31904 -27352 -15113 7992 31395 20712 18353 8419 -4581 19830
9419A9830L134n839J4695J6834J865l0596k6765J8177J0882k6610P985J6281k1995
$$ 19830 22964 17125 31820 48654 50519 19923 -6842 11335 22217 -4393 3592 19873 -2122
9406b122m276p780j2097P514R370K7771J6345J7459N911l0221J1568m669j8690
$$ -2122 -6398 -14178 -26275 -18761 -9391 18380 34725 52184 58095 27874 39442 34773 16083
9393A6083j8488K675R432Q214K3359J6791m47k1277R546l96j0250k45P14k5124
$$ 16083 -2405 270 9702 17916 41275 58066 57619 36342 45888 45492 35242 34997 35711 10587
9379A0587O015M698j3286k81p624r268Q611K6140k0668k4031K837J611O84j9370
$$ 10587 16602 21300 8014 7733 109 -9159 -548 25592 4924 -19107 -16270 -14659 -13975 -33345
9365c3345K1420M4934K0820K0380n264m1133K0051m211m4445M245K662K3951J2160
$$ -33345 -11925 33009 53829 74209 68945 27812 47863 43652 -793 3452 6114 30065 42225
9352D2225Q149j4427Q553j8273k6477r144m171j4198K7295M957j4162J0556J0886
$$ 42225 50374 35947 44500 26227 -250 -9394 -13565 -27763 -468 4489 -9673 883 11769
$$ [...]
##END NTUPLES=NMR SPECTRUM
##END=
