##TITLE=Analysis number 321364
Compound Code cc 58508
Book Reference 196/184
Project Code adrs
Chemist Name jimp
##JCAMPDX= 6.0         $$ Bruker NMR JCAMP-DX V2.0
##DATA TYPE= NMR SPECTRUM
##DATA CLASS= NTUPLES
##ORIGIN= Bruker BioSpin GmbH
##OWNER= nmr
$$ XWIN-NMR		Version 3.5
$$ Mon Aug  7 14:06:52 2006 GMT Daylight Time (UT+1h)  MAYBRIDGE\nmr@NMR_250MHZ
##.OBSERVE FREQUENCY= 250.131544655141
##.OBSERVE NUCLEUS= ^1H
##.ACQUISITION MODE= SIMULTANEOUS (DQD)
##.ACQUISITION SCHEME= undefined
##.AVERAGES= 16
##.DIGITISER RES= 18
##SPECTROMETER/DATA SYSTEM= dpx250
##.PULSE SEQUENCE= zg30
##.SOLVENT NAME= CDCl3
##.SHIFT REFERENCE= (INTERNAL, CDCl3, 0, 16.4081)
##AUDIT TRAIL= $$ (NUMBER, WHEN, WHO, WHERE, WHAT)
$$ ##TITLE= Audit trail, XWIN-NMR		Version 3.5
$$ ##JCAMPDX= 5.01
$$ ##ORIGIN= Bruker BioSpin GmbH
$$ ##OWNER= nmr
$$ C:\u/data/dgb/nmr/ADRS/380/pdata/1/auditp.txt
$$ ##AUDIT TRAIL=  $$ (NUMBER, WHEN, WHO, WHERE, WHAT)
(   1,<2006-08-07 14:06:31.98 +100>,<MAYBRIDGE\nmr>,<NMR_250MHZ>,
      <created by zg, POWCHK disabled, PULCHK disabled
       configuration hash MD5:
       E2 DF 36 D8 04 B2 41 60 5A D7 A3 38 5A 4B D0 FE
       data hash MD5: 64K
       08 EB D9 33 42 0F 66 48 1A F3 B7 80 7F 17 7A 1D>)
(   2,<2006-08-07 14:06:43.42 +100>,<MAYBRIDGE\nmr>,<NMR_250MHZ>,
      <Start of raw data processing
       ef LB = 0.3 FT_mod = 6 PKNL = 1 SI = 32K 
       data hash MD5: 32K
       B1 E5 E5 CE 07 A8 71 62 8E FA BB 31 E2 B0 0F D8>)
(   3,<2006-08-07 14:06:45.26 +100>,<MAYBRIDGE\nmr>,<NMR_250MHZ>,
      <apk 
       data hash MD5: 32K
       E4 3D D3 3E 8F 0B 4B D0 01 57 94 1F 63 FD 08 8A>)
(   4,<2006-08-07 14:06:46.00 +100>,<MAYBRIDGE\nmr>,<NMR_250MHZ>,
      <abs ABSG = 5 
       data hash MD5: 32K
       89 61 7A 81 97 22 47 9D 9C 13 AA D1 B9 67 F4 0A>)
$$ ##END=
$$ 
$$ hash MD5
$$ 79 07 C5 37 58 EA 14 2F D3 74 05 20 BA D3 20 CD
##$RELAX= 
##$RELAX= 
##$RELAX= 
##$RELAX= 
##$RELAX= 
##$RELAX= 
##$RELAX= 
$$ Bruker specific parameters
$$ --------------------------
##$DU= <C:\u>
##$EXPNO= 380
##$NAME= <ADRS>
##$PROCNO= 1
##$TYPE= <nmr>
##$USER= <dgb>
##$AMP= (0..31)
100 100 100 100 100 100 100 100 100 100 100 100 100 100 100 100 100 100 
100 100 100 100 100 100 100 100 100 100 100 100 100 100 
##$AQSEQ= 0
##$AQ_mod= 3
##$AUNM= <au_zg>
##$AUTOPOS= <35 >
##$BF1= 250.13
##$BF2= 250.13
##$BF3= 250.13
##$BF4= 250.13
##$BF5= 500.13
##$BF6= 500.13
##$BF7= 500.13
##$BF8= 500.13
##$BYTORDA= 1
##$CFDGTYP= 0
##$CFRGTYP= 5
##$CHEMSTR= <none>
##$CNST= (0..31)
1 1 145 1 1 1 1 1 1 1 1 1 1 1 1 1 1 1 1 1 1 1 1 1 1 1 1 1 1 1 1 1 
##$CPDPRG= <>
##$CPDPRG1= <>
##$CPDPRG2= <>
##$CPDPRG3= <>
##$CPDPRG4= <mlev>
##$CPDPRG5= <mlev>
##$CPDPRG6= <mlev>
##$CPDPRG7= <mlev>
##$CPDPRG8= <mlev>
##$CPDPRGB= <>
##$CPDPRGT= <>
##$D= (0..31)
0 1 0 0 0 0 0 0 0 0.06 0 0 0 0 0 0 0.0002 0 0 0 0 0 0 0 0 0 0 0 0 0 0 
0 
##$DATE= 1154955991
##$DBL= (0..7)
120 120 120 120 120 120 120 120 
##$DBP= (0..7)
150 150 150 150 150 150 150 150 
##$DBP07= 0
##$DBPNAM0= <>
##$DBPNAM1= <>
$$ [...]
##$SUBNAM7= <"">
##$SUBNAM8= <"">
##$SUBNAM9= <"">
##$SW= 20.6930455092707
##$SWIBOX= (0..15)
0 0 3 0 0 0 0 0 0 0 0 0 0 0 0 0 
##$SW_h= 5175.983436853
##$TD= 65536
##$TD0= 1
##$TE= 295.16
##$TE2= 300
##$TE3= 300
##$TEG= 300
##$TL= (0..7)
0 120 120 120 120 120 120 120 
##$TP= (0..7)
150 150 150 150 150 150 150 150 
##$TP07= 0
##$TPNAME0= <>
##$TPNAME1= <>
##$TPNAME2= <>
##$TPNAME3= <>
##$TPNAME4= <>
##$TPNAME5= <>
##$TPNAME6= <>
##$TPNAME7= <>
##$TPOAL= (0..7)
0.5 0.5 0.5 0.5 0.5 0.5 0.5 0.5 
##$TPOFFS= (0..7)
0 0 0 0 0 0 0 0 
##$TUNHIN= 0
##$TUNHOUT= 0
##$TUNXOUT= 0
##$USERA1= <user>
##$USERA2= <user>
##$USERA3= <user>
##$USERA4= <user>
##$USERA5= <user>
##$V9= 5
##$VALIST= <valist>
##$VCLIST= <CCCCCCCCCCCCCCC>
##$VD= 0
##$VDLIST= <DDDDDDDDDDDDDDD>
##$VPLIST= <PPPPPPPPPPPPPPP>
##$VTLIST= <TTTTTTTTTTTTTTT>
##$WBST= 1024
##$WBSW= 4
##$XGAIN= (0..3)
0 0 0 0 
##$XL= 0
##$YL= 0
##$YMAX_a= 574706
##$YMIN_a= -752065
##$ZGOPTNS= <>
##$ZL1= 120
##$ZL2= 120
##$ZL3= 120
##$ZL4= 120
##$ABSF1= 16.40807
##$ABSF2= -4.285101
##$ABSG= 5
##$ABSL= 3
##$ALPHA= 0
##$AQORDER= 0
##$ASSFAC= 0
##$ASSFACI= 0
##$ASSFACX= 0
##$ASSWID= 0
##$AUNMP= <proc_1d>
##$AZFE= 0.1
##$AZFW= 0.1
##$BCFW= 0
##$BC_mod= 0
##$BYTORDP= 0
##$COROFFS= 0
##$CY= 12.5
##$DATMOD= 1
##$DC= 0
##$DFILT= <>
##$DTYPP= 0
##$F1P= 14.0000005364418
##$F2P= -0.99999901652339
##$FCOR= 0.5
##$FTSIZE= 32768
##$FT_mod= 6
##$GAMMA= 0
##$GB= 0
##$INTBC= 1
##$INTSCL= 1
##$ISEN= 128
##$LB= 0.3
##$LEV0= 0
##$LPBIN= 0
##$MAXI= 10000
##$MC2= 0
##$MEAN= 0
##$ME_mod= 0
##$MI= 0
##$NCOEF= 0
##$NC_proc= -4
##$NLEV= 6
##$NOISF1= 0
##$NOISF2= 0
##$NSP= 0
##$NTH_PI= 0
##$NZP= 0
##$OFFSET= 16.40807
##$PC= 1
##$PHC0= 149.7263
##$PHC1= 0.4146788
##$PH_mod= 1
##$PKNL= yes
##$PPARMOD= 0
##$PSCAL= 4
##$PSIGN= 0
##$REVERSE= no
##$SF= 250.130028495195
##$SI= 32768
##$SIGF1= 0
##$SIGF2= 0
##$SINO= 400
##$SIOLD= 32768
##$SREGLST= <1H.CDCl3>
##$SSB= 0
##$STSI= 32768
##$STSR= 0
##$SW_p= 5175.98343685301
##$SYMM= 0
##$S_DEV= 0
##$TDeff= 65536
##$TDoff= 0
##$TI= <Analysis number 999999
Compound Code 99
Book Reference 9
Project Code 9>
##$TILT= no
##$TM1= 0
##$TM2= 0
##$TOPLEV= 0
##$USERP1= <user>
##$USERP2= <user>
##$USERP3= <user>
##$USERP4= <user>
##$USERP5= <user>
##$WDW= 1
##$XDIM= 32768
##$YMAX_p= 446313701
##$YMIN_p= -127531
$$ End of Bruker specific parameters
$$ ---------------------------------
##NTUPLES= NMR SPECTRUM
##VAR_NAME=  FREQUENCY,     SPECTRUM/REAL,   SPECTRUM/IMAG
##SYMBOL=    X,             R,               I
##VAR_TYPE=  INDEPENDENT,   DEPENDENT,       DEPENDENT
##VAR_FORM=  AFFN,          ASDF,            ASDF
##VAR_DIM=   32768,         32768,           32768
##UNITS=     HZ,            ARBITRARY UNITS, ARBITRARY UNITS
##FACTOR=    0.157963299565203, 1,           1
##FIRST=     4104.15091924945, 0,            0
##LAST=      -1071.83251760356, 0,           0
##MIN=       -1071.83251760356, -127531,     0
##MAX=       4104.15091924945, 446313701,    0
$$ Real data points
##PAGE= N=1
##DATA TABLE= (X++(R..R)), XYDATA
$$ [...]
19439h569k740K8971P899r455J1026J2880r07o915n433R317K2179K3495n032K546
$$ -8569 -11309 17662 25561 16106 27132 40012 39105 32190 26757 36074 58253 81748 76716 79262
19425G9262k1687M049R379j0937k1136l247J5708L1797j014j9872j1262j855O874
$$ 79262 57575 61624 71003 60066 38930 35683 51391 83188 82174 62302 51040 49185 56059
19412E6059J0138l4019j1191J3866J1481j843J5220l936j2406o11q629k2982k1342
$$ 56059 66197 32178 20987 34853 46334 44491 59711 55775 43369 42758 34129 11147 -10195
19399a0195r94J7937L1008L23p197L90P527o771J6629M83l5740j2764K5024j1595
$$ -10195 -11189 6748 37756 38079 30882 31272 38799 32028 48657 49140 13400 636 25660 14065
19385A4065l4518j1208K0799L2889L9406j081k6926j2130l327l844Q513J4605
$$ 14065 -20453 -31661 -10862 22027 61433 60352 33426 21296 17969 14125 22638 37243
19373C7243J8J250k6768j5462J0382J4340J4199M694J9136M090q849j3901r744
$$ 37243 37261 38511 11743 -3719 6663 21003 35202 39896 59032 63122 54273 40372 30628
19360C0628M165q922J0573j5367J0320J6853J3753k924l1848P644k649p407J905
$$ 30628 34793 25871 36444 21077 31397 48250 62003 59079 27231 34875 32226 24819 26724
19347B6724M115O388J0327j8073k9078j9378J2908j5811K6374J2167L454k0140
$$ 26724 30839 37227 47554 29481 403 -18975 -6067 -21878 4496 16663 20117 -23
19335b3r138J0431l0077J6130K7719q10J7360j861l3634j1195K9656L202j5736
$$ -23 -9161 1270 -28807 -12677 15042 14232 31592 29731 -3903 -15098 14558 17760 2024
19322B024O895R525J5308P542L9326j5386Q377L320j6323k1231j0111j8652j5484
$$ 2024 8919 18444 33752 41294 80620 65234 73611 76931 60608 39377 29266 10614 -4870
19309d870K3776J4951M1736Q38l7991k8817J7822J1394j7344j2475K4763K3451
$$ -4870 18906 33857 75593 76431 38440 9623 27445 38839 21495 9020 33783 57234
19297E7234J7756n632l253j6895m221n975m163M045K379J2982J1613j549M95O805
$$ 57234 74990 69358 66105 49210 44989 39014 34851 38896 41275 54257 65870 64321 64816 71621
19283G1621P88K5723p040m700J978J2004J6014q600Q233L1602m551m8894l6886
$$ 71621 72409 98132 91092 86392 88370 100374 116388 107788 116021 147623 143072 94178 57292
19270E7292M2196K0465j3429P524j882k0505k4749k3409l1370j2606P416R582
$$ 57292 99488 119953 106524 114048 112166 91661 66912 43503 12133 -473 6943 16525
19258A6525K427j7218n094J3081P302k901N272J6594J8446j386J882O735j4837
$$ 16525 18952 1734 -3360 9721 17023 14122 19394 35988 54434 53048 54930 61665 46828
19245D6828n384J7475K4357j3521j1188N372J9851j259j1339Q12J4533k0613R845
$$ 46828 41444 58919 83276 69755 58567 63939 83790 82531 71192 72004 86537 65924 75769
19232G5769K9374O220m632l530l3976k3102J1847n259J0470J7731j9219j1934
$$ 75769 105143 111363 106731 103201 69225 46123 57970 52711 63181 80912 61693 49759
19220D9759k270J002k6034j3919N51j3166j3049J7694K9168p294L086K1570L0319
$$ 49759 47489 48491 22457 8538 9089 -4077 -17126 568 29736 22442 25528 47098 77417
19207G7417J0867J4782J8439j8743k2860K997K6393J4479j3926l3726J2238O079
$$ 77417 88284 103066 121505 102762 79902 82899 109292 123771 109845 76119 88357 94436
19195I4436j0543j1166N019n831k5724j4980oj9426R765M901J5118J0469J090
$$ 94436 83893 72727 77746 71915 46191 31211 31205 11779 21544 26445 41563 52032 53122
19182E3122j6873j6274J6923J1520J0491j1443k2343j2936J8518J7192L768R274
$$ 53122 36249 19975 36898 48418 58909 47466 25123 12187 30705 47897 51665 60939
19170F0939K2534J6466R138M910O784k4159K099q593n259J915K784P913n446j9873
$$ 60939 83473 99939 109077 113987 120771 96612 98711 90118 84859 86774 89558 97471 92025 72152
19156G2152K0103J6032m940j9829L919N182R695J5245j1527j3590Q885k0909r103
$$ 72152 92255 108287 103347 83518 87437 92619 102314 117559 106032 92442 101327 80418 71315
19143G1315P075j2668j5248k4886j1022J7641Q455L3161J4869n272j9400L864
$$ 71315 78390 65722 50474 25588 14566 32207 40662 73823 88692 83420 64020 67884
19131F7884K648k2049q351j7826Q353Q510L063J6850K8751j0392k6514m15K8687
$$ 67884 70532 48483 40132 22306 30659 39169 42232 59082 87833 77441 50927 50512 79199
19118G9199M1642Q097K1742k5408m0240j9463Q082J4876n105J825m522J3672K802
$$ 79199 120841 128938 150680 125272 85032 65569 73651 88527 83422 85247 80725 94397 97199
19105I7199r952k3960J8204m934n463K0866L609R139K701k3903N520n15o464j0762
$$ 97199 87247 63287 81491 76557 71094 91960 95569 104708 107409 83506 89026 88511 82047 71285
19091G1285J8231r123j8872k2387J5928K8234K6170J0227j564o126m0637k5424
$$ 71285 89516 80393 61521 39134 55062 83296 109466 119693 118129 112003 71366 45942
19079D5942Q627K2817R540j1952k550j3537o345L2748O774r527P418Q001L0348
$$ 45942 54569 77386 86926 74974 72424 58887 52542 85290 92064 82537 89955 97956 128304
19066A28304O505j6784j426J8977k2607r23N620K4852K3074O73Q193Q098P667
$$ 128304 134809 118025 116599 135576 112969 112046 117666 142518 165592 166265 174458 182556 190223
19053A90223m2896o610J3538J201m138J5884O430R777j9451j3000j720j8921J042
$$ 190223 147327 140717 154255 155456 151318 167202 173632 183409 163958 150958 149238 130317 131359
19040A31359K9000L1778L3189k4297O985j2399q779j6804P705J2189q817N025
$$ 131359 160359 192137 225326 201029 208014 195615 186836 170032 177737 189926 181109 186134
19028A86134j4557q781Q45R654R267j4381J3344N868K770J6896n18m401J8200
$$ 186134 171577 162796 163641 173295 182562 168181 181525 187393 190163 207059 206541 202140 220340
19015B20340K7339J5962M923O149K7224K9109J8588L2483K9978L9908j1623j5528
$$ 220340 247679 263641 268564 274713 301937 331046 349634 382117 412095 452003 440380 424852
19003D24852j5445k0293j3989l0522k3858j2665r904k253L264j0290K5482J6889
$$ 424852 409407 389114 375125 344603 320745 308080 298176 295923 299187 288897 314379 331268
18991C31268J7989J6813j1798j6453K0396K0117j0497J2430L5229K932j1085j2415
$$ 331268 349257 366070 354272 337819 358215 378332 367835 380265 415494 418426 407341 394926
18979C94926m199J7106K6116R124K0962R153j9663k9018m912j030l0509j4165
$$ 394926 390727 407833 433949 443073 464035 473188 453525 424507 419595 418565 388056 373891
18967C73891l151j8298l0466j5206j522J6608J6614j159l2049J0064L1884M236
$$ 373891 370740 352442 321976 306770 305248 321856 338470 337311 305262 315326 347210 351446
18955C51446N457j1664K1218K6337L9117J7060j6158k2996Q025K672k4344k7167
$$ 351446 356903 345239 366457 392794 431911 448971 432813 409817 417842 420514 396170 369003
18943C69003j6109k1332l4883m2845m66R314j4208J1065R364P427k5680r930J1654
$$ 369003 352894 331562 296679 253834 253368 262682 248474 259539 268903 276330 250650 240720 252374
18930B52374J5518j0825l171J6070J7245l780j2840m362p373j6745n277J4265
$$ 252374 267892 257067 253896 269966 287211 283431 270591 266229 258856 242111 236834 251099
18918B51099Q324j2543M0584N9646O1528J1538P093o102N536L6630L390j1994
$$ 251099 259423 246880 287464 347110 408638 420176 427269 421167 426703 463333 466723 454729
18906D54729j5225k0366J1306j4372n2696j9785K1121J8696j6791j7194k1344
$$ 454729 439504 419138 430444 416072 363376 343591 364712 383408 366617 349423 328079
18895C28079K453K002q022Q986o958n270j4060k2247J7755L9014J8976J8044j7733
$$ 328079 330532 332534 324512 333498 326540 321270 307210 284963 302718 341732 360708 378752 361019
18882C61019J7201J0961j1797L0600J5924J094l380P159l597j4676p858R717P047
$$ 361019 378220 389181 377384 407984 423908 425002 421622 428781 425184 410508 402650 412367 419414
18869D19414j7250k0848m141j3754m500k3924l7146J236M250K0647K6175L7429
$$ 419414 402164 381316 377175 363421 358921 334997 297851 299087 303337 323984 350159 387588
18857C87588M6186K1698J8173K7390K9169J0026j6972n0083m7761j1757l2493
$$ 387588 433774 455472 473645 501035 530204 540230 523258 473175 425414 413657 381164
18846C81164l4672k6950j8355P23Q268J1752P92Q396R628Q681J1601L3609J4650
$$ 381164 346492 319542 301187 301910 310178 321930 322722 331118 340746 349427 361028 394637 409287
18833D09287j2593j2190R158R737K4525K3588P005J3193J5859l145l672Q251K634
$$ 409287 396694 384504 393662 403399 427924 451512 458517 471710 487569 484424 480752 489003 491637
18820D91637l0671j9126j6413k4456p439l03K3188M183o392j117j0094m7573m1263
$$ 491637 460966 441840 425427 400971 393532 393229 416417 420600 414208 413091 402997 355424 314161
18807C14161k3253J6268L3176K6773L6227N4560J7545J3149L048L812M1647K2169
$$ 314161 290908 307176 340352 367125 403352 457912 475457 488606 491654 495466 537113 559282
18795E59282L21k350M0733L8931N1889M1522O2170O4763J4236L0449J3439k8569
$$ 559282 559603 557253 597986 636917 688806 730328 792498 857261 871497 901946 915385 886816
18783H86816j6980K5608K6914M259L4962L5755K2008l2832l9179k6834k5922l5301
$$ 886816 869836 895444 922358 926617 961579 997334 1019342 986510 947331 920497 894575 859274
18771H59274n7213l6730j5399j4853k756Q785K2806K496l2631m345M548l6395
$$ 859274 802061 765331 749932 735079 732323 741108 763914 766410 733779 729434 733982 697587
18759F97587j9851j5157r398k0365J6745L3218L3632k7672J8145q97j1594L603
$$ 697587 677736 662579 653181 632816 649561 682779 716411 688739 706884 705987 694393 697996
18747F97996N8301M6427O7096R0158Q3871M2776L3220K0486j2691p1400k4254
$$ 697996 756297 802724 869820 959978 1043849 1086625 1119845 1140331 1127640 1056240 1031986
18736A031986k8777L992J5123K7489O616q165j0285M423o5760p4212n4983o1340
$$ 1031986 1003209 1007201 1022324 1049813 1056429 1048264 1037979 1042402 976642 902430 847447 786107
18724G86107l3402j7584j8968l7206j6694J2373q605l2995k1158k6627l0284j1377
$$ 786107 752705 735121 716153 678947 662253 674626 666021 633026 611868 585241 554957 543580
18712E43580n622k4835K3145Q604K1864l4175l6704o839J2183J752N0726L0687
$$ 543580 537958 513123 536268 544872 566736 532561 495857 489018 501201 502953 553679 584366
18700E84366K4077K4199r002K8459P795n784l854M26j0209k4157m584K699l590
$$ 584366 608443 632642 623640 652099 659894 654110 650256 650682 640473 616316 611732 614431 610841
18687F10841J1835l4213k2222P278j5774k7616k3878L943Q638m0930j2690k2634
$$ 610841 622676 588463 566241 573519 557745 530129 506251 510194 518832 477902 465212 442578
18675D42578j7867o38j8228k7563j9962K014l128j3687o432K4377J5046j4092
$$ 442578 424711 424073 405845 378282 358320 360334 357206 343519 337087 361464 376510 362418
18663C62418N495j5191M856K6097j050j9248j7244J4185K6544j1725k1514J2704
$$ 362418 367913 352722 357578 383675 382625 363377 346133 360318 386862 375137 353623 366327
18651C66327l772o144K2708P811o032k2869L7067K4400J3817k6434P362N056n230
$$ 366327 362555 356411 379119 386930 380898 358029 395096 419496 433313 406879 414241 419297 414067
18638D14067J1888L1750J195J3692m468J41J0902K257j3042n1276k8549J4522
$$ 414067 425955 457705 458900 472592 468124 468265 479167 481424 468382 417106 388557 403079
18626D03079K2679q365o870J5699L0219L1115J2981l9341k343L2226Q261K296
$$ 403079 425758 417393 410523 426222 456441 487556 500537 461196 458853 491079 499340 501636
18614E01636L2579J3365M915O427J3662n539j108J841l831j513m976J3479J4857
$$ 501636 534215 547580 552495 558922 572584 567045 565937 567778 563947 562434 557458 570937 585794
18601E85794M65N08k5784j0724j2209K921K4642L2190K7609k4040k5661K751K8063
$$ 585794 586259 586767 560983 550259 538050 540971 565613 597803 625412 601372 575711 578462 606525
18588F06525K72P01K0985J0218J1229K122L8976p534q362l283J6304M5178L120
$$ 606525 606797 607498 628483 638701 649930 652052 691028 683494 675132 671849 688153 733331 736451
18575G36451j3518j1554L0187J4823J6075K267l9253K107K3919j886j6055O119
$$ 736451 722933 711379 741566 756389 772464 774731 735478 737585 761504 759618 743563 749682
18563G49682J9287J4792L3307J6039Q975J2075J4275L6956K443J1817M8710O8633
$$ 749682 768969 783761 817068 833107 842082 854157 868432 905388 907831 919648 968358 1036991
18551A036991M8359M5260P6675J07657Q2586Q2441J01870Q6745J08283J38923
$$ 1036991 1085350 1130610 1207285 1314942 1397528 1479969 1581839 1668584 1776867 1915790
18541A915790J85985K42577L18003M03842M84985M58299M17245L61373K58900
$$ 1915790 2101775 2344352 2662355 3066197 3551182 4009481 4426726 4788099 5046999
18532E046999J68946L6288j14800k33940k78487j96355j16060o4505m176M1922
$$ 5046999 5215945 5252233 5137433 4903493 4625006 4428651 4312591 4248086 4243910 4285832
18522D285832J45268K66750M03684N61066Q15102J193546J616940K069857K548747
$$ 4285832 4431100 4697850 5101534 5662600 6477702 7671248 9288188 11358045 13906792
18513A3906792L057924L484685L733710L658488L292123K781177K012232Q74087
$$ 13906792 16964716 20449401 24183111 27841599 31133722 33914899 35927131 36801218
18505C6801218k94325j263850k023225k575064k966661k996019k608474k080573
$$ 36801218 36506893 35243043 33219818 30644754 27678093 24682074 22073600 19993027
18497A9993027j469153p03926J69891J150771K115892K897564L460844L752963
$$ 19993027 18523874 17819948 17989839 19140610 21256502 24154066 27614910 31367873
18489C1367873L727548L275056K716625K134228J631829J292178J053501R06093
$$ 31367873 35095421 38370477 41087102 43221330 44853159 46145337 47198838 48104931
18481D8104931Q55599O05700L7499p09587j561361k303754k922972l222933k895687
$$ 48104931 48960530 49566230 49603729 48894142 47332781 45029027 42106055 38883122 35987435
18472C5987435k113863j174756l19263L56285Q20923R85399P38842M90070L32586
$$ 35987435 33873572 32698816 32379553 32735838 33556761 34542160 35281002 35771072 36103658
18463C6103658J22846j38544l58574j14857M99698J239434K126444L096097M007276
$$ 36103658 36226504 36087960 35729386 35614529 36114227 37353661 39480105 42576202 46583478
18454D6583478M660802M766953M477821L890793K746528R83615r47908k586081
$$ 46583478 51244280 56011233 60489054 64379847 67126375 68109990 67162082 64576001
18446F4576001l917645n044050n853102o074621n677166m946257m139743l321716
$$ 64576001 60658356 55614306 49761204 43686583 38009417 33063160 28923417 25601701
18438B5601701k479407j745845j191792o90254l22879j00286P9335J93552K90551
$$ 25601701 23122294 21376449 20184657 19494403 19171524 19071238 19150573 19344125 19634676
18429A9634676L59932M02847M54926N38956O70013R57593J468092K108554K670479
$$ 19634676 19994608 20397455 20852381 21391337 22061350 23018943 24487035 26595589 29266068
18420B9266068K963496L024554K825108K265848J230814j56212j452194k481947
$$ 29266068 32229564 35254118 38079226 40345074 41575888 41419676 39967482 37485535
18412C7485535l208055l542864l533323l140094k405084j500486o21134K02956
$$ 37485535 34277480 30734616 27201293 24061199 21656115 20155629 19534495 19737451
18404A9737451Q74174J451170J829979K016806K020408J722956J299886Q87515
$$ 19737451 20611625 22062795 23892774 25909580 27929988 29652944 30952830 31840345
18396C1840345M68596L32595N82594J321959K068348K008391J391225J427206
$$ 31840345 32308941 32641536 33224130 34546089 36614437 38622828 40014053 41441259
18388D1441259K084909K222501J569641J113578J916170K841404K585169J416729
$$ 41441259 43526168 45748669 47318310 48431888 50348058 53189462 55774631 57191360
18380E7191360K18823q33359k442069m507020n998840o168719n191804l755810
$$ 57191360 57410183 56576824 54134755 49627735 43628895 37460176 32268372 28512562
18372B8512562k506989j465893n36480M17474J464058K694810M194175N867873
$$ 28512562 26005573 24539680 24003200 24420674 25884732 28579542 32773717 38641590
18364C8641590P455909Q549536Q938739Q475843P237626N102751K163978j260144
$$ 38641590 46097499 54647035 63585774 72061617 79299243 84401994 86565972 85305828
18356H5305828m475621o855956q281581q881262q671719p765370o402918m844093
$$ 85305828 80830207 73974251 65692670 56811408 48139689 40374319 33971401 29127308
18348B9127308l474412k356991j544563r51315o23937k81691P0305M22031O69219
$$ 29127308 25652896 23295905 21751342 20800027 20176090 19894399 19964704 20386735 21055954
18339B1055954P51630P88423P24802O45924O45529O01158N78895N46528K32207
$$ 21055954 21807584 22596007 23320809 23966733 24612262 25213420 25792315 26338843 26571050
18330B6571050j49967k4443N32922J042702J195998J138890J146860J027267Q35049
$$ 26571050 26421083 26396640 26929562 27972264 29168262 30307152 31454012 32481279 33316328
18321C3316328O80567L82169j74236q10994j172574j112972q41628m33630n5526
$$ 33316328 33996895 34379064 34204828 33393834 32221260 31108288 30266660 29833030 29777504
18312B9777504j478j45953j30940R7979L53883Q77684J495798J965158K342855
$$ 29777504 29776026 29630073 29499133 29597112 29950995 30828679 32324477 34289635 36632490
18303C6632490L207520N222759Q873264J4420481K1382511K7007005K7051126
$$ 36632490 39840010 45062769 53936033 68356514 89739025 116746030 143797156
18296A43797156K2835104K1255945K0566833J4504367M86636j3768721j9689578
$$ 143797156 166632260 187888205 208455038 222959405 223446041 209677320 189987742
18289A89987742j9905683j9881391k0949096j9914171j5404074r154536l897635
$$ 189987742 170082059 150200668 129251572 109337401 93933327 84778791 80881156
18282H0881156q08185J009720L047221M878471N014995L209059J107405Q13708
$$ 80881156 80072971 81082691 84129912 89008383 94023378 97232437 98339842 99153550
18274I9153550K023305L115236L289041K761883J905811J349426J634589K130111
$$ 99153550 101176855 104292091 107581132 110343015 112248826 113598252 115232841 117362952
18266A17362952J788563P58648k03053j256568k596425k638280r18262J87723
$$ 117362952 119151515 119910163 119707110 118450542 115854117 113215837 112297575 112485298
18258A12485298q23724k452943j550726K233622O693010J0225390J2055791J0902332
$$ 112485298 111661574 109208631 107657905 109891527 116584537 126809927 138865718 149768050
18250A49768050N589048Q46205j5419j87386k566842o568270o000996L96929P883756
$$ 149768050 155357098 156203303 156187884 156000498 153433656 146865386 140864390 141261319 149145075
18241A49145075J2702879J3837033J4091216J2547359O063630k846692q903444
$$ 149145075 161847954 175684987 189776203 202323562 208387192 205540500 196637056
18234A96637056j3069533j8248801k4463892k6368354k1294312j3988366q405140
$$ 196637056 183567523 165318722 140854830 114486476 93192164 79203798 70798658
18227G0798658n071076l552788l100653k671070k238577k275332k773807l167365
$$ 70798658 65727582 62174794 59074141 56403071 54164494 51889162 49115355 45947990
18219D5947990k783178j942122j294812r13850o27333j30838O50170J653790K730400
$$ 45947990 43164812 41222690 39927878 39014028 38386695 38255857 38906027 40559817 43290217
18210D3290217L678516L762791K679106J633082J348130R14656k15488j401604
$$ 43290217 46968733 50731524 53410630 55043712 56391842 57306498 57091010 55689406
18202E5689406j065014P64333K366162L516771O079216R604709J1739317J0588990
$$ 55689406 54624392 55388725 57754887 61271658 67350874 76955583 88694900 99283890
18194I9283890P279751L794182M98370j796084n422880j0296417j4460056j5533252
$$ 99283890 106563641 110357823 110856193 109060109 103637229 93340812 78880756 63347504
18186F3347504j2518677q383435n321874l346065k032545j000913k92230j46523
$$ 63347504 50828827 42445392 37123518 33777453 31744908 30743995 30451765 30305242
18178C0305242m57289p28355p79406r48398j482675k107286k313765k074156j606544
$$ 30305242 29847953 29119598 28340192 27391794 25909119 23801833 21488068 19413912 17807368
18169A7807368j213118r67903p54440o08494n28231m45524m06510l52027l86502
$$ 17807368 16594250 15626347 14871907 14263413 13735182 13289658 12883148 12531121 12144619
18160A2144619m21687m32806m30988m51628m36870m46723m05839l64182l32772
$$ 12144619 11722932 11290126 10859138 10407510 9970640 9523917 9118078 8753896 8421124
18151H421124l13710l05345k54088k13670k05211k17654k09989j98439j75629
$$ 8421124 8107414 7802069 7547981 7334311 7129100 6911446 6701457 6503018 6327389
18142F327389j63219j67898j71265j62087j73800j79781j54036j52804j31063
$$ 6327389 6164170 5996272 5825007 5662920 5489120 5309339 5155303 5002499 4871436
18133D871436j20760j19373r2043r3953p8731r4495j00463m5554n8344l0223n2492
$$ 4871436 4750676 4631303 4539260 4445307 4366576 4272081 4171618 4126064 4067720 4037497 3985005
18122C985005o1052m5015L1708O0405Q2107J27783J45357K20208L21644M01647
$$ 3985005 3923953 3878938 3910646 3971051 4053158 4180941 4326298 4546506 4868150 5269797
18112E269797N51558R23846J558131K674168M287267N516680M367883J238353
$$ 5269797 5821355 6745201 8303332 10977500 15264767 20781447 25149330 26387683
18104B6387683O04318J181152J36563l121563o153813n542163l370833j890638
$$ 26387683 26992001 28173153 28309716 25188153 19034340 13492177 10121344 8230706
18096H230706j161889p96960n37176l19234k90323k55184k49190j71837j07914
$$ 8230706 7068817 6271857 5734681 5415447 5125124 4869940 4620750 4448913 4340999
18087D340999j28107j22538j19389j19182j00487j02523r7883j26804j57859j64185
$$ 4340999 4212892 4090354 3970965 3851783 3751296 3648773 3550890 3424086 3266227 3102042
18077C102042j42428j19880n8893p6747m6592n8013n9645j3586k9349l7968k5680
$$ 3102042 2959614 2839734 2780841 2704094 2657502 2599489 2539844 2526258 2496909 2458941 2433261
18066B433261m0248j5860l434J116J8393J6535p195j6894m4310o5615n1852n9460
$$ 2433261 2393013 2377153 2373719 2374835 2393228 2409763 2402568 2385674 2341364 2275749 2223897 2164437
18054B164437n4604k9905j0279Q105j5177k4366M684J1452J0634K0746J990k7868
$$ 2164437 2109833 2079928 2069649 2077754 2062577 2038211 2042895 2054347 2064981 2085727 2087717 2059849
18042B059849K316p623J6410K520l7795j6558k5612j9375O552j8680l8267o1531
$$ 2059849 2062165 2054542 2070952 2073472 2035677 2019119 1993507 1974132 1980684 1962004 1923737 1862206
18030A862206p9288m9911k1804l3708k8241l2948l6022o5110n7527q4158j03996
$$ 1862206 1782918 1733007 1711203 1677495 1649254 1616306 1580284 1515174 1457647 1373489 1269493
18019A269493n4657j6777j3568J560l3365j6373M030L060j4305J276j9097k458
$$ 1269493 1214836 1198059 1184491 1186051 1152686 1136313 1140343 1143403 1129098 1130374 1111277 1108819
18007A108819Q25j6185J5083j5686m6O763K4099L807r346l335K2350L2139L4545
$$ 1108819 1109644 1093459 1108542 1092856 1092810 1099573 1123672 1127479 1118133 1114798 1137148 1169287 1203832
17994A203832J9047j0788m2048k5051o116o154m9227n1068m1094k5940K3406K3544
$$ 1203832 1222879 1212091 1170043 1144992 1138876 1132722 1083495 1032427 991333 965393 988799 1012343
17982A012343l5645k9626J7499J4005J0802J4012P28j5241j9695l8534j6884j9145
$$ 1012343 976698 947072 964571 978576 989378 1003390 1004118 988877 969182 930648 913764 894619
17970H94619j5747k9389j384J9j0209k0859j9028j9614n020J0290q047j7269Q660
$$ 894619 878872 849483 848099 848118 837909 817050 798022 778408 773388 783678 775631 758362 767022
17957G67022J9659j0777j0578K005P923N308J9982r908R541J98j2555K5459j4001
$$ 767022 786681 775904 765326 767331 775254 780562 800544 790636 800177 800375 787820 813279 799278
17944G99278o195J8373M4406L6466M431j512J3167K201K5471j0247K861N61J3474
$$ 799278 793083 811456 855862 892328 896759 895247 908414 910615 936086 925839 928700 929261 942735
17931I42735J096M511L9411O94j7485j4211J7156J8389J9471K0529K9775j6770
$$ 942735 943831 948342 987753 988447 970962 956751 973907 992296 1011767 1032296 1062071 1045301
17919A045301j579r417j6387N298q623k8640r619K6557K1028m497K7090O2111
$$ 1045301 1043722 1034305 1017918 1023216 1014593 985953 976334 1002891 1023919 1019422 1046512 1108623
17907A108623O0288M917l302J8604L0620q11j9637m3100n8277l9535m0608k4363
$$ 1108623 1168911 1173828 1170526 1189130 1219750 1218939 1199302 1156202 1097925 1058390 1017782 993419
17895I93419o65k9348j4232J2771M3298L8009L1068Q0077M4122M9730J5218K5779
$$ 993419 992754 963406 949174 961945 1005243 1043252 1074320 1154397 1198519 1248249 1263467 1289246
17883A289246R128K3327L2202J9678j3972J9218J1413m308K4552K0603k3500J758
$$ 1289246 1298374 1321701 1353903 1373581 1359609 1378827 1390240 1385932 1410484 1431087 1407587 1409345
17871A409345J9595J4012L649k6044j0820L0853L9221Q757k502j3119k7053K4332
$$ 1409345 1428940 1442952 1446601 1420557 1409737 1440590 1479811 1488568 1486066 1472947 1445894 1470226
17859A470226L2787l353R448K2168m308J1632M7739N2912N6992N0521J1484Q498
$$ 1470226 1503013 1499660 1509108 1531276 1526968 1538600 1586339 1639251 1696243 1746764 1758248 1766746
17847A766746J0972l832J1662L9296R589k0228q815K1767K7115O6361Q7072Q6524
$$ 1766746 1777718 1773886 1785548 1824844 1834433 1814205 1805390 1827157 1854272 1920633 2007705 2094229
17835B094229N3741R3542J01774Q4796J03922J15501J29867J47086J89511K12273
$$ 2094229 2147970 2241512 2343286 2428082 2532004 2647505 2777372 2924458 3113969 3326242
17825C326242K92690K99099K91109L39789L98618M74403N73817O92070R21911
$$ 3326242 3618932 3918031 4209140 4548929 4947547 5421950 5995767 6687837 7609748
17816G609748J220829J658574K093836K410610K489036K499967K678011K506847
$$ 7609748 8830577 10489151 12582987 14993597 17482633 19982600 22660611 25167458
17808B5167458J918531J269578J268691J986826L152020M785114O734351Q122817
$$ 25167458 27085989 28355567 29624258 31611084 34763104 39548218 46282569 54405386
17800E4405386Q500682Q670840R103473R936789J1343592J3270411J4594206J3219433
$$ 54405386 62906068 71576908 80680381 90617170 101960762 115231173 129825379 143044812
17792A43044812R183987N787776M540511K374737l738027j2017243j6967514j5785475
$$ 143044812 152228799 158016575 162557086 164931823 161193796 149176553 132209039 116423564
17784A16423564j1170667p114947m555624k164723O86459K517940J946005J206697
$$ 116423564 105252897 98137950 93582326 91417603 92104062 94622002 96568007 97774704
17776I7774704J894067J789376j470620o596776q663759p086233n354085n147312
$$ 97774704 99668771 101458147 99987527 93390751 84726992 77640759 72286674 67139362
17768F7139362n191286m146041l018136l036639l419190k865295j905245j254638
$$ 67139362 61948076 57802035 54783899 51747260 48328070 45462775 43557530 42302892
17760D2302892q59144j53733J023775K027942K431565K799435L608708M713280
$$ 42302892 41443748 41290015 42313790 44341732 46773297 49572732 53181440 57894720
17752E7894720N358198M902448L594835K856760L566489N074399O473400P509277
$$ 57894720 63252918 68155366 71750201 74606961 78173450 83247849 89721249 97230526
17744I7230526P967428P401228O490200O825194Q237678Q838613P115235L438094
$$ 97230526 105197954 112599182 119089382 125914576 134152254 142990867 150106102 153544196
17736A53544196n14097k590979j402413j40310k842111q322983j0633899p030088
$$ 153544196 153030099 150439120 149036707 148896397 146054286 137731303 127097404 120067316
17728A20067316k138830r59018k660026l211626k260161k715730n756277q898948
$$ 120067316 117928486 116969468 114309442 111097816 108837655 106121925 100365648 91466700
17720I1466700r321626p598170n925162n371642n387811n271417n198375n078125
$$ 91466700 82145074 74546904 68621742 63250100 57862289 52590872 47392497 42314372
17712D2314372m647870l864837k952699k261214j775784j475922j271399j107739
$$ 42314372 37666502 33801665 30848966 28587752 26811968 25336046 24064647 22956908
17704B2956908r30545q11482o95115o60989n98019n02054m42778m18506l54355
$$ 22956908 22026363 21214881 20519766 19858777 19260758 18758704 18315926 17897420 17543065
17695A7543065k31076p6370J81271N47249J077546J867712K605673K604023J726621
$$ 17543065 17311989 17235619 17416890 17964139 19041685 20909397 23515070 26119093 27845714
17686B7845714J370438J890353K388045K318316J772698J012831q8402l04439
$$ 27845714 29216152 31106505 33494550 35812866 37585564 38598395 38509993 38205554
17678C8205554L24809J90630j262636l071243l627469l165896k300874j502648
$$ 38205554 38530363 38720993 37458357 34387114 30759645 27593749 25292875 23790227
17670B3790227j393079j995231k670676k611862j973020j368685r63216p09327
$$ 23790227 22397148 20401917 17731241 15119379 13146359 11777674 10814458 10105131
17662A0105131n80390m82861m36538l65065l34724k86359k71148k61933k38267
$$ 10105131 9524741 9041880 8605342 8240277 7905553 7619194 7348046 7086113 6847846
17653F847846k04503k37762k54635k39053k44110k14560j73876j81318j68142
$$ 6847846 6643343 6405581 6150946 5911893 5667783 5453223 5279347 5098029 4929887
17644D929887j69449j37182j55451j62906j42510j24613j46027j24790j10298
$$ 4929887 4760438 4623256 4467805 4304899 4162389 4037776 3891749 3766959 3656661
17635C656661j13248j41770j02282j22114j16883p3882o0377p6615o5298k2999
$$ 3656661 3543413 3401643 3299361 3177247 3060364 2986482 2926105 2849490 2784192 2761193
17625B761193m8337r5231q2191m7748n3408m9078k7652o0379o2449n6038n8497
$$ 2761193 2712856 2617625 2535434 2487686 2434278 2385200 2357548 2297169 2234720 2178682 2120185
17614B120185m4625l0784l0559n4415j32518j13985n9650m4653k7265n1666q7958
$$ 2120185 2075560 2044776 2014217 1959802 1827284 1713299 1653649 1608996 1581731 1530065 1442107
17603A442107n9155l5969m2535o7465l4095R093M517n213J4732l1488l1761n6673
$$ 1442107 1382952 1346983 1304448 1236983 1202888 1211981 1216498 1211285 1226017 1194529 1162768 1106095
17591A106095l1908j3962J877j9084m6792k2177q088o74K088P144l5561k7152
$$ 1106095 1074187 1060225 1062102 1043018 996226 974049 965961 965287 967375 974519 938958 911806
17579I11806k9062N100R335N0Q778j2520p774K636k929K852k2846k7097l6606
$$ 911806 882744 887844 897179 897229 906007 893487 885713 888349 885420 888272 865426 838329 801723
17566H01723j3363o604j8212l1776n0036k4048M033j4545J4684j5391l2786k6231
$$ 801723 788360 781756 763544 731768 681732 657684 661717 647172 661856 646465 613679 587448
17554E87448j8203k5336q118J7564N908k6158j5219k2414k7495k9419j4087K39
$$ 587448 569245 543909 535791 553355 559263 533105 517886 495472 467977 438558 424471 424710
17542D24710j2692o066r472J4334K2391n767j9672o20J3462J153l6752j9673k7753
$$ 424710 412018 405952 396480 410814 433205 427438 407766 407146 420608 421761 385009 365336 337583
17529C37583k3855K7656L9897m41j7671j0644Q372k1164M984J9356P72j9021j7712
$$ 337583 313728 341384 381281 380840 363169 352525 360897 339733 344717 364073 364845 345824 328112
17516C28112q352Q158K3377m611n598O238Q125j5249j5460J196k458P657M950
$$ 328112 319760 327918 351295 346684 341086 347324 355449 340200 324740 325936 323478 331135 336085
17503C36085j6645q916N534k591J943M32K2655O86j8891j54k568j7710l348K0218
$$ 336085 319440 310524 316058 313467 315410 315842 338497 339183 320292 320138 317570 299860 296512 316730
17489C16730R910q289N166m871j5457R773K066L4710J8468j7162K2993r39l136
$$ 316730 326640 318351 323517 318646 303189 312962 315028 349738 368206 351044 374037 373098 369962
17476C69962k256j7544J5336M09K4726L7710M1676J687L4445O5305M4200P060
$$ 369962 367706 350162 365498 365907 390633 428343 470019 471706 506151 571456 615656 622716
17464F22716P936l6812j2789q20R803q273m0443n3016m6540J3212J8679p717m8724
$$ 622716 630652 593840 581051 580231 590034 581761 541318 488302 441762 454974 473653 465936 417212
17451D17212k579N695l8349j2707J3518m678q561J9335j4479p634q213j1044j6173
$$ 417212 414633 420328 381979 369272 382790 378112 369551 388886 374407 366773 358560 347516 331343
17438C31343K1194Q897p716k0581l080q919r694k6974J1912J3715J6351J3117
$$ 331343 352537 361434 353718 333137 330057 321138 311444 284470 296382 310097 326448 339565
17426C39565P753J0146L9892L1023j0839J3404P748M427j1400p487L0153Q110
$$ 339565 347318 357464 397356 428379 417540 430944 438692 443119 431719 424232 454385 462495
17414D62495J3282K1636L4763L2338m08l7116m3355m0870l0419L632l0217m7705
$$ 462495 475777 497413 532176 564514 564106 526990 483635 442765 412346 415978 385761 338056
17402C38056o1382n4380k0543Q537j348l3319n544N075j4354j3509p872o301n047
$$ 338056 276674 222294 201751 210288 208940 175621 170077 175152 160798 147289 139417 133116 128069
17389A28069k164k728K3630j589K2833M045J5109P935j8087j0622K1474l8462
$$ 128069 125905 123177 146807 145218 168051 172096 187205 195140 177053 166431 187905 149443
17377A49443l5052k8886m104j4663J3107J0943J2488j2666r682J6725J1392j5334
$$ 149443 114391 85505 81401 66738 79845 90788 103276 90610 80928 97653 109045 93711
17365I3711K719j8005j2635R7Q526J960J6060j4251j933P192M661J910p491j116
$$ 93711 96430 78425 65790 65887 74413 76373 92433 78182 76249 83441 88102 90012 82521 81405
17351H1405M260k0124l1489j1979J4945J0840K523o562L2003K2589O410j5390
$$ 81405 85665 65541 34052 22073 37018 47858 50381 43819 75822 98411 104821 89431
17339H9431K5994K1843M220p918N712J6522j3888k1833P717J6550M700k1420K4101
$$ 89431 115425 137268 141488 133570 139282 155804 141916 120083 127800 144350 149050 127630 151731
17326A51731K0924J2495J3571p960k194l3445k3161n334k982p94r002J6508J8117
$$ 151731 172655 185150 198721 190761 188567 155122 131961 126627 123645 122851 113849 130357 148474
17313A48474K7698K2240N089P374L3602K1478K9164K0502Q953L3146O4613N5912
$$ 148474 176172 198412 203501 210875 244477 265955 295119 315621 324574 357720 422333 478245
17301D78245R0005P2848P2473N6475L5157M2410Q5704L9301L2171r851j351k2018
$$ 478245 568250 641098 713571 770046 805203 847613 933317 972618 1004789 994938 993587 971569
17289I71569k23M018L413o564L6843l231o0063l7556o868l542j1236j9278m9859
$$ 971569 971346 975364 978777 972213 1009056 1005825 945762 908206 901338 897796 886560 867282 817423
17276H17423k7232n9761m9064m0492m7014l7279m3368k454j0802j2479J3766J8146
$$ 817423 790191 730430 681366 640874 593860 556581 513213 510759 499957 487478 501244 519390
17264E19390n856J410J1028J4060K1665K7771l163r557Q796r233j1272Q769L1364
$$ 519390 513534 514944 525972 540032 561697 589468 586305 576748 585544 576311 565039 573808 605172
17251F05172P3176N4650Q035L0784L5872O2928O1803M2662J7018K3402N77j0487
$$ 605172 678348 732998 741033 771817 807689 870617 932420 975082 992100 1015502 1016079 1005592
17239A005592l2968k6012l4742k5312n4082n6115m4378l2893P987J0915j2207
$$ 1005592 972624 946612 911870 886558 832476 776361 731983 699090 707077 717992 705785
17228G05785j5881m23K8223K5969R45m544J2514j2384K4612M8302L4103J9615
$$ 705785 689904 689481 717704 743673 744618 740074 752588 740204 764816 813118 847221 866836
17216H66836k3614n4293l0966m4773n0646j3389J5379k5660n4840p3214k4291
$$ 866836 843222 788929 757963 713190 662544 649155 664534 638874 584034 510820 486529
17205D86529j2036m3817l2827j9160n0785m9099j3513k5463j4599j7020p19j997
$$ 486529 474493 430676 397849 378689 327904 278805 265292 239829 225230 208210 207491 205494
17193B05494j4508P278J2760J5007J5410l4651l7644l6778R237K0260q288j964
$$ 205494 190986 198264 211024 226031 241441 206790 169146 132368 141605 161865 153577 151613
17181A51613Q631M228k0910o663O591o840K0797M5453J3836m659L6556K4242k3362
$$ 151613 160244 164472 143562 136899 143490 136650 157447 202900 216736 212077 248633 272875 249513
17168B49513k7241M681O595J2445K2792l048k4049l0564j6142J3378J8522j4097
$$ 249513 222272 226953 233548 245993 268785 265737 241688 211124 194982 208360 226882 212785
17156B12785k4584r020K4756p369L672M789k3162k5982J1053j0391l8951p379
$$ 212785 188201 179181 203937 196568 200240 205029 181867 155885 166938 156547 117596 110217
17144A10217L511J4579j8014k1512k958l145k1129J0427N660Q869j4436q361J5961
$$ 110217 113728 128307 110293 88781 85823 82678 61549 71976 77636 86505 72069 63708 79669
17131G9669q447l1704O846M259n840J1681L97j3153j4490n61J5483J6566j8571
$$ 79669 71222 39518 46364 50623 44783 56464 56861 43708 29218 28657 44140 60706 42135
17118D2135j0947n852k301j5311O721N9457K6260K446q243n0885k3501N017R156
$$ 42135 31188 25336 23035 7724 14445 73902 100162 102608 94365 43480 19979 24996 34152
17105C4152Q276o435j5244N801J4317j1321P224J9322l7248j7133j7678p99K5734
$$ 34152 42428 35993 20749 26550 40867 29546 36770 56092 18844 1711 -15967 -16766 8968
17092H968L0707J4717j0981N892q416J3131J2032L206J8398p708K140k2379j5246
$$ 8968 39675 54392 43411 49303 40887 54018 66050 69256 87654 79946 82086 59707 44461
17079D4461k0930L43r335k4873K144K2658K5437K2506J326j039O314N577l479
$$ 44461 23531 23874 14539 -10334 -8190 14468 39905 62411 63737 62698 69012 74589 71110
17066G1110l1881k6474J5012J0688o585Q992k26j2430J2303L606j1210n3649k0333
$$ 71110 39229 12755 27767 38455 31870 40862 40636 28206 40509 44115 32905 -20744 -41077
17053d1077o153K6214K6112j3771K2993M544l5607n505j021j2053j5252K4473
$$ -41077 -47230 -21016 5096 -8675 14318 18862 -16745 -22250 -23271 -35324 -50576 -26103
17041b6103L4478o859q72K0630O115l765N778q452j645n696l2783o150m352Q738
$$ -26103 8375 1516 644 21274 27389 23624 29402 20950 19305 13609 -19174 -25324 -29676 -20938
17027b0938J6333o264j0619K0821N453J9275m970l1287J6541K2333j6334P85n345
$$ -20938 -4605 -10869 -21488 -667 4786 24061 19091 -12196 4345 26678 10344 11129 5784
17014E784j5044k605k977l1598j0972q581J6284L7929L8435k1646k3729M1908
$$ 5784 -9260 -11865 -14842 -46440 -57412 -65993 -49709 -11780 26655 5009 -18720 23188
17002B3188J6250O837j6171l3687L077K0552J1132r717r911j4247j7952L7253
$$ 23188 39438 46275 30104 -3583 -506 20046 31178 21461 11550 -2697 -20649 16604
16990A6604K4993k56m538J3284o240j4462o597K0764J9215J7720J3058k7874k8297
$$ 16604 41597 41341 36803 50087 43847 29385 22788 43552 62767 80487 93545 65671 37374
16977C7374j460n953J761N740O875j3046k0444j4650j8329J4757j6649K2270o073
$$ 37374 35914 29961 31722 37462 44337 31291 10847 -3803 -22132 -7375 -24024 -1754 -7827
16964g827j5119o310P651L0651J4600J7941K144l0617R43k0158j2081J8847K0728
$$ -7827 -22946 -29256 -21605 9046 23646 41587 43731 13114 14057 -6101 -18182 665 21393
16951B1393j615j5534J6923j8732r963M134Q917J5845N631J7437O956j2281k2574
$$ 21393 19778 4244 21167 2435 -7528 -3394 5523 21368 26999 44436 51392 39111 16537
16938A6537J3321j0686j6332O256n917l847J3133J7671R491K53O17J3352p358
$$ 16537 29858 19172 2840 9096 3179 -668 12465 30136 39627 39880 40497 53849 46491
16925D6491k928l9288j9258J2238L396K4701J1553j3528r510n688j225m20J0159
$$ 46491 43563 4275 -14983 -2745 651 25352 36905 23377 13867 8179 6954 6534 16693
16912A6693L603J8743k7252k8701j1749o603l559K8542K0346K5730K3561J305
$$ 16693 20296 39039 11787 -16914 -28663 -35266 -38825 -10283 10063 35793 59354 60659
16900F0659l1084l3186j8483o153K40j1817o497j3825R508N315J8939J9037K1582
$$ 60659 29575 -3611 -22094 -28247 -28007 -39824 -46321 -60146 -50638 -45323 -26384 -7347 14235
16887A4235j1391p564K3876j7335j3119P828K0114O630L182n229O508K521K3410
$$ 14235 2844 -4720 19156 1821 -11298 -3470 16644 23274 26456 21227 27735 30256 53666
16874E3666J2765J4498l6694j8403k2287q385p664J5214j8747j5692K1107L58
$$ 53666 66431 80929 44235 25832 3545 -4840 -12504 2710 -16037 -31729 -10622 -10264
16862a0264k652K241m81P99K9026K20k0883L977K7338M408k5965k2531M102J8716
$$ -10264 -12916 -10675 -11156 -10357 18669 18889 -1994 1983 29321 33729 7764 -14767 -10665 8051
16848H051n49j4199k3854j9633l399q21J3664N749J7189J8482l840l282j1372
$$ 8051 7502 -6697 -30551 -50184 -53583 -54404 -40740 -34991 -17802 680 -3160 -6442 -17814
16835a7814N828L4152k0336k6796L0694M1678Q452k580j7714j2018N876K4687
$$ -17814 -11986 22166 1830 -24966 5728 47406 55858 53278 35564 23546 29422 54109
16823E4109j7443j7181j4459j2167p00r390K2211N5318o115k0377J1240P986k9677
$$ 54109 36666 19485 5026 -7141 -7841 -17231 4980 60298 54183 33806 45046 53032 23355
16810B3355J4226o25J8201j3894k4246K5156P127j9147k0545m677j7550Q314J6219
$$ 23355 37581 36956 55157 41263 17017 42173 49300 30153 9608 4931 -12619 -4305 11914
16797A1914o629N122j4553q159L0204Q990r647j1918K3848Q591j8495k0519J8499
$$ 11914 5285 10407 -4146 -12305 17899 26889 17242 5324 29172 37763 19268 -1251 17248
16784A7248r921J2561P602M71j2984j310k24l748J0111J541r204r820q536k5497
$$ 17248 7327 19888 27490 27961 14977 13667 13443 9695 19806 21347 12143 2323 -6213 -31710
16770c1710Q557K209J0197J7621m48J1397j6970o020K2319o003J1355J2212k2421
$$ -31710 -23153 -20944 -10747 6874 6426 17823 853 -5167 17152 11149 22504 34716 12295
16757A2295n614j7740k183J3509K8424P853K2666o214k4638r440k0246j2071J8415
$$ 12295 6681 -11059 -13242 267 28691 36544 59210 52996 28358 18918 -1328 -13399 5016
16744E016J3139o344n732j6457j5627K8114j8768J4890K2189j6911l483r240r116
$$ 5016 18155 11811 6079 -10378 -26005 2109 -16659 -1769 20420 3509 26 -9214 -18330
16731a8330k0190j6236J2183m406l554J4424K1124q96O502J8478M662J1731j8786
$$ -18330 -38520 -54756 -42573 -46979 -50533 -36109 -14985 -15881 -9379 9099 13761 25492 6706
16718F706k5932J4852j939O827J4909J3847L337J3393J6693m3072r248J123P309
$$ 6706 -19226 -4374 -6313 514 15423 29270 32607 46000 62693 19621 10373 11496 18805
16705A8805K350p615k9240q560J2242J6541j3400O258p892L2048Q629k0835k0852
$$ 18805 21155 13540 -15700 -24260 -12018 4523 -8877 -2619 -10511 21537 30166 9331 -11521
16692a1521P239K1199K785p654k3866j0943j1958J9815j974K1707J3553j7900
$$ -11521 -4282 16917 19702 12048 -11818 -22761 -34719 -14904 -16878 4829 18382 482
16680D82M679K739m471J4154L7307l836o586k7243k2788j7926J901j1924J6865
$$ 482 5161 7900 3429 17583 54890 51054 44468 17225 -5563 -23489 -21588 -33512 -16647
16667a6647J9026k4808K205j1056j1013J7583J6681M298j8617N026M3678K1731
$$ -16647 2379 -22429 -20224 -31280 -42293 -24710 -8029 -3731 -22348 -17322 26356 48087
16655D8087O583j8239j9837k1411P156J6995J2544j2793K0948M27l847l066j026
$$ 48087 54670 36431 16594 -4817 2339 19334 31878 19085 40033 40460 36613 33547 32521
16642C2521j4163j9199n98J0773j5037l4230K1560J9075J5717J485j5483Q540
$$ 32521 18358 -841 -1439 9334 -5703 -39933 -18373 702 16419 17904 2421 10961
16630A0961J7677Q252p244O811L902l0832j2271l248o822N734K4876l456L202
$$ 10961 28638 36890 29646 36457 40359 9527 -2744 -5992 -12814 -7080 17796 14340 17542
16617A7542K0518k7874j3986K0071k4376j1892J9487K6609J1487r774l2707q227
$$ 17542 38060 10186 -3800 16271 -8105 -19997 -510 26099 37586 27812 -4895 -13122
16605a3122R544J6770N332J0810Q242J3682P933K13j6602j7981j5914j5764L090
$$ -13122 -3578 13192 18524 29334 37576 51258 59191 59404 42802 24821 8907 -6857 -3767
16592c767J5548R775j1209J974j6242o167N026K887n775j4015K1397l829J8805
$$ -3767 11781 21556 10347 12321 -3921 -10088 -5062 -2175 -7950 -21965 -568 -4397 14408
16579A4408q97p34M646j9064j6139K6799O700j9304L842K08k0831j718K5741O599
$$ 14408 13511 12777 17423 -1641 -17780 9019 15719 -3585 257 465 -20366 -22084 3657 10256
16565A0256m1104k2596M657J7470K6619N867P469J6488l3913k2952K9125J1956
$$ 10256 -30848 -53444 -48787 -31317 -4698 1169 8638 25126 -8787 -31739 -2614 9342
16553I342j8647o3O653n718j5026J6616N729l766j0687J1997K0490L1547k5156
$$ 9342 -9305 -9368 -2715 -8433 -23459 -6843 -1114 -4880 -15567 -3570 16920 48467 23311
16540B3311k5607n145l522P141r654j2576J259J2482N552J2647J0437j2608R905
$$ 23311 -2296 -7441 -10963 -3822 -13476 -26052 -24793 -12311 -6759 5888 16325 3717 13622
16527A3622L9283J3819k3790p677k4165o869K7928j1557j0744L1955K2082M610
$$ 13622 52905 66724 42934 35257 11092 4223 32151 20594 9850 41805 63887 68497
16515F8497q946j5821l968j690n277J609J1820K5241K1667K4750k3925m9682K511
$$ 68497 59551 43730 39762 38072 32795 34404 46224 71465 93132 117882 93957 44275 46786
16502D6786J5229k9774k6010j424r8J1483j0878K0873L2553m850r071K5241k3270
$$ 46786 62015 32241 6231 4807 4709 16192 5314 26187 58740 53890 44819 70060 46790
16489D6790j3870j4183j8671j3199J4681l779j8831Q839L5933L0063J1083j4821
$$ 46790 32920 18737 66 -13133 1548 -2231 -21062 -12223 23710 53773 64856 50035
16477E0035m2771n127q687J8858J6869r16j5563j8503J4753Q462j6954m998R235
$$ 50035 7264 2137 -6550 12308 29177 28261 12698 -5805 8948 17410 456 -4542 4693
16464D693j43J2187J0423R235j3687K1183K9221k7574k0332j5183j0697j0751
$$ 4693 4550 16737 27160 36395 22708 43891 73112 45538 25206 10023 -674 -11425
16452a1425l667j0654o834M8270P131k0176m957O942J864j5335K2852j9238J9433
$$ -11425 -15092 -25746 -32580 15690 22821 2645 -2312 4630 6494 -8841 14011 -5227 14206
16439A4206K630k985R458P79l455Q72J6252k2815j8380O35O825K434j0755j0306
$$ 14206 16836 13851 23309 24088 20633 21505 37757 14942 -3438 -2803 4022 6456 -4299 -14605
16425a4605M698K4242P871J025M870R445q972o19j0532p062J0290j3290m900n190
$$ -14605 -9907 14335 22206 23231 28101 37546 28574 27955 17423 10361 20651 7361 2461 -2729
16411b729J3681m960j1375m960j3979L683L8502K7542K3871r247p762k504k9840
$$ -2729 10952 5992 -5383 -10343 -24322 -20639 17863 45405 69276 60029 52267 49763 19923
16398A9923k5348J1735K5503l6575k8262j291P99J2127O984P03j2716k2656o347
$$ 19923 -5425 6310 31813 -4762 -33024 -34315 -33516 -21389 -14405 -13702 -26418 -49074 -55421
16385e5421L3379K9141R727J296o231j9269q471O916j4105Q992K861q38R79J787
$$ -55421 -22042 7099 16826 18122 11891 -7378 -15849 -8933 -23038 -14046 -11185 -12023 -11044 -9257
16371i257P010L2685K603Jk0117k7404K964K9124P785K2509N562l4525r201j6066
$$ -9257 -2247 30438 33041 33042 12925 -14479 -11515 17609 25394 47903 53465 18940 9739 -6327
16357f327J0870J690J6156k1705k551J708L2528Q63K0568j2272j1299k0495M427
$$ -6327 4543 6233 22389 684 -1867 -159 32369 33232 53800 41528 30229 9734 14161
16344A4161l970p042J8356j718j5949k2161R290K5293J2374J2843l9601n2704
$$ 14161 10191 3149 21505 19787 3838 -18323 -9033 16260 28634 41477 1876 -50828
16332e0828K0285J6079j0456l500L8484J9710K994N198o250k7470q33M734l195
$$ -50828 -30543 -14464 -24920 -28420 10064 29774 32768 37966 31716 4246 3413 8147 4952
16319D952j424O94q878K9854k700p394P004o029o252R55q915K6964J2571k9648
$$ 4952 3528 4222 -4656 25198 22498 15104 22108 16079 9827 10782 1867 28831 41402 11754
16305A1754K564j3186N058K114m077r257K9760O415o907j3578p656K3715J449
$$ 11754 14318 1132 6190 8304 4227 -5030 24730 31145 24238 10660 3004 26719 28168
16292B8168p037j568K088O074p688N598J9419l0969j4546L5766J3341j5558n338
$$ 28168 21131 19563 21651 27725 20037 25635 45054 14085 -461 35305 48646 33088 27750
16279B7750J0153J3598j532j9934j6154k7131O791p33j0010K2365j258k5185K1975
$$ 27750 37903 51501 49969 30035 13881 -13250 -6459 -7192 -17202 5163 3905 -21280 695
16266F95J9703J0816R448j4771P431M086l126j3720J0912o808l6179k8302r682
$$ 695 20398 31214 40662 25891 33322 37408 34282 20562 31474 24666 -11513 -39815 -49497
16253d9497K0343M2729K3555J1167l3869m2709j8826j7258O220Q745J1041j1502
$$ -49497 -29154 13575 37130 48297 14428 -28281 -47107 -64365 -58145 -49400 -38359 -49861
16241d9861L095M2473K1802n012J0171j562q166m81J9740P219m738J4550k543
$$ -49861 -46766 -4293 17509 12497 22668 21106 12940 12459 32199 39418 34680 49230 46687
16228D6687O920n341j9953l054O904Q09J6048j941O58m198o230L700q176j8638
$$ 46687 53607 48266 28313 25259 32163 32972 49020 47079 47737 43539 37309 41009 32833 14195
16214A4195K4879J0916k8694J7913L6093n6p250Q112N816k4637q869k8629q123
$$ 14195 39074 49990 21296 39209 75302 75246 67996 76108 81924 57287 48418 19789 11666
16201A1666R429l464J0248k991j1147J7680l5208r888J0386j6360q969J7585L1819
$$ 11666 21095 17631 27879 24888 13741 31421 -3787 -13675 -3289 -19649 -28618 -11033 20786
16188B0786L0632p939j6307k1120n253L3828O637l798M011J2036m776k4559k6718
$$ 20786 51418 43479 27172 6052 799 34627 41264 37466 41477 53513 48737 24178 -2540
16175b540J0516J3195n321k12o643P702r554o989n345l56J4215j1447j9015K6493
$$ -2540 7976 21171 15850 15638 8995 16697 7143 154 -5191 -5547 8668 -2779 -21794 4699
16161D699J050M537R602j4765j1205o277K3013L0036k8060k700M1084J2476l2545
$$ 4699 5749 10286 19888 5123 -6082 -12359 10654 40690 12630 9930 51014 63490 30945
16148C0945k5546p416j020J926J590Q825Q102J5828m728q43L8210k890l3405k2194
$$ 30945 5399 -2017 -3037 -1111 479 9304 17406 33234 28506 27663 65873 62983 29578 7384
16134G384j764J1426j0390k1983K6381K0490j0789l737J0961j4761k1142J2441
$$ 7384 5620 17046 6656 -15327 11054 31544 20755 17018 27979 13218 -7924 4517
16122D517J0738J1496P82j2289p440n896j5486l219m647j2062R44j257L7134L3339
$$ 4517 15255 26751 27533 15244 7804 1908 -13578 -16797 -21444 -33506 -32562 -33819 3315 36654
16108C6654j432Q908j268o888Q094J1269k978j6154K9130j8394m0985M124J4497
$$ 36654 35222 44130 42862 35974 44068 55337 52359 36205 65335 46941 5956 10080 24577
16095B4577K622n018L2697j0533j4387K0466n240r778j579j80j3252k0495K0184
$$ 24577 27199 22181 54878 44345 29958 50424 45184 35406 33827 33647 20395 -100 20084
16082B0084J3631k4007j2198j4133K5816L1271J021k2912J1814o210n015j7711
$$ 20084 33715 9708 -2490 -16623 9193 40464 41485 18573 30387 24177 19162 1451
16070A451K572m685M464J4615j6076J2927J0126k8401N732K0476j18R750q63q989
$$ 1451 4023 -662 3802 18417 2341 15268 25394 -3007 2725 23201 23083 32833 31970 22981
16056B2981R56N548L774R163q897K2850q834l069l681k3181r035J0747P05j9103
$$ 22981 23937 29485 33259 42422 33525 56375 47541 44472 40791 17610 8575 19322 20027 924
16042I24l2747P860J6145l0153J2353K1879J1820Q822K8233J1384j0604J82K021
$$ 924 -31823 -23963 -7818 -37971 -25618 -3739 8081 16903 45136 56520 45916 46098 48119
16029D8119K19k558L151r69j5471n476o41J2101J3961k831q802J5497Q306j1001
$$ 48119 48338 45780 48931 47962 32491 27015 26374 38475 52436 49605 40803 56300 64606 53605
16015E3605r752n505J86O081j6480J772P145p3q208J227j1867l534o004j1216
$$ 53605 43853 38348 38534 44615 28135 29907 37052 36979 28771 29998 18131 14597 8593 -2623
16001b623J6306L3006J7773j761m374J1930L734k622O737Q637k6334M441L761
$$ -2623 13683 46689 64462 62701 58327 70257 73991 71369 78106 86743 60409 64850 68611
15988F8611l4156m5001P466J1254J2626J3837Q961M281k2023R855K5108L907n985
$$ 68611 34455 -10546 -3080 8174 20800 34637 43598 47879 25856 35711 60819 64726 58741
15975E8741n422m2060k4038j20K6703J8193j5863j0201M522m746J718L876J0187
$$ 58741 53319 11259 -12779 -12899 13804 31997 16134 5933 10455 5709 7427 11303 21490
15962B1490J6568K044M714l910Q076R032m52J093J455j5900K1769j1513K1098
$$ 21490 38058 40102 44816 40906 48982 58014 57562 58655 60110 44210 65979 54466 75564
15949G5564J02m7241j3934Q501J3127K6448j108l532j2155l6471j8802O527K4545
$$ 75564 75666 28425 14491 22992 36119 62567 61459 57927 45772 9301 -9501 -2974 21571
15936B1571M5071L583L503j5756m461J2917o587j8843q376r710j574J626K6o095
$$ 21571 66642 70225 73728 57972 53511 66428 59841 40998 32622 22912 21338 22964 22990 16895
15922A6895q3J4252j8008J6714J1244J799J3086K1563q615j6413p659j1761J8571
$$ 16895 16812 31064 13056 29770 41014 42813 55899 77462 68847 52434 44775 33014 51585
15909E1585j132m8291Q965k0346L4062K7983k9149k321j2780J1597L3241q685
$$ 51585 50453 2162 11127 -9219 24843 52826 23677 21356 8576 20173 53414 44729
15897D4729q120j351l458r173j6191k0561K2643K9917N706O082l0302m164R217
$$ 44729 36609 35258 31800 22627 6436 -14125 8518 38435 44141 50223 19921 15757 24974
15884B4974j0121K590J0749k002N342Q913n912J2027K672p84k1528j003m201O490
$$ 24974 14853 17443 28192 26190 31532 40445 34533 46560 49232 48448 26920 25917 21716 28206
15870B8206j2087P062P744j2162J034L938J7162q987j0830l5183q284J3735O717
$$ 28206 16119 23181 30925 18763 19797 23735 40897 31910 21080 -14103 -22387 -8652 -1935
15857a935n048J9327l239L49q971o978K9634P209Q461j8854p187J4894K0490J1285
$$ -1935 -6983 12344 9105 9454 483 -6495 23139 30348 38809 19955 12768 27662 48152 59437
15843E9437n486j7094j832j459o461K2579m772J5144L934J739j9805j0035R289
$$ 59437 53951 36857 35025 33566 27105 49684 44912 60056 63990 65729 45924 35889 45178
15830D5178J6171l387j8608n914J1131O9l0471M69o53q42L8308Q19P332j8948
$$ 45178 61349 57962 39354 33440 44571 44640 14169 14638 13985 13143 51451 52270 59602 40654
15816D0654k6882J0894J1242j4008j2589q291r038J6588Q819l592P322q273J643
$$ 40654 13772 24666 35908 21900 9311 1020 -8018 8570 17389 13797 21119 12846 14489
15803A4489n661K2490K7551p175j6733p303L41J7533N1509L2080J1772J2830j7639
$$ 14489 8828 31318 58869 51694 34961 27658 27999 45532 97041 129121 140893 153723 136084
15790A36084k0480j3065L464o590j7048k4163p329k0179k1119j6819J3311K1421
$$ 136084 115604 102539 106003 99413 82365 58202 50873 30694 9575 -7244 6067 27488
15778B7488k5107K946K1254m050J5198o394J8936M854p351k6073p242J8283J3932
$$ 27488 2381 5327 26581 22531 37729 31335 50271 55125 47774 21701 14459 32742 46674
15765D6674N275J2459J2712R52r917q855j7228L718N934k5808j5683L4440J9840
$$ 46674 51949 64408 77120 78072 68155 59300 42072 45790 51724 25916 10233 44673 64513
15752F4513j0248q349RJ037J8061o665p087j2699K4165J9662M924j326r874l176
$$ 64513 54265 45916 45925 46962 65023 58358 51271 38572 62737 82399 87323 85997 76123 72947
15738G2947O732l2796l5311k0929n271K4746K0155q253J4524P563J2819j5855
$$ 72947 79679 46883 11572 -9357 -14628 10118 30273 22020 36544 44107 56926 41071
15726D1071K274J2091j4154J2905K3586j9925k5084K7708j877j9694n270O739
$$ 41071 43345 55436 41282 54187 77773 57848 32764 60472 58595 38901 33631 40370
15714D0370p515q811j4985J1916J58l40O847P842j0428r301j5879J5880K5606
$$ 40370 32855 24044 9059 20975 21133 20793 27640 35482 25054 15753 -126 15754 41360
15701D1360K3003J3974n021n885k0842j1068M136m860n696j9404o104K353K1928
$$ 41360 64363 78337 73316 67431 46589 35521 39657 34797 29101 9697 3593 5946 27874
15688B7874L0564j236n980P94K8265M931Q174k7512k1671p748M589J5478l126
$$ 27874 58438 57202 51222 52016 80281 85212 93386 65874 44203 36455 41044 56522 53396
15675E3396k936N477K7021L317m052q173R716J0658j6363j1520J2707J8311L785
$$ 53396 50460 55937 82958 86275 82223 74050 83766 94424 78061 66541 79248 97559 101344
15662A01344Q96j5922M185J0961l46m899m812R038J3067l659Q570j7831j7068
$$ 101344 102240 86318 90503 101464 101118 96219 91407 100445 113512 109853 118423 100592 83524
15649H3524o385J5186K955m571Q219m383J6431j415K915K2410j2014p394m943
$$ 83524 77139 92325 95280 90709 98928 94545 110976 109561 112476 134886 122872 115478 110535
15636A10535l2845k2189j88K1729j4674n82K6009L4262r830l036K503K4618K426
$$ 110535 77690 55501 55313 77042 62368 61786 87795 122057 112227 109191 111694 136312 138738
15623A38738j6403j7392k0636j5116n054L5327n817l8302k1771K7600J0510K8633
$$ 138738 122335 104943 84307 69191 64137 99464 93647 55345 33574 61174 71684 100317
15611A00317q554J0366K4261n267l940k1154j9351q135J9962Q514j5359O729o918
$$ 100317 91763 102129 126390 121123 117183 96029 76678 68543 88505 97019 81660 88389 81471
15598H1471j0668K0440J9100k2740k2162K3211K3696P329J4907n667k2978k6392
$$ 81471 70803 91243 110343 87603 65441 88652 112348 119677 134584 128917 105939 79547
15586G9547J875L5434Q501l9390k2719J247J8538j3924j5849j4746j2338j5386
$$ 79547 81422 116856 125357 85967 63248 64495 83033 69109 53260 38514 26176 10790
15574A0790K8310J1074K77J5153K2365r568j9900J0926L1817K644j3898r737j0426
$$ 10790 39100 50174 50451 65604 87969 78401 58501 69427 101244 103888 89990 80253 69827
15561F9827q272M980R042M364j199L757O276j132k299K253j802J4073J6897k1023
$$ 69827 61555 66535 75577 79941 78742 82499 88775 87643 85344 87597 85795 99868 116765 95742
15547I5742j5196Q051J3608K2433l6414j8070j425J1897J0706J7546j7671m156
$$ 95742 80546 88597 102205 124638 88224 70154 68729 80626 91332 108878 91207 87051
15535H7051K9705j5250N121P946k6075l6013J3958P0844M048j4173n447k4284
$$ 87051 116756 101506 106627 114573 88498 52485 66443 137287 141335 127162 121715 97431
15523I7431K6122r735j9521q005P912l95k1548J6620L4875j7106j9755O989J5113
$$ 97431 123553 113818 94297 86292 94204 93809 72261 88881 123756 106650 86895 93884 108997
15510A08997J9360M7679J5531J4673J419J365r043j7137K2489J9776k4491k7311
$$ 108997 128357 176036 191567 206240 207659 209024 199981 182844 205333 225109 200618 173307
15498A73307J528n538l483N30N815J5684J104k4695j1546j0832J1382O27k8724
$$ 173307 174835 169297 165814 166344 172159 187843 188947 164252 152706 141874 153256 153883 125159
15485A25159L8385K9312k4061k1121l7218j2036K7005K3114M66k937m64j4303
$$ 125159 163544 192856 168795 147674 110456 98420 125425 148539 149005 146068 145604 131301
15473A31301n591j1221k3516J9795K4195j0067j3289j4372l0394q387j1945J1968
$$ 131301 125710 114489 90973 110768 134963 124896 111607 97235 66841 58454 46509 58477
15461E8477J3116J367r452P53P30J2074J2906J4857o228M819j0669j3480r555
$$ 58477 71593 72960 63508 64261 64991 77065 89971 104828 98600 103419 92750 79270 69715
15448F9715K9J0362J7178J9257L802l070K899k0789q079j3709O912K440J4487
$$ 69715 69744 80106 97284 116541 120343 117273 120172 99383 91304 77595 84507 86947 101434
15435A01434L0348J3417j7891l1640P744J4286k993j0896r720O804j5777J588
$$ 101434 131782 145199 127308 95668 103412 117698 114705 103809 94089 100893 85116 86704
15423H6704K1261J4013P39j3457R902k2464j2201N539J242K0899q341q451J1409
$$ 86704 107965 121978 122717 109260 119162 96698 84497 90036 91278 112177 103836 95385 106794
15410A06794p053k3171o340K8773J6711J0324q432k7812j6390J6786L5218J8833
$$ 106794 99741 76570 70230 99003 115714 126038 117606 89794 73404 90190 125408 144241
15398A44241l983j6992j5275N52J3407o044r173j9335N8897K9047j3419k4373
$$ 144241 140258 123266 107991 108543 121950 115906 106733 87398 146295 175342 161923 137550
15386A37550k0208K6680L3111K0073r550l822k8506m1779K1928k58j175N832K451
$$ 137550 117342 144022 177133 197206 187656 183834 155328 113549 135477 135219 134044 139876 142327
15373A42327k0443J4164p060J6932q359j847J5669J2902L376P524p681J6972K5866
$$ 142327 121884 136048 128988 145920 137561 135714 151383 164285 167661 175185 167504 184476 210342
15360B10342o621j4207m1309j3492J1513K1482K1840K5123J6325L1951J01j368
$$ 210342 203721 189514 148205 134713 146226 167708 189548 214671 230996 262947 263048 261680
15348B61680J5861O0333O1360M6929L1547R1374J41792J97448K20993K34249K22320
$$ 261680 277541 337874 399234 446163 477710 569084 710876 908324 1129317 1363566 1585886
15337A585886K16569J95828J51112P4731l0096j41979k01302j93088k27633k23181
$$ 1585886 1802455 1998283 2149395 2224126 2194030 2052051 1850749 1657661 1430028 1206847
15327A206847j97022j35885r7971p6182q7378o3176o5435k3886o5635l6246k8244
$$ 1206847 1009825 873940 775969 699787 612409 549233 483798 459912 394277 358031 329787
15316C29787l1913P18k0489k2196o560r7m032K606j6742k6382r15Q558J4946M296
$$ 329787 297874 298592 278103 255907 249347 249250 245218 247824 231082 204700 203785 212343 227289 231585
15302B31585k0564J1234l704r753k4011l468P043j3820j5821j0579k56J0829K1201
$$ 231585 211021 222255 218551 208798 184787 181319 188362 174542 158721 148142 147886 158715 179916
15289A79916K2060L661J5994N865j5233J5899J1926n501j2761k0084K452J5794
$$ 179916 201976 205637 221631 227496 212263 228162 240088 234587 221826 201742 204194 219988
15277B19988j1376j1056p990l7432K0547P749M834M549J4567M453l0892J599L1486
$$ 219988 208612 197556 189566 152134 172681 180430 185264 189813 204380 208833 177941 179540 211026
15264B11026K1545k710j1228Q362O8286K5923R0435Q7408Q4866R3967N7817L3824
$$ 211026 232571 229861 218633 226995 295281 321204 411639 499047 583913 677880 735697 769521
15252G69521J0022J1715n0265o9157p0569p4020p6610o9807p6397k1691k9127
$$ 769521 779543 791258 740993 671836 601267 527247 450637 380830 304433 282742 253615
15241B53615k841j7786j6927l441p705K1134n521l2254j3433K4790K1795j2648
$$ 253615 250774 232988 216061 212620 204915 226049 220528 188274 174841 199631 221426 208778
15229B08778J1124j8383k7187m454R103j2918l0634J021j465K949J2398J8836
$$ 208778 219902 201519 174332 169878 178981 166063 135429 136450 134985 137934 150332 169168
15217A69168J9842K314r402k101j7834o244K0440o058k2266j5711J555Q568N331
$$ 169168 189010 191324 181922 179821 161987 155743 176183 170125 147859 132148 133703 142271 147602
15204A47602K8708j7540k4545o005K0477j6732p457J0206N934j9592J4376L979
$$ 147602 176310 158770 134225 128220 148697 131965 124508 134714 140648 121056 135432 139411
15192A39411j594J72j7715n673L2071J9058J1794k4269k2042N208K9142l137j1450
$$ 139411 137817 137989 120274 114601 146672 165730 177524 153255 131213 136421 165563 162426 150976
15179A50976r240j7856J0675J1535K5229J5868o08K6076l39k4891p601J180R012
$$ 150976 141736 123880 134555 146090 171319 187187 186579 212655 212316 187425 179824 181004 190016
15166A90016J1230J0566k2389j633R715j3501o878Q214J4929J5850j7204Q358
$$ 190016 201246 211812 189423 187790 197505 184004 177126 185340 200269 216119 198915 207273
15154B07273J268j0773N128L684J3493j822j858Q118L2435K3992L9682K4757O442
$$ 207273 208541 197768 202896 206580 220073 218251 216393 224511 256946 280938 320620 345377 351819
15141C51819O381J2497L4911N2706n111o016J5630L6383O8l7549j3967J990j2417
$$ 351819 358200 370697 405608 458314 453203 447187 462817 499200 499268 461719 447752 449742 437325
15128D37325k8906m1889j646J725j4144k3914J1142q16m0679J0892j8875n547
$$ 437325 408419 366530 364884 366609 352465 328551 339693 338877 298198 309090 290215 284668
15116B84668j3086j2390K345L9372Q831r181O336J8121M626j2464m757j8746j4389
$$ 284668 271582 259192 261537 300909 309740 300559 306895 325016 329642 317178 312421 293675 279286
15103B79286j0054K773K4290J1646k6356J1212m614k3866J1825L8689J2967O857
$$ 279286 269232 272005 296295 307941 281585 292797 288183 264317 276142 314831 327798 334655
15091C34655k2655j2336J3737K5372j485k6231K5341L1820J990L059k828q669
$$ 334655 312000 299664 313401 338773 337288 311057 336398 368218 370208 373267 370439 361770
15079C61770k7170j7778J1913L6819M85j9270k025J7711j5993j4003j0529j3772
$$ 361770 334600 316822 328735 365554 366039 346769 344744 362455 346462 332459 321930 308158
15067C08158l413N625j1862l2706J987j0349K3841j704j254L068L6941N44q270
$$ 308158 304745 310370 298508 265802 267789 257440 281281 279577 278323 281391 318332 318876 310606
15054C10606M809O802j1373J6475J2847M1715L6357O375J180K160K3209j7438
$$ 310606 315415 322217 310844 327319 340166 381881 418238 424613 425793 427953 451162 433724
15042D33724J1814L2647J5080J8210O022K183K3395K1441r733j577k0474j9648
$$ 433724 445538 478185 493265 511475 517497 519680 543075 564516 554783 553206 532732 513084
15030E13084J500J3583J0058K9519P209k023L95k6016M3570P9637M1400N2129
$$ 513084 514584 528167 538225 567744 574953 572930 573325 547309 590879 670516 711916 764045
15018G64045O9486O9129Q5048P5258O9494O8445M3314J161M918o517l7027o1708
$$ 764045 833531 902660 987708 1062966 1132460 1200905 1244219 1245380 1250298 1243781 1206754 1145046
15006A145046l7225p6855p0535p9826m6885p47j7806j0804K0617K3885L2996K5893
$$ 1145046 1107821 1030966 960431 880605 833720 832973 815167 804363 824980 848865 881861 907754
14994I07754J6646J508k0373j7576P591j5289J2107l158m790K3473J9053N216
$$ 907754 924400 925908 905535 887959 895550 880261 892368 889210 884420 907893 926946 932162
14982I32162p76J3318M1794K9880J493J418J8412J7970N0220N4045K5199K3453
$$ 932162 931386 944704 986498 1016378 1017871 1019289 1037701 1055671 1105891 1159936 1185135 1208588
14970A208588m819O855Q234J7222k4768m6900n8081m3181k2898j9857j0304p634
$$ 1208588 1203769 1210624 1218858 1236080 1211312 1164412 1106331 1063150 1040252 1020395 1010091 1002457
14958A002457j6409K519J9420j970N3524O0580K3018J9475L9981N6117N3629N7950
$$ 1002457 986048 988567 1007987 1006017 1059541 1120121 1143139 1162614 1202595 1258712 1312341 1370291
14946A370291M9312Q8843J06192O7903Q1633O9861L9358J2476L9309K0672K5952
$$ 1370291 1419603 1508446 1614638 1682541 1764174 1834035 1873393 1885869 1925178 1945850 1971802
14935A971802M0087M8190P8790Q4577J10500J01892J01729J16690J00577Q2792
$$ 1971802 2011889 2060079 2138869 2223446 2333946 2435838 2537567 2654257 2754834 2837626
14925B837626R1643J00096J17307J28153J00515R6416J45825J31063J54861K34013
$$ 2837626 2929269 3029365 3146672 3274825 3375340 3471756 3617581 3748644 3903505 4137518
14915D137518K46650L16538L29395L63063M11890M80678N40237N62914O52182
$$ 4137518 4384168 4700706 5030101 5393164 5805054 6285732 6825969 7388883 8041065
14906H041065P28878Q30554J008761J222149J505031J836703K205263K592803
$$ 8041065 8769943 9600497 10609258 11831407 13336438 15173141 17378404 19971207
14898A9971207L050696L570770M195845N031547O151206P861253J0612460J4917355
$$ 19971207 23021903 26592673 30788518 35820065 41971271 49832524 60444984 75362339
14890G5362339K1345071K9681821L8649834M6016625M9744621M9285977M4721489
$$ 75362339 96707410 126389231 165039065 211055690 260800311 310086288 354807777
14883C54807777L5249802J9991285J190209j7006118l1576281m1854423m7503760
$$ 354807777 390057579 410048864 411239073 394232955 362656674 320802251 273298491
14876B73298491m7780604m2997641l5255797k6908215j9507566j3871202j0035368
$$ 273298491 225517887 182520246 147264449 120356234 100848668 86977466 76942098
14869G6942098p632389o155518n255900m624935m141298l690947l303935k996077
$$ 76942098 69309709 63154191 57898291 53273356 49132058 45441111 42137176 39141099
14861C9141099k689840k367613k107454j879237j661724j494519j333220j198378
$$ 39141099 36451259 34083646 31976192 30096955 28435231 26940712 25607492 24409114
14853B4409114j104153r92891r04023q58520q19025p81130p99841p58306p26368
$$ 24409114 23304961 22312070 21408047 20549527 19730502 18949372 18149531 17391225 16664857
14844A6664857p10264o85929o35203n90144n45722m64402m25668m47069m27708
$$ 16664857 15954593 15268664 14633461 14043317 13497595 13033193 12607525 12160456 11732748
14835A1732748m00686l59454l32009l32104l19553k96825l09874l09310l05016
$$ 11732748 11332062 10972608 10640599 10308495 9988942 9692117 9382243 9072933 8767917
14826H767917l09036k70309k27108k35785k10629j52054j01190o4810r8372j03082
$$ 8767917 8458881 8188572 7961464 7725679 7515050 7362996 7261806 7196996 7098624 6995542
14816F995542o2930p0605j15340j51958j80924k02898k08532k79188k53469k00497
$$ 6995542 6932612 6862007 6746667 6594709 6413785 6210887 6002355 5723167 5469698 5269201
14806E269201j95444j83479j76589j66550j87903j93934k06200j80974j67236
$$ 5269201 5073757 4890278 4713689 4547139 4359236 4165302 3959102 3778128 3610892
14797C610892j26422r3078j22286r5292o4624o6653m4038k3685L0141j6137p9728
$$ 3610892 3484470 3391392 3269106 3173814 3109190 3042537 2998499 2974814 3004955 2988818 2909090
14786B909090o7352o4962o5005j26672j10041j19474j12565j38405j51542r0647
$$ 2909090 2841738 2776776 2711771 2585099 2475058 2355584 2243019 2104614 1953072 1862425
14776A862425q9688j47300q5903q7569j05778r7660q9955p1359m9881m3900o1700
$$ 1862425 1772737 1625437 1539534 1451965 1346187 1248527 1158572 1087213 1037332 993432 931732
14765I31732k3380l3873k9746m1081m5751l9683k9388n5804r0415n6116m3587
$$ 931732 908352 874479 844733 803652 757901 718218 688830 633026 542611 486495 442908
14754D42908n2530l5029l9901l4415k3557j4281j2006o349l528J6508K0562J9983
$$ 442908 390378 355349 315448 281033 257476 243195 231189 224840 221312 237820 258382 278365
14742B78365L5764M9337K5680L734j3931J2338Q608Q116k699j88k0637j8674l655
$$ 278365 314129 363466 389146 392880 378949 391287 399895 408011 405312 405124 384487 365813 362158
14729C62158K0287J2666K2199K0413l0k681K2343M8069O3867P2892L1109N5749
$$ 362158 382445 395111 417310 437723 437693 435012 457355 505424 569291 642183 673292 729041
14717G29041M6055L3989L4308K1458J8877j7808k5939m0751m9671n6030n9035
$$ 729041 775096 809085 843393 864851 883728 865920 839981 799230 749559 693529 634494
14706F34494m8572l4320j3427q304k4194j3199j4985k9158k0749k0492j5700q611
$$ 634494 585922 551602 538175 529871 505677 492478 477493 448335 427586 407094 391394 382783
14694C82783k2599J3845J5215k6998m2939k1236J5440K2289J3046j3821q294r783
$$ 382783 360184 374029 389244 362246 319307 298071 313511 335800 348846 335025 326731 316948
14682C16948j4660l5082j8439M6407J9786j2448j6685K505j7307J9281J3891L884
$$ 316948 302288 267206 248767 295174 314960 302512 285827 288332 271025 290306 304197 308081
14670C08081j1990l9179O40J4689Q726n399r827j3235Q854J0824l341k9720k6582
$$ 308081 296091 256912 257552 272241 280967 275568 265741 252506 261360 272184 268843 239123 212541
14657B12541L223O952J2742J7636K5540K4787K2015p120L4602J5667K8274L0945
$$ 212541 215764 222716 235458 253094 278634 303421 325436 318316 352918 368585 396859 427804
14645D27804K3309j736Q230j1223l5595n0502k4030k0114k5044j9222q967k9965
$$ 427804 451113 449377 457607 446384 410789 360287 336257 316143 291099 271877 262910 232945
14633B32945k0044j8074l6460J5798K4733J3673J1508L977K3791J1500J5199L0376
$$ 232945 212901 194827 158367 174165 198898 212571 224079 228056 251847 263347 278546 308922
14621C08922J5808p021R636J9606J7817j3399j6658j4494m4595j4632j1519l3227
$$ 308922 324730 317709 327345 346951 364768 351369 334711 320217 275622 260990 249471 216244
14609B16244k3775j1886l831k6586n164J9966p816J2499J9737L7260j15Q415K585
$$ 216244 192469 180583 176752 150166 145002 164968 157152 169651 189388 226648 226533 234948 237533
14596B37533J0724K8780N254r455J0337k1605l4171k0500P249j3548m0051m702
$$ 237533 248257 277037 282291 272836 283173 261568 227397 206897 214146 200598 160547 155845
14584A55845j1878l5442J657J1595j6455R441j4395m287M0509N5475J3691n26
$$ 155845 143967 108525 110182 121777 105322 114763 100368 96081 136590 192065 205756 205230
14572B05230j2367j4637j8202K9258L1925j1577p932r412p320m141l6492j7551
$$ 205230 192863 178226 160024 189282 221207 209630 201698 192286 184966 180825 144333 126782
14560A26782r195k6128J880M4510K4439p384k3158r937r669j037L0099K2648K926
$$ 126782 117587 91459 93339 137849 162288 154904 131746 121809 112140 111103 141202 163850 166776
14547A66776j1103N186K6771n8j732p923L9387J1264J1446m1235l0608q793j5525
$$ 166776 155673 160859 187630 187572 185840 177917 217304 228568 240014 198779 168171 159378 143853
14534A43853k5085J9464O155O410j0592l466q87n625J1702j2467j5232J4295j6385
$$ 143853 118768 138232 144387 150797 140205 136739 135852 130227 141929 129462 114230 128525 112140
14521A12140o95J7910o046p324R354K6344k6075N82K0741K4577k0283K453K7627
$$ 112140 111445 129355 123309 115985 125339 151683 125608 126190 146931 171508 151225 153678 181305
14508A81305j1767m328j4395j2348k4389k771J4612j1960j879j6036m448j3458
$$ 181305 169538 165210 150815 138467 114078 111307 125919 113959 112080 96044 91596 78138
14496G8138M4861J8421n698j4529k2647Q586l631J1879J7439j2684Q458j1162
$$ 78138 122999 141420 135722 121193 98546 107132 103501 115380 132819 120135 128593 117431
14484A17431j9659K0282q170j7125K6438R002J0521M1566K6958j7750J545J2135
$$ 117431 97772 118054 109884 92759 119197 128199 138720 180286 207244 189494 191039 203174
14472B03174O083J6931K718O561J6831L8813N1895M2618K9561J8678M2958Q7324
$$ 203174 209257 226188 228906 235467 252298 291111 343006 385624 415185 433863 476821 564145
14460E64145J15125J56588K09958K85601L07273K52308K35953J40302M8957j6559
$$ 564145 679270 835858 1045816 1331417 1638690 1890998 2126951 2267253 2316210 2299651
14450B299651j28526k53509k94125k99209k18663k03670j54122p6802n4335m0079
$$ 2299651 2171125 1917616 1623491 1324282 1105619 901949 747827 671025 616690 576611
14440E76611j4987k2448j5047N231J8988K3319J4652L4466M8627P7338J14390
$$ 576611 561624 539176 524129 529360 548348 571667 586319 620785 669412 746750 861140
14429H61140J58758J90587K37643K37916K36002K21886J63344Q7481j9922j24455
$$ 861140 1019898 1210485 1448128 1686044 1922046 2143932 2307276 2394757 2374835 2250380
14419B250380j75104k12761j92015k14855k26417j59646r4537j03590p9957n7844
$$ 2250380 2075276 1862515 1670500 1455645 1229228 1069582 975045 871455 791498 733654
14409G33654l4048l5319k1962o0332m2609n7703n9064j3787m702K0979j2905k9259
$$ 733654 699606 664287 642325 581993 539384 481681 422617 408830 404128 425107 412202 382943
14397C82943k4963k4863l6561j7127p45j0822r225l641k1301k3911K546q65j8583
$$ 382943 357980 333117 296556 279429 278684 267862 258637 254996 233695 209784 212330 211465 192882
14384A92882j5083K1414L8567L333k1299k0697j1065N174j0334K1916R712J0646
$$ 192882 177799 199213 237780 241113 219814 199117 188052 193226 182892 204808 214520 225166
14372B25166p008J5543p357j4093j4573Q51J0951K7536Q201j5186N469l8029J7642
$$ 225166 218158 233701 226344 212251 197678 198529 209480 237016 245217 230031 235500 197471 215113
14359B15113R65m1198L888O744j2884L4564J7678j4618J1543k7604k2652j3959
$$ 215113 216078 174880 178768 185512 172628 207192 224870 210252 221795 194191 171539 157580
14347A57580K3148L0097J9093J107K3973N2077K0510K694J2960R634K6047j0252
$$ 157580 180728 210825 229918 231025 254998 307075 327585 330279 343239 352873 378920 368668
14335C68668k806k1666p118j6713m1627k4220j4564m176J1357k736j2404l4005
$$ 368668 365862 344196 337078 320365 278738 254518 239954 235778 247135 244399 231995 197990
14323A97990K180L2472m700q366o122j0128k3851r448j1805l155K7869k022n26
$$ 197990 200170 232642 227942 219576 213454 203326 179475 170027 158222 155067 182936 180914 180388
14310A80388L126k0967N48k7247l0571K2706K6273J6551L2744l695m1764o098
$$ 180388 183514 162547 163095 135848 105277 127983 154256 170807 203551 199856 158092 151994
14298A51994J520l3823J183L3659L2674r995k8976K000r814K6065L538j2576J9185
$$ 151994 153514 119691 120874 154533 187207 177212 148236 150236 140422 166487 170025 157449 176634
14285A76634p207l0682m007J6215k3605o749L1120J2696k1107j7217p311L1606
$$ 176634 169427 138745 134738 150953 127348 120599 151719 164415 143308 126091 118780 150386
14273A50386O615L041k516J9324K6906j488l4675j0461L623Q414K276J2747J0530
$$ 150386 157001 160042 157526 176850 203756 202268 167593 157132 160755 169169 171445 184192 194722
14260A94722j2619m742L6156o119k8071l016J6414M7662M3272Q258K0985n590
$$ 194722 182103 177361 213517 207398 179327 176311 192725 240387 283659 291917 312902 307312
14248C07312r032J9896o84O158J2923J6135m714k5255l110k1769P732J7401q379
$$ 307312 298280 318176 317492 323650 336573 352708 347994 322739 319629 297860 305592 322993 314614
14235C14614q234R827L601j4328M08J9439K0212K8557N0803J0371J8901K8871
$$ 314614 306380 316207 319808 305480 305888 325327 345539 374096 424899 435270 454171 483042
14223D83042M2371O523j0921l085l1326k4423j4719k4090j5745J3666j7713J676
$$ 483042 525413 531936 521015 517930 486604 462181 447462 423372 407627 421293 403580 405256
14211D05256k0420k7067j847p446L9255J8303j5934Q056R974L8882M2427N1188
$$ 405256 384836 357769 355922 348476 387731 406034 390100 398156 408130 447012 489439 540627
14199E40627P6961J02073J10122J05089J10019P4632P6426O9063O248k5812o1493
$$ 540627 617588 719661 829783 934872 1044891 1119523 1195949 1265012 1271260 1245448 1183955
14188A183955n7966o1069r4159p4694p6457q0236m5697j2923k6866n4095q303
$$ 1183955 1125989 1064920 970761 896067 819610 739374 693677 680754 653888 599793 591490
14177E91490J4135l489k7542q380J6031p404n2328J4430K085k3305n6117l5859
$$ 591490 605625 602136 574594 566214 582245 574841 522513 536943 539028 515723 459606 423747
14165D23747l994R091k520j1789j7236o307J1045J9757k5647k6601j4258O400
$$ 423747 419753 428844 426324 414535 397299 390992 402037 421794 396147 369546 355288 361688
14153C61688p217p266J0772m215m352j5736k9180M811K003L7647Q603M155R197
$$ 361688 354471 347205 357977 353762 349410 333674 304494 309305 311308 348955 357558 361713 370910
14140C70910O159j2724N212J9026O171K8851M2953N0537L9806O3197O2579O4208
$$ 370910 377069 364345 369557 388583 394754 423605 466558 517095 556901 620098 682677 746885
14128G46885N8689O0909M6178M6368P004k1732n5517o7549q0204m0558m0464k5002
$$ 746885 805574 866483 912661 959029 966033 944301 888784 821235 741031 700473 660009 635007
14116F35007L089J9076L6017K2128P841N792p349M1274K6477P4779Q1952Q7989
$$ 635007 638096 657172 693189 715317 723158 728950 721601 762875 789352 864131 946083 1034072
14104A034072R4817Q6561M6891L4930N6525m444j1199K0024l5964l8832p3830
$$ 1034072 1128889 1215450 1262341 1297271 1353796 1349352 1338153 1358177 1322213 1283381 1209551
14093A209551q8695p2387n8790o3994k1803J1216J0798P932l273j0865J7292M2950
$$ 1209551 1120856 1048469 989679 925685 903882 915098 925896 933828 930555 919690 936982 979932
14081I79932K0121k6949j368k0039m389p279k148m333J9012L3429J4568q285j836
$$ 979932 1000053 973104 971736 951697 947308 940029 937881 933548 952560 985989 1000557 992272 990436
14068I90436p801J0131K4592L2506K3008L4687K1910M8529M7970N7572L1011l638
$$ 990436 982635 992766 1017358 1049864 1072872 1107559 1129469 1177998 1225968 1283540 1314551 1310913
14056A310913m170j5866j9132k7241p0525l4036J4520J7907p799l5353j0924L6457
$$ 1310913 1306743 1290877 1271745 1244504 1173979 1139943 1154463 1172370 1164571 1129218 1118294 1154751
14044A154751L9754M4769M2873M6671M0960O1180R0613J13140J54373J97714K77630
$$ 1154751 1194505 1239274 1282147 1328818 1369778 1430958 1521571 1634711 1789084 1986798 2264428
14033B264428L51950M24709M93475M56984K86067J26778Q7544N552j79229l87952
$$ 2264428 2616378 3041087 3534562 3991546 4277613 4404391 4491935 4497487 4318258 3930306
14023C930306m32871k74083j54887j09175k1201M2698N5711J12014J04181J07659
$$ 3930306 3497435 3223352 3068465 2959290 2938089 2980787 3036498 3148512 3252693 3360352
14013C360352R3431R8501O5341J26616J46069J10617J12456J07918J71800K15329
$$ 3360352 3453783 3552284 3617625 3744241 3890310 4000927 4113383 4221301 4393101 4608430
14003D608430K51910L36085L89999M19449M65762N08386O01161O85055P74253
$$ 4608430 4860340 5196425 5586424 6005873 6471635 6980021 7581182 8266237 9040490
13994I040490Q94442J084467J279344J444821J626938J840889K037196K329178
$$ 9040490 9934932 11019399 12298743 13743564 15370502 17211391 19248587 21577765
13986B1577765K656700K985015L517846M300677N420144P066880R590482J3533044
$$ 21577765 24234465 27219480 30737326 35038003 40458147 47525027 57115509 70648553
13978G0648553J9757808K8966767M0839556N3406513O2977942O4233679N3367141
$$ 70648553 90406361 119373128 160212684 213619197 276597139 340830818 394197959
13971C94197959L5032040J7083702j359570k3059764m6821402o3917096o6365749
$$ 394197959 429229999 446313701 444954131 421894367 375072965 311155869 244790120
13964B44790120n6877639m2405290k8827737j9068821j2854279r068845o871174
$$ 244790120 187912481 145507191 116679454 97610633 84756354 75687509 68816335
13957F8816335n578517m751632m200616l718482l379627l086341k797943k596669
$$ 68816335 63237818 58486186 54285570 50567088 47187461 44101120 41303177 38706508
13949C8706508k442516k234581k072739j849552j640307j434172j266881j156943
$$ 38706508 36263992 34029411 31956672 30107120 28466813 27032641 25765760 24608817
13941B4608817j025738r42677r03433r07106q87233q99703q70728q35540p99275
$$ 24608817 23583079 22640402 21736969 20829863 19942630 19042927 18172199 17336659 16537384
13932A6537384p84210p18326o62528n88483n38999n22050m98790m32615l88162
$$ 16537384 15753174 15034848 14372320 13783837 13244838 12722788 12223998 11791383 11403221
13923A1403221l63586l48723l55856l35858l25376k80350k82890l23439l14430
$$ 11403221 11039635 10690912 10335056 9999198 9673822 9393472 9110582 8787143 8472713
13914H472713l19118l04590k98239k74623k10274k01536j95683j47350j42076
$$ 8472713 8153595 7849005 7550766 7276143 7065869 6864333 6668650 6521300 6379224
13905F379224j46074j68278j85507j77619j57103j81462j36254j25183j14325
$$ 6379224 6233150 6064872 5879365 5701746 5544643 5363181 5226927 5101744 4987419
13896D987419j30785j68871j62076j43647j45955j58649j62386j68726j38208
$$ 4987419 4856634 4687763 4525687 4382040 4236085 4077436 3915050 3746324 3608116
13887C608116j45491j47320j16407r6742r8844p5895n5131n8483l3611l7675l1796
$$ 3608116 3462625 3315305 3198898 3102156 3003312 2927417 2872286 2813803 2780192 2742517 2710721
13876B710721n298j6370j6764n5214q9694p1269j42713j51850j53493j48638r5797
$$ 2710721 2705423 2689053 2672289 2617075 2527381 2456112 2313399 2161549 2008056 1859418 1763621
13865A763621j10420j22793r4015j04041q1549o5498o2063o6627p1198n8711o2202
$$ 1763621 1653201 1530408 1436393 1332352 1250803 1185305 1123242 1056615 985417 926706 864504
13854H64504n7610m5586k9861p974l0089n9735q6519p3880n8710l0440m2933n9191
$$ 864504 806894 761308 731447 723473 693384 633649 547130 473250 414540 384100 341167 281976
13842B81976o1300j3097m7571n2897r407k9224k0422M519J6464J3227N6822M0181
$$ 281976 220676 207579 160008 107111 97704 68480 48058 52577 69041 82268 139090 179271
13830A79271L0722K2920m311j8522P180J7528j7367p486P05K1319K5417K7376
$$ 179271 209993 232913 228602 210080 217260 234788 217421 209935 210640 231959 257376 284752
13818B84752J1478j3955n0685q270o015K5616M3201J7091J4877M4484Q7739Q4760
$$ 284752 296230 282275 231590 223320 217305 242921 286122 303213 318090 362574 450313 535073
13806E35073R7176J61865J55917J27033R6403N1024k551n7019j04547j29733j52555
$$ 535073 632249 794114 950031 1077064 1173467 1224491 1221940 1164921 1060374 930641 778086
13795G78086j46035r7821n6532l9635k0853k4381J614k0109k1199J323j261j9125
$$ 778086 632051 534230 477698 438063 417210 392829 394443 374334 353135 354458 353197 334072
13783C34072R730j6363l9651o519L042R129m715l8893k000j2735k4055j3894m629
$$ 334072 343802 327439 287788 281269 284311 293440 288725 249832 247832 235097 211042 197148 192519
13770A92519k0828j0731k0551Q560L161Q127J7519J6776j1422j4416j2772J9902
$$ 192519 171691 160960 140409 148969 152130 160257 177776 194552 183130 168714 155942 175844
13758A75844K1953k338j4851M217j8028m0628m4773j500M3280n302j6011j9931
$$ 175844 197797 195459 180608 184825 166797 126169 81396 79896 123176 117874 101863 81932
13746H1932J5278J9160L7965K5234j7444o519L4450K8484K309N604j3344l9307
$$ 81932 97210 116370 154335 179569 162125 155606 190056 218540 220849 226453 213109 173802
13734A73802j0514k5091q065K6217k7123k7615n451p898j6633l0263M528J2271
$$ 173802 163288 138197 130132 156349 129226 101611 96160 88262 71629 41366 45894 58165
13722E8165L9174M2546K5958P708m134o282J3071L8598J1525l4420l7482k1187
$$ 58165 97339 139885 165843 173551 169417 163135 176206 214804 226329 191909 154427 133240
13710A33240p979k8229j2920r400j8427k4894j5884L713p7N959o594P488j1831
$$ 133240 125261 97032 84112 74712 56285 31391 15507 19220 19143 25102 18508 25996 14165
13697A4165j0231P816P160l0578P857O524l701k4953K0836J3157k594n336l9452
$$ 14165 3934 11750 18910 -11668 -3811 2713 -988 -25941 -5105 8052 5458 122 -39330
13684c9330n1962k2713K8667K7378K6114J2045J4780K4107M2868k7183m5133l6685
$$ -39330 -91292 -114005 -85338 -57960 -31846 -19801 -5021 19086 61954 34771 -10362 -47047
13672d7047j3221K3301k774O902L8013J9355m712k137P135j4537k1790n447J5131
$$ -47047 -60268 -36967 -39741 -32839 5174 24529 19817 17680 24815 10278 -11512 -16959 -1828
13659a828l96j0690o51J2241j8411k4830J1672N935L859Q760M9694J6884k0976
$$ -1828 -2224 -12914 -13565 -1324 -19735 -44565 -32893 -26958 -23099 -14339 35355 52239 31263
13646C1263k6761j4622L2828R317O740k3235j0498K7620O057j2344p199n784K142
$$ 31263 4502 -10120 22708 32025 38765 15530 5032 32652 38709 26365 19166 13382 15524
13633A5524J5048N220q676k6405j1634m246O80l06j503K6664L4535K5786k5980
$$ 15524 30572 35792 27116 711 -10923 -15169 -14489 -14795 -16298 10366 44901 70687 44707
13620D4707j0321m711N607k3675k0754n879j4623J1730J7428j5011k1461j1082
$$ 44707 34386 29675 35282 11607 -9147 -15026 -29649 -17919 -491 -15502 -36963 -48045
13608d8045k73J1633j300l197J7686N865P088J0221Q083M983J5451N910M350j1268
$$ -48045 -48318 -36685 -37985 -41182 -23496 -17631 -10543 -322 7761 12744 28195 34105 38455 27187
13594B7187j5099m1217r624P294P88j6767K2239K4207j3778q35K8357L7722n249
$$ 27187 12088 -29129 -38753 -31459 -30671 -47438 -25199 -992 -14770 -15605 12752 50474 45225
13581D5225J3388j1342n4163j3741K0369J9939J8979k2493k5888L618l977J3337
$$ 45225 58613 47271 -6892 -20633 -264 19675 38654 16161 -9727 -6109 -10086 3251
13569C251K1961K0443o533N998r261J6469J2702l0694l2454j3249J4476N288J2051
$$ 3251 25212 45655 39122 45120 35859 52328 65030 34336 1882 -11367 3109 8397 20448
13556B0448K9499K738q999P828j6297M364J4248p209N420k046l632L0069K9796
$$ 20448 49947 52685 43686 51514 35217 39581 53829 46620 52040 49994 46362 76431 106227
13543A06227J4119k8313q1P630j7084J3268k7096l3519n163K0138L4210K959j0977
$$ 106227 120346 92033 91952 99582 82498 95766 68670 35151 29988 50126 84336 87295 76318
13530G6318m396K1222J1695j2942o750k3325O667N388j8467l9404P096K4880l846
$$ 76318 71922 93144 104839 91897 85147 61822 68489 73877 55410 16006 23102 47982 44136
13517D4136l49q317k552p626J7126N100o978L353m066j171K4502L2463q390j9565
$$ 44136 43787 35470 32918 25292 42418 47518 40540 43893 39827 38656 63158 95621 87231 67666
13503F7666J9761q672K4320Q512j2798o731j71N5600N3310J102K4130M4067L9869
$$ 67666 87427 78755 103075 111587 98789 92058 91887 147487 200797 201899 226029 270096 309965
13490C09965N7872J02240J37413J71282K28537K97740K78900K90967K18584J37938
$$ 309965 367837 470077 607490 778772 1007309 1305049 1583949 1874916 2093500 2231438
13480B231438O3355p7547k03505k91207k96839k86542k35423j62178j18018p5711
$$ 2231438 2294793 2217246 2013741 1722534 1425695 1139153 903730 741552 623534 547823
13470E47823m8748l5586k8621m1096n2408o1534j9345J4177j7311r372o176l6391
$$ 547823 499075 463489 434868 393772 341364 279830 260485 274662 257351 247979 241803 205412
13458B05412m9482P052Q875j6910q819J546j8765k0501n171k3013K094R328j924
$$ 205412 155930 162982 171857 154947 146128 147674 128909 108408 103237 80224 82318 91646 89722
13445H9722J6295j6866j5537n963k5520q905n119J1538J3216l674n529m534l0273
$$ 89722 106017 89151 73614 67651 42131 33226 28107 39645 52861 49187 43658 39124 8851
13432H851K6542J2316k3125j4003k697l299Q564j4440m882r056O737k1532j482
$$ 8851 35393 47709 24584 10581 7884 4585 13149 -1291 -6173 -15229 -8492 -30024 -31506
13419c1506J5688j536K1767P309l074l235m655j1822q485j0973m778j496j5529
$$ -31506 -15818 -17354 4413 11722 8648 5413 758 -11064 -19549 -30522 -35300 -36796 -52325
13406e2325O1306M9981p926k9431l1146k1524R214p817m714J4763J0862k4919
$$ -52325 8981 58962 51036 21605 -9541 -31065 -21851 -29668 -34382 -19619 -8757 -33676
13394c3676j536K1331K245p507J433j684q130J6737O497j5771j6244k5421J090
$$ -33676 -35212 -13881 -11636 -19143 -17710 -19394 -27524 -10787 -4290 -20061 -36305 -61726 -60636
13381f0636R039Q609K1421k983q384L701j2174k5705j8344J6249J7002j6580j4619
$$ -60636 -51597 -42988 -21567 -24550 -32934 -29233 -41407 -67112 -85456 -69207 -52205 -68785 -83404
13368h3404M5032L0380K894L64K0604j0066k4460j4282j0911K285J6809j6148
$$ -83404 -38372 -7992 -5098 -4734 15870 5804 -18656 -32938 -43849 -41564 -24755 -40903
13356d0903O647J0685j0639L317m22r317J6137K1754j920k4455J5381J5458l413
$$ -40903 -34256 -23571 -34210 -30893 -31315 -40632 -24495 -2741 -4661 -29116 -13735 1723 -1690
13343a690j9124o735K866l8712K402K8224k7745J1045L9061M5083P263j2291j8663
$$ -1690 -20814 -27549 -24683 -63395 -60993 -32769 -60514 -49469 -10408 34675 41938 29647 10984
13330A0984j9619p15J9343J987K8462Q487J7039J8692M4902M6530J9031K8328
$$ 10984 -8635 -9350 9993 11980 40442 48929 65968 84660 129562 176092 195123 223451
13318B23451L8506j8237r34K559k4712l7970l5650m1499j9396j3687k3815p381
$$ 223451 261957 243720 242786 245345 220633 182663 147013 105514 86118 72431 48616 41235
13306D1235l579r773K4055K4141j6354j0756O984k1603k2911J8497J6717m622
$$ 41235 37656 27883 51938 76079 59725 48969 55953 34350 11439 29936 46653 42031
13294D2031N399n235p360L8974M205k5473M940L4303R542J8555p668M697L5942
$$ 42031 47430 42195 34835 73809 78014 52541 57481 91784 101326 119881 112213 116910 152852
13281A52852L4966M1607N7408R3990J19016J32347J54315J06710N5507M0249j0487
$$ 152852 187818 229425 286833 380823 499839 632186 786501 893211 948718 988967 978480
13270I78480o8045r1107j30426j33025r4561m8766j1514K1691K0903k286p727
$$ 978480 910435 819328 688902 555877 461316 412550 401036 422727 443630 441344 433617
13259D33617R143P271m4863n9415o0405l4809O253k1511k8683R498L5133N5784
$$ 433617 442760 450031 405168 345753 285348 250539 256792 235281 206598 216096 251229 307013
13247C07013M4059N1604J2799K034O618l2069l3338k8669o2231l3880J5291L3695
$$ 307013 351072 402676 415475 417509 424127 392058 358720 330051 267820 233940 249231 282926
13235B82926N7034P4763Q3444J42006J38539J47176J01027O7590L3601L5702m0425
$$ 282926 339960 414723 498167 640173 778712 925888 1026915 1094505 1128106 1163808 1123383
13224A123383j22974j49214r1693m0326M1412J14589J32570J17841N4967L444
$$ 1123383 1000409 851195 759502 719176 760588 875177 1007747 1125588 1180555 1183999
13214A183999j8479n2524j19883j59308j69473j11689m1507r264R475N1618J03209
$$ 1183999 1165520 1112996 993113 833805 664332 552643 511136 501872 511347 562965 666174
13203F66174J38326J24139J02965O4234l380n4441q4614j30840j49926j44700
$$ 666174 804500 928639 1031604 1095838 1092458 1038017 953403 822563 672637 527937
13193E27937j10610m3441k9049l8613J4148N6780L5403N3037L2405O187l715L0554
$$ 527937 417327 373886 344837 306224 320372 377152 412555 465592 497997 504184 500469 531023
13181E31023L6544Q075m2268n7018M103P0950J25010J91989J77846J04991L5090
$$ 531023 567567 575642 533374 476356 480459 551409 676419 868408 1046254 1151245 1186335
13170A186335L1929R363o2761j55266k07827j71658r7403o6764k2354M8300P0676
$$ 1186335 1218264 1227627 1164866 1009600 801773 630115 532712 465948 443594 491894 562570
13159E62570J36377J45724J37004R5209N0171J8993l1282p8699j52451j62390
$$ 562570 698947 844671 981675 1076884 1127055 1146048 1114766 1036067 883616 721226
13149G21226j45095j10763m4056n4069n8673m6153m2456k6008K1215J2576k687
$$ 721226 576131 465368 421312 367243 308570 262417 219961 193953 215168 227744 225057
13138B25057R591r373P113O296o090R191J8128P13L4898M2137J8890L0360L3250
$$ 225057 234648 225275 232388 238684 232594 241785 259913 260626 295524 337661 356551 386911 420161
13125D20161M8469Q113l5839q5587o1602n5766l9822L743j7153j3381N601J6526
$$ 420161 468630 476743 440904 355317 293715 237949 198127 201870 184717 171336 176937 193463
13113A93463L4535P6048M9502K4190j3068l8922l2317k0102k4714o0082o8686
$$ 193463 227998 304046 353548 377738 364670 325748 293431 273329 248615 188533 119847
13102A19847k8415Q021j1068q625r027j333q439j7579k947N354L8507P574k9652
$$ 119847 91432 99453 88385 79760 70733 69400 60961 43382 40435 45789 84296 91870 62218
13089F2218l1101j4718l224k313n946j5657j269J5004M90m3511j1396J6039R030
$$ 62218 31117 16399 13175 10862 4916 -10741 -12010 2994 3484 -40027 -51423 -35384 -26354
13076b6354n540n929J4081n285l952j8285j4168J0604N044P443J7635K8181K1783
$$ -26354 -31894 -37823 -23742 -29027 -32979 -51264 -65432 -54828 -49784 -42341 -24706 3475 25258
13063B5258q218J9177K5070J7742q301J2453K871P999k1566l1169p655j4845o976
$$ 25258 17040 36217 61287 79029 70728 83181 86052 94051 72485 41316 33661 18816 11840
13050A1840m717J631o417q312J9682J7348o288j7147k6775m2028j4639R475L0697
$$ 11840 7123 8754 2337 -5975 13707 31055 24767 7620 -19155 -61183 -75822 -66347 -35650
13037c5650K8355N904j4290M690M15k1535j2139K037O31o699j1850j21j1714K6907
$$ -35650 -7295 -1391 -15681 -10991 -10576 -32111 -44250 -42213 -41582 -48281 -60131 -60252 -71966 -45059
13023d5059M1144q319k7673j6562P862p65J249O511P421k83M475K2294N585k4675
$$ -45059 -3915 -12234 -39907 -56469 -48607 -49372 -48123 -41612 -34191 -34474 -29999 -7705 -2120 -26795
13009b6795K2552M075r219l582N647j1516m4242O344l958J1076M934n875J5684
$$ -26795 -4243 -168 -9387 -12969 -7322 -18838 -63080 -56736 -60694 -49618 -44684 -50559 -34875
12996c4875J795J3438J9060P030p989j8440j5370m801j5118k8449P518L3104K9498
$$ -34875 -33080 -19642 -582 6448 -1541 -19981 -35351 -40152 -55270 -83719 -76201 -43097 -13599
12983a3599j4404j1199m238J5195M178p824k6383n582K0731l091k12K594j7245
$$ -13599 -28003 -39202 -43440 -28245 -24067 -31891 -58274 -63856 -43125 -46216 -46428 -43834 -61079
12970f1079k4259j8108K4739L1260r884j471k9749O608J9581N790K4163Q274k7929
$$ -61079 -85338 -103446 -78707 -47447 -57331 -58802 -88551 -81943 -62362 -56572 -32409 -24135 -52064
12957e2064j946n110J7859L525j2703K4193O815M427k028l5254N064M0389k8543
$$ -52064 -54010 -59120 -41261 -37736 -50439 -26246 -19431 -15004 -17032 -52286 -47222 -6833 -35376
12944c5376j9808L0908K1802r770R621k7189l5805l4499K4262J9309K0131J548
$$ -35376 -55184 -24276 -2474 -12244 -2623 -29812 -65617 -100116 -75854 -56545 -36414 -34866
12932c4866R832k3038q205K0421L8970j9803l5201j2005Q024P187j7528Q333O248
$$ -34866 -25034 -48072 -56277 -35856 3114 -16689 -51890 -63895 -55871 -48684 -66212 -57879 -51631
12919e1631L929K4385J2584l3292k1813J2319K7603j2526m171M0507m370k1328
$$ -51631 -47702 -23317 -10733 -44025 -65838 -53519 -25916 -38442 -42613 -2106 -6476 -27804
12907b7804J958K0593K0381j1720j5479l602J2245O496o777j7461q654O000Q155
$$ -27804 -25846 -5253 15128 3408 -12071 -15673 -3428 3068 -3709 -21170 -29824 -23824 -15669
12894a5669M783r59K8769m6695k5470K506j0192m728l293K7568K6363J8071r853
$$ -15669 -10886 -11845 16924 -29771 -55241 -52735 -62927 -67655 -70948 -43380 -17017 1054 -8799
12881h799K4332L238j4680j5125j2233J2598m903K4275o580r707q848K7169N315
$$ -8799 15533 18771 4091 -11034 -23267 -10669 -15572 8703 2123 -7584 -16432 10737 16052
12868A6052J6625P585L442m117k2038q877j651j0550k4997j64m60L3881O489o0165
$$ 16052 32677 40262 43704 39587 17549 8672 7021 -3529 -28526 -28690 -29150 4731 11220 -48945
12854d8945l5646k7081K0421K011J2713L5794P473m619K665M986k3595K9866J2238
$$ -48945 -84591 -111672 -91251 -89240 -76527 -40733 -33260 -37879 -35214 -30228 -53823 -23957 -11719
12841a1719j8278l8695m263K9706K5643P065k1352m679k156k4524j8575J1208
$$ -11719 -29997 -68692 -72955 -43249 -17606 -10541 -31893 -36572 -38728 -63252 -81827 -70619
12829g0619J9211P469j712j1317j732j545K2054l310m054M144L2431J8766m620
$$ -70619 -51408 -43939 -45651 -56968 -58700 -60245 -38191 -41501 -45555 -41411 -8980 9786 5166
12816E166j8139l0710j2828j1723m934O832J6755k2172m566M432J5038j9681K2223
$$ 5166 -12973 -43683 -56511 -68234 -73168 -66336 -49581 -71753 -76319 -71887 -56849 -76530 -54307
12803e4307L5996N260O075j6735l1912j5893J7432k729j3817J804j3374L806M356
$$ -54307 -18311 -13051 -6976 -23711 -55623 -71516 -54084 -56813 -70630 -68826 -82200 -78394 -74038
12790g4038k051k568N853P486J8870K1573J7239K2666m290l9295l0583Q041N1151
$$ -74038 -76089 -78657 -72804 -65318 -46448 -24875 -7636 15030 10740 -28555 -59138 -51097 54
12777E4j3446k3216J1140R554r141J1081L0906k1941J2506K189l959k0897m0605
$$ 54 -13392 -36608 -25468 -15914 -25055 -13974 16932 -5009 7497 9686 5727 -15170 -55775
12764e5775j4602k1120P329L2004j151j2898o356N908O779j0443p358j93J3370
$$ -55775 -70377 -91497 -84168 -52164 -53315 -66213 -72569 -66661 -59882 -70325 -77683 -77876 -64506
12751f4506K3129l8031k586Q02K2075J1973m146J2121M09l316J6473k70j6436
$$ -64506 -41377 -79408 -81994 -81192 -59117 -47144 -51290 -39169 -38760 -42076 -25603 -25873 -42309
12738d2309m3193K6318J1017l378Q380Q615K8866L4694J3514l2277l5275m481
$$ -42309 -85502 -59184 -48167 -51545 -43165 -34550 -5684 29010 42524 10247 -25028 -29509
12726b9509J2343J0651j7243O892L6127k7933j492K8469K6787j4317m0247m583
$$ -29509 -17166 -6515 -23758 -16866 19261 -8672 -10164 18305 45092 30775 -9472 -14055
12714a4055K4018J0104o871P195P42j9969J6684o662R03n744J8163k2163k140
$$ -14055 9963 20067 13196 20391 21133 1164 17848 11186 12089 6345 24508 2345 205
12701B05j3868O652r694j7452L2102r077k0684l904M081M636J7179j9963k9116
$$ 205 -13663 -7011 -16705 -34157 -2055 -11132 -31816 -35720 -31639 -27003 -9824 -29787 -58903
12688e8903l884l763K1558K9196Q304n661m793J9275J8801Q576j7532j3437J6390
$$ -58903 -62787 -66550 -44992 -15796 -7492 -13153 -17946 1329 20130 28706 11174 -2263 14127
12675A4127j6555j3138o898j7183j4703N360J4474K1067J493J2251J6632J9312
$$ 14127 -2428 -15566 -22464 -39647 -54350 -48990 -34516 -13449 -11956 295 16927 36239
12663C6239j1634j270Q24l4425m0111Q714J2465R94n608p486n584M0521J1792
$$ 36239 24605 23335 24159 -10266 -50377 -41663 -29198 -28204 -33812 -41298 -46882 -6361 5431
12650E431L217k929o081m336k559o210j2993k4241J4461m973J733K2548n223k6260
$$ 5431 8648 5719 -362 -4698 -7257 -13467 -26460 -50701 -36240 -41213 -39480 -16932 -22155 -48415
12636d8415K689l493Q162L385P559J1458j543k5450j4543J645K5510j442Q133
$$ -48415 -45726 -49219 -41057 -37672 -30113 -18655 -20198 -45648 -60191 -58546 -33036 -34478 -26345
12623b6345m482J1455j2670l5159L936J8204J2900L4389j7627k7831K4831L9194
$$ -26345 -30827 -19372 -32042 -67201 -63265 -45061 -32161 2228 -15399 -43230 -18399 20795
12611B0795k4593l4787j3257O320J7832l23j7844R599J065K3763j4689m4433m654
$$ 20795 -3798 -38585 -51842 -45522 -27690 -28013 -45857 -36258 -35193 -11430 -26119 -70552 -75206
12598g5206J1362J4795J0581m600j218Q976K1977r562j8720j5872o723j5576J6586
$$ -75206 -63844 -49049 -38468 -43068 -44286 -35310 -13333 -22895 -41615 -57487 -64210 -79786 -63200
12585f3200L0148k4800j7766K3895J6867P811L1335N894j1999j2214J3400j1164
$$ -63200 -33052 -57852 -75618 -51723 -34856 -27045 4290 10184 -1815 -14029 -629 -11793
12573a1793j4681J0873R830K6250J7610L579j5814j3587l1225l917J51K8916o343
$$ -11793 -26474 -15601 -5771 20479 38089 41668 25854 12267 -18958 -22875 -22724 6192 -151
12560a51j9200j9022n957O631J4903K710l1512j6671J4859L3868L4017j0320J1138
$$ -151 -19351 -38373 -44330 -37699 -22796 -20086 -51598 -68269 -53410 -19542 14475 4155 15293
12547A5293J0969p409J9499J0162m079l2725n1899j4326J3100m799L89N349J896
$$ 15293 26262 18853 38352 48514 44435 11710 -40189 -54515 -41415 -46214 -45825 -40476 -38580
12534c8580K601J6026j7578O692J1259N74o218K439J7359R723j2004j0826m238
$$ -38580 -35979 -19953 -37531 -30839 -19580 -19006 -25224 -22785 -5426 4297 -7707 -18533 -22771
12521b2771P469P484j614r998k5712r416J3580M206K4396r273j4008j3030K425
$$ -22771 -15302 -7818 -9432 -19430 -45142 -54558 -40978 -36772 -12376 -21649 -35657 -48687 -46262
12508d6262N879J951J1794j2292j2424k2274R274M0024Q039j4349j2334J7972
$$ -46262 -40383 -38432 -26638 -38930 -51354 -73628 -64354 -24330 -16291 -30640 -42974 -25002
12496b5002M3434p941l2048L028m846o645J7920J2346J753J0122Q938K259J3663
$$ -25002 18432 10491 -21557 -18529 -23375 -30020 -12100 246 1999 12121 21059 23318 36981
12483C6981k6865j6623J8812p77j9641j4786R501j2946j9637K440J6705j4372
$$ 36981 10116 -6507 12305 11528 -8113 -22899 -13398 -26344 -45981 -43541 -26836 -41208
12471d1208Q952L52o130k939J939K184L1211K0100o680N340J4431l0091k3569
$$ -41208 -32256 -31904 -38034 -40973 -39034 -36850 -5639 14461 7781 13121 27552 -2539 -26108
12458b6108l0859L4385L9582J0117k4654k7720L483K3485j330P525K637P246k7923
$$ -26108 -56967 -22582 17000 27117 2463 -25257 -21774 1711 381 7906 10543 17789 -10134
12445a0134j0652r808K6481L2468J7733j3710m2663j6409O624r076o385L6481
$$ -10134 -20786 -30594 -4113 28355 46088 32378 -10285 -26694 -20070 -29146 -35531 950
12433I50M350m2724p68K3767j2607j4863Q094J1316M4383K4145j8755l6488l441
$$ 950 5300 -37424 -38192 -14425 -27032 -41895 -33801 -22485 21898 46043 27288 -9200 -12641
12420a2641m263j8103L5557L331j9001Q086J0053M935J5574j8513j8485j693j4754
$$ -12641 -16904 -35007 550 3881 -15120 -7034 3019 7954 23528 5015 -13470 -15163 -29917
12407b9917j1325K5101R112j0301p577m873L3k682P716O521R860j263j7638o297
$$ -29917 -41242 -16141 -7029 -17330 -24907 -29780 -29747 -32429 -24713 -18192 -8332 -9595 -27233 -33530
12393c3530J2737K1972n12l6155j242p927J3608j1165j7080M962Q927O351r376
$$ -33530 -20793 1179 667 -35488 -36730 -44657 -31049 -42214 -59294 -54332 -45405 -39054 -48430
12380d8430l217j4795J1917m373k198J7872K1588L7455k8757m058L6254l910k6463
$$ -48430 -51647 -66442 -54525 -58898 -61096 -43224 -21636 15819 -12938 -16996 19258 15348 -11115
12367a1115j9613J9246J4877j749j8115L1402L8166N045n204k0425J753K9662
$$ -11115 -30728 -11482 3395 1646 -16469 14933 53099 58144 52940 32515 34268 63930
12355F3930J0038o092Q720L8857K3971k2102r80K8717L4739J3111J7250L9186
$$ 63930 73968 67876 76596 115453 139424 117322 116342 145059 179798 192909 210159 249345
12343B49345K8323N5187O8325P1091N9214O7827N5872P9931N4996M8937P532m9882
$$ 249345 277668 332855 401180 472271 531485 599312 655184 735115 790111 839048 846580 796698
12331G96698k7626k3373n7676o5084q4297m7988k4623q494l3766m0634m2147l6307
$$ 796698 769072 745699 688023 622939 538642 490654 466031 457537 423771 383137 340990 304683
12319C04683k4748l6626p667k4860m6197p237K017Q018o724k5081J455q665j6785
$$ 304683 279935 243309 235642 210782 164585 157348 159365 167383 160659 135578 137033 128368 111583
12306A11583k0610j1896j8318j8516p67M569J0008j2512K7916J7312m464j5516
$$ 111583 90973 79077 60759 42243 41476 46045 56053 43541 71457 88769 84305 68789
12294F8789Q49j1636J5443J845K1544J4773k0485l107K4194K2204OL9037N4296
$$ 68789 69638 58002 73445 75290 96834 111607 91122 88015 112209 134413 134419 173456 227752
12281B27752O5166J00197K7988k3054l3816r47k5554j12689p2356l8168k8400
$$ 227752 292918 393115 421103 398049 364233 363286 337732 225043 152687 114519 86119
12270H6119q125o626j4669M897J026Q306l9728r607R644k4415r09o336Q225m108
$$ 86119 77994 71368 56699 61596 62622 70928 31200 21593 31237 6822 5913 -423 7802 3694
12256C694J5386K4928P007M573l397j9098L974J1842k202J6837J1046L051l7690
$$ 3694 19080 44008 51015 55588 52191 33093 37067 48909 46707 63544 74590 77641 39951
12243C9951K5323K1366K6586J0341M117M2028N1060N3654L6537P924k787K2084
$$ 39951 65274 86640 113226 123567 127684 169712 220772 274426 310963 318887 316100 338184
12231C38184q942o7786r1719o6908m9903j6844J2385j371k7879j8101q149j8707
$$ 338184 329242 261456 169737 102829 52926 36082 48467 47096 19217 1116 -7033 -25740
12219b5740k4314K0544N879J2724K1992o55q980k5600n775q697K9093K1249Q106
$$ -25740 -50054 -29510 -23631 -10907 11085 10430 1450 -24150 -29925 -38622 -9529 11720 19826
12206A9826q712Q989R579q826O869l1056l0933K9869J8873J5562j4712m2692K6210
$$ 19826 11114 20103 29682 20856 27725 -3331 -34264 -4395 14478 30040 15328 -27364 -1154
12193a154J9527K5247R526j8772O4836L9057n919m3457m1541k6705j2422r108
$$ -1154 18373 43620 53146 34374 99210 138267 132348 88891 47350 20645 8223 -885
12181h85R366K924j3143J7253J0343j3970k5959j86j6810k302M612m499j0607
$$ -885 8481 11405 -1738 15515 25858 11888 -14071 -14257 -31067 -33369 -28757 -33256 -43863
12168d3863r792J5822l646J2163r072k6052L845J8465J0841K340R351R01j7382
$$ -43863 -53655 -37833 -41479 -29316 -38388 -64440 -60595 -42130 -31289 -28949 -19598 -18697 -36079
12155c6079k156K4650j7747k1184J3537l656J413L233J4294K3648K9957L8428
$$ -36079 -38235 -13585 -31332 -52516 -38979 -42635 -41222 -37989 -23695 -47 29910 68338
12143F8338j8257j1130R401p319j2858J7160j4415k9421k4989O845K0737k1782
$$ 68338 50081 38951 48352 41033 28175 45335 30920 1499 -23490 -16645 4092 -17690
12131a7690j0656K8431r997l2466q36J8704O969J0216K738Q405o954j2805k1246
$$ -17690 -28346 85 -9912 -42378 -43214 -24510 -17541 -7325 -4587 3818 -3136 -15941 -37187
12118c7187p031R818K3448J3422M12o069q833j162O779O043j5213q270r885L0551
$$ -37187 -44218 -34400 -10952 2470 2882 -3187 -12020 -13182 -6403 -360 -15573 -23843 -33728 -3177
12104c177J5697k1958o828L5640O995J20p886j3826j0582j5533j6507J460K0454
$$ -3177 12520 -9438 -16266 19374 26369 26489 18603 4777 -5805 -21338 -37845 -36385 -15931
12091a5931J4891o067k6211L658Q402J1412J4171l1392k0307J426L2845j1275
$$ -15931 -1040 -7107 -33318 -29660 -21258 -9846 4325 -27067 -47374 -45948 -13103 -24378
12079b4378l3221K946K5400n816J5682j3519r830k787N670K1805L099k4313r291
$$ -24378 -57599 -54653 -29253 -35069 -19387 -32906 -42736 -45523 -39853 -18048 -14949 -39262 -48553
12066d8553K7868M0248l6707k6989J7262k1229k5458m904J2041L608K1714M5857
$$ -48553 -20685 19563 -17144 -44133 -26871 -48100 -73558 -78462 -66421 -62813 -41099 4758
12054D758N113K5911r729N334k8529o551P012K193j9289q933J5124N374j0842
$$ 4758 9871 35782 26053 31387 2858 -3693 3319 5512 -13777 -22710 -7586 -2212 -13054
12041a3054p426K5812K7821n477Q139k1142j7194J5932k2960j5603n935m00K2591
$$ -13054 -20480 5332 33153 27676 35815 14673 -2521 13411 -9549 -25152 -31087 -31487 -8896
12028h896L4090j7244l4031j7199R641K7683J9851J0568M44j1768k8769K4183
$$ -8896 25194 7950 -26081 -43280 -33639 -5956 13895 24463 24907 13139 -15630 8553
12016H553O437J4453J1129K9175j6284l634m026Q015J6852j8995j9160k7175P582
$$ 8553 14990 29443 40572 69747 53463 49829 45803 53818 70670 51675 32515 5340 12922
12003A2922j4450j817R752Q592J0173j2059k0890J7770O963k0642j4296j3191
$$ 12922 -1528 -3345 6407 14999 25172 13113 -7777 9993 16956 -3686 -17982 -31173
11991c1173j3541R557P462J7674K747K8472J8003j6918k470l2441k4625j8625
$$ -31173 -44714 -35157 -27695 -10021 -7274 21198 39201 22283 19813 -12628 -37253 -55878
11979e5878J0181L0958J7715o298O098N028j946n129k5078J164K3742J5024J1904
$$ -55878 -45697 -14739 2976 -3322 2776 7804 5858 729 -24349 -23185 557 15581 27485
11966B7485j635k2655l8849j359N832k596N600o236J4972j1075K2546K144j8079
$$ 27485 25850 3195 -35654 -37013 -31181 -33777 -28177 -34413 -19441 -30516 -7970 -5826 -23905
11953b3905J6194P748k1508K4179J0884k0365k5215K0904L693k8682R708r193
$$ -23905 -7711 37 -21471 2708 13592 -6773 -31988 -11084 -7391 -36073 -26365 -35558
11941c5558j5405m433K6642K8079J8273J1155j0885P121N264j5328l2223j8485
$$ -35558 -50963 -55396 -28754 -675 17598 28753 17868 24989 30253 14925 -17298 -35783
11929c5783J4359J7774o644N854J545j0225j1674j8268j2819p334J9821J6158
$$ -35783 -21424 -3650 -10294 -4440 -2895 -13120 -24794 -43062 -55881 -63215 -43394 -27236
11917b7236j4953k3713q203Q458K2542Q698K2529N248Q954m757p464P831l31j6345
$$ -27236 -42189 -65902 -74105 -65647 -43105 -34407 -11878 -6630 2324 -2433 -9897 -2066 -2397 -18742
11903a8742j0467k1604j0307J7234J5299k1879R954J4354j4921K6410K9593k7464
$$ -18742 -29209 -50813 -61120 -43886 -28587 -50466 -40512 -26158 -41079 -14669 14924 -12540
11891a2540k593m700j9352Q740k7136j6122P461M1078N542J0329J2287k4314j9593
$$ -12540 -15133 -19833 -39185 -30445 -57581 -73703 -66242 -25164 -19622 -9293 2994 -21320 -40913
11878d0913O736l1607m690J5115j616R892J3298P540l6022n060J319K1585q404
$$ -40913 -34177 -65784 -70474 -55359 -56975 -47083 -33785 -26245 -62267 -67327 -66008 -44423 -52827
11865e2827K0077p845R562k273m542J7822J0200O477J6215J2035n397j2958k7325
$$ -52827 -32750 -40595 -31033 -33306 -37848 -20026 -9826 -3349 12866 24901 19504 6546 -20779
11852b0779p731R230l88j0768J0270n077n477P047R068J1478j3352j3093j0141
$$ -20779 -28510 -19280 -19668 -30436 -20166 -25243 -30720 -23673 -14605 -3127 -16479 -29572 -39713
11839c9713j3136L0813J1402J2064l653K6193j670j7939J3512k2719j0099J7995
$$ -39713 -52849 -22036 -10634 1430 -2223 23970 22300 4361 17873 -4846 -14945 3050
11827C050L526j8243j4744j7079j1296P655j0557N413J9486k6351K819K8465L5135
$$ 3050 6576 -11667 -26411 -43490 -54786 -47131 -57688 -52275 -32789 -59140 -56321 -27856 7279
11814G279R182k8541Q78j809k109Q771R196N538J5852l6905P656J5989k5103k2254
$$ 7279 16461 -12080 -11202 -13011 -15120 -6349 2847 8385 24237 -12668 -5012 10977 -14126 -36380
11800c6380q665j1866k2009p167J8699J3752L3200J5729j846j8497J235k1617
$$ -36380 -45045 -56911 -78920 -86087 -67388 -53636 -20436 -4707 -6553 -25050 -23815 -45432
11788d5432k355K7997j9992j3168J6393K2405k783k1084K3981L387j8293R828
$$ -45432 -47787 -19790 -39782 -52950 -36557 -14152 -16935 -38019 -14038 -10651 -28944 -19116
11776a9116K9288k2633j4433j7993j5944J5955l010q823j0077n573J0674L2197
$$ -19116 10172 -12461 -26894 -44887 -60831 -44876 -47886 -56709 -66786 -72359 -61685 -29488
11764b9488L5296J1666m217k3479j7900o494j64K1554J0095j9293j8068m715j0796
$$ -29488 5808 17474 13257 -10222 -28122 -34616 -34780 -13226 -3131 -22424 -40492 -45207 -56003
11751e6003K096K4247L4784p192p666J911K2112j9195j6396N713Q091o349k1277
$$ -56003 -53907 -29660 5124 -2068 -9734 -7823 14289 -4906 -21302 -15589 -7498 -13847 -35124
11738c5124q368K2971K657Q548J904K385J0888j0719j3163m641Q31m107j4982
$$ -35124 -43492 -20521 -17864 -9316 -7412 -5027 5861 -4858 -18021 -22662 -21831 -25938 -40920
11725d0920k4896K0559K2479K574j7042K570J0109K5089n65r734j5448j9755k7017
$$ -40920 -65816 -45257 -22778 -20204 -37246 -34676 -24567 522 -43 -9777 -25225 -44980 -71997
11712g1997K2041L909j3282M955Q211K3782M581n296j5305r00J7981J7858j1677
$$ -71997 -49956 -46047 -59329 -54374 -46163 -22381 -17800 -23096 -38401 -39301 -21320 -3462 -15139
11699a5139j566l6471N861L0403L2j5472j2630k050j660j580q903r958M838L1916
$$ -15139 -16705 -53176 -47315 -16912 -16880 -32352 -44982 -47032 -48692 -50272 -59175 -69133 -64295 -32379
11685c2379J307j0141K4275J1120J303k7500k2520k8809J1850M2142k2397j9664
$$ -32379 -31072 -41213 -16938 -5818 -4515 -32015 -54535 -83344 -71494 -29352 -51749 -71413
11673g1413L0540m897l1495j7478R843K8802n805N46L39M6360r583j7175J2775
$$ -71413 -40873 -45770 -77265 -94743 -84900 -56098 -61903 -61357 -61018 -14658 -24241 -41416 -28641
11660b8641N809P811j6829J4732J0792P239J917l5175j280l28j7824K1282K5011
$$ -28641 -22832 -15021 -31850 -17118 -6326 913 2830 -32345 -33625 -33953 -51777 -30495 -5484
11647e484K9807O748j5162p652j5943j3693j6628k5302n960P849O475J1668j7897
$$ -5484 24323 31071 15909 8257 -7686 -21379 -38007 -63309 -69269 -61420 -54945 -43277 -61174
11634f1174O443j459J3332k1383J4916k599K034k770j379L1172K0363j2103j3877
$$ -61174 -54731 -56190 -42858 -64241 -49325 -51924 -49890 -52660 -54039 -22867 -2504 -14607 -28484
11621b8484j0719O063L50j6111k2513K246L7005J5309j2156K898J1560l9525p347
$$ -28484 -39203 -33140 -32790 -48901 -71414 -69168 -32163 -16854 -29010 -26112 -14552 -54077 -61424
11608f1424J6168L324J2712r088L89m1620k9230J7712J9645R087Q800j4163O999
$$ -61424 -45256 -41932 -29220 -38308 -37919 -79539 -108769 -91057 -71412 -62325 -53525 -67688 -60689
11595f0689J7917Q58R510J3093J032j3506Q868M036K0250p425J5230o020j3312
$$ -60689 -42772 -41914 -32404 -19311 -18279 -31785 -22917 -18881 1369 -6056 9174 3154 -10158
11582a0158j1715j2646K704j5542q687L6428K5746j2790l4263P813K771n138K714
$$ -10158 -21873 -34519 -31815 -47357 -56044 -19616 6130 -6660 -40923 -33110 -30339 -35477 -32763
11569c2763L1844L7163K0640k620j0455j1299l7897R993k8302o956l89l023J0915
$$ -32763 -919 36244 56884 54264 43809 32510 -5387 4606 -23696 -30652 -31041 -34064 -23149
11556b3149o997l842j787J8929Q583J4453o442j8005L71j894n974L666K8040J4511
$$ -23149 -30146 -33988 -35775 -16846 -8263 6190 -252 -18257 -17886 -19780 -25754 -22088 5952 20463
11542B0463j3537j6282K484j5700k0570j9221M242J4982m63p286p170j783q760
$$ 20463 6926 -9356 -6872 -22572 -43142 -62363 -58121 -43139 -43602 -50888 -58058 -59841 -68601
11529f8601k934n80J4629K0159L27p302k449j882k107J144p445L0912L581N770
$$ -68601 -71535 -72115 -57486 -37327 -37000 -44302 -46751 -48633 -50740 -49596 -57041 -26129 -22548 -16778
11515a6778p412J9540O34J8478j716j4724j4961j6580k1222J0672L9050J2926
$$ -16778 -24190 -4650 -4016 14462 12746 -1978 -16939 -33519 -54741 -44069 -5019 7907
11503G907J0393k8305k6430q390o621N286L4391R055j7297J2657l283k028j904
$$ 7907 18300 -10005 -36435 -44825 -51446 -46160 -11769 -2714 -20011 -7354 -10637 -12665 -14569
11490a4569J9795o643m312N554O841Q534l9499m0250K2584R992j062J1564n782
$$ -14569 5226 -1417 -5729 -175 6666 15200 -24299 -64549 -41965 -31973 -33035 -21471 -27253
11477b7253q783P176J377j3000k1139M1865J1076l0635l202n833R332K0239J4341
$$ -27253 -36036 -28860 -27483 -40483 -61622 -19757 -8681 -39316 -42518 -48351 -39019 -18780 -4439
11464d439J577n477k2005N037L3027R853k9826j2116l982j0516j5582k254J659
$$ -4439 -2862 -8339 -30344 -25307 7720 17573 -12253 -24369 -28351 -38867 -54449 -56703 -55044
11451e5044J3699K347p863j8816p863J0723L7373k989q731k7085K025L1625O758
$$ -55044 -41345 -38998 -46861 -65677 -73540 -62817 -25444 -28433 -37164 -64249 -62224 -30599 -23841
11438b3841P835K1275O734l650j3402l754m540l773n440j3280k8590P625J2027
$$ -23841 -16006 5269 12003 8353 -5049 -8803 -13343 -17116 -22556 -35836 -64426 -56801 -44774
11425d4774n523j2772J1469J5146j5959j3529J7141N7949J6076l554k7702l0109
$$ -44774 -50297 -63069 -51600 -36454 -52413 -65942 -48801 9148 25224 21670 -6032 -36141
11413c6141K550J0917J6647j8735K5777J4533J3450K0767l022l5071K012k5568
$$ -36141 -33591 -22674 -6027 -24762 1015 15548 28998 49765 46743 11672 13684 -11884
11401a1884k2358J421N159K4490j2K252j0791k7484k0972P274M523J5558K9112
$$ -11884 -34242 -32821 -27662 -3172 -3184 -932 -11723 -39207 -60179 -52905 -48382 -32824 -3712
11388c712K7539k5377k1441l777Q454m5776k1785J5318j2012L3071K1222j7858
$$ -3712 23827 -1550 -22991 -26768 -18314 -64090 -85875 -70557 -82569 -49498 -28276 -46134
11376d6134o651J9007R973R294j9751l1593J5266K5621J9222J175j0291l051k7853
$$ -46134 -52785 -33778 -23805 -14511 -34262 -65855 -50589 -24968 -5746 -4571 -14862 -17913 -45766
11363d5766l4888L3076k401q731l569J8515k8540j5041L2022L0795N7007L6957
$$ -45766 -80654 -47578 -49979 -58710 -62279 -43764 -72304 -87345 -55323 -24528 32479 69436
11351F9436j619l3386k6881o472J2468K211o146l074j0281j8950J6705J4434K77
$$ 69436 67817 34431 7550 1078 13546 15757 9611 6537 -3744 -22694 -5989 8445 8722
11338H722j9557k8653l3124o365L2006K2359m416j5494j3469K0288L5978J2775
$$ 8722 -10835 -39488 -72612 -78977 -46971 -24612 -29028 -44522 -57991 -37703 -1725 11050
11326A1050k937l1399j40k495j4687j2669j0737M000J4515K5673k4936k5317N429
$$ 11050 8113 -23286 -23426 -25921 -40608 -53277 -64014 -60014 -45499 -19826 -44762 -70079 -64650
11313f4650L5559J4465N144Q616l6269k4955k371R886M727K129J675K2477J1514
$$ -64650 -29091 -14626 -9482 -866 -37135 -62090 -64461 -54575 -49848 -47719 -46044 -23567 -12053
11300a2053j8305Q183J0418k149M520j4308l9563k0002N663K1405K1535k0578
$$ -12053 -30358 -22175 -11757 -13906 -9386 -23694 -63257 -83259 -77596 -56191 -34656 -55234
11288e5234Q554J1817j787P247J3458L927J6277Q082j3110j3755J6012J3693l3992
$$ -55234 -46680 -34863 -36650 -29403 -15945 -12018 4259 12341 -769 -14524 1488 15181 -18811
11275a8811l2119L213p9Q636Q098J6901j9368K200o92P941J4306J1663k522j3667
$$ -18811 -50930 -47717 -47796 -39160 -31062 -14161 -33529 -31329 -32021 -24080 -9774 1889 -633 -14300
11261a4300l5537j4306L639m537J3863J9553l37j7516L245O316J1613J3694K3495
$$ -14300 -49837 -64143 -60504 -65041 -51178 -31625 -31962 -49478 -46233 -39917 -28304 -14610 8885
11248H885K342j8346L3120r539K955J3721l9695j5085j4072q133M589Q389J3540
$$ 8885 11227 -7119 26001 16462 19417 33138 -6557 -21642 -35714 -43847 -39258 -30869 -17329
11235a7329J1396J5833j6975N704K1388k3561j5477k120p081j9280m331J2834
$$ -17329 -5933 9900 -7075 -1371 20017 -3544 -19021 -21141 -28222 -47502 -51833 -38999
11223c8999j323j47K7823J8120q29j4885O909l375J1393m414M803Q927k4192p169
$$ -38999 -40322 -40469 -12646 5474 4645 -10240 -3331 -6706 4687 273 5076 14003 -10189 -17358
11209a7358J5307j3647j6L2181p099l1326n456r596J8616Q146p046j6053n846
$$ -17358 -2051 -15698 -15714 16467 9368 -21958 -27414 -37010 -18394 -10248 -17294 -33347 -39193
11196c9193J7671J7120r77l948k2904k2088l67J3916l207k2426K034J9594J666
$$ -39193 -21522 -4402 -5379 -9327 -32231 -54319 -54686 -40770 -43977 -66403 -64369 -44775 -43109
11183d3109l3436q128o915J6638J8735J6830l020Q515J2352K776M776l4658J9703
$$ -43109 -76545 -84673 -91588 -74950 -56215 -39385 -42405 -33890 -21538 -18762 -13986 -48644 -28941
11170b8941K0636P019p98l8207j4823J8485K5666J8832j4207k6740J1265l1413
$$ -28941 -8305 -1286 -2084 -40291 -55114 -36629 -10963 7869 -6338 -33078 -21813 -53226
11158e3226j8035J019L7464N428j0633K8692K180K4834L1611J9314l711J1710
$$ -53226 -71261 -70242 -32778 -27350 -37983 -9291 -7111 17723 49334 68648 64937 76647
11146G6647N5338Q2736J08873M7232P258J7849J3744k5461m4817q9228r2468n5553
$$ 76647 131985 214721 323594 370826 378084 395933 409677 384216 339399 250171 157703 102150
11134A02150n0777j0014J5538J512j2697j1525j791j811o289P141K1539J2180
$$ 102150 51373 41359 56897 58409 45712 34187 32396 30585 24296 31437 52976 65156
11122F5156M519J471k6424l2386r918j2614J9910K650J6363k4391p695Q360n158
$$ 65156 69675 71146 44722 12336 2418 -10196 9714 12364 28727 4336 -3359 5001 -157
11109a57o028q866J3702k1081p997K0254K3716Q10r307k2342J0805K8919K0011
$$ -157 -6185 -15051 -1349 -22430 -30427 -10173 13543 14353 5046 -17296 -6491 22428 42439
11096D2439l252j0427j5667l2278k774K987K8155J8006m6836l4533J3474K1646
$$ 42439 39187 28760 13093 -19185 -21959 -18972 9183 27189 -19647 -54180 -40706 -19060
11084a9060j739N539J2524K4202j4080k1871N999J6769J3018r472k4390m276j4329
$$ -19060 -20799 -15260 -2736 21466 7386 -14485 -8486 8283 21301 11829 -12561 -16837 -31166
11071c1166r550J4788K8786K3165j3068j0020r260L1161L1155k7909n508N210
$$ -31166 -40716 -25928 2858 26023 12955 2935 -6325 24836 55991 28082 22574 27784
11059B7784O891K3545o836l2335l5835j6446j0376O928j0706O247J0630M592K362
$$ 27784 34675 58220 51384 19049 -16786 -33232 -43608 -36680 -47386 -41139 -30509 -25917 -23555
11046b3555q852j3395O973J1455l424N020r481K5735M8513j1270n6374n701j4298
$$ -23555 -32407 -45802 -38829 -27374 -30798 -25778 -35259 -9524 38989 27719 -28655 -34356 -48654
11033d8654J6440L9452j3222j2792q885k4329j7244R400J8480J9286p239l190
$$ -48654 -32214 7238 -5984 -18776 -27661 -51990 -69234 -59834 -41354 -22068 -29307 -32497
11021c2497J061l663n037P773J9778J358j2221r974J1597K390J3936L170n775
$$ -32497 -31436 -35099 -40136 -32363 -12585 -11227 -23448 -33422 -21825 -19435 -5499 -2329 -8104
11008h104l7255k932r512l86K8276J2106o065m800K537j0783J7107M781J330k2212
$$ -8104 -45359 -48291 -57803 -58189 -29913 -17807 -23872 -28672 -26135 -36918 -19811 -15030 -13700 -35912
10994c5912j0642j4707r088M004n136J3680J0848K5630n007m076r825o55j9682
$$ -35912 -46554 -61261 -70349 -66345 -71481 -57801 -46953 -21323 -26330 -30406 -40231 -40886 -60568
10981f0568Q718L2812j946O046J8274m968k2655j0912o889L3021J1840m215n849
$$ -60568 -51850 -19038 -20984 -14938 3336 -1632 -24287 -35199 -42088 -9067 2773 -1442 -7291
10968g291J0788J6083J2847m420j6634J396m6Q598o986k0696j5207o114n520J3958
$$ -7291 3497 19580 32427 28007 11373 12769 12723 21321 14335 -6361 -21568 -27682 -33202 -19244
10954a9244J8288K339j5165L163j446k2023l0390j8213J1187M513Q496M428m343
$$ -19244 -956 1383 -13782 -10619 -12065 -34088 -64478 -82691 -71504 -66991 -58495 -54067 -58410
10941e8410k556J3045j7562l4165k018L1138J0446R096J7142j0828M476L6766
$$ -58410 -60966 -47921 -65483 -99648 -101666 -70528 -60082 -50986 -33844 -44672 -40196 -3430
10929c430J6134j3093q087O127J7232M731p345J5713K370m3731k2525K5447M544
$$ -3430 12704 -389 -8476 -2349 14883 19614 12269 27982 30352 -13379 -35904 -10457 -5913
10916e913l626m449Q964p182k3442q967k3142K9153L199j041j4739q253J298O510
$$ -5913 -9539 -13988 -5024 -12206 -35648 -44615 -67757 -38604 -35405 -36446 -51185 -59438 -58140 -51630
10902e1630o760Q196L0141q508j2589l4158k0200M4523K5692K7695j473j8611
$$ -51630 -58390 -50194 -20053 -28561 -41150 -75308 -95508 -50985 -25293 2402 929 -17682
10890a7682j8238m889n569L568J1636J5149K726o561k443N747J4488n554k0026
$$ -17682 -35920 -40809 -46378 -42810 -31174 -16025 -13299 -19860 -22303 -16556 -2068 -7622 -27648
10877b7648K576l832J2671k3481j373L9044K4117j3551k9868k5969n178K7437
$$ -27648 -25072 -28904 -16233 -39714 -41087 -2043 22074 8523 -21345 -47314 -52492 -25055
10865b5055K9500j5296l3096j8509N106K318l1956n755K6720J8228N221K3484
$$ -25055 4445 -10851 -43947 -62456 -57350 -55032 -86988 -92743 -66023 -47795 -42574 -19090
10853a9090q97R540L775Q177m257j3263q951n01r625j6467k67K8399M0620o434
$$ -19090 -19987 -10447 -6672 1505 -2752 -16015 -24966 -25467 -35092 -51559 -51826 -23427 17193 10759
10839A0759l4048n73K8687m00O483P620q130l6347k5774P043M2094K8029j7302
$$ 10759 -23289 -23862 4825 4425 10908 18528 10398 -25949 -51723 -44680 -2586 25443 8141
10826H141k5028O406L821L9255K1449l3805Q379j3177k780J1200k6301p499J2398
$$ 8141 -16887 -10481 -6660 32595 54044 20239 28618 15441 12661 23861 -2440 -9939 2459
10813B459j0975k6570k454K1203k32k1074J7844o802k5254l5822K6975J5295k579
$$ 2459 -8516 -35086 -37540 -16337 -16569 -37643 -19799 -26601 -51855 -87677 -60702 -45407 -47986
10800d7986R190J4618L2129J1624j8261j9222J9134q351M619K8004O799j0256
$$ -47986 -38796 -24178 7951 19575 1314 -17908 1226 -7125 -2506 25498 32297 22041
10788B2041j5076O284k163L620j0337J0208j5322N556k1000j4542k1412j9495
$$ 22041 6965 13249 11086 14706 4369 14577 -745 4811 -16189 -30731 -52143 -71638
10776g1638Q124K2526J2832J0480j0658M983Q564K3808K7438j4316k5854J91J4466
$$ -71638 -63514 -40988 -28156 -17676 -28334 -23351 -14787 9021 36459 22143 -3711 -3520 10946
10763A0946J1308o935L421J6954j5858K254K5667k798L4946J2016j4782k8014
$$ 10946 22254 15319 18740 35694 19836 22090 47757 44959 79905 91921 77139 49125
10751D9125j8416O640j3179k5569R081j8685M956M043J6858k0800l0242p732J2765
$$ 49125 30709 37349 24170 -1399 7682 -11003 -6047 -2004 14854 -5946 -36188 -43920 -31155
10738c1155J7047p914j6951K6953Q907j6771J21o250K54L9158R051j5061j0850
$$ -31155 -14108 -22022 -38973 -12020 -3113 -19884 -19763 -26013 -25759 13399 22450 7389 -3461
10725c461r594j4927r047K8806l894m5377r779R394J3280M0411L7390P948j1756
$$ -3461 -13055 -27982 -37029 -8223 -12117 -57494 -67273 -57879 -44599 -4188 33202 41150 29394
10712B9394O487l716j9955n799m467m0407l3903q330J4919J2295J1916J1794L312
$$ 29394 35881 32165 12210 6411 1944 -38463 -72366 -80696 -65777 -53482 -41566 -29772 -26460
10699b6460J163J2155J5154K2056j3167l8407J3908J3822j6246j5392r440J0785
$$ -26460 -25297 -13142 2012 24068 10901 -27506 -13598 224 -16022 -31414 -40854 -30069
10687c0069J8219k710p829K538n346K9570K0564N881J1884L1852k1291j6565k8495
$$ -30069 -11850 -14560 -22389 -19851 -25197 4373 24937 30818 42702 74554 53263 36698 8203
10674H203n4678k4365j5761j8683K5715M7356J9770m93j7258L6576J111p989k531
$$ 8203 -46475 -70840 -86601 -105284 -79569 -32213 -12443 -12936 -30194 6382 7493 -496 -3027
10661c027j2840r022J3212j9641k361J1202K2627J8258J7173k2443k7802k6437
$$ -3027 -15867 -24889 -11677 -31318 -33679 -22477 150 18408 35581 13138 -14664 -41101
10649d1101O627M0600J3204Q468l2871j5224Q891k728m69J3483r434Q428J528
$$ -41101 -34474 6126 19330 27798 -5073 -20297 -11406 -14134 -14603 -1120 -10554 -2126 -598
10636e98k0164k8748J9976K081m151j2437R084J4622J4830Q766J6218j1642j2346
$$ -598 -20762 -49510 -29534 -27453 -31604 -44041 -34957 -20335 -5505 3261 19479 7837 -4509
10623d509M256m200l168p881J8817K8832J0151J2877j5400J685J4709j0830j1524
$$ -4509 -253 -4453 -7621 -15502 3315 32147 42298 55175 39775 41460 56169 45339 33815
10610C3815j9052k7598J1596K6905j8710k3551J2574j542o929r17N757K840N363
$$ 33815 14763 -12835 -1239 25666 6956 -16595 -4021 -5563 -12492 -13409 -7652 -4812 551
10597E51l123k2452l25k780M8757O534m885n271j9806q717k9514k1185J4773K5972
$$ 551 -2572 -25024 -25349 -28129 20628 27162 22277 17006 -2800 -11517 -41031 -62216 -47443 -21471
10583b1471o142K31j4648p250J800L3653L2741L236n221l1957L779J8975J5016
$$ -21471 -27613 -27382 -42030 -49280 -47480 -13827 18914 22150 16929 -15028 -11249 7726 22742
10570B2742r81q733j8693l6028j4330J3764M1773J753j3993J2557M75K2298l366
$$ 22742 21761 13028 -5665 -41693 -56023 -42259 -486 1267 -12726 -169 306 22604 19238
10557A9238K957J6921n028k2002l4565P380j0469n147j7252J7489J8214J5814
$$ 19238 22195 39116 34088 12086 -22479 -15099 -25568 -30715 -47967 -30478 -12264 3550
10545C550l1663p936J8682q178n794N621P941k016j946j9460K0296K0274j4861
$$ 3550 -28113 -36049 -17367 -25545 -31339 -25718 -17777 -19793 -21739 -41199 -20903 -629 -15490
10532a5490l2715m656K8384J3530j0915K738r64j3293m81K3587K098j0831L157
$$ -15490 -48205 -52861 -24477 -10947 -21862 -19124 -20088 -33381 -33862 -10275 -8177 -19008 -15851
10519a5851K4162n149P210J8594l4300o812o615Q547k411O430J732K5836j8968
$$ -15851 8311 3162 10372 28966 -5334 -12146 -18761 -10214 -12625 -6195 -4463 21373 2405
10506B405m0771l982J0564L5452j8439j0195K5370L7769L5323k906j0252J5068
$$ 2405 -38366 -42348 -31784 3668 -14771 -24966 404 38173 73496 70590 60338 75406
10494G5406P375J4071J9847k3028J4149J7730L805K2523J2569M1628P4424O3654
$$ 75406 82781 96852 116699 93671 107820 125550 129355 151878 164447 206075 280499 344153
10482C44153J22544J40152J47401J33949J26637J25877J12067L2972p8703j14345
$$ 344153 466697 606849 754250 888199 1014836 1140713 1252780 1285752 1207049 1092704
10472A092704r1083r6819j15712j44487j31399r2077o2032o6498m1302j9540j9377
$$ 1092704 1001621 904802 789090 644603 513204 421127 359095 292597 251295 231755 212378
10461B12378m9294j6331J5887L652l1897j9344r334j2024l520K329P148j7193
$$ 212378 163084 146753 162640 166292 134395 115051 105717 93693 90173 92502 99650 82457
10449H2457l2978n017K5067Q773j6039q782N959P881p47J2077l0695j5838R885
$$ 82457 49479 44462 69529 78302 62263 53481 59440 67321 66574 78651 47956 32118 42003
10436D2003j6960k4885m0334L1721K4413L6856j5342l4072j051N392R180Q358
$$ 42003 25043 158 -40176 -8455 15958 52814 37472 3400 2349 7741 16921 25279
10424B5279q119n11j2598m567M203j1737j5977R726o939j4731R95M8438J3901
$$ 25279 17160 16649 4051 -516 3687 -8050 -24027 -14301 -21240 -35971 -34976 13462 27363
10411B7363j8932p94J6488P637j1663j1165J0345K00J0431j2886J0303j3941l4187
$$ 27363 8431 7637 24125 31762 20099 8934 19279 19479 29910 17024 27327 13386 -20801
10398b0801J660K0673M092K3754K2383J000N745L1592J43J36m702m268j6835K082
$$ -20801 -19141 1532 5624 29378 51761 52761 58506 90098 90241 90377 85675 81407 64572 66654
10384F6654J4472j0413k3461l1787N396P047q868k1910n438m024Q051p537P995
$$ 66654 81126 70713 47252 15465 20861 27908 19040 -2870 -8308 -12332 -4281 -11818 -3823
10371c823J1742K152P713j3820m604R949K1688j0491j8156L0950K8888O962J297
$$ -3823 7919 10071 17784 3964 -640 9309 30997 20506 2350 33300 62188 69150 70447
10358G0447k8524j3923j6792r962k4795J3322jj5760P585K8228J9199J3139j3190
$$ 70447 41923 28000 11208 1246 -23549 -10227 -10228 -25988 -18403 9825 29024 42163 28973
10345B8973p231J634k3377J4250J2460k3729j3144N981o511N579M73k6154R979
$$ 28973 21742 23376 -1 14249 26709 2980 -10164 -4183 -10694 -5115 -4642 -30796 -20817
10332b0817K2275k8867l3754J7631O268L1230Q570p379M614k4235J3255J7708
$$ -20817 1458 -27409 -61163 -43532 -37264 -6034 2536 -4843 -229 -24464 -11209 6499
10320F499L788M0523J8390j3314j9055j4551j517J0529n77j1864n62L551j4650
$$ 6499 10287 50810 69200 55886 36831 22280 20763 31292 30715 18851 18289 21840 7190
10307G190k2021m441Q281J3902M728N702M135K686J944K5136k247k95k978r505
$$ 7190 -14831 -19272 -10991 2911 7639 13341 17476 20162 22106 47242 44995 44700 41722 32217
10293C2217k784P505j3900j3098j2068j0014Q499J6276o442k2483m599L4526L044
$$ 32217 29433 36938 23038 9940 -2128 -12142 -3643 12633 6191 -16292 -20891 13635 16679
10280A6679J695p810n376J671m037K2310Q850q399K96K3250L0134K6752J3930
$$ 16679 18374 10564 5188 6859 2822 25132 33982 25583 25879 49129 79263 106015 119945
10267A19945L422L7257P871L9325N4852L0589L3591K892O156j2825o321k1739
$$ 119945 123367 160624 168495 207820 262672 293261 326852 329744 335900 323075 316754 295015
10255B95015l7114m4269j7496k1045l9306n7401j4973l535p479q761j3587k5015
$$ 295015 257901 213632 196136 175091 135785 78384 63411 59876 52397 43636 30049 5034
10243E034n055K8185R653K3490j3019l048r409m703j421j106k7339p046o580Q172
$$ 5034 -21 28164 37817 61307 48288 45240 35831 31128 29707 28601 1262 -5784 -12364 -4192
10229d192k000J0968K9990k229k6177j5395j15o977J5698L1158n359n623R59l0965
$$ -4192 -6192 4776 34766 32537 6360 -9035 -9150 -16127 -429 30729 25370 19747 20706 -10259
10215a0259J8759J2831k819K1623k703j5894k5490K811K5449l7405k5585L7811
$$ -10259 8500 21331 18512 40135 37432 21538 -3952 -1141 24308 -13097 -38682 -871
10203h71J4303K0965J3642j4419n930j8968L951R813M482K650o128k9969l438
$$ -871 13432 34397 48039 33620 27690 8722 12673 22486 26968 29618 23490 -6479 -9917
10190i917J3633O087J690Q539q84o381n336P157m417k0625j745k074j9475j317
$$ -9917 3716 9803 11493 20032 19148 12767 7431 14588 10171 -10454 -12199 -14273 -33748 -35065
10176c5065J5194P207J2342l235j7832j5092N983l4r14J3038q654M718J8974J8411
$$ -35065 -19871 -12664 -322 -3557 -21389 -36481 -30498 -30532 -31446 -18408 -27062 -22344 -3370 15041
10162A5041l259l9729j4837M985p583J1397M6098J9863l7010O435R440J0875J9688
$$ 15041 11782 -27947 -42784 -37799 -45382 -33985 12113 31976 -5034 1401 10841 21716 41404
10149D1404p555n000l2279L143M089q626R657J4305O930O361j191l484q103L072
$$ 41404 33849 28849 -3430 -287 3802 -4824 4833 19138 26068 32429 31238 27754 19651 22723
10135B2723J1883q048k8560p590N786J5165J0794j5018j2964Q354J7495K0616
$$ 22723 34606 26558 -2002 -9592 -3806 11359 22153 7135 -5829 2525 20020 40636
10123D0636O180J2201l9265o784K247M921j8482q337j6587j6518J3783P212O439
$$ 40636 46816 59017 19752 12968 15215 20136 1654 -6683 -23270 -39788 -26005 -18793 -12354
10110a2354J3508q494m977k159j237k9763M151J049j2609J4064L5477L2778k7646
$$ -12354 1154 -7340 -12317 -14476 -15713 -45476 -41325 -40276 -52885 -38821 -3344 29434 1788
10097A788j1922M240j5629k7768J51L3325J0578K9637j4616L041j8524k5032j1971
$$ 1788 -10134 -5894 -21523 -49291 -49140 -15815 -5237 24400 9784 12825 -5699 -30731 -42702
10084d2702R81O998J9201J0563j2924K1831K9033N595k407J0843N473J6059K191
$$ -42702 -41721 -34723 -15522 -4959 -17883 3948 32981 38576 36169 47012 52485 68544 70735
10071G0735m1338m7746k1366K078L4614O804J5855j5804j6816j6164k7753R327
$$ 70735 29397 -18349 -39715 -37637 -3023 3781 19636 3832 -12984 -29148 -56901 -47574
10059d7574k254j4303J8047L1061N260j5718J5902J7034j0940j0905N715J7347
$$ -47574 -49828 -64131 -46084 -15023 -9763 -25481 -9579 7455 -3485 -14390 -8675 8672
10047H672L504L366j3034k51J3070j4325m1545k1769K3653K4284L4838j367l0999
$$ 8672 12176 15542 2508 2257 15327 1002 -40543 -62312 -38659 -14375 20463 19096 -11903
10034a1903j5553m056K4267j100j1226L223j2277j2784M1389j5996m548J6810
$$ -11903 -27456 -31512 -7245 -8345 -19571 -16348 -28625 -41409 -20 -16016 -20564 -3754
10022c754j3185k9321j8261N159K8359P178L3225l44Q068O672j6387k0310K727
$$ -3754 -16939 -46260 -64521 -59362 -31003 -23825 9400 9056 17124 23796 7409 -12901 -10174
10009a0174R186J5174m351m631J5756j7523j6670j3718p278p811j0981r12J0238
$$ -10174 -988 14186 9835 5204 20960 3437 -13233 -26951 -34229 -42040 -53021 -53933 -43695
9996d3695K9161J7641O154k8257l915K6688J9920L679L827o611Q004M902o960
$$ -43695 -14534 3107 9261 -18996 -22911 3777 23697 27376 31203 24592 32596 37498 30538
9983C0538K975j7585j3259J7239L3169k8689k4121k4244J3100Q505l0748L624
$$ 30538 33513 15928 2669 19908 53077 24388 267 -23977 -10877 -2372 -33120 -29496
9971b9496M550J7239J4380j6876J4928J3404O461K1011k1139k3549J4744Q503
$$ -29496 -24946 -7707 6673 -10203 4725 18129 24590 45601 24462 913 15657 24160
9959B4160j7002o909Q790J0167P885O719l2864j835n167j6277J383k842L2657
$$ 24160 7158 249 9039 19206 27091 33810 946 -889 -6056 -22333 -20950 -23792 8865
9946H865Q007M424j1536q139j4297J1405N475N595j8288Q329O157O249K3590O435
$$ 8865 16872 21296 9760 1621 -12676 -1271 4204 9799 -8489 -160 5997 12246 35836 42271
9932D2271k2121k6485L565J5724J3905J2631o240j2182K6554k3209J098L714K1730
$$ 42271 20150 -6335 -2770 12954 26859 39490 33250 21068 47622 24413 25511 29225 50955
9919E0955k503L047M99p741j682O185M459n068P858L4933J6238J262K2241k382
$$ 50955 48452 51499 51998 44257 42575 48760 53219 48151 56009 90942 107180 108442 130683 128301
9905A28301r55K1057L4324J2215j2382J3609L4087L0672O2325R2147R1285J33775
$$ 128301 127346 148403 182727 194942 182560 196169 230256 260928 323253 415400 506685 640460
9893F40460K57326M12584O37170P13151O20637L69696J72744P7170n7499m01006
$$ 640460 897786 1310370 1947540 2660691 3281328 3651024 3823768 3900938 3843439 3442433
9883C442433p13507p74667n84133l62343k26387j37437p2944m3652n9921n3846
$$ 3442433 2728926 1954259 1370126 1007783 781396 643959 571015 527363 467442 413596
9873D13596j7418P441l2194n6614n6749k6375k8n429J1228K3851j6208J4145l1771
$$ 413596 396178 403619 371425 314811 258062 231687 231659 226230 237458 261309 245101 259246 227475
9860B27475l6562k6250q096J4411K3351j5966j2403p091k2219l8474j2826J3027
$$ 227475 190913 164663 156567 170978 194329 178363 165960 158869 136650 98176 85350 98377
9848I8377r450L593L8889m941l1987m634j8447L50r25k0163p540J7004J955l63
$$ 98377 88927 92520 131409 126468 94481 89847 71400 71750 70825 50662 43122 60126 62081 61718
9834F1718m143J2801J3852J7041j8336k0643k760N937O773j6717j516J7602L4
$$ 61718 57575 70376 84228 101269 82933 62290 59530 65467 72240 55523 54007 71609 71643
9821G1643j8105o909J6308M144k049k0750p873k169l832J4805j2057K3945K3795
$$ 71643 53538 46629 62937 67081 65032 44282 36409 34240 30408 45213 33156 57101 80896
9808H0896O05j6756K1763P594r513p598j7762r542O101j902j597J3081l118Q649
$$ 80896 81501 64745 86508 94102 84589 76991 59229 49687 55788 53886 52289 65370 62252 70901
9794G0901J0067k7338j3000N829j3567J880j5399k8596J28o787J1179J1474o360
$$ 70901 80968 53630 40630 46459 32892 34772 19373 -9223 -9095 -15882 -4703 6771 411
9781D11p541j1856n319J0298J4320q095k860q92J1028K3014L1094J130k1817n657
$$ 411 -7130 -18986 -24305 -14007 313 -7782 -10642 -11534 -506 22508 53602 54732 32915 27258
9767B7258O479j1408k3261m1065l546J1365P077K045k6050q561K4460L0199k5159
$$ 27258 33737 22329 -932 -41997 -45543 -34178 -27101 -25056 -51106 -59667 -35207 -5008 -30167
9754c0167k1935j0291l04O783K6662L0264J9633r554j2391k3824K2329J9026l299
$$ -30167 -52102 -62393 -62697 -55914 -29252 1012 20645 11091 -1300 -25124 -2795 16231 12932
9741A2932J78q649j1748J0443J2573j2639k8885J763J0033o233k688J5152J8772
$$ 12932 13110 4461 -7287 3156 15729 3090 -25795 -24032 -13999 -20232 -22920 -7768 11004
9728A1004L0330p204k830p383n677K729k0086j8245j7673Q351K2240O752J0844
$$ 11004 41334 34130 31300 23917 18240 20969 883 -17362 -35035 -26684 -4444 2308 13152
9715A3152j8525k0780Q893J054J455K6349J8249M3061K2748j1082j6331r708l1241
$$ 13152 -5373 -26153 -17260 -16206 -14751 11598 29847 72908 95656 84574 68243 58535 27294
9702B7294o631J8584q219j7199l4697j8235J3356L3369L4442J8493n2R564m404
$$ 27294 20663 39247 31028 13829 -20868 -39103 -25747 7622 42064 60557 60505 70069 65665
9689F5665r216k7010k3689j6601N681L926Q507N894Q179j53j7238m80o967q862
$$ 65665 56449 29439 5750 -10851 -5170 -1244 7263 13157 21336 21183 3945 3465 -3502 -12364
9675a2364k887J2100J3524r93J3733R245l4521j6654j4092K911J3209J4237J1382
$$ -12364 -15251 -3151 10373 9380 23113 32358 -2163 -18817 -32909 -29998 -16789 -2552 8830
9662H830n315J0243L764j753J5201q881j3117l0721K2879Q766m201L9742R542
$$ 8830 3515 13758 17522 15769 30970 22089 8972 -21749 1130 9896 5695 45437 54979
9649E4979j8819k1537j8507m036j0513L9242n672j4797P681O418q861R890M13
$$ 54979 36160 14623 -3884 -7920 -18433 20809 15137 340 8021 14439 5578 15468 15881
9636A5881J503k4758k4243p189J5065M5486J2878q922j350J464J8399j4206Q992
$$ 15881 17384 -7374 -31617 -38806 -23741 21745 34623 25701 24351 25815 44214 30008 39000
9623C9000R408N16q196K0915L139l402k6724n4880n292J7892J5802L638J2238
$$ 39000 48408 48924 40728 61643 64782 61380 34656 -20224 -25516 -7624 8178 11816 24054
9610B4054r299j3144k8K5182K5112k204k5937j5978M574k2326k3649p131P86j412
$$ 24054 14755 1611 1583 26765 51877 49673 23736 7758 12332 -9994 -33643 -40774 -39988 -41400
9596d1400q825M913j3065J4768J3709J1514K2247K2162j5567l454P037k8562L16
$$ -41400 -50225 -45312 -58377 -43609 -29900 -18386 3861 26023 10456 7002 14039 -14523 -14207
9583a4207K8435K9823K2864j962j5120k9379L621K1611j2747j6395l807j0912
$$ -14207 14228 44051 66915 64953 49833 20454 24075 45686 32939 16544 12737 1825
9571A825J7074J2073j0191j6337j5685R833O123k2601K8088Q362L3881J6225K94
$$ 1825 18899 30972 20781 4444 -11241 -1408 4715 -17886 10202 18564 52445 68670 68964
9558F8964o118m286l9663l3514J0462M1258M2293o743l8395j8779p199j5609j1989
$$ 68964 62846 58560 18897 -14617 -4155 37103 79396 72653 34258 15479 8280 -7329 -19318
9545a9318j6447M0014J5391J1222q51k9394j1213J3069q777R261l106J212j6366
$$ -19318 -35765 4249 19640 30862 30011 617 -10596 2473 -6304 2957 -149 1063 -15303
9532a5303J5652R828K9072j0689j3570J1290j5559l2368o021j0285L682J8655
$$ -15303 349 10177 39249 28560 14990 26280 10721 -21647 -27668 -37953 -34271 -15616
9520a5616l452J2556K4556Q969o206p001r792R848j7966l657L5889K2052k4131
$$ -15616 -19068 -6512 18044 27013 20807 13806 4014 13862 -4104 -7761 28128 50180 26049
9507B6049j2293k8211p493J2163J3986j1036r202L0081K4588J9091k2932n424
$$ 26049 13756 -14455 -21948 -9785 4201 -6835 -16037 14044 38632 57723 34791 29367
9495B9367J3238K1477o849k1300j6450j9674J1288K7351J4099j0106l3064k039
$$ 29367 42605 64082 57233 35933 19483 -191 11097 38448 52547 42441 9377 7338
9483G338P386K388M0487O778k0108r929j984r287J0094N495o344j074L662m6444
$$ 7338 14724 17112 57599 64377 44269 34340 32356 23069 33163 38658 32314 31240 34902 -11542
9469a1542j2331Q804J5148j0315J5923q954M064n565o892P54l597Q04Q118M212
$$ -11542 -23873 -15069 79 -10236 5687 -3267 797 -4768 -11660 -10906 -14503 -13699 -5581 -1369
9455a369M974L039J5675L7196j4787l2113M192J9339l141m816j338j9439r419
$$ -1369 3605 6644 22319 59515 44728 12615 16807 36146 33005 28189 26851 7412 -2007
9442b007J5411J8300L42J3210M271j2107n201L244j4459j2956M497k1106o224
$$ -2007 13404 31704 32046 45256 49527 37420 32219 35463 21004 8048 12545 -8561 -14785
9429a4785J8063J1354j1325o272R93m359j2102K0501J2274n796J8598J0076J3357
$$ -14785 3278 14632 3307 -2965 -1972 -6331 -18433 2068 14342 8546 27144 37220 50577
9416E0577J4103J4506l3502n7066m452L2572K4114K4527M18k3365L240k0285n646
$$ 50577 64680 79186 45684 -11382 -15834 16738 40852 65379 65797 42432 45672 25387 19741
9403A9741n03J7661J9949m85j933m123j316j6872K542o496j8063j6598q352K5717
$$ 19741 19238 36899 56848 56363 54430 50307 48991 32119 34661 28165 10102 -6496 -14848 10869
9389A0869J3697J30j7163K7671J8413k8122k9922J9875M6158M2132m925m3178
$$ 10869 24566 24696 7533 35204 53617 25495 -4427 15448 61606 103738 98813 55635
9377E5635k9800J6567p483J0485n229j398R288m672O917Q131M158J1209k527J1638
$$ 55635 25835 42402 34919 45404 40175 38777 48065 43393 50310 58441 62599 73808 71281 82919
9363H2919r506j5428l873m666k1907j3757K0969J6245l2732k3965k2821J8959
$$ 82919 73413 57985 54112 49446 27539 13782 34751 50996 18264 -5701 -28522 -9563
9351i563Q829q683J5850p293j7063q34P892M479L164j5289O779K0473K3579q062
$$ -9563 -734 -9417 6433 -860 -17923 -18757 -10865 -6386 -3222 -18511 -11732 8741 32320 24258
9337B4258j6804K996K8499J2010J0098K213j6200N599L5695l980k9977K1262Q447
$$ 24258 7454 10450 38949 50959 61057 63270 47070 52669 88364 84384 54407 75669 84116
9324H4116k3256r66M286j4556k709j3697q707L0241R459j2025r386k8982k6044
$$ 84116 60860 59894 64180 49624 46915 33218 24511 54752 64211 52186 42800 13818 -12226
9311a2226K802J0906J7998o733J6364J0195j1225R172J9428o012J823l013J3688
$$ -12226 -9424 1482 19480 12747 29111 39306 28081 37253 56681 50669 52492 49479 63167
9298F3167N228j6322J4795J4327J288J887M610n569j5678j6553p953j1803j519
$$ 63167 68395 52073 66868 81195 82483 84370 88980 83411 67733 51180 43227 31424 29905
9285B9905L014N319J6624k904N92J1081p064j4737K0956N6782j3578l0189L675
$$ 29905 32919 38238 54862 51958 52550 63631 56567 41830 62786 119568 105990 75801 79476
9272G9476j2880n958L2549L550p390j0796j7594m837o25m324n634j5924L2842
$$ 79476 66596 60638 93187 96737 89347 78551 60957 56120 55495 51171 45537 29613 62455
9259F2455J5503K817J2146r462K3735Q987l1389k6374j5128K4309J0535J1671
$$ 62455 77958 80775 92921 83459 107194 116181 84792 58418 43290 67599 78134 89805
9247H9805M4108m425k6190R845N070K0983K145j0200j1014J3274q735o756j8822
$$ 89805 133913 129488 103298 113143 118213 139196 141341 131141 120127 133401 124666 117910 99088
9234I9088O26L9J7293J8575L2834J927P69k0955k7203k2331Q07J8612p077M1327
$$ 99088 99714 99753 117046 135621 168455 170382 171151 150196 122993 100662 101469 120081 113004 154331
9220A54331j084k831N337P364o989n862L149R347K1414N245O101J7310k2645l6796
$$ 154331 153247 150416 155753 163117 156128 150266 153415 162762 184176 189421 195522 212832 190187 153391
9206A53391j0415J2663K1333j1361N134J6602L864j6207J4255J3500j5402J5813
$$ 153391 142976 155639 176972 165611 170745 187347 191211 175004 189259 202759 187357 203170
9194B03170J6081K954Q035m852j1925K9815p095J609l481l646r2N74l587L725
$$ 203170 219251 222205 230240 225388 213463 243278 236183 237792 234311 230665 230573 231147 227560 231285
9180B31285P75m698J2116K1650N923M945J2311o797N948M347J0027j2644M0672
$$ 231285 232060 227362 239478 261128 267051 271996 284307 277510 283458 287805 297832 285188 325860
9167C25860K3020m11j2698Q483K5982r061j8035k230O419L7119r769k0329Q011
$$ 325860 348880 348469 335771 344254 370236 361175 343140 340910 347329 384448 374679 354350 362361
9154C62361q647K2350Q976P785Q322o116L3322L4552m187O955N429K1502L7333
$$ 362361 353714 376064 385040 392825 401147 395031 428353 462905 458718 465673 471102 492604 529937
9141E29937K3319k659m84J5871j338N404J2195K4960J6959J5351j207M2001P49
$$ 529937 553256 550597 550113 565984 564646 570050 582245 607205 624164 639515 638308 680309 681058
9128F81058O537M272P690N7748P0559M0106K9440L0470L1518L0067N5676L5941
$$ 681058 687595 691867 699557 757305 827864 867970 897410 927880 959398 989465 1045141 1081082
9116A081082J6180L2317N6951M7585L2383N0519N4265P4847Q4229N8355N0504
$$ 1081082 1097262 1129579 1186530 1234115 1266498 1317017 1371282 1446129 1530358 1588713 1639217
9105A639217N3241O7735O9720L0569O2274Q6417J13907Q7596R8248P2138Q4793
$$ 1639217 1692458 1760193 1829913 1860482 1922756 2009173 2123080 2210676 2308924 2381062 2465855
9094B465855P1326Q0029R5403J02165R8206N7457M4471P7313Q6469N3359L2153
$$ 2465855 2537181 2617210 2712613 2814778 2912984 2970441 3014912 3092225 3178694 3232053 3264206
9083C264206P2556J9159j78J0538J2867J3658k1822k0586k3203l1824m8173q4478
$$ 3264206 3336762 3355921 3355743 3366281 3379148 3392806 3370984 3350398 3327195 3295371 3247198 3162720
9071C162720p7491q6726n8050p4377r1487j00439q5414p8675n7077l7523o8924
$$ 3162720 3085229 2998503 2940453 2866076 2774589 2674150 2588736 2510061 2452984 2415461 2346537
9060B346537r9372m9334o2090q8231p4551q2933m6467n4870n6917m0984p0486
$$ 2346537 2247165 2197831 2135741 2047510 1972959 1890026 1843559 1788689 1731772 1690788 1620302
9049A620302q1405l1243k0628n5723m7066k8725m2879n9770o4971m0600k2705
$$ 1620302 1538897 1507654 1487026 1431303 1384237 1355512 1312633 1252863 1187892 1147292 1124587
9038A124587j2697l9546k2413j9787n0264m1780k4831J0851k4220n5381k9891
$$ 1124587 1111890 1072344 1049931 1030144 979880 938100 913269 924120 899900 844519 814628
9027H14628j5372Q779l143m8234l8405l7494k1697j7596l2810l2487k3242j324
$$ 814628 799256 808035 804892 756658 718253 680759 659062 641466 608656 576169 552927 551603
9015E51603K3395P288R972j7867n1479q799j714j9746k0175j8695J2371J469j2102
$$ 551603 574998 582286 592258 574391 522912 514113 512399 492653 472478 453783 466154 467623 455521
9002D55521k531Q363J9169k9228l9204n0214k7137P776Q629o761M633K171J2503
$$ 455521 452990 461353 480522 451294 412090 361876 334739 342515 351144 344383 349016 351187 363690
8989C63690K8938k0078l2283j1858j113k718o234l327j7068l244j3800n322O126
$$ 363690 392628 372550 340267 328409 327296 324578 318344 315017 297949 294705 280905 275583 281709
8976B81709j4563k4566l57J3098q321k6374J9249m082p431k0435q955m635j8506
$$ 281709 267146 242580 242223 255321 247000 220626 239875 235793 228362 207927 198972 194337 175831
8963A75831j2421N347K2312L7678j0267k2459J5841q626L832R826J0877k349J9421
$$ 175831 163410 168757 191069 228747 218480 196021 211862 203236 207068 216894 227771 225422 244843
8950B44843k807k3773l431J1044K5560J7695n178J1516L5371J1002J8398K5458
$$ 244843 242036 218263 214832 225876 251436 269131 263953 275469 310840 321842 340240 365698
8938C65698K9963K3996M5611Q4478Q1759J33440K11223L11051M22921M54772L15243
$$ 365698 395661 419657 465268 549746 631505 764945 976168 1287219 1710140 2164912 2480155
8927B480155J46227Q3023M7558j40003l78894m76604m25201l14515k10813j15667
$$ 2480155 2626382 2709405 2756963 2616960 2238066 1761462 1336261 1021746 810933 695266
8917F95266r9687l8861q668k0158k4777k0642m9241l4879j7972j5381o509p178
$$ 695266 595579 556718 548050 527892 503115 482473 433232 398353 380381 365000 358491 351313
8905C51313q396m697k3259j333q284o757k330j192q781j3318j3614j3164o77k8862
$$ 351313 342917 338220 314961 313628 305344 298587 296257 295065 286284 272966 259352 246188 245511 216649
8891B16649k4880j5033L203q538j6418J138J836J6126K7783k622J8020R251j5016
$$ 216649 191769 176736 179939 171401 154983 156121 157957 174083 201866 199244 217264 226515 211499
8878B11499P067j6644m554J4678M180k3793q586J2007K3093Q187N1645L6383J0042
$$ 211499 218566 201922 197368 212046 216226 192433 183847 195854 218947 227134 278779 315162 325204
8865C25204L7544O9658J00719J47147K24646L27384K92324K81589K30916J42264
$$ 325204 362748 432406 533125 680272 904918 1232302 1524626 1806215 2037131 2179395
8855B179395O4586m4332j82063l06971l64548l23110k43827j65661p5352n6105
$$ 2179395 2243981 2199649 2017586 1710615 1346067 1022957 779130 613469 538117 482012
8845D82012m3392p7141n2140j0052J5032j1309Q338m685k85L941L12j5740J1134
$$ 482012 438620 361479 309339 299287 314319 303010 311348 306663 306378 310319 310631 294891 306025
8832C06025n960L402K4877J9998j0336L4388N1882J3866P912J4086L8432O9083
$$ 306025 300065 303467 328344 348342 338006 372394 424276 438142 446054 460140 498572 567655
8820E67655R9530J74810K04841K87753M56710N91352O26680N59348L89257K35026
$$ 567655 667185 841995 1046836 1334589 1791299 2382651 3009331 3568679 3957936 4192962
8810D192962M5392j80887m07989n95933o76791o05466m40344k79145j67913q6041
$$ 4192962 4238354 4057467 3649478 3053545 2376754 1771288 1330944 1051799 883886 797845
8800G97845n4859o3856p5495p5614j5693J56k0245k2178o371P081k2261l6539
$$ 797845 742986 679130 603635 528021 512328 512484 492239 470061 463690 470771 448510 411971
8788D11971k8889k6750r38K7367L1721j650R856J6167M53J2806l824J655K8995
$$ 411971 383082 356332 355394 382761 414482 412832 422688 438855 439308 452114 448290 449945 478940
8775D78940N8462J02604J10930J56378K38824K66175K67383K20962J63559J10639
$$ 478940 537402 640006 750936 907314 1146138 1412313 1679696 1900658 2064217 2174856
8765B174856J5315j15632k47215l05750k92259k64393j85902j26820q8137n6484
$$ 2174856 2190171 2074539 1827324 1521574 1229315 964922 779020 652200 564063 507579
8755E07579l5137m9006j5835k2796j5433k2003j5690j7486k572m34m2468l5014
$$ 507579 472442 423436 407601 384805 369372 347369 331679 314193 311621 311187 268719 233705
8743B33705k10J3265p290k7288n115J0129j7198j9860j283O237k792K007L849
$$ 233705 233495 246760 239470 212182 207067 217196 199998 180138 178855 185092 182300 184307 188156
8730A88156r418q16K5879k0384K897M4801K1873l3476l6292k7422j0081K5383
$$ 188156 178738 177922 203801 183417 186314 231115 252988 219512 183220 155798 145717 171100
8718A71100K2098l774J8385J2291j7953r614j7426J2319K1459j397k1873j4141
$$ 171100 193198 189424 207809 220100 202147 192533 175107 187426 208885 207488 185615 171474
8706A71474j4540K3762L0511M0311k2920j3957K2615q059k019J2818N2124L3964
$$ 171474 156934 180696 211207 251518 228598 214641 237256 229197 227178 239996 292120 326084
8694C26084J01818J54411J60401J65154J07271N6675L7642k086n2465j94720k01907
$$ 326084 427902 582313 742714 907868 1015139 1071814 1109456 1107370 1054905 860185 658278
8683F58278j42413q5938p5764o0168m2966k1936M731O3328R615j3132j0208j1987
$$ 658278 515865 429927 354163 293995 251029 229093 233824 297152 306767 293635 283427 271440
8671B71440j6637O605m198R61L2251J2541J1451M318J988K6320K0319N730M3792
$$ 271440 254803 261408 257210 258171 290422 302963 314414 318732 320720 347040 367359 373089 416881
8658D16881M1563J7016L5673L4538L4858N4113Q7618J29227J44491K09980K34865
$$ 416881 458444 475460 511133 545671 580529 634642 722260 851487 995978 1205958 1440823
8647A440823K81204L69024K66120N4921j5205l3422j66606l36528m48110m01978
$$ 1440823 1722027 2091051 2357171 2412092 2396887 2363465 2196859 1860331 1412221 1010243
8637A010243k17719j35093q7595n2278m1807o1128m6199m600r664l2718j4811
$$ 1010243 792524 657431 569836 517558 475751 414623 368424 363824 354160 321442 306631
8626C06631J5113K0509l8471l7029k6449K027J0790Q009k323j9102J741o634n732
$$ 306631 321744 342253 303782 266753 240304 242331 253121 261130 258807 239705 241446 234812 229080
8613B29080L2507J2529R153M4039O8271R5581J35106J70847J50562J17484J10026
$$ 229080 261587 274116 283269 327308 395579 491160 626266 797113 947675 1065159 1175185
8602A175185J65588K09469J05526r2533j59478p5774j05700j61709k22204j97455
$$ 1175185 1340773 1550242 1655768 1563235 1403757 1327983 1222283 1060574 838370 640915
8592F40915j31567r5434l4661m8704n0511J3190K6409r021l299j7629l4200k6847
$$ 640915 509348 413914 379253 330549 280038 293228 319637 310616 307317 289688 255488 228641
8580B28641j0572l685j2991o703K160J054k374m2337K575K2675K840R140q41j2632
$$ 228641 218069 214384 201393 194690 196850 197904 195530 153193 155768 178443 181283 190423 189582 176950
8566A76950k601Q40M0936L7921M8933N9131M4700j0820M184M873J239m9674q4508
$$ 176950 174349 175189 216125 254046 302979 362110 406810 395990 400174 405047 406286 356612 272104
8553B72104n6637n9370k9829j2893q236J6681k1622l7275k0230J7831L3345K5894
$$ 272104 215467 156097 126268 113375 105139 121820 100198 62923 42693 60524 93869 119763
8541A19763o9j3552n898p038k46R568K6929j2164j9745P40K4945J295J8967K1426
$$ 119763 119694 106142 100244 93206 92960 102528 129457 117293 97548 98288 123233 124528 143495 164921
8527A64921j5059l3646l3780j8217l0765K05l715l2382J8256O140J1939n270Q467
$$ 164921 149862 116216 82436 64219 33454 33659 29944 -2438 15818 21958 33897 28627 37094
8514C7094j5738J5070K0267k1335q35N726m039R239K135k246r38k762j246K6534
$$ 37094 21356 36426 56693 35358 34523 40249 36210 45449 47584 45338 44400 41638 40392 66926
8500F6926J5269j5525k2840j3934L740j1045m2826j0534J9714J4018j0063M120
$$ 66926 82195 66670 43830 29896 33636 22591 -20235 -30769 -11055 2963 -7100 -2980
8488b980J8978K0513m494n528L4114j6401j2063J4353j9789p961j4586l538k5427
$$ -2980 15998 36511 32017 26489 60603 44202 32139 46492 26703 18742 4156 618 -24809
8475b4809m298L188q345l070L1087m766o76N083j578J3023q612O712k63K0857
$$ -24809 -29107 -25919 -34264 -37334 -6247 -11013 -11689 -6606 -8184 4839 -3773 2939 2676 23533
8461B3533n981k2357Q570R139k069K632k711m918j6915j7355K1724K4110K9059
$$ 23533 17552 -4805 3765 12904 10835 13467 10756 5838 -11077 -28432 -6708 17402 46461
8448D6461j1797M330J2690J3330L3278k4358m7065k5960J530J7219p726k1428
$$ 46461 34664 38994 51684 65014 98292 73934 26869 909 2439 19658 11932 -9496
8436i496K2367J1025O361j0047j2142R044j2939K068k172J8545R35r234j4028
$$ -9496 12871 23896 30257 20210 8068 17112 4173 6241 4069 22614 23549 14315 287
8423B87J4522J2353k6648J824O169L4540J4612k2478n855p248P520J1374j8235
$$ 287 14809 27162 514 2338 8507 43047 57659 35181 29326 22078 29598 40972 22737
8410B2737o566J7968J2935j2383p824J7328K3283k3654J6091k9332n4133j7598
$$ 22737 16171 34139 47074 34691 26867 44195 67478 43824 59915 30583 -23550 -41148
8398d1148Q15j2468J4798K8218L393j4207o577R41K1853Q343J0020J0093j1468
$$ -41148 -40333 -52801 -38003 -9785 -6392 -20599 -27176 -26235 -4382 3961 13981 24074 12606
8385A2606j8054J0502l599j4098J213j658j7405r812J9139N875l683J3980j8518
$$ 12606 -5448 5054 1455 -12643 -11430 -13088 -30493 -40305 -21166 -15291 -18974 -4994 -23512
8372b3512k3826L5060J9957J9005k669P664k49K8728J877l2574k0405n358j9005
$$ -23512 -47338 -12278 7679 26684 24015 31679 31430 60158 62035 29461 9056 3698 -15307
8359a5307J735J5691J2615m659O116J2174j0063m481j0285Q872K0618r649k0786
$$ -15307 -13572 2119 14734 10075 16191 28365 18302 13821 3536 12408 33026 23377 2591
8346B591Q116K26K2294J1004k0849o534M442l455k113N402J076K7617l2127M801
$$ 2591 10707 10933 33227 44231 23382 16848 21290 17835 15722 21124 22200 49817 17690 22491
8332B2491J2814L113O527j9199p304k4846k2476Q670Q634j3196o982k1307J3226
$$ 22491 35305 38418 44945 25746 18442 -6404 -28880 -20210 -11576 -24772 -31754 -53061 -39835
8319c9835K8058L8617R666j9800k4709j6872n186j0408J6875L6520Q36k378M380
$$ -39835 -11777 26840 36506 16706 -8003 -24875 -30061 -40469 -23594 12926 13762 11384 15764
8306A5764J8894K9521M115l245q49M968j5794l0663k1730j9413k6769o93K6632
$$ 15764 34658 64179 68294 65049 64200 69168 53374 22711 981 -18432 -45201 -45894 -19262
8293a9262n059j5306K3455J8957k3083j3727K1608K6605J9836j9203k6845j3847
$$ -19262 -24321 -39627 -16172 2785 -20298 -34025 -12417 14188 34024 14821 -12024 -25871
8281b5871R557Q136k78k7720k271L9952M6426r933l3869O111K5902o946J327j8682
$$ -25871 -16314 -8178 -8456 -36176 -38447 1505 47931 37998 4129 10240 36142 29196 30523 11841
8267A1841k8475K6197K3729j1562k3734P482M77O548P440p986p042k4015n197
$$ 11841 -16634 9563 33292 21730 -2004 5478 5955 12503 19943 11957 4915 -19100 -24297
8254b4297K2241J7742J2779M115r046j7808J735q871M58J7624l271j2784L645
$$ -24297 -2056 15686 28465 32580 23534 5726 7461 -1410 -952 16672 13401 617 4262
8241D262n704J6879J142j2480k9944M704K9554J734j0615k8938k6847K9063J6814
$$ 4262 -1442 15437 16579 4099 -25845 -21141 8413 10147 -468 -29406 -56253 -27190 -10376
8228a0376J1758J6969n254j0330J567P445k8906q467J0252J6932j3417k1928j077
$$ -10376 1382 18351 13097 2767 4334 11779 -17127 -25594 -15342 1590 -11827 -33755 -34832
8215c4832K7691K5715r817j7974p097q736j8264J4138L3991N965p432N370L105
$$ -34832 -7141 18574 8757 -9217 -16314 -25050 -43314 -29176 4815 10780 3348 8718 11823
8202A1823M996p747k0514L9884j1975N946J6173j3063l7320j1501l417l724Q108
$$ 11823 16819 9072 -11442 28442 16467 22413 38586 25523 -11797 -23298 -26715 -30439 -22331
8189b2331J317P789j0573k5604K4190K1543J1818k0198k4374n446J3788L7104
$$ -22331 -21014 -13225 -23798 -49402 -25212 -3669 8149 -12049 -36423 -41869 -28081 9023
8177I023J668q148K0348l604N691p160j6033j6662k3407J6826Q388O054o376J900
$$ 9023 10691 2543 22891 19287 24978 17818 1785 -14877 -38284 -21458 -13070 -7016 -13392 -11492
8163a1492q882N922L167j2582J7285J6845J8963k0885l0909j5855J3751J0390
$$ -11492 -20374 -14452 -11285 -23867 -6582 10263 29226 8341 -22568 -38423 -24672 -14282
8151a4282K1430K006K653j2066J3989Q411l2789J1497K1278k4479J1789J7338
$$ -14282 7148 9154 11807 -259 13730 22141 -10648 849 22127 -2352 9437 26775
8139B6775K980Q645j6157m5036k1298J8634N5276N082K695J3196r026p986K607
$$ 26775 29755 38400 22243 -22793 -44091 -25457 29819 34901 37596 50792 41766 33780 36387
8126C6387j7870j8137J1615k3979k8101L1006K8015R613j864j7419p166o21l299
$$ 36387 18517 380 11995 -11984 -40085 -9079 18936 28549 26685 9266 2100 1479 -1820
8113a820N766j3657j1360J969M8717K3645k6081l560J9072n59J1211o61P531o10
$$ -1820 3946 -9711 -21071 -19102 29615 53260 27179 23619 42691 42132 53343 52682 60213 59603
8099E9603n081j1601L2205J1816k5672q083k7309K415j009P744j9802J0132K0140
$$ 59603 54522 42921 75126 86942 61270 53187 25878 28293 27284 35028 15226 25358 45498
8086D5498k4531k0849Q131K0417N094k6807Q577K0072k204k730P128P64j5331
$$ 45498 20967 118 8249 28666 33760 6953 15530 35602 33398 30668 37796 38560 23229
8073B3229K959j6229o700j0801K8372L478K0677J3302l981K011k298O268J3679
$$ 23229 26188 9959 3259 -7542 20830 24308 44985 58287 54306 56317 54019 60287 73966
$$ [...]
##END NTUPLES=NMR SPECTRUM
##END=
