##TITLE=Analysis number 321248
Compound Code cc 58509
Book Reference 196/182
Project Code adrs
Chemist Name jimp
##JCAMPDX= 6.0         $$ Bruker NMR JCAMP-DX V2.0
##DATA TYPE= NMR SPECTRUM
##DATA CLASS= NTUPLES
##ORIGIN= Bruker BioSpin GmbH
##OWNER= nmr
$$ XWIN-NMR		Version 3.5
$$ Tue Aug  1 10:17:18 2006 GMT Daylight Time (UT+1h)  MAYBRIDGE\nmr@NMR_250MHZ
##.OBSERVE FREQUENCY= 250.131544655141
##.OBSERVE NUCLEUS= ^1H
##.ACQUISITION MODE= SIMULTANEOUS (DQD)
##.ACQUISITION SCHEME= undefined
##.AVERAGES= 16
##.DIGITISER RES= 18
##SPECTROMETER/DATA SYSTEM= dpx250
##.PULSE SEQUENCE= zg30
##.SOLVENT NAME= CDCl3
##.SHIFT REFERENCE= (INTERNAL, CDCl3, 0, 16.522)
##AUDIT TRAIL= $$ (NUMBER, WHEN, WHO, WHERE, WHAT)
$$ ##TITLE= Audit trail, XWIN-NMR		Version 3.5
$$ ##JCAMPDX= 5.01
$$ ##ORIGIN= Bruker BioSpin GmbH
$$ ##OWNER= nmr
$$ C:\u/data/dgb/nmr/ADRS/3900/pdata/1/auditp.txt
$$ ##AUDIT TRAIL=  $$ (NUMBER, WHEN, WHO, WHERE, WHAT)
(   1,<2006-08-01 10:16:57.64 +100>,<MAYBRIDGE\nmr>,<NMR_250MHZ>,
      <created by zg, POWCHK disabled, PULCHK disabled
       configuration hash MD5:
       E2 DF 36 D8 04 B2 41 60 5A D7 A3 38 5A 4B D0 FE
       data hash MD5: 64K
       A8 A6 D0 69 65 3C E0 55 3E 52 E5 C9 22 0E 6F 77>)
(   2,<2006-08-01 10:17:09.22 +100>,<MAYBRIDGE\nmr>,<NMR_250MHZ>,
      <Start of raw data processing
       ef LB = 0.3 FT_mod = 6 PKNL = 1 SI = 32K 
       data hash MD5: 32K
       17 92 1B 40 27 89 4D 83 7A B8 9C BA F8 5D E8 DB>)
(   3,<2006-08-01 10:17:11.07 +100>,<MAYBRIDGE\nmr>,<NMR_250MHZ>,
      <apk 
       data hash MD5: 32K
       21 6D A0 AD 3C C5 7C 7D DA DE 8D D2 F6 91 38 5F>)
(   4,<2006-08-01 10:17:11.87 +100>,<MAYBRIDGE\nmr>,<NMR_250MHZ>,
      <abs ABSG = 5 
       data hash MD5: 32K
       3B CD 94 2E A5 13 BB 9C 65 58 6D 84 BE 70 00 BB>)
$$ ##END=
$$ 
$$ hash MD5
$$ CD 8B 61 31 78 00 A4 31 71 76 94 6C BF 15 8C DD
##$RELAX= 
##$RELAX= 
##$RELAX= 
##$RELAX= 
##$RELAX= 
##$RELAX= 
##$RELAX= 
$$ Bruker specific parameters
$$ --------------------------
##$DU= <C:\u>
##$EXPNO= 3900
##$NAME= <ADRS>
##$PROCNO= 1
##$TYPE= <nmr>
##$USER= <dgb>
##$AMP= (0..31)
100 100 100 100 100 100 100 100 100 100 100 100 100 100 100 100 100 100 
100 100 100 100 100 100 100 100 100 100 100 100 100 100 
##$AQSEQ= 0
##$AQ_mod= 3
##$AUNM= <au_zg>
##$AUTOPOS= <25 >
##$BF1= 250.13
##$BF2= 250.13
##$BF3= 250.13
##$BF4= 250.13
##$BF5= 500.13
##$BF6= 500.13
##$BF7= 500.13
##$BF8= 500.13
##$BYTORDA= 1
##$CFDGTYP= 0
##$CFRGTYP= 5
##$CHEMSTR= <none>
##$CNST= (0..31)
1 1 145 1 1 1 1 1 1 1 1 1 1 1 1 1 1 1 1 1 1 1 1 1 1 1 1 1 1 1 1 1 
##$CPDPRG= <>
##$CPDPRG1= <>
##$CPDPRG2= <>
##$CPDPRG3= <>
##$CPDPRG4= <mlev>
##$CPDPRG5= <mlev>
##$CPDPRG6= <mlev>
##$CPDPRG7= <mlev>
##$CPDPRG8= <mlev>
##$CPDPRGB= <>
##$CPDPRGT= <>
##$D= (0..31)
0 1 0 0 0 0 0 0 0 0.06 0 0 0 0 0 0 0.0002 0 0 0 0 0 0 0 0 0 0 0 0 0 0 
0 
##$DATE= 1154423816
##$DBL= (0..7)
120 120 120 120 120 120 120 120 
##$DBP= (0..7)
150 150 150 150 150 150 150 150 
##$DBP07= 0
##$DBPNAM0= <>
##$DBPNAM1= <>
$$ [...]
##$SUBNAM7= <"">
##$SUBNAM8= <"">
##$SUBNAM9= <"">
##$SW= 20.6930455092707
##$SWIBOX= (0..15)
0 0 3 0 0 0 0 0 0 0 0 0 0 0 0 0 
##$SW_h= 5175.983436853
##$TD= 65536
##$TD0= 1
##$TE= 295.16
##$TE2= 300
##$TE3= 300
##$TEG= 300
##$TL= (0..7)
0 120 120 120 120 120 120 120 
##$TP= (0..7)
150 150 150 150 150 150 150 150 
##$TP07= 0
##$TPNAME0= <>
##$TPNAME1= <>
##$TPNAME2= <>
##$TPNAME3= <>
##$TPNAME4= <>
##$TPNAME5= <>
##$TPNAME6= <>
##$TPNAME7= <>
##$TPOAL= (0..7)
0.5 0.5 0.5 0.5 0.5 0.5 0.5 0.5 
##$TPOFFS= (0..7)
0 0 0 0 0 0 0 0 
##$TUNHIN= 0
##$TUNHOUT= 0
##$TUNXOUT= 0
##$USERA1= <user>
##$USERA2= <user>
##$USERA3= <user>
##$USERA4= <user>
##$USERA5= <user>
##$V9= 5
##$VALIST= <valist>
##$VCLIST= <CCCCCCCCCCCCCCC>
##$VD= 0
##$VDLIST= <DDDDDDDDDDDDDDD>
##$VPLIST= <PPPPPPPPPPPPPPP>
##$VTLIST= <TTTTTTTTTTTTTTT>
##$WBST= 1024
##$WBSW= 4
##$XGAIN= (0..3)
0 0 0 0 
##$XL= 0
##$YL= 0
##$YMAX_a= 440416
##$YMIN_a= -567261
##$ZGOPTNS= <>
##$ZL1= 120
##$ZL2= 120
##$ZL3= 120
##$ZL4= 120
##$ABSF1= 16.522
##$ABSF2= -4.171173
##$ABSG= 5
##$ABSL= 3
##$ALPHA= 0
##$AQORDER= 0
##$ASSFAC= 0
##$ASSFACI= 0
##$ASSFACX= 0
##$ASSWID= 0
##$AUNMP= <proc_1d>
##$AZFE= 0.1
##$AZFW= 0.1
##$BCFW= 0
##$BC_mod= 0
##$BYTORDP= 0
##$COROFFS= 0
##$CY= 12.5
##$DATMOD= 1
##$DC= 0
##$DFILT= <>
##$DTYPP= 0
##$F1P= 14.0000005364418
##$F2P= -0.99999901652339
##$FCOR= 0.5
##$FTSIZE= 32768
##$FT_mod= 6
##$GAMMA= 0
##$GB= 0
##$INTBC= 1
##$INTSCL= 1
##$ISEN= 128
##$LB= 0.3
##$LEV0= 0
##$LPBIN= 0
##$MAXI= 10000
##$MC2= 0
##$MEAN= 0
##$ME_mod= 0
##$MI= 0
##$NCOEF= 0
##$NC_proc= -4
##$NLEV= 6
##$NOISF1= 0
##$NOISF2= 0
##$NSP= 0
##$NTH_PI= 0
##$NZP= 0
##$OFFSET= 16.522
##$PC= 1
##$PHC0= 139.3935
##$PHC1= 12.15835
##$PH_mod= 1
##$PKNL= yes
##$PPARMOD= 0
##$PSCAL= 4
##$PSIGN= 0
##$REVERSE= no
##$SF= 250.13
##$SI= 32768
##$SIGF1= 0
##$SIGF2= 0
##$SINO= 400
##$SIOLD= 32768
##$SREGLST= <1H.CDCl3>
##$SSB= 0
##$STSI= 32768
##$STSR= 0
##$SW_p= 5175.98343685301
##$SYMM= 0
##$S_DEV= 0
##$TDeff= 65536
##$TDoff= 0
##$TI= <Analysis number 999999
Compound Code 99
Book Reference 9
Project Code 9>
##$TILT= no
##$TM1= 0
##$TM2= 0
##$TOPLEV= 0
##$USERP1= <user>
##$USERP2= <user>
##$USERP3= <user>
##$USERP4= <user>
##$USERP5= <user>
##$WDW= 1
##$XDIM= 32768
##$YMAX_p= 313214363
##$YMIN_p= -151740
$$ End of Bruker specific parameters
$$ ---------------------------------
##NTUPLES= NMR SPECTRUM
##VAR_NAME=  FREQUENCY,     SPECTRUM/REAL,   SPECTRUM/IMAG
##SYMBOL=    X,             R,               I
##VAR_TYPE=  INDEPENDENT,   DEPENDENT,       DEPENDENT
##VAR_FORM=  AFFN,          ASDF,            ASDF
##VAR_DIM=   32768,         32768,           32768
##UNITS=     HZ,            ARBITRARY UNITS, ARBITRARY UNITS
##FACTOR=    0.157963299565203, 1,           1
##FIRST=     4132.6476996994, 0,             0
##LAST=      -1043.33573715361, 0,           0
##MIN=       -1043.33573715361, -151740,     0
##MAX=       4132.6476996994, 313214363,     0
$$ Real data points
##PAGE= N=1
##DATA TABLE= (X++(R..R)), XYDATA
$$ [...]
20305F3551k2931j8893j1745k583K2836j1589j2471j7173j7956K055M4486J86
$$ 63551 40620 21727 9982 7399 30235 18646 6175 -10998 -28954 -26899 17587 17773
20293A7773J3613K6775j0706J5288k2479l6867n330M928L2348m35n0952j7733
$$ 17773 31386 58161 47455 62743 40264 3397 -1933 2995 35343 34908 -16044 -33777
20281c3777M2275M6529M548m1812q776K1418P000q141N781K1702J9227k3709l1154
$$ -33777 8498 55027 59575 17763 8987 30405 37405 29264 35045 56747 75974 52265 21111
20268B1111K2061J9205R331L2714o097J806K8468K3995l4077m2899J806l4970
$$ 21111 43172 62377 71708 104422 98325 100131 128599 152594 118517 75618 77424 42454
20256D2454o2490k9715j0129M9971N2028j716L802j4663J0197m0845n300R003
$$ 42454 -20036 -49751 -59880 -9909 42119 40403 44205 29542 39739 -1106 -6406 2597
20244B597K785R257l5970q429J2261k219J7136N818M7568L1992L5630p047l3491
$$ 2597 5382 14639 -21331 -29760 -17499 -19718 -2582 3236 50804 82796 118426 111379 77888
20231G7888k0835M4204J0701m3964l8898l1390l3922P458M479N3580L5348J8454
$$ 77888 57053 101257 111958 67994 29096 -2294 -36216 -28758 -24279 29301 64649 83103
20219H3103k1955J7902J6492l3053j9053j8033K829L1776q775o390R823O405m0910
$$ 83103 61148 79050 95542 62489 43436 25403 28232 60008 51233 44843 54666 61071 20161
20206B0161j4962K8564P285J3954k8861l2435j5808j4883J5137K9705L3321L1535
$$ 20161 5199 33763 41048 55002 26141 -6294 -22102 -36985 -21848 7857 41178 72713
20194G2713J6427J1976l3511L1805l5406l6702j162j3885K3724L2140P761k9294
$$ 72713 89140 101116 67605 99410 64004 27302 26140 12255 35979 68119 75880 46586
20182D6586j7488L5766N178j4993k2875j9898m575O5296K1004k6476k5360j9507
$$ 46586 29098 64864 70042 55049 32174 12276 7701 72997 94001 67525 42165 22658
20170B2658M8620K0377L891J9151O906p778j1280k9843l3045L1678L3046j6624
$$ 22658 71278 91655 95546 114697 121603 113825 102545 72702 39657 71335 104381 87757
20158H7757m0245l3624o109j742l0594J7362K0431J3977j4153n42J8580k2256
$$ 87757 47512 13888 7779 6037 -24557 -7195 13236 27213 13060 12518 31098 8842
20146H842j1618l233m9213O951K4624j8170k563L3946M0711L6959k1790j8913
$$ 8842 -2776 -6009 -55222 -48271 -23647 -41817 -44380 -10434 30277 67236 45446 26533
20134B6533m638J5491J4431l2979k9051j543J6127Q784k4210K1193J656P247j0007
$$ 26533 21895 37386 51817 18838 -10213 -11756 4371 13155 -11055 10138 11794 19041 9034
20121I034q189p675j1200Q51j2457J3255O632K935J7441K0622M1001J3783j2591
$$ 9034 845 -6830 -18030 -17179 -29636 -16381 -9749 -6814 10627 31249 72250 86033 73442
20108G3442j8632k0259l3134l4629L4318L0368L5889K5024m1363m670q861j9192
$$ 73442 54810 34551 1417 -33212 1106 31474 67363 92387 51024 46354 37493 18301
20096A8301p666q571j3106P6182p829k3805p400j1314K343j4215j1231q248J5138
$$ 18301 10635 2064 -11042 65140 57311 33506 26106 14792 17135 2920 -8311 -16559 -1421
20083a421P996K982N7126j2406K1751K0749k1314k9945j3172k1054r507M548K9684
$$ -1421 6575 9557 66683 54277 76028 96777 75463 45518 32346 11292 1785 6333 36017
20070C6017K2139L5677k9446o315j6699j2960j2758R441J7151J5326j2585m261
$$ 36017 58156 93833 64387 58072 41373 28413 15655 25096 42247 57573 44988 40727
20058D0727M877P686J8508L3625l1458l6595n598K167p719j7048J8759m2959O564
$$ 40727 45604 53290 71798 105423 73965 37370 31772 33939 26220 9172 27931 -15028 -8464
20045h464K912m076N1009J8938J43J2807k9273l4845L703j9007j9967K2175J8659
$$ -8464 -5552 -9628 41381 60319 60462 73269 43996 9151 12854 -6153 -26120 -3945 14714
20032A4714J1433p272j9016j1043l9267j4925M9421L7059j6987l5828J9586L6710
$$ 14714 26147 18875 -141 -11184 -50451 -65376 -15955 21104 4117 -31711 -12125 24585
20020B4585K1194k0717l4834k6029N1024K930l4891j0680r290J1907J3150K767
$$ 24585 45779 25062 -9772 -35801 15223 18153 -16738 -27418 -36708 -24801 -11651 -8884
20008h884R112L5865m358n207l9542j5222K3802M6038K7537j1668l3964K6501
$$ -8884 228 36093 31735 26528 -13014 -28236 -4434 41604 69141 57473 23509 50010
19996E0010M783n518O217m6209K0698L2741l1623m1922L1458J6897J6728p939
$$ 50010 54793 49275 55492 9283 29981 62722 31099 -10823 20635 37532 54260 46321
19984D6321J1974P9K17M2811N0978j6475l0753j5556n0768j6267J1848L6137j1622
$$ 46321 58295 58374 58591 101402 152380 135905 105152 89596 38828 22561 34409 70546 58924
19971E8924M193J5127o067j1756j9797j4155J6812j3339j0408p41j9543l020K778
$$ 58924 63117 78244 72177 60421 40624 26469 43281 29942 19534 18793 -750 -3770 -992
19958i92L5132J5198m0111k1514J3537R467j9191K0085l0246K0841M3880J8921
$$ -992 34140 49338 9227 -12287 1250 10717 -8474 11611 -18635 2206 46086 65007
19946F5007K1579k8332j5287j6118P463L261L610M808r77n453p244n590K85m1471
$$ 65007 86586 58254 42967 26849 34312 37573 41183 45991 45014 39561 32317 26727 27012 -14459
19932a4459L562N038J6825L0997n239m3552m0614J3238K8777M8953K0655o779
$$ -14459 -10897 -5859 10966 41963 36724 -6828 -47442 -34204 -5427 43526 64181 57402
19920E7402J6232K117L3586J530k1823M592J681q745j7073q20J824k6356m1751
$$ 57402 73634 75751 109337 110867 89044 93636 95317 86572 69499 68679 70503 44147 2396
19907B396j6175J1108N0486L3931j6291k541j752L6324j7158k3950R184J1358
$$ 2396 -13779 -2671 47815 81746 65455 62914 61162 97486 80328 56378 65562 76920
19895G6920O40P763j8169n4592n733K1380L1558k054J9943K5593j2056j3397m606
$$ 76920 77560 85323 67154 12562 6829 28209 59767 57713 77656 103249 91193 77796 73190
19882G3190j8998J885J2953k6237n947J4551J3015J535k3969j6301K1634p101
$$ 73190 54192 56077 69030 42793 36846 51397 64412 65947 41978 25677 47311 40210
19870D0210j3686J7274J3877K017K2139l466L82K1291J3873J47k1795m8669n3239
$$ 40210 26524 43798 57675 59692 81831 78365 78747 100038 113911 114058 92263 43594 -9645
19857i645k0895J1852K3451N631O541J803j1603p15J0758L2003K3102m561l1083
$$ -9645 -30540 -18688 4763 10394 16935 18738 7135 6420 17178 49181 72283 67722 36639
19844C6639j9540J4915O897k0788j5274K95J3175J017J5516J6027L454K8366J534
$$ 36639 17099 32014 38911 18123 2849 3144 16319 17336 32852 48879 52333 80699 82233
19831H2233n268r702k5011m6800K13J1618J2041m0989l0288j6554L023L6448K5891
$$ 82233 76965 67263 42252 -4548 -4335 7283 19324 -21665 -51953 -68507 -65484 -29036 -3145
19818c145J030m267K5369P802j4805j1323J8984J112k2341q472J5389J4881J6886
$$ -3145 -2115 -6382 18987 26789 11984 661 19645 20757 -1584 -10056 5333 20214 37100
19805C7100j685p519j5360N5965Q473m2093r382o224J5948k1044j3207j9198O296
$$ 37100 35415 27896 12536 68501 76974 34881 25499 19275 35223 14179 972 -18226 -11930
19792a1930J5558R826K4566k7110J7685J0838l621l3485L439R583o434r601K8314
$$ -11930 3628 13454 38020 10910 28595 39433 35812 2327 5766 15349 8915 -686 27628
19779B7628L6183P069j8939L987P670p36L4132j9170J6073K6191j8535m7526n5724
$$ 27628 63811 70880 51941 55928 63598 62862 96994 77824 93897 120088 101553 54027 -1697
19766a697l3932K9032J8962K0615k0374j2976M8488K3140l480j7814l6204o08
$$ -1697 -35629 -6597 12365 32980 12606 -370 48118 71258 67778 49964 13760 13152
19754A3152j1258J2790J8592M009j4602J2008N4136l997j4346l7197n7274n506
$$ 13152 1894 14684 33276 37285 22683 34691 88827 84830 70484 33287 -23987 -29493
19742b9493L1425J4755J4678L440j7531k6130K561K6144J3620l4735j7757J1316
$$ -29493 1932 16687 31365 34805 17274 -8856 -6295 19849 33469 -1266 -19023 -7707
19730g707P764M637m376m5686L0136L9378j1485L167K0955K1983k0885j6148Q866
$$ -7707 57 4694 318 -45368 -15232 24146 12661 15828 36783 58766 37881 21733 30599
19717C0599M7270j2601L147J6095O524j9560j2676l3494k9646J2186N3951j4563
$$ 30599 77869 65268 68415 84510 91034 71474 58798 25304 -4342 7844 61795 47232
19705D7232k5169p185j9440L8201L5044j0868N1292K3957o3976r832j1963k1363
$$ 47232 22063 14878 -4562 33639 68683 57815 109107 133064 69088 59256 47293 25930
19693B5930J1417K9852p880n7224M383L3520K3134J4419P880r541r574q919k1378
$$ 25930 37347 67199 59319 2095 6478 39998 63132 77551 85431 75890 66316 57397 36019
19680C6019L843J72l6565j4820K3652J5053j1737j4654J7145K2137N811j3227
$$ 36019 39862 40034 3469 -11351 12301 27354 15617 963 18108 40245 46056 32829
19668C2829L4549J0343j5974J9019l1636l0356j2032l2119K7207J6758j7467L6550
$$ 32829 67378 77721 61747 80766 49130 18774 6742 -25377 1830 18588 1121 37671
19656C7671P516o757J8009J2343N585n286P597K0815K2425j2124l350J6347J9161
$$ 37671 45187 38430 56439 68782 74367 69081 76678 97493 119918 107794 104444 120791 139952
19643A39952l3330K48l9005r0854r246L3218N465L152J4786Q438j324l390J132
$$ 139952 106622 106870 67865 -22989 -32235 983 6448 9600 24386 32824 31500 28110 29242
19630B9242q469k229m493J856O5226J4751m4881q983K2359q123m5496N5140K7784
$$ 29242 20773 18544 14051 15907 81133 95884 51003 42020 64379 56256 10760 65900 93684
19617I3684l4144k9873j4163K4952K8490N128l156j5281j264l584m0836j2795
$$ 93684 59540 29667 15504 40456 68946 74074 70918 55637 54373 50789 9953 -2842
19605b842L1740J8212L6339J4858j8693l6119k3333L61p535N111L1949K7195j356
$$ -2842 28898 47110 83449 98307 79614 43495 20162 20523 12988 18099 50048 77243 75887
19592G5887j9298j0827R392k716q577o785k5148Q491M5015J4907l192K3819l2610
$$ 75887 56589 45762 55154 52438 43861 37076 11928 20419 65434 80341 77149 100968 68358
19579F8358n34K1961l3906k1257J6683j1398j0961Q040k705k9509J5334L9938
$$ 68358 67824 89785 55879 34622 51305 39907 28946 36986 34281 4772 20106 60044
19567F0044J030j1809K2045L7612l3864k8340N588M2929J0147o5334m3846J8604
$$ 60044 61074 49265 71310 108922 75058 46718 52306 95235 105382 40048 -3798 14806
19555A4806L5093k5688N535l422M1378J2639n720J4537k1342m8142N6O489J9764
$$ 14806 49899 24211 29746 26324 67702 80341 74621 89158 67816 19674 19730 26219 45983
19542D5983L8484K5617J1002L650j0957L61o1129J2676J6634r955k0410n345k313
$$ 45983 84467 110084 121086 124736 113779 114140 53011 65687 82321 72366 51956 46611 44298
19529D4298J6058K7746J3148j3416j6490K4457M0211j1945n8657L752j2396k9937
$$ 44298 60356 88102 101250 87834 71344 95801 136012 124067 65410 69162 56766 26829
19517B6829N688K4302k391k6321J6598N8855q704m757L603K2074K9508l3024j7432
$$ 26829 32517 56819 54428 28107 44705 103560 94856 90099 93702 115776 145284 112260 94828
19504I4828O927k0854j0558M016m2376k8002K2269j2961J6476L8219O3738N073
$$ 94828 101755 80901 70343 74359 31983 3981 26250 13289 29765 67984 131722 136795
19492A36795k3102r973j361j5287m4034j4778l3493M180L8943M5284J3487M057
$$ 136795 113693 103720 102359 87072 43038 28260 -5233 -1053 37890 83174 96661 100718
19480A00718J1894j6811j3247k4302K527J553L704L0592J3403r962k0804k602
$$ 100718 112612 95801 82554 58252 60779 62332 66036 96628 110031 100069 79265 76663
19468G6663l1319J2395m628j9787J452J5856M50k2468L1188k1381k5933M3341
$$ 76663 45344 57739 53111 33324 34776 50632 51082 28614 59802 38421 12488 55829
19456E5829l7626k2463J1234L754J8174J3908j224K1294J639k7438O814o510k5848
$$ 55829 18203 -4260 6974 10728 28902 42810 41586 62880 64519 37081 43895 37385 11537
19443A1537J9123L2527J214k0978m9945N7652M2486J5735M9858K9665j2071m5673
$$ 11537 30660 63187 64401 43423 -6522 51130 93616 109351 159209 188874 176803 131130
19431A31130k4345j8148J1596k0089j1343j7654K6755j402j3j4713l0918q193
$$ 131130 106785 88637 100233 80144 68801 51147 77902 76500 76487 61774 30856 22663
19419B2663k165J4442o624k580J2691K2871p519J724J3442J1289P19K4787j5021
$$ 22663 20498 34940 28316 25736 38427 61298 53779 55503 68945 80234 80953 105740 90719
19406I0719j1597Q589j1260O096K2120l679j1521J8992L0430j8485o4559O273
$$ 90719 79122 87711 76451 82547 104667 100988 89467 108459 138889 120404 55845 62118
19394F2118L5469l0860j8461K5674L0699k9711j5179J5280K6091l3226k3089J4344
$$ 62118 97587 66727 48266 73940 104639 74928 59749 75029 101120 67894 44805 59149
19382E9149K6795k9135K337L1449l1533J3128j5493j988J0075k695L4597k437
$$ 59149 85944 56809 59146 90595 59062 72190 56697 54709 64784 62089 96686 94249
19370I4249k4786l2123J187L285m401J0290J1429M8221j0527k1581j1037M614
$$ 94249 69463 37340 38527 41812 37411 47701 59130 107351 96824 75243 64206 68820
19358F8820J8463M603J403n03L083k0369k146j266K8073L2309j7357j8006k4276
$$ 68820 87283 91886 93289 92786 95869 75500 73354 72088 100161 132470 115113 97107 72831
19345G2831K6452j4618K0221L0478l4782r162j8061Q563J7360k010J2215l6316
$$ 72831 99283 84665 104886 135364 100582 91420 73359 81922 99282 97272 109487 73171
19333G3171M229J5380J0413j825o728M952m654k2798m830M5444J6852K0938l0722
$$ 73171 77400 92780 103193 101368 94640 99592 94938 72140 67310 112754 129606 150544 119822
19320A19822m2218J6035M1090j7468j3972R93K3164k4157j3039o189m2080k2077
$$ 119822 77604 93639 134729 117261 103289 104282 127446 103289 90250 84061 41981 19904
19308A9904J0971O688J7492L9011j5105l7143M0671P141j0567K3268M2748j2875
$$ 19904 30875 37563 55055 94066 78961 41818 82489 89630 79063 102331 145079 132204
19296A32204m1986r875j4450p001K6436K599o761l0375o467K89j8710K0300O3362
$$ 132204 90218 80343 65893 58892 85328 87927 81166 50791 44324 44613 25903 46203 109565
19283A09565J727o031Q249o479L31j0951k8642j6309J4747K9782M4321j7533l111
$$ 109565 111292 105261 113510 107031 107362 96411 67769 51460 66207 95989 140310 122777 119666
19270A19666j3602m5375K4578J5975Q369J3546M4370j1202m090k0026j2439N718
$$ 119666 106064 60689 85267 101242 109611 123157 167527 156325 152235 132209 119770 125488
19258A25488J230k9834k6016r54L1408K4917k7293k9184m907J8095j9424j5112
$$ 125488 126718 96884 70868 69914 101322 126239 98946 69762 64855 82950 63526 48414
19246D8414K4711P39k4370j3016N686K9606J8740m579j0228j17j831L3036N759
$$ 48414 73125 73864 49494 36478 42164 71770 90510 85931 75703 75586 73755 106791 112550
19233A12550L2594L038l8977Q903m984K2304k4943j8325M3031M7750J6343N575
$$ 112550 145144 148182 109205 118108 113124 135428 110485 92160 135191 182941 199284 204859
19221B04859j9365n9982M997k3420k1197n00p904r337j0443L816K5220l1207k1105
$$ 204859 185494 125512 130509 107089 85892 85392 77488 68151 57708 61524 86744 55537 34432
19208C4432R563L4023Q078K8978L2345L952L157J884M571J0398P556l0304l4326
$$ 34432 43995 78018 86096 115074 147419 151371 154528 156412 160983 171381 178937 148633 114307
19195A14307R621k1648l9478l8338R736L0109L8686j3766j5171M1075J9427j3602
$$ 114307 123928 102280 62802 24464 34200 64309 102995 89229 74058 115133 134560 120958
19183A20958l4667L5059k8497l059M5280L9007R730o0670q955k8811K742L2412
$$ 120958 86291 121350 92853 89794 135074 174081 183811 123141 114186 85375 88117 120529
19171A20529J7915r999J5079L3376j6523k2986k4461k3996k1714j5392K4947J1842
$$ 120529 138444 128445 143524 176900 160377 137391 112930 88934 67220 51828 76775 88617
19159H8617J9475J8584j5669k3683J4976J7517J8843j8163l8032l4096l1949R643
$$ 88617 108092 126676 111007 87324 102300 119817 138660 120497 82465 48369 16420 26063
19147B6063O5368L283j4939K8715o448K4855K6449L3356k0555n2370o2n385m0778
$$ 26063 91431 94714 79775 108490 102042 126897 153346 186702 166147 113777 113715 108330 67552
19134F7552j582K4961J5872l814O959J4969R636j509J9809K480l1J9838N92q117
$$ 67552 65970 90931 106803 102989 109948 124917 134553 133044 152853 155333 155302 175140 175732 167615
19120A67615j05m875m0975q838J3474J9482p106L500L221l9326M1451j2734k8338
$$ 167615 167510 162635 121660 112822 126296 145778 138672 142172 145393 106067 147518 134784 106446
19107A06446J0090J5035K8135Q174k0829k3469Q07J2587k957o923k6240K5733
$$ 106446 116536 131571 159706 167880 147051 123582 124389 136976 134019 127096 100856 126589
19095A26589L7088j2859p455o915r223j4425k520K4307K3572N927j0638J1863
$$ 126589 163677 150818 143363 136448 127225 112800 110280 134587 158159 164086 153448 165311
19083A65311k4495r145l5339k1547J07J7410K5618J2069K8297l2541k1128J1307
$$ 165311 140816 131671 96332 74785 74892 92302 117920 129989 158286 125745 104617 115924
19071A15924j796M9640M8417K186n1537k5800J0705J5023q542K4315N578J2799
$$ 115924 114128 163768 212185 214371 162834 137034 147739 162762 154220 178535 184113 196912
19059A96912l3590j7720k8813k6778K5813M0017K0511J39l4592l9652L9601K2419
$$ 196912 163322 145602 116789 90011 115824 155841 176352 176491 141899 102247 141848 164267
19047A64267J4491L0737K22L965k2840j8176j1525J1282k5801j0275M0886k029
$$ 164267 178758 209495 209717 213682 190842 172666 161141 172423 146622 136347 177233 175204
19035A75204J932k6051o2277K9730J5249J5210O417M0784J5014O620K7041q32
$$ 175204 177136 151085 88808 118538 133787 148997 155414 196198 211212 217832 244873 244041
19023B44041j4195k3618k72j5620l4013l7305j1483k03o947j2029K4144K7756
$$ 244041 229846 206228 205956 190336 156323 119018 107535 107332 100385 88356 112500 140256
19011A40256J7056K8146n562N739m6918k0576K8341L2954m1915n319K1125M5341
$$ 140256 157312 185458 179896 185635 138717 118141 146482 179436 137521 132202 153327 198668
18999A98668k2721k6824j4573J9926Q428J3217M9926m287n309K9022P90l8341
$$ 198668 175947 149123 134550 154476 162904 176121 226047 221760 216451 245473 246263 207922
18987B07922j0885J1234J3350m895L322J4180O654k5055j0055J078M121k4205
$$ 207922 197037 208271 221621 216726 220048 234228 240882 215827 205772 206850 210971 186766
18975A86766m8759K9699O9885P3696J3564Q159j2004j7567J586M4359K9847J1183
$$ 186766 138007 167706 237591 311287 324851 333010 321006 303439 305025 349384 379231 390414
18963C90414m962K1556K8694j0908j5314o554n2064P428P3218J4952J2709P5863
$$ 390414 385452 407008 435702 424794 409480 402926 350862 358290 431508 446460 459169 535032
18951E35032J3044k1172l8643J6514O1823N491l6022j6645m3509m3765l3461k3950
$$ 535032 548076 526904 488261 504775 566598 572089 536067 519422 475913 432148 398687 374737
18939C74737n121n177J372Q541j0985J3414l890k8160k5508r685m913K270J2980
$$ 374737 369616 364439 365811 374352 363367 376781 372891 344731 319223 309538 304625 306895 319875
18926C19875L9026J1061l083k3555K5492K1913K787K6170K2083O57J5456N4864
$$ 319875 358901 369962 366879 343324 368816 390729 393516 419686 441769 442426 457882 512746
18914E12746R3033L8822n92O056j6973l4686K3184K1470K2368l6190p1683p587
$$ 512746 605779 644601 644009 650065 633092 598406 621590 643060 665428 629238 557555 549968
18902E49968Q520m8972k2812M862N805l7509l4421l3330j9417j7573l4459k2929
$$ 549968 558488 509516 486704 491566 497371 459862 425441 392111 372694 355121 320662 297733
18890B97733N3666M6212l2121k0846r13j2233R1n4528m7375r214L5920L5026o199
$$ 297733 351399 397611 365490 344644 343731 331498 331589 277061 229686 220472 256392 291418 285219
18877B85219o323j638L8158L8514l055K9761k9686l306p098n3749J5402K4933
$$ 285219 278896 277258 315416 353930 350875 380636 350950 347644 340546 286797 302199 327132
18865C27132j6204K2588l0856j5952P294R695M1612K6912L3187k6050n4940j9978
$$ 327132 310928 333516 302660 286708 294002 303697 345309 372221 405408 379358 324418 304440
18853C04440p315j698o780J3644Q775p908j9856r175J5192l5398J101K8975J9988
$$ 304440 297125 295427 288647 302291 311066 303158 283302 274127 289319 253921 255022 283997 303985
18840C03985j0031N914J5213K4839k1478j7682J6831P51j7350m7954J5233M5620
$$ 303985 293954 299868 315081 339920 318442 300760 317591 318342 300992 253038 268271 313891
18828C13891r682M678O0443O5690L3314K8883j6538j445K2366o344M4208J4143
$$ 313891 304209 308887 369330 435020 468334 497217 480679 479234 501600 495256 539464 553607
18816E53607j5605J4711j0647r751J4187O65J3390k9862o2652n2550l3171J4482
$$ 553607 538002 552713 542066 532315 546502 547167 560557 530695 468043 415493 382322 396804
18804C96804J8945K0632j6126j8690J3629L0068m7760k3340l817L8459j0817m1414
$$ 396804 415749 436381 420255 401565 415194 445262 397502 374162 370345 408804 397987 356573
18792C56573r906L1954j7702r992J6904M3114K3484k9941j5174k0878J1865K5919
$$ 356573 346667 378621 360919 350927 367831 410945 434429 404488 389314 368436 380301 406220
18780D06220J5216P421m172K3358O8859N7721K0547l3373j571L2808M4208P228
$$ 406220 421436 428857 424685 448043 516902 574623 595170 561797 560226 593034 637242 644470
18768F44470M6174O8751R7719J40827Q0161J3795q912j03425r7266q5845m3219
$$ 644470 690644 759395 857114 997941 1078102 1091897 1082985 979560 882294 796449 753230
18757G53230J924J5421J156K6129K2876n9155o5883q5225p6377m7428K8179M1956
$$ 753230 755154 770575 771731 797860 820736 761581 695698 610473 534096 486668 514847 556803
18745E56803O036j0452k5826p1065m2658k7091k9633M2648J8789N402o512k0643
$$ 556803 562839 552387 526561 455496 412838 385747 356114 398762 417551 422953 416441 395798
18733C95798J4125j808J9735L5457M6454K2395j7275m329m319K2708M8926O4401
$$ 395798 409923 408115 427850 463307 509761 532156 514881 510552 506233 528941 577867 642268
18721F42268O8545L7396N962K5977K7025K2017j9253j5061k6635K6238K2807K4525
$$ 642268 710813 748209 754171 780148 807173 829190 809937 794876 768241 794479 817286 841811
18709H41811J9297J9545L1344r481k5413j2935p0091l8768k9071l727j3201M5548
$$ 841811 861108 880653 911997 902516 877103 864168 794077 755309 726238 722511 709310 754858
18697G54858J6801k6210o7466o7682j6278K400p282j4015m434O752n031j6154
$$ 754858 771659 745449 677983 610301 594023 596423 589141 575126 570692 577444 572413 556259
18685E56259l6527L786l280L896L011k6352Q668R187O60J3046k7996J4864J1016
$$ 556259 519732 523518 520238 524134 527145 500793 509461 518648 519308 532354 504358 519222 530238
18672E30238m816M354J8875N327L8323J8060M1658L6480K5824n847L9392J2627
$$ 530238 525422 529776 548651 553978 592301 610361 652019 688499 714323 708476 747868 760495
18660G60495j5457m9702o034p485j5900j4691l5285n54M163J5147J608j7059r396
$$ 760495 745038 695336 689302 681817 665917 651226 615941 615387 619550 634697 636305 619246 609850
18647F09850k4441k9681k3335k8646J6159P625P792j3172r790N750m7572l0723
$$ 609850 585409 555728 532393 503747 519906 527531 535323 522151 512361 518111 470539 439816
18635D39816o041J8030J3473j1615J6849k4246r551j4431J5086M8464K6274q43
$$ 439816 433775 451805 465278 453663 470512 446266 436715 422284 437370 485834 512108 511265
18623E11265K126k2619J3268L8656J058J6616J1335j8249m9938j6930J9254j0558
$$ 511265 513391 490772 504040 542696 543754 560370 571705 553456 503518 486588 505842 495284
18611D95284L3066Q980m1688J9425M4584M693k530K3378M5117K8937K4698l9955
$$ 495284 528350 537330 495642 515067 559651 564344 561814 585192 630309 659246 683944 643989
18599F43989l9383k5707j4702M7794Q235j3030j8651j8217J5127l8458n437M933
$$ 643989 604606 578899 564197 611991 620226 607196 588545 570328 585455 546997 541560 546493
18587E46493o983J1741L5693K5010j740K117j0353K3715l5446l5364o767K3679
$$ 546493 539510 551251 586944 611954 610214 612331 601978 625693 590247 554883 548116 571795
18575E71795L7882M5807J2128M2109N34L634j597n5566p0699K047K8234K7397
$$ 571795 609677 655484 667612 709721 710255 713889 712292 656726 586027 588074 616308 643705
18563F43705L1374j7763K4992J5228L1993J7509J9072M3531j7384l464J7979M2786
$$ 643705 675079 657316 682308 697536 729529 747038 766110 809641 792257 788793 806772 849558
18551H49558q503k3179j911K6329L4166K219l1616N028l491J8820J533k0437n5893
$$ 849558 841055 817876 815965 842294 876460 878679 847063 852091 848600 867420 868953 848516 792623
18538G92623n311K0857P3006M5684m657O5440O1072n017l2330j0946L2705L7297
$$ 792623 787312 808169 881175 926859 922202 987642 1048714 1043697 1011367 1000421 1033126 1070423
18526A070423J220j8869j5731q056L1074N8628p19R521L0978L6227J23J8934K6006
$$ 1070423 1071643 1052774 1037043 1028987 1060061 1118689 1117970 1127491 1158469 1194696 1194819 1213753 1239759
18513A239759K5436M4840J00898J36033J19884J18890M0323J7982p1845l6318
$$ 1239759 1265195 1310035 1410933 1546966 1666850 1785740 1826063 1844045 1772200 1735882
18503A735882N934O0332P6251M8556R9921J57648R9994J24621J61683J02447R7766
$$ 1735882 1741816 1802148 1878399 1926955 2026876 2184524 2284518 2409139 2570822 2673269 2771035
18492B771035J45512J19836R2889J25454J43208J24998J62968J88357J94169K93817
$$ 2771035 2916547 3036383 3129272 3254726 3397934 3522932 3685900 3874257 4068426 4362243
18482D362243M20854N27755P68065J131141J564731J974179K433516K822741L029736
$$ 4362243 4783097 5310852 6078917 7210058 8774789 10748968 13182484 16005225 19034961
18473A9034961K967349K643332K229699J794873J590735J533927J416295J335024
$$ 19034961 22002310 24645642 26875341 28670214 30260949 31794876 33211171 34546195
18465C4546195J263031J467181K144099K940417L500680L781194L483008K320418
$$ 34546195 35809226 37276407 39420506 42360923 45861603 49642797 53125805 55446223
18457E5446223N58759j401136l315447m214422m031830l306371k339125j447248
$$ 55446223 56004982 54603846 51288399 47073977 43042147 39735776 37396651 35949403
18449C5949403r18695p24182n09287l68103l49233l87803m07759m37231o57478
$$ 35949403 35030708 34306526 33797239 33429136 33079903 32692100 32284341 31847110 31189632
18440C1189632n91390k68047j1614L69430P67024J243483J578972J699191J815311
$$ 31189632 30598242 30330195 30318581 30688011 31455035 32698518 34277490 35976681 37791992
18431C7791992J874532J726095J569718J997162K561417L326495M341072N396874
$$ 37791992 39666524 41392619 42962337 44959499 47520916 50847411 55188483 60585357
18423F0585357O204310O448280N978196M965002L171459Q73590p27860r80184
$$ 60585357 66789667 73237947 79216143 84181145 87352604 88226194 87498334 86518150
18415H6518150n98372J19396O24941P1943j609442k764858k149243l28597R72770
$$ 86518150 85919778 86039174 86664115 86736058 85126616 82361758 80212515 79883918 80856688
18406H0856688J34576k120267m373319n632055n970742o085129o170917n932064
$$ 80856688 80991264 78870997 74497678 68865623 62894881 56809752 50638835 44706771
18398D4706771n246997m435396l676736k897214k238022j729008j276305r31431
$$ 44706771 39459774 35024378 31347642 28450428 26212406 24483398 23207093 22275662
18390B2275662p64522o14658n33855m58163m28126m10245m47209m12491l83996
$$ 22275662 21511140 20896482 20362627 19904464 19476338 19066093 18618884 18206393 17822397
18381A7822397k81658k99902l98774m34034k67610j56588j00021L975L21717Q65651
$$ 17822397 17540739 17240837 16842063 16408029 16140419 15983831 15883810 15887785 16209502 17075153
18371A7075153J602479K398514K654214K066957P02459q63869k101815k498732
$$ 17075153 18677632 21076146 23730360 25797317 26499776 25635907 23534092 21035360
18363B1035360k163818j400985n85353K31687J108949K082409K986812L247254
$$ 21035360 18871542 17470557 16885204 17116891 18225840 20308249 23295061 26542315
18355B6542315K646329J122395q01924k563512l432735l383820k698829j920216
$$ 26542315 29188644 30311039 29509115 26945603 23512868 20129048 17430219 15510003
18347A5510003j237775o22522k46176j78650k03414m11715n61101n88316m48540
$$ 15510003 14272228 13649706 13403530 13224880 13021466 12609751 12048650 11460334 11011794
18338A1011794l16487k00794q6007O528J40084K66613L67959M44600O31834Q55812
$$ 11011794 10695307 10494513 10408506 10415034 10555118 10821731 11189690 11634290 12266124 13121936
18328A3121936J263514J925207L025615M713550P016410R380844J0560363R182501
$$ 13121936 14385450 16310657 19336272 24049822 31066232 40447076 51007439 60189940
18320F0189940M751179j272357o272815q249093p568765n545202l540483j981416
$$ 60189940 64941119 63668762 57395947 49146854 41578089 36032887 32492404 30510988
18312C0510988o25869R32807K661836M371726N268621M369209J404013k726740
$$ 30510988 29885119 30817926 33479762 37851488 43120109 47489318 48893331 46166591
18304D6166591n520364n914739m843307l306448j925200q57835J04856J092912
$$ 46166591 40646227 34731488 29888181 26581733 24656533 23798698 23903554 24996466
18296B4996466K456552M419730O821364R010389R421643O837225J749084l872311
$$ 24996466 27453018 31872748 38694112 47704501 57126144 63963369 65712453 61840142
18288F1840142p256658p420548n480235k655446L10043L202922N887959P658990
$$ 61840142 54583484 47162936 41682701 39027255 39337298 42540220 48428179 56087169
18280E6087169P335006N223365L019533K771838L982295K909713k030485q744428
$$ 56087169 63422175 68645540 71665073 74436911 78419206 81328919 79298434 70554006
18272G0554006j1958835r982345o311795l424631j328255M34263K326393M508972
$$ 70554006 58595171 48612826 42301031 38876400 37548145 37982408 40308801 44817773
18264D4817773O941102R304714J0479843R215625N342593j178574o276143p778638
$$ 44817773 51758875 61063589 71543432 80759057 86101650 84923076 78646933 70868295
18256G0868295p786506n495192l822296m000944l262153k72026L139116N888321
$$ 70868295 63081789 57586597 53764301 49763357 46501204 46229178 49368294 55256615
18248E5256615P077659N769129K014608k892780n827417o381132n862020m717396
$$ 55256615 62334274 68103403 70118011 67225231 61397814 55016682 49154662 44437266
18240D4437266k902671p28308J398825L073651L643964K659220M05056k338706
$$ 44437266 41534595 40806287 42205112 45278763 48922727 51581947 51987003 49648297
18232D9648297m004699l985132l025359j924500r81725j9136O03921M29533k14469
$$ 49648297 45643598 41658466 38633107 36708607 35726882 35707746 36311667 36741200 36526731
18223C6526731N4204J539466L065305L315997K136102J47152K02178L392809P709698
$$ 36526731 36580935 38120401 41185706 44501703 46637805 46784957 46987135 50379944 58089642
18214E8089642J0837464J1598512R771403O500444M508800P97819m646892q379056
$$ 58089642 68927106 80525618 90297021 96797465 101306265 102104084 97457192 89078136
18206H9078136p608153k990408L027193N872403L568067l219985r141339j0808319
$$ 89078136 81469983 78479575 81506768 87379171 90947238 87727253 78585914 67777595
18198F7777595r637004o998894m373724k166754m65816N30395P01327K16937j57581
$$ 67777595 58140591 51141697 46767973 44601219 44135403 44665798 45367125 45584062 45426481
18189D5426481n47658j845887k908624k639796j913598j268251j212718j882683
$$ 45426481 44878823 43032936 40124312 37484516 35570918 34302667 33089949 31207266
18181C1207266k567875k439028j898171j366923j050055p53805l82362m8341K60373
$$ 31207266 28639391 26200363 24302192 22935269 21885214 21131409 20749047 20700706 20961079
18172B0961079O12164J071902J842113K949046L971269M332493L902509L124346
$$ 20961079 21573243 22645145 24487258 27436304 31407573 35740066 39642575 42766921
18164D2766921L061547L689220M050559M546934P591643J0736095J0048033K937887
$$ 42766921 45828468 49517688 53568247 58115181 65706824 76442919 86490952 89428839
18156H9428839n422528j2956133j6263190j2342067p816209n003903l321461k234524
$$ 89428839 84006311 71050178 54786988 42444921 34628712 29624809 26303348 24068824
18148B4068824j530211j086018p13482k29154M17398R43696Q20160q5949j610673
$$ 24068824 22538613 21452595 20739113 20509959 20927357 21871053 22691213 22605264 20994591
18139B0994591k404633j993187j415613j086007q18867n99011n23754m52335l98575
$$ 20994591 18589958 16596771 15181158 14095151 13276284 12677273 12153519 11701184 11302609
18130A1302609l64791k46134j43302j76827j77552k42513l14971k76560k45472
$$ 11302609 10937818 10691684 10548382 10371555 10194003 9951490 9636519 9359959 9114487
18121I114487j83655j37490j07599j30330p6268J4505J34448K47367M87294P05403
$$ 9114487 8930832 8793342 8685743 8555413 8479145 8493650 8628098 8875465 9362759 10068162
18111A0068162J069021J707105L058900N913996J0763808J3689292J0262341J018050
$$ 10068162 11137183 12844288 15903188 21817184 32580992 46270284 56532625 57550675
18103E7550675j3524925j4481583q360964m680381k783360j785168j228670q63396
$$ 57550675 44025750 29544167 21183203 16502822 13719462 11934294 10705624 9842228
18095I842228o32012n09569m85833m42490l25709k88323k78839k39599k26339
$$ 9842228 9210216 8700647 8214814 7772324 7446615 7158292 6879453 6639854 6413515
18086F413515k55220k53981k15626j76880j82361j77516j83919j56309j19050
$$ 6413515 6158295 5904314 5688688 5511808 5329447 5151931 4968012 4811703 4692653
18077D692653j51987j40874o5899m4977j01126j07564j12683r8901j14570j32890
$$ 4692653 4540666 4399792 4333893 4288916 4187790 4080226 3967543 3868642 3754072 3621182
18067C621182q9683q2879q0953n9809o6262q4917q4810m1148m6957j13407r2750
$$ 3621182 3531499 3448620 3367667 3307858 3241596 3156679 3071869 3030721 2983764 2870357 2777607
18056B777607n9203r0475j08002n9798m6873l3135l2871l2766j3995N269M565
$$ 2777607 2718404 2627929 2519927 2460129 2413256 2380121 2347250 2314484 2300489 2305758 2310323
18045B310323K1979J3963N369j0566m9463n6719j09148r9383o0492m5649p0845
$$ 2310323 2332302 2346265 2351634 2341068 2291605 2234886 2125738 2026355 1965863 1920214 1849369
18034A849369o6708m6304m4536m4976n3501n7573m8358l7582Q130n816l2083M1847
$$ 1849369 1782661 1736357 1691821 1646845 1593344 1535771 1487413 1449831 1457961 1452145 1420062 1461909
18022A461909M2759N4843M9590l329L416k3220j1240j7974P348M2883N098q846
$$ 1461909 1504668 1559511 1609101 1605772 1609188 1585968 1574728 1556754 1564102 1606985 1612083 1603237
18010A603237o0168p3763o3618p9271n7069n8237p9266n4013m387L3588k7701
$$ 1603237 1543069 1469306 1405688 1326417 1269348 1211111 1131845 1077832 1073445 1107033 1079332
17999A079332j9761k3379m2367m4886o9011j8549j1177J2678K7037j6890k7228
$$ 1079332 1059571 1036192 993825 948939 879928 861379 850202 862880 889917 873027 845799
17988H45799m4693J4967j6348M110L117k1726j1212j1121R403R52n4345l3119
$$ 845799 801106 816073 799725 803835 806952 785226 774014 762893 772296 773248 718903 685784
17976F85784m4826l3655j8850n965L0428M00r804n31J7440K3336M6388N3012J1286
$$ 685784 640958 607303 588453 582488 612916 613316 603512 602981 620421 643757 690145 743157 754443
17963G54443K8032J2535n057J2286M9171N811J3078J9206M3965N667K2615j9868
$$ 754443 782475 795010 789953 802239 851410 857221 870299 889505 933470 939137 961752 941884
17951I41884J6934M4832p070j2159m9815j5616k0685o1308p1100n1547l2662j6384
$$ 941884 958818 1003650 996580 984421 934606 918990 898305 836997 765897 714350 681688 665304
17939F65304O749j7421q237O863K2036k1549m4712l6565J5202L659K2590j202
$$ 665304 672053 654632 646395 653258 675294 653745 609033 572468 587670 591329 613919 612717
17927F12717M223j2710k455O9293K8511j6886R101k3495j8173j6041R521L6910
$$ 612717 616940 604230 601775 671068 699579 682693 691794 668299 650126 634085 643606 680516
17915F80516N5090K5948r824r110j847o403j9141j7157k6764L215j2358N08j257
$$ 680516 735606 761554 751730 742620 740773 734370 715229 698072 671308 674523 662165 662673 661416
17902F61416Q9j7187l428r95l669M3527j4214m2464m1663k3876L5487M8679k0142
$$ 661416 661505 644318 640890 639895 636226 679753 665539 623075 581412 557536 593023 641702 621560
17889F21560o7849l0491p752j3225K3960P423J745K978k1218j4097K0869n59k2812
$$ 621560 553711 523220 515468 502243 526203 533626 535371 538349 517131 503034 523903 523344 500532
17876E00532J9262j2597K0623K9370p292k8222l4450J4725J6768o764j4204J2799
$$ 500532 519794 507197 527820 557190 549898 521676 487226 501951 518719 511955 497751 510550
17864E10550k0698K0764K3967J0213m0868o707k2711L26j3321L1574N0171M8620
$$ 510550 489852 510616 534583 544796 503928 497221 474510 474836 461515 493089 543260 591880
17852E91880M6959j1610k4765K7787N5424P74m5766O306J4615Q561J3084J5960
$$ 591880 638839 627229 602464 630251 685675 686449 640683 646989 661604 670165 683249 699209
17840F99209L4546k901M963j1613k5774J2774k980j2620K378L3128K179j3042
$$ 699209 733755 730854 735817 724204 698430 711204 708224 695604 697982 731110 733289 720247
17828G20247k4626J0850M5674N3225L8408q596J1524l6881k7483Q960J160l9863
$$ 720247 695621 706471 752145 805370 843778 835182 846706 809825 782342 791302 792462 752599
17816G52599N2586K3899J5052L2604L8837K8221j6726m861J9483M0672Q8702O5474
$$ 752599 805185 829084 844136 876740 915577 943798 927072 922211 941694 982366 1071068 1136542
17804A136542J5650K2887J4692J989J3700L431J2457N1544Q9576Q2341O3813J8518
$$ 1136542 1152192 1175079 1189771 1191760 1205460 1208891 1221348 1272892 1362468 1444809 1508622 1527140
17792A527140M179R382L7410L4970L8221L7548M1045J03574P2831N9806P8267
$$ 1527140 1531319 1540701 1578111 1613081 1651302 1688850 1729895 1833469 1906300 1966106 2044373
17781B044373Q6011Q5344J11944J13790Q7329N9358N9529R2010J57837J51075
$$ 2044373 2130384 2215728 2327672 2441462 2528791 2588149 2647678 2739688 2897525 3048600
17771C048600K23347L17618L34047L94670N27774O39375Q14737J057563J416332
$$ 3048600 3271947 3589565 3923612 4318282 4846056 5485431 6300168 7357731 8774063
17762H774063J838789K124129K264788K312023K664818L238380L397108L115090
$$ 8774063 10612852 12736981 15001769 17313792 19978610 23216990 26614098 29729188
17754B9729188L502793M905654O260818O824184O019263M716736L622924J072044
$$ 29729188 33231981 38137635 44398453 51222637 57241900 61958636 65581560 66653604
17746F6653604l049782l565074J037748O782282J2156103J5732414J4813704P691909
$$ 66653604 63603822 60038748 61076496 67858778 80014881 95747295 110560999 118252908
17738A18252908k109639p427793n867957k557549k266435l961206m141781l131259
$$ 118252908 116143269 108715476 102847519 100289970 98023535 94062329 89920548 86789289
17730H6789289m201997p800004j0364184r326253o186105k882404j6838K261770
$$ 86789289 82587292 74787288 64423104 55096851 48910746 46028342 46011504 48273274
17722D8273274L238186K211466n00831l306592m040787k600170n46623J243735
$$ 48273274 51511460 53722926 53222095 49915503 45874716 43274546 42727923 43971658
17714D3971658K030277J667393L08829l87381O84944K190198M469457Q579540
$$ 43971658 46001935 47669328 47978157 47590776 48275720 50465918 54935375 63514915
17706F3514915J2210140J1780260N784603l178876q798928p164824k651782N9958
$$ 63514915 75725055 87505315 93289918 90111042 81312114 74147290 71495508 71555466
17698G1555466j28503j167220k048363j908746l92187Q25299R05053r6506j149119
$$ 71555466 71426963 70259743 68211380 66302634 65910447 66735746 67640799 67544293 66395174
17689F6395174J75531M106793P892913Q690000N361811m39249l549061k024104
$$ 66395174 66570705 70677498 78570411 87260411 92622222 92182973 88633912 86609808
17681H6609808K320707N571156L469030m317941j2986003j4915917j0987560o674596
$$ 86609808 88930515 94501671 97970701 93652760 80666757 65750840 54763280 48088684
17673D8088684l993030k882479k634485k242392j263032K18796J917292L045110
$$ 48088684 44095654 41213175 38578690 36336298 35073266 35292062 37209354 40254464
17665D0254464K742797Q68346j784421k053357l97602J223195J916598R68963
$$ 40254464 42997261 43865607 42081186 40027829 39630227 40853422 42770020 43738983
17657D3738983j947319n035231m951527k968768j222076l32483n45013j633909
$$ 43738983 41791664 36756433 31804906 28836138 27614062 27281579 26736566 25102657
17649B5102657k689042k436326j735020j282968j001249p93527o33522n96686
$$ 25102657 22413615 19977289 18242269 16959301 15958052 15164525 14531003 13934317
17641A3934317n41015l95144m02444m48389m16720l87034l15774k56314k53465
$$ 13934317 13393302 12998158 12595714 12147325 11730605 11343571 11027797 10771483 10518018
17632A0518018l30410l93036l46913l16951l02127k69769k23283k37473k57406
$$ 10518018 10187608 9794572 9447659 9130708 8828581 8558812 8335529 8098056 7840650
17623G840650k47709k55907k08897j88287j73280k01128j82804j13297j73794
$$ 7840650 7592941 7337034 7128137 6939850 6766570 6565442 6382638 6269341 6095547
17614F095547j62189j27806j24210j46932j76081j78647j37872j48452j59325
$$ 6095547 5933358 5805552 5681342 5534410 5358329 5179682 5041810 4893358 4734033
17605D734033r2411q8813j31102j42385j49302j26982j02281j04398o6123p8480
$$ 4734033 4641622 4552809 4421707 4279322 4130020 4003038 3900757 3796359 3730236 3651756
17595C651756r3343n4547p0260r5724q8617j18849q7904n7431q9847r1408q1994
$$ 3651756 3558413 3503866 3433606 3337882 3249265 3130416 3042512 2985081 2895234 2803826 2721832
17584B721832o7318o6701l2810o3015q6162p1400p7151n0593k8416q0044l7803
$$ 2721832 2654514 2587813 2555003 2491988 2405826 2334426 2257275 2206682 2178266 2098222 2060419
17573B060419r225q4749n0201r138m5041p7457o3323m1553m3568k0317k7753n7599
$$ 2060419 2051194 1966445 1916244 1907106 1862065 1784608 1721285 1679732 1636164 1615847 1588094 1530495
17561A530495j02260m6127P627j6507l6195p8666n5315m4969l2494j0709Q204
$$ 1530495 1428235 1382108 1389735 1373228 1337033 1258367 1203052 1158083 1125589 1114880 1123084
17550A123084l6442p4635l5616n6104m0365r834J0324J071n62k959J3938l9362
$$ 1123084 1086642 1012007 976391 920287 879922 870088 880412 881483 880921 877962 891900 852538
17538H52538m2697o9781m6799j1347k1055j4480J8515n0642j5551K9031Q854k6277
$$ 852538 809841 740060 693261 681914 660859 646379 664894 614252 598701 627732 636586 610309
17526F10309n4804l1754n0594o067J4305j2014l1006j7448J1512L5452K6689k6626
$$ 610309 555505 523751 473157 467090 481395 469381 438375 420927 432439 467891 494580 467954
17514D67954k8979j3834l5628k7777m0910j2399j6098k9687k1135P977l993k0349
$$ 467954 438975 425141 389513 361736 320826 308427 292329 262642 241507 249484 245491 225142
17502B25142j086J0351M128k1565O178j6375K8689J5016j8273j0395J950L4592
$$ 225142 224056 234407 238535 216970 223148 206773 235462 250478 232205 221810 223760 258352
17490B58352l9095l0071k6745l8515J0966n072M6268K2895J0601j5739k9994r427
$$ 258352 219257 189186 162441 123926 134892 129820 176088 198983 209584 193845 163851 154424
17478A54424n213j3371Q6M326K2028k2272N638K0862l704P846M694K1l0274M772
$$ 154424 149211 135840 135926 140252 162280 140008 145646 166508 162804 170650 175344 175365 145091 149863
17464A49863r499k358N710n187j9176m0365P875L0868m168k4725N890L7291l353
$$ 149863 140364 138006 143716 138529 119353 78988 86863 117731 113563 88838 94728 132019 128666
17451A28666m1938q941k0284Q828K5996j1785J1641K7499L3425K5781M1877L2070
$$ 128666 86728 77787 57503 66331 92327 80542 92183 119682 153107 178888 220765 252835
17439B52835K1568M5290l829q9110p3293k0402j6824m530K6737J474J749n270
$$ 252835 274403 319693 315864 226754 153461 133059 116235 111705 138442 139916 141665 136395
17427A36395j0981O512k6537l4598m087j3308K7664O4881k7300o3569j9169K656
$$ 136395 125414 131926 105389 70791 66704 53396 81060 145941 118641 55072 35903 38559
17415C8559O607J5701M149L8288l7272m5300n311m268r891J5464M5638L2207k2149
$$ 38559 45166 60867 65016 103304 66032 20732 15421 11153 1262 16726 62364 94571 72422
17402G2422r355k6913l0085J1725J6797K4164j2889r382l9299j8659j9088r667
$$ 72422 63067 36154 6069 17794 34591 58755 45866 36484 -2815 -21474 -40562 -50229
17390e0229J086J6284j1283k7571M3581K7793j1918p765p093O367k84K52K9756
$$ -50229 -49143 -32859 -44142 -71713 -28132 -339 -12257 -20022 -27115 -20748 -21032 -20780 8976
17377H976k720j9165k0151m973K7572M6318k6189m8835k1195j1024j1236l3409
$$ 8976 6256 -12909 -33060 -38033 -10461 35857 9668 -39167 -60362 -71386 -82622 -116031
17365a16031M139P088J5116L0468K6895O924l1392K8128k3944k1686N30K7118
$$ -116031 -111892 -104804 -89688 -59220 -32325 -25401 -56793 -28665 -52609 -74295 -73765 -46647
17353d6647R679J3019N050l5514l4591n303n1760K3807M7895K0832r839j0270
$$ -46647 -36968 -23949 -18899 -54413 -89004 -94307 -146067 -122260 -74365 -53533 -63372 -73642
17341g3642k8831J6181J8773L6969M079l895N033n658k1195n220k2627J696n5
$$ -73642 -102473 -86292 -67519 -30550 -26471 -30366 -25333 -30991 -52186 -57406 -80033 -78337 -78392
17328g8392L2373j9237l069K2873j652j6466j0022j1172j514l1970j041R957K4472
$$ -78392 -46019 -65256 -68325 -45452 -47104 -63570 -73592 -84764 -86278 -118248 -119289 -109332 -84860
17315h4860O7103L0356l4848k7923M284k7235j4222K6411k844j1059n421L7157
$$ -84860 -17757 12599 -22249 -50172 -45888 -73123 -87345 -60934 -63778 -74837 -80258 -43101
17303d3101J5370Q460l0340L782j3012j7324M4329L651n3517q779J2725L1180
$$ -43101 -27731 -19271 -49611 -45829 -58841 -76165 -31836 -28185 -81702 -90481 -77756 -46576
17291d6576K3594J2883K1024L7931j198m4080j5929j3098n241J1299J4633K6359
$$ -46576 -22982 -10099 10925 48856 47658 3578 -12351 -25449 -30690 -19391 -4758 21601
17279B1601M6737j8095k9158n795J1560j439k3818J922l3785l3546J838j4457
$$ 21601 68338 50243 21085 15290 26850 25411 1593 3515 -30270 -63816 -61978 -76435
17267g6435j5601j19N9788J3269Q366L3245K1216l9996l9850j7945M556m375q542
$$ -76435 -92036 -92155 -32367 -19098 -10732 22513 43729 3733 -36117 -54062 -49506 -53881 -62423
17254f2423K7734O3874J5408K8410J2082P809O3941O4869K6810L8887K8426L2483
$$ -62423 -34689 29185 44593 73003 85085 92894 156835 221704 248514 287401 315827 348310
17242C48310L2965k5389L36K7202m9061k4261J6079M3233P4967K3872j8768j2856
$$ 348310 381275 355886 356222 383424 334363 310102 326181 369414 444381 468253 449485 436629
17230D36629k9773p4928l8650r573N4912k1998m5395J9812K327P633k581k5420
$$ 436629 406856 331928 293278 283705 338617 316619 271224 291036 293363 300996 298415 272995
17218B72995p926o1220o4533o8106l906j0837Q877K7131k0953O152J4284K987
$$ 272995 265069 203849 139316 71210 67304 56467 65344 92475 71522 77674 91958 94945
17206I4945j8917K9829M828L6913J5509L6834M2132N0483M765l48J8938N6042
$$ 94945 76028 105857 110685 147598 163107 199941 242073 292556 297321 296973 315911 371953
17194C71953P4040N0590J7311j0594k9527r106J1185M6496K3767m4683p7265m1939
$$ 371953 445993 496583 513894 503300 473773 464667 475852 522348 546115 501432 424167 382228
17182C82228k5440N144m97k8677l2309k357l9754l0815N7912N9025J2761l0498
$$ 382228 356788 361932 361435 332758 300449 298092 258338 227523 285435 344460 357221 326723
17170C26723n8349n0665R418J7793L9328J9376K0434j4610m5496m4582m5798k2977
$$ 326723 268374 217709 227127 244920 284248 303624 324058 309448 263952 219370 173572 150595
17158A50595k1006k4834k7439k511L7035J5263K8624j6347n3279k1083J1035L7923
$$ 150595 129589 104755 77316 74805 111840 127103 155727 139380 86101 65018 76053 113976
17146A13976J7363o917j6474k1495l5255j3068K695Q607J6617j9399n532N218
$$ 113976 131339 124422 107948 86453 51198 38130 40825 49432 66049 46650 41118 46336
17134D6336k8391j2432m423K0688k3906Q176K7071J2736o51j1209k5429m762J5102
$$ 46336 17945 5513 1090 21778 -2128 6048 33119 45855 45204 33995 8566 3804 18906
17121A8906L1383k1005k4338j7078m910Q181J9269N739P73L9628J2114l209L640
$$ 18906 50289 29284 4946 -12132 -17042 -8861 10408 16147 16920 56548 68662 65453 69093
17108F9093l0754o658j3034K6655J1117l2200l1930j0294k7724N803N893k4715
$$ 69093 38339 31681 18647 45302 56419 24219 -7711 -18005 -45729 -39926 -34033 -58748
17096e8748k1020J9464J8201K2739m0316j6618j9827J4075N1167L8889J126k7258
$$ -58748 -79768 -60304 -42103 -19364 -59680 -76298 -96125 -82050 -30883 8006 9132 -18126
17084a8126K5431K6017o703m8500n0609n3853K7466L4642K8814L0839K5998J2933
$$ -18126 7305 33322 26619 -21881 -72490 -126343 -98877 -64235 -35421 -4582 21416 34349
17072C4349k0776k8138j9696j3327J8257P991j4923k1114o624L885l3929L6952
$$ 34349 13573 -14565 -34261 -47588 -29331 -21340 -36263 -57377 -64001 -60116 -94045 -57093
17060e7093o955m475J4191j942O652j6512m562K0298L537k4986K4501O0714K5628
$$ -57093 -64048 -68523 -54332 -56274 -49622 -66134 -70696 -50398 -46861 -71847 -47346 13368 38996
17047C8996l2533r954L989L638J2900J9912j8046o8569o0984L2724L9254j9414
$$ 38996 6463 -3491 498 4136 17036 36948 18902 -49667 -110651 -77927 -38673 -58087
17035e8087k7554K3907K8624n290M342L5985K8061p703k9008l7944k6967O383
$$ -58087 -85641 -61734 -33110 -38400 -34058 1927 29988 22285 -6723 -44667 -71634 -65251
17023f5251j8878J149j9719J6597K2518M149L601Q565J2910O463K4481l0052p1225
$$ -65251 -84129 -82980 -102699 -86102 -63584 -59435 -55834 -47269 -34359 -27896 -3415 -33467 -104692
17010a04692Q163L9722K22K0622K8201O074j1825n7736m2346k8767L6295K0522
$$ -104692 -96529 -56807 -56585 -35963 -7762 -1688 -13513 -71249 -113595 -142362 -106067 -85545
16998h5545k841P724L4424m292l3560l3398L8341M9790j5290j6577P537n510N6216
$$ -85545 -88386 -80662 -46238 -50530 -84090 -117488 -79147 -29357 -44647 -61224 -53687 -59197 -2981
16985b981O6835j6595k7595k7781q104o371J2308j7198k1596J4671k6968k2074
$$ -2981 63854 47259 19664 -8117 -16221 -22592 -10284 -27482 -49078 -34407 -61375 -83449
16973h3449J6680K9725K2343J7844k1605K5026l2350l3017N444j9190L075J7050
$$ -83449 -66769 -37044 -14701 3143 -18462 6564 -25786 -58803 -53359 -72549 -69474 -52424
16961e2424J4719L34Q158j0459J0990K2180K6260j7822j4826j588l375M167j3984
$$ -52424 -37705 -37371 -29213 -39672 -28682 -6502 19758 1936 -12890 -14478 -17853 -13686 -27670
16948b7670R490N626Q797j2969l692j908j3522M699M080k2540P451nj2708K4349
$$ -27670 -18180 -12554 -3757 -16726 -20418 -22326 -35848 -31149 -27069 -49609 -42158 -42163 -54871 -30522
16934c0522K5091k2927n2282m497K8863K2910j6401l2821J1656k5431n829R030
$$ -30522 -5431 -28358 -80640 -85137 -56274 -33364 -49765 -82586 -70930 -96361 -102190 -93160
16922i3160K1617K2183l8054J9538K3274P369r576N259m2546l0505p308K7269
$$ -93160 -71543 -49360 -87414 -67876 -44602 -37233 -46809 -41550 -84096 -114601 -121909 -94640
16910i4640N9902j6172j9930k7647L4335q825n286J8846K305K488l2404k0364
$$ -94640 -34738 -50910 -70840 -98487 -64152 -72977 -78263 -59417 -57112 -54624 -87028 -107392
16898a07392Q910K0400J8223K840J1645p683k3124O813J1983N8466l473k7264
$$ -107392 -98482 -78082 -59859 -57019 -45374 -53057 -76181 -69368 -57385 1081 -2392 -29656
16886b9656j3070p660j4545K65k6834j015J0116n238J4085K7766k0393j7233k1931
$$ -29656 -42726 -50386 -64931 -64666 -91500 -92515 -82399 -87637 -73552 -45786 -66179 -83412 -105343
16873a05343o301j757K7243n132P370J3902J7390m6687j0226L7037K3402J6354
$$ -105343 -111644 -113401 -86158 -91290 -83920 -70018 -52628 -99315 -109541 -72504 -49102 -32748
16861c2748J636J6172M2680R163l8273l0007M193K9789R289j5651m4901k8275
$$ -32748 -31112 -14940 27740 36903 -1370 -31377 -27184 2605 11894 -3757 -48658 -76933
16849g6933J4356J7695O181J5773q129M185j8725j9669J2934N738J6610J3621
$$ -76933 -62577 -44882 -38701 -22928 -31057 -26872 -45597 -65266 -52332 -46594 -29984 -16363
16837a6363k6656j0374J4720J6962J4527J1201k9248q185j2269l0225J3050L4872
$$ -16363 -43019 -53393 -38673 -21711 -7184 4017 -25231 -33416 -45685 -75910 -62860 -27988
16825b7988p814p995K1312J9303j3595l2K9749r757j4944q260J3166l0149J5892
$$ -27988 -35802 -43797 -22485 -3182 -16777 -16809 12940 3183 -11761 -20021 -6855 -37004 -21112
16812b1112M253J2121l9400j7267k8516J1834J6925J3905K789k0563l387K6842
$$ -21112 -16859 -4738 -44138 -61405 -89921 -78087 -61162 -47257 -44468 -65031 -68418 -41576
16800d1576q914j9197n7945k785M1550M107m7394p048K8039L5911K0812L0347
$$ -41576 -50490 -69687 -127632 -130417 -88867 -84760 -132154 -139202 -111163 -75252 -54440 -24093
16788b4093R400j3222n1234m1645M852L5964K9967J5610J9622K4012p881p0073
$$ -24093 -14693 -27915 -79149 -120794 -115942 -79978 -50011 -34401 -14779 9233 1352 -68721
16776f8721J0643k94j8571K1817o62n2517j328M6911K9677m542j2q360n5861m4749
$$ -68721 -58078 -58372 -76943 -55126 -55788 -108305 -109633 -62722 -33045 -37587 -37599 -45959 -101820 -146569
16762a46569N5790R124J2102m101k3941M0036L2156K3717J818m0107k2777j0928
$$ -146569 -90779 -81655 -69553 -73654 -97595 -57559 -25403 -1686 132 -39975 -62752 -73680
16750g3680J467J5761K7641k94k2927j0634J1022N2393J1906j1298j1616m6971
$$ -73680 -72213 -56452 -28811 -29105 -52032 -62666 -51644 749 12655 1357 -10259 -57230
16738e7230l8792R077r073l0014J8857L4605L3969K1043J5603l1239p897L473
$$ -57230 -96022 -86945 -96018 -126032 -107175 -72570 -38601 -17558 -1955 -33194 -41091 -37618
16726c7618L8257J4158L011j1190L532J841k968j5167j8593j246n40J0266m144
$$ -37618 639 14797 17808 6618 10150 11991 9023 -6144 -24737 -25983 -26523 -16257 -20401
16713b0401J1918k5121k6529L9398K760l2631l63L4631J140l6661m7440j1275
$$ -20401 -8483 -33604 -60133 -20735 -17975 -50606 -50969 -16338 -15198 -51859 -99299 -110574
16701a10574K9840K1906J0618k0517N393J3848m803n0164J5474K275p394J7643
$$ -110574 -80734 -58828 -48210 -68727 -63334 -49486 -54289 -104453 -88979 -86704 -94098 -76455
16689g6455J1829L259j7789l059j922r977j4023J9943N8989J9838m2881J1685
$$ -76455 -64626 -61367 -79156 -82215 -84137 -94114 -108137 -88194 -29205 -9367 -52248 -40563
16677d0563R384o74k1201l2540M2354Q009J4649K2394j577l923l573n5261J747
$$ -40563 -31179 -31853 -53054 -85594 -43240 -35231 -20582 1812 235 -3688 -7261 -62522 -60775
16664f0775K0914j4058O2r666K6272k5884l0293j9910K7720L7928l6582J1093
$$ -60775 -39861 -53919 -53857 -63523 -37251 -63135 -93428 -113338 -85618 -47690 -84272 -73179
16652g3179L4567j1768J2274L0864Q923m1072q019J1794j1725q904J2692l335
$$ -73179 -38612 -50380 -38106 -7242 1681 -39391 -47410 -35616 -47341 -56245 -43553 -46888
16640d6888k2427j1673J5324K8828O105m411k7458j3928L859L9817K1384k583
$$ -46888 -69315 -80988 -65664 -36836 -30731 -35142 -62600 -76528 -72669 -32852 -11468 -14051
16628a4051l5689R371r394J8221L0406k0260J456K1213L794R684j6345k1199m217
$$ -14051 -49740 -40369 -49763 -31542 -1136 -21396 -19940 1273 5067 14751 -1594 -22793 -27010
16615b7010j4297o666j3005K0083L032R420q209k842K2522j5348l2030K8355K0577
$$ -27010 -41307 -47973 -60978 -40895 -37863 -28443 -36652 -39494 -16972 -32320 -64350 -35995 -15418
16602a5418k2875k5765P081j5737L8513M2573J2123k4278l2439j5363j026j7089
$$ -15418 -38293 -64058 -56977 -72714 -34201 8372 20495 -3783 -36222 -51585 -52611 -69700
16590f9700L740K1862M0859N933j2506R406l3863k5828m159M1074K118j2580k7740
$$ -69700 -65960 -44098 -3239 2694 -9812 -406 -34269 -60097 -64256 -23182 -21064 -33644 -61384
16577f1384j2173j229N273L5642j7136k973M4500M6069J3962l7534m2941M374
$$ -61384 -73557 -74786 -69513 -33871 -51007 -53980 -9480 36589 50551 13017 -29924 -25550
16565b5550K3006k9213p545r046J4446o68J2335K0007K8737j417M240j5310o389
$$ -25550 -2544 -31757 -39302 -48348 -33902 -34570 -22235 -2228 26509 25092 29332 14022 7633
16552G633l4980k3158J9806k753O592q156p652m028J8111J0904k058J3591k2377
$$ 7633 -27347 -50505 -30699 -33452 -26860 -35016 -42668 -46696 -28585 -17681 -19739 -6148 -28525
16539b8525k2762J431K1221m033j3330j5059K0971j5619j0878K9646L8416j8345
$$ -28525 -51287 -49856 -28635 -32668 -45998 -61057 -40086 -55705 -66583 -36937 1479 -16866
16527a6866P369m6543k4896P156R055K9367M6180l6321M400K0670k2702K1035
$$ -16866 -9497 -56040 -80936 -73780 -64725 -35358 10822 -25499 -21099 -429 -23131 -2096
16515b096L3590P018j7029j4904j8898j5485j0792k6870o688k1993k2469M0036
$$ -2096 31494 38512 21483 6579 -12319 -27804 -38596 -65466 -72154 -94147 -116616 -76580
16503g6580K5446j2134k525m334j3475J4544K7470j1527K7368R987J5253K297
$$ -76580 -51134 -63268 -65793 -70127 -83602 -69058 -41588 -53115 -25747 -15760 -507 1790
16491A790J037k7668l3063k5113M2068K6174k1196l8581L9023K3114k1947j7453
$$ 1790 2827 -24841 -57904 -83017 -40949 -14775 -35971 -74552 -35529 -12415 -34362 -51815
16479e1815J8480N6940O998n7123p113j0319n4943l2597L4624J1622m883L2085
$$ -51815 -33335 23605 30603 -26520 -33633 -43952 -98895 -131492 -96868 -85246 -90129 -58044
16467e8044o890j931K5097L670J3854k7562j9135p341j1079L1598L67j0626k19
$$ -58044 -64934 -66865 -41768 -38098 -24244 -51806 -70941 -78282 -89361 -57763 -57396 -68022 -68241
16454f8241K2726J5907m83m4804L09J0371R311N506J1431K4298l4191J6820K8488
$$ -68241 -45515 -29608 -30091 -74895 -74586 -64215 -54904 -49398 -37967 -13669 -47860 -31040 -2552
16441b552j0126n290m3652l2697K3726K7881K1948J6736j2305k2936M315J5110
$$ -2552 -12678 -17968 -61620 -94317 -70591 -42710 -20762 -4026 -16331 -39267 -34952 -19842
16429a9842j0050K4172J265J1849L470k8427o643l456q503m2170o6799o606L2252
$$ -19842 -29892 -5720 -4455 7394 10864 -17563 -24206 -27662 -36165 -78335 -145134 -151740 -119488
16416a19488M556j5342M220K3141K5026P16k357R5J1169J2847M2787J4654J9744
$$ -119488 -114932 -130274 -126054 -102913 -77887 -77171 -79528 -79433 -68264 -55417 -12630 2024 21768
16403B1768k7083l3807l5285k2187j5474m836M4679M7176j4043m9355n3660M526
$$ 21768 -5315 -39122 -74407 -96594 -112068 -116904 -72225 -25049 -39092 -88447 -142107 -137581
16391a37581J0376L1362K2612L4451K724k5171j493j0990L1522L3657l2080j2617
$$ -137581 -127205 -95843 -73231 -38780 -36056 -61227 -62720 -73710 -42188 -8531 -40611 -53228
16379e3228J7197j3884j3628K864p162o510J6216J725j1142L570K2999M2325L2181
$$ -53228 -36031 -49915 -63543 -60679 -67841 -74351 -58135 -56410 -67552 -63982 -40983 1342 33523
16366C3523k4349n3674k3173l4637K4419N4716M0802l909K5076M033o0304m9351
$$ 33523 9174 -44500 -67673 -102310 -77891 -23175 17627 13718 38794 42827 -17477 -66828
16354f6828M602K8331J0714j4429m707J6625k720p26k2958k5076K268l90j0729
$$ -66828 -62226 -33895 -23181 -37610 -42317 -25692 -28412 -29138 -52096 -77172 -74904 -75294 -86023
16341h6023L1721K1818k1912j5034L497J2982L2202P803k0950n343K4123R645
$$ -86023 -54302 -32484 -54396 -69430 -65933 -52951 -20749 -12946 -33896 -39239 -15116 -5471
16329e471j0925k6416K2591q424j9678K1899j4798k7451j1283L649k028J5730
$$ -5471 -16396 -42812 -20221 -28645 -48323 -26424 -41222 -68673 -79956 -76307 -78335 -62605
16317f2605L8157m377J0618n798k0602k810k3822M1989K6588R742k2937m3429
$$ -62605 -24448 -28825 -18207 -24005 -44607 -47417 -71239 -29250 -2662 7080 -15857 -59286
16305e9286k3053K6938J3166l4785J2968J314k6432q909M0279M8594j0464k7057
$$ -59286 -82339 -55401 -42235 -77020 -64052 -62738 -89170 -98079 -57800 -9206 -19670 -46727
16293d6727q098Q680J0054K8797j290J4225N0956J6907J1311k2631m1555k3539
$$ -46727 -54825 -46145 -36091 -7294 -8584 5641 56597 73504 84815 62184 20629 -2910
16281b910j2130J0272o095L8189Q713m0010k9786R859k2799k0917L4569M0627
$$ -2910 -15040 -4768 -10863 27326 36039 -3971 -33757 -23898 -46697 -67614 -33045 7582
16269G582j5993K1746j7101k9088J9749N0775O103j2236L0425l3170o7586n7249
$$ 7582 -8411 13335 -3766 -32854 -13105 37670 43773 31537 61962 28792 -38794 -96043
16257i6043l67N0464K6783J0565k2219K406K9359K1534r029l0045L8264j2794
$$ -96043 -96410 -45946 -19163 -8598 -30817 -28411 948 22482 13453 -16592 21672 8878
16245H878m6141N253P487J4J6909m436k299n043j0598o801L4745L5596o145r410
$$ 8878 -37263 -32010 -24523 -24509 -7600 -12036 -14335 -19378 -29976 -36777 -2032 33564 27419 18009
16231A8009k8846J207J2377K4401N421j0357k6331j3977l0195j2345L6854L5804
$$ 18009 -10837 -9630 2747 27148 32569 22212 -4119 -18096 -48291 -60636 -23782 12022
16219A2022K780m3811j7627n739J4883L853L9265n637l5474m4565j3887L3560
$$ 12022 14802 -29009 -46636 -52375 -37492 -33639 5626 -11 -35485 -80050 -93937 -60377
16207f0377K9243K2222K3691j7941o698J2705j7517k8400j2843K8610M996L3192
$$ -60377 -31134 -8912 14779 -3162 -9860 2845 -14672 -43072 -55915 -27305 -22309 10883
16195A0883K4021l504r410p549l0207N472J2624j0039O274J0485R162j0558k613
$$ 10883 34904 31400 21990 14441 -15766 -10294 2330 -7709 -1435 9050 18212 7654 5041
16182E041j5565p647K2764J2619k2245j8274j4784N319J4993j684k313q60j2409
$$ 5041 -10524 -18171 4593 17212 -5033 -23307 -38091 -32772 -17779 -19463 -21776 -22636 -35045
16169c5045J1199J8578k8493k3235K0541p769j516N1870l195j741k2522j3777
$$ -35045 -23846 -5268 -33761 -56996 -36455 -44224 -45740 6130 2935 1194 -21328 -35105
16157c5105N1690J1857k2469l0491j9473M8590j7533m8347L490Q118k5628k2222
$$ -35105 16585 28442 5973 -24518 -43991 4599 -12934 -61281 -57791 -49673 -75301 -97523
16145i7523m822l169J2919K7626J2339J0815l2277J0598J5631j0018Q0j5918L0207
$$ -97523 -102345 -105514 -92595 -64969 -52630 -41815 -74092 -63494 -47863 -57881 -57801 -73719 -43512
16132d3512J434k2608l6111J8623l34K563J205j9034k0629P761L9019K3879Q458
$$ -43512 -42078 -64686 -100797 -82174 -82508 -79945 -78740 -97774 -118403 -110642 -71623 -47744 -39286
16119c9286j8163l3635n64N2756K7372n760p117n687M089J4591L1318N114n836
$$ -39286 -57449 -91084 -91648 -38892 -11520 -17280 -24397 -30084 -25995 -11404 19914 25028 19192
16106A9192j488j4059l4351k0646o84J4747l968k24J1204l5952l7800j2380J0811
$$ 19192 17704 3645 -30706 -51352 -52036 -37289 -41257 -41481 -30277 -66229 -104029 -116409 -105598
16093a05598M6094q552j7141J6638J8034L1933J1402k7742J877p702L3359K2671
$$ -105598 -59504 -68056 -85197 -68559 -50525 -18592 -7190 -34932 -33055 -40757 -7398 15273
16081A5273k3333j433j9152m5305J0315L7647K28j5402m598J8610j3902j0670
$$ 15273 -8060 -9493 -28645 -73950 -63635 -25988 -25760 -41162 -45760 -27150 -41052 -51722
16069e1722j7243m6944M5090L5265q257R228J6245p090K406k9651k0197j1055
$$ -51722 -68965 -115909 -70819 -35554 -43811 -34583 -18338 -25428 -23022 -52673 -72870 -83925
16057h3925N089K7243Q759j8161l472l8757O8745K9027j7549n227l2258k0442
$$ -83925 -78836 -51593 -42834 -60995 -64467 -103224 -34479 -5452 -23001 -28228 -60486 -80928
16045h0928J6259l8891j78L1508J7481j7500K0491O8583K6076j0315l8190k4615
$$ -80928 -64669 -103560 -103738 -72230 -54749 -72249 -51758 16825 42901 32586 -5604 -30219
16033c0219o859K1912M3911K4795p002m2792l6629o161N886J0275J1562l2075
$$ -30219 -37078 -15166 28745 53540 46538 3746 -32883 -39044 -33158 -22883 -11321 -43396
16021d3396J481Q091j6831o46J9692M696K3174K9420J58j9285J5015j0159k3041
$$ -43396 -41915 -33824 -50655 -51301 -31609 -26913 -3739 25681 25839 6554 21569 11410 -11631
16008a1631l8752j9890J4572K7007K5092j1863j1509J9286j8260O66O95K442k0481
$$ -11631 -50383 -70273 -55701 -28694 -3602 -15465 -26974 -7688 -25948 -25282 -24587 -22145 -42626
15995d2626K0125q642n789l2533m355L0409M4491l103k0568k8515q556j5662j9108
$$ -42626 -22501 -31143 -36932 -69465 -73820 -43411 1080 -2023 -22591 -51106 -59662 -75324 -94432
15982i4432L1572J1107O016k4574j5755Q39j785r532L6383K2808q184n341K0478
$$ -94432 -62860 -51753 -45737 -70311 -86066 -85227 -87012 -96544 -60161 -37353 -45537 -50878 -30400
15969c0400Q010m5496k4918J6454j2369K0215J5348j995l2057r17L679L7023L4211
$$ -30400 -22390 -67886 -92804 -76350 -88719 -68504 -53156 -55151 -87208 -88125 -84446 -47423 -13212
15956a3212l6865k7047L0482K4095J5170k9738k5872L4689N3113J6441k9322j9412
$$ -13212 -50077 -77124 -46642 -22547 -7377 -37115 -62987 -28298 24815 41256 11934 -7478
15944g478O379k3621k1519N35K0342J9145j8633Q963m983m0479J4765j7427L505
$$ -7478 -1099 -24720 -46239 -45704 -25362 -6217 -24850 -15887 -20870 -61349 -46584 -64011 -60506
15931f0506M2467k1398k8099O991K5420k1165o760M0961q995o245l3678o868L1232
$$ -60506 -18039 -39437 -67536 -60545 -35125 -56290 -63050 -22089 -31084 -37329 -71007 -77875 -46643
15918d6643O4993m14k5100j4561Q246l1410l2512J1310J0817K466j8336j1670
$$ -46643 18350 17936 -7164 -21725 -13479 -44889 -77401 -66091 -55274 -52808 -71144 -82814
15906h2814K1137K6095J4822J7890L7497j4079n9030m8065M628L4619R890l1202
$$ -82814 -61677 -35582 -20760 -2870 34627 20548 -38482 -86547 -81919 -47300 -37410 -68612
15894f8612Q716p211J8573K0882M0299K780K651l3310m6901j2565J9559J0520
$$ -68612 -59896 -67107 -48534 -27652 12647 15427 18078 -15232 -62133 -74698 -55139 -44619
15882d4619j6721M804J2001J8740r916j9116l4243N427j764K4739K331K6562L5878
$$ -44619 -61340 -56536 -44535 -25795 -35711 -54827 -89070 -83643 -85407 -60668 -58337 -31775 4103
15869D103K207k278j0246J3790l432j8495k9512J1230j0142j27M5806M530m151
$$ 4103 6310 4032 -6214 7576 4144 -14351 -43863 -32633 -42775 -42902 2904 7434 3283
15856C283P092k2680j0913k373r338k7403K0629k253m165p144k5037J1514J8387
$$ 3283 10375 -12305 -23218 -25591 -34929 -62332 -41703 -43956 -48121 -55265 -80302 -68788 -50401
15843e0401P118J0789j8421k4093r884j5307O566N0440K8431l9064l7147Q808
$$ -50401 -43283 -32494 -50915 -75008 -84892 -100199 -93633 -43193 -14762 -53826 -90973 -82165
15831h2165J0344K8156Q636m5852j1431L8965K2032j450L1926j3008k3231J8617
$$ -82165 -71821 -43665 -35029 -80881 -92312 -53347 -31315 -32765 -839 -13847 -37078 -18461
15819a8461l3707q212K8602n421J23J1664k6202r576K5255J5087j1565P597O902
$$ -18461 -52168 -60380 -31778 -37199 -37076 -25412 -51614 -61190 -35935 -20848 -32413 -24816 -17914
15806a7914K4788p021J3938r0l055J9710j9185k6336M3327j005j1872P136m6273
$$ -17914 6874 -147 13791 13701 10646 30356 11171 -15165 28162 27157 15285 22421 -23852
15793b3852O492K5779n90O669j3704K3212N750J5109k1665n8853p2979r444l0623
$$ -23852 -17360 8419 7829 14498 794 24006 29756 44865 23200 -35653 -108632 -118076 -148699
15780a48699Q460O1075o088L2954L8695M1372l830k5950l9882j4455K3103J5213
$$ -148699 -140239 -79164 -85252 -52298 -13603 27769 23939 -2011 -41893 -56348 -33245 -18032
15768a8032M208l3760p766k4877L6421M4427K724K2484J9056M08l6850k76j7635
$$ -18032 -13824 -47584 -55350 -80227 -43806 621 3345 25829 44885 45293 8443 8167 -9468
15755i468J75Q769j4440j7784K5917k132j375Q700j5997j6014j9829L0867J0071
$$ -9468 -9293 -524 -14964 -32748 -6831 -8963 -10338 -1638 -17635 -33649 -53478 -22611 -12540
15742a2540r322L4392M5487k9035o1577O683M405J7155k4792j4282k953K066N9750
$$ -12540 -21862 12530 58017 28982 -32595 -25912 -21507 -4352 -29144 -43426 -46379 -44313 15437
15729A5437M1614q061n5728L82k7262R887K4094J4397k4963l637k3822J7396J6103
$$ 15437 57051 48990 -6738 -6356 -33618 -23731 363 14760 -10203 -13840 -37662 -20266 -4163
15716d163J5850k7094k4214K7104j636J2865n34j22K1832J5137J5313m617l6247
$$ -4163 11687 -15407 -39621 -12517 -14153 -1288 -1822 -1944 19888 35025 50338 45721 9474
15703I474l5711l5232J4982P224L805m334J4662J9681J6374R334J6006k0560J4298
$$ 9474 -26237 -61469 -46487 -39263 -35458 -39792 -25130 -5449 10925 20259 36265 15705 30003
15690C0003l6599M755O234p190j0330L0841K6894J3020j3841r9928j9804K6960
$$ 30003 -6596 -1841 4393 -2797 -13127 17714 44608 57628 43787 -56141 -75945 -48985
15678d8985J2550J6435l332R372j7605K4868J683m310M7405p095l5997m1190l020
$$ -48985 -36435 -20000 -23332 -13960 -31565 -6697 -5014 -9324 38081 30986 -5011 -46201 -49221
15665d9221N111L0287J6946J9439r51j7080k3458R907q059k0368J6615K5706j6801
$$ -49221 -44110 -13823 3123 22562 21611 4531 -18927 -9020 -17079 -37447 -20832 4874 -11927
15652a1927l3051J3835J0294k0029J489j1523m12N0177L6606l0919l5733q842
$$ -11927 -44978 -31143 -20849 -40878 -39389 -50912 -51324 -1147 35459 4540 -31193 -40035
15640d0035j6526Q154m378j4727J1670L4327P843O706J579j1060m006l5902k0628
$$ -40035 -56561 -48407 -52785 -67512 -55842 -21515 -13672 -6966 -5387 -16447 -20453 -56355 -76983
15627g6983J3952J9732L634K768L6252M708j3880j4636K6437K33l3415K471L0881
$$ -76983 -63031 -43299 -39665 -36897 -645 4063 -9817 -24453 1984 2217 -31198 -28727 2154
15614B154k1725J8094L8493Q322j0460k2214m087o922J629L2611k226j347M892
$$ 2154 -19571 -1477 37016 45338 34878 12664 8577 1655 3284 35895 33669 32322 37214
15601C7214p649l4322k2469k749r594K648m2507K0605J7982Q216O591j1425J3253
$$ 37214 29565 -4757 -27226 -29975 -39569 -36921 -79428 -58823 -40841 -32625 -26034 -37459 -24206
15588b4206K1175o936l5870K915O071j7939J9227j4590r472J2803M3804J2346
$$ -24206 -3031 -9967 -45837 -42922 -36851 -54790 -35563 -50153 -59625 -46822 -3018 9328
15576I328k9277p2755j5453L2787N2030L0542k779m042J638k1035n242m9948K595
$$ 9328 -19949 -92704 -108157 -75370 -23340 7202 4423 381 2019 -19016 -24258 -74206 -71611
15563g1611L5023K5390j290k863k1456J1451l1196J5453M9456R260o595m1295
$$ -71611 -36588 -11198 -12488 -15351 -36807 -25356 -56552 -41099 8357 17617 11022 -30273
15551c0273L082k9173k9755j7349R654K6209J0113J4317J5557K1289l0652k4773
$$ -30273 -27191 -56364 -86119 -103468 -93814 -67605 -57492 -43175 -27618 -6329 -36981 -61754
15539f1754j0373K0619J703K6577J8589J5702K0163K1508J965m6105R392n775
$$ -61754 -72127 -51508 -49805 -23228 -4639 11063 31226 52734 54699 8594 17986 12211
15527A2211j9189j3517j0700k1962J981M3684m360l1630Q532K3554R539l040J3466
$$ 12211 -6978 -20495 -31195 -53157 -51176 -7492 -11852 -43482 -34950 -11396 -1857 -4897 8569
15514H569J2042k6986j8395r189J3617o001O902j3113n911l968k8658k5L5889
$$ 8569 20611 -6375 -24770 -33959 -20342 -26343 -19441 -32554 -38465 -42433 -71091 -71116 -35227
15501c5227k839k877J4312O007K5340j7106j2710M7578Q862J367J6774j9236k0041
$$ -35227 -38066 -40943 -26631 -20624 4716 -12390 -25100 22478 31340 32707 49481 30245 10204
15488A0204L4963Q854J1273q537k1221P527J9903j1795l0881K6099N4180j3467
$$ 10204 45167 54021 65294 56757 35536 43063 62966 51171 20290 46389 100569 87102
15476H7102o7181k7664k8819L034J3708J8316k9750k0655j3518Q693M4235k7949
$$ 87102 19921 -7743 -36562 -33528 -19820 -1504 -31254 -51909 -65427 -56734 -12499 -40448
15464d0448L9312K2318k3314k8740K1345M705k7341L7866K0292o578j1414J5381
$$ -40448 -1136 21182 -2132 -30872 -9527 -4822 -32163 5703 25995 19417 8003 23384
15452B3384l044l6831k5437k143L3399M6990j5524k8501j5883J3754K4015L0337
$$ 23384 20340 -16491 -41928 -44071 -10672 36318 20794 -7707 -23590 -9836 14179 44516
15440D4516M9450p144m8304n4170J006j3983o937J5557r539k0847L2204J7633
$$ 44516 93966 86822 38518 -15652 -14646 -28629 -35566 -20009 -29548 -50395 -18191 -558
15428e58l1050n1265Q933J2581K9261J0534M7617L0439l5753k2364J6933K7680
$$ -558 -31608 -82873 -73940 -61359 -32098 -21564 26053 56492 20739 -1625 15308 42988
15416D2988K2776L006J2073J6575J4504m3822l3054m731J6918K9589j1642l2661
$$ 42988 65764 68770 80843 97418 111922 68100 35046 30315 47233 76822 65180 32519
15404C2519L4464L2619j5940m7411j682j0364J3917k345l1673k1744r134J9702
$$ 32519 66983 99602 83662 36251 34569 24205 38122 35777 4104 -17640 -26774 -7072
15392g072k3699o42K8358N905l3684L2123K0162l9073R94J4499J0751r475o438
$$ -7072 -30771 -31413 -3055 2850 -30834 1289 21451 -17622 -16628 -2129 8622 -853 -7291
15379g291k4305Q93K6821j4967m883J4277J3023J1453K8935J1713l1792j0053
$$ -7291 -31596 -30703 -3882 -18849 -23732 -9455 3568 15021 43956 55669 23877 13824
15367A3824L771k5518J3011l649O941K3908j3848K2984J868k902j463k7781k861
$$ 13824 17595 -7923 5088 1439 8380 32288 18440 41424 43292 40390 38927 11146 8285
15354H285O906L509L2974k2665l8234K580N1697K1953n446k4755l8073l1650J4372
$$ 8285 15191 18700 51674 29009 -9225 -6645 45052 67005 61559 36804 -1269 -32919 -18547
15341a8547K3884J9282j9155j7492K2435m7526m5113N7143O7751L330k721J4272
$$ -18547 5337 24619 5464 -12028 10407 -37119 -82232 -25089 42662 45992 43271 57543
15329E7543M522j9475o7513k0015J6263M1388J1404n57J6976J6159j3158l0031
$$ 57543 62065 42590 -24923 -44938 -28675 12713 24117 23560 40536 56695 43537 13506
15317A3506k1096r839m012J0473k9290M830O1226J1595k7247J0717j9281k0858
$$ 13506 -7590 -17429 -21441 -10968 -40258 -35428 25798 37393 10146 20863 1582 -19276
15305a9276k2388L0961P716n827Q077M3779N63j0305j1456j3177m5016n907R47
$$ -19276 -41664 -10703 -2987 -8814 -737 43042 43605 33300 21844 8667 -36349 -42256 -41309
15292d1309J2452M4113O297p912o588m2474k2851O6564J2493k9667j116J2248
$$ -41309 -28857 15256 21553 13641 7053 -35421 -58272 8292 20785 -8882 -9998 2250
15280B250P624L5154J5240p98l1485K367l720L362K762J3487l9744l3740J7823
$$ 2250 9874 45028 60268 59470 27985 30352 26632 29994 32756 46243 6499 -27241 -9418
15267i418L1019K0278l442l8703J4301o694Q355K1004J1217m062Q911L5572j4852
$$ -9418 21601 41879 38437 -266 14035 7341 15696 36700 47917 43855 52766 88338 73486
15254G3486J6422K0603r111K3587K2641k5820q532J8174J8773k8335k1805M485
$$ 73486 89908 110511 101400 124987 147628 121808 113276 131450 150223 121888 100083 104568
15242A04568J2398K3571L2442J4128Q4659J06109R4819J16559J88776K02342K25022
$$ 104568 116966 140537 172979 187107 271766 377875 472694 589253 778029 980371 1205393
15231A205393K15159J86556J5261q6246j47214k34049k03717j48509j28871j53176
$$ 1205393 1420552 1607108 1622369 1536123 1388909 1154860 951143 802634 673763 520587
15221E20587p1915n8231p6584n7291k2275k9428k4381n411p6m7349k2142J3252
$$ 520587 448672 390441 313857 256566 234291 204863 180482 175071 174995 127646 105504 118756
15209A18756R558J1032J861j5361N334L5496k3530l0823j8855k2274O086k0230
$$ 118756 128314 139346 141207 125846 131180 166676 143146 112323 93468 71194 77280 57050
15197E7050l1821R648N3284L4124j1731R383Q485p197k1414j547L0086j4408m6702
$$ 57050 25229 34877 88161 122285 110554 119937 128422 121225 99811 98264 128350 113942 67240
15184F7240m7029P480L2120J6594j2323r623l964m5261P831L3431M3751J612k1123
$$ 67240 20211 27691 59811 76405 64082 54459 50495 5234 13065 46496 90247 91859 70736
15171G0736j7605O1841l8338l964q785m3337j3228J6333M3176r722p865J2671
$$ 70736 53131 114972 76634 72670 63885 20548 7320 23653 66829 57107 49242 61913
15159F1913k879Q824K0425J8607K7543k9861n6591k584M3434M688l0806n5279
$$ 61913 59034 67858 88283 106890 134433 104572 47981 45397 88831 93519 62713 7434
15147G434J1248K1710M1910L5920K4192l3994l6261L495J3301m789m7158L940
$$ 7434 18682 40392 82302 118222 142414 108420 72159 75654 88955 84166 37008 40948
15135D0948r68l131n86M691J1828J5321l051k043l0546L055L3830J7780m519o532
$$ 40948 39980 36849 36263 40954 52782 68103 65052 63009 32463 35518 69348 87128 82609 76077
15121G6077p085J0408k2456K846J6627j6655m9896q151k7754K213R310M103P864
$$ 76077 68992 79400 56944 59790 76417 59762 9866 1715 -26039 -23826 -14516 -10413 -2549
15108b549K5365J2259M000J3105J1419j4069K021N6831p682k6138j9989K697K5035
$$ -2549 22816 35075 39075 52180 63599 49530 51551 108382 100700 74562 54573 57270 82305
15095H2305k2429l0344r749R626k4577l5474r705K6179N6813L0940k4976k3762
$$ 82305 59876 29532 19783 29409 4832 -30642 -40347 -14168 42645 73585 48609 24847
15083B4847J3170L1471k3596N063M4798M2461j8580L260q339k420k0943k2416
$$ 24847 38017 69488 45892 50955 95753 138214 119634 122894 114555 112135 91192 68776
15071F8776m204j2661j9506J6016K464j4969J9291K2206j0815j3646N996j4077
$$ 68776 64572 51911 32405 48421 50885 35916 55207 77413 66598 52952 58948 44871
15059D4871K639M370K1540K9811m17K9099k697n5980n5791n853J5420n114K1734
$$ 44871 47510 51880 73420 103231 102814 131913 129216 73236 17445 11592 27012 21898 43632
15046D3632J7812k3810k1115R136K2703J8607K2871J2325K4098j65J4595R88m342
$$ 43632 61444 37634 16519 25655 48358 66965 89836 102161 126259 126094 140689 141677 137335
15033A37335K603J9798J0721K7358m669N000L04n4789k5782j8215M872K8512L5396
$$ 137335 139938 159736 170457 197815 193146 198146 198450 143661 117879 99664 104536 133048 168444
15020A68444k1195r4183J8426M2111l330j9720k0712k119J3655J6944q936J419
$$ 168444 147249 53066 71492 113603 110273 90553 69841 67722 81377 98321 89385 90804
15008I0804k6167k4034J3462j8906k2536j2372J4390M1105L7917k30k03K5318
$$ 90804 64637 40603 54065 35159 12623 251 14641 55746 93663 93433 93230 118548
14996A18548L8431m512j5826o46J8225p51j9566k9166K0336m698P95k7683M7238
$$ 118548 156979 152467 136641 135995 154220 153469 133903 104737 125073 120375 121170 93487 140725
14983A40725K5777q196J3904j3962J999J226K7218j4500l3942j3058L0634p142
$$ 140725 166502 158306 172210 158248 160247 161473 188691 174191 140249 127191 157825 150683
14971A50683k2928r515j3196J1152K7107J0722j9104k5996n764N563R623J7912
$$ 150683 127755 118240 105044 116196 143303 154025 134921 108925 103161 108724 118347 136259
14959A36259k149L0161j9253m4161K2927L2757K3902O4918j1846l6860l4838l085
$$ 136259 134110 164271 145018 100857 123784 156541 180443 245361 233515 196655 161817 158732
14947A58732n024J6630M3579J0759L956m0433L2453K9902k5749m5491j720J612
$$ 158732 153708 170338 213917 224676 228632 188199 220652 250554 224805 179314 177594 179206
14935A79206J8466M3081L929k2899o094K2702L030J4333P587l8644l9806J0862
$$ 179206 197672 240753 244682 221783 215689 238391 241421 255754 263341 224697 184891 195753
14923A95753N8156p709l9519n187J3266J0452J1324k6046N2287L0665j2755L0042
$$ 195753 253909 246200 206681 201494 214760 225212 236536 210490 262777 293442 280687 310729
14911C10729N5417O0777o030J8265J7423k2425n8782n1583j3714J02k7693o1569
$$ 310729 366146 426923 420893 439158 456581 434156 375374 323791 310077 310179 282486 220917
14899B20917n0369m6935k283J4897j510K8889N2493K5951Q384P117l5892J1447
$$ 220917 170548 123613 121330 136227 134717 163606 216099 242050 250434 257551 221659 233106
14887B33106P272K4801j0924P754K9598k5727L3959J8794k3436j6250J5079M6968
$$ 233106 240378 265179 254255 262009 291607 265880 299839 318633 295197 278947 294026 340994
14875C40994K9742L3670J2544K198L4509J7543J9417L115k395K876j3304Q115
$$ 340994 370736 404406 416950 419148 453657 471200 490617 493732 491337 494213 480909 489024
14863D89024l6508p1036j6435M5946J9644j2747K5400J1661J6378m865Q878K8661
$$ 489024 452516 381480 365045 410991 430635 417888 443288 454949 471327 466462 475340 504001
14851E04001K5694L6599K7631K7006K3190k614K8982M6508L809j3191L725L4077
$$ 504001 529695 566294 593925 620931 644121 641507 670489 716997 720806 707615 711340 745417
14839G45417K1687k8274j7759K6341j0546J2240L3706N571M4266M8850L0550P0427
$$ 745417 767104 738830 721071 747412 736866 749106 782812 788383 832649 881499 912049 982476
14827I82476O8883L9270N1653M0632M6666P7078R2543j1968m933L2638R8364J35837
$$ 982476 1051359 1090629 1142282 1182914 1229580 1306658 1399201 1387233 1382300 1414938 1513302 1649139
14815A649139Q7324P7749J30025J11884J56781K01736J87032K06901K52989K75919
$$ 1649139 1736463 1814212 1944237 2056121 2212902 2414638 2601670 2808571 3061560 3337479
14805C337479K99223K58822K83608L26549L77440M52461N22489O21768P78748
$$ 3337479 3636702 3895524 4179132 4505681 4883121 5335582 5858071 6479839 7258587
14796G258587R56670J156569J446169J693137J956508K313763K731160L183991
$$ 7258587 8215257 9371826 10817995 12511132 14467640 16781403 19512563 22696554
14788B2696554L845544M907413O681878R650376J4276392K0884117K9281392L8092364
$$ 22696554 26542098 31449511 38131389 47781765 62058157 82942274 112223666 150316030
14780A50316030M4696534M6098664L9874389K5709121O519625j3585596l1206053
$$ 150316030 195012564 241111228 280985617 306694738 313214363 299628767 268422714
14773B68422714m3061524m5870667l9876676k9532197j9981754j3302286r161238
$$ 268422714 225361190 179490523 139613847 110081650 90099896 76797610 67636372
14766F7636372o590107n028026m053567l475955l097516k868531k729039k575992
$$ 67636372 61046265 56018239 51964672 48488717 45391201 42522670 39793631 37217639
14758C7217639k390915k180971j975274j766741j616756j462074j254179j097828
$$ 37217639 34826724 32645753 30670479 28903738 27286982 25824908 24570729 23472901
14750B3472901r48613q15310o68195o24628n45969m90090n34247n32538n62900
$$ 23472901 22524288 21708978 21040783 20416155 19870186 19380096 18845849 18313311 17750411
14741A7750411n61487n40189n23915n10064m45003m22347m34670m07308m10562
$$ 17750411 17188924 16648735 16124820 15614756 15169753 14747406 14312736 13905428 13494866
14732A3494866m07013l84086l97350l79273l78189l83575m14120l54040k95082
$$ 13494866 13087853 12703767 12306417 11927144 11548955 11165380 10751260 10397220 10102138
14723A0102138l12285l48001l10313l04608l10018k39824k26734k11713k30335
$$ 10102138 9789853 9441852 9131539 8826931 8516913 8277089 8050355 7838642 7608307
14714G608307j96878j79715j59744j63734j53427j73884j49577j18650j32876
$$ 7608307 7411429 7231714 7071970 6908236 6754809 6580925 6431348 6312698 6179822
14705F179822j23271j14755j48274j11582j37346j66030j42262j11376j66692
$$ 6179822 6056551 5941796 5793522 5681940 5544594 5378564 5236302 5124926 4958234
14696D958234p8150m2607m1957l6373m9624K8137N7362P3001K4336o703q167q2970
$$ 4958234 4880084 4837477 4795520 4759147 4709523 4737660 4795022 4868023 4892359 4885656 4877489 4794519
14684D794519j80041k08662k73631k20166j86883j52991j21888j25154j25845
$$ 4794519 4614478 4405816 4132185 3912019 3725136 3572145 3450257 3325103 3199258
14675C199258j01178o7745o2140m2828k0018r9053r0749p7785p6112m3629l2891
$$ 3199258 3098080 3030335 2968195 2925367 2905349 2806296 2715547 2637762 2561650 2518021 2485130
14664B485130q1145o5795l7866o0641m5343O599j1090k2556p0068l8394k3179
$$ 2485130 2403985 2338190 2300324 2239683 2194340 2200939 2189849 2167293 2097225 2058831 2035652
14653B035652j5932l1361n9954l9119m9506p2843q7962m2831o4086n7218k0615
$$ 2035652 2019720 1988359 1928405 1889286 1839780 1766937 1678975 1636144 1572058 1514840 1494225
14642A494225m1590r936r784l8259k5404p037J4487p460j238j6117p1576m0156
$$ 1494225 1452635 1442699 1432915 1394656 1369252 1362215 1376702 1369242 1368004 1351887 1280311 1240155
14630A240155n2868p3913k9825k1663j7836o2291l3949m3713k3589k0945m8023
$$ 1240155 1187287 1113374 1083549 1061886 1044050 981759 947810 904097 880508 859563 811540
14619H11540m0040l0039l2936J584n035o007j0130k2267m2331K025M530J7908
$$ 811540 771500 741461 708525 710109 705074 699067 688937 666670 624339 626364 630894 648802
14607F48802j2498K3890K4778k7545K0345J4572R279O761Q8859K1931J691N5823
$$ 648802 636304 660194 684972 657427 677772 692344 701623 708384 797243 819174 820865 876688
14595H76688K0860M148M1540J2936m3575r410L1560O824N157K3317j3590k8348
$$ 876688 897548 901696 943236 956172 912597 903187 934747 941571 946728 970045 956455 928107
14583I28107o164k7736p0478m4554o714n6627k4927l5112m651l2002o4426J1878
$$ 928107 921943 894207 823729 779175 772461 715834 690907 655795 651144 619142 554716 566594
14571E66594j9491j3948j0144K153N1240K4721N977n2406p4127l9225K7575j8824
$$ 566594 547103 533155 523011 525164 576404 601125 607102 554696 480569 441344 468919 450095
14559D50095j0442J6551j7521j0847k7117j4287j7330O75P565J1468k6781m360
$$ 450095 439653 456204 438683 427836 400719 386432 369102 369777 377342 388810 362029 357669
14547C57669K2490J9307l9946k716Q535l6744j0232N24K7305J3551l3622j2331
$$ 357669 380159 399466 359520 356804 365339 328595 318363 318887 346192 359743 326121 313790
14535C13790k048j445K4339O060q043m3794J1537K9572J1363o663p895l6916m713
$$ 313790 311742 310297 334636 340696 332653 288859 300396 329968 341331 334668 326773 289857 285144
14522B85144R904M77m4130n1620L803L9934P2762k0180k6292N080l2755j5501
$$ 285144 295048 295525 251395 199775 203578 243512 316274 296094 269802 274882 242127 226626
14510B26626N2592J7974n1613k1146M591J6460j0763K1211K6827k0003j7472J7685
$$ 226626 279218 297192 245579 224433 229024 245484 234721 255932 282759 262756 245284 262969
14498B62969M19l3505q602j7021r321M5849l6847m1347K0128Q590k2990l839N0914
$$ 262969 263388 229883 221281 204260 194939 240788 203941 162594 182722 191312 168322 164483 215397
14485B15397j5709p5961k3811P289J1561K9934j6837m2991r634K3879J8074r157
$$ 215397 199688 123727 99916 107205 118766 148700 131863 88872 79238 103117 121191 112034
14473A12034k6890k7572j7237l609P7596P9822K0922j2559k6372k8163J4876J015
$$ 112034 85144 57572 40335 36726 114322 194144 215066 202507 176135 147972 162848 163863
14461A63863l4715R529k9502N597N874N814J9239l6482J5112k5691j3522R029
$$ 163863 129148 138677 109175 114772 120646 126460 145699 109217 124329 98638 85116 94145
14449I4145j3824k2591j3971K3915L3268m222j2162L4234J1353l9906k3916M2119
$$ 94145 80321 57730 43759 67674 100942 96720 84558 118792 130145 90239 66323 108442
14437A08442L3056K806k8085k1901p776K7033J271l9829L0601J7934n026R25K0251
$$ 108442 141498 144304 116219 94318 86542 113575 114846 75017 105618 123552 118526 119451 139702
14424A39702J5209j6854j4273m944l214l229M7864J2538r644K8869j5595m6703
$$ 139702 154911 138057 123784 118840 115626 112397 160261 172799 163155 192024 176429 129726
14412A29726n953R608L6219j0108L0861k3283k6371L802R546N603k3431q073M095
$$ 129726 123773 133381 169600 159492 190353 167070 140699 144501 154047 159650 136219 128146 132241
14399A32241L6417K1190K3162J7353m718j8201j1625l3997k1744J6145j388l500
$$ 132241 168658 189848 213010 230363 225645 207444 195819 161822 140078 156223 154835 151335
14387A51335k0558k748j8812K835j3273J2369j9834Q80k1638k5507P614P4672
$$ 151335 130777 128029 109217 112052 98779 111148 91314 92194 70556 45049 52663 127335
14375A27335n763J6059J361n499j7477L0679K1305J9705K7570j8989n0137l7385
$$ 127335 121572 137631 138992 133493 116016 146695 168000 187705 215275 196286 146149 108764
14363A08764m320r069L984N6765L0383O034j1110j4527p85K1474j6181j4614J8912
$$ 108764 104444 95375 99359 156124 186507 192541 181431 166904 166119 187593 171412 156798 175710
14350A75710K1635n310j2835q323Q387J7475k3427J4885L8836J6485k5935o142
$$ 175710 197345 192035 179200 170877 179264 196739 173312 188197 227033 243518 217583 211441
14338B11441k7462j9428m741K0297N0461L7429M231j0672j248R79L314P1877Q6415
$$ 211441 183979 164551 159810 180107 230568 267997 272228 261556 260308 261287 264601 336478 422893
14325D22893N9980N3838J15888J37775J60208K05645K44493J98728J24756O7871
$$ 422893 482873 536711 652599 790374 950582 1156227 1400720 1599448 1724204 1792075
14315A792075k7033j20281j64875j81593k30620j86469q7190p7887n4122p0251
$$ 1792075 1765042 1644761 1479886 1298293 1067673 881204 794014 716127 662005 591754
14305E91754q6747q2712k5589K0487m278M4946m5337l5588L0340L5369j6456k3142
$$ 591754 505007 422295 396706 417193 412915 457861 412524 376936 407276 442645 426189 403047
14293D03047M364Q095K6590j5761n2398j8829j623m063m314L8445L3843n1413
$$ 403047 407411 415506 442096 426335 373937 355108 353485 349422 345108 383553 417396 365983
14281C65983l2713L2842N2169P42r560J0962j276k0538j2096l9160J3266K6775
$$ 365983 333270 366112 418281 419023 409463 420425 419149 398611 386515 347355 360621 387396
14269C87396K8370L7785J9548J6515j3454l7510l896l3702j7973j3270N4595K6503
$$ 387396 415766 453551 473099 489614 476160 438650 434754 401052 383079 369809 424404 450907
14257D50907j4978k9997K215J7340J4050J3769j8951J2649K4344J0626l35j8117
$$ 450907 435929 405932 408147 425487 439537 453306 434355 447004 471348 481974 481639 463522
14245D63522k7675M3459K9324M201K8012j2256L084j655j3909J8179J3324M4695
$$ 463522 435847 479306 508630 512831 540843 528587 531671 530016 516107 534286 547610 592305
14233E92305L8589J4952L502O471M7220L3320n748K1173M0466M9810K6547J7084
$$ 592305 630894 645846 649348 655819 703039 736359 730611 751784 792250 842060 868607 885691
14221H85691K3752L1791L2975M7004J3950K0370M0006N5584P2348M4504K2687
$$ 885691 909443 941234 974209 1021213 1035163 1055533 1095539 1151123 1223471 1267975 1290662
14210A290662L0710P8536O4407N0152J01858R3272K8978Q3875J21561O9284O2097
$$ 1290662 1321372 1399908 1464315 1514467 1616325 1709597 1738575 1822450 1944011 2013295 2075392
14199B075392R5417R0158P8254J08590J38454J77433J85812J57415J61937J72268
$$ 2075392 2170809 2260967 2339221 2447811 2586265 2763698 2949510 3106925 3268862 3441130
14189C441130K03360K73190K63086K48153L11933K87860L36130L86619L79427
$$ 3441130 3644490 3917680 4180766 4428919 4740852 5028712 5364842 5751461 6130888
14180F130888M45003M61598N38735O15388O42341O74908P66050Q10516Q55706
$$ 6130888 6575891 7037489 7576224 8191612 8833953 9508861 10274911 11085427 11941133
14171A1941133R98004J100125J220929J309010J419652J592813J747039J931678
$$ 11941133 12939137 14039262 15260191 16569201 17988853 19581666 21328705 23260383
14163B3260383K072733K263034K446705K765359K990000L286681L600784L866458
$$ 23260383 25333116 27596150 30042855 32808214 35798214 39084895 42685679 46552137
14155D6552137M155019M446227M760158N025199N241937N457816N585587N594649
$$ 46552137 50707156 55153383 59913541 64938740 70180677 75638493 81224080 86818729
14147H6818729N515537N287239M913893M391873L715363K898680J993052J071130
$$ 86818729 92334266 97621505 102535398 106927271 110642634 113541314 115534366 116605496
14139A16605496R2642q52600j700717k439482l136797l654749m065340m336146
$$ 116605496 116698138 115845538 114144821 111705339 108568542 104913793 100848453 96512307
14131I6512307m456585m543000m516658m425453m294332m093541l871928l675807
$$ 96512307 92055722 87512722 82996064 78570611 74276279 70182738 66310810 62635003
14123F2635003l449182l311926l101603k912338k751117k550125k369630k200904
$$ 62635003 59185821 55873895 52772292 49859954 47108837 44558712 42189082 39988178
14115C9988178k035097j875046j752011j624891j509189j386917j313538j225533
$$ 39988178 37953081 36078035 34326024 32701133 31191944 29805027 28491489 27265956
14107B7265956j167434j104837j016854r61395r14230q27182q29276p88546p03790
$$ 27265956 26098522 24993685 23976831 23015436 22101206 21274024 20444748 19656202 18952412
14098A8952412o28133o50592o22617o22401n77009n43314n26762n09170m59226
$$ 18952412 18324279 17673687 17051070 16428669 15851660 15308346 14781584 14272414 13813188
14089A3813188m33539m22976m56209m11206l58358l63946l58503l68267l60009
$$ 13813188 13379649 12956673 12500464 12089258 11730900 11366954 11008451 10640184 10280175
14080A0280175k82647l00407l13479k56310k56665k72984k13745k26844k18511
$$ 10280175 9997528 9697121 9383642 9127332 8870667 8597683 8383938 8157094 7938583
14071G938583j94196j66373k22191j79638j58138j94995j74076j15398j41125
$$ 7938583 7744387 7578014 7355823 7176185 7018047 6823052 6648976 6533578 6392453
14062F392453j29048j04474q3962j00681o8742r0032j01163j02766j25618j20469
$$ 6392453 6263405 6158931 6074969 5974288 5905546 5815514 5714351 5611585 5485967 5365498
14052E365498r9268j27287j05274j57850j52159j34306j13905j19886j18768j59161
$$ 5365498 5266230 5138943 5033669 4875819 4723660 4589354 4475449 4355563 4236795 4077634
14042D077634j23170q0436j07026q0215j17876r7350q8645q3591j29413n7131
$$ 4077634 3954464 3874028 3767002 3686787 3568911 3471561 3382916 3299325 3169912 3112781
14032C112781l8325q3971p0031j04177p5011n7353m9410n8297m5358o7488n7777
$$ 3112781 3074456 2990485 2920454 2816277 2741266 2683913 2634503 2576206 2530848 2463360 2405583
14021B405583q5347j9585j6107m6010p1687r0788l0946j3835q8934j3350m1558
$$ 2405583 2320236 2300651 2284544 2238534 2166847 2076059 2045113 2031278 1942344 1928994 1887436
14010A887436o3757n4606m6507n3418r689m4801m5035n2880k7692k8045k2373
$$ 1887436 1823679 1769073 1722566 1669148 1659459 1614658 1569623 1516743 1489051 1461006 1438633
13999A438633j5965k5536k8331m7860r0180n7130k1545L9115m279k2796J1193
$$ 1438633 1422668 1397132 1368801 1320941 1230761 1173631 1152086 1191201 1186922 1164126 1175319
13988A175319P305l5585l4785n5608J6522o117j3867K2648l504k4196m301m9465
$$ 1175319 1182624 1147039 1112254 1056646 1073168 1067051 1053184 1075832 1072328 1048132 1043831 994366
13976I94366o5120p4420m5731l5504K3697j2910n6390n0026l8019m1968j6180
$$ 994366 929246 854826 809095 773591 797288 784378 727988 677962 639943 597975 581795
13965E81795K2831J2354k3553k2482o373o3632l9631m7611N437J8051k1107J39
$$ 581795 604626 616980 593427 570945 564572 500940 461309 413698 419135 437186 416079 416218
13953D16218K1473m0823j1578K7350N920l2671M977N97j1889j6599O336k3336
$$ 416218 437691 396868 385290 412640 418560 385889 390866 391463 379574 362975 369311 345975
13941C45975o336N420p078k1390K3993m600k7796l654k1960P482R58R253j2344
$$ 345975 339639 345059 337981 316591 340584 335984 308188 304534 282574 290056 291014 300267 287923
13928B87923L010K3945j0822R702r782j5413j8442K350k202O056l239n486p733
$$ 287923 290933 314878 304056 313758 303976 288563 270121 272471 270269 276325 273086 267600 259867
13915B59867L2801l1395m3863J0300M4912J2489j0247K38K4498j175k0484J8112
$$ 259867 292668 261273 217410 227710 272622 285111 274864 275102 299600 298425 277941 296053
13903B96053P793j581k0068l1254j2643M0659J2093j1146k083j2010m489R212
$$ 296053 303846 302265 282197 250943 238300 278959 291052 279906 277823 265813 261324 270536
13891B70536j3317l0062l2712L1265M3646J5736Q506k7054k0850J1697j8868P975
$$ 270536 257219 227157 194445 225710 269356 285092 293598 266544 245694 257391 238523 246498
13879B46498M0146j5076k2388r852L382l0104j5209R168N39N578j1590J1523n493
$$ 246498 286644 271568 249180 239328 242710 212606 197397 206565 207104 212682 201092 212615 207122
13866B07122j6228L5071j388l1856q364N673l4359k5763N2630M6470j4948l5110
$$ 207122 190894 225965 224577 192721 184357 190030 155671 129908 182538 229008 214060 178950
13854A78950k648k4288k538K1147j1631r641n4867K5552K7408j4692K4302l9277
$$ 178950 176302 152014 149476 170623 158992 149351 94484 120036 147444 132752 157054 117777
13842A17777k9715r71j0809M888o822J841k9448o432m924J0034K3283j2652k981
$$ 117777 88062 87091 76282 81170 74348 76189 46741 40309 35385 45419 68702 56050 53069
13829E3069L5450L0126J014L0143J917n6939l0932K7079l7173k590J8760k577
$$ 53069 88519 118645 119659 149802 151719 94780 63848 90927 53754 51164 69924 67347
13817F7347k1859J5917n346M973J8999J626K0365J3944m194m0339K6496l103k8300
$$ 67347 45488 61405 56059 61032 80031 81657 102022 115966 111772 71433 97929 94826 66526
13804F6526J9443j5061m3499j828J3624o513K1185M4358j8959j5362K2240L2600
$$ 66526 85969 70908 27409 25581 39205 32692 53877 98235 79276 63914 86154 118754
13792A18754j9314O735J056J7876O151n900K7673l3979m622q533p719Q589k5138
$$ 118754 99440 106175 107231 125107 131258 125358 153031 119052 114430 105897 98178 106767 81629
13779H1629k680Q416O741R836Q79m335j3265j7267J3228J6519j7943j0136J696
$$ 81629 78949 87365 94106 103942 104821 100486 87221 69954 83182 99701 81758 71622 73318
13766G3318k052j0137q668l946m2010m5412P1017P8682J7912l3o2864l0716p639
$$ 73318 71266 61129 52461 48515 6505 -38907 32110 110792 128704 128671 65807 35091 27452
13753B7452R485m735m609K9M0848M638n3915k1986j1546o186j0708m996L0741
$$ 27452 36937 32202 27593 27622 68470 73108 19193 -2793 -14339 -20525 -31233 -36229 -5488
13740e488K7472K2242k775J4184k1606k7056l8419O739M8971K3719j977k7871
$$ -5488 21984 44226 41451 55635 34029 6973 -31446 -24707 24264 47983 46006 18135
13728A8135K1034M0360K4530j3944j2569k3379O994L2714m935K6817K0651n1475
$$ 18135 39169 79529 104059 90115 77546 54167 61161 93875 88940 115757 136408 84933
13716H4933l0282L1399J3512L2704M0402L5840J1287J5294l1818l5496J2076K0433
$$ 84933 54651 86050 99562 132266 172668 208508 219795 235089 203271 167775 179851 200284
13704B00284q502P620J7641n156L5742O6708P7250N1321p606L4146R655K4849
$$ 200284 191782 199402 217043 211887 247629 314337 391587 442908 435302 469448 479103 503952
13692E03952J1267J0118O3412N2781K5559j4960J6256K8335l0854R426J7885j5962
$$ 503952 515219 525337 588749 641530 667089 652129 668385 696720 665866 675292 693177 677215
13680F77215k2870n0388l1059l7432m210j9686k9953k2521l2500l2354j0088j9796
$$ 677215 654345 603957 572898 535466 531256 511570 481617 459096 426596 394242 384154 364358
13668C64358j8494k0820K4372k8990L109K5609Q311k9616n8115l3024K4887q303
$$ 364358 345864 325044 349416 320426 323535 349144 357455 327839 269724 236700 261587 253284
13656B53284k4606n601l800k7940j0546m6457o502K2230K3303r050j0169k5683
$$ 253284 228678 223077 219277 191337 180791 134334 127832 150062 173365 164315 154146 128463
13644A28463j7808m182L359M8829p509l2735j7838j715N987L060k5669k7791K3265
$$ 128463 110655 106473 109832 158661 151152 118417 100579 98864 104851 107911 82242 54451 77716
13631G7716j3459M25J3893K0323k96m0917l0654q763Q038k3220R793k1620J4007
$$ 77716 64257 64682 78575 98898 98602 57685 27031 18268 26306 3086 12879 -8741 5266
13618E266M3124J9345L0689K5017O654l092P128m98l3423q486l6684q440l0950
$$ 5266 48390 67735 98424 123441 130095 127003 134131 133633 100210 91724 55040 46600 15650
13605A5650j5582L336K0182J8749k828l172j6579n198K3407r51p153r423K0415
$$ 15650 68 3404 23586 42335 39507 36335 19756 14558 37965 37014 29861 20438 40853
13592D0853M834k0925O284K3501J9819m914k5237K2551j7823o848J8204J2722
$$ 40853 45687 24762 31046 54547 74366 69452 44215 66766 48943 42095 60299 73021
13580G3021r856o5316k1964L5495Q58l627K2235M0868k80j220k5315k7781R020
$$ 73021 63165 -2151 -24115 11380 12238 8611 30846 71714 71434 70214 44899 17118 26138
13567B6138J0056Q365j7033j9550N698l297K5300L2234L4632k84m9575l4460L1495
$$ 26138 36194 44559 27526 7976 13674 10377 35677 67911 102543 102259 52684 18224 49719
13554D9719m3024J776J7447m944l5896j0574K2939J2529n673j5006N592J6232
$$ 49719 6695 8471 25918 20974 -14922 -25496 -2557 9972 4299 -10707 -5115 11117
13542A1117K1399K6363K0735o3437l1117J7507J6488p003n61J0442k3675M717
$$ 11117 32516 58879 79614 16177 -14940 2567 19055 12052 11491 21933 -1742 2975
13530B975l1575L141O180J5746M6171L2599l3821k2252k1719J6563K0146j0238
$$ 2975 -28600 -25459 -19279 -3533 42638 75237 41416 19164 -2555 14008 34154 23916
13518B3916j9358L1507R333j8899l113j6541j9857R184K8057K6757K6002j2388
$$ 23916 4558 36065 45398 26499 23386 6845 -13012 -3828 24229 50986 76988 64600
13506F4600l9123k9017L708o351q947L3740M5233j3653q128k0605O147M156K8600
$$ 64600 25477 -3540 168 -6183 -15130 18610 63843 50190 42062 21457 27604 31760 60360
13493F0360l189l1071L020j9813N709K3000O051k7282P047J2486j5114j365o233
$$ 60360 57171 26100 29120 9307 15016 38016 44067 16785 23832 36318 21204 19839 13606
13480A3606l5472L0884L1449j7443k0577j952l643m190j1970J3324R260R547K8236
$$ 13606 -21866 9018 40467 23024 2447 495 -3148 -7338 -19308 -5984 3276 12823 41059
13467D1059k2461l6439R868l849j5913k0830M8585K5721j659j2084J8980P910
$$ 41059 18598 -17841 -7973 -11822 -27735 -48565 20 25741 24082 11998 30978 38888
13455C8888k8589l1420J430j8314n282J4709P281N131M6563p937l7506N22J060
$$ 38888 10299 -21121 -19691 -38005 -43287 -28578 -21297 -16166 30397 22460 -15046 -14524 -13464
13442a3464j5944l1610J2333L9566J0420K436K1679J5244j5126l3607j0069J4939
$$ -13464 -29408 -61018 -48685 -9119 1301 3737 25416 40660 25534 -8073 -18142 -3203
13430c203l849P951r955k1543j9328l7628L1194J9524j5822L2605M1388K6702
$$ -3203 -7052 899 -9056 -30599 -49927 -87555 -56361 -36837 -52659 -20054 21334 48036
13418D8036j580j2984j4420j9924j2253N503J7179M4814o4m5843l7120K2987J9878
$$ 48036 46456 33472 19052 -872 -13125 -7622 9557 54371 54307 8464 -28656 -5669 14209
13405A4209J622K227O450r609m0413J7342j7292M341M5477J0431q378m406l2106
$$ 14209 15831 18058 24508 14899 -25514 -8172 -25464 -21123 24354 34785 26407 22001 -10105
13392a0105m1292L1077J9740l2292j0597K9238n73J4045k4391m450K1081j9759
$$ -10105 -51397 -20320 -580 -32872 -43469 -14231 -14804 -759 -25150 -29600 -8519 -28278
13380b8278j6491O303J4853j0148j3856L3786K6409n552k0104j2147J7180O840
$$ -28278 -44769 -38466 -23613 -33761 -47617 -13831 12578 7026 -13078 -25225 -8045 -1205
13368a205L2143J5871J851R062q034l6293k2223R784J9466j9646o4754j5792o408
$$ -1205 30938 46809 48660 57722 49688 13395 -8828 956 20422 776 -63978 -79770 -86178
13355h6178K172K3886P937M7921K2606M681M014J3128J029Q990k1864K740p129
$$ -86178 -84006 -60120 -52183 -4262 18344 23025 27039 40167 41196 50186 28322 31062 23933
13342B3933K3746j5829q198l1904m5747j2531M9970M989K4749L2357l2424j7858
$$ 23933 47679 31850 23652 -8252 -53999 -66530 -16560 -11571 13178 45535 13111 -4747
13330d747R432J9154j663j514j3725l213o60j2145K9944K3274o560k1923j9510
$$ -4747 4685 23839 22176 20662 6937 3724 3064 -9081 20863 44137 37577 15654 -3856
13317c856k4656l4873p196o835K8531L9155j5744k7048N4857K1565J6239j8859
$$ -3856 -28512 -63385 -70581 -77416 -48885 -9730 -25474 -52522 2335 23900 40139 21280
13305B1280j9921o375k0662K4854R271l5627L201J7454M3272j590l7599k6490
$$ 21280 1359 -5016 -25678 -824 8447 -27180 -23979 -6525 36747 35157 -2442 -28932
13293b8932K4812P8652M8937k3477k4066k9442l4897k5032P294J6999K1071K1753
$$ -28932 -4120 74532 123469 99992 75926 46484 11587 -13445 -6151 10848 31919 53672
13281E3672j2347m0159q996j1903J5564P327N211k962K1790K6032k0635k2908
$$ 53672 41325 1166 -7830 -19733 -4169 3158 8369 5407 27197 53229 32594 9686
13269I686J0387K8200q481r469k3698K6597l1417j8405o848J2253j7457j0083
$$ 9686 20073 48273 39792 30323 6625 33222 1805 -16600 -23448 -11195 -28652 -38735
13257c8735k6683p419J6826j4267J5595M4406q882R21J0341P52q017K3553K8581
$$ -38735 -65418 -72837 -56011 -70278 -54683 -10277 -19159 -18238 -7897 -7145 -15162 8391 36972
13244C6972K4200j0866l3376k1859R357J245j5193K9132J5943n0842q094j2003
$$ 36972 61172 50306 16930 -4929 4428 5673 -9520 19612 35555 -15287 -23381 -35384
13232c5384L822J2877p529j5841l4427L4689M6699L3268k7655K5707K6099l5728
$$ -35384 -31562 -18685 -26214 -42055 -76482 -41793 4906 38174 10519 36226 62325 26597
13220B6597J051L455k9351P415L7424k1627l2899K583j0640k1017k0882L1209
$$ 26597 27648 31103 1752 9167 46591 24964 -7935 -5352 -15992 -37009 -57891 -26682
13208b6682M974k3063J1674J5763j9185q80J5834M2907m487j7274j3158O026J735
$$ -26682 -21708 -44771 -33097 -17334 -36519 -37399 -21565 21342 16855 -419 -13577 -7551 -5816
13195e816N966l0375m954k0775l071J7745L7126K4196O833M9921k9271J0887K031
$$ -5816 150 -30225 -35179 -55954 -59025 -41280 -4154 20042 26875 76796 47525 58412 60443
13182F0443k6363L71M291k040j5069q251J7316j0001m148l94K5532l769L7522
$$ 60443 34080 34451 38742 36702 21633 13382 30698 20697 16549 16155 41687 37918 75440
13169G5440j9709m065L8027L2886n7606l0384k2782J7711K8592k8003k7545l2792
$$ 75440 55731 51666 89693 122579 64973 34589 11807 29518 58110 30107 2562 -30230
13157c0230K2519J7877K5839J272j4534l6531J7347K084J7249J4483r908J1531
$$ -30230 -7711 10166 36005 37277 22743 -13788 3559 5643 22892 37375 27467 38998
13145C8998J1756k3432l561n64j1007q006M0775P716m148l4383K2845k0271k6783
$$ 38998 50754 27322 23761 23197 12190 4184 44959 52675 48527 14144 36989 16718 -10065
13132a0065j2284k0057j0421q444J1286J2190o616p705Q430L8685J1014j8851
$$ -10065 -22349 -42406 -52827 -61271 -49985 -37795 -44411 -52116 -43686 -5001 6013 -12838
13120a2838J0933N703k3733n907M0627J5270j0673Q788P114k9677j004l244L2171
$$ -12838 -1905 3798 -19935 -25842 14785 30055 19382 28170 35284 5607 4603 1359 33530
13107C3530J4458k3617k4426N788Q115o1572k6845N9574K3821l0850M1002K3669
$$ 33530 47988 24371 -55 5733 13848 -47724 -74569 -14995 8826 -22024 18978 42647
13095D2647l0437j6624L5259K1924k3039m9674M936M5262l1661K0008k0030m0458
$$ 42647 12210 -4414 30845 52769 29730 -19944 -15008 30254 -1407 18601 -1429 -41887
13083d1887K5204J0174n890J6490K6721m4747J6563N3725o122o3522n6657J0774
$$ -41887 -16683 -6509 -12399 4091 30812 -13935 2628 56353 50231 -13291 -69948 -59174
13071e9174J3573L0512N5884o130j0902n516j1750q894r097j1206j8013O665j1927
$$ -59174 -45601 -15089 40795 34665 23763 18247 6497 -2397 -11494 -22700 -40713 -34048 -45975
13058d5975P819J8984N6600Q258l3202k6312j6118J568J3347Q915l2401M365L3231
$$ -45975 -38156 -19172 37428 45686 12484 -13828 -29946 -28378 -15031 -6116 -38517 -34152 -921
13045i21k6754k8372q916l0341K244N6543K4895J9339j3387q338L4987J8962J4359
$$ -921 -27675 -56047 -64963 -95304 -93060 -36517 -11622 7717 -5670 -14008 20979 39941 54300
13032E4300j4517r840o686J8989M0036k4346m6242j6416j7753L8449N2479J1331
$$ 54300 39783 29943 23257 42246 82282 57936 11694 -4722 -22475 15974 68453 79784
13020G9784j3598o620l4803J9445o865p089j713o765q263J8990k784n44j0233
$$ 79784 66186 59566 24763 44208 37343 30254 28541 21776 13513 32503 29719 29175 18942
13007A8942k0735K1871J8309K7070L7047k919m0723j4172k916j479K6050q884
$$ 18942 -1793 20078 38387 65457 102504 99585 58862 44690 41774 40295 66345 57461
12995E7461p46j7827l007j6503k9108J6181J3108N074k7748k8739m0052K6367
$$ 57461 56715 38888 35881 19378 -9730 6451 19559 24633 -3115 -31854 -71906 -45539
12983d5539K9888j4510L697K6998J6926p832l4255k0549l1791M0640O4731J9490
$$ -45539 -15651 -30161 -26464 534 17460 9628 -24627 -45176 -76967 -36327 28404 47894
12971D7894q963m2833O691L9355j2307K4083j0979K689J9334j4677j3189J8913
$$ 47894 38931 -3902 2789 42144 29837 53920 42941 45630 64964 50287 37098 56011
12959E6011Q665m5369j9117K4222K1751r947n9169l0817k9096L3039L3954L3017
$$ 56011 64676 19307 190 24412 46163 36216 -22953 -53770 -82866 -49827 -15873 17144
12947A7144j929n2570L0891n875k0167o215n952P5349J8745k385l3382p980L0845
$$ 17144 15215 -37355 -6464 -12339 -32506 -38721 -44673 30676 49421 47036 13654 5674 36519
12934C6519K8638M089k4136j3494r75J3809j2953m5535q607R649J6404l065k399
$$ 36519 65157 69246 45110 31616 30641 44450 31497 -14038 -22645 -12996 3408 343 -2056
12921b056j8710k7851O623M7832j3345j4913K3355J3018j6K3073J679j3526l2270
$$ -2056 -20766 -48617 -41994 5838 -7507 -22420 935 13953 13937 37010 38689 25163 -7107
12908g107l5565j2874j0032K3206M1481q084j9991J6691M7238j3047q005k4038
$$ -7107 -42672 -55546 -65578 -42372 -891 -8975 -28966 -12275 34963 21916 13911 -10127
12896a0127l434m88q241q419J8920j9821k3377l7953N564L0091K871k67M0942
$$ -10127 -13561 -14049 -22290 -30709 -11789 -31610 -54987 -92940 -87376 -57285 -54414 -54681 -13739
12883a3739K8005L6963J9939m7613k6068R990j7605K3089J9195p734J2485k7676
$$ -13739 14266 51229 71168 23555 -2513 7477 -10128 12961 32156 24422 36907 9231
12871I231k7516R869K7597J9058k97l955k1895J5911m301j1259j9681j805L5003
$$ 9231 -18285 -8416 19181 38239 37942 33987 12092 28003 23702 12443 -7238 -9043 25960
12858B5960l832o481J1585J3529O090K633O993K3722k1293m1651k4248K7294n332
$$ 25960 22128 15647 27232 40761 46851 49484 56477 80199 58906 17255 -6993 20301 14969
12845A4969P665l101J0932j7581k4202L7472j9818P503J1752m0713j9512L7532
$$ 14969 22634 19533 30465 12884 -11318 26154 6336 13839 25591 -15122 -34634 2898
12833B898O5621J9596k9788j4303n7575k6024M5892L8951M18j9577j257j414O697
$$ 2898 68519 88115 58327 44024 -13551 -39575 6317 45268 45686 26109 24852 23438 30135
12820C0135j4242N135J5937l857j3039r009J8377j7332j1192l918K9216Q498k4848
$$ 30135 15893 21028 36965 33108 20069 11060 29437 12105 913 -3005 26211 34709 9861
12807I861J5441K3481J1355j745M4412K0848K9338J2156N372j3117K8221O3981
$$ 9861 25302 48783 60138 58393 102805 123653 152991 165147 170519 157402 185623 249604
12795B49604O6007N2018J38992J68966J23416J25615J16125O5459j1651j12175
$$ 249604 315611 367629 506621 675587 799003 924618 1040743 1106202 1094551 982376
12785I82376j44933j61867j08134j15744o2804q1847p1629l7632k4873j3987l3566
$$ 982376 837443 675576 567442 451698 388894 307047 235418 197786 172913 158926 125360
12774A25360n437O3950n517P906J2200j7126m5699P332L4150O630k763k8466n0546
$$ 125360 119923 183873 178356 186262 198462 181336 135637 142969 177119 183749 180986 152520 101974
12761A01974j5656K7018K3691k0998Q256J0239l0791J448j2242J5605L4392n3660
$$ 101974 86318 113336 137027 116029 124285 134524 103733 105181 92939 108544 142936 89276
12749H9276l4918K4170J0990k7546R123L2246K1454k2106J6668j9539j3500k6333
$$ 89276 54358 78528 89518 61972 71095 103341 124795 102689 119357 99818 86318 59985
12737E9985j8770M908L7128M6894N364l5944r164K578N668M1443o226k8463K8880
$$ 59985 41215 46123 83251 130145 135509 99565 90401 92979 98647 140090 133864 105401 134281
12724A34281l4998r230O442j9345j2822m6591R790M0204k568Q592N832k5475k5971
$$ 134281 99283 90053 96495 77150 64328 17737 27527 67731 65163 73755 79587 54112 28141
12711B8141j025J9796j392J8753K0718J72k3003K8519L0706L2943p466L993K0818
$$ 28141 27116 46912 45520 64273 84991 85163 62160 90679 121385 154328 146862 150855 171673
12698A71673l4471k5192k1905l7528o865j3755k3546N904Q939L633J4893L712
$$ 171673 137202 112010 90105 52577 45712 31957 8411 14315 23254 26887 41780 45492
12686D5492N783k5068J034J0222j8775K4082K1062n771k7292P55J9189L0703J1498
$$ 45492 51275 26207 27241 37463 18688 42770 63832 58061 30769 31524 50713 81416 92914
12673I2914K372m3037O39n0J2091K4032m724q645k661j5976L838j3937J3629Q783
$$ 92914 95286 52249 52888 52838 64929 88961 84237 75592 72931 56955 60793 46856 60485 69268
12659F9268m969m1172j4497L887j1670k1900L1189M3567j3536j1648J223j4212
$$ 69268 64299 23127 8630 12517 847 -21053 10136 53703 40167 28519 29742 15530
12647A5530j0736K3471k4544o612O216R182q365o492r467m206J5657K5156M199
$$ 15530 4794 28265 3721 -2891 3325 12507 4142 -2350 -11817 -16023 -366 24790 28989
12634B8989k5095P859k1615k7648J2595L5366R812J879l4947j4214J749L5221
$$ 28989 3894 11753 -9862 -37510 -24915 10451 20263 22142 -12805 -27019 -25270 9951
12622I951K3922J4336j0929K7309k810Q43L4147j2280j2459j195j5471l4164j8212
$$ 9951 33873 48209 37280 64589 61779 62622 96769 84489 72030 70835 55364 21200 2988
12609B988J5449J9466J6340k1844K355J11k457j6546J3875O881o672M4461J0741
$$ 2988 18437 37903 54243 32399 34754 34865 32408 15862 29737 36618 29946 74407 85148
12596H5148m6591j462M407k4660k359K1909K9497N3061O456j0250l5120n9180
$$ 85148 38557 37095 41502 16842 14483 36392 65889 118950 125406 115156 80036 20856
12584B0856P578K4520J4473n824j2425j5003J707j1434k5K3507K975K741k6703
$$ 20856 28434 52954 67427 61603 49178 34175 35882 24448 24423 47930 50905 53646 26943
12571B6943J906K870q106K6280J5736O190l3645K7666N483J0993k3675n176L260
$$ 26943 28849 31719 23613 49893 65629 71819 38174 65840 71323 82316 58641 53465 56725
12558E6725J78j6157m471K9791J3011J3912J987m407p445J6241P4072J9017J9486
$$ 56725 56903 40746 36275 66066 79077 92989 94976 90569 83124 99365 173437 192454 211940
12545B11940N0611J0060j3435m2817m9331k8696Q897j0472m8679j5147O064K4012
$$ 211940 262551 272611 259176 216359 167028 138332 147229 136757 88078 72931 78995 103007
12533A03007K4256P333n2096L5651m08j2072M3277j4376m631k9017l9530o936
$$ 103007 127263 134596 82500 118151 117743 105671 148948 134572 129941 100924 61394 54458
12521E4458M851L382K115k4779j6928K4511O478J1370k9749l8954J9973M5506
$$ 54458 59309 62691 64806 40027 23099 47610 54088 65458 35709 -3245 16728 62234
12509F2234L4182j0373J7619J9977L2208l7840n071k9500j986J3627j8891k4357
$$ 62234 96416 86043 103662 123639 155847 118007 112936 83436 81450 95077 76186 51829
12497E1829r198J5341r041j026O547k0255k353j338k156J5484J2569Q791k4782
$$ 51829 42631 57972 48931 47905 54452 34197 31844 30506 28350 43834 56403 65194 40412
12484D0412k1564N2261K7264l8839J7457J7846j0250J4525J4824M753Q7734k028
$$ 40412 18848 71109 98373 59534 76991 94837 84587 99112 113936 118689 206423 204395
12472B04395l2337M0139j922m6876m3776J012J0103K5874k7575l2117k6535P61
$$ 204395 172058 212197 210275 163399 119623 120635 130738 156612 129037 96920 70385 71146
12460G1146K436L2678P629k3157j4621M2585O8939O352J3836m6660P213J613K7529
$$ 71146 73582 106260 113889 90732 76111 118696 187635 193987 207823 161163 168376 169989 197518
12447A97518M8684p354j1133o780j878J2955j8802J1591O4742M4267n938M3953
$$ 197518 246202 238848 227715 220935 219057 232012 213210 224801 289543 333810 327872 371825
12435C71825j6886l1548k0566N737j9703l9520l0306o397m474j5643j614L8612
$$ 371825 354939 323391 302825 308562 288859 249339 219033 212636 208162 192519 190905 229517
12423B29517M7548j7599m7236k9606j3923j3354j195K6837p883k2002l5300l4116
$$ 229517 277065 259466 212230 182624 168701 155347 154152 180989 173106 151104 115804 81688
12411H1688K3255K3659L3928o285K5147l4550j2839k314p736K5565J0055J638
$$ 81688 104943 128602 162530 156245 181392 146842 134003 131689 123953 149518 159573 161211
12399A61211k0683L016J9090j0841m0783j9319R783k1996j304j0185l3036J3532
$$ 161211 140528 143544 162634 151793 111010 91691 101474 79478 78174 67989 34953 48485
12387D8485J19K4435j0079j4155J4803l578j1887J150j0469K146K4954J5761L065
$$ 48485 48604 73039 62960 48805 63608 60030 48143 49293 38824 40970 65924 81685 84750
12374H4750j5849l6470M458k1960j1377j9951M6651K6481j4886R59p056K9455
$$ 84750 68901 32431 36889 14929 3552 -16399 30252 56733 41847 42806 35750 65205
12362F5205K5491k0960k725J3662K953k259k3209p188k5230l6016m352M1633M1396
$$ 65205 90696 69736 67011 80673 83626 81367 58158 50970 25740 -10276 -14628 27005 68401
12349F8401K1459m438j7069j2856j4305J1582j3113o852J8036k1984k0842j1039
$$ 68401 89860 85422 68353 55497 41192 52774 39661 32809 50845 28861 8019 -3020
12337c020J3429j1495p235M735R451M0930r430j1269j582j9970j5081M5625R060
$$ -3020 10409 -1086 -8321 -3586 5865 46795 37365 26096 24514 4544 -10537 35088 44148
12324D4148l4686k1962j8443M2794O0953L1089k2931r257k8537j8866n444K0838
$$ 44148 9462 -12500 -30943 11851 72804 103893 80962 71705 43168 24302 18858 39696
12312C9696N170J1691j3954j5003j9532P283R799k0373l339J3610n084m9831n692
$$ 39696 44866 56557 42603 27600 8068 15351 25150 4777 1438 15048 9964 -39867 -45559
12299d5559K6630n418K213J3814j50n892K6904R992q61k2093J6246J8657l1593
$$ -45559 -18929 -24347 -22134 -8320 -8470 -14362 12542 22534 21673 -420 15826 34483 2890
12286B890k3227J1360Q450j5747l2440k2663K4189L7198L2165K122k2151N47J0510
$$ 2890 -20337 -8977 -527 -16274 -48714 -71377 -47188 -9990 22175 24297 2146 2693 13203
12273A3203l7187k2748j7285J9674L8343J3032l274j1494J7404j362M289J0726
$$ 13203 -23984 -46732 -64017 -44343 -6000 7032 3758 -7736 9668 8306 12595 23321
12261B3321o241j4069o426p158j5006k0904N2535J1856j5369R957k21l0424p800
$$ 23321 17080 3011 -3415 -10573 -25579 -46483 6052 17908 2539 12496 12275 -18149 -25949
12248b5949n614K0670L841j0852R236K5667Q226p576j0772o175o516O175K0998
$$ -25949 -31563 -10893 -7052 -17904 -8668 16999 25225 17649 6877 702 -5814 361 21359
12235B1359R32l0756J6357L0697m0417m9048k1611L457L6909J9021J0991O038
$$ 21359 22291 -8465 7892 38589 -1828 -50876 -72487 -69030 -32121 -13100 -2109 3929
12223C929o562J3570j7839j0532K7971R338L82n761j7933J9107q846l2191M1822
$$ 3929 -2633 10937 -6902 -17434 10537 19875 20257 14496 -3437 15670 6824 -25367 16455
12210A6455J1510N081L878K037R301K7603K7525j0302k6480m4787m2789k6253
$$ 16455 27965 33046 36924 38961 48262 75865 103390 93088 66608 21821 -20968 -47221
12198d7221J5965J3916k6673K1922L4214m3955j7522K9484J4325L4849K913p534
$$ -47221 -31256 -17340 -44013 -22091 12123 -31832 -49354 -19870 -5545 29304 32217 24683
12186B4683k5055J946j9484N199j239J3025J9934j6644m468j0908k7322m0671
$$ 24683 -372 1574 -17910 -12711 -13950 -925 19009 2365 -2103 -13011 -40333 -81004
12174h1004O3501K5395K8424j7989L542k1382l043J6728k3751Q34J3053j5891
$$ -81004 -17503 7892 36316 18327 21869 487 -2556 14172 -9579 -8745 4308 -11583
12162a1583j6423O2005K1506j659j530r895k4053M225K5966n347k7387j9832J9678
$$ -11583 -28006 33999 55505 53846 52316 42421 18368 22593 48559 43212 15825 -4007 15671
12149A5671k3222m666j5582Q64j7302l689O2764N3856k022k5542l5356q394j2873
$$ 15671 -7551 -12217 -27799 -26935 -44237 -47926 14838 68694 66672 41130 5774 -2620 -15493
12136a5493J9879j0847K0430M6915j7658j352j0041l0382m100Q572M2122p121
$$ -15493 4386 -6461 13969 60884 43226 41874 31833 1451 -2649 5923 48045 40924
12124D0924N700l0070l4971j2210L033L0574L466P498K6096k4404k6852K8636
$$ 40924 46624 16554 -18417 -30627 -27594 2980 6446 13944 40040 15636 -11216 17420
12112A7420k7324m2502N178J6130M4523J4142m3636n0684K8470L0770J2244j587
$$ 17420 -9904 -52406 -47228 -31098 13425 27567 -16069 -66753 -38283 -7513 4731 3144
12100C144L191k9352m2279o024j7617M9240N3892J4290l2212k0179J4406J1579
$$ 3144 6335 -23017 -65296 -71320 -88937 -39697 14195 28485 -3727 -23906 -9500 2079
12088B079k5582p925K4962K415K2555M635p48L2541J3168p527K1997k14k9404
$$ 2079 -23503 -31428 -6466 -4051 18504 23139 22391 54932 68100 60573 82570 82356 52952
12075E2952k7299l0203k3804L4148J7589k9039K1863O0946k6513l5779j0768n4503
$$ 52952 25653 -4550 -28354 5794 23383 -5656 16207 77153 50640 14861 4093 -50410
12063e0410k854L6877J4612K5019P859J1930Q800k9156M760K921P918R025J218
$$ -50410 -53264 -16387 -1775 23244 31103 43033 51833 22677 27437 30358 38276 47301 48519
12050D8519k8212l2655L0458J582l1386l5151J9043K822j1086P666Q624N871J2541
$$ 48519 20307 -12348 18110 19692 -11694 -46845 -27802 -24980 -36066 -28400 -19776 -13905 -1364
12037a364n832j8941k434L1928J2431r902K811k7785L638j1707J6960J6837L9056
$$ -1364 -7196 -26137 -28571 3357 15788 5886 8697 -19088 -15450 -27157 -10197 6640 45696
12024D5696P785m0962m7084k8366K8556K1590P136J9027N2219J8937o9679p334
$$ 45696 53481 12519 -34565 -62931 -34375 -12785 -5649 13378 65597 84534 14855 7521
12012G521L1987l7007n7335k2984L8382K0435L4671P652j5375j0566j0536J1979
$$ 7521 39508 2501 -54834 -77818 -39436 -19001 15670 23322 7947 -2619 -13155 -1176
12000a176J8538m2108l4682K1368K0060k5698j8683N5086o727P782M1371o61j5592
$$ -1176 17362 -24746 -59428 -38060 -18000 -43698 -62381 -7295 -14022 -6240 35131 34470 18878
11987A8878k9232J5728K485O023K9530J3058o083Q128k6613P240j4150l0074O576
$$ 18878 -10354 5374 7859 13882 43412 56470 50387 58515 31902 39142 24992 -5082 1494
11974A494j7542J0904K1609p84l8979m93J1393m034J61J4220k2348j5830J1387
$$ 1494 -16048 -5144 16465 15681 -23298 -23791 -12398 -16432 -16271 -2051 -24399 -40229 -28842
11961b8842J9435M582K5620k1233k2047r485M2059K7720J20J0372J4514J0453
$$ -28842 -9407 -4825 20795 -438 -22485 -31970 10089 37809 37929 48301 62815 73268
11949G3268l3794l5264J4J8929l6815j5275K0018P600J3775Q986K6979l1196k5408
$$ 73268 39474 4210 4224 23153 -13662 -28937 -8919 -1319 12456 21442 48421 17225 -8183
11936h183j5057J1676q22m544j7996o07J8924K811J8050q586Q087K4794K7620
$$ -8183 -23240 -11564 -12386 -16930 -34926 -35533 -16609 -13798 4252 -4334 3753 28547 56167
11923E6167j3051J3346j7281n4770J5067N0099L3576k4730n3050m5118p18L0080
$$ 56167 43116 56462 39181 -15589 -522 49577 83153 58423 5373 -39745 -40463 -10383
11911a0383o977l0584p066k19k7035J9743J1458L6007q507N941K2360m0728Q409
$$ -10383 -17360 -47944 -55010 -55229 -82264 -62521 -51063 -15056 -23563 -17622 4738 -35990 -27581
11898b7581K45M3482J8649k5873j6544l0381k3885j448K8799J7721m2288m6689
$$ -27581 -27336 16146 34795 8922 -7622 -38003 -61888 -63336 -34537 -16816 -59104 -105793
11886a05793J7143K5945M7789M5784j8507l8712J4444j1514L2275J3014m0840
$$ -105793 -88650 -62705 -14916 30868 12361 -26351 -11907 -23421 8854 21868 -18972
11875a8972K9570L0982p635K100j7616L6380J9143m1129m661J0071k0059j1060
$$ -18972 10598 41580 33945 36045 18429 54809 73952 32823 28162 38233 18174 7114
11863G114j4999K0728M833L507J1769k4708R935j4432L0670M1353q08k3659j7375
$$ 7114 -7885 12843 17676 21183 32952 8244 18179 3747 34417 75770 74962 51303 33928
11850C3928J8564j4339l1771J3017J4550J6890k9376P999j0144r086k1530m0248
$$ 33928 52492 38153 6382 19399 33949 50839 21463 29462 19318 10232 -11298 -51546
11838e1546Q39J835n491K1812N64J4933n67q255N96l207M8126P89j4087J9738
$$ -51546 -50707 -48872 -54363 -32551 -31987 -17054 -17621 -25876 -25280 -28487 19639 20428 6341 26079
11824B6079o978l7862L2563K6283J7468J9426K4729l7345j8526k5763M468O524
$$ 26079 19101 -18761 13802 40085 57553 76979 101708 64363 45837 20074 24542 31066
11812C1066l6946j5657K0683L5985J9676k3057k1726l4065p257j3195M1774j069
$$ 31066 -5880 -21537 -854 35131 54807 31750 10024 -24041 -31298 -44493 -2719 -3788
11800c788m423k1657j9330l2980K1569K8208L2774K219J6006j3544l0585P695
$$ -3788 -8211 -29868 -49198 -82178 -60609 -32401 373 2592 18598 5054 -25531 -17836
11788a7836j901r976n440j0837K6342M0246j0913m9152k3929P310N439K6069j7328
$$ -17836 -19737 -29713 -35153 -45990 -19648 20598 9685 -39467 -63396 -56086 -50647 -24578 -41906
11775d1906n159k059M1482K5554n0692k158L6740K0591j2162j6425j8301M597
$$ -41906 -47065 -49124 -7642 17912 -32780 -34938 1802 22393 10231 -6194 -24495 -19898
11763a9898L916J5304N245k2520j5033K8016J4142l4762j5367M0281M133j8138
$$ -19898 -15982 -678 4567 -17953 -32986 -4970 9172 -25590 -40957 -676 3457 -14681
11751a4681K1989J7451j2422m0018k8488K4170K9639R148Q223L6072J0191k6357
$$ -14681 7308 24759 12337 -27681 -56169 -31999 -2360 6788 15011 51083 61274 34917
11739C4917k3408P409K694k012K4769k0296R22O114K0100Q669k9489o1352k5204
$$ 34917 11509 18918 21612 19600 44369 24073 24995 31109 51209 59878 30389 -30963 -56167
11726e6167O901K1788J9801q16k2021K6297O6O603P604p779l255J580L2254p000
$$ -56167 -49266 -27478 -7677 -8493 -30514 -4217 -4151 2452 10056 2277 -978 602 32856 25856
11712B5856k4521J3962O343Q629j7690J2470k5033k7633Q135J4703m98k3982M101
$$ 25856 1335 15297 21640 30269 12579 25049 16 -27617 -19482 -4779 -5277 -29259 -25158
11699b5158J1784k1825l114K8821J2780J1752K5092m1809J9347l551j4422J5826
$$ -25158 -13374 -35199 -38313 -9492 3288 15040 40132 -1677 17670 14119 -303 15523
11687A5523K0966k8819l5758j8248K0166J6869P61n53K3859m231m1246K030K6087
$$ 15523 36489 7670 -28088 -46336 -26170 -9301 -8540 -9093 14766 10535 -30711 -28681 -2594
11674b594p327J1128j0175l029l404K881J9055K756L5380K3958J9520J892j1673
$$ -2594 -9921 1207 -8968 -11997 -15401 -12520 6535 9291 44671 68629 88149 90041 78368
11661G8368m0239j7953j7263N249j6388j5535L2835K0253p723n642j40l5149j0733
$$ 78368 38129 20176 2913 8162 -8226 -23761 9074 29327 21604 15962 15822 -19327 -30060
11648c0060J586K587J8064K7430K414k2493P95r176L6496J3465k6274k7620j6800
$$ -30060 -28474 -25887 -7823 19607 22021 -472 323 -8853 27643 41108 14834 -12786 -29586
11635b9586O601M712l1984j030K2958K2845j3187P118K7882k004m6028P058M4396
$$ -29586 -22985 -18273 -50257 -51287 -28329 -5484 -18671 -11553 16329 14325 -31703 -24645 19751
11622A9751K4762k2760l1676j4624n950l7017k0986M7574K4983J4133k3586m8174
$$ 19751 44513 21753 -9923 -24547 -30497 -67514 -88500 -40926 -15943 -1810 -25396 -73570
11610g3570r535J4591K1758q913k5882J0294K8956q092L1082L6253K2491l4546
$$ -73570 -83105 -68514 -46756 -55669 -81551 -71257 -42301 -50393 -19311 16942 39433 4887
11598D887l1816l1215J9528p643K6339J6661k1708j0089O089p378K1428J1604
$$ 4887 -26929 -58144 -38616 -46259 -19920 -3259 -24967 -35056 -28967 -36345 -14917 -3313
11586c313K652J6068K4841l6484Q212j1308l0886N306K6992j8630l0544m706J5061
$$ -3313 -661 15407 40248 3764 11976 668 -30218 -24912 2080 -16550 -47094 -51800 -36739
11573c6739N6439r854k1981o245o315j222L942m465J2428j7456j4534L1946N18
$$ -36739 19700 9846 -12135 -18380 -24695 -25917 -21975 -26440 -14012 -31468 -46002 -14056 -13538
11560a3538k3800j2506K8428k447k6515l9360K762M1860J1477M1732L015l137
$$ -13538 -37338 -49844 -21416 -23863 -50378 -89738 -86976 -45116 -33639 8093 11108 7971
11548G971k1718l9195J4802M8260k727k1837K5296L8594r194k3486j7460n7522
$$ 7971 -13747 -52942 -38140 10120 7393 -14444 10852 49446 40252 16766 -694 -58216
11536e8216n894J8216j1760J303k688L8176J6729k8397J7363j0687N872L1084
$$ -58216 -64110 -45894 -57654 -56351 -59039 -20863 -4134 -32531 -15168 -25855 -19983 11101
11524A1101K0457j6170r49r270r096l947j6230J1920J0162K824n123P91j2711
$$ 11101 31558 15388 14439 5169 -3927 -7874 -24104 -12184 -2022 802 -4321 -3530 -16241
11511a6241j3507K7349L658k3677m634J6402K0427N974Q082k1828K8200L4234
$$ -16241 -29748 -2399 1259 -22418 -27052 -10650 9777 15751 23833 2005 30205 64439
11499F4439R15k2945j9023M246Q591l1077o6371k1324R395K7761L748J9911J7595
$$ 64439 65354 42409 23386 27632 36223 5146 -61225 -82549 -73154 -45393 -41645 -21734 -4139
11486d139Q145j8158r403J926l8379M224K6354R12L466M863O450K4402k3041l745
$$ -4139 4006 -14152 -23555 -21629 -60008 -55784 -29430 -28518 -25052 -20189 -13739 10663 -12378 -16123
11472a6123L0157O912k2347l1403k7327M115L4484J7640k1585N831L1095k2839
$$ -16123 14034 20946 -1401 -32804 -60131 -56016 -21532 -3892 -25477 -19646 11449 -11390
11460a1390m8653l3453M5974K5563j0074j418R801N596K6012K4443J8915Q199
$$ -11390 -60043 -93496 -47522 -21959 -32033 -33451 -23650 -18054 7958 32401 51316 59515
11448E9515j575j3041m0945k6582J4195j3271l5112l877K4006M5180K1593K7295
$$ 59515 57940 44899 3954 -22628 -8433 -21704 -56816 -60693 -36687 8493 30086 57381
11436E7381j6115k8353p392L794L21n0988j1155K4230J9937K9054j1406M7640
$$ 57381 41266 12913 5521 9315 9636 -41352 -52507 -28277 -8340 20714 9308 56948
11424E6948K9087l4447l6229J1373L157j663n6993m4292J2747K6157n032L0537
$$ 56948 86035 51588 15359 26732 29889 28226 -28767 -73059 -60312 -34155 -39187 -8650
11412h650j3217j6888l7621m557J6078K2J233K0794L1196J8605J8556l1479k1588
$$ -8650 -21867 -38755 -76376 -80933 -64855 -64833 -63600 -42806 -11610 6995 25551 -5928 -27516
11399b7516K4881M0337J9206K3333K370k5853j855o2309n9009O005K3470l3779
$$ -27516 -2635 37702 56908 80241 82611 56758 54903 -7406 -66415 -60410 -36940 -70719
11387g0719N277K4758O152K7701L266O479J0283P091j0274J3028k2230k5077r968
$$ -70719 -65442 -40684 -34532 -6831 -3565 2914 13197 20288 10014 23042 812 -24265 -34233
11374c4233j5141k04J4903j0962j1295k136J9240L9216N7869k9772l1349j9773
$$ -34233 -49374 -49578 -34675 -45637 -56932 -59068 -39828 -612 57257 27485 -3864 -23637
11362b3637J4097M3392L3457k268m3783l0103n0577n1512K4377N5131K4635J2938
$$ -23637 -9540 33852 67309 65041 21258 -8845 -59422 -110934 -86557 -31426 -6791 6147
11350F147O816O109J5241r43l7310l4085J5657O158J0011r099J0899N846p161
$$ 6147 12963 19072 34313 33370 -3940 -38025 -22368 -16210 -6199 -15298 -4399 1447 -5714
11337e714J3793q915k8437k8578K2135R518k0802L1103J5183k0698j6362k3743
$$ -5714 8079 -836 -29273 -57851 -35716 -26198 -47000 -15897 -714 -21412 -37774 -61517
11325f1517R240j6755J2181K6380L463M7252L01p132R814k0595m4987j7177j1918
$$ -61517 -52277 -69032 -56851 -30471 -27008 20244 20545 13413 23227 2632 -42355 -59532 -71450
11312g1450N045M7525K3434j6893j6703j4829m57j4888K4362L5455J782K5315
$$ -71450 -66405 -18880 4554 -12339 -29042 -43871 -44328 -59216 -34854 601 2383 27698
11300B7698J0101m334j3827k9840K722M27M857k6370J4220j859K3402K4539p947
$$ 27698 37799 33465 19638 -10202 -7480 -7053 -2196 -28566 -14346 -16205 7197 31736 23789
11287B3789K1950O235j2313l7519P160l5997j4779Q3190K7202j7232k742J4675
$$ 23789 45739 51974 39661 2142 9302 -26695 -41474 41716 68918 51686 48944 63619
11275F3619l1909J30k7435j1431k6442J2871j0466P149j482j6285K6277M0606
$$ 63619 31710 31840 4405 -7026 -33468 -20597 -31063 -23914 -25396 -41681 -15404 25202
11263B5202m911J6449O268l7246k3273j5428J8043L1125o846J5640M9474K5135
$$ 25202 20291 36740 43008 5762 -17511 -32939 -14896 16229 9383 25023 74497 99632
11251I9632l3884k9126L3653j9417j6792k6368J2194J9991J3571J4887J9752j9630
$$ 99632 65748 36622 70275 50858 34066 7698 19892 39883 53454 68341 88093 68463
11239F8463R639R828j106l9060l0280L306J8134K9349J7986k0425n5115l3801
$$ 68463 78102 87930 86824 47764 17484 20790 38924 68273 86259 65834 10719 -23082
11227b3082L0028j9004k0637K8524l991K2559n451q454r877N39K7863p384k6614
$$ -23082 6946 -12058 -32695 -4171 -8162 14397 8946 492 -9385 -8846 19017 11633 -14981
11214a4981O739K4445k1250R015K4930J7535K4181m1083j1402p461K0636K355
$$ -14981 -8242 16203 -5047 3968 28898 46433 70614 29531 18129 10668 31304 33659
11202C3659J3854q205j9499O076L4781k8043o0974k0574J5134M2441l0225l0872
$$ 33659 47513 39308 19809 25885 60666 32623 -28351 -48925 -33791 8650 -21575 -52447
11190e2447J2021M6323O1802l730j0193k2759k491O3819K1233j9711k1721m2197
$$ -52447 -40426 5897 67699 63969 53776 31017 28526 92345 113578 93867 72146 29949
11178B9949o859J2399k6625J3918K5538k6519J0807j4322k0701j171J1462J6350
$$ 29949 23090 35489 8864 22782 48320 21801 32608 18286 -2415 -3586 7876 24226
11166B4226l8733l0717K3117L609J7186L4525j4187j3376j4965K560J9469L0558
$$ 24226 -14507 -45224 -22107 -18498 -1312 33213 19026 5650 -9315 -6755 12714 43272
11154D3272K9990j5378k9414n75j5106j9539p832J7430O470L3571k4573l462k0490
$$ 43272 73262 57884 28470 27895 12789 -6750 -14582 2848 9318 42889 18316 14854 -5636
11141e636j7706k3267N667K0711J5692j4333j2304K023j1701R166M1144J8378
$$ -5636 -23342 -46609 -40942 -20231 -4539 -18872 -31176 -29153 -40854 -31688 9456 27834
11129B7834n8619m0787L61K8586K1752M359L1106O071j2858R701k7491k843M7089
$$ 27834 -30785 -71572 -71211 -42625 -20873 -16514 14592 20663 7805 17506 -9985 -12828 34261
11116C4261J0803q414l5611l8992n729K855Q523j668J1867Q208M0658P0192Q3531
$$ 34261 45064 36650 1039 -37953 -43682 -40827 -32304 -33972 -22105 -13897 26761 96953 180484
11103A80484P8808Q4785O0905J5285q8647r1100o8968n6589m0563l8906J5025
$$ 180484 259292 344077 404982 420267 331620 240520 171552 114963 74400 35494 50519
11092E0519n728j6502J5040L014O820J6273M848l4735k92l059P617J614j1848
$$ 50519 44791 28289 43329 46343 53163 69436 74284 39549 39257 36198 43815 45429 33581
11079C3581j5719O563O7104K0921l9947q65j984m645P353K0503k1579p812q736
$$ 33581 17862 24425 91529 112450 72503 71638 69654 65009 72362 92865 71286 63474 54738
11066E4738k8293j5325k0855k5390m6594K1981O4192K4489J25m918k4412k3044
$$ 54738 26445 11120 -9735 -35125 -81719 -59738 4454 28943 29068 24150 -262 -23306
11054b3306j2097K1816n903l20j0722j4012q995k3943P603M1542L4468Q903O03
$$ -23306 -35403 -13587 -19490 -19810 -30532 -44544 -53539 -77482 -69879 -28337 6131 15034 15637
11041A5637j681L1835K8347j1291N707j3333m0767k1404K813O5114O383J5181
$$ 15637 13956 45791 74138 62847 68554 55221 14454 -6950 -4137 60977 67360 82541
11029H2541O022J3610K6603j6251L7884L517o9992n0671l0331R333K0865n002
$$ 82541 88563 102173 128776 112525 150409 153926 83934 33263 2932 12265 33130 28128
11017B8128O115j4504K923J8173k2929j9677j6792J1896O099J1535K9954L6301
$$ 28128 34243 19739 22662 40835 17906 -1771 -18563 -6667 -568 10967 40921 77222
11005G7222j2427o3979l0597P904K1450J4408k5181o52L3660m556j0171N46p957
$$ 77222 64795 816 -29781 -21877 -427 13981 -11200 -11852 21808 17252 7081 7627 -330
10992c30k3620R996M2903l3271n695L385M785j1437M937R670L0423r185q208j5924
$$ -330 -23950 -13954 28949 -4322 -10017 -6632 -1847 -13284 -8347 1323 31746 22561 14353 -1571
10978a571j4466K3133o658K4861J1263k4552j4941J7803l1793j1391J1694k600
$$ -1571 -16037 7096 438 25299 36562 12010 -2931 14872 -16921 -28312 -16618 -19218
10966a9218M2760R874p866l9974Q176R06R711K3723j1690j5565J1511j4373n235
$$ -19218 23542 33416 25550 -14424 -6248 -5342 4369 28092 16402 837 12348 -2025 -7260
10953g260P40J6882M037R267q898n359l6013m891j6436N34Q162J703L4529l203
$$ -7260 -6520 10362 14399 23666 14768 9409 -26604 -31495 -47931 -47397 -39235 -37532 -3003 -6206
10939f206k2189K2058q07K0339q050p646m727L8072K3106M24l7593l9400J0780
$$ -6206 -28395 -6337 -7144 13195 5145 -2501 -7228 30844 53950 54374 16781 -22619 -11839
10926a1839p04L7974p548j5605r673K0255K109r445k015q627J0508k7186l8345
$$ -11839 -12543 25431 17883 2278 -7395 12860 14969 5524 3509 -5118 5390 -21796 -60141
10913f0141M4910K2121j0238K9131Q045M516N661j9416m8556L1057M5482j2228
$$ -60141 -15231 6890 -3348 25783 33828 38344 44005 24589 -23967 7090 52572 40344
10901D0344m6477J3536j0882Q03K1769j9069J4397j692M384M6460J3795r744j3242
$$ 40344 -6133 7403 -3479 -2676 19093 24 14421 12729 17113 63573 77368 67624 54382
10888E4382m149j4829m5574k0434k8550K9908L1721l6011l3016j276L2305K2016
$$ 54382 50233 35404 -10170 -30604 -59154 -29246 2475 -33536 -66552 -67828 -35523 -13507
10876a3507Q496K9383L2499k2765j9707J1700K6306L5816j6418m6219k3719j0730
$$ -13507 -5011 24372 56871 34106 14399 26099 52405 88221 71803 25584 1865 -8865
10864h865K3242L3845j0549L1183J9302l5436k8641j319L222L6288J8437j3056
$$ -8865 14377 48222 37673 68856 88158 52722 24081 22762 25984 62272 80709 67653
10852F7653k9871m776K3211N778o994k6646n7159R54L5204k620j3569j6128K9103
$$ 67653 37782 33006 56217 61995 55001 28355 -28804 -27850 7354 4734 -8835 -24963 4140
10839D140n719o535L2030j4081m0918K7295j0710j7923L3747J5429K7104m754
$$ 4140 -1579 -8114 23916 9835 -31083 -3788 -14498 -32421 1326 16755 43859 39105
10827C9105j9526J420J5674M694n4240q586J7967k246J667K6410N2204M7373j1472
$$ 39105 19579 20999 36673 41367 -12873 -21459 -3492 -5738 -4071 22339 74543 121916 110444
10814A10444k3937p772R314j4268r480l1978Q832l4794O434j3947j6051m3915
$$ 110444 86507 78735 88049 73781 64301 32323 41155 6361 12795 -1152 -17203 -61118
10802f1118j1327j9264n229J9949L3626L2934L224j3033O81j113J8127r120l2166
$$ -61118 -72445 -91709 -96938 -76989 -43363 -10429 -7205 -20238 -19557 -20670 -2543 -11663 -43829
10789d3829O581K6800J7662r555O0963J1996m7130n3091p497L4386l2945l224
$$ -43829 -37248 -10448 7214 -2341 58622 70618 23488 -29603 -37100 -2714 -35659 -38883
10777c8883K4365k5071J4395K3260K2205M0816m880j5455q900k1735r780m0449
$$ -38883 -14518 -39589 -25194 -1934 20271 61087 56207 40752 31852 10117 337 -40112
10765d0112l5747J8209K4478Q557J5640k498J6002K1608R264j4543k5895L1027
$$ -40112 -75859 -57650 -33172 -24615 -8975 -11473 4529 26137 35401 20858 -5037 25990
10753B5990M7309R484r497j4487j8140k2751N679l369l276K3286L3834j2471j3181
$$ 25990 73299 82783 73286 58799 40659 17908 23587 20218 16942 40228 74062 61591 48410
10740D8410j3922J7009m4679k5238l5211l303J7994M9799J7960j4487k4361K4413
$$ 48410 34488 51497 6818 -18420 -53631 -56934 -38940 10859 28819 14332 -10029 14384
10728A4384J5098r035l0774J0658J608K1332k1291L8315N9113P8448J21888J36551
$$ 14384 29482 20447 -10327 331 1939 23271 1980 40295 99408 177856 299744 436295
10716D36295P2697l8194j21128q7985o3688p3303k0549l1386N659k0781K1926
$$ 436295 508992 470798 349670 261685 197997 124694 104145 72759 78418 57637 79563
10705G9563K1925R731j6491l6011L369K4952n4904q6603p043K2597K8706M5451
$$ 79563 101488 111219 94728 58717 62086 87038 32134 -54469 -61512 -38915 -10209 35242
10693C5242j4998K3184J0543J739j3970l230j7274J1266N3349R348q1952l8890
$$ 35242 20244 43428 53971 55710 41740 38510 21236 32502 85851 95199 13247 -25643
10681b5643L6908J7677L2930R149K630n9024l613k2868J4114R416M80j6942K1266
$$ -25643 11265 28942 61872 71021 73651 14627 11014 -11854 2260 11676 12156 -4786 16480
10668A6480K5558N956j3448N3657J1394l2670j5724j198P892m2067m8854R947
$$ 16480 42038 47994 34546 88203 99597 66927 51203 50005 57897 15830 -33024 -23077
10656b3077J7079J2668K0452j1303Q909J7812O991n517j4511l3762j8704K061
$$ -23077 -5998 6670 27122 15819 24728 42540 49531 44014 29503 -4259 -22963 -20902
10644b0902j0426Q501J3546L330P417m1807m138M0787l0814K1563N031j4799N738
$$ -20902 -31328 -22827 -9281 -5951 1466 -40341 -44479 -3692 -34506 -12943 -7912 -22711 -16973
10631a6973O6884J4471K5167j7863m7303J8968j3586m8753n485J1032N9267J0897
$$ -16973 49911 64382 89549 71686 24383 43351 29765 -18988 -24473 -13441 45826 56723
10619E6723j5227M2437m3412k0664P172j62j2380K0010L7189j0466m4238k4681
$$ 56723 41496 83933 40521 19857 27029 26867 14487 34497 71686 61220 16982 -7699
10607g699K3817N7563n721m3513j2069M3761N2742k975m5500l0939m977L679J3245
$$ -7699 16118 73681 67960 24447 12378 56139 108881 105906 60406 29467 24490 28169 41414
10594D1414n370M916J7622l5932R274J905j6667n025J0105j076K647n201j5580
$$ 41414 36044 40960 58582 22650 31924 33829 17162 12137 22242 21166 23813 18612 3032
10581C032M503j7930k5345L6301L8513J0545j8314q647m910l24R666K7013p947
$$ 3032 7535 -10395 -35740 561 39074 49619 31305 22658 17748 17424 27090 54103 46156
10568D6156j6977l54J4975L783j5922J5677M8349J5366k800m4682k5820K034m491
$$ 46156 29179 28825 43800 47583 31661 47338 95687 111053 108253 63571 37751 39785 35294
10555C5294M4270N285k17n2381j3063K0521M955P447p320k2193k3472J3157K3438
$$ 35294 79564 84849 84632 32251 19188 39709 44664 52111 44791 22598 -874 12283 35721
10542C5721n144j8729l0398J3124K6423J372L422k4260r63K7556O170J4160n224
$$ 35721 30577 11848 -18550 -5426 20997 22369 25791 1531 568 28124 34294 48454 43230
10529D3230J2397m266L3571M0995j6077l1440j6611q843J5961K1688j1958J0538
$$ 43230 55627 51361 84932 125927 109850 78410 61799 52956 68917 90605 78647 89185
10517H9185K9809L14j5242k1094r412l1379O586L4339L6912r24j2726J5249M1546
$$ 89185 118994 119308 104066 82972 73560 42181 48767 83106 120018 119094 106368 121617 163163
10504A63163j9008J436K8710m183k1832k5007m4301l2355L3723L91K3029K7287
$$ 163163 144155 145591 174301 170118 148286 123279 78978 46623 80346 80737 103766 131053
10492A31053N251r967l0001j0170J2751L2091J208j1285k6260K344L3308m389
$$ 131053 136304 126337 96336 86166 98917 131008 132216 120931 94671 97015 130323 125934
10480A25934J3608o448k4058k5591J8519j8561O980K7134k3979L3378K2311j5191
$$ 125934 139542 133094 109036 83445 101964 83403 90383 117517 93538 126916 149227 134036
10468A34036R593l1862k4073J2031P089m9360M2428M8210l0137k2141K5339K730
$$ 134036 143629 111767 87694 99725 106814 57454 99882 148092 117955 95814 121153 123883
10456A23883M9186J9715l4513k3392J5589M423j8070L4409l0929n2022K9373N3479
$$ 123883 173069 192784 158271 134879 150468 154891 136821 171230 140301 88279 117652 171131
10444A71131J0327l2195j807r744r48L2913k3641k7659J0052P054J944J4549M1343
$$ 171131 181458 149263 147456 137712 136764 169677 146036 118377 128429 135483 137427 151976 193319
10431A93319K2710o744J8778j8718k7315m314K28r8364l1092N4632N2080L1672
$$ 193319 216029 209285 228063 209345 182030 177716 177944 79580 48488 103120 155200 186872
10419A86872K1861j7063j7706J9668K7579r850k5259k77J218j6473l6248n298
$$ 186872 208733 191670 173964 193632 221211 211361 186102 185825 187043 170570 134322 129024
10407A29024K6457K9319L4619O522R461k2537k6848J5600J6519k3523j1388r69
$$ 129024 155481 184800 219419 225941 235402 212865 186017 201617 218136 194613 183225 182256
10395A82256l900K2790K2793J0944j9451l8167K9352L9516j2876O154R801L8639
$$ 182256 178356 201146 223939 234883 215432 177265 206617 246133 233257 239411 249212 287851
10383B87851Q940r321k810r863o73j1079J3625L8340K9171J1487J483M6534M4986
$$ 287851 296791 287470 284660 274797 274124 263045 276670 315010 344181 355668 357151 403685 448671
10370D48671Q443k803k69J7115l1393K7097N1676K8295L8163J08953K11038K79928
$$ 448671 457114 454311 454042 471157 439764 466861 518537 546832 584995 693948 904986 1184914
10358A184914L64277L37059K63394J58250M8584m0008j09733j87936k43072k11076
$$ 1184914 1549191 1886250 2149644 2307894 2356478 2316470 2206737 2018801 1775729 1564653
10348A564653j75928j59505j06694q0569n3753j1976l8285m8991q80j0893o4397
$$ 1564653 1388725 1229220 1122526 1041957 988204 976228 937943 888952 888072 877179 812782
10337H12782j9051K3872J2269k0843k5241J0002J3280J4055J1863K1092j3433
$$ 812782 793731 817603 829872 809029 783788 793790 807070 821125 832988 854080 840647
10326H40647L701K3155J4681N044p893K167Q655J6080J6834K9264K1304N127l463
$$ 840647 844348 867503 882184 887228 879335 881502 890157 906237 923071 952335 973639 978766 975303
10313I75303N4109M8701J4357J140L3752L9543q247M1252K4145K1570J56J9497
$$ 975303 1029412 1078113 1092470 1093610 1127362 1166905 1158658 1199910 1224055 1245625 1245781 1265278
10301A265278j4284N3187L2983M1340O9225P5734k499J7257P4041N1113K9434
$$ 1265278 1250994 1304181 1337164 1378504 1447729 1523463 1520964 1538221 1612262 1663375 1692809
10290A692809N7306M2468M9552M6171L6221M4391R4432O6508P3905J09795J09681
$$ 1692809 1750115 1792583 1842135 1888306 1924527 1968918 2063350 2129858 2203763 2313558 2423239
10279B423239M6125N5063P4315O4081O5388J63748J30775J09664J11455P8074
$$ 2423239 2469364 2524427 2598742 2662823 2728211 2891959 3022734 3132398 3243853 3321927
10269C321927J10662J23655J21254J36773J14005J53381J56562J62678J79060
$$ 3321927 3432589 3556244 3677498 3814271 3928276 4081657 4238219 4400897 4579957
10260D579957K01983K33192K13082J53172J63895J64701K13018K66450K72461
$$ 4579957 4781940 5015132 5228214 5381386 5545281 5709982 5923000 6189450 6461911
10251F461911K25620K29958K80426K93805K75522L34294L15897K85110K89211
$$ 6461911 6687531 6917489 7197915 7491720 7767242 8101536 8417433 8702543 8991754
10242H991754K93516L33109L41989L30904L69200L81387M23877L88563L87422
$$ 8991754 9285270 9618379 9960368 10291272 10660472 11041859 11465736 11854299 12241721
10233A2241721M41548M76725M47984M61451N23644N02162M47174M42852M94226
$$ 12241721 12683269 13159994 13607978 14069429 14593073 15095235 15542409 15985261 16479487
10224A6479487M73288M98392M91006M94126M80814N28363N57124N96207N59461
$$ 16479487 16952775 17451167 17942173 18436299 18917113 19445476 20002600 20598807 21158268
10215B1158268N32259N49679N25205N04402N11295M53808L97977L81596L18098
$$ 21158268 21690527 22240206 22765411 23269813 23781108 24234916 24632893 25014489 25332587
10206B5332587L30922K68412J72329J66793J51884J11763L1962j3313p8527j65490
$$ 25332587 25663509 25931921 26104250 26271043 26422927 26534690 26566652 26553339 26474812 26309322
10196B6309322j56888j84273k33766k75695l07034k96066k83494l36134l44663
$$ 26309322 26152434 25968161 25734395 25458700 25151666 24855600 24572106 24235972 23891309
10187B3891309l86625m18160m08585m11409l77873m14960m07611m04622m24826
$$ 23891309 23504684 23086524 22677939 22266530 21888657 21473697 21066086 20661464 20236638
10178B0236638m19483m12163l80525l74876m34456m38978m26150m23165m03521
$$ 20236638 19817155 19404992 19024467 18649591 18215135 17776157 17350007 16926842 16523321
10169A6523321m19602l95269m19106l80682l54877l28317l74934l51138l53446
$$ 16523321 16103719 15708450 15289344 14908662 14553785 14225468 13850534 13499396 13145950
10160A3145950l84012l39679l34665l14484l12497l10381l08594l06410k65080
$$ 13145950 12761938 12422259 12087594 11773110 11460613 11150232 10841638 10535228 10270148
10151A0270148k48934k98726k58842k21597k63481k65880k41470k53858k20281
$$ 10270148 10021214 9722488 9463646 9242049 8978568 8712688 8471218 8217360 7997079
10142G997079j46725j59884j99762k03193j84785j79186j96729j67447j53977
$$ 7997079 7850354 7690470 7490708 7287515 7102730 6923544 6726815 6559368 6405391
10133F405391j54232j56673j61185j61197j42617j27812j14350j11634j25587
$$ 6405391 6251159 6094486 5933301 5772104 5629487 5501675 5387325 5275691 5150104
10124E150104j06511j25152r2991j13347j24999r6833q2042j18789j09856n1449
$$ 5150104 5043593 4918441 4825450 4712103 4587104 4490271 4408229 4289440 4179584 4128135
10114D128135o3468j20945j17761j05016n7387o2601n2330n2436o6062j11413
$$ 4128135 4064667 3943722 3825961 3720945 3663558 3600957 3548627 3496191 3430129 3318716
10104C318716r8599n2980k6285p5099p8491l5843n1413o9268j5510l6877k7950
$$ 3318716 3220117 3167137 3140852 3065753 2987262 2951419 2900006 2830738 2815228 2778351 2750401
10093B750401o0199p3599l9290n4943j7275q2701m5184m3427l3340l6937q0056
$$ 2750401 2690202 2616603 2577313 2522370 2505095 2422394 2377210 2333783 2300443 2263506 2183450
10082B183450p2142l7952Q621j5956o3924l1629M040N679k1001k7092m1725k4700
$$ 2183450 2111308 2073356 2081977 2066021 2002097 1970468 1974508 1980187 1959186 1932094 1890369 1865669
10070A865669n4729o0769j344R14P211l4399k5724r986l705L4520N7570Q8274
$$ 1865669 1810940 1750171 1748827 1749741 1756952 1722553 1696829 1686843 1683138 1717658 1775228 1863502
10058A863502J87669L61848O73336J070407J056880N33545o20202j341366q66485
$$ 1863502 2051171 2413019 3086355 4156762 5213642 5747187 5126985 3785619 2919134
10049B919134n30096l02782j69989j33722j07745j01452p7000j7125o2016n0539
$$ 2919134 2389038 2086256 1916267 1782545 1674800 1573348 1496348 1479223 1417207 1366668
10039A366668N458j3211l4962n3529j7557J5255P026m0970n3306k8630k1355k4078
$$ 1366668 1372126 1358915 1323953 1270424 1252867 1268122 1275148 1234178 1180872 1152242 1130887 1106809
10027A106809n2655j9085K1004j5687P983Q7l8171m2210l3514K0656Q906n4587
$$ 1106809 1054154 1035069 1056073 1040386 1048369 1048456 1010285 968075 934561 955217 964123 909536
10015I09536l0548L6145j4865K082l4017n1802m7403p985k1669r031O148p236
$$ 909536 878988 915133 900268 902350 868333 816531 769128 761143 739474 730443 736591 729355
10003G29355P25J7044k04J792O650j1082k0495k0121k3326r283l0923j3388J1812
$$ 729355 730080 747124 746920 748712 755362 744280 723785 703664 680338 671055 640132 626744 638556
9990F38556l9232n384L1183J0303r774j85p766j2177j22L9752Q567m3877n6085
$$ 638556 599324 593940 625123 635426 625652 625467 617701 605524 605402 645154 653721 609844 553759
9977E53759J4231J9830n862k6323j6522J792M669J7687l3895n0019O73O817O81
$$ 553759 567990 587820 581958 555635 539113 540905 545574 563261 529366 479347 480020 486837 487518
9964D87518m5972k5039J8284J2360J9578j329K7264L7948r79m5698Q459J4893
$$ 487518 441546 416507 434791 447151 466729 465400 492664 530612 529633 483935 492394 507287
9952E07287L7324j5263k5033j1233l6083l2508k8307j2657K6439O418K4171m0036
$$ 507287 544611 529348 504315 493082 456999 424491 396184 383527 409966 416384 440555 400519
9940D00519j3730R541L5640j878j3735q674j3691m0682p401K4775L854J4208N520
$$ 400519 386789 396330 431970 430092 416357 407683 393992 353310 345909 370684 374538 388746 394266
9927C94266J2535l1904n18Q867j0966J7428L1512o0314k4589K825J6403J0383
$$ 394266 406801 374897 374379 383246 372280 389708 421220 360906 336317 339142 355545 365928
9915C65928M929r98j4266k2075M252j1058J7915k0799J522R055O302m6184K4399
$$ 365928 370857 369859 355593 333518 337770 326712 344627 323828 325350 334405 340707 294523 318922
9902C18922J9786J0905K3330j0826k2047J7892J1151j2308R085J0992n340J375
$$ 318922 338708 349613 372943 362117 340070 357962 369113 356805 365890 376882 371542 372917
9890C72917k0469l993j0891j9721j4019j982j2379l3687m7640P0098N2006m0352
$$ 372917 352448 348455 337564 317843 303824 301842 289463 255776 208136 278234 330240 289888
9878B89888l1452K3617L4370j6891Q03o120k3299m0662K911J1288K9301K3617
$$ 289888 258436 282053 316423 299532 300335 294215 270916 230254 233165 244453 273754 297371
9866B97371L1570j439n3136m9004K794m135K7202L6686N298K3989k3379j3819
$$ 297371 328941 327502 274366 225362 228156 224021 251223 287909 293207 317196 293817 279998
9854B79998j9961J5722p365l450K1073q261j505k3019K462J4133K795j9455K7510
$$ 279998 260037 275759 268394 264944 286017 277756 276251 253232 255694 269827 272622 253167 280677
9841B80677k2040n4645P85K6655k6685m561J3291R395L4315R332n496j7019l371
$$ 280677 258637 203992 204777 231432 204747 200186 213477 222872 257187 266519 261023 244004 240633
9828B40633m004J91N093p950Q706J4409J6553l1627j2386J5553j0251L4287P640
$$ 240633 236629 236820 241913 233963 242669 257078 273631 242004 229618 245171 234920 269207 276847
9815B76847m1273l6268Q193L4490j4547j8053J4399J5195J1448l9799j661p55
$$ 276847 235574 199306 207499 241989 227442 209389 223788 238983 250431 210632 208971 208216
9803B08216r832J0124J7281J5719k0744K0572k0707Q73l1767p227k5867k913K7146
$$ 208216 198384 208508 225789 241508 220764 241336 220629 221502 189735 182508 156641 153728 180874
9790A80874m099j4319J9813O550m6492l4302L2249N5860K0955J2402Q975K3105
$$ 180874 176775 162456 182269 188819 142327 108025 140274 196134 217089 229491 238466 261571
9778B61571l5558m6743L36L6673l943J0279R684l3536M874J0583j5865j527k8959
$$ 261571 226013 179270 179606 216279 212336 222615 232299 198763 203637 214220 198355 196828 167869
9765A67869k1307J1660K5249m563l445k8930j4477M99J2257j1672J867M1747J6059
$$ 167869 146562 158222 183471 178908 175463 146533 132056 132555 144812 133140 135007 176754 192813
9752A92813k2602p536n0817L7053K4680P836l8424j8437J5001M736L0568P096
$$ 192813 170211 162675 111858 148911 173591 181427 143003 124566 139567 144303 174871 181967
9740A81967q507J8136j82K7906r213n3174R397K5940j5824k7688o35l157n409
$$ 181967 173460 191596 191414 219320 210107 156933 166330 192270 176446 148758 148123 144966 139557
9727A39557k6007L4233J6005n153l0216n778j1116M1161K4311M987j8405K760
$$ 139557 113550 147783 163788 158635 128419 122641 111525 152686 176997 181984 163579 166339
9715A66339k260J1605J3240r201P194K665K0529K1026L4647o6123l6776R021l5187
$$ 166339 164079 175684 188924 179723 186917 189582 210111 231137 265784 199661 162885 171906 136719
9702A36719J8540J9315N0256J8208m5369k6139L7207L4164k8675J4400m976l9570
$$ 136719 155259 174574 224830 243038 197669 171530 208737 242901 214226 228626 223650 184080
9690A84080j3916n1434J4797K0670J545r141O577L0773R447l0300m4297K3702
$$ 184080 170164 118730 133527 154197 155742 146601 153178 183951 193398 163098 118801 142503
9678A42503K3480k229q725k968j8303R684N4745k5460l2540M1375o342p914Q6
$$ 142503 165983 163754 155029 152061 133758 143442 198187 172727 140187 181562 175220 167306 167392
9665A67392j264k7151m16M7706L7314q492m100m118k1447l609J0678K078j8287
$$ 167392 166128 138977 138561 186267 223581 215089 210989 206871 185424 181815 192493 194571 176284
9652A76284K99k3814J4204J1751k5935n894k1292P0L8756J886N030J9498J5034
$$ 176284 176583 152769 166973 178724 152789 146895 125603 125673 164429 166315 171345 190843 205877
9639B05877N166K921j9356m1452l22l1922l3191k3249P255K7681N3753N1497Q034
$$ 205877 211043 213964 194608 153156 152834 120912 87721 64472 71727 99408 153161 204658 212692
9626B12692n4171j2534r611O742J0691l5745k4409J0359k5945l9768M1082J4789
$$ 212692 158521 145987 136376 143118 153809 118064 93655 104014 78069 38301 79383 94172
9614I4172K8236J0996J3576M5228M5264N013k6592j4980J8946J1785k1204k5896
$$ 94172 122408 133404 146980 192208 237472 242485 215893 200913 219859 231644 210440 184544
9602A84544j5856K0770n2539j1892J9439J4657J4526J2631N942J9583M3317J6527
$$ 184544 168688 189458 136919 125027 144466 159123 173649 186280 192222 211805 255122 271649
9590B71649j5085m3567Q313k079l166k2667j9433L014l3230K000J7877Q479m3619
$$ 271649 256564 212997 221310 219231 216065 193398 173965 176979 143749 145749 163626 172105 128486
9577A28486M6926L5958L0236J3072P444j066j7351O10J7749m965k2262J6313O354
$$ 128486 175412 211370 241606 254678 262122 261056 243705 244315 262064 257099 234837 251150 257504
9564B57504k1443l7917l7051p135L7059M8513N6638k6308k3351L229n806J3235
$$ 257504 236061 198144 161093 153958 191017 239530 296168 269860 246509 249738 243932 257167
9552B57167N4903N2410L0440K0711J9239o3080m2860L284n188l8801k0052k0889
$$ 257167 312070 364480 394920 415631 434870 371790 328930 332214 327026 288225 268173 247284
9540B47284K3615J1159J2500n065o170j0157l4610j884K0481j8243J5060K5581
$$ 247284 270899 282058 294558 289493 283323 273166 238556 236672 257153 238910 253970 279551
9528B79551k9899j7361m966J8807K663K4883j0446j5540K9151j4549k5784O973
$$ 279551 249652 232291 227325 246132 248795 273678 263232 247692 276843 262294 236510 243483
9516B43483J1229K6758N273k1772O714R010O747L3602k4583K3647J236k9255m6136
$$ 243483 254712 281470 286743 264971 271685 280695 287442 321044 296461 320108 321344 292089 245953
9503B45953k1292j7057K3081N1746J8333j1822q485k7146j4015j2742L1260J1047
$$ 245953 224661 207604 230685 282431 300764 288942 280457 253311 239296 226554 257814 268861
9491B68861k0582J1680N316n303J5550l0458l1188k0552K5714J6781K4271j827
$$ 268861 248279 259959 265275 259972 275522 245064 213876 193324 219038 235819 260090 258263
9479B58263k5288n384K0147J4788m3285p617j3767J3001J2214R695q851p6321
$$ 258263 232975 227591 247738 262526 219241 211624 197857 210858 223072 232767 223916 147595
9467A47595n683m042K0671J0418N189K8858K6653M733j1307J8680R829K242n8
$$ 147595 141912 137870 158541 168959 174148 203006 229659 234392 223085 241765 251594 253836 253778
9454B53778J4629p382l303J0813l0013n965K311J1506k5730J419N27o28K5229
$$ 253778 268407 261025 257722 268535 238522 232557 234868 246374 220644 222063 222590 221962 247191
9441B47191J441j2409J1640J3932j6270M918k183J1002K8340k2117m9479k2610
$$ 247191 248632 236223 247863 261795 245525 250443 248260 259262 287602 265485 216006 193396
9429A93396M3942J6635k6176m4252L4502K1616J2394k941n0167k3372n392j8954
$$ 193396 237338 253973 227797 183545 218047 239663 252057 249116 198949 175577 170185 151231
9417A51231J2626j2968M5383L6712J1874J5891J6726n500k0260q52k3301O278
$$ 151231 163857 150889 196272 232984 244858 260749 277475 271975 251715 250863 227562 233840
9405B33840k2009J7955J3455k7313M139L7755L5985n228m270M0135l3915j2228
$$ 233840 211831 229786 243241 215928 220067 257822 293807 288579 284309 324444 290529 278301
9393B78301J5773l725L4231j9949l4214j1731L4234L0250j365J0868K1951l9490
$$ 278301 294074 290349 324580 304631 270417 258686 292920 323170 321805 332673 354624 315134
9381C15134l1452m481K087Q560K9070R64m762j2644j1899K8811J2882m2618l9765
$$ 315134 283682 279201 281288 289848 318918 319882 315120 302476 290577 319388 332270 289652 249887
9368B49887J5249L9261Q378l740k0933k0854J102o07p571L9871N1068K3822j3810
$$ 249887 265136 304397 312775 309035 288102 267248 268350 267743 260172 300043 351111 374933 361123
9355C61123J3695M4303j8892m0250l3764p299K4146J8679j8670R360j5784n800
$$ 361123 374818 419121 400229 359979 326215 318916 343062 361741 343071 352431 336647 330847
9343C30847j9440r281J0534J3416Q6k472o970L1871M3338j1022K871m902j5649
$$ 330847 311407 302126 312660 326076 326162 323690 316720 348591 391929 380907 383778 378876 363227
9330C63227J5862L868J6425r720j3806l3585K8765L0428L8428j5477k1214J4645
$$ 363227 379089 382957 399382 389662 375856 342271 371036 401464 439892 424415 403201 417846
9318D17846K7492J1179J7184P661K6948K490m3596J3617O797M3783K413j1431
$$ 417846 445338 456517 473701 481362 508310 510800 467204 480821 487618 531401 533814 522383
9306E22383Q989P070K4272K1872J3076L2527J4747J4094L2870L3308k144k5527
$$ 522383 531372 538442 562714 584586 597662 630189 644936 659030 691900 725208 723064 697537
9294F97537n882l661l348J727k3796q52R947K9003M342J8265K1704M8238N5869
$$ 697537 691655 687994 684646 686373 662577 661725 671672 700675 705017 723282 744986 793224 849093
9281H49093J1575j8587O642m486L145L0345M4691l3884L814K2284j9079k2384
$$ 849093 860668 842081 848723 844237 847382 877727 922418 888534 892348 914632 895553 873169
9269H73169p367Q467Q171M2864K5784P0646J09443J22556R7413k974n8141m8064
$$ 873169 865802 874269 882440 925304 951088 1021734 1131177 1253733 1351146 1348172 1290031 1241967
9257A241967o9627m2493j7231m750L2356J5965P721R195L0362K404M5906K9841
$$ 1241967 1172340 1129847 1112616 1107866 1140222 1156187 1163908 1173103 1203465 1205869 1251775 1281616
9245A281616K2865K9221J0912J1884L6566M3646L748K3700K8271R387l0774j2115
$$ 1281616 1304481 1333702 1344614 1356498 1393064 1436710 1440458 1464158 1492429 1501816 1471042 1458927
9233A458927M183J0497K6769L7998O6761K3614K5340J3793L6488K3128K2198L4225
$$ 1458927 1463110 1473607 1500376 1538374 1605135 1628749 1654089 1667882 1704370 1727498 1749696 1783921
9221A783921j8308p533J8506K5492K1960K8725K5062J0279N0468J8433n809K7915
$$ 1783921 1765613 1758080 1776586 1802078 1824038 1852763 1877825 1888104 1938572 1957005 1951196 1979111
9209A979111J3791O025J984N1061P9063O600M0714L9305J2478P57k903o95M8299
$$ 1979111 1992902 1998927 2000911 2051972 2131035 2137635 2178349 2217654 2230132 2230889 2227986 2227291 2275590
9196B275590L7760l818j1408K2103K8766L9251N7974J5040j7191L7445j4337j8374
$$ 2275590 2313350 2309532 2298124 2320227 2348993 2388244 2446218 2461258 2444067 2481512 2467175 2448801
9184B448801j8031o296l215j6767J1831M6744j252K960j7865q544K2948j2809
$$ 2448801 2430770 2424474 2421259 2404492 2416323 2463067 2461815 2464775 2446910 2438366 2461314 2448505
9172B448505o9686r415k8390o9401l3953p020L1712M843m9384n2625K5749J2924
$$ 2448505 2378819 2369404 2341014 2271613 2237660 2230640 2262352 2267195 2217811 2165186 2190935 2203859
9160B203859k9618K373j8063l7574j5793m583n4832n5692j6510m4642k9532k7570
$$ 2203859 2174241 2176614 2158551 2120977 2105184 2100601 2045769 1990077 1973567 1928925 1899393 1871823
9148A871823L149K594j2077n405m970q433o1185n5582l6601k8624m7350k1887
$$ 1871823 1874972 1877566 1865489 1860084 1855114 1846681 1785496 1729914 1693313 1664689 1617339 1595452
9136A595452j8768n2115l5076K029j6631n0743j09653j5418L2718M510O602K4898
$$ 1595452 1576684 1524569 1489493 1491522 1474891 1424148 1314495 1299077 1331795 1336305 1342907 1367805
9124A367805l0250n8349o1498l1715j5167r534Q161m569n455J861k7072o994j4785
$$ 1367805 1337555 1279206 1217708 1185993 1170826 1161292 1169453 1164884 1159429 1161290 1134218 1127224 1112439
9111A112439O337p086j7512k9651p703q562Q33m1730n1241n2532J7029K4151l380
$$ 1112439 1118776 1111690 1094178 1064527 1056824 1048262 1049095 1007365 956124 903592 920621 944772 941392
9098I41392k8989k4351k9117m5067k3642l7552M545J6770J7341j4179j7253p055
$$ 941392 912403 888052 858935 813868 790226 752674 757219 773989 791330 777151 759898 752843
$$ [...]
##END NTUPLES=NMR SPECTRUM
##END=
