##TITLE=Analysis number 321250
Compound Code cc 60309
Book Reference 470/69
Project Code adrs
Chemist Name mikem
##JCAMPDX= 6.0         $$ Bruker NMR JCAMP-DX V2.0
##DATA TYPE= NMR SPECTRUM
##DATA CLASS= NTUPLES
##ORIGIN= Bruker BioSpin GmbH
##OWNER= nmr
$$ XWIN-NMR		Version 3.5
$$ Tue Aug  1 10:31:44 2006 GMT Daylight Time (UT+1h)  MAYBRIDGE\nmr@NMR_250MHZ
##.OBSERVE FREQUENCY= 250.131544655141
##.OBSERVE NUCLEUS= ^1H
##.ACQUISITION MODE= SIMULTANEOUS (DQD)
##.ACQUISITION SCHEME= undefined
##.AVERAGES= 16
##.DIGITISER RES= 18
##SPECTROMETER/DATA SYSTEM= dpx250
##.PULSE SEQUENCE= zg30
##.SOLVENT NAME= CDCl3
##.SHIFT REFERENCE= (INTERNAL, CDCl3, 0, 16.4516)
##AUDIT TRAIL= $$ (NUMBER, WHEN, WHO, WHERE, WHAT)
$$ ##TITLE= Audit trail, XWIN-NMR		Version 3.5
$$ ##JCAMPDX= 5.01
$$ ##ORIGIN= Bruker BioSpin GmbH
$$ ##OWNER= nmr
$$ C:\u/data/dgb/nmr/ADRS/3920/pdata/1/auditp.txt
$$ ##AUDIT TRAIL=  $$ (NUMBER, WHEN, WHO, WHERE, WHAT)
(   1,<2006-08-01 10:31:22.84 +100>,<MAYBRIDGE\nmr>,<NMR_250MHZ>,
      <created by zg, POWCHK disabled, PULCHK disabled
       configuration hash MD5:
       E2 DF 36 D8 04 B2 41 60 5A D7 A3 38 5A 4B D0 FE
       data hash MD5: 64K
       30 5E 2C 8C C5 5C 65 E8 FA CF 53 D1 0D 31 64 06>)
(   2,<2006-08-01 10:31:35.45 +100>,<MAYBRIDGE\nmr>,<NMR_250MHZ>,
      <Start of raw data processing
       ef LB = 0.3 FT_mod = 6 PKNL = 1 SI = 32K 
       data hash MD5: 32K
       02 C9 EB 0F 9C A3 CF 4F E4 04 50 6B 8E E5 D0 85>)
(   3,<2006-08-01 10:31:37.14 +100>,<MAYBRIDGE\nmr>,<NMR_250MHZ>,
      <apk 
       data hash MD5: 32K
       12 03 C4 01 AB 66 78 C8 E1 1E 47 99 F8 B3 88 55>)
(   4,<2006-08-01 10:31:37.90 +100>,<MAYBRIDGE\nmr>,<NMR_250MHZ>,
      <abs ABSG = 5 
       data hash MD5: 32K
       3B B3 93 43 15 10 F4 AD E7 4B FA F3 7C 5D AC 49>)
$$ ##END=
$$ 
$$ hash MD5
$$ 46 4B C7 93 3F F3 F7 03 56 6D 0B 15 49 F1 88 05
##$RELAX= 
##$RELAX= 
##$RELAX= 
##$RELAX= 
##$RELAX= 
##$RELAX= 
##$RELAX= 
$$ Bruker specific parameters
$$ --------------------------
##$DU= <C:\u>
##$EXPNO= 3920
##$NAME= <ADRS>
##$PROCNO= 1
##$TYPE= <nmr>
##$USER= <dgb>
##$AMP= (0..31)
100 100 100 100 100 100 100 100 100 100 100 100 100 100 100 100 100 100 
100 100 100 100 100 100 100 100 100 100 100 100 100 100 
##$AQSEQ= 0
##$AQ_mod= 3
##$AUNM= <au_zg>
##$AUTOPOS= <27 >
##$BF1= 250.13
##$BF2= 250.13
##$BF3= 250.13
##$BF4= 250.13
##$BF5= 500.13
##$BF6= 500.13
##$BF7= 500.13
##$BF8= 500.13
##$BYTORDA= 1
##$CFDGTYP= 0
##$CFRGTYP= 5
##$CHEMSTR= <none>
##$CNST= (0..31)
1 1 145 1 1 1 1 1 1 1 1 1 1 1 1 1 1 1 1 1 1 1 1 1 1 1 1 1 1 1 1 1 
##$CPDPRG= <>
##$CPDPRG1= <>
##$CPDPRG2= <>
##$CPDPRG3= <>
##$CPDPRG4= <mlev>
##$CPDPRG5= <mlev>
##$CPDPRG6= <mlev>
##$CPDPRG7= <mlev>
##$CPDPRG8= <mlev>
##$CPDPRGB= <>
##$CPDPRGT= <>
##$D= (0..31)
0 1 0 0 0 0 0 0 0 0.06 0 0 0 0 0 0 0.0002 0 0 0 0 0 0 0 0 0 0 0 0 0 0 
0 
##$DATE= 1154424681
##$DBL= (0..7)
120 120 120 120 120 120 120 120 
##$DBP= (0..7)
150 150 150 150 150 150 150 150 
##$DBP07= 0
##$DBPNAM0= <>
##$DBPNAM1= <>
$$ [...]
##$SUBNAM7= <"">
##$SUBNAM8= <"">
##$SUBNAM9= <"">
##$SW= 20.6930455092707
##$SWIBOX= (0..15)
0 0 3 0 0 0 0 0 0 0 0 0 0 0 0 0 
##$SW_h= 5175.983436853
##$TD= 65536
##$TD0= 1
##$TE= 295.16
##$TE2= 300
##$TE3= 300
##$TEG= 300
##$TL= (0..7)
0 120 120 120 120 120 120 120 
##$TP= (0..7)
150 150 150 150 150 150 150 150 
##$TP07= 0
##$TPNAME0= <>
##$TPNAME1= <>
##$TPNAME2= <>
##$TPNAME3= <>
##$TPNAME4= <>
##$TPNAME5= <>
##$TPNAME6= <>
##$TPNAME7= <>
##$TPOAL= (0..7)
0.5 0.5 0.5 0.5 0.5 0.5 0.5 0.5 
##$TPOFFS= (0..7)
0 0 0 0 0 0 0 0 
##$TUNHIN= 0
##$TUNHOUT= 0
##$TUNXOUT= 0
##$USERA1= <user>
##$USERA2= <user>
##$USERA3= <user>
##$USERA4= <user>
##$USERA5= <user>
##$V9= 5
##$VALIST= <valist>
##$VCLIST= <CCCCCCCCCCCCCCC>
##$VD= 0
##$VDLIST= <DDDDDDDDDDDDDDD>
##$VPLIST= <PPPPPPPPPPPPPPP>
##$VTLIST= <TTTTTTTTTTTTTTT>
##$WBST= 1024
##$WBSW= 4
##$XGAIN= (0..3)
0 0 0 0 
##$XL= 0
##$YL= 0
##$YMAX_a= 376744
##$YMIN_a= -487796
##$ZGOPTNS= <>
##$ZL1= 120
##$ZL2= 120
##$ZL3= 120
##$ZL4= 120
##$ABSF1= 16.45163
##$ABSF2= -4.241543
##$ABSG= 5
##$ABSL= 3
##$ALPHA= 0
##$AQORDER= 0
##$ASSFAC= 0
##$ASSFACI= 0
##$ASSFACX= 0
##$ASSWID= 0
##$AUNMP= <proc_1d>
##$AZFE= 0.1
##$AZFW= 0.1
##$BCFW= 0
##$BC_mod= 0
##$BYTORDP= 0
##$COROFFS= 0
##$CY= 12.5
##$DATMOD= 1
##$DC= 0
##$DFILT= <>
##$DTYPP= 0
##$F1P= 14.0000005364418
##$F2P= -0.99999901652339
##$FCOR= 0.5
##$FTSIZE= 32768
##$FT_mod= 6
##$GAMMA= 0
##$GB= 0
##$INTBC= 1
##$INTSCL= 1
##$ISEN= 128
##$LB= 0.3
##$LEV0= 0
##$LPBIN= 0
##$MAXI= 10000
##$MC2= 0
##$MEAN= 0
##$ME_mod= 0
##$MI= 0
##$NCOEF= 0
##$NC_proc= -4
##$NLEV= 6
##$NOISF1= 0
##$NOISF2= 0
##$NSP= 0
##$NTH_PI= 0
##$NZP= 0
##$OFFSET= 16.45163
##$PC= 1
##$PHC0= 141.4781
##$PHC1= 7.075083
##$PH_mod= 1
##$PKNL= yes
##$PPARMOD= 0
##$PSCAL= 4
##$PSIGN= 0
##$REVERSE= no
##$SF= 250.130017599145
##$SI= 32768
##$SIGF1= 0
##$SIGF2= 0
##$SINO= 400
##$SIOLD= 32768
##$SREGLST= <1H.CDCl3>
##$SSB= 0
##$STSI= 32768
##$STSR= 0
##$SW_p= 5175.98343685301
##$SYMM= 0
##$S_DEV= 0
##$TDeff= 65536
##$TDoff= 0
##$TI= <Analysis number 999999
Compound Code 99
Book Reference 9
Project Code 9>
##$TILT= no
##$TM1= 0
##$TM2= 0
##$TOPLEV= 0
##$USERP1= <user>
##$USERP2= <user>
##$USERP3= <user>
##$USERP4= <user>
##$USERP5= <user>
##$WDW= 1
##$XDIM= 32768
##$YMAX_p= 420820773
##$YMIN_p= -185540
$$ End of Bruker specific parameters
$$ ---------------------------------
##NTUPLES= NMR SPECTRUM
##VAR_NAME=  FREQUENCY,     SPECTRUM/REAL,   SPECTRUM/IMAG
##SYMBOL=    X,             R,               I
##VAR_TYPE=  INDEPENDENT,   DEPENDENT,       DEPENDENT
##VAR_FORM=  AFFN,          ASDF,            ASDF
##VAR_DIM=   32768,         32768,           32768
##UNITS=     HZ,            ARBITRARY UNITS, ARBITRARY UNITS
##FACTOR=    0.157963299565203, 1,           1
##FIRST=     4115.04641105561, 0,            0
##LAST=      -1060.9370257974, 0,            0
##MIN=       -1060.9370257974, -185540,      0
##MAX=       4115.04641105561, 420820773,    0
$$ Real data points
##PAGE= N=1
##DATA TABLE= (X++(R..R)), XYDATA
$$ [...]
15773a2810R707l0346L1928j910J282L6995j1633l2883K3327L0364K7106q721
$$ -12810 -3103 -33449 -1521 -3431 -2149 34846 23213 -9670 13657 44021 71127 62406
15761F2406j8174J2595q916j1795k5584M062m758k0356k2246J3889K471K3559
$$ 62406 44232 56827 47911 36116 10532 14594 9836 -10520 -32766 -18877 -16406 7153
15749G153j4616J845r016r836M3209J1784m1172l3320K3981l3717J0890J4334
$$ 7153 -7463 -5618 -14634 -24470 18739 30523 -10649 -43969 -19988 -53705 -42815 -28481
15737b8481p22J5429P898R336j4385j8145J7561R058n361R892l4058o4220K270
$$ -28481 -29203 -13774 -5876 3460 -10925 -29070 -11509 -2451 -7812 2080 -31978 -96198 -93928
15724i3928M0718N0338j027m9270j8498K8215J482l165J2751m2386m6092j1395
$$ -93928 -53210 -2872 -3899 -53169 -71667 -43452 -41970 -45135 -32384 -74770 -120862 -132257
15712a32257J3105N7949J606R262O2120M7981j450k3789l9694j0855n753L2586
$$ -132257 -119152 -61203 -59597 -50335 11785 59766 58316 34527 -5167 -16022 -21775 10811
15700A0811K3702M6517k8084l3138J0610M1142j5092k5615l2340m3286r550R046
$$ 10811 34513 81030 52946 19808 30418 71560 56468 30853 -1487 -44773 -54323 -45277
15688d5277l3897K0176R175N318L9362j4065k5964K0470N8515l2417l9306j6488
$$ -45277 -79174 -58998 -49823 -44505 -5143 -19208 -45172 -24702 33813 1396 -37910 -54398
15676e4398K7457m416k753R760N8416J2482o6202o9073O636P6774L7445M0249
$$ -54398 -26941 -31357 -34110 -24350 34066 46548 -19654 -88727 -82091 -5317 32128 72377
15664G2377p487J9304q644M615m1736j9400m3396k6991J7320K7122R499l332L1504
$$ 72377 64890 84194 75550 80165 38429 19029 -24367 -51358 -34038 -6916 2583 -749 30755
15651C0755m0997P042J6953m8279m4191O8424O2180m7386n3251j165K7379l8264
$$ 30755 -10242 -3200 13753 -34526 -78717 -10293 51887 4501 -48750 -49915 -22536 -60800
15639f0800K0356L1377o755k3555o696j5800J2279J449l4718n0125N7407M0929
$$ -60800 -40444 -9067 -15822 -39377 -46073 -61873 -49594 -48145 -82863 -132988 -75581 -34652
15627c4652J8740K1202q683k0253K8888M406K4391j2031k7741l948m1385r642
$$ -34652 -15912 5290 -3393 -23646 5242 9648 34039 22008 -5733 -9681 -51066 -60708
15615f0708P198m0758J9508M3862M0114J7589K7196P525L8281K8421k3840l8545
$$ -60708 -53510 -94268 -74760 -30898 9216 26805 54001 61526 99807 128228 104388 65843
15603F5843j9717l6876Q124L1579k7338q144j6530k623k3103j5088K9457O7944
$$ 65843 46126 9250 17374 48953 21615 13471 -3059 -5682 -28785 -43873 -14416 53528
15591E3528r850j061k4752k3752O47j9508j0483J6478j2926k2152K8355L1829
$$ 53528 43678 42617 17865 -5887 -5240 -24748 -35231 -18753 -31679 -53831 -25476 6353
15579F353J9765N981J0032N395j2347l9646m5794K9466J4848J0494P901k3449
$$ 6353 26118 32099 42131 47526 35179 -4467 -50261 -20795 -5947 4547 12448 -11001
15567a1001m3157l7798J1544J4426K8102J1496O167K4421J0941k8966J7376r369
$$ -11001 -54158 -91956 -80412 -65986 -37884 -26388 -20221 4200 15141 -13825 3551 -5818
15555e818j7259m5737m0575K6982M8402L316J5677K9959K1203R493l6208J7711
$$ -5818 -23077 -68814 -109389 -82407 -34005 -30689 -15012 14947 36150 45643 9435 27146
15543B7146j7081k1158k5817J9255k2155L3955L3629j6454j4562k4748O6571k552
$$ 27146 10065 -11093 -36910 -17655 -39810 -5855 27774 11320 -3242 -27990 38581 36029
15531C6029j4876J1232Q241k5941p013l4290l3260Q346k8812n3466j638J9335
$$ 36029 21153 32385 40626 14685 7672 -26618 -59878 -51532 -80344 -133810 -135448 -116113
15519a16113O0105M8927O956J224j7857l6861k2043N1479J846k1179l043j0379
$$ -116113 -56008 -7081 -125 1099 -16758 -53619 -75662 -24183 -22337 -43516 -46559 -56938
15507e6938m6504J1642M6527K6577J7839o224M9467j2567r300k656k3465k233
$$ -56938 -103442 -91800 -45273 -18696 -857 -7081 42386 29819 20519 17863 -5602 -7835
15495g835J5104j2005J2632K9287J238j4184l1699k1559m4273l5062k359K0350
$$ -7835 7269 -4736 7896 37183 38421 24237 -7462 -29021 -73294 -108356 -110715 -90365
15483i0365M1880N1217L2986J4722l495k9456l8053k0266M1671P5477J9045m2207
$$ -90365 -48485 2732 35718 50440 46945 17489 -20564 -40830 841 76318 95363 53156
15471E3156o3062l8984M1340M7147m116j0016J490j7270l1840j8482L871J3546
$$ 53156 -9906 -48890 -7550 39597 35481 25465 26955 9685 -22155 -40637 -36766 -23220
15459b3220k8308r028L5145Q358k457J3613K419L763j812r655p58K0512l4817
$$ -23220 -51528 -60556 -25411 -17053 -19510 -5897 -3478 285 -1527 -11182 -11940 8572 -26245
15446b6245k3305K0591P118l7743l7442K3769K7328J4094J5581K6744j106j8045
$$ -26245 -49550 -28959 -21841 -59584 -97026 -73257 -45929 -31835 -16254 10490 9384 -8661
15434h661l0383o955j5496J041J1084M2328k7523l2530N2809K5129j7755K0376
$$ -8661 -39044 -45999 -61495 -60454 -49370 -7042 -34565 -67095 -14286 10843 -6912 13464
15422A3464J2038j0541j0756m604J5252o952r139p457n4469n716M259K8127J0974
$$ 13464 25502 14961 4205 -399 14853 7901 -1238 -8695 -63164 -68880 -64621 -36494 -25520
15409b5520J3965j2964M2796J808p374P101q4714K414L2084j2682k8962L9580
$$ -25520 -11555 -24519 18277 20085 12711 19812 -64902 -62488 -30404 -43086 -72048 -32468
15397c2468J0455L9405k5747j4986l874j1976J9199K4092N1341j4605l3526r908
$$ -32468 -22013 17392 -8355 -23341 -27215 -39191 -19992 4100 55441 40836 7310 -2598
15385b598j0544M7627J3160k1552M5076j5263P112K1685q261J8649k3448J7730
$$ -2598 -13142 34485 47645 26093 71169 55906 63018 84703 76442 95091 71643 89373
15373H9373J3100M324l7104k9976L00J4688k5369o202j1942l6538k0807J0043
$$ 89373 102473 106797 69693 39717 40017 54705 29336 23134 11192 -25346 -46153 -36110
15361c6110K8888l2567m3677L1962L7437M405j5187N0797L7040r304j9210l1157
$$ -36110 -7222 -39789 -83466 -51504 -14067 -9662 -24849 25948 62988 53684 34474 3317
15349C317l2427k8519j9297L8073k473n1762K4694Q730J3848l152j8527M4967
$$ 3317 -29110 -57629 -76926 -38853 -41326 -93088 -68394 -59664 -45816 -48968 -67495 -22528
15337b2528O340L4392j8979k3843j117j9776n1760N3119M3622K3092k6280k4056
$$ -22528 -16188 18204 -775 -24618 -25735 -45511 -97271 -44152 -530 22562 -3718 -27774
15325b7774j0951K1500j06n301L1877M553J0481m977r4k8801K2755J0426L0993
$$ -27774 -38725 -17225 -17331 -22632 9245 13798 24279 19302 19208 -9593 13162 23588 54581
15312E4581j7192L6874M9166m4394p0839n578J8124K6632K8362K8878q0824l8791
$$ 54581 37389 74263 123429 79035 8196 2618 20742 47374 75736 104614 23790 -15001
15300a5001K0483j898o389J51j5028J6978l508k0542M4288K9913J2288m1952l9367
$$ -15001 5482 3584 -2805 -2654 -17682 -704 -4212 -24754 19534 49447 61735 19783 -19584
15287a9584l6338Q011M1662J0776j0594j1377m2472K2624Q5360j2333o3941l9051
$$ -19584 -55922 -47911 -6249 4527 -6067 -17444 -59916 -37292 48068 35735 -28206 -67257
15275f7257o484R106L5446J7794Q40N5828K8654r0195p6107N5186P5100N0737
$$ -67257 -73741 -64635 -29189 -11395 -10555 45273 73927 -16268 -92375 -37189 37911 88648
15263H8648j5041m6871k1277J6404J0055j8270m9525N731O9080J0902m1558m2080
$$ 88648 73607 26736 5459 21863 31918 13648 -35877 -30146 38934 49836 8278 -33802
15251c3802m544p862L086J8693j7233K142o465J6770J0083L5128J4725r045q795
$$ -33802 -38346 -46208 -43122 -24429 -41662 -39520 -45985 -29215 -19132 15996 30721 21676 12881
15238A2881K4707m158J2272l6688k2788j3130l0003M0504J2696N352M7516M31
$$ 12881 37588 33430 45702 9014 -13774 -26904 -56907 -16403 -3707 1645 49161 49592
15226D9592l768K2321N522O6397n857r4790n0024K6664K9318J3603l3284m0312
$$ 49592 45824 68145 73667 140064 134207 39417 -10607 16057 45375 58978 25694 -14618
15214a4618r571N739K5708Q338J1643J8217l3773q927L9113K2460p6993n1784
$$ -14618 -24189 -18450 7258 15596 27239 45456 11683 2756 41869 64329 -12664 -64448
15202f4448K1934Q585k670J2327p987j3508k8736r070J3049K4902M3791j6588
$$ -64448 -42514 -33929 -36599 -24272 -32259 -45767 -74503 -83573 -70524 -45622 -1831 -18419
15190a8419l6577j8519j1947J3395L7411K0497k7182M5504Q131m9385L2745K4459
$$ -18419 -54996 -73515 -85462 -72067 -34656 -14159 -41341 4163 12294 -37091 -4346 20113
15178B0113l8984n640L0026n91J0272j8534k5847J7432n325l678K0200O9073M3078
$$ 20113 -18871 -24511 5515 4924 15196 -3338 -29185 -11753 -17078 -20756 -556 68517 111595
15165A11595M3526j0929p7070o1921K8883k2132N029j6084k4117J5933J2970K5259
$$ 111595 155121 144192 67122 5201 34084 11952 16981 897 -23220 -7287 5683 30942
15153C0942q71j316m8502M399l489J5743L9207R71J2812k4749k4086O660K6981
$$ 30942 30071 28755 -19747 -15348 -18837 -3094 36113 37084 49896 25147 1061 7721 34702
15140C4702k5875L6105P883o2348J1784L6372J6875M4479P999J5403k6335m4630
$$ 34702 8827 44932 52815 -9533 2251 38623 55498 99977 107976 123379 97044 52414
15128E2414r718k4862k920j6725J5352N264K8320j1785K5940k3100n5530j0485
$$ 52414 42696 17834 14914 -1811 13541 18805 47125 35340 61280 38180 -17350 -27835
15116b7835L2878M0001l0789l4199m2568k0569N0151j441j2893L4625j2366J2796
$$ -27835 5043 45044 14255 -19944 -62512 -83081 -32930 -34371 -47264 -12639 -25005 -12209
15104a2209N2478J5935r877j1820K9789R209k9312k9629k3402J0181j2287K2982
$$ -12209 40269 56204 46327 34507 64296 73505 44193 14564 -8838 1343 -10944 12038
15092A2038m868l2068j4612O01K1406R093L947m032J2129J6366p438p3566K48
$$ 12038 7170 -24898 -39510 -38909 -17503 -8410 -4463 -8495 3634 20000 12562 -61004 -60756
15079f0756O971M83J4252K0421R825J5696k964j8813r04m4701J0174K2145j2643
$$ -60756 -53785 -53302 -39050 -18629 -8804 6892 3928 -14885 -15789 -60490 -50316 -28171 -40814
15066d0814r643k3501J2976O5335j396k5584J8002J230j4035j0549J6762l558
$$ -40814 -50457 -73958 -60982 4353 2957 -22627 -4625 -3395 -17430 -27979 -11217 -14775
15054a4775J0299k0722N1283L3579J392M3673k5116r043P034J0900n6448l5916
$$ -14775 -4476 -25198 26085 59664 61056 104729 79613 70570 77604 88504 32056 -3860
15042c860n5289P212O1412K5869j387j6580q753q254J8808R17k9607j142j4812
$$ -3860 -59149 -51937 9475 35344 33957 17377 8624 370 19178 20095 -9512 -10654 -25466
15029b5466K2633N1772n39J2591j6554l7706j8662j4263j2390o298R31J0598M0955
$$ -25466 -2833 48939 48400 60991 44437 6731 -11931 -26194 -38584 -44882 -43951 -33353 7602
15016G602p201l8021L8538L4379n72J8821n1980K0149m330l3077k5386K8920K800
$$ 7602 401 -37620 918 35297 34725 53546 1566 21715 17385 -15692 -41078 -12158 -9358
15003i358l370N074O2710n0917j5604k800J3713M1003l4393j0388K7170L7696
$$ -9358 -12728 -7654 55056 4139 -11465 -14265 -552 40451 6058 -4330 22840 60536
14991F0536P004p855J364j6262m8693l1139j9916l013K5067j1724l3481L700N6778
$$ 60536 67540 59685 61049 44787 -3906 -35045 -54961 -57974 -32907 -44631 -78112 -74412 -17634
14978a7634L7066R051l185n234m9758k4744P141L8118K9245J8867k0617J0230
$$ -17634 19432 28483 25298 20064 -29694 -54438 -47297 -9179 20066 38933 18316 28546
14966B8546k7395m3092R976l0982K0997L2637j6993k8919J4920J8336J1273J5498
$$ 28546 1151 -41941 -31965 -62947 -41950 -9313 -26306 -55225 -40305 -21969 -10696 4802
14954D802J2508l120r767J1146Q528j5540k809J387P056j206j1486l508m1936
$$ 4802 17310 14190 4423 15569 24097 8557 5748 7135 14191 12985 1499 -2009 -43945
14941d3945j3678l0745j0128J2386Q101L2154K2280k124l0113K7501L8099P827
$$ -43945 -57623 -88368 -98496 -86110 -78009 -45855 -23575 -25699 -55812 -28311 9788 17615
14929A7615r107L3878k4869n8357j7300n5089J4383M4366k4053P648N0117O0642
$$ 17615 8508 42386 17517 -40840 -58140 -113229 -98846 -54480 -78533 -70885 -20768 39874
14917C9874J3539n576m959l216l1549k7205k0697j5448L4835L2772k6565m5194
$$ 39874 53413 47837 42878 39662 8113 -19092 -39789 -55237 -20402 12370 -14195 -59389
14905e9389K8875P538j1456L5303K6476j6404J958r583r904j7250q02J3666l673
$$ -59389 -30514 -22976 -34432 871 27347 10943 12901 3318 -6586 -23836 -24638 -10972 -14645
14892a4645j3994J3905j4413k3759k8612L2641O5566K6549L149r047m1141K7196
$$ -14645 -28639 -14734 -29147 -52906 -81518 -48877 16689 43238 46387 37340 -3801 23395
14880B3395M2350R315K9138j6640o9876n5272M774P052K3369k69j4774q64l8251
$$ 23395 65745 75060 104198 87558 17682 -37590 -32816 -25764 -2395 -2664 -17438 -18302 -56553
14867e6553l7475J1231L4649M6711r144J3061M8446J4219k2941j2952j3773k4035
$$ -56553 -94028 -82797 -48148 -1437 -10581 2480 50926 65145 42204 29252 15479 -8556
14855h556l950M7617L7049l1339l1707n2251M0743M108j2453K8645K255Q361J3850
$$ -8556 -12506 35111 72160 40821 9114 -43137 -2394 1714 -10739 17906 20161 28522 42372
14842D2372J687j8127k5765J1845L994m1118l2944k5572m053P86P2888K1785k4550
$$ 42372 44059 25932 167 12012 16006 -25112 -58056 -83628 -87681 -86895 -14007 7778 -16772
14829a6772j8986N1776K0298j176J7748m5307J9191j1752j1014q095l0038k0813
$$ -16772 -35758 16018 36316 35140 52888 7581 26772 15020 4006 -4089 -34127 -54940
14817e4940J6883J3781n99q050j6960L9032K1285j4556L6621K1413o510l8280
$$ -54940 -38057 -24276 -24875 -32925 -49885 -10853 10432 -4124 32497 53910 47400 9120
14805I120n1604l5870K7307L1904M3632L69k8884j0544l0453O657M4926K5571
$$ 9120 -42484 -78354 -51047 -19143 24489 24858 -4026 -14570 -45023 -38366 6560 32131
14793C2131R212L276M217J059k2268k5348k2439L005R490k4473L3841j1679j9298
$$ 32131 41343 44619 48836 49895 27627 2279 -20160 -17155 -7665 -32138 1703 -9976 -29274
14780b9274j0453k896r605M6369L4544l1421m0729m7011J1939N9352K4208J959
$$ -29274 -39727 -42623 -52228 -5859 28685 -2736 -43465 -90476 -78537 -19185 5023 6982
14768F982n4235L7314k576j0714m4424o0176q756N6241m482M9705M4977j1272
$$ 6982 -47253 -9939 -12515 -23229 -67653 -127829 -136585 -80344 -84826 -35121 9856 -1416
14756a416L1901J2411l6215K1256k5796n2240M9176j8988j0917K6043K7908j487
$$ -1416 30485 42896 6681 27937 2141 -50099 -923 -19911 -30828 -4785 23123 21636
14744B1636J0053Q909p0670m9890q658J7699J112M5071q423K0760J9167J1664
$$ 21636 31689 40598 -30072 -79962 -88620 -70921 -69809 -24738 -33161 -12401 6766 18430
14732A8430o71j0447n6644p3353K9990R567n0366N4345L6383k7171R690K9185
$$ 18430 17759 7312 -49332 -122685 -92695 -83128 -133494 -79149 -42766 -69937 -60247 -31062
14720c1062K3788K6290J8589M194o8410l9899j0073P5365O5336K1437J069Q309
$$ -31062 -7274 19016 37605 41799 -26611 -66510 -76583 -1218 64118 85555 86624 94933
14708I4933k9642j6921j6292k4918O216m368K4737K038k2656l9811J3212n527
$$ 94933 65291 48370 32078 7160 13376 9008 33745 35783 13127 -26684 -13472 -18999
14696a8999K1185k2972l6373l8766L6963L9319j2477j8430l602J2307L607j5526
$$ -18999 2186 -20786 -57159 -95925 -58962 -19643 -32120 -50550 -54152 -41845 -38238 -53764
14684e3764l277J2281p90K5791p471J123J1007K2063J1175K4265R545k3268J1917
$$ -53764 -57041 -44760 -45550 -19759 -27230 -26107 -15100 6963 18138 42403 51948 28680 40597
14671D0597k8435j1616l4926l7678K3451L5891L0923l3563k4228K4980M1558j3492
$$ 40597 12162 546 -34380 -72058 -48607 -12716 18207 -15356 -39584 -14604 26954 13462
14659A3462J0994K7062j9226J3248L3042M5420L326m6778k8456l5862J1141n607
$$ 13462 24456 51518 32292 45540 78582 124002 127328 80550 52094 16232 27373 21766
14647B1766o531k990l7165p247L1642K1685L3066j0996k5745l0410m774N639L722
$$ 21766 15235 12245 -24920 -32167 -525 21160 54226 43230 17485 -12925 -17699 -12060 -8338
14634h338L41j011J4109j3292J2426M7385j5072Q956K2837k7402l6000n3431j2320
$$ -8338 -7997 -9008 5101 -8191 4235 51620 36548 45504 68341 40939 4939 -48492 -60812
14621f0812K1705j8372j6502Q126M1612N0748r066l3750k3517K6067J0741J8540
$$ -60812 -39107 -57479 -73981 -65855 -24243 26505 17439 -16311 -39828 -13761 -3020 15520
14609A5520r173k45k018n2765J561J01068K9770j0468m989k9443P557j2676n0392
$$ 15520 6347 6102 4084 -48681 -47120 53948 83718 73250 68261 38818 46375 33699 -16693
14596a6693R798K395q313L9335K4965K4150k8826m7918k1355K3622R139L6775
$$ -16693 -6895 -4500 -12813 26522 51487 75637 46811 -1107 -22462 1160 10299 47074
14584D7074p502j426L169J318R352p0435K2135L9998l4286l2142L7494L16j358
$$ 47074 39572 38146 41315 42633 51985 -18450 3685 43683 9397 -22745 14749 15065 13707
14571A3707N617j7705n829N1673q350J5419N355k3338l5080K957L6303M1808l743
$$ 13707 19324 1619 -4210 47463 39113 54532 59887 36549 1469 4426 40729 82537 78794
14558G8794K7693J05140R7715L4051l3900o5473r840q544k3127k4273n5922l1518
$$ 78794 106487 211627 309342 343393 309493 244020 234180 225636 202509 178236 122314 90796
14546I0796j1737l1775m1176L6726l782l7651K9732j3534m0994L4310M2597J158
$$ 90796 79059 47284 6108 42834 39052 1401 31133 17599 -23395 10915 53512 54670
14534E4670l0472j4245K7104L715N984j4078j2472k193J155R906J9096m3574k0556
$$ 54670 24198 9953 37057 40772 46756 32678 20206 18013 19168 29074 48170 4596 -15960
14521a5960j1667L4458P6124k4800L77l876n137m4718L1952K0426k7928J9871
$$ -15960 -27627 6831 82955 58155 58532 54656 49519 4801 36753 57179 29251 49122
14509D9122m676m2402k5012L2366j8848M718j470J5273N644P166L7661K1646J3013
$$ 49122 44446 2044 -22968 9398 -9450 -4732 -6202 9071 14715 21881 59542 81188 94201
14496I4201n3088q0382j7339M295R527K7211k1744k1478J3784J1648j607L70L1690
$$ 94201 41113 -39269 -56608 -52313 -42786 -15575 -37319 -58797 -45013 -33365 -34972 -34602 -2912
14483b912k761j6380L2721K2720l4704q712M4568L1033M834j992k4677m40j2748
$$ -2912 -5673 -22053 10668 33388 -1316 -10028 34540 65573 70407 68415 43738 43298 30550
14470C0550j6441R008j0403l5178l3026O879m260J717N6108P497n1124l6721M2086
$$ 30550 14109 23117 12714 -22464 -55490 -48611 -52871 -51154 4954 12451 -38673 -75394 -33308
14457c3308M0675M2863L1480L9280n2876o2195O190j5128K516n375M211L4223
$$ -33308 7367 50230 81710 120990 68114 5919 12109 -3019 -503 -5878 -1667 32556
14445C2556M002K5943l8974m3174K3151M1109K1835J579L712K1296K506m8151
$$ 32556 36558 62501 23527 -19647 3504 44613 66448 68027 71739 93035 95541 47390
14433D7390j3191K5933n4299j8855R918N8865J6979M1595J9075k4258j0840k8949
$$ 47390 34199 60132 5833 -13022 -3104 55761 72740 114335 133410 109152 98312 69363
14421F9363k7955k137J2537L3586l4138l1049j5083J8044R711n895K5495r779
$$ 69363 41408 39271 51808 85394 51256 20207 5124 23168 32879 26984 52479 42700
14409D2700J2164K9739k1253n9772j8339K1951L4221Q897j8179k3750k4614l637
$$ 42700 54864 84603 63350 3578 -14761 7190 41411 50308 32129 8379 -16235 -19872
14397a9872J2210L3200J8954M3812k691m4191J2741K1853p0229p8355r819M8682
$$ -19872 -7662 25538 44492 88304 85613 41422 54163 76016 5787 -72568 -82387 -33705
14385c3705M0332k128l304R36k0094J2173K8335J0666J4239M116Q121k6942j4618
$$ -33705 6627 4499 1195 2131 -17963 -5790 22545 33211 47450 51566 59687 32745 18127
14372A8127q626n7252r656J5811R492L7726O4017M2439m8599k5834r150J4351
$$ 18127 9501 -47751 -57407 -41596 -32104 5622 69639 112078 63479 37645 28495 42846
14360D2846k1239K941L1980j6298j0064k4214J4827L3327K5478n1226m9597J9201
$$ 42846 21607 24548 56528 40230 30166 5952 20779 54106 79584 28358 -21239 -2038
14348b038M9800J6781k3620o5542j1410O0723N3490L519N524K4038j4714j8097
$$ -2038 47762 64543 40923 -24619 -36029 24694 78184 81703 87227 111265 96551 78454
14336G8454j6465l3089n5181l8649N6415K9475K797J7133m234l541J64K3809K8469
$$ 78454 61989 28900 -26281 -64930 -8515 20960 23757 40890 36656 33115 33279 57088 85557
14323H5557L9405k8092q263j9593n1452k6987L8131N6533p9871m4045K7350k228
$$ 85557 124962 96870 88607 69014 17562 -9425 28706 85239 5368 -38677 -11327 -13555
14311a3555L1470J6769k1173J163l3257R682K0302k402J3547n42j120n900K3801
$$ -13555 17915 34684 13511 14674 -18583 -8901 11401 8999 22546 22004 20884 14984 38785
14298C8785n578p499Q082k0629K4368L0993N8j797j9540L585J2394M9932L0578
$$ 38785 33207 25708 33790 13161 37529 68522 68580 66783 47243 50828 63222 113154 143732
14285A43732j2444M201o5671k7235K9124J3069k5282K3877K5167J7082J5061o972
$$ 143732 131288 135489 69818 42583 71707 84776 59494 83371 108538 125620 140681 133709
14273A33709J8641J6902K2128J0950M9215J356P9179P5043Q5037O1356Q7062O9509
$$ 133709 152350 169252 191380 202330 251545 252901 332080 407123 492160 553516 640578 710087
14261G10087K5555M3782J42152J1879k2120K0862k2031j25718j05160p8005m6650
$$ 710087 735642 779424 921576 933455 911335 932197 910166 784448 679288 601283 554633
14250E54633p9836r7249l0932L366n6419o4741J7777R097l9224l4588j6264m772
$$ 554633 474797 377548 346616 349982 293563 228822 246599 255696 216472 181884 165620 160848
14238A60848M8999L1996l0745k0472k5305k3390j7272N0610l1j8757l0240J7147
$$ 160848 209847 241843 211098 190626 165321 141931 124659 175269 175238 156481 126241 143388
14226A43388K0976j141n286J3382R419n2087m9913N8989K1068l1085p3085o269
$$ 143388 164364 163223 157937 171319 180738 128651 78738 137727 158795 127710 54625 48356
14214D8356O2282j4167m1496M2354j2753k8638l9866j3164O459R0433J7242n0077
$$ 48356 110638 96471 54975 97329 84576 55938 16072 2908 9367 99800 117042 66965
14202F6965L5997o339l7726K024L9674J1715j1030k5922K929J8504J3811r885
$$ 66965 102962 96623 58897 60921 100595 112310 101280 75358 78287 96791 110602 100717
14190A00717m3885L6587L519k0561J9234j9666m5856k7353N387L5331J4459k9869
$$ 100717 56832 93419 96938 76377 95611 75945 30089 2736 8123 43454 57913 28044
14178B8044j2295M1048J2932p106J804K5697M9767j7856n5910l6600L3953N5952
$$ 28044 15749 56797 69729 62623 64427 90124 139891 122035 66125 29525 63478 119430
14166A19430L576o8926j6035O2006j2930l5481P745k2532k1899m603K2358R278
$$ 119430 123006 54080 38045 100051 87121 51640 59385 36853 14954 10351 32709 41987
14154D1987M2770J4535r382l9704k0665J6281K6857k1751o635j5734j2771K1125
$$ 41987 84757 99292 89910 50206 29541 45822 72679 50928 44293 28559 15788 36913
14142C6913k4516M9510L2727p9363j2011K0486m622J0797M3236j4118J0848K426
$$ 36913 12397 61907 94634 15271 3260 23746 19124 29921 73157 59039 69887 72313
14130G2313L6591J645k4562k162O528k8192o535M2614O8635k1589m8179j4655
$$ 72313 108904 110549 85987 83825 90353 62161 55626 98240 166875 145286 97107 82452
14118H2452K870Q149j0431N919J1160k0007j7973q911j5682K0122j4045J1431
$$ 82452 85322 93471 83040 88959 100119 80112 62139 53228 37546 57668 43623 55054
14106E5054L1287o574k7188J2448L1056j6824o0496J419k0816K0274N5410K6424
$$ 55054 86341 79767 52579 65027 96083 79259 18763 20182 -634 19640 75050 101474
14094A01474m5017k7973J3695L8418J0942L015l8514o665m1214q038P1472K7198
$$ 101474 56457 28484 42179 80597 91539 94554 56040 49375 8161 123 71595 98793
14082I8793o491L1034J7035L379j2334n25l2082q154n936J5936o4300l9560O5775
$$ 98793 92302 123336 140371 143750 131416 130891 98809 90655 84719 100655 36355 -3205 62570
14069F2570R4299J1445N358J8770P2571O688P942m7523o6619O54L550K22J530
$$ 62570 156869 168314 173672 192442 265013 271701 279643 232120 165501 166155 169705 169927 171457
14056A71457j5528L3107j4899j1625J5107L4956j5959j0646J8551J088l0410j043
$$ 171457 155929 189036 174137 162512 177619 212575 196616 185970 204521 205609 175199 174156
14044A74156N9621o651J027n151j586j5023L6993M9421m409L1425N266k9105l8834
$$ 174156 233777 227126 228153 223002 221416 206393 243386 292807 288398 319823 325089 295984 257150
14031B57150j5517K535J1537L8428N8604m2346m9339q880J4841L6010O488k2124
$$ 257150 241633 244168 255705 294133 352737 310391 261052 252172 267013 303023 309511 287387
14019B87387j2268l0928K7652k4024j8147J2029K1229N0289M2761j2377l5995
$$ 287387 275119 244191 271843 247819 229672 241701 262930 313219 355980 343603 307608
14008C07608j2123L556J3175K3380K284J9753K8152k8053l36M2522L6651O6536
$$ 307608 295485 299041 312216 335596 337880 357633 385785 357732 357396 399918 436569 503105
13996E03105M4290O8689K4077O7543M0655K3437J12279J20630J02323J48047K77297
$$ 503105 547395 616084 640161 707704 748359 771796 884075 1004705 1107028 1255075 1532372
13985A532372L41405M18504M08320M55704M51708L75180L25925K70211J76496
$$ 1532372 1873777 2292281 2700601 3156305 3608013 3983193 4309118 4579329 4755825
13976D755825Q5243R9686n421j33721r7160j50976k56649k67178k78052k68325
$$ 4755825 4841068 4940754 4935333 4801612 4704452 4553476 4296827 4029649 3751597 3483272
13966C483272l10706l30247k94944k56995k50009j86815j13486j28736o9161j3410
$$ 3483272 3172566 2842319 2547375 2290380 2040371 1853556 1740070 1611334 1542173 1528763
13956A528763l6735o6610n8295o4515l7488k6862r842q1614q8484l6241l1787
$$ 1528763 1492028 1425418 1367123 1302608 1265120 1238258 1228416 1146802 1058318 1022077 990290
13945I90290j3485N894J5528l3177k4887J0803k6418r0542o0342j8459K8343n935
$$ 990290 976805 982699 998227 965050 940163 950966 924548 834006 773664 755205 783548 777613
13933G77613n5632m6382j3591L0399J6302m5678o146K9468K8348J099l4861o903
$$ 777613 721981 675599 662008 692407 708709 663031 656885 686353 714701 715800 680939 674036
13921F74036j4485L2338M2189l6488k4517K4110J8574M1528L0746L1652M4736
$$ 674036 659551 691889 734078 697590 673073 697183 715757 757285 788031 819683 864419
13910H64419N2822J19062J06929J10960J01261R4539M3853J9654q1681p7305o4425
$$ 864419 917241 1036303 1143232 1254192 1355453 1449992 1493845 1513499 1431818 1354513 1290088
13899A290088m3869j05924o8711k1161m5930l3185n8547k6984K0127L6283K6892
$$ 1290088 1246219 1140295 1071584 1050423 1004493 971308 912761 885777 905904 942187 969079
13888I69079M7390k8041m453j7476m2322J9572M5363M2971j6862q6386O8858M9098
$$ 969079 1016469 988428 983975 966499 924177 943749 989112 1032083 1015221 928835 997693 1046791
13876A046791K0098K5892M3332M9248K1463L0619L4581L8091K7719J6028M6653
$$ 1046791 1066889 1092781 1136113 1185361 1206824 1237443 1272024 1310115 1337834 1353862 1400515
13865A400515O5390L7525K5616P7080R6400M5486M5999N8257M8469L3559R3446
$$ 1400515 1465905 1503430 1529046 1606126 1702526 1748012 1794011 1852268 1900737 1934296 2027742
13854B027742Q8415R7150P6241M1143P9975J49733J75235J34920J14545J42055
$$ 2027742 2116157 2213307 2289548 2330691 2410666 2560399 2735634 2870554 2985099 3127154
13844C127154J38953J93736K53251J95875L05105L20068L31857L41716M21385
$$ 3127154 3266107 3459843 3713094 3908969 4214074 4534142 4865999 5207715 5629100
13835E629100N04843N63432O72461P62864Q97901J092629J295823J457749J714132
$$ 5629100 6133943 6697375 7369836 8132700 9030601 10123230 11419053 12876802 14590934
13826A4590934J930870K213388K627526L294492M166217N440019P398115J0004913
$$ 14590934 16521804 18735192 21362718 24657210 28823427 34263446 41661561 51666474
13818E1666474J3268373J6914231K0247833K2320507K2207860J9369800J3972610
$$ 51666474 64934847 81849078 102096911 124417418 146625278 165995078 179967688
13811A79967688O513260j943216j0009896j6062938j9441772k0306165j8994975
$$ 179967688 186480948 184537732 174527836 158464898 139023126 118716961 99721986
13804I9721986j6148220j2714035r616838p232146n502070m293723l470676k970973
$$ 99721986 83573766 70859731 61242893 54010747 48508677 44214954 40744278 37773305
13796C7773305k645534k375743k141331j986548j825814j658543j452854j254712
$$ 37773305 35127771 32752028 30610697 28624149 26798335 25139792 23686938 22432226
13788B2432226j087303r37393q43077p82099p09962o34752n81241n76914o12295
$$ 22432226 21344923 20407530 19564453 18782354 18072392 17437640 16856399 16279485 15667190
13779A5667190o41051n00815m51204m75116m40044m64904m39108l90467l76045
$$ 15667190 15026139 14525324 14074120 13599004 13158960 12694056 12254948 11864481 11488436
13770A1488436l76472l32368k83943l19554l11772l05055k85510k59725j82374
$$ 11488436 11111964 10779596 10495653 10176099 9864327 9559272 9273762 9014037 8831663
13761H831663k12056j89094j75047k41559k28572j96316j78674j98033j79252
$$ 8831663 8619607 8430513 8255466 8013907 7785335 7589019 7410345 7212312 7033060
13752G033060j44536j89476j71049j72295k11795j92392j75214j76800j69939
$$ 7033060 6888524 6699048 6527999 6355704 6143909 5951517 5776303 5599503 5429564
13743E429564j18848j46289j44001p3415n1740p8877r4007j18259j47712q8488
$$ 5429564 5310716 5164427 5020426 4947011 4895271 4816394 4722387 4604128 4456416 4367928
13733D367928r8084j31653j49081r1424q461m6280p1392o2423r3717j30543k6626
$$ 4367928 4269844 4138191 3989110 3897686 3889225 3842945 3771553 3709130 3615413 3484870 3458244
13722C458244l6063j08577o9468M017p3706j15677q5028n3531q7901q0973j940
$$ 3458244 3422181 3313604 3244136 3248153 3174447 3058770 2973742 2920211 2832310 2751337 2749397
13711B749397l6907o8718k2814r7608j05295m4748k8810p0908n8521m0584p2947
$$ 2749397 2712490 2643772 2620958 2523350 2418055 2373307 2344497 2273589 2215068 2174484 2101537
13700B101537m0886m2294n1559m5180n7409n3516m7056j9142l241m5532o0465
$$ 2101537 2060651 2018357 1966798 1921618 1864209 1810693 1763637 1744495 1741254 1695722 1635257
13689A635257m9353j5180j6685k1050j4680J966l4648n4133r2201q2237r7186
$$ 1635257 1585904 1570724 1554039 1532989 1518309 1520275 1485627 1431494 1339293 1257056 1159870
13678A159870o2124k1370K7149j7028J9659n5345n4768l8232N398o537l1828m1262
$$ 1159870 1097746 1076376 1103525 1086497 1106156 1050811 996043 957811 963209 956672 924844 883582
13666H83582j2294k4364N352l6034j730j0790k2699j011M7780L830k4322o9351
$$ 883582 871288 846924 852276 816242 814512 803722 781023 780012 827792 831622 807300 737949
13654G37949j7374l5572K4457M4089k9810j0541M378m2651k1409r32J5066j3672
$$ 737949 720575 685003 709460 753549 723739 713198 717576 674925 653516 652584 667650 653978
13642F53978l4200o5262r6772k7990P481K3752O720P81l7765R043N808r226l6503
$$ 653978 619778 554516 457744 429754 437235 460987 467707 468488 430723 439766 445574 436348 399845
13629C99845j6280j0981k2776J57m981l394k1000j5692K0200n0761j3746k7919
$$ 399845 383565 372584 349808 349965 344984 341590 320590 304898 325098 274337 260591 232672
13617B32672j5460L139j8119j0040l2987K4779N423j2891Q82m455P185M177m031
$$ 232672 217212 220351 202232 192192 159205 183984 189407 176516 177398 172943 180128 184305 180274
13604A80274J5968l0710J2175M1453K0892n5193J9728J7659k0819k0731L6245
$$ 180274 196242 165532 177707 219160 240052 184859 204587 222246 201427 180696 216941
13593B16941J9857l6067K8905L0398m5598k9592k2905J0420L5137j7297O279n7814
$$ 216941 236798 200731 229636 260034 214436 184844 161939 172359 207496 190199 196478 138664
13581A38664k3466M7312K5287l6864m7070K0020R0851J7134l9358l1628K1221
$$ 138664 115198 162510 187797 150933 103863 123883 214734 231868 192510 160882 182103
13570A82103l3550l1240L3054n244m1353K4756N9046q232m8204o999K2890j3272
$$ 182103 148553 117313 150367 145123 103770 128526 187572 179340 131136 124137 147027 133755
13558A33755o2078k4186K8P086J5559K8386j988j9743M6763K0317m2503R157K9265
$$ 133755 71677 47491 47519 54605 70164 98550 96562 76819 123582 143899 101396 110553 139818
13545A39818J9632j5822L8605L2057r955n9049l8838L0217j9596m6435k4684J981
$$ 139818 159450 143628 182233 214290 204335 145286 106448 136665 117069 70634 45950 47931
13533D7931l2544l1558J4643L9520O0394P1028L2890j1932l0759L1693M0645L920
$$ 47931 15387 -16171 -1528 37992 98386 169414 202304 190372 159613 191306 231951 235871
13521B35871k1614k2411j3970R473m5803k2879p358M2285l6372p561p533k3606
$$ 235871 214257 191846 177876 187349 141546 118667 111309 153594 117222 109661 102128 78522
13509G8522j2109J4829m0035r759M5813j2729l6073R592K3674M3019Q2265O2711
$$ 78522 66413 81242 41207 31448 77261 64532 28459 38051 61725 104744 187009 249720
13497B49720m314l0289K9952n2715o5732m9084L330L5092J4306p1943j626N2908
$$ 249720 245406 215117 245069 192354 126622 77538 80868 115960 130266 58323 56697 109605
13485A09605j9127p1240k8152M2324l3448k4983L34J6027J06L9289K0603k9405
$$ 109605 90478 19238 -8914 33410 -38 -25021 -24687 -8660 -8554 30735 51338 21933
13473B1933J1727m391K9484o870J2151L632j9729k2943K030N9630J8825Q273n1020
$$ 21933 33660 29269 58753 51883 64034 67666 47937 24994 27024 86654 105479 113752 62732
13460F2732k7387k0549J9154O9171j20M2042L957J7967o799k7211o2616p7381
$$ 62732 35345 14796 33950 103121 103001 145043 149000 166967 160168 132957 70341 -7040
13448g040l7211R649M5811P7443L1598j2315m862J8005J6057n0641J3111k779
$$ -7040 -44251 -34602 11209 88652 120250 107935 103073 121078 137135 86494 99605 96826
13436I6826l3109o1743j3477K5467n933k1878l5273n217K4348q249J0357J8624
$$ 96826 63717 1974 -11503 13964 8031 -13847 -49120 -54337 -29989 -38238 -27881 -9257
13424i257K9060L4671j0838k8926O854r84M8032K7617k5632j3141N8808J03706
$$ -9257 19803 54474 43636 14710 21564 20580 68612 96229 70597 57456 116264 219970
13412B19970m5760r1397o4519m0750j5020J7599N8022M4404k5418M4263J0125
$$ 219970 174210 82813 18294 -22456 -37476 -19877 38145 82549 57131 101394 111519
13401A11519k4749n8698J2236k1081l7911j83L1035J5428M0223m2109J4077m045
$$ 111519 86770 28072 40308 19227 -18684 -18867 12168 27596 67819 25710 39787 35742
13389C5742j8614k2972p2012L135O1162R6614K3502l0077j4868Q689J8448j9874
$$ 35742 17128 -5844 -77856 -74721 -13559 83055 106557 76480 61612 70301 88749 68875
13377F8875k2130M1309K1015K5765j5574j971M8503r476j4425P6230J3683P5455
$$ 68875 46745 88054 109069 134834 119260 117289 165792 156316 141891 218121 231804 307259
13365C07259Q7134M3353P8037P8327J05040J08355Q8784M6580N5475J1472p2783
$$ 307259 394393 437746 515783 594110 699150 807505 896289 942869 998344 1009816 937033
13354I37033j19325j22794j38994m5574n6082p1629q0008m2729k9356K7291K3375
$$ 937033 817708 694914 555920 510346 454264 382635 302627 259898 230542 257833 281208
13343B81208M139j0677K987n7048l8668m3788p793J6023J7699l575k7540J9481
$$ 281208 285347 274670 277657 220609 181941 138153 130360 146383 164082 160507 132967 152448
13331A52448k6511L653J8880q239j8487n5791r511J5717L226m9382l3461M6878
$$ 152448 125937 129590 148470 140231 121744 65953 56442 72159 75385 26003 -7458 39420
13319C9420L4479R486o905q406m4483P676P759L1506k6029m8553j1778O0607L7237
$$ 39420 73899 83385 76480 68074 23591 31267 39026 70532 44503 -4050 -15828 44779 82016
13306H2016J5814k8629l3515J2095k8543J2872L2950j680K5822L1532J9429k9884
$$ 82016 97830 69201 35686 47781 19238 32110 65060 63380 89202 120734 140163 110279
13294A10279l2280k1954l6973J7860j1293m654J6143Q36K9388J5962K9133k0937
$$ 110279 77999 56045 19072 36932 25639 20985 37128 37964 67352 83314 112447 91510
13282I1510o5923K3289K7653l5899p061m1328J986M687N1458m8849K2461J7811
$$ 91510 25587 48876 76529 40630 33569 -7759 -5773 -1086 50372 1523 23984 41795
13270D1795P063J4503q69j3084o7061m153K3791n6557j13160K1991M5764J9968
$$ 41795 48858 63361 62492 49408 -17653 -21806 1985 -54572 -167732 -145741 -99977 -80009
13258h0009J432r110M975j3989j7269P5165O2756n485j3652K0970K471P2789k359
$$ -80009 -78577 -87687 -82712 -96701 -113970 -38805 23951 18466 4814 25784 28255 101044 98685
13245I8685n5633l3932j1663k4826J3057k5101K1919Q93l9635m2984J6049N000
$$ 98685 43052 9120 -2543 -27369 -14312 -39413 -17494 -16601 -56236 -99220 -83171 -78171
13233g8171R031K8201p15L3366O2617N3435n3330q4144j9097N54O413O3538K3511
$$ -78171 -69140 -40939 -41654 -8288 54329 107764 54434 -29710 -48807 -48253 -41840 21698 45209
13220D5209j8013k278P211P079m4435m4282k9958L1267K6745J1124n175L7871
$$ 45209 27196 24918 32129 39208 -5227 -49509 -79467 -48200 -21455 -10331 -15506 22365
13208B2365j7577j0911J3427K7769j9240l9166J1804J7046j9901m6717M4532O1273
$$ 22365 4788 -6123 7304 35073 15833 -23333 -11529 5517 -14384 -61101 -16569 44704
13196D4704L0178o1870j7401K6516L3519J0109k8021l699K2953m2584m4869j4527
$$ 44704 74882 13012 -4389 22127 55646 65755 37734 34035 56988 14404 -30465 -44992
13184d4992J8536O371l396L2095J5553K024K993j1214j6688o116k878k2506J0016
$$ -44992 -26456 -20085 -23481 8614 24167 26191 29184 17970 1282 -4834 -7712 -30218 -20202
13171b0202R327O2521o509o1521j5706J3424m092L1820J9024m7948j945M9140
$$ -20202 -10875 51646 45137 -16384 -32090 -18666 -22758 9062 28086 -19862 -21807 27333
13159B7333J4933k2874P202P557J1442K6206N123m5660q891r253j4317O234K922
$$ 27333 42266 19392 26594 34151 45593 71799 76922 31262 22371 13118 -1199 5035 7957
13146G957j9075J7952N0316M8804J8917m0984p5656k2035l6386J6561N3984M8037
$$ 7957 -11118 6834 57150 105954 124871 83887 8231 -13804 -50190 -33629 20355 68392
13134F8392k9030o7472K3655K3435j6629J0029L0814N441m6446k1578L3774L9786
$$ 68392 39362 -28110 -4455 18980 2351 12380 43194 48635 2189 -19389 14385 54171
13122E4171J8184Q97o229j7318m560k35L8804l5466j7499J5544l7680l8035j4953
$$ 54171 72355 73252 67023 49705 45145 44910 83714 48248 30749 46293 8613 -29422 -44375
13109d4375R987o242L6202L1415L777j2391j3697j8220J8884l6816k6653O2144
$$ -44375 -34388 -40630 -4428 26987 30764 18373 4676 -13544 5340 -31476 -58129 4015
13097D015K4986j0292K3406p448K2270J2270l1159m645O383l2259o087K4518M2527
$$ 4015 29001 18709 42115 34667 56937 69207 38048 33403 39786 7527 1440 25958 68485
13084F8485K7888l3775k1642K6524n6898l7474N0567l334Q8j3049N742L1939K5415
$$ 68485 96373 62598 40956 67480 10582 -26892 23675 20341 20429 7380 13122 45061 70476
13071G0476k2905L7766J3429j160l2956j7786J8912L9827l1244k9077j3436K0079
$$ 70476 47571 85337 98766 97606 64650 46864 65776 105603 74359 45282 31846 51925
13059E1925n751J254J6640k2650m5500j6802K446k3398L6408L9638k6112R180
$$ 51925 46174 47428 64068 41418 -4082 -20884 -18438 -41836 -5428 34210 8098 17278
13047A7278O263n3377k9074O7001L8685k7628j2273q375J4053m2961k2658N0975
$$ 17278 23541 -29836 -58910 8091 46776 19148 6875 -1500 12553 -30408 -53066 -2091
13035b091N428j4078N0038K0181K1982K7754J0550p4094k6460L8562P32k4202
$$ -2091 3337 -10741 39297 59478 81460 109214 119764 45670 19210 57772 58504 34302
13023C4302M2153r529J8533j6361J1645j5509k3916q724k8278m3906K8974J147
$$ 34302 76455 66926 85459 69098 80743 65234 41318 32594 4316 -39590 -10616 -9469
13011i469l270L5259L1028J2687l4488K4071O4473j4497k8347j1207m8651L4006
$$ -9469 -12739 22520 53548 66235 31747 55818 120291 105794 77447 66240 17589 51595
12999E1595K71l56J459m9032n668J4032o938N6381J3165j1330K348M5362l1657
$$ 51595 51866 51510 52969 3937 -1731 12301 5363 61744 74909 63579 65927 111289 79632
12986G9632o2461J7235J8979j2087J1166L1139m6378n1643k454L3326J6842K8283
$$ 79632 17171 34406 53385 41298 52464 83603 37225 -14418 -16872 16454 33296 61579
12974F1579N6294j3033j2360R62p106k7632k8304K1497J148K5235k704j7281q703
$$ 61579 117873 104840 92480 93442 86336 58704 30400 51897 53045 78280 75576 58295 49592
12961D9592k3566m2531J5108N4272M272l2871L4064k3353n3743q020J6555R020
$$ 49592 26026 -16505 -1397 52875 57147 24276 58340 34987 -18756 -26776 -10221 -1201
12949a201o892L7616L1226j7183j0202j271j1903j3361J5509L8153J3800m2368
$$ -1201 -8093 29523 60749 43566 33364 32093 20190 6829 22338 60491 74291 31923
12937C1923j5677K169J4059R309J5842l775R427k7827P6908L4496m4862j6179
$$ 31923 16246 18415 32474 41783 57625 53850 63277 35450 112358 146854 101992 85813
12925H5813K216k8447m1626k1213m3818L2517M9206J3444M0J8827j3084n3376
$$ 85813 88029 59582 17956 -3257 -47075 -14558 34648 48092 48132 66959 53875 499
12913D99L1400l057j4327l569n868M4222j1220R193J2344k3550q626L74O493L6348
$$ 499 31899 28842 14515 10946 5078 49300 38080 47273 59617 36067 27441 27815 34308 70656
12899G0656m096O374k0528l9054j3008j6207L4510M3109j1255L4425P6581K1374
$$ 70656 66560 72934 52406 13352 344 -15863 18647 61756 50501 84926 161507 182881
12887A82881k9081n7665j2705k2342j7141L1293P527l114q400l7918o175J7346
$$ 182881 153800 96135 83430 61088 43947 75240 82767 79653 71253 33335 27160 44506
12875D4506J4748K1867j0397q920l1352k099Q031J575k904J0481J1964j2523Q834
$$ 44506 59254 81121 70724 61804 30452 28353 36384 37959 35055 45536 57500 44977 53811
12862E3811k4732R504K1706m1135Q393N8912J1166k9938M87j4152k9871K6620
$$ 53811 29079 38583 60289 19154 27547 86459 97625 67687 68174 54022 24151 50771
12850E0771N250j9637j9546l4911J2608K5861K5982M309J4976J658j8282J1685
$$ 50771 56021 36384 16838 -18073 -5465 20396 46378 50687 65663 67321 49039 60724
12838F0724L5110k0359L626K0703J4475m7806p620k322J6327K2515m0951P157
$$ 60724 95834 75475 79101 99804 114279 66473 58853 56531 72858 95373 54422 61579
12826F1579Q1835J1757l5865l3712m3679J3880M7749m1906l1994k2353k6004Q334
$$ 61579 143414 155171 119306 85594 41915 55795 103544 61638 29644 7291 -18713 -10379
12814a0379P4026J3149k5225J6373K1440L5738Q074L2371m5876n3934m9621l715
$$ -10379 63647 76796 51571 67944 89384 125122 133196 165567 119691 65757 16136 12421
12802A2421K4749o361J6033k796j9803J4513j0091k9437L1228M4871J3850L631
$$ 12421 37170 30809 46842 44046 24243 38756 28665 -772 30456 75327 89177 92808
12790I2808K1052K9310k7231n6794n0772J0558l3965q252L5854j0421k9092N724
$$ 92808 113860 143170 115939 59145 8373 18931 -15034 -23286 12568 2147 -26945 -21221
12778b1221L2814O0680j525o3357J072P5921K1038L0082j9974n7686k434P6106
$$ -21221 11593 72273 70748 7391 8463 84384 105422 135504 115530 57844 55410 131516
12766A31516q814o869j7289j1160J5737J8384m5038j6637j2189L0039N5652N477
$$ 131516 122702 115833 98544 87384 103121 121505 76467 59830 47641 77680 133332 138809
12754A38809n2516l6281L0717j3584j9919K7573L2406M1872P776j6474m6395l3963
$$ 138809 86293 50012 80729 67145 47226 74799 107205 149077 156853 140379 93984 60021
12742F0021K9442L9269L1733J1P31k9523p4090j6752O1375M3798m989J1968J9164
$$ 60021 89463 128732 160465 160476 161207 131684 57594 40842 102217 146015 141026 152994 172158
12729A72158M9613q69o5336n2937K8513K8169K9055K2504j0838k2025j9092K1013
$$ 172158 221771 220902 155566 102629 131142 159311 188366 210870 200032 178007 158915 179928
12717A79928Q494o1617j1479J8629J0998m834K4447j8252J475O9916Q2669K0428
$$ 179928 188422 126805 115326 133955 144953 140119 164566 146314 147789 217705 300374 320802
12705C20802k183N4075L9393j1607j4261k8355J980L4826R162K3700l4170o2553
$$ 320802 318619 372694 412087 400480 386219 357864 359844 394670 403832 427532 393362 330809
12693C30809p3126m6893M7388L2826n808L9671P097L912J5346j9239l3045L717
$$ 330809 257683 210790 258178 291004 285196 324867 331964 335876 351222 331983 298938 302655
12681C02655L6169O028j9840j523Q772j1119J5682r14J9588M4381q128L8864O872
$$ 302655 338824 344852 325012 323489 332261 321142 336824 335910 355498 399879 391751 430615 437487
12668D37487J0465k6064k8631M897j3405l3434l8973M8751K8669k3870m3150j3726
$$ 437487 447952 421888 393257 398154 384749 351315 312342 361093 389762 365892 322742 309016
12656C09016P640Q971r348J6318K7086j3822l8795L5568O523L03P7834O2362K5086
$$ 309016 316656 325627 316279 332597 359683 345861 307066 342634 349157 349460 427294 489656 514742
12643E14742p16K8540l3432k4526j9703J777l7730m2283k4955k4692O512K0091
$$ 514742 514026 542566 509134 484608 464905 466682 428952 386669 361714 337022 343534 363625
12631C63625J8830P951l5223o2186K89P599l0460l760m2396m8790O79J7844r11
$$ 363625 382455 390406 355183 292997 293286 300885 270425 266665 224269 175479 176158 194002 193091
12618A93091k0972k0428m3664P864L5117M1203K4135K7615k268j3938r856J2250
$$ 193091 172119 151691 108027 115891 151008 192211 216346 243961 241693 227755 217899 230149
12606B30149J2233l3325r784M927k2188k0652n0753m0226N9964N1405L1521K4796
$$ 230149 242382 209057 199273 204200 182012 161360 110607 70381 130345 181750 213271 238067
12594B38067K9149q349K3209k6388r492L5303L1594P3634O1072M4663k8815K3147
$$ 238067 267216 258867 282076 255688 246196 281499 313093 386727 447799 492462 463647 486794
12582D86794K0870n055L3419L2001m8305K9074L0962l8151o4565j3154J8303N85
$$ 486794 507664 502609 536028 568029 519724 548798 579760 541609 477044 463890 482193 482778
12570D82778j7432j3052k3131m2395m1215P82l3592j5610J4071N8397O2556K973
$$ 482778 465346 452294 429163 386768 345553 346335 312743 297133 311204 369601 432157 435130
12558D35130j9148Q108j618m544n372l8836Q663R1876Q8283J9961j4203L1660
$$ 435130 415982 424090 422472 417928 412556 373720 382383 474259 562542 582503 568300 599960
12546E99960P2851J08630J26306P1234N0772k7043k6502K0897R755k7641J3754
$$ 599960 672811 781441 907747 978981 1029753 1002710 976208 997105 1006860 979219 992973
12535I92973P2255M6990l027r1529r1551r1793l1633q5393q9208p4102l111j5499
$$ 992973 1065228 1112218 1109191 1017662 926111 834318 802685 717292 628084 553982 550871 535372
12523E35372K1405L7290J0712K2492M462q846m3084k8011P039j5026l4962K9372
$$ 535372 556777 594067 604779 627271 631733 622887 579803 551792 558831 543805 508843 538215
12511E38215j1984k089L2303M2846O5245L7018m153k9952k5453N1188K0864k5143
$$ 538215 526231 524142 556445 599291 664536 701554 697401 667449 641996 693184 714048 688905
12499F88905p672J7863J9400l7762n5524o009m7752J1942L7237m7455n0358N617
$$ 688905 681233 699096 718496 680734 625210 619201 571449 583391 620628 573173 522815 528432
12487E28432k1212n5136k6867k551L7629j445J1113l2518j5748J3855j6209o0674
$$ 528432 507220 452084 425217 422666 460295 458850 469963 437445 421697 435552 419343 358669
12475C58669Q433O527l0394l0571K9719p859N6650P593O993q247J1528Q7263L1621
$$ 358669 367102 373629 343235 312664 342383 334524 391174 398767 405760 397513 409041 496304 527925
12462E27925m3300l761m586l3242L005M3760m5779k8385R856j79j0352K4508K211
$$ 527925 484625 480864 476278 443036 446041 489801 444022 415637 425493 425314 414962 439470 441681
12449D41681L148L006K72l970M135L7171r340J2680m338l739j4556k5572L4035
$$ 441681 444829 447835 448107 444137 448272 485443 476103 488783 484445 480706 466150 440578 474613
12436D74613O3697L7010K1134j5067Q594M7101N3302N9918J3227O458N3955K3971
$$ 474613 538310 575320 596454 581387 589981 637082 690384 750302 763529 769987 823942 847913
12424H47913K7494M8797O5035L2263L6680l751N2111L7506l9578q4545r6741n2144
$$ 847913 875407 924204 989239 1021502 1058182 1054431 1106542 1144048 1104470 1019925 923184 871040
12412H71040o5994n6334m4727P249K2980k0372o1031k5124l078j7388n6580m485
$$ 871040 805046 748712 703985 711234 734214 713842 652811 627687 624609 607221 550641 546156
12400E46156K2833L374O0897P805m4439K4072M5124J1150n1431k230k6576k9779
$$ 546156 568989 572363 633260 641065 596626 620698 665822 676972 625541 623311 596735 566956
12388E66956K8557L7829k734M63o431J7097K6160l2372k8506O71k1632n129J1053
$$ 566956 595513 633342 630608 631071 624640 641737 667897 635525 607019 607690 586058 580929 591982
12375E91982M7497L1135J0767L7471k5461k9882R616P376m3155l2092l0377r119
$$ 591982 639479 670614 681381 718852 693391 663509 673125 680501 637346 605254 574877 565758
12363E65758L9335K1732l3208J0897J3380l0414K3506J7424J0807M9899p505J3551
$$ 565758 605093 626825 593617 604514 617894 587480 610986 628410 639217 689116 681611 695162
12351F95162j8067k2656L4968K3576K031J0351j126l4960L0219M9591k5040k0762
$$ 695162 677095 654439 689407 712983 715014 725365 724239 689279 719498 769089 744049 723287
12339G23287M3870N1304N213j2315o0500j0006M5194P2769N3532l158P749N3166
$$ 723287 767157 818461 823674 811359 750859 740853 786047 858816 912348 909190 916939 970105
12327I70105K9492J1260j3300o231P739J1333P5652O2233M7311L7217P291M7851
$$ 970105 999597 1010857 997557 991326 999065 1010398 1086050 1148283 1195594 1232811 1240102 1287953
12315A287953K6996M1577R555L8820R8776J05635N2797L8542J18312J20390J16332
$$ 1287953 1314949 1356526 1366081 1404901 1503677 1609312 1662109 1700651 1818963 1939353 2055685
12304B055685J02970Q1772J73345J64021J86284K82317L55358M04643M40239N24627
$$ 2055685 2158655 2240427 2413772 2577793 2764077 3046394 3401752 3806395 4246634 4771261
12294D771261N85206P31051Q80964J066011J374832J828308K483232L290535M343927
$$ 4771261 5356467 6087518 6968482 8034493 9409325 11237633 13720865 17011400 21355327
12285B1355327N456348O499048O950273O439770M923617K568541j68882k639163
$$ 21355327 26811675 33310723 40260996 46700766 51624383 54192924 54024042 51384879
12277E1384879m368048n194387n144077m573349l743623k906804k092031j429946
$$ 51384879 47016831 41822444 36678367 32105018 28361395 25454591 23362560 21932614
12269B1932614q41386k14373L43752R18638J483427K134719K606274K786825K658043
$$ 21932614 21091228 20876855 21220607 22139245 23622672 25757391 28363665 31150490 33808533
12260C3808533K272696J711229J264409J199005J521302K056140K641961K947383
$$ 33808533 36081229 37792458 39056867 40255872 41777174 43833314 46475275 49422658
12252D9422658K764200K161613J161243p4574j204322k148799k657922k710736
$$ 49422658 52186858 54348471 55509714 55435140 54230818 52082019 49424097 46713361
12244D6713361k404998j672418r26106m59990m14540p43219j401658k079300k504757
$$ 46713361 44308363 42635945 41709839 41249849 40835309 40092090 38690432 36611132 34106375
12235C4106375k557662k287527j788665j144726n05082L7572O63011J374883K246002
$$ 34106375 31548713 29261186 27472521 26327795 25822713 25860285 26523296 27898179 30144181
12226C0144181L194806M360300N475215O331283O546258N992358M272535J465178
$$ 30144181 33338987 37699287 43174502 49505785 56052043 62044401 66316936 67782114
12218F7782114j758124m656016o625923p299661o855374n774042m541680l451563
$$ 67782114 66023990 61367974 54742051 47442390 40587016 34812974 30271294 26819731
12210B6819731k687439k104446j641959j343037j136410j043607r62075q09303
$$ 26819731 24132292 22027846 20385887 19042850 17906440 16862833 15900758 15091455
12202A5091455p31874p08931o29233n40976n17446m22868l36401l77963l19128
$$ 15091455 14359581 13650650 13021417 12480441 11962995 11540127 11203726 10825763 10506635
12193A0506635k65252k65801k17066k03816k47768k14178k32354k07753j23009
$$ 10506635 10241383 9975582 9758516 9554700 9306932 9092754 8860400 8652647 8529638
12184H529638j35229j15004j09188p5343r3071p6999K281O8955K4418P0169J88352
$$ 8529638 8394409 8279405 8170217 8094874 8001803 7924804 7927085 7996040 8020458 8090627 8278979
12173H278979J90450K12852K93472L98257M96496O88576Q77266J134511J558671
$$ 8278979 8469429 8682281 8975753 9374010 9870506 10559082 11436348 12570859 14129530
12164A4129530K135825K994747M152002N479269O691068P284542O772465M894583
$$ 14129530 16265355 19260102 23412104 28891373 35582441 42866983 49639448 54534031
12156E4534031J876669j641027m582024o342597o630376n946561m771224l555804
$$ 54534031 56410700 54769673 50187649 43845052 37214676 31268115 26496891 22941087
12148B2941087k517576j869842j406304j076702p91336o02367m86299l99699l26791
$$ 22941087 20423511 18553669 17147365 16070663 15279327 14676960 14190661 13790962 13464171
12139A3464171k90824k31807r0290J5051K21467M70382O09930P98284Q93231J058636
$$ 13464171 13173347 12941540 12851250 12866301 13087768 13558150 14168080 14966364 15859595 16918231
12129A6918231J140787J337150J577725J991456K626101L762663N388641P448927
$$ 16918231 18059018 19396168 20973893 22965349 25591450 29354113 34742754 42191681
12121D2191681R765806J1917266J3074084J2496480R743754M750943j244148o813078
$$ 42191681 51957487 63874753 76948837 89445317 99189071 103940014 102695866 95882788
12113I5882788j0632017j2061198j1521395r835245p772511n761587m131945k961135
$$ 95882788 85250771 73189573 61668178 51832933 44060422 38298835 34166890 31205755
12105C1205755k188272j738776j467589j338537j294012j313148j211559j108472
$$ 31205755 29017483 27278707 25811118 24472581 23178569 21865421 20653862 19545390
12097A9545390j000254q21133n90315m36636l09802j63818m9439N9376J58622
$$ 19545390 18545136 17724003 17133688 16697052 16387250 16223432 16173993 16233369 16391991
12088A6391991L29176M91529P98846J163462J670722K447286L463090M748278
$$ 16391991 16721167 17212696 18011542 19175004 20845726 23293012 26756102 31504380
12080C1504380O131644P156402P442481O508263L974610L56630l344776o114333
$$ 31504380 37636024 44792426 52234907 58743170 62717780 63074410 59729634 53615301
12072E3615301p433721p323317o215452m873000l654245k700881k068864j588841
$$ 53615301 46181580 38858263 32642811 27769811 24115566 21414685 19345821 17756980
12064A7756980j292046j023023q78495q21673p16851o77998o66461n62882m42725
$$ 17756980 16464934 15441911 14563416 13741743 13024892 12346894 11680433 11117551 10674826
12055A0674826m36224m33547l93198l69384l08474k95169k95214k35810k01863
$$ 10674826 10238602 9805055 9411857 9042473 8733999 8438830 8143616 7907806 7705943
12046G705943k30225k01813k34619j77043j74703j92124j88750j67684r6005j40223
$$ 7705943 7475718 7273905 7039286 6862243 6687540 6495416 6306666 6138982 6042977 5902754
12036E902754j23689q0348j62454j22590r5697j29270j59408j66615j03531j43169
$$ 5902754 5779065 5698717 5536263 5413673 5317976 5188706 5029298 4862683 4759152 4615983
12026D615983j10779q6363j23764j03212j43606j33142j41998p7904m0050l8955
$$ 4615983 4505204 4418841 4295077 4191865 4048259 3915117 3773119 3695215 3655165 3616210
12016C616210p4129p9927q7373j23562r9872r4661q4285r1146m3624m1611p1076
$$ 3616210 3542081 3462154 3374781 3251219 3151347 3056686 2972401 2881255 2837631 2796020 2724944
12005B724944k6634o8280r3315k8426k9911q4309o5679m4973J6899k5414p4360
$$ 2724944 2698310 2630030 2536715 2508289 2478378 2394069 2328390 2283417 2300316 2274902 2200542
11994B200542n0755l2932K7177m1487j15572o2509l36k9435p2383p2692k6509
$$ 2200542 2149787 2116855 2144032 2102545 1986973 1924464 1924128 1894693 1822310 1749618 1723109
11983A723109o2109l1754l0851j9548l5761n1041o6569n7702p4976j2382r810
$$ 1723109 1661000 1629246 1598395 1578847 1543086 1492045 1425476 1367774 1292798 1280416 1270606
11972A270606j5068j7037l8593K13l8562J669k3484j060J2428l7056n619r120
$$ 1270606 1255538 1238501 1199908 1200121 1161559 1163228 1139744 1138684 1151112 1114056 1108437 1099317
11960A099317k5420j8874O018P461j1041n6741l9018m7868l2024l1559L7783j2568
$$ 1099317 1073897 1055023 1061041 1068502 1057461 1000720 961702 913834 881810 850251 888034 875466
11948H75466m8950j4774J6521m299o365j8362l7949m5701J5162k5577m6032J0197
$$ 875466 826516 811742 828263 823964 817599 799237 761288 715587 730749 705172 659140 669337
11936F69337k1010k333J3656K1210j9958O202Q920m2750j0031L584l1377j23532
$$ 669337 648327 645994 659650 680860 660902 667104 676024 633274 623243 626827 595450 471918
11924D71918j1495O655k7748m704M5272K9683l5104k8531P144n3632r766K4559
$$ 471918 460423 467078 439330 434626 479898 509581 474477 445946 453090 399458 389692 414251
11912D14251Q2505M5724M44J7966k1022j673M418L0555K2587P1199J52744J81778
$$ 414251 496756 542480 542924 560890 539868 538195 542613 573168 595755 666954 819698 1001476
11900A001476K11584K92538L19251K97981J11985j12417l09985l39449k32700
$$ 1001476 1213060 1505598 1824849 2122830 2234815 2122398 1812413 1472964 1240264
11891A240264k19356j31017j01022j03535n4454k735k7177r4912n0227q02J6084
$$ 1240264 1020908 889891 788869 685334 630880 628145 600968 506056 455829 455027 471111
11880D71111k557p7541k8154K9122j2913j3008l0123K1120j0589k575J5709K7445
$$ 471111 468554 391013 362859 391981 379068 366060 335937 357057 346468 343893 359602 387047
11868C87047j3777m7807j7396R374q634j143j896M2045N8090j0833N799k7055
$$ 387047 373270 325463 308067 317441 308807 307664 305768 347813 405903 395070 400869 373814
11856C73814j0706L6108J5607N2416l230R722m273n508j5558j2771j5150k6364
$$ 373814 363108 399216 414823 467239 464009 473731 469458 463950 448392 435621 420471 394107
11844C94107M282m5526p2696K0433J650j61l2453N200J7438j4444r398L3164L0164
$$ 394107 398389 352863 280167 300600 302250 302089 269636 274836 292274 277830 268432 301596 331760
11831C31760K2263J6921M6486L565L0998O5316J8712n5127k6801Q069m4813m7182
$$ 331760 354023 370944 417430 420995 451993 517309 536021 480894 454093 462162 417349 370167
11819C70167k2026j9745M1966K6137o586K0902J1273k2472l1159M8410K0329l1533
$$ 370167 348141 328396 370362 396499 389913 410815 422088 399616 368457 416867 437196 405663
11807D05663m6013m2240l9806l7445r152K7480J4493J6949m4770j1627L7231R169
$$ 405663 359650 317410 277604 240159 231007 258487 272980 289929 245159 233532 270763 279932
11795B79932N1141N8166J9335M6700P4254p217j4126p6149l6505r720r449l6050
$$ 279932 331073 389239 408574 455274 529528 522311 508185 432036 395531 385811 376362 340312
11783C40312J0854m1802q6609K1102L2800k4734n4096m7180l6422Q650K5490j263
$$ 340312 351166 309364 222755 243857 276657 251923 197827 150647 114225 122875 148365 147102
11771A47102M164M4991J272k5204m8441m8278j814P7603L5678q413n7766J0535
$$ 147102 151266 196257 197529 172325 123884 75606 73792 151395 187073 178660 120894 131429
11759A31429J6357L590J5064j1156l6694j5310n62k6335J8876j5700l8218K3698
$$ 131429 147786 151376 166440 155284 118590 103280 102718 76383 95259 79559 41341 65039
11747F5039K7139K6202L7899m3877J4168L8838k4326k258o1293k7389O2721N7226
$$ 65039 92178 118380 156279 112402 126570 165408 141082 138824 77531 50142 112863 170089
11735A70089M2150K5837L7256j1189k2549J6107n695j0432P650Q0020K2694K6153
$$ 170089 212239 238076 275332 264143 241594 257701 252006 241574 249224 329244 351938 378091
11723C78091j5436m1199l9899m8167J0193J8376p0681O854l6141k9899m620N4425
$$ 378091 362655 321456 281557 233390 243583 261959 191278 198132 161991 132092 127472 181897
11711A81897L2204R347r832k1589n3035R809J3041J9673O350K4677J6100l0923
$$ 181897 214101 223448 213616 192027 138992 148801 161842 181515 187865 212542 228642 197719
11699A97719j3963K5455K8665M4473k4972o0148J7510J409L999O9537J2246L9281
$$ 197719 183756 209211 237876 282349 257377 197229 214739 216148 220147 289684 301930 341211
11687C41211P0535M9852P4235P6601O1362n6402r1594l3505m6519n200J833l4393
$$ 341211 411746 461598 535833 612434 673796 617394 525800 492295 445776 440576 442409 408016
11675D08016K3428J8480m2874m9289k6127k4472J5022Q917n017l2830l7405k279
$$ 408016 431444 449924 407050 357761 331634 307162 322184 331101 326084 293254 255849 253570
11663B53570j2856J2480M5135j6154j2439j0518p5622K821M0277Q749k142k3029
$$ 253570 240714 253194 298329 282175 269736 259218 183596 186417 226694 235443 233301 210272
11651B10272J1311P5290M8217N2611J6778n83J6875L733K0298J7762K0317j4910
$$ 210272 221583 296873 345090 397701 414479 413896 430771 434504 454802 472564 492881 477971
11639D77971l5661l1246j1052l1841k4100j3592m2324m266L542k6423l3460J261
$$ 477971 442310 411064 400012 368171 344071 330479 288155 283889 287431 261008 227548 228809
11627B28809J7283r916m0781k4435J7443O93r69M0816P8262m656r755K5134k9803
$$ 228809 246092 236176 195395 170960 188403 189096 188127 228943 307205 302549 292794 317928 288125
11614B88125n3200j2089j6799k956Q761j6164j5714J3464K7818m0109j4335L2944
$$ 288125 234925 222836 206037 203081 211842 195678 179964 193428 221246 181137 166802 199746
11602A99746N2798p9759p2276l7169J3475M2531L8289L4191l9251j4381N2307
$$ 199746 252544 172785 100509 63340 76815 119346 157635 191826 152575 138194 190501
11591A90501j3481l3115k081m2584J369N5181K4752J2831j2593n0289L7366K0597
$$ 190501 177020 143905 141824 99240 100609 155790 180542 193373 180780 130491 167857 188454
11579A88454L6572J4302N215N612k3657M209k59n7925k9884Q698l3885k0146o775
$$ 188454 225026 239328 244543 250155 226498 230707 230448 172523 142639 151337 117452 97306 90531
11566I0531K6924J5444k5291m7369k0944M9916K7704J2077K2309k8551k9366l3106
$$ 90531 117455 132899 107608 60239 39295 89211 116915 128992 151301 122750 93384 60278
11554F0278R577K5696K5732m710n9159k1716Q385K2823L0644N2154l3484m3011
$$ 60278 69855 95551 121283 116573 57414 35698 44083 66906 97550 149704 116220 73209
11542G3209J7261k4364m0569J2270j673r050M7145k0066J2241N4138M2067N1070
$$ 73209 90470 66106 25537 37807 36134 27084 74229 54163 66404 120542 162609 213679
11530B13679k3342p3207l1730m2445J994O6998M3480j4415q099j8724J4804j5600
$$ 213679 190337 117130 85400 42955 44949 111947 155427 141012 132913 114189 128993 113393
11518A13393J5693J396P215K3691j2405R533r019j5293l2173l3880j332P965j7778
$$ 113393 129086 130482 137697 161388 148983 158516 149497 134204 102031 68151 66819 74784 57006
11505E7006M217L957K5326m0274k0187R007J3662N302J3417L3286J6656J7880
$$ 57006 61223 65180 90506 50232 30045 39052 52714 58016 71433 104719 121375 139255
11493A39255K2443m072k4649j1807k2733K0494j952q7161k4530L3603M5946K6239
$$ 139255 161698 157626 132977 121170 98437 118931 116979 29818 5288 38891 84837 111076
11481A11076j1638o6811l8656R223J2405k7218L2664O1481k2527l609J9159k087
$$ 111076 99438 32627 -6029 3194 15599 -11619 21045 82526 59999 56390 75549 73462
11469G3462K860P9341j401n3073m1250q664N907K8063n583O34K2611L3371l253
$$ 73462 76322 155663 154262 101189 59939 51275 57182 85245 79662 80296 102907 136278 133025
11456A33025l914j7997J0456J5884l5279O033R165k3961l7036k2778K30j1368
$$ 133025 129111 111114 121570 137454 102175 108208 117373 93412 56376 33598 33828 22460
11444B2460r637R290j3609j9171P0810l509L0884K167j8002k197o551K6339K9510
$$ 22460 12823 22113 8504 -10667 60143 56634 87518 89685 71683 69486 62935 89274 118784
11431A18784R308l8163q0079L2491Q533L675K05N426L143M5944k8455o6696J3547
$$ 118784 128092 89929 9850 42341 50874 54549 54754 60180 63323 109267 80812 14116 27663
11418B7663j6732J6466N9271N7538m0789l4636J0257O4509P196n0101l3073r000
$$ 27663 10931 27397 86668 144206 103417 68781 79038 143547 150743 100642 67569 58569
11406E8569J1675M5547l7733K3618j9551l8452M8128K75j4299R443L1139N1329
$$ 58569 70244 115791 78058 101676 82125 43673 91801 92076 77777 87220 118359 169688
11394A69688o4876q6876j7704K2490k4815n84K0321K7873O606J7060L2929J1282
$$ 169688 104812 17936 232 22722 -2093 -2677 17644 45517 52123 69183 102112 113394
11382A13394j0319K5473k4796m2886k1538l029P298J0133K1790l2487j0655N997
$$ 113394 103075 128548 103752 60866 39328 36299 43597 53730 75520 43033 32378 38375
11370C8375k740L7743K4431J0715j9214j0994J8794n24k9056O595k0473L5265
$$ 38375 35635 73378 97809 108524 89310 78316 97110 96586 67530 74125 53652 88917
11358H8917l241m3942l2924L9328L1174J3042j6315o479q868L4859j4670K4283
$$ 88917 85676 41734 8810 48138 79312 92354 76039 69560 60692 95551 80881 105164
11346A05164j4541k0594k3176L5239L9948q7261j6509J5910j7776M8160O2073
$$ 105164 90623 70029 46853 82092 122040 34779 18270 34180 16404 64564 126637
11335A26637j5991l5975k0537N8089J6069m1278K5210K3052j5307L4363K3242
$$ 126637 110646 74671 54134 112223 128292 87014 112224 135276 119969 154332 177574
11324A77574o2915l7474m7533l8705j2743N7155M3843M6805k78M135K9309L0656
$$ 177574 114659 77185 29652 -9053 -21796 35359 79202 126007 125729 129864 159173 189829
11312A89829L4022L3022j192k0832K6795l5746p1238k3238J5980M337L6211M1784
$$ 189829 223851 256873 255681 234849 261644 225898 154660 131422 147402 151739 187950 229734
11300B29734L4025J8298J8182N3028j746N0400M8503Q445J4546l249l9575p3706
$$ 229734 263759 282057 300239 353267 351521 401921 450424 458869 473415 470166 430591 356885
11288C56885n6530k1252J931j0937N407j5855j0637N5075k4685j8474P3101R1151
$$ 356885 300355 279103 281034 270097 275504 259649 249012 304087 279402 260928 334029 425180
11276D25180O9266N7389R2108L5377j9612m6914l4404m9402m8207j4403k6654
$$ 425180 494446 551835 643943 679320 659708 612794 578390 528988 480781 466378 439724
11265D39724n654M6614L8503R4N779j812M5358J8921j4105k5197M693k2100k5545
$$ 439724 434070 480684 519187 519281 525060 523248 568606 587527 573422 548225 552918 530818 505273
11252E05273M6134k9895p3244l5711p0946N460l1756N7920L9235k1798k2725n9417
$$ 505273 551407 521512 448268 412557 341611 347071 315315 373235 412470 390672 367947 308530
11240C08530j1752K9627M1451R4443R581n333M090j4097R997p494K6014P25m2978
$$ 308530 296778 326405 367856 462299 471880 466547 470637 456540 466537 459043 485057 485782 442804
11227D42804o7333l5716m0527l0314N4042L6974n3838l7797J2879k6128j5304
$$ 442804 375471 339755 299228 268914 322956 359930 306092 268295 281174 255046 239742
11216B39742j6495J2385l42l8090J5751Q844k3483J428j5091j5753P227J8458
$$ 239742 223247 235632 235290 197200 212951 221795 198312 199740 184649 168896 176123 194581
11204A94581q135j4533m904M1492j1814r523l8768J0390j9129l530J2030l97k6853
$$ 194581 186446 171913 167009 208501 196687 187164 148396 158786 139657 136127 148157 147760 120907
11191A20907L501M2076J7433M1668J881l9550l8680N359K6368K1811M5349J9771
$$ 120907 124408 166484 183917 225585 227466 187916 149236 154595 180963 202774 248123 267894
11179B67894k5451j5482o072o2877L627j283o64J7961l8662o08J4316j0202k1275
$$ 267894 242443 226961 220889 158012 161639 160356 159692 177653 138991 138383 152699 142497 121222
11166A21222k6865M3109N0348r248M316L911k5286j519N1430M1022K905j1088
$$ 121222 94357 137466 187814 178566 182882 186793 161507 159988 211418 252440 255345 244257
11154B44257J3721K364j8175l1991k4362k0312R160K5485m8517L0688K4671Q319
$$ 244257 257978 260342 242167 210176 185814 165502 174662 200147 151630 182318 206989 215308
11142B15308Q034p839j7116o681m6196O846L601J713K6343M7692j7466j6270J8789
$$ 215308 223342 215503 198387 191706 145510 152356 155957 157670 184013 231705 214239 197969 216758
11129B16758K1965J1199j4648l0459n1027j1803J9947J2390j6011M5736M9771
$$ 216758 238723 249922 235274 204815 153788 141985 161932 174322 158311 204047 253818
11118B53818R589k6258K6288L2068j6691p575K8334J7402Q9029J05007J26084
$$ 253818 263407 237149 263437 295505 278814 271239 299573 316975 406004 511011 637095
11107F37095J91071L22142M17183L73069J16821j67647l86502m27084k64538j28119
$$ 637095 828166 1150308 1567491 1940560 2057381 1889734 1503232 1076148 811610 683491
11097F83491p4806o163R685j09120n3017q682J7681J2436k5936j323j7435k17
$$ 683491 608685 602522 612207 503087 450070 441388 459069 471505 445569 444246 426811 426594
11085D26594k9932N1025J1638l1643j9259k4918K4273j660L7924J2510j3310M3388
$$ 426594 396662 447687 459325 427682 408423 383505 407778 406118 444042 456552 443242 486630
11073D86630Q8779N3630R343J1935j5937k3l3953o4073m2599l6500R833J7782
$$ 486630 575409 629039 638382 650317 634380 634357 600404 536331 493732 457232 467065 484847
11061D84847Q125m2632j6242m5959R13L6595J9970L442j7163J8063J134n994N4646
$$ 484847 492972 450340 434098 388139 389052 425647 445617 449059 431896 449959 451093 445099 499745
11048D99745j2544l6958L2195J4979j7613j5365L9030N8272N631N6341J8266j1359
$$ 499745 487201 450243 482438 497417 479804 464439 503469 561741 567372 623713 641979 630620
11036F30620k0850k855J1401K4327K3769R479O0064L8426K5743M2512q055M7103
$$ 630620 609770 606915 618316 642643 666412 675891 735955 774381 800124 842636 834581 881684
11024H81684N7478m285j04081j15205n6624p8024j4782o5544l1327K9746M547
$$ 881684 939162 934877 830796 715591 658967 580943 566161 500617 469290 499036 503583
11013E03583L611J0961L847Q3587L8724J7275q31j8040N370M0373j1441j0940
$$ 503583 507194 518155 522002 605589 644313 661588 660757 642717 648087 688460 677019 666079
11001F66079k611M3785k326q8788m3579l3581k3306P631m471o87L9668J60l0399
$$ 666079 663468 707253 704927 616139 572560 538979 515673 523304 518833 518146 557814 557974 527575
10988E27575j6193J4272K0303N0262j6961m6309j7336O651l0386L4512K0611l3814
$$ 527575 511382 525654 545957 596219 579258 532949 515613 522264 491878 526390 547001 513187
10976E13187J3736k699J8087j2712j6670M2359L1947n1239k292k4467K4841J7949
$$ 513187 526923 524224 542311 529599 512929 555288 587235 535996 533704 509237 534078 552027
10964E52027K3931R6j9694l0135o198M8790N9226k16K3425J1492j6764M884L1980
$$ 552027 575958 576054 556360 526225 520027 568817 628043 627827 651252 662744 645980 650864 682844
10951F82844K9624m145J9513k1083r2830k7122L9477J5209j7572K6778K6758K0705
$$ 682844 712468 708323 727836 706753 613923 586801 626278 641487 623915 650693 677451 698156
10939F98156L5907k9745P354L619M9263J7391m7864P471J8627M8695R506J2370
$$ 698156 734063 704318 711672 715291 764554 781945 734081 741552 760179 808874 818380 830750
10927H30750K3501K5806M7550L9726J6166M1813J8531M6057J4365N1745K6046
$$ 830750 854251 880057 927607 967333 983499 1025312 1043843 1089900 1104265 1156010 1182056
10916A182056J4696J4777O3860M2871J8018R2764L3165P5312J28594Q2542P5002
$$ 1182056 1196752 1211529 1275389 1318260 1336278 1429042 1462207 1537519 1666113 1748655 1823657
10905A823657R2058R4662J56418J96343J79453J77324J38687J93890K34892L16261
$$ 1823657 1915715 2010377 2166795 2363138 2542591 2719915 2858602 3052492 3287384 3603645
10895C603645L30958L77863M51502N95781P70117R58468J235476J489289J921329
$$ 3603645 3934603 4312466 4763968 5359749 6129866 7088334 8323810 9813099 11734428
10886A1734428K594725L368802M466356N683924O795063P622228P546030O139913
$$ 11734428 14329153 17697955 22164311 27848235 34643298 42265526 49811556 55951469
10878E5951469L735814O99868k413156m827829o153385o318396n578521m429976
$$ 55951469 59687283 60387151 57973995 53146166 46992781 40674385 35095864 30665888
10870C0665888l362411k417344j622569r19076l15331K70608J054809J856022
$$ 30665888 27303477 24886133 23263564 22344488 22029157 22299765 23354574 25210596
10862B5210596K566583L043597K932542K127404J096536K07923k83474j61155
$$ 25210596 27777179 30820776 33753318 35880722 36977258 37185181 36901707 36740552
10854C6740552M93185J657497L026130M099111M547069M178234L034458J213429
$$ 36740552 37233737 38891234 41917364 46016475 50563544 54741778 57776236 58989665
10846E8989665q51368k503233l498962l645929l055606j997859r75830j96451
$$ 58989665 58138297 55635064 52136102 48490173 45434567 43436708 42460878 42264427
10838D2264427J2465m21465j244497k359262l186879l386857k921900k103601
$$ 42264427 42276892 41855427 40610930 38251668 35064789 31677932 28756032 26652431
10830B6652431j306323o00177J4941O76995J348474K081419K953664L915042M832503
$$ 26652431 25346108 24745931 24760872 25437867 26786341 28867760 31821424 35736466 40568969
10821D0568969N539775N708270N096268L503048J166163j442949l779704n404663
$$ 40568969 46108744 51817014 56913282 60416330 61582493 60139544 56359840 50955177
10813E0955177o133038o008770n240790m257093l342062k665586k059057j657396
$$ 50955177 44822139 38813369 33572579 29315486 25973424 23307838 21248781 19591385
10805A9591385j357966j160288j005896q49094p54305o43358n76285n21278m86389
$$ 19591385 18233419 17073131 16067235 15218141 14463836 13820478 13244193 12722915 12236526
10796A2236526m84934m68058m71455m06934l60353k96938k98681k77001k43201
$$ 12236526 11751592 11283534 10812079 10405145 10044792 9747854 9449173 9172172 8928971
10787H928971k71017k66071k76267k37496k44980k36671k08295j85851j47823
$$ 8928971 8657954 8391883 8115616 7878120 7633140 7396469 7188174 7002323 6854500
10778F854500j96124j86737j40727j83967j18454r5383r0356j09847q8335q3681
$$ 6854500 6658376 6471639 6330912 6146945 6028491 5933108 5842752 5732905 5644570 5560889
10768E560889j4177J1048J01969J19058J19613J50720Q7519o7066j58097j59797
$$ 5560889 5546712 5557760 5659729 5778787 5898400 6049120 6136639 6069573 5911476 5751679
10758E751679p2075p685L5176J18570J42784P1158j38441l30519m28392m13532
$$ 5751679 5679604 5671919 5707095 5825665 5968449 6039607 5901166 5570647 5142255 4728723
10748D728723k72899k24100j81818k18177j35808n5388l5081l0549j8344J4836
$$ 4728723 4455824 4231724 4049906 3831729 3695921 3640533 3605452 3574903 3556559 3571395
10738C571395O5222N7834N3876P8113j27534k37263k03420j52367r6713j04553
$$ 3571395 3636617 3694451 3748327 3826440 3698906 3461643 3258223 3105856 3009143 2904590
10728B904590q7235n1763k1112K149m3337r7728q1048N2586k9866o9144j9028
$$ 2904590 2817355 2765592 2744480 2746629 2703292 2605564 2524516 2577102 2547236 2478092 2459064
10717B459064m5424n2691n2038m014k0637l9106m2934K459L3843q940J7624q613
$$ 2459064 2413640 2360949 2308911 2304897 2284260 2245154 2202220 2204679 2238522 2229582 2247206 2238593
10705B238593m1369J0273J2445k5561j5459k2813K3693j7151q8365j0341K7889
$$ 2238593 2197224 2207497 2219942 2194381 2178922 2156109 2179802 2162651 2074286 2063945 2091834
10694B091834R863P1489P1077J500o917L2964M4450L4386M8426N5493R0699Q8103
$$ 2091834 2101697 2173186 2244263 2245763 2238846 2271810 2316260 2350646 2399072 2454565 2545264 2633367
10682B633367O9179J10287J53178J80362J99915J64924K21579J82983K00835K17270
$$ 2633367 2702546 2812833 2966011 3146373 3346288 3511212 3732791 3915774 4116609 4333879
10672D333879L16620L97153M76176N84708P31206R52467J199890J552037K125701
$$ 4333879 4650499 5047652 5523828 6108536 6839742 7792209 8992099 10544136 12669837
10663A2669837K819198L757803M864269N720496O090428N717675M297682K255213
$$ 12669837 15489035 19246838 24111107 29831603 35922031 41639706 45937388 48192601
10655D8192601K2746k080083l795084m571114m395218l502137k407003j494196
$$ 48192601 48215347 46135264 42340180 37769066 33373848 29871711 27464708 25970512
10647B5970512r60522q83775r11972j049704j035669q29299m52330L2415P33016
$$ 25970512 25009990 24126215 23214243 22164539 21128870 20299571 19847241 19879656 20612672
10638B0612672J443637K074182K584889K704971K321004J641113Q04712L5034
$$ 20612672 22056309 24130491 26715380 29420351 31741355 33382468 34187180 34222214
10630C4222214k17086J33707J052855K281242L415838M178735M293827L642790
$$ 34222214 34005128 34138835 35191690 37472932 40888770 45067505 49361332 53004122
10622E3004122K329734L66932j680671l339079m213411m378836l879679k907479
$$ 53004122 55333856 55700788 54020117 50681038 46467627 42088791 38209112 35301633
10614C5301633j622223l71976N78787J103932J091583O34612k69834j194430j980608
$$ 35301633 33679410 33307434 33886221 34990153 36081736 36716348 36446514 35252084 33271476
10605C3271476k461905k468039k072816j397029n88375J14203P65897J298547
$$ 33271476 30809571 28341532 26268716 24871687 24283312 24397515 25163412 26461959
10597B6461959J572671J728704J768442J958380K417302L213858M405506N617784
$$ 26461959 28034630 29763334 31531776 33490156 35907458 39121316 43526822 49144606
10589D9144606O185943N706792L783074O86882k715950n442932p093189p303265
$$ 49144606 55330549 61037341 64820415 65507297 62791347 57348415 50255226 42951961
10581D2951961o454500n214361m028468l035043k361726j773411j425875j206097
$$ 42951961 36497461 31283100 27254632 24219589 21857863 20084452 18658577 17452480
10573A7452480j091945r57815q30106o85539n95640n26077m89348n11249m61169
$$ 17452480 16360535 15402720 14572614 13887075 13291435 12765358 12276010 11764761 11303592
10564A1303592l76693l55814l82705l73876l74752l09904k70819k98181k91209
$$ 11303592 10926899 10571085 10188380 9814504 9439752 9129848 8859029 8560848 8269639
10555H269639k63535k40935k62571k06475j67710j96476j46883j26900j67055
$$ 8269639 8006104 7765169 7502598 7296123 7128413 6931937 6785054 6658154 6491099
10546F491099j42433j11838m0558l1116l5718j3699j6651j39981k69792k91065
$$ 6491099 6348666 6236828 6196270 6165154 6129436 6115737 6099086 5959105 5689313 5398248
10536E398248j94885j38861r5491j23071j06570r1239m6078q5425j04428j42946
$$ 5398248 5203363 5064502 4969011 4845940 4739370 4648131 4602053 4516628 4412200 4269254
10526D269254j58598j58980o2704l7617q6678m0280n7039m9444n6441j08671r8009
$$ 4269254 4110656 3951676 3888972 3851355 3764677 3724397 3667358 3617914 3561473 3452802 3354793
10515C354793j00746j02737n8278n3227r5664n0896o004q1248o5k0361p9106j01436
$$ 3354793 3254047 3151310 3093032 3039805 2944141 2893245 2887241 2805993 2805928 2785567 2706461 2605025
10503B605025j01786m2000j7444j3682n8966m7335k2376n1720m3843n9189q7827
$$ 2605025 2503239 2461239 2443795 2430113 2371147 2323812 2301436 2249716 2205873 2146684 2058857
10492B058857p7538J4963N9100n843N26K8569K9611m5342p288O659k4410j642
$$ 2058857 1981319 1996282 2055382 2049539 2050065 2078634 2108245 2062903 2055615 2062274 2037864 2036222
10480B036222m5960n322K3562m0528n4283n9533m5256m3942n1781K0478M14K997
$$ 2036222 1990262 1984940 2008502 1967974 1913691 1854158 1808902 1764960 1713179 1733657 1734071 1737068
10468A737068J2573J350k2216J4094k4513q9825q3424L9670K9381K1677J2873
$$ 1737068 1749641 1750991 1728775 1742869 1718356 1628531 1545107 1584777 1614158 1635835 1648708
10457A648708m0081p0483k8042L5457K082k3609j1492m7324j9251l0813M5328
$$ 1648708 1608627 1538144 1510102 1545559 1547641 1524032 1512540 1465216 1445965 1415152 1460480
10446A460480M5464M5933M0772N2629L6043k3620j7472m3915k666K841l9323m3507
$$ 1460480 1505944 1551877 1592649 1645278 1681321 1657701 1640229 1596314 1593648 1596489 1557166 1513659
10434A513659J0878l6051L2012J06365M8495n885L1377j757l8347p5079l3435
$$ 1513659 1524537 1488486 1520498 1626863 1675358 1669473 1700850 1699093 1660746 1585667 1552232
10423A552232j8811m2496l4074m4128k5113K017j2895p787k5843J9979O5504O5929
$$ 1552232 1533421 1490925 1456851 1412723 1387610 1389627 1376732 1368945 1343102 1363081 1428585 1494514
10411A494514K3843l9344l1538L1627k9723L7436O2892M9657M8661R0585O157
$$ 1494514 1518357 1479013 1447475 1479102 1449379 1486815 1549707 1599364 1648025 1738610 1744767
10400A744767m0154J6084N3241L0493L3015j4242k6744k359N2781N8831N8696
$$ 1744767 1704613 1720697 1773938 1804431 1837446 1823204 1796460 1794101 1846882 1905713 1964409
10389A964409J0770k2067N946R3422J06963O9480L8066M1164P1782P4940O0626
$$ 1964409 1975179 1953112 1959058 2052480 2159443 2228923 2266989 2308153 2379935 2454875 2515501
10378B515501J03313Q1131L7866k9169N6799Q5412J28560J84028J08297J33895
$$ 2515501 2618814 2699945 2737811 2708642 2765441 2850853 2979413 3163441 3271738 3405633
10368C405633J73005K14123K29980K36255K71201L92320M26401M79908N24452
$$ 3405633 3578638 3792761 4022741 4258996 4530197 4922517 5348918 5828826 6353278
10359F353278N87449O41685P31796J030945J233167J420948J649236J747841J740117
$$ 6353278 6940727 7582412 8314208 9345153 10578320 11999268 13648504 15396345 17136462
10350A7136462J538795J440012J826523K573597L540973M782592O502969R104885
$$ 17136462 18675257 20115269 21941792 24515389 28056362 32838954 39341923 48446808
10342D8446808J2891534J8668818K7753321M1594852N9243951P4968654P7904271
$$ 48446808 61338342 80007160 107760481 149355333 208599284 283567938 361472209
10335C61472209N6357603K990961o0112031q4494635p0467775m8499785l2081329
$$ 361472209 417829812 420820773 360708742 276214107 205746332 157246547 125165218
10328A25165218k1713213j5214810j0925384q112362o209027m801133l832753
$$ 125165218 103452005 88237195 77311811 69199449 62990422 58189289 54356536
10321E4356536k933181k401541k035265j887986k083949k289989k250445j981409
$$ 54356536 51423355 49021814 46986549 45098563 43014614 40724625 38474180 36492771
10313C6492771j922879k032542j878019j490138j166393r55757q65903q30706
$$ 36492771 34569892 32537350 30659331 29169193 28002800 27047043 26181140 25350434
10305B5350434q29740q68001q82740q58371q17951p43935o44065n50157o06909
$$ 25350434 24520694 23652693 22769953 21911582 21093631 20349696 19705631 19155474 18548565
10296A8548565n87231n27411n18943n02856m72839m69032m60984m11421l75360
$$ 18548565 17961334 17433923 16914980 16412124 15939285 15470253 15009269 14597848 14222488
10287A4222488l64789l43947l43338l40483l27858l14649l21328k90905k87303
$$ 14222488 13857699 13513752 13170414 12829931 12502073 12187424 11866096 11575191 11287888
10278A1287888k47264k49653k67937l02617l01310k76093k79763k45779k64018
$$ 11287888 11040624 10790971 10523034 10220417 9919107 9643014 9363251 9117472 8853454
10269H853454k73807k37033j82148j64922k00100j65707j67083j89467k12962
$$ 8853454 8579647 8342614 8160466 7995544 7795444 7629737 7462654 7273187 7060225
10260G060225j44070j35286j24604j38245j52247p5805o3774j24832j33767r2542
$$ 7060225 6916155 6780869 6656265 6518020 6365773 6289968 6226194 6101362 5967595 5875053
10250E875053r5215j53782j29745r9338j04736q0058l1934r3625j60355j04252
$$ 5875053 5779838 5626056 5496311 5396973 5292237 5212179 5180245 5086620 4926265 4822013
10240D822013n6452k9071p5553j22441l1723m5976j24420q2302p8594o1356n6562
$$ 4822013 4765561 4736490 4660937 4538496 4506773 4460797 4336377 4254075 4175481 4114125 4057563
10229D057563j00336j19324n7989p5248j05857q1342n6385o5751k7594j9697m6209
$$ 4057563 3957227 3837903 3779914 3704666 3598809 3517467 3461082 3395331 3367737 3348040 3301831
10218C301831p8152o6483J4115J8329R160N2391N3788J19969K5621j2217n3521
$$ 3301831 3223679 3157196 3171311 3189640 3198800 3251191 3304979 3424948 3450569 3438352 3384831
10207C384831j14894p4616P4505j7270j01402j69125j12919j0101j17420j67324
$$ 3384831 3269937 3195321 3269826 3252556 3151154 2982029 2869110 2859009 2741589 2574265
10197B574265j40714p6027p7253p3033n1118k7135j7996k8883k0417o6237n2754
$$ 2574265 2433551 2357524 2280271 2207238 2156120 2128985 2110989 2082106 2061689 1995452 1942698
10186A942698m8416j0661n4187p3027k831N8416k2796m025J9079R209j8363k1870
$$ 1942698 1894282 1883621 1829434 1756407 1753576 1811992 1789196 1785171 1804250 1813459 1795096 1773226
10174A773226j2675k785J3872M8784O9551N111o782l7463m1748j8207p5967l2940
$$ 1773226 1760551 1757766 1771638 1820422 1889973 1895084 1888302 1850839 1809091 1790884 1714917 1681977
10162A681977l3772n5099k2102n1150q5667m9246j4487l6372m8485o1816L2050
$$ 1681977 1648205 1593106 1571004 1519854 1434187 1384941 1370454 1334082 1285597 1223781 1255831
10151A255831q460k3178k4886l3121M7663K0139N1883L0517J0548M4270N2418
$$ 1255831 1247371 1224193 1199307 1166186 1213849 1233988 1285871 1316388 1326936 1371206 1423624
10140A423624P7711N0183n2212l2361p3870q0687m6333r096n2945o2839j1712
$$ 1423624 1501335 1551518 1499306 1466945 1393075 1312388 1266055 1256959 1204014 1141175 1129463
10129A129463r509M524L4735M5823m3879j13250o3053q2141o1818k0046l4612
$$ 1129463 1119954 1124478 1159213 1205036 1161157 1047907 984854 902713 840895 820849 786237
10118G86237j1092P458J4259Q1897J22106P1684J1014p93m5073q0038q2486n442
$$ 786237 775145 782603 796862 878759 1000865 1072549 1083563 1082770 1037697 957659 875173 869731
10106H69731K151q3592l7864m1499l3173J9740P164l9483k8529k5791j8809k8918
$$ 869731 871882 788290 750426 708927 675754 695494 702658 663175 634646 608855 590046 561128
10094E61128J9078J4497m2109n3783J658j367L6098N755j3883M9006k5568J1728
$$ 561128 580206 594703 552594 498811 500469 499102 535200 540955 527072 576078 550510 562238
10082E62238J6470j2827l4846k7356N3073N3238R768k9920m3569q632j5509k003
$$ 562238 578708 565881 531035 503679 556752 609990 619758 589838 546269 537637 522128 520125
10070E20125k2260r826o743R103k7115j286p560J9523L1762M4014j3236l8838
$$ 520125 497865 488039 481296 490399 463284 461998 454438 473961 505723 549737 536501 497663
10058D97663K198m9573l9161K0994L1731M728k3773P7334J9146j1351p388M2691
$$ 497663 499861 450288 411127 432121 463852 468580 444807 522141 541287 529936 522548 565239
10046E65239L6803q749Q083j3005j8345J3049R80l2103k0938l4435k1413J9023
$$ 565239 602042 593293 601376 588371 570026 583075 584055 551952 531014 496579 475166 494189
10034D94189M8898j5031q210l5803l4661K6594m766L8127j7856m4571l4113m4534
$$ 494189 543087 528056 519846 484043 449382 475976 471210 509337 491481 446910 412797 368263
10022C68263k5070J6370M8546K1183J2977M236k7783j2986L5095l421k7739n6357
$$ 368263 343193 359563 408109 429292 442269 446505 418722 405736 440831 437410 409671 353314
10010C53314L1273n377J3531M5981k0394r46K6763J2506j8253J695J6183M2385
$$ 353314 384587 379210 392741 438722 418328 417382 444145 456651 438398 440093 456276 498661
9998D98661P4831L6650j4915m2056k123k4725k1878P496l3469J275j3412k0187
$$ 498661 573492 610142 595227 553171 551048 526323 504445 511941 478472 479747 466335 446148
9986D46148m1451m2992j0023m5430l202R082N2350K1706N872N1314M7354l398
$$ 446148 404697 361705 351682 306252 303050 312132 364482 386188 392060 443374 490728 487330
9974D87330k8747L6149J2657j6676o54j6876l3348J5745N5953J354K9199q293
$$ 487330 458583 494732 507389 490713 490059 473183 439835 455580 511533 512887 542086 533793
9962E33793j6236J6117L6239P5293J3361m8614L8552p030l4654J2549J5404n6683
$$ 533793 517557 533674 569913 645206 658567 609953 648505 641475 606821 619370 634774 578091
9950E78091m9632n0012k447J8027K7424L1191l7887J4982N592L8920J8289p6164
$$ 578091 528459 478447 476000 494027 521451 552642 514755 529737 535329 574249 592538 516374
9938E16374k9628q918j0657K9885J3892j3990K45L1647r075J2528N4256j9495
$$ 516374 486746 477828 467171 497056 510948 496958 497203 528850 519775 532303 586559 567064
9926E67064K3262N9498M4461r921J7695M5280N4498Q8488O5473N1065R9418J42312
$$ 567064 590326 649824 694285 684364 702059 747339 801837 890325 955798 1006863 1106281 1248593
9914A248593K77306L27608K96663K60728K14636M173k93481l48669l06960k62214
$$ 1248593 1525899 1853507 2150170 2410898 2625534 2629707 2336226 1987557 1680597 1418383
9904A418383j87135p9216k6140n6420m2091l7707j5931k6839l3300Q325M5602
$$ 1418383 1231248 1152032 1125892 1069472 1027381 989674 973743 946904 913604 921929 967531
9893I67531L02k1322N0623Q238k8941o622j2008k5597J4262N2595k6891q835L7332
$$ 967531 967833 946511 997134 1005372 976431 969809 957801 932204 946466 999061 972170 963335 1000667
9880A000667M0116R1336K6292j8206L4451N2923J00711Q1971R1700P4972P9814
$$ 1000667 1040783 1132119 1158411 1140205 1174656 1227579 1328290 1410261 1501961 1576933 1656747
9869A656747J83889K59539K50894K71860K93809L49334M84963O41593Q71360J295906
$$ 1656747 1840636 2100175 2351069 2622929 2916738 3266072 3751035 4392628 5263988 6559894
9859F559894J684958K137093K376844K286087J588465L08433j016185j841218
$$ 6559894 8244852 10381945 12758789 15044876 16633341 16941774 15925589 14084371
9851A4084371j940211j552498j096918o37246k29786r3674j09060k64868l44881
$$ 14084371 12144160 10591662 9494744 8857498 8627712 8534038 8424978 8160110 7815229
9842G815229l72682l36578j72838j6437K49904M28957N76377P98057R23358Q12509
$$ 7815229 7442547 7105969 6933131 6916694 7166598 7595555 8171932 8969989 9893347 10705856
9832A0705856N46546K41957J31199K67545M43230O26532P46424R56305J398488
$$ 10705856 11252402 11494359 11625558 11893103 12336333 12962865 13709289 14665594 16064082
9823A6064082J887990K358669K720700K946014L065882L101062K940537K267148
$$ 16064082 17952072 20310741 23031441 25977455 29043337 32144399 35084936 37352084
9815C7352084J264599K10463r88656k155365k775135k596456k005452j496468
$$ 37352084 38616683 38827146 37838490 35683125 32907990 30311534 28306082 26809614
9807B6809614j370793j329582j307909j193288r80075p51094n83081k79461J03869
$$ 26809614 25438821 24109239 22801330 21608042 20627967 19876873 19293792 19014331 19118200
9798A9118200N76197J054150J326212J368978J150300O84784J74293j23115J94432
$$ 19118200 19694397 20748547 22074759 23443737 24594037 25278821 25453114 25329999 25524431
9789B5524431R32993J720111K270563K432229K181760J543659J034423J006043
$$ 25524431 26457424 28177535 30448098 32880327 35062087 36605746 37640169 38646212
9781C8646212J056204R52174P76855N26011L33341K5671m55088j208694k115029
$$ 38646212 39702416 40654590 41431445 41957456 42290797 42316468 41861380 40652686 38537657
9772C8537657k615135k364003j635656r40131p04770j025670j470859j670230
$$ 38537657 35922522 33558519 31922863 30982732 30277962 29252292 27781433 26111203
9764B6111203j580682j462715j157356p64131l77386N5596M36537O47034Q95577
$$ 26111203 24530521 23067806 21910450 21146319 20768933 20824529 21261066 21908100 22803677
9755B2803677R73999R03419Q11164P62506P92673J032692J360896J598734J630447
$$ 22803677 23777676 24681095 25492259 26254765 27047438 28080130 29441026 31039760 32670207
9746C2670207J445958J227080Q45191P6113q82703j850966k334041k221115j883715
$$ 32670207 34116165 35343245 36188436 36264549 35381846 33530880 31196839 28975724 27092009
9737B7092009j574915j462817j449688j389001j130601q07837o02572m58704l66934
$$ 27092009 25517094 24054277 22604589 21215588 20084987 19277150 18674578 18215874 17848940
9728A7848940m26138p09732r94035j127588j087994q44152n92734l95792j98769
$$ 17848940 17422802 16713070 15719035 14591447 13503453 12659301 12066567 11670775 11472006
9719A1472006n5752K3135J29640J22902R856j2752n5895O0352K52922N01078Q63158
$$ 11472006 11416254 11439389 11569029 11691931 11701787 11689035 11633140 11693492 11946414 12447492 13310650
9708A3310650J182782J374469J260694P93680J314r50088j659706j892261j658463
$$ 13310650 14493432 15867901 17128595 17922275 17923589 16973501 15313795 13421534 11763071
9699A1763071j270853r79398p71412n93754m43816l75358l04550k62445k25663
$$ 11763071 10492218 9512820 8741408 8147654 7703838 7328480 7023930 6761485 6535822
9690F535822k04106k37642j89066j97189k42943j46900j02023p1716j32055j49905
$$ 6535822 6331716 6094074 5905008 5707819 5464876 5317976 5215953 5144237 5012182 4862277
9680D862277j11027j33828q1645n5865n2215j08401j44968j18662j21396r8963
$$ 4862277 4751250 4617422 4535777 4479912 4427697 4319296 4174328 4055666 3934270 3835307
9670C835307k0195l8094n4710m9376l0784j4690m2013l4488j2718J1130l9670
$$ 3835307 3815112 3777018 3722308 3672932 3642148 3627458 3585445 3550957 3538239 3549369 3509699
9659C509699j21644q1311m134k4329j07324n5423j300j5609n1640k0916K2797
$$ 3509699 3388055 3306744 3302610 3278281 3170957 3115534 3114234 3098625 3046985 3026069 3048866
9648C048866K1651n0425l3075K8275K0189J102p2802o6685l2436k4858j2849j9416
$$ 3048866 3070517 3020092 2987017 3015292 3035481 3036583 2963781 2897096 2864660 2839802 2826953 2807537
9636B807537k9152m578p208J927J4192l2558M8871N2948l3345R778k1955r667
$$ 2807537 2778385 2773807 2766599 2768526 2782718 2750160 2799031 2851979 2818634 2828412 2806457 2796790
9624B796790R343j1663O6652L6892J3522L4343L8019K547J3138p186K9196L3313
$$ 2796790 2806133 2794470 2861122 2898014 2911536 2945879 2983898 2986445 2999583 2992397 3021593 3054906
9612C054906N8972K3308l7547K9515R0092N9262J0503J2130L7681P3159O2985
$$ 3054906 3113878 3137186 3099639 3129154 3219246 3278508 3289011 3301141 3338822 3411981 3474966
9601C474966O3422O0339P0690O8628O0317Q1882M2157Q5729J01871J18402J37292
$$ 3474966 3538388 3598727 3669417 3738045 3798362 3880244 3922401 4008130 4110001 4228403 4365695
9590D365695R4339R9128J06554J19397J14422J15479J13579J27409J74426K47001
$$ 4365695 4460034 4559162 4665716 4785113 4899535 5015014 5128593 5256002 5430428 5677429
9580E677429K40294K43755K27488J62579J90885J67875K07922K41364K78096K30460
$$ 5677429 5917723 6161478 6388966 6551545 6742430 6910305 7118227 7359591 7637687 7868147
9570G868147L08825L26619L51155L66897M52068M49842M40681M74001N75176N85239
$$ 7868147 8176972 8503591 8854746 9221643 9673711 10123553 10564234 11038235 11613411 12198650
9560A2198650N90139N84167O17232O73084P36576P70664Q34606R16450R82332
$$ 12198650 12788789 13372956 13990188 14663272 15399848 16170512 17005118 17921568 18903900
9551A8903900J026426J091826J086309J114939J205028J237500J263270J321504
$$ 18903900 19930326 21022152 22108461 23223400 24428428 25665928 26929198 28250702
9543B8250702J310109J319159J261963J221739J163995J079827R33937N47992
$$ 28250702 29560811 30879970 32141933 33363672 34527667 35607494 36541431 37089423
9535C7089423K58039O2626p7757j91794l52808n30171o54018p46036q70414r47802
$$ 37089423 37347462 37410088 37332331 37140537 36787729 36257558 35603540 34857504 33987090 33039288
9525C3039288j043768j042849j032464j061980j025432r89533j013311j044102
$$ 33039288 31995520 30952671 29920207 28858227 27832795 26843262 25829951 24785849
9517B4785849r65752q91659p75382p98937q48497q15198p27801p17398o79348
$$ 24785849 23820097 22928438 22153056 21354119 20505622 19690424 18962623 18245225 17565877
9508A7565877o41192n85918n23593n60798m98598m71926m97633m76796m43270
$$ 17565877 16924685 16338767 15815174 15254376 14755778 14283852 13786219 13309423 12866153
9499A2866153l42697k94449k99741l43974k90892k90519m02838l71379l35695
$$ 12866153 12523456 12229007 11929266 11585292 11294400 11003881 10601043 10229664 9893969
9490I893969k47575k76591k68543k23713k21964j99474j90076j86090j85275j85017
$$ 9893969 9646394 9369803 9101260 8877547 8655583 8456109 8266033 8079943 7894668 7709651
9480G709651k50085k36278j22652j18973k33511j77960j70851j39484j71903j55059
$$ 7709651 7459566 7223288 7100636 6981663 6748152 6570192 6399341 6259857 6087954 5932895
9470E932895n3355r4210j27985r2461p9449j09440j17634j66557j61414j08048
$$ 5932895 5879540 5785330 5657345 5564884 5485435 5375995 5258361 5091804 4930390 4822342
9460D822342j08358q7271p2028j26992p8066q7684m2508J1655q8995j11739q7455
$$ 4822342 4713984 4626713 4554685 4427693 4349627 4261943 4219435 4231090 4142095 4030356 3942901
9449C942901j14626n7312o8284j03042p1655r6410r6218n0302n0527r9993p5089
$$ 3942901 3828275 3770963 3702679 3599637 3527982 3431572 3335354 3285052 3234525 3134532 3059443
9438C059443n6732n7814q7117k548l8378m6782m2232m8109j5004N042q0303o7105
$$ 3059443 3002711 2944897 2857780 2855232 2816854 2770072 2727840 2679731 2664727 2669769 2589466 2522361
9426B522361k4180o1897l2793P263j7724m3841m4935j5122J3124q478r931n3908
$$ 2522361 2498181 2436284 2403491 2410754 2393030 2349189 2304254 2289132 2302256 2293778 2283847 2229939
9414B229939j00952p4423j0502l1116j5598n966k1878o0170n3975k9409n1055
$$ 2229939 2128987 2054564 2044062 2012946 1997348 1991382 1969504 1909334 1855359 1825950 1774895
9403A774895k6270M440R471p6467r6893l7999J7345K7845n434l3353m7902l4472
$$ 1774895 1748625 1753065 1762536 1686069 1589176 1551177 1568522 1596367 1590933 1557580 1509678 1475206
9391A475206m0343q305J0531k0490j7022J414P798k5368m2266k6963l0722m2479
$$ 1475206 1434863 1426558 1437089 1416599 1399577 1400991 1408789 1383421 1341155 1314192 1283470 1240991
9379A240991J6554L6096M6534m6078l7240l8215n7551P248n461m9012l5751q4786
$$ 1240991 1257545 1293641 1340175 1294097 1256857 1218642 1161091 1168339 1162878 1113866 1078115 993329
9367I93329l9551k5081J3730L6545L889j1297J8270k616m0398m4719m5869l8217
$$ 993329 953778 928697 942427 978972 982861 971564 989834 987218 946820 902101 856232 818015
9355H18015o4302Q424P1072M1743n914l1451l6851o5318k1404J08593K4351n7622
$$ 818015 753713 762137 833209 874952 869038 837587 800736 735418 714014 822607 846958 789336
9343G89336o2607k9295j4000K4289J4165k2252m5267k8354j9666l7561K728l021
$$ 789336 726729 697434 683434 707723 721888 699636 654369 626015 606349 568788 571516 568495
9331E68495K8219M3070J7363j8091k4144l2645k1949l974J2967n3433m1820j4092
$$ 568495 596714 639784 657147 639056 614912 582267 560318 556344 569311 515878 474058 459966
9319D59966r911j5924J5516L9520J525j471Q409k5192l350j3106m9289p3827M2403
$$ 459966 450055 434131 449647 489167 490692 489221 497630 472438 469088 455982 406693 332866 375269
9306C75269M9243K3618L7293J9557l027K89J4087j9414k5329K2149J1652L3154
$$ 375269 424512 448130 485423 504980 501953 502242 516329 496915 471586 493735 505387 538541
9294E38541k2398o5391J2455J0303M0380J8394k3041o8980m7537n0245l4503k2789
$$ 538541 516143 450752 463207 473510 513890 532284 509243 440263 392726 342481 307978 285189
9282B85189n761L1180K4223M728n96J7196L7674L463K0734J4961K8092j2941p376
$$ 285189 279428 310608 334831 339559 338963 356159 393833 397296 418030 432991 461083 448142 440766
9269D40766n874k4966j8770l0765l7732K8486M4121J2160j1204J2657N2317L3620
$$ 440766 434892 409926 391156 360391 322659 351145 395266 407426 396222 408879 461196 494816
9257D94816Q9820M9600L9782n5496o8761r5551l5199k9078o0522k4535J8602L4927
$$ 494816 584636 634236 674018 618522 549761 454210 419011 389933 329411 304876 323478 358405
9245C58405L8416j158j0330l0585J1551M7215q837M7278l5620l9906m8101l2125
$$ 358405 396821 395663 385333 354748 366299 413514 404677 451955 416335 376429 328328 296203
9233B96203R951J8369l5088p986K4359l1323k8716k6035L808K8444K0621j3051
$$ 296203 306154 324523 289435 281449 305808 274485 245769 219734 223542 251986 272607 259556
9221B59556J3726O800k74j5156N99k6837m7965j8912M1030N297M88l0054j7649
$$ 259556 273282 280082 279808 264652 265251 238414 190449 171537 212567 217864 218352 188298 170649
9208A70649M5499m2591l9082L2174l809P332K3710K324K690k7170l7368J2914
$$ 170649 216148 173557 134475 166649 162840 170172 193882 196206 198896 171726 134358 147272
9196A47272j2696K8120l6258M089J1126k9271R870N6416N722m0223n7244J7296
$$ 147272 134576 162696 126438 130527 141653 112382 122252 178668 184390 144167 86923 104219
9184A04219j2840J9159P7734m0406j9240m840o8491L3113O0775K5173m5595m1131
$$ 104219 91379 110538 188272 147866 128626 123786 55295 88408 149183 174356 128761 87630
9172H7630k6660q9M8408J1823l4426K1530j1902n3030M685k951L0776m4478m4109
$$ 87630 60970 60881 109289 121112 86686 108216 96314 43284 47969 45018 75794 31316 -12793
9159a2793P892K8956L5644j6591P545L8972l821m853j6031p946J749J6253K3288
$$ -12793 -4901 24055 59699 43108 50653 89625 85804 80951 64920 56974 58723 74976 98264
9146I8264k0577j886M263L815J3141j682L3838M6213J6990l6651n3970j7001M3970
$$ 98264 77687 75801 80064 83879 97020 95338 129176 175389 192379 155728 101758 84757 128727
9133A28727l3593l078L2526J2620o449p282K015l5410k8489k0237k3870K640L8447
$$ 128727 95134 92056 124582 137202 130753 123471 125486 90076 61587 41350 17480 20120 58567
9120E8567L0759L6378m81k8543m3156l3274K1319M4813l6051l6843K8347N4172
$$ 58567 89326 125704 125223 96680 53524 20250 41569 86382 50331 13488 41835 96007
9108I6007J6410j3418L7111m2777J4459M0765J4116l4932m4055K6061m5520m2378
$$ 96007 112417 98999 136110 93333 107792 148557 162673 127741 83686 109747 64227 21849
9096B1849j7121N6999p567M985k231k5116J3208P267r971K0923N2962j2995J8912
$$ 21849 4728 61727 54160 59145 56914 31798 45006 52273 42302 63225 116187 103192 122104
9083A22104j5285l9432j3999R399Q434k1543j3935J4077j4365M624K0351M1612
$$ 122104 106819 67387 53388 62787 71221 49678 35743 49820 35455 40079 60430 102042
9071A02042k8672j0105J4002O414J5107j0677m0442m0238M5826L4317L6875M8191
$$ 102042 73370 63265 77267 83681 98788 88111 47669 7431 53257 87574 124449 172640
9059A72640n1273K23l3248n0342j7541r048J9188K4475M0190l644o287l5092j8345
$$ 172640 121367 121590 88342 38000 20459 11411 30599 55074 95264 91620 85333 50241 31896
9046C1896l2361K0415o192P434M7184k9369l2972L2416K4278J6492L263j8138
$$ 31896 -465 19950 13758 21192 68376 39007 6035 38451 62729 79221 82484 64346
9034F4346l4187j7411k1177j7304k892L9925M330j198J1568R408l1996n9824O344
$$ 64346 30159 12748 -8429 -25733 -28625 11300 15630 14432 26000 35408 3412 -56412 -50068
9021e0068K6543l376q529K9426o643M1149K4370L646J0312l2348n3285J3666J4961
$$ -50068 -23525 -26901 -35430 -6004 -12647 28502 52872 56518 66830 34482 -18803 -5137 9824
9008I824k904J7954o198J9485N8927k0143r050K1554K1552l1760j9524L168n9696
$$ 9824 6920 24874 18676 38161 97088 76945 67895 89449 111001 79241 59717 62885 3189
8995C189K79L1591k9007P623K5898m647j2468M4047M94p3194k9893K9544K6760
$$ 3189 3468 35059 6052 13675 39573 34926 22458 66505 66999 -6195 -36088 -6544 20216
8982B0216j120J5883Q641r973K479J8683k5805K0009J6774M1762K3627m7489m0201
$$ 20216 19096 34979 43620 33647 36126 54809 29004 49013 65787 107549 131176 83687 43486
8969D3486k5050k8552n213K4933M6194M7927m8075n350p6165o0824M5028M4558
$$ 43486 18436 -10116 -15329 9604 55798 103725 55650 50300 -25865 -86689 -41661 2897
8957B897L6349L0268o4744k0113R878P471O473L0768K4814k5919K4955n0762L3926
$$ 2897 39246 69514 4770 -15343 -5465 2006 8479 39247 64061 38142 63097 12335 46261
8944D6261N5229l094l0413J668J1172Q489L655m4855k2034k7689J3897O1453k5153
$$ 46261 101490 98396 67983 69651 80823 89312 92967 48112 26078 -1611 12286 73739 48586
8931D8586J641j7818j7000J0647L5865L758J2297K0699r680k5207l3576m311J8813
$$ 48586 50227 32409 15409 26056 61921 65679 77976 98675 88995 63788 30212 25901 44714
8918D4714M2255L538J588n3250j5313j5294Q539K7806K0174j377j741L4642k5660
$$ 44714 86969 90507 92095 38845 23532 8238 16777 44583 64757 63380 61639 96281 70621
8905G0621J3837K1846L463J2488K0344m003N684Q165m096k3730N6986N9800J2383
$$ 70621 84458 106304 109767 122255 142599 138596 144280 152445 148349 124619 181605 241405 253788
8892B53788K4329m20J7312K8668j6525p646K9081L0808P5403P5264O4528P3313
$$ 253788 278117 277697 295009 323677 307152 299506 328587 359395 434798 510062 574590 647903
8880F47903J61612L02365M53914P20953J075102J255773J201204N83990o61017
$$ 647903 809515 1111880 1565794 2286747 3361849 4617622 5818826 6402816 5741799
8871E741799j490169j215141p72166n11810k93565k04260j46916j02902j16591
$$ 5741799 4251630 3036489 2264323 1752513 1458948 1254688 1107772 1004870 888279
8862H88279n5682J3836o9959q9926j7858j2778k1934o0239j01819k7998l4925
$$ 888279 832597 846433 776474 686548 668690 655912 633978 573739 471920 443922 408997
8851D08997j7679O9596J2177n0531J6489O3112K87k9697j4173q68n3704J9760
$$ 408997 391318 460914 473091 422560 439049 502161 502448 472751 458578 457710 404006 423766
8839D23766M0619L910p2703p6973l6494m88L210l7q287k5604l4596o880J4274
$$ 423766 464385 468295 395592 318619 282125 281637 284847 284810 276523 250919 216323 209443 223717
8826B23717R003j1720J298l5167J3888p464r688k804k42j7687K4286p744j1415
$$ 223717 232720 221000 222298 187131 201019 193555 183867 181063 180821 163134 187420 179676 168261
8813A68261J7254J6484l2441m4272l6213l5863r736N8482P3395Q3726M2457n4730
$$ 168261 185515 201999 169558 125286 89073 53210 43474 101956 175351 259077 301534 246804
8801B46804k7274l6139l1469k359j5110J3569K3196l8844m3122p614L0472k0455
$$ 246804 219530 183391 151922 149563 134453 148022 171218 132374 89252 81638 112110 91655
8789I1655O558k2627p3022N749n130K1022J1859k4060K7650L0215N0877P9385
$$ 91655 98213 75586 2564 8313 3183 24205 36064 12004 39654 69869 120746 200131
8777B00131N116k8163Q12l5688p3237q042M0994o791J2165l3140L3775k8962o6400
$$ 200131 205247 177084 177896 142208 68971 60929 101923 95132 107297 74157 107932 78970 12570
8764A2570k4947N0043O1808k345k081P1269l516j4145k9842l4286j9695K254j5879
$$ 12570 -12377 37666 99474 97129 95048 166317 162801 148656 118814 84528 64833 67087 51208
8751E1208J4956k7213k3931N055O877L0373j051k906M3656o8580m8161l8373K3811
$$ 51208 66164 38951 15020 20075 26952 57325 56274 53368 97024 28444 -19717 -58090 -34279
8738c4279L9264k2400J5213N1085P0469l8203l8438k94K4380p24k3291o050j6258
$$ -34279 4985 -17415 -2202 48883 119352 81149 42711 42417 66797 66073 42782 36732 20474
8725B0474n279l547n0496l1146N9025J132r517k8235N1629Q4778J1333j6313n1077
$$ 20474 15195 11648 -38848 -69994 -10969 -9837 -19354 -47589 4040 88818 100151 83838 32761
8712C2761o286J6917J0157K0729J9382m5198j8125K5238j785O186N993j00N834
$$ 32761 26475 43392 53549 74278 93660 48462 30337 55575 53790 59976 65969 65869 71703
8699G1703p188R841k4054m7641m9100k0303K0706N8438J5553m9130L8742M0558
$$ 71703 64515 74356 50302 2661 -46439 -66742 -46036 12402 27955 -21175 17567 58125
8687E8125K4326K0330l4202l5184O2104O3103K5561p92r4728o8005j1439J1821
$$ 58125 82451 102781 68579 33395 95499 158602 184163 183371 88643 20638 9199 21020
8675B1020K2805K484n253l9920l4565R183J9731J0878O2148O480j3129l4643n495
$$ 21020 43825 46309 41056 1136 -33429 -24246 -4515 6363 68511 74991 61862 27219 21724
8662B1724m6191K7811K795M0510j153l8374n470m3944j6673M8196N4047M2863
$$ 21724 -24467 3344 6139 46649 45496 7122 1652 -42292 -58965 -10769 43278 86141
8650H6141j7293l6492k9268j4945l4893N4147M8439P537o444j9108Q92k9469m2539
$$ 86141 68848 32356 3088 -11857 -46750 7397 55836 63373 56929 37821 38713 9244 -33295
8637c3295J7558L962k2581J4775k7158L7161O1645N5353J7260m2148m9507m415
$$ -33295 -15737 -11775 -34356 -19581 -46739 -9578 52067 107420 124680 82532 33025 28610
8625B8610M8716J0430p713l9347J6308K0857K0780L4155j0848J893k6017r602
$$ 28610 77326 87756 80043 40696 57004 77861 98641 132796 121948 123841 97824 88222
8613H8222J6671r553J3411K0114k8649j7062l4553K0176N5145P4362J9103k7774
$$ 88222 104893 95340 108751 128865 100216 83154 48601 68777 123922 198284 217387 189613
8601A89613l7018j9617J9370P1871J940L5191M7505J8380m273j6877o509j1898
$$ 189613 152595 132978 152348 224219 226159 261350 308855 327235 322962 306085 299576 287678
8589B87678l0269j0630l5967q4277k2406M5672n301l3189k821K8461J7564j262
$$ 287678 257409 246779 210812 126535 104129 149801 144500 111311 108490 136951 154515 153253
8577A53253n0773l2824N9556L9435j6066l958N2240K4517o083j3791J0114k0588
$$ 153253 102480 69656 129212 168647 152581 148623 200863 225380 219297 205506 215620 195032
8565A95032k0851n6626O244P255L69k4193L0220j064J3995N12k5713P673K1709
$$ 195032 174181 117555 123799 131054 131423 107230 137450 136386 150381 150893 125180 132853 154562
8552A54562k5316J5410K0844l4928j7723p1594N767L5776L782j3880j5046J204
$$ 154562 129246 144656 165500 130572 112849 41255 47022 82798 86580 72700 57654 58858
8540E8858m1377l052Q038k8489j4034J2752L0433L7547J453J8187m206M2019K3675
$$ 58858 17481 14429 22467 -6022 -20056 -7304 23129 60676 62129 80316 76110 118129 141804
8527A41804j7126o1963j4924O51K1924j4888j5708m8229K4879M5864O662m770
$$ 141804 124678 62715 47791 48442 70366 55478 39770 -8459 16420 62284 68946 64176
8515F4176R86M4774k0062l2550k0948K7508K3371M5275l972n6945M355r218l9091
$$ 64176 65162 109936 89874 57324 36376 63884 87255 132530 128558 71613 75968 66750 27659
8502B7659k6081J5074l9657j0656N2634J6848J5188k5196m0468n5220n3649M5451
$$ 27659 1578 16652 -23005 -33661 18973 35821 51009 25813 -14655 -69875 -123524 -78073
8490g8073P309J620M9234L0402J7220J2841n896m95N468r893j3369q900L7413
$$ -78073 -70764 -69144 -19910 10492 27712 40553 34657 34162 39630 29737 16368 7468 44881
8477D4881K8240M4722j3025k0592K5069k943m4578Q478K0936k6527k9947p01J9109
$$ 44881 73121 117843 104818 84226 109295 106352 61774 70252 91188 64661 34714 34013 53122
8464E3122j5541m247M2819L5390o1154m4945o7329q67O4631L4097K1685L9218
$$ 53122 37581 33334 76153 111543 50389 5444 -61885 -62752 1879 35976 57661 96879
8452I6879M7958k1686l8975m3384j1647O5783r060l6789k431k9068J4298L4022
$$ 96879 144837 123151 84176 40792 29145 94928 85868 49079 46648 17580 31878 65900
8440F5900j4345j0554l8340k2937j0319M9821K8126O063o551J4086J7510J2221
$$ 65900 51555 41001 2661 -20276 -30595 19226 47352 53415 46864 60950 78460 90681
8428I0681o272m030q585P6651O9403k8061m9430L069k0615k6881j8217R592m8362
$$ 90681 84409 80379 71794 148445 217848 189787 140357 143426 122811 95930 77713 87305 38943
8415C8943k0946l164m721K2389L0853k1519o889J3387J7356l7927N389k5720M843
$$ 38943 17997 14833 10112 32501 63354 41835 34946 48333 65689 27762 33151 7431 12274
8402A2274J5326N5950r882Q254j6460N750m1363O237l9088k8819Q543p250M828
$$ 12274 27600 83550 73668 81922 65462 71212 29849 36086 -3002 -31821 -23278 -30528 -25700
8389b5700K0558L5709l5725n2397J7662M3924N9148M5320L8494J2315k3195l533
$$ -25700 -5142 30567 -5158 -57555 -39893 4031 63179 108499 146993 159308 136113 132580
8377A32580j7565K245l2529J4785M7566K3478r486j8664m1469k8048k5620k3152
$$ 132580 115015 117260 84731 99516 147082 170560 161074 142410 100941 72893 47273 24121
8365B4121m1517o889K2717P1545M025m7384n7481J190M1572L7454J84m7978K358
$$ 24121 -17396 -24285 -1568 69977 74002 26618 -30863 -29673 11899 49353 49537 1559 3917
8352C917K3032r21N83J214k143O4310m5820p914M5250j8473K3430K2467M1755
$$ 3917 26949 26028 26611 27825 25682 89992 44172 36258 81508 63035 86465 108932 150687
8339A50687j1234p2873k2817J3508J0847O1824K3551k2161L9539O151k2727m1964
$$ 150687 139453 66580 43763 57271 68118 129942 153493 131332 170871 177022 154295 112331
8327A12331l7063j0528l5616L894L5344N3719L4751n6195j7215m454q928m096
$$ 112331 75268 64740 29124 33018 68362 122081 156832 100637 83422 78968 70040 65944
8315F5944K998j0375j5629N015O2254M2909j2574k4751m3692K3451M3752L188
$$ 65944 68942 58567 42938 47953 110207 153116 140542 115791 72099 95550 139302 142490
8303A42490J7729k1544k8713O3644N7039k0095J2038J906k2729n6295j4951K7898
$$ 142490 160219 138675 109962 173606 230645 210550 222588 224494 201765 145470 130519 158417
8291A58417K1094N3143M472K5824l345J0699L6721n2761l6464o7021k6568L8065
$$ 158417 179511 232654 237126 262950 259605 270304 307025 254264 217800 150779 124211 162276
8279A62276L9712j9390l7765j5288j6921m1522M522j9984p6480K596O6520J93
$$ 162276 201988 182598 144833 129545 112624 71102 75624 55640 -20840 -18244 48276 48469
8267D8469O886o120J6853l725l5052m7628L546M0386N1342L9544J582l5554k4466
$$ 48469 55355 49235 66088 62363 27311 -20317 -16771 23615 74957 114501 116083 80529 56063
8254E6063l0527J2891J4667k1176o88R78P3835M7824l3798j2239L9322J5404O357
$$ 56063 25536 38427 53094 31918 31230 32208 106043 153867 120069 107830 147152 162556 168913
8241A68913J8408J4926k373j9931k2136Q961J9727M1580J6851q099l6035k8283
$$ 168913 187321 202247 199874 179943 157807 166768 186495 228075 244926 236827 200792 172509
8229A72509j0705l5391J3844L5298R312m8435n126k5646m5921P110K3124j9726
$$ 172509 161804 126413 140257 175555 184867 136432 131306 105660 59739 66849 89973 70247
8217G0247J3837N668Q983n505l5872K0907j6828j4665k0114n206K1554J7199q197
$$ 70247 84084 89752 98735 93230 57358 78265 61437 46772 26658 21452 43006 60205 52008
8204E2008J5390m7792l9942k1081j0L9561j9732j8101o656P8546O3848m3100j5640
$$ 52008 67398 19606 -20336 -41417 -41427 -1866 -21598 -39699 -46355 32191 96039 52939 37299
8191C7299j8635m4777K1290j8478o899L3078r718j4996J1384j4919j0578L1059
$$ 37299 18664 -26113 -4823 -23301 -30200 2878 -6840 -21836 -10452 -25371 -35949 -4890
8179d890m965p0930n971J0935K3654J6114k4049j3733N9435M5734j8865k4257
$$ -4890 -9855 -80785 -86756 -75821 -52167 -36053 -60102 -73835 -14400 31334 12469 -11788
8167a1788q6424K1914L6904M5946L3772J2094J4230j070p2086o1809L575M9308
$$ -11788 -98212 -76298 -39394 6552 40324 52418 66648 65578 -6508 -68317 -64742 -15434
8155a5434Q94k0570N6275R874k7958J26M220Q173M0888L234N498K865l3402L0069
$$ -15434 -14540 -35110 21165 31039 3081 3207 7427 15600 56488 59722 65220 68085 34683 64752
8141F4752k0425J3125j6279l6031J948N5125M2677r852j8656p0075k7584L9730
$$ 64752 44327 57452 41173 5142 7090 62215 104892 95040 76384 6309 -21275 18455
8129A8455q170o451Q907J8983l3866M39P035k048K5075J0194k4824m1491o19J6238
$$ 18455 10285 3834 12741 31724 -2142 -1703 5332 3284 28359 38553 13729 -27762 -28381 -12143
8115a2143K2960L0279L73q5472J0048j9239l0416J8604L0952K6549q732K7535
$$ -12143 10817 41096 41469 -44003 -33955 -53194 -83610 -65006 -34054 -7505 -16237 11298
8103A1298L5748k4247l2637m679L9472K2467l4557n1789J4856J2111k4647r475
$$ 11298 47046 22799 -9838 -14517 24955 47422 12865 -38924 -24068 -11957 -36604 -46079
8091d6079K4315K4968j1180J4446J329m9106J1969O9514N8330j0821p4907o1416
$$ -46079 -21764 3204 -7976 6470 7799 -41307 -29338 40176 98506 87685 12778 -48638
8079d8638l82J9705J3174k0026m1619J5558K2693Q662n297P137J6719k7396j6462
$$ -48638 -49020 -29315 -16141 -36167 -77786 -62228 -39535 -30873 -36170 -29033 -12314 -39710 -56172
8066e6172j9913L1010Q175L1464M8540l1610j4251J6011K2347J1898n764k0961
$$ -56172 -76085 -45075 -36900 -5436 43104 11494 -2757 13254 35601 47499 41735 20774
8054B0774J301J9433K014k6826l5859l1949P844M1284M6528M668l0583m2587k8394
$$ 20774 22075 41508 43522 16696 -19163 -51112 -43268 -1984 44544 49212 18629 -23958 -52352
8041e2352J8599K1507K8369O2194J3501R092K3626k0980n450J7596K5972m5053
$$ -52352 -33753 -12246 16123 78317 91818 100910 124536 103556 98106 115702 141674 96621
8029I6621j1595J1150o1211n1043L5939J9835j7057J2152j9455p0992K3253L3211
$$ 96621 85026 96176 34965 -16078 19861 39696 22639 34791 15336 -55656 -32403 808
8017H08K1424p262Q485M2072J6989j6337k8363j467M6880j1501j4712j9138q793
$$ 808 22232 14970 23455 65527 82516 66179 37816 36349 83229 71728 57016 37878 29085
8004B9085j0403L5910L5964M1628j3580n7194m8903o988q731o602L6985M9118
$$ 29085 18682 54592 90556 132184 118604 61410 12507 5519 -3212 -9814 27171 76289
7992G6289J44p379l8833J7998J2895P491n1509p7885j8242J3277R163k477M2057
$$ 76289 76433 69054 30221 48219 61114 68605 17096 -60789 -79031 -65754 -56591 -59068 -17011
7979a7011K0940K2730N575k1870J050K7897r404k3625l9880j5604L2554J3162
$$ -17011 3929 26659 32234 10364 11414 39311 29907 6282 -33598 -49202 -16648 -3486
7967c486J9360l389j7695p971R863l3913k7970N9647M1317m935j5240q143R786
$$ -3486 15874 12485 -5210 -13181 -3318 -37231 -65201 -5554 35763 30828 15588 7445 17231
7954A7231J3351J4553L7905N648j0343j4865L301R175k1604k5977j9684j1251
$$ 17231 30582 45135 83040 88688 78345 63480 66781 75956 54352 28375 8691 -2560
7942b560J757P6021K9759K128m376n4127l0376k9349j6228j7761k990J4540J9935
$$ -2560 -803 75218 104977 107105 102729 48602 18226 -11123 -27351 -45112 -48102 -33562 -13627
7929a3627L546J5396n642n639J9391l480k243O5312L2044n3741k9424K2376j3156
$$ -13627 -10081 5315 -327 -5966 13425 9945 7702 73014 105058 51317 21893 44269 31113
7916C1113k6533j3884k9758O122L3687L5118J5462j7156j5786K452J8578L947
$$ 31113 4580 -9304 -39062 -32940 747 35865 51327 34171 18385 20837 39415 43362
7904D3362l8503R609l8786j7401j8354N255j8613j5567K7015L3558O50k6190M3812
$$ 43362 4859 14468 -24318 -41719 -60073 -54818 -73431 -88998 -61983 -28425 -27775 -53965 -10153
7891a0153K7091j7179J550L7238j1678K3423L3690M1853K334R323m263k5744k3710
$$ -10153 16938 -241 1309 38547 26869 50292 83982 125835 128169 137492 133229 107485 83775
7878H3775m8737m6097J0927R111m975m7230k2096K3548J1481J82L9176L4375p884
$$ 83775 35038 -11059 -132 8979 4004 -43226 -65322 -41774 -30293 -30111 9065 43440 35556
7865C5556k0241l6174j9084J3177J8017j947o901K87K8053J7397j7016k1051J2563
$$ 35556 15315 -20859 -39943 -26766 -8749 -10696 -17597 -17310 10743 28140 11124 -9927 2636
7852B636J6266J8515l3147k658M3884O658J7590j4270J565P49l0953k5354r628
$$ 2636 18902 37417 4270 1612 45496 52154 69744 55474 57039 57788 26835 1481 -8147
7839h147J0389J1112l5703n7190J273q60L6669L9225k395l455k4889K6970L6680
$$ -8147 2242 13354 -22349 -79539 -78266 -79126 -42457 -3232 -5627 -9082 -33971 -7001 29679
7826B9679K2827k5883l0993j7228l1257j7390J7000J0415M08l6963J9030M5684
$$ 29679 52506 26623 -4370 -21598 -52855 -70245 -53245 -42830 -42422 -79385 -60355 -14671
7814a4671L4224O1209m1960m1897J315k3759L5208L0026J4141L4522n1558r861
$$ -14671 19553 80762 38802 -3095 -1780 -25539 9669 39695 53836 88358 36800 26939
7802B6939K599j8311l7701L849J5164p1340p348M0778l0869j7858k7178P801j207
$$ 26939 29538 11227 -26474 -22625 -7461 -78801 -86149 -45371 -76240 -94098 -121276 -113475 -114682
7789a14682J0226R6997m03m0579Q403M5968J9772R428P492n931n2654p2981J1966
$$ -114682 -104456 -7459 -7862 -48441 -40038 5930 25702 35130 42622 36691 -15963 -88944 -76978
7776g6978K5734k3461j4509K6092N4315J4379j1077p21n481N1518j2498j09j9729
$$ -76978 -51244 -74705 -89214 -63122 -8807 5572 -5505 -6226 -11707 39811 27313 27204 7475
7763G475N872K30l6349J2644J0004j7316j100r567N367j9524j1154K3311M6518
$$ 7475 13347 13577 -22772 -10128 -124 -17440 -18540 -28107 -22740 -42264 -53418 -30107 16411
7750A6411R702n5698j0190q262j176K7697J9395j0521Q902O353J933k6544j9305
$$ 16411 26113 -29585 -39775 -48037 -49213 -21516 -2121 -12642 -3740 2613 4546 -21998 -41303
7737d1303m675j5714l4150J8972K7987j7454k4159o406j9097L0700O9874M5354
$$ -41303 -45978 -61692 -95842 -76870 -48883 -66337 -90496 -96902 -115999 -85299 -15425 29929
7725B9929k2852k9511m6172l4395L8504J488l9916J1671J7966M3353L8292K1388
$$ 29929 7077 -22434 -68606 -103001 -64497 -63009 -102925 -91254 -73288 -29935 8357 29745
7713B9745r671r516n012p079k6703k1677J3728K5336J4549J588j3407p96l65p832
$$ 29745 20074 10558 5546 -1533 -28236 -49913 -36185 -10849 3700 5288 -8119 -8915 -9280 -17112
7699a7112k5885Q00q75l1947J5397L0094j3487K2143M8602k8909k5229l0062L31
$$ -17112 -42997 -42197 -43072 -75019 -59622 -29528 -43015 -20872 27730 -1179 -26408 -56470 -56139
7686e6139O8528j564o1784k9623k423L6596O7628R319M2951o656J7975K7306n7974
$$ -56139 12389 10825 -50959 -80582 -83005 -46409 21219 30538 73489 66833 84808 112114 54140
7673E4140n3650L1164N8211M322l0961p0794j6829J5175J6984k108J2103K4839
$$ 54140 490 31654 89865 94187 63226 -7568 -24397 -9222 7762 5654 17757 42596
7661D2596j5097k1249j9117l603K5064q396m5003j2442L0074J1217j3634k2265
$$ 42596 27499 6250 -12867 -16470 8594 198 -44805 -57247 -27173 -15956 -29590 -51855
7649e1855K3169o952j0114q989J3181J2031M6739M8884k6642n7967k5862o745
$$ -51855 -28686 -35638 -45752 -54741 -41560 -29529 17210 66094 39452 -18515 -44377 -51122
7637e1122j4732J2046Q602m442O388N4682J3210k7751m9280J3417K8837l957M865
$$ -51122 -65854 -53808 -45206 -49648 -43260 11422 24632 -3119 -52399 -38982 -10145 -14102 -9237
7624i237m811J791N1220L9118j1710k8742l0058k8703n1332k7330Q8530J7411
$$ -9237 -14048 -12257 38963 78081 66371 37629 7571 -21132 -72464 -99794 -11264 6147
7612F147Q296m626K2071J8409m6040n296l4657l1680k011M4878K9845M7748L9966
$$ 6147 14443 9817 31888 50297 4257 -1039 -35696 -67376 -69387 -24509 5336 53084 93050
7599I3050L145K918o3353J267j115m0546Q234k4070R170M492o1378l8647q019
$$ 93050 96195 99113 35760 37027 35912 -4634 3600 -20470 -11300 -6808 -68186 -106833 -114852
7586a14852O3536M5253k3604M2601k0697J6738J8313J216l3430j5108R0691K2020
$$ -114852 -51316 -6063 -29667 12934 -7763 8975 27288 28504 -4926 -20034 70657 92677
7574I2677n2895l4010J4706L8071n4895o0680k8950N126N1853K7663r780j6140
$$ 92677 39782 5772 20478 58549 3654 -57026 -85976 -80850 -28997 -1334 -11114 -27254
7562b7254m5907L4747O3943P568P30k7051k6856J3369N333j0936j5052L8260M1098
$$ -27254 -73161 -38414 25529 33097 33827 6776 -20080 -6711 -1378 -12314 -27366 10894 51992
7549E1992P367j9340J2927j7102J8709M5633N2911k9287o0397l5430k3218m7185
$$ 51992 59359 40019 52946 35844 54553 100186 153097 123810 63413 27983 4765 -42420
7537d2420j2609J0399K7593r284L3716k1523j7906Q788m618O267M8066l681m7602
$$ -42420 -55029 -44630 -17037 -26321 7395 -14128 -32034 -23246 -27864 -21597 26469 22788 -24814
7524b4814K270j5972M5457M2037J395j3223j3123L103q123j0290K2564L6734K829
$$ -24814 -22544 -38516 6941 48978 50373 37150 24027 27130 19007 8717 31281 68015 70844
7511G0844N319L110j0398k8933j8786N1624J1307q7962l7437M1036k7686m9998
$$ 70844 76163 79273 68875 39942 21156 72780 84087 -3875 -41312 -276 -27962 -77960
7499g7960J8443J8390J0404R2208L924k3096k8534k3783j4702m262L6351K8887
$$ -77960 -59517 -41127 -30723 61485 65409 42313 13779 -10004 -24706 -28968 7383 36270
7487C6270K5916J9901k2850p041p688k8471m3505J8049Q464l635n268m589M832
$$ 36270 62186 82087 59237 52196 44508 16037 -27468 -9419 -955 -4590 -9858 -14447 -9615
7474i615J5595J1141o423j5205k7818L3751K5181q292j0676j1348j1449j4773
$$ -9615 5980 17121 10698 -4507 -32325 1426 26607 18315 7639 -3709 -15158 -29931
7462b9931j3048j0090J5923L5943k7008j311Q000N983m6379j1413L839j3873P003
$$ -29931 -42979 -53069 -37146 -1203 -28211 -29522 -21522 -15539 -61918 -73331 -69492 -83365 -76362
7449g6362L4122K9064n9476m6411L6645R5677j4116m0556L761o4452L5975J5940
$$ -76362 -42240 -13176 -72652 -119063 -82418 13259 -857 -41413 -37652 -102104 -66129 -50189
7437e0189J2828K8576N353n0386L721J8287n3522j6132K9400L4522N4123j6113
$$ -50189 -37361 -8785 -3432 -53818 -50097 -31810 -85332 -101464 -72064 -37542 16581 468
7425D68l9016J1019n0115K1489O4019j4451k6923K3410M4874j633J0014j2216
$$ 468 -38548 -27529 -77644 -56155 7864 -6587 -33510 -10100 34774 33141 43155 30939
7413C0939m8236P27K3611N316r485K5175k4899k5560K8686O954K4681k6592l6164
$$ 30939 -17297 -16570 7041 12357 2872 28047 3148 -22412 6274 13228 37909 11317 -24847
7400b4847k4609j9051P754K3312P2302j2506R387L8669l0186m4576J302K1122
$$ -24847 -49456 -68507 -60753 -37441 34861 22355 31742 70411 40225 -4351 -3049 18073
7388A8073M982l1779j810r877p584L6470m60K075O119l4480K8887m7133k6989
$$ 18073 23055 -8724 -10534 -20411 -27995 8475 8015 10090 16209 -18271 10616 -36517 -63506
7375f3506j9087M2654K9942Q296K5585P486l0826O190L308j6312j2101L1540J2444
$$ -63506 -82593 -39939 -9997 -1701 23884 31370 544 6734 10042 -6270 -18371 13169 25613
7362B5613j4982j3015l4402j1979M398k1418j2521K0873Q441K1982k990j3772
$$ 25613 10631 -2384 -36786 -48765 -44367 -65785 -78306 -57433 -48992 -27010 -30000 -43772
7350d3772O970k893J115J5358K9365K891K1086J2815O017k3156Q478j3723l0654
$$ -43772 -36802 -39695 -38580 -23222 6143 9034 30120 42935 48952 25796 34274 20551 -10103
7337a0103l0344J588J6806L1172R443J6364J8997R041J027K4022j8213k8227k2832
$$ -10103 -40447 -38859 -22053 9119 18562 34926 53923 62964 63991 88013 69800 41573 18741
7324A8741j1326L7817K7337n010l4201l8797n041J7508N460n9149o8882o870M1254
$$ 18741 7415 45232 72569 67559 33358 -5439 -10480 7028 12488 -46661 -115543 -122413 -81159
7311h1159K2307N2382l87j1199q341N072j2647J6853P113K025j6386p506K0629
$$ -81159 -58852 -6470 -6857 -18056 -26397 -21325 -33972 -17119 -10006 -7981 -24367 -31873 -11244
7298a1244L4735K821j8276m4967k3940k4188J3783M3062l8861l4922J7469O0763
$$ -11244 23491 26312 8036 -36931 -60871 -85059 -71276 -28214 -67075 -101997 -84528 -23765
7286b3765K526j5639j4700j1888j0783P1195L7787l355l4317j2184P315m1887
$$ -23765 -21239 -36878 -51578 -63466 -74249 -3054 34733 31378 -2939 -15123 -7808 -49695
7274d9695l4754r282K7123K3655K5459m82j667k6793l1419k8725K4280L7253J6177
$$ -49695 -84449 -93731 -66608 -42953 -17494 -17976 -19643 -46436 -77855 -106580 -82300 -45047 -28870
7261b8870M6158J0332j8144l1942l1262K3214k1154k4090K4965J7341L8082k2148
$$ -28870 17288 27620 9476 -22466 -53728 -30514 -51668 -75758 -50793 -33452 4630 -17518
7249a7518q0670L6983L6138l2678j6435j9582j7376M4388K1494r280R807Q452
$$ -17518 -98188 -61205 -25067 -57745 -74180 -93762 -111138 -66750 -45256 -54536 -44729 -36277
7237c6277j687N9484J7658K5531r391k1289J4350j9944j1707M8689M8779j672
$$ -36277 -37964 21520 39178 64709 55318 34029 48379 28435 16728 65417 114196 112524
7225A12524j1997p3750l7565r02p973J0512M9647K4147p600l1157l6249j1477
$$ 112524 100527 26777 -10788 -11690 -19663 -9151 40496 64643 57043 25886 -10363 -21840
7213b1840J4653K0313l86l1412N818K8012l2486R327l3723R747K8526O300j0970
$$ -21840 -7187 13126 12740 -18672 -12854 15158 -17328 -8001 -41724 -31977 -3451 2849 -8121
7200h121l2498L5171q759j4301N7915L8602j9913j4616j7063k3973j1525J3016
$$ -8121 -40619 -5448 -14207 -28508 29407 68009 48096 33480 16417 -7556 -19081 -6065
7188f065L6588k6369J1797j3135m5938j1421q504k596j0574J1843K6584K1645
$$ -6065 30523 4154 15951 2816 -43122 -54543 -63047 -65643 -76217 -64374 -37790 -16145
7176a6145p794l3563J2345J9545n73K2149m381J7729K9737n9146r485m127j9112
$$ -16145 -23939 -57502 -45157 -25612 -26185 -4036 -8417 9312 39049 -20097 -29582 -33709 -52821
7163e2821L081O5869l3054m6430Q555M0324Q712L354N1006n086j2447p9675l8558
$$ -52821 -49740 16129 -16925 -63355 -54800 -14476 -5764 -2410 48596 43510 31063 -48612 -87170
7150h7170M5999N0053N495L7662j2220n0755j2693j918K8762K2466n3620j2586
$$ -87170 -41171 8882 14377 52039 39819 -10936 -23629 -25547 3215 25681 -27939 -40525
7138d0525N412J6963J9430M2373k0688q52N1176k4678l1031j0222J6749O549K877
$$ -40525 -35113 -18150 1280 43653 22965 22113 73289 48611 17580 7358 24107 30656 33533
7125C3533k9994j3679K8347J7116m8654m4868K4954K9950K9433J9937K0468M1296
$$ 33533 3539 -10140 18207 35323 -13331 -58199 -33245 -3295 26138 46075 66543 107839
7113A07839j2400k1868j9651m0463L5426J1721O02m0109m7871R709J5306k7671
$$ 107839 95439 73571 53920 13457 48883 60604 61206 21097 -26774 -17065 -1759 -29430
7101b9430n741K0033j836p8201L2498N4753m40m5008m3641L7216N5283K7215n466
$$ -29430 -35171 -15138 -16974 -95175 -62677 -7924 -8364 -53372 -97013 -59797 -4514 22701 17235
7088A7235n1528m0475q847L9131J335k4266m799k5519J4008j014N237J9415l401
$$ 17235 -34293 -74768 -83615 -44484 -43149 -67415 -72214 -97733 -83725 -84739 -79502 -60087 -63488
7075f3488J2070J7798k597M2468l469j7485k4847p03K9629L104m2116m0058j3508
$$ -63488 -51418 -33620 -36217 6251 2782 -14703 -39550 -40253 -10624 -7520 -49636 -89694 -103202
7062a03202K3957J4966L3214q024m3940l0709J4275N7169O3989J8603l8458M841
$$ -103202 -79245 -64279 -31065 -39089 -83029 -113738 -99463 -42294 21695 40298 1840 6681
7050F681L7731K9541p0468m4141M1654O2231p4024j05343L3766J4366j8035L5978
$$ 6681 44412 73953 3485 -40656 998 63229 -10795 -116138 -82372 -68006 -86041 -50063
7038e0063l444k0217n595L60M0043L3310N82l4814k1087l012L1016j9866k1914
$$ -50063 -53507 -73724 -79319 -78959 -38916 -5606 -5024 -39838 -60925 -63937 -32921 -52787 -74701
7025g4701J4377N387R152K7289k154J3867K9742q888j499J4246J8876n3444m8108
$$ -74701 -60324 -54937 -45785 -18496 -20650 -6783 22959 14071 12572 26818 45694 -7750 -55858
7012e5858k1675N6939j8966j9596K6393k6029K372J617j1052k9492L4121N2737
$$ -55858 -77533 -20594 -39560 -59156 -32763 -58792 -56420 -54803 -65855 -95347 -61226 -8489
7000h489N3125q805k2399o0809l654K9113j3181n426J6766m526M6929k9046J2823
$$ -8489 44636 35831 13432 -47377 -51031 -21918 -35099 -40525 -23759 -28285 18644 -10402 2421
6987B421q998p562L049Q283p4818k527P3016m5869j1063N6712J3714J9966L3268
$$ 2421 -6577 -14139 -11090 -2807 -77625 -80152 -7136 -53005 -64068 -7356 6358 26324 59592
6974E9592m1699k0076J2314j1647j6876j0421P15j1198M3976N4393k3330p946
$$ 59592 17893 -2183 10131 -1516 -18392 -28813 -28098 -39296 4680 59073 35743 27797
6962B7797j5993L5566J1578l860J6002l2460r099r775k5437k8887L1465O645n0709
$$ 27797 11804 47370 58948 55088 71090 38630 29531 19756 -5681 -34568 -3103 3542 -47167
6949d7167J6909M8502M2728L823o6688k4261L4547j7177o2491k4456J01543N9234
$$ -47167 -30258 18244 60972 64795 -1893 -26154 8393 -8784 -71275 -95731 5812 65046
6937F5046L0112j8904j7374p6345l1590O3717L0606j7921o7254j8918m455J0581
$$ 65046 95158 76254 58880 -17465 -49055 14662 45268 27347 -39907 -58825 -63280 -52699
6925e2699J8310K0186L9003J8320m4582k9187J3986J2868j2443l4661K2506j8983
$$ -52699 -34389 -14203 24800 43120 -1462 -30649 -16663 -3795 -16238 -50899 -28393 -47376
6913d7376j1455N2194k0740o0662k426K1561j7742j2363K5285j57j5634p911J181
$$ -47376 -58831 -6637 -27377 -88039 -90465 -68904 -86646 -99009 -73724 -73881 -89515 -97426 -96245
6900i6245L087K8676J3848P422M417q068J8826K9965k0175n7250K8790L1714j1319
$$ -96245 -93158 -64482 -50634 -43212 -38795 -46863 -28037 1928 -18247 -75497 -46707 -14993 -26312
6887b6312j3495j6940K6241R416l2918j4405m339M2032M4408N4076j7710J3571
$$ -26312 -39807 -56747 -30506 -21090 -54008 -68413 -72752 -30720 13688 67764 50054 63625
6875F3625n154l5568m4664q958K2215K335k2793M9280K4064O486J4346K300r616
$$ 63625 58471 22903 -21761 -30719 -8504 -6169 -28962 20318 44382 50868 65214 67514 57898
6862E7898J2393J6105J9565l7896K5639k7963j7048M560j6269o2131m2127J1344
$$ 57898 70291 86396 105961 68065 93704 65741 48693 53253 36984 -25147 -67274 -55930
6850e5930K0999l6549J9045P1464K9514R720n7712r22K8459M284j6979o855j4200
$$ -55930 -34931 -71480 -52435 19029 48543 58263 551 -371 28088 32372 15393 8538 -5662
6837e662N419j4158j3876k7228K161K6172K3745n7509L5251M2290J0565j3866
$$ -5662 -243 -14401 -28277 -55505 -53344 -27172 -3427 -60936 -25685 16605 27170 13304
6825A3304k8160P819K4748j9208o5178k107N1257J4981k5215M7409L5952P533
$$ 13304 -14856 -7037 17711 -1497 -66675 -68782 -17525 -2544 -27759 19650 55602 63135
6813F3135j8099k9689l0093l978J8360L109k9483k5356L6102O467j3137m646K1900
$$ 63135 45036 15347 -14746 -18724 -364 2745 -26738 -52094 -15992 -9525 -22662 -27308 -5408
6800e408K1495K502K012j2145m4622L142k8944m1247l390j8038N0522N4768P021
$$ -5408 16087 18589 20601 8456 -36166 -33024 -61968 -103215 -106605 -124643 -74121 -19353 -12332
6787a2332L7924J312j6593j3247L6789J3754L8885J1017l2350j5195m5468n3051
$$ -12332 25592 26904 10311 -2936 33853 47607 86492 97509 65159 49964 4496 -48555
6775d8555K686l5081n4493J3167K1973P3927L6400j227m5604l2639M273K7708
$$ -48555 -45869 -80950 -135443 -122276 -100303 -26376 10024 8797 -36807 -69446 -65173 -37465
6763c7465O7019K3903l3680r792p631k2646j4235N0515M8045J9513Q040k7358
$$ -37465 29554 53457 19777 9985 2354 -20292 -34527 15988 64033 83546 91586 64228
6751F4228n1674o0579N5961J1347J010j7563K0534N3268j9213J458J7178j8417
$$ 64228 12554 -48025 7936 19283 20293 2730 23264 76532 57319 58777 75955 57538
6739E7538j4974m211O095N9055K3337j1560q589k2250l2066J3038J4135n426L6599
$$ 57538 42564 38353 44448 103503 126840 115280 106691 84441 52375 65413 79548 74122 110721
6726A10721P0537M8623Q2555J32027K02938K74321L30443M45643M95269L34814
$$ 110721 181258 229881 312436 444463 647401 921722 1252165 1697808 2193077 2527891
6716B527891j7096n38640o20390m04695k33085j50757q0788m6856l5774m9311
$$ 2527891 2510795 1972155 1351765 947070 713985 563228 482440 435584 399810 350499
6706C50499l3467l8858k2839Q264L1615j8586k2894m5289J9596J1704j4818j7087
$$ 350499 317032 278174 255335 263599 295214 276628 253734 208445 228041 239745 224927 207840
6694B07840K7969K5118l6697l1433L5715p374n2961l3213l5670k9312l6130k7251
$$ 207840 235809 260927 224230 192797 228512 221138 168177 134964 99294 69982 33852 6601
6682F601j077O858R855K3267K2272O556m583J46j1801J077k1248k6807j5181J8861
$$ 6601 5524 12382 22237 45504 67776 74332 69749 69895 58094 59171 37923 11116 -4065 14796
6668A4796j1873l1171K491N947J1291j7385j0100K8325N9219j6776k6397K2067
$$ 14796 2923 -28248 -25757 -19810 -8519 -25904 -36004 -7679 51540 34764 8367 30434
6656C0434L1084j2694k3428j172l236p879O316j8542n0508O751J0929J0078L2952
$$ 30434 61518 48824 25396 24224 20988 13109 19425 883 -49625 -42874 -31945 -21867 11085
6643A1085K1141o4732l2017J3605k6969k1001K2614k6696J4131P0939Q837m680
$$ 11085 32226 -32506 -64523 -50918 -77887 -98888 -76274 -102970 -88839 -17900 -9063 -13743
6631a3743L7029K368n2362l484K9226J2452J1502l88P889M4666M1317O745n5052
$$ -13743 23286 25654 -26708 -30192 -966 11486 22988 22600 30489 75155 116472 123217 68165
6618F8165Q14J0056J1202n5832p8795L7147J5202K5713J7726P925p621K5088n330
$$ 68165 68979 79035 90237 34405 -44390 -7243 7959 33672 51398 59323 51702 76790 71460
6605G1460n9243j1103K5986k6555M786l5416k3466K7877N2927o757M620m230O696
$$ 71460 12217 1114 27100 545 5331 -30085 -53551 -25674 27253 20496 25116 20886 27582
6592B7582m7530M990P264K465j3120j9902L7018R051L881p949j0474L791o595
$$ 27582 -19948 -14958 -7694 -5229 -18349 -38251 -1233 7818 11699 3750 -6724 -2933 -9528
6579i528K7923k3178l0542l9103j1967L9725J0615L2770N399l2461K1354j0106
$$ -9528 18395 -4783 -35325 -74428 -86395 -46670 -36055 -3285 2114 -30347 -8993 -19099
6567a9099J2697Q0153K4838l9370q6999l9406L6704J7140L192L2347l5812m6987
$$ -19099 -6402 73751 98589 59219 -27780 -67186 -30482 -13342 -10150 22197 -13615 -60602
6555f0602k682L9206j5127L8425O3339k5931n0969K1507N614k9772J4918N5664
$$ -60602 -63284 -24078 -39205 -780 62559 36628 -14341 7166 12780 -16992 -2074 53590
6543E3590k3455n8026K635j3428k6317j8801J4907K6425L296N280J2616J9938
$$ 53590 30135 -27891 -25256 -38684 -65001 -83802 -68895 -42470 -39174 -33894 -21278 -1340
6531a340M5120O9955Q505j8830m7709l1004k7195N52j0448m336n862k9454Q315
$$ -1340 43780 113735 122240 103410 55701 24697 -2498 -1946 -12394 -16730 -22592 -52046 -43731
6518d3731N1522R190K2885M133r446o3562R990K5758k0910l8023J8318N2870J2961
$$ -43731 7791 16981 39866 43999 34553 -29009 -19019 6739 -14171 -52194 -33876 18994 31955
6505C1955k3477J5086L4426j4159n5435k3255l1080J2335M6137L376j0982M2635
$$ 31955 8478 23564 57990 43831 -11604 -34859 -65939 -53604 -7467 -4091 -15073 27562
6493B7562k2728n0787j7131j5723L9858L9114q4l9047k6809j8956K8100L5062
$$ 27562 4834 -45953 -63084 -78807 -38949 165 81 -38966 -65775 -84731 -56631 -21569
6481b1569J4218K8903j4483l2526k8214m4846m99M1857M0821J7257m1367m809
$$ -21569 -7351 21552 7069 -25457 -53671 -98517 -99016 -57159 -16338 919 -40448 -45257
6469d5257L2951n41j2600k7972K7826K4549k0248j3156j1834o316J2603L0258
$$ -45257 -12306 -12847 -25447 -53419 -25593 -1044 -21292 -34448 -46282 -52598 -39995 -9737
6457i737J828l2657J0098K6329N381m3566l4864K6549N5499O356m2943J135j5806
$$ -9737 -7909 -40566 -30468 -4139 1242 -42324 -77188 -50639 4860 11216 -31727 -30592 -46398
6444d6398j7055K3510P3728J6090n5397m9610k1475r542j4075J944K8377J9959
$$ -46398 -63453 -39943 33785 49875 -5522 -55132 -76607 -86149 -100224 -98280 -69903 -49944
6432d9944l2630K4114N1183m3434r571O2075j4178l3889N9099J5406n420J7101
$$ -49944 -82574 -58460 -7277 -50711 -60282 1793 -12385 -46274 12825 28231 22811 39912
6420C9912O041k1052r667l042R877k9071m4089O770R905Q487j7619K4945M2959
$$ 39912 45953 24901 15234 12192 22069 -7002 -51091 -44321 -34416 -25929 -43548 -18603 24356
6407B4356J9968l4545l2376L1448K3818N5m776p470l4849k9559r767k4171M0755
$$ 24356 44324 9779 -22597 8851 32669 32724 27948 20478 -14371 -43930 -53697 -77868 -37113
6394c7113j1487q161M9346M7885j1532l855l4075M2675M5680o904j305r156m4034
$$ -37113 -48600 -56761 -7415 40470 28938 25083 -8992 33683 79363 72459 71154 61998 17964
6381A7964n1997K8761K1215K433j3298m877n394O692L2844j1253J8604j1487m9879
$$ 17964 -34033 -5272 15943 18376 5078 201 -5193 1499 34343 23090 41694 30207 -19672
6368a9672j8076P510R542J9493j5504m095o9060r700M9574j2151K7908J1142l051
$$ -19672 -37748 -30238 -20696 -1203 -16707 -20802 -89862 -99562 -49988 -62139 -34231 -23089 -26140
6355b6140L3997K7668l5773n4669J259j3029M7477N1800M2395L874o029q434l1763
$$ -26140 7857 35525 -248 -54917 -53658 -66687 -19210 32590 74985 78859 72830 64396 32633
6342C2633j0551l3996R517j3714k3645K6241J1539O77n9035K6130J6664J7838
$$ 32633 22082 -11914 -2397 -16111 -39756 -13515 -1976 -1299 -60334 -34204 -17540 298
6330B98l1666l6972M8075N6687j498l6200N399N2295J7326K538j2400l2221j2423
$$ 298 -31368 -68340 -20265 36422 34924 -1276 4123 56418 73744 76282 63882 31661 19238
6317A9238J1055J3077n807j3928L8307j3820m7980K3885J3083j8905l4147N748
$$ 19238 30293 43370 37563 23635 61942 48122 142 24027 37110 18205 -15942 -10194
6305a0194K0649k7541n6316J16R3561n953n8711J4233M5577j870j1068J751l3949
$$ -10194 10455 -17086 -73402 -73286 20275 14322 -44389 -30156 15421 13551 2483 4234 -29715
6292b9715k8048k809k9213L7319O1390K2311k8371k0817o9830p952N3872O543
$$ -29715 -57763 -60572 -89785 -52466 8924 31235 2864 -17953 -87783 -95735 -41863 -35320
6280c5320n498J6035m78l9260j4085N3716L5052K9867J7203j1864m3335j803q126
$$ -35320 -40818 -24783 -25261 -64521 -78606 -24890 10162 40029 57232 45368 2033 230 -7896
6267g896J0857K3929O264k5662m5586J331L8597M95K3966k6690j2959j257j6716
$$ -7896 2961 26890 33154 7492 -38094 -36763 1834 2329 26295 -395 -13354 -14611 -31327
6254c1327j6335r178M6296K7475L0668M705r964k4489o9073o3218L0595J4427
$$ -31327 -47662 -56840 -10544 16931 47599 52304 42340 17851 -51222 -114440 -83845 -69418
6242f9418J9537M3207J3242N1286M1158n3314j5954J2328o1410q1768P421L9986
$$ -69418 -49881 -6674 6568 57854 99012 45698 29744 42072 -19338 -101106 -93685 -53699
6230e3699n829n720j2152K7635J1289k3897k7537L2523J6357p397R849O446Q2398
$$ -53699 -59528 -65248 -77400 -49765 -38476 -62373 -89910 -57387 -41030 -48427 -38578 -32132 50266
6217E0266l4925l7758L4524L4735l4495l1223r734m5895k1077j4388K7474J2820
$$ 50266 15341 -22417 12107 46842 12347 -18876 -28610 -74505 -95582 -109970 -82496 -69676
6205f9676L1985K3628N959l852j0737j2234m702m7042L0484K4573K3888K4121
$$ -69676 -37691 -14063 -8104 -11956 -22693 -34927 -39629 -86671 -56187 -31614 -7726 16395
6193A6395K7329l4760o3971k365r456N415K8683N7959L5692k269l4098k0602n3536
$$ 16395 43724 8964 -55007 -57372 -66828 -61413 -32730 25229 60921 58652 24554 3952 -49584
6180d9584j3017J0904k1087J9773J5275K7589K7016l7529m830j3998k9630M1461
$$ -49584 -62601 -51697 -72784 -53011 -37736 -10147 16869 -20660 -25490 -39488 -69118 -27657
6168b7657K9702j6545j3669L9530m1807k2890J7035j5684q201q463L4453O4373
$$ -27657 2045 -14500 -28169 11361 -30446 -53336 -36301 -51985 -60186 -68649 -34196 30177
6156C0177J3869k2613k7217j845j0895l7714J3085k9298j7783K1374J3381k463
$$ 30177 44046 21433 -5784 -7629 -18524 -56238 -43153 -72451 -90234 -68860 -55479 -57942
6144e7942J5272J9039M7461j7097m9914k0375P0159O9174N890n1909n6367j697
$$ -57942 -42670 -23631 23830 6733 -43181 -63556 6603 75777 81667 29758 -26609 -28306
6132b8306N2068K1632j5092R854R858R654k3914l3263j5972J282l5318l3877L1282
$$ -28306 23762 45394 30302 40156 50014 59668 35754 2491 -13481 -12199 -47517 -81394 -50112
6119e0112J4014J7937m9862K084L3000J6719J9563K0639j6637m442j7861R159
$$ -50112 -36098 -18161 -68023 -65939 -32939 -16220 3343 23982 7345 2903 -14958 -5799
6107e799j9659j8313J2976R475M985m3169j8024l0013k245j2450J832L7127M7431
$$ -5799 -25458 -43771 -30795 -21320 -16335 -59504 -77528 -107541 -109786 -122236 -120404 -83277 -35846
6094c5846K9975J502J1290M1329j3575j6394o582k1670l8937n3406q392L3179
$$ -35846 -5871 -4369 6921 48250 34675 18281 11699 -9971 -48908 -102314 -110706 -77527
6082g7527M9607J6336k0866N8214J4146n1979l2812J2980M2500K8755k2677k9134
$$ -77527 -27920 -11584 -32450 25764 39910 -12069 -44881 -31901 10599 39354 16677 -12457
6070a2457k0471k1215K4546M8144K6833l9035l0132j4759k2407k320K8315M72
$$ -12457 -32928 -54143 -29597 18547 45380 6345 -23787 -38546 -60953 -63273 -34958 -34486
6058c4486k6701j9662l3030O2867N9066M7559l3390q3061l8532J5833N8592J9388
$$ -34486 -61187 -80849 -113879 -51012 8054 55613 22223 -60838 -99370 -83537 -24945 -5557
6046e557k0310j0504l5123J5345L8435P203M1400P652n4463K5685L4402k062j7179
$$ -5557 -25867 -36371 -71494 -56149 -17714 -10511 30889 38541 -15922 9763 44165 42103 24924
6033B4924n2834j8681J3234K3347J8285L6243k0149j9187K344R300l6828P378
$$ 24924 -27910 -46591 -33357 -10010 8275 44518 24369 5182 7526 16826 -20002 -12624
6021a2624j4482K1464P8385P734k7535o1712o1887N909M1287j882P776K6k2513
$$ -12624 -27106 -5642 72743 80477 52942 -8770 -70657 -64748 -23461 -25343 -17567 -17541 -40054
6008d0054l2211j9267O0862J9915K8158J2439k6821J3682p288j9334q956M2084
$$ -40054 -72265 -91532 -30670 -10755 17403 29842 3021 16703 9415 -9919 -18875 23209
5996B3209J3440J2164J0207j6325m7374n5976r903J0911J1613K9214l755M0742
$$ 23209 36649 48813 59020 42695 -4679 -60655 -70558 -59647 -48034 -18820 -22575 18167
5984A8167j4032r450J6958j2617K569n499k7824j6835J6443J5140q961K638l6827
$$ 18167 4135 -5315 11643 -974 1595 -3904 -31728 -48563 -32120 -16980 -25941 -23303 -60130
5971f0130R695J9779K3755R273p890J99m310O655N112l6020o142K2427j0227k4763
$$ -60130 -50435 -30656 -6901 2372 -5518 -5319 -9629 -2974 2138 -33882 -40024 -17597 -27824 -52587
5957e2587Q644L1562J7932j8327k434J8307K2026j6981L8658j0926j5344J856
$$ -52587 -43943 -12381 5551 -12776 -15210 3097 25123 8142 46800 35874 20530 22386
5945B2386J587n5053j7223L9245k2j2771l607M0114n5280K859L1891L7693J1810
$$ 22386 23973 -31080 -48303 -9058 -9080 -21851 -25458 14656 -40624 -37765 -5874 31819 43629
5932D3629l244L3143l8819m2971J2196n532n3147l1919M5320O1452j6468o6992
$$ 43629 40385 73528 34709 -8262 3934 -1598 -54745 -86664 -41344 20108 3640 -63352
5920f3352K4541l486j7969J4448m9610j4277J2195J380K0153M8213Q4641l6703
$$ -63352 -38811 -42297 -60266 -45818 -95428 -109705 -97510 -96130 -75977 -27764 56877 20174
5908B0174l8248j2856K6655P119m3881l6319L0536O0265j6454l1556J1923K1739
$$ 20174 -18074 -30930 -4275 2844 -41037 -77356 -46820 13445 -3009 -34565 -22642 -903
5896i03j1838R55k4413M1675O629K3414m373j0567K9474m7479N119j0573J9740
$$ -903 -12741 -11786 -36199 5476 12105 35519 31146 20579 50053 2574 7693 -2880 16860
5883A6860N1656Q124n4016j7576m2223J2346J7717K9281j4797j9626J1627k889
$$ 16860 68516 76640 22624 5048 -37175 -24829 -7112 22169 7372 -12254 -627 -3516
5871c516K2589k5140R694L3696J5508k6209j7742m3264p7440J7727O858K4762
$$ -3516 19073 -6067 3627 37323 52831 26622 8880 -34384 -111824 -94097 -87239 -62477
5859f2477j5055k0920L5507M5604j6054l1485N4574N5863j7613N41n779N508j1762
$$ -62477 -77532 -98452 -62945 -17341 -33395 -64880 -10306 45557 27944 28485 22706 28214 16452
5846A6452l0465R06k8495m645K7913j014l272q503k7827J5701j1975M9010j4166
$$ 16452 -14013 -13107 -41602 -46247 -18334 -19348 -22620 -31123 -58950 -43249 -55224 -6214 -20380
5833b0380K4600n934l3603K6562K7169r531k175L0410l2223k6604K9847j1415
$$ -20380 4220 -1714 -35317 -8755 18414 8883 6708 37118 4895 -21709 8138 -3277
5821c277j7548J1897k2111j5493L4957K5977J7720q416j052P983l0414p104P905
$$ -3277 -20825 -8928 -31039 -46532 -11575 14402 32122 23706 22654 30637 223 -6881 1024
5808A024m2773k264P546J6064R890J5160K9192m9437o3508O565R558k0263J4588
$$ 1024 -41749 -44013 -36467 -20403 -10513 4647 33839 -15598 -79106 -72541 -62983 -83246 -68658
5795f8658l7965J2589K199L7120M9k8568K6696r51l7953j3018K2248j8858P068
$$ -68658 -106623 -94034 -91835 -54715 -54666 -83234 -56538 -57489 -95442 -108460 -86212 -105070 -98002
5782i8002Q3594L7598l1207j067l8152k185M7536L6928n0577l3892j54k8620N710
$$ -98002 -14408 23190 -8017 -9084 -47236 -49421 -1885 35043 -15534 -49426 -49580 -78200 -72490
5769g2490M8109M0261K4850K8002j4959J0906O203j5277j106m4791K376k177k7508
$$ -72490 -24381 15880 40730 68732 53773 64679 70882 55605 54499 9708 12084 9907 -17601
5756a7601j8353m583J0280l570M2533l7522k0208l0629J1384M7736j3552l5483
$$ -17601 -35954 -40537 -30257 -33827 8706 -28816 -49024 -79653 -68269 -20533 -34085 -69568
5744f9568j1608O1378K300K6592j7501l0900K349J6577M1852J1892j4084J8275
$$ -69568 -81176 -19798 -17498 9094 -8407 -39307 -36958 -20381 21471 33363 19279 37554
5732C7554Q156J6073j1975j4413O178J3948j1022n5705k9970J3229O1492p451
$$ 37554 45710 61783 49808 35395 41573 55521 44499 -11206 -41176 -27947 33545 26094
5720B6094R652K7047M547l479j1796j6786j7284J0316N171r020k7453j8374k5068
$$ 26094 35746 62793 67340 63861 52065 35279 17995 28311 33482 24462 -2991 -21365 -46433
5707d6433K3697M6793K0393Q477Q128R717J8447p3600o7332n743K1872P082k0025
$$ -46433 -22736 24057 44450 52927 61055 70772 89219 15619 -51713 -57456 -35584 -28502 -48527
5694d8527J0609J3261k3976j8936M918K0697L5570J1132j1456m4694J016r408
$$ -48527 -37918 -24657 -48633 -67569 -62651 -41954 -6384 4748 -6708 -51402 -50386 -59794
5682e9794J9798Q284L9034k6440j5430J4784N2124k2534J1657l422l4318l898
$$ -59794 -39996 -31712 7322 -19118 -34548 -19764 32360 9826 21483 18061 -16257 -20155
5670b0155r093l0542M112J7127N5596k754L646k7253J9548J7712l571P994j7605
$$ -20155 -29248 -59790 -55678 -38551 17045 14291 17937 -9316 10232 27944 24373 32367 14762
5657A4762r044J6265L2987K4430O180j6786J011j4254n4167k2238Q504J5974j1318
$$ 14762 5718 21983 54970 79400 85580 68794 69805 55551 1384 -20854 -12350 3624 -7694
5644g694n848K6859j0101n3357m6107Q6301J02161n313k1952l2361l433n942k5618
$$ -7694 -13542 13317 3216 -50141 -96248 -9947 92214 86901 64949 32588 29155 23213 -2405
5631b405j947l6559n0224O387J9593M3003K7460p927J3451N930k3574L5513j3004
$$ -2405 -4352 -40911 -91135 -84748 -65155 -22152 5308 -2619 10832 16762 -6812 28701 15697
5618A5697n491n0375N238J1178J7216n933j1078K281K699K514j994l3136j0057
$$ 15697 10206 -40169 -34931 -23753 -6537 -12470 -23548 -21267 -18568 -16054 -18048 -51184 -61241
5605f1241j0368K3090K2588K2531j1431n8038n698L793M3232N1159K0821J1029
$$ -61241 -71609 -48519 -25931 -3400 -14831 -72869 -78567 -74774 -31542 19617 40438 51467
5593E1467r88j9402L4224l385j5162K2436m0582m7657j4191L9533k483J5295O5817
$$ 51467 50479 31077 65301 61916 46754 69190 28608 -19049 -33240 6293 3810 19105 84922
5580H4922M5009m1560k7130k1535m9001M299O1827L737m7441j9120L0345k2960
$$ 84922 129931 88371 61241 39706 -9295 -4996 56831 60568 13127 -5993 24352 1392
5568A392q276l1804M8389N2908l3174l1511k8249k1129k1772J7184N4249J5652
$$ 1392 -6884 -38688 9701 62609 29435 -2076 -30325 -51454 -73226 -56042 -1793 13859
5556A3859J2295j0244j9388L7119K0741J458Q44k0131l7215k5053l8315K1955
$$ 13859 26154 15910 -3478 33641 54382 55840 56684 36553 -662 -25715 -64030 -42075
5544d2075L7564K1668m567M42L9870k837m6094p1372p071N227L2337M3082R509
$$ -42075 -4511 17157 12590 13032 52902 50065 3971 -67401 -74472 -69245 -36908 6174 15683
5531A5683P971J5227l351j1822k7124l7090L7038j0923m9346n6693K943K6214
$$ 15683 23654 38881 35530 23708 -3416 -40506 -3468 -14391 -63737 -120430 -117487 -91273
5519i1273L6688J8365r811J8796M6586J7763k0578l2879k2462N2368j059J689
$$ -91273 -54585 -36220 -46031 -27235 19351 37114 16536 -16343 -38805 13563 12504 14193
5507A4193k2543L118L6285O018n39l7314j0341k5018q612j0865p99K2283M3294
$$ 14193 -8350 -5232 31053 37071 36532 -782 -11123 -36141 -44753 -55618 -56417 -34134 9160
5494I160N259k5459l3981m0229m4926M8409L1591K7657M5479R408j5650l0851
$$ 9160 14419 -11040 -45021 -85250 -130176 -81767 -50176 -22519 22960 32368 16718 -14133
5482a4133l5283k0417m0036J6126M2961O6128N9250l5971l4063l7838o581L285
$$ -14133 -49416 -69833 -109869 -93743 -50782 15346 74596 38625 4562 -33276 -39857 -36572
5470c6572L9660j1072J706J3726j3268j740p964l1887N609L3307M8510Q768Q221
$$ -36572 3088 -7984 -6278 7448 -5820 -7560 -15524 -47411 -41802 -8495 40015 48783 57004
5457E7004k6757J7398l8888j6063o1960j3568M9473L0019r818k5778l643K86k341
$$ 57004 30247 47645 8757 -7306 -69266 -82834 -33361 -3342 -13160 -38938 -42581 -42295 -44636
5444d4636R197L0669J1631j0860j9832K1073j1341K6366K9093k3237m9515J231
$$ -44636 -35439 -4770 6861 -3999 -23831 -2758 -14099 12267 41360 18123 -31392 -30161
5432c0161l419L9781J9767j6268n0848l4915N76N1597N8724L5925l48l5008n4429
$$ -30161 -33580 6201 25968 9700 -41148 -76063 -75487 -23890 34834 70759 70411 35403 -19026
5419a9026l2838K5279O9081L7417l7038n2971Q863k1238m1252j2588k359J8534
$$ -19026 -51864 -26585 42496 79913 42875 -10096 -1233 -22471 -63723 -76311 -78670 -60136
5407f0136L7083K2814m5554o4595K1394J9663J6238K4608j642r029K1000L1724
$$ -60136 -23053 -239 -45793 -110388 -88994 -69331 -53093 -28485 -30127 -39156 -18156 13568
5395A3568k7821K1372L1360l611J0427j8761p7196K416l1958n815J9040L1024
$$ 13568 -14253 7119 38479 34868 45295 26534 -50662 -48246 -80204 -86019 -66979 -35955
5383c5955j0695J0758J4021J2585N8544K1765m0887o552j4520k5264J4946K0653
$$ -35955 -46650 -35892 -21871 -9286 49258 71023 30136 23584 9064 -16200 -1254 19399
5371A9399K6099k806m4066k0882o485N520L6261N2064l4702J3816L3047N442L8205
$$ 19399 45498 42692 -1374 -22256 -28741 -23221 13040 65104 30402 44218 77265 82707 120912
5358A20912j7619p2557P343L0844l1978j8827L029L7232L6091n6860k0325J3215
$$ 120912 103293 30736 38079 68923 36945 18118 21147 58379 94470 37610 17285 30500
5346C0500n538l4800p398l6857K5907J1024N4478K5377j3556k9802m4374J0313
$$ 30500 24962 -9838 -17236 -54093 -28186 -17162 37316 62693 49137 19335 -25039 -14726
5334a4726K9380P413l9759P32J8086l6452k9085K1003J4388J9959J046K759M3902
$$ -14726 14654 22067 -17692 -16960 1126 -35326 -64411 -43408 -29020 -9061 -8015 -5256 38646
5321C8646K7234j6696k1383k4110l5881j0017j5791m243K6112K0865L2832O2153
$$ 38646 65880 49184 27801 3691 -32190 -42207 -57998 -62241 -36129 -15264 17568 79721
5309G9721k6961k573k2141l3558K3994q349l1396l6114L4412K8953k1977r599
$$ 79721 52760 50187 28046 -5512 18482 10133 -21263 -57377 -22965 5988 -15989 -25588
5297b5588M3333P8564n5172r6360m184K1606J2945q597k925N3260Q982k7899o834
$$ -25588 17745 96309 41137 -55223 -59407 -37801 -24856 -33453 -36378 16882 25864 -2035 -8869
5284h869k0789r163j9918J6429K8296M5484K4120j2411j3162l5485k5745k2974
$$ -8869 -29658 -38821 -58739 -42310 -14014 31470 55590 43179 30017 -5468 -31213 -54187
5272e4187p808L1573L476L0360j7172O451n3700J7703l161J6074M415N8500j9066
$$ -54187 -61995 -30422 -26946 3414 -13758 -7307 -61007 -43304 -46465 -30391 -25976 32524 13458
5259A3458n2881m270K9826Q270r721k405k45r798P917m1681R280k3360o046J0159
$$ 13458 -39423 -43693 -13867 -5597 -15318 -17723 -17968 -27766 -19849 -61530 -52250 -75610 -81656 -71497
5245g1497P6174k757n627O581N258o1282m8748k279j6744R132K2461L9433K1987
$$ -71497 4677 1920 -3707 2874 8132 -53150 -101898 -104177 -120921 -111789 -89328 -49895 -27908
5232b7908k5194K938J3481J2296j6307j9970J8475J3716k869K6429K1901J765
$$ -27908 -53102 -50164 -36683 -24387 -40694 -60664 -42189 -28473 -31342 -4913 16988 18753
5220A8753J9863j6260j0865R44j2925N528J0538k6462l1833l50P530N005k1651
$$ 18753 38616 22356 11491 12435 -490 5038 15576 -10886 -42719 -43069 -35539 -30534 -52185
5207e2185j730L7042K8608l054k081l0351j7722P641L0027N5823k2989k3937J0015
$$ -52185 -53915 -16873 11735 8681 6600 -23751 -41473 -33832 -3805 52018 29029 5092 15107
5194A5107m60n6919l0066K1329N5990L8780j9054K5390j9313l612k0481j3793
$$ 15107 14647 -42272 -72338 -51009 4981 43761 24707 50097 30784 27172 6691 -7102
5182g102P962o534O982j6703j2760M7917k5869p05l0402n4032M143k529M4028
$$ -7102 860 -5674 1308 -15395 -28155 19762 -6107 -6812 -37214 -91246 -87103 -89632 -45604
5169d5604Q646P559N845O556N6657L8689j9180p9655j1897J5217O0751J5695k0146
$$ -45604 -36958 -29399 -23554 -16998 39659 78348 59168 -20487 -32384 -17167 43584 59279 39133
5156C9133j88J7827j9352J7419L0920j5325l2071p3251l6576Q9105O0727m7583
$$ 39133 38945 56772 37420 54839 85759 70434 38363 -34888 -71464 17641 78368 30785
5144C0785m2823j5899n522m5877M1335K805o191J4119K7177N3686M5856k5265
$$ 30785 -12038 -27937 -33459 -79336 -38001 -35196 -41387 -27268 -91 53595 99451 74186
5132G4186L425N375k3570m3323m2536k6703K6755m006K2598L8468m5484o378N6807
$$ 74186 77611 82986 59416 16093 -26443 -53146 -26391 -30397 -7799 30669 -14815 -21193 35614
5119C5614L6352K1950p1825p5278r745J2092J9734L7958J6639K549k2653j2280
$$ 35614 71966 93916 22091 -53187 -62932 -50840 -31106 6852 23491 26040 3387 -8893
5107h893M597L635Q511r814k2997K0886k219L2936j0307l4034l5236l8208L9422
$$ -8893 -4296 -661 7850 -1964 -24961 -4075 -6294 26642 16335 -17699 -52935 -91143 -51721
5094e1721N3250r893Q8233J1312m978l1720o4765K612L7459J6706k77m9364k7613
$$ -51721 1529 -8364 79869 91181 86203 54483 -10282 -7670 29789 46495 46218 -3146 -30759
5081c0759N770j4907k3579J1778K4992M4615K224k535q789k4651m5006j4033l7550
$$ -30759 -24989 -39896 -63475 -51697 -26705 17910 20134 17599 8810 -15841 -60847 -74880 -112430
5068a12430j2971L8427N3861k2799O6J0807J4774l044k8486k7994K2603K5460
$$ -112430 -125401 -86974 -33113 -55912 -55846 -45039 -30265 -33309 -61795 -89789 -67186 -41726
5056d1726l4201k1165L5284K0842M0728L5828l5933o7478j6704O906m015Q2130
$$ -41726 -75927 -97092 -61808 -40966 -238 35590 -343 -67821 -84525 -77619 -81634 496
5044D96k913j2413m5928n7596K9074K0802j209l0742Q765N6953L6979P851j7437
$$ 496 -2417 -14830 -60758 -118354 -89280 -68478 -69687 -100429 -91664 -34711 2268 10119 -7318
5031g318j1259M4057k977o9736j3269q247n181N159L4597O853m6595K0881N4166
$$ -7318 -18577 25480 22503 -47233 -60502 -68749 -73930 -68771 -34174 -27321 -73916 -53035 1131
5018A131K6370K4577l2670m6870l350M0258J3808j7555k9551N46q120j3039j2392
$$ 1131 27501 52078 19408 -27462 -30812 9446 23254 5699 -23852 -23306 -31426 -44465 -56857
5005e6857m3434j7147K2767J7004O334m932N430J9347J1195K1224j8429j5907
$$ -56857 -100291 -117438 -94671 -77667 -71333 -76265 -70835 -51488 -40293 -19069 -37498 -53405
4993e3405R427M4705j7381k1503L8845Q890L561j0277K658J4684N0135k6006j3996
$$ -53405 -43978 727 -16654 -38157 688 9578 13139 2862 5520 20204 70339 44333 30337
4980C0337j6296j9643N664j6755L0477L0826n2867L7471L8059k1104m2481j0999
$$ 30337 14041 -5602 62 -16693 13784 44610 -8257 29214 67273 46169 3688 -7311
4968g311m28J7093K3313m3091j7133J7062L0513O396M0901l6561n2566K0200J3312
$$ -7311 -7739 9354 32667 -10424 -27557 -10495 20018 26414 67315 30754 -21812 -1612 11700
4955A1700j5510k7900N403k8450j2364M3101Q885n136l4749K3883M5912k2760
$$ 11700 -3810 -31710 -26307 -54757 -67121 -24020 -15135 -20271 -55020 -31137 14775 -7985
4943g985l1544Q099N3752K4482j0540j6342k2690R541P5067M1639p2142m5455
$$ -7985 -39529 -31430 22322 46804 36264 19922 -2768 6773 81840 123479 51337 5882
4931E882j7131j3538k1182R84j0718P533Q5607M4963l7489n5967l6424l2412K0120
$$ 5882 -11249 -24787 -45969 -44985 -55703 -48170 37437 82400 44911 -11056 -47480 -79892 -59772
4918e9772L0702j4604M9643N1858k7549l1013j5198j9999j0807O623J3927J2862
$$ -59772 -29070 -43674 5969 57827 30278 -735 -15933 -35932 -46739 -40116 -26189 -13327
4906a3327K0872j8184p4582R917R3870K1912k6265m1089l0893J4151M5572l8515
$$ -13327 7545 -10639 -85221 -75304 18566 40478 14213 -26876 -57769 -43618 1954 -36561
4894c6561n2476M775j1147K8604J2883L3062K571P269j6961J5927m756J8170K9637
$$ -36561 -89037 -84262 -95409 -66805 -53922 -20860 -18289 -11020 -27981 -12054 -16810 1360 30997
4881C0997n1886L066N0793J0172q129k6453k1065L5433N0530j9815n2936m997
$$ 30997 -20889 -17823 32970 43142 35013 8560 -12505 22928 73458 53643 707 -4290
4869d290J7909p571m9370j4395j6488K2301k227r329M6092K378k0485j0549k3581
$$ -4290 13619 6048 -43322 -57717 -74205 -51904 -54131 -63460 -17368 -14990 -35475 -46024 -69605
4856f9605j67k6464j58N1376O0671j3193l7645J1065l5811N5443J8916j0274o118
$$ -69605 -69772 -96236 -96394 -45018 15653 2460 -35185 -24120 -59931 -4488 14428 4154 -1964
4843a964l9904j5417L5213J6526k8721K4923L3554J6280k966m5469M975k3730
$$ -1964 -41868 -57285 -22072 -5546 -34267 -9344 24210 40490 37524 -7945 -2970 -26700
4831b6700J143N0288L5600M503m0350k1203J4630P7886l095l4173j6647k5520
$$ -26700 -25557 24731 60331 64834 24484 3281 17911 95797 92702 58529 41882 16362
4819A6362l9154j0988N4893K0095j4060M1225j6325Q913N4689J710k9475p2682
$$ 16362 -22792 -33780 21113 41208 27148 68373 52048 60961 115650 117360 87885 15203
4807A5203k7191L5987k8476k0067M5041P033J6793k3285m0352l5611k1738k2585
$$ 15203 -11988 23999 -4477 -24544 20497 27530 44323 21038 -19314 -54925 -76663 -99248
4795i9248O1902j9119J4495p637L3761J9626p102m526m2234m678P216k411j9274
$$ -99248 -37346 -56465 -41970 -49607 -15846 3780 -3322 -7848 -50082 -54760 -47544 -49955 -69229
4782f9229K9986O1075J7124m2732p689K6441N626k7667j8302j0878J8300J1042
$$ -69229 -39243 21832 38956 -3776 -11465 14976 20602 -7065 -25367 -36245 -17945 -6903
4770f903k778k8888l9605l7874n0326N0854P0034O043n3776j6285j8834M3872
$$ -6903 -9681 -38569 -78174 -116048 -166374 -115520 -45486 -39443 -93219 -109504 -128338 -84466
4758h4466K5059M924J0321K675L8137j2062k0912K9408m4148K029K1558k053M6513
$$ -84466 -59407 -54483 -44162 -41487 -3350 -15412 -36324 -6916 -51064 -49035 -27477 -29530 16983
4745A6983K0964q470l048l4595l425K1896m4857o7661J067M0296O1342K1028K701
$$ 16983 37947 29477 26429 -8166 -11591 10305 -34552 -102213 -101146 -60850 492 21520 24221
4732B4221M5245K4917k5334K468L0611m5694k0427j5011j361R36m473l5113l3464
$$ 24221 69466 94383 69049 71517 102128 56434 36007 20996 19635 20571 16098 -19015 -52479
4719e2479M8214J3828k8898l9710K2748N2430l5634L948Q255M657j2238N159J3074
$$ -52479 -4265 9563 -19335 -59045 -36297 16133 -19501 -15553 -7298 -2641 -14879 -9720 3354
4706C354K4918J085q875M3335J5305n9321j572J2275k4655R97K5061N0412j3577
$$ 3354 28272 29357 20482 63817 79122 19801 18229 30504 5849 6846 31907 82319 68742
4693F8742l0177k5538n3753j4039K3844O060j3831k276M2341J7985O582J3070
$$ 68742 38565 13027 -40726 -54765 -30921 -24861 -38692 -40968 1373 19358 25940 39010
4681C9010j4887j9424K6558j1186l2681J0643m4152m1769J6579K5357K690L3917
$$ 39010 24123 4699 31257 20071 -12610 -1967 -46119 -87888 -71309 -45952 -43262 -9345
4669i345O3752L580P140J0997J3540l3143L108J500l3102l7147J7718J4906r840
$$ -9345 54407 57987 65127 76124 89664 56521 59629 61129 28027 -9120 8598 23504 13664
4656A3664k0409Q78q181O5391J09630k0201j04594o5180J2231N0904j6605P56
$$ 13664 -6745 -5867 -14048 51343 160973 140772 36178 -29002 -16771 34133 17528 18284
4644A8284J9609o282q890m5863O19J7121K8711K2053l2109j9264m5021n1094k5172
$$ 18284 37893 31611 22721 -23142 -22523 -5402 23309 45362 13253 -6011 -51032 -102126 -127298
4631a27298M5359N3069p588k1268L2145L2014R195l9963Q681J4394J0273J4080
$$ -127298 -81939 -28870 -36458 -57726 -25581 6433 15628 -24335 -15654 -1260 9013 23093
4619B3093n48j7034n1489m6069j0818k164K0552K6430K5613K7246L0933N0382
$$ 23093 22545 5511 -45978 -92047 -102865 -105029 -84477 -58047 -32434 -5188 25745 76127
4607G6127j6662L958K092N567J6489k6174J022k8805n3868k7938J3787N4022L1771
$$ 76127 59465 63423 65515 71082 87571 61397 62419 33614 -20254 -48192 -34405 19617 51388
$$ [...]
##END NTUPLES=NMR SPECTRUM
##END=
