##TITLE=Analysis number 321684
Compound Code cd 08075
Project Code adrs
Chemist Name fudan
##JCAMPDX= 6.0         $$ Bruker NMR JCAMP-DX V2.0
##DATA TYPE= NMR SPECTRUM
##DATA CLASS= NTUPLES
##ORIGIN= Bruker BioSpin GmbH
##OWNER= nmr
$$ XWIN-NMR		Version 3.5
$$ Tue Aug 22 12:39:12 2006 GMT Daylight Time (UT+1h)  MAYBRIDGE\nmr@NMR_250MHZ
##.OBSERVE FREQUENCY= 250.131544655141
##.OBSERVE NUCLEUS= ^1H
##.ACQUISITION MODE= SIMULTANEOUS (DQD)
##.ACQUISITION SCHEME= undefined
##.AVERAGES= 16
##.DIGITISER RES= 18
##SPECTROMETER/DATA SYSTEM= dpx250
##.PULSE SEQUENCE= zg30
##.SOLVENT NAME= CDCl3
##.SHIFT REFERENCE= (INTERNAL, CDCl3, 0, 16.522)
##AUDIT TRAIL= $$ (NUMBER, WHEN, WHO, WHERE, WHAT)
$$ ##TITLE= Audit trail, XWIN-NMR		Version 3.5
$$ ##JCAMPDX= 5.01
$$ ##ORIGIN= Bruker BioSpin GmbH
$$ ##OWNER= nmr
$$ C:\u/data/dgb/nmr/ADRS/1350/pdata/1/auditp.txt
$$ ##AUDIT TRAIL=  $$ (NUMBER, WHEN, WHO, WHERE, WHAT)
(   1,<2006-08-22 12:38:41.07 +100>,<MAYBRIDGE\nmr>,<NMR_250MHZ>,
      <created by zg, POWCHK disabled, PULCHK disabled
       configuration hash MD5:
       E2 DF 36 D8 04 B2 41 60 5A D7 A3 38 5A 4B D0 FE
       data hash MD5: 64K
       86 17 01 1D 14 28 02 ED EE 94 B3 66 11 DA C3 3D>)
(   2,<2006-08-22 12:38:55.97 +100>,<MAYBRIDGE\nmr>,<NMR_250MHZ>,
      <Start of raw data processing
       ef LB = 0.3 FT_mod = 6 PKNL = 1 SI = 32K 
       data hash MD5: 32K
       1C 48 2E 1B 74 57 5F 6A 47 1D 87 83 CF 0E 77 80>)
(   3,<2006-08-22 12:39:00.32 +100>,<MAYBRIDGE\nmr>,<NMR_250MHZ>,
      <apk 
       data hash MD5: 32K
       B0 A2 84 37 6C 29 3B 08 55 E7 F2 E7 D3 E8 4D DB>)
(   4,<2006-08-22 12:39:01.96 +100>,<MAYBRIDGE\nmr>,<NMR_250MHZ>,
      <abs ABSG = 5 
       data hash MD5: 32K
       9D 50 F0 E9 D8 61 BE 83 1C 93 35 ED 46 D4 99 55>)
$$ ##END=
$$ 
$$ hash MD5
$$ DD 18 23 79 66 B2 2C 60 13 A8 2C 1E 3F 29 7E CF
##$RELAX= 
##$RELAX= 
##$RELAX= 
##$RELAX= 
##$RELAX= 
##$RELAX= 
##$RELAX= 
$$ Bruker specific parameters
$$ --------------------------
##$DU= <C:\u>
##$EXPNO= 1350
##$NAME= <ADRS>
##$PROCNO= 1
##$TYPE= <nmr>
##$USER= <dgb>
##$AMP= (0..31)
100 100 100 100 100 100 100 100 100 100 100 100 100 100 100 100 100 100 
100 100 100 100 100 100 100 100 100 100 100 100 100 100 
##$AQSEQ= 0
##$AQ_mod= 3
##$AUNM= <au_zg>
##$AUTOPOS= <29 >
##$BF1= 250.13
##$BF2= 250.13
##$BF3= 250.13
##$BF4= 250.13
##$BF5= 500.13
##$BF6= 500.13
##$BF7= 500.13
##$BF8= 500.13
##$BYTORDA= 1
##$CFDGTYP= 0
##$CFRGTYP= 5
##$CHEMSTR= <none>
##$CNST= (0..31)
1 1 145 1 1 1 1 1 1 1 1 1 1 1 1 1 1 1 1 1 1 1 1 1 1 1 1 1 1 1 1 1 
##$CPDPRG= <>
##$CPDPRG1= <>
##$CPDPRG2= <>
##$CPDPRG3= <>
##$CPDPRG4= <mlev>
##$CPDPRG5= <mlev>
##$CPDPRG6= <mlev>
##$CPDPRG7= <mlev>
##$CPDPRG8= <mlev>
##$CPDPRGB= <>
##$CPDPRGT= <>
##$D= (0..31)
0 1 0 0 0 0 0 0 0 0.06 0 0 0 0 0 0 0.0002 0 0 0 0 0 0 0 0 0 0 0 0 0 0 
0 
##$DATE= 1156246719
##$DBL= (0..7)
120 120 120 120 120 120 120 120 
##$DBP= (0..7)
150 150 150 150 150 150 150 150 
##$DBP07= 0
##$DBPNAM0= <>
##$DBPNAM1= <>
##$DBPNAM2= <>
$$ [...]
##$SUBNAM7= <"">
##$SUBNAM8= <"">
##$SUBNAM9= <"">
##$SW= 20.6930455092707
##$SWIBOX= (0..15)
0 0 3 0 0 0 0 0 0 0 0 0 0 0 0 0 
##$SW_h= 5175.983436853
##$TD= 65536
##$TD0= 1
##$TE= 295.16
##$TE2= 300
##$TE3= 300
##$TEG= 300
##$TL= (0..7)
0 120 120 120 120 120 120 120 
##$TP= (0..7)
150 150 150 150 150 150 150 150 
##$TP07= 0
##$TPNAME0= <>
##$TPNAME1= <>
##$TPNAME2= <>
##$TPNAME3= <>
##$TPNAME4= <>
##$TPNAME5= <>
##$TPNAME6= <>
##$TPNAME7= <>
##$TPOAL= (0..7)
0.5 0.5 0.5 0.5 0.5 0.5 0.5 0.5 
##$TPOFFS= (0..7)
0 0 0 0 0 0 0 0 
##$TUNHIN= 0
##$TUNHOUT= 0
##$TUNXOUT= 0
##$USERA1= <user>
##$USERA2= <user>
##$USERA3= <user>
##$USERA4= <user>
##$USERA5= <user>
##$V9= 5
##$VALIST= <valist>
##$VCLIST= <CCCCCCCCCCCCCCC>
##$VD= 0
##$VDLIST= <DDDDDDDDDDDDDDD>
##$VPLIST= <PPPPPPPPPPPPPPP>
##$VTLIST= <TTTTTTTTTTTTTTT>
##$WBST= 1024
##$WBSW= 4
##$XGAIN= (0..3)
0 0 0 0 
##$XL= 0
##$YL= 0
##$YMAX_a= 226000
##$YMIN_a= -444815
##$ZGOPTNS= <>
##$ZL1= 120
##$ZL2= 120
##$ZL3= 120
##$ZL4= 120
##$ABSF1= 16.522
##$ABSF2= -4.171173
##$ABSG= 5
##$ABSL= 3
##$ALPHA= 0
##$AQORDER= 0
##$ASSFAC= 0
##$ASSFACI= 0
##$ASSFACX= 0
##$ASSWID= 0
##$AUNMP= <proc_1d>
##$AZFE= 0.1
##$AZFW= 0.1
##$BCFW= 0
##$BC_mod= 0
##$BYTORDP= 0
##$COROFFS= 0
##$CY= 12.5
##$DATMOD= 1
##$DC= 0
##$DFILT= <>
##$DTYPP= 0
##$F1P= 14.0000005364418
##$F2P= -0.99999901652339
##$FCOR= 0.5
##$FTSIZE= 32768
##$FT_mod= 6
##$GAMMA= 0
##$GB= 0
##$INTBC= 1
##$INTSCL= 1
##$ISEN= 128
##$LB= 0.3
##$LEV0= 0
##$LPBIN= 0
##$MAXI= 10000
##$MC2= 0
##$MEAN= 0
##$ME_mod= 0
##$MI= 0
##$NCOEF= 0
##$NC_proc= -5
##$NLEV= 6
##$NOISF1= 0
##$NOISF2= 0
##$NSP= 0
##$NTH_PI= 0
##$NZP= 0
##$OFFSET= 16.522
##$PC= 1
##$PHC0= 154.2684
##$PHC1= 7.583286
##$PH_mod= 1
##$PKNL= yes
##$PPARMOD= 0
##$PSCAL= 4
##$PSIGN= 0
##$REVERSE= no
##$SF= 250.13
##$SI= 32768
##$SIGF1= 0
##$SIGF2= 0
##$SINO= 400
##$SIOLD= 32768
##$SREGLST= <1H.CDCl3>
##$SSB= 0
##$STSI= 32768
##$STSR= 0
##$SW_p= 5175.98343685301
##$SYMM= 0
##$S_DEV= 0
##$TDeff= 65536
##$TDoff= 0
##$TI= <Analysis number 999999
Compound Code 99
Book Reference 9
Project Code 9>
##$TILT= no
##$TM1= 0
##$TM2= 0
##$TOPLEV= 0
##$USERP1= <user>
##$USERP2= <user>
##$USERP3= <user>
##$USERP4= <user>
##$USERP5= <user>
##$WDW= 1
##$XDIM= 32768
##$YMAX_p= 270073631
##$YMIN_p= -932759
$$ End of Bruker specific parameters
$$ ---------------------------------
##NTUPLES= NMR SPECTRUM
##VAR_NAME=  FREQUENCY,     SPECTRUM/REAL,   SPECTRUM/IMAG
##SYMBOL=    X,             R,               I
##VAR_TYPE=  INDEPENDENT,   DEPENDENT,       DEPENDENT
##VAR_FORM=  AFFN,          ASDF,            ASDF
##VAR_DIM=   32768,         32768,           32768
##UNITS=     HZ,            ARBITRARY UNITS, ARBITRARY UNITS
##FACTOR=    0.157963299565203, 1,           1
##FIRST=     4132.6476996994, 0,             0
##LAST=      -1043.33573715361, 0,           0
##MIN=       -1043.33573715361, -932759,     0
##MAX=       4132.6476996994, 270073631,     0
$$ Real data points
##PAGE= N=1
##DATA TABLE= (X++(R..R)), XYDATA
$$ [...]
18866b65575J22743K09040L3142k28982J459o3769j4688J61454R0822k02398j03255
18855b60007j02382L787m9654K02044L83941J60637J50427p5066l3869O3090k35583
18844B07365k83032J62784K65545J9082j00664Q2124r0810k7575k99997k00953
18834b66131J85207K93301k1060o6764J69856r8079M5762n7265P8006R315J29586
18823D01734Q0776J42717q56k67625J0719j7666k73685l52965M6387K08742k907
18812b4629J68054R0811l14106o703m5545j20146j22369J43871O9036K23009J77045
18801B38328q0502p1499l61531p7885j53889J84334J01855J02678k38307K17955
18791a38463L32098o9983o6285l7092j48136R8123P6518o5249J2862J00814o9190
$$ y = [-265575, -142832, 66208, 99350, -129632, -128173, -191942, -206630, -45176, 45646, -156752, -260007, -362389, -358602, -408256, -206212, 177729, 338366, 488793, 413727, 379858, 442948, 207365, -75667, 87117, 352662, 371744, 271080, 353204, 262394, 234819, -65178, -266131, -80924, 212377, 191317, 124553, 294409, 196330, 242092, 184827, 262833, 272148, 401734, 482510, 625227, 624371, 356746, 367465, 349799, 76114, -276851, -230464, -21722, -24629, 143425, 234236, -79870, -86573, -132118, -252264, -374633, -230762, -161726, 61283, 238328, 157826, 86327, -275204, -353089, -506978, -322644, -220789, -118111, -356418, -138463, 193635, 123652, 57367, 20275, -127861, -29738, 46780, -18469, -5607, 95207, 26017]
18780B6017M04701j95158k19487J11199r1829q2608K31046P5011k09792O8373
18770A17473J63160M52935K90957j66387n9832J06583M51235J95427n34230k70171
18760G47150Q4171j83969k7363r5203k66593j56183k8621k2758q9514o6110L2722
18749g2271r6332J81578K20613j83534q0608m1553J0968J46449L44870j30157
18739C00023k17768j45879J12738J20332O3139p2616l16565j07150O4361N1701
18729a47684N240J27437j16091l6319J46294o1694k20935L3317R9128j41295K0086
18718b92516j7123K74748K57706p2199k56129l11940j96867N9473N2064K09697
18708b93086J48629j13766k48045J4200K8592P5944j21627J36642K45881P2165
$$ y = [26017, 430718, 235560, 16073, 127272, 35443, -47165, 183881, 258892, 49100, 117473, 280633, 733568, 1024525, 858138, 798306, 904889, 1356124, 1551551, 1017321, 747150, 831321, 647352, 619989, 524786, 258193, 102010, 73389, 50631, -38883, -104993, -72271, -168603, 12975, 233588, 50054, -30554, -72107, -61139, 85310, 430180, 300023, 82255, -63624, 49114, 169446, 232585, 159969, -156596, -263746, -199385, -147684, -142444, -15007, -131098, -167417, -21123, -82817, -303752, -270435, -171307, -312602, -292516, -309639, -34891, 222815, 150616, -105513, -417453, -614320, -554847, -502783, -293086, -144457, -258223, -506268, -492068, -463476, -387532, -509159, -372517, -126636, -54471]
18698e4471j20280j7389Q5811j83861K91180K00747Q5636n7180m32450o0890J15888
18687a47259j49276m6256J98647j42218r6363K4542L12771J03998k04713q9809
18677b35936l9603j27769l5530J14891K20401J04138L0199J01191r8389Q1262
18667A14855j6960k07541K7533J6061L9281J9541J81533K40232n8494r4944J9254
18656B80351k57942k59582P4075L03589j29665Q392Q3741j03204m2848o4092j1620
18645a18805R0398J60273j48936L7382J7400j2895K0749m9367M1142J0400j9990
18634B7751k7617k36836J6232J29756k9753o0395r3205M1075M2826M580L6070
18623a49516l485k153L2002J27837P1224j31024J62721J97759j48102r6407j03433
$$ y = [-54471, -174751, -192140, -106329, -290190, 990, 201737, 287373, 230193, -202257, -263147, -147259, -296535, -342791, -144144, -286362, -382725, -358183, -45412, 58586, -146127, -235936, -275539, -403308, -438838, -323947, -103546, 592, 30791, 131982, 33593, 114855, 97895, -109646, -82113, -66052, -26771, -7230, 174303, 414535, 356041, 261097, 280351, 22409, -237173, -163098, 140491, 10826, 19218, 102959, -245, -43093, -107185, -118805, -28407, 131866, -17070, 20312, 37712, 24817, 45566, -3801, 37341, 47741, 27751, 134, -236702, -220470, -90714, -120467, -180862, -274067, -232992, -190166, -185586, -149516, -153001, -155154, -123152, 4685, 75909, -55115, 107606, 305365, 157263, 60856, -42577]
18612d2577k06136k05254j05997j20181L39302J55772N0004n0480j51024Q507
18602c28064Q7263M8743J16725j05099r2993K11184J73187P1070o2119l20511
18592b00614k47979K48122J84763L9801P1029J19630j11912j53196q0518J35984
18582E110q1803k10809J39705l8403j24896L387O9384J85513m9802k11021M0931
18571b72704K86565m2604o1658k1088K37361L0493j36896J3696j7884j01651J5406
18560g0964j36520j73929o8826K09426J95133J4129j60711R905M0382M2450p2372
18549a71897q7387n2801K07756Q4089L269p9195m3699L3206j78417l9223M9530
18538b74769J0778N7128P6310O2892K77200O7699o3100k71667J78017J96299k05051
$$ y = [-42577, -248713, -453967, -559964, -680145, -340843, -185071, -135067, -185547, -336571, -328064, -240801, -192058, -75333, -180432, -273425, -62241, 110946, 182016, 119897, -200614, -448593, -200471, -15708, 24093, 95122, 214752, 102840, -50356, -130874, 5110, -76693, -287502, -147797, -186200, -311096, -307709, -238325, -52812, -102614, -313635, -272704, 13861, -28743, -90401, -111489, 125872, 156365, 19469, 33165, 15281, -86370, -70964, -207484, -381413, -450239, -240813, -45680, -31551, -192262, -182357, -141975, -99525, -171897, -259284, -312085, -104329, -20240, -16971, -96166, -139865, -106659, -285076, -324299, -274769, -263991, -206863, -130553, -67661, 209539, 277238, 214138, -57529, 120488, 316787, 111736]
18527A11736j02135N054k64j07026l7701j61166o7597j53744Q6010J46796j62512
18516d42549r0532K16915K18398K48400J77170k06088k22929l4023M0847P269
18506h7122q6248o5961k32503j2190J34436m040m1965J9941J80817k3750n2488
18495b71073J12566J1815J4202J27120N4134O0657K4046N4741m5797p9968q2748
18484b0305r2665J52466J94645j02583J0455j24076j13601O808j03181j6401K03508
18473d930k74195k28253M5678M58533K33969j6853J53813J19154k8324j39327
18463C19265j59523k06668r6845J0026j56355j40951Q4585K05361j99680j45050
18453d85835J01901J6358J63313L4175r3740p6383m0889j4820P9558K61778J48022
$$ y = [111736, 9601, 14655, 14391, -92635, -130336, -291502, -359099, -512843, -426833, -280037, -442549, -533081, -316166, -97768, 150632, 327802, 121714, -101215, -135238, -94391, -87122, -173370, -239331, -471834, -484024, -349588, -353628, -395593, -375652, -194835, -218585, -271073, -158507, -146692, -132490, -5370, 48764, 109421, 133467, 188208, 142411, 62443, -20305, -112970, 39496, 234141, 131558, 142013, 17937, -95664, -88856, -192037, -208438, -4930, -279125, -507378, -461700, -3167, 230802, 213949, 367762, 486916, 458592, 319265, 159742, -46926, -143771, -133745, -290100, -431051, -346466, -141105, -340785, -485835, -383934, -367576, -204263, -170088, -263828, -340211, -381100, -395920, -316362, -54584, 93438]
18442I3438k73851j51710N085Q201n2589o3053k1569j45518k1993K15873K70222
18431a37464Q8065J3447K56922J55077p1002l17389o6986J48545K5148N255N179
18420A04797k65604m18837J48565K66197K33444R7862m23907J2350J70987L41640
18410B67494J20938r4188l7212j42730M5282o1801j7904J86950j53731j34354
18400b1256M9850K1389j58107k1221P3539Q0669p4436N4960o4685k8187J40986
18389E3501L08291m1091J0691j02991O418j01327j52145R343O429O3494j21206
18378f0593j48380q9347k10634k25246J48234O3901J34417p3513L6574j8400J32851
18367c10136O8801J6658J46716M8391R1685Q5961r913j6462M6244K0506j01451
$$ y = [93438, -180413, -332123, -327038, -318837, -371426, -434479, -456048, -601566, -623559, -407686, -137464, -49399, -35952, 220970, 376047, 305045, -12344, -79330, 69215, 94363, 99618, 104797, -160807, -579644, -431079, -164882, 68562, 166424, -257483, -245133, -74146, 267494, 388432, 294244, 257032, 114302, 159584, 97783, 79879, 266829, 113098, -21256, 28594, 49983, -108124, -129345, -55806, 24863, -49573, 5387, -59298, -87485, 53501, 361792, 320701, 331392, 228401, 234819, 133492, -18653, -9310, -2881, 60613, -60593, -208973, -298320, -508954, -734200, -585966, -522065, -387648, -461161, -424587, -442987, -310136, -241335, -224677, -77961, -29570, 62115, 148076, 138163, 121701, 167945, 188451, 87000]
18356H7000j49420l91123K97604L45433k3658q0423k1735o7657N4675o6167k83271
18345b98742J76165P4206k83180J18783P4464J38962j47196j07725J60569l1690
18335a25384l92685r7341k266K16568K46638J92990K17794k7113k77670l5359
18325h3828J03566J43868J71651j99364k34814k8169n5232l19650p0128K54342
18315c17758J81813q2064K20014N8976k28350j21916M2865j54210l2520J83395
18305b49755J09372K4325J07666N7313r1636J13363r0098R5943l43824k00791
18295d68122Q5704J59335K25679j82177j96840P6188o3806K33679L3240L486j65798
18284b59432q5369j9551J06616J04405o9146R0287P0854J85852J92094N75r7720
$$ y = [87000, -62420, -453543, -155939, 189494, 165836, 85413, 63678, -3979, 50696, -15471, -298742, -122577, -48371, -331551, -212768, -138304, 658, -146538, -254263, -93694, -125384, -518069, -615410, -617676, -401108, -154470, 38520, 256314, 229201, -48469, -83828, 19738, 163606, 335257, 135893, -98921, -127090, -182322, -501972, -572100, -317758, -135945, -218009, 2005, 60981, -167369, -289285, -246420, -400630, -433150, -249755, -140383, -116058, -8392, 48921, -42715, 70648, -19450, 76493, -267331, -468122, -382418, -223083, 2596, -179581, -376421, -300233, -364039, -130360, -97120, -93634, -259432, -344801, -364352, -257736, -153331, -222477, -132190, -61336, 124516, 316610, 317185, 219465]
18273B19465j80370j47712j53844q413K26662J36307p3192k28160k75345Q7042
18263c97560k3017L6577Q34J63876L06159P3981k41741J2213r4356n7196m621
18252b24851R0680j41185o7681L0559L4568J40420K34889j05242r154M0876j0502
18241A3377n0974P2373Q4279p2536l23768K22939J72523K26562K23366k59328
18231C08813k54305N4274j0674R3791Q1081j33967j50140Q685K34673J21314m01224
18220d7679k21192J14520J65097p0643r1268k7967K08813l2917q4809j70174l9213
18209b97432K65747K07067l2845k55227k02466J4511O3472K12063L63915K60968
18199E99773j8465l4010n8489k64329k41848n3576L0902M1572N9442J93079J23230
$$ y = [219465, 39095, -108617, -262461, -270874, -44212, 92095, 18903, -209257, -484602, -397560, -420577, -384000, -383166, -219290, 86869, 160850, -80891, -68678, -163034, -220230, -224851, -134171, -275356, -343037, -312478, -277910, -137490, 97399, -7843, -16997, 23879, 13377, -37597, 34776, 119055, 46519, -277249, -54310, 118213, 344775, 568141, 308813, 54508, 108782, 98108, 191899, 272980, 139013, -11127, -2442, 232231, 353545, -47679, -268871, -154351, 10746, -59897, -151165, -179132, 29681, -3236, -88045, -258219, -297432, -31685, 175382, 142537, -112690, -315156, -300645, -237173, -25110, 338805, 599773, 581308, 547298, 488809, 224480, -17368, -70944, -40042, 1530, 60972, 254051, 377281]
18188C77281n9470k01745R4733J60751l6216m70125j58561K25412K43694M3791
18178B19545J00059p6703k62177k03769J13209L76670J46630L1939j48737Q089
18168C04755J40842k82985j25822J52074o1489k926R1292K17385k71343j76689
18158a4906K3219J65624J01369j06598j72239Q492n4315L229K91527J73158O5609
18147D84169J02755Q590J2800j92882J8820K55965J03659Q6521j7694P4458J01714
18136A038875J54089L34981J73056j74541k31380L62172K64823M03502L82017
18127B707594J58685J06696J89863K47727O16278N33387O35883O53420N79424
18118F428957P37508J233669J590072K115578L311979M391836O102161R162228
$$ y = [377281, 317811, 116066, 210799, 371550, 335334, -134791, -293352, -67940, 175754, 219545, 319604, 242901, -19276, -223045, -109836, 266834, 413464, 445403, 296666, 304755, 445597, 162612, 36790, 188864, 127375, 124449, 215741, 433126, 161783, -14906, 8313, 173937, 275306, 168708, -3531, 4961, -49354, -46125, 245402, 418560, 484169, 586924, 595514, 608314, 415432, 434252, 690217, 793876, 880397, 862703, 937161, 1038875, 1192964, 1527945, 1701001, 1526460, 1295080, 1657252, 1922075, 2325577, 2707594, 2866279, 2972975, 3162838, 3410565, 4026843, 4560230, 5196113, 5849533, 6428957, 7166465, 8400134, 9990206, 12105784, 15417763, 19809599, 25911760, 35073988]
18110C5073988J4293107K3999324M1326099N7936805M7568386J4737476j9026769
18103B15908416l7482376l6266997k5430548j7512439j3916018j1904227r954302
18096F3441509q327237o960433n795966m699518l584316l137385k387591j888974
18088B6660089j731722j760876j897263j423808j397169j288015j147102j027173
18080A4986961o81689n04033m94254n65398p60041o07643k02783k87094l79323
18071A0504703l79865n13440l95497l31742l01848k10153j76954k98090n41301
18062G355813k89576K0834N2601n29613k49751R8513l48013n12055k52638p0355
18052E275760j99753j86173q3813j951j17854j07075k15359k78757k57215M7612
$$ y = [35073988, 49367095, 73366419, 114692518, 172629323, 220197709, 234935185, 215908416, 178426040, 142159043, 116728495, 99216056, 85300038, 73395811, 63441509, 55114272, 48153839, 42357873, 37658355, 34074039, 30936654, 28549063, 26660089, 24928367, 23167491, 21270228, 19846420, 18449251, 17161236, 16014134, 14986961, 14305272, 13801239, 13306985, 12741587, 11981546, 11373903, 11171120, 10884026, 10504703, 10124838, 9611398, 9215901, 8884159, 8582311, 8372158, 8195204, 7897114, 7355813, 7066237, 7087071, 7139672, 6610059, 6360308, 6458821, 6110808, 5598753, 5346115, 5275760, 5076007, 4889834, 4806021, 4804070, 4686216, 4579141, 4363782, 4085025, 3827810, 3875422]
18042C875422K89409k18048j48418r9173n8115j43750j27915O4782j25383L7891
18032C346702J48519M8183P935n8464k05326J14666J45121k56360l41969j91052
18022B757955k83478j31396J27932J90110N7169k04518l38200P0497j36767l11573
18012A797731o6064p2688J71026j71160j49038q1127J92854j82146J48207k7521
18002A560074l3103r8453N0240J84371l0386j09728q4748k58291l6705L31626
17992A474897j13534j09243o770j1749j9925k2925m9438k38533o7083m9431O5179
17981H51445k80118l1912K38086j17659j72066l89712j32139J28277L40667N0318
17971D85187m6957n3208k64480J80494J62555J05585j4190p3239k05849N9535
$$ y = [3875422, 4164831, 3946783, 3798365, 3699192, 3641077, 3497327, 3369412, 3434194, 3308811, 3346702, 3495221, 3543404, 3551339, 3492875, 3287549, 3402215, 3547336, 3290976, 2949007, 2757955, 2474477, 2343081, 2471013, 2661123, 2718292, 2513774, 2175574, 2246071, 2109304, 1797731, 1731667, 1658979, 1830005, 1658845, 1509807, 1428680, 1621534, 1439388, 1587595, 1560074, 1526971, 1428518, 1478758, 1663129, 1632743, 1523015, 1438267, 1179976, 1143271, 1474897, 1361363, 1252120, 1245350, 1233601, 1213676, 1190751, 1141313, 902780, 835697, 786266, 851445, 571327, 539415, 777501, 659842, 487776, 98064, -34075, 94202, 434869, 485187, 438230, 385022, 120542, 301036, 463591, 569176, 554986, 481747, 275898, 335433]
17961C35433O7050m54r1097J89727J40473j32747k19884J33535l8172j96966j44834
17950D2064J48091K3129q9690j0983j01797j20742Q0313K67174J07359l14226
17940C0692r0392K09967K16877j41766q1145J6652j53550j45255K82117K54707
17930C98904k97315r3024k7321j4224j8403j03477L122O9236O9398m3195M4180
17919a2119J39433M6161O8417O7747K7532L0130j16740n3274j63952l778K24960
17908B54517J35028k44680M2466N9281k148L3015L2305j76548r1469k9140J13540
17897A26167N422J10699M948j188r6364q1289j78419J7036J1837l0845J82621
17886G0625J51785r4646j25242J4830J73552k47524L2505K74220J47344j13393
$$ y = [335433, 402483, 402029, 310932, 500659, 641132, 508385, 288501, 422036, 383864, 186898, 42064, 190155, 213284, 123594, 112611, 10814, -109928, -29615, 237559, 344918, 30692, -59700, 150267, 367144, 225378, 144233, 160885, 7335, -137920, 144197, 398904, 101589, 8565, -18756, -32980, -51383, -154860, -151738, -82502, -13104, -56299, -12119, 127314, 173475, 241892, 309639, 337171, 367301, 250561, 197287, 33335, 29557, 254517, 389545, 144865, 187331, 246612, 244464, 277479, 309784, 133236, 41767, 12627, 126167, 131589, 242288, 247236, 246048, 149684, 68395, -110024, -92988, -81151, -111996, 70625, 222410, 127764, 2522, 17352, 190904, -56620, -24115, 250105, 397449, 284056]
17876B84056n270J15841j23417p3201n0447L1511P2435j36798j04842N9069N9681
17865A28618K63092J06091k2830k32148k52608N1236N7790q7581p4609P9690L8927
17854E5668O696k47540p1802J44006J77528j19547k86387J9871L2675N1385J91932
17843d5515K49690j60196j91150K13053L04347J15133k07386R7419L87245J42733
17833I05373p7233L686j77964l00516l6212O5980j30875r7655o7160k85102j58418
17822c56096Q7408K26476l3119J12359m435n7697l4408j18723k32800j1830K45448
17811a77417O0034q7721L09494L52o0525J52101k4926M9137J60078j19103j74463
17800H7041q7688j62339j01147J90203p810m9851J21733P2556J76982j02857j45192
$$ y = [284056, 278786, 394627, 271210, 198009, 147562, 179073, 251508, 114710, 9868, 68937, 128618, 391710, 497801, 474971, 242823, -9785, 41451, 99241, 11660, -62949, 16741, 55668, 62364, -185176, -256978, -112972, 64556, -54991, -341378, -321507, -288832, -237447, -45515, 204175, 43979, -147171, 65882, 370229, 485362, 277976, 375395, 762640, 905373, 828140, 831826, 653862, 353346, 317134, 383114, 252239, 154584, 87424, -197678, -356096, -268688, -42212, -75331, 37028, 32593, -25104, -59512, -178235, -411035, -422865, -177417, -117383, -205104, 104390, 104742, 44217, 196318, 171392, 220529, 380607, 261504, 87041, -647, -162986, -264133, -73930, -81740, -131591, -9858, 62698, 239680, 136823, -8369]
17789h369M9467L35970j58615j63900Q863j69237M3366O7031j45313r4717o651
17778b42105k15791l1266K69017J07090j01380n8239J57816O9507O0410L451L1782
17767E0292j05367k35195J14751P0290Q6907J11914J8277K2899K9316k06279p2141
17756a14336j84685J62044M6606J01014J70606M3684R3352K3367l6055P39j10204
17745A96132j2913j7333j41516K0551J33871J62791l6904j37076p7336o0412j32788
17734a02933K91782n3473k83194O1182l1032j67108M6429j2527N1308l2550P8107
17723a54009o0547K33607J2263O7735Q4551j48605p7909R997J26672k7397R5563
17712A61921J5933j10008J8013J00128l4131j46795l4217K9376P1094q6101j32868
$$ y = [-8369, 41098, 377068, 218453, 54553, 63416, -105821, -62455, 4576, -140737, -235454, -242105, -457896, -489162, -220145, -113055, -214435, -272674, -114858, -45351, 15059, 18510, 50292, -55075, -290270, -175519, -105229, -18322, 93592, 111869, 134768, 164084, -42195, -114336, -299021, -136977, -90371, 10643, 181249, 224933, 318285, 341652, 305597, 306336, 196132, 183219, 165886, 24370, 44921, 178792, 341583, 304679, 167603, 90267, 29855, -102933, 188849, 135376, -147818, -86636, -117668, -284776, -238347, -250874, -199566, -232116, -154009, -214556, 19051, 31314, 99049, 183600, 34995, -42914, -32917, 93755, 66358, 161921, 177854, 67846, 85859, 185987, 151856, 5061, -29156, 220, 71314, -14787, -147655]
17701a47655L0248K56311K38857j43924l04912j21477p3201p4958K41433K19989
17691A20711j28208j37338P8011N3401K83388j15975n2503j17943L11373J16693
17681D11610m8576J7809J42257J6595j48820j22577O0561m3170J19962Q2590j60279
17670C27962p1574j8266L574p9430j62187R026K19315J93841m5547P5862K9779
17659D82355K21141j48133n6198K63099N3721j29916o3499l71997r1856q1367
17649G7350j29366J61217n5961j6469K07853K26518k32939k17927K04195J84694
17639D09165j5922j83001O9791J24817N555j9047j4625K79240K02373j59214k53386
17628D45746j32855k37290l7074l7440j4342k02454K26576J1719N0070J53054
$$ y = [-147655, -117407, 138904, 377761, 233837, -71075, -192552, -265753, -340711, -99278, 120711, -7497, -144835, -66824, -13423, 269965, 153990, 101487, -16456, 294917, 411610, 363034, 380843, 523100, 539695, 390875, 268298, 328859, 285689, 405651, 488241, 327962, 256388, 238122, 241696, 162266, 79, 9105, 228420, 422261, 376714, 452576, 482355, 703496, 555363, 499165, 762264, 815985, 686069, 622570, 250573, 158717, 77350, -52016, 109201, 53240, 36771, 244624, 471142, 238203, 20276, 224471, 409165, 393243, 210242, 280033, 404850, 410405, 391358, 376733, 655973, 858346, 699132, 445746, 312891, 75601, 38527, 1087, -13255, -215709, 10867, 22586, 72656, 225710]
17618B25710L02146Q7836q4710k6223J27221J8800J82070Q4370k40918j79800
17608D96502r1827j52943J31044L17620O0524k3048l4630j11715P4194Q7260j32515
17597F20466j39364j9819L8047J14889n72R7900j52431n9400j8258M8667j95965
17586C34160J85512K98714L57734L0986o9343J23440L93434J54802J88420L06959
17576B304818J67804L61581K19034J76282J28690J95163K69363K24534L28061
17567D375330J37712M84298M71272M84225M35442P38160J259521J714327J955067
17558A2055354K308921L452081N084584P138928J0748426J7487049K7328916L4676273
17550A20280532L0656980K0675071J3514873J0101237J181106j1334622k2419342
$$ y = [225710, 527856, 615692, 530982, 504759, 631980, 650780, 832850, 917220, 676302, 496502, 404675, 251732, 382776, 700396, 760920, 737872, 703242, 591527, 665721, 752981, 620466, 481102, 461283, 499330, 614219, 613647, 711547, 559116, 499716, 481458, 530125, 334160, 519672, 818386, 1176120, 1207106, 1137763, 1261203, 1654637, 1809439, 1997859, 2304818, 2472622, 2834203, 3053237, 3229519, 3358209, 3553372, 3822735, 4047269, 4375330, 4513042, 4997340, 5468612, 5952837, 6388279, 7126439, 8385960, 10100287, 12055354, 14364275, 17816356, 22900940, 30039868, 40788294, 58275343, 85604259, 120280532, 150937512, 171612583, 185127456, 195228693, 196409799, 185075177, 162655835]
17543A62655835k6413331k2769449j7030968j3227538j1230504r498897p471131
17536E5014017n786917n005100m114179l402626k648575j949053j659355j403583
17528B9044629j487408j492330j113396j133621j081308j230985j136093o94574
17520A9674914p08563p98988o18396l01802m72525m87365l47820l22160l99006
17511A5218289l86719j02851j905Q5196L0048M00419L07656M56755R25249J161256
17501A8093393J558746K351353L360453M786829P399958J1458153J8553477K8165840
17493I5728202L3051508K6691486J7443953J1789418P307429k691152j4155728
17486A75165116k3303534k4829348k0338821j5044495j1961803r983179q095297
$$ y = [162655835, 136242504, 113473055, 96442087, 83214549, 71984045, 62485148, 55014017, 49227100, 44222000, 40107821, 36705195, 34056620, 32107567, 30448212, 29044629, 27557221, 26064891, 24951495, 23817874, 22736566, 21505581, 20369488, 19674914, 18966351, 18167363, 17548967, 17247165, 16774640, 16287275, 15939455, 15617295, 15218289, 14831570, 14728719, 14726814, 14812010, 14842058, 15242477, 15550133, 16006888, 16932137, 18093393, 19652139, 22003492, 25363945, 30150774, 37550732, 49008885, 67562362, 95728202, 128779710, 155471196, 172915149, 184704567, 192011996, 189320844, 175165116, 151861582, 127032234, 106693413, 91648918, 79687115, 69703936, 61608639]
17479F1608639o842561n836882m876996l984734l205459k326851j828532j670690
17471C1035934j582584j399928j310398j316252j318123j153624j147388j133741
17463B0673896j102526j092542r58515p97741q70719r23145p60646n30316l57662
17454A3280084m61879m85207j44183l41184m29595o06244o42571k97656J16823
17445I988388p7540l74136k87765N3920J90451j45072j25472j97685l42371l31116
17435H351602j82968j94360p69648n90695k67108m11452j24779j31227k22072
17426E457293Q483O3728K5000k48734n5093j29161l49895n26861k27286J34144
17416D151618l25928j35756j37475k08592J78054o3023k74180J31068J26574k55085
$$ y = [61608639, 54766078, 48929196, 44052200, 40067466, 36862007, 34535156, 32706624, 31035934, 29453350, 28053422, 26743024, 25426772, 24108649, 22955025, 21807637, 20673896, 19571370, 18478828, 17520313, 16722572, 15851853, 14928708, 14168062, 13637746, 13280084, 12818205, 12332998, 12188815, 11847631, 11418036, 10811792, 10169221, 9871565, 9988388, 9910848, 9536712, 9248947, 9302867, 9493318, 9348246, 9222774, 9025089, 8682718, 8351602, 8168634, 7974274, 7204626, 6613931, 6346823, 5935371, 5810592, 5679365, 5457293, 5465776, 5529504, 5554504, 5305770, 5250677, 5121516, 4771621, 4244760, 4017474, 4151618, 3825690, 3689934, 3552459, 3343867, 3521921, 3458898, 3184718, 3315786, 3442360, 3187275]
17406C187275m9139R8382j40750k56520p1948o6105p5843n6195q6997j95961r5755
17395B190444j69060k5517r9j99562K04811K19436j69628j13302n9220j22321
17385A755982j8210M4702j00714j00958j6566j17542r3512Q2580l0104O2161k1863
17374A445956J91680J38189Q2374l4938j86172k81489k51524j6716J60431j27110
17364A120681O1356J58846N5560j10536m4997l4533j10989K2231n6796j4722J07038
17353A153139l9197k13713q7178j51967k9102R5307k4449j297j49816O0397J12813
17342G24937j8894m7212K040J1251N439j56679O8222K39571J28266l91329j78169
17331C87443Q6189n6526m1256n1849p9080m0893k54484m5771m1355J14422K89069
$$ y = [3187275, 3138136, 3236518, 3095768, 2839248, 2767300, 2701195, 2625352, 2569157, 2482160, 2286199, 2190444, 2021384, 1995867, 1995768, 1796206, 2001017, 2220453, 2050825, 1937523, 1878303, 1755982, 1737772, 1782474, 1681760, 1580802, 1564236, 1446694, 1353182, 1435762, 1405658, 1467819, 1445956, 1637636, 1775825, 1858199, 1823261, 1637089, 1355600, 1104076, 1087360, 1247791, 1120681, 1182037, 1340883, 1396443, 1285907, 1240910, 1206377, 1095388, 1117619, 1060823, 1046101, 1153139, 1113942, 900229, 813051, 661084, 631982, 727289, 702840, 701543, 551727, 612124, 724937, 706043, 658831, 660871, 672122, 677561, 520882, 589104, 828675, 956941, 565612, 387443, 473632, 417106, 375850, 324001, 244921, 204028, -50456, -96227, -137582, -23160, 265909]
17320B65909K26714j69986j33807J95229J01362J6059J12139O2866k17801k34352
17310B24332K4904K06383K93884j26129l938Q2234k63391j79539O8538O0971l9605
17299C48644k88228p0070J21132K04602p6477p383J93643j8123n9496o6481J76493
17288D58256Q0158l3558l05869J66894J20363j68324k05582k10899j08074O0267
17278a46368R9753P262J39849J02531J47060K09108J41296n1758k66649j55320
17268B26764J08990n1472j19590K3247o97P1343p2191j21775k12637k71857J93561
17257b26314K30068m9123J14398J83569j60192l0369J36183Q3180n8741j16091
17247A06568J00381r5543R5626o1037q3784J19637P696j43189L1710K45211L37945
$$ y = [265909, 492623, 322637, 188830, 384059, 485421, 501480, 613619, 676485, 458684, 224332, 249236, 455619, 749503, 623374, 619436, 701670, 438279, 258740, 327278, 388249, 348644, 60416, -9654, 111478, 316080, 239603, 232220, 425863, 407740, 348244, 281763, 458256, 538414, 504856, 198987, 365881, 486244, 317920, 112338, -98561, -206635, -146368, -46615, -39353, 100496, 203027, 350087, 559195, 700491, 648733, 382084, 226764, 335754, 284282, 164692, 187939, 187242, 258585, 186394, 64619, -148018, -419875, -226314, 3754, -45369, 69029, 252598, 92406, 62037, 198220, 281400, 222659, 106568, 206949, 111406, 207032, 145995, 62211, 181848, 189544, 46355, 78065, 323276, 661221]
17236F61221j91521k93980q2852K2116K17757Q3244j03290k22319J52503q529
17226B34350p9717J1327J32040j03658j56648j8347r1444j7341l0148Q3872J85026
17215A49312J41261k03689k33714J11280j5371j17697L7760J08950n1423j32579
17205b05910n1892k36184L80373J55300l46137Q9738K91915k18829J1923J40062
17195A0359O9894P0392l46196j99505o8725J20268J59001K37389K08004J73753
17185D34634o7318o3253j70587m3586J8149P3611N3687o6719k51283M6419K07936
17174A71690l9804m2099O5893j09300O2976m5843J62327O6762L0616j29392q0444
17163A13382O7335L7503R9529R5118K07379l38231j21392J4871r696j00469k43618
$$ y = [661221, 469700, 175720, 92868, 114984, 332741, 415985, 312695, 90376, 242879, 234350, 154633, 165960, 298000, 194342, 37694, 19347, -72097, -89438, -119586, -35714, 149312, 290573, 86884, -146830, -35550, -50921, -168618, -130858, -21908, -73331, -205910, -257802, -493986, -113613, 41687, -304450, -214712, 77203, -141626, -129703, 10359, 80253, 150645, -195551, -395056, -463781, -343513, -184512, 52877, 260881, 434634, 367316, 304063, 133476, 89890, 108039, 181650, 235337, 168618, -82665, -36246, 171690, 131886, 89787, 155680, 46380, 109356, 63513, 225840, 292602, 323218, 193826, 113382, 180717, 218220, 317749, 412867, 620246, 282015, 160623, 175494, 165798, 65329, -178289]
17152a78289N3330J36649P5242r109Jj15028j57332J71858R6979p768p9590q9418
17140a02475P0340N306k66067j9923J69214L8197L7994j02835J48148J21132P4097
17129A73128Q6116j48847m21701p3168j3493Q1316K34732K46153J43945P0910
17119C79091q3203J09106k86209j28342J20621M1687j79613n1460J64321J91682
17109B77681J86573R7349l44660j90494l6843m1231L388L6341J84898L3360J16557
17098C22919k16579l7448K2604m0900K06717J40649j10496j80874l56630p110
17088b57148L3430j13662J26885J16181J1440P9817k2335L1999j05883N7310j29903
17077a71869k75043o143l240K84783R0345K3625p8512M53J36326q4844j09733
$$ y = [-178289, -124959, 11690, 86932, 77823, 77824, -37204, -194536, -22678, 74301, 66533, -13057, -102475, -32135, -26829, -292896, -312819, -143605, -105408, -67414, -170249, -22101, 99031, 173128, 259244, 110397, -311304, -384472, -397965, -316649, -81917, 164236, 308181, 379091, 295888, 404994, 118785, -9557, 111064, 152751, -26862, -78322, 85999, 277681, 464254, 561603, 216943, 26449, -10394, -51625, -48237, -11896, 173002, 206362, 322919, 106340, 68892, 91496, 50596, 257313, 397962, 287466, 106592, -250038, -257148, -223718, -337380, -210495, -94314, -82874, -3057, -25392, 6607, -99276, -41966, -171869, -446912, -453055, -456295, -171512, -81167, -57542, -136054, -135601, 725, -84119, -193852]
17066a93852j7834j03777J30868P6528j06710k25563Q8373J00308l4991R3591
17056a93059J91126k3403j96798q7363l6216p8756J29894J68552P9848j46391
17046a92566J68424K19775p6932L5380j96534j30393K7210k6997K34935J58934
17036B21236j56614J90506j08874j68533O1284J44576N1812k09124j02887j381
17026g7999j61073J25150Q4312j34219m9662O3777M5342M8786l0148J23828N7919
17015I6013n2957J26126L3990l5273N6657l094J16101K24029L33625L0440l8791
17004H86866J96224K93764k47843j99480l28308O1605O4249j629k73375o0120
16994C91953j47270Q5755l12935q576N8659P455q6630k04201O9207O5669P3024
$$ y = [-193852, -211686, -315463, -184595, -108067, -214777, -440340, -351967, -251659, -286650, -193059, -1933, -25336, -222134, -309497, -345713, -424469, -294575, -126023, -46175, -192566, -24142, 195633, 118701, 154081, -42453, -172846, -145636, -172633, 62302, 221236, 64622, 255128, 146254, -22279, 39005, 183581, 235393, 26269, -76618, -77999, -239072, -113922, -29610, -163829, -213491, -149714, -104372, -55586, -85734, 38094, 96013, 43056, 169182, 203172, 167899, 224556, 221462, 337563, 561592, 895217, 925657, 886866, 1083090, 1376854, 1129011, 929531, 601223, 662828, 727077, 725448, 452073, 391953, 244683, 330438, 17503, 8927, 67586, 75041, -11589, -215790, -146583, -80914, -7890]
16983g890J77568O9225M0252k68298k23318J01850J50022J02207q8350N8510o7690
16972D4088j52683r7695m2491J56046J02636J86044N8238k4926n2393k7808P3692
16961B22748K88657P5288k32577l10411P996M2037k02123J01735Q3158l2166J61955
16950B06297K48318L50758L07382j17361j60849K83250J77606o364l31640l01765
16940F55632k13684q6856k78544p5031J87677J74083Q5062N8137j18282j7457
16930C70737M2666j39966k67129L6131j48445J83841K48779R3591k33857r2354
16920I3994J57735j02248k74333O0711j57315J35501j45162q6874P6192k03749
16910d45548r0535J55420L85912L33552J11620j75010j83501k0372J05857L9575
$$ y = [-7890, 169678, 238903, 279155, 10857, -212461, -110611, 39411, 141618, 53268, 111778, 44088, -108595, -206290, -248781, -92735, 9901, 195945, 254183, 229257, 176864, 149056, 222748, 511405, 586693, 354116, 43705, 51701, 93738, -108385, -6650, 76508, 44342, 206297, 454615, 805373, 1112755, 995394, 834545, 1117795, 1295401, 1289037, 957397, 655632, 441948, 355092, 76548, 1517, 189194, 363277, 448339, 506476, 388194, 370737, 413403, 273437, 6308, 42439, -106006, 77835, 326614, 420205, 186348, 93994, 251729, 149481, -124852, -64141, -221456, -85955, -231117, -317991, -241799, -445548, -536083, -380663, 5249, 338801, 450421, 275411, 91910, 71538, 177395, 216970]
16900B16970k54178j52685J43934k46610K0682L40580O0071k01288p2507J2094
16890a32937M8592R8862m8008J08529j01280q7744r1114O7693J59386J2316Q3757
16879A18052j6362o898J68243Q2421k6683j14028j24192n1659p521j09932J33210
16868D4651j97952r3932R4734J77492K42735n4302l57667j64379J60531J22232
16858b5857q4256R3119o642j39825m4957m8429R2513K11543J53303j81793p8365
16847e9646J44768N1337j34910l4150r4461k57513K24279N3377k7096j4589Q1658
16836f6946P8326k3879J00851j3923P2338j8327j43880j78029J49779K04087j06593
16825E3804J7599P0930J50656P2389J5261m5997l6644j16490J20881J24820J47121
$$ y = [216970, -37208, -189893, -45959, -292569, -271887, 68693, 128764, -72524, -145031, -132937, -84345, 14517, -33491, 75038, -26242, -113986, -205100, -137407, 21979, 34295, 118052, 101690, 94792, 263035, 345456, 318773, 204745, 80553, 28894, 21373, -88559, 44651, -153301, -247233, -152499, 24993, 267728, 213426, -144241, -308620, -148089, -25857, -110113, -16994, -23636, -163461, -208418, -256847, -164334, 47209, 200512, 18719, -59646, 85122, 136459, 1549, -32601, -127062, -384575, -160296, -106919, -134015, -148604, -66946, 11380, -12499, 88352, 74429, 146767, 128440, -15440, -193469, -43690, 160397, 53804, 71403, 142333, 292989, 365378, 380639, 334642, 297998, 181508, 302389, 427209, 574330]
16814E74330m9183k97945r2408k4795j63940p1094j4395P1752j0410P7129J11165
16803A10206K70999P313k52047j19905J32902j82348M7800k2421j40913j85011
16793c33425L00618K29999m5689J43172K52724k38990q3098k60130L01461J65259
16783D31901j78374j95730j67383J02908K4264Q587P1085r0041j06522R6378l34182
16772c37109q6074l3732j3909J03088M41831j7597p5735J344K9893P5036j87369
16761a00333n2600J69346J17868J70046j83984k07841K59272K14948j03267J26221
16751D09676J26949l04959J65257O9392j35439p5985j22779l59830R146M7618
16741a70954r8304J03324K25456Q9752j47893n3418j61057k26573j50902K02247
$$ y = [574330, 525147, 227202, 134794, 109999, -53941, -125035, -139430, -67678, -78088, -959, 110206, 381205, 388518, 136471, 16566, 149468, -32880, 14920, -7501, -148414, -333425, -32807, 197192, 151503, 294675, 547399, 308409, 225311, -34819, 266642, 431901, 253527, 57797, -109586, -6678, 17586, 26173, 97258, 7217, -99305, -2927, -337109, -423183, -456915, -470824, -367736, 74095, 56498, -19237, -17893, 12000, 87036, -100333, -152933, 16413, 134281, 304327, 120343, -87498, 171774, 386722, 283455, 409676, 536625, 231666, 396923, 466315, 330876, 254891, 132112, -227718, -218572, -170954, -269258, -165934, 59522, 149274, 1381, -52037, -213094, -439667, -590569, -388322]
16731c88322J49484R7480K3817j44077N8090J39788O1795N6148O0936j27956p6407
16720h9224P6981M1773J39654R4005j16087j8620K1474K66174j6027p3725P076
16709C33454j85223L0032j4036K704j06907p1357k6420Q9891J19363n2848k7177
16698I1476L19620r3412k83263r3873j11240o8842J60732K4931j3451J53363N4341
16687A40382Q4959l8641M6386r7248l65487k23945N7894J82392J36656p8433j25996
16676b81081L3802P3136J68880K7534r4902L0698J00940n4209l29571j67778R9586
16665c92965Q1443j46480p0903R9695K7245j82322O5049J49108j6749k2028J18364
16654b90543l7735J68991l2465l4358K05051K52258p5340q245M4502m4800l700
$$ y = [-388322, -238838, -141358, -117541, -261618, -203528, -63740, -1945, 54203, 115139, -12817, -89224, -12243, 29530, 169184, 263189, 147102, 128482, 149956, 416130, 400103, 326378, 333454, 148231, 178263, 164227, 166931, 60024, -11333, -37753, 52138, 171501, 118653, 91476, 411096, 317684, 34421, -59452, -170692, -239534, -78802, -53871, -67322, 86041, 140382, 225341, 186700, 233086, 135838, -229649, -453594, -395700, -213308, -76652, -155085, -281081, -247279, -174143, -5263, 22271, -72631, -41933, 59007, 4798, -324773, -492551, -392965, -311522, -458002, -528905, -429210, -401965, -584287, -519238, -370130, -386879, -408907, -290543, -328278, -159287, -191752, -226110, -21059, 231199, 155859, 147614, 192116, 147316, 143616]
16643A43616N321k84741p6319M9135K32275o117j74514j48209j46313P3187P5433
16632b57246o7149K20557L6735p4651K03843o1890K8410M8512L36948j31620m18955
16621a36506k83569K92891K29003j69788j62230l2128k4570K65644K94470o5957
16611B07260J33701q4699p7947O9024k88137j8432O0237L42306n0717p9242p7458
16600A35896p0978J39464N5240J04443p4888O3014p212L0334K6884k11914L4765
16589B25048J26332l48793q7315K08576o7202J8509q0167j61705Q0944J7883P6102
16578H212j64478j1469n3979j51600K3437J35874r453J23074j5086j27383L5885
16567b06966P673J9367J3320J06674n0121p0412m6984J60616J15570j93518K3321
$$ y = [143616, 148937, -135804, -212123, -162988, 69287, 63170, -111344, -259553, -405866, -332679, -257246, -324395, -103838, -67103, -141754, 62089, 199, 28609, 77121, 414069, 282449, -136506, -420075, -127184, 101819, -67969, -230199, -262327, -286897, -21253, 273217, 207260, 340961, 256262, 178315, 247339, -40798, -59230, 1007, 343313, 292596, 213354, 135896, 64918, 204382, 259622, 364065, 289177, 352191, 344979, 375313, 402197, 190283, 225048, 351380, 2587, -84728, 123848, 56646, 75155, -5012, -166717, -85773, -67890, 8212, -156266, -167735, -221714, -373314, -349877, -214003, -223456, -100382, -115468, -242851, -206966, -199293, -179926, -166606, -59932, -110053, -180465, -227449, -66833, 48737, -144781, -121460]
16556a21460J73573M0054j49896p0460P0712O9697r0054j19648J50533K05185
16546A58236q4540J06143L4637j63457j8969J49905j17747l2873N4324L1274q827
16535A08106o5501j50287k35718P9076q5856m00094o6903K45121K4063L37601
16525b10392k9867N3167P9785J83826J84195n1009l67674K49936L6226K3842N4388
16514B06423O9313j08645j93545Q7350j15180k7576j1250R0521L3003r2368M4236
16503a7718J42481J97856k05060l45704K23590J76555q07O6958K00499K8658j54628
16492C12680k83582j2786K3888n6659J36705k6248k63647K4478J13551R6393J4628
16481G9401j48219K97185K0530p1031M968k5644q3245k38631q7227L96264L6993
$$ y = [-121460, 52113, 92167, -57729, -128189, -57477, 12220, -77834, -197482, -46949, 158236, 73696, 179839, 214476, 51019, 32050, 181955, 64208, 31335, 85659, 116933, 108106, 42605, -107682, -343400, -264324, -350180, -750274, -817177, -572056, -547993, -210392, -240259, -187092, -107307, 76519, 260714, 209705, -157969, 91967, 128193, 152035, 206423, 275736, 167091, -26454, 60896, -54284, -81860, -93110, -2589, 30414, -61954, -17718, 124763, 322619, 117559, -228145, -4555, 172000, 171193, 238151, 438650, 467308, 312680, 29098, 16312, 40200, -16459, 120246, 93998, -169649, -145171, -31620, 64773, 79401, -68818, 228367, 248897, 177866, 182834, 157190, 73945, -164686, -251913, 144351, 181344]
16470A81344k25230L811J29916J42292j0168k45082j36388J48893N8396l9175
16460H609k4424j33545J89678J96863k36946p0394O592M4905J31529j08146j36074
16449a31353j91912l5778J9861K31392J49959k3049l3179M926n0855O4405l7124
16438c2707p4946j0122J31621R3880k5409m9368j11229k91869n4390K45494N1673
16427a27372p3099j33350J28788K03708j45213l43185K79734K77921p5541N6721
16417D9112J30570J49257j54233n6777R6321K9612r9907l16836j30284J16738
16407a86427j09729k32633J21755K85566M9666j35258r0218m1884J82734K03823
16397D7395K86734K24277j00202k75451r0332K9165j1754n6184k45374j01033
$$ y = [181344, -43886, -40075, 89841, 232133, 221965, -23117, -159505, -10612, 47784, 8609, -15815, -149360, 40318, 237181, 235, -70159, -63567, -18662, 112867, 4721, -131353, -323265, -359043, -339182, -107790, 42169, 19120, -14059, -9133, -59988, 4417, -32707, -107653, -117775, 13846, 107726, 82317, 32949, -78280, -370149, -424539, -179045, -127372, -200471, -333821, -205033, -1325, -146538, -489723, -209989, 67932, -7609, 49112, 179682, 328939, 174706, 117929, 214250, 243862, 143955, -172881, -303165, -186427, -296156, -528789, -407034, -121468, -71802, -207060, -297278, -339162, -156428, 47395, 334129, 558406, 458204, 182753, 92421, 121586, 109832, 53648, -191726, -292759]
16387b92759j04712M6543M89378J17703R6329j13487j79532k42188k18420k0431
16377d21576N9158J3136J4658j59751P2611K45312O7398j32935q4192Q6381J94710
16366d5090J7967j01348n047r2102Q2894l7380k58956m1893J46964K78191K19945
16355A64145k84749l77914m4087M8882N6844q707J12646o921j84197P5053L8314
16344d10691L52519K45183K5135j08422j54464P3618j63641L69622J94533k5202
16334C98190j00485k97150O749j7030L2252k8011j26043r4444j41537R5400O2579
16323b09530L8185O9138j4488j97623n6300M0360J91132P2792p6369J51500K75632
16312B84429j53890l47791J21752N489K26333J28210j20922j20335n2989L467
$$ y = [-292759, -397471, -350928, 138450, 256153, 352482, 238995, 59463, -182725, -401145, -421576, -362418, -349282, -334624, -494375, -421764, -176452, -109054, -241989, -326181, -239800, -45090, -27123, -128471, -133518, -225620, -142726, -180106, -439062, -480955, -333991, -55800, 164145, -120604, -498518, -542605, -493723, -436879, -445586, -332940, -339861, -524058, -449005, -410691, -58172, 187011, 212146, 103724, -50740, 22878, -140763, 228859, 423392, 398190, 297705, 555, 7304, -9726, 22526, -5485, -131528, -225972, -367509, -272109, -209530, -171345, -102207, -116695, -314318, -370618, -330258, -139126, -66334, -142703, 8797, 284429, 130539, -217252, -95500, -90011, 136322, 264532, 143610, 23275, -29714, -26247]
16302b6247k3794J47515J1946j14041N6092o2972j38238K02091j5992q1653Q813
16291c6480j31901j83005K22801P9158k58327m7504P2214m9764O4341O0829P5911
16280a31727J06133J86902J03682K22118m5535k79265j6378l7233k8066l29193
16270b48562j58177J78371j61363J06400K80134J72690l33457j58966J8374K28882
16260g5674K05254N7182k74515k51102m4275k14933N2920J06439K75766J22214
16250d0724l12927K02221K15134N3862J008q1559j48743N0896k22088R6511n0705
16239b37114k45784J68854j3538l5191J27844K00192j92264l5756J09262O4096
16229h9399L04098J23528j52949R2394l88016j91903J36890K51938N4869M0402
$$ y = [-26247, -50041, 97474, 109420, -4621, 51471, -11501, -149739, 52352, 36360, -45293, -36480, -168381, -351386, -128585, -49427, -307754, -355258, -283044, -332808, -268467, -207638, -131727, -25594, 161308, 264990, 487108, 441573, 162308, 145930, 108697, 80631, -248562, -406739, -228368, -389731, -283331, -3197, 169493, -163964, -322930, -304556, -75674, 129580, 186762, -87753, -338855, -383130, -598063, -545143, -438704, -162938, -40724, -353651, -151430, 63704, 117566, 118574, 37015, -111728, -60832, -282920, -186409, -237114, -482898, -314044, -327582, -362773, -234929, -34737, -227001, -262757, -153495, -89399, 214699, 338227, 185278, 277672, -110344, -302247, -165357, 86581, 141450, 181852]
16219A81852k16160j31779K32400J51350L9319k5933l11803j0030J23825j6068
16209A6973k8300p6357Q1548J46322j19674k39480K0617O2534Q3903O7076j1714
16198C448L3040O5478j01650P1690j56524j59233m1847k8144O7175j06369k4553
16187c77489L9851N6293r2740L6765M4858K9895J15636O9969J64971M5067j36435
16176c359j19251j43427J32757j004l5148j21361j95318J52429L84019o527j22541
16165g8731o4612N8684J15746J02754j94112Q629N686J54410J10413j6931l35274
16154a33338j61810p9823K13690L43634j18324J6838J3042k92490J17441M6359
16144c4781R2962J11108n8331N1976m8314j80542r4145k01368p1567j04687N0379
$$ y = [181852, -34308, -166087, 66313, 217663, 256982, 231049, -80754, -90784, 33041, 16973, -11327, -87684, -6136, 140186, 20512, -218968, -198351, -135817, -51914, 15162, 3448, 36488, 101966, 316, 72006, -84518, -243751, -285598, -313742, -246567, -352936, -377489, -337638, -281345, -374085, -337320, -292462, -262567, -146931, -76962, 88009, 133076, -3359, -122610, -266037, -133280, -134284, -169432, -290793, -486111, -333682, 50337, 43810, -78731, -143343, -84659, 31087, 133841, -60271, -51642, -45956, 108454, 218867, 201936, -133338, -295148, -374971, -161281, 182353, 64029, 80867, 93909, -198581, -81140, -34781, 58181, 169289, 110958, 162934, 114620, -65922, -160067, -361435, -433002, -537689, -487310]
16133d87310K89151K0670K85548o4622q078l9239j40051o0949r4433M8412P7495
16122a73406O847J45198Q2637J40255r3164j03196j4980J058j13951j57682J07598
16111a72786Q5509J62916O1350N7700p626P3243j63966l86613j46872J94671K85491
16100D3017J63514J64338k1770j27513o8192j74680j49177j87450K07250J41880
16090h783J03208K62896n7412J574j10536j55777k0140J72051j57761k16544M4342
16079a42882L30467J15372l34266k26531K96500J66867J0714J01372j38086l46325
16069a66798k81653J39796J23317J19732J7829J78065n89j89688j10654k95955
16059d66598J01763J6211J8581M3778K42361P4911j287k03853j37221K1163K25967
$$ y = [-487310, -198159, -177489, 108059, 43437, 35359, -3880, -143931, -204880, -299313, -250901, -173406, -166559, -21361, 61276, 201531, 108367, 5171, -9809, -8751, -122702, -280384, -172786, -87277, 75639, 136989, 194689, 187063, 260306, 96340, -290273, -437145, -242474, 43017, 206531, 370869, 349099, 221586, 153394, -21286, -170463, -357913, -150663, -8783, 94425, 357321, 299909, 301483, 190947, 35170, 15030, 187081, 29320, -187224, -142882, 187585, 302957, -31309, -257840, 38660, 205527, 216241, 317613, 179527, -166798, -448451, -308655, -185338, -65606, -47777, 130288, 129699, -59989, -170643, -466598, -364835, -348624, -330043, -286265, -43904, 31007, 29720, -174133, -311354, -290191, -64224]
16048f4224Q4694R0052j26078L8294K13362r519q0141m5915l3142q3449j23784
16037a39850j5889K22563J70250j54418k17494m0769K98138J25935K8103Q4009
16027C60578M9818j14268l11434o4883J84405O8932M8185k18097J9149q7276m5073
16016a09964l9001j8247J26377j91599p8136J23205j1223J3390J31181Q1801j58503
16005a30719p5626Q8415j78487j92021K33197K85425l6002k36165N4335Q5936
15995a01712k9820n2712J44696R7476j06442o7668o4625N9217j61559r0966L7181
15984c36934r1254J91566k4722p3188K90505J73286k13585k912J25873j71837
15974a33202P8631J63869l27338R3520K39080j34023j9232o9564p2399J27241
$$ y = [-64224, 20470, 110522, -15556, 22738, 236100, 226581, 146440, 100525, 67383, -16066, -139850, -155739, 66824, 237074, 82656, -134838, -175607, 122531, 248466, 276569, 360578, 410396, 296128, -15306, -80189, 104216, 173148, 221333, 3236, 22385, -64891, -109964, -148965, -167212, -40835, -232434, -310570, -187365, -198588, -185198, -54017, 27784, -130719, -206345, -117930, -296417, -488438, -255241, 30184, -5818, -241983, -187648, -101712, -131532, -184244, -39548, 57928, -48514, -116182, -180807, -121590, -283149, -374115, -336934, -428188, -236622, -261344, -334532, -44027, 129259, -84326, -87238, 38635, -133202, -54571, 109298, -218040, -124520, 114560, -19463, -38695, -108259, -180658, -53417]
15964e3417K06799Q2619O631j74772L1845j96955p3754J39397m4336o6778P6204
15953f6517l929J8374j09963R6430L39104L9276p7798q695n3323j37965O5463
15942A00457K317k16530k9198Q0435O2018R700J66388L7497j00390n1386L02558
15931C63866L3751j98775l08231J32054J2281l8144j56361J291P2958O8887R5414
15920G8991P7632j13413l06082j62258Q7903L55417k1722j58137J2895R921J92915
15909E4062L01035l2940p3817j18718j96102K28301k04451k24009j50414O4435
15899c52618J70000J23152J54629K40314Q9844r4115j29833p6370k93881Q0943
15889h7935R3758m7990n5013N2563O3824O5364N4310J23668O55J76374Q6124k27128
$$ y = [-53417, 153382, 236001, 242632, 67860, 99705, -97250, -171004, -31607, -75943, -142721, -66517, -70446, -52072, -162035, -65605, 273499, 312775, 234977, 226282, 172959, 34994, 100457, 102774, -113756, -142954, -62519, -501, 9199, 175587, 213084, 112694, 61308, 363866, 397617, 198842, -109389, 22665, 34946, -3198, -159559, -158268, -85310, -16423, 78991, 156623, 43210, -262872, -425130, -337227, 18190, -3532, -161669, -148774, -138853, 54062, 355097, 322157, 248340, 129622, -66480, 161821, -42630, -266639, -417053, -352618, -182618, -59466, 95163, 335477, 425321, 331206, 201373, 125003, -168878, -87935, 5823, -42167, -97180, -44617, 19207, 84571, 138881, 262549, 263204, 439578, 525702, 298574]
15877B98574N1997j82082m34819r4785K62089J58996j66804K93194K14583j74733
15867B26210j37069L4537L1408k03112j74762J79718J75365K7057L2759r025j33981
15856D9105R3676J37853N3275k54121j20217J05644j37288q7867K68526l7475
15846G1111j81584P9969O763J74008N2984Q521J43851l342k59976l66127q0813
15835c54635J91433K22374j1410K03176J86308P2212P6030L5978r8111k59582
15825B63773J52074J64580j35909l47332j13882J47442p0600Q3371N7892k53230
15815e1821j24512l3946K89396L055J5459n9060k35324o9247J8542J26995k3371
15804a43834J59500j05151j7253n8170K55732k271k80516J5275J39169j50516
$$ y = [298574, 350571, 168489, -266330, -361115, -99026, 59970, -106834, 186360, 400943, 226210, 89141, 123678, 155086, -48026, -222788, -43070, 132295, 159352, 192111, 183086, 49105, 142781, 280634, 333909, 79788, -40429, 65215, -72073, -159940, 108586, 71111, -110473, -30504, -23741, 150267, 203251, 211772, 355623, 352281, 92305, -273822, -354635, -163202, 59172, 47762, 250938, 437246, 509458, 585488, 621466, 523355, 263773, 415847, 580427, 444518, 97186, -16696, 130746, 60146, 143517, 201409, -51821, -176333, -210279, 79117, 82172, 97631, 38571, -196753, -266000, -247458, -120463, -143834, 15666, -89485, -106738, -164908, 90824, 88553, -191963, -176688, -37519, -188035]
15794a88035j59597j97799j8856J73294L50528J62929l39157m3068K06076O1851
15784H166j54895J80053k123k10185O6065l1357q9658m2704L8801M8971J5245
15773a73621N5249j24772r2418p9830L21564R5451k16740m6176K3912L10069p049
15762F5639k01641k785L7047n192k14585n1750J07556K28705o7698k76712N368
15751c76048k5375o0755N7692J4096N1134J0880k4312M0786j1860P0778M5187
15740b07797R1880R2465L2776M3929k79842j4375J12893j06194m537R4912k33122
15729c77012k01669K63826L30526R4352j30237k72857p0793O1636n2397J75193
15719a79432J04518j59022j4722j81335j3631O8712M0676j0973N9949J00386P3472
$$ y = [-188035, -347632, -545431, -564287, -390993, -40465, 122464, -216693, -259761, -53685, 8166, -146729, 33324, 31201, -178984, -112919, -144276, -233934, -276638, -237837, -188866, -173621, -118372, -243144, -335562, -415392, -93828, 1623, -215117, -261293, -237381, 72688, 65639, -136002, -138787, -101740, -106932, -321517, -373267, -265711, -37006, -104704, -381416, -376048, -401423, -462178, -404486, -390390, -339256, -328376, -352688, -311902, -323762, -252984, -207797, -115917, -23452, 9324, 53253, -226589, -240964, -128071, -234265, -238802, -143890, -377012, -578681, -314855, 15671, 110023, -20214, -293071, -363864, -302228, -354625, -179432, -74914, -233936, -248658, -429993, -443624, -374912, -334236, -345209, -285260, -184874, -111402]
15708a11402R0532K33192K4389p1177l53901j55219J07698L22883J39172m4568
15698A81599o0772k21522j11969K37746l20779j45952K91352K88335j17164M0627
15688F1501j47834O9461J22088Q2461j39776r0170P3542K6089m6511J73010k47502
15677f3641j42856O8817J10883O5082J80843j39721j03203j76782o9081L49102
15667G9443L2887L6544p1388o132l4458q5878j25201j71172o5318n4896J51863
15656c13706J99347K15115M9791j23858j70826L49678J21910j95593p6298J6254
15646G1814L7464j43724j2135o5336K46099J3390j93495O6179J48749J75488j02892
15635B41601m4004j38714k07225j10764K89965n4975j28425N8679K75797J95853
$$ y = [-111402, -20870, 212322, 236711, 165534, -188367, -343586, -235888, 86995, 226167, 181599, 120827, -100695, -212664, 25082, -295697, -441649, -150297, 138038, 20874, 61501, -86333, -16872, 105216, 187677, 47901, -42269, 31273, 57362, 10851, 183861, -63641, -206497, -137680, -26797, 38285, 219128, 79407, -23796, -200578, -269659, 79443, 112330, 148874, 77486, 71354, 36896, -48982, -174183, -345355, -410673, -465569, -313706, -114359, 100756, 150547, 26689, -144137, 205541, 327451, 131858, 55560, 71814, 109278, -34446, -46581, -111917, 134182, 147572, -45923, 20256, 169005, 344493, 241601, 197597, 58883, -148342, -259106, 30859, -24116, -152541, -93862, 181935, 377788]
15625C77788j28802l4662k57715q7314p8434J30554l3480r5298J25180J69960
15615H7777J77714l11727m93491J30765J1246J97638R3066k08389J21351j42964
15605c37014J98128K09347j60375l2644P9691R3367l0880R1140J01800o176j22309
15594H4075m2185M9185L7614J39311N0033l45471O5238R6916m4530R8280J25683
15583C14149O0752J62782j71683l81016l4998k9764J24866R2805q8101J1343j39472
15572g8337j79968k52871j29047L51917J53089j4923L0081l7389k00718r2422
15562d50588J72612m9901L7803J97391J69934k45616m4660J56734L22130J24896
15552C90735j55463o0736j54632L1907O446M1038j43388j97882r4803J66237L2241
$$ y = [377788, 248986, 214324, -43391, -130705, -209139, -78585, -112065, -207363, -82183, 87777, 265491, -46236, -539727, -408962, -397716, -200078, -107012, -315401, -194050, -337014, -138886, 70461, -89914, -122558, -42867, 50500, 19620, 110760, 212560, 206384, 84075, 41890, 91075, 128689, 268000, 318033, -27438, 37800, 134716, 90186, 188466, 314149, 374901, 537683, 366000, -15016, -50014, -79778, 45088, 137893, 49792, 61135, -78337, -258305, -511176, -640223, -288306, -135217, -150140, -120059, -157448, -358166, -450588, -277976, -327877, -290074, -92683, 77251, -168365, -213025, -56291, 265839, 390735, 235272, 174536, 19904, 51811, 58257, 99295, -44093, -241975, -336778, -170541, -138300]
15541a38300n0271J12140j7504r1202j61012l9440K21050o4749q1695P178R670
15530b94135m7101j679n1991J48438K70799J42007j89333l21672l1314Q1408l7542
15519c32115M2812K5826K25841L1975J41223l784j49733k47732J66270k4303j7689
15508a41409P9891M8054Q9424j07485o1994K07337k30419j61918J87203J39071
15498D7755j79674j00667J03501P9539j68861k07690J68612J10667M1108j15046
15488b20756N3843Q1063J32830o7236O6852K29609O2719k12831O2963l05745l77653
15477d94342J26957L15217K62429r4503j87065q1609j99412r9562r84P6943J42455
15466b33476M9871J31450o24j51623j40971p8585p4200L5371J70985J23682j66124
$$ y = [-138300, -188571, -76431, -93935, -185137, -346149, -385589, -164539, -229288, -310983, -303805, -294135, -341236, -342915, -394906, -246468, 24331, 166338, -22995, -344667, -375981, -294573, -332115, -289303, -263477, -37636, -5661, 135562, 131778, -17955, -265687, -99417, -123720, -141409, -61518, -13464, 75960, -31525, -93519, 113818, -116601, -278519, -91316, 47755, -131919, -232586, -129085, -49546, -218407, -426097, -257485, -146818, -105710, -220756, -166913, -85850, 46980, -20256, 46596, 276205, 338924, 126093, 189056, -116689, -494342, -367385, -52168, 210261, 115758, -71307, -152916, -352328, -451890, -452874, -375931, -233476, -183605, -52155, -52779, -204402, -345373, -423958, -498158, -462787, -291802, -168120, -334244]
15455c34244J59130J66146N8985k52183M9310O0237m8733J31295J43400q1227
15445E2116q4346j16392J60194J68943r834M136j22788k03985n4138j50409N3203
15434c03300K10998k00693K03046K53838N0343k77432m66905Q8973M06595J33896
15424I9359J5846J77584P5128l00301j21867L1528q0696k00345j09196J35920
15414b77040k5055l9403Q2915q4200J22592j21550r0239L31250K36383k00464
15404f4811m4128J15639K43645J793k74061r0482J33892j42151k99771o7417K34864
15393b52988R9974N7677J95332j27967k59781q8271R9882L02935J25524j09654
15383D2663k18790m3026K36965n0196L9471K04319o2559q5151j65090m4660K42460
$$ y = [-334244, -175114, -8968, 50017, -202166, -152856, -92619, -141352, -10057, 133343, 52116, -32230, -148622, 11572, 180515, 170681, 174817, 52029, -151956, -206094, -356503, -303300, -92302, -292995, -89949, 163889, 214232, -63200, -530105, -441132, -34537, 99359, 115205, 292789, 367917, 67616, -54251, -22723, -103419, -303764, -412960, -277040, -302095, -341498, -258583, -342783, -220191, -341741, -431980, -100730, 135653, -64811, -108939, 6700, 250345, 252138, -21923, -112405, 21487, -120664, -420435, -487852, -252988, -153014, -95337, 99995, -27972, -287753, -376024, -276142, 26793, 152317, 42663, -176127, -219153, 17812, -32384, 7087, 211406, 148847, 63696, -101394, -146054, 96406]
15372I6406L13285j11127Q2367L25735j65554k43219k85105r4582M4177p5503
15362a13120p6927r6255j13294q0258J08776K01632J42897k07518j3936O5207
15352a82796j06488J70565J45915o0581Q1960M6969m50630l47640l0011L03820
15342d28917J64464J02074K13471j4432J69584j59513k03719J40704P9252O3191
15332A26159K0215l24891k11783J75104J13875K40741J16006r585k55422k7236
15322c6817k07921j06610J67520M568O2288j33686J04950K44186l9630o8473r4463
15311a04088p1612J71899n6026l6415N8802q9308o8141J72588M4286j8825Q8524
15300I1684R3930j52964l7442K9378j00679o8394O570N6571R4167J641j17930
$$ y = [96406, 409691, 298564, 380931, 706666, 541112, 297893, 12788, -81794, -37617, -113120, -190047, -286302, -399596, -479854, -371078, -169446, -26549, -234067, -248003, -182796, -289284, -118719, 27196, -33385, 48575, 95544, -355086, -702726, -732737, -428917, -264453, -162379, 51092, 36660, 206244, 46731, -156988, -16284, 62968, 126159, 146374, -178517, -390300, -215196, -101321, 139420, 255426, 245841, -9581, -36817, -244738, -351348, -183828, -179260, -116972, -250658, -145708, 98478, 58848, -9625, -104088, -175700, -3801, -59827, -96242, -37440, -126748, -194889, -22301, 21985, 3160, 91684, 185614, 32650, -4792, 24586, -76093, -144487, -137917, -81346, 12821, 14462, -103468]
15289a03468Q2965K68589J2763p8513K5643j7939l7025l4466o5461p5597K24937
15278B02428j47262k40968K07130J70392K9058o1719K2666p7668k99359j3748
15268b09050k81640J92655P7901P0396N4357r770j8538J5427L3804P294k34872
15257c02036K0921Q4051j4712J04120o2001J59603J6414L5958L8658K9822j3150
15246I7648j66789k91841N0176N7192K57017K18166J49624k1111j92884j37157
15236B0041q1750J73705l8159J93289k0631L5405n6966P822M0036q0661j58457
15225C3674R0338j09360R111J55873j39132j00296N4886Q6428Q5188J33451Q344
15214C08505j84845j6484k9146m1473J14147R7585j42268j88799J0958j6313j30658
$$ y = [-103468, -20503, 248086, 260849, 182336, 207979, 190040, 153015, 118549, 53088, -22509, 202428, 55166, -185802, 21328, 191720, 220778, 159059, 181725, 104057, -195302, -209050, -490690, -298035, -220134, -149738, -95381, -105151, -123689, -108262, -74458, -67164, -302036, -281115, -197064, -211776, -107656, -169657, -10054, 6360, 42318, 80976, 110798, 97648, -69141, -360982, -310806, -253614, 3403, 221569, 371193, 350082, 157198, 20041, -61709, 111996, 73837, 267126, 246495, 281900, 224934, 232756, 272792, 192131, 33674, 124012, 14652, 23763, 179636, 40504, -59792, -4906, 81522, 166710, 300161, 308505, 123660, 107176, 78030, 36557, 150704, 248289, 106021, -82778, -71820, -88133, -218791]
15203b18791j88776R8935j58826k46190J29321J67367J74034j14469k43915J47803
15193d53507P7024j1825o4202J8283K5026L5880k8462J00525J65531J64686K31918
15182B60877P2030k49737j08768o3012n7662J89638L4426r498l0334r0650l34051
15171c86741J30839L34806j28671j67003j40518o8729J58952j02127Q8489J17877
15161a62826j106j43186j2910J73422K54873J52146k19079L7933k01986k00449
15151c23168L9771R2044J5110j10602j74605M6388K9349K27645j43431L3419J48808
15140a19272J63524n460o0234j64612k8718P7209K1937L5055K8325q320m1311
15129a01877k87018j43027L0661M56125j7576n6175j27310p580J07927J63012
$$ y = [-218791, -407567, -308632, -467458, -713648, -584327, -416960, -242926, -357395, -601310, -453507, -376483, -388308, -452510, -434227, -409201, -373321, -401783, -301258, -135727, 28959, 260877, 332907, 83170, -25598, -88610, -146272, 43366, 77792, 68294, 37960, -52690, -386741, -255902, 78904, -49767, -216770, -357288, -426017, -267065, -369192, -280703, -162826, -163932, -307118, -320028, -146606, 108267, 260413, 41334, 79267, -122719, -323168, -283397, -191353, -176243, -286845, -461450, -415062, -385713, -158068, -301499, -268080, -119272, 44252, 38792, -21442, -186054, -214772, -137563, -115626, -80571, -52246, -60566, -101877, -388895, -531922, -501261, -45136, -62712, -118887, -246197, -253777, -145850, 17162]
15119A7162o9751l5411J20721k49427j0776j66748R7335J61300M1112l2971r0496
15108b17950N3819M5242j31771L3591k43756j59735L53694L00710j33689r0032
15098a89877J29417J60222k85975l606K5600j75062m4522J73470N1485K6754o3161
15087a95255m6725L5362J6372J01082K1686q6165p2920m0241n5284j36059J51929
15076c06218j52057k3707J39402P9584j8155P6297K04689p840j63826J13946o7254
15065a25139j57493Q34L2298m4003p9630m8159j2080J92154M50857k23776l28529
15054c42666J06951R5427J94755J60125n7735k42016r6406j395K41880K25888
15044B84808j388o6180J32176k4131k12059P7295j38695r266N1081j05085q1911
$$ y = [17162, -52589, -88000, 32721, -216706, -227482, -394230, -296895, -135595, -94483, -127454, -217950, -164131, -118889, -250660, -217069, -460825, -620560, -266866, 33844, -99845, -189877, -60460, 99762, -186213, -189819, -164219, -339281, -383803, -210333, -158848, -132094, -195255, -241980, -206618, -190246, -89164, -67478, -153643, -226563, -266804, -322088, -458147, -306218, -458275, -481982, -342580, -262996, -281151, -204854, -165, -8005, -171831, -57885, -125139, -282632, -281798, -249500, -293503, -373133, -421292, -433372, -241218, 209639, -14137, -342666, -235715, -140288, 54467, 214592, 156857, -85159, -181565, -182960, 58920, 284808, 283420, 217240, 349416, 325285, 113226, 190521, 51826, 42560, 93641, -11444, -93355]
15033i3355j05093L0945J23994J49961l55307j88095J03235R8735q0956Q0664
15023b35272L12422j58713k35274K8476K91129J05666L08430L3792k22386k18217
15013A0053k10750k25204j7536K33151j6796J54760N6075j38847p5151j31252
15003c61497k7338K79673K98857P7001j50989j06822L7655Q547k7749j37377R783
14992a00256J83250J0992r2660N651J1159L7665L9042j29355l98082j013J05785
14981c27822L55762K43028j45421j58798j21526o9114p8626R6493Q8145J0469
14971a07410j0245p1396n975P2788r2023N3832Q6545M6506j0072j25393j4946
14960a77789L82409M4751k42153P3908J70455j75121n201j24471l19144j47240
$$ y = [-93355, -198448, -167503, -43509, 106452, -248855, -436950, -333715, -234980, -315936, -235272, 77150, -81563, -316837, -288361, 2768, 108434, 416864, 450656, 228270, 10053, -200697, -425901, -443437, -210286, -227082, -72322, -16247, -155094, -230245, -361497, -388835, -109162, 189695, 266696, 115707, 8885, 46540, 55087, 27338, -110039, -100256, 82994, 93986, 1326, 6977, 18136, 55801, 94843, -34512, -432594, -433607, -327822, 27940, 270968, 125547, -33251, -154777, -223891, -302517, -206024, -117879, -107410, -117655, -189051, -195026, -122238, -214261, -160429, -73884, -27378, -37450, -162843, -177789, 204620, 249371, 7218, 81126, 251581, 76460, 71259, -53212, -372356, -519596]
14950e19596J24171l1099j76186J92799J60690j16641K76952K64180k69079l42008
14940d35817J49801N33141K17787r5477q9926j12733k4947k46096k37777j8598
14930c60642J25893J53244J07926q3570J67551q5739L9431j14606j94983R5329
14920a50166J34644K05141o2713k06522o4390K7198l30848k650R0905N7506j57453
14909d59348L7328Q8650j07109Q5397J99874J2905L8324l44631j79664o1597P0750
14898f19121J37169J68348J37006l8976J13583o942J05587r9498J55489K06203
14888B58848j57653k82144j98660P015J63621k9250L7542r290k2351M8894j09179
14877b92607K3694j51976j39029K39097K27429L8356o6655O7691N3106P3835l1837
$$ y = [-519596, -395425, -426524, -602710, -409911, -249221, -365862, -88910, 175270, -93809, -435817, -286016, 247125, 464912, 369435, 279509, 166776, 141829, -104267, -342044, -360642, -234749, -81505, 26421, -57149, 110402, 24663, 64094, -50512, -245495, -150166, -15522, 189619, 126906, -79616, -144006, -116808, -447656, -450306, -359401, -301895, -459348, -422020, -333370, -440479, -355082, -155208, -142303, -103979, -448610, -628274, -689871, -619121, -481952, -313604, -176598, -215574, -101991, -108933, -3346, -102844, 52645, 258848, 101195, -180949, -379609, -372594, -208973, -238223, -200681, -209971, -232322, -183428, -292607, -268913, -420889, -559918, -320821, -93392, -55036, -121691, -54000, -894, 72941, 41104]
14866D1104m4285N0776R63J0235n0682j06161j16743j40153o9131K58732l0687
14855a96032M1802m1639j02372J39095j82431O057J51061L21821r39j67048q7913
14844a18538Q4462P4413o3740j74092j89467j37855J24242J3755R6713M15312
14834A25205R4198l21731L2011K49262j41357l52900r0967J36696J70293l42922
14824d42212m6250Q1774J88731J15525j66635j86819J41047R184O7530Q2278j40802
14813b96649M8348N7946K22485Q3522R3367j20638j59539j27558N0298J19205
14803b9213m1968K2546j40228K25645K01318N1177l09362J7415J13056k01085
14793i0699k14641j29668o2903p9926J89302K45359R3553p1095j46745P6974J36589
$$ y = [41104, -3181, 47595, 48558, 58793, 8111, -98050, -214793, -354946, -424077, -165345, -196032, -154230, -195869, -298241, -159146, -341577, -335520, -184459, 137362, 136423, -30625, -118538, -34076, 40337, -23403, -197495, -386962, -524817, -400575, -386820, -290107, 125205, 219403, -102328, -70317, 178945, 37588, -315312, -406279, -269583, -99290, -442212, -488462, -406688, -217957, -102432, -269067, -455886, -314839, -305655, -238125, -155847, -296649, -248301, -190355, 32130, 115652, 209019, 88381, -71158, -198716, -148418, -29213, -71181, -48635, -188863, 36782, 238100, 289277, -20085, -2670, 110386, -90699, -305340, -435008, -497911, -577837, -388535, -143176, -49623, -120718, -267463, -190489, -53900]
14782e3900K34348j02761j09308j48636n1541K4140J17224k42357j40584L7040
14772d36335K09453J77044R9543K14162p6075M2202j72780n2516n4745j67618
14762b17665j86750l2514Q1326J11238J30728M9115K6295K1652k9208j43187J06297
14751h2673J36549r5861j19835j72203q1104j54386k21178j0060j3288K38798
14741e75241L87298j78405L1740J32205J37476J69694k82960k01089Q4107K12028
14731h3147j34583p8945q7640o918K37201M4751P5290j83087k80311K18320O3871
14720b15198l8620p4221r8844N2692K11636j09195o5501J4988J33642L3326j43227
14709b98522m3263J62933n9264L27750K4960j6728r1168J73592O6635q0311m2913
$$ y = [-53900, 180448, 77687, -31621, -180257, -231798, -207658, -90434, -332791, -473375, -436335, -226882, -49838, 49705, 263867, 187792, 229994, 57214, 4698, -50047, -217665, -404415, -436929, -355603, -244365, -113637, -64522, -38227, -16575, -45783, -188970, -82673, 53876, -41985, -161820, -334023, -415127, -569513, -790691, -800751, -814039, -575241, -187943, -366348, -334608, -202403, -64927, 104767, -178193, -379282, -295175, -83147, -217730, -296675, -384315, -391233, -154032, -109281, -33991, -217078, -497389, -279069, -215198, -253818, -328039, -426883, -374191, -162555, -271750, -337251, -322263, -188621, -155295, -298522, -341785, -178852, -238116, 89634, 114594, 97866, 6698, 180290, 246925, 166614, 123701]
14698A23701j81005M8611J05755J06202k38240k57258k65305J961K04384K13741
14688a37453q4053p7126J31174p2218k3279L1847J34058J02538j71939q7268Q3552
14677a70167O0263k76151n5308j1210P4720j19840Q3447K82080K0033l2044M4159
14666a00018k87554N885L3087M5805J37451L0053K5999m2978R001O7472P2387
14655c410J96125r7237j09664m4403M5638M8149l4351m5235L657j29906J54553
14644a6084r8471o8310l0101J25220J29219J9783p6100J05639K7802o6397P094
14633E9294j34772l58550O346K38816Q1885j70296m0329K34070p6505p824m7580
14622b15445l4675J54084J85026J27882N6004j8608k21972j25696k8670p2511
$$ y = [123701, -57304, -8693, 97062, 203264, -34976, -292234, -557539, -555578, -351194, -137453, -221506, -298632, -167458, -239676, -262955, -231108, -97050, 5488, -166451, -253719, -170167, -109904, -386055, -441363, -452573, -377853, -497693, -414246, -132166, -112133, -144177, -100018, -387572, -381687, -348600, -302795, -165344, -135291, -109292, -152270, -143269, -75797, -3410, 192715, 95478, -14186, -58589, -12951, 35198, 847, -44388, -40731, -170637, -16084, -114555, -182865, -212966, -87746, 41473, 61256, -14844, 90795, 118597, 52200, 59294, -75478, -434028, -427682, -188866, -106981, -277277, -317606, -83536, -160041, -167865, -215445, -250120, -96036, 88990, 216872, 272876, 254268, 32296, -93400, -122070, -194581]
14612a94581j24599M4067j11829N0572l2975R2309O3041J35056J69622J43066
14602B33749Q8825j02797j77177n5294j47135N3609J9137J87652R7095j10454
14592H7210j18153j9902j45222p4294K19379M7137q0937j04217j28769j2465J43509
14581a86724j2939P5590J61847J56170o3318j66174J17780r64j06697q1246j32642
14570b39317O8034k4649j43183K9733Q0968R467j94475M0783K21817l9991j17477
14559c08290J45793j02021K0759Q8947j47825j2005k2275j45J91349k07855n3776
14548d07344K87612J58365j46676P7454j34059R2227J06981m9353O4324J04709
14538A54240J8023n48175r2635L7919o6266L10481K45647j81616j9679J0382k33583
$$ y = [-194581, -319180, -275113, -386942, -336370, -369345, -277036, -213995, -78939, 90683, 233749, 322574, 219777, 42600, -12694, -159829, -106220, -87083, 100569, 197664, 87210, -30943, -50845, -196067, -270361, -50982, -3845, -84782, -188999, -317768, -330233, -186724, -199663, -124073, 37774, 193944, 130626, -35548, 82232, 81268, -25429, -106675, -239317, -171283, -195932, -339115, -309382, -228414, -218947, -413422, -372639, -150822, -190813, -308290, -162497, -264518, -243759, -154812, -302637, -314642, -336917, -337062, -145713, -353568, -407344, -119732, 38633, -108043, -30589, -164648, -72421, 34560, -14793, 49531, 154240, 172263, -375912, -468547, -430628, -496894, -186413, 59234, -122382, -142061, -131679, -365262]
14527c65262K4344j45294N1051J85690Q2533M7910P6063P2079j77032l3934Q8557
14516i3295J3490k85014j26794J72668N8405P32J11896J53335J8402l0784o4303
14505g1262J38981J64525J70956k67804l63085j90972j03516m5499j39096J62678
14495e44094K21707N7220j24127q979J11042J45788J80030r6857p774Q2024l1546
14484a5566M3746j3944l4607O5153j95441J02473J39849K16331j48731l33896
14474a74633j06246K0238J36969J33517J17659L2567m7355j4315k30816o4721
14464a97136P1646J46895k33478J4725J46491R463o876J09993R2736p67Q4643
14453B38335M8465j4946k88470l56671k02842J11162J18972L7639k6692n8878
$$ y = [-365262, -340918, -486212, -435161, -249471, -166938, -119028, -42965, 29114, -147918, -181852, -93295, -79805, -364819, -491613, -318945, -260540, -259808, -147912, 5423, 23825, -6959, -71262, 67719, 232244, 403200, 135396, -227689, -418661, -522177, -567676, -706772, -544094, -322387, -265167, -389294, -398273, -287231, -141443, 38587, -58270, -66044, 15980, -15566, 28180, 14236, -20371, 44782, -150659, -48186, 91663, 307994, 159263, -174633, -280879, -260641, -123672, 9845, 127504, 160071, 112716, 98401, -132415, -197136, -125490, 21405, -212073, -197348, -50857, -41394, -48270, 61723, 154459, 153692, 238335, 286800, 271854, -16616, -373287, -576129, -464967, -345995, -308356, -335048, -393926]
14443c93926K9848O9659K1224J49930j25818N5543o6967o479P3382j36764Q7567
14432b42801j37039k9920L4919K1518K03325J78430j62549k17481Q602l5043j52989
14421e31028j24543K97089K60710O2537j57284M2827O0229K5350j3200l9959k16161
14410c33433p6864J2450L0097J08198J43949j15796r6449K05231J53105k4896
14400E592J10497o1290k27848J60819L1272j63981l207j10788J99712J75814J10281
14389B26873k94808j41792J4276J75697K12649Q7892l7305j81965q6557J06405
14379H1365o156l9245j36418j01159R846o167j19404J45051j53837m6767P9941
14368b92950J94365L62452R0154J26226k51529q1570K18575o8225L4681K25995
$$ y = [-393926, -364078, -294419, -273195, -123265, -249083, -193540, -260507, -266986, -193604, -330368, -242801, -379840, -409760, -374841, -353323, -149998, 28432, -134117, -351598, -342996, -378039, -531028, -655571, -358482, -97772, -35235, -192519, -149692, -89463, -64113, -77313, -117272, -333433, -410297, -397847, -367750, -259552, -115603, -231399, -327848, -122617, 30488, 5592, 116089, 54799, -173049, -12230, 19042, -144939, -148146, -258934, -59222, 116592, 226873, -67935, -209727, -195451, -19754, 192895, 280787, 243482, 61517, -25040, 81365, 75209, 35964, -100454, -201613, -191767, -197934, -317338, -172287, -326124, -372891, -292950, -98585, 263867, 354021, 480247, 228718, 147148, 365723, 297498, 332179, 558174]
14358E58174N8197J49403K93536K38940k49728k15330k28091j60649K5275l6385
14348D33342q9972o092j50016J16995M8350k28740r2923O8356K73061K19512L26753
14337I18626J02373J7621j27946m03369j16819K81729J11114k59591J94085R9803
14327H17626r2380o7740J26028j64230m4663J81126J58906j120j67258j03886
14317F42409o9625R9469J90773j8074R1722n8753m03113k73874o6035J01065J78309
14306D14273K68456q4603K68832P1008K2720R6159J88702K48198R3442J7753k22975
14295A381965k99999m59522j39909J44494K81558J05796l0487m00824l47039l7967
14285A98066p1643o8839O6838J52825P2305O9972j21612l06215j96596K68355
$$ y = [558174, 616371, 765774, 1059310, 1298250, 1048522, 833192, 605101, 444452, 469727, 433342, 343370, 337278, 187262, 304257, 352607, 123867, 30944, 99300, 372361, 591873, 918626, 1020999, 1038620, 910674, 507305, 390486, 672215, 783329, 523738, 717823, 817626, 725246, 657506, 783534, 619304, 574641, 755767, 914673, 913553, 746295, 642409, 572784, 672253, 863026, 844952, 936674, 877921, 474808, 200934, 134899, 235964, 414273, 682729, 598126, 866958, 937966, 960686, 1056845, 1245547, 1493745, 1587187, 1604940, 1381965, 1081966, 622444, 482535, 627029, 908587, 1014383, 983896, 583072, 236033, 198066, 126423, 57584, 124422, 277247, 349552, 419524, 297912, -8303, -204899, 63456]
14275F3456K41623K7485k02567p0265j57610J01251j06807J07660O1862R6278
14265A62366k9047J11065J84543j99426j33013J66312K95195M8196L0159j01908
14255E34442p5027L6533j72409J74536M48459K15635M5017J54637K87228L29986
14245A979037O64553J059469J511279K141242K592583L352048L157324J200196
14237A7657731q53270k090789k377888j837065j651907j299199j121202o56172
14229E770239k96670p86466p96204m53281m30034j71200j45066n5982K7108j08292
14219B554152m87948l42704k3643K89902j46808l77159k59911n2670K46391J43416
14209A543018j9228j63667j77323k09001j18678J51291N0458k11266j66975j25230
$$ y = [63456, 305079, 332564, 129997, 59732, -97878, 3373, -103434, 4226, 66088, 162366, 133319, 244384, 428927, 229501, 96488, 262800, 557995, 606191, 636350, 534442, 459415, 495948, 323539, 498075, 946534, 1162169, 1207186, 1361823, 1649051, 1979037, 2643590, 3703059, 5214338, 7355580, 9948163, 13300211, 16457535, 17657731, 16804461, 14713672, 12335784, 10498719, 8846812, 7547613, 6426411, 5770239, 5473569, 4687103, 3890899, 3437618, 3007584, 2836384, 2691318, 2635336, 2662444, 2554152, 2066204, 1723500, 1699857, 1989759, 1842951, 1465792, 1205881, 1153211, 1399602, 1543018, 1523790, 1360123, 1182800, 973799, 855121, 1006412, 1056870, 845604, 678629, 553399]
14199E53399Q9943J11539J1397j18127Q2096j689k10690k84641J46744K70025
14189F49996M9250q2518o2241o0427k3874k5606l13418o6883J56223J9934O4445
14178C04881k9269j98644k00585Q3228k60995k02159L82533L07646q4426k13273
14168a11063M0898L497J04236j00511k85737n6777j25263K72473O79616J81541
14158F02910k25690j58507J03354J71534j64666n9192p8515J7928L9564n6501
14148A92219j18976k41049p0664K04124q4320M2981K20491M3707r3149O832J35015
14137B37211J85040K3619p0195k04356k7464k06052N5675L0788r3369J07155M4758
14126H2810K38735m1375J4007j58090j46431j11942O7175K13484p5637N8430M6903
$$ y = [553399, 643342, 754881, 766278, 648151, 730247, 728558, 517868, 233227, 379971, 649996, 699246, 616728, 554487, 494060, 470186, 444580, 131162, 64279, 220502, 240436, 304881, 275612, 76968, -123617, -40389, -301384, -503543, -121010, 186636, 102210, -111063, -70165, -66668, 37568, -62943, -348680, -405457, -530720, -258247, 421369, 602910, 377220, 218713, 322067, 493601, 328935, 269743, 191228, 209156, 248720, 192219, 73243, -167806, -238470, -34346, -118666, -75685, 144806, 188513, 95364, 102196, 237211, 422251, 445870, 375675, 171319, 143855, -62197, -6522, 24266, -69103, 38052, 82810, 321545, 280170, 294177, 136087, -10344, -122286, -55111, 158373, 82736, 141166, 188069]
14115A88069J37666q7671k19829k60177j67670J6822J44782K82628r2061j67494
14105b24935K0998l0049l72888P5191K22952k4170Q1619P6255J19243p6774J65298
14094C2740O4634J19634j04844j91198k5554K31491O665j38505j59753J76789
14084A2099K15790j1063j35332J02237L7312J57508K8282j94065j15917O9312
14074A66163r4214L9332J32275n6607n05600Q5722L02783j43277r2965J0665j74948
14063c30671R0254J09631j14147J97285J57194K6476J28597k11161k05241J43909
14053g874J00316J23042p4107j12188M5252R3149k87260R174j3703j01290J58236
14042f7253N7612l9133J14926J49403j19103j05122M8658R6222r0000k23792R5207
$$ y = [188069, 325735, 238064, 18235, -241942, -409612, -392790, -248008, 34620, -57441, -224935, -203937, -233986, -606874, -531683, -308731, -332901, -251282, -175027, -55784, -132558, 32740, 97374, 217008, 112164, -79034, -104588, 126903, 133568, -4937, -164690, 12099, 227889, 216826, 81494, 183731, 221043, 378551, 406833, 212768, 96851, 166163, 71949, 111281, 243556, 186949, -318651, -232929, 69854, -73423, -166388, -155723, -330671, -240417, -130786, -244933, -47648, 109546, 136022, 264619, 53458, -151783, -7874, 92442, 215484, 141377, 29189, 74441, 167590, -119670, -110496, -124199, -225489, -67253, -9641, -48774, 66152, 215555, 96452, -8670, 39988, 136210, 46210, -177582, -82375]
14031h2375l4329l60607O5677K13418L25417R2391M5511m1302K8335L36269R9596
14020F88001J65689J63221K1205j17174l34292j34544k2131j45090k23236r6994
14010c5345K00897J41401J14015n4547l28158r0451O5916K14633j3321j460j7040
13999A96540M0503L9501J9881j87872J7365Q5022O8235j65803K0938K64923k4508
13988C74725l6564J60505j3443l8606j88205J52115K09495k13473r4472K5578
13978C37655R8181r8492r0275L2886M7762J7752M9171j11856L0187J41436R4084
13967E48491M7627J8950j1414m9641K31654L16714N1072j65043j24725o3706k00451
13956E99528o2514m1779K05175M11801r5571k39975K1484R3489O6520j2662K500
$$ y = [-82375, -116704, -477311, -411634, -198216, 127201, 219592, 265103, 223801, 252136, 588405, 688001, 853690, 1016911, 1038116, 920942, 586650, 452106, 429975, 284885, 61649, -35345, 165552, 306953, 420968, 366421, 38263, -52188, 13728, 228361, 215040, 213580, 196540, 237043, 276544, 296425, 108553, 125918, 210940, 279175, 113372, 134310, 399233, 374725, 338161, 498666, 485223, 446617, 258412, 410527, 620022, 406549, 312077, 337655, 435836, 337344, 247069, 279955, 327717, 345469, 394640, 282784, 312971, 454407, 548491, 596118, 615068, 603654, 554013, 785667, 1102381, 1153453, 988410, 863685, 799979, 599528, 537014, 495235, 700410, 1112211, 1016640, 776665, 798149, 891638, 958158, 945496, 947996]
13945I47996Q2161p0854j50459L12218O0119J4682j16061o0897P2486J4132p7798
13934A027725q8002J78333K59380J0315J34516L9557J30048j14141p359Q1036
13924A651408j0297L02536L97708J27161P4202K22872L84316L07654L80349L69218
13914D207127M89838L93793M77261N24822L48248O79068O55404R40056R38639
13905I654256J317671J837240K722460L458187M455570N938784Q091465J1888172
13897D9363805J8192743K7510625L7999860M0551428K8209409N982419j4293448
13890A93516841k4553530k4304852j9576921j4597234j0916181q540257o285259
13883H4742607m140225j029064L450389P957486J0065050Q848638O943466P090959
$$ y = [947996, 1030157, 959303, 808844, 1121062, 1181181, 1195863, 1079802, 1018905, 1091391, 1105523, 1027725, 939723, 1118056, 1377436, 1387751, 1522267, 1561824, 1691872, 1577731, 1570372, 1651408, 1641111, 1943647, 2341355, 2468516, 2542718, 2765590, 3149906, 3457560, 3837909, 4207127, 4696965, 5090758, 5568019, 6092841, 6441089, 7120157, 7775561, 8715617, 9654256, 10971927, 12809167, 15531627, 18989814, 23445384, 29384168, 37475633, 49363805, 67556548, 95067173, 133067033, 173618461, 201827870, 207810289, 193516841, 168963311, 144658459, 125081538, 110484304, 99568123, 91027866, 84742607, 80602382, 79573318, 83023707, 90981193, 101046243, 109894881, 116838347, 123929306]
13875A23929306P816766N285339M70263l732641l819762J263768R445723J9311157
13867A59969919K7786811K9820598K2648792P674921r269525k0704490k4335628
13860A93591398k1123546j5255393r108138k293762M151925P417053N151139L32043
13852A62862719l207399m011749n019739p568539j0105216j1205164r498722o688502
13844A05557689l849241o78954K958517P519667J4381731K5262168L7850392M3114148
13836B32116117L1361164O596350j7944066l1241387l2043476k6121001k0123958
13829A42599743j5987138j3311899j1712557j0206701q759728p782281o585640
13822F8253799n627524m602031l709855l398279k979739k544067k329702k387274
$$ y = [123929306, 131746072, 137031411, 137501674, 133769033, 129949271, 131213039, 140658762, 159969919, 187756730, 217577328, 240226120, 247901041, 238631516, 217927026, 193591398, 172467852, 157212459, 148104321, 145810559, 149962484, 157379537, 162530676, 162862719, 159655320, 155643571, 150623832, 143055293, 132950077, 121744913, 112246191, 105557689, 101708448, 101029494, 103988011, 111507678, 125889409, 151151577, 189001969, 232116117, 263477281, 270073631, 252129565, 220888178, 188844702, 162723701, 142599743, 126612605, 113300706, 101588149, 91381448, 82621720, 74839439, 68253799, 62626275, 58024244, 54314389, 50916110, 47936371, 45392304, 43062602, 40675328]
13814D0675328k176637j947557j444485j247214j223038j387993j074681r75500
13806B9198223j139125j187797j021143j011009o23403o09073p23712p95720n63244
13797B1523997m66410n31495n90373p24498o13078m90701o44901l98826m93151
13788A6570564m72329m00193n18991l62554k10508n08018m57906k97968n00024
13779A2842073n58222k43298q0964k40279m61748j54409j52749k86759m96178
13770A0167467n20641j84644l4706j20367l99987l76809j8984j60824m28993l71088
13760G550424l34829j57715j59301k36523j78321q6731k44054M3556j91350k03634
13750E801522K0703l20451m05668R08M8997M8702l3523M4446k02784m25911j61860
$$ y = [40675328, 38498691, 36551134, 35106649, 33859435, 32636397, 31248404, 30173723, 29198223, 28059098, 26871301, 25850158, 24839149, 24215746, 23606673, 22882961, 22087241, 21523997, 21057587, 20526092, 19935719, 19211221, 18598143, 18107442, 17462541, 17063715, 16570564, 16098235, 15698042, 15179051, 14816497, 14605989, 14097971, 13640065, 13342097, 12842073, 12283851, 12040553, 11959589, 11719310, 11257562, 11103153, 10950404, 10663645, 10167467, 9646826, 9462182, 9427476, 9307109, 8907122, 8530313, 8511329, 8350505, 7921512, 7550424, 7215595, 7057880, 6898579, 6662056, 6483735, 6397004, 6152950, 6196506, 6005156, 5801522, 5822225, 5501774, 5096106, 5097014, 5146011, 5194713, 5161190, 5205636, 5002852, 4576941, 4415081]
13739D415081j69999r0850k77471n8589J97310r0200q3469m11920k12251r7223
13729C120419L62862j3658l72806k53039j08115k48529j09369J37825J25244J22205
13719B763039n0865j77107l2125O9793M7714N257J16188J65764K95833P0602J8859
13708C292952j61283l29160j96464l8650k49771l18702j15986P5319r4343k63044
13698A600868r0885k18554j59239P1757O5523q5079L2928K67422j68867M2650
13688A358524N0928j78676r5650J9563R0459j51348k11304L20069J04835j46029
13678A161371j59665o0134J10523k127l926l2343j12392J43053J21138K0987k37427
13667I49058l80836R6615K54018j38o5493Q1430J44312M8400R8707p99j30972
$$ y = [4415081, 4245082, 4154232, 3876761, 3818172, 4015482, 3925282, 3841813, 3429893, 3217642, 3120419, 3483281, 3469623, 3096817, 2843778, 2735663, 2487134, 2377765, 2515590, 2640834, 2763039, 2712174, 2535067, 2502942, 2572735, 2620449, 2625706, 2741894, 2907658, 3203491, 3274093, 3292952, 3131669, 2802509, 2606045, 2567395, 2317624, 1998922, 1882936, 1958255, 1863912, 1600868, 1509983, 1291429, 1132190, 1203947, 1269470, 1184391, 1217319, 1484741, 1315874, 1358524, 1409452, 1230776, 1135126, 1154689, 1245148, 1093800, 882496, 1202565, 1307400, 1161371, 1001706, 941572, 1052095, 1049968, 1046042, 1013699, 901307, 1044360, 1165498, 1186485, 949058, 568222, 664837, 918855, 918717, 853224, 934654, 1078966, 1127366, 1226073, 1225274, 1094302]
13656A094302o403J2413k15202l2357J70797J39815k21489r851j59361j80417
13646E92247J79324K83105m1413k411l9k45718m37753j03865J38926J93998L35831
13635H92232q225j65006l9215j07940J07063o4391m7443J10490R4994q2806k39003
13624D50750n4455J31688m258Q0152q4850o9772Q900J31809J97860K6790l9473
13613G75141r0780P3143N3982k6254Q3065k5245j04835J87516j90213m00106r0174
13602B45240Q4387M9025K9311j38209n3402J36870J89678K280j2044L9289j96978
13591C75447j52015L97930O2046j97293J40772J31963n9497j6327j48014p5659
13581D59353J91904q5953j70985k5426N1719J40849J35535m843n098k63932k44864
$$ y = [1094302, 1087899, 1100312, 885110, 852753, 1023550, 1163365, 941876, 932025, 772664, 592247, 771571, 1054676, 1013263, 1010852, 1010813, 765095, 327342, 223477, 362403, 556401, 892232, 884007, 719001, 679786, 571846, 678909, 614518, 567075, 677565, 772559, 689753, 450750, 396295, 527983, 523725, 603877, 519027, 449255, 458155, 589964, 787824, 814614, 775141, 684361, 757504, 811486, 785232, 868297, 843052, 738217, 925733, 735520, 335414, 245240, 329627, 378652, 407963, 269754, 216352, 353222, 542900, 545180, 533136, 572425, 375447, 223432, 621362, 683408, 486115, 626887, 758850, 699353, 683026, 535012, 459353, 651257, 565304, 394319, 368893, 420612, 561461, 696996, 692153, 687055, 423123, 178259]
13570A78259P1038o7841O9942M3018K34520M2379r7134r2877j83034J40710J54134
13559D93114J57391N1329j50577j36688j45739j25704M2723l143K2692J73777
13549C79175O2830L4328k16639m7495K15196J26289j9392k88525j18097K10296
13539C37966N8698N1032N4383M9545K0013j0439l0220R9840o587j34862j89010
13528C00359P9054o7530j61047j08283j81603j43125J20346J49881P9247m6817
13518B0482J09884J2416r6860P0164J76383O2676k0471j02209m7204j22913j54601
13507i2253j54578Q3906J41529O2624M7546R1403K06547K75837k04834k05609
13497B52118j09063L310j0125j12107J47101r6946j35171L710J58089P0186o1332
$$ y = [178259, 249297, 181456, 251398, 294416, 528936, 571315, 474181, 381304, 198270, 338980, 493114, 650505, 701834, 551257, 414569, 268830, 143126, 185849, 182706, 205398, 379175, 442005, 476333, 259694, 212199, 427395, 553684, 534292, 245767, 127670, 337966, 396664, 447696, 502079, 551624, 571637, 561198, 530978, 630818, 624231, 489369, 300359, 379413, 311883, 150836, 42553, -139050, -282175, -161829, -11948, 67299, 20482, 130366, 142782, 45922, 116086, 292469, 355145, 334674, 232465, 185261, 62348, -92253, -246831, -162925, -21396, 41228, 88774, 180177, 386724, 662561, 457727, 252118, 143055, 146365, 136240, 24133, 171234, 74288, -60883, -57173, 100916, 171102, 109770]
13486A09770J61861R1405J36535L8845m3361M5701r9455j30355j72761j6863J64806
13475B86128j05858j72526p5266j18627o9209J24403L96175m8780k08918k14788
13465b07266M4854K38883Q2097O7309J89286k12089J7727N081j53294O2463O5447
13454B00498O9416p1714N1268J07751K37669P4300j37547j73160Q2001J40252
13444E80734R2205L0395l08783k95055j81773k8803R3962J95605J28655k9394
13434B77748j7570J15777J51100m254o3760O7687J28817Q5697O3946J96841K21940
13423A223969P2699M9304R8651l4473P9901J51720k33194l43706k0115j13087
13413I31669p5439M6781J46902R9226J42505n8328R6917k2519j54767J10890k4290
$$ y = [109770, 271631, 363036, 499571, 538416, 495055, 540756, 441301, 310946, 138185, 121322, 286128, 180270, 7744, -67522, -186149, -255358, -130955, 265220, 216440, 7522, -207266, -162412, 76471, 158568, 225877, 415163, 203074, 220801, 225882, 72588, 135051, 200498, 269914, 198200, 249468, 357219, 594888, 669188, 531641, 358481, 440482, 580734, 672939, 703334, 394551, 99496, -82277, -111080, -17118, 178487, 307142, 277748, 260178, 375955, 527055, 522801, 459041, 526728, 655545, 741242, 805188, 1002029, 1223969, 1296668, 1345972, 1444623, 1410150, 1490051, 1641771, 1408577, 1064871, 1044756, 931669, 856230, 903011, 1049913, 1149139, 1291644, 1233316, 1330233, 1307714, 1152947, 1263837, 1239547]
13402A239547k5502K5591j21577m2275K36901J45631K06286R8598j16227K9647
13392A676620J63976J27309J75866q9676j43474j39909q1980J41940J66853K40130
13382B237655j30393j5034j08906k86808j44153k60779p8514m0409j90459j55346
13372H26854O106K02649J07306J47587K15678K67948r947m1797O4933j3170p8733
13361A695414k99839m23149j71097J99256n9173N1396Q4004o4799O7685J37076
13351A216774k446j054L5436k5020r4407L5369l9032j45497m6561l11908m75231
13340A46423o59J19062L4899o629p4643L0796R4408J73581J08957j70006j74551
13329B81638K3732p7124O3175L29562j45706k32339K8177j4975J28113J7858l3449
$$ y = [1239547, 1214045, 1239636, 1118059, 1075784, 1312685, 1458316, 1664602, 1763200, 1646973, 1676620, 1840596, 1967905, 2143771, 2054095, 1910621, 1770712, 1688732, 1830672, 1997525, 2237655, 2107262, 2092228, 1983322, 1696514, 1552361, 1291582, 1213068, 1172659, 982200, 826854, 832960, 1035609, 1142915, 1290502, 1506180, 1774128, 1764181, 1722384, 1787317, 1774147, 1695414, 1395575, 972426, 801329, 1000585, 941412, 992808, 1076812, 1012013, 1079698, 1216774, 1214328, 1213274, 1248710, 1223690, 1129283, 1164652, 1125620, 980123, 933562, 621654, 146423, 145764, 264826, 299725, 293096, 218453, 249249, 343657, 517238, 626195, 456189, 281638, 305370, 228246, 291421, 620983, 475277, 242938, 271115, 256140, 384253, 402111, 368662]
13318C68662n1666k0691N9992j64629j18631j28487J97335K08549J81082J69761
13308G01277l7127m5623k75908p7584K6068J6326l7114q2755j24850j7774N9515
13297A04451L7492j99317k23239K92634L47190J56781J5587R7380j79220j55881
13287B93858j31533O9245K7224J35118O8589Q2197k34362j57458k22095j09349
13277a78566k5447J40908q8185Q2505J5456n0325R3040O8944K04376k91940k02197
13266b31431J49077J74404n6742K39929j85148m9747L13325k9514r4019J57959
13256C88093q3323j24772j53222m9072m0951l1554Q1304o3533L8289J10147K62612
13245C34018n7004p5719K4512l4929J11190J47083J6263M0922j41641j50874o0302
$$ y = [368662, 316996, 296305, 356297, 191668, 73037, -55450, 141885, 350434, 531516, 701277, 664150, 618527, 342619, 265035, 291103, 307429, 270315, 187560, 62710, 44936, 104451, 141943, -57374, -280613, 12021, 359211, 515992, 531579, 628959, 449739, 293858, 162325, 231570, 258794, 393912, 462501, 544698, 310336, 152878, -69217, -178566, -204013, -63105, -151290, -68785, -53329, -103654, -10614, 58330, 262706, -29234, -231431, -82354, 92050, 35308, 275237, 90089, 40342, 353667, 324153, 230134, 388093, 304770, 179998, 26776, -22296, -63247, -94801, -13497, -77030, -38741, 71406, 334018, 277014, 201295, 225807, 190878, 302068, 449151, 465414, 506336, 364695, 213821, 153519]
13234A53519p0128J16615j39559l57072J68260R4070L13127j1582P6454k08377
13224A35327q547K89268J40750j42062j09424j5004j61653j93942J06066K6704
13214F7483k92269j2851P3144K55033p7809j01018J47302J33054J12262j57113
13204A47218L597o7268k17373K38468R5753j65996P3372N27l17789n6123O7967
13193a97647O6357o5223J97816M03459J46757j89426k00965j21832N8900r5826
13183B370J71829J90403j26502l6848n8428J69332q5558j0440J28759j74033j40980
13172B9904j83802j10608J51951K30252K03604K5690J13252j10693P6392p2092
13162C53850j81387N8066Q4712q4067j09249k31189j4483J97205L18657j24048
$$ y = [153519, 83391, 200006, 60447, -296625, -128365, -34295, 278832, 267250, 343704, 135327, 126780, 416048, 556798, 414736, 305312, 290308, 128655, -65287, 40779, 67483, -224786, -237637, -164493, 90540, 12731, -88287, 59015, 192069, 304331, 147218, 150815, 83547, -133826, 104642, 200395, 34399, 107771, 108298, -209491, -265614, -197647, -131290, -196513, 1303, 404762, 551519, 362093, 161128, 39296, 98196, 2370, 174199, 364602, 238100, 201252, 142824, 312156, 226598, 216158, 344917, 170884, 29904, -153898, -264506, -112555, 117697, 321301, 346991, 460243, 349550, 425942, 353850, 172463, 230529, 315241, 231174, 121925, -109264, -123747, 73458, 392115, 268067]
13152B68067k47275R6625K90133k11359l34770m7455M67607l3841k84406J34991
13142I8317k0371j72749n9212K4923L49140J53273Q9328o1744k54950j83864j9531
13131e7440J15778r3929K47572L63812o124j0290Q3302k07600j45611K9051j84462
13120A34059j18828l72122J29916J51095J60786L11874o8782j89934j7187J48163
13110B69040K20672Q4365k32230k54644J51256J01092k034o5233r8077j15876
13100E8331j22499M9693M37J36629L74915J80406J45080l339j18284k29725q5798
13089C85846N0134K30949K77516J91264r782k25902k16305j55049j27913j2409
13079C88349J9634k11185J16338J83554J80010j80261j31809k45682R4732J76350
$$ y = [268067, 20792, 117417, 407550, 196191, -138579, -186034, 281573, 247732, -36674, 98317, 77946, -94803, -154015, -129092, 220048, 373321, 462649, 400905, 145955, -37909, -57440, 58338, -35591, 211981, 575793, 569669, 559379, 642681, 435081, 289470, 318521, 134059, 15231, -356891, -226975, -75880, 84906, 396780, 327998, 138064, 120877, 269040, 489712, 574077, 341847, 87203, 238459, 339551, 337517, 272284, 174207, 58331, -64168, -14475, -14038, 122591, 497506, 677912, 822992, 819653, 701369, 471644, 385846, 435980, 666929, 944445, 1135709, 1125927, 900025, 683720, 528671, 400758, 388349, 407983, 196798, 313136, 496690, 676700, 496439, 364630, 118948, 213680, 390030]
13069C90030K00314J02802p7011K21276J2447j43179M6692L6230r0489J06253
13059H05365J84839N039j88866Q6669J84436Q876j89472K0258l9751j21775n33
13048G55085L8428J09852p3234L9722p044L5770r5176J59388K27356l2358J62558
13037A320347k8154m7145K29760j27993p9421J01004l7581K61516L66046j0664
13027A947715P2410J63239L8342M37085J74799K75112L40756J24117N8630o5108
13017C567097j83963Q1316M68786N78724M84313K67954M96676R32936J286173
13008G980012R63937J584612K221754L093400M096489N796229Q773736J3492291
13000D8002460J9707186K3377557J9277501P750667m912531j2949838j4195518
$$ y = [390030, 590344, 693146, 616135, 837411, 849858, 706679, 753371, 789601, 699112, 805365, 990204, 995243, 806377, 893046, 1077482, 1086358, 896886, 917144, 877393, 755618, 755085, 793513, 903365, 830131, 869853, 862809, 898579, 803403, 962791, 1190147, 1157789, 1320347, 1292193, 1245048, 1474808, 1346815, 1267394, 1368398, 1330817, 1592333, 1958379, 1947715, 2020125, 2183364, 2221706, 2658791, 2833590, 3108702, 3449458, 3573575, 3632205, 3567097, 3383134, 3464450, 3933236, 4511960, 4996273, 5264227, 5760903, 6693839, 7980012, 8943949, 10528561, 12750315, 15843715, 19940204, 25736433, 34510169, 48002460, 67709646, 91087203, 110364704, 118115371, 113202840, 100253002, 86057484]
12993H6057484j1762243q562485o891325n230380l633419k038538j20377K214815
12985E0033532M245932M677821L719075L242173L819762L181258R21799k074997
12977G1766355l966692l268924k54963K616911O463001J1090939J5158572J6067142
12969A15672341J3238374P296466M06296l359947k321117L145484J2185830K0266987
12961A66530714K2178248J3556940q56282j2661620j6992790j5534023j3418366
12954A42802821j2302230j1520416j0271171p614069m275063p87860K950038N652185
12946A04634235O593277Q599412J2546452J7562604J9432228J3731391K410335
12939A85509934q513120j4061773j2833653p724995p62225O372649J0203827R121849
$$ y = [86057484, 74295241, 65732756, 58841431, 53611051, 49977632, 47939094, 47818717, 50033532, 54279464, 58957285, 62676360, 65918533, 69738295, 72919553, 73841352, 71766355, 67799663, 64530739, 64275776, 66892687, 73355688, 84446627, 99605199, 115672341, 128910715, 136207181, 136613477, 133253530, 130932413, 134077897, 146263727, 166530714, 188708962, 202265902, 201409620, 188748000, 171755210, 156221187, 142802821, 130500591, 118980175, 108709004, 101094935, 96819872, 96032012, 98982050, 104634235, 111227512, 119826924, 132373376, 149935980, 169368208, 183099599, 185509934, 176996814, 162935041, 150101388, 142376393, 141614168, 147986817, 158190644, 167312493]
12931A67312493K740725o216086j2765652j4793546j2930763r227092m930965
12924A09189114j203421N59976m88354k364159l361656l324005l832080n131033
12916I0044382o546555p093137n973282m483208k892867j526936k74242J640646
12908F2894801M096969P434514J2751142J7716605J7912840J0237062j435833
12901A31608100j1239337j5144515j3879496j1164148q859870p176540o187537
12894E7956657n218815m532016l990933l406492k845792k482912k309790j845166
12886C1324741j678211j537074j268661j143501r69402r85093j047782p32326
12878B1962691q75910q02397n02642o04027p74209m66098n80839o63937q59519
$$ y = [167312493, 170053218, 163837132, 151071480, 136277934, 123347171, 114120079, 109189114, 107985693, 108545669, 108057315, 105693156, 102331500, 99007495, 95175415, 90044382, 83497827, 76404690, 70431408, 65948200, 63055333, 61528397, 61254155, 62894801, 66991770, 74426284, 87177426, 104894031, 122806871, 133043933, 131608100, 120368763, 105224248, 91344752, 80180604, 71320734, 64144194, 57956657, 52737842, 48205826, 44214893, 40808401, 37962609, 35479697, 33169907, 31324741, 29646530, 28109456, 26840795, 25697294, 24727892, 23742799, 22695017, 21962691, 21086781, 20284384, 19781742, 19177715, 18403506, 17937408, 17356569, 16692632, 15833113]
12869A5833113o56434m77578r3927m57852m22362l72672m87838m84496l42753
12860A2037201k87480m14391k62383l20699l72961k81072k83819q3273j92133
12851I538990l08769l80979j45113l72801j90294j78431r2958k50441j02142k8147
12841G488915j99797l36010j32880j97749m47798k47893J2000p0721j13349R2207
12831E846925J19378k5521l32332k75725m69078k26385J09354m1009j44474j02944
12821D458189l09559l17544J77826k1191j40444J75931o3111J25412Q0522j34207
12811D031824k27798q8335q0536k95009M9597M6032j42094q2652l55225o4375
12801B791429m4097l48544m7395q1065j22450j41767O6837J97634K47601j48618
$$ y = [15833113, 15176679, 14699101, 14605174, 14147322, 13724960, 13352288, 12864450, 12379954, 12037201, 11749721, 11335330, 11072947, 10752248, 10379287, 10098215, 9814396, 9731123, 9538990, 9230221, 8849242, 8704129, 8331328, 8141034, 7962603, 7869645, 7619204, 7517062, 7488915, 7289118, 6953108, 6820228, 6622479, 6174681, 5926788, 5938788, 5868067, 5754718, 5846925, 5966303, 5940782, 5608450, 5332725, 4863647, 4637262, 4746616, 4705607, 4561133, 4458189, 4148630, 3831086, 4008912, 3987721, 3847277, 4023208, 3960097, 4085509, 4166031, 4031824, 3804026, 3715691, 3635155, 3340146, 3389743, 3435775, 3293681, 3211029, 2855804, 2791429, 2747332, 2398788, 2351393, 2270328, 2147878, 2006111, 2072948, 2270582, 2518183, 2369565]
12791B369565j88454j94467j55644j10218k9787L7804p0141j02900J84718K22968
12781A963444k18194j50004q0537q0989P459K84834K14236q500K8432M3067j07449
12770A895799j64284p0993M621j66423j89346j5226o2162m6563R5792M4028J51799
12759A477042Q4127k70574j55422J7095j57545l5913J98742R6153k65979l26631
12749F61095K60406K20470p7445k07541j18594K805j16814K17798k47418j89213
12739D05549l2632J35422L51742o9757k71374j15639j41979K81592K84190j58232
12729F68882J74680L04978p068r7735j76281J9217J83897L5921M9339l4858k17666
12718I03306J2118M6873j63488m3005j38730o1999J42358K44115J80999j80451
$$ y = [2369565, 2181111, 1986644, 1831000, 1720782, 1690995, 1728799, 1658658, 1555758, 1740476, 1963444, 1745250, 1595246, 1514709, 1433720, 1441179, 1726013, 1940249, 1931749, 1960181, 2003248, 1895799, 1731515, 1660522, 1665143, 1498720, 1309374, 1294148, 1231986, 1185423, 1281215, 1325243, 1477042, 1561169, 1290595, 1135173, 1152268, 994723, 958810, 1157552, 1253705, 987726, 661095, 921501, 1141971, 1064526, 856985, 738391, 741196, 624382, 842180, 594762, 405549, 372917, 508339, 860081, 790324, 518950, 403311, 261332, 542924, 827114, 668882, 843562, 1148540, 1141472, 1043737, 867456, 886673, 1070570, 1106491, 1155830, 1120972, 903306, 915424, 962297, 798809, 755804, 617074, 555075, 697433, 941548, 1122547, 942096]
12708I42096P2876k1387L1893J18666K80834o587l31877l36804j74161K6855m2576
12697E59828j2641K1030j65504L6085L69896K103k39857j6280l9543L790J23560
12686F42467O2512o1780J71788J31941N6262k02605j91574j900M8598N9592R4725
12675H10026j43275J13098Q7500k4295R5650j32282P7948l73054j90586O3586
12665C84316J0923L3606j5497l30268p8471J29920K23236k05190J5310J93610
12655C61495L78666N5504j67258J32014m2414r4994J67171K12812l19289k16309
12645D67398j2345K21452k28973l18369N4010J96343q5890n0582J17743K66152
12635F26939n2788j28515k7996K93846K99937k07298k96022k10503M8063L4231
$$ y = [942096, 1014972, 993585, 1025478, 1144144, 1424978, 1418391, 1086514, 749710, 575549, 602404, 559828, 547187, 568217, 402713, 438798, 808694, 810797, 570940, 554660, 515117, 518907, 642467, 704979, 643199, 814987, 946928, 1003190, 800585, 609011, 607111, 655709, 715301, 810026, 666751, 779849, 867349, 843054, 938704, 806422, 884370, 511316, 320730, 384316, 395239, 428845, 413348, 83080, 4609, 134529, 357765, 152575, 167885, 361495, 740161, 795665, 628407, 760421, 718007, 623013, 790184, 1002996, 683707, 467398, 455053, 676505, 447532, 129163, 183173, 379516, 293626, 243044, 360787, 626939, 574151, 445636, 417640, 711486, 1011423, 804125, 508103, 297600, 345663, 379894]
12625C79894J94470j1671K5628j04982n9099K02678Q1609Q4021j94659k55552
12615C42337j92318j14193J11151J6589j63731n3724K07507J50093L4646k5341
12605C13016J38634p721J30124o7344p3131J2949R0624j226k05147j48271K59638
12594D42145O6930j12520L9156N6953O8670J35753K46605m7990j08353j63546
12584F23803k00824j83321j6872o5844N4663l4859J47872M6499N7785K3855P3119
12573E25876O7394p7569p7160o3523n3553N5141j8135P5796P2877o5840R4038
12562E35342M6222J10901J01406J10240M29305P93446R47381J170959J140916
12553E386118M10859n7917l15889o33594m21319l07102r2862n0273j53986L39424
$$ y = [379894, 574364, 562693, 588321, 483339, 424240, 626918, 708527, 792548, 597889, 342337, 150019, 35826, 146977, 163566, -165, -53889, 153618, 303711, 338357, 313016, 451650, 443929, 574053, 506709, 433578, 446527, 537151, 535925, 330778, 182507, 442145, 509075, 396555, 435711, 492664, 561334, 697087, 943692, 895702, 787349, 623803, 422979, 239658, 222786, 156942, 211605, 176746, 324618, 371117, 428902, 452757, 525876, 593270, 515701, 438541, 375018, 321465, 376606, 358471, 434267, 507144, 441304, 535342, 581564, 692465, 793871, 904111, 1333416, 2126862, 3074243, 4245202, 5386118, 5796977, 5739060, 5423171, 4789577, 4368258, 4061156, 3968294, 3918021, 3764035, 4103459]
12543D103459K31491J98976L69238J88030q1045j47920j8476J54981R2776J36888
12533E228398j05821m7691K7203k00894m07476k64261L1266k4098j08978P0317
12523D197965j28004j11500O04187Q58887Q64925N94768J84578l05800p56127
12514F003879q15986m22966m67621o36993j40259j07930j21883j85799L4043O9488
12504C207973j23841l33515l18210j09009r8534j84556k75962k27335j90173M4496
12494A391334J45602Q6964K0021k8722R7058K98546J10699r0244P6202N6132j766
12483B161826j3589k40776l13580J39751j3249k39713j1846R0091J57735k53865
12473A462785k81151K5861m6799Q463J52485K5625k016N3245j36336m6259j308
$$ y = [4103459, 4334950, 4533926, 4903164, 5091194, 5010149, 4862229, 4843753, 4998734, 5091510, 5228398, 5122577, 5074886, 5102089, 4901195, 4493719, 4229458, 4260724, 4236626, 4127648, 4197965, 4069961, 3958461, 4562648, 5421535, 6286460, 6881228, 7065806, 6760006, 6003879, 5187893, 4764927, 4297306, 3660313, 3520054, 3412124, 3290241, 3104442, 3138485, 3207973, 3084132, 2750617, 2432407, 2323398, 2224864, 2040308, 1764346, 1537011, 1346838, 1391334, 1536936, 1623900, 1643921, 1615199, 1712257, 2010803, 2121502, 2031258, 2107460, 2163592, 2161826, 2148237, 1907461, 1593881, 1733632, 1720383, 1480670, 1468824, 1558915, 1716650, 1462785, 1181634, 1207495, 1160696, 1169159, 1321644, 1347269, 1345253, 1398498, 1262162, 1215903, 1214595]
12462A214595j96791p5968l7909p2495m0248L22046l4609l55088r1638o7076k4953
12451E39866L97533M26891j50693j73005K20j75893L940J06494r4400m28239j77327
12440B75387J73031J12349J10881k57058j36427p1495N4082j37885J37949K7138
12430B87952r928K76640K12734j72344k85814j20032J7899k20391K5066J53296
12420A65078K14727j55040k73822j86042o4869Q0604K33273J34656J05898k10817
12410D3646j18180j70132M2799P8169J77809O2923l2710K77888l8504j39574P1070
12399B55204J00028j5125p7633q1310j09345M4213r0172j4499J24391K02069J76844
12388E14665j35955j86076j51267k13824M182O3535L7856N1406K9462J73210q0341
$$ y = [1214595, 1017804, 941836, 903927, 831432, 791184, 1113230, 1078621, 723533, 631895, 564819, 539866, 937399, 1364290, 1213597, 1040592, 1040812, 864919, 868859, 975353, 880953, 452714, 275387, 448418, 560767, 671648, 414590, 278163, 206668, 260750, 122865, 260814, 287952, 278024, 554664, 767398, 595054, 309240, 189208, 207107, -13284, 11782, 165078, 379805, 224765, -49057, -235099, -299968, -219364, 13909, 148565, 254463, 43646, -74534, -244666, -201867, -123698, 54111, 117034, 84324, 362212, 323708, 184134, 255204, 355232, 340107, 262474, 181164, 71819, 116032, 25860, 11361, 135752, 337821, 514665, 378710, 192634, 41367, -172457, -168275, -104740, -66884, -15478, 13984, 187194, 106853]
12377A06853j46327K24482l6097j34425R281n535n4433p9257J6053K9311J92060
12366A21966j05848N2150o7757p0585L5976J33443Q1657o3506K07938r0810R1450
12355C26074R3962O700j61540j1322k05344j56612K17180N8499O7687L7148l6448
12344B35984k67257q053Q9451j42011m7371k3667J57401l5901L2328Q9504k0884
12333E9524j2556L4381o0516R002j9624K34778O9073n2258j87538r9228j913k1448
12321d8323J55480J79727j5915j3910M5381j18617K2438l191j44344r5131l7327
12310g3732J65831J19766q923p8618P8098j46332J1804K23479P1195l0769r0814
12299B40985k01525j97733j20589J16729J30025K40735k0957r3625J77238L7116
$$ y = [106853, -39474, 185008, 148911, 14486, 23767, 18232, -36201, -115458, -99405, -70094, 121966, 16118, 68268, 511, -70074, -34098, 99345, 181002, 117496, 325434, 234624, 326074, 420036, 426736, 265196, 253874, 48530, -108082, 109098, 167597, 235284, 272432, 235984, -31273, -39326, 50125, -91886, -139257, -162924, -5523, -41424, -9096, 80408, 59524, 46968, 81349, 20833, 29835, 10211, 244989, 314062, 261804, 74266, -24962, -26875, -48323, 107157, 286884, 270969, 257059, 302440, 183823, 206261, 203070, 58726, -36405, -73732, 92099, 211865, 202942, 124324, 202422, 56090, 67894, 291373, 362568, 331799, 240985, 39460, -158273, -278862, -162133, -32108, 208627, 187670, 94045, 271283, 308399]
12289C08399O9007J11269J12996P4982O3348k64186l37380p2160j75301j21297
12279b30323O9988N7961n1238j18995K57404j3128j17473Q3993j17304R7801K56919
12268A75605J05711n3745k23731K16025j45356j14509q2076N217J07990R4875
12258H6006K82590l0724j51633j03285k48686N6961K40549L9409K6715J80652
12248C78554l34263n106K58266K4132M3985p6663j39039K54223O1438j82554q7202
12237A95771J3967R2313q7981n8494O2505O3161o9778R167j67386j47879J85545
12226I0911J57211j38132j23856j9563Q8131R7258k75829l25651j37733J41293
12216d45960K74840L23738K2922l5772k5643j24909j91460p2076M95696L5096
$$ y = [308399, 377406, 488675, 601671, 676653, 740001, 475815, 138435, 66275, -109026, -230323, -160335, -102374, -153612, -272607, -15203, -28331, -145804, -61811, -179115, -81314, 175605, 281316, 227571, 3840, 219865, 74509, -40000, -122076, -116859, -8869, 86006, 368596, 337872, 186239, 82954, -165732, -108771, 131778, 171187, 197902, 378554, 44291, 39185, 297451, 321583, 365568, 288905, 149866, 404089, 465527, 282973, 195771, 209738, 302051, 214070, 155576, 218081, 281242, 211464, 220631, 53245, -94634, 90911, 248122, 109990, -13866, -33429, 54702, 151960, -123869, -449520, -587253, -445960, -171120, 152618, 175540, 139768, 114125, -10784, -202244, -274320, 221376, 256472]
12206B56472j29159N9468q7192K7309j72859O2244L07408Q083q751m1462j5512
12195B66049Q4121L0337j45427r6850N5555m7527j41184Q0960M9913N2493m3234
12184A45206q1483j06464l41413J71394k9858j8593L283o283P0762O6931J04746
12173b1772P6684K3219O5981J67550N9040Q1463j33817l08813J5129l3796J3010
12162C878K75040J44826j98803j76549J4716j20451r5820o4529K82490N6075K04906
12151C25779o0079P8550k79162j29065q2920Q9428J04133M17167J10714j00379
12141D74166j70182k83733j34130J52798J01204m3972N5988J91460n8606Q6414
12131C71407k30544j79499J35317Q3474l17045j62342K41273L54815R6728k42887
$$ y = [256472, 127313, 186781, 99589, 126898, -45961, 16283, 323691, 331774, 323023, 281561, 266049, 350170, 380507, 235080, 138230, 193785, 146258, 5074, 86034, 135947, 188440, 145206, 63723, -42741, -384154, -212760, -242618, -261211, -257928, -264211, -193449, -126518, -21772, 54912, 78131, 144112, 311662, 370702, 452165, 318348, 9535, 24664, -9132, 3878, 278918, 423744, 224941, 48392, 63108, -57343, -153163, -217692, 64798, 120873, 325779, 265700, 344250, 65088, -63977, -146897, -57469, 46664, 463831, 574545, 474166, 303984, 20251, -113879, 38919, 140123, 96151, 152139, 343599, 284993, 371407, 140863, -38636, 96681, 180155, -136890, -299232, -57959, 296856, 393584, 150697]
12121A50697n5973m5222l7166Q4014q6860L4847j20486j26750P373K41848P6347
12110A22669J17015j71763R7901N2997J27219j66732n0236r9859j03396L8833
12100c5352R3843l472J3038k33051j35715P0447K5433M21297J12613l43140j3051
12089b7110J70464j6476j35047K02233m8759r0269j13083P3371R9212j01495l161
12078I880l00873M3685L08520R8714k090p0187J10724J39956Q7613l8594R3160
12067D80508j77988l51397j81677L9505K39453m3626J3497J67502M03891m7220
12057E42448k53283k01777J44920K71337k27698j01534r5038m7857P8899k43240
12047a32823j58535l3376n314k48652K0684m1329J08683L15247l1322L6035P808
$$ y = [150697, 94724, 49502, 12336, 96350, 9490, 44337, -76149, -202899, -195526, 46322, 122669, 239684, 67921, 165822, 218819, 346038, 179306, 129070, 29211, -74185, -35352, 58491, 55019, 68057, -164994, -300709, -230262, -204829, 216468, 329081, -14059, -27110, 143354, 126878, -8169, 194064, 145305, 55036, -58047, 15324, 114536, 13041, 9880, -290993, -247308, 61212, 159926, 157836, 87649, 198373, 338329, 425942, 387348, 480508, 302520, -48877, -230554, -191049, 48404, 4778, 18275, 185777, 589668, 542448, 289165, 87388, 232308, 503645, 275947, 174413, 79375, 31518, 110417, -132823, -291358, -324734, -330048, -578700, -558016, -599345, -490662, -175415, -206737, -170702, -162894]
12036a62894M1728R475J13694J18628n1135m6556p7650k42800J89796M81351r6689
12025B76948k09063K29846L9879j44585K8658P9156j76069n6014Q9380J10196
12015B68332J37672n7265k70981j55758J91473K29194K14824K4457l65345l74463
12005a57860j674L0338l17573j27118n0094K56318L01123J37407j48323k9167
11995a06623J56644o7927j26087j8538K2819J31905q7041K16733R3375k1230k53941
11984e9911l21333J75869j6223K17219P6032J00178R3650q3719j81854j48818
11974a48910o2228M678M6208J65781P4602N6152J80389o8393k56707P4581J22788
11963A88941l9845m1609o9769o0770k4280p9970K935J01691P6938j80893k35656
$$ y = [-162894, -121166, -111691, 2003, 120631, 69496, 22940, -54710, -297510, -107714, 373637, 276948, 67885, 297731, 337610, 193025, 221683, 300839, 124770, 68756, 158136, 268332, 406004, 348739, 77758, -78000, 113473, 342667, 557491, 581948, 216603, -157860, -159534, -129196, -446769, -573887, -623981, -367663, -66540, 70867, -77456, -106623, 50021, -17906, -143993, -162531, -139712, -7807, -94848, 121885, 215260, 194030, -59911, -381244, -205375, -221598, -4379, 71653, 171831, 265481, 181762, -92, -148910, -211138, -206460, -160252, 5529, 80131, 136283, 316672, 248279, -8428, 66153, 188941, 149096, 107487, 37718, -23052, -47332, -127302, -124367, -22676, 54262, -126631, -362287]
11952c62287Q867L57259K47194o0565m30005l4566O3862O0376j60690J30020L18466
11941A37931j1899m2265L03277J86100o819j33680M3197p1250j51896o4468Q3294
11930B71522j28522k23183L7088P0233J4924k39438l3182L2087J88799L0638J04852
11919A25818k3175K06548N2989l12540Q1778L0380R3503j0679k90909P1401K49910
11908B75024k77163j17499N112J10212k7033o4299Q6426m7232j55071j13836N2944
11897b72415J82411j1474n9646L48041R2451j60892J17669P2110Q4902N8018j80587
11886B70588l78607j31416N450l7851J31134O0708M3138K56775N2403j16909r0501
11875F4912Q2494q5513O977L5819l5964j67987j14897R9165P2828L7973j52272
$$ y = [-362287, -353420, 3839, 251033, 190468, -239537, -274103, -210241, -149865, -310555, -180535, 137931, 126032, 83767, 387044, 573144, 566325, 432645, 475842, 404592, 252696, 188228, 271522, 143000, -80183, -43095, 27138, 42062, -197376, -230558, -198471, -9672, 20966, 125818, 102643, 309191, 362180, 49640, 131418, 161798, 255301, 244622, -46287, 25114, 275024, -2139, -119638, -114526, -4314, -31347, -95646, -9220, -56452, -211523, -325359, -272415, -90004, -101478, -161124, 186917, 279368, 118476, 236145, 308255, 393157, 451175, 270588, -108019, -239435, -233985, -271836, -140702, -79994, -36856, 219919, 272322, 155413, 64912, 147406, 61893, 68870, 104689, 68725, -99262, -214159, -114994, -42166, -4193, -156465]
11864a56465j524J59915n5670Q8107J71712j57017j59440k36806J56834q133K62683
11853F4196J74368Q732k47567J3987J33999o9592k29511j91862K48016p7302r3085
11842b65621J49771J04837O619J56331M4538J62003Q3012j12153j62523j27208
11832C9606J9845j28678k13880q0099J80470K07445J27003k8144M2999j11696
11822E4871n8403q381J40426O1852m6312J15532J0261j09727O580j29194r0014
11811e2509k62078o5391J9734K8073N5931j8307J27801O4514K82903J99462J17864
11800D97997q5720r5391j30618o8201l3290l8120k4811j32093j3261j51813n9307
11789c34628J59155O2387j2430r9226R1467m1894Q9656J54684j30807j82987O1870
$$ y = [-156465, -157989, 1926, -53744, 34363, 206075, 49058, -110382, -347188, -190354, -198487, 64196, 238564, 247296, -271, 13716, 147715, 78123, -151388, -343250, -95234, -172536, -265621, -115850, -11013, -4394, 151937, 196475, 358478, 441490, 329337, 166814, 39606, 59451, -69227, -283107, -363206, -182736, 24709, 151712, 123568, 166567, 54871, -3532, -11913, 128513, 190365, 144053, 259585, 269846, 160119, 166699, 37505, -52509, -314587, -379978, -360244, -332171, -276240, -294547, -166746, -102232, 180671, 380133, 497997, 412277, 316886, 186268, 118067, 84777, 46657, 21846, -110247, -123508, -275321, -334628, -175473, -113086, -125516, -224742, -133275, -175169, -85513, 69171, -61636, -244623, -182753]
11778a82753K77636K27911j9229j21606j10767j30227O5017L8261p2159j41884
11768a69800k74559O3855N5223k7155j59115Q8540K90073J75604o1498k33047
11758b51879K86365J07321m6846J8590Q9687K7884m1820L9177n6841j20832J42688
11747A93494p9235o818K6220j347O0280j56028j53465O6337N5293K6926L582Q7690
11735A22929m3539J95358J20561R3166q3564k28238J2248K41883j30423j11191
11725A89190P649o3291k34751j48246L05048J24972o5468j78343J12298K33626
11715B82684J82625K5791j00409l52857l04000j49410J86651K26988M1768M877
11705D4708O661J34291p1083j81082j23982M239M1418Q3574M9638m5634L1543
$$ y = [-182753, 94883, 322794, 303565, 181959, 71192, -59035, 5982, 44243, -27916, -169800, -444359, -380504, -325281, -352436, -511551, -423011, -132938, 42666, -18832, -251879, 34486, 141807, 94961, 113551, 203238, 231122, 189302, 228479, 171638, 50806, 193494, 114259, 107441, 133661, 132314, 192594, 36566, -116899, -50562, 4731, 31657, 35239, 122929, 79390, 274748, 395309, 488475, 404911, 176673, 188921, 430804, 300381, 189190, 196839, 133548, -101203, -249449, 55599, 180571, 115103, -63240, 49058, 282684, 465309, 491100, 390691, 37834, -266166, -415576, -228925, -1937, 39831, 44708, 51369, 185660, 114577, -66505, -190487, -186248, -144830, -61256, -11618, -57252, -25709]
11694b5709N0889K30766K43732j8486k86575l15423L8522J52088J26035J1120
11684B06959J06323j28709j41776J54211O7118q9243K80594J23306l26455k29592
11674B2736q6166J20863M3357o8627j10688N1368K0792n8730j09410J03763L6050
11663c4692m5316k57845l9439K93382J00572P130j37282r0696k68594j19546L3847
11652e58479K35665K05705Q8296j29065P004l22491K65199L02724K2807n8866
11642E8499j22848k10223J80807K23539J21380j79052N452J2038m9568K04272
11632B44296K08698j1522k13049k8196j24839j14225j76981k51602M04417K33110
11622A70107J00648k08335j08827j5877k3076L2635L5505N7834r392R5782n0915
$$ y = [-25709, 25180, 255946, 499678, 481192, 194617, -120806, -82284, 69804, 195839, 206959, 313282, 184573, 42797, 197008, 264126, 174883, 455477, 578783, 252328, 22736, -63430, 57433, 100790, 32163, -78525, -27157, -6365, -65095, -174505, -70742, -34692, -80008, -337853, -377292, -83910, 16662, 23792, -113490, -204186, -472780, -592326, -558479, -322814, -117109, -28813, -157878, -150874, -473365, -208166, 94558, 117365, 58499, -64349, -274572, -93765, 129774, 251154, 72102, 77554, 89592, 40024, 244296, 452994, 441472, 228423, 200227, 75388, -38837, -215818, -467420, -63003, 170107, 270755, 62420, -46407, -62284, -85360, -52725, -17220, 40614, 31222, 127004, 76089]
11611G6089j32480k16148l43426p701L08945L16576n1476j40832J17585o6855
11601a39723r9354L8847k48759J85525M5053o678j5441p6484J70171J6733q746
11590a38856L04054K47411j24075l7963j63461j53363K74395o9656j02880j788
11580C3818J64497Q2682l3141J86110j03299j36482k2309j42957J60286j24358
11570F4847L4517n0530j12316P5137j13630k22297J38651J15319J26474o3403
11560g231P0880o7436o4906J33361K93658j68981k33917m9956J35706P8684j7902
11549A01960j24973N653J12393R3827P5245J1420J43155L127J17112P3128J0320
11538F22367k8572J22295j31236k79360j92089k52970J8215R4983Q8912j42729
$$ y = [76089, -56391, -272539, -615965, -623666, -314721, 1855, -49621, -190453, -72868, -139723, -239077, -200230, -448989, -263464, -218411, -225089, -240530, -317014, -146843, -130110, -138856, 165198, 412609, 288534, 250571, 87110, -66253, 208142, 138486, 35606, 33818, 198315, 280997, 247856, 433966, 330667, 194185, 171876, 28919, 189205, 64847, 99364, 48834, -63482, 11655, -101975, -324272, -185621, -70302, 56172, -7231, 63649, -3787, -68693, 64668, 358326, 189345, -44572, -94528, 41178, 119862, 101960, -23013, -17360, 95033, 188860, 264105, 275525, 418680, 421807, 538919, 612047, 622367, 593795, 716090, 584854, 305494, 113405, -139565, -121350, -26367, 62545, -80184]
11528h0184O5263m6865J70317K67909K61910j56573l73098N1715N4911r315l7635
11517A68355N3404l75680j26492J33363J98398J20776j09502k19224K50336R6154
11507A89888r4555K2385j53966m3732J14188K44331r4837j08433M23N213N7554
11496A38459n742j60905j01466m8358M43905N1251j99681r1789j28516q1806L05283
11485A20635K25738j25193j35148p889k68298n4637j02399O7277K39973j52271
11475a92212j47205r5188J0603K01835O4441K14585p855M6741J7199N2714j13546
11464E2112j95249K68658J33662j2054K6254k9970l61961r3506P0185m9709Q1885
11453a09693K51206j16144j76625J8258r4339Q1455K79778J36760n4898r4187
$$ y = [-80184, -14921, -61786, 108531, 376440, 638350, 481777, 108679, 160394, 215305, 205990, 168355, 221759, -153921, -280413, -147050, 51348, 172124, 62622, -156602, 93734, 189888, 95333, 117718, -36248, -79980, 34208, 278539, 183702, 75269, 75692, 80905, 138459, 132717, -28188, -129654, -178012, 265893, 317144, 117463, 25674, -102842, -184648, 120635, 346373, 221180, 86032, 78143, -190155, -244792, -347191, -279914, -39941, -192212, -339417, -434605, -424002, -222167, -157726, 56859, 49004, 95745, 112944, 165658, 52112, -143137, 125521, 259183, 247129, 273383, 243413, -118548, -212054, -141869, -191578, -109693, 141513, 25369, -151256, -132998, -227337, -145882, 133896, 270656, 215758, 121571]
11443A21571J9796K66091q2973k30814j86009j91793j74907J84584L45350K43034
11433C13930q5777k74874k9494R2158j31467Q9318J2813j41366q029J30202n9416
11422i2002k18987N7069N3415O6827J27688R5094q8112p0894J7277l29802j586
11411c84013J37278j54641J04420J8024k290J43589P6825k69207J59639J17949
11401e2427l18514O589L08186J13434j90248o5022p860K77859J28574K0018j95190
11390B5399j04114j01153M3805R81J79650K02945k07634o4901M46856O2857k15132
11379B69559j74743J02610Q168j73967j09903j50682J16949R6304p0773p8416
11369a64894N8350R0990o6711L6360j6238j89292k11070M2052K69582J09909j61588
$$ y = [121571, 141367, 407458, 324485, 93671, -92338, -284131, -459038, -274454, 70896, 313930, 228153, -46721, -76215, 15943, -115524, -26206, -13393, -154759, -162788, -32586, -92002, -310989, -253920, -200505, -133678, -5990, 89104, 992, -69902, -52625, -382427, -384013, -246735, -401376, -296956, -278932, -281222, -137633, -60808, -330015, -170376, -52427, -370941, -364352, -56166, 57268, -132980, -198002, -205862, 71997, 200571, 220589, 25399, -78715, -179868, -136063, -135082, 44568, 247513, 39879, -25022, 421834, 484691, 269559, 94816, 197426, 205594, 31627, -78276, -228958, -112009, -15705, -86478, -164894, -106544, -15554, -82265, -45905, -62143, -251435, -462505, -420453, -150871, -40962, -202550]
11358b02550J87930j8444k51547K26071K43908M0131k23809n5759j3965k49733
11348c17767j15820J80718L01096J49513q9849l8013r5738p5725N9117J28684
11338H6216q9990J1145n9043j33143N1681k08263K0174K04522O8774k18250J84507
11327h1670J58594q2177n485o0890M4261K73740J46726q467j0597n7305j52316
11316A64414j06990P2833J60633O7180k57603O5907K6489q6681K31338J3358k99710
11305E1168O2202P3775L6681j65415q2670Q1114j05148j48462l02043l0677J72172
11294c57303K28767N6467j4417J7050j74935l6474J22296J4927r9654N6245L27942
11283A40911N245l7641M6818j9444o5656j62365R7241n6994K5024L62022P6474
$$ y = [-202550, -14620, -33064, -284611, -58540, 185368, 225499, 1690, -54069, -68034, -317767, -433587, -252869, 48227, 197740, 107891, 69878, -25860, -101585, -42468, 86216, -3774, 7371, -51672, -184815, -133134, -341397, -321223, -116701, -47927, -266177, -81670, 76924, -5253, -10738, -71628, -27367, 246373, 393099, 384632, 374035, 316730, 164414, 57424, 130257, 290890, 358070, 100467, 166374, 192863, 106182, 337520, 350878, 51168, 113370, 187145, 223826, 58411, -24259, 56855, -48293, -196755, -498798, -529475, -357303, -128536, -72069, -86486, -69436, -244371, -280845, -158549, -143622, -243276, -187031, 140911, 146156, 108515, 155333, 135889, 70233, -92132, 5109, -51885, -26861, 335161, 411635]
11272D11635m5381j22403O5540j1185j55803j46277l8438m6576M9936N2868J81491
11261A95407p500l8798p7323o6976k00922o4319m0467l4229r1599J16485J02762
11250b07479l401q6254j40259k6335M6261l2869R0178n3999j5556j67779J09733
11239d87759K69149j7130O5267j02353l9635J25761N7088k7424K27579O0400k03475
11228g2532J45214J44328j75423p5393J52630j06906L271k32643J4652l9408K7325
11217b14885J61663J20228j82985m5063J10032r0766k7257j19623M4885L9770
11207b04001j15339o1610J48922K96866L0654K918J8229l2721P1008M7045Q7858
11196B89829j78626L4011k1778q3210j40344M6819p2812l6479j13710M8416J21499
$$ y = [411635, 366254, 243851, 309391, 298206, 142403, -3874, -42312, -88888, -38952, 13916, 195407, 187907, 149109, 71786, 4810, -196112, -260431, -300898, -335127, -426726, -310241, -207479, -210880, -297134, -437393, -463728, -417467, -450336, -360158, -414157, -429713, -597492, -487759, -218610, -235740, -170473, -272826, -312461, -186700, -129612, -157036, 70543, 130943, -72532, 72682, 217010, 41587, -33806, 118824, 11918, 15189, -217454, -202802, -242210, -214885, -53222, 67006, -115979, -161042, -51010, -141776, -169033, -288656, -243771, -204001, -319340, -380950, -232028, 64838, 95492, 98410, 116639, 83918, 154926, 201971, 289829, 111203, 145214, 123436, 40226, -100118, -53299, -126111, -162590, -276300, -227884, -106385]
11185a06385J05318K02885K5606j08369K0207l18892q1567J04636R3976N1010
11175a1575L7815L5902N5833K7121r3296k98334r2915J40795J88977J69683m4574
11164A15432j02003P341J46129J3083j5522M5587k4693m9840M0316q6988Q183
11153I7025l2575k5748K01002j40667q3605j80445O7773J53736N2376Q646L4947
11142A52465L0981J36094Q0642l6865m060j28646k31969P1996q726k20650K233
11131a56505P3688J28508k25442j28740k52288N2771L97725J16544q5597M47590
11121C68254O7422q9134J66843k2662k67363k57428n9268j7122N5276j54917L24
11110b09775J66738j90646j94292J42664J5167l9380N045r7866k0001L62516L23045
$$ y = [-106385, -1067, 201818, 227424, 119055, 139262, -179630, -261197, -156561, -62585, -11575, 26240, 62142, 117975, 145096, 51800, -246534, -339449, -198654, -9677, 160006, 115432, 13429, 20770, 166899, 179982, 164460, 210047, 185354, 135514, 175830, 88842, 97025, 64450, 38702, 239704, 99037, 15432, -165013, -97240, 56496, 108872, 117518, 152465, 183446, 319540, 400182, 363317, 359257, 230611, -1358, 70638, 61912, -158738, -156505, -82817, 45691, -179751, -308491, -560779, -508008, -110283, 6261, -79336, 368254, 435676, 346542, 513385, 490723, 223360, -34068, -93336, -110458, -55182, -210099, -209775, -43037, -233683, -427975, -285311, -270144, -309524, -304479, -402345, -422346, -59830, 263215]
11099B63215M5277J11464l03217r7229J70492k19194k68341Q1052J2665o2444
11089b66260m4607n4912J5401L11547K39082L76j67620j50838M0157L43281P9192
11078C44799L4821m50244l11018J60462J87076L29400q7471j14534k57156k01875
11068c65740K27709L54590P8335k33694J4154J4246J41242l51633k92548M6304
11058c67035Q2796K8342O1313J32989j5133o4910j65257k5758J02854m8178j15880
11047c93857j44017K85957L91344J23692k1302L4005K6219R6687r5526j52938
11037A50264j45970J09941j9993j75560j2574L74849J17130k87789n8469m461
11027D7368J15299r293q294J7096k8733n0744M9401j63957k77173J56K53685K52978
$$ y = [263215, 308492, 419956, 116739, 19510, 190002, -29192, -297533, -216481, -203816, -266260, -310867, -365779, -350378, -38831, 200251, 200627, 33007, -117831, -77674, 265607, 344799, 379620, -70624, -381642, -221180, -34104, 295296, 207825, 93291, -163865, -365740, -138031, 216559, 294894, 61200, 75354, 89600, 230842, -120791, -413339, -367035, -284239, -255897, -194584, -61595, -76728, -141638, -306895, -332653, -229799, -277977, -393857, -537874, -251917, 139427, 263119, 241817, 275822, 302041, 398728, 303202, 150264, 4294, 114235, 94242, -81318, -93892, 280957, 398087, 110298, 51829, 47368, 162667, 153374, 145080, 162176, 133443, 82699, 132100, -31857, -309030, -308874, -55189, 197789]
11015A97789k60484l04694J85814k5821m7253j3913Q6263n6148N9330r1378j0103
11004b80598j89570K55410p1630Q63K16354m9390l1260J46384L2873n3976j57515
10993a82055p7601P4656J53471N8060j28052L26172K24492r7259r9066J94003
10983D46821j36797k56240j62148j25102K0646N1853j8874J50529k41939k63140
10973e34391J88806K14236j28360O1852K9824m6817P3743N8597J10462L8864j10906
10962d4090M469J42847k8733m5354k02600O3239J20135K3636K41317k144k77796
10951e074K360L4161J29260K72212r6314m6868j52507j76539j72332J99525K78252
10940B66136J96985J99320L2806k47039n500o7684L7638j84827k79890P2459J54024
$$ y = [197789, -62695, -367389, -181575, -207396, -254649, -268562, -182299, -238447, -179117, -270495, -280598, -470168, -214758, -286388, -285525, -69171, -118561, -149821, -3437, 29436, -24540, -182055, -259656, -185000, -31529, 26531, -101521, 224651, 449143, 351884, 252818, 446821, 310024, 53784, -108364, -233466, -212820, -160967, -179841, -29312, -271251, -534391, -345585, -131349, -259709, -197857, -168033, -214850, -141107, -82510, 27952, 66816, -44090, -39621, 103226, 74493, 29139, -173461, -110222, 9913, 33549, 274866, 272722, -5074, -2714, 31447, 160707, 432919, 336605, 289737, 137230, -39309, -211641, -12116, 266136, 463121, 662441, 695247, 448208, 442708, 375024, 412662, 227835, -52055, 20404, 174428]
10929A74428n02k8717K6363l6994P5032J44174q1900q963K96023Q613k66038r3838
10917B07681L2761k60560K306K56237o7233j40930r404M1642J642m30363k47338
10906f13559K85265L28687M5553J9112O8303N1140J40464P5346R1399J79115l9919
10895F30906l12769r2421o8684J52796K19816J97283J4945k4670l27696k36354
10885A53152j03709J32184K38261j21049k22468o6095j8810j68396Q3402R141
10875h4387j1037P1282n406Q7906Q6688J09040L5100J33708L895j25711j3890
10864B87188J67230j89066l03743k5678O3693r8222k72218j45901j08893J24077
10854e01533Q5081L17494R3206P2780o2431k26786j02376Q2927l945K05007K03866
$$ y = [174428, 173926, 145209, 171572, 134578, 209610, 353784, 271884, 262921, 558944, 567557, 301519, 207681, 240442, -20118, -17812, 238425, 171192, 30262, 20858, 62500, 64142, -366221, -613559, -328294, 393, 45946, 65058, 133361, 184501, 324965, 400311, 491710, 670825, 630906, 318137, 225716, 157032, 309828, 529644, 726927, 741872, 717202, 389506, 153152, 49443, 181627, 419888, 298839, 76371, 10276, -8534, -176930, -93528, -84387, -95424, -24142, -29548, 58358, 145046, 254086, 289186, 422894, 426789, 301078, 287188, 454418, 265352, -38391, -64069, -376, -98598, -370816, -516717, -625610, -501533, -416452, -98958, -5752, 67028, 4597, -222189, -324565, -241638, -245583, -40576, 163290]
10843A63290J0654R549R1676J8404j13943j83680j14446j51870J24343q18j5893
10832a62734J02166j75277K9942j31309k30902J32966K48398K09886J03109K0185
10822A46430K7234J02375q4483j65310m5392q7085j27145j72013o956K53705K91736
10811A33096j86689p7451o6868N7985P8723J8992J74107n6986L5461j92501n3994
10800a36125Q6807J77137m8158k89291j69418Q3701r9167P9505J61497N723J87206
10789C9417L00137k49231m62463k81283j03676K29458K82602j00523l2063K299
10779c75326O9382L78148K18277K7863k30027n45089k18424K57901L3958O4778
10769c18559q5852k9015K91325J25259K01054l57813k27185j75288O4752J28887
$$ y = [163290, 173944, 183493, 275169, 293573, 179630, -4050, -118496, -270366, -146023, -146841, -162734, -60568, -235845, -205903, -337212, -568114, -435148, -186750, 23136, 126245, 146430, 173664, 276039, 191556, 26246, -19146, -106231, -233376, -405389, -412345, -158640, 133096, -53593, -131044, -197912, -139927, -61204, -42212, 131895, 74909, 110370, -82131, -136125, -49318, 127819, 79661, -209630, -379048, -295347, -394514, -315009, -153512, -147789, 39417, 339554, 90323, -372140, -653423, -757099, -527641, -245039, -345562, -377625, -375326, -305944, 72204, 290481, 318344, 88317, -456772, -675196, -417295, -383337, -318559, -404411, -433426, -142101, -16842, 184212, -173601, -400786, -576074, -511322, -382435]
10759c82435J11158j4165l57476j01179J50058J91391L58227o3150k52513q53
10749c60937m5367j20907K8277R6955J0045K17979l1253K7675R7269L05594o685
10738B18645J3625J16942k27962j52516j83141M6528j5932k03296j20293q8817
10728e96217L04212N8581K508P3898m3511j61974J63490J6896k90447j23940J76035
10717d20469K29452J56204j3395k9123j74917n9529p467N6597m2006J98092P6343
10706c0218j50799j05537M7337l5258J9934k0562l55207k4415L81665K26622m5299
10695i1737N3903r1819j62052K18177R5367n5257j21307Q2276J33872L6844k40738
10684a42471J6349M8070l1154p1462J03684J69917k66176j42093K8276K00594
$$ y = [-382435, -271277, -285442, -642918, -744097, -594039, -402648, -44421, -107571, -360084, -360937, -406304, -527211, -498934, -401979, -391934, -173955, -205208, -177533, -80264, 225330, 218645, 232270, 349212, 121250, -31266, -214407, -167879, -183811, -387107, -507400, -596217, -292005, -233424, -230916, -157018, -200529, -362503, -199013, -182117, -472564, -596504, -420469, -191017, -34813, -48208, -77331, -252248, -311777, -319244, -262647, -304653, -106561, -30218, -181017, -286554, -239217, -274475, -254541, -275103, -630310, -654725, -273060, -46438, -91737, -37834, -129653, -291705, -73528, 21839, -33418, -154725, -72449, 61423, 98267, -142471, -126122, -78052, -109206, -180668, -76984, 92933, -173243, -315336, -287060, -86466]
10674h6466O6843K2830J36330K46611o4420k66788k2350p7818j48208J20793J34402
10663F1759q5465k36227n7958q0504J14012J07608K09024p3011m3964J23303l4074
10652D503j41090J30395j93340l5154j1502j76001k3610K18357j00675L2026J85618
10641a10473L78209K13104m4787l48529M4489q4336l4343j34829o0794k7014J81597
10630b7706P8950m8544J41185R0045q4113k03843J13539J48682p5620k11409m22806
10619e01640J17232L15391K48021R3081M0527n4032k36855J16201j60312l5256
10609e7642R949J49050j13744K20474k3800K3822r7716j40516j66146j91550J11377
10598b76442K20388K60696k768J75k15334n1696l47352j38524P3535J06810L48804
$$ y = [-86466, -19623, 3207, 139537, 386148, 321728, 54940, 32590, -45228, -193436, -72643, 61759, -23706, -259933, -317891, -398395, -284383, -176775, 32249, -40762, -84726, 38577, 4503, -136587, -6192, -199532, -234686, -246188, -422189, -445799, -227442, -328117, -296091, -110473, 267736, 480840, 436053, 87524, 132013, 47677, 13334, -121495, -182289, -209303, -27706, 51244, 2700, 143885, 233930, 149817, -54026, 59513, 208195, 132575, -78834, -501640, -384408, -69017, 179004, 272085, 312612, 258580, 21725, 137926, -22386, -57642, -47693, 101357, -12387, 208087, 184287, 208109, 110393, -30123, -196269, -387819, -276442, -56054, 204642, 201874, 202049, -13285, -64981, -412333, -550857, -477322, -370512, -21708]
10587b1708l6918j1904J3793K0961m9476J24211k5860j25973k21051J01405R6334
10576a36186M7646Q3960k30173q4944Q7279k8963k35554l05232q9209L83546K52098
10565b55732m2015k1438P8208q5653M4422K51360J32748m3630O7442l4640K1881
10554A12953R7757j63253k16431Q080J18091j39996J85016O7750R5127n5971j25754
10543a6631J70810l7422r4284R0452P894n5531J3218j25539p9377j79615K13132
10532i2893R6503K5017j83j17063k7747n1734K26352L26166K58853p0312j99289
10521C73670J58745n3622r4824p9496J27020o4878l46659j04037j75166K8608
10511b30639J7399k3648q3610o911L2284J25983L9131j4843J30474P5208k8018
$$ y = [-21708, -58626, -70530, -56737, -35776, -85252, 38959, 13099, -112874, -333925, -232520, -136186, -88540, -4580, -234753, -319697, -232418, -261381, -496935, -802167, -891376, -507830, -255732, -297747, -319185, -240977, -326630, -282208, -30848, 101900, 58270, 125712, 91072, 112953, 210710, 47457, -168974, -160894, -42803, -182799, 2217, 69967, 165094, 109123, -16631, 154179, 116757, 22473, 112925, 120819, 65288, 78506, -47033, -126410, -306025, -92893, 3610, 28627, 28444, -88619, -116366, -168100, 58252, 384418, 643271, 572959, 373670, 532415, 478793, 383969, 304473, 431493, 366615, 19956, -84081, -259247, -230639, -213240, -236888, -320498, -327409, -295125, -169142, -130011, -144854, -14380, 60828, 32810]
10500C2810R5365q0424J9596P3300j95067r0779r250j7820J98914n3657R3593
10489F6581M1429J75103Q7925k46082k33895r4919Q111J60572K4031P9190J28077
10478A96123K1442k53338L6842J36513J35910j34710k78266j76158L08374Q5565
10468G8297l02349m8841o8112k075K33896j630Q8788K53549j45352n6163m7448
10457a7440j82140j37511q1153k3773j62843k2855L13810J76952J04040q2247
10447a15160K8399J63728R7835j05621K6342j09614q2593j39507p5163O3853O4787
10436a82714k4586J64386R3732q0175n3068k63781J9289N6576j42614j20128k181
10425e35264J22640J10599L2051J81720n131K34563J82436j50755K4417l1617
$$ y = [32810, 128175, 47751, 67347, 140647, -54420, -145199, -154449, -172269, 26645, -27012, 66581, 108010, 283113, 371038, 124956, -108939, -203858, -195747, -35175, -11144, 68046, 196123, 217565, -35773, 1069, 137582, 273492, 138782, -139484, -315642, -7268, 78297, -224052, -272893, -341005, -343080, -109184, -110814, -22026, 231523, 86171, 30008, -17440, -199580, -337091, -418244, -442017, -604860, -627715, -313905, -136953, -32913, -115160, -86761, 76967, 174802, 69181, 95523, -14091, -96684, -236191, -311354, -247501, -182714, -207300, -42914, 50818, -29357, -82425, -346206, -326917, -270341, -412955, -533083, -535264, -412624, -302025, -269974, -88254, -93385, 141178, 323614, 172859, 197276, 165659]
10415A65659j8114M792J91184j6636j96448j70252O3963L17964K54874k36050
10405C60936k60775j35682j21222m2962l6763k1809K33053L6353p0962k30931
10395b90764Q5909P4051J93008P9564o4785J06087p316k39565K30731K27889L60514
10384G55323j97884k79764j878J13151k82009M5314j75347k03827J4969R8741
10374a13211R2404K14128M7390k1866o6490j59829o9393L0363J15251J22550j9639
10363A71658p5988O9511K45849r4539l2376o7308l72308q679K81044J53447m7202
10352B23109j17584q400K7804J20018L28563K85795k9714l31643j14029j07350
10342B76569N7541k9445J12872n2539k5070K66028J80795J86285l4914j49295
$$ y = [165659, 147545, 152337, 343521, 326885, 130437, -39815, 24148, 342112, 596986, 360936, 100161, -35521, -156743, -199705, -236468, -258277, -25224, 11129, -59833, -290764, -204855, -130804, 62204, 141768, 76983, 183070, 175754, -63811, 166920, 394809, 755323, 557439, 277675, 275797, 388948, 106939, 152253, -23094, -226921, -211952, -113211, -20807, 193321, 240711, 218845, 152355, -7474, -76867, -46504, 68747, 191297, 171658, 95670, 165181, 411030, 316491, 284115, 216807, -155501, -164180, 116864, 270311, 223109, 105525, 97125, 124929, 244947, 573510, 859305, 829591, 497948, 383919, 276569, 334110, 304665, 417537, 364998, 339928, 605956, 786751, 973036, 938122, 788827]
10332G88827J7596J03301J86413j20077K4982Q969O4900J50589Q3562K39828K01652
10321A750542l1318J61302J25594J34731J51309L19638N16457L56259M54741N25939
10311D465194O16947P93167J273461J794852K357250L264498M341411O423598
10303B5330378J0020436J5880521K1949230K2839947J4811883J859942r465501
10296A03226836j4777223j4039464j1049218q810344o838802n791718n066088
10289C6853979l863339l046112k735204k325400k100927j550166j303446j240511
10281A8688874r87212n33433n4484j44935j01115K23973L41569P67809J517394
10272A9718440J695811K325921L600934N266998P478481J0686637J6957276K6851240
$$ y = [788827, 806423, 909724, 1096137, 976060, 1001042, 1010011, 1074911, 1225500, 1309062, 1548890, 1750542, 1719224, 1880526, 2006120, 2140851, 2292160, 2611798, 3128255, 3484514, 3939255, 4465194, 5082141, 5875308, 7148769, 8943621, 11300871, 14565369, 18906780, 25330378, 35350814, 51231335, 73180565, 96020512, 110832395, 112692337, 103226836, 88449613, 74410149, 63360931, 54550587, 47711785, 41920067, 36853979, 32990640, 29944528, 27209324, 24883924, 22782997, 21232831, 19929385, 18688874, 17701662, 17168229, 17113745, 16968810, 16867695, 17091668, 17433237, 18201046, 19718440, 21414251, 23740172, 27341106, 32608104, 40086585, 50773222, 67730498, 94581738]
10264I4581738M0088397M7380651L6674559J1616578j4229470k9610882l0995781
10257A55505790k4683252j8559304j4552094j2055331j0158248q402364o883583
10250F0211614o169955n149299m441348l682175k983226k924751k574028j853753
10242C0433079j416238j225348j081685j076642j000712o83397j92144L63290
10234B4120203Q01662J530109K033661K682141L822342O393337J0464634J6269348
10226F8117437K1165392J9504984R493796k927479j2210077j5063043j3238512
10219G4842498j0214564p933503o626992n452673m523816l774744l440000k994207
10211B9881999k376655k086530j912317j681290j324520j154390r94394j018491
$$ y = [94581738, 134670135, 182050786, 218725345, 230341923, 216112453, 186501571, 155505790, 130822538, 112263234, 97711140, 85655809, 75497561, 67095197, 60211614, 54041659, 48892360, 44451012, 40768837, 37785611, 34860860, 32286832, 30433079, 29016841, 27791493, 26709808, 25633166, 24632454, 23949057, 23756913, 24120203, 24921865, 26451974, 28485635, 31167776, 34990118, 41383455, 51848089, 68117437, 89282829, 108787813, 118281609, 115354130, 103144053, 88081010, 74842498, 64627934, 56694431, 50067439, 44614766, 40090950, 36316206, 32876206, 29881999, 27505344, 25418814, 23506497, 21825207, 20500687, 19346297, 18351903, 17333412]
10203A7333412r86650p83452q46674p36524k35325l79788m86197m48099n22894
10194A1907809o68295l77817l62413m02119n40920q0547m67999l11956k27467
10185H468276j54932j80778j30543m39499m00299j69258j02108j74729j07011
10176F609119k12439l31848j52950q5129l50192j94881j20731k29003p5283j07361
10166D749302k69908J67603j7109m5691J24413k41731k88220k8293j56584o8674
10156C925108j5043L907k60496n26346o6156o7036J67497n4461J13109p2569R8152
10145C245666l2171j59204j77453j29279r8907j36076K868p4608j52941r5571
10135B192324N4370N42j91807J01870l8872r1194k19231m4905n5370j74128M3806
$$ y = [17333412, 16346762, 15563310, 14716636, 13980112, 13744787, 13364999, 12878802, 12430703, 11907809, 11239514, 10861697, 10499284, 10097165, 9556245, 9475698, 9007699, 8695743, 8468276, 8313344, 8132566, 8002023, 7562524, 7162225, 6992967, 6890859, 6716130, 6609119, 6396680, 6064832, 5911882, 5826753, 5476561, 5281680, 5160949, 4931946, 4856663, 4749302, 4479394, 4646997, 4629888, 4584197, 4708610, 4466879, 4178659, 4150366, 3993782, 3925108, 3910065, 3913972, 3653476, 3127130, 3060974, 2993938, 3161435, 3106974, 3220083, 3147514, 3245666, 3213495, 3054291, 2876838, 2747559, 2648652, 2512576, 2515444, 2440836, 2287895, 2192324, 2246694, 2247236, 2055429, 2157299, 2118427, 2027233, 1808002, 1763097, 1707727, 1533599, 1577405]
10124A577405j3582j3357k53783q554M3335j90121j61525J96521j11429R1126
10114A156036K76583j26860k69167n8064l4243j91456J03146L6080J16148K69589
10104A277792p6504l67820j46034j72657k5813M1728J65846J08484L7805J05972
10094I48799l55486j35593K33519L066O494K16144l3718q1089R9265o2656j13991
10083G24754j03826P16Q670o5697K8872j69224r4488K08102M8973l2213o1752
10072D92887n5159k9006r5967n8142J68408l7226M8806m3717q2696P3325m502
10061C77011K22260p7407J32905J24524O116M5161K728j7691J01974K67631L82499
10050A567711M66557O37176J222496J821847J703654O98711o51220j383782j188159
$$ y = [1577405, 1563823, 1550466, 1296683, 1288129, 1331464, 1141343, 979818, 1176339, 1064910, 1156036, 1432619, 1305759, 1036592, 978528, 944285, 752829, 855975, 892055, 1008203, 1277792, 1201288, 833468, 687434, 514777, 488964, 530692, 696538, 805022, 842827, 948799, 593313, 457720, 691239, 694305, 700799, 916943, 883225, 802136, 901401, 838745, 724754, 620928, 621644, 630314, 564617, 593489, 424265, 329777, 537879, 586852, 554639, 492887, 437728, 408722, 312755, 254613, 423021, 385795, 434601, 390884, 308188, 381513, 377011, 599271, 521864, 654769, 779293, 785409, 830570, 833298, 815607, 917581, 1185212, 1567711, 2034268, 2671444, 3893940, 5715787, 7419441, 8118152, 7466932, 6083150, 4894991]
10041D894991r37986m32915l12433m86827m38188R2076j35160j13550l80579j73238
10031A576191r1597j21534l4602m7333q2570k75603n1612J68687m6004j73301
10021H20722r4443q1019K15836P162l31104P9381J71245r7769q0067k31611L7637
10010D15970q437k51551n4120k8815L1859J4696Q3982L05706J81760j41927l21865
9999B27258k4957j36962K80545J28301J61753L3348r8992o2941r4972l00380p3277
9988C8724K64175M8811Q4244o8510l3158P2952P0410l9700k62389M6329o565k28772
9976a3449j9185J16267N3596p4989J73103J60683k19033j48649J07390R128O458
9965A51320N5971p1838K04426J83644j38965l0054k27697j14658J86994L33068
$$ y = [4894991, 3957005, 3524090, 3211657, 2724830, 2286642, 2378718, 2243558, 2130008, 1749429, 1576191, 1484594, 1363060, 1328458, 1281125, 1198555, 922952, 871340, 1040027, 994023, 820722, 726279, 645260, 861096, 868258, 537154, 616535, 787780, 690011, 609944, 378333, 415970, 407533, 155982, 101862, 73047, 104906, 119602, 203584, 509290, 691050, 549123, 227258, 202301, 65339, 345884, 474185, 635938, 669286, 570294, 507353, 412381, 112001, 38724, 302899, 351710, 435954, 367444, 334286, 407238, 477648, 437948, 175559, 221888, 215323, -13449, -32634, 83633, 137229, 62240, 235343, 396026, 176993, 28344, 135734, 144862, 151320, 207291, 135453, 339879, 523523, 384558, 354504, 126807, 12149, 199143, 532211]
9955E32211k64932K9060o5974J13855j01246r4612k9713k35966P5321J47414J17967
9944B23385l4515M9418J19094k5083j74589J20871l2522J2110n3876K3889K6263
9933B54445N2462J07093K7677j21082j88234L8177n8487K15717k9019k30953Q0497
9922A48293R9236k8925m5526J3798N7425k07583p3243k27365J99610L44086N7028
9911C36834q6481j15609j02142k5483k02529l3765Q7871J51601J22673K2037k60458
9900a05451o7304j22923J52172L47155L402Q0455R4414o4322J4841R8074K7180
9889D57693J2173q4862j91196j86916p3033J76229K10763J8524k8828r3395j09346
9878A07806l41981K9600J2462P4286J58202J16599j1745j9183J11966j30887j81252
$$ y = [532211, 267279, 296339, 230365, 344220, 242974, 148362, 118649, -117317, -41996, 105418, 223385, 188870, 238288, 357382, 332299, 157710, 278581, 246059, 258169, 204293, 228182, 254445, 306907, 414000, 441677, 320595, 132361, 170538, 112051, 327768, 298749, 67796, 148293, 247529, 218604, 173078, 186876, 244301, 36718, -36525, -263890, -64280, 279806, 336834, 250353, 134744, 32602, 7119, -195410, -229175, -141304, 10297, 132970, 155007, -105451, -172755, -295678, -143506, 203649, 207051, 287506, 381920, 317598, 332439, 430513, 457693, 469866, 385004, 193808, 6892, -66141, 110088, 320851, 339375, 310547, 217152, 107806, -234175, -204575, -192113, -117827, 40375, 156974, 145229, 126046, 238012, 107125, -74127]
9867g4127Q2248J22524o8661k07761l68152l41181J09282J97450J12885K20164
9857b15329J13813J72347K9844j08902j1335J12246K1890R4706m9140j30050j78876
9846a48786J32451K50559J26228q9598K74128K00049j12293l55561J08579P4901
9836D60657k2061j04579j3370J34530q5159k62493J60545r0930j31978j56737
9826a11575J48168J77463N8634M0053J49163Q8830j04648l17214k19555j23898
9816b14579J02917M2104J34685J45149J12013J51270N6633j6168k04768j46495
9806A62761j9368L31352R9863J05500k07573l74824O7685J02454M1664m4456j01313
9795A63745k14038J60358J49637o3983p6878j40008o1398J88134p8387l6783J0004
$$ y = [-74127, 8121, 130645, 61984, -145777, -513929, -855110, -745828, -548378, -435493, -215329, -101516, 70831, 100675, -8227, -19562, 92684, 114574, 209280, 160140, 30090, -148786, -16335, 234224, 360452, 270854, 544982, 745031, 632738, 277177, 385756, 460657, 438596, 334017, 320647, 455177, 370018, 107525, 268070, 177140, 45162, -111575, 36593, 214056, 272690, 312743, 461906, 550736, 446088, 128874, -90681, -214579, -111662, -69558, 65127, 210276, 322289, 473559, 530192, 514024, 309256, 162761, 143393, 474745, 574608, 680108, 472535, 97711, 165396, 267850, 309514, 265058, 163745, -50293, 110065, 259702, 195719, 118841, -21167, -82565, 105569, 27182, -9601, 403]
9784D03L5935P1802j06563j04626K7051o5247J24399J5024k03754k1065J01861
9773a24780r2271Q0152K77022N8513m54018N0244J57143j20920K37817O4565r159
9762A24308O496l2884j26989n1246p5238J15972K92469N2727j83516m4496o7881
9751I722j75534q5764P1919L95298K15725L7039m003k89227j32273l6103j60516
9740a53717j80665J1822o6385R0996j47137R1909P8468J71165K90224p0414j61542
9729d5276j78148J58953O7647k45013N4407L7005j54981J30099M9335M6645n8630
9718a37957q9329K1089O4187m9814j24391n7699m6270Q7785j85057l7639K771
9707e52324r087J07300R0532j28990n9669K79904M51541j14236j11384m7331M7745
$$ y = [403, 36338, 108140, 1577, -103049, -75998, -141245, -16846, -1822, -205576, -226641, -124780, -217051, -136899, 140123, 198636, -255382, -205138, -47995, -168915, 68902, 133467, 124308, 130804, 97920, -29069, -80315, -155553, -39581, 252888, 305615, 122099, 77603, 9722, -165812, -251576, -179657, 215641, 431366, 468405, 464402, 175175, 42902, 6799, -153717, -334382, -322560, -388945, -297949, -445086, -353177, -274709, -103544, 186680, 116266, -45276, -223424, -64471, 3176, -241837, -187430, -150425, -305406, -175307, -125972, -79327, -137957, -227286, -206197, -142010, -191824, -316215, -373914, -420184, -332399, -517456, -555095, -552324, -561411, -454111, -363579, -492569, -552238, -272334, 179207, 64971, -46413, -93744, -45999]
9696d5999n1102p1452O2840N8313j5162L09702L67415j68706l48447k7332J32821
9685B02891p5570M0984J97533J12324J68624K7010k27330j15088j09423k75831
9675e3876j27029O1834K12521L5608j34273J24698k63794k26086L09281J63627
9665A02511O4578j12490j1964L010K23067Q6974j2172j99053J8943j05178k17451
9654a59225r573l31457N5233J58512R5687Q7171J01409R8624N1079l03663j10264
9643b66467J31980k9713n7698O6492O6640n496J37868K1189J30699j8076k28679
9632e1261j05403j50539K96209J98543P2097j63875k51620k03444J42695J78655
9622c7943l7619j2020k2058q997k75531J19029J14748J71310J5033j38341K48282
$$ y = [-45999, -97101, -168553, -105713, -47400, -62562, 247140, 614555, 445849, 97402, 70070, 202891, 127321, 168305, 365838, 478162, 646786, 673796, 446466, 331378, 221955, -53876, -180905, -119071, 93450, 129058, -5215, 119483, -144311, -370397, -61116, 102511, 167089, 54599, 42635, 45645, 268712, 355686, 343514, 144461, 163404, 58226, -159225, -168798, -500255, -445022, -286510, -190823, -103652, -2243, 96381, 147460, -156203, -266467, -134487, -164200, -221898, -155406, -88766, -94262, 43606, 64795, 195494, 177418, -51261, -156664, -307203, -10994, 187549, 259646, 95771, -155849, -359293, -216598, -37943, -75562, -87582, -109640, -118637, -394168, -275139, -160391, 10919, 25952, -112389, 135893]
9611A35893K55930L3629j07097j59067Q5998O3680K25211N1672K218l0908k06226
9600C50933J02147j8865j62147r6407P6442p4756R2709K56435R5277J12771m3535
9589F91004o959j37308p981J78029K6203k29617M5963j02153M10246K30661p1684
9578A026404j54378P7624q7519l80467k7128L73528J6035M111L27028J64058m7743
9567A291553j17291k00793K37443L73274j91376k9370K03938L43967m0489J41187
9557B012043Q7857M3413L3529k95569K07995j3486k48312J1683o2465j58676J22103
9546A740115m1797l5795R0769j31944k19339n1856k15768l9280J6446Q2680L03176
9535A497407n1977j059j25027M0209J67531J32144o6680j12244n0055k45546k32931
$$ y = [135893, 391823, 425452, 318355, 159288, 245286, 308966, 534177, 585849, 588067, 557159, 350933, 453080, 434215, 272068, 175661, 252103, 177347, 270056, 526491, 621768, 734539, 691004, 684045, 546737, 538756, 716785, 742988, 513371, 559334, 457181, 867427, 1098088, 1026404, 872026, 949650, 862131, 481664, 454536, 828064, 844099, 848210, 1175238, 1339296, 1291553, 1174262, 973469, 1210912, 1584186, 1392810, 1363440, 1567378, 1911345, 1870856, 2012043, 2099900, 2143313, 2176842, 1881273, 2089268, 2075782, 1827470, 1839153, 1776688, 1618012, 1740115, 1698318, 1662523, 1753292, 1621348, 1402009, 1350153, 1134385, 1095105, 1111551, 1194231, 1497407, 1445430, 1444371, 1319344, 1359553, 1527084, 1659228, 1592548, 1480304, 1430249, 1184703, 951772]
9524I51772J5857K62892J29143K11351p5186l88606j24801j04256q7970j47426
9514F42770j78297j59449P7032L20582L09255L092j5941j97251k51353P2560p5925
9503E47075j64009j73709J48122K31201O4398j71032k73154q1431k4552k4903
9493G8006p9031j72940K43692J53312l51028m58336J82892L44722K93168L95517
9483F29974J05113n44434q7159j60875j37228q0929N2713K9613J46554N3692J53976
9472A61010P291L2214j89701j41062p2375n15997J46623M27077J01972k79201
9462c22149J40788o7742m1534j1754J77401K49882q8315R8394j3980m2945k17967
9451a39921j37618o7651m9013J99229J57562j46959j85686Q7364K37588j34922
$$ y = [951772, 967629, 1230521, 1359664, 1571015, 1495829, 1107223, 982422, 878166, 790196, 642770, 464473, 305024, 382056, 702638, 1011893, 1014985, 999044, 801793, 550440, 623000, 547075, 383066, 209357, 357479, 588680, 653078, 482046, 208892, 127461, 102909, 78006, -1025, -173965, 69727, 223039, -127989, -586325, -403433, -58711, 234457, 629974, 735087, 190653, 103494, -57381, -194609, -275538, -222825, -193212, -46658, 7034, 161010, 168301, 200515, 10814, -130248, -202623, -718620, -571997, -144920, -42948, -322149, -181361, -249103, -290637, -302391, -124990, 124892, 36577, 134971, 120991, 78046, -139921, -277539, -345190, -394203, -194974, -37412, -184371, -370057, -282693, -45105, -180027]
9441a80027k75634p6826J46557J26446P477J17190J15741Q2486m6939k5519J99599
9430A90551l5087j59385k1320j35411j44640j3272L24905N8929k5033K44261j4053
9419B70445j1310o1205J0453p5223J34520J32661l0003j13323m22675o2213n3708
9408b81581p1083K30933q7447k04031l4293J74546N6408M1373Q2559P2229p85
9397b1172k89636j21870J17384K41072R3252J11514K3458K41746m4628j15888
9387B35232j84251j10314k6752j17196J9906j44002J25461L38501K28285P0304
9377D35174j6910k14913M3656N7234k52186k11456q0640J18294J70931Q4928o0274
9366G3838J56097J92821k55221j75368j32623J30692L1712J18434q088j53285
$$ y = [-180027, -455661, -532487, -385930, -259484, -252007, -134817, -19076, 63410, 16471, -9048, 190551, 155464, -3921, -25241, -160652, -305292, -318564, 6341, 65270, 40237, 284498, 270445, 259135, 197930, 208383, 133160, 267680, 400341, 370338, 257015, -165660, -227873, -281581, -352664, -121731, -209178, -413209, -447502, -272956, -216548, -175175, -92616, -20387, -21172, -310808, -432678, -315294, -74222, 19030, 130544, 154002, 395748, 351120, 235232, 50981, -59333, -86085, -203281, -183375, -327377, -201916, 136585, 364870, 435174, 418264, 203351, 247007, 304241, 52055, -159401, -240041, -121747, 49184, 134112, 73838, 229935, 422756, 167535, -7833, -140456, -9764, 21948, 140382, 132294, -20991]
9356b0991k52315l8597J19842J41668J60583J42402j47436q2458Q3176j45629
9346c9755j27323j55084M0069J15452k8038M1347K6617J69555K48418K91091q9246
9335D93103n05448j69736R4815j64441j67259K91879O5083O3139O8796J97284
9325B67215P5615l2545j15862q3247k03749j39747m6552J44361P4092Q7227j50010
9314a23202P3809j54401j42728k8490J12838J17313R1256o851k6733N2517P5851
9303D1179L4987j92691o4530J03928k67597o11K61544K03747l3093j96134O6597
9292d2674L19587L49590J44033k71091k89545j41109n1659K0838K84253j67614
9282A54609k75048k7798K18538K71227R6654k30897l50337J53368K63097P5508
$$ y = [-20991, -273306, -311903, -192061, -50393, 110190, 252592, 105156, 22698, 105874, -39755, -167078, -322162, -282093, -166641, -194679, -153332, -126715, 42840, 291258, 582349, 493103, -12345, -182081, -87266, -251707, -418966, -127087, -62004, 1135, 69931, 267215, 342830, 310285, 194423, 111176, -92573, -232320, -278872, -134511, -60419, 26808, -123202, -49393, -203794, -346522, -375012, -262174, -144861, -53605, -60456, -87189, -34672, 41179, 76166, -116525, -181055, -77127, -344724, -345335, -83791, 119956, 86863, -109271, -42674, 276913, 626503, 770536, 499445, 209900, 68791, 17132, 37970, 322223, 154609, -120439, -148237, 70301, 341528, 438182, 207285, -143052, 10316, 273413, 348921]
9272C48921k98873q3568l2443K098l55600o234K33814J96527P6731J19618m94
9261B00497l24520M2834J77876N7891J12085O0008k78139k45426j48351J40749
9251b04496L13275Q3861j52961O5556J60199j95234j82759N2761N9754p0896j17699
9240a88639J08045J40573J60555n6538O6749K7993p5278M155K58538L0567k37061
9229B39659m96146j42752K35191K36605N3332k62822j75713R5458j66533J83775
9219a99946R3630L4073m7810J50421L44472N3479j78218J3311J80133K28448j60075
9208E11918j93178k1625N064m5348r6105q907o2736J84964J61022l9892Q8024
9197D83201o0654R2316J00975m5445j56589j94097O8016Q3713J8243J72283K47226
$$ y = [348921, 50048, -33520, -65963, -63865, -419465, -425699, -191885, 4642, 81373, 200991, 200497, -124023, -81189, 96687, 154578, 266663, 326671, 48532, -196894, -345245, -204496, 108779, 192640, 39679, 105235, 265434, 70200, -112559, -59798, -44, -70940, -188639, -80594, 59979, 220534, 163996, 230745, 258738, 183460, 187615, 446153, 476720, 239659, -256487, -399239, -164048, 72557, 125889, -136933, -312646, -217188, -383721, -199946, -106316, -72243, -120053, 30368, 374840, 428319, 250101, 263412, 443545, 671993, 511918, 318740, 297115, 302179, 256831, 160726, 151819, 89083, 274047, 435069, 395177, 483201, 422547, 514863, 615838, 570393, 413804, 219707, 287723, 371436, 389679, 561962, 809188]
9186H09188j60911j92116j44710j5202O3420J41637O1286k23208j51406Q0044
9176B68022r4719k6194Q4673R2449J18860K28055M0128J9075K16242K05737L50431
9165A502759K6195j24716o7734J31697M2393k43368L69301J29582L97446O65064
9155B828619J62485J08762R2973M58874M55275O12320P34668Q84914O76196O62252
9145G677338R02071J501378K073417K610485L336672M350486O388363R284941
9137C8125151J3979842K1159825L1391537M0352196L6418829J7477122n315993
9130A93588509k2150727k6720407k2919645j7606125j4064518j1606617j0008537
9123F8511933q326730p199648o099716n121462m311105l557653k832539k760296
$$ y = [809188, 648277, 456161, 311451, 296249, 359669, 501306, 562592, 339384, 187978, 268022, 173303, 147109, 231782, 324231, 443091, 671146, 711274, 730349, 946591, 1152328, 1502759, 1528954, 1404238, 1336504, 1468201, 1510594, 1267226, 1636527, 1766109, 2163555, 2828619, 2991104, 3099866, 3192839, 3651713, 4106988, 4719308, 5453976, 6338890, 7015086, 7677338, 8579409, 10080787, 12154204, 14764689, 18101361, 22451847, 28840210, 38125151, 52104993, 73264818, 104656355, 145008551, 181427380, 198904502, 193588509, 171437782, 144717375, 121797730, 104191605, 90127087, 78520470, 68511933, 60185203, 52985555, 46885839, 41764377, 37453272, 33895619, 31063080, 28302784]
9115B8302784k306956k254647j819211j359409j199444j117803j094896r76197
9107A6174221r43050q53073p46912n77914n48041j98548n87727p62261m60820
9098A0495875n28483o03678l42242n5817k92012l02508L3285k66887m38370l16774
9088G382389k51649k23069j23508r2649j69416p0929j46152k72767k03503r4454
9078E734293r8609j7730l9895p4792m07339p0746R41j85437l13524k76715q8737
9067D161710k48222M6151j29542J70k4223l63082r5113O4951K4493j35090j28749
9056C173454j32546j05225J33120m8170j55633l0698J2387k50055j46322n3806
9046B396506p9401O8987J113j71815l07698k82989J13289J64387n9440n8578r5975
$$ y = [28302784, 25995828, 23741181, 21921970, 20562561, 19363117, 18245314, 17150418, 16174221, 15231171, 14378098, 13631186, 13053272, 12505231, 12306683, 11718956, 10956695, 10495875, 9967392, 9363714, 9021472, 8965655, 8673643, 8371135, 8404420, 8137533, 7699163, 7382389, 7130740, 6907671, 6784163, 6691514, 6522098, 6451169, 6305017, 6032250, 5828747, 5734293, 5635684, 5617954, 5578059, 5503267, 5095928, 5025182, 5026123, 4840686, 4527162, 4250447, 4161710, 3913488, 3959639, 3830097, 3830267, 3806044, 3442962, 3347849, 3412800, 3437293, 3302203, 3173454, 3040908, 2935683, 3068803, 3020633, 2865000, 2834302, 2846689, 2596634, 2450312, 2396506, 2317105, 2386092, 2387205, 2215390, 1907692, 1624703, 1737992, 1902379, 1842939, 1784361, 1688386]
9035A688386j35860J08533J60631J280j83395j80277j95253k79402M6891j02027
9025I29507J06637J24801M0444j20281L9670O5721J41548J43329K6857m0498m159
9014A453576O6473k13124l2318q6948j0480K45693j89400k63110J27648q8680
9004A009330m8447q4672J02824K4151n690r6093J40005K6719p160j12519r0084
8993H58364j29577J0248O4704k04754j81296M5139j3227r2453K20336m800o6270
8982E06414k10532Q6802p6414r4586j11982M7197J64707J37012k05151j59049
8972H4418o7031L5381J19630L3103J18407k9525o3011Q6228M6489r3313j05667
8961A65109N2926K88796k47793j98611J35762q1512j5239L10179k9324p4887L5677
$$ y = [1688386, 1552526, 1661059, 1821690, 1822970, 1639575, 1459298, 1264045, 984643, 1031534, 929507, 1036144, 1160945, 1201389, 1081108, 1120778, 1186499, 1328047, 1471376, 1498233, 1457735, 1453576, 1520049, 1306925, 1274607, 1187659, 1177179, 1422872, 1233472, 970362, 1098010, 1009330, 960883, 876211, 979035, 1003186, 997496, 901403, 1041408, 1068127, 1060967, 948448, 858364, 728787, 739035, 803739, 598985, 417689, 462828, 449601, 357148, 577484, 572684, 506414, 295882, 382684, 306270, 211684, 99702, 146899, 311606, 448618, 243467, 84418, 17387, 52768, 172398, 205501, 323908, 294383, 231372, 317600, 364089, 270776, 165109, 218035, 506831, 259038, 60427, 196189, 114677, 99438, 409617, 380293, 305406, 341083]
8950C41083R2723K77176k0671l05989m4080j24984j08271K36584j37879p5332
8940A30360l0986l6542M7104N9664j26165Q9097M4589M3386J96731o9969o8841
8929B78428q0720j024K54172J93870p1760j49116r4240o3905q7435n7085j61769
8918d0584o8310J15831J16099L98209Q2294k51206j11888J4257j09970k4883j24399
8907d550L6216L2536l5028M5218r6761r254k2028q8832p9710r486m9203K7937
8895b52945j17300J29637K60581L48674q1940k3560L7330j60246l0543j10047
8885c59j63667j37525p5989J93111K27203Q8707l7166l1118K15392J30252K21981
8874F30822L1049k23729J34219j52830k93586J1450J24700k1332N8523J16624
$$ y = [341083, 433806, 710982, 690311, 384322, 340242, 215258, 106987, 343571, 205692, 130360, 99374, 62832, 109936, 169600, 43435, 132532, 177121, 220507, 417238, 347269, 278428, 197708, 196684, 450856, 644726, 572966, 423850, 329610, 265705, 178270, 121185, -40584, -108894, 6937, 123036, 521245, 603539, 352333, 240445, 254702, 144732, 119849, -4550, 31666, 64202, 29174, 74392, -22369, -31623, -53651, -142483, -222193, -231679, -280882, -252945, -370245, -240608, 19973, 368647, 286707, 263147, 300477, 140231, 109688, -359, -164026, -301551, -377540, -184429, 42774, 131481, 94315, 63197, 278589, 408841, 630822, 661871, 438142, 572361, 419531, 125945, 137395, 262095, 240763, 299286, 415910]
8864D15910p4578L383m1400j6780k03799j18894K21501J82582j32922p9309r2207
8853F3487M8280M9272k31915J26577J31090j84568j36111J9794J19149r4079l2849
8842a21873N6028Q6909q0546j01993P7109o232k9916J91670L1464J71727p5482
$$ y = [415910, 341332, 344715, 303315, 286535, 82736, -36158, 185343, 367925, 235003, 155694, 63487, 111767, 161039, -70876, 55701, 186791, 2223, -133888, -114094, 5055, -89024, -121873, -65845, 21064, -59482, -161475, -84366, -90598, -120514, 71156, 102620, 274347, 198865]
$$ [...]
##END NTUPLES=NMR SPECTRUM
##END=
