##TITLE=Analysis number 320446
Compound Code mo 07899
Book Reference 477/188/3
Project Code adrs
Chemist Name avrilr
##JCAMPDX= 6.0         $$ Bruker NMR JCAMP-DX V2.0
##DATA TYPE= NMR SPECTRUM
##DATA CLASS= NTUPLES
##ORIGIN= Bruker BioSpin GmbH
##OWNER= nmr
$$ XWIN-NMR		Version 3.5
$$ Mon Jun 26 11:26:20 2006 GMT Daylight Time (UT+1h)  MAYBRIDGE\nmr@NMR_250MHZ
##.OBSERVE FREQUENCY= 250.131544655141
##.OBSERVE NUCLEUS= ^1H
##.ACQUISITION MODE= SIMULTANEOUS (DQD)
##.ACQUISITION SCHEME= undefined
##.AVERAGES= 16
##.DIGITISER RES= 18
##SPECTROMETER/DATA SYSTEM= dpx250
##.PULSE SEQUENCE= zg30
##.SOLVENT NAME= CDCl3
##.SHIFT REFERENCE= (INTERNAL, CDCl3, 0, 16.522)
##AUDIT TRAIL= $$ (NUMBER, WHEN, WHO, WHERE, WHAT)
$$ ##TITLE= Audit trail, XWIN-NMR		Version 3.5
$$ ##JCAMPDX= 5.01
$$ ##ORIGIN= Bruker BioSpin GmbH
$$ ##OWNER= nmr
$$ C:\u/data/dgb/nmr/ADRS/1460/pdata/1/auditp.txt
$$ ##AUDIT TRAIL=  $$ (NUMBER, WHEN, WHO, WHERE, WHAT)
(   1,<2006-06-26 11:25:59.28 +100>,<MAYBRIDGE\nmr>,<NMR_250MHZ>,
      <created by zg, POWCHK disabled, PULCHK disabled
       configuration hash MD5:
       E2 DF 36 D8 04 B2 41 60 5A D7 A3 38 5A 4B D0 FE
       data hash MD5: 64K
       7E 08 7B F5 7F 7F E5 F6 10 5E B4 D0 8A 51 EB 41>)
(   2,<2006-06-26 11:26:11.76 +100>,<MAYBRIDGE\nmr>,<NMR_250MHZ>,
      <Start of raw data processing
       ef LB = 0.3 FT_mod = 6 PKNL = 1 SI = 32K 
       data hash MD5: 32K
       B4 14 1E 5B 7C 9E 93 37 A7 9D 1D BB D0 85 59 CE>)
(   3,<2006-06-26 11:26:13.37 +100>,<MAYBRIDGE\nmr>,<NMR_250MHZ>,
      <apk 
       data hash MD5: 32K
       06 4F 92 80 A1 3E 2F 55 C3 87 19 74 9C A7 3B E0>)
(   4,<2006-06-26 11:26:14.12 +100>,<MAYBRIDGE\nmr>,<NMR_250MHZ>,
      <abs ABSG = 5 
       data hash MD5: 32K
       FA 2E DC 43 E7 17 A9 AE EB AB 07 21 01 96 92 D0>)
$$ ##END=
$$ 
$$ hash MD5
$$ E1 D4 A1 A7 8E E8 93 3C A1 DD 51 F8 52 7D 4D 14
##$RELAX= 
##$RELAX= 
##$RELAX= 
##$RELAX= 
##$RELAX= 
##$RELAX= 
##$RELAX= 
$$ Bruker specific parameters
$$ --------------------------
##$DU= <C:\u>
##$EXPNO= 1460
##$NAME= <ADRS>
##$PROCNO= 1
##$TYPE= <nmr>
##$USER= <dgb>
##$AMP= (0..31)
100 100 100 100 100 100 100 100 100 100 100 100 100 100 100 100 100 100 
100 100 100 100 100 100 100 100 100 100 100 100 100 100 
##$AQSEQ= 0
##$AQ_mod= 3
##$AUNM= <au_zg>
##$AUTOPOS= <20 >
##$BF1= 250.13
##$BF2= 250.13
##$BF3= 250.13
##$BF4= 250.13
##$BF5= 500.13
##$BF6= 500.13
##$BF7= 500.13
##$BF8= 500.13
##$BYTORDA= 1
##$CFDGTYP= 0
##$CFRGTYP= 5
##$CHEMSTR= <none>
##$CNST= (0..31)
1 1 145 1 1 1 1 1 1 1 1 1 1 1 1 1 1 1 1 1 1 1 1 1 1 1 1 1 1 1 1 1 
##$CPDPRG= <>
##$CPDPRG1= <>
##$CPDPRG2= <>
##$CPDPRG3= <>
##$CPDPRG4= <mlev>
##$CPDPRG5= <mlev>
##$CPDPRG6= <mlev>
##$CPDPRG7= <mlev>
##$CPDPRG8= <mlev>
##$CPDPRGB= <>
##$CPDPRGT= <>
##$D= (0..31)
0 1 0 0 0 0 0 0 0 0.06 0 0 0 0 0 0 0.0002 0 0 0 0 0 0 0 0 0 0 0 0 0 0 
0 
##$DATE= 1151317558
##$DBL= (0..7)
120 120 120 120 120 120 120 120 
##$DBP= (0..7)
150 150 150 150 150 150 150 150 
##$DBP07= 0
##$DBPNAM0= <>
##$DBPNAM1= <>
$$ [...]
##$SUBNAM7= <"">
##$SUBNAM8= <"">
##$SUBNAM9= <"">
##$SW= 20.6930455092707
##$SWIBOX= (0..15)
0 0 3 0 0 0 0 0 0 0 0 0 0 0 0 0 
##$SW_h= 5175.983436853
##$TD= 65536
##$TD0= 1
##$TE= 296.16
##$TE2= 300
##$TE3= 300
##$TEG= 300
##$TL= (0..7)
0 120 120 120 120 120 120 120 
##$TP= (0..7)
150 150 150 150 150 150 150 150 
##$TP07= 0
##$TPNAME0= <>
##$TPNAME1= <>
##$TPNAME2= <>
##$TPNAME3= <>
##$TPNAME4= <>
##$TPNAME5= <>
##$TPNAME6= <>
##$TPNAME7= <>
##$TPOAL= (0..7)
0.5 0.5 0.5 0.5 0.5 0.5 0.5 0.5 
##$TPOFFS= (0..7)
0 0 0 0 0 0 0 0 
##$TUNHIN= 0
##$TUNHOUT= 0
##$TUNXOUT= 0
##$USERA1= <user>
##$USERA2= <user>
##$USERA3= <user>
##$USERA4= <user>
##$USERA5= <user>
##$V9= 5
##$VALIST= <valist>
##$VCLIST= <CCCCCCCCCCCCCCC>
##$VD= 0
##$VDLIST= <DDDDDDDDDDDDDDD>
##$VPLIST= <PPPPPPPPPPPPPPP>
##$VTLIST= <TTTTTTTTTTTTTTT>
##$WBST= 1024
##$WBSW= 4
##$XGAIN= (0..3)
0 0 0 0 
##$XL= 0
##$YL= 0
##$YMAX_a= 585560
##$YMIN_a= -570071
##$ZGOPTNS= <>
##$ZL1= 120
##$ZL2= 120
##$ZL3= 120
##$ZL4= 120
##$ABSF1= 16.522
##$ABSF2= -4.171173
##$ABSG= 5
##$ABSL= 3
##$ALPHA= 0
##$AQORDER= 0
##$ASSFAC= 0
##$ASSFACI= 0
##$ASSFACX= 0
##$ASSWID= 0
##$AUNMP= <proc_1d>
##$AZFE= 0.1
##$AZFW= 0.1
##$BCFW= 0
##$BC_mod= 0
##$BYTORDP= 0
##$COROFFS= 0
##$CY= 12.5
##$DATMOD= 1
##$DC= 0
##$DFILT= <>
##$DTYPP= 0
##$F1P= 14.0000005364418
##$F2P= -0.99999901652339
##$FCOR= 0.5
##$FTSIZE= 32768
##$FT_mod= 6
##$GAMMA= 0
##$GB= 0
##$INTBC= 1
##$INTSCL= 1
##$ISEN= 128
##$LB= 0.3
##$LEV0= 0
##$LPBIN= 0
##$MAXI= 10000
##$MC2= 0
##$MEAN= 0
##$ME_mod= 0
##$MI= 0
##$NCOEF= 0
##$NC_proc= -3
##$NLEV= 6
##$NOISF1= 0
##$NOISF2= 0
##$NSP= 0
##$NTH_PI= 0
##$NZP= 0
##$OFFSET= 16.522
##$PC= 1
##$PHC0= 171.4463
##$PHC1= 5.872712
##$PH_mod= 1
##$PKNL= yes
##$PPARMOD= 0
##$PSCAL= 4
##$PSIGN= 0
##$REVERSE= no
##$SF= 250.13
##$SI= 32768
##$SIGF1= 0
##$SIGF2= 0
##$SINO= 400
##$SIOLD= 32768
##$SREGLST= <1H.CDCl3>
##$SSB= 0
##$STSI= 32768
##$STSR= 0
##$SW_p= 5175.98343685301
##$SYMM= 0
##$S_DEV= 0
##$TDeff= 65536
##$TDoff= 0
##$TI= <Analysis number 999999
Compound Code 99
Book Reference 9
Project Code 9>
##$TILT= no
##$TM1= 0
##$TM2= 0
##$TOPLEV= 0
##$USERP1= <user>
##$USERP2= <user>
##$USERP3= <user>
##$USERP4= <user>
##$USERP5= <user>
##$WDW= 1
##$XDIM= 32768
##$YMAX_p= 473307116
##$YMIN_p= -80623
$$ End of Bruker specific parameters
$$ ---------------------------------
##NTUPLES= NMR SPECTRUM
##VAR_NAME=  FREQUENCY,     SPECTRUM/REAL,   SPECTRUM/IMAG
##SYMBOL=    X,             R,               I
##VAR_TYPE=  INDEPENDENT,   DEPENDENT,       DEPENDENT
##VAR_FORM=  AFFN,          ASDF,            ASDF
##VAR_DIM=   32768,         32768,           32768
##UNITS=     HZ,            ARBITRARY UNITS, ARBITRARY UNITS
##FACTOR=    0.157963299565203, 1,           1
##FIRST=     4132.6476996994, 0,             0
##LAST=      -1043.33573715361, 0,           0
##MIN=       -1043.33573715361, -80623,      0
##MAX=       4132.6476996994, 473307116,     0
$$ Real data points
##PAGE= N=1
##DATA TABLE= (X++(R..R)), XYDATA
$$ [...]
18827 -1594 10835 22978 16264 -2597 -2733 -13896 -15051 -10217 6140 13908 -4152 -9819 -27369
18814 -27369 -20749 3371 8134 -4920 -5850 12330 26857 17882 21805 23512 27140 40202 26931
18801 26931 21820 11368 11993 20713 25538 27134 23096 8666 9585 9009 13743 7183 -4468 2841
18787 2841 17786 8312 450 -6454 -9067 -14983 -14591 -17954 1466 10144 12601 8252 733 9033
18773 9033 28773 41567 54014 86282 102318 112033 131657 147564 120452 67995 49396 33029
18761 33029 14549 11677 20495 41346 30527 20641 36388 30895 36076 33059 34501 36711 34270
18748 34270 33371 13699 5691 27210 38361 13902 -10429 2448 10819 9039 17459 41048 48006
18735 48006 15778 7089 18237 1375 -3186 11029 29299 20340 11917 11001 -413 -7824 -23738
18722 -23738 -32967 -24061 -6710 3882 -3986 -18028 -15575 -570 13423 41463 24526 18232 15795
18709 15795 -1154 -34 14366 4628 12643 21289 9983 15781 12960 -8533 -14906 -12144 -6223
18696 -6223 -8764 5870 427 -3289 -6240 718 -15236 -3519 8244 23360 14542 22410 13878
18683 13878 16435 1395 -3124 -6296 15686 36607 50320 45140 15248 17318 15462 27160 34263
18670 34263 22304 20333 9657 15489 26629 28942 -1172 -12506 -13894 -23759 -27824 -29387 -22586
18657 -22586 -7998 -17538 -10542 -5193 -3488 -14317 -30418 -26121 -1899 11244 1218 -14012 3605
18644 3605 29780 3711 -50 -11797 -21774 -8954 -7562 -16149 -22528 -9123 4550 9825 13815
18631 13815 -12250 -17883 -11456 -7295 18753 18513 -8488 -777 9797 3744 165 -7481 -3866 2580
18617 2580 16814 18849 9375 13529 17020 -4033 -10000 -10555 -3822 -209 9804 14014 5875 -13910
18603 -13910 -36031 -31419 -32995 -47152 -30381 -5006 8185 5256 12749 2984 -37870 -31601 -11530
18590 -11530 2191 1333 11367 -6381 -21509 -16835 -28112 -27069 -28598 -15903 -6122 11464 15251
18577 15251 13995 12818 12122 15143 18675 28574 29444 34710 27988 27915 47786 57632 51791 61165 46613
18562 46613 30501 13603 3452 -10219 -1854 12954 6694 12863 31790 21760 8895 11479
18550 11479 24028 34324 46012 40975 21259 23213 24693 25630 23086 36854 22976 6491 21550
18537 21550 21035 38164 46907 43165 49624 51031 35230 5404 -9078 -7601 -6041 9516 12705
18524 12705 -10570 -18872 -15322 -3551 8573 25431 23808 21744 21981 14595 11409 10011 21547
18511 21547 20321 27756 39846 41462 36678 22920 28097 45002 46320 45543 36206 27156 4891 -1532
18497 -1532 -8848 3568 21123 4326 -1680 -1756 -10814 -17715 -18650 -23187 3361 29198 36075 36109 30293
18482 30293 13069 22950 30153 27548 17986 11322 5505 11643 3838 10832 19614 17165 18620 30907
18468 30907 31657 27519 35835 28915 19100 -3153 -5743 13498 23944 42253 25868 11883 6091
18455 6091 8523 20138 34247 32938 16513 11313 -1884 11993 18785 -1986 -16469 -18383 -18423
18442 -18423 8251 6058 -5991 -22255 -6079 25271 28846 17095 11697 25992 30518 25792 13332
18429 13332 10582 7398 14770 -2312 -502 -2110 -1102 2984 6037 22818 38508 44984 35309 22164
18415 22164 19278 11247 16348 18725 17402 5740 3651 -4129 -9879 -4489 -977 15464 30933 22837
18401 22837 23425 19465 12632 10421 20102 24439 31041 43834 17691 14276 17565 9551 14106 28840
18387 28840 23054 25703 41726 39015 40169 48297 70105 76620 71863 78936 78544 73986 90063 108314
18373 108314 101724 80427 83820 84272 78253 80204 86934 79892 98618 103887 104936 111843 88646 81036
18359 81036 89910 87059 88659 91046 86806 81959 84234 98760 99817 80165 60200 73795 87486
18346 87486 97016 90146 83102 76312 65541 71604 65210 59761 64591 65917 72729 80306 81536 63778
18332 63778 68484 72889 62812 93359 104785 119671 126707 147813 178044 178100 203236 191499 155916
18319 155916 133619 135877 162265 146182 117140 114390 132383 137611 130641 124220 102063 105811 150062
18306 150062 170797 193684 226753 232044 261678 313304 354153 390570 384818 340358 293733 274596
18294 274596 271801 227120 190087 181474 186333 206302 216560 228915 223519 223177 235507 226368 205755
18281 205755 188066 172505 156218 159339 187782 213470 213836 218427 240647 246274 219643 202470
18269 202470 205598 184719 142970 96682 62355 55381 58330 88683 101309 103711 110735 108802 89013
18256 89013 98702 100749 80442 85016 104344 145272 157850 167119 208407 261837 303984 314782
18244 314782 292658 246059 201838 169314 148568 137199 129062 114553 116688 99627 91376 90944
18232 90944 86669 77199 69827 67309 69759 79209 82977 77627 82869 96583 92709 68864 50835 62119
18218 62119 71429 59867 66625 75274 42918 43627 73112 87363 92224 76840 75805 65565 61747
18205 61747 79813 77886 79099 62222 50802 57753 59629 62803 66026 60391 52991 48840 44751 49213
18191 49213 88568 88347 64972 59840 74517 72460 73188 75119 76490 83952 73099 53925 39630
18178 39630 41676 34808 35283 44037 69052 100012 104433 102504 100008 78886 51234 36019 43007
18165 43007 56439 63983 64838 33924 31981 62999 72063 56112 52510 61487 68607 92213 96718
18152 96718 98457 96162 66308 60141 69906 79103 61827 48952 51517 73140 84744 89972 93825
18139 93825 109105 123943 138503 150790 176362 199129 205850 206802 201307 223350 245119 260914
18127 260914 270557 296612 342246 382666 434182 496404 579751 703116 871893 1088125 1405148
18116 1405148 1871406 2590301 3823184 6130697 9989666 14649705 18313316 21398328
18108 21398328 24458158 21276921 12670400 7774383 5507665 4288533 3546660 3041707
18100 3041707 2671904 2408303 2215631 2052313 1917910 1784186 1675428 1588796 1498982 1426149
18090 1426149 1380297 1330061 1262304 1205379 1145251 1105107 1095440 1065022 1035771 998976 945711
18079 945711 904051 883030 862138 826379 798451 783096 765782 742868 710162 657288 625430
18068 625430 633953 628871 596761 572916 566890 546363 529122 531038 525869 515133 483907 477044 474715
18055 474715 483032 489046 475538 467320 448370 445633 449866 437501 418803 392062 376440 386611
18043 386611 408154 424873 417044 407490 387926 384719 391225 390517 371853 360056 340986 339281 344545
18030 344545 310594 287844 276862 271080 261554 256634 245060 242947 237247 239254 235140 226492 235692
18017 235692 233173 229054 237529 238681 212754 196179 209635 221109 204809 199250 191833 206437 223537
18004 223537 203032 189731 195831 195742 195163 195180 182997 186056 202844 205571 212033 196663 183734 200547
17990 200547 200223 194032 181439 169962 159234 151142 164943 164340 159921 142027 130740 134189 146500
17977 146500 156729 160579 154824 154823 162016 150404 129684 114251 106320 95933 91429 97054 115059
17964 115059 126571 139422 131105 115887 124425 136242 127650 125877 128279 131175 130970 140188 145145
17951 145145 148924 139187 129785 139152 149758 168329 169170 165726 159408 167913 171031 165447 156934 155436
17937 155436 146029 150924 161409 173572 198198 215184 204531 206120 215223 203473 177174 166432
17925 166432 166842 173707 196067 200809 204865 200755 202222 226720 248187 257437 284142 288620 291656
17912 291656 291283 282207 279929 275832 274636 262814 257604 284491 293346 301479 305439 303255 306910 309393
17898 309393 341570 366264 386560 394808 378367 378934 397417 418800 451689 495038 542653 635407
17886 635407 805475 1137398 1562215 1964600 2292871 2584191 2627280 2029931 1419770 1124438
17876 1124438 983198 934278 955303 1024592 1136208 1252763 1328829 1413939 1452510 1392130 1245640
17865 1245640 1142440 1094141 1078767 1058590 1030588 985016 944889 919440 922083 908742 915569
17854 915569 923105 972396 1022729 1083279 1157587 1235444 1321147 1416828 1541059 1775477 2170126
17843 2170126 2794782 3530949 4161465 4735762 5250589 5079282 4501474 4398333 4762547
17834 4762547 5559496 6960394 9356816 13297994 18652513 23882893 28416277 33059979
17826 33059979 34774215 29653626 24800738 22798175 22132673 19867394 15906916 13510716
17818 13510716 12933443 13831703 16036949 18874367 21324024 23394624 24766653 22375255
17810 22375255 17051387 13365270 11466808 10591688 10332112 10547210 11333488 12898868 15721269
17801 15721269 20301062 26246751 32063938 37453691 42673109 44441464 42253524 42918497
17793 42918497 47040871 51565099 55693603 55794575 46465215 33705329 25733948 22384190
17785 22384190 21853575 22982777 24509323 25878818 27236035 26854418 22666202 18884536
17777 18884536 17344313 17527689 19246840 22302630 25893052 29636035 33883210 36774908
17769 36774908 35555695 33944869 32345446 31039100 29992567 27256644 25900431 26546436
17761 26546436 27582944 28775698 29365768 25890968 20631591 17733036 16440682 15729432
17753 15729432 15282854 14266284 12168179 10441089 9355336 8616778 8094356 7663769 7297936
17744 7297936 6987301 6781501 6663478 6551716 6434251 6317233 6140454 5747063 5353188
17735 5353188 5086687 4847821 4652167 4486390 4308037 4134564 3987270 3852174 3716066
17726 3716066 3594674 3508302 3447479 3404807 3333426 3245230 3158325 3076407 2974776 2884750 2775872
17715 2775872 2642009 2520481 2445030 2401718 2370889 2329271 2305853 2277473 2262463 2234754 2166746
17704 2166746 2062282 1943030 1854696 1775656 1712746 1655861 1595286 1552770 1512633 1461137 1417705
17693 1417705 1363870 1321772 1286942 1277900 1241526 1189026 1157638 1140141 1116024 1081144 1060553
17682 1060553 1038797 1035416 1014262 979653 957491 910109 874989 843418 822684 792446 757141
17671 757141 736993 748989 730259 721718 715414 713370 706966 710072 689819 670512 635116 635113 621678
17658 621678 602419 590279 568644 545684 532499 522419 502689 474629 468339 467571 459364 450767
17646 450767 436348 411366 403378 395828 401293 400080 384941 370901 369445 389730 393497 385226 401409
17633 401409 410199 416451 440431 454765 446258 443193 433390 406683 374198 346252 319745 305865
17621 305865 295666 298647 299639 280647 281329 296909 308734 316752 293981 255568 231536 234865 226851
17608 226851 230817 214126 211423 203427 198351 186360 167909 162418 167502 165189 153147 147998 139367
17595 139367 146677 142497 126126 128630 142297 144666 126686 119375 124634 133988 127407 130662 135546
17582 135546 142572 170723 182557 209928 227653 241000 262690 281340 278561 228886 177333 159741
17570 159741 172008 175901 178410 175385 179815 204259 208521 216569 216944 222063 207497 169059 135791
17557 135791 117222 110121 106364 98875 89442 86379 107798 121608 108934 102636 99348 116166 125396
17544 125396 130206 144816 146411 151787 168862 179763 185532 183291 143178 155432 174883 189087
17532 189087 208488 198153 181618 170094 166212 170387 184963 191315 164803 134065 112332 113592
17520 113592 126036 135079 123812 116026 105480 114907 116415 122800 125403 119146 114427 112650 116174
17507 116174 129095 122403 114949 84137 82177 110514 135025 131303 135827 142535 131307 119825 142117
17494 142117 154544 147871 138363 156407 170040 167819 151663 150098 148217 157286 172744 184120 186868
17481 186868 193287 206793 206907 191032 180033 198841 188792 164973 145462 167907 188269 170869
17469 170869 166868 155656 154978 184377 210244 207930 200056 186633 184318 190809 208492 236465 280352
17456 280352 330168 372408 427403 535129 731981 1033749 1424750 1807865 2121873 2415132
17446 2415132 2457787 1985179 1506681 1248067 1184395 1194367 1262419 1468817 1710467 1908016
17436 1908016 2086930 2201095 2041683 1670976 1459047 1439164 1492755 1645605 1909901 2315716
17426 2315716 3001557 4228341 6026319 8035790 9720265 11136841 12012055 10484222
17418 10484222 7407450 5376885 4349322 3835241 3612834 3584856 3754465 4206801 5091037
17409 5091037 6532274 8253960 9740129 10986772 11862169 10882067 8253208 6418752
17401 6418752 5675618 5686408 6302867 7410132 8691248 9872288 10974448 11541714 10734107
17392 10734107 10004619 10353572 11140956 12085848 13274549 13437217 12113251 11400571 11356994
17383 11356994 11559940 10959015 8969262 7206741 6172847 5501046 4992672 4680729 4554362
17374 4554362 4620128 4965017 5679548 6933734 8763077 10892952 13020849 14842486 15409851
17365 15409851 14058698 11808162 8839404 6688639 5472544 4795455 4416798 4235107
17357 4235107 4208444 4322059 4532196 4806692 5262970 5978850 6900536 7962035 8861433
17348 8861433 9623961 10091898 8945982 6607636 5018052 4197337 3731911 3462858 3370237
17339 3370237 3413548 3476787 3517503 3539765 3385478 2955596 2588416 2393977 2292598 2263449
17329 2263449 2254121 2228941 2188664 2106762 1921738 1763686 1644501 1555176 1498727 1472374 1487792
17318 1487792 1537398 1575656 1625282 1661834 1640815 1493020 1305047 1181144 1103386 1043162 995145
17307 995145 945590 918646 899647 885738 869803 850036 833338 831992 823422 816939 799525 783324
17295 783324 782696 775637 766632 757824 739778 705011 685055 679935 652222 612010 600124 574060 552563
17282 552563 528722 499112 481326 463623 442238 431263 407412 388605 373380 347872 334542
17271 334542 337528 340184 338588 330988 325692 314373 300067 300281 293228 295635 281614 274826 300758
17258 300758 339123 355526 342476 331027 321280 313949 298175 302468 322984 340207 345778 365903
17246 365903 394556 403986 390138 401291 379396 350604 318891 321256 313771 297892 274987 262200
17234 262200 262487 269297 289242 283458 248657 211685 178588 157107 153505 153420 155953 150511 147788 128377
17220 128377 128204 127048 118992 120035 124980 124455 118620 116454 93202 75768 77614 95669 96932 97472
17206 97472 111232 107787 89693 68651 59007 46405 55067 67828 67256 84824 113143 93034 66009
17193 66009 50059 49184 56883 50991 38791 18386 17590 60205 74001 78922 82285 68658 55632
17180 55632 60221 68610 54312 50796 47085 26885 29887 32662 39873 30825 40376 36282 31574 38248
17166 38248 23822 7381 15394 6295 18659 32299 49163 64798 60148 42087 11957 -14496
17154 -14496 6327 15656 1135 4469 13776 19604 29708 26904 2509 -23578 -36752 -13745 2621
17141 2621 19994 20796 19459 22666 33750 36108 22920 10365 22602 21984 15832 19935 21154 3385
17127 3385 15073 44112 51059 39533 24391 6090 7052 12073 19032 13816 11263 14655 27763
17114 27763 13896 21712 32162 23186 14922 7452 15400 2183 -4385 15767 20899 4239 2860
17101 2860 16140 11790 8719 8366 22401 24443 3905 -1249 7264 3719 6283 -3250 -9907 11042
17087 11042 16256 6047 11610 6352 16696 22184 22254 18945 15646 1188 5020 10473 23717 35337
17073 35337 41038 19690 12274 9584 -660 3655 -19024 -31054 -9469 -4232 -12387 9361 20636
17060 20636 9785 28219 29996 22104 412 8744 28631 25631 2023 -10286 -15288 -23767 -15695
17047 -15695 -4405 -13741 -1272 5398 4326 16346 21996 39978 33119 13129 5457 25485 34269
17034 34269 12373 -2462 -6402 26329 26869 22539 11402 8287 -2181 -607 2907 6147 9063
17021 9063 5440 -9099 -4753 -693 -3159 -2155 -5325 -1550 10411 315 -2727 -2962 -20644 -22385
17007 -22385 -22314 -1983 2937 -2586 20489 31176 13644 -222 5586 17901 13445 4398 -12552
16994 -12552 -20683 -16885 6945 22263 5588 -16303 -8306 -2049 10035 9646 -24900 -30534 516
16981 516 14218 13176 3799 8064 18963 11496 30385 28294 8819 -15264 -17074 -18541 -12317 11307
16967 11307 20119 3893 -3989 -1685 3312 879 -1589 -1542 -1750 -4890 -7688 -10078 -8522 -6268 5635
16952 5635 5752 4123 -4975 -19192 -19826 -1700 2501 5909 -4687 -22899 -29058 4950 14479 27127
16938 27127 46352 40838 30181 16644 25849 18580 22435 35437 34139 19973 -19623 -13401 7037
16925 7037 11043 25662 24548 28197 35835 22336 10119 -4368 -3226 9687 24393 25280 4597
16912 4597 13117 35492 34688 12642 -10356 -5783 2193 -1847 14117 17901 17308 27259 32915 33328
16898 33328 39874 53179 67278 102945 114965 90795 73143 58880 43599 15586 -483 -19681
16886 -19681 -30198 -2819 6106 26651 59027 64523 65402 60431 45455 53382 42612 33924 45180
16873 45180 74225 101873 104731 90572 62043 34345 22956 34886 28954 25761 21751 10620
16861 10620 17013 15411 3331 -1319 6580 20864 42349 80487 104106 76219 39219 28769
16849 28769 26195 40747 44272 19026 20721 31735 18110 18814 22193 33625 51257 75617 71049
16836 71049 57837 56947 41510 45001 44755 33252 23713 25395 17873 8066 -10283 -12005 -16971 6811
16822 6811 16154 14238 10624 12049 28377 21622 16402 8728 10406 27762 20349 808 5816 4849
16808 4849 7634 13983 27286 24775 22339 12413 1702 -13003 -3567 12148 -2712 1456 8579
16795 8579 7319 6332 -110 -3052 13301 8641 1847 10632 4977 14941 32304 27880 12064 8297
16781 8297 8856 8547 23848 34214 5021 -748 118 11552 19451 10697 7807 11790 10543 -2520
16767 -2520 -16955 -22587 4784 -4824 -18177 -15130 724 8770 6888 -4295 -18787 -35866 -41994
16754 -41994 -40770 -22267 -15148 -149 23103 36048 15250 2136 2061 1751 14030 10208 12463
16741 12463 23139 21414 11057 9480 6631 4992 11131 9516 14940 1619 -15233 -6733 24277
16728 24277 28904 33709 24730 7714 724 9626 26272 25411 13738 -1982 -6954 -10574 1349
16715 1349 6899 12883 19765 22224 8902 -1014 -126 -778 -8255 -23138 -15767 3327 21864 33897
16701 33897 40117 41025 10086 -5199 -7263 -6008 -19097 -18983 -2000 -13155 -23455 -31027 -34743
16688 -34743 -26462 -30896 -44237 -44126 -28353 -31412 -21748 -21031 -26004 1574 13978 12695 14629 -6885
16674 -6885 -16952 -7522 667 -5801 952 23252 24505 9242 -4188 -22876 -35251 -33587 -31677
16661 -31677 -23195 -7244 19809 22219 7792 -22757 -13225 7749 2815 -12511 -12971 -8946 -1510
16648 -1510 -17209 -11804 -1928 12470 10075 -10094 -14898 -29763 -40153 -25388 -22211 -18169 92
16635 92 13015 26279 12550 -7005 5350 8700 4349 -2528 -2170 -12935 -28981 -37893 -22908
16622 -22908 -3127 -7482 -10045 -4969 7372 5468 4583 5102 9866 12116 -776 -10192 2528 -9538
16608 -9538 -4661 76 -14741 -24237 -25704 -26753 -16182 -12913 -5568 -8905 -15346 -7388 -8797 -23196
16594 -23196 -8447 4729 16666 7809 7639 852 5526 28298 32882 32978 35188 24212 9645 -11133
16580 -11133 -18485 -26365 -5305 15446 -877 -30508 -39752 -23443 -12358 -14596 1455 22501
16568 22501 23158 2485 -7642 -18900 -27327 -25959 -12721 -18118 -23090 -2977 16228 21722 13878
16555 13878 -6206 -9889 -4233 -1846 7699 -10108 -16657 -23260 -7218 -8329 -25087 -16208 -2801
16542 -2801 687 3766 -8160 13436 30888 21608 21067 33904 23369 12704 -750 -12205 8235
16529 8235 13373 -4078 -602 4215 6301 -7328 -17330 -17213 -10761 22295 22201 -11263 -12905 -6958
16515 -6958 -9198 -10506 -5696 1182 12372 16531 16583 25741 -2101 -2913 7089 8465 1964 -6418 -10867
16500 -10867 -11742 -10820 -4919 -11605 -634 -10787 920 20167 19735 16863 14133 15321 11788 13669
16486 13669 -16725 -26694 -23461 -23653 -25522 -9802 -4178 17966 14907 17121 25932 14329 5633 -14976
16472 -14976 -22198 -24706 -14156 -22389 -26898 -23434 -12223 -25644 -22918 -163 19750 21128 -257
16459 -257 8114 10136 -17483 -19897 -4982 8274 -5252 -13706 22897 28790 1832 3089 -10574
16446 -10574 -21235 -22933 -14734 -20673 -41013 -27094 -11731 -240 22418 -808 -15918 -14061
16434 -14061 -8133 7573 8682 7874 7034 8008 7739 12528 21360 23047 22925 15961 19621 10567 -3604
16419 -3604 -17023 -23812 -20870 -12584 -20730 -23344 -13528 -632 5848 9111 19583 6362 365 -2164
16405 -2164 -11260 -22798 -7881 13916 24815 21817 1369 -12944 -6745 -20404 -16207 -12518 -17439
16392 -17439 -10967 5072 18206 7154 14856 8206 -1722 4528 2078 -8233 20603 31271 6625
16379 6625 4267 817 15944 25448 20090 17703 14485 708 -10788 -22346 -19452 -15171 -3561
16366 -3561 4501 15066 -1654 -33 5646 -4748 -13718 -9756 -4276 -2983 -9018 -13460 -4023 8727
16352 8727 8824 15563 -364 -20958 -11414 -5605 9454 7299 5789 -10030 -21547 -24795 -5389 -4605
16338 -4605 -1668 -8871 -19008 -15030 2640 1761 -10085 -14937 -13401 -8279 11861 -2662 -11140 -3329
16324 -3329 -2764 -6262 -784 -702 -228 13113 24710 33486 16178 -11831 -10421 8621 -7308 -15284
16310 -15284 -21907 -12563 -16295 -16493 -20261 7513 -7080 1722 -5033 168 7055 2815 5186 -5420
16296 -5420 9532 -6889 -18026 -1396 5528 8463 8387 24071 19380 14929 13999 15151 22022 6259
16282 6259 -14236 -23494 -9854 -8005 9688 5308 -902 -2787 -11881 -21384 -18714 -1298 2017 13183
16268 13183 17255 14187 6242 4860 2446 11119 6361 -1434 -3881 23910 35387 38020 26208 14248
16254 14248 15818 21377 9009 5523 13993 27528 19940 -3657 -7083 -12570 -17439 -11897 -10854 -19765
16240 -19765 -35725 -16819 14116 34640 46999 45493 31081 5311 -5866 9213 8629 8011 6152
16227 6152 -4353 6858 5431 19643 15917 -5904 -3035 3402 153 3485 1909 1148 -6245 1369
16213 1369 2744 -3922 -2911 -3383 8713 1113 4179 11009 13496 24310 35797 43911 37031 5679
16199 5679 5037 23894 39550 28807 17216 19613 28240 9479 -9544 843 -803 11435 20547
16186 20547 12500 -10495 -30950 -37150 -21488 -18251 -26037 -12327 -3745 350 11315 -4935 -5818
16173 -5818 -9893 -16073 -3951 5912 -5738 -16095 -20768 -28146 -13480 8028 3027 -11111 -16563
16160 -16563 -18329 -13588 -4130 -2661 -24995 -21402 -23451 -20713 4169 13186 -7392 -13015 -18573 -22994
16146 -22994 -19949 -11993 -3521 -15532 -13683 -8409 8001 3907 -14584 -9425 -1116 -4403 -4539 -11593
16132 -11593 -35477 -36915 -8219 -3255 1205 -13001 -34302 -36273 -34967 -41559 -40874 -36296 -41057 -25780
16118 -25780 -32787 -43338 -47227 -23352 2351 4988 -5863 -12565 -15888 -16165 -23161 -32864 -24359 -18548
16104 -18548 -31996 -21096 -4923 -6184 -13255 -4178 -5744 -9445 -13732 -2508 5333 -316 -3282
16091 -3282 8708 18602 10317 16036 10498 4342 4338 -1457 -19918 -20249 -20164 -39374 -30532 -23960 -11022
16076 -11022 19387 22440 -3257 -16657 -20904 -23120 -17008 -4865 1241 -14372 -24244 -9715 -3672
16063 -3672 -30904 -27696 -11641 -18126 -28417 -44202 -33143 -2711 -12417 -14318 2815 2459 -13490
16050 -13490 -12575 -3443 -8869 -10924 -18422 6727 24449 19895 11393 17633 36971 44638 32153 30026
16036 30026 27104 18421 856 -21632 -14480 -21497 -15740 6595 11565 -1011 737 16932 36294
16023 36294 37162 14301 -10811 -15442 -22559 -17899 1703 27202 24225 29925 30703 24209 22051 24443
16009 24443 22797 3714 -2140 7518 -3438 -10822 -13527 9180 5431 -20351 -15176 -9111 -6427
15996 -6427 -15086 -383 -1608 -1229 2426 -7685 -8562 13182 27410 16681 -4423 641 7361 -14322
15982 -14322 -28376 -4000 6148 16150 -2097 2854 2154 -4117 -2921 -6281 -10274 -9724 -662 8036
15968 8036 12519 15106 17131 27575 20234 3905 2994 -4538 -2280 10552 6884 3609 16468 14845
15954 14845 2770 -2173 10355 16334 3856 1615 3709 9465 18818 18417 -1334 -7619 11960
15941 11960 13310 -1027 5460 5170 5137 3517 1175 -1263 1726 15921 14461 -14559 -17132 -5537
15927 -5537 -11819 -26700 -29277 -34994 -24989 -15621 -8776 13702 23226 3245 1847 31074 38961
15914 38961 34946 18717 -3852 -23924 -12418 12904 11368 -12093 -21949 -14484 -10446 -33129 -67462
15901 -67462 -64092 -25819 963 -1101 5053 5259 2003 1908 -11666 3590 14579 17244 18620 10198
15887 10198 565 11838 12753 12125 15751 2652 2444 4231 359 -5640 11912 9112 1013 11097
15873 11097 6816 1100 4462 -9316 -5368 3558 3365 -13006 -20091 4749 17105 -143 -9411
15860 -9411 -8325 -6246 -11471 2116 10442 4649 -1126 -13438 -6788 -290 -1012 4847 15016 27534
15846 27534 39438 33213 30135 22973 -853 -7015 10821 11754 17704 21305 25021 19444 7700 10262
15832 10262 8741 5916 23473 21321 28402 18995 1401 9537 30602 31089 11488 15684 32928
15819 32928 31428 4835 3295 14086 21485 6524 20978 24472 23157 33753 23248 12961 12515
15806 12515 17233 8464 -5649 2495 9762 -12813 -2178 10789 7647 -2108 -3255 12676 6196
15793 6196 -4924 -5778 2284 8686 6506 21278 14327 12471 24538 26000 15433 4894 3869 11608
15779 11608 -3309 -14483 -35010 -29493 -6025 2504 -4218 16142 14907 7911 -1550 -2503 -3259 -8442
15765 -8442 7107 15414 16257 16118 7502 3376 -348 -574 -759 9931 -1902 -7438 -11654 -10709 -14365
15750 -14365 -11881 -9509 -11193 -4604 -10769 -26998 -14949 -10830 2051 12968 19983 32756 39462
15737 39462 39614 29195 23795 15378 -8787 11895 -310 2532 646 2901 290 4430 -10942
15724 -10942 -23779 -16749 -22733 -25291 -14564 -13868 -16439 -25492 -22730 1211 15223 20156 33507
15711 33507 29742 14316 -509 -1007 5806 -1183 -4780 -14177 -13466 -3590 14442 21517 -6188 -23085
15697 -23085 -4943 653 -970 13988 8117 3359 15362 4656 -19941 -8433 12189 20513 12591
15684 12591 10946 6503 7804 13506 20367 -706 -37693 -19378 -9999 -2213 6828 11529 16090 8933
15670 8933 -13442 -32697 -43325 -35637 -10172 -9818 -26442 -16804 -12718 -8445 -6173 -3183 8638
15657 8638 1253 -10553 -6727 4390 2463 -4922 -14132 -11012 4977 24414 31722 39140 23441
15644 23441 42227 48908 30959 1136 -12147 9963 10479 5717 11090 14440 20541 15658 17680
15631 17680 7740 5563 -3098 3223 4581 8123 6442 3199 2107 -3829 774 3884 -10771 -14293
15617 -14293 3271 7235 -936 -7387 4987 5499 -10592 -23774 -6697 -588 -14712 -30067 -30989
15604 -30989 -26320 -43015 -29202 -30912 -46288 -32558 -31875 -27098 -11548 1282 6048 13932 11176
15591 11176 22280 29190 30604 6834 13344 6662 8376 -10296 -42880 -44004 -33761 -12445 162
15578 162 -14473 -32321 -38838 -30528 -20127 -24826 -25742 -27993 -28470 -27740 -12808 -2016 -7395 -9010
15564 -9010 -6151 -7942 13838 20156 19531 18297 6455 -10136 -7239 16931 31741 22255 24891 15843
15550 15843 -8130 -17076 -268 8752 -7883 -9839 4315 -11310 -8696 -8867 -18476 -16510 -9837
15537 -9837 -6985 -8338 -2210 1468 8106 -1472 -4865 -4115 -631 16255 13827 1240 6606 22725
15523 22725 21750 1939 -10159 -17261 -10588 -18542 -20703 -32752 -34807 -23839 -2384 20189 19687
15510 19687 11021 -9186 -15821 -7367 8587 -2737 -8967 -4888 7609 560 -26531 -25527 -26100
15497 -26100 -22445 -18270 -27149 -25648 -32384 -27817 -17495 -21729 -25774 -4085 25501 4013 -6533
15484 -6533 3881 -3704 -6855 12966 16445 -5900 4274 5536 2358 -1275 -35053 -35453 -30459 -5375
15470 -5375 6757 -3803 -4640 -11072 -12623 -17092 -14286 -10904 8247 20123 3764 7301 9613 2538
15456 2538 -12298 -15120 -13201 -4153 -15256 -28646 -38932 -20492 5985 21005 10592 15707 29629
15443 29629 31425 36299 29798 22777 10406 -3414 -10347 -13450 -5946 7083 4418 -13657 -12100
15430 -12100 -1050 195 -490 11716 15028 23342 42385 18188 -23084 -45745 -48544 -38228 -51510
15417 -51510 -44462 -21080 -5241 10383 13638 2370 -2682 -22628 -33076 -8019 -7359 -18596 -24562
15404 -24562 -25684 -3851 10952 3644 -7163 -425 5689 2609 -408 14945 -6876 -7161 18836
15391 18836 28006 30428 19411 9756 18114 19505 9726 -3201 -2999 -846 -16764 -20100 -22123 10160
15377 10160 40592 31534 26766 14271 -16246 -23445 -29260 -24352 -14538 -11250 -23413 -23876 -33275 -36615
15363 -36615 -30520 -27069 -25813 -13863 2307 6176 2834 -2740 235 -9972 -4352 -31412 -34482
15350 -34482 -15670 294 -4606 -24585 -44591 -18082 -10850 7298 40512 44572 33862 11090
15338 11090 12665 1512 -3911 -8529 9063 11567 8406 21916 12517 6060 3662 4213 -10689 -12067
15324 -12067 -16026 -5065 -2912 5149 -4267 33 17860 25100 -11577 -33467 -14064 -11993 -14098
15311 -14098 -20605 -14532 -5392 20752 22745 8070 7685 15911 15849 22261 23443 12949 8076 -504
15297 -504 11226 26493 19379 8199 12933 18970 12371 17749 2994 -12022 -9000 -10708 -15511 -2407
15283 -2407 4463 -12125 -17871 -13587 -11120 -5642 -9540 -12652 -19057 -13201 917 6241 9008 22182
15269 22182 17257 -1861 -3191 4987 15481 20475 26505 34076 43550 28514 8920 -596 6646
15256 6646 8179 9113 21083 19048 -659 13676 18673 29091 14101 -19994 -22951 -13929 -24922
15243 -24922 -20218 -16949 774 17185 20739 15234 81 -8722 -3382 -5986 -22263 -29983 -20322
15230 -20322 -6407 -3073 -4787 4318 12491 4534 6309 22524 26357 4185 -23006 -42110 -45496
15217 -45496 -34944 -20949 8494 19578 604 -8845 412 -4281 -4080 -18589 -29666 -13334 -13412
15204 -13412 1782 16161 3916 -11808 -7491 13650 9160 -17995 -19959 301 15049 7120
15192 7120 5098 368 -6905 -6987 -13658 -20707 -16417 2356 10153 1024 -7063 -29185 -59388 -66226
15178 -66226 -38554 -21843 -8677 15685 21005 12177 11043 1246 -17067 -27727 -38761 -48789
15166 -48789 -33892 -19912 -15439 -16592 -9477 -9821 393 -5514 -9523 -5259 4218 13188 14499 18702
15152 18702 10303 -784 -10303 -17744 -15787 -4123 -825 1367 -16665 -19680 -7091 12482 21733
15139 21733 16877 13334 11297 8356 9909 7810 -1959 -27827 -39144 -49893 -41927 -34596 -27700 -5456
15125 -5456 -1586 -22032 -51366 -40591 -15914 -2697 -2837 -18960 7229 20150 14320 11716 12071
15112 12071 6741 9135 17455 18095 18977 2145 -5882 8338 -1852 -17476 -323 13275 2561
15099 2561 -5794 4456 14384 12307 4893 -8930 -11229 -7428 6360 4605 1040 4103 -7261 -8935
15085 -8935 5584 26450 23854 23334 8715 6374 10777 8934 -3368 -7173 7515 5629 -7888
15072 -7888 -987 2253 1538 10040 11993 5650 6799 6643 17214 18356 24939 25771 15522 -4120 -2730
15057 -2730 12783 16979 9048 -6636 11897 29764 22064 -8722 -3527 6021 24711 15984 3020
15044 3020 18967 16313 6345 -7579 -25832 -27132 -16272 -892 2295 21248 22385 6666 -14014
15031 -14014 -14048 -11185 -5456 -11470 -18578 -2740 8810 8365 18369 15553 11802 -17324 -17961 1364
15017 1364 12560 43198 70115 64122 68128 80363 110573 187767 336837 564836 793926 930209
15005 930209 1102657 1219150 899274 505870 316396 240138 196188 175514 167826 148888 137027
14994 137027 109439 90409 80918 78017 81991 76952 76909 58848 49421 66527 72211 58068 55685
14981 55685 49342 28335 23510 38263 63131 63344 68679 58504 45121 40824 37352 31158 26880
14968 26880 22944 29797 28060 18162 32486 43954 37447 30679 43934 36434 37029 54121 57709 36968
14954 36968 21062 4802 7680 7454 17082 31635 38794 39787 56689 33605 4441 10168 16050
14941 16050 35180 37202 32997 26603 16308 13332 6857 1674 -7391 -18399 -12425 6576 15777
14928 15777 -2303 -22452 -13679 -3834 10518 8529 -3272 -13116 -4400 6400 5049 12788 -220
14915 -220 -6154 -3370 -934 2168 -2092 3277 12248 16414 4181 12305 4644 808 314 -3615 -6771
14900 -6771 11139 12249 12792 -2343 -15329 -17834 -18994 -3901 -3061 -7352 6092 4579 -13358 -11827
14886 -11827 -5622 6063 -8301 -17913 -14274 -9145 8867 12449 -20375 -30508 -11151 4006 51
14873 51 -1370 8687 -5457 -4911 -2707 -20009 -8065 -7620 -1995 10781 12834 18854 24229 26822
14859 26822 8507 1692 16588 7874 -3340 -9519 2435 10670 5352 9535 6190 6795 -4475
14846 -4475 -2124 7858 17120 9164 1718 13207 19050 4932 12116 16916 7895 -5983 1590 19114
14832 19114 16399 -8376 -7500 1246 21369 11416 9965 8555 -14170 -22236 -2447 157 17402
14819 17402 23773 5160 3794 19259 13489 -2895 -11685 -9682 -12275 -12006 -11179 341 9862 7832
14805 7832 5829 -575 -12438 -14740 -12756 -25599 -30579 -24105 -29287 -22073 -24109 -14637 -5352 3898
14791 3898 16902 16272 7311 -18525 -23731 -15492 -440 6610 -4134 192 -6724 -8623 -25568 -22755
14777 -22755 -9149 -10590 -5314 -5267 -2257 -1464 -4959 -8889 -179 8504 563 -6059 -6466 -290 6205
14762 6205 -10660 -9298 -11505 -5068 -12908 -24086 -20174 -2339 1741 -1402 2102 7160 2042 -2892
14748 -2892 5212 8969 3478 11778 5635 -9182 -12563 -6225 -1161 8815 2761 -7646 7297 7670
14734 7670 10933 6838 3510 -6038 -13736 -8822 1873 -4602 -20116 -24467 -14018 -19490 -10828 7924
14720 7924 21098 26531 34139 20987 19517 14031 6848 3147 -3947 -10491 -2283 -2603 -20890 -28745
14706 -28745 -31832 -35893 -41413 -12548 -6378 697 4428 3862 -10900 -22202 -26026 -26879 -20586 -7235
14692 -7235 -10504 -16616 -5973 -12848 -23674 -31110 -30264 -33323 -27066 -30862 -28075 -22516 -4595 11431
14678 11431 14 8520 3914 1092 7261 9692 -6680 -26953 -40967 -27818 -1313 10349 1746
14665 1746 2521 -16585 -27886 -24597 -4975 1379 -21254 -39145 -20918 -28555 -21368 -21922 -11438
14652 -11438 -22301 -19349 -11982 -6291 -13504 -10216 -18634 -27655 -24028 -7074 1180 11581 6199 -406
14638 -406 -14710 -8857 -18688 -10421 -13506 -10642 3940 3642 13173 7066 9759 8462 3337 -2480 -11522
14623 -11522 -9792 12593 -5793 -27816 -10978 13076 32570 45753 21761 -4402 -12199 -13253
14611 -13253 -11918 -12779 -1076 16314 16843 13285 -1618 12986 7060 -8047 -26543 -41787 -36296
14598 -36296 -16009 -4637 -31100 -52487 -34297 -19807 -13922 -28238 -22525 -16500 -16655 -13477 -4324
14585 -4324 3326 11661 13799 22000 19143 11150 12825 -932 9546 18193 15393 4973 5340 7662
14571 7662 699 -8923 -21749 -22276 -41575 -43847 -60290 -66661 -39500 -22701 -12271 -3867 5902
14558 5902 -423 15398 21509 17720 10785 1044 12431 24959 8000 4903 13861 10110 14431 6288
14544 6288 -10537 -13522 -2367 -9388 -30456 -23360 -3063 2435 17887 10088 1913 -4712 18376
14531 18376 22842 26611 10933 1598 -9225 -13654 6147 2156 -7838 -6172 1806 -9728 -8984 -31192
14517 -31192 -36262 -5304 -12498 -14356 -13630 -6011 -3372 -10493 -21244 -7504 19748 24566 25472 11182
14503 11182 -18463 -34991 -40733 -24929 -26040 -26420 -21344 -33553 -46934 -35154 -6268 12143 22140
14490 22140 16558 -2961 -5021 5237 22641 13000 -5305 10659 12141 7185 14315 20633 10287
14477 10287 -5468 1630 1114 5133 1769 -1924 10531 21171 13564 639 5760 -1383 11845
14464 11845 15813 19762 21330 28827 14745 -11194 -20911 -17911 -13960 -8164 -2681 25326 30490 29187
14450 29187 4205 9086 9560 -20589 -14173 -13174 -17742 -1106 -4177 -9597 -9118 7469 52885 33504
14436 33504 8783 -18957 -31551 -41975 -19258 -17021 -20298 -17148 -3773 -18969 -39912 -28883
14424 -28883 -25125 -33866 -53917 -35575 -28735 -30863 -9263 1040 -14196 -7815 -1194 -1044 7211
14411 7211 -10572 -1427 2727 -6609 9324 23920 26512 36487 22966 4269 7775 8135 -5811
14398 -5811 -9713 -13749 -12223 -971 -7342 -26099 -23317 -13316 3220 16090 9405 3201 -3570
14385 -3570 -5379 -3372 12682 10873 4340 -858 3047 13248 4482 -3324 6560 1934 -5315 -5450
14371 -5450 5507 11735 12415 -3911 1115 9387 -346 -20094 -31177 -38564 -36199 -33249 -20485 -20817
14357 -20817 -4315 7562 13680 24845 37005 14271 -2281 -11719 -20511 -26638 -21263 -8072 -25305
14344 -25305 -3452 45431 38635 1850 1847 -3197 5250 4972 -8827 -12722 -18505 -13988 -7114 -12526
14330 -12526 -5536 -2205 -4484 -4607 -13486 -26837 -24340 -7798 -28 -8222 -3229 2258 -9141 -250
14316 -250 12876 40765 19220 -4236 6068 20620 12321 19276 34940 19741 4022 7098 18746
14303 18746 15829 -3947 -14175 -19284 -20153 -29153 -22371 -9478 -4605 -11588 4533 3915 1295 2469
14289 2469 -25562 -41048 -34544 -20483 2068 9298 15874 12827 11936 11250 13678 19964 12936 11192
14275 11192 10882 15394 18210 2794 -14922 -9051 -19613 -34977 -34359 -26638 -15184 -12438 -8959 -5861
14261 -5861 11888 -4788 -23342 -15580 -11270 -10801 -4057 4579 13017 9912 13920 31856 31643 13695
14247 13695 35462 35550 39369 51871 42924 39755 31896 25462 3378 -11993 -12906 -23931 -23293 -17510
14233 -17510 -27607 -34870 -37529 -26915 -14872 -18253 -7028 -11680 -22827 -41199 -25479 8589
14221 8589 7005 2178 1703 4884 -13344 -20628 -18129 -10986 9570 26414 15256 902 -7463 -5632
14207 -5632 11546 -2326 -9840 -8614 2292 1790 7107 -19494 -38663 -46924 -17981 6565 32415
14194 32415 36087 26313 18628 25560 10465 -2182 14496 24059 28949 44288 36000 20783 12502
14181 12502 29994 31506 39738 35642 9527 -318 -8446 -5500 -6288 549 449 -5058 -7584 -16537
14167 -16537 -34954 -35733 -32780 -11577 -8165 9698 14415 21341 12073 23877 25042 6275 -6081
14154 -6081 -21758 -20402 -11243 -4727 3766 7144 2859 -9144 1621 12158 4565 -11207 -6210
14141 -6210 -19048 -23342 9486 13876 2739 2401 2971 13988 2131 7773 4174 -7039 -23603
14128 -23603 -38644 -41175 -30889 -38862 -42966 839 17011 24501 9766 -11777 -15415 -11109 -9259
14115 -9259 -5263 -9498 -1124 566 -11223 -21452 4401 21680 33977 23186 -9322 -21299 -27746
14102 -27746 -23719 -44805 -45267 -33930 -41529 -41825 -30113 -42867 -32313 -24953 -28476 -26168 -27711 -18169
14088 -18169 -25874 -20655 -19082 -25608 -32736 -35837 -24640 -10873 -18970 -15601 -2892 -12078 -11132 7048
14074 7048 27829 19839 9699 20846 6181 -11084 -16963 825 23925 13325 -6918 -25747
14062 -25747 -27703 -1881 3714 7090 6750 -6989 -3106 -8435 -30000 -36201 -20155 5652 11682
14049 11682 -5284 -16138 -12457 -5863 -3814 -1449 -3512 3461 7919 245 -9172 -14738 -21358 -22630
14035 -22630 -4432 7423 1204 286 1450 2760 13816 18544 16091 16017 -9475 -9828 -4403 16816
14021 16816 31531 5143 -20399 -10546 -2148 84 -15061 -11257 -1765 -8162 -19285 -9412 3656
14008 3656 -9098 -16353 -13823 -19229 -24256 -4212 -3325 -9003 -6518 15030 4059 -24175 -19935 -10940
13994 -10940 -13606 -14895 -18586 8107 18232 23725 30845 41005 17070 12001 16328 20027 27419
13981 27419 20102 -5798 1000 10734 7592 28383 29484 3591 -11906 -36961 -33235 1016 -2517
13968 -2517 5032 8457 17190 6000 -1267 10240 13888 17222 13280 6740 -8601 -17580 -22044 -29435
13954 -29435 -28192 -15180 -4947 12994 4101 -10177 -18902 -19832 -28570 -35694 -11968 3617 -3455
13941 -3455 -14827 -34414 -39854 -32658 -14146 -21766 -21759 -30980 -30871 -23101 -24404 -23390 -22244 -9742 2715
13926 2715 1330 3966 144 -19719 -35868 -18644 -9727 24178 30850 23132 11659 -1721 -5742
13913 -5742 18172 25675 21393 4849 12798 20925 4133 -1834 1780 17411 4065 -5861 -19714
13900 -19714 -17105 -6332 -1929 -5085 -14664 -8085 2269 -1739 -27522 -55227 -44021 -41391 -28561
13887 -28561 -14875 -112 6189 5248 4059 -178 6030 17330 24964 29241 32512 21894 14331 9562
13873 9562 -2765 -12781 -10780 4523 28331 39973 18283 5976 3427 188 27028 24369 3215
13860 3215 -24776 -16464 6999 23724 30570 18146 26375 20709 -69 2784 12798 21947 28338
13847 28338 19765 1462 18803 30676 18383 13565 25085 9071 -13581 -1935 17090 8758
13835 8758 2220 -18836 -30356 -18920 13117 6090 2644 -2506 -11251 -17456 -14605 -13926 -23249 -29915
13821 -29915 -35986 -35743 -18639 -22362 -29299 -26853 -29393 -21734 -22471 -22870 -1893 -15226 -92 -440
13807 -440 -11391 -3816 3074 -2678 -3234 7314 -15852 -22357 -15011 13637 14567 15274 8519 5107 -4318
13792 -4318 -16130 -21141 626 21137 35713 31469 25197 29034 31846 15523 14929 -2517 216
13779 216 15078 17797 12409 9176 -17969 -20728 15845 7615 -29208 -35602 -27431 -1202 21931
13766 21931 26701 9921 16397 11734 12893 24126 21502 7292 5090 -2775 -8470 -16069 -8064 -13421
13752 -13421 -11573 11597 22502 12144 1599 9613 6028 27701 52662 37276 13325 7537
13740 7537 -2888 -9479 -9230 -6445 -3373 -5822 -18305 -12562 9791 21127 18532 13834 18035 13164
13726 13164 8522 17395 11052 -7827 8395 23133 3992 14615 22092 16497 11272 -5795 -32147
13713 -32147 -26281 -14108 17350 2495 -20203 -18305 -34050 -23965 -20895 -9650 -12823 -24489
13701 -24489 -18347 -3631 -12345 -18573 -17882 -11272 -27270 -34982 -36626 -21722 -782 2939 -32206
13688 -32206 -34611 -7565 16886 20669 10361 -4294 1598 8028 -7585 -17187 -11419 -7242 -12532
13675 -12532 -11639 -23889 -37223 -29972 -23016 -10940 -7798 -11395 -30571 -37516 -41123 -28424 -14797
13662 -14797 -8911 -8796 -17531 -23684 -17413 -12805 -10719 -2459 3488 5856 4535 -12640 -11244 14300
13648 14300 29110 32566 32955 24394 402 -16032 -14625 -26349 -28247 -24285 -21654 -15497 5583
13635 5583 13662 14477 8326 -3012 -13285 -15720 -332 2149 -3018 -17949 -29014 -43613 -26953
13622 -26953 -1823 13425 16235 14594 2319 -4616 -591 16149 3591 -12454 -9563 -36532 -44670
13609 -44670 -49688 -25109 -6029 -360 15868 3227 11874 23129 17853 6197 -3354 -4251 10219
13596 10219 499 -19746 -13265 -451 921 -3298 9868 21417 29164 8176 -6266 3339 3834
13583 3834 -2650 4540 16953 9512 -24053 -35644 -21447 -22083 -24152 -5966 -2998 -15843 -14910 -8165
13569 -8165 25 11532 9451 9137 20860 1547 -15499 -23795 -11588 -14297 -16796 -19651 -13022 -27534
13555 -27534 -14890 3774 11343 13093 8739 21498 12273 -6473 -8977 -39 -2309 -18770 -24512
13542 -24512 -13513 11290 18833 11535 21594 17855 -13354 -22208 -18620 2384 18466 17048 7425
13529 7425 9635 11717 27223 15224 14856 -4604 -32274 -19629 21298 19466 15688 173 12544
13516 12544 21782 17671 31033 27353 10613 -2572 999 3967 21877 20012 6042 9952 17339
13503 17339 5621 -6723 -8443 16122 21103 19712 22679 10234 27264 31355 27536 13469 -23
13490 -23 -4388 2235 13401 10879 8160 5408 -10343 -21515 -33725 -22242 -15272 -21997 -33281 -19056
13476 -19056 -10668 -18150 -1937 14052 23486 21735 22317 17340 2089 4402 -8981 -27479 -15872
13463 -15872 -14055 -20802 -5174 13 -2111 -13168 -10484 3361 20267 13600 -2625 -25206 -21103
13450 -21103 -12328 -18521 -3217 5942 5923 -7692 -11011 -17711 -17484 -8565 -12903 -10300 -3571 14543
13436 14543 -853 -541 10534 6778 17660 30515 13732 28634 25578 -3989 -20371 -29267 -11817
13423 -11817 11853 23441 14049 3535 -8806 -7412 -15835 -16134 -18338 -15461 4196 9068 8431 -15776
13409 -15776 -12354 -16346 -26021 -16933 -4499 -8154 -2390 -2692 4040 13430 20693 24673 20165 6935
13395 6935 -1482 -5695 414 14839 11637 -11250 -23092 -6157 8001 4307 6315 -11037 -26038
13382 -26038 -28088 -34009 -33581 -43071 -40100 -40768 -28322 -13017 -17919 -34045 -36341 -23609 -13411 254
13368 254 -5622 -14820 -488 11402 16005 -1066 -28836 -30252 -9387 5752 7971 6935 5846
13355 5846 14079 9 -21964 -27040 -12135 -9413 8764 17096 13505 3609 2557 -4840 -2087 1424
13341 1424 7863 -5129 -20619 5649 14635 -2328 -14360 -5082 7004 27854 19999 10825 11412
13328 11412 5293 5143 2487 -12453 -19188 -19899 -16962 -5732 -9696 -32181 -44431 -45607 -37849 -11286
13314 -11286 1008 -18066 -15593 -2914 -2567 11706 22952 18038 3833 12531 19051 14525 9615
13301 9615 -5573 -9018 -15727 -14210 20196 19389 20815 25095 24443 13727 4667 3317 -15857 -26772
13287 -26772 -16425 8745 10772 -4595 -21997 -51449 -43752 -16518 6395 -1125 -11912 -20751
13275 -20751 -27469 -34181 -9689 -8880 -20042 -26655 -35963 -21775 -2229 -3755 -27914 -35730 -31493
13262 -31493 -12084 -7180 -8366 -11450 -272 -2129 -2087 -5910 -5405 -21740 -29029 -32435 -10220 -2403
13248 -2403 -19141 -21228 -26571 -12168 4572 -12679 -22232 -11318 -7252 4252 -2791 -6740 -15298
13235 -15298 -34804 -41154 -33137 -10363 -6406 -10696 -27312 -29355 -10733 4683 -5765 -8047 -11336
13222 -11336 -8655 6355 7539 4909 12410 16363 31775 43436 33732 23844 8452 -16046 -30521
13209 -30521 -12546 5839 4204 16379 24240 34761 38364 13774 9487 1137 -27241 -29159 -16071
13196 -16071 -9071 4204 20042 18268 21882 1764 498 9886 14011 15496 17538 466 -7558
13183 -7558 8098 7025 25706 34578 28003 33324 21105 23164 13950 -1451 2578 12264 26390
13170 26390 15934 -206 -7946 -20316 -20800 -15196 -5486 -675 -1951 8875 -1133 -13181 -5353
13157 -5353 19356 -1472 -15644 -32825 -22642 -462 -19248 -30777 -40549 -30979 -19834 -7438
13145 -7438 -11618 -14652 -21314 -21180 -21270 -20428 -24991 -21611 -27724 -31103 -25979 -21411 -33388 -38251 -43855
13130 -43855 -24129 -17666 -17722 -21345 -36816 -31781 -17619 -21460 -5310 1890 5754 -6801 -14288 3491
13116 3491 3315 -7994 6020 32524 22423 15746 14031 -102 1412 11612 2868 -6896 -11029
13103 -11029 -19696 -21506 -31535 -25400 -14808 -16937 -31974 -34444 -30318 -34362 -27938 -34920 -30414 -17887
13089 -17887 -2122 -2583 -21291 -22196 -10815 4980 -2248 -2102 1341 10418 3926 -2525 -14933 -26101
13075 -26101 -26372 -25674 -23652 -13043 -31714 -41356 -33966 -20027 -25010 -16707 -2820 12676 -4759
13062 -4759 -21304 -9926 -22587 -32801 -28121 -22584 -18787 -11731 -15808 -241 -2685 -574 -1806
13049 -1806 -2795 -2250 -15805 -14373 -36049 -46375 -38563 -39443 -32740 -49708 -57195 -34798 -29051 -19926
13035 -19926 -7122 -13198 -3517 -21822 -25306 -12339 -7970 -7208 -8484 -5417 -1637 -21818 -22865 -10238
13021 -10238 1073 -13013 -3279 4704 -538 -15117 491 -9537 -31301 -39400 -36353 -30629 -24107
13008 -24107 -25574 -25298 -30624 -21329 3150 8653 25783 20801 6177 -28322 -39618 -29223 -5296
12995 -5296 2708 -2931 4302 17665 4174 14551 2362 -13341 -16947 -10881 3170 13065 11953
12982 11953 3423 4565 5349 9153 1834 -16867 -25744 -10808 1433 13838 8962 7280 16635 19122
12968 19122 1921 -20105 -11103 7325 5924 11483 6888 6420 -5055 3250 11848 14745 7793 -6209
12954 -6209 -12468 4328 -1510 -5296 -7508 -3732 10685 13131 5035 -17330 -26258 -22680 -18528 -18756
12940 -18756 -31651 -35560 -14861 -21826 -17331 -4231 10278 8922 11103 8500 -7744 955 -1042
12927 -1042 -4819 -15468 3222 -7763 -17517 -28956 -14820 12408 28754 26279 29987 1042 -22568
12914 -22568 -9195 -3715 5615 -3418 -8109 2630 8932 20185 10734 -7089 -4455 -3715 -6744 -12914
12900 -12914 -18847 -15245 1846 13137 3079 -2105 -9612 -8994 1851 2505 4731 2867 886 -12796
12886 -12796 -19110 -22614 -8510 5967 9935 4831 -1157 4120 -947 -21014 -24721 -1130 14150
12873 14150 5682 -4520 -4498 -24815 -34640 -32709 -678 3738 2521 -4561 -9047 -10992 -19316 -14968
12859 -14968 -6420 1230 -2841 -3269 -20622 -1612 10029 -4103 -37122 -49891 -25780 -11403 -32497
12846 -32497 -35173 -37758 -11473 11149 183 -29810 -61431 -56516 -35974 -22053 -10923 -4242
12834 -4242 -6896 -8985 -21661 -17302 -16508 -5473 -2959 2017 -6791 -15591 -11150 -17284 -35963 -14158
12820 -14158 -10380 -6415 1378 8908 -9576 -6797 5067 6790 -5786 -19583 -20803 -26043 -24234
12807 -24234 -21465 -18322 -13348 -20810 -30535 -22273 15641 53467 36954 8348 -1361 3057 13672
12794 13672 12932 24125 28511 14282 3667 20814 13980 -8968 -12829 -13645 -16797 -10996 -18821 -3315
12780 -3315 623 -14375 -12027 -14763 -40695 -51934 -37424 -4915 -6299 -11320 -12676 -4077 -3484 -6162
12766 -6162 -30688 -39422 -21053 -15462 -1314 1302 205 7861 16030 18074 7295 -9624 -44421
12753 -44421 -38422 -7650 6062 15536 3806 -21444 -24926 -17833 -11182 -19432 -17385 -3564 -4931
12740 -4931 465 13757 14947 -13031 -11337 -19030 -13014 -15417 -7016 -11361 -18474 -22418 -12735 -9920
12726 -9920 -17313 -8541 2180 -1557 -3806 -5499 -11761 -34187 -26591 -14311 -20336 -30251 -17286 -10823
12712 -10823 -16845 -26075 -15621 -36947 -64375 -71890 -41810 -23643 -16996 -14910 -9802 -14715 -479
12699 -479 8305 -2296 -19498 -13381 -9159 1465 7326 -7852 -22142 -33315 -47940 -44506 -25470
12686 -25470 -21227 -1011 8175 15620 8258 -18737 -29480 -20795 -15992 -12592 713 -4982 -25560
12673 -25560 -32385 -21684 -16158 7329 7016 2261 -8663 -13021 -6959 6161 10903 -2309 3668
12660 3668 9324 -1885 -4597 1440 21601 23414 5753 22763 24364 23239 4555 -7198 -11506
12647 -11506 -23131 -21898 -2683 4800 2738 3044 19350 21736 9926 -17984 -25288 -29850 -36723
12634 -36723 -23303 -24488 336 6067 10185 -1123 -21916 -31658 -28022 7191 50805 46110 9853
12621 9853 -4952 -4625 4678 -7039 -203 -2196 -3312 -3543 -1793 16402 3146 -24072 -27231 -13420
12607 -13420 -6944 7899 9341 16287 1781 -11324 -25330 -20649 -30182 -26914 -25003 -8799 -4896
12594 -4896 -21573 -15445 -19892 -26941 -175 -1345 -5587 12309 15292 4714 12443 36575 36302 23621
12580 23621 13526 19413 -840 -3773 4572 3184 -5521 7143 -12759 -26252 -52281 -65630 -57961
12567 -57961 -51534 -20166 3346 15304 10865 17406 18151 -2938 -20767 -21698 -25572 -18824 -4195
12554 -4195 20454 13272 3554 7942 -6210 -11575 -2001 8348 -6888 -34656 -40559 -34351 -30572
12541 -30572 -30661 -23080 -18438 -342 17898 32494 28651 1208 -12738 -33190 -29111 -23444 -8027
12528 -8027 -3548 -5098 249 3023 3563 1266 -3973 -9406 -15073 -25100 -40572 -28728 -12994 -17665
12514 -17665 -23889 -23074 -22372 -20597 -23933 -14225 18230 29676 18362 16088 6285 -6449 -15886 -20803
12500 -20803 -18410 -13178 -12439 -9633 7345 11277 7980 10857 11066 -1627 -4685 -22247 -7498 13502
12486 13502 9988 -12490 -23509 -13058 5816 8584 -2554 -15101 -6974 2868 -2368 -24435 -41893
12473 -41893 -25819 -1550 1686 21656 24014 7705 -920 -14852 -32173 -37974 -20711 12854
12461 12854 34542 35454 44299 24194 6099 7381 568 -20663 -4999 2100 1385 6875 8113 13935
12447 13935 -861 -4439 -14175 -13729 -6761 -14168 -25274 -11574 -6757 2268 9741 1176 -24044 -22323
12433 -22323 -21573 -12241 -6414 -10291 -2709 9886 2725 2750 14299 14585 2949 6049 27319 31298
12419 31298 12679 -5829 4862 15716 22595 29291 19993 3691 -16940 -9459 -11595 -15883 -16018
12406 -16018 -14089 -10198 -5737 2073 20935 20268 13155 18206 17402 2909 -17019 -38722 -49785 -46272
12392 -46272 -12979 17109 11037 8084 20742 25566 7131 -6269 13590 20074 9856 26064
12380 26064 28055 11647 -2260 -19819 -26160 -14165 -10162 -19783 -21494 -10342 12442 13540 8674
12367 8674 8696 13432 17175 17567 -1160 -14225 -16099 1919 13954 22502 32287 17157 13888 27635
12353 27635 25564 4993 -25985 -29731 11195 12424 8580 8386 14917 10684 -1991 -25628 -21864
12340 -21864 -11345 5786 16087 6167 1410 -9463 -18010 -6121 -1185 -11133 -22409 -40956 -34469
12327 -34469 -22887 -14763 -7000 -4830 -5396 -19655 -12190 -12474 5766 14141 5554 249 -1598 -19551
12313 -19551 -26678 -26326 -34321 -25147 -14988 -6791 -7470 -2192 4253 -8385 -11625 -3106 4064 9664
12299 9664 10467 13696 10528 -3145 -5797 -12005 -28717 -31866 -11725 -6943 -11440 -6333 -14016 -26288
12285 -26288 -29560 -11359 -9357 -16568 -10900 -26046 -39477 -38359 -28434 -8133 -7782 -22862 -12582
12272 -12582 9876 3575 -3217 1831 30721 42452 8102 -19781 -7293 9712 -1568 3083
12260 3083 4023 -12330 -1476 -16744 -23254 -27279 -30436 4599 22621 18435 12562 11756 13013 6394
12246 6394 6765 11183 6902 15428 -4295 -5894 -18214 -20156 -1729 13439 19929 30759 28747 27040
12232 27040 37648 11736 -5676 -1094 -5632 -12490 -10468 -5830 -16120 -23991 -8754 -5933 -8786
12219 -8786 2567 8609 753 9687 -10458 -11398 -5782 121 14434 9527 19203 10363 -13696 783
12205 783 6119 -12471 -13363 -4983 -14158 -28953 -21805 -16794 -3541 -9136 -19502 -21243 -30374 -18374
12191 -18374 -5517 -15421 -12823 -10375 -16350 -5505 -10590 -16998 -4926 -13766 -6196 13134 25896
12178 25896 9978 1914 21840 26852 18534 26542 17201 5042 -2528 20 12585 28437 22780
12165 22780 582 -7408 -8110 -3618 -17437 -26554 -31640 -20557 -21828 -43150 -37642 -16332 -26937
12152 -26937 -26201 -22228 -24900 -33398 -19256 -6599 1659 3427 1128 11647 6140 -1489 -2235 -9305
12138 -9305 -19816 -14077 -25184 -39835 -32897 -25277 -26542 -30074 -26841 -462 15629 4371 -23955
12125 -23955 -42686 -41681 -35023 -40049 -28690 -12230 -2772 -1607 11079 14101 16676 -11281 -17535
12112 -17535 -14634 -14535 5746 9766 -584 -13389 -17891 -16121 322 15577 15683 15165 -7795 -23437
12098 -23437 -13493 -4628 -10685 -16955 -25126 -19381 -5132 -15216 -29537 -46457 -48161 -14463 -9317
12085 -9317 -8419 9840 6437 341 -11819 -31659 -25533 -13003 -3604 -14241 -25776 -12218 10682
12072 10682 29878 37089 26418 3347 9880 18069 18760 32364 34818 27363 1985 -19396 -33469
12059 -33469 -25314 -22301 -26452 -6926 -4737 -81 5318 10274 12625 35580 51686 34511 31020
12046 31020 24066 860 2150 4490 8903 7412 1011 5251 9696 -16358 -28964 -23651 -18535 -7789
12032 -7789 -8175 -3033 -4423 7815 2198 -839 -996 -7706 -20792 1854 21795 19752 10620 6380
12018 6380 -8273 -35446 -28146 -6325 2291 442 8705 -4562 7120 4335 -6016 -16300 -22744
12005 -22744 -22115 -17055 -11406 -9198 -9106 -17420 6229 21982 11981 -9339 -22691 -20769 -12771 -16323
11991 -16323 -19941 -19556 -28456 -33768 -26942 -22642 -10181 -9952 -9402 -5853 -21009 -27224 1286 -992
11977 -992 -17696 -21573 -20657 -9649 -11329 -1212 3466 -11715 -17986 -12084 -19461 -16972 509 9131
11963 9131 -198 -11157 -6086 7768 2215 -1972 3370 -10930 -14993 -6597 4246 -5660 3694 -2844
11949 -2844 -16198 -4248 3917 -14299 -19359 -14408 -16761 -13258 -14167 -12994 -21464 -20503 -14109 1074
11935 1074 6868 -7746 -20833 -10408 -6923 5063 14029 23832 10029 -3970 -2109 -6409 -9676
11922 -9676 -13699 -5397 -6159 -13722 -19474 -8059 -3573 -5432 -9991 124 1739 -27431 -38656 -47909
11908 -47909 -31525 -20363 -23032 -11879 1968 -750 5093 4157 4895 13640 23050 18414 12961 7004
11894 7004 8267 8011 5456 15761 30946 34464 20300 5201 -13815 -4110 14326 17703 25084
11881 25084 26176 27797 18010 1121 -1431 9902 23097 26575 19454 18303 21823 16484 8570 -4406
11867 -4406 -5206 -1839 -6896 -4764 -422 -9320 -16578 -24306 -21418 -16061 315 8494 26072 26900 16646
11852 16646 5015 -8204 -5070 -1653 8050 -7084 -13779 -9272 -1818 6614 5429 2996 11836 7665
11838 7665 -1937 -1659 -1535 -7822 3025 17760 10912 -4259 -19824 -24466 -18706 -13951 -11771 -15101
11824 -15101 -22207 -14717 4344 4803 5115 474 11331 8858 -4172 2381 17210 5279 -11697
11811 -11697 -31825 -33836 -25860 -26194 -3480 1632 -8268 -16040 -5282 -1870 14038 30255 23518
11798 23518 2105 -8058 -9881 -26470 -28956 -30292 -30419 -31747 -25300 -28707 -48448 -16153 -10472
11785 -10472 -7092 10609 -499 -23205 -41001 -40624 -37815 -48172 -25097 -19452 -9932 -9660 -25388
11772 -25388 -22202 -1402 6807 -6965 -9718 -11406 -10647 -17464 -23798 -23759 -12598 -3137 -3011 -20785
11758 -20785 -24826 -19550 -20242 -10512 10800 25154 19158 6108 14499 18655 -6442 -23833 -15400
11745 -15400 -8734 -9208 -831 -4286 -5779 -6379 -7895 -267 -2587 -12408 1559 7845 15177 17372 17775
11730 17775 16244 21836 2741 3839 12080 5063 10991 2977 266 2226 -5898 -2836 -10674 -11757
11716 -11757 -1959 2838 2747 -13146 -12923 -368 2140 -2832 -18592 -27593 3417 10312 15004 31673
11702 31673 40382 32011 16003 8393 -8183 -17190 -3738 12918 20893 18531 6038 3832 -497
11689 -497 -13342 -13708 -3458 -4915 9810 28042 18046 16778 24356 30869 10805 8496 8764 -3212
11675 -3212 11467 11731 18237 8099 -13816 -21516 -12627 -14475 -2856 22683 17861 10541 -10432
11662 -10432 -35914 -34976 -27952 -23509 -18141 -2437 21119 32007 43273 37761 46206 28455 6456
11649 6456 -18312 -29995 -13182 -15611 -21602 -31765 -30044 -25678 -34617 -41314 -46593 -36031 -44149
11636 -44149 -42389 -31340 -17210 -13459 1693 17862 25824 13567 -547 -9538 -5327 -10905 -26106
11623 -26106 -22975 3282 13332 1742 12378 27887 10032 2286 -11991 9792 13590 4588
11611 4588 2791 8365 18051 21597 13025 4418 25352 23280 11184 6425 -2867 -4400 -8918 8497
11597 8497 27549 29097 17139 -1360 5462 14954 32019 40624 27168 11124 -5170 1991 14557
11584 14557 3111 -23555 -34630 -35715 -26419 -9172 -4594 980 6986 -4519 -3580 -3767 8168
11571 8168 3802 15432 9794 3172 -21217 -32224 -27235 -35308 -51596 -23993 -21056 -21863 13232
11558 13232 946 -15527 -15263 -27423 -15787 -16353 -10175 -7338 -2947 -7335 -29880 -43262 -41368
11545 -41368 -28276 -28572 -14066 4726 19076 19926 -1492 152 -1389 2845 -9473 -18148 -11538
11532 -11538 -14538 -35025 -21814 1676 -2871 -5559 10081 17832 -6708 -18335 -12128 6589 -1590
11519 -1590 -28104 -43655 -31524 -18585 -6276 18044 26587 25726 23937 8678 7703 -14786 -16600
11506 -16600 -26834 -25489 1400 1637 9662 15647 13231 323 -16156 -27347 -12950 -5004 -10932
11493 -10932 1400 24735 16772 18310 3795 -21699 -5407 15349 41518 72092 65916 48984
11481 48984 29917 14582 12558 -10171 -28297 -13673 -20757 -8747 14204 18411 39101 34993
11469 34993 16509 23431 21724 14444 4956 -20514 -18390 -5831 27359 43664 36087 25926 13377
11456 13377 8288 8900 1224 -2350 -8487 -3305 7235 14761 6495 6527 36926 30855 28334 38616
11442 38616 27202 3812 -11450 -21082 -19709 -16887 -19997 -2307 -2160 2839 29682 34262 32090
11429 32090 24424 35858 4775 -20362 -23872 -4448 15781 21041 -5272 -10617 16688 30144
11417 30144 27306 19955 4957 -19485 -11454 5217 5596 -2883 -6796 5477 17964 16836 16673 12736
11403 12736 -2595 -10273 -29106 -36149 -21061 -4265 12285 25587 9095 -4727 9625 10310
11391 10310 18526 8449 -4382 -16983 -6732 16956 11490 17821 18801 -10018 -16255 2302 15320
11378 15320 14076 -299 -3042 748 12504 39438 44183 46347 18016 3242 7028 -778 -10274
11365 -10274 -30318 -34317 -5417 5215 305 4278 9887 -4281 -17551 -12586 -13394 -3865 1149
11352 1149 -1109 9632 21656 20492 2340 -13835 -1004 19109 21381 10321 2177 2930 71
11339 71 -15166 -2183 15323 18722 3619 -13000 -19303 -12368 -18271 -20014 -3026 6637 13799 26165
11325 26165 30915 5815 -18362 -27969 -23375 -24800 -22540 -7950 12525 8963 -2733 -19562 -22688
11312 -22688 -31622 -18542 -5296 -2260 6798 -4437 -9039 -13859 -13413 -28197 -33021 -24400 -20602 -24013
11298 -24013 -28838 -20361 -5511 -16204 -18911 -6967 11658 18203 20299 36401 43467 26599 25590
11285 25590 -5226 -17027 -19823 -19225 633 7719 11250 -2599 9017 625 -2353 13277 17085
11272 17085 1147 3809 15099 18163 9769 -1946 -10057 -8767 12238 31029 21880 20007 -1075
11259 -1075 -3492 -9158 7519 18529 21311 24963 37854 30755 15761 15548 -7388 -12776 -11095 4237
11245 4237 11521 12041 17138 17607 29167 26376 8811 8719 -3605 -11152 -19297 -12826 -17084 -12646 -4202
11230 -4202 16779 13505 -7348 -12941 -12477 -4814 1505 2191 -11185 -15938 -26216 -27287 -14747 -6240
11216 -6240 3186 7147 6335 6941 -467 -1001 -12049 256 15591 -5029 -26330 -6102 6553 -14633
11202 -14633 -5541 14230 11686 -3784 -19188 -13488 8092 7588 -15947 -3911 6581 18736 23966
11189 23966 11364 829 -1567 11750 7104 -11547 -14215 -8362 5966 15150 10852 29666 15120
11176 15120 12001 15380 -4521 -16320 -7356 4519 20814 15861 12992 12355 9904 3094 -3721 -12039
11162 -12039 -3915 -17068 -26651 -18713 9299 9340 -8736 -15565 -29781 -22248 -25632 -18520 -1367 -26549
11148 -26549 -49883 -34813 -32514 -27849 -23741 -24052 -33346 -46489 -43581 -59838 -56431 -38661 -9076
11135 -9076 -4134 -17093 -19060 -41354 -37851 -13152 -6728 -7543 564 7483 -20009 -17396 -23310 -23545
11121 -23545 -13354 -5594 5364 -340 -5527 13168 44938 50006 37825 18486 18419 8940 11253
11108 11253 -3260 -18411 -28351 -20694 -9105 -17292 -8379 -2538 -7670 -19684 -33675 -23711 -4515
11095 -4515 -5183 -10265 -5854 -13240 -18652 -13158 -7633 -6020 -9156 -24323 -30644 -38768 -41278 -27479
11081 -27479 -37936 -28605 -27493 -29037 -14720 -5274 2221 -10132 -21405 -19054 17697 39287 25409
11068 25409 10346 -9338 -7248 7626 3471 5933 8707 20134 1203 -2794 -13624 -15897 4872
11055 4872 6762 5638 9237 17146 13770 -8056 2506 17393 14135 11473 13339 631 -9326 -18363
11041 -18363 -13080 -18267 -25182 -21750 -451 4843 -21963 -38649 -23927 -11161 -11606 -1895 1202
11028 1202 13964 32673 16693 6555 -11205 -9388 9072 10522 2139 -13814 -21123 -7618 -13264
11015 -13264 -12255 1296 -3478 -4993 4507 9778 -19548 -30589 -31643 -34983 -30923 -26737 -35516 -45318
11001 -45318 -51633 -35651 2909 45100 34962 22239 40291 53737 36286 25412 16075 17782
10989 17782 17534 23197 41275 18452 -9633 -26106 -15431 7568 -1603 -9621 -11112 -16248 -10228
10976 -10228 4289 4459 -6377 -9774 -3427 -15789 -28128 -29771 -8835 21492 21526 2617 -16825
10963 -16825 -19803 -3145 9633 15270 -7595 -30592 -49661 -54596 -25229 -11295 -2343 6700 -22281
10950 -22281 -25297 -21718 335 22031 17801 709 -1911 9439 3255 -8233 -15707 -24031 -5696
10937 -5696 -15350 -28769 -25472 -26408 -20862 -26654 -44209 -42315 -27774 6454 1519 982 -9576 -2789
10923 -2789 -3054 -10464 1436 -8737 -11824 -6560 -8992 -4331 3934 10713 -9446 -11182 -13750 -13461
10909 -13461 5250 5924 2877 -4920 -3444 -3336 -16852 -20022 -31236 -18614 -12365 6906 32961
10896 32961 31559 4958 -20867 -33429 -17278 1115 15081 21744 19064 9228 1315 -844 724
10883 724 15092 22270 2458 -16784 -12527 -16005 -933 -10369 -6303 19018 24399 31637 28619 27396
10869 27396 23937 6540 -11875 -20153 -15913 -713 2255 19495 25212 11436 2892 -9073 -14144
10856 -14144 -15922 -14424 -14971 15508 22533 7536 14738 407 -12958 -6466 2338 -2354 7002 7539
10842 7539 16724 17130 13359 3153 -1872 682 7674 21154 3795 -11263 -23797 -15844 11989
10829 11989 22207 1569 -12815 -799 7160 5771 -6695 -4288 -932 -8109 -21987 -33234 -21324
10816 -21324 -16101 -30571 -38583 -34350 -29363 -25924 -13881 3139 18701 12207 -3177 5992 10267
10803 10267 4566 7573 -3521 -8890 -7153 -9051 -13353 -18437 -15538 203 3355 -11283 -5623 -1147
10789 -1147 15327 22442 6179 -9518 -3842 9655 12540 12918 9750 13238 20687 1705 -16391
10776 -16391 -29864 -14350 14927 23111 24753 42637 32790 17360 -1489 -3238 1119 -253 -1569
10763 -1569 934 11274 12412 10684 22939 20056 28658 29834 16217 11521 9181 13548 -5579 -15979
10749 -15979 -26525 -15341 8031 -3648 -31257 -31093 -16149 -11618 -4779 3455 10189 12298 9881
10736 9881 -1611 -9496 -7870 5113 4354 5136 8356 10435 27782 34436 42866 47470 28001 13092
10722 13092 8388 4150 6345 10334 4480 -2029 -8419 -2105 13954 12280 -301 -8526 -15818 -11717
10708 -11717 3742 -12349 -31856 -34565 -32873 -23393 -14896 -5668 2953 -6236 -16114 -18902 -31258
10695 -31258 -27340 -35998 -33196 -9379 1071 -27317 -45866 -24358 -6975 -8258 -25105 -25282 -18863
10682 -18863 -4049 15578 8770 -2002 -17548 -22412 -1983 9941 26937 35202 37587 36975 43552
10669 43552 42226 25167 7789 -3578 -734 -2007 -12299 -7967 10346 18767 1281 -17817 -25247
10656 -25247 -22217 -25428 4574 26469 34915 17236 21604 23613 9376 -5522 -13898 -24015 -17236
10643 -17236 -11402 20620 31916 29242 7896 -5339 5321 4323 14084 15568 13583 7072 2183
10630 2183 -1244 -5926 8214 19398 50546 48190 18196 2132 17084 30570 25017 15031 11575
10617 11575 -5631 801 12136 17873 23736 12548 5937 9599 7469 -1443 16368 37151 37519
10604 37519 27062 24329 30308 26605 32484 21080 4356 7864 2155 -1278 12944 17416 -15363
10591 -15363 -17129 -8448 15618 21328 15138 -3468 -11632 -5207 -12255 -16799 -22911 -13113 6718 17294
10577 17294 16225 -2341 -23071 -22993 -22532 -26382 -51880 -39911 -16870 -10564 -17812 -9154 20134 13943
10563 13943 -4694 -8075 4803 -13042 -23872 -37600 -38021 -15483 -5555 -3754 4043 -64 861
10550 861 15119 21464 12827 8298 448 415 23082 31525 19592 13406 9686 12013 23777 17825
10536 17825 7567 12400 15657 8562 4515 13366 7321 -17231 -17988 -8931 -1694 1145 13096 9394
10522 9394 4099 12808 15072 12047 -2354 -3738 -10907 -30069 -28266 -5350 6748 -1856 -4750 3092
10508 3092 -8543 -2718 -12056 -23005 -24246 -28821 -25616 -16838 -8375 -11859 -16798 -26572 -5527 10218
10494 10218 14728 9190 -671 -739 -12326 -3220 -2209 -6818 1891 -3279 11306 28032 25592 25058
10480 25058 11051 -3662 -12608 -2478 -801 15607 22072 34030 27363 14353 -13405 -34634
10468 -34634 -32550 -11997 800 12404 5450 -2486 -7536 -16531 -12670 -14269 -32975 -16049 -16269
10455 -16269 -16798 -13182 -17153 2565 -11755 -23253 -9226 15087 17133 -7468 -16447 -3691 -14079
10442 -14079 -22415 1340 13020 15772 226 -13687 -4822 -11474 -13353 -19317 -21719 -30760 -10493
10429 -10493 14467 -8338 -19785 -22231 -27081 -10216 12668 7395 -1293 -9047 -16889 -19047 -19110 3325
10415 3325 -9815 -40148 -30221 -30607 -42655 -41729 -24189 -4767 949 2621 -6040 -16297 3393
10402 3393 -4398 -22188 -14118 -10191 7663 -6604 -7496 -6818 -11018 8110 15760 878 -15130 -5207
10388 -5207 -113 13309 10928 -1271 -2721 14994 20160 21348 16533 11367 2384 1703 25454 33212
10374 33212 22759 14050 1999 20502 25061 12802 -2174 570 -9198 -10908 -2300 5221 -10472
10361 -10472 409 7621 35152 1172 -19744 -7611 -32141 -28327 -20112 -32897 -49396 -39498
10349 -39498 -14873 -2342 1989 9667 14173 9105 -6760 -23231 -19767 -13527 -22141 -5264 -4423
10336 -4423 -3953 -2203 -1549 -9110 9045 20410 28063 -4791 -7206 -4852 -10520 -7919 18082 26602
10322 26602 -6738 -24903 -20305 -21702 -17247 -12930 -11782 7829 6888 11221 15735 35047 53551
10309 53551 53458 49601 29893 24911 28600 24948 6723 10153 11126 12369 6410 -6420 -9239 16067
10295 16067 16824 12983 22228 21634 21665 11839 16332 36111 20074 12796 23807 24248 17348 -494 -9919
10280 -9919 -8270 7442 15259 11074 16303 4331 -16864 -20992 -3836 6634 15358 22713 15607
10267 15607 22874 15278 6229 14799 24779 25722 27172 13490 2581 2946 12940 28809 23123 9431
10253 9431 11 -7144 9052 33928 31383 37992 36580 35358 27961 18225 13960 20811 40272 34777
10239 34777 23885 25375 31892 20223 1659 -1567 -2394 -3885 11373 30884 33352 30689 22524
10226 22524 7174 -2048 -8121 15649 16253 18426 23357 23560 10031 6720 14724 15298 4183 2638
10212 2638 18410 31556 22944 8664 -13844 -20494 2493 26847 30067 25464 3190 -14927 -11282
10199 -11282 -19959 -14103 -908 7008 -10647 -5931 4039 10749 2139 -19666 -11253 5170 14552
10186 14552 28436 23887 3267 -15218 -14416 -236 -9199 -13067 -24054 -32881 -28451 -14518 -21155
10173 -21155 -18210 -27034 -33541 -28433 -25069 -11908 -16179 -16585 -12176 -15560 -16781 -13895 1764 24328
10159 24328 26344 18241 -6400 4194 8180 5185 -5424 59 4842 -978 -4001 6794 5811 4366
10145 4366 -8605 -11762 -3772 12041 20051 24685 9994 3301 542 10039 11381 -4635 -4043 248
10131 248 11279 12031 -1337 -9219 -7947 -874 -8732 -30161 -11356 -6986 -1614 -3734 -10611 11356
10117 11356 3728 -15558 -25371 -12079 -13119 -14690 -3618 11463 26053 27236 6913 25052 31176
10104 31176 29076 20859 6766 23915 27750 31664 39406 32606 24542 33883 40160 29932 14872
10091 14872 19084 43654 49558 38945 26408 19628 14102 6675 -9849 -13838 -9046 5782 26280
10078 26280 10243 -14553 -20104 2421 -7279 -18055 -21562 -11048 -1513 9251 33924 32684 28885
10065 28885 39407 34843 37366 33910 19818 8227 -672 6152 9395 32183 33171 35488 32512 24595
10051 24595 3301 8503 17954 11179 -2867 -11868 -10217 -2579 -6881 -7641 -19172 -220 -1355 7008
10037 7008 29371 14150 1216 -2403 12269 26285 27819 22961 22044 31404 19332 8035 -940
10024 -940 -1671 -7127 2298 4637 -1361 6236 20406 28112 5765 1241 41094 55009 52564 40018
10010 40018 32072 6137 -15014 -24719 -6532 7059 5199 13224 8092 14479 32693 26737 13981
9997 13981 12784 13202 10684 16587 29754 31154 43658 52739 34326 17626 10413 14987 23109 26852
9983 26852 15491 -2431 -10889 13898 25265 32056 49882 44688 30007 33969 30138 13772 -2328
9970 -2328 -12889 -4261 -3591 15770 40740 45675 23705 12470 903 -1054 3572 21512 22339 11152
9956 11152 -15893 -24680 -13387 5418 19283 9163 14749 35683 23009 -7833 -16591 -4269
9944 -4269 -2227 -4986 1990 -5419 -5575 12245 18667 9799 2332 4889 -5569 1095 5354 -8685
9930 -8685 -5116 12186 32213 22920 -2268 -10937 8902 7661 5666 7913 18353 24064 6046
9917 6046 -21287 -8407 -2646 -4377 13071 30798 30945 35222 22961 25077 21769 26451 29679 28189
9903 28189 18596 16395 10599 25116 33142 33971 12365 4943 2582 20355 25186 26354 8914 4258
9889 4258 4678 -5814 -16942 -14899 -17165 -5142 28530 39455 32863 15650 19945 32698 33718
9876 33718 30505 22965 29999 28724 11418 -3846 -5706 855 11246 24323 20764 21932 34938
9863 34938 52498 41780 32613 5868 3703 9312 16271 23578 33010 26815 8499 6986 12523 4018
9849 4018 -13230 -13416 -3988 17061 14419 18605 10203 -3788 19684 24899 27479 25383 15659 23988
9835 23988 47970 47495 28453 21380 21764 27132 61916 58045 20381 -5851 -16206 -10039 -2746 10405
9821 10405 19243 19133 17781 20013 17113 30726 45610 39648 26194 21030 15603 7678 4777 4299
9807 4299 3475 3099 13546 23219 30758 31587 45449 54227 44314 27191 7549 6687 -11656 876
9793 876 12364 16757 21597 12786 5503 -10453 4759 19845 44750 51748 51540 46183 13420 2076
9779 2076 16076 3982 -5191 4300 -2401 -8934 -5055 -2033 -6699 1104 17958 24409 16748 1881
9765 1881 -8809 -19462 -16496 5655 14904 15366 6706 8682 -445 93 18417 29619 24701 23233
9751 23233 27515 37874 53458 49237 31235 14082 1765 19432 29179 13632 30586 36888 32076
9738 32076 43067 58584 49682 45601 26714 20353 7521 -984 -862 1380 -11944 -3413 3704 -8795
9724 -8795 -7062 11962 25699 23793 18613 26035 23238 2852 -6925 -11787 -11006 -2245 6722 27189
9710 27189 27563 49880 63544 65582 50470 29530 38572 54020 56331 43259 43328 37326 23568 22694
9696 22694 29252 19895 7849 -1441 2867 20123 26709 29780 19917 9390 4037 24249 20240 9558
9682 9558 13121 15497 11750 29675 59429 52828 63547 84915 77319 33079 28199 1816 -1807
9669 -1807 34828 59260 58482 54116 47954 29803 24057 9461 17751 27089 25116 26652 22757 16636
9655 16636 22399 29035 6088 15121 36111 35878 38505 48269 34654 8072 15008 21414 21317 11833
9641 11833 1388 3742 3885 135 -7603 -1048 14109 21788 23431 26964 38427 30265 16718 17060
9627 17060 20056 10936 12910 20069 27897 37074 27222 30814 30751 35186 26978 39297 42192 54384 57971
9612 57971 81699 78639 65059 60930 38111 33890 29906 30696 30828 20356 12640 -611 14947 17862
9598 17862 18510 7166 12364 30424 17834 9959 14286 682 -273 18164 18194 10320 7737 35853
9584 35853 65728 67129 42427 51184 58793 45354 26204 29681 33055 30491 21637 50730 72392
9571 72392 59704 71417 79366 77598 61045 53887 53428 59074 37889 18841 42558 55532 40092
9558 40092 19334 29205 50882 54240 52648 41203 33284 22139 -4726 -6519 13492 28210 15676
9545 15676 20386 28282 33231 46663 62149 58511 45818 47213 42834 34743 37464 39987 38363 52201
9531 52201 63848 74311 76837 80613 70186 56628 43651 21015 7635 13007 18338 27045 44113
9518 44113 54836 44012 25084 32800 29387 24940 18898 21940 12578 19781 16800 28018 30232 37895
9504 37895 35499 28574 14940 6541 22003 18411 24261 33413 31377 43688 36701 57729 63697 58411
9490 58411 40983 14233 26260 44269 53764 20922 2226 24285 25109 22721 18507 28371 31152
9477 31152 38456 45610 29565 25797 29760 22269 10606 8584 11493 13437 27475 29478 16264 22208
9463 22208 18938 21071 20434 32478 59397 65938 60777 50947 49790 49719 41555 50357 54011 74715 64817
9448 64817 35547 27924 21436 5629 2033 30363 33655 18346 2398 8095 14738 11176 12403
9435 12403 6049 -8148 -5807 30260 52797 42735 29375 14754 18823 31941 20352 29644 51377
9422 51377 55695 40889 40007 62004 51143 54186 49282 28816 15587 18441 34817 25026 26351
9409 26351 29093 36038 37481 31030 32210 29538 41724 36421 37302 34658 29474 15075 -1951 4565
9395 4565 17672 30808 16671 -58 -4238 -1996 14405 33845 29573 43573 43405 25684 17421
9382 17421 13401 7741 4575 10956 22400 20846 24021 19147 25319 11946 -5893 -10692 -24851 -25876
9368 -25876 -14109 -5357 1436 18938 24480 29334 29979 41870 51566 32021 22005 12195 14230 21580
9354 21580 43438 61364 82006 74757 77441 67729 76150 75258 72085 64420 64748 59236 38964 41175
9340 41175 42168 55439 61054 57396 42512 34673 35432 35727 48123 47682 42201 52800 39746 41414
9326 41414 57900 56874 56843 58548 58368 63728 61676 47608 60096 82026 100205 105414 93546 82626
9312 82626 93516 82944 60276 47687 54004 50591 27129 21692 37340 46637 31510 15128 7295
9299 7295 26024 48528 43116 55009 59527 54628 65046 64387 57915 54988 41512 48067 56032 64761
9285 64761 74516 83175 78579 62883 67510 71996 66294 69740 68028 81074 77146 73474 60323 60666
9271 60666 56166 50957 45787 27778 27133 54525 58734 54936 42459 63742 56658 59213 64900 61034
9257 61034 62422 52445 45745 41862 30513 45748 64213 52011 34801 42791 37722 25176 36689
9244 36689 12481 7748 37462 47982 47844 31723 25205 44966 55253 78461 60871 42915 54403
9231 54403 66276 62575 49730 27108 27882 50622 37291 39739 52486 82428 79034 55322 45201
9218 45201 40309 33498 22012 671 4784 13734 33102 47350 35684 21997 32415 38512 40427
9205 40427 58294 57895 62220 65565 58704 50837 25237 25136 21957 25824 38820 32743 36520 36763 51069
9190 51069 68572 69433 67122 58040 39832 43384 56051 63032 77437 67526 67516 89668 92281 98349
9176 98349 102652 79378 70193 67047 68165 59804 41434 45839 72006 93364 123618 120640 72244
9163 72244 66468 73490 87139 97784 94138 97440 114141 102912 87942 99166 105254 94076 68324
9150 68324 76175 96353 102203 97316 103972 102582 84455 87769 90050 89205 97182 107054 99254 77237
9136 77237 70926 79880 80623 103438 126380 134048 124948 99459 80838 52456 57809 80970 108904
9123 108904 106808 100437 103487 104372 113618 104628 77667 80692 89796 85091 117384 140212 127019 114712
9109 114712 123504 124621 118533 107219 99376 86295 83908 87776 103783 109170 122259 129752 137818
9096 137818 137803 135202 132272 119783 135092 145816 131090 131001 126410 118217 119797 134419 139228 151396
9082 151396 170311 180111 175816 177139 184272 201171 221807 229867 249462 241034 261196 279851 286132
9069 286132 289784 329356 371489 405236 466495 572664 656933 779970 959931 1240869 1720042
9058 1720042 2580071 4159499 6600184 9028572 10737413 12472880 13154436 9064132 5357469
9049 5357469 3642090 2774314 2247412 1920708 1687766 1510762 1379116 1258133 1174424 1102681
9039 1102681 1044892 1007973 965887 914429 879252 839306 821238 774174 736469 708508 693955
9028 693955 682726 672753 663816 645885 634121 614269 607668 616371 614648 607041 608187 611761 593128
9015 593128 593495 606904 592556 565802 518116 476714 458536 440809 419390 395870 388276 398825
9003 398825 403917 398386 383125 387306 364529 351449 347923 350582 348261 340166 339388 323568 332849 329216
8989 329216 312998 302398 306744 307822 304488 299102 309515 317468 299625 274791 276570 291356 322804
8976 322804 355660 365923 355732 363678 360554 362521 387442 395461 422124 439246 433242 413377 393204
8963 393204 374288 350931 327150 306209 291502 307985 304537 285254 286199 279170 275141 269729 275544
8950 275544 253119 226676 219304 226656 248258 262591 260809 258989 260796 251942 235557 237728 248868
8937 248868 250421 238716 247570 253386 247365 255573 252311 260992 281111 280943 282263 281501 277450 293415
8923 293415 301200 314982 325931 344945 382590 394041 383071 355015 317951 276193 273292 270393
8911 270393 269725 248510 257403 269087 281962 302629 311460 292634 269547 246153 242408 267197 263125
8898 263125 264462 266340 269680 256904 253168 268468 255043 243028 234699 233310 243719 252601 243059
8885 243059 237982 237061 248663 238723 223378 243669 265994 282314 276218 270445 279802 312292 313897
8872 313897 321118 315281 296903 288024 276025 275883 278241 294657 309999 320984 323077 305572 288720
8859 288720 280130 280481 280535 272781 270961 264483 258056 249380 260929 281862 293794 288092 275068 259441
8845 259441 285980 301532 276765 246917 230578 215250 224339 226535 228824 236386 249377 268049
8833 268049 291924 305650 329861 349567 358298 364651 364345 359845 362555 362694 354891 337041 324293
8820 324293 318411 338462 357753 361398 352812 353032 335707 332312 342343 351060 353782 341740 344563
8807 344563 355439 361011 356859 335765 343649 345754 337235 356935 371674 369904 365239 371819 379339
8794 379339 386474 404146 410224 433413 463599 508674 539935 565754 618324 661803 672480 691895
8782 691895 722063 753265 783681 809212 847969 882703 917287 966994 1040191 1106269 1177843 1267091
8770 1267091 1376596 1497768 1593170 1656286 1672053 1639409 1570661 1487693 1366000 1247508 1148201
8759 1148201 1073375 1042532 1069414 1172035 1306652 1446738 1563088 1655472 1662196 1549894 1379666
8748 1379666 1233714 1144072 1079640 1023992 979975 989125 1014916 1054901 1079203 1160542 1268620
8737 1268620 1397073 1568870 1765671 1993350 2220494 2455903 2700911 2964409 3225406 3437866
8727 3437866 3600096 3703033 3732559 3677784 3595357 3459374 3279482 3049222 2772690 2480457
8717 2480457 2260159 2103786 2023745 1978625 1948821 1959131 2012565 2124526 2361985 2718473
8707 2718473 3284021 4113713 5153527 6217688 7099910 7673985 7618983 6676297 5379827
8698 5379827 4324085 3611925 3190582 2927419 2781533 2732850 2747448 2814061 2902659 2993195
8688 2993195 3061280 3060382 2998012 2873472 2743713 2638337 2574432 2588410 2665714 2772747 2904896
8677 2904896 3075952 3257478 3433487 3620003 3901435 4371692 5056128 5991318 7073326
8668 7073326 8090908 8909503 9343312 9132376 8257832 7193968 6371481 5882500 5752374
8659 5752374 5932443 6470024 7489841 9162497 11594917 14519195 17270282 19453003 20694342
8650 20694342 19685260 16279432 12750482 10227711 8550474 7406185 6605209 6045995
8642 6045995 5644813 5344195 5155664 5046302 5020084 5080668 5241201 5505412 5838600 6300659
8632 6300659 6935396 7753733 8801242 10070210 11399076 12581510 13367601 13395790 12494275
8623 12494275 11034873 9642013 8652203 8052074 7779627 7738126 7918281 8446281 9420162
8614 9420162 11019154 13501112 16914619 20796939 24380051 27244003 28699649 27272155
8606 27272155 23544896 20301936 18738511 18743863 19724615 20871705 21773356 21970802 20192124
8597 20192124 16612582 13392677 11279120 9945836 9055773 8478130 8111611 7933897 7899234
8588 7899234 8007936 8281838 8694107 9308367 10222607 11449712 13035012 14923607 16738534
8579 16738534 18050312 18692633 18235345 16489465 14197557 12198335 10745969 9718568
8571 9718568 8980312 8501997 8240341 8200929 8369416 8748992 9434976 10594167 12423092
8562 12423092 15257297 19454148 25077771 31224000 36592579 40574323 41901041 37932718
8554 37932718 30200922 23304235 18470103 15192575 12909688 11282329 10096862 9227719
8546 9227719 8590990 8099024 7743186 7494364 7322729 7203612 7118711 7044809 6922366 6763555
8536 6763555 6635146 6594451 6615590 6641190 6661506 6584020 6415813 6310095 6328460 6484016 6777865
8525 6777865 7234040 7953452 9066597 10757836 13253618 16760787 21093836 25433104 28958196
8516 28958196 31133136 30641676 26482736 20767794 16119240 12972193 10889622 9434429
8508 9434429 8396914 7623022 7033802 6589258 6260606 6011623 5832985 5709081 5620524 5585802
8498 5585802 5580710 5607589 5649369 5685153 5691217 5626140 5464945 5247546 5059528 4970183 4971132 5090100
8486 5090100 5328150 5736792 6374150 7283708 8434074 9636864 10672811 11349917 11388811
8477 11388811 10512290 9007815 7545008 6455501 5707996 5144229 4736478 4408626 4155344
8468 4155344 3979346 3835142 3728826 3657237 3638359 3637283 3615437 3603618 3601682 3575990 3519369
8457 3519369 3472349 3437428 3431604 3423298 3418748 3415612 3406027 3402545 3402708 3368433 3358546 3342801 3314189
8444 3314189 3287025 3259741 3260495 3315439 3401605 3520025 3665574 3849783 4091259 4381020 4722312
8433 4722312 5089615 5433246 5765935 6021454 6150620 6130542 5939516 5652313 5325972 5010188
8423 5010188 4757340 4577922 4461291 4407108 4351487 4355945 4394150 4481551 4590292 4714947 4843733
8412 4843733 4976068 5136805 5276887 5429214 5603995 5836856 6140931 6499641 6938496 7469845
8402 7469845 8128379 8919719 9852306 10973822 12282021 13787616 15543263 17547925 19748980
8393 19748980 22106473 24704083 27516019 30351328 33192941 36075038 38989657 42211060
8385 42211060 46315361 52056753 60344550 72168721 88515697 110316383 137925573 170864607
8377 170864607 209377707 253885959 301320434 348373428 395558286 437610818 464327612
8370 464327612 473307116 463199517 430410439 379558465 319692155 258664950 205699787
8363 205699787 165561977 137751951 119130230 106346306 97253913 90706318 86133743
8356 86133743 83091398 81165136 80024063 79199351 78190287 76788996 74867771 72343494
8348 72343494 69535570 66745106 64259259 62293304 60976227 60423618 60635789 61783482
8340 61783482 64282291 68761305 75998712 87076276 103162155 124925943 152027031 182568489
8332 182568489 213706846 242345615 263997520 275476675 279035330 275990503 265321676
8325 265321676 249070210 233370430 218269253 200769183 182742944 164073344 144585736
8318 144585736 129854043 121538748 117065044 114008940 110538631 103995544 93998037 84421178
8310 84421178 77472580 72755215 69529876 67225068 65221987 63129505 60803724 57855383
8302 57855383 54012544 49790700 46059108 43020800 40565548 38434681 36471769 34594310
8294 34594310 32878523 31396374 30096167 28927076 27855403 26869258 25972004 25125484 24331635
8285 24331635 23593957 22915981 22280523 21651665 21033597 20422389 19829682 19245877 18676512
8276 18676512 18132185 17613385 17122923 16634125 16164075 15720687 15277812 14851434 14452224
8267 14452224 14062150 13656318 13271798 12859811 12418839 12007654 11630366 11272890 10941367
8258 10941367 10634598 10335928 10043272 9754780 9461242 9191224 8949949 8708045 8450775
8249 8450775 8199852 7999215 7809546 7628093 7468543 7323944 7171433 7027647 6908377 6777622
8239 6777622 6660844 6534089 6370631 6183287 6027275 5862351 5696067 5529596 5355853 5200544
8229 5200544 5049384 4901317 4762767 4621373 4474290 4324581 4201971 4105620 3963227 3845289
8219 3845289 3742549 3641817 3533128 3449488 3382963 3331791 3273967 3210424 3128263 3054645 2980736
8208 2980736 2912471 2858132 2824591 2813657 2806062 2786831 2740993 2683554 2624158 2543170 2471037 2416654
8196 2416654 2373397 2312229 2250804 2221078 2192582 2177243 2138466 2089557 2054027 2019669 1998014
8185 1998014 1999144 1985177 1961405 1935182 1910718 1882361 1809804 1734667 1658262 1583486 1534937 1494356
8173 1494356 1454498 1416716 1349929 1297973 1248064 1217679 1186359 1150828 1134945 1133012 1136682 1157178
8161 1157178 1209452 1288426 1358126 1402935 1425327 1402793 1320868 1223854 1115518 1032210 978942
8150 978942 933727 938830 921777 911873 910759 909454 904828 934665 936177 919257 908856 881096 845450
8137 845450 815534 803195 810747 796116 782320 758817 747085 743408 736064 730657 725402 726375 727702
8124 727702 718826 713622 704499 690970 677799 661143 678175 693547 704661 713856 721900 732767 754198
8111 754198 749129 728127 685594 645576 621824 583942 553583 538362 506594 486835 479161 471711
8099 471711 461841 479214 514131 528926 537760 520543 501859 503757 504878 492430 489972 487278 461994
8086 461994 437194 414401 395199 390949 386864 385036 399184 416610 427921 428809 426626 415789 403214
8073 403214 396640 380616 338892 326777 317018 292511 293349 289140 275823 272830 281983 294364 302656
8060 302656 293083 270062 244378 254624 267598 245022 246910 257690 264613 266582 291484 302007
8048 302007 278761 261990 271614 264778 261508 260205 285736 276658 250562 248494 249142 255854 255332 256562
8034 256562 271239 271608 261116 229422 223714 230922 234673 222963 219658 199003 190486 200171 196542
8021 196542 198106 207836 207595 220490 236002 235238 236168 252712 265392 291875 326500 315097 276881
8008 276881 232268 204038 177012 169202 193806 187799 193136 211103 214677 223282 228283 232223 230472
7995 230472 231979 241051 262471 273600 292950 305213 291861 272727 273456 297137 313179 319913 350890
7982 350890 405748 460711 540123 664118 848190 1077416 1406624 1826975 2274034 2701717
7972 2701717 3021983 3154315 3022838 2645876 2169380 1705432 1320883 1064711 889994 763427
7962 763427 690271 627648 577515 538589 514031 536103 544365 534868 506342 492193 479219 461762
7950 461762 459554 442477 429603 423399 427919 421922 416893 407041 387535 353499 362288 365141 378538
7937 378538 390997 399508 411472 437084 523945 641702 817864 1059292 1385927 1775551 2175225
7926 2175225 2509251 2692578 2636029 2364311 1973462 1554965 1233562 992434 823716 694966
7916 694966 603547 554434 508927 475234 437976 400542 388562 428331 449502 435193 435224 428526
7904 428526 420976 395725 345669 334877 353774 365865 354367 331557 337639 349490 374461 368829
7892 368829 378105 365614 345440 321023 285771 254325 227326 214217 182468 163612 158450 142193
7880 142193 149789 156705 148005 139111 140446 138834 122890 133885 142745 137359 134369 129938 134183 149657
7866 149657 165281 175028 166928 186714 195615 185010 179345 180017 168049 156619 139103 132416 143198
7853 143198 137944 138897 116104 101598 122145 137902 138056 154746 165774 164110 170226 205554 207093
7840 207093 205271 203160 194719 186773 181266 204343 205521 189658 169734 136496 116651 112198 108530
7827 108530 119097 124258 129580 117597 117286 115665 124182 117023 108957 89959 103689 107889 113510 113505
7813 113505 118836 109757 105858 114860 116026 115899 99778 74406 57039 66361 79497 82591 80516 83922
7799 83922 69026 49239 72771 80260 81366 81555 64801 74443 103727 126402 134818 168872 191656
7786 191656 193726 200470 206900 198328 159397 143633 121880 102500 98332 112093 107042 117435 95711
7773 95711 86534 73192 61384 56242 59400 54255 66258 64616 55450 66634 45062 41459 64519
7760 64519 89079 68569 54288 68903 67837 53002 43305 56850 47717 37922 35239 34053 19050
7747 19050 3472 -284 3994 1145 10535 19395 29298 37191 50687 32853 34306 30468 39938 43130
7733 43130 32330 45141 45817 40858 20278 3828 2805 11289 20546 34137 43408 35748 31875 24319
7719 24319 18165 25162 26169 33183 36792 20201 -3065 -8287 -4004 -5720 5930 22649 32422 24287
7705 24287 11262 1645 4739 -2689 -1559 2455 -4877 -20422 -22145 2749 35462 29765 28732 42302
7691 42302 33666 32655 29141 41077 20542 9172 2628 -12602 -12795 -879 15984 17608 11434
7678 11434 14908 23751 23422 31002 39332 64863 51947 39278 28449 17551 14028 27380 21202
7665 21202 28943 45936 48165 53343 41073 35180 23611 11488 3544 -15473 -8027 -10166 -3282
7652 -3282 -7761 -17303 -8212 26357 49758 52634 53991 42554 35455 30737 19052 23168 37825 25382
7638 25382 3818 7032 21041 37307 37525 28100 17450 18584 24172 21736 16761 15888 -5973 -6815
7624 -6815 8127 18293 9348 5473 -11305 -20854 -11060 20611 17279 24173 29004 33476 27028 35008
7610 35008 24426 29723 30146 21318 24438 13926 8011 4905 19833 18589 4392 -2806 6721 4679
7596 4679 -13437 -32705 -25363 -21092 -21135 -8016 9685 13966 15122 4709 1602 14275 16977 5322
7582 5322 9864 -181 -3726 5148 11716 7671 9818 12299 7131 1190 3876 17345 15703 29338
7568 29338 35163 13312 2825 11996 13832 14432 9611 4052 11988 21784 29732 21202 19454 24501
7554 24501 18593 33288 17750 9651 -3656 -5589 -5526 10664 5783 858 10770 17345 17502 -6411
7540 -6411 -10913 -10095 -17642 -1912 14591 2699 8278 2950 17120 19116 13863 24812 38448 26056
7526 26056 6437 31020 34211 12276 4068 17165 27278 22027 2292 -8453 -26190 -21782 14155
7513 14155 36205 22643 -9806 -12809 -19318 -15560 -34272 -38539 -16682 1645 18409 7153 -7911
7500 -7911 -13570 3729 14533 5914 2093 12023 11836 7395 -11012 -13361 -2562 8219 9394 3795
7486 3795 1109 -10909 -15087 7373 15432 12015 5440 1260 -17814 -12486 -11181 -7051 -17386 5656
7472 5656 3548 6436 16042 9416 11690 4297 -11707 -20359 -10317 -10816 -8316 2640 15039 8665
7458 8665 -15021 -22115 -20213 -22267 -24615 -10363 -9689 -21217 -16738 -13911 14341 34798 45238 40428
7444 40428 27500 18035 2058 2095 5863 7707 7980 17555 21797 -294 -1148 -10297 -10053 5477 7330
7429 7330 -6847 7535 275 -15218 10059 18693 20036 7143 -16100 -26069 2022 21041 24602
7416 24602 8664 5636 857 7566 15381 14944 24010 12086 3049 -11483 -8356 8522 16892 3564
7402 3564 5472 14151 26165 33258 27803 7559 -1467 21479 20977 8755 10251 18368 43816 38612
7388 38612 31516 26651 24850 8477 609 -13361 -955 12922 -2492 7470 -420 -12036 -8224
7375 -8224 -27778 -26868 -19374 -27717 -33525 -27849 -9417 -1572 4353 -2163 3916 19171 409 -676
7361 -676 -4833 -3487 -7288 -3602 -3483 -4843 -4341 -9345 5827 4229 1325 -16300 -32628 -34635 -28151
7346 -28151 -44683 -41913 -1239 16110 22570 29691 24558 -6407 -31186 -16563 9709 15230 7763
7333 7763 15907 2268 -15010 -379 -8361 -8363 8978 17081 18195 9987 37473 39377 10363 22926
7319 22926 40524 31791 25715 24041 25758 21477 8203 8672 1734 -18518 -21825 -13904 -995 70
7305 70 2978 2932 2183 3513 -2338 -5578 -12421 -13983 -16980 -7978 560 -6448 -7705 -15170 -12329 -31372
7289 -31372 -39884 -19049 -23244 -24850 -13865 -31292 -40981 -47174 -48043 -36685 -39663 -45990 -38746 1850
7275 1850 8946 541 6621 8313 -5686 -5817 7878 24762 13458 22026 17495 10746 -6316 -18211
7261 -18211 -10003 -3089 -7271 -7208 1270 1623 -396 -5975 -15833 -17425 -28497 -18054 -9872 1158 22358
7246 22358 25569 24130 6090 -8523 -17188 -238 19077 23180 22566 31111 5614 -3828 10514
7233 10514 14296 5011 -10624 -25826 -3950 -2764 -20521 -44186 -28019 -30678 -42098 -35827 -13661
7220 -13661 -7781 -9993 -4644 -17624 -40749 -30366 -10496 11039 20157 -1197 -18534 -10342 -14233
7207 -14233 -10232 3617 6040 10194 1737 -14679 -5203 3264 19172 12430 1943 12540 20647
7194 20647 16685 23619 29261 18791 15786 20529 -382 -6991 -9989 -26007 -21954 -14696 -18024 -8509
7180 -8509 941 576 -14741 -19799 -6723 -530 -10040 -35089 -29047 -14229 -1524 -9856 1055 7076
7166 7076 3164 -4023 -8404 3455 4155 -3013 -4137 -4287 -6496 -20323 -23269 -10940 -5436 -21668
7152 -21668 -32558 -28908 -20653 -12653 1053 -6805 -3320 2863 1767 -889 -2168 -13537 3088 15931
7138 15931 7870 589 4454 10784 -6769 4424 -12151 -19836 -3111 7669 5540 2653 13453
7125 13453 10660 -2284 3577 10959 24803 16791 22864 2769 -7827 17552 23904 13591 10473
7112 10473 12965 7380 -6823 -14847 -16986 -22750 -14191 -31737 -40076 2324 12854 -8942 -18068
7099 -18068 -12425 18879 16620 3659 3798 20469 23468 9636 -1548 -14441 -6206 4572 -7294
7086 -7294 -10736 -11986 2102 -14429 -12471 -11023 7612 22904 27195 21890 14337 -15649 -23238 -14675
7072 -14675 -21437 2204 12726 1311 3716 -7027 -22884 -22314 -19926 -14069 -11391 -1832 -1967 1671
7058 1671 5174 -736 -26986 -17621 8767 10205 277 -26669 -31302 -19545 -11182 -25441 -32130 -19105
7044 -19105 -11413 -14809 -7932 11901 20254 9484 6568 3875 9804 16899 15456 8662 4735 13834
7030 13834 14002 21291 34761 45800 43161 28554 23187 28188 31442 29666 12767 18843 18446 32750
7016 32750 25421 7155 -6717 -7947 -1836 798 3903 14350 8018 21712 14547 8074 13822 10096
7002 10096 1843 -28888 -35915 -25928 -8613 -5363 -15488 -13837 -13935 -24860 -13473 -5394 -15379 -33460
6988 -33460 -31582 -28999 -32119 -38017 -38130 -32594 -27285 -17663 -18300 -17421 296 1183 -13527 -21548 -17995
6973 -17995 -20536 48 11614 17086 8375 3133 3033 7049 2022 -7525 -10765 -19119 -17780 -21758
6959 -21758 -19910 -8566 7240 22973 15823 16427 29061 35104 38080 35311 34688 29149 10000 17749
6945 17749 18934 -179 -4189 8775 2364 6231 -4566 -13499 -4823 -23670 -28818 -23828 -11234
6932 -11234 -8103 4107 7962 -9217 -12535 -19155 -32650 -30746 -46804 -42030 -38816 -43533 -43385 -52703
6918 -52703 -42418 -971 15609 16203 7050 513 15098 23897 13139 -19177 -34271 -11602 -11765
6905 -11765 -18163 2063 12063 7581 3977 -15846 -16703 -4904 3253 7077 -1546 -918 -14970 -13458
6891 -13458 -10715 -19864 -19168 -17581 -5195 13809 38286 34370 17250 3746 8019 -3369 -24012
6878 -24012 -29215 -20844 -25073 -33337 -29483 -17407 -2530 5956 -534 -888 -14263 -27025 -15715 1288
6864 1288 6977 11671 13395 16511 16522 17585 20534 11445 7 -8570 -28805 -28172 -30993 -22552 -15284
6849 -15284 -25353 -23729 -9818 -9565 -17914 -4623 25442 22577 -7092 -23100 -32869 -21587 -9175
6836 -9175 -8397 -15820 -689 17057 25615 780 -11589 -6069 -12396 -123 7412 8931 -5572 -14326
6822 -14326 -11462 -1878 8136 4650 -5025 -13433 -26194 -12469 -5374 -17561 -859 21765 20134
6809 20134 18821 23136 385 -9012 -19200 -31767 -35773 -22612 -20185 -23337 -12752 -1048 -2405
6796 -2405 675 8378 150 -23858 -19629 -25401 -10414 13170 -1587 -34417 -38045 -27292 -15792
6783 -15792 627 -2402 -3093 -22080 -35514 -28336 -29523 -34358 -29177 -18829 -8272 6894 6489 1591
6769 1591 -11132 -8291 8710 13260 3525 3926 -8321 -21867 -31947 -23383 -23388 -18074 -17717 -7411 -14510
6754 -14510 -22685 -3791 5450 2913 4202 10611 21851 33516 37454 41296 31721 7864 6147 18774
6740 18774 29322 8401 6292 14068 7443 -14227 -5620 1293 11500 47625 58438 40397 20676
6727 20676 -405 11493 20519 34730 26724 3747 2927 8001 -434 -15054 -1189 -5923 -14049
6714 -14049 -20074 -16496 -13838 -21341 -9480 -6274 -3772 12668 23655 12219 -10523 -12890 -6267
6701 -6267 4315 3304 8390 4323 3902 12633 17068 23854 21941 16968 3879 1586 20764 12446
6687 12446 1777 4744 -5175 -377 8042 19864 20620 25071 25899 7953 -9078 -12770 -19647 -9807
6673 -9807 -13674 -18880 -11683 -5880 -9580 -20211 -31470 -28106 -12374 6125 -4197 -6232 -15792 -26324
6659 -26324 -18887 -25438 -15202 -11989 -10724 -3868 9197 17700 7802 -2447 -2354 -299 -6371 -7851
6645 -7851 2518 -4990 1428 8546 -6101 -2443 -5572 -9045 -10837 -20072 -15744 -17440 -25657 -6355
6631 -6355 19079 -8079 -28383 -8637 20733 28334 29795 26972 23879 960 -18712 -30518 -39396
6618 -39396 -31033 -10259 9288 4556 -1847 -6380 3134 21453 31314 20802 7243 -18828 -8953
6605 -8953 -8566 -28465 -24664 -31160 -25746 -6022 -746 -1906 -8662 -12281 -27436 -31397 -23922 -8649
6591 -8649 -9496 -20398 -18431 -1584 11003 10985 7239 18903 37124 31149 22373 21769 8575 18765
6577 18765 31737 48474 50195 41434 34724 25392 14437 7364 13345 21304 19812 11612 5948 787
6563 787 -4502 8860 10247 11500 9681 13825 1435 -11411 -5227 21549 22985 -3658 -27444 -11339
6549 -11339 -6674 780 3288 666 -4958 -8285 -652 -18379 -26054 -3062 4264 2720 -4684 -8236
6535 -8236 -846 682 3603 19071 18898 22569 15506 14449 8887 8165 1337 -1421 -6325 -19678 -21844
6520 -21844 -15838 -15790 -13914 -15399 -10804 -14189 4588 -13017 -23838 -22279 -5209 -1350 5099 4283
6506 4283 -25098 -34934 -21384 -22558 -22069 -29892 -27391 8273 -4518 -13249 3510 15115 12337 -1644
6492 -1644 -12436 -25703 -24993 -7072 13141 8492 -4362 10405 25669 29851 25831 12639 -1143
6479 -1143 849 -7990 -13021 6537 -7181 -15580 -12585 4984 5219 -13281 -18124 -27756 -33390 -13776
6465 -13776 -10327 -11902 6089 996 9576 3229 -2406 -24681 -41244 -44870 -44698 -36527 -16046 -22897
6451 -22897 -30646 -17817 -15212 -8260 2469 -7936 11633 23425 1985 -19255 -9987 -13997 -13527
6438 -13527 -28438 -22034 -3464 21582 27950 42729 52734 25505 4362 -3784 -2659 -13278 -2914
6425 -2914 11545 11308 5663 2982 5552 -4639 -24055 -33134 -27851 -10650 -3450 -4708 8133 15629
6411 15629 14924 16202 17106 20942 8744 -7317 20511 33216 18064 9146 -3504 -3407 -11601 -24847
6397 -24847 -32630 -22424 -6902 1741 -11835 -25382 -30983 -30858 -22422 -12202 -13638 -22373 -26269 -24703
6383 -24703 -25116 -28537 -6353 718 9468 14686 8125 7928 12792 9654 -3877 -13713 -8924 -6889 4353
6368 4353 20675 20851 32541 46701 36526 11262 -3760 -18712 -31660 -10348 -951 -16869 -16167
6355 -16167 -18016 -17540 -15637 -19520 -27816 -32775 -27342 -18491 -43566 -47004 -41170 -26953 -41237 -42838
6341 -42838 -24286 -10572 -14741 -33801 -42525 -42131 -31561 -32690 -35046 -18485 -12033 -22907 -10822
6328 -10822 -9649 -5801 -10792 -6573 -14639 -15489 -3707 1428 1252 2689 -13226 -32805 -34441 -17704
6314 -17704 -20753 -20465 -19465 -2300 -3386 -12603 -16954 -19529 -31628 -28945 -28049 -26384 -3181 -11860
6300 -11860 7461 14747 -6117 16559 24795 24650 16802 -4676 -13254 -8750 -16261 -35528 -30941 -30108
6286 -30108 -21723 -638 2258 9334 2906 -298 -5522 -21452 -18047 -17111 -22416 -13377 -1675 -15765
6272 -15765 -34758 -42148 -13573 -10952 -939 -6800 -7721 -21975 -16810 4078 17535 8540 4892
6259 4892 17868 17978 -456 -15084 -24812 -49707 -29967 -12506 -19626 -18420 2071 20562 11447
6246 11447 283 -11042 -23404 -18126 -22844 -9779 -12298 -4708 -7493 -22897 -2112 14329 13033
6233 13033 -3285 -12437 -21302 -28456 -27124 -25788 -20314 -16202 -14694 -19478 -15743 2838 1242 -22621
6219 -22621 -18578 11358 12808 10107 11437 8760 -2331 -17100 -25890 -11204 -13743 -10293 -5932 6550
6205 6550 -5168 -20112 -26999 -20989 -29834 -24681 -3089 -8091 -20937 -21555 -20267 -18999 -17914 924
6191 924 14 -8867 -4626 -1044 -2626 -7904 -23373 -35630 -20602 -13788 1102 12316 -2271 -9442
6177 -9442 4440 22961 34069 25225 -1911 -7853 5630 3365 -10008 -11833 -26624 -30525 -26575
6164 -26575 -5798 11508 25298 24824 8611 -10541 -4770 -2651 4468 7583 -9943 -29211 -11406
6151 -11406 -11523 -21797 -5878 13706 13019 -20617 -40809 -38186 -40923 -46404 -23302 -2888 7734
6138 7734 25416 17851 13062 26484 21995 18575 8310 -11306 -6471 4986 8057 1766 7476 7316
6124 7316 -7463 -15825 -8738 -4331 -4561 -5507 2037 6437 -18069 -18908 -3039 -6997 2282 -4711 -21325
6109 -21325 -8369 -7343 6321 2203 -6673 3848 22405 14238 12909 24078 -1085 -18845 -25544
6096 -25544 -26604 -12426 -12582 -1898 8312 11439 8279 10430 16813 -4677 -10273 -13324 -17847 -5146
6082 -5146 9799 9271 -14649 -23400 -26135 -35255 -12972 -19383 -33507 -10441 -3455 5937 -6248 -16718
6068 -16718 -8227 -17143 1181 17561 22530 20541 11541 -10234 -10314 -1733 18553 27858 15079 23536
6054 23536 36728 30944 722 -11465 -4168 1442 7011 2905 1954 3572 -604 -19496 -32630 -26555
6040 -26555 -18122 10052 28262 34966 29757 8500 17014 6211 13023 15613 20964 9815 -5153
6027 -5153 -19613 -7903 -969 -9597 -11315 -6572 -1581 12 -27655 -8785 14494 30155 59143
6014 59143 60267 44854 20126 9500 -748 -12742 -28628 -21546 -11000 -29003 -11967 2303
6002 2303 2604 -6259 -1635 -7306 -27992 -27901 -5694 1925 -6261 1154 5350 4478 -8181 -12112 -8100
5987 -8100 -11761 -10909 -1454 -13521 4454 -297 -14515 -22699 -9247 -5133 -17686 -32324 -26551 -27087
5973 -27087 -18826 -5785 3078 -16412 -28487 -14064 9834 11711 8264 -9392 -10663 -4677 4688
5960 4688 -4227 6785 2389 -2016 -13870 -6743 -12561 8915 13261 34854 22459 19717 24449 22297
5946 22297 19091 13852 9947 10222 8601 -3096 -24358 -20774 -13229 -4822 -28 11534 9908 9218
5932 9218 16830 30060 27251 11016 2145 4305 21977 12657 -7494 -8175 9452 -3098 -21629
5919 -21629 -15163 -3231 5889 2292 2673 -15978 -12198 -4358 -18328 -11399 5937 5317 -16425 -11094
5905 -11094 -5264 -9885 -4694 -15609 -10131 -4311 -10418 -5154 -3774 -4916 -16939 -20668 -4774 11025
5891 11025 4302 6442 28632 26701 26782 32902 6848 -17903 -18145 -9838 4486 7564 23431 34188
5877 34188 45417 41474 9388 -12175 -20517 -5096 4738 18174 7021 875 -3616 -24249 -13735
5864 -13735 13259 20591 15721 23101 19007 -148 -4571 -24384 -16382 -373 -573 -9008 -3693 4476
5850 4476 9335 19801 5614 13202 19861 8573 14571 29753 31923 19962 34290 18353 9997
5837 9997 -933 3720 15192 2200 16891 17140 20061 14754 -168 1191 26040 33825 24483 10530
5823 10530 8060 19583 20562 21262 17908 10249 18738 22107 5429 -10117 -7291 -706 20907 27543
5809 27543 5204 -18489 -17282 -16240 -6632 8387 2453 -3586 -1707 -2818 4834 17081 3025
5796 3025 -2343 -3665 5715 5518 5897 21737 20997 14749 11890 -11822 -10780 -18879 -32968 -28433 -12271
5781 -12271 -10481 -30734 -38304 -31643 -13300 -3031 6341 -9464 -2943 -8302 -9231 8396 6018 10791
5767 10791 17312 5956 4903 -1435 6498 11903 -6508 5316 32484 28498 10159 -20429 -12683
5754 -12683 -2590 2827 17457 8917 14958 -4425 -914 3442 9124 -1913 3813 -11624 -5300
5741 -5300 -3798 -9157 -13998 -18080 -1423 8479 19388 28789 27773 -5493 9712 42128 37367 17368
5727 17368 10224 7326 -10872 1064 -2308 -22247 -24725 -15831 -7388 -495 -466 1693 -12665 -26211
5713 -26211 -19177 8390 7392 9804 15210 5201 -8137 -20092 -18181 -29293 -19163 -22023 -22999 -38787
5699 -38787 -28689 -23174 -14771 -12202 -16313 -13441 -29873 -18349 -818 2727 5580 10235 -13549
5686 -13549 -26222 -20160 -18330 -14930 -3337 6332 4957 -9711 -10296 6986 9244 -5096 -19196
5673 -19196 -16155 -5974 -16152 -7454 12144 10420 -30 -6016 86 14342 18270 6956 -18072
5660 -18072 -30980 -17109 -8259 3290 8625 2606 -269 -9496 -27673 -28682 -32455 -37071 -35550 -28484
5646 -28484 -27617 -27423 -36382 -33098 -12920 2217 11455 -728 2561 4463 -7145 -2794 10805 4855
5632 4855 14220 11043 16135 8788 6405 -388 -4548 4195 8686 14533 12783 20457 15002 26336 26326
5617 26326 -116 -9656 -6730 3108 12284 218 -8296 -18218 -28458 -19748 16032 14056 5104 -19934
5603 -19934 -4640 7290 1578 3981 22897 52737 49887 38040 34366 27785 3832 2360 16322
5590 16322 20880 9398 -2708 -12644 -10555 -9781 -15874 -2779 6872 -5454 -15606 -19253 -18955 -18460
5576 -18460 -22291 -5192 -5035 -17745 -21194 -9409 -10511 459 10208 8115 -2562 2631 14767
5563 14767 -1706 1961 -4685 -9802 -7964 -4879 13259 7806 -7542 -16109 -15464 12896 5984 -11051
5549 -11051 -33727 -29282 -28094 -8891 19868 33728 39734 26255 28528 20298 17375 6712 -14354
5536 -14354 -2630 8562 4352 6834 11093 9823 17059 7440 -276 -17384 -32891 -31729 -20924
5523 -20924 -23050 -25141 -12748 -4317 -7222 -4671 -21991 -38181 -26422 -11953 -6608 -10341 -1568
5510 -1568 7428 2825 -3889 -17456 -31232 -14547 13311 8237 -12969 -16493 -21489 -12171 -11533 -9902
5496 -9902 -1107 -17862 -18396 -2371 13884 14826 19975 30789 31317 20199 9973 6990 -13485 -20743
5482 -20743 -36993 -43138 -36955 -18439 -10141 -17697 -13007 -25095 -32255 -20977 2129 13998 -501
5469 -501 11907 3366 15518 11750 -2326 -5457 11477 580 10728 10936 -12873 844 1332 10461
5455 10461 25214 19778 -4746 -27584 -36717 -24578 14059 22820 14712 -2633 -8044 3818 1614
5442 1614 -9904 -29732 -28309 -17677 -3307 10602 12022 9784 904 -4104 672 -7015 -22740
5429 -22740 -14840 255 3625 1779 -7313 -19090 -11843 -8921 12519 21580 11669 17243 23407 24305
5415 24305 29689 29841 25344 -2031 -27918 4313 11738 4241 214 -321 -2436 5675 1935 -17367
5401 -17367 -6046 11651 13850 -3488 -15608 -11918 -4214 -8169 -14502 -10726 -1628 12812 7551
5388 7551 6142 5909 8415 15000 13728 5477 -1701 -5044 -2831 7414 7032 16684 31944 35238 22821
5373 22821 173 -3329 4397 3462 -13021 -13967 -32723 -37870 -15191 -11501 -10878 -10182 -2167 -367 14806
5358 14806 21057 653 -18283 -16463 -14720 -28707 -38569 -34371 -25517 -28204 -33389 -28907 -14114 -7979
5344 -7979 -14262 -11432 4216 -69 1336 15306 14235 3215 813 1323 -6282 -20622 -16260 2953
5330 2953 24585 4548 -1159 -3937 13838 31400 13883 -1558 -11454 -7325 -5808 13417 8465
5317 8465 16 7570 14250 -8911 -17245 -17087 -14538 -28085 -27314 -19270 -15974 -12202 422 11951
5303 11951 12086 16795 5614 2196 -316 798 -4610 -6900 -8386 18085 31066 613 -3551 6596
5289 6596 5233 2281 -4873 15181 26497 20766 4405 -1122 -3410 11222 18036 6283 1135 4648
5275 4648 18286 21852 12898 -6394 7219 17739 2375 -10036 -18950 -20984 -18974 -10234 -2932
5262 -2932 196 -18118 -4992 18784 15912 9990 15244 5945 -23926 -48617 -48980 -41722 -26415 -26518
5248 -26518 -27297 -13151 -5250 8567 10443 -2053 -13187 -9080 -1550 17753 31193 35508 20784
5235 20784 10349 -11144 -16060 160 11205 11929 5568 5088 -4079 4087 31464 47489 35973
5222 35973 21436 1722 -2597 3282 1224 6094 1195 6544 3010 -8159 -1382 -57 -9524 -32144
5208 -32144 -26301 -6975 -4898 -5596 6301 8287 4281 14784 18861 18617 13986 6787 -2573 -4333
5194 -4333 -12341 -26169 -27818 -21595 -21073 -14642 -21419 -5906 8732 -24767 -20699 -21154 -3579 7255
5180 7255 8267 6818 5657 18482 30591 30526 6876 -7916 18158 29371 36081 24441 -4256
5167 -4256 -18220 -624 23889 27820 7173 -17445 -9209 -9796 -18734 -3408 -217 -4638 -7368 5901
5153 5901 -13714 -24421 -11800 3277 19664 25601 2652 14368 9811 808 -6898 -30669 -4396
5140 -4396 14934 1099 -12617 -1858 -7872 -4725 3277 24754 31216 20594 13368 10096 8591
5127 8591 21340 14193 2699 7329 -1146 -1687 -1261 -91 2335 -6183 -3922 -7689 -329 -4446 -8108
5112 -8108 16526 18092 19144 26286 14811 18510 16292 11708 2101 -6487 -19546 -16273 -5408 -9315
5098 -9315 -4764 -9597 -6188 5106 15065 2383 -1533 21811 46619 40067 16416 -6836 -15150
5085 -15150 -9724 -1238 6986 11265 470 1428 5105 -9140 -1550 -13508 -16869 -3951 7314 -1700
5071 -1700 4849 2602 10108 15764 18024 11681 30588 35184 16900 13242 7227 10907 4683 -9628
5057 -9628 -13283 -13288 -22477 -35543 -26317 -14456 -2456 -2287 -12082 -14053 -9392 3287 8273 -8997 -19023
5042 -19023 -18477 -24816 -19769 4621 12501 4614 7782 14007 -10314 -17165 -9433 2811 7185 -3727
5028 -3727 -14402 -1529 -633 10640 17737 13822 1595 -26658 -26314 5091 22949 19437 5510
5015 5510 -19387 -23772 -9706 -1783 -6240 -25727 -18310 -5913 19311 24999 20904 20716 11511 9650
5001 9650 10640 2006 -19834 -35829 -27432 -16278 -15779 -2260 9969 -3394 4661 11979 8270 3925
4987 3925 4601 -1811 8455 5525 16741 14764 8402 8296 18837 18664 9171 2627 2880 14814 23429
4972 23429 11291 -2568 6209 3115 -4498 -17379 -18983 -4774 11591 4748 1053 1707 -7880 -24863
4958 -24863 -30489 -32123 -10850 12207 9137 -8001 -10893 -24285 -18116 -3644 11777 21467 229
4945 229 -10095 -4984 -9097 -1407 -2619 -1650 7961 -9341 -28772 -14851 6372 18188 2693 -16697
4931 -16697 -27490 -45537 -33402 -15323 -10165 -2827 -2344 -985 -6919 -18574 -23014 -23233 -28939 -25804
4917 -25804 -17303 -107 11565 13825 -1371 -1413 6516 8216 3546 -2049 -10018 -26860 -24215 -18089
4903 -18089 -39236 -32881 -23721 -6148 13130 15344 6623 9043 19739 -1490 -20062 -271 15263
4890 15263 -1978 -13694 -15466 -12313 -8682 8387 8877 22079 18065 18885 5087 -6590 -14833 -25124
4876 -25124 -19158 -4121 3549 -8579 -18736 -18275 -13644 -1657 9217 -1355 10498 11246 6486
4863 6486 10501 15486 13255 19333 17150 18474 10435 -22446 -46311 -44274 -31693 -10407 17327 13570
4849 13570 -8185 -2432 3946 -8857 -11082 -1382 9655 26169 26862 25766 7294 772 471 7999
4835 7999 5948 2014 -3039 -8895 -4496 13488 13362 7128 9728 33048 45710 28600 1412 -14391
4821 -14391 -24567 -8444 3962 -5640 -15145 -24255 -19974 -12114 -27733 -18255 -3310 -5170 -9496
4808 -9496 -10837 1217 3982 3820 14862 12568 12265 4239 1170 -6362 1746 -5423 -1562 -18 -3400
4793 -3400 -5297 -12772 -19544 -24441 -29686 -23511 -24725 -35847 -29562 -26204 -23540 6162 18522 494
4779 494 -2994 -3924 3299 -7187 -19141 -18659 -7587 -15049 -9464 -6228 -3279 2491 23698 25560 20761
4764 20761 -9455 -35953 -34193 -12737 -12123 -14285 -19379 -15833 -15466 -20217 -20355 -6766 -4198 621
4750 621 -5781 -16289 -38137 -25675 -4546 -12779 -23250 -19596 -23600 -17060 -6231 -13319 -7495 532
4736 532 7325 375 -15849 -18123 -4820 -4331 -1440 -9022 557 -16748 -14280 4306 25635 20416
4722 20416 8969 -721 -4700 -22188 -15926 -1955 -25758 -27950 -21460 -25389 -33347 -35476 -16007
4709 -16007 3555 14619 16762 25089 26630 19552 19386 4228 3926 11117 -4285 -12453 -9614 -26807
4695 -26807 -25904 -21885 -34957 -31064 -16662 -20139 -2186 1331 -16080 -10812 4025 6417 4143 14845
4681 14845 37217 48423 34407 14933 1908 10439 5990 -5507 -19829 779 12389 19822
4669 19822 23928 21487 24559 11583 -14960 -18594 -18445 -14489 -16840 -10058 3947 25568 26430 16945
4655 16945 8103 8765 12916 12029 10841 14914 2608 -11914 9192 20906 24225 6776 -15203 -16352
4641 -16352 -7123 -7813 -3841 6006 9782 15009 11086 14772 15004 -3406 -15422 -13479 -12815 -22234 -28790
4626 -28790 -1589 17432 8690 18752 27350 19866 28363 -3690 7089 12181 7767 17011 17458 10513
4612 10513 21574 4318 -14051 -16263 525 3879 11759 7292 13780 15909 16607 20114 13058 -2580
4598 -2580 -13771 -10192 -2714 11006 11110 15927 1517 13063 12398 13280 17018 15982 18459 1084
4584 1084 11249 21565 16424 13680 8151 13000 4049 -4563 -5462 -10239 -8138 -4778 -15578 -9579
4570 -9579 8891 -5853 1848 8857 4711 1582 10779 2045 15315 31539 19286 23682 15714 8390
4556 8390 -1739 -12124 -7293 5647 -1509 -4594 -11486 -5203 -11894 -14921 -23637 -18448 9203 13035
4542 13035 -6001 1485 -7523 -11191 -7221 -2684 -11456 -139 32323 28258 -5168 -21470 -23429
4529 -23429 -33401 -27036 -15356 93 -11921 -24334 -22458 -13493 4794 13558 21129 26000 18472
4516 18472 1196 -7608 2037 8590 -579 -2348 -7002 -32371 -22600 -13047 -18509 -14038 5875 10677
4502 10677 25734 32047 12696 171 17655 12102 -4798 -5330 7031 1517 10923 223 -11352
4489 -11352 -4664 14437 13696 -3147 -21994 -47970 -38147 -22475 -12128 -3198 10880 -11405 -19199
4476 -19199 -38726 -52599 -27821 -7245 -4256 -8101 10147 12374 3516 12272 843 -17058 -11443
4463 -11443 -8134 -10359 -8749 -13031 -8005 -11655 8421 24747 41018 42844 31153 -10968 -40757
4450 -40757 -23966 -8030 9798 2947 -4164 -8118 11092 10647 -3516 -2107 -1877 -435 2602 -14281
4436 -14281 -17373 -11639 -3938 15744 7871 5397 12826 29012 35982 25187 17734 15599 8424 11217
4422 11217 10447 1576 -2927 -7350 -12603 -6379 2332 7411 -9502 -7451 21368 9756 -10013 9566
4408 9566 12738 15356 1351 12974 4475 -10349 -4880 10076 12345 -18517 -7850 -4638 -17270
4395 -17270 -17164 -23169 -18853 -3976 14907 7996 -13064 -18009 -13235 -4137 1454 4369 1390 -46
4381 -46 -13553 -4905 11313 30995 39205 20464 12632 6335 13417 19588 13386 3476 -17020 -16114
4367 -16114 -1056 4814 3052 17354 23567 5371 21829 20137 23903 3886 -7177 -16362 -9737
4354 -9737 -12809 -15821 -41632 -38731 -10732 -10934 -22431 -1932 4045 -5323 -2422 -1580 -19074 -29180
4340 -29180 -9940 -4450 -9685 -4644 -9057 -17644 -21007 -35601 -32043 -27826 -39499 -24993 -11823
4327 -11823 -20107 -34438 -20659 -12232 -28289 -21911 8060 2361 -3813 20858 24121 3703 -4962
4314 -4962 -28278 -25560 -7214 7898 13621 17070 20809 16891 4420 11959 8758 -4 -12690 -29538
4300 -29538 -27171 -16933 17726 28844 19417 835 -7364 8029 37777 27659 23607 13843 11485
4287 11485 1846 -14577 -9311 4102 -2828 2594 18045 4632 -12949 9212 12611 11464 17039
4274 17039 25357 18879 11018 -3383 -9719 -4987 -4924 -12227 770 3652 -8433 -756 10389 8635
4260 8635 -6140 1984 21368 15637 6283 11616 15047 8976 3866 -10107 -5600 -3623 -15810 -16492
4246 -16492 -14159 -15021 -8035 3599 1952 8539 8004 5788 5909 4969 5018 7562 -4557 -24111 -26840
4231 -26840 -24559 -11119 -1346 5200 10327 -281 -2855 18466 6766 -10410 -15426 -6899 12742
4218 12742 25128 20430 4327 -19595 -25984 -11855 -8319 -21327 -15063 -832 7862 7863 20622 27572
4204 27572 11257 -9772 -2445 -1409 -10230 -10962 -31753 -42218 -40311 -44721 -28090 -25574 -7428
4191 -7428 15268 33667 34812 24614 7672 -3378 -10982 -3659 4212 -12573 -6180 504 1449 -7443
4177 -7443 -12372 0 -1300 5840 12389 4190 -14872 7687 33564 24620 14180 14630 18070 17416
4163 17416 12851 3097 -5675 -11218 -7694 -1168 764 4690 -4801 -16192 -31107 -30477 -12741 11595
4149 11595 6743 3986 18525 10050 -2589 -3505 7476 5075 -10477 -15220 -11427 -5817 391 3797
4135 3797 12219 10541 3327 8601 -1202 -7016 -8396 -10607 -7583 -11871 -7565 -4595 14071 27436
4121 27436 22377 1899 8579 10709 -7074 -10925 1094 14694 3587 3707 470 -10392 14539
4108 14539 19825 6450 -12326 -14629 -24764 -29832 -22664 -26179 -17120 2143 12304 -803 -6157
4095 -6157 -14152 -31265 -36921 -27029 -7979 -7015 -35528 -29293 -15575 -21935 -24939 -29080 -14595 -10966
4081 -10966 -7307 -8305 -16839 -32258 -14649 186 -2678 -1713 -4287 -1313 16777 18466 -7571 -16093
4067 -16093 -592 -4986 -13847 -6663 611 -7425 -3866 2044 19567 28202 13062 2967 -14827
4054 -14827 -25593 -20489 -6277 7204 12657 6328 -16001 -12378 -9916 -7251 -28476 -38723 -13706
4041 -13706 -12287 -12272 -2910 7782 -713 -17419 -34806 -17030 -197 5896 -4171 10417 14963
4028 14963 3571 -3300 6653 5566 10338 12721 21143 12332 -2260 -7760 -13671 -13999 -9553 -12626
4014 -12626 -27884 -16023 15074 21966 12011 23411 34754 17035 12593 29620 23879 -14161 -28893
4001 -28893 -23590 -13931 -21197 -27348 -31224 -23017 -9304 3349 -4044 -15117 -7260 12606 29510
3988 29510 21700 18515 7391 8499 -4129 -12071 -10393 1772 9023 4869 10388 11406 19248 30223
3974 30223 11661 -8252 16911 17448 29042 22116 9793 19495 35354 35137 15971 12902 22042
3961 22042 17527 8855 -4299 -12997 -2168 2345 -6582 -16250 -10428 -2740 -4989 -5785 -17332 -9485
3947 -9485 -7328 -9521 -6382 1659 -4760 5020 7724 8311 12211 15319 21041 -398 3639 2110 4006
3932 4006 18387 3839 14884 9614 8460 3887 -11137 -10571 -10166 -10824 -13576 209 -3215 -492
3918 -492 21649 17630 -2355 -4230 12593 12083 8602 7443 15091 31557 28986 6928 -17871 -40890
3904 -40890 -37604 -23432 6925 5072 -12999 -12224 12211 21138 4483 1307 -12288 -14764 2964
3891 2964 14707 5418 9288 8339 9485 21391 29056 30035 29149 23796 4599 -16000 -44618 -42083
3877 -42083 -19196 -4275 -7240 1943 -346 -7182 -15056 -13019 -11523 -9962 -13849 -18997 -14859 -6499
3863 -6499 5803 7800 -1560 16880 -6987 -25106 -20771 -15921 -4446 1524 3537 -1144 -2479 -2620
3849 -2620 -2718 14624 679 -10899 -4219 933 1453 11889 7737 9070 10141 27567 39442 43502
3835 43502 27270 34110 26141 32146 48479 30513 11538 11082 6175 -14296 -31172 -36884 -28246
3822 -28246 -12837 -19815 -20842 -8111 517 -1237 -5120 -26508 -33158 -27663 -14806 -6517 -1535 7527
3808 7527 -13022 -19593 -4038 -5056 -14840 -11882 -15380 -252 6965 5566 -6265 -11137 11998 3750
3794 3750 -15292 -911 3479 12655 8860 8171 18898 18642 5252 18905 32641 25888 9281 -1893
3780 -1893 -9910 -37576 -48521 -38589 -13042 9044 32333 30408 12743 6772 15308 24450 6128
3767 6128 -17489 -32482 -23118 -28037 -20742 -11415 380 1572 11906 -19318 -20010 -27494 -28347 -29920
3753 -29920 -25668 -14592 5287 2868 -22861 -36817 -28901 -7021 -9069 -11047 -5707 17102 12897
3740 12897 -514 10557 20356 19250 10643 46 9165 12572 -7007 -5564 6990 -518 -6657
3727 -6657 -7097 -8369 481 -1714 -2213 9237 26198 18565 3401 8725 4690 944 11204 41877
3713 41877 64276 55319 31505 17946 16638 16369 20586 -13446 -11835 9908 13949 22276 19539 -8813
3699 -8813 -12759 -19556 -14945 -10094 -2290 -2335 8740 18042 2245 2332 -4299 -9061 -8214 8334 18560
3684 18560 36043 40877 25225 8699 29007 36220 11277 2364 -2470 -8887 9098 16736 8779
3671 8779 1219 25227 37946 24657 1593 -14837 -5322 5167 12619 -3610 3552 5026 -6946
3658 -6946 -9349 -7482 -425 -17052 -32486 -16695 -609 -5843 -24655 -24649 -9054 22103 33876 21119
3644 21119 19829 24473 6419 -698 -10640 -1440 17947 20385 17719 4616 -15036 -27363 -26101
3631 -26101 -17751 7911 27900 11614 3911 912 -6198 -5896 -14238 1878 29898 37206 19500
3618 19500 -6649 -34282 -27338 -48343 -62848 -49763 -46324 -24900 -17705 -16049 -11041 -26322 -21245
3605 -21245 -18000 -22333 167 21373 36289 22638 15529 -8259 -11120 3503 1495 11425 11947
3592 11947 7179 1768 15547 16296 6112 4031 16749 11834 8457 2307 -9248 -16407 -22123 -14982
3578 -14982 -16107 -15109 -2307 19810 26612 12913 6142 -9950 -7148 3323 -20905 -29021 -22050
3565 -22050 -28179 -32408 -26227 -28240 -17105 -390 5234 -10002 -15088 -15584 -15812 -33200 -27194 -7557
3551 -7557 -3151 14948 4850 11509 25272 29858 44842 18860 7033 -11179 -33419 -16225 -2657
3538 -2657 12942 23962 15821 -7296 -24444 -17555 -15394 -9870 -7857 56 8628 -10594 -33575
3525 -33575 -36238 -19079 9020 5622 7170 7229 19096 22376 17956 26007 19267 10459 12047 598
3511 598 8436 6575 -367 -6514 -4351 -9708 -3993 -9283 -6129 -12667 -11502 7292 35974 32142 4536
3496 4536 -12321 -5912 -8866 -8650 -10165 -11219 -9362 -11738 175 -434 7886 12415 13255 -16439 -15579
3481 -15579 1246 -6558 -11139 -13210 -12295 15843 19818 13160 4069 832 19145 4216 -2312 -400
3467 -400 -6243 -24551 -24671 -10946 1017 -11689 -5150 3487 10586 21076 11409 3749 -6295 -16789
3453 -16789 -16170 -21065 -21807 -20108 -14831 456 3750 -20770 -23487 -14668 -17531 -5159 -9926 -15940
3439 -15940 -11901 4653 25659 17332 5280 17100 3249 3983 24161 10770 4346 -4590 -8967
3426 -8967 -8597 7327 3976 75 -13781 -20000 -12580 -4373 -9908 459 29933 27507 27102 12990
3412 12990 7050 9479 13307 1690 -8759 -17813 -14601 746 -14884 -37240 -25677 -17352 -29002
3399 -29002 -35212 -23625 -9748 -10775 -16486 -34238 -31725 -5821 6876 27532 10273 -15128 -19563
3386 -19563 1664 14008 367 -17 8711 14371 13636 21373 20549 1372 -1123 -6263 2152 1857 -2993
3371 -2993 -15683 -16995 -12665 -14923 -11668 -21659 -11074 -4473 -9325 -123 -3016 -7619 -5023 10568
3357 10568 22633 16795 -20052 -25891 -3283 -4049 -2623 -5818 -1858 -19707 -27387 -22379 -11793 -5236
3343 -5236 4366 13249 10631 3984 -14542 -16362 1488 9826 17061 11847 -1331 4921 2277 -20640
3329 -20640 -23339 -17572 -15868 -12479 -18355 -11013 6931 24892 23608 3724 3912 -2383 -16449 -209
3315 -209 14542 16469 20143 12003 10438 5033 14550 15958 23640 40108 35549 43631 44546 28489 21204
3300 21204 15953 31484 12444 9129 -3456 5891 4339 -3949 -5755 -3040 8380 -634 -20287
3287 -20287 -30453 -16517 6070 10131 -137 -7226 1817 22118 29592 42622 33614 22227 29778
3274 29778 32432 35551 45875 39501 37966 24074 4833 -9478 -15650 -29633 -27500 -21110 -18470
3261 -18470 -17048 -7044 -9589 -19636 -19402 -34110 -21153 -5494 13436 21 430 -47 -21327
3248 -21327 -12812 -3368 3716 5025 2034 11564 14921 19280 6677 -3688 3085 4972 -21194 -26690
3234 -26690 -18129 -10254 -2408 1351 3758 6750 2779 10191 20678 17650 -2003 -12854 -37616 -35429
3220 -35429 -13839 -8721 -6481 11134 26359 13575 7352 21650 5379 -4437 1272 -6598 -1041
3207 -1041 24173 16438 13937 6004 -5243 3027 12300 9062 16582 14989 9151 6804 11765 -2796
3193 -2796 -1832 -17675 -11040 3200 27933 -755 -19701 -20106 -24122 -29555 -11346 -14763 -26185 -19624
3179 -19624 -20574 -19010 -22449 -13312 -6891 -12701 -20033 -25209 -3817 4283 629 11134 5319 6655
3165 6655 18817 16874 7020 20519 20801 -2835 -4223 1485 -2749 -14508 -5970 -15752 -24876 -20844
3151 -20844 -18288 -5014 15111 1422 -16535 -737 15701 25840 13640 548 -9458 12214
3139 12214 15576 18503 15312 -5121 -6527 3003 2990 -15608 -13350 -5489 -2333 -9334 -11238 -62
3125 -62 -1141 -11605 -11104 1593 14630 8086 5067 15053 12193 21736 22083 23709 28935 14752 -2915
3110 -2915 -15397 -10079 725 17709 28969 19481 24520 15813 -2167 9104 17158 10545 9376
3097 9376 9300 -6657 -12058 -12330 -22399 -33101 -20340 337 -13382 -18059 -12328 554 20660 18355
3083 18355 21894 26275 15360 2427 -2061 -5825 -8926 -21912 -17304 -14146 -10631 -11682 5881 27979
3069 27979 20830 5097 8348 7535 5180 13831 13751 -6782 -19495 -14254 8785 22328 9779 -1291
3055 -1291 10230 39828 35522 25617 18824 -10054 -29314 -20137 13023 27623 24112 22015 18841
3042 18841 -13188 175 25204 21985 20867 10791 16244 14543 4055 2680 -7093 -3512 3276
3029 3276 7621 -114 8334 28348 25094 -5470 -19623 -10816 -13372 -9429 -16684 -21324 -30284 -21142
3015 -21142 -1584 10227 -3368 -6119 -10463 -31945 -33446 -25167 -24985 -14950 -22854 -26541 -29036 -35548
3001 -35548 -24097 -12287 -21763 -19341 -3085 12049 2792 -21080 -520 7728 7271 -3798 6863
2988 6863 8233 -10525 -7403 6289 3651 26000 28615 14780 12782 1559 6146 4623 -2257 14649
2974 14649 31391 12024 276 -8460 -20288 -16012 -15170 6423 15047 -2062 -9054 9723 13662
2961 13662 4277 57 -4677 -6758 7142 20531 31955 27854 15016 22519 13292 15861 18123 20987
2947 20987 8398 -16106 -2537 20634 23751 -12084 -12109 3196 7434 -2218 -24524 -32445 -25306
2934 -25306 -28674 -21631 -16374 -7425 13771 1775 1657 -9310 -17637 -3685 -401 2241 5780 13932
2920 13932 23173 25639 31492 28463 32680 28246 26717 31162 21436 1991 -4081 2511 7771 11333
2906 11333 24398 6666 2754 12899 8413 2841 9293 2196 -1819 10721 30344 27790 24792
2893 24792 34027 25972 4543 -3314 -1386 14470 6047 -13693 -6499 6363 8984 18649 30353
2880 30353 30544 30877 10077 -18357 -22563 -26299 -13827 -12907 -16408 -29 -6125 -5732 -32264 -54181
2866 -54181 -48525 -34727 -42461 -41600 -36198 -25165 -4604 19014 13901 9748 -6119 12360 21364
2853 21364 40955 36084 12908 -3258 3915 -1427 5046 23858 21249 24791 24391 34027 47229 34392
2839 34392 15357 3902 167 -1428 -8809 -19844 -4333 2021 -4827 -8036 -14274 -5708 8870
2826 8870 15331 21234 30418 41017 32214 12929 6153 -8162 -10842 6969 19655 22250 9326
2813 9326 8646 11629 20520 14531 -1168 -4858 -14051 -9461 -6087 -31759 -33433 -28357 -27673 -17223 -14620
2798 -14620 -14783 -8360 2845 -4381 -590 3063 3156 1187 -3804 -19083 -26560 -18667 -19024 -15152 -15157 -3773
2782 -3773 17208 25833 26906 20266 1007 -6241 5324 -517 -23114 -18934 833 7025 -95 -1050
2768 -1050 -8360 -2482 8091 4359 -23222 -38479 -23111 -17037 6247 23132 24070 18569 20389 12629
2754 12629 10899 7772 1087 -23464 -29229 -23284 -21375 -26513 -25275 -6944 17442 -1356 -16951
2741 -16951 -21397 -2165 7857 11310 8058 12036 32992 34083 33997 25921 17412 1610 -17645 2901
2727 2901 8240 11567 23866 12754 -12446 -23325 -18453 -11337 -8396 -5764 -13148 -2565 -2962 -13786
2713 -13786 -1801 9301 8890 -10111 -14681 -10211 -2968 -4664 -2861 8154 -13334 -30346 -40763
2700 -40763 -48177 -30977 -14964 -5410 -5999 -5227 -14328 -8524 -2398 17507 33088 28425 2589 -1677
2686 -1677 3176 24172 25130 5759 -6827 -5542 8756 4502 -5047 5762 4196 8433 34027 27548
2672 27548 20479 18227 10000 7918 11272 -6344 -4362 1221 3806 8919 820 -16007 -26193 -29233
2658 -29233 -36780 -25090 -37375 -46447 -24716 -24827 -34057 -37786 -48547 -24644 21830 17851 -7827
2645 -7827 -13659 -14838 -17903 -17050 -18349 -29881 -11896 -10210 -32867 -33581 -26884 -39515 -47031 -23385
2631 -23385 -9699 -14150 -17001 -17187 -1520 -2758 -8125 -8852 -10931 -14291 -5057 -15275 -5923 21055
2617 21055 34240 23567 27287 23153 27292 21801 7596 -23368 -32334 -28688 -26250 -12414 -5375
2604 -5375 3419 -1512 -21647 -23610 -27893 -25520 -28404 -6268 1231 10733 16604 14981 2414 11595
2590 11595 36594 38738 10174 -10683 -6409 -771 4688 9550 12719 7143 11584 20687 -3604 2326
2576 2326 2767 -4202 -14955 -3595 14082 -5035 -21721 -2791 -6954 -19417 -24913 -9863 -12576
2563 -12576 -16374 -25497 -27808 -24037 -28533 -35130 -49120 -53851 -51122 -43619 -24402 -7611 -6233 1904
2549 1904 -13130 -38838 -34549 -8096 14497 15529 11670 9564 2884 -3507 853 -11083 -18075 -5192
2535 -5192 2555 -1048 -10652 -16034 2247 -7516 2963 12569 11523 14030 12512 6550 -35 2395
2521 2395 4618 1835 -13358 6267 8912 -1761 -12024 -8620 -21326 -16318 -25750 -28640 -22063 -13008
2507 -13008 -6218 4722 17827 28843 37677 30340 34069 28019 20149 7301 -14743 -12559 -20944
2494 -20944 -29696 -24011 -16076 -19962 -27709 -19519 1282 13792 11487 -937 6143 13631 570 -11437
2480 -11437 -28234 -11260 10768 44718 52116 22013 516 10988 22255 10053 -1577 -25904
2468 -25904 -32571 -11786 -13219 -24352 -14787 676 -7842 -17247 -21596 -6742 -1045 -22017 -13783
2455 -13783 -6771 -5288 5764 6218 1533 5740 -4921 1766 25950 25571 422 -7597 1243 7102
2441 7102 4380 5902 2229 -11300 -10750 -1050 -6698 -2440 14578 14272 -5323 2843 10814 14567 8711
2426 8711 6218 11683 18395 283 4362 2661 -19410 -3214 -1131 -12024 -14569 -25437 -16220 -1607
2412 -1607 -3014 6825 12311 13525 14762 635 -14063 3296 1592 6759 23425 -2048 -5719 17691
2398 17691 20138 31498 35683 32946 18436 12372 18983 29452 23238 23501 25700 11298 12902 6456
2384 6456 -3323 3849 19348 26093 15000 -6879 -6606 971 7945 4200 -12510 -10373 -4640 -10254
2370 -10254 2925 4861 -7817 -12688 -2666 19467 41686 39650 25757 21669 35723 28711 10500
2357 10500 -3078 6570 -4501 -13924 -14518 -1618 -3321 107 -11445 -1218 7238 10211 -1737
2344 -1737 1900 18741 23015 26502 25772 10999 659 -7644 -5863 -18365 -24742 -35019 -44314 -29267
2330 -29267 -1966 -5359 -1573 -3284 -11532 -26096 -25182 -15105 -8054 -5456 768 -3893 -30682 -42371
2316 -42371 -5487 34800 41635 27015 24391 17014 8428 -1255 -3823 -6058 -3425 -29010 -38481 -33615
2302 -33615 -21264 -17749 -10910 9293 9323 2825 -12774 -23319 -17896 -19490 -28180 -21599 -1720 5379
2288 5379 6249 -2880 -1589 2894 3483 1820 19785 12564 17363 -1233 -16722 5367 2516 1692 471
2273 471 465 14995 20931 26420 -3131 -12786 -11561 -3284 -8191 -24313 -32211 -18346 -4000 -5923 581
2258 581 26346 31753 22652 4650 2242 -12935 -8209 -7161 -7469 -12687 -20331 -21844 -18248 -5361
2244 -5361 2789 12762 5847 -6394 -22279 -25957 -28680 -4373 13656 11403 11818 -6050 -8628 -19927
2230 -19927 -29340 -27323 -28695 -26305 -2376 6663 -8496 -15952 -34059 -21666 -13459 -2290 -17259
2217 -17259 -30437 -13728 -15829 -20549 -2037 13780 4099 -28541 -16492 -6268 856 3533 -605
2204 -605 -17558 -14325 -22656 -12709 191 -6787 -19475 -15019 -11690 -31572 -8583 6730 -1600 -699
2190 -699 12356 202 11344 8918 -14285 -22053 -29848 -15575 -9156 -20189 -17969 -5564 -9824
2177 -9824 -4185 12514 16572 2456 -9934 -2139 13776 24828 20586 -11199 -21995 -9290 -4921
2164 -4921 -4116 2130 12773 11265 -16302 -24012 -27116 -20317 -11927 -19074 -13182 -13801 -19848 -4057 42
2149 42 6964 12880 10316 6964 8031 7079 21455 16446 1038 19315 20431 13501 15594 31314 18912
2134 18912 5339 2884 442 -9677 -12026 -1531 -9770 -26904 -34889 -17420 -14651 405 24086
2121 24086 19687 7328 -18241 -1394 -804 -23573 -41074 -19402 1645 20951 24911 25974 33180
2108 33180 35645 42958 44309 33469 28485 32378 37453 26332 5800 952 21014 24842 30725 33386
2094 33386 29383 26735 32108 31881 32693 40449 39863 24264 11551 7929 19982 11171 15452 -2468
2080 -2468 -11382 -12139 -10749 -8744 -11963 9152 25738 9418 -8321 -15236 -11728 7760 14096 1428
2066 1428 -8390 -3918 -8165 2530 17182 32088 31975 17234 -4984 -21191 -16839 2536 7080
2053 7080 -9400 -21857 -21282 -11024 -17385 -29839 -31291 -17850 130 -11110 -28661 -18218 28
2040 28 14171 14078 -7368 -19298 927 17730 11661 16805 12017 2326 -1867 -25781 -26029 -30284 -32297
2025 -32297 -1717 2740 -12073 -6356 -5680 14340 34334 25328 30618 7764 -19627 -23220 -4378
2012 -4378 18769 16838 2586 8831 11443 503 2270 29221 37929 20842 -297 691 -11502
1999 -11502 -20671 -10676 16032 30508 5815 -22475 4506 28663 29349 17849 19943 19913 -1878
1986 -1878 -11377 -10551 -14773 -1839 18426 18942 24578 3615 12227 7500 16039 18694 -6686 -18868
1972 -18868 -9300 -3347 5931 8315 3791 -14613 -20230 -903 -12178 -31811 -20282 -13892 -6065
1959 -6065 -8089 -21133 -14527 -7843 -26517 -22624 -26087 -25247 -22142 -8075 -4420 -3250 -893 7682
1945 7682 29531 17319 10929 20647 13381 194 -20533 -8593 -435 -4047 216 14402 10358
1932 10358 -2148 -13223 -3007 -2785 -17643 -21981 -33654 -47599 -25826 -10577 -435 -18267
1920 -18267 -50071 -39126 -17146 -9172 -6424 122 9258 13635 4095 -2288 6241 515 -18694 -23367
1906 -23367 -21988 -5895 136 -4866 -12542 -937 14992 33313 35471 29891 21093 9282 17871
1893 17871 -76 -4528 -4631 -2847 7968 20086 15860 26925 -2736 -28795 -26127 3845 13894
1880 13894 12374 5200 -28527 -39112 -41947 -44023 -42892 -8364 14053 140 3806 21990 24615
1867 24615 40839 35093 34357 43766 33701 30958 35351 20085 1743 3620 13037 35220 40460 34925
1853 34925 30125 19221 -2478 3907 9688 4229 -1766 5723 -13496 -29281 -32582 -22962 -9385
1840 -9385 -2257 19595 19862 -15294 -22894 -4955 5044 19442 6172 1538 21893 20514 8500
1827 8500 -15172 -4795 8142 9930 18043 19398 15854 19785 24260 6454 8563 12920 19802 17382
1813 17382 2420 5591 -15070 -21872 -2089 22971 31563 -435 -39340 -37522 -23604 -2908 11636
1800 11636 6597 -7369 473 6362 -498 -10868 -9125 -4709 1002 5419 -319 -10394 5205 22008
1786 22008 40477 30123 22408 22712 10722 8641 13185 -3033 -14064 -15330 7811 14135 -8839
1773 -8839 -28188 -31054 -14480 -11356 -13668 -7543 -8432 -9978 -2858 -1866 268 -2094 12581 33194
1759 33194 24228 19508 6624 2037 -4669 -15433 -959 24162 33996 27465 20009 20345 -3019 -13245
1745 -13245 14349 20133 12082 -12881 -17337 -22127 -7476 -9833 614 5020 6442 21404 20045
1732 20045 -621 -8244 165 12645 25588 18218 -17211 -47773 -38934 -18933 -8702 2752 -8918
1719 -8918 -17006 -12594 -13641 -23774 -17643 -2564 17948 1346 -9834 -13358 -14041 -26558 -35949 -13373
1705 -13373 -5051 -991 10927 4849 -21454 -43875 -26918 -17597 -27866 -31333 -18687 17932 10188
1692 10188 -26141 -42259 -26662 -8233 7823 18210 35792 22111 15947 15664 24639 20311 3301
1679 3301 12106 3987 -3069 -16192 -23346 -16493 -11239 -2559 -5311 -10971 -10456 -17659 -17775 -14018 -9435
1664 -9435 -2295 -3663 -14685 -18288 -5504 4004 8294 5659 6473 782 4251 26380 25438 22408 27406
1649 27406 30628 27640 39820 25836 5329 11180 18038 11102 10820 10868 19364 24161 15370 2310
1635 2310 -205 17920 21567 17877 22859 33595 20496 12255 6119 -670 -17508 -29067 -16201
1622 -16201 7957 18240 670 -7146 -10324 -12466 -21051 -12362 -6114 -10078 1385 23193 34201
1609 34201 20461 6340 11358 -1094 -15581 -17359 12608 18597 25524 24014 13279 -6201 -20042
1596 -20042 -27614 -28494 -30270 -33356 -17335 1498 -10354 -14617 -21299 -11961 13957 -2738 -15412
1583 -15412 -20161 -35919 -41420 -28615 -9821 -19374 -40101 -42198 -33109 -25886 -25864 -22023 -31550 -26162
1569 -26162 -19095 -21266 -11443 -21032 -36822 -42072 -33869 -30610 -35323 -32111 -27455 -18977 -2382 11898
1555 11898 -697 13154 8124 -5434 -11801 -5911 7986 16877 11745 9589 -13864 -11448 2963
1542 2963 379 -11568 -12875 -6354 672 -4597 1456 22976 36754 23101 16999 13654 4098 -15141
1528 -15141 -14998 780 3951 -250 -5948 -9587 -5515 1589 482 -2246 -9888 -23384 -14508 3025
1514 3025 10170 -1591 4422 3394 -831 -14926 7516 36517 40183 36752 19179 12796 5546 -17080
1500 -17080 -20842 -13381 -14991 -30473 -39628 -46053 -30750 -5395 -12017 -21368 -17949 -16950 -4036 -8286
1486 -8286 -19134 -36172 -17996 -1206 5723 13575 9747 16717 27789 18821 5793 -2346 -10308
1473 -10308 9147 41194 23416 12320 10751 13771 16459 9026 11291 17891 2868 -6487 -3369
1460 -3369 15591 17330 -3959 5612 8654 1351 -2806 11075 9358 -2608 -10057 -23413 -32176 -29448
1446 -29448 -13055 11816 24795 17211 13620 6381 -3657 8202 2752 -5984 -11726 -9606 5661
1433 5661 -708 -8749 -9729 -15178 -21702 -8956 2779 -8487 -22932 -25488 -13434 -21600 -34352 -22287
1419 -22287 2918 980 -16678 -26830 -43882 -37053 -13950 -7570 4897 17907 25515 19551 8069
1406 8069 20147 14615 11579 17842 8063 8366 3488 6512 12924 20334 18913 14827 7507 9648 14386
1391 14386 16043 30369 39547 41307 27449 21004 9787 -3960 -6491 -22239 -27633 -24586 -26641
1378 -26641 -48427 -40596 1624 22129 27239 18373 22812 31660 13015 5752 11291 23215 32794
1365 32794 25226 14278 18681 -5696 -16275 -8299 -1349 -22150 -25548 -20907 -18806 -8488 -2283
1352 -2283 3010 7370 -7284 -15169 -21503 -33890 -45010 -38018 -60399 -61876 -38681 -39027 -53569 -47929
1338 -47929 -63568 -50554 -15159 -6817 6563 302 -5266 -2630 -7285 -4384 -2904 11151 -3766
1325 -3766 -15323 -20660 783 1174 -16953 11754 21854 10555 4645 246 12942 25675 -2350
1312 -2350 -18057 -5836 -7889 -13274 11576 33314 19904 12086 7221 -8102 -4385 10929 10002
1299 10002 8863 -11286 -29329 -25253 -26727 -13874 2426 7157 8588 -40 -21154 -38456 -31591
1286 -31591 -14071 -9575 -3339 1362 15687 23345 19538 15887 -10178 -5159 2040 -7919 -30780 -37040
1272 -37040 -41793 -44459 -33491 -13516 17578 25045 17053 19083 6671 7389 6778 20591 12982 17635
1258 17635 24935 25824 19862 15630 12566 -8791 -636 15166 17800 14897 -2512 -15342 -21714 -25401
1244 -25401 3214 9153 -5560 -15349 -7701 7343 13921 26748 12035 763 15191 22648 37962
1231 37962 13020 -4480 13365 16685 22379 9631 -2438 960 -14700 -26738 -13087 4523
1219 4523 20011 28285 33792 30929 22563 34872 33603 26630 22157 20156 8276 5272 1894 19337
1205 19337 36743 31277 21443 27443 45566 29035 16387 16108 21813 -3054 -20557 -11129 3447
1192 3447 15793 10280 8288 4285 4560 15944 17149 6158 14231 18089 748 1545 29035 37862
1178 37862 10965 -6284 8398 2778 -22770 -22747 -14547 5177 14404 -21831 -3191 30272 29289
1165 29289 23728 5390 -5854 -28184 -45061 -54680 -68576 -62807 -42970 -14484 -3511 -4415 -28808
1152 -28808 -37153 -43242 -33302 -31300 -31557 -42594 -20017 -4581 7252 16880 7205 -9444 -12906 -18723
1138 -18723 -19743 -24903 -40603 -23500 -24314 -14033 -6330 -4703 1719 -22799 -25571 -34586 -28178 -14528
1124 -14528 -16411 -18428 -18678 611 2073 16715 43815 31169 18306 19573 31788 21598 1836
1111 1836 -15631 -8935 6373 -1290 -13990 -34730 -22117 9984 17123 -2968 -3129 12910 29497
1098 29497 19192 15535 21591 31635 25086 8114 14759 12249 8168 -4554 -11610 -15924 -1740
1085 -1740 6264 17761 15099 6147 17335 27334 30402 10221 -8231 -21442 -12158 10579 11736
1072 11736 2631 848 2000 -681 -470 -15360 -6634 16043 29189 25826 19115 25629 28549 27572
1058 27572 16083 11662 28925 30458 20615 8605 15417 23003 37965 33960 32598 18779 12724
1045 12724 18651 -3416 -35391 -31937 -28133 -28262 -39386 -27523 -6796 10917 4366 12692 11990 -452
1031 -452 -19418 -13424 915 3933 2811 -222 10653 13672 6773 11260 3852 1328 18175 7956
1017 7956 7764 23189 9402 -18572 -33999 -14463 8595 16723 1697 -5859 1125 -10764 1798
1004 1798 10771 14004 14542 15167 3208 7321 11398 8963 16229 8069 -2669 -2505 -13613 -11295 9933
989 9933 13140 2288 -8812 -23478 5812 25513 19522 -13208 -24566 -41929 -46206 -22615 -24916
976 -24916 -17477 1448 -12379 -10089 -5940 -19380 -7044 8822 16517 29705 41368 35144 11847
963 11847 3947 4564 -7958 -5390 -16620 -16883 -33618 -34350 -31842 -8287 21140 20861 15233 10407 5513
948 5513 1307 478 -6361 -23565 -23263 -4374 25703 20911 2524 -4822 -2303 2630 3935 2310 5325
933 5325 8886 15809 -8170 -7661 5102 -3450 -22932 -21805 8297 22607 1362 -22031 -29017 -33817
919 -33817 -25793 -18845 -5139 15750 12766 5406 7758 13514 11290 -9685 -17758 -1792 11666 898
905 898 4495 18905 -3574 -27232 -24911 -23207 -15374 -1474 7766 6316 -5589 3998 7165 7161 14248
890 14248 1192 -17014 -29110 -36446 -23774 -10405 -665 4894 -1064 11068 10979 32877 14598
877 14598 5797 22501 24161 10536 10094 18753 15901 4915 450 15175 25815 -724 -20721
864 -20721 709 13592 7119 7657 -1946 -14381 -16873 3203 -14856 -23968 -6867 5553 7315
851 7315 -4985 -504 26112 27530 34851 30643 21751 23737 23716 13075 -1639 -22138 -50841 -55517
837 -55517 -40472 -20815 -17588 -24712 -2243 301 -16022 -4589 2852 4387 8093 10406 14154 21887
823 21887 17961 12503 -13825 -34267 -26993 -11064 9102 2395 -2470 409 9013 17337 24229 18861
809 18861 26576 33858 45474 23313 8026 3658 -12008 -16211 -10591 -5116 1221 -1479 -10190 -26483
795 -26483 -19615 2096 10459 17537 18681 15066 -387 -13996 -17131 -14243 -21907 -36205 -9531 -15209
781 -15209 -40256 -35837 -10925 -1895 -15692 -23100 -14140 9211 10295 2522 -13886 -29895 -19484
768 -19484 14165 24856 2678 5925 18616 10566 -9805 -5314 6676 9942 6508 1478 -1323
755 -1323 -7222 -22232 -26729 -25523 -17946 -9642 6172 21014 37210 35461 30136 12503 -7208 1171
741 1171 -147 -372 -1447 -4231 -9847 -9297 -9725 13141 27022 16713 -16786 -30244 -32455 -22007
727 -22007 -31769 -42625 -36844 -27833 -6207 -14652 -30116 -22941 -15130 -24728 11994 16487 -5303 -27395
713 -27395 -31352 -10382 -6678 -13138 -1923 11743 6950 -4340 -10166 -2197 6679 2398 1174 -860
699 -860 -13478 -16343 1957 11039 32490 38107 36133 31609 30676 22914 15099 -6454 9988 24852
685 24852 10400 1293 -24556 -39468 -19116 -3252 -4461 -14816 -3756 -6340 -17326 -28532 -10908
672 -10908 3035 4845 9040 8027 17827 35892 35703 24129 21143 13089 11694 18221 26559 7224
658 7224 7962 27320 24071 9643 12554 10522 -10099 -20797 -22451 -32466 -33562 -29118 -23103 -20681
644 -20681 -37057 -33739 -24332 -15951 -717 28590 34208 -734 -5856 -5076 -9479 -12867 -15062 -11453
630 -11453 14877 43130 49816 60279 43639 18029 10521 -2860 -6500 -21059 -24956 -34502 -33775
617 -33775 -28321 -22522 -17516 -23566 -6800 20281 22351 9591 12135 23360 25794 22205 -3735 -28185
603 -28185 -40684 -24649 -7248 8585 -14606 -12243 2209 9134 12880 16481 30337 15769 3244
590 3244 5717 16345 15561 -873 35 -7393 -12093 -8202 -6002 -10262 -6835 6878 5805 3138 -1157
575 -1157 -8162 -3236 2102 -18099 -17833 10090 33357 23557 18156 4399 -1226 17387 16494 21527
561 21527 3329 1722 11645 17537 17016 -2110 -3419 -2484 11718 5731 3681 9909 13492 333
547 333 10849 11013 8959 15053 18984 12743 26567 26967 27248 -8468 -31284 -18620 1253 9781 -10785
532 -10785 -27142 -10003 -18563 -14569 721 14569 13760 -10021 -15626 -14585 -7528 22225 21121 15583
518 15583 14201 562 -3543 -10697 -5454 3479 -5539 5752 12031 21455 18078 19356 21229 17612
504 17612 12411 -8807 -23745 -30253 -24599 -29000 -22933 6406 165 -13830 -21750 -4030 -8142 -5702
490 -5702 -10170 9990 29576 6207 -8232 4934 4177 -7815 -14338 -24408 -32823 -15049 -7416
477 -7416 -14725 -15739 -3913 12832 -4382 -6398 3261 -210 7465 12932 -730 -11242 -14760 -23105
463 -23105 -26486 -41296 -46095 -36483 -28056 -5176 1010 -1509 3827 -5687 -2736 -17067 -33994 -32469
449 -32469 -24939 -15792 -8943 -12366 -13183 -17681 -13969 -12133 -14873 -3985 -15587 -11613 -4362 -21975
435 -21975 -19311 13594 37658 45501 32684 23805 16945 21986 18551 8625 2686 -3757 1482 1901
421 1901 14233 7119 3396 -6841 -15505 -18104 -13629 707 18350 7233 -3412 -3368 1224 1300 -227
406 -227 -1467 8918 17071 9670 8455 4732 4103 15742 22172 8001 16037 16147 6966 7006 3627 1460
390 1460 8732 2785 4451 29722 31764 19879 7398 -4593 -7702 1227 11754 15174 -2648 -17928
376 -17928 -13011 -13624 -11071 -6084 -19062 -24451 -22045 -27560 -24835 -14145 -15212 -11255 -14719 -19764 -15107
361 -15107 -6660 735 20264 24965 26929 31913 12932 -1430 -7517 -6205 -28145 -21220 -4519 16478
347 16478 24354 13464 707 -5509 6582 7747 10492 2524 12182 21681 13948 19595 22206 10701
333 10701 15637 8253 15667 24719 5020 -8932 -13353 -14559 -25771 -25120 -499 6360 10141 16662
319 16662 28199 32878 15625 5228 3049 6181 14907 2230 623 2121 -8491 -14605 -15190 -1198
305 -1198 8613 3208 -10375 -14066 -4287 -20075 -27146 -15362 -3518 -7871 -22086 -26826 -27080 -15094
291 -15094 -10927 -2678 11513 21141 32875 39673 38486 30162 27043 34353 28152 25011 14130 20380
277 20380 12815 -2409 1266 9942 13344 19637 22813 -607 -14006 -13722 -10976 -9162 13883 10259
263 10259 -181 14559 15589 16546 12732 7337 1677 5504 5583 -1748 1875 -2186 59 -1805 3342
248 3342 549 -7738 -3656 -2543 -4424 1653 5846 16199 9296 3503 -4391 -2873 7745 4833 -3844
233 -3844 4824 -3194 -9302 5904 8318 13241 19057 17215 17574 16804 6256 -3500 725 4355 1043
218 1043 -7533 -3405 -4761 -1457 -11909 -19314 -18758 -11943 -13914 -10149 -18887 -21977 -17197 -23897 -16570
203 -16570 -11980 -21162 -20706 -16059 -12757 -6786 -8348 750 -904 -2371 -1557 -13504 -8698 636 1132
188 1132 246 5631 13858 17567 22550 24453 8872 -4861 -995 4200 1928 -1254 -2730 6635 -6064
173 -6064 -5501 -10010 -3321 -1176 -14491 -16306 -8066 -17004 -26517 -25587 -13786 -18658 -7010 138 -3818
158 -3818 -7725 -4760 6583 17430 16209 5575 2418 -6969 -1002 11606 11862 17729 3455 -397
144 -397 -6280 5931 10308 12783 -4669 -2906 -2929 -149 4128 3215 14320 -1090 -12350 4747 22728
129 22728 27118 23300 28269 12716 2034 6365 5495 10276 24830 16319 6445 13827 10313 2342
115 2342 4915 20676 29192 16240 11073 120 -1151 8125 5927 14879 29668 28869 26344 8779
101 8779 8353 13650 15374 5706 -5026 -1389 -723 1789 3000 2094 -1820 -13082 -13353 -15229 -6501 1916
85 1916 -2710 -4762 -7394 -11835 -3690 14994 13603 19372 15883 460 3076 11463 20929 27138 19281
70 19281 5933 -2987 4088 -790 -10040 -3040 2959 -7177 -23357 -36716 -29403 -23039 -21357 -17991
56 -17991 -16512 -13044 4239 22102 11122 245 -9521 -3052 6325 7370 11036 -8016 -18472 -16157
42 -16157 -3284 -7775 -3972 -1590 6094 15249 29353 28573 11669 11334 5528 8372 -3124 -15373
28 -15373 -15123 -15611 -14529 -5646 6203 22078 33837 24149 3078 1544 5894 4805 3971 12722 12817
13 12817 2308 4211 1899 -7561 1863 1679 -4621 3582 10761 2591 -4778 6178 9550
0 9550
$$ Imaginary data points
##PAGE= N=2
##DATA TABLE= (X++(I..I)), XYDATA
32767 14084 30541 25862 18687 10689 5199 10358 27974 35309 36550 34771 22699 15657 17562 23074
32753 23074 28455 42438 56592 44997 34843 28012 32766 45355 37210 35495 33712 37491 46761
32740 46761 49303 57703 59653 60612 62932 48703 46063 50078 64389 78190 75325 52528 39509
32727 39509 39643 54471 71191 74269 73309 72553 63292 52178 42973 50044 66493 68796 70379 83204
32713 83204 85959 75920 70659 84530 89225 89339 90972 76526 70264 81895 98415 98366 97993 86424
32699 86424 80393 85522 96962 99312 103499 108200 103776 98250 90609 98993 108551 99682 80159 71185
32685 71185 81826 92033 101968 111856 112173 110607 120695 114767 97289 116221 123488 105514 104254
32672 104254 102059 108815 110742 108242 105136 110600 104243 114709 111359 109185 126236 136773 135146
32659 135146 130466 123525 128751 123710 113382 128241 144328 133316 124614 143003 153338 144202 138030
32646 138030 142875 152310 149322 146301 166497 160517 147376 147076 130430 125127 130337 129054 139540
32633 139540 160317 166617 159234 148618 147191 156569 157157 168798 157581 136253 117573 122520 155107
32620 155107 191465 198217 185562 166531 151844 140401 152166 159787 164148 181529 182853 164989
32608 164989 166753 161559 162254 161918 166220 183900 191032 190924 196072 190109 182338 165509 161820 167312
32594 167312 169975 177360 180862 194845 201638 204686 191965 176748 168288 171541 172829 178156 182805
32581 182805 165098 168019 178987 179206 181241 190283 202009 195328 197359 197429 188700 207811 199310 195926
32567 195926 201990 226039 229099 242072 234043 219539 206172 177727 178894 208959 205137 203701 200967
32554 200967 199394 217859 225469 223202 213425 210161 207519 216946 221915 234655 232478 221273 217466
32541 217466 221169 219562 206366 198050 206077 200021 199353 212623 195150 208437 231928 228674 218539
32528 218539 234087 228302 235278 228267 223721 222322 224854 223119 230283 215789 224726 233752 232461 240103
32514 240103 253975 263179 271671 254664 254183 259331 248565 266193 281858 271145 253963 240350
32502 240350 239368 232450 227585 235152 240367 257653 249849 253543 269065 243306 238803 254199 250357
32489 250357 252401 265297 260726 266109 282672 266911 267836 258092 252366 242290 245232 240800 242547
32476 242547 262001 251931 252878 265103 280795 283614 272678 272060 272378 282794 280730 294349 296120
32463 296120 277903 262783 276611 300887 288266 276132 263131 271240 291419 290015 278930 273139
32451 273139 289255 279366 268734 251742 240487 244909 259424 272405 283771 284791 284354 283899 273972
32438 273972 267144 269681 284662 285046 279705 272119 279819 293214 283325 271938 287112 281828 290059
32425 290059 297913 300913 298084 280045 272322 268169 256268 261972 278991 289960 280498 284992 282906
32412 282906 287860 278100 286764 309897 314835 317775 306325 299083 315488 314018 310596 303792 310825
32399 310825 315656 302230 289022 296173 298900 289306 290615 290055 297521 316657 320256 305048 303542
32386 303542 308001 318394 325099 319241 298013 299187 300343 314630 320529 327734 316094 311890 328064
32373 328064 354605 335286 321004 315699 308048 290080 311969 323679 327406 323490 329239 329696 321101
32360 321101 311133 309824 313675 321919 318676 314543 305011 312096 314091 322590 327736 333046 347617 344382
32346 344382 333070 324351 334424 322125 305467 312288 318344 332198 328682 322175 317360 320734 327987
32333 327987 317073 311671 323309 318348 308597 311591 310476 303428 308139 322067 315350 310386 318986
32320 318986 335810 331149 336463 340648 343217 346145 330314 326119 338563 343989 336251 328225 338540
32307 338540 340937 325379 318139 323825 336966 345107 337442 319138 310100 305600 315286 321587 333944
32294 333944 348753 357248 345182 336833 336577 346539 348433 339259 338042 363685 363559 359826 343397 339081
32280 339081 347604 348222 344163 345621 359327 362914 346980 324453 312043 320213 333836 352517 363263
32267 363263 352651 328331 319030 349061 353766 343931 345252 347298 341614 348033 366460 366381 357782 366449
32253 366449 352102 330996 325186 335137 334480 326357 333940 338125 350140 350131 351360 365470 354468 349769
32239 349769 343148 349864 357456 329121 317660 329450 325772 339076 318465 320622 328438 310763 300071
32226 300071 292160 292961 320357 326287 327880 342482 343577 332782 331104 335291 362803 368645 359128
32213 359128 348197 328668 333633 335860 332210 337642 343636 340810 341470 344922 351222 344976 347549 351590
32199 351590 354591 331877 328211 327047 335194 316378 326012 342836 349707 353881 340610 349056 335703
32186 335703 325162 338098 341609 328724 327374 304220 295397 307300 320977 321236 324076 339755 365931
32173 365931 368826 351392 346792 344223 347215 346411 332988 312354 312662 338023 347526 354645 358252 368762
32159 368762 361208 361174 350055 327787 316911 341121 356109 355201 340662 342917 347230 361712 356477
32146 356477 347325 346378 341659 333283 340555 357630 353859 344508 332783 332239 329720 321149 326094 344277
32132 344277 358327 338505 338734 354612 362311 359573 363174 369283 389452 376588 363274 353431 347954
32119 347954 349990 343656 356611 362125 357551 350607 346884 347688 363043 364129 360574 336551 329961 345833
32105 345833 374048 368212 341749 341414 346422 345542 333957 335648 329530 354863 348119 350529 364158
32092 364158 374845 373745 352336 335842 342893 347823 365072 349384 347987 357486 371342 376311 363999
32079 363999 354845 347940 340002 342147 356997 369437 363755 346167 328545 326323 344381 353391 356615
32066 356615 360820 378509 379805 374875 364434 387065 376026 352525 349334 349316 367980 374142 345413
32053 345413 339917 348079 356279 357263 337940 328632 338742 358598 381893 377039 378681 395700 394090
32040 394090 369474 368155 375235 372650 359761 348703 348503 352557 358111 354510 350897 359362 356577 363453
32026 363453 370862 356797 361796 355869 359242 366159 366148 359202 338228 326724 327487 319472 337589 352215
32012 352215 337050 337283 346992 325306 326140 333665 352596 355761 347656 339739 321639 324069 339359
31999 339359 329315 329666 333017 324461 319175 340881 358623 339163 327348 341102 337253 333857 340920
31986 340920 344950 349618 369625 372309 370062 366592 383046 397646 385264 368140 356862 346614
31974 346614 356831 365460 367015 377511 382604 360743 357011 363680 366018 361647 347297 338795 342303
31961 342303 331104 340201 337292 335210 349377 366721 375925 366584 348903 348667 356313 351064 361188
31948 361188 371566 355716 341281 333916 335566 355446 346703 339269 359576 358001 340755 329934
31936 329934 341890 367945 372416 353994 329727 317179 320255 345068 366634 387662 370190 370408
31924 370408 383141 388435 371793 366664 360472 354458 344979 350875 344282 342089 354727 371881 382313
31911 382313 363935 339258 337911 346886 356211 358659 334994 338215 357890 370468 366365 362944 357269
31898 357269 365023 353227 340626 330935 335763 339909 357902 405633 419731 395088 370985 355261
31886 355261 356536 345824 346830 323319 340292 365124 356422 356137 356392 359583 356163 334140 325355
31873 325355 342570 334001 331389 335827 363298 380209 383701 386192 385903 372700 377845 371031 376983
31860 376983 378920 368428 349535 333656 334231 347405 347623 346309 342909 323579 323238 333523 370420
31847 370420 349932 338337 363986 387549 381102 369444 364198 379866 388473 386139 393392 386171 379090
31834 379090 389855 374734 370037 386637 378638 374627 364617 357749 347109 345801 352075 367396 375539
31821 375539 406172 386193 381885 385246 368203 365239 379900 385932 379724 374377 372285 367044 364425
31808 364425 371804 382895 362423 366274 371457 344710 325198 341248 368625 386204 371667 360515
31796 360515 362329 364039 370818 386767 388265 358113 356203 380698 392681 384450 381139 358508 358268
31783 358268 366509 360368 377514 372584 363345 340446 329557 345709 357154 343687 340473 341973 317524
31770 317524 320751 342890 357958 361497 377265 382268 388248 389134 384618 376526 370074 365587 346139
31757 346139 341451 344856 351521 354062 355567 342145 342571 350897 364136 362143 351534 350971 349171 359194
31743 359194 356684 351371 356929 371453 374291 367365 364994 364543 356064 362446 365105 375499 380200 354648
31729 354648 338950 335710 324411 344297 354008 341855 347295 351070 354199 355256 376712 382947 383369
31716 383369 382824 357839 352686 352492 335758 344065 352244 347878 340975 335024 343249 359086 366949 355037
31702 355037 353836 351734 356300 385308 371433 353986 349589 350595 348228 348224 342697 346029 371197 363472
31688 363472 377483 401910 399229 388841 372838 349933 357902 369991 348155 318209 328332 329620
31676 329620 333236 320244 322357 345289 347500 357617 362285 340723 331157 345632 380256 376652 365318
31663 365318 377633 363419 351784 381512 382028 372811 359276 358384 354056 341306 328880 324372 323982
31650 323982 327535 330678 330374 341994 353786 354923 336039 341576 354214 361096 345192 356570 363264
31637 363264 355037 347772 331606 351133 374499 383838 370140 344957 328961 342087 352662 351338
31625 351338 330693 328189 331383 344745 355177 347642 342848 343244 355764 351293 351476 365662 352015
31612 352015 352311 362731 369098 352375 331670 338192 352006 362072 349571 338534 343365 330646
31600 330646 320026 330983 349104 353629 355926 350597 353510 364266 380796 400156 386677 367355
31588 367355 350468 357121 377089 386124 366571 356056 346311 335192 351764 349443 339868 337566 359941
31575 359941 358375 354589 378636 367075 351307 343023 349647 344431 346185 345533 360851 369222 372584
31562 372584 374362 373038 377300 369901 363825 357316 352144 370092 391006 389374 386459 385808 384329 367329
31548 367329 371504 383595 365832 361777 375646 370319 376412 379305 380415 375217 365210 358350 345630
31535 345630 355473 358299 355506 358211 365029 361784 381650 388745 392378 403354 391673 381084 380137
31522 380137 373870 370005 377033 384764 388481 395442 393170 386446 375933 361477 382350 397851 374233
31509 374233 364065 371000 362773 370500 386057 389761 381869 376431 383173 370709 355978 364021 360584
31496 360584 353825 351639 349072 347999 344226 348185 343318 352541 357877 343228 341167 332899 321770 339333
31482 339333 343357 339853 347430 354566 360656 356653 344272 344344 357984 370899 365118 359937 372541 390886
31468 390886 389057 381867 374618 355927 362689 392464 384982 373772 358138 345718 360152 352446 359818
31455 359818 361113 352790 354043 367752 365390 353479 365511 369779 375406 395781 378025 374581 385767
31442 385767 385863 379011 370197 363258 357353 355646 369561 350292 346225 343424 358797 370222 362798 359460
31428 359460 360341 380898 389795 380097 372418 361906 358667 326959 313015 335713 356917 361176 349636
31415 349636 349347 348385 354212 356337 347138 329704 340388 348408 338831 331858 322653 332920 362078 370105
31401 370105 364556 367773 368392 364678 363856 367248 358083 363121 359662 359697 364598 365870 363346 351435 354565
31386 354565 349548 350521 349477 345783 356566 365691 366542 350550 341030 331651 316862 320114 320927 337955
31372 337955 369723 380923 376263 376226 360185 344202 345392 370763 397678 368260 357057 380533
31360 380533 382939 389328 396670 382110 372159 356391 350026 350254 349660 328570 328723 337824 331030 320392
31346 320392 317888 351157 354630 351784 363664 359764 359564 368992 371432 367136 363531 343459 355603
31333 355603 379561 388322 380575 371152 351441 356660 362923 365594 380385 387658 412117 403715 394052
31320 394052 388511 385430 378458 369809 371627 379937 372102 352228 360615 388076 392168 391488 382082 387729
31306 387729 389977 385027 394811 391678 403078 392747 391270 387163 361886 361764 373137 378961 383162
31293 383162 383758 396215 397682 371914 343071 345287 353638 341195 352016 348503 361731 375290 374879
31280 374879 365813 349872 343983 353472 374903 384899 393570 389179 390391 385245 372083 355458 346212
31267 346212 346504 355413 342798 325587 333445 349793 376654 388644 369126 366556 340233 328024
31255 328024 332845 364308 369312 348567 342207 339765 359413 378420 371454 359481 354081 357691 342541
31242 342541 337814 345980 337036 348306 346589 354344 358200 364676 365676 363147 355796 355944 353106 360272
31228 360272 374845 372991 355632 357673 385196 395863 387871 375046 377519 390450 379414 379094 380554
31215 380554 362511 363397 371158 360037 354799 362052 357554 344100 348962 363427 355987 336740 329909
31202 329909 337374 352126 365067 376745 370807 366301 370592 364478 371714 361839 350444 364161 360433
31189 360433 359793 360164 325464 320052 324308 351034 369775 375589 395486 390812 387608 390546 371108
31176 371108 359617 366277 353176 357427 364596 366602 379190 370827 353454 354958 358385 353395 358320
31163 358320 335426 333167 345129 342402 358561 378909 378476 370236 338640 323075 344898 352000 348084
31150 348084 348367 361219 359769 374801 376808 376378 389767 381267 373242 366354 374737 386798 385096 378304
31136 378304 356093 339651 336433 329429 352570 390697 388232 368064 360257 351059 355755 355817 360090
31123 360090 379639 386607 376178 371894 365909 366282 373808 373662 362470 366869 361615 365012 366682 354074
31109 354074 359638 367697 369848 360526 348675 361988 379450 371964 363278 346739 354344 354871 357520
31096 357520 361367 371711 374584 365304 361278 380566 386731 366770 359409 359786 353600 366366 369200
31083 369200 353454 353361 369020 370424 362271 361040 372441 377496 378773 387263 392010 377943 371533 374664
31069 374664 374448 378532 383455 382012 384085 378744 381214 375046 363100 351139 351352 354116 343169 344306
31055 344306 339877 340180 355659 358628 349642 353318 374515 374552 375201 384975 383379 378146 374809 367105 373768
31040 373768 377800 392625 399953 387824 374614 353907 343639 335292 324368 327991 321096 338009
31028 338009 326961 314439 308282 324414 345203 359573 358996 361956 374860 379198 363182 354863 343825
31015 343825 351397 360804 376016 369569 363407 369990 369156 354891 350543 371993 378806 371811 368044 381692
31001 381692 384447 367988 358774 359859 371114 387588 361050 362222 371340 367920 362902 357118 378421
30988 378421 367371 336958 346820 358734 371559 366536 364378 353881 359203 367533 369147 354647 345819
30975 345819 356549 359387 360843 362349 356398 344498 343633 346410 369974 366065 359966 349459 347465
30962 347465 362034 355721 335564 343297 364963 379968 378218 378793 383357 364959 337636 336257 345119
30949 345119 345191 361750 384107 396886 388612 373043 372492 375711 369011 377479 382455 355516 339154
30936 339154 348014 356846 335871 327930 328511 328017 333277 345543 349662 349683 344338 359314 382341 382974
30922 382974 386607 387390 392261 385039 388251 386729 394710 419062 402481 383093 389590 396494 380711
30909 380711 386773 380194 380466 395062 380555 374772 376183 372537 382184 379137 357215 342105 346963
30896 346963 360267 371226 381960 386995 376438 371631 375733 386222 377173 369183 380082 378823 365627
30883 365627 356507 356220 368728 379224 388613 380779 377143 357990 352241 362676 338620 349797 371561
30870 371561 365960 368545 366280 357715 367827 385583 399241 405917 392200 388855 393962 384471 366904
30857 366904 350278 351739 357697 356645 357372 351174 346426 351133 347342 357223 375104 384084 382096 392346
30843 392346 387240 367048 372272 378094 367498 384752 372220 351180 347373 366450 390222 405359
30831 405359 404488 402366 381237 368676 379566 383460 385956 372792 367952 370967 397463 398189 372329
30818 372329 361124 381993 404100 413572 397047 386114 366972 354969 368900 382389 387741 398640
30806 398640 357976 345501 360982 372619 366202 365331 359387 365360 370292 373254 383904 387457 386402
30793 386402 375671 376385 375211 386128 392021 414831 414265 419353 401852 379126 368992 370825 372311
30780 372311 372484 377250 374026 362075 357070 368276 378278 378522 372485 359916 360327 366801 374993 377398
30766 377398 373852 378021 370439 364810 362291 365050 353288 353631 366250 368183 371495 362122 380842 379340
30752 379340 376115 364051 375563 377502 348726 353816 352681 352875 378126 400701 388022 365425 363824
30739 363824 376589 383452 383884 384072 383354 377137 388566 396479 395550 391933 377777 366532 373997 383872
30725 383872 384457 382050 374734 370391 367452 355014 359172 357724 365724 362953 344666 330228 332681 358318
30711 358318 364054 372378 376351 386365 379382 371803 359295 353689 377850 383888 387733 387346 378024 372410
30697 372410 370469 354482 361499 367485 368370 364730 372105 372090 388961 383787 373880 362991 376509 400587
30683 400587 407727 405458 391753 382526 364314 367618 363793 360556 365307 378483 382120 384584 390603
30670 390603 392746 401059 388149 368479 369184 381969 397632 401811 418853 423980 420714 407783 405549
30657 405549 404187 403844 392167 359624 344943 337363 346147 352338 337243 330430 356374 359520 355798
30644 355798 370904 379199 390215 384912 395786 394040 372871 352575 362838 360427 362793 357733 383498
30631 383498 409097 403423 377812 377704 396563 410234 371526 342262 356654 358839 366423 394926
30619 394926 391060 381808 376013 365152 364740 359862 372182 374688 373453 367580 374402 383323 394664 405894
30605 405894 414708 394465 380313 401381 404631 401995 402114 412571 392984 367180 383332 389216 401683
30592 401683 421248 410022 397652 394669 400992 404654 408266 396507 406126 414479 419677 391150 372967
30579 372967 372645 378307 382206 388812 407454 408572 400737 381880 367563 370049 373000 384616 387275
30566 387275 371941 382761 391267 376653 385936 379921 379071 384110 370643 376394 385832 383929 382402
30553 382402 375705 378006 376120 373178 375804 384762 384477 374528 365978 361583 369415 367630 367865 372453 376820
30538 376820 377257 374503 395605 422591 423914 395576 389844 399081 400409 399878 391557 378746 377737 369577
30524 369577 368562 379651 377660 373672 378972 372800 369229 349094 358098 352733 359540 347962 340385
30511 340385 340085 327477 331223 336968 359185 378471 360176 332150 353944 374977 374707 360162 378822
30498 378822 401162 422940 421423 416330 402015 405149 415170 407173 387450 377680 376622 360885 359181
30485 359181 355126 349622 376141 382814 364744 356744 369766 387928 394210 394990 386399 359490 369023
30472 369023 385714 373584 376119 393903 379209 375420 375738 360332 371307 364392 361657 368644 364551
30459 364551 361495 359469 367798 354341 352489 359044 376694 377655 376143 384946 397600 399528 393473 371767
30445 371767 373140 380010 403866 411376 402944 394193 377501 369411 363078 370294 369856 398695 413684
30432 413684 403945 387875 379873 351419 349963 354006 365615 370054 375734 392218 390209 376183 378109
30419 378109 400464 393356 367292 346340 364828 374023 372076 360161 354546 347804 368393 398109
30407 398109 396549 375362 362818 356143 378926 383396 376406 386171 395871 387411 373019 368391 380977
30394 380977 363660 354086 365099 367119 378877 392032 383143 404101 410917 391049 373160 348945
30382 348945 351020 347548 357714 365810 357698 349552 347786 352654 361047 350221 329382 342230 360931
30369 360931 390782 380581 369318 372080 394903 388098 368156 364174 366736 369410 366493 358253 352384
30356 352384 342831 340696 359147 381242 392992 390804 383243 388963 400344 399413 382024 388090 385649
30343 385649 372380 385309 377025 370353 387119 396063 399031 399588 395111 386915 374499 371913 382463
30330 382463 358097 345492 347345 378550 397796 413248 406257 385850 385162 385384 377228 377842 375364
30317 375364 366819 376753 377053 380662 380018 383516 383038 388713 387845 389605 384069 374199 367878 362189 371932
$$ [...]
##END NTUPLES=NMR SPECTRUM
##END=
