##TITLE=Analysis number 320742
Compound Code mo 07902
Book Reference 487/93
Project Code adrs
Chemist Name janh
##JCAMPDX= 6.0         $$ Bruker NMR JCAMP-DX V2.0
##DATA TYPE= NMR SPECTRUM
##DATA CLASS= NTUPLES
##ORIGIN= Bruker BioSpin GmbH
##OWNER= nmr
$$ XWIN-NMR		Version 3.5
$$ Fri Jul  7 09:02:45 2006 GMT Daylight Time (UT+1h)  MAYBRIDGE\nmr@NMR_250MHZ
##.OBSERVE FREQUENCY= 250.131544655141
##.OBSERVE NUCLEUS= ^1H
##.ACQUISITION MODE= SIMULTANEOUS (DQD)
##.ACQUISITION SCHEME= undefined
##.AVERAGES= 16
##.DIGITISER RES= 18
##SPECTROMETER/DATA SYSTEM= dpx250
##.PULSE SEQUENCE= zg30
##.SOLVENT NAME= CDCl3
##.SHIFT REFERENCE= (INTERNAL, CDCl3, 0, 16.522)
##AUDIT TRAIL= $$ (NUMBER, WHEN, WHO, WHERE, WHAT)
$$ ##TITLE= Audit trail, XWIN-NMR		Version 3.5
$$ ##JCAMPDX= 5.01
$$ ##ORIGIN= Bruker BioSpin GmbH
$$ ##OWNER= nmr
$$ C:\u/data/dgb/nmr/ADRS/2460/pdata/1/auditp.txt
$$ ##AUDIT TRAIL=  $$ (NUMBER, WHEN, WHO, WHERE, WHAT)
(   1,<2006-07-07 09:02:26.13 +100>,<MAYBRIDGE\nmr>,<NMR_250MHZ>,
      <created by zg, POWCHK disabled, PULCHK disabled
       configuration hash MD5:
       E2 DF 36 D8 04 B2 41 60 5A D7 A3 38 5A 4B D0 FE
       data hash MD5: 64K
       AF 17 12 EF FF 11 32 C4 E2 D3 EF 71 20 63 85 83>)
(   2,<2006-07-07 09:02:37.17 +100>,<MAYBRIDGE\nmr>,<NMR_250MHZ>,
      <Start of raw data processing
       ef LB = 0.3 FT_mod = 6 PKNL = 1 SI = 32K 
       data hash MD5: 32K
       DD 47 7D 2A B5 74 19 48 6A 4A ED A6 64 52 65 A7>)
(   3,<2006-07-07 09:02:38.74 +100>,<MAYBRIDGE\nmr>,<NMR_250MHZ>,
      <apk 
       data hash MD5: 32K
       D2 E2 AE E2 32 6A D9 9B B6 D5 C8 C7 75 99 92 A9>)
(   4,<2006-07-07 09:02:39.47 +100>,<MAYBRIDGE\nmr>,<NMR_250MHZ>,
      <abs ABSG = 5 
       data hash MD5: 32K
       02 92 E3 13 5D E6 22 C7 F0 9D E2 C0 E4 A4 C8 85>)
$$ ##END=
$$ 
$$ hash MD5
$$ B3 B5 E9 DD 6D 3C 54 AA 36 5D E7 04 75 B4 A5 EC
##$RELAX= 
##$RELAX= 
##$RELAX= 
##$RELAX= 
##$RELAX= 
##$RELAX= 
##$RELAX= 
$$ Bruker specific parameters
$$ --------------------------
##$DU= <C:\u>
##$EXPNO= 2460
##$NAME= <ADRS>
##$PROCNO= 1
##$TYPE= <nmr>
##$USER= <dgb>
##$AMP= (0..31)
100 100 100 100 100 100 100 100 100 100 100 100 100 100 100 100 100 100 
100 100 100 100 100 100 100 100 100 100 100 100 100 100 
##$AQSEQ= 0
##$AQ_mod= 3
##$AUNM= <au_zg>
##$AUTOPOS= <32 >
##$BF1= 250.13
##$BF2= 250.13
##$BF3= 250.13
##$BF4= 250.13
##$BF5= 500.13
##$BF6= 500.13
##$BF7= 500.13
##$BF8= 500.13
##$BYTORDA= 1
##$CFDGTYP= 0
##$CFRGTYP= 5
##$CHEMSTR= <none>
##$CNST= (0..31)
1 1 145 1 1 1 1 1 1 1 1 1 1 1 1 1 1 1 1 1 1 1 1 1 1 1 1 1 1 1 1 1 
##$CPDPRG= <>
##$CPDPRG1= <>
##$CPDPRG2= <>
##$CPDPRG3= <>
##$CPDPRG4= <mlev>
##$CPDPRG5= <mlev>
##$CPDPRG6= <mlev>
##$CPDPRG7= <mlev>
##$CPDPRG8= <mlev>
##$CPDPRGB= <>
##$CPDPRGT= <>
##$D= (0..31)
0 1 0 0 0 0 0 0 0 0.06 0 0 0 0 0 0 0.0002 0 0 0 0 0 0 0 0 0 0 0 0 0 0 
0 
##$DATE= 1152259345
##$DBL= (0..7)
120 120 120 120 120 120 120 120 
##$DBP= (0..7)
150 150 150 150 150 150 150 150 
##$DBP07= 0
##$DBPNAM0= <>
##$DBPNAM1= <>
$$ [...]
##$SUBNAM7= <"">
##$SUBNAM8= <"">
##$SUBNAM9= <"">
##$SW= 20.6930455092707
##$SWIBOX= (0..15)
0 0 3 0 0 0 0 0 0 0 0 0 0 0 0 0 
##$SW_h= 5175.983436853
##$TD= 65536
##$TD0= 1
##$TE= 295.16
##$TE2= 300
##$TE3= 300
##$TEG= 300
##$TL= (0..7)
0 120 120 120 120 120 120 120 
##$TP= (0..7)
150 150 150 150 150 150 150 150 
##$TP07= 0
##$TPNAME0= <>
##$TPNAME1= <>
##$TPNAME2= <>
##$TPNAME3= <>
##$TPNAME4= <>
##$TPNAME5= <>
##$TPNAME6= <>
##$TPNAME7= <>
##$TPOAL= (0..7)
0.5 0.5 0.5 0.5 0.5 0.5 0.5 0.5 
##$TPOFFS= (0..7)
0 0 0 0 0 0 0 0 
##$TUNHIN= 0
##$TUNHOUT= 0
##$TUNXOUT= 0
##$USERA1= <user>
##$USERA2= <user>
##$USERA3= <user>
##$USERA4= <user>
##$USERA5= <user>
##$V9= 5
##$VALIST= <valist>
##$VCLIST= <CCCCCCCCCCCCCCC>
##$VD= 0
##$VDLIST= <DDDDDDDDDDDDDDD>
##$VPLIST= <PPPPPPPPPPPPPPP>
##$VTLIST= <TTTTTTTTTTTTTTT>
##$WBST= 1024
##$WBSW= 4
##$XGAIN= (0..3)
0 0 0 0 
##$XL= 0
##$YL= 0
##$YMAX_a= 367457
##$YMIN_a= -420519
##$ZGOPTNS= <>
##$ZL1= 120
##$ZL2= 120
##$ZL3= 120
##$ZL4= 120
##$ABSF1= 16.522
##$ABSF2= -4.171173
##$ABSG= 5
##$ABSL= 3
##$ALPHA= 0
##$AQORDER= 0
##$ASSFAC= 0
##$ASSFACI= 0
##$ASSFACX= 0
##$ASSWID= 0
##$AUNMP= <proc_1d>
##$AZFE= 0.1
##$AZFW= 0.1
##$BCFW= 0
##$BC_mod= 0
##$BYTORDP= 0
##$COROFFS= 0
##$CY= 12.5
##$DATMOD= 1
##$DC= 0
##$DFILT= <>
##$DTYPP= 0
##$F1P= 14.0000005364418
##$F2P= -0.99999901652339
##$FCOR= 0.5
##$FTSIZE= 32768
##$FT_mod= 6
##$GAMMA= 0
##$GB= 0
##$INTBC= 1
##$INTSCL= 1
##$ISEN= 128
##$LB= 0.3
##$LEV0= 0
##$LPBIN= 0
##$MAXI= 10000
##$MC2= 0
##$MEAN= 0
##$ME_mod= 0
##$MI= 0
##$NCOEF= 0
##$NC_proc= -3
##$NLEV= 6
##$NOISF1= 0
##$NOISF2= 0
##$NSP= 0
##$NTH_PI= 0
##$NZP= 0
##$OFFSET= 16.522
##$PC= 1
##$PHC0= 169.4697
##$PHC1= 7.218502
##$PH_mod= 1
##$PKNL= yes
##$PPARMOD= 0
##$PSCAL= 4
##$PSIGN= 0
##$REVERSE= no
##$SF= 250.13
##$SI= 32768
##$SIGF1= 0
##$SIGF2= 0
##$SINO= 400
##$SIOLD= 32768
##$SREGLST= <1H.CDCl3>
##$SSB= 0
##$STSI= 32768
##$STSR= 0
##$SW_p= 5175.98343685301
##$SYMM= 0
##$S_DEV= 0
##$TDeff= 65536
##$TDoff= 0
##$TI= <Analysis number 999999
Compound Code 99
Book Reference 9
Project Code 9>
##$TILT= no
##$TM1= 0
##$TM2= 0
##$TOPLEV= 0
##$USERP1= <user>
##$USERP2= <user>
##$USERP3= <user>
##$USERP4= <user>
##$USERP5= <user>
##$WDW= 1
##$XDIM= 32768
##$YMAX_p= 393254479
##$YMIN_p= -215750
$$ End of Bruker specific parameters
$$ ---------------------------------
##NTUPLES= NMR SPECTRUM
##VAR_NAME=  FREQUENCY,     SPECTRUM/REAL,   SPECTRUM/IMAG
##SYMBOL=    X,             R,               I
##VAR_TYPE=  INDEPENDENT,   DEPENDENT,       DEPENDENT
##VAR_FORM=  AFFN,          ASDF,            ASDF
##VAR_DIM=   32768,         32768,           32768
##UNITS=     HZ,            ARBITRARY UNITS, ARBITRARY UNITS
##FACTOR=    0.157963299565203, 1,           1
##FIRST=     4132.6476996994, 0,             0
##LAST=      -1043.33573715361, 0,           0
##MIN=       -1043.33573715361, -215750,     0
##MAX=       4132.6476996994, 393254479,     0
$$ Real data points
##PAGE= N=1
##DATA TABLE= (X++(R..R)), XYDATA
$$ [...]
18636D6335k5139p0245k2276l9396k6960O8973N2555j1432L0375L3733l4980J1973
18624A3516K6542m5066j2531j8097K9003L680j3177R585k0147j065m0122N3370
18612a4509Q3658M043o7930k6385K1828O7915o793l0561j2814l0842O348M266
18600a776j5873n3104K1381M2848n4048j8553l7645j791M5756M0399J7564K5167
18588A0325L0655k0177n960M623m0223L5902J5760P2073J5536r5057j6132K2980
18576C0305l3613m6106k2757N9548K8476K9970j0679j1984L1350J5903j6218p5338
18564b1143K3132J036k1005J1662j3778K7924n4325K719N9167m2895N535L7587
18552A5616j4011N7169K0673J2404n6411p318j9111L7036M9948L8229n6260o691
$$ plain form
18636 46335 21196 -49049 -71325 -110721 -137681 -68708 -16153 -27585 2790 36523 1543 13516
18624 13516 40058 -5008 -17539 -35636 -6633 -2953 -16130 -6545 -26692 -27757 -67879 -14509
18612 -14509 69149 73192 5262 -21123 705 68620 61827 31266 18452 -12390 -6042 -1776
18600 -1776 -17649 -70753 -49372 -6524 -60572 -79125 -116770 -118561 -72805 -32406 -14842 10325
18588 10325 40980 20803 14843 19466 -20757 15145 30905 102978 118514 23457 7325 30305
18576 30305 -3308 -49414 -72171 -12623 15853 45823 35144 23160 54510 70413 54195 -21143
18564 -21143 1989 3025 -17980 -6318 -20096 7828 -46497 -43778 15389 -27506 -21971 15616
18552 15616 1605 58774 79447 91851 35440 28122 9011 46047 95995 134224 77964 71273
18540G1273K9230m2793j16588k2485K5567K9544K895k8897L8554J1817o3600R501
18528e5982L0693j1586k4425J6776L04k0351j8731L930J069l4639L1537n995Q1590
18515e810M5295n9071N172j274m843o4290L727M7435K8228M6644o267l0815K3157
18502B7288j0435j9192m5438J4975M0074o0665K2328P902M6244k161K94l5379
18490a4165J9745N0268o672m6058K5435N7425k3111k4406o043j4058l9437j7280
18478c8357J0860j5213J6079l012j4426l6481J6306O4685M4719M2056j2233O965
18466H1948J2178M8995n957m7593k8164k4810j0165J3324m3323L1259K0159n3699
18454e848k7050L0991P182j7348n68j4083k9678M51J6801K309n69L7419L5831
$$ plain form
18540 71273 100503 57710 -58878 -81363 -55796 -26252 -23357 -52254 -13700 -1883 -65483 -55982
18528 -55982 -25289 -36875 -61300 -44524 -44220 -64571 -83302 -79372 -78303 -112942 -81405 -87400 -5810
18515 -5810 39485 -19586 -14414 -15688 -20531 -84821 -81094 -33659 -5431 41213 34946 4131 27288
18502 27288 16853 -2339 -47777 -32802 7272 -53393 -31065 -23163 23081 20920 21214 -14165
18490 -14165 5580 55848 49176 3118 28553 85978 62867 38461 32418 18360 -21077 -38357
18478 -38357 -27497 -42710 -26631 -29643 -44069 -80550 -64244 441 45160 87216 74983 81948
18466 81948 94126 143121 137164 89571 61407 36597 26432 39756 -3567 27692 47851 -5848
18454 -5848 -32898 -1907 5275 -12073 -12641 -26724 -56402 -55951 -39150 -36841 -37410 9 35840
18441C5840p57j9492K7965m651j6543m0022l8398Q434N2434K9642K2873p528n7725
18428g928j4131M7183L4453n6381p734K1210l6156j715k8781l7662M8664K7193
18416a1785K4854K5345k4040k2034Q06M734j0431q557O2505n871m0399p613p5040
18403h7526m6297N8978K2425J1865j0032M9111L0794K5920n4693m9487N156l2398
18391g6184j0337k0093J1219K3908l8606J4947J4496O832l5283K1017J9992k439
18379g0531O0683k7878J3682M2916m1854N774K7606m5684k1124K1263J9120k1209
18367c7236j8698K8370J2099o8229J7232K7849M5082l6518J8299l6241L0092l2567
18355e0466L6927J3110l0470L8698M5049N2J1559m5523n3840l831Q2100N5681
$$ plain form
18441 35840 35083 15591 43556 38905 22362 -17660 -56058 -47624 4810 34452 57325 49797 -7928
18428 -7928 -22059 25124 59577 3196 -4538 16672 -19484 -21199 -49980 -87642 -38978 -11785
18416 -11785 13069 38414 14374 -7660 -6854 -2120 -12551 -21108 41397 35526 -4873 -12486 -87526
18403 -87526 -133823 -74845 -52420 -40555 -50587 -1476 29318 55238 545 -48942 -43786 -76184
18391 -76184 -86521 -106614 -95395 -71487 -110093 -95146 -80650 -73818 -109101 -88084 -68092 -70531
18379 -70531 -9848 -37726 -24044 18872 -22982 -17208 10398 -35286 -56410 -35147 -16027 -37236
18367 -37236 -55934 -27564 -15465 -83694 -66462 -38613 6469 -30049 -11750 -47991 -17899 -50466
18355 -50466 -13539 -429 -30899 7799 52848 52900 64459 18936 -34904 -38735 43365 99046
18343I9046K305k1967k0243J1310l6331o1862j7648k04K9374L4636m4054n969
18331c1607J2252K5677p68O628m3503L9472K3305m7091j0560k0213l1072L0207
18319d7273N1292N4108L258q231K2963K3065k2878k7940k1759l3814j7551N172
18307a9588n3666m288j1298N069N5343M5554L0004k3795J0475m364n9405k8900
18295e8859J8106J523M1761k9600Q997N5808L3217j146l5396q8587o294L1478
18283b8992k581o5974l6433Q8877O1017l9815n2558j4439K890j3795J5721k8462
18271a14544k528J0737j1338L4230N2636J0548M5084J5574n1788j6807j4745J4676
18259b8265O8031K404n3571l1368M8785O6445J3448k7243m3868j3414M3629K9861
$$ plain form
18343 99046 101351 79384 59141 70451 34120 -27742 -45390 -45594 -16220 18416 -25638 -31607
18331 -31607 -19355 6322 5554 12182 -31321 8151 31456 -15635 -26195 -46408 -77480 -47273
18319 -47273 4019 58127 61385 53154 76117 99182 76304 48364 26605 -7209 -24760 -19588
18307 -19588 -73254 -77542 -88840 -83771 -28428 17126 47130 23335 33810 29446 -29959 -58859
18295 -58859 -40753 -39230 2531 -27069 -18072 37736 70953 69807 34411 -54176 -60470 -28992
18283 -28992 -31573 -97547 -133980 -45103 15914 -23901 -76459 -90898 -88008 -101803 -86082 -114544
18271 -114544 -117072 -106335 -117673 -83443 -30807 -20259 24825 40399 -11389 -28196 -42941 -28265
18259 -28265 39766 42170 -11401 -42769 6016 72461 85909 58666 14798 1384 45013 74874
18247G4874N775O5441l9282q941O236K8590j05330n4074L7296O834L1939j5831
18235C3527J1770L1325M0879J3325o7712K935j03528L6029P0753n8054k8052j1976
18223b8779N6640O0241J2117l8034q321l4061R962K5657m8492K5524J7746l2063
18211A8137p3315R1391K8073k4847l552j116L5539P790m3087L1839P9955k9414
18199A17393j2244p028K3023l2820j6870O7052j8482l9048l6598k7465p34j325
18187A4854K7723L5004l2817K2204j6436o87j2941N4353R4126N987j37442j23595
18175f9667O0344P4104L4403N079k0957J0165K018n0436K3576P7104L0655J0034
18163A86422O800p6970J4967K5928R00Q2074K2698l1527O2j1234l3405l3163K0406
$$ plain form
18247 74874 80649 146090 106808 97867 104103 132693 27363 -26711 10585 17419 49358 33527
18235 33527 45297 76622 117501 130826 63114 66049 -37479 -1450 69303 11249 -16803 -28779
18223 -28779 27861 88102 100219 62185 53864 19803 29765 55422 6930 32454 50200 18137
18211 18137 -55178 36213 64286 39439 35887 34771 70310 78100 35013 66852 146807 117393
18199 117393 105149 98121 121144 88324 71454 138506 120024 80976 44378 16913 16179 14854
18187 14854 42577 77581 44764 66968 50532 49845 36904 91257 185383 191370 53928 -69667
18175 -69667 -9323 64781 99184 104263 83306 93471 95489 45053 68629 145733 176388 186422
18163 186422 193222 116252 131219 157147 158047 240121 262819 231292 231354 220120 186715 153552 173958
18150A73958P4960M4878M5211j7436j1054j8482o0321K0527P5287L6437j7114
18139C46851J2862J05146M9882O9717j237m1454P5915Q6377O2054J07899R3312
18128I67324J09995J89720J06063J42676J77048K94931L73297M01012N33032O24084
18118C919182Q38113J139897J607597K351470L818298O767944J1553374J3076480
18110D5072355P500214L245559K328528J086654j4154541j6545143r180494m800465
18102A4552667k820217j833621j378210j084350q96342o43809m75782l75212l07067
18093D738057l21089k49000j62152j47794j65518j09894j36285j39832j12706
18084C193787p8179q2375j04205j22360j32593r6409j27451j40714j21531j17751
$$ plain form
18150 173958 248918 293796 339007 321571 310517 292035 231714 252241 327528 363965 346851
18139 346851 359713 464859 514741 584458 583221 541767 617682 704059 766113 874012 967324
18128 967324 1077319 1267039 1373102 1515778 1692826 1987757 2361054 2762066 3295098 3919182
18118 3919182 4757295 5897192 7504789 9856259 13674557 20442501 31995875 45072355
18110 45072355 52572569 55818128 58146656 59233310 45078769 28533626 19353132 14552667
18102 14552667 11732450 9898829 8520619 7436269 6539927 5896118 5420336 5045124 4738057
18093 4738057 4416968 4167968 4005816 3858022 3692504 3582610 3446325 3306493 3193787
18084 3193787 3115608 3033233 2929028 2806668 2674075 2577666 2450215 2309501 2187970 2070219
18074B070219j18074p6750n4604l1899r8089q9929j07631j21232o5454J3011j4587
18063A304981q5193o2419k784M0554k9218o7511o5167p3355j5467M8620j8402
18052I74639l5585o6084o4165j7027J3278j0609q8698l1803k6317k0386j7052
18041F10191p621j43L416l8485L821L1919m8582p0628N9282j9614k8458k6848
18029D68250o1047m6206j1037J8495j8397j3328N0922j1543k908K0533L2537k945
18017D23326m8095k4607k472k1249o2412k3449R6364J35338r923j04746p9973
18006B78102l5521p4296n5922J5653r797k5799K5709K9876M9088L4729p4706n6825
17994A00291O4648M4152j0363L626L2992l0487q040j483l0178o7110p0400k2479
$$ plain form
18074 2070219 1952145 1875395 1820791 1788892 1690803 1600874 1493243 1372011 1306557 1319568 1304981
18063 1304981 1219788 1157369 1154585 1195139 1165921 1098410 1033243 959888 944421 993041 974639
18052 974639 939054 872970 808805 791778 805056 794447 705749 673946 647629 627243 610191
18041 610191 602570 602427 605843 567358 571179 603098 554516 483888 543170 523556 495098 468250
18029 468250 407203 360997 349960 368455 350058 336730 387652 376109 373201 393734 426271 423326
18017 423326 375231 350624 348152 326903 264491 241042 337406 472744 462821 358075 278102
18006 278102 242581 168285 112363 128016 118219 92420 118129 148005 197093 231822 157116 100291
17994 100291 164939 209091 198728 202354 235346 204859 196819 195336 165158 98048 27648 5169
17982E169j4367Q94K724N1809K470l7242p448k2577j6827P2980K2707k1129K3899
17969F3062K4309n4129n9582J5708P0126N013n0927l4692R973q297M7971l9643
17957a1108K0172L6540k064m463m257P7963N580m4472P043j6523n6875p9835j6878
17944h9177L8164P9957l5972K4997j1816M305M3226L0000k6030k2937O408l694
17932C7431J8711q045L3685M1284q9048m2938k5444L2397P7698n8709n5302K6906
17920a1374L7888J3718m1810m6768j7675K6966j0113o498K8245J27217L6067r8624
17908C7239J184p5491m837N717L1462L0202J6747m001o589l5155K3576Q824l402
17895B5476L7348m6203l5875m8049l249M5981k449n227N3913j9575l812Q041j2054
$$ plain form
17982 5169 -9198 -8304 -5580 46229 48699 11457 4009 -18568 -35395 37585 60292 39163 63062
17969 63062 87371 33242 -26340 -10632 59494 64507 13580 -21112 -11139 -19436 28535 -11108
17957 -11108 9064 45604 43540 39077 34820 112783 118363 73891 80934 64411 7536 -72299 -89177
17944 -89177 -51013 28944 -7028 17969 6153 10458 53684 83684 57654 34717 41125 37431
17932 37431 56142 48097 81782 123066 34018 -8920 -34364 -1967 75731 17022 -38280 -11374
17920 -11374 26514 40232 -1578 -48346 -66021 -39055 -49168 -55666 -27421 99796 135863 37239
17908 37239 38423 -37068 -41905 -36188 -4726 25476 42223 38222 31633 -3522 20054 28878 25476
17895 25476 62824 16621 -19254 -67303 -70552 -24571 -27020 -32247 21666 2091 -1721 6320 -5734
17882e734L2052k9265r068J437J1960o5709K763O695M2990N785q0403L005P3246
17869a0246m1753k2692J5629K7538L1198K2562k9243l4573K3627P413L3066j8759
17857C767J8704j6701J5468m8926j04078K927M9022K4003l6702K2058K1892K9111
17845a9455j5737Q468l4685k4815j1183M695M142K6206K3155m9308k7130N0582
17833f5065j9863m6051q879K0764N0157Q648M031l2824j5310M6866M1090j9671
17821c6107k9290m6530M4317k275K6677K3736L76m1598p423M5326N4316j0310
17809B1215q0j3896L0631l4310p5175k0031K4788Q033p457J8502K3078K0620N7351
17796E3269K9181K041p7928k6091p317J7123L855k0734K4512N781j232K0226n505
$$ plain form
17882 -5734 26318 -2947 -12015 -10578 1382 -64327 -61564 -54869 -11879 -6094 -86497 -83492 -10246
17869 -10246 -51999 -74691 -59062 -31524 -326 22236 -7007 -41580 -17953 -10540 22526 3767
17857 3767 22471 5770 21238 -27688 -131766 -128839 -79817 -55814 -92516 -70458 -48566 -19455
17845 -19455 -35192 -26724 -61409 -86224 -97407 -92712 -88570 -62364 -39209 -88517 -115647 -65065
17833 -65065 -84928 -130979 -139858 -119094 -68937 -60289 -56258 -89082 -104392 -57526 -16436 -36107
17821 -36107 -65397 -111927 -67610 -69885 -43208 -19472 -19096 -60694 -68117 -22791 31525 21215
17809 21215 21135 7239 37870 3560 -71615 -91646 -66858 -58825 -66282 -47780 -24702 -4082 53269
17796 53269 82450 84491 6563 -19528 -26845 -9722 -5867 -26601 -2089 3692 2460 22686 17181
17783A7181j7337k787J6393k9866l7836J5086L6569L6432K621J8261k5364p8064
17771d8711K447J2205L0191o273p488K4032K9508R809j4963K7054j597m8133o1148
17758e3067r406P771K1726J261Q311l9974o3995Q9463J1268P65N1642Q165L134
17745C7064N796J8085l7220o7056l3982N592K2014K6812O09m6886M9115K7525
17733G468k9204P198n6745J9707J1147j2060N083J0564N0273Q7656K847q4775
17721A9159l0478K0409K4991O7935n409m6995n296j99K3694L3229K7834k9100
17709I9774n7575J2211J2147M2828J4993o8927n2248p6946L1285R5280M7086p287
17697I2621Q305m9991l8945K0940J3995J2188j1320j2386k0213j4810j2605Q896
$$ plain form
17783 17181 -156 -2943 13450 -16416 -54252 -39166 -2597 33835 36456 54717 29353 -48711
17771 -48711 -46264 -34059 -3868 -10141 -17629 6403 35911 45720 30757 57811 56214 8081 -53067
17758 -53067 -62473 -54702 -32976 -31715 -23404 -63378 -127373 -37910 -26642 -25877 25765 33930 37064
17745 37064 42860 60945 23725 -43331 -77313 -71721 -49707 -22895 -22286 -69172 -20057 7468
17733 7468 -21736 -14538 -71283 -51576 -40429 -52489 -47406 -36842 13431 101087 103934 19159
17721 19159 -11319 9090 34081 102016 96607 49612 44316 44117 67811 101040 128874 99774
17709 99774 42199 54410 66557 109385 124378 55451 3203 -73743 -42458 52822 99908 92621
17697 92621 100926 50935 11990 32930 46925 59113 47793 35407 15194 384 -12221 -3325
17685c325K0761j0225m3461L3726O943L4110M4594j7002l0228m1902j12354m1518
17673a59881N6382N6447k522L3419L277r808k6835l033j2922M392K7276p045Q473
17660c2380k727j5965J7538l6333K6084N9934K238M54o9230l8742L8480K8361
17648b2288J6546J0118K0687P370K3719j3591m0741p695P606L1426J0071k1499
17636B1729p0827j1842N1184M2576L234k5154m1330q654j5067l2932K5771K6272
17624c5040J8284M5689N8144P937k292q1268n599l4577o693j1182M0636P0050
17612F4089L0421r166j40808n644J4302O3303N2751n8886K1706L3028m6889M3605
17600F1812K2759J0424l9658m0843j7353J7917P623j2253j8817J0504K5182J4560
$$ plain form
17685 -3325 17436 7211 -36250 -2524 4419 38529 83123 66121 35893 -6009 -118363 -159881
17673 -159881 -103499 -47052 -49574 -16155 -12878 -22686 -49521 -52554 -65476 -61084 -33808 -40853 -32380
17660 -32380 -35107 -51072 -33534 -69867 -43783 16151 18389 18843 -50387 -89129 -50649 -22288
17648 -22288 -5742 4376 25063 32433 56152 42561 1820 -5875 1731 33157 43228 21729
17636 21729 -49098 -60940 -9756 32820 36054 10900 -30430 -39084 -54151 -87083 -61312 -35040
17624 -35040 -16756 28933 87077 95014 92722 11454 5855 -28722 -35415 -46597 -5961 64089
17612 64089 94510 85344 -55464 -61108 -46806 16497 69248 10362 32068 65096 18207 61812
17600 61812 84571 94995 55337 14494 -2859 15058 22681 10428 -8389 2115 27297 41857
17588D1857l1100j3573M0862l6168q9849o0987N5130O2386O0319o3139l1288j6360
17576h1910M0032R7245K8465N088j6712l7001k1457Q751Q9176M6757p5834n4343
17564B8257o9455p4004r28J9016N2078K8297n788k1845k286l663j4613l7208J9661
17551h2481O3707J1352J245K784k4031J5820N3536o9152o8652L2879K1248L9713
17539b032M4020m9411L8996m5299k6218K7842l3201K2969O8307O6195o118q6523
17527A9527p2181k3358m817O6971j9290k0720K505L3425j1197n9934k7925j3776
17515a30770N3890L7542K6484K7944j6806N3770N4336n0038n7225k5993J5030
17504a1836J438K7251L7790m2059n0958L650J8856j1163L3289n1559O7460P141
$$ plain form
17588 41857 10757 -2816 38046 1878 -87971 -148958 -93828 -31442 28877 -34262 -65550 -81910
17576 -81910 -41878 55367 83832 88920 72208 35207 13750 22501 111677 158434 82600 28257
17564 28257 -41198 -115202 -116130 -97114 -45036 -16739 -22527 -44372 -46658 -50321 -64934 -102142 -82481
17551 -82481 -18774 -7422 -6177 -3393 -27424 -11604 41932 -27220 -95872 -62993 -41745 -2032
17539 -2032 41988 -7423 31573 -13726 -39944 -12102 -45303 -22334 45973 112168 106050 19527
17527 19527 -52654 -76012 -80829 -13858 -33148 -53868 -51363 -17938 -29135 -89069 -116994 -130770
17515 -130770 -76880 -39338 -12854 15090 -1716 52054 106390 56352 -873 -26866 -11836
17504 -11836 -10398 16853 54643 12584 -38374 -34724 -15868 -27031 6258 -45301 22159 29300
17492B9300j1405L018J3750J469L7126l5174P6653m7268o1374l3720J6285m7227
17480e8567l7288N1731L4343q383j7450N101r203j258k3654R060k382J745R474
17467d6731J6531M3461K4536P741o3333R777j4458l6430j5080M8479M2475O8223
17455H5191k4511j393m1440k5600j0802L7092L1112J4376J9366Q7976P1167N4550
17443B97084J4387r345Q073q1215q7005p875j8690k6481l1954o167r370K7436
17431F8878J226m3804n302l6375k1328o978J6438M0100o4422k3324N5742P6027
17419E6878k693k8303m9138k3262o141k3856J57M774J2151L4895O3385Q9226l1373
17406I6700l3906j7174o1705k4082P410J9490p1318L8448J9320p9101r1K2588
$$ plain form
17492 29300 17895 20913 34663 36132 73258 38084 114737 67469 6095 -27625 -11340 -58567
17480 -58567 -95855 -44124 -9781 -18164 -35614 -30513 -39716 -40974 -64628 -55568 -57950 -56205 -46731
17467 -46731 -30200 13261 37797 45538 -17795 -8018 -22476 -58906 -73986 -25507 16968 85191
17455 85191 60680 59287 17847 -7753 -18555 18537 49649 64025 83391 171367 242534 297084
17443 297084 311471 302126 310199 228984 141979 134104 115414 88933 56979 50812 41442 68878
17431 68878 70104 26300 20998 -15377 -36705 -43683 -27245 12855 -51567 -74891 -19149 56878
17419 56878 54185 25882 -23256 -46518 -52659 -76515 -76358 -71584 -59433 -24538 38847 128073 96700
17406 96700 62794 45620 -16085 -40167 -32757 -13267 -84585 -46137 -26817 -105918 -106009 -83421
17394h3421L522N33J2659O797K8397K8006O8J3499K9947J2100N2244k4481K5912
17381A05782n3567n4502P130P4911L625j04192k3264L0742k2130m1897k1657K9169
17369f9850M3107j6918j4049N841J0026k221L540J4143K6798j794J5190L3977
17357D7790L0886j9858l4439l588j1316N7k1921P134j2666j9077K5216k7814k2087
17344f1683K59k4594L5883M6971l1678K5974M3196K8483K4250j7636k7692l2773
17332H960n2655l9952J4907l579o3061K6906P5894j2769K661J8004j6301M3062
17320B077M0380k1826k4086J555j7552J1409N6964J2085q9078q4056k7029p509
17308a46666K7987J08075L0692p8287K2923M4211M513j9007j1069O4650l508l0605
$$ plain form
17394 -83421 -79899 -79366 -66707 -59910 -31513 -3507 -3439 10060 40007 52107 104351 79870 105782
17381 105782 52215 -2287 4843 79754 83379 -20813 -44077 -13335 -35465 -77362 -99019 -69850
17369 -69850 -26743 -43661 -57710 -51869 -41843 -44064 -40524 -26381 417 -1377 13813 47790
17357 47790 78676 58818 24379 20791 9475 9532 -12389 -5255 -17921 -36998 -11782 -39596 -61683
17344 -61683 -61424 -86018 -50135 -3164 -34842 -8868 34328 62811 87061 69425 41733 8960
17332 8960 -43695 -83647 -68740 -72319 -135380 -108474 -32580 -45349 -42688 -24684 -40985 2077
17320 2077 42457 20631 -3455 -1900 -19452 -8043 48921 61006 -28072 -112128 -139157 -146666
17308 -146666 -118679 -10604 20088 -58199 -35276 8935 13448 -5559 -16628 48022 44514 13909
17296A3909M5660r129o3065l8639j6786K7147J7762N2527O1575m4010p5060J1775
17284a6334j1207m0496j945M1879O27m1726m550M2101J7069J8284j5571m6281
17272e8150l6716J3356J3108j1710J5592M6023K1240k0371k8272M5797K7018M578
17260C1493m534k4177m3418q570l3856K9860R180j3097N411K1054M2007M1408
17248E2761l8783o9899N2681O2200J4218p2911l0322K790O1865j0473L3989j3615
17236D4501J4569l0641m470j6630N5253M6490k2777m6587j2071o500K0916j2378
17224B9675p1430K2020K1274M7702K927m61j1994N4409J1111j0347p1011p78m511
17211A8586N5634K7282j9160o8605o030m669j1108R784Q649j7740l5988j4702
$$ plain form
17296 13909 59569 50440 -12625 -51264 -68050 -40903 -23141 29386 90961 46951 -28109 -16334
17284 -16334 -27541 -68037 -69982 -28103 -27476 -69202 -73752 -31651 -14582 3702 -11869 -58150
17272 -58150 -94866 -81510 -68402 -80112 -64520 -18497 2743 -17628 -45900 -103 26915 31493
17260 31493 26959 2782 -40636 -49206 -83062 -53202 -44022 -57119 -51708 -30654 11353 52761
17248 52761 13978 -55921 -3240 58960 73178 267 -30055 -27265 34600 24127 58116 44501
17236 44501 59070 28429 23959 7329 62582 109072 86295 39708 27637 21137 42053 29675
17224 29675 -41755 -19735 1539 49241 52168 51707 39713 94122 105233 94886 23875 23097 18586
17211 18586 74220 101502 82342 13737 7707 3038 -8070 1714 10363 -7377 -43365 -58067
17199e8067Q8076K5555o0597o0641K9531J8941L5342m1935m1737M0712M0734L3419
17187D9333r511n759L3628J1788p770n7223J6056k0785l7402J4746l8416J5747
17175c5568J3996m3712N6230N0572Q464L1847L1318l3911k3939m6402L1044J8249
17163E8188l4992n4592k287J4392o27q462J0031M7965k7391l6815q0951l8645
17151a54186J0556P4319j803l3243N7745O24J7832J6291J1551J776J6962O600
17139B5024K2251N1209n3454l3808J6068m5277m3367L6701L0029J2321N4096n2541
17127A9252n2461q703K7771N525M2763J8837n7417p3609K4108K2286j5196k8156
17115g5000K9586N7799n0858n2986j4417J3320O5023J4604j3612j4820K4161K6846
$$ plain form
17199 -58067 30009 55564 -5033 -65674 -36143 -17202 18140 -23795 -65532 -24820 15914 49333
17187 49333 39822 34063 67691 79479 71709 14486 30542 9757 -27645 -12899 -51315 -35568
17175 -35568 -21572 -65284 -9054 41518 49982 81829 113147 79236 55297 8895 39939 58188
17163 58188 23196 -31396 -33683 -19291 -19918 -28380 -18349 29616 2225 -34590 -115541 -154186
17151 -154186 -143630 -69311 -71114 -104357 -46612 -45988 -28156 -11865 -314 1462 18424 25024
17139 25024 47275 98484 45030 11222 27290 -17987 -61354 -24653 5376 17697 71793 19252
17127 19252 -33209 -41912 -14141 -8616 34147 52984 -4433 -78042 -53934 -31648 -46844 -75000
17115 -75000 -45414 12385 -38473 -91459 -105876 -92556 -27533 -12929 -26541 -41361 -17200 9646
17103I646L938M2556j6337j3974l2515k845k212o4159o8987K3446J2170O9664
17091c9609P3211K9906K6770j8696r1627k8819J0639N2247J9857J0452l4874j0206
17079g49m5545j148m689l7422K2623J2663J8134L643K7637k6873o271m6696J2737
17066g1956l3820K3102K9978j6445k3071L0120p61m9946k0979K0301J606K4805
17054h7066M1094J6050j0714L446j3384k3370K5117L1482M5622P61m945k4513
17042d20q678j6796k4135j9137J3540L8563N9695k9040j2269k3829K2484O380
17030F358n0126L410L7843k748l0008J2058o076k9051j0443m157M5487R268j2208
17017c0393n06J667J4324L8215J8998k6519L1150M7951j7856k2967l32K7721L4518
$$ plain form
17103 9646 13584 56140 39803 25829 -6686 -9531 -11743 -75902 -144889 -121443 -109273 -39609
17091 -39609 33602 63508 90278 71582 -20045 -48864 -38225 14022 33879 44331 9457 -749
17079 -749 -46294 -47442 -52131 -89553 -66930 -54267 -36133 -32490 -4853 -31726 -37997 -84693 -71956
17066 -71956 -105776 -82674 -52696 -69141 -92212 -62092 -62853 -112799 -133778 -113477 -111871 -87066
17054 -87066 -45972 -29922 -40636 -37190 -50574 -73944 -48827 -17345 28277 29038 24093 -420
17042 -420 -9098 -25894 -50029 -69166 -55626 -17063 42632 13592 1323 -22506 -22 6358
17030 6358 -43768 -40358 -2515 -5263 -35271 -23213 -29289 -58340 -68783 -72940 -27453 -18185 -30393
17017 -30393 -30899 -29232 -14908 23307 42305 15786 46936 94887 77031 54064 53732 81453 115971
17004A15971o4533j2226n124k9497n6182K4509R9164P4069m7068p1076l488J8244
16992D2763N264q2810o253L2366k0429j9166j558J79J5807J5809N891J5223J7761
16979B0847L3242n2608k2592m2517N503L1779N529k3400O713J2815k8634j4103
16967f7426j9855M4135K9336P9379p660q2229m4701k2620J4274O4393k279j3048
16955b8301J7756j9762j5844K212J4042M9855L50p9958l4889K658L257N4639L5042
16942A057Q0948R274o5602j826K7864p774P933M612k2513o8650l3822K2479J899
16929d4121J2214n0905J8282L4459q067K987M9000J7862K2582r511j5465n6721
16917b7404R188M5112K4150l0411k7029L9634L6814R648q2248n0214j4557p525
$$ plain form
17004 115971 51438 39212 34088 4591 -51591 -27082 72082 146151 99083 28007 24519 42763
16992 42763 48027 -34783 -41036 -8670 -29099 -48265 -49823 -49644 -33837 -18028 -12137 3086 20847
16979 20847 54089 1481 -21111 -63628 -58125 -26346 -20817 -44217 -37504 -24689 -53323 -67426
16967 -67426 -87281 -43146 -13810 65569 57909 -24320 -69021 -91641 -77367 -12974 -15253 -28301
16955 -28301 -10545 -30307 -46151 -43939 -29897 19958 20308 -59650 -94539 -91881 -88624 -33985 1057
16942 1057 82005 91279 25677 23851 51715 43941 51874 56486 33973 -34677 -68499 -46020 -44121
16929 -44121 -31907 -82812 -64530 -30071 -38138 -35151 13849 31711 54293 44782 29317 -27404
16917 -27404 -18216 26896 51046 20635 -6394 33240 70054 79702 -2546 -52760 -67317 -74842
16905g4842M1194O813n6480j9178R2238M1492n8818k4868J3789j0052N0577K9701
16893C1566j341l0976k3486n5173L3005P3796j8202k1383K6249J4238j52L3040
16881F1181J73l2881J6624M7620j7525k4332k1604J855j7483m4385m2520k7744
16869a01021P011j0763J8864J2496j0771N9199K8817q371l970j5349J4147J1473
16857A762L2649j8533n2033L6339j2895p177M0172J3113K5579m809k1156j3993
16845A9018k6672N203L1575k1687l6031l7273n982O3836K4409J6150J3085j3489
16833C2142J4989M4900n7017J8227n310m0523L0836L6110l9615m0401K2263N7467
16821G4068k999j232N054n6628k6157K2643O6653K323n7804k5729l4035j8777
$$ plain form
16905 -74842 -33648 -26835 -83315 -102493 -10255 31237 -27581 -52449 -38660 -48712 1865 31566
16893 31566 30225 -751 -24237 -79410 -46405 27391 9189 -12194 14055 28293 28141 61181
16881 61181 61354 28473 45097 92717 75192 50860 29256 31111 13628 -30757 -73277 -101021
16869 -101021 -94010 -104773 -85909 -73413 -84184 -24985 3832 -4539 -8509 -23858 -9711 1762
16857 1762 34411 15878 -36155 184 -12711 -19888 20284 33397 58976 54167 33011 19018
16845 19018 -7654 -2451 29124 7437 -28594 -65867 -71849 -8013 16396 32546 45631 32142
16833 32142 47131 92031 35014 53241 47931 7408 38244 74354 34739 -5662 16601 74068
16821 74068 71069 69837 74891 18263 -7894 14749 81402 83725 25921 192 -33843 -52620
16809e2620k8863K3902J8305n4712J8537J3407K9096N754k99M9975J0912j128
16797C2266j0352o7165n3983j5731K0317L9842Q1274N4878l2207o2960j9659P155
16785b6325K0796J41k5304M6030M7691K2251l0980o7441l972L0598L8579K8619
16773H0683P678M059j6333M472j5691r2734k220J0811k2072K6100N6350j0943
16761C0160k4771J2722l7937m1781J2917J9708L6054J3675j9026K7069m5491j4855
16749c1556K3352J7608J3506n6225J0855K2325m9589l7855M8180J00827M3424
16738A04852K4812k5604m1920O07l1287r2337k7758N161k8293O3001j179l2516
16726h2461J8547M6236k3538j1674o780n2574k4536r916M3622J3013N6870L7050
$$ plain form
16809 -52620 -81483 -57581 -39276 -93988 -75451 -62044 -32948 -27194 -27493 22482 33394 32266
16797 32266 21914 -45251 -99234 -114965 -94648 -54806 26468 81346 49139 -13821 -33480 -26325
16785 -26325 -5529 -5388 -30692 15338 63029 85280 54300 -13141 -17113 13485 52064 80683
16773 80683 88361 92420 76087 80559 64868 -27866 -30086 -19275 -41347 -15247 41103 30160
16761 30160 5389 18111 -19826 -61607 -48690 -28982 7072 20747 1721 28790 -16701 -31556
16749 -31556 -8204 9404 22910 -33315 -22460 -135 -49724 -87579 -39399 61428 104852
16738 104852 129664 104060 62140 62747 31460 -60877 -88635 -83474 -111767 -48766 -49945 -82461
16726 -82461 -63914 -17678 -41216 -52890 -59670 -112244 -136780 -146696 -103074 -90061 -33191 3859
16714C859j9924K8095l1558k1743M4557k9390J7303L5284p611j9844m3226Q81
16702d3317J5586K1191k0483m0702L7067L9845l7953J3225o929k573J3313J9576
16690G846K0138n0153m9334M031K4147O9876L1716l2650o2296o19J4502j0057
16678c2853J5693J5626N918K6000n3525k3248M622J5039k1349N7648L1869j8418
16666B3022N8899p004j6549K5324k5709M6402k0820q4757k6095K2098L0058J3778
16654C8647o1125O116Q625k7679n0194M0174L0981k1766L2551J8827N805L0348
16642E1310p0019o5674N3426J6011m0410Q077R5144K9034p3361k9276j554J3292
16630a4000j3430k2064l982J7997K5852L2484n1712k3242q139K7722L5194l3319
$$ plain form
16714 3859 -16065 12030 -19528 -41271 3286 -26104 -8801 26483 18872 -972 -44198 -43317
16702 -43317 -27731 -6540 -27023 -67725 -30658 9187 -28766 -15541 -22470 -25043 -11730 7846
16690 7846 27984 -22169 -71503 -67472 -43325 26551 58267 25617 -36679 -37298 -22796 -32853
16678 -32853 -17160 -1534 4384 30384 -23141 -46389 -41767 -26728 -48077 9571 41440 23022
16666 23022 81921 74917 58368 83692 57983 104385 83565 -1192 -27287 -5189 24869 38647
16654 38647 -22478 -16362 -7737 -35416 -85610 -45436 -14455 -36221 -3670 15157 20962 51310
16642 51310 -18709 -84383 -30957 -14946 -55356 -47279 47865 76899 3538 -25738 -27292 -14000
16630 -14000 -27430 -49494 -53476 -35479 -9627 22857 -28855 -52097 -60236 -32514 2680 -30639
16618c0639j2982J6316k7820P5460l0814m1252m1847j6599N0018l08J4233P7458
16606C1224K4028m2269L349j0601K7827L9004j9476k98K336j4113l4372K3683
16594C0322j0133n6428J6140M5595m665P712n4898j6144O4192l7636j6653M7068
16582A4472P082L0632j812R030L0406j2419j2655R39k079o7622k4731m8017K6881
16569d9893L7033N976k4878o5660j4583L7333O9159N4859q051r843N4278l652
16557H2078n0984k4526k072q978N6323k3160n7003N9261J3235K3124N6421J5381
16545A39100j02009k1522j4338L603j46j5283o723J75n5790K6834N6176k2884
16533a2807L9414L8354K2190l5981p3317l3325j5977J0257N391O221K9633K567
$$ plain form
16618 -30639 -43621 -27305 -55125 20335 -10479 -51731 -93578 -110177 -60159 -60467 -46234 31224
16606 31224 55252 12983 16332 5731 33558 72562 53086 52788 55124 41011 6639 30322
16594 30322 20189 -36239 -20099 25496 20831 28543 -26355 -42499 21693 -15943 -32596 14472
16582 14472 21554 52186 50374 59404 89810 77391 64736 65675 63596 -4026 -28757 -76774 -49893
16569 -49893 -12860 -6884 -31762 -97422 -112005 -74672 -5513 49346 41295 31452 85730 82078
16557 82078 31094 6568 4496 -4482 51841 28681 -28322 30939 44174 67298 123719 139100
16545 139100 37091 15569 1231 4834 4688 -10595 -17318 -17143 -72933 -46099 10077 -12807
16533 -12807 26607 64961 87151 51170 -22147 -55472 -71449 -61192 -55801 -49580 -19947 -17380
16521a7380l0729n169n530K289J053K1576M5703O9707P7447m2748n6695q4999
16509b5475p8320N9552L8581k8451K8697l4833l4102m1699P6510P3407J4947L0824
16497G9638L125m1957k1665L1398O5793L1404n7537o3265m0679n5294o976k7835
16485a03850k7150N6153o784J957n1864k7028m4270M6449N4197L8864L1724J4276
16473a7326l43N9760p40k8825j273o3954K5021N4797K1132N683j2463l2908j0765
16460b204k7564J2868J8794N6138N938l1734O477O788K7033l758j6976N9011j4735
16447I6076l1928j0783l6855m4387M3716N7285l2625o3338m417j632J4965N3765
16435C9842Q2395L0473l0118q7828o464L7288J474N5313o873m2710l055k7255
$$ plain form
16521 -17380 -48109 -53278 -58808 -56519 -55466 -33890 11813 81520 158967 116219 59524 -25475
16509 -25475 -103795 -44243 -5662 -34113 -5416 -40249 -74351 -116050 -39540 33867 48814 79638
16497 79638 82763 40806 19141 50539 116332 147736 90199 26934 -13745 -69039 -76015 -103850
16485 -103850 -131000 -74847 -81631 -79674 -131538 -158566 -202836 -156387 -102190 -63326 -31602 -17326
16473 -17326 -17669 42091 41351 12526 11253 -52701 -27680 27117 48249 53932 41469 8561 -2204
16460 -2204 -29768 -16900 1894 58032 63970 32236 38713 45501 72534 68776 51800 110811 96076
16447 96076 64148 53365 16510 -27877 15839 73124 40499 -22839 -27256 -28888 -13923 39842
16435 39842 122237 152710 122592 34764 28300 65588 67062 122375 115502 72792 69737 42482
16423D2482l0836n7708q9481k0084R5166R9497L343m7489j4714K3263l7714J7665
16411a6610J0750L1400L1195K1697m7429Q701J8986m782l2528l5501k8253k8284
16399g0658l1419N620N8769M8404l3599o3431P432L380L7515n453L833M5380M5679
16386E1452M4996m3134o1272j602Q137L1355l7686p7385l2504N0585M9591k4216
16374d1683j2027K8885K1544P46l6397L779j8986L8354J9415j5834J639K8638
16362A8073l4561j9089K7081M5430j8132j5848J6218N301R734J0454l8199P043
16350A3505m1314l5681K3292j5331R605j1299K5390j1521j618L4785K1583l3788
16338b2392k1007j1243j054r01o6601K458Q728M3978J9357K1322Q264o980M9470
$$ plain form
16423 42482 11646 -46062 -135543 -155627 -60461 39036 42379 -5110 -19824 3439 -34275 -16610
16411 -16610 -5860 25540 56735 78432 31003 39704 58690 53908 21380 -14121 -42374 -70658
16399 -70658 -102077 -96457 -37688 10716 -22883 -86314 -78882 -75502 -37987 -43440 -39607 5773 51452
16386 51452 96448 53314 -7958 -9560 -1423 29932 -7754 -85139 -117643 -67058 -17467 -41683
16374 -41683 -53710 -24825 -3281 -2535 -38932 -35153 -54139 -15785 3630 -12204 -10565 18073
16362 18073 -16488 -35577 -8496 36934 18802 2954 19172 24473 34207 44661 6462 13505
16350 13505 -27809 -63490 -40198 -55529 -45924 -57223 -31833 -43354 -44972 -10187 11396 -22392
16338 -22392 -43399 -54642 -55696 -56597 -123198 -120740 -112012 -68034 -48677 -27355 -19091 -26071 23399
16325B3399o9362l0544Q0653K1560l9184R530O6487J4415k1140n0692o5685J7163
16313d3400l2790K1263J8920J8653L543J8141m0308j6969K8706n289j3604o733
16301d9867M4994j9128j0010q106o345l4339k9122O6220R1448j382j0518L4257
16289F8102n0863k6997K2384L4714j6899M839J3536m1071k4261m5753j201j9258
16277h2728J1979K0838M1172O173q904L4663K3013K457j5423M8329m426k7551
16265D9592K4059k2424p6376m7903J1972O022J6127L2533L0088n3647m3858k068
16253g5883O278j8091J2330J7915L6898P2821L2893O322J5300j7288l0129R651
16241F9017j6428m0333j220J1402K3632r4607k4117L8441K8322M886m801k3434
$$ plain form
16325 23399 -45963 -76507 4146 25706 -13478 -3948 62539 76954 55814 5122 -60563 -43400
16313 -43400 -76190 -54927 -36007 -17354 -13811 4330 -35978 -52947 -24241 -29530 -43134 -49867
16301 -49867 -4873 -24001 -34011 -42117 -48462 -82801 -111923 -45703 45745 44363 33845 68102
16289 68102 17239 -9758 12626 47340 30441 35280 48816 7745 -16516 -62269 -63470 -82728
16277 -82728 -70749 -49911 -8739 -2566 -11470 23193 46206 48663 33240 81569 77143 49592
16265 49592 73651 51227 -25149 -73052 -61080 -55058 -38931 -6398 23690 -29957 -73815 -75883
16253 -75883 -69605 -87696 -75366 -57451 -20553 52268 85161 91483 106783 89495 59366 69017
16241 69017 52589 12256 11036 22438 46070 -48537 -72654 -34213 -5891 -1005 -5806 -29240
16229b9240k3179k2225K8925N2070L8901L390j252l2991J3388L41L8747j4873
16217E2002n0737l7216m3385K9479P5044q863m3279K5806n619k63N8066M0246
16205I1281p7173n9804L3740J5025l4828q82K2445k826J3080Q1661J2024j6312
16193G7431J3962l9205o3274n7467k142K1298L1272K2308J4312j5923m3761Q686
16181c2503q012m1869N0974O4198K4243n1218J1593M874l5308K3657l7270n750
16169c2391L5282M947J6741N1830j07k8959j4049N316L0854L1003P349l9195R408
16156G8029K5281k4710n0882j9318j1714m9016R1K4193k6730M5121K9734o8843
16144d8764L4582O4453n0136l1239M2319O1058q1477j4661r277J9158M0634J5124
$$ plain form
16229 -29240 -52419 -74644 -45719 6351 45252 48642 47390 14399 27787 28128 66875 52002
16217 52002 1265 -35951 -79336 -49857 25187 16324 -26955 -1149 -6768 -7031 51035 91281
16205 91281 14108 -45696 -11956 3069 -31759 -32641 -10196 -13022 58 81719 93743 77431
16193 77431 91393 52188 -11086 -68553 -70695 -49397 -18125 4183 18495 2572 -41189 -32503
16181 -32503 -40515 -82384 -31410 32788 57031 5813 17406 22280 -13028 10629 -26641 -32391
16169 -32391 2891 7838 24579 76409 76302 47343 33294 38610 69464 100467 107816 68621 78029
16156 78029 103310 78600 27718 8400 -3314 -52330 -52239 -28046 -54776 -9655 20079 -48764
16144 -48764 -14182 50271 135 -31104 11215 72273 -9204 -23865 -33142 -13984 26650 41774
16132D1774j6594l584j5691m6523m4124k6142R992J8805P4512M7361l0914j2557
16120c685m4311O3747M8311l9635r9547n2905L2865L6339M7998N2520l1018k2321
16108a1642N4702J4533l7636j5273K1748m356K7035l9187k7067k5686L5532j2053
16096a9350M4714K0253j6433J1306n6102j5153K980J7391l7673n1793k6648K8183
16084i8325K4578N1435M1627q407j2241P842j7652n0507n0572k7278M8622j7009
16072a07887k0243M6352P7071J1798J0134j733R501k2868k5105K0238j1489n0971
16060f5202L3216L9265N2409l220j6084p639J5161J9569l7539o6673n7368L0537
16048f3568O7046O4700J778l0392L3403J2755k5056m6185o7962N848M640K1561
$$ plain form
16132 41774 25180 21596 5905 -40618 -84742 -110884 -100892 -82087 -7575 39786 8872 -3685
16120 -3685 -47996 15751 64062 24427 -75120 -128025 -95160 -58821 -10823 41697 10679 -11642
16108 -11642 43060 57593 19957 4684 26432 22076 49111 9924 -17143 -42829 -7297 -19350
16096 -19350 25364 45617 29184 40490 -15612 -30765 -27785 -10394 -48067 -99860 -126508 -98325
16084 -98325 -73747 -22312 19315 10908 -1333 6509 -11143 -61650 -112222 -139500 -90878 -107887
16072 -107887 -128130 -81778 -4707 7091 17225 15492 24993 2125 -22980 -2742 -14231 -65202
16060 -65202 -31986 7279 59688 56468 40384 32745 47906 67475 29936 -36737 -94105 -63568
16048 -63568 3478 68178 69956 39564 72967 85722 60666 14481 -53481 -47633 -42993 -21432
16036b1432Q3937j1223l4183m1742j3018L734N5023N650k2952J9827L2554j3636
16024D2539O1023l615n3345k372K814j5681k902N0829m4835M642j2796n2996k7739
16011e4434N2569j2667L0813L0738L1045K5710J1365m0298k1660j3968l0717J3284
15999B1780J2185r7040j033K3585m6130k3467L4023J1010j9412m2711p8813r607
15987b15630J8434P7101P2897L87O2258J6906m522R356n0047p726L8984J4121
15975C2519K0852O291Q023j027j5712l3596n0511L0551K1214N235J1808p3254
15963c7607o9637L0307K0709p532J6125q994J0122P111l4907L8522N0805p436
15951G588j2197j1524J4488O8784q287n8820n2675K3784N61J205J593n976R489
$$ plain form
16036 -21432 62505 51282 17099 -24643 -37661 -33927 21096 26746 3794 23621 56175 42539
16024 42539 103562 99947 46602 44230 47044 31363 28461 79290 34455 39097 26301 -26695 -54434
16011 -54434 -1865 -14532 16281 47019 78064 103774 115139 74841 53181 39213 8496 21780
15999 21780 33965 -63075 -64108 -40523 -86653 -110120 -76097 -65087 -84499 -127210 -206023 -215630
15987 -215630 -197196 -120095 -47198 -46811 15447 32353 27831 37187 -12860 -20586 18398 32519
15975 32519 53371 59662 67685 66658 50946 17350 -33161 -2610 18604 23839 35647 -37607
15963 -37607 -107244 -76937 -56228 -63760 -47635 -56629 -46507 -39396 -74303 -35781 15024 7588
15951 7588 -4609 -16133 -1645 67139 58852 32 -52643 -28859 -28298 -27093 -25500 -31476 -21987
15938b1987m1962p892O2014K1043L460k1364K6870O5030j2180j671K7095n844
15926I2612m4194n1420k3052o7987k7004R2814L0300R266m5203L909N6416q238
15914A8219q4793p951J5260M16K8381L3061O7167k225l3296n9686m3374m1276
15902a10097M082m475K7425j0985O1052n221k3733L0582P5923M5142O4645O9508
15890B23848l5961j15601m9286N363M8207M234l019q6403k6428N3993m9314q142
15878c8509M9558L6351j7669n2819J3105k466j1030M9715N459K3631l7652l3387
15866a5713M3524N0326J9410j4166m2756o4040J5791M2991l4378n8086n3102m1525
15854a51724K2224J03390M4915J3613j1161J2079L947m6930l86N0315L0290n3674
$$ plain form
15938 -21987 -63949 -71841 -9827 11216 14676 -6688 20182 85212 73032 71361 98456 92612
15926 92612 48418 -3002 -26054 -94041 -121045 -28231 2069 11335 -33868 -29959 26457 18219
15914 18219 -66574 -74525 -59265 -58849 -30468 2593 69760 67535 34239 -25447 -68821 -110097
15902 -110097 -106015 -110490 -83065 -94050 -32998 -38219 -61952 -31370 44553 89695 154340 223848
15890 223848 187887 72286 23000 28363 76570 80804 77785 -8618 -35046 18947 -30367 -38509
15878 -38509 11049 47400 29731 -23088 -9983 -12449 -23479 26236 31695 55326 17674 -15713
15866 -15713 27811 78137 97547 83381 40625 -23415 -7624 35367 989 -57097 -110199 -151724
15854 -151724 -129500 -26110 18805 32418 21257 33336 37283 -9647 -10033 40282 70572 16898
15842A6898p0724n4517K2184O0163K5588r825J983l074K5712J3993J9413o2746
15830a4952J1963j5892j3579K358m1811M3472J1949J6119m4569K0112J1997j4380
15818b7213l2138J2257K6273M0045p4130n4509N1625K3254m2697J80k1146o982
15806a05181P3042J1606m3335j2349M4695J3522M687J182q41N4609n4136n6500
15794f8999M445M1262N729M7254J8846m430q2346p4487p6630L8794M0330M2779
15782f7453L6131J278O6244j5153J833l4293K3043l0M8308k5005m6462J7681m9334
15769d3212m3928J9339J2535R857P6034k3089j8455J6224n2853l1484k8697N4155
15757e3574L2702L3918l0705m4030q17J990L1541R51P1397N059m6638r405l5310
$$ plain form
15842 16898 -53826 -108343 -86159 -25996 -408 -10233 -8250 -11324 14388 28381 47794 -14952
15830 -14952 -2989 -18881 -32460 -30102 -71913 -28441 -16492 -373 -44942 -24830 -12833 -27213
15818 -27213 -59351 -47094 -20821 19224 -54906 -109415 -57790 -34536 -77233 -77053 -98199 -105181
15806 -105181 -32139 -20533 -63868 -76217 -31522 -18000 -13313 -12131 -12972 41637 -12499 -68999
15794 -68999 -64554 -23292 -17563 29691 48537 44107 -38239 -112726 -189356 -150562 -110232 -67453
15782 -67453 -31322 -30044 36200 21047 22880 -11413 11630 11600 59908 34903 -11559 6122 -43212
15769 -43212 -87140 -67801 -55266 -45409 30625 7536 -10919 5305 -47548 -79032 -107729 -53574
15757 -53574 -20872 13046 -17659 -61689 -62506 -60516 -28975 -28024 43373 48432 1794 -7611 -42921
15744d2921n2019L6048M5207j4006j434j8400p6827M4320J30092n312m3859L298
15732D187N4597K8028j3636o7492l906J5182k3309L1556l60l237K4476j0584n5503
15719b0001p6716K9899J32768L9525j9509m6570K6189l3016o1926j6879K6048
15708b0188k6229J5501P161m4270J8618J7948K9073K423l3427q201L5957N3495
15696D7861L1504l3230l4322M8m0784j8024L2065q344J5m968N792k2964M7051
15683A700R1865K4048k2123m7134j8275J9096p899J0211Q777K0694j09125r1281
15671a19446K3284K9281L1011M9716R726n8027K4335K8347R208O02l6230K6408
15659A8215m3668p2835N2662M9757n664j5351n16L1190Q877n9214j7292R069O744
$$ plain form
15744 -42921 -94940 -58892 -13685 -27691 -29125 -47525 -124352 -80032 50060 44748 889 4187
15732 4187 58784 86812 73176 5684 1778 16960 -6349 25207 24847 21610 46086 35502 -20001
15719 -20001 -96717 -66818 65950 105475 85966 39396 65585 32569 -29357 -46236 -20188
15708 -20188 -46417 -30916 -23755 -68025 -49407 -31459 -2386 37 -33390 -41591 -5634 47861
15696 47861 79365 46135 11813 11861 -28923 -46947 -14882 -23226 -23211 -28179 -22387 -45351 1700
15683 1700 93565 117613 95490 48356 30081 49177 41278 51489 60266 80960 -28165 -119446
15671 -119446 -96162 -66881 -35870 13846 23572 -34455 -10120 18227 27435 28037 -8193 18215
15659 18215 -25453 -98288 -45626 4131 -1533 -16884 -17400 13790 22667 -36547 -53839 -44770 -38026
15646c8026l9442l5343K4375Q5226K1782P3671L7980n3539m4127M2337N0138l6997
15634H8035j1823r346m3986n045L6974j3268J3629l0714n3306L205L6575K2330
15622C3260m1480l3853j331J9836K06K1660L294N4154L7500r347m5814L516J9994
15609F1595L700r822p222L1632o4634q7996J406M1094M5777J5054k0566l6555
15597b6537p307L4962K9196L7361N0967o2751k9440J4086J6553o4469R555q777
15585f601m6222K2860O6161M0195Q062q2640l4268J7322j6753k7204k8133O1556
15573b5665k1284n2293Q592J05520k3709p2619K5469O5832j1924m9314L852N1614
15561D071J1418l3911j74Q0056K1037L3645L0969p2899q5147j1753Q119k1983
$$ plain form
15646 -38026 -77468 -112811 -88436 -3210 18572 92243 130223 76684 32557 74894 125032 88035
15634 88035 76212 66866 22880 17835 54809 41541 55170 24456 -28850 -25645 10930 33260
15622 33260 -8220 -42073 -43404 -23568 -23362 -1702 1592 55746 93246 83899 38085 41601 61595
15609 61595 65295 55473 48251 79883 15249 -72747 -71341 -30247 15530 30584 10018 -26537
15597 -26537 -33844 1118 30314 67675 118642 55891 26451 40537 57090 -7379 2176 -6601
15585 -6601 -52823 -29963 36198 76393 84455 1815 -32453 -15131 -31884 -59088 -87221 -25665
15573 -25665 -46949 -99242 -90650 14870 -8839 -81458 -55989 9843 -2081 -51395 -47543 4071
15561 4071 15489 -18422 -18596 61460 82497 116142 147111 74212 -10935 -22688 -14569 -36552
15549c6552l1459R87J7555J4287l2738k3255N3826J1152L8182k1454K6599O208
15537B3338k9767R399K1756l1544N3382K0929j5307l3660n2381L3709M5448J4037
15525E9339o6998N556J2623k3395k070K6063K6085M9629m53j05264r1965P3867
15513c6983Q9269n49j2699o58n6810l5285Q3786N8944L5636m351m119n9925p8613
15500b2357o7989K3382K0391l0325J4095L8710J4197K347N4198K0577o0832n3807
15488d7413n8598M3247J16678K5116k9104l0232m6005l8827k3478j3858R87J06792
15476E305K6679P181l4778k4534Q715m4263J6504N2771J3604k0985j971j3952
15464i724L6363K4411n2426k8545J7385L5470j2228n6813N3657M4178k4181m1764
$$ plain form
15549 -36552 -68011 -67024 -49469 -35182 -67920 -91175 -37349 -26197 11985 -9469 17130 23338
15537 23338 -6429 2970 24726 -6818 46564 67493 52186 18526 -33855 -146 45302 59339
15525 59339 -7659 -2103 10520 -12875 -14945 11118 37203 86832 86379 -18885 -110850 -36983
15513 -36983 52286 51737 39038 38380 -18430 -53715 30071 89015 124651 120300 116181 56256 -22357
15500 -22357 -90346 -66964 -46573 -76898 -62803 -24093 -9896 -7549 46649 67226 6394 -47413
15488 -47413 -106011 -62764 53914 79030 49926 19694 -26311 -65138 -88616 -102474 -101487 5305
15476 5305 31984 39165 4387 -20147 -11432 -55695 -39191 13580 27184 6199 4228 -9724
15464 -9724 26639 51050 -1376 -29921 -12536 22934 10706 -46107 7550 51728 27547 -14217
15452a4217p0420m7231O481M4368P9023R039n2569k4261P681K217o6360r229p354
15439a42832N3955l3145R615J04350R595J1175m040O5946O8532J9760q2264r4887
15427a4240j3339N3824m066l2396k2887J8212L8232K7882P501J6471J3031L121
15415I1346J0186n2042n2955L5312M1464l4987K1494k7522R773k2211K4001j6884
15403B6975n4509k4076J9814J6801m6483K8026k2754l4966M3109M3251l3116m8122
15391h6050J153J2912L5550L0759P475l1033j4666L4450M1923m4413l4836o131
15379e2907K3033l0513K0632M2857k759L8116K3203m5345o3415K5768k3149j2159
15367e6638l6960j7687j8779L454J1590K3532P5237l235l5904O7522M1525K7317
$$ plain form
15452 -14217 -84637 -131868 -125387 -81019 -1996 7043 -45526 -69787 -62106 -59889 -126249 -135478 -142832
15439 -142832 -88877 -122022 -112407 -8057 1538 12713 8673 74619 143151 162911 80647 -14240
15427 -14240 -27579 26245 22179 -10217 -33104 -14892 23340 51222 58723 75194 88225 91346
15415 91346 101532 49490 -3465 31847 73311 38324 59818 32296 42069 19858 43859 26975
15403 26975 -27534 -51610 -31796 -14995 -61478 -33452 -56206 -91172 -48063 -4812 -37928 -86050
15391 -86050 -84897 -71985 -36435 -5676 1799 -29234 -43900 -9450 32473 -11940 -46776 -52907
15379 -52907 -29874 -60387 -39755 3102 343 38459 61662 16317 -47098 -21330 -44479 -56638
15367 -56638 -93598 -111285 -130064 -126610 -115020 -91488 -16251 -19486 -55390 12132 53657 80974
15355H0974l0957r9859l9601N0192K4896k299L0728N1015j1748m7971j1938k3678
15343c0246K1998J774o3136K8062k4714J8669J3569j8429j3285J3178L4300L7333
15331A9073M0879K1035j7963J7091l8669k8586r585j1933n3305N5932N7921m2918
15319H972J3407o979l7643n445k0088l2218J6084Q1605k6719o6701k8492O2359
15307d1858N0865j0603k9285N2467K1376K3025j238j2726j8310k7655j6332K6419
15295A6145L7001m0218k3942o3353k6686K1970M7173L31j7990K9621M3622j0524
15283A3150M0278J8024n7504j0424O2829k6952l2780n1765L8771j7957j9963j2734
15271e7027J9768M3796j7526L9478L3691M9528l6409j5574n2663m2322k8893K3384
$$ plain form
15355 80974 50017 -49842 -89443 -39251 -14355 -16654 14074 65089 53341 5370 -6568 -30246
15343 -30246 -8248 -6474 -69610 -41548 -66262 -47593 -34024 -52453 -65738 -52560 -18260 19073
15331 19073 59952 80987 63024 80115 41446 12860 3275 -8658 -61963 -6031 51890 8972
15319 8972 22379 15400 -22243 -27688 -47776 -79994 -63910 17695 -9024 -75725 -104217 -41858
15307 -41858 9007 -1596 -30881 21586 42962 65987 64749 52023 33713 6058 -10274 16145
15295 16145 53146 12928 -11014 -74367 -101053 -79083 -31910 -31579 -49569 -19948 23674 13150
15283 13150 53428 71452 13948 3524 66353 39401 6621 -45144 -6373 -24330 -44293 -57027
15271 -57027 -37259 6537 -10989 28489 62180 111708 75299 59725 7062 -35260 -64153 -40769
15259d0769j4544k9677l1817M604L880J8433L9920J0192R189L5587K3804O760
15247C5562q6163l9589M9883N633l7586L0342Q8789J5011p3215m824J676l5894
15235e0375m904N5590K9649j6940J9073l1677n5076m1698q321J9510M1437K2739
15223b0993k0363K9434K944j6452o2271p1078M1477J08575K7929n6048Q711K4804
15211c331L7417k0146o1730J5863l8785k6838O2685J0631l8552o835P8894N1311
15199F0584O4252n5346n6415l5466p8155n655Q6623O7387o52j9913k6078K0517
15187B1683j6346p8997n1201Q2744j0071j7732J3197k0474K6641M2037j6352k4174
15175d9045m9688l699J16904L8225p5080j8435J994p915l6865l4944O7891N9657
$$ plain form
15259 -40769 -55313 -84990 -116807 -112203 -108323 -89890 -49970 -39778 -30589 4998 28802 35562
15247 35562 -50601 -90190 -40307 -34674 -72260 -41918 46871 61882 -11333 -16157 -14481 -50375
15235 -50375 -55279 311 29960 13020 32093 416 -54660 -96358 -104679 -85169 -43732 -20993
15223 -20993 -41356 -11922 -8978 -25430 -87701 -158779 -117302 -8727 19202 -36846 -28135 -3331
15211 -3331 34086 13940 -47790 -31927 -70712 -97550 -34865 -24234 -62786 -69621 9273 60584
15199 60584 124836 69490 13075 -22391 -100546 -106201 -19578 47809 47157 27244 1166 21683
15187 21683 5337 -73660 -124861 -42117 -52188 -69920 -56723 -77197 -50556 -8519 -24871 -49045
15175 -49045 -98733 -102432 14472 52697 -22383 -40818 -38824 -46739 -83604 -118548 -50657 9000
15163I000k2426n3085O4999K7404K9785n0287j1533R244m1647K3800J8842K2990
15151B7086J9971n6992j6630q5784k1543L0560Q365L0529L456M3852k4979J6275
15139b5834J8195r408K0039l81K379m0130m8002j5083Q0602j8181L894o705K1572
15126a7043J8656N3525m1848l8885o005J60O048L5187l2287q69J4260j3052q609
15113c0762j5135J7426r365k3975J5860N8638J7651m6431j134P7269M2119j7151
15101H5010m1617m5281j3705j9824l0289M1317L4761R2943J0679l5776p1018K6175
15089C3375J9771N063j0880k2708k6935k8796l7179j3719N3957J4189L590L3396
15077B3124P1221L9280k6140p0020L592O478j2205L2862J5786J5355k4237l1684
$$ plain form
15163 9000 -13426 -66511 -1512 25892 55677 5390 -6143 3101 -38546 -14746 4096 27086
15151 27086 47057 -9935 -26565 -112349 -133892 -103332 -94967 -64438 -60982 -17130 -42109 -25834
15139 -25834 -7639 -17047 2992 2611 4990 -35140 -83142 -98225 -17623 -35804 -31910 -38615 -17043
15126 -17043 1613 55138 13290 -25595 -31600 -31440 -25392 9795 -22492 -23361 -9101 -22153 -30762
15113 -30762 -45897 -28471 -37836 -61811 -45951 12687 30338 -16093 -17227 60042 102161 85010
15101 85010 43393 -1888 -15593 -35417 -65706 -24389 10372 103315 113994 78218 7200 33375
15089 33375 53146 58209 47329 24621 -2314 -31110 -68289 -82008 -28051 -13862 -10272 23124
15077 23124 94345 133625 107485 37465 41057 47535 35330 68192 83978 99333 75096 43412
15065D3412m1504k5351p5194m7589K7101J01279N0594J1182K8183K9702l3657
15054F8158m2712k4086K918o4234o8349J7044Q6216O3179K0512J8921J0239p4864
15042A2942j00161L7012N1228J3490O841j3919o4355n4047J7335J00665j9224
15031a2193O5621J2024L9203K1765o9919M588k8521Q297j8373j3234O3915j1111
15019F2062n3161r6204l3519K7278N5364K4738K9329l6041J2596L3918q64j4344
15007A1152k2678L517L469P5162R8465n856o5197K0763m9557m5562n4485l2478
14995f3285n6313K2681P0894l8338q4661r65R212K8443L5826L6710N2009k424
14983I789R464k8716J0323K0840M801N4857J8409l2285o3978n8854j4944L2407
$$ plain form
15065 43412 1908 -23443 -98637 -146226 -119125 -17846 32748 43930 72113 101815 68158
15054 68158 25446 1360 4278 -59956 -128305 -111261 -25045 38134 58646 77567 87806 12942
15042 12942 -87219 -50207 1021 14511 21352 7433 -56922 -110969 -93634 7031 -12193
15031 -12193 53428 65452 104655 126420 56501 61089 32568 40865 22492 9258 73173 62062
15019 62062 8901 -87303 -120822 -93544 -38180 -13442 15887 -20154 -7558 26360 25496 11152
15007 11152 -11526 -8009 -4540 70622 169087 163231 98034 118797 69240 23678 -30807 -63285
14995 -63285 -119598 -96917 -26023 -64361 -149022 -149987 -140775 -112332 -76506 -39796 12213 9789
14983 9789 19253 -9463 860 21700 26501 81358 99767 67482 3504 -55350 -70294 -37887
14971c7887L7822M8549m5972n8453k5483K6298J9541k5866M9000N4761l5664o2624
14959e5978j6123P9476Q2355J1573l3587r0023j5629j8894l556L0249o736J8296
14947a8577k7869J0552J1914K3582j1356M2799N6493L1568m1754k8312r4945m4902
14935i0807K5584L3513k2324m5081K5974N7073L0167n1787l9001N3076K3491J5862
14923A5740k3644K1022M590K8416l4479p596L7759K5018Q940q479K4501n9095
14911C2693N9494R850m516P43o577l1461j9732M0992l8396r1408N828m5171Q943
14898g8718L2642M2536K8204n5932N7687J8734K3249j7833o0519k8647Q339J722
14886b8536N5867K8162m9944o2257P789J9750n0940l9506M5693p744j8191J2011
$$ plain form
14971 -37887 -65 48484 2512 -55941 -81424 -55126 -35585 -61451 -12451 42310 6646 -55978
14959 -55978 -72101 7375 89730 101303 67716 -22307 -37936 -56830 -60386 -30137 -36873 -18577
14947 -18577 -46446 -35894 -23980 -398 -11754 31045 87538 119106 77352 49040 -45905 -90807
14935 -90807 -65223 -31710 -54034 -99115 -73141 -16068 14099 -37688 -76689 -23613 -122 15740
14923 15740 -7904 13118 17708 46124 11645 4049 41808 66826 75766 67287 91788 32693
14911 32693 92187 102037 97521 98264 91687 60226 40494 81486 43090 -48318 -42490 -87661 -78718
14898 -78718 -46076 -3540 24664 -31268 26419 45153 68402 50569 -9950 -38597 -30258 -28536
14886 -28536 27331 55493 5549 -56708 -48919 -29169 -80109 -119615 -73922 -81666 -99857 -87846
14874h7846M7516N5296J3187l5884n4934j1620l1959j4753J6008O2169N0070n0071
14862d2821l6085o565K1033J2005J7395K9152l8971L9598K5006k7837m1613K6673
14850b3030L8476K376J2153j4383j6312j0543K568n971R7859J9922k6896n0400
14838B5819P450l1940L371j5398K4923K4347M1892o9094k1863K6523K2303J0288
14826D8621o4840m4539J6224L6259k7975J5667k2208j996L2169O0606k3721n376
14814A8891N0417l836n3583N593j9601k7995p981P774L1345j8416l9938J6493
14802d0837Q622m8009j2991p0612j6434N411J5447L2189j127j0992R2222M9188
14790B077o5406k1076L6090M1415M1742K3983n5496j09923l6745j6992J786Q0532
$$ plain form
14874 -87846 -40330 14966 28153 -7731 -62665 -74285 -106244 -120997 -104989 -42820 7250 -42821
14862 -42821 -78906 -85471 -64438 -52433 -35038 -5886 -44857 -5259 19747 -8090 -49703 -23030
14850 -23030 15446 17822 29975 15592 -720 -11263 -8695 -14666 83193 103115 76219 25819
14838 25819 33269 1329 4700 -10698 14225 38572 80464 11370 -10493 16030 38333 48621
14826 48621 -16219 -60758 -44534 -8275 -36250 -20583 -42791 -44787 -12618 47988 24267 18891
14814 18891 69308 65472 11889 17482 -2119 -30114 -38095 -30321 1024 -17392 -57330 -40837
14802 -40837 -32215 -80224 -93215 -163827 -180261 -174850 -159403 -127214 -128341 -139333 -47111 2077
14790 2077 -63329 -84405 -48315 -6900 34842 58825 3329 -106594 -143339 -160331 -158545 -78013
14778g8013N0383j7682k4094q033J9463Q494L9094J6367P691M6813P581n4689
14766A3375m687j4664m6234o9059L5994N1559o094N699O0950K1696L346j1640
14754D0241p971k2858n9436L305M2373K0045l1234Q461K3710J3721K432o12L39
14741C2516k9228r60Q859N3250O1786j15215n9648J9043K7139k7187k2658K7334
14729b4969K4886j3379j8970M978K5592j5164q495K7746L7496m1533n7473k7642
14717h6927M1680J1373k6421L0242K3139L0673j6778L0578J0492n0846n4650k1041
14705g8486J8113M1026p9917K3001R767k5664N0947K6167J9365K9562l4883J7171
14693A6169N918n9869J2558r70m30K7223O7257k5062k4878J1104Q269O069p746
$$ plain form
14778 -78013 -27630 -45312 -69406 -77439 -57976 -49482 -10388 5979 13670 60483 68064 13375
14766 13375 8688 -5976 -52210 -121269 -85275 -33716 -39810 -34111 26839 48535 51881 40241
14754 40241 32270 9412 -50024 -46719 -4346 15699 -15535 -7074 16636 30357 32789 32177 32516
14741 32516 3288 2328 11187 64437 126223 11008 -48640 -29597 -2458 -29645 -52303 -24969
14729 -24969 -83 -13462 -32432 -27454 -1862 -17026 -25521 2225 39721 -1812 -59285 -86927
14717 -86927 -45247 -33874 -60295 -30053 -6914 23759 6981 37559 48051 -2795 -57445 -78486
14705 -78486 -60373 -19347 -99264 -76263 -66496 -92160 -41213 -15046 4319 33881 -1002 16169
14693 16169 22087 -37782 -25224 -26194 -26624 599 67856 42794 17916 29020 37289 43358 35612
14680C5612l6553M272K6562l3146K5820k7738L1453P4466J1001l9562j5537k0971
14668C5679p687k0093J4608J2020n6822J1949P523L4180k1331l7598L2163N3721
14656E8312n399K9575o831j3325k9345m1044Q09L2381k7561L0092K9567j5261
14644D1970M7892j8192o1939j6755n6813m1143j92K6317J8735N535K4108O2756
14632C2279j056m1455j1809J3475K8753K7622K5406m7139n2488k47m1916j1184
14620g9759j444L5627N5693J03536M9383j1227p0889o9413N0980K4773m2564o904
14608C7792L2152J0612n7639m7919k7079L1171O183o1187P163M5890k8502l1417
14596h2780K0152Q037J4415K7406j6247K9395m6147l7905j2000N116L5530K6619
$$ plain form
14680 35612 -941 3331 29893 -3253 22567 -5171 26282 100748 111749 72187 56650 35679
14668 35679 27992 7899 22507 34527 -22295 -10346 -2823 31357 10026 -27572 4591 58312
14656 58312 52913 82488 75657 62332 32987 -8057 -7248 25133 -2428 27664 57231 41970
14644 41970 89862 71670 9731 -7024 -63837 -104980 -105172 -78855 -60120 -54585 -30477 32279
14632 32279 31223 -10232 -22041 -8566 20187 47809 73215 26076 -26412 -26659 -68575 -79759
14620 -79759 -81203 -45576 10117 113653 163036 151809 80920 11507 62487 87260 44696 37792
14608 37792 69944 80556 22917 -25002 -52081 -20910 -14727 -75914 -68751 -22861 -51363 -82780
14596 -82780 -62628 -54591 -40176 -12770 -29017 378 -45769 -83674 -95674 -90558 -55028 -28409
14584b8409n080k6400l0098L5293J9447j234j0364k0529N06M5950L2640l3047
14572b1325n1612L7253m4155M6299K5602m1533J66K0475K7182K4612J426K921
14560B7311N3531J267p1097l4390M4213M7150M1327N5304m8539o0990m4211k9885
14548a9009o889j2570o460k3611m5408M461L3104J3419L7841K9556K9206o4804
14536c1164n9177N852O9844K9056m5291L1402K4563L1337l373l7355K0698j078
14524C5314m9160m6550l92K9493K7730o344N307M9173j1066R691j9078o1607j8848
14511e6337l7664N4546J7091M46M2294R6720m0209j01790j2849L2731J1725J4271
14499B0975o0994J638L7556l1855j8944j3408O9872L1045K8769n433J6734R025
$$ plain form
14584 -28409 -33489 -59889 -89987 -54694 -35247 -36481 -46845 -67374 -66868 -20918 11722 -21325
14572 -21325 -72937 -35684 -79839 -33540 -7938 -49471 -49305 -28830 -1648 22964 24390 27311
14560 27311 80842 82109 11012 -23378 20835 67985 109312 164616 116077 55087 10876 -19009
14548 -19009 -25898 -38468 -44928 -68539 -113947 -109486 -76382 -62963 -25122 4434 33640 -31164
14536 -31164 -90341 -84489 -14645 14411 -30880 522 25085 56422 53049 15694 36392 35314
14524 35314 -13846 -60396 -60788 -31295 -3565 -9909 -4602 44571 33505 43196 24118 -37489 -56337
14511 -56337 -94001 -39455 -22364 -21918 20376 117096 76887 -24903 -37752 -5021 6704 20975
14499 20975 -40019 -38381 -825 -32680 -51624 -65032 4840 35885 64654 59221 75955 84980
14487H4980j4719l6422K493j7875P407r424o377K55p4783J2828J2730k0657l309
14474f2873j807K778j995K0227k2368M0523M9496n8985n1491l6452o22J6723k4689
14461a31535J179O8789K4672o4076R447J540k9915K6584N9844J7490J5256k9156
14449b9881j0128L0668N455m5909o0800J201L1356O1876P0944m8350o353M7540
14437D7619J2000j0763l5702m6044J5380l1716k8136K2603M3035K9600l0553r978
14425b2655L7343O5261R446l2785k6135l1124q968l9919L062k0869p1725N4599
14413h4469J33729L6782m5135k4403n026j8298n753M0819J8143n1909o0320j1161
14401g7001N5220K5145j3391j3279m6032L4786J2914o5602m5420R0149P9374K9163
$$ plain form
14487 84980 70261 33839 36332 18457 25864 16440 10063 10318 -64465 -51637 -38907 -59564 -62873
14474 -62873 -64680 -61902 -63897 -43670 -66038 -25515 23981 -35004 -86495 -122947 -123569 -106846 -131535
14461 -131535 -130356 -61567 -36895 -100971 -91524 -89984 -119899 -93315 -33471 -15981 -725 -29881
14449 -29881 -40009 -9341 -3886 -49795 -110595 -109394 -78038 -16162 54782 6432 79 47619
14437 47619 59619 48856 13154 -32890 -17510 -49226 -77362 -54759 -11724 17876 -12677 -22655
14425 -22655 14688 79949 89395 56610 30475 -649 -9617 -49536 -46474 -67343 -139068 -84469
14413 -84469 49260 86042 40907 16504 11478 -6820 -12573 28246 46389 -5520 -65840 -77001
14401 -77001 -21781 3364 -10027 -23306 -69338 -34552 -21638 -87240 -132660 -42511 36863 66026
14389F6026m8768m1978l9171j7594j6993n5680l7193O0698J26233J8811j9157
14378d766K952O1768P513M1290k7911j16158j5659L194r540K0960P6976M8345
14366H8964L1708q4719k3096n073R647L3217j2268l2804p0621k512K8642k1800
14354f0715k6499R02J3834O1890P012L7272m294l8559n0961K2809J7278R290O2650
14341E1909J0873R891q5884j6974M1223M4470N6607l5526k9744o8063q091n9218
14329h8527M9309K822L3856j0316p3468K4152j2464K0909N0585j3834j709r976
14317b8661K293M8634J9418m3262k0283l9491L1125O2526O7687l7516r3574j11316
14305a42420o0228K5672K0852O3470Q9979J6167q373k6329m6382Q438M9679L5804
$$ plain form
14389 66026 17258 -24720 -63891 -81485 -98478 -154158 -191351 -130653 -4420 14391 -4766
14378 -4766 -1814 59954 67467 108757 80846 -35312 -50971 -47777 -57317 -36357 40619 88964
14366 88964 120672 35953 12857 7784 17431 50648 38380 5576 -65045 -67557 -38915 -60715
14354 -60715 -87214 -86312 -72478 -10588 -3576 33696 29402 -9157 -60118 -37309 -20031 -10741 51909
14341 51909 62782 72673 -13211 -30185 11038 55508 112115 76589 46845 -21218 -29309 -88527
14329 -88527 -39218 -36396 -2540 -12856 -86324 -62172 -74636 -53727 -3142 -16976 -18685 -28661
14317 -28661 -26368 22266 41684 -1578 -21861 -61352 -30227 32299 99986 62470 -31104 -142420
14305 -142420 -202648 -176976 -156124 -92654 -2675 13492 5119 -21210 -67592 -59154 -9475 26329
14293B6329L9113P316q136P820q725M7419K1259m4065m8740m7737l8081k0157
14281f6385K2813J5594Q5298N6322j0081k1876p419M697l503p251q8109m5634
14269f5534k1356M492K0636K9337N5253j9583p0819O233J550O634N4078K3143
14257B4064k5675m5712l176l461o651K2856M4797J4633l1689j2350M6414k8836
14245d786L418O1494k5820o153k0041n2433k1462K6398j3538M3296N1680m0661
14233A392n4747M3063Q6727J7777l0975j00470n41N92j2062m1111j24N7696m055
14220c6838l0644L3746K0671k2823n3440k0067j3860R166M0594j507n7062L6160
14208i5904J394J1832j7828j5797j0418O0314P0475O6335n229n9364k577J7564
$$ plain form
14293 26329 65442 72758 64622 72442 63717 111136 132395 88330 39590 -8147 -46228 -66385
14281 -66385 -43572 -27978 57320 113642 103561 81685 74266 78963 75460 68209 -19900 -65534
14269 -65534 -86890 -82398 -61762 -32425 22828 3245 -67574 -61341 -59791 -53157 921 24064
14257 24064 -1611 -47323 -50499 -53960 -60611 -37755 7042 21675 -10014 -22364 24050 -4786
14245 -4786 -1368 60126 34306 28153 8112 -44321 -65783 -39385 -52923 -9627 42053 1392
14233 1392 -53355 -10292 76435 94212 63237 -37233 -37774 -37182 -49244 -90355 -90479 -32783 -36838
14220 -36838 -67482 -33736 -13065 -35888 -89328 -109395 -123255 -114089 -73495 -75002 -132064 -95904
14208 -95904 -94510 -82678 -100506 -116303 -126721 -66407 4068 70403 65174 5810 3233 20797
14196B0797j061j3281m9786k4986M3995L2315j7181J1257j3104J5055r228K4162
14184A8954K8831l5959p081k3397k0157o4288J184J6241j8194J6369L2906R757
14172d4834o082L6155o827J7844O462j9377J9626l6491n2154j0568p1915l202
14160a71363P3626L4577R372N887J7283m3274n3920j6665L4332K4845K5143N1616
14148h541L0211R930K937l6029L9247J8059r363n2047k5719L7747O7803j7489
14136E6746l4000k1083q2984L3323r901M809L0402J7371P014k3653R598K9952
14124A7594K1366M4198k8509m3630J089n0269k2900K8576K4348K6318J7685k1203
14112A4663l305m2046p349M5318j2412j8534M8455J4807J5520M7012l2542m822
$$ plain form
14196 20797 19736 6455 -43331 -68317 -24322 7993 -9188 2069 -11035 4020 -5208 18954
14184 18954 47785 11826 4745 -18652 -38809 -103097 -101913 -85672 -103866 -87497 -54591 -44834
14172 -44834 -50916 -14761 -21588 -3744 2718 -16659 2967 -33524 -85678 -96246 -168161 -171363
14160 -171363 -97737 -63160 -53788 -47901 -30618 -73892 -127812 -144477 -110145 -85300 -60157 -8541
14148 -8541 21670 31600 34537 -1492 37755 55814 46451 -5596 -31315 6432 74235 56746
14136 56746 22746 1663 -81321 -47998 -57899 -53090 -22688 -5317 1697 -21956 -12358 17594
14124 17594 38960 83158 54649 11019 12108 -38161 -61061 -32485 -8137 18181 35866 14663
14112 14663 11358 -30688 -38037 7281 -5131 -23665 24790 39597 55117 102129 69587 64765
14100F4765n5145o629j8905m0402M9284M8060L6359l4602k3868p090n5285p492
14088e0950r76k669j9186L2504N7705L756O4340n047k9159l5547k5250l0597k2137
14075f3213J5317k17K2402J7677o224J5510j1102J5734p1776r0634J4481Q0337
14063f1708R6149M7844n3967p3637K7900L5557L9165r2042q4662O2224N8123J6087
14051A7033r3355j0684Q2582K4872k9924k2629l067K3668k2071Q0205N5639l7672
14039F4597J4523j3268n3463l93L1518o2360j6685O4147N1346n9648n211M69n3085
14026c7513k4836l353K95q930J7141k8940M8533k3796p907O0717Q2761l1585j9401
14013B3186j0713j5155r174M0130l7691J9562n146J8339K6820l3847m0513K4325
$$ plain form
14100 64765 9620 2991 -15914 -56316 -7032 41028 77387 42785 18917 11827 -43458 -50950
14088 -50950 -51926 -54595 -73781 -41277 16428 20184 84524 79477 50318 14771 -10479 -41076 -63213
14075 -63213 -47896 -48113 -25711 -8034 -14258 1252 -9850 5884 -65892 -156526 -142045 -61708
14063 -61708 34441 82285 28318 -45319 -17419 18138 57303 -34739 -119401 -57177 946 17033
14051 17033 -76322 -87006 -4424 20448 -9476 -32105 -35172 -11504 -33575 46630 102269 64597
14039 64597 79120 65852 12389 11996 43514 -18846 -35531 28616 79962 20314 15103 15572 -37513
14026 -37513 -62349 -65702 -65407 -74337 -57196 -86136 -37603 -61399 -69306 -8589 74172 42587 23186
14013 23186 12473 -2682 -11856 28274 -9417 10145 4999 23338 50158 16311 -24202 123
14001A23k2472o0558k2259O2634M6907N5521K2430p8058r514J1027l7028j5606
13989d6853j6719K524j7007M3344J14907k406l5062K8217j6468j0671L4803p778
13977G0831n7717l2776M048L6359j5363k7863j3199L4474l0945P559L6320k0200
13965h472l9460p46q217m9179r253K6756L1475l7511j2275L7585J2392K1233K637
13952c3035K3243l5884J8757n431m7453K5872N1088N2302M602k8209j7380J6148
13940B4620K8063J0983k6707j3575J7967J2795J9763k5266n6748N7664J7853o1203
13928F209K8391J8047q8218j869L5598K1150L9602N88m4987j9795j2471K6468
13916H713j4578J2422j6818o8909L6073q247o2314N187J9672N9024L0071M5314
$$ plain form
14001 123 -22349 -82907 -105166 -42532 4375 59896 82326 4268 -5246 5781 -31247 -46853
13989 -46853 -63572 -61048 -78055 -34711 80196 77790 42728 70945 54477 43806 78609 70831
13977 70831 13114 -19662 -15614 20745 5382 -22481 -35680 -1206 -32151 -24592 11728 -8472
13965 -8472 -47932 -48678 -56895 -106074 -115327 -88571 -57096 -94607 -106882 -69297 -56905 -35672 -33035
13952 -33035 -9792 -45676 -26919 -32350 -79803 -53931 -2843 49459 54061 25852 8472 24620
13940 24620 52683 63666 36959 23384 41351 54146 73909 48643 -8105 49559 67412 6209
13928 6209 34600 52647 -35571 -37440 -1842 19308 58910 59498 14511 -5284 -17755 8713
13916 8713 -5865 6557 -10261 -79170 -43097 -51344 -113658 -108471 -88799 -29775 296 45610
13904D5610m8066O653M7546p267J6962l3006m0799L3377l8492k4921n637k5404
13892g3444J8639p0047N0824O4276n2272k3778M2654l875k2435K4030N1749J4942
13880B1263L3802J0555o9203l0871J311R424k460n62k7636l5457j3288k0220n201
13867a28543J1139L39J4838Q5382j3119R70J5665L762p708L0852j8706l0622J0935
13854b4816M840M1241l64r5529k4395j1560K6620l4186K679p755N3810K3018M9061
13841B664J2266n034k521J0277N812m0278k8320J046O0398N0525k5093m4364j2954
13828a5576k8045m9185J6919N628J2455R3708J3932n3312M567j0157r02o7285
13816g7253l459N571R299K5964O181M4766p761k2342j4585M4255J7757L4930l7825
$$ plain form
13904 45610 -2456 4197 51743 44476 61438 28432 -12367 21010 -17482 -42403 -48040 -73444
13892 -73444 -54805 -124852 -74028 -9752 -62024 -85802 -43148 -47023 -69458 -45428 6321 21263
13880 21263 55065 65620 -3583 -34454 -33143 -23719 -26179 -26741 -54377 -89834 -103122 -123342 -128543
13867 -128543 -117404 -117065 -102227 -16845 -29964 -28994 -13329 -9567 -17275 13577 -5129 -35751 -24816
13854 -24816 -19976 21265 20901 -74628 -99023 -110583 -83963 -118149 -115470 -123225 -69415 -46397 2664
13841 2664 14930 9896 7375 17652 23464 -16814 -45134 -44088 16310 66835 41742 -2622 -15576
13828 -15576 -43621 -92806 -75887 -70259 -57804 35904 49836 -3476 1091 -9066 -9968 -77253
13816 -77253 -80712 -75141 -65842 -39878 -33697 11069 3308 -19034 -33619 10636 28393 63323 25498
13803B5498j5744m0015k9784M983M2685M751m3928J0357m0016p5816N285K8713
13791a23031P348R3975R5591o0514k1690K1899K4088J0578n1175Q580K7808l0157
13779C300m6515K4675k2724k5463L145J5933J9533m7006l9572k0173M8819L9582
13767d6466k4998M6194M2492o2731r4695R274K4298p8196j9399N2633R684R5334
13755d6576N1074k5243M900N729K8308k7032R284K2661k0509J019l059K81j268
13742d31l0057j5487L7478K1265k6538o2563n01M4173O4578j0465n1102J9807
13730i843K2988j4524j8652L1984L6986q3721l5799k8871n9663R8381J11982M3708
13718I4956R50j3543l5813M5007k2039p2705k9305K6382k1016J2500L2065M2845
$$ plain form
13803 25498 9754 -30261 -60045 -55062 -12377 -7626 -51554 -41197 -81213 -157029 -151744 -123031
13791 -123031 -115683 -21708 73883 13369 -8321 13578 37666 48244 -2931 5649 33457 3300
13779 3300 -43215 -18540 -41264 -66727 -63582 -47649 -28116 -75122 -114694 -134867 -86048 -46466
13767 -46466 -71464 -25270 17222 -45509 -140204 -130930 -106632 -184828 -204227 -151594 -141910 -46576
13755 -46576 4498 -20745 -15845 -10116 18192 -8840 444 23105 2596 3615 556 837 -431
13742 -431 -30488 -45975 -8497 12768 -13770 -76333 -76834 -32661 31917 21452 -29650 -9843
13730 -9843 13145 -1379 -20031 11953 48939 -34782 -70581 -99452 -159115 -60734 51248 94956
13718 94956 95906 82363 46550 91557 69518 -3187 -32492 -6110 -27126 -14626 17439 60284
13706F0284K0973l6260k301l911n1964K362k5878N3142R2836k9503k7444q2045
13694b9709m2248L6529M5671k2784j3751L2270P4145q6445n9294L5435m3055m3610
13682a16846M2850M5667p297j0675n9584j7557J3030l1354M1953Q8557N5066j0225
13670C3585n9314k9755j9992K8622R004m9154M6213q204k9094k2722j4095l467
13658a18373K9865J9035M4920K3331J6055j2251K4551J5606n0268o2710j0657
13647h0896J4623K0024m20M5617m122q4264j7964O7892P0845m6997q4554k0039
13635a20255L1025K1724K5004M2543k1985j1152j6707k1868l1902L5666L7568
13624c0339P5439O396l9893j6779M1392m239l399o4175j2830N2509j0004o0424
$$ plain form
13706 60284 81257 44997 42696 38785 -13179 -10817 -36695 16447 109283 79780 52336 -29709
13694 -29709 -71957 -35428 10243 -12541 -26292 5978 80123 -6322 -65616 -30181 -73236 -116846
13682 -116846 -73996 -28329 -35626 -46301 -105885 -123442 -110412 -141766 -99813 -11256 43810 33585
13670 33585 -25729 -55484 -75476 -46854 -37850 -87004 -40791 -48995 -78089 -100811 -114906 -118373
13658 -118373 -88508 -69473 -24553 -1222 14833 2582 27133 42739 -7529 -70239 -80896
13647 -80896 -66273 -46249 -46669 -1052 -5174 -89438 -107402 -39510 31335 -15662 -100216 -120255
13635 -120255 -89230 -67506 -42502 41 -21944 -33096 -49803 -71671 -103573 -67907 -30339
13624 -30339 45100 51496 11603 -5176 36216 31977 28578 -35597 -48427 4082 -5922 -66346
13612f6346l1741J789J5310K49Q3863K0408J850L6757k9342n3037n1170j0967
13600h2377L3028l3169J8035L0069M1968l0394o2909J9220K5870j3375M5340j884
13588a0578m8047M3090N368K7639O146q6980p135M1610L1819M4582M7218n880
13576H8852m2726O1442k870m9336L1442l3449m3274M589k1949l5786j6218N1953
13564g330L252k9186n5681O2376M3633L5636o4708l1827K6677N699K0486K1516
13552C0543M1112k1253o7503k2153k2493P0830J20042l933n0814l2254L3017k3043
13540E2098J2324R143L2171n2705l8023P840K8649q24k3163k4361L4029k6186
13528A0992m2974K282K1334O48K5628l2596k9429p555K3101J2691R002m8277j9651
$$ plain form
13612 -66346 -98087 -96298 -80988 -80739 3124 23532 25382 62139 32797 -20240 -71410 -82377
13600 -82377 -49349 -82518 -64483 -34414 7554 -22840 -85749 -66529 -40659 -54034 -8694 -10578
13588 -10578 -58625 -15535 -10167 17472 23618 -63362 -70497 -28887 2932 47514 94732 88852
13576 88852 46126 107568 104698 55362 86804 53355 10081 14670 -7279 -43065 -59283 -7330
13564 -7330 -4078 -33264 -88945 -26569 17064 52700 -12008 -43835 -17158 -11459 9027 30543
13552 30543 71655 50402 -17101 -39254 -61747 9083 129125 125192 74378 42124 75141 52098
13540 52098 64422 73565 105736 53031 15008 22848 51497 50673 27510 3149 37178 10992
13528 10992 -31982 -29700 -8366 -7718 17910 -14686 -44115 -51670 -28569 -15878 -6876 -55153 -74804
13515g4804K714l0449K9790J4479L6737m810J625K6352m1070J2577K2555o537
13503a0841l1793m0828l0796O5806J18732j6544j1129k2215K3997l1496M2529
13492E5422p835l4206K974Q036j7214j2268j9085J723J4720o0838j312l2872l6154
13479a38909O1267P9305M4198n8600m6532K9252O769K3249k181J345n1567K5087
13467b7317J1104J3575k7259k0551Q967L5819j725l106m8995k485K3333R9933
13455F1293K4622J8491L689j1753q3076j7202J450L6858K0140m914M5182L123
13443I7903n07k9045o3554N382j4548J1015k097N5308Q6044l8425n9924m7262
13431B90q0704q851N06K3500M2429M4836M9039Q980n9936k0680Q767M2713K4149
$$ plain form
13515 -74804 -72090 -102539 -72749 -58270 -21533 -26343 -24718 1634 -39436 -26859 -4304 -10841
13503 -10841 -42634 -83462 -114258 -48452 70280 53736 42607 20392 44389 12893 55422
13492 55422 47587 13381 16355 24391 7177 -5091 -24176 -22453 -7733 -68571 -69883 -102755 -138909
13479 -138909 -77642 1663 45861 -12739 -59271 -30019 -23250 -1 -2182 -837 -52404 -27317
13467 -27317 -16213 -2638 -29897 -50448 -41481 -5662 -7387 -10493 -59488 -61973 -38640 61293
13455 61293 85915 104406 108095 96342 13266 -3936 -2486 34372 54512 49598 94780 97903
13443 97903 97396 68351 4797 10179 -4369 6646 4549 59857 145901 107476 47552 290
13431 290 -80414 -89265 -88759 -65259 -22830 22006 71045 80025 20089 -591 8176 50889 75038
13418G5038n3766n5291L2934m009J3586j3593L0974L8757L7249l2299o2604r5387
13406h8411K1731P4559N6460k5308m9629l2819k5381l9099O6678O5625p1645k1182
13394f8421K7194J4988K3549K0133j4585P31o841n9265l1779L0936M2972L4068
13382A3680J3835J5571n5443n1140n7891k2779L9247N4706j5028M182N4392M5328
13370C8660M972L741j4852m0858n855L7655K9024M871l6608o1960K4902L8311
13358B2003P553K2978J9397Q64j0764K7825l1953m7071k9606m3741K3551L2766
13346f198O2154O1090P212K240P005R991m8825N1545N2414M4523K4837J7356O1358
13333C46702P8983J70049K83849L38560L30776K17662J34015J04516n4217l60016
$$ plain form
13418 75038 21272 -34019 -1085 -5094 8492 -5101 25873 64630 101879 69580 6976 -88411
13406 -88411 -66680 7879 64339 39031 -10598 -43417 -68798 -107897 -41219 24406 -47239 -68421
13394 -68421 -41227 -26239 -2690 17443 2858 3589 -3252 -62517 -94296 -63360 -20388 13680
13382 13680 27515 43086 -12357 -63497 -121388 -144167 -104920 -50214 -65242 -61060 -6668 38660
13370 38660 43632 47373 32521 -8337 -14192 23463 52487 57358 20750 -41210 -16308 22003
13358 22003 29556 52534 71931 72795 62031 89856 57903 10832 -18774 -62515 -38964 -6198
13346 -6198 55956 117046 124258 126498 133503 143494 94669 146214 198628 243151 267988 285344 346702
13333 346702 425685 595734 879583 1218143 1548919 1766581 1900596 2005112 1950895 1590879
13323A590879m15016l59575k24474r2635r4185p4002p7559j03446N1417N5552
13313B56956K7067l7684q0392q1082l5226M6865N7109L3853k7504p2975K4931
13302A11918J6637m227l6167j1391K7740M6989M9241o987k3756m8705J3402n0630
13290H4064q6052l496K8340j2194O292n6260J9219K805j6966n2701J4413K7475
13278d5061j4114K6837M926M4276p592m746J9802j6196J3153q071n2834n980k4390
13265f9990m2861K6199J07839L8677j9995k4089N7323k6013q8071q618N2764j6760
13253a3595L3163N2676L1158k8303J0920l096o1200p0656j6352O1713O1586M1976
13241I9990M4447m5441p786K8560r9898L7045N3028j752m858n3310p32M751K3973
$$ plain form
13323 1590879 1175863 816288 591814 499179 404994 330992 253433 149987 201404 256956
13313 256956 284023 246339 165947 84865 49639 96504 153613 187466 159962 86987 111918
13302 111918 128555 124328 88161 76770 104510 151499 200740 193753 169997 121292 134694 84064
13290 84064 -1988 -5484 22856 10662 16954 -39306 -20087 -17282 -34248 -86949 -72536 -45061
13278 -45061 -59175 -32338 -27412 16864 9272 4526 24328 8132 21285 13214 -39620 -45600 -69990
13265 -69990 -112851 -86652 21187 59864 39869 15780 73103 47090 -40981 -49599 3165 -13595
13253 -13595 19568 72244 103402 75099 86019 82923 21723 -48933 -65285 -3572 58014 99990
13241 99990 144437 98996 91210 119770 19872 56917 109945 108193 103335 50025 49293 54044 78017
13228G8017Q263l0739l5078o6473O9686K3996n0071l7535j2253m8646L3430K9363
13216c8040J3428L9769L9845n6587Q361j692l0j1753K0752M0077K6608K2929J1149
13203A14816q5256k9582M7515J5290m7810n1651J8844j4435L997J8210j6170L5822
13191I590k0883m5662M3943l4863m4216M9931M0786m8701j8204P7679j0130q1086
13179h1816k193L120K9297l3027N4660O6546l3220o1177k8807Q8275N2516L7026
13167I1200l0160J397j4043k5790n2576J2615M0189M6579k0368R816o135k7102
13155B5622r9725j6205K1169k4317K8307L6911J6798O995N3306O67K6447L9126
13143A15101J119p967k0476L1847k7319o5128J3826j8683l3969l7909k5972O1607
$$ plain form
13228 78017 86280 55541 20463 -46010 23676 47672 -2399 -39934 -52187 -100833 -67403 -38040
13216 -38040 -24612 15157 55002 -1585 6776 5084 5054 -6699 14053 54130 80738 103667 114816
13203 114816 29560 -22 47493 62783 14973 -36678 -17834 -32269 -28272 -10062 -26232 9590
13191 9590 -11293 -56955 -13012 -47875 -92091 -42160 -1374 -50075 -68279 9400 -730 -81816
13179 -81816 -84009 -80889 -51592 -84619 -29959 36587 3367 -57810 -86617 1658 54174 91200
13167 91200 61040 62437 48394 22604 -29972 -17357 22832 69411 49043 58859 52724 25622
13155 25622 -74103 -90308 -69139 -93456 -65149 -28238 -11440 -4445 48861 49528 75975 115101
13143 115101 116220 108253 87777 119624 92305 27177 41003 22320 -11649 -49558 -75530 -13923
13131a3923K6276n9638J8957J0871L1200M4489m4844N9972R8532k0548o5770j6146
13119F9428N5314K9769J6967o3936l3482J3797P004L6558K5337O3678j9807k6040
13107A74587M8961K153N0148n3546l3043k813L6481K5108L2061N7258j4498l1981
13095B90876Q4906J71890J30902J25410P2810J0364j74660k12900j27449j52151
13085B19998m1851m844j8974l2007l9993K1175j58K1703l7662l5492K3269P8299
13073A53463j2742l6323O407J3902p571J5588o1893k5203N0709L8189k7123k8803
13061G8600r781O5365M5873K5619Q131j2078K3313n8707o3042j3388P1781M8779
13049B10465n1407m1657l2795M7824J8442K5029m2791k5960j1394j9337l799K2466
$$ plain form
13131 -13923 12353 -47285 -28328 -17457 13743 58232 13388 73360 171892 151344 85574 69428
13119 69428 124742 154511 171478 107542 74060 87857 94861 131419 156756 220434 200627 174587
13107 174587 223548 225701 275849 222303 189260 186447 222928 248036 280097 337355 322857 290876
13095 290876 375782 547672 678574 803984 876794 887158 712498 499598 372149 219998
13085 219998 178147 173303 154329 122322 82329 103504 103346 125049 87387 51895 75164 153463
13073 153463 140721 104398 110805 124707 117136 132724 70831 45628 96337 134526 107403 78600
13061 78600 68819 134184 180057 205676 213807 201729 225042 166335 103293 89905 161686 210465
13049 210465 159058 117401 84606 132430 150872 175901 133110 107150 95756 76419 72620 95086
13037I5086J6065m6076K54J9950l5270J5504O6584L5364L2438O647j2118J8598
13025B13026l86j2935k2611j272k7731l8295L48m175l1598n4336p330R0795j2362
13012I1138m1637P238M6875q56r228P4933K0893l9548K0561j3592L0043j4181
13000A72639j0774l68J6170L1123N1078O9518K2958j4794J9664K3007P8418q221
12988D50418o1529m5941K5407O931p976l188r707l4688p7434K2068J2722P0191
12976C47274L9867L196k6605m7145p1398q0067Q5409L4452k4318M5512j5827k3439
12964B66911L6197K5678L0527N0963j3834R1456R4869m1282k8590n0331K9731
12953D92295L4799j6292K849q9414l3394M0277N3179O3492J2048o967p11K7250
$$ plain form
13037 95086 111151 65075 65329 85279 50009 65513 132097 167461 199899 206546 194428 213026
13025 213026 212640 199705 177094 175822 148091 109796 110144 105969 74371 20035 12705 103500 91138
13012 91138 49501 56739 103614 102758 93530 168463 189356 149808 170369 156777 186820 172639
13000 172639 161865 161497 177667 208790 259868 329386 352344 337550 357214 380221 458639 450418
12988 450418 388889 342948 368355 375286 367310 364122 354415 319727 242293 264361 277083 347274
12976 347274 387141 390337 363732 316587 245189 165122 250531 284983 260665 306177 290350 266911
12964 266911 303108 328786 359313 410276 396442 487898 582767 541485 512895 462564 492295
12953 492295 527094 510802 513651 424237 390843 431120 484299 547791 559839 552872 552161 579411
12941E79411n4997n7915k0483L6902M3030m6894J9323L9573L5945M6721o1561
12930E59055n8069r292k3141M8279N7459M7463M4128N9779k2644N9260P1907K2611
12918H56795K9777J8824j9376L6265R5128P4237J13866J09964J24104J21783J13872
12907A675239O6137J26022J23265J65727Q6751N1579J07530J08967R0549J57537
12897B759303J38057J26852J80503J83200J67233K45573K60899K65933K27822
12888D555375L05300M43473N06509N44870P09691Q30103J013527J191294J304243
12879A1404385J604226K099320K441056K795230L252475M030498M966314O123048
12871C8716552Q471063J2278963J8529700K9977781N0316913P4668067P2877066
$$ plain form
12941 579411 524414 466499 446016 482918 525948 479054 498377 537950 573895 620616 559055
12930 559055 500986 491694 468553 516832 574291 621754 665882 725661 703017 762277 834184 856795
12918 856795 886572 905396 886020 922285 1017413 1091650 1205516 1315480 1439584 1561367 1675239
12907 1675239 1741376 1867398 1990663 2156390 2243141 2294720 2402250 2511217 2601766 2759303
12897 2759303 2897360 3024212 3204715 3387915 3555148 3800721 4061620 4327553 4555375
12888 4555375 4860675 5304148 5810657 6355527 7065218 7895321 8908848 10100142 11404385
12879 11404385 13008611 15107931 17548987 20344217 23596692 27627190 32593504 38716552
12871 38716552 47187615 59466578 77996278 107974059 158290972 232959039 305836105
12864C05836105M1924986J9966376J3019207j3971277q9605808q9034435n3612142
12857A34523012l0776657j8922398j2695811r278601p084291n524622m428715
12850D5811917l584270k974903k673788k609953k196702j672226j355495j275231
12842B7469349j204292j138878r91055q64424q13708p99220q78997r64360r39420
12833A8874995r53929q75069q54526q42623o91144o12489n42751m81450n60199
12824A2460815m81766m81199m57395m32079l75404l31707k87655k95758k63610
12815I054242k09580k72351l66403k58118k25671k28200k02804j98511k24737
12806F867867k87328k66764k27999j66279j58643j99035j67726j27009r5848q7428
$$ plain form
12864 305836105 347761091 367727467 380746674 366775397 277169589 188135154 134523012
12857 134523012 103746355 84823957 72128146 62849545 55765254 50240632 45811917
12850 45811917 42227647 39252744 36578956 33969003 31772301 30100075 28744580 27469349
12842 27469349 26265057 25126179 24135124 23270700 22456992 21657772 20778775 19814415 18874995
12833 18874995 17921066 17045997 16191471 15348848 14657704 14045215 13502464 13021014 12460815
12824 12460815 11979049 11497850 11040455 10608376 10232972 9901265 9613610 9317852 9054242
12815 9054242 8844662 8572311 8205908 7947790 7722119 7493919 7291115 7092604 6867867
12806 6867867 6580539 6313775 6085776 5919497 5760854 5561819 5394093 5267084 5171236 5083808
12796E083808j24425j23901m9167m9386p6937j84813j74851q3346j05551j41075
12786C970356q7579n4817j29769j85939j35099j44377j23280j31689j05967j49082
12776B722758o4093M4482o194m7078p8241n1181o8238l3467m2725m6417m3247
12765B286359k7676N7892l8716j8460j25400j34608j29876r2482m3745j2518r7015
12754A623755k9395p5406j22750j15831m5839m1057p3116r2037k5032L888m1148
12743I66032n4960n4385n6541k0296J1895l7584o7457o66L0215J8400n0979k5462
12731F58212j6310k5771o173o0377p4630r810K9451K7866O01j4711m4866m5007
12719D18475R46J9804l040p7175l880M9392l1556o8930K7767L3286N5361j2224
$$ plain form
12796 5083808 4959383 4835482 4786315 4736929 4659992 4475179 4300328 4216982 4111431 3970356
12786 3970356 3882777 3827960 3698191 3512252 3377153 3232776 3109496 2977807 2871840 2722758
12776 2722758 2658665 2703147 2696953 2649875 2571634 2520453 2452215 2418748 2376023 2329606 2286359
12765 2286359 2258683 2316575 2277859 2259399 2133999 1999391 1869515 1777033 1733288 1720770 1623755
12754 1623755 1594360 1518954 1396204 1280373 1234534 1193477 1120361 1028324 1003292 1007180 966032
12743 966032 911072 856687 800146 779850 791745 754161 686704 686038 716253 734653 683674 658212
12731 658212 641902 616131 609958 549581 474951 465141 494592 522458 523059 508348 463482 418475
12719 418475 419421 439225 436185 359010 355130 404522 372966 304036 331803 365089 420450 408226
12707D08226j7107J6443M253J1493K3444K5629o877n5898l287l3537n5716l6711
12695B80355L807M7360j426L2060N51j8708M4269j9505K129j4134M3192K9401
12683D29351k9409L1506l6748k2327K5353O643L3296K7812k2595p7098o7383r921
12671B88480m45j1138J6002M456L6160k847n9017o2146k1824O1624K6277M8284
12659C23866M2562M5148j4819m6934k1461M51l6587q3369m877J5751P2222L1359
12647C23312o3852L2282j0869k3434n847M9507n6232o5145L7244K7753L7193K6901
12635C08813j3203k8014k5935Q0725M4903n0394j8869m467K0056o3106o6165K933
12623A87277L0426K9801j1401k9407K5283l9839J2536K4767m029P17k7253j5657
$$ plain form
12707 408226 391119 407562 411815 423308 446752 472381 465504 409606 406319 372782 317066 280355
12695 280355 284162 331522 330096 362156 362707 343999 388268 368763 370892 356758 399950 429351
12683 429351 399942 431448 394700 372373 397726 404369 437665 465477 442882 365784 298401 288480
12671 288480 288035 276897 292899 297355 333515 330668 271651 209505 187681 249305 275582 323866
12659 323866 366428 411576 396757 349823 328362 328813 292226 208857 203980 219731 291953 323312
12647 323312 259460 291742 280873 257439 251592 301099 244867 179722 216966 244719 281912 308813
12635 308813 295610 267596 241661 322386 367289 316895 298026 293559 313615 250509 184344 187277
12623 187277 217703 247504 236103 206696 231979 192140 204676 229443 225414 226131 198878 183221
12611A83221P872n0850k7555N6978P3874r636L6269R645k4816n8845l7394M9081
12599B07844R1317M4463p0926k0580R722n482p4456p1877n8218R9006K7865k6787
12587A51891r066q3948n0290O8337l7498k7624L7317L0010l030P940K6374L1312
12575A41725M1977K5731l5272n7216k8481k1692j706j506L2535J1070P754K9575
12563A44494j9237j253q555j8257L803k3897J0663n606M2623K7737k4430k8690
12551I9395q0853p161O1314J21313j8306l1997k3063k8862J552k9829l7586r735
12539A6182N3466O5385O0408k9171k1676L524j04784j1777K0093q17J6631M6606
12527A14070L2977n3097k6596j482M840q05k1810l5876M7823K3010J3964l2574
$$ plain form
12611 183221 191093 140243 112688 169666 243540 233904 270173 279818 255002 196157 158763 207844
12599 207844 299161 343624 272698 252118 261840 256358 181902 110025 51807 150813 178678 151891
12587 151891 142825 58877 8587 76924 39426 11802 49119 79129 76099 84039 110413 141725
12575 141725 183702 209433 174161 116945 88464 66772 65066 63560 96095 107165 114919 144494
12563 144494 125257 124004 115449 97192 100995 77098 87761 82155 124778 152515 128085 99395
12551 99395 18542 11381 72695 194008 175702 143705 120642 91780 93332 63503 25917 16182
12539 16182 69648 135033 195441 166270 144594 148118 43334 31557 51650 50833 67464 114070
12527 114070 147047 93950 67354 65872 70712 69907 48097 12221 60044 83054 97018 64444
12515F4444l3316N4293k4810o464J1272J7809O6258n589k574j8986n1121p3791
12503b575J9208M4510k6959K0782l7429k1611M9790M2044l8852J0971j0493M2157
12491I1543l2714j3741l0712K8493N9477K4450l5629n0167l0895j3688M7189N510
12479D9116L63J2327R506M635m9146m1501j6986N6594K9739K229m4685N778M222
12466B2191j4219j552J3137N823M4010k0401j0288k7127K5392K0712j0280n0977
12454c579l971J4525J5557l2180k0446K5619N5460M230m814o244J8405n2366l8917
12441b8721l9208N5516L2515l4618L5941J3930m5297N709O8363M9080k5248m4158
12429D3804j7907R086N4030M274o0276m1365K2660R7007j6957K9468L3409n0287
$$ plain form
12515 64444 31128 85421 60611 54147 65419 83228 149486 143897 141323 122337 71216 -2575
12503 -2575 16633 61143 34184 54966 17537 -4074 45716 87760 48908 59879 49386 91543
12491 91543 58829 45088 14376 42869 102346 126796 91167 41000 10105 -3583 43606 49116
12479 49116 49479 61806 71312 75947 26801 -14700 -31686 24908 54647 56876 12191 17969 22191
12466 22191 7972 6420 19557 25380 69390 48989 38701 11574 36966 57678 47398 -3579
12454 -3579 -7550 6975 22532 -9648 -30094 -4475 50985 55215 50401 44157 62562 10196 -28721
12441 -28721 -67929 -12413 20102 -14516 21425 35355 -9942 -4233 64130 113210 87962 43804
12429 43804 25897 34983 89013 93287 33011 -8354 14306 111313 94356 123824 157233 106946
12417A06946o8035n0382Q7838O8410k89k9273o269M4525L3193m4853o6578L7906
12405A13139N722k8717M2692P2876N7450J1587m426N5467J05803J90771K36485
12394H58849L73552L72073K70381J35068N0653j73143m62610m06712k85979j82948
12384E49184j01230j20058k3525J1922r4764l6475L6672Q683m9458r331L0297
12373B01917o2503q424j7929K3411P3587l3300k3300j5745l2508j4853P35j4289
12361G6799l8135l0945K5976j3244k7657J4718l666K6676L9204J1899K217P186
12349I1028M3774l2757l5892m3943K11M244j8227P7452Q6042j068p4019q1120
12337A5725K2411O8251k4707K6015k0736k5372j9273r523M4105j5117l6650r411
$$ plain form
12417 106946 38911 -11471 76367 144777 144488 115215 108946 153471 186664 141811 75233 113139
12405 113139 118861 90144 132836 205712 263162 274749 270323 325790 431593 622364 858849
12394 858849 1232401 1604474 1874855 2009923 2060576 1887433 1424823 1018111 732132 549184
12384 549184 447954 327896 304371 316293 221529 185054 221726 230409 180951 171620 201917
12373 201917 139414 130990 113061 136472 210059 176759 153459 137714 105206 90353 91088 76799
12361 76799 38664 7719 33695 20451 -7206 7512 3846 30522 69726 81625 83842 91028
12349 91028 134802 102045 66153 22210 22421 26665 8438 85890 171932 170864 96845 15725
12337 15725 38136 106387 81680 107695 86959 61587 42314 32791 76896 61779 25129 15718
12325A5718M087P2919p588j4345r578k0243J9401J382K9629M4473l715N879m3525
12312I4494o2341j5748L2710o853o051M1115o0097r040J1180K8088P1175M9868
12300A68500m7681j033J2695j0349m5251L945K0543k4232o166J2270n219k6258
12288E1764J1548M7067k7632n7504L1609o242L408K7654m6110k2393n9381J1688
12276c4524O3877m858K0436J1506J1346J6987k6749k8180m3800n5125M5437L2337
12264H690P748n0398L5408R64L6606M440j584L2549k8244o999m0033k7046r914
12251c7813L956j7572Q642k8536O8891k1258l2307M9711K0480J9322L1510l7478
12239B7548j8192q957l4808r216L5296N7657r622q695m721K1573o306P694L8387
$$ plain form
12325 15718 19805 92724 85136 70791 61213 40970 60371 61753 91382 135855 132140 138019 94494
12312 94494 32153 16405 49115 42262 36211 77326 17229 8189 19369 47457 118632 168500
12300 168500 120819 119786 132481 122132 76881 80826 101369 77137 70971 83241 78022 51764
12288 51764 63312 110379 82747 25243 56852 50610 54018 81672 35562 13169 -46212 -34524
12276 -34524 29353 24495 44931 56437 67783 84770 58021 29841 -13959 -69084 -23647 8690
12264 8690 16438 -33960 1448 2412 39018 43458 41874 74423 46179 39180 -853 -27899 -37813
12251 -37813 -33857 -51429 -42787 -71323 -2432 -23690 -55997 -6286 14194 33516 65026 27548
12239 27548 9356 399 -34409 -43625 -8329 49328 39706 31011 26290 47863 41557 49251 87638
12226H7638m3710o8037J8970J5760M3457o3966L2815J2023M521J3082l6627N5592
12214G1518L0033j3730m7061m2758M3075j3421N1886K5373N833N588p225m5190
12202F3921o602M0916o1277k4869n235k2137L7602K014l0928k4331Q1901P2768
12190A23743J3331k6876J3687j0542o689J7203q797r6164k3784l3649k4058R436
12178e3159L6532J2735L9947N754n54k2143L7880r745J3519L3251O614M4742o806
12165A38567m6783p5793j5565L4820j3492L0981r21m279K0374j6188j8445k0932
12153A2344k5000K8612O9571j8998L620k2808J2976J8704M836J0975j6215j5234
12141F3383N3933o082m5855K842m045l5132K0315p608o8539L5530q658L5217l2657
$$ plain form
12226 87638 43928 -24109 -5139 10621 54078 -9888 22927 34950 39471 52553 15926 71518
12214 71518 101551 87821 40760 -1998 41077 27656 79542 104915 110748 116336 109111 63921
12202 63921 57319 98235 36958 12089 6854 -15283 22319 24333 -6595 -30926 50975 123743
12190 123743 137074 110198 123885 113343 106654 123857 115060 18896 -4888 -38537 -62595 -53159
12178 -53159 -16627 -3892 36055 41809 41255 19112 56992 47247 60766 94017 100631 145373 138567
12165 138567 91784 15991 426 35246 21754 52735 51814 47535 67909 51721 33276 12344
12153 12344 -12656 15956 85527 66529 70149 47341 60317 79021 83857 94832 78617 63383
12141 63383 117316 111234 65379 68221 64176 29044 49359 41751 -26788 8742 84 35301 2644
12128B644K0503P2977j5528l8753K1734j2143m2270m7633R413K7090O456K6616
12116C1106n2759R712M3621K1861N390K3278m6025l701l004O1385K4346o0783
12104E4427o2523L5011J8286k8190j2291m965r117K2275L42r200r285J9453m0450
12091b6227K7215J4563L8543R243l2083n4441j2408o173M6805k7606m4969J3992
12079e3546L5562j514l0191J6012Q721J7621L5480j667k3586j9881k6270P9347
12067C6088J7819p2475k033K5135M321K7221K0959M1275n6227m591l1442j970
12055D080K1873j0335L4796J1861J0895j8254q8262k3108L7548j1935R870k8173
12043d9144j2373l9926m1344J26531N1905o352m0056k9766K1M6084P877L595M9742
$$ plain form
12128 2644 23147 96124 80596 41843 63577 51434 9164 -38469 -29056 -1966 4490 31106
12116 31106 -21653 -11941 31680 53541 58931 82209 36184 32483 29479 90864 115210 54427
12104 54427 -8096 26915 45201 17011 4720 -245 -9362 12913 13255 4055 -5230 14223 -26227
12091 -26227 988 15551 54094 63337 31254 -23187 -35595 -41768 5037 -22569 -67538 -53546
12079 -53546 -17984 -19498 -49689 -33677 -24956 -7335 28145 26478 2892 -16989 -43259 36088
12067 36088 53907 -18568 -20601 4534 8855 36076 57035 98310 42083 37492 6050 4080
12055 4080 25953 15618 50414 62275 73170 54916 -33346 -56454 -18906 -30841 -20971 -49144
12043 -49144 -61517 -101443 -142787 -16256 35649 29297 -10759 -40525 -40504 5580 13457 17052 66794
12030F6794J5215o962l3432L4894k2422R780m1690q9412l84J6895L3694J2772
12018d258k3929L1584L3162n899l5292o437k1964l2071j2363J7441M2242L6665
12006A8881p369l4703J0689j2383l3136o360L167J806Q4131n496J6306k4320K40
11993A1453J3204j0125n9307L0434Q85J8263j7127J4285j6366L8506K4388K9816
11981G8309J3245n1642p0183k3236K1860Q6600J7183J8701k0496n8088l8123j0224
11969c6094K4532l576Q630Q6729K5881q3078o8993O194N8325p126K2597J360O836
11956D2217j9243k0335m2043J7599L0040L3280k5017O1669L0949p2931J0089j4972
11944C1302j2886n555l1691k5523P7288P1373n991o8536o3926k2994J4182J7395
$$ plain form
12030 66794 82009 75047 41615 76509 54087 63867 22177 -67235 -67619 -50724 -17030 -4258
12018 -4258 -28187 3397 36559 30660 -4632 -11069 -33033 -65104 -77467 -60026 -17784 18881
12006 18881 11512 -23191 -12502 -24885 -58021 -64381 -61214 -59408 24723 19227 35533 11213 11453
11993 11453 24657 14532 -44775 -14341 -13456 4807 -12320 1965 -14401 24105 48493 78309
11981 78309 91554 39912 -30271 -53507 -31647 54953 72136 90837 70341 12253 -25870 -36094
11969 -36094 -11562 -15138 -6508 80221 106102 23024 -45969 -39775 18550 11424 34021 35381 42217
11956 42217 22974 2639 -39404 -21805 8235 41515 16498 78167 109116 36185 46274 31302
11944 31302 18416 12861 -18830 -44353 32935 104308 98317 29781 -34145 -57139 -42957 -25562
11932b5562M5235N4445K0683m2052o5281L8731J5932M153m8477K5568K3822k4221
11920B2976l8610l1504O8039P685l3357L079K9675j6035N1953o41m0441p017K9938
11907D5740j8982n3758j9645n381L9870Q222J5829K5957j111j6984L7721p9070
11895b1592n3545J8222N6279O0738K8340k3402J5035l756p3099k3378m1880k713
11883f4751J4072Q907j9550n650O3725M3346N0766k5980q0173j0450Q544J8076
11871H82M8391m653l3780L9116m472o0391M0645J6681l8298L056k2601k3855N5665
11858A6386Q6561k9485r4152l7242K3143K8399l3487K305M5366O8969j4091k4835
11846C7837M155j2483j9533K3356M0977j4487q4994o9405L4938K5419J2603l1154
$$ plain form
11932 -25562 19673 74118 94801 52749 -12532 26199 42131 46284 -2193 23375 47197 22976
11920 22976 -15634 -47138 20901 28586 -4771 -1692 27983 11948 63901 63260 22819 15802 45740
11907 45740 26758 -27000 -46645 -52026 -12156 -3934 11895 37852 36741 19757 57478 -21592
11895 -21592 -75137 -56915 -636 60102 88442 65040 80075 76319 3220 -20158 -62038 -64751
11883 -64751 -50679 -41772 -61322 -66972 -3247 40099 90865 64885 -15288 -25738 -17194 882
11871 882 49273 44620 10840 49956 45484 -14907 25738 42419 4121 7177 -15424 -39279 16386
11858 16386 102947 73462 -20690 -57932 -34789 -6390 -39877 -37572 7794 76763 62672 37837
11846 37837 41992 29509 9976 33332 74309 59822 -25172 -94577 -59639 -34220 -21617 -52771
11834e2771R718j528l2723K2422O1281N46k8161j5261o344j6411K5449O1314J1159
11821C8690m908n5786K5339J8068r8158J8351M0971L8289l4886k5770j0534O577
11809d3757M6837K6879J8302N112l0994o1190M4803K7544K1684k3719K4866n045
11797E1322N603L435K0749L8895o9030r1545M2754K8533j458n8834k6396L1082
11785b4890R894r194k579K5864j1707N5544L0219R92k0773r048J7095l7428l3816
11772i827k9755O1405L031r363n819L0622l589J2466Q10n6978j3878K4103L7478
11759D0706L7339Q4923L3043j22196j27912o6839R913N1172Q912j4747J9343P2231
11747B5888K0541p3894l6986L7122M235m7590O4639N0221l4828q112J662N8888
$$ plain form
11834 -52771 -43053 -44581 -77304 -54882 6399 6945 -21216 -36477 -42821 -59232 -33783 27531 38690
11821 38690 33782 -22004 3335 21403 -76755 -58404 -17433 20856 -14030 -39800 -50334 -43757
11809 -43757 3080 29959 48261 53373 22379 -38811 5992 33536 55220 31501 56367 51322
11797 51322 56925 60360 81109 120004 50974 -40571 2183 30716 29258 -29576 -55972 -24890
11785 -24890 -14996 -24190 -26769 -905 -12612 42932 73151 74143 53370 44322 61417 23989 -9827
11772 -9827 -39582 21823 24854 15491 9672 40294 36705 49171 49981 -6997 -20875 3228 40706
11759 40706 78045 162968 196011 73815 -54097 -120936 -111023 -59851 -50939 -65686 -46343 25888
11747 25888 46429 -27465 -64451 -27329 -23094 -70684 -6045 44176 9348 1236 2898 61786
11735F1786J0081l5109k4678O2630K786r6171M1913L8773l5824J0330J5783j5846
11723C6454L7427j347J3735n2032j8678k4003o3382R902j8131K9703P2503N6881
11711G9032l2867l1364q6717m4332N3350P7457L7223J6380q1832n6870L0053L1680
11699h807k6491j0134j069M5766m1808m7312J5051Q2274N5961M0937n2824r0141
11687c8597o1543l1171M3765J28033M5501l1109o0423o9056O832J7763K1435K3044
11675e526M8096K5940L406o0427k8692m7221q4394L2057J022K7828L4107Q2879
11663B9075J8024J0718n7911j22360L0771J22132K8428R316m6811O482k1063l8307
11651c1506k9443n002L5529J6364p3185r8947M0067J11032P4094p4017l7758O4843
$$ plain form
11735 61786 71867 36758 12080 74710 77496 -18675 23238 62011 26187 36517 52300 36454
11723 36454 73881 72534 86269 34237 15559 -8444 -71826 -61924 -80055 -50352 22151 79032
11711 79032 46165 14801 -71916 -116248 -62898 14559 51782 68162 -13670 -70540 -40487 -8807
11699 -8807 -35298 -45432 -46501 -735 -42543 -89855 -74804 7470 63431 104368 51544 -38597
11687 -38597 -100140 -131311 -87546 40487 85988 54879 -5544 -74600 -67768 -50005 -28570 -5526
11675 -5526 42570 68510 71916 11489 -17203 -64424 -148818 -116761 -115739 -87911 -53804 29075
11663 29075 47099 57817 -94 -122454 -91683 30449 58877 68193 21382 27864 6801 -31506
11651 -31506 -60949 -65951 -30422 -14058 -87243 -186190 -146123 -35091 39003 -35014 -72772 -7929
11639g929N1348q543K2638r401j7076J8784j6961J7696j469r667j5769p2887p981
11626e7217n2928m4177K7056L3854L7255M0776J9698m504m7823N491K0952O622
11614a4945J2979M578k4841k8334K7527J1351K6261l311o4704K8332R3441l245
11602F5089j09733k4586K274k7321r256R936J3408N7836N5472R282O0146K9884
11590A32431r7094m3851M4396M9170j2042n9220p822m88K588m6111k5697J136
11578f2604m3510k0092m411n9843k5290K0066N3155J6296l5588L4351J17847J6063
11566F440J5870k0949r08M1197m1842j3571q0364j3412K9645k7093q2773j2366
11554b00126O2379L1248J0239N8476Q1559M4863o3859m5032j9698L4320N3113
$$ plain form
11639 -7929 43419 34876 57514 48113 31037 49821 32860 50556 49087 39420 23651 -49236 -57217
11626 -57217 -110145 -154322 -127266 -93412 -56157 -15381 4317 -187 -48010 -42519 -21567 -14945
11614 -14945 -1966 2612 -22229 -50563 -23036 -11685 14576 11265 -53439 -25107 68334 65089
11602 65089 -44644 -69230 -66956 -94277 -103533 -93597 -80189 -22353 33119 42401 102547 132431
11590 132431 35337 -8514 35882 85052 73010 13790 5968 5480 8068 -38043 -63740 -62604
11578 -62604 -106114 -126206 -130617 -190460 -215750 -195684 -142529 -126233 -161821 -127470 -9623 6440
11566 6440 22310 1361 453 41650 -192 -13763 -94127 -107539 -77894 -104987 -187760 -200126
11554 -200126 -137747 -106499 -96260 -37784 43775 88638 24779 -20253 -39951 -5631 47482
11543D7482Q975k1254l8850l9254l3935O6892M0450k8282o3835j5111K7096J6388
11531c3238L156O9674Q259l0799k9476J790l78K2462M2645K0507l7285m7598J0212
11518f9J8055k1931j4403p440j7073N8648K3171k0464j6809R593m3878L4691L6476
11505C8567n3244p4742M7281r382q986P182O1681q981k4639l1439M3000J0701
11493c001p7640K0389L0532L2766K6557K8355k6079o244O70K861M234n002k0283
11480H115P781K6152M9415M066k1041l8056K6919l0243m599j3575O563N615l1949
11467d837N0626j7917p8006j5435l0167O5931j0885k7200J8857O9536N3220o7767
11455E956J5414K5095j0200p2217J7327K2996N3284P285m9678k7096J677m2267
$$ plain form
11543 47482 56457 35203 -3647 -42901 -76836 -9944 30506 2224 -61611 -76722 -49626 -33238
11531 -33238 -30082 39592 47851 17052 -12424 -10634 -11012 11450 54095 74602 37317 -10281 -69
11518 -69 17986 -3945 -18348 -25788 -42861 15787 38958 18494 1685 11278 -32600 2091 38567
11505 38567 -14677 -89419 -42138 -51520 -60506 -53324 8357 -624 -25263 -56702 -13702 -3001
11493 -3001 -80641 -60252 -29720 3046 29603 57958 31879 25635 26305 29166 33400 28398 8115
11480 8115 15896 42048 91463 95529 74488 36432 63351 33108 28509 14934 21497 27112 -4837
11467 -4837 45789 27872 -50134 -65569 -95736 -29805 -40690 -67890 -49033 20503 73723 5956
11455 5956 21370 46465 36265 -35952 -18625 4371 57655 64940 15262 -11834 -10157 -52424
11443e2424n4888J2078N5711l0591j1217K9911k4532K2022P6670l804n4200l5096
11431g0360L4542O2462M1758m9402k4273M7111O363m1109M3452M0580l8541J0444
11419F3027K5836m1486j02039J4390K9591l7913m639L6247P6693m9118m3511l853
11407c6775K1774Q5285m193K7491j9176n3461k6007K6081J8467L3463J6457J7937
11395A07343J9087m4466o1370J6791O3352m790O331J289l0278l8860j1998L5253
11383E7684K6841p0496m4419K4116J0708j9361K9080M2343L0984m2180M3218k3863
11371F4655m41m4213K7594K5278l4823m2705K2763J9030L8681l4323p6663j5697
11359e0864n1427J5535O1815P6646J2597J6270j7097q404K8384m4771q1870K5171
$$ plain form
11443 -52424 -107312 -95234 -39523 -70114 -81331 -51420 -75952 -53930 22740 18936 -35264 -70360
11431 -70360 -35818 26644 68402 19000 -5273 41838 48201 7092 50544 91124 52583 63027
11419 63027 88863 47377 -54662 -40272 -10681 -48594 -53233 -16986 59707 10589 -32922 -36775
11407 -36775 -15001 70284 66091 93582 74406 20945 -5062 21019 39486 72949 89406 107343
11395 107343 126430 81964 20594 37385 100737 95947 102278 103567 73289 34429 22431 57684
11383 57684 84525 14029 -30390 -6274 4434 -14927 14153 56496 87480 45300 88518 64655
11371 64655 64214 20001 47595 72873 38050 -4655 18108 37138 75819 41496 -35167 -50864
11359 -50864 -102291 -86756 -24941 51705 64302 80572 63475 55071 83455 38684 -43186 -18015
11347a8015J3785k3378N784P3945L6578q0679k2969n0171J177j3456R654P0559
11335B814L8271j455o472k3783o637J2873O5010Q163l1118l1543l1399P2768j7517
11322D9975j0876J5907n4588o5148K5690j1294m606l210j6775j1346N4804K4624
11310f843q859p522J4385l8943O3969O1808k2568q1617n636P1236L4373k7879
11298D5904k1984K6955Q5240k640J4341M9101l7201M5220L1182j9429o6008m7413
11286A03268n6459M8072L6329k9459m5583K9945k9906K9362J0969j1264l490k6573
11274E5211o216n4053p6400L0701O8200P2977L147k6667l2896m215M3390j325
11262G1854n2873j3593j9420L990l1579p583J1641M1568O7184L3017O975o0596
$$ plain form
11347 -18015 -4230 -27608 -21824 52121 88699 8020 -14949 -65120 -63943 -77399 -67745 2814
11335 2814 41085 39630 33158 9375 2738 15611 80621 88784 57666 26123 -5276 67492 49975
11322 49975 39099 55006 418 -64730 -39040 -50334 -54940 -58150 -74925 -86271 -31467 -6843
11310 -6843 -15702 -23224 -8839 -47782 16187 77995 55427 -26190 -31826 39410 73783 45904
11298 45904 23920 50875 136115 133475 147816 196917 159716 204936 236118 216689 150681 103268
11286 103268 46809 94881 131210 101751 56168 86113 56207 85569 96538 85274 81784 55211
11274 55211 48995 -5058 -81458 -50757 17443 90420 93567 66900 34004 29789 73179 71854
11262 71854 18981 5388 -14032 -10042 -41621 -49204 -37563 4005 71189 104206 111181 50585
11250E0585n4730m7678K40L1845K146P0402L389l5870J7568L3954k7061K8849
11238G3639K4993l4988p1973k9212j8448L1381R981P478L6771O4345K2525o2012
11226E4480o1234j5978K9763J1823M2089J3029n7503m7773l900j5458L9153L3053
11214B1544M958o500M3225k023Q615O178L9306O1862J6393q509K6514j2890J0918
11201B09591Q3134Q1945J97348K47573L79838M17184K85829J44305P8976o1047
11191B064676m04571m46779k68867k56181j37740o2243o3906p8168r0681l3447
11181B22093l9721K4061L8510N8344K2299M2587k384K2596J3004p7218q4186m8297
11169A91688n614k6685l8317j3747m0804m8460M1294J686j2810j8394j6848K1024
$$ plain form
11250 50585 -4145 -51823 -51583 -19738 -17592 52810 56199 20329 37897 71851 44790 73639
11238 73639 98632 63644 -8329 -37541 -55989 -24608 -14627 -7149 29622 93967 116492 54480
11226 54480 -6754 -22732 7031 18854 60943 73972 16469 -31304 -35204 -50662 -11509 21544
11214 21544 26502 20002 63227 61204 69819 75997 115303 177165 193558 185049 211563 198673 209591
11201 209591 292725 374670 572018 819591 1199429 1616613 1902442 2046747 2125723 2064676
11191 2064676 1660105 1213326 944459 688278 550538 488295 424389 346221 255540 222093
11181 222093 182372 206433 244943 303287 325586 368173 365789 388385 401389 324171 239985 191688
11169 191688 186074 159389 121072 107325 66521 18061 59355 61041 48231 29837 12989 34013
11157C4013R0604J6847L2506q421K2626j5948q258K6317l3573l5193M4806j4061
11145A52265q0776m8493j536K377L3696m9436p0867j0223K5750J6904L8732J2911
11133B1304j4102n0653J281J3606N5425K3346L2351l3517q5647m6098J3224K1370
11121d8110O8452N5877k3508m1863r679k7666L3948Q0629M1268l9598n2360k1897
11109A5493j8164J6251J1700O767J7358M4087M3258o5734j05318j7087n646J2424
11097d4611J5335Q764k5541J1032k241k7931l5267P320L3217L3724Q734O859K0539
11084I933J6937k3848k4014J4898l0988n7253K0609M7098J8541M3958p809l1329
11072c267l5946L5025J713m8528J3508J6675j8805J789k9860J2578K9964j9718
$$ plain form
11157 34013 124617 141464 173970 165549 188175 172227 163969 190286 156713 121520 166326 152265
11145 152265 71489 22996 21460 23837 57533 8097 -62770 -72993 -47243 -30339 8393 21304
11133 21304 7202 -43451 -42170 -28564 26861 50207 82558 49041 -36606 -82704 -69480 -48110
11121 -48110 20342 76219 52711 10848 1169 -26497 7451 88080 129348 89750 37390 15493
11109 15493 -2671 13580 25280 32047 49405 93492 136750 71016 -34302 -51389 -57035 -44611
11097 -44611 -29276 -20512 -46053 -35021 -37262 -65193 -100460 -93140 -59923 -26199 -17465 -10606 9933
11084 9933 26870 3022 -20992 -6094 -37082 -94335 -73726 -26628 -8087 35871 28062 -3267
11072 -3267 -39213 -4188 -2475 -51003 -37495 -20820 -39625 -37836 -67696 -55118 -25154 -44872
11060d4872n0250q2884k1333M556K7378L5314P4058R3511J7277m4927j4763k189
11048i124L2093j7483k678K5164J1047k1605l3199j6374J5065l5737j0684j1124
11036g4639k6779L955j990l210N1257O470N4274J1779O5783k7085n7161J6072
11024A8726K7066J7094K6782o655j5361P67k6291j8690J7899J5892J7287l1189
11012D3327j4134J6410r181L4786M5733K1441K1792o2358j9115O266j6663q5317
11000a7013k5098L3768Q9000O9523k698k7644l5478N4473J01k7487l5757L8369
10988A14059k215J9641O6756k3943n4736j7891J0092m052q7114K83P764K940m2956
10975a1372O562j1361p952J656P9795P1286j7191o2277L4962L172o7275j9893
$$ plain form
11060 -44872 -95122 -178006 -199339 -194783 -167405 -132091 -58033 35478 52755 7828 -6935 -9124
11048 -9124 22969 5486 2808 27972 39019 17414 -15785 -32159 -17094 -52831 -63515 -74639
11036 -74639 -101418 -97463 -99453 -102663 -51406 -44936 9338 21117 86900 59815 2654 18726
11024 18726 45792 62886 89668 83013 67652 68419 42128 23438 41337 57229 74516 43327
11012 43327 29193 45603 36422 71208 116941 138382 160174 97816 78701 84967 68304 -17013
11000 -17013 -42111 -8343 80657 150180 147482 119838 84360 138833 138934 111447 75690 114059
10988 114059 111844 131485 198241 174298 119562 101671 111763 107711 20597 20880 28644 31584 -11372
10975 -11372 -4810 -16171 -24123 -22467 57328 128614 111423 49146 84108 87280 20005 112
10963A12k41M1692k6461J2364Q72j2217j8465K1862j7438Q729k287J06784P7582
10950A92888j9585k5444k4761N436l6512l4702J6541R139q5187n1896L9801M2898
10938B8616L6848k8345N928N7650k1589m2391L6828Q612o7034L0533j9523P765
10926C3898l6666L9922K1481K6999M2637k9508m0132J028K878Q1166P0107n6064
10914A57746k6736L2291l7121k3121K7741m70j0618j9892j9937j3936O0275J17503
10902B43725N4297n5465p3138l1000k852j2073r11K2866K0341m0684k9262m314
10890I1530l5435J477R015J14k0446L5690M9838L8152K8083j3238j7751L8691
10878B05720j4771O6953J00K5421K7231K1065j4394l5307K7542L4180J6990n2628
$$ plain form
10963 112 -129 41563 15102 27466 28338 16121 -2344 19518 2080 10809 8522 115306 192888
10950 192888 173303 147859 123098 128534 92022 57320 73861 83000 -2187 -54083 -14282 28616
10938 28616 65464 37119 43047 100697 79108 36717 73545 82157 15123 45656 26133 33898
10926 33898 -2768 37154 58635 85634 128271 98763 58631 59659 62537 143703 213810 157746
10914 157746 131010 163301 126180 103059 130800 130330 119712 99820 79883 65947 126222 243725
10902 243725 298022 242557 169419 138419 135567 123494 122583 145449 165790 125106 95844 91530
10890 91530 56095 57572 66587 66701 46255 81945 131783 169935 198018 184780 167029 205720
10878 205720 190949 257902 258002 283423 310654 331719 317325 282018 309560 343740 360730 308102
10866C08102m9972j5968k8104m4907k7317N480L2505K6366K6078k0789L6301L8743
10854B86518O2056O952l0788k9658j9609R878J9844R308L8543M5082O639J98K9251
10841D34214k9185l1760j0745l2492k66J5975M0026K3712j9656O6869Q3539N428
10829E45659P003o1734o6417o048l6743J9105M7200J928p5972Q805Q389j9312
10817C71863j2817J5133P5936J7270L5582P3749J2308k5521J7748M6525R3722
10806G21498R463k971J8951k9853o4987J8412R2446O4311L4802J66332J13307
10795A141711J21565J42661O1537L9282O4293J24494J56380M5837J6663R7045
10785B011468N9087J42794J96812K17906K00031J53122J66352J15206J21921J87530
$$ plain form
10866 308102 258130 242162 214058 169151 141834 147314 179819 206185 232263 211474 247775 286518
10854 286518 348574 355526 324738 295080 275471 285349 305193 314501 353044 398126 404765 404963 434214
10841 434214 405029 373269 362524 330032 329766 345741 385767 409479 389823 456692 540231 545659
10829 545659 552662 490928 424511 418463 381720 400825 448025 449953 373981 382786 391175 371863
10817 371863 359046 374179 450115 467385 502967 576716 589024 563503 581251 627776 721498
10806 721498 730961 727990 746941 717088 652101 670513 762959 827270 862072 1028404 1141711
10795 1141711 1263276 1405937 1467474 1506756 1571049 1695543 1851923 1897760 1914423 2011468
10785 2011468 2070555 2213349 2410161 2628067 2828098 2981220 3147572 3262778 3384699 3572229
10775C572229K50904K66557L80419M95760N04572M96111O70017Q29645J115120
10766H581334J387069J600297J734184J783046K081871K572128K978425L392776
10758B6111130M593147O403720Q816372J2566365J9178754L2095009N5690414
10751A65454911Q1480490P3695493L9143735J8314886J5164964k3537080j02918975
10744B66798424r0240732n0938979k8513729j7590104j1886104q783551o870893
10737E1974332n250456l700990k849287k617982k332498j943910j806764j905769
10729B9566676j555932j210484j169429j043722q40129q08678q64723q80045r55817
10720B0237717q84011r15342r20031q26296p56476q44654p67336n93248n21657
$$ plain form
10775 3572229 3823133 4089690 4470109 4965869 5470441 5966552 6636569 7466214 8581334
10766 8581334 9968403 11568700 13302884 15085930 17167801 19739929 22718354 26111130
10758 26111130 30704277 37107997 45924369 58490734 77669488 109764497 165454911
10751 165454911 246935401 320630894 359774629 378089515 393254479 369717399 266798424
10744 266798424 176557692 125618713 97104984 79514880 67628776 58845225 51974332
10737 51974332 46723876 43022886 40173599 37555617 35223119 33279209 31472445 29566676
10729 29566676 28010744 26800260 25630831 24587109 23746980 22938302 22073579 21193534 20237717
10720 20237717 19353706 18438364 17518333 16692037 15935561 15090907 14323571 13730323 13208666
10711A3208666m59044m79143m80121n34013m12631l43839m16919l45109k71418
10702I466429k54942j89436k08174k93339l02067k41205k35511k89010l18403
10693G134342k29771k16518j93068j77298j92890k10781j66789j05303j27241
10684E514683j67476j39787j44373p7246j00379j54458j10065q8061p4794j70989
10674D287055j93902r8296q2873j68960j77891j39706j29646p3387q1086p6789
10664C064519j10407j53181r3443o2228m4606j4037m2535J124N5467k1079l6877
10653B542717n8987m0142k9863K8648k2824q9827j17726j05453j05558l4622m4593
10642A921770q1642p5806j06428q6547j00942r5537m3624m1988q2995o5499p1351
$$ plain form
10711 13208666 12749622 12270479 11790358 11256345 10843714 10499875 10082956 9737847 9466429
10702 9466429 9211487 9022051 8813877 8520538 8218471 7977266 7741755 7452745 7134342
10693 7134342 6904571 6688053 6494985 6317687 6124797 5914016 5747227 5641924 5514683
10684 5514683 5347207 5207420 5063047 4985801 4885422 4730964 4620899 4532838 4458044 4287055
10674 4287055 4093153 3994857 3911984 3743024 3565133 3425427 3295781 3222394 3141308 3064519
10664 3064519 2954112 2800931 2707488 2645260 2600654 2586617 2544082 2545206 2600673 2579594 2542717
10653 2542717 2483730 2443588 2413725 2442373 2419549 2329722 2211996 2106543 2000985 1966363 1921770
10642 1921770 1840128 1764322 1657894 1571347 1470405 1374868 1331244 1289256 1206261 1140762 1069411
10631A069411p5088o3686o4697k6801J7300n2717k5023m8571K8422k2496o0846
10620F75208o8183L0902K4277k6069M4520N595o8541l6218n7691n6831j7327L1363
10608D81005L4430r355j2270j8569n2446l2568K9136l493L7088R483l5758k1296
10596D05387m3166k9455M8398j7340o1191o5744K4011K2377l5883K1539k3830
10585B45103L101R1860Q705J9811j3931j1303J5434J4142l1407M30j1108Q9517
10573D20354J0308l5674r7811l1902J9104O0500M6115j7273N4808L3643o634o7059
10561C88479q2512p9926k8388L0225L7819K1561M2874l0241M747k4306k2706n2082
10549B05544N9042L3154M9638m2859m7475j4008R6289L8746l9465n027j7136j1505
$$ plain form
10631 1069411 994323 930637 865940 839139 856439 803722 778699 730128 758550 736054 675208
10620 675208 607025 637927 662204 636135 680655 686250 617709 581491 523800 466969 449642 481005
10608 481005 515435 506080 493810 475241 422795 390227 419363 415870 452958 462441 426683 405387
10596 405387 362221 332766 381164 363824 302633 236889 260900 283277 247394 268933 245103
10585 245103 248204 340064 348769 368580 354649 343346 358780 372922 341515 341945 330837 420354
10573 420354 430662 394988 297177 265275 284379 344879 390994 373721 428529 462172 455538 388479
10561 388479 305967 226041 197653 227878 265697 287258 330132 299891 304638 280332 257626 205544
10549 205544 264586 297740 347378 304519 257044 243036 339325 378071 338606 333579 316443 304938
10537C04938k2541j3792J639K3627J7477R945l7292j9652P2208r923j22604k0093
10525A83937N4265k5432q560M7267k0974j3005L0295J4552j3415O856j7058J5578
10513B54306j8191j5195J9314p4460r222K6723k2569k1331K0156j5225L0757p222
10501A67841n732M946m5937l6506N9275K0158M1607k6461K6487L2374N2293K608
10489B92953l0907m8720m5720n0162L1783l2846r57K1517M8781p1914l5898l8846
10477C9064J2680K6501j8807m3651J813J9793J2291n083q553l6181L0094N8808
10465H8769K3669N5287m561n2303l1017n683M404J0451J0712o015P062k5568K5903
10452A01110j0427m9964q537R2583M6145l8280j8868L3404O3017m19O27k7793
$$ plain form
10537 304938 282397 268605 270244 293871 311348 321293 284001 264349 336557 326634 204030 183937
10525 183937 238202 212770 204210 251477 230503 217498 247793 262345 248930 255786 238728 254306
10513 254306 236115 220920 240234 165774 156552 183275 160706 139375 159531 144306 175063 167841
10501 167841 162109 167055 121118 84612 143887 164045 205652 179191 205678 238052 290345 292953
10489 292953 262046 213326 167606 117444 149227 116381 115424 136941 185722 113808 77910 39064
10477 39064 51744 78245 59438 15787 17600 37393 49684 44601 36048 -133 29961 88769
10465 88769 112438 167725 163164 110861 79844 74161 78565 89016 99728 93713 100775 75207 101110
10452 101110 90683 40719 32182 124765 170910 132630 113762 147166 210183 209764 210391 182598
10440A82598j0093J2234m0511k922k5449m0456l0537q143N6339K1885J2573m2593
10428H4925j4531O3390k0248l8482L2403M4717m0230J0186l1429j15010l8262
10417f2571N2328J32432N1770K939k2962k1638o1704J5077M3799M2560j2745l1283
10405A28002l3971K0409j6988L3182Q342j8280M3284K336k5260K786K8566k1787
10393A50621L0823P6606k5186o0936L4865o443o5394n9781j251O627k8469K5935
10381G8017n5744n2002J1920M2827Q8884j2240m3589m8493j8034m806L0712l2086
10369a4634k6437N2787L7984n775j1462R205J9289N1579O3353p5991q4725P806
10357B2979J5581P3317Q740m1581L958J4478r554J7572R368k4894o1551l082J5802
$$ plain form
10440 182598 172505 184739 144228 141306 115857 75401 44864 36721 93060 114945 127518 84925
10428 84925 70394 133784 113536 75054 107457 152174 111944 122130 90701 -24309 -62571
10417 -62571 -10243 122189 173959 176898 153936 132298 70594 85671 129470 172030 159285 128002
10405 128002 94031 114440 97452 130634 138976 120696 163980 166316 141056 143842 172408 150621
10393 150621 181444 258050 232864 171928 206793 200350 134956 75175 73924 80551 52082 78017
10381 78017 22273 -29729 -17809 25018 113902 101662 58073 9580 -8454 -13260 17452 -14634
10369 -14634 -41071 11716 49700 43925 32463 41668 60957 112536 175889 99898 15173 22979
10357 22979 38560 111877 120617 79036 82994 97472 87918 105490 114858 89964 28413 25331 41133
10344D1133K0691k220m6686k6016N0836j5374j6642K9021J1064N8723J0574N748
10332A20852K1549l8632M8099m7142k4054o8293l2031N1995l71k2557J7594k1161
10320E848j0665K1418M7088o022L8251m2373l6170P4091M4960j4234J2350L1511
10308A66053J9653r343L8013P3500K6127M9570M4374J53875K23168M01193M03414
10297A589597K70638J31391K2314l6963l78878m49092l76946k16501J3010q3492
10287D85078p2535j7562n2692k0242k1374k7686j8932o6426J9505M1486m9093
10276A99527l1976J9908J7488l9629o385p270k4520j9327k9941K3850j1122M2354
10264A32957J2337l7868p5355K6507k748k7103k2716J9218N2316k6221m4257J4040
$$ plain form
10344 41133 61824 59604 12918 -13098 37738 22364 5722 34743 45807 104530 115104 120852
10332 120852 142401 103769 151868 104726 80672 12379 -19652 32343 31972 9415 27009 5848
10320 5848 -4817 16601 63689 57667 95918 53545 17375 91466 136426 122192 134542 166053
10308 166053 185706 176363 214376 287876 314003 363573 407947 561822 784990 1186183 1589597
10297 1589597 1860235 1991626 2013940 1976977 1598099 1149007 772061 555560 568570 485078
10287 485078 412543 394981 342289 322047 300673 272987 254055 187629 207134 248620 199527
10276 199527 167551 187459 204947 165318 158933 151663 127143 107816 77875 101725 90603 132957
10264 132957 145294 107426 32071 58578 55830 28727 6011 25229 77545 51324 7067 21107
10252B1107K6466O2382K2342L2617r763M8521J1656l8609l6573j2326j5853k6612
10240H5355O4754M7457l8959j8127r156L6680J8855k4871o5152o6277o0638L3309
10228C230J5935J7181M1212j1812K1991M23n9499p2925k8107L1509N0152L9792
10216D9082O062O812J4918L2384J4434m7261k937o785n1204n3562K7804M7888
10204C7635K1487L017r923O5419Q086j7600p3509k308K550j6925K0956l0756L021
10191A1150m7181n0017m3277J7537P9762R1714m9742j1938M4548K8122K0436K45
10179I1359l6674r087m5234L137l1735m726L8881M8822l0476l9761J7473K3435
10167B5414l8567m4539j9147N1273N6026l853K7967L2674L666n3340k3166K5285
$$ plain form
10252 21107 47573 109955 132297 164914 155151 203672 215328 176719 140146 127820 111967 85355
10240 85355 150109 197566 158607 140480 131324 168004 186859 161988 96836 30559 -30079 3230
10228 3230 19165 36346 77558 65746 87737 88160 28661 -44264 -72371 -40862 9290 49082
10216 49082 55144 61956 76874 109258 123692 76431 73494 66709 15505 -38057 -10253 37635
10204 37635 59122 62139 52216 117635 125721 108121 34612 32304 34854 17929 38885 8129 11150
10191 11150 -36031 -86048 -129325 -111788 -32026 59688 9946 -1992 42556 70678 91114 91359
10179 91359 54685 45598 364 3501 -28234 -32960 5921 54743 24267 -15494 1979 25414
10167 25414 -13153 -57692 -76839 -25566 30460 26607 54574 87248 90914 37574 14408 39693
10155C9693J08115L6964m3260n6990n1855r9131j5015N7414N8463j2403p3866
10144e1871P763K4338M1370r708l1994N1030j9757k0170P5697M1257k1817o9745
10132A6393o891k6742q379Q214P2096j6218k6499m1790K693R0010N7654N2053
10120A72594j09o1439n9621O152K1707m5240J9157q630l5624O931n266j2372M5779
10107D4019k418m6441K4639j1533J7196J7494l3765j9418j2177J032K6694L1335
10095C6657m2607L7K2565L8051L3657j3969l8691N9460Q3610k7490r3832n4542
10083B906l9383M8903R2671k1191O584J3780n095n5622m6836N2945J5333j4481
10071E0514k2977J7455L4184J7164K7814O5457L5339M9917K0996j9553o128M1219
$$ plain form
10155 39693 147808 184772 141512 84522 32667 -66464 -81479 -24065 34398 21995 -51871
10144 -51871 -44108 -19770 21600 11892 -20102 30928 11171 -8999 66698 107955 86138 16393
10132 16393 9502 -17240 -25619 -17405 54691 38473 11974 -29816 -27123 62887 120541 172594
10120 172594 172485 111046 51425 57577 79284 34044 53201 44571 8947 15878 10612 -1760 44019
10107 44019 41601 -4840 19799 8266 25462 42956 9191 -10227 -22404 -21372 5322 36657
10095 36657 -5950 -5913 16652 54703 88360 74391 35700 95160 178770 151280 57448 2906
10083 2906 -36477 12426 105097 83906 90490 104270 99175 43553 -3283 49662 64995 50514
10071 50514 27537 44992 79176 96340 124154 189611 224950 274867 295863 276310 270182 311401
10059C11401j3864K1943N9673J27451J35932J29605K33053N09284R42117J242343
10049C698938Q20022L08191J68965K80918q70148j640854r85686m57984k41443
10040A080919j76175j49774r1893k6714p5824l2600n1603k6375j4478p3882J9835
10029C81436L774k9579j4766J6759k0930K765J1093n7777p429J1558j083l4384
10017B61437l7790m2907Q478M9860K4705l3715l5992m6824k3212n182j9780O1644
10005A60722l2497R378M7631k165j4039p048j0991n5814q088N3520K32k9671l9673
9992G1497K6501j96p332k1493K0303n2642K6559o27O095J6000O551P4702K8588
9979A94506J8316l1639j7677l9195m3289K3882j6788j2522J4361M3497J819l4555
$$ plain form
10059 311401 297537 319480 379153 506604 642536 772141 1005194 1514478 2456595 3698938
10049 3698938 4518960 4827151 4996116 5277034 4406886 2766032 1780346 1322362 1080919
10040 1080919 904744 754970 663077 636363 560539 527939 476336 449961 435483 361601 381436
10029 381436 385210 355631 340865 357624 336694 339459 350552 292775 285346 296904 295821 261437
10017 261437 223647 180740 189218 239078 263783 230068 194076 147252 124040 118858 99078 160722
10005 160722 128225 137603 185234 183069 169030 161982 150991 95177 87089 140609 140841 111170 71497
9992 71497 97998 97802 90470 68977 89280 36638 63197 62570 68665 84665 91216 165918 194506
9979 194506 212822 181183 163506 124311 81022 104904 88116 75594 89955 133452 135271 100716
9967A00716m487N3767l0852n0145r16L5921o458J4150k9610k2361O8509L0715
9955A58949L7162Q69n3033n9598l2398L3755N815l2952l1322j0960K7477M0268
9943H4032K4440k0642m3363J0108L7638k1525o4778p039q619L8716M241K2002
9931E5211O537R532J4193m2541o1774K2836K8985L9894q867k7638M0671K6100
9919A03139J6530P981p4979o4997L7566M858j5961L1696O7842J8236l6829l8122
9907E6960j8203o7433k2473r192N8456R5633j5131p0515J5593M1755K0811J2681
9895I8942K0967j2324j3469Q288J8565l6254m0762m1074L639R9680M7383j00329
9883E3252j9053p821Q941M0065L5010l3479l6135k4332K8793M741m9461m9354
$$ plain form
9967 100716 96229 149996 119144 68999 68083 104004 97546 111696 82086 59725 128234 158949
9955 158949 196111 196980 143947 84349 51951 85706 91521 58569 27247 16287 43764 84032
9943 84032 108472 87830 44467 54575 92213 70688 5910 -1129 -9748 28968 33209 55211
9931 55211 61748 71280 85473 42932 -18842 3994 32979 72873 64006 36368 77039 103139
9919 103139 119669 127650 52671 -12326 25240 30098 14137 45833 113675 131911 95082 56960
9907 56960 38757 -28676 -51149 -60341 -1885 93748 78617 8102 23695 65450 86261 98942
9895 98942 119909 107585 94116 102404 120969 84715 43953 2879 6518 106198 153581 53252
9883 53252 34199 26378 35319 75384 110394 76915 40780 16448 45241 49982 521 -48833
9871d8833L7949L4877L725K6514k7195m0664L7582J3949P1794L7472r9114o4859
9859a6803N4664Q960L3551j1357j5734M610P661L224L4514M42j0347k7935n7940
9846G510o1295R172J1645Q587M5426Q865J9926m2607k2286p6754L1925O5863k4663
9833a8686N540J7512L9665m762k5768N5696L775n9820l4115J2800J1682L0797
9821C4316k4985k8016j1979l480J992J5607o680K1797j8965j5828K7132K5044
9809A5955J0649O909L4547J9434o587L7082O416J4153n0002l6614K7352o428J49
9796G3015j3217K85j7513o628r674p1580l7854p753J3946k241n4608M9954L6577
9783d7291M0369N2844k8534l8868j0017l8550L7997R9252M2301l6431o0180J8608
$$ plain form
9871 -48833 -10884 23993 27718 54232 27037 -13627 23955 37904 109698 147170 48056 -16803
9859 -16803 37861 46821 80372 69015 53281 57891 65552 68776 103290 103732 93385 65450 7510
9846 7510 -53785 -44613 -32968 -24381 21045 29910 49836 7229 -15057 -91811 -59886 5977 -18686
9833 -18686 -13146 4366 44031 39269 13501 69197 72972 13152 -20963 -8163 3519 34316
9821 34316 9331 -18685 -30664 -34144 -32152 -16545 -23225 -1428 -20393 -36221 -9089 15955
9809 15955 26604 33513 68060 87494 80907 117989 124405 138558 88556 51942 79294 72866 73015
9796 73015 59798 60083 42570 35942 26268 -45312 -83166 -90919 -76973 -79214 -133822 -83868 -47291
9783 -47291 -6922 45922 17388 -21480 -31497 -70047 -32050 67202 109503 73072 12892 31500
9771C1500L6052o0989k0578M1583J7340m0318k5907L9627N805j6471q493K5322
9759B4473K2826j2189l1508j4707k4074j8726J3816L0733j767Q557M6702K2620
9747F6756k3459q6749m5279O1555L3949L1845R963l7888k8257k0311N4654P4734
9735I1513K3974m9108q356L3538o1566m1519J5014m3170J7021O6394N327k4674
9723B4388J863l0617j89J4837J2147R079J2062Q864k0099O721M487j1141K1544
9710E3946k1756q0715j8463l16K9451J9309J6099N5634L326q77m4883k5351J546
9697a3050k7975J5764o14n648P4156M0797r5403l0921L3547P4456J0739m5193
9685C0655m0683k6613K6669q088N2847l0904L4636L9953K7549R193O538j2993
$$ plain form
9771 31500 67552 6563 -14015 27568 44908 4590 -21317 18310 24115 7644 -849 24473
9759 24473 47299 35110 3602 -11105 -35179 -53905 -40089 -9356 -11123 -2566 44136 66756
9747 66756 43297 -43452 -88731 -27176 6773 38618 48581 10693 -17564 -37875 16779 91513
9735 91513 115487 66379 58023 91561 29995 -11524 3490 -39680 -22659 43735 49062 24388
9723 24388 26251 -4366 -4555 10282 22429 31508 43570 52434 32335 39056 43543 32402 53946
9710 53946 32190 -48525 -66988 -67304 -37853 -18544 -2445 53189 56515 55638 10755 -14596 -13050
9697 -13050 -41025 -25261 -25875 -31523 42633 83430 -11973 -42894 -9347 65109 75848 30655
9685 30655 -10028 -36641 -9972 -18060 34787 3883 38519 78472 106021 115214 121752 108759
9673A08759k7368j7357J7261j2159J255J2528K2358j0979n7795K0263k9044j7409
9661A0313j2091k586k225M9085j1563o3721m1323P254K1877L1928k7561k6924
9649f7537j8707l6071L6382L7831j310j4222L8996R5346j163J3507l695m4282
9637C5075o6124J8053O3183M0182j1113m4808n8262K329j1068j4229K9327K5814
9625H359N6716j6044j13227j2677Q0414N2774J7206M597n3535m983l4195j1876
9613b6471Q848m799M6821o078m665N3745j8842n9315L7067N9007k2191n87J2902
9600G5442k9032O1087J2847m4212l3719l2101l5524m4842m6125L762J21094J2845
9588B1522m2410L0504j7881n3419p309k2104M673o187L5627K6913j1298L2599
$$ plain form
9673 108759 81391 64034 81295 69136 70391 82919 105277 94298 36503 56766 27722 10313
9661 10313 -1778 -4364 -6589 42496 30933 -32788 -74111 -66857 -44980 -13052 -40613 -67537
9649 -67537 -86244 -122315 -85933 -48102 -49412 -63634 -24638 70708 69545 83052 79357 35075
9637 35075 -31049 -12996 50187 90369 79256 34448 -23814 -21485 -32553 -46782 -17455 8359
9625 8359 65075 49031 -64196 -76873 3541 56315 73521 78118 24583 19600 -14595 -26471
9613 -26471 -17623 -22422 24399 18321 13656 67401 48559 -10756 26311 85318 63127 62540 75442
9600 75442 46410 107497 120344 76132 42413 10312 -25212 -70054 -116179 -112417 8677 21522
9588 21522 -20888 9616 -8265 -61684 -68993 -91097 -86424 -92611 -56984 -30071 -41369 -8770
9576h770J6888l844k4567j6354K7533O7180l0838m9874j310M040m855k9992J5930
9563c8833Q758J5047P1559l3651p451j3159J3434L103J502K42N6251k6340L6018
9550H6480O7o1401l8159J569L9393K4066J1796j296L780j6541m9440K026J5284
9537A7624n31L3734K8068L3766L1106m0335m5208j7454k7256R910L4014m448o8163
9524a5173n5724J1384O1760K6065n0513o5148n12M7666r121k1311J6284K8193
9512b6150M0179K6739K3737q936n2666l2408p9753L9489K4089M7188m7618j8854
9500f4964N1120O66m2874l108K4721k857L4343O3615l3809K0517J4467K0856k772
9487G9921p7730m0769J8666L3352L2891L4776l626o7106p8948K4106M0994j5408
$$ plain form
9576 -8770 8118 4274 -20293 -36647 -9114 58066 27228 -22646 -23956 -19916 -24771 -54763 -38833
9563 -38833 -30075 -15028 56531 22880 15429 2270 15704 18807 20309 20551 76802 50462 86480
9550 86480 86547 25146 -13013 -11444 27949 52015 63811 62515 66295 49754 314 2340 17624
9537 17624 17093 50827 78895 112661 143767 103432 58224 40770 13514 23424 57438 52990 -15173
9524 -15173 -70897 -59513 2247 28312 -22201 -87349 -87861 -40195 -49316 -70627 -54343 -26150
9512 -26150 14029 40768 64505 55569 2903 -29505 -109258 -69769 -45680 1508 -46110 -64964
9500 -64964 -13844 -13178 -56052 -59160 -34439 -37296 -2953 60662 26853 47370 61837 82693 79921
9487 79921 2191 -38578 -19912 13440 46331 81107 77481 10375 -68573 -44467 -3473 -18881
9475a8881Q651O0816l9529j2965K4596j1928m7925q903N8113L0603J2223o6868
9463a1997j2207P221Q516J7455j257J8839l740m5991L2476K7149p4867m9774L6166
9450e2011N6574R168k9157n4985O722N9069K8781k6787j5619K5040j7584l158
9438a3947N550o596K6311J9200L7108l436q123K191J78n9333p9298K682P6914
9425e99K5082k3695p2295M2298k2713N910K8803L5758K7506J5863m3172p5394
9413e6648j47l1399O7257P2287J2590L669n6543j3497j0767Q874r455q161m5342
9400f7282m0819K7285J9054n3553m0763K9902M1198K7302L8730m0992L5510k124
9388b6552k8747N5905l643l2224l403r5673K7220J00237Q96L0742M058q0812o561
$$ plain form
9475 -18881 -10230 50586 11057 -1908 22688 10760 -37165 -46068 12045 42648 54871 -11997
9463 -11997 -24204 -16983 -8467 8988 7731 26570 22830 -23161 9315 36464 -38403 -88177 -52011
9450 -52011 4563 13731 -15426 -70411 -63689 -4620 24161 -2626 -18245 6795 -10789 -13947
9438 -13947 -8397 -14993 11318 30518 67626 64190 56067 58258 58436 -897 -80195 -77513 -599
9425 -599 24483 788 -71507 -29209 -51922 -46012 -17209 18549 46055 61918 18746 -56648
9413 -56648 -56795 -88194 -20937 51350 63940 67609 11066 -2431 -13198 -4324 -13779 -21940 -67282
9400 -67282 -108101 -80816 -61762 -115315 -156078 -126176 -84978 -57676 -18946 -59938 -24428 -26552
9388 -26552 -55299 606 -3037 -35261 -38664 -134337 -107117 -6880 -5984 24758 28816 -51996 -58557
9375e8557K2750q200K8420L0684m6840n2341l3605L3430q79O3261L8172O3421
9363G9716k1831m2151m7040n7465P637j1126j221N7836K8663K0728N978J3475
9351C3199j6779J365k0369j3620p433J3796J3631m5730k63Q329j1342N7387l830
9338H341q970M153J9245O302J4973J29777n786r7810l0769Q696K5741k4293o9168
9325a9568l2354J1465j0962m6978M647q998M5149N9820k0038k0609J3228k7075
9313e2273k8503J7112M3403o778k5085j6893K6872K3441p731o0114m3375J8604
9301a11320P8412N5896l6018l5950O5269Q600j5695j9158J7351J4034L9097k2940
9289C7578K025k3271k5290J7061J4542M6757Q5976K8209m299r9208j0438l1395
$$ plain form
9375 -58557 -35807 -44007 -15587 15097 -31743 -84084 -117689 -84259 -85138 -21877 16295 79716
9363 79716 57885 15734 -31306 -88771 -81134 -92260 -93481 -35645 -6982 13746 19724 33199
9351 33199 16420 17785 -2584 -16204 -23637 -9841 3790 -41940 -42203 -33874 -45216 12171 8341
9338 8341 -629 3524 22769 29071 44044 173821 168035 70225 39456 48152 73893 49600 -19568
9325 -19568 -51922 -40457 -51419 -98397 -93750 -102748 -57599 2221 -17817 -38426 -25198 -52273
9313 -52273 -80776 -63664 -20261 -27039 -52124 -69017 -42145 -18704 -26435 -86549 -129924 -111320
9301 -111320 -32908 22988 -13030 -48980 16289 24889 9194 -9964 7387 21421 60518 37578
9289 37578 39603 16332 -8958 8103 22645 69402 155378 183587 179288 80080 69642 38247
9277C8247l4207m9528k9718m8387l5284J2159l4030L8041L8714j932l4189j4574
9265a54688J192M474P1398O0394m8093j8034M9134K1346l8207L7814J31m3680
9253e6819M4266J8508O03K6108J8149J6433j4765n804l1413o2715N3552l1152
9241b5049n9358K7222Q0898L8382k32K0662r042l5471P926L0290L3863j7554N918
9228I8455J4251j6722m9089p4934n788L1637J19233q12K5060J1289j9186l9009
9216I4385q327O4352l1099o6165K3757M4698m9034j3450q561o1636j5028M5778
9204A9670J7623p697n1635m9525M2637P2880P6546j2877p3642K9231j7524l6746
9192H941M5084L4901N642p6567J1887L2716L5825M3978l1261n6483K281q617K2244
$$ plain form
9277 38247 4040 -45488 -75206 -123593 -158877 -146718 -180748 -142707 -103993 -105925 -140114 -154688
9265 -154688 -153496 -149022 -77624 -17230 -65323 -83357 -34223 -12877 -51084 -13270 -13139 -56819
9253 -56819 -12553 5955 6558 32666 50815 67248 52483 46679 15266 -47449 6103 -25049
9241 -25049 -84407 -57185 23713 62095 61863 82525 73483 38012 45938 76228 110091 92537 98455
9228 98455 112706 95984 46895 -28039 -33827 -2190 117043 116231 141291 152580 133394 94385
9216 94385 86058 150410 119311 53146 76903 121601 72567 59117 50556 -11080 -26108 19670
9204 19670 37293 29596 -22039 -71564 -28927 43953 120499 107622 33980 63211 45687 8941
9192 8941 54025 88926 94568 18001 29888 62604 98429 142407 111146 54663 56944 48327 70571
9179G0571J2843L082L6228j0120Q9771N960J3051K9528k0330M8551J36453l683
9167D11905q8372o2151R863K3630R0046J08494J0305k6186m9076J2547P5782N8788
9155E75575O682J5230N5451N0714K5827R6573J41722J37504J19459J77016J60781
9144A562534J96973K55313L04144L06980L78170N74547O83872R18645J365714
9135F546892J935860K748145M178348O296450Q182775P312213M542192K331109
9127D4073984P30708l422635q959012q845787o003841l780274k547353j722487
9119I523303j208777j007456q84597o16816m54082m02918l42756l13447k97547
9110C994907j35787j03510j58584j20521q0999j33631j52511j78248j86571j47823
$$ plain form
9179 70571 83414 86496 122724 112604 202375 208335 221386 250914 230584 279135 415588 411905
9167 411905 323533 261382 271245 294875 384921 493415 503720 477534 428458 441005 516787 575575
9155 575575 582257 597487 652938 703652 729479 826052 967774 1105278 1224737 1401753 1562534
9144 1562534 1759507 2014820 2318964 2625944 3004114 3578661 4262533 5181178 6546892
9135 6546892 8482752 11230897 15409245 21705695 29888470 37200683 41742875 44073984
9127 44073984 44804692 41382057 32423045 23577258 17573417 13793143 11245790 9523303
9119 9523303 8314526 7307070 6422473 5805657 5351575 4948657 4605901 4292454 3994907
9110 3994907 3859120 3755610 3597026 3476505 3395506 3261875 3109364 2931116 2744545 2596722
9100B596722j24375j42069p3102q0784q7473r3740p9650p5916l3466o1455j14825
9089A629867n8479r9022o1486l0573n6632j6569l2151k1977k3567o7828k8179
9078A133404J8903o5792j9062l7968l7770q4473o1269P177k6683M0175n3497n0550
9066G62595k62o7584m8263j5722k6358n2101M4206m781j6591o5607k6354K9808
9054E12986L8773J6627j01740m3469k0173O02J5780N9212m0906m5708n0985N8877
9042C99876j6497o6308j3624o999N3001J8745R65o3047l0615m3383R270K846n91
9029B43639J4824k7243O454M8933L3124P202m2347n9045n7373K5314N1191Q783
9017B53456o5167k6941j0771n9703o0088l5102r664N2198P3881k2707r266M3786
$$ plain form
9100 2596722 2472347 2330278 2257176 2176392 2088919 1995179 1915529 1839613 1806147 1744692 1629867
9089 1629867 1571388 1472366 1410880 1380307 1323675 1307106 1274955 1252978 1229411 1161583 1133404
9078 1133404 1152307 1086515 1067453 1029485 991715 907242 845973 853150 826467 866642 813145 762595
9066 762595 762333 694749 646486 630764 604406 552305 596511 591730 575139 509532 483178 512986
9054 512986 551759 568386 466646 423177 403004 403606 419386 478598 437692 391984 340999 399876
9042 399876 383379 317071 303447 296448 349449 368194 369159 306112 275497 232114 241384 244230 243639
9029 243639 258463 231220 237674 286607 319731 326933 284586 225541 168168 193482 244673 253456
9017 253456 188289 161348 150577 90874 30786 -4316 -13980 38218 112099 89392 80126 123912
9005A23912k3593J265K6490M6390k7975l4380q3342M3836P012k5692M1628j8083
8993G7468n8008L2413K6631J3082K5558j3741m8801m096N7589L8047K5052n1912
8981A19282k3249Q629Q2823l323r3713o0053K9920L7283j1406Q467j5063k325
8969G7272p465N804m5869m3190k6643j757K4893J9809p650j8127J06520J1530
8957I5127n698l1751n3117M019J5231L6003K0541p9210j0311M4508p775K4112
8945E1679j5986l6087j0634J9873R818O1835k3660n1244l4258J3873M2937L3932
8933F2078P0513J1298L0412q5835o5736j9242O5992J6759k0921K0759j0973l8148
8921C6956j5186J3473J9301k0119J226l690J3592L3850r049n5338p6733J3286
$$ plain form
9005 123912 100319 101584 128074 174464 146489 112109 28767 72603 79615 53923 95551 77468
8993 77468 19460 51873 78504 91586 117144 103403 54602 50506 108095 146142 171194 119282
8981 119282 96033 104662 187485 184162 90449 30396 60316 97599 86193 94660 79597 77272
8969 77272 69807 75611 29742 -13448 -40091 -41848 -16955 2854 -4796 -22923 83597 95127
8957 95127 89429 57678 4561 8580 23811 59814 80355 1145 -9166 35342 27567 51679
8945 51679 35693 -394 -11028 8845 18663 80498 56838 5594 -28664 -14791 28146 62078
8933 62078 132591 143889 174301 88466 22730 3488 69480 86239 65318 86077 75104 36956
8921 36956 21770 35243 54544 34425 35651 31961 45553 79403 70354 15016 -61717 -48431
8909d8431L8198M2556K0808L9983M1059l386l8655j8438k5262m2864L6817O7182
8897A09567l4198r686N0429j0200k2986k2598J409m2231j378R082L5645O6996
8885A29851m1817m9736l9107P6336j1530o8611L0464L9236O0607j3181o1977q993
8873D1542Q001m448l0109m5054j9565o5860j4969R8912N1077K3149M9849l145
8861H9380m0070L4322q784k9299j4168J0433J2601l3796m8550J0297M5763J3635
8849D1764n987P036k268K9064M6350n4248q3396R623J2871K3226J8241N1298m5142
8836D8432l6829k8185o189N8752m072j4816K6728j4929j1568K1183J1429L0373
8824H0309J2387l7887K6674M3838j1538K1479K0615p2283p2776o2428q2412j5246
$$ plain form
8909 -48431 -10233 32323 53131 93114 134173 130787 92132 73694 48432 5568 42385 109567
8897 109567 75369 65683 116112 105912 82926 60328 61737 19506 18128 27210 62855 129851
8885 129851 88034 38298 -809 75527 63997 -4614 25850 65086 125693 112512 50535 41542
8873 41542 49543 45095 14986 -30068 -49633 -115493 -130462 -31550 19527 42676 92525 89380
8861 89380 49310 83632 74848 45549 31381 41814 54415 20619 -27931 -17634 28129 41764
8849 41764 35777 42813 40545 69609 115959 61711 -21685 -12062 809 24035 42276 93574 48432
8836 48432 11603 -16582 -22771 35981 31909 17093 43821 28892 17324 38507 49936 80309
8824 80309 92696 54809 81483 125321 113783 135262 155877 83594 10818 -51610 -134022 -149268
8812a49268J14424K6435j18N3980M721n3157L1115R32J6593L4m3758J5454j6261
8799A126J0363L4594J4702M0646n9841k3087o547M9312K7799j7083j4410k0512
8787C7062j2685L591j3514M860l9745m15m384L5902L653j0563K2137O9701M4011
8774A39611J4527l7632k6406P364k5419l3215k9463m77K3499o006J0655M0537
8762G7575k4475m9393L7256N0242m1139k115N6375n5119l8774M1078J5161l9777
8750B6895k8056k9257J4425N7308J2951J7766M4585l3756o6308m7716l1720O8565
8738E682J0912k9997j7707m5494m2737M713R2770J10766N946J2863p7398q303
8726B2016m563L3320K0259O016l7439n9785m6630J0279R7970k5987N684j228k7987
$$ plain form
8812 -149268 -34844 -8409 -8527 45453 50174 -2983 28132 29064 45657 45691 1933 17387 1126
8799 1126 11489 46083 60785 101431 41590 18503 11956 61268 89067 71984 57574 37062
8787 37062 24377 27968 14454 19314 -20431 -20846 -25230 10672 14325 3762 25899 95600 139611
8774 139611 154138 116506 90100 97464 72045 38830 9367 8890 32389 26383 37038 77575
8762 77575 53100 3707 40963 91205 50066 47951 104326 49207 10433 51511 66672 26895
8750 26895 -1161 -30418 -15993 41315 54266 72032 116617 82861 16553 -31163 -62883 5682
8738 5682 16594 -13403 -31110 -76604 -119341 -114628 -21858 88908 94854 107717 30319 22016
8726 22016 17453 50773 71032 77048 39609 -20176 -66806 -56527 41443 15456 21140 19912 -8075
8713h075J5870N8492L7173J9594K4866k8501l19k549r262l683K22j7854J4329
8700A00303o2646m6776K1021P1529K1025k2987m9754O3975P5214n0362o7176K1221
8688G4587J9991q4028r4364o8767P111P5339J052j14R3541J6295P542p1349q3062
8675a06226P0162K2217K8839Q9586L1033q244o6948L275k4505m3224P848j7340
8663a3527K0210l563J4546k668K4027Q339N673l1668p4360o6239k0403j1713J5893
8650a35453Q07j7680O1319Q9623L8698k3138l9359j9507O3908O1855o778j0127
8638F4168n3897j181N3935k9823R772P149J495n3054k4314L3501M5292j4166o9653
8625c0776j5558J8502K8151m8540l0467M1397r962M7853J5201J5364o2168j1203
$$ plain form
8713 -8075 7795 66287 103460 123054 147920 119419 119100 116551 107289 103606 103828 85974 100303
8700 100303 37657 -9119 11902 83431 104456 81469 31715 95690 170904 120542 53366 74587
8688 74587 94578 10550 -83814 -152581 -145470 -70131 -69079 -69193 24348 40643 48185 -23164 -106226
8675 -106226 -36064 -13847 14992 104578 135611 127367 60419 63694 39189 -4035 3813 -13527
8663 -13527 6683 3120 17666 14998 39025 47364 53037 21369 -52991 -119230 -139633 -151346 -135453
8650 -135453 -134646 -152326 -91007 -1384 37314 14176 -25183 -44690 19218 81073 74295 64168
8638 64168 10271 9090 63025 33202 42974 50123 51618 -1436 -25750 7751 53043 38877 -30776
8625 -30776 -46334 -27832 319 -48221 -78688 -37291 -47253 600 15801 31165 -31003 -42206
8613d2206R6q380j4520m551J370j2274J6778L1584O6463L2010L0439m1678m0141
8600A4990j0681k3864L350J2479P323L1961J5374K9865K6975m0731m7005J0357
8588C0393Q814N3101p816k2845J93P3448M4165M034k8810o8952m8226k2298l4807
8575a9606M826K4117L4524O668j5741m5644k8322P308K9207J3626n3823M5128
8563B268N5522l590l9542R786k3249j3388K2307P201j8740k0838m4318K6474M4199
8550D092L4715N7587J0009J3108k6867j1479l887r065l5992j0245l1580N076k4572
8537b9100k1069k3386k6604J2756L1211L3845j2985j1936p625k8168J90j7491
8525a00362P3344l2150O630n789n600M1960J5470O0347L2625J6670p6779q0661
$$ plain form
8613 -42206 -42110 -50490 -65010 -69561 -68191 -80465 -63687 -32103 34360 66370 96809 55131 14990
8600 14990 4309 -19555 -16205 -3726 3597 35558 50932 80797 107772 67041 20036 30393
8588 30393 39207 92308 84492 61647 61840 135288 179453 183487 154677 85725 37499 15201 -19606
8575 -19606 -14780 9337 43861 50529 34788 -10856 -39178 -31870 -2663 10963 -42860 2268
8563 2268 57790 54200 14658 24444 1195 -12193 10114 17315 -1425 -22263 -66581 -40107 4092
8550 4092 38807 96394 106403 119511 92644 81165 77278 68213 32221 21976 -9604 -4528 -29100
8537 -29100 -50169 -73555 -100159 -87403 -56192 -22347 -35332 -47268 -54893 -83061 -82871 -100362
8525 -100362 -27018 -59168 -52538 -58327 -63927 -21967 -6497 53850 86475 103145 26366 -54295
8513e4295p195k045l0170M0541m942M863K3932L6869O4142m2452j2388L113J255
8500B1228j3766M1741j58o013R6477M1395l3916L7000l6776p8846o2228p821J2963
8487A1280k2731M6440L6207k5182J0906Q529l6580L1887J2951n0483J1513J7254
8475E1991m9240M1921M9097l708k1083k2213l1223l6251k9371P194M4011L6097
8463C7222J5911L5995l8719k8351r298L1240k2635m5708j6020J0401j6536j7719
8451f4217m170K2694K1404P126P3209J1455p3076n7151M6362N8903l0126p6216
8439f3803L0921L3851Q755L9017N605p6072o7881K9774P34k2427J8429M8808j8297
8426c2586j0912J0400N8488n1813k8400K9860J5063K1159k2531o7754K9089O2787
$$ plain form
8513 -54295 -61490 -63535 -93705 -53164 -58106 -53243 -29311 7558 71700 29248 16860 19973 21228
8500 21228 7462 49203 49045 43032 139509 180904 146988 183988 147212 68366 6138 -1683 11280
8487 11280 -11451 34989 71196 46014 56920 65449 28869 60756 73707 23224 34737 51991
8475 51991 2751 44672 93769 90061 68978 46765 15542 -20709 -50080 -42886 1125 37222
8463 37222 53133 89128 50409 22058 12760 44000 21365 -24343 -40363 -29962 -46498 -64217
8451 -64217 -68387 -45693 -24289 -17163 56046 67501 -5575 -62726 -16364 42539 12413 -63803
8439 -63803 -32882 969 9724 48741 54346 -21726 -89607 -59833 -59099 -81526 -63097 -14289 -32586
8426 -32586 -43498 -33098 25390 -26423 -54823 -24963 -9900 11259 -11272 -79026 -49937 12850
8414A2850P2969O1454j8859q8108p7728k7816M0283M0026J1626O2448n664j3265
8402G0216j0389L1811l0698m7257K2108k7576N385J3541m3333O88N3697k6111
8390A2082j7876j0317k5255J9354p4231J8045K4928Q0787N6945q330K7323L691
8378A07146n4898l3680K6022L930M1381j831m1915m4823k0110J8160m2986n7425
8366a01029k3123K1052K2786L8304J5323j7573J1925Q624O1358O6236l4659o6554
8354B670m0111K8719K7225J8938j7234L2138N176j6572M760J9191m8567q2109
8342f5776j1767M6688K2863n9520Q17O8863k50k3282K4617J4361J7136J18J5626
8329E0494l6176o5483N7125k569k9162L0904m968p2550P470J7131K654l9047N2256
$$ plain form
8414 12850 85819 147273 128414 40306 -37422 -65238 -24955 15071 26697 89145 83481 70216
8402 70216 59827 91638 60940 13683 35791 8215 13600 27141 -16192 -15504 38193 12082
8390 12082 -5794 -16111 -41366 -22012 -96243 -78198 -53270 27517 84462 76132 103455 107146
8378 107146 52248 18568 44590 48520 89901 88070 46155 1332 -18778 -618 -43604 -101029
8366 -101029 -124152 -103100 -80314 -42010 -26687 -44260 -32335 -23711 37647 103883 69224 2670
8354 2670 -37441 -8722 18503 37441 20207 52345 57521 40949 45709 64900 16333 -65776
8342 -65776 -77543 -30855 -7992 -67512 -66695 2168 1918 -21364 3253 17614 34750 34868 50494
8329 50494 14318 -51165 5960 3391 -25771 5133 165 -72385 -64915 -47784 -45130 -84177 -31921
8316c1921L0002k6430l5607M7163L8665Q5917k2455k5330j9223k3544O948k6176
8304a991l1641M0783O533L6472J4256o6049J1057K1515N411K584k9102k5399Q3919
8291F8348K2084m7040r3927K6642L6515M663j4065K9204k2930N311p3250k0716
8279g9161J4332K8133j2289j2736l0575N7720p597q280J4070l169M4477K249M0831
8266D8005K0488J4292k6454p7209o2994L261O2981L644j8107K2077L2788n565
8254A7207j4193n1881j1542M7154J6334k5588M9470Q6696R444r9802m6185Q03
8242b2083l4343j0085m680O035K8225m3595O7925J3748o2590J1524M6525L6209
8230C2815J7024Q919k6276K1232k1676l0240M0935k0281k6989j1295k4050j7659
$$ plain form
8316 -31921 -1919 -28349 -63956 -16793 21872 107789 85334 60004 40781 17237 24185 -1991
8304 -1991 -33632 7151 13684 50156 64412 -1637 9420 30935 36346 38930 9828 -15571 68348
8291 68348 90432 43392 -50535 -23893 12622 17285 3220 32424 9494 14805 -58445 -79161
8279 -79161 -64829 -36696 -48985 -61721 -92296 -34576 -42173 -50453 -36383 -39552 4925 7174 48005
8266 48005 68493 82785 56331 -20878 -83872 -80611 -17630 -13986 -32093 -10016 22772 17207
8254 17207 3014 -48867 -60409 -13255 3079 -22509 26961 113657 123101 23299 -22886 -22083
8242 -22083 -56426 -66511 -71191 -65156 -36931 -80526 -12601 1147 -61443 -49919 -3394 32815
8230 32815 49839 58758 32482 53714 32038 1798 42733 22452 -4537 -15832 -39882 -57541
8218e7541R96j9869K8957L7719m780P135o5931l9796m7750N244Q5490P2639k4708
8205b2195l2954j1641J1415L4514M246K2394O0635K6450j3852j6353j16149o6595
8193a20085J1097P0576P8371J0755k1294q209K8961K01j7797O751M0824r8005
8181a7854K3513M84K4771L0713o5909o9240L3784p976j2228J7100Q3040L4343
8169G4541n4786m9558K3832M8754k4640L9737M3791j9852l3200k5581n8445l8600
8157g4007j0509L0629O308l1547M2018N4635M9484J1105p7938j3832j242M0773
8145B5877l798j575O4676j5988l0915o4362m1388M0731N0482p338k2987M2078
8133C5493N0626k9261j611m359o5094l6301J315Q4933L3790M4275l1098o8796
$$ plain form
8218 -57541 -56545 -76414 -47457 -9738 -14518 -7383 -73314 -113110 -160860 -155616 -70126 2513 -22195
8205 -22195 -55149 -66790 -55375 -20861 -16615 5779 66414 92864 79012 62659 -53490 -120085
8193 -120085 -108988 -38412 39959 50714 29420 21211 50172 50373 32576 39327 80151 -17854
8181 -17854 5659 6143 30914 61627 -4282 -73522 -39738 -47714 -59942 -42842 40198 74541
8169 74541 19755 -29803 -5971 42783 18143 57880 101671 81819 48619 23038 -35407 -74007
8157 -74007 -84516 -53887 -47579 -79126 -37108 17527 67011 78116 178 -13654 -14896 25877
8145 25877 22079 20504 85180 69192 38277 -26085 -67473 -26742 23740 16402 -6585 35493
8133 35493 86119 56858 55247 50888 -14206 -50507 -49192 35741 69531 113806 82708 13912
8121A3912j7086m6181o871r27J7400J1593k16j9490K1592l133J1088j2210l8283
8108f8812m7619L925R9752P5963K8784r582o518o384k0063j3731k7632N3931P916
8095F9930m7718j2256L5380n5547n020N853K4628j9548M467j422j1055L9346J9963
8082D7001m0351k8283O1353J8041R949N292j693n23J1849Q816j293J6213m5463
8069F0908k2638K8962N0936l2827k0033M2595J417J7799L5707o8343m2755q7559
8057c5831n4014Q4890L4847k5529n2560r273o720j3629K6796l858N48L5521L1898
8044A3086m8218m5291j8543J3208l32j5061R588N0784K518r607O6548l666j3669
8031A345K3568K671o2030r6867k933L6378M1790N8252J1514L9721q5152m8982
$$ plain form
8121 13912 -3174 -49355 -56226 -57153 -39753 -28160 -28376 -47866 -26274 -29407 -18319 -30529 -68812
8108 -68812 -116431 -112506 -12754 63209 91993 82411 75893 69509 49446 35715 8083 62014 69930
8095 69930 22212 9956 45336 -10211 -15231 -9378 15250 -4298 169 -1253 -12308 27038 47001
8082 47001 6650 -21633 39720 57761 67710 73002 71309 70786 82635 91451 90158 106371 60908
8069 60908 38270 67232 118168 85341 65308 107903 109320 127119 162826 94483 51728 -35831
8057 -35831 -89845 -4955 29892 4363 -48197 -57470 -64190 -77819 -51023 -54881 -54333 -18812 13086
8044 13086 -35132 -80423 -98966 -85758 -86090 -101151 -91563 -40779 -38261 -47868 18680 15014 1345
8031 1345 24913 27584 -34446 -131313 -134246 -97868 -56078 2174 13688 53409 -31743 -80725
8019h0725l4814k82j5705o3668J00241R0819J5687l2902O652K9304N4718J8265
8007H7590m7324q3896m840j4241n304K3639q844L2494j6855N365K8183N2833K3629
7994G2429J5381P794L0170n5316r6188j7115L0014N0024R551q54K7365L6018m7367
7981F1906n6467o3586j9971N97r268J2271K7583L3462J2773J9889M0902K022n998
7968E6115K2486p08l4949r9873k9618N3840J3098l4513K2922m5663k6523m55K2942
7955h0899M6830r108m217L1814j8172K0367P7855p109q662R63n0706j7681M9386
7942C0661r048k5333p8505K6318K5707K0543J2905J6095M2529l2796J9535R068
7930E7679m5967K5253K5477K0938j23010k4540K3779k4170J7432L7161L7163N0385
$$ plain form
8019 -80725 -115539 -115821 -131526 -195194 -94953 -4134 11553 -21349 -14697 14607 69325 87590
8007 87590 40266 -43630 -48470 -62711 -68015 -44376 -53220 -20726 -37581 -32216 -4033 48800 72429
7994 72429 87810 95604 125774 70458 -25730 -42845 -12831 37193 46744 45890 73255 109273 61906
7981 61906 5439 -58147 -78118 -77521 -86789 -74518 -46935 -13473 -700 19189 60091 62113 56115
7968 56115 78601 77893 42944 -56929 -86547 -32707 -19609 -54122 -31200 -76863 -103386 -103841 -80899
7955 -80899 -34069 -43177 -47394 -15580 -33752 -13385 64470 57361 48699 49662 -1044 -18725 30661
7942 30661 21613 -3720 -82225 -55907 -30200 -9657 3248 19343 61872 29076 48611 57679
7930 57679 11712 36965 62442 83380 -39630 -64170 -40391 -64561 -47129 -9968 27195 77580
7918G7580M976j1026k34n9693J6889K7503m7644L8091N2525l972K1129j8866l463
7905I3795L8722k0675p9217m6279J7025q313m7700K2266J9326N5988n3934l0859
7893c9855K7444k6856p9798N863M3414k728j5902N3067O3274l570o7294q412N288
7880d6065K3076J9325m75j3423q1937n5289P1450P048j5111O2582M8290K2715
7868D2186k3748j0797n6928r12k9972L4961J6780P065K1754j3456o821L5481j907
7855A3686k3782j15q7787N0663J00484K3212m762p4318n2169l3982m3225M113
7843a27982m8269M3059O2395P806k7520K8964K8552o011o9844j7460Q7586L9842
7831A118O115k3440l6953K5383J3638L0073j488J7964n1686l0913K3267r608k126
$$ plain form
7918 77580 82556 71530 71296 11603 28492 55995 8351 46442 98967 94995 116124 97258 93795
7905 93795 132517 111842 32625 -13654 3371 -4942 -52642 -30376 -11050 44938 -8996 -39855
7893 -39855 -12411 -39267 -119065 -113202 -69788 -72516 -88418 -35351 27923 24353 -42941 -51353 -46065
7880 -46065 -22989 -3664 -4139 -17562 -99499 -154788 -83338 -76290 -91401 -28819 19471 42186
7868 42186 18438 7641 -49287 -50199 -80171 -45210 -28430 -21365 389 -13067 -19888 15593 13686
7855 13686 -10096 -10211 -97998 -47335 53149 76361 71599 -2719 -54888 -88870 -132095 -127982
7843 -127982 -176251 -133192 -70797 -62991 -90511 -61547 -32995 -39006 -108850 -126310 -38724 1118
7831 1118 7233 -16207 -53160 -27777 -14139 15934 14446 32410 -19276 -50189 -26922 -36530 -38656
7818c8656L67J3375Q864j3072n96O7288o8240l4902N3166j1684j7896j035J4671
7805b8350K8426m9545k1500K0575l451O0200N1467J4888j679k9809q765l5380
7793b923j7989j2450k2719l892Q764Q299k4814M6792P3892J1753N0623L4709k0490
7780A29555m8527R495j8967K329Q568m6806o2710R0532n14k3390m1076q2979K073
7767h2417K1874q785K9611N1678Q9185q260p921N2855p1079j2303Q964l1485j837
7754C0080n723J7396k563m3898p638j1707r509Q291j5265q014J9662K534o896
7741c3250O4535O9413l693J997j01285p8662O5737P1629o559j3411j9254K7254
7729D4451N476q46N731m6376q852m0507n1787k5468K5853P2511K1657K3109O5288
$$ plain form
7818 -38656 -38289 -24914 -16050 -29122 -29718 37570 -30670 -65572 -12406 -24090 -41986 -43021 -28350
7805 -28350 76 -49469 -70969 -50394 -53845 6355 57822 72710 71031 41222 32457 -2923
7793 -2923 -20912 -33362 -56081 -59973 -51209 -42910 -67724 -20932 52960 64713 115336 150045 129555
7780 129555 81028 90523 71556 73885 82453 35647 -27063 63469 62955 39565 -1511 -84490 -82417
7767 -82417 -60543 -69328 -39717 11961 101146 92886 84965 137820 66741 54438 63402 31917 30080
7754 30080 24357 41753 39190 -4708 -12346 -24053 -33562 -25271 -40536 -48550 -28888 -26354 -33250
7741 -33250 31285 100698 97005 99002 -2283 -80945 -15208 56421 49862 36451 17197 44451
7729 44451 49927 49081 54812 8436 -416 -40923 -92710 -118178 -92325 -19814 1843 24952 90240
7716I0240K5948N5763j6200p7289p4371k2769o970n4396K796P7468k705l0987
7704c3472m5116n418N2366N0037K6434P642k4631l0253j6448n2006l9078N2971
7692e6972O0635P881O559N151m8499m6408j1267R3642P9808M478k0744m0742j8979
7679A4543j4594n3178p389K7770R3549K7379p7674o5334O0393P560j7656k4243
7667b8874L4202N3219J4912j7734M090M8077l0569K336M3383R495p9963r5258
7655d2684J9594M5731J623L1149K0939n0115p7860o1980J9809K0785O249m8320
7643a15080J9739L3871m7674l8732r740J4097K9231J9978L9486K0064K0179R487
7631e094M1600O673l2624k5663o1423m1513K5486N6845l0355J6729L5535k5510
$$ plain form
7716 90240 116188 171951 155751 78462 4091 -18678 -25648 -80044 -77248 220 -2485 -33472
7704 -33472 -78588 -84006 -31640 18397 44831 52473 27842 -2411 -18859 -70865 -109943 -56972
7692 -56972 3663 11544 18103 23254 -25245 -71653 -82920 10722 90530 95008 74264 33522 14543
7679 14543 -51 -53229 -60618 -32848 60701 88080 10406 -54928 5465 13025 -4631 -28874
7667 -28874 5328 58547 73459 55725 59815 107892 77323 79659 123042 132537 52574 -42684
7655 -42684 -23090 22641 24264 55413 76352 26237 -51623 -113603 -93794 -73009 -66760 -115080
7643 -115080 -95341 -61470 -109144 -147876 -157616 -143519 -114288 -94310 -54824 -34760 -14581 -5094
7631 -5094 36506 43179 10555 -15108 -76531 -118044 -92558 -35713 -66068 -49339 -13804 -39314
7619c9314l0005r904k2697O2312P4993J2678o2148P303L2819J1525k1423m1208
7607b5069P0203K4424K6205L3098j6199p5113k5257L2094L8368N6180j7570j2157
7595A09207p5912k9690M8896J6553j9010m1216j7207N2826O970j852J185l6318
7583A4432j995n740K2007m2187l9972m728J8340l137j7015N6331j4604l3244P068
7570d4444Q936m9104M0423O6696Q843j5070j975J6634q732k7432m8945m7740p079
7557a08989N3031p6761k1331L8640R0925j2705k2773J710N7846k4114K0170r476
7545a3827n6251m6542N7327N4572K880L0253j4661J8379o791l7518J8534Q9486
7533I5841J434j3158j7773q1086r9454K6646Q0424O9466m0497j9953N59j3647
$$ plain form
7619 -39314 -69319 -79223 -101920 -39608 35385 48063 -14085 -6782 26037 37562 16139 -25069
7607 -25069 45134 69558 95763 128861 112662 37549 12292 44386 82754 138934 121364 109207
7595 109207 33295 3605 52501 69054 50044 8828 -8379 44447 51417 49565 50750 14432
7583 14432 12437 6697 28704 -13483 -53455 -58183 -39843 -42980 -59995 -3664 -18268 -51512 -44444
7570 -44444 -35508 -84612 -44189 22507 31350 16280 14305 30939 22207 -5225 -54170 -101910 -108989
7557 -108989 -55958 -132719 -154050 -115410 -24485 -37190 -59963 -58253 -407 -24521 -4351 -13827
7545 -13827 -70078 -116620 -59293 -4721 -1841 28412 13751 32130 25339 -12179 6355 95841
7533 95841 97275 84117 66344 -14742 -114196 -87550 -7126 62340 21843 1890 2449 -11198
7521a1198k2779k7861o7886L2293J35526K8012K386j5947l2725k2884j3878p780
7509b4721j6699J691J9645J5703P396J9821Q723j269n3541m5420p0279M9082P4355
7496a5513L1252M6375J1578j3626J5531M709o3853j5798m125J4971n282j3583
7484g364l0227L5045O1992L2653j5555o9790K1131O109m0115m269K4994M322o384
7471A2542N5488N881k6051l0842l8073J2211o621M9990L5957R614N7361p2779
7459F4678r0733O5291P0885n8280j1479m5114l674n254k284Q305N2437p3460m8414
7446g7096m782L0408l357K8701L3782o199M0141K3867Q267K9474o2469k6224k1439
7433f926j6636q270m2998j0202K5196k0461j5961N6048N0398k5285l3232N074
$$ plain form
7521 -11198 -33977 -61838 -129724 -97431 38095 66107 68493 52546 19821 -3063 -16941 -24721
7509 -24721 -41420 -39729 -20084 -4381 3015 22836 31559 30290 -23251 -68671 -138950 -89868 -15513
7496 -15513 15739 62114 73692 60066 75597 80306 16453 655 -3470 11501 6219 -7364
7484 -7364 -37591 -2546 59446 92099 76544 6754 27885 33994 -6121 -10390 14604 18926 12542
7471 12542 68030 73911 47860 17018 -21055 -8844 -15465 34525 70482 80096 137457 64678
7459 64678 -26055 39236 110121 51841 40362 -4752 -8426 -13680 -15964 -7659 44778 -28682 -77096
7446 -77096 -81878 -51470 -54827 -26126 7656 1457 41598 65465 73732 103206 40737 14513 -6926
7433 -6926 -23562 -31832 -74830 -85032 -59836 -80297 -96258 -40210 10188 -15097 -48329 -43255
7421d3255K6545j460K7919N0057N8837l336O165o586p128k5629K3266J0575n5799
7408F0171K5453M3741q6716r9166J5699j1080j0163r11J6600k3633o7007Q636
7396a28376O1341M740j0473K869L1976R2947J8455n6773J6847J0578j9831R556
7384C3856j6170M888k5878p3949M64M2852j417k8749r071L7256Q567N847N883
7371a5621J00578N4469J5334p3671q5560m813j0537o6382j0997R7369m0244n1459
7359i1534K664l2863N489j7055L7680O0594k68O616O7835N8275n4256o6011K0104
7346b730M485L492J6067j6044J4307P9867J5165q1447m1417m9469m3620j2947
7334a14291r111N7865N7786J7623l8144l090M933K7527L1816R977m6908j6804
$$ plain form
7421 -43255 -16710 -18170 9749 59806 118643 115307 121472 114886 107758 82129 105395 115970 60171
7408 60171 85624 129365 42649 -56517 -40818 -51898 -62061 -62972 -46372 -70005 -137012 -128376
7396 -128376 -67035 -62295 -72768 -69899 -37923 55024 73479 16706 33553 44131 24300 33856
7384 33856 17686 22574 -3304 -77253 -76789 -33937 -35354 -64103 -73174 -35918 -27351 -21504 -15621
7371 -15621 84957 139426 154760 81089 -4471 -9284 -19821 -86203 -97200 169 -40075 -91534
7359 -91534 -88870 -121733 -116244 -133299 -95619 -35025 -35293 -28677 39158 97433 43177 -22834 -2730
7346 -2730 1755 5247 21314 5270 19577 99444 114609 33162 -8255 -57724 -101344 -114291
7334 -114291 -123402 -65537 -7751 9872 -28272 -31362 -26429 1098 32914 42891 -4017 -20821
7322b0821M1118j6943k8913J3151j7727l4767j8771O855j1204q136N271K6806
7310f4081K7784M625K3708K9730k2397k6375K3629J8602N3723l6961p2932N0737
7298I792K1121o2354K7732P294p145J0050P5528K5761j3179r951q0667p729K6917
7285B3170j101K5583j1153j7223J5869j5551m1337l121k6287J6977J5301Q980
7273i893M0074m558l4449l020l6272m2665n4394M83J10502P5141Q440j5385M0627
7260G4631L5379m9757j9239l0609q4142N842l9516N959K0074M6024M4926k6399
7248a6827N5246N6349L3608J526l5370m1626K5939L6015m2631p5696k8466N3226
7236B1293k8112m2676n237M7662l2430J4888N3961M0420k8089q4764j381m8600
$$ plain form
7322 -20821 20297 3354 -25559 -12408 -30135 -64902 -83673 -76818 -88022 -96158 -90887 -64081
7310 -64081 -36297 -31672 -7964 21766 -631 -27006 -3377 15225 68948 31987 -40945 9792
7298 9792 30913 -31441 -3709 3585 -3560 6490 82018 107779 94600 84649 3982 -3747 23170
7285 23170 22069 47652 36499 19276 35145 19594 -21743 -24864 -51151 -34174 -18873 -9893
7273 -9893 30181 25623 -8826 -11846 -48118 -90783 -145177 -144694 -34192 40949 49389 34004 74631
7260 74631 110010 60253 41014 10405 -73737 -67895 -107411 -101452 -81378 -35354 9572 -16827
7248 -16827 38419 94768 128376 129902 94532 52906 78845 114860 72229 -3467 -31933 21293
7236 21293 -6819 -49495 -54732 -7070 -39500 -24612 29349 69769 41680 -43084 -44465 -93065
7224i3065K9010M7445M094j1081K2811k7395j0164l4168J4672N0597Q23j9670
7212b6091k601O8087N4090o0888m6858l4842j2136L7341N9168l7750J7196L5030
7200D9746n868l8151j1508m0624l431O9940k6690M4003K9061o402j16314n9885
7188a16123L5847J4960J3152J4904n7732j4333Q211L0667R4549M4407j1233n1283
7176E993m4306k260L0219J3339p4551m0641N2308l2297j5085M4726K8824l8319
7164g2050N115m445K7313M1838L1799l5023m6153j445L1749M2176p397j7900N7629
7151E3206j3213q025n1514l1245J02J0528J040l396j8620L8645L2107j8872R370
7138A13j4513r246k157K7922l108n5004l0819L2632n248r629k7522M3476M9084
$$ plain form
7224 -93065 -64055 -16610 -12516 -23597 -786 -28181 -38345 -72513 -57841 -7244 -6421 -26091
7212 -26091 -28692 39395 93485 32597 -14261 -49103 -61239 -23898 35270 -2480 14716 49746
7200 49746 43878 5727 -5781 -46405 -49836 20104 -6586 37417 66478 60076 -56238 -116123
7188 -116123 -80276 -65316 -52164 -37260 -94992 -109325 -101114 -70447 24102 68509 57276 5993
7176 5993 -38313 -40573 -10354 2985 -71566 -112207 -59899 -92196 -107281 -62555 -33731 -72050
7164 -72050 -66935 -71380 -44067 -2229 29570 -5453 -51606 -53051 -21302 20874 13477 -4423 53206
7151 53206 39993 31968 -19546 -50791 -50689 -40161 -39121 -42517 -61137 -22492 9615 -9257 113
7138 113 -14400 -23646 -25803 2119 -989 -55993 -86812 -54180 -59428 -69057 -96579 -53103 -4019
7125d019j8036l351n997o47K234K9167O3467p662k3233m3486K379j3843R911J9251
7111F135j6093J4108L5886l6420O025L7154l6900N076m48K7001J9518L9265m2287
$$ plain form
7125 -4019 -22055 -25406 -31403 -32050 -29816 -649 62818 55156 31923 -11563 -9184 -23027 -13116 6135
7111 6135 -9958 4150 40036 3616 9641 46795 9895 14971 14523 41524 61042 100307 58020
$$ [...]
##END NTUPLES=NMR SPECTRUM
##END=
