##TITLE=Analysis number 320685
Compound Code rf 01374
Project Code adrs
Chemist Name prosynth
##JCAMPDX= 6.0         $$ Bruker NMR JCAMP-DX V2.0
##DATA TYPE= NMR SPECTRUM
##DATA CLASS= NTUPLES
##ORIGIN= Bruker BioSpin GmbH
##OWNER= nmr
$$ XWIN-NMR		Version 3.5
$$ Wed Jul  5 11:54:28 2006 GMT Daylight Time (UT+1h)  MAYBRIDGE\nmr@NMR_250MHZ
##.OBSERVE FREQUENCY= 250.131544655141
##.OBSERVE NUCLEUS= ^1H
##.ACQUISITION MODE= SIMULTANEOUS (DQD)
##.ACQUISITION SCHEME= undefined
##.AVERAGES= 16
##.DIGITISER RES= 18
##SPECTROMETER/DATA SYSTEM= dpx250
##.PULSE SEQUENCE= zg30
##.SOLVENT NAME= CDCl3
##.SHIFT REFERENCE= (INTERNAL, CDCl3, 0, 16.522)
##AUDIT TRAIL= $$ (NUMBER, WHEN, WHO, WHERE, WHAT)
$$ ##TITLE= Audit trail, XWIN-NMR		Version 3.5
$$ ##JCAMPDX= 5.01
$$ ##ORIGIN= Bruker BioSpin GmbH
$$ ##OWNER= nmr
$$ C:\u/data/dgb/nmr/ADRS/2320/pdata/1/auditp.txt
$$ ##AUDIT TRAIL=  $$ (NUMBER, WHEN, WHO, WHERE, WHAT)
(   1,<2006-07-05 11:54:06.35 +100>,<MAYBRIDGE\nmr>,<NMR_250MHZ>,
      <created by zg, POWCHK disabled, PULCHK disabled
       configuration hash MD5:
       E2 DF 36 D8 04 B2 41 60 5A D7 A3 38 5A 4B D0 FE
       data hash MD5: 64K
       F7 24 81 DD 07 DC 4C 7E B5 93 4F C7 88 CC E6 1C>)
(   2,<2006-07-05 11:54:19.27 +100>,<MAYBRIDGE\nmr>,<NMR_250MHZ>,
      <Start of raw data processing
       ef LB = 0.3 FT_mod = 6 PKNL = 1 SI = 32K 
       data hash MD5: 32K
       F2 71 3E 7B 5D C0 89 98 BE 04 35 8E 84 CF 33 EC>)
(   3,<2006-07-05 11:54:21.33 +100>,<MAYBRIDGE\nmr>,<NMR_250MHZ>,
      <apk 
       data hash MD5: 32K
       E8 AB AF CE A5 25 C1 DE 04 A2 EB 72 E3 6F 5F 79>)
(   4,<2006-07-05 11:54:22.36 +100>,<MAYBRIDGE\nmr>,<NMR_250MHZ>,
      <abs ABSG = 5 
       data hash MD5: 32K
       48 DD 87 36 1A 2D ED BE D2 55 DA 3D 8B 2E 44 2C>)
$$ ##END=
$$ 
$$ hash MD5
$$ E2 DB 5A C6 04 24 9D AE E2 04 F2 AF 4B 80 EA B6
##$RELAX= 
##$RELAX= 
##$RELAX= 
##$RELAX= 
##$RELAX= 
##$RELAX= 
##$RELAX= 
$$ Bruker specific parameters
$$ --------------------------
##$DU= <C:\u>
##$EXPNO= 2320
##$NAME= <ADRS>
##$PROCNO= 1
##$TYPE= <nmr>
##$USER= <dgb>
##$AMP= (0..31)
100 100 100 100 100 100 100 100 100 100 100 100 100 100 100 100 100 100 
100 100 100 100 100 100 100 100 100 100 100 100 100 100 
##$AQSEQ= 0
##$AQ_mod= 3
##$AUNM= <au_zg>
##$AUTOPOS= <21 >
##$BF1= 250.13
##$BF2= 250.13
##$BF3= 250.13
##$BF4= 250.13
##$BF5= 500.13
##$BF6= 500.13
##$BF7= 500.13
##$BF8= 500.13
##$BYTORDA= 1
##$CFDGTYP= 0
##$CFRGTYP= 5
##$CHEMSTR= <none>
##$CNST= (0..31)
1 1 145 1 1 1 1 1 1 1 1 1 1 1 1 1 1 1 1 1 1 1 1 1 1 1 1 1 1 1 1 1 
##$CPDPRG= <>
##$CPDPRG1= <>
##$CPDPRG2= <>
##$CPDPRG3= <>
##$CPDPRG4= <mlev>
##$CPDPRG5= <mlev>
##$CPDPRG6= <mlev>
##$CPDPRG7= <mlev>
##$CPDPRG8= <mlev>
##$CPDPRGB= <>
##$CPDPRGT= <>
##$D= (0..31)
0 1 0 0 0 0 0 0 0 0.06 0 0 0 0 0 0 0.0002 0 0 0 0 0 0 0 0 0 0 0 0 0 0 
0 
##$DATE= 1152096845
##$DBL= (0..7)
120 120 120 120 120 120 120 120 
##$DBP= (0..7)
150 150 150 150 150 150 150 150 
##$DBP07= 0
##$DBPNAM0= <>
##$DBPNAM1= <>
##$DBPNAM2= <>
$$ [...]
##$SUBNAM7= <"">
##$SUBNAM8= <"">
##$SUBNAM9= <"">
##$SW= 20.6930455092707
##$SWIBOX= (0..15)
0 0 3 0 0 0 0 0 0 0 0 0 0 0 0 0 
##$SW_h= 5175.983436853
##$TD= 65536
##$TD0= 1
##$TE= 295.16
##$TE2= 300
##$TE3= 300
##$TEG= 300
##$TL= (0..7)
0 120 120 120 120 120 120 120 
##$TP= (0..7)
150 150 150 150 150 150 150 150 
##$TP07= 0
##$TPNAME0= <>
##$TPNAME1= <>
##$TPNAME2= <>
##$TPNAME3= <>
##$TPNAME4= <>
##$TPNAME5= <>
##$TPNAME6= <>
##$TPNAME7= <>
##$TPOAL= (0..7)
0.5 0.5 0.5 0.5 0.5 0.5 0.5 0.5 
##$TPOFFS= (0..7)
0 0 0 0 0 0 0 0 
##$TUNHIN= 0
##$TUNHOUT= 0
##$TUNXOUT= 0
##$USERA1= <user>
##$USERA2= <user>
##$USERA3= <user>
##$USERA4= <user>
##$USERA5= <user>
##$V9= 5
##$VALIST= <valist>
##$VCLIST= <CCCCCCCCCCCCCCC>
##$VD= 0
##$VDLIST= <DDDDDDDDDDDDDDD>
##$VPLIST= <PPPPPPPPPPPPPPP>
##$VTLIST= <TTTTTTTTTTTTTTT>
##$WBST= 1024
##$WBSW= 4
##$XGAIN= (0..3)
0 0 0 0 
##$XL= 0
##$YL= 0
##$YMAX_a= 278274
##$YMIN_a= -450085
##$ZGOPTNS= <>
##$ZL1= 120
##$ZL2= 120
##$ZL3= 120
##$ZL4= 120
##$ABSF1= 16.522
##$ABSF2= -4.171173
##$ABSG= 5
##$ABSL= 3
##$ALPHA= 0
##$AQORDER= 0
##$ASSFAC= 0
##$ASSFACI= 0
##$ASSFACX= 0
##$ASSWID= 0
##$AUNMP= <proc_1d>
##$AZFE= 0.1
##$AZFW= 0.1
##$BCFW= 0
##$BC_mod= 0
##$BYTORDP= 0
##$COROFFS= 0
##$CY= 12.5
##$DATMOD= 1
##$DC= 0
##$DFILT= <>
##$DTYPP= 0
##$F1P= 14.0000005364418
##$F2P= -0.99999901652339
##$FCOR= 0.5
##$FTSIZE= 32768
##$FT_mod= 6
##$GAMMA= 0
##$GB= 0
##$INTBC= 1
##$INTSCL= 1
##$ISEN= 128
##$LB= 0.3
##$LEV0= 0
##$LPBIN= 0
##$MAXI= 10000
##$MC2= 0
##$MEAN= 0
##$ME_mod= 0
##$MI= 0
##$NCOEF= 0
##$NC_proc= -5
##$NLEV= 6
##$NOISF1= 0
##$NOISF2= 0
##$NSP= 0
##$NTH_PI= 0
##$NZP= 0
##$OFFSET= 16.522
##$PC= 1
##$PHC0= 149.4221
##$PHC1= 48.42526
##$PH_mod= 1
##$PKNL= yes
##$PPARMOD= 0
##$PSCAL= 4
##$PSIGN= 0
##$REVERSE= no
##$SF= 250.13
##$SI= 32768
##$SIGF1= 0
##$SIGF2= 0
##$SINO= 400
##$SIOLD= 32768
##$SREGLST= <1H.CDCl3>
##$SSB= 0
##$STSI= 32768
##$STSR= 0
##$SW_p= 5175.98343685301
##$SYMM= 0
##$S_DEV= 0
##$TDeff= 65536
##$TDoff= 0
##$TI= <Analysis number 999999
Compound Code 99
Book Reference 9
Project Code 9>
##$TILT= no
##$TM1= 0
##$TM2= 0
##$TOPLEV= 0
##$USERP1= <user>
##$USERP2= <user>
##$USERP3= <user>
##$USERP4= <user>
##$USERP5= <user>
##$WDW= 1
##$XDIM= 32768
##$YMAX_p= 463715099
##$YMIN_p= -1105658
$$ End of Bruker specific parameters
$$ ---------------------------------
##NTUPLES= NMR SPECTRUM
##VAR_NAME=  FREQUENCY,     SPECTRUM/REAL,   SPECTRUM/IMAG
##SYMBOL=    X,             R,               I
##VAR_TYPE=  INDEPENDENT,   DEPENDENT,       DEPENDENT
##VAR_FORM=  AFFN,          ASDF,            ASDF
##VAR_DIM=   32768,         32768,           32768
##UNITS=     HZ,            ARBITRARY UNITS, ARBITRARY UNITS
##FACTOR=    0.157963299565203, 1,           1
##FIRST=     4132.6476996994, 0,             0
##LAST=      -1043.33573715361, 0,           0
##MIN=       -1043.33573715361, -1105658,    0
##MAX=       4132.6476996994, 463715099,     0
$$ Real data points
##PAGE= N=1
##DATA TABLE= (X++(R..R)), XYDATA
$$ [...]
23566B79557n168n5139l8628j36902k5864J47951J88956k05115m7197Q3574M2659
23555B28684r0173k28284N8381L6050k29327P2764r690m646J19344L96208J76096
23544E25407k80225j11246n3203m0048Q0235j09077q1540L1653j3340M0595j08931
23533a19720k7422m2467m1883K01941J64321q0489j13798q1938J81981o5777M7739
23522B2488k91682j32419J70818L03294J56133K50101J3717l58292m42132M9588
23512b58386N3304K701r135J92506N6385n547K5790m1265q2863o5572J68288K19207
23500B55413j73892k04344o1226n484M5252M8215j1362k99k523J51999l1489j28057
23488a17797k61030J84836K35874j6764k5147l50900p4836o3333Q9355K28381
$$ plain form
23566 279557 274389 219250 180622 43720 17856 165807 354763 149648 102451 186025 228684
23555 228684 138511 -89773 -31392 4658 -224669 -151905 -161595 -166241 -46897 349311 525407
23544 525407 245182 133936 80733 40685 120920 11843 -69697 -38044 -51384 -10789 -119720
23533 -119720 -147142 -189609 -231492 -29551 134770 54281 -59517 -141455 40526 -25251 22488
23522 22488 -269194 -401613 -230795 72499 228632 478733 492450 134158 -307974 -258386
23512 -258386 -205082 -202381 -211516 -19010 37375 31828 57618 16353 -66510 -132082 36206 255413
23500 255413 81521 -122823 -184049 -189533 -144281 -96066 -107428 -107727 -110250 41749 10260 -117797
23488 -117797 -378827 -193991 41883 25119 -28 -350928 -425764 -489097 -399742 -171361
23478a71361K21166m5358l04606q794J57715J4420l3115k08310K23281K63712
23468A08750j22533j88059j63338J56373J30599N6168p7113R8514l1071O1607
23458B9897O1718M2487m5203n1172J62155K8460J28529L7421j55892k30315k7421
23447a9336J06830N0653r8939n339K30720o1282l7219L59O9694p0250j87081j18422
23435a39612P9080L51393o7770k87663l7090k3089R856R9928K57295j02782j40530
23424i84N6556K5139j51673K79315J87898P3806q5732l75344l31036Q2170J00999
23413a38886O9571L5091K8062k5701l1922P2416j13218k45894l79831O3862K17289
23402d49161L3008Q8436N2311J28343P0404k0425J33872J89950o5485k7990J55054
$$ plain form
23478 -171361 49805 4447 -300159 -308953 -151238 -136818 -169933 -378243 -154962 108750
23468 108750 -13783 -201842 -365180 -208807 -78208 -22040 -99153 -639 -31710 29897
23458 29897 91615 134102 88899 37727 199882 228342 356871 394292 238400 8085 -19336
23447 -19336 87494 138147 39208 33869 264589 203307 166088 166447 236141 165891 -21190 -139612
23435 -139612 -60532 290861 223091 -64572 -101662 -124751 -114895 -14967 242328 139546 -984
23424 -984 55572 80711 -70962 208353 396251 470057 384325 8981 -322055 -239885 -138886
23413 -138886 -69315 -34224 -6162 -31863 -63785 8631 -104587 -350481 -730312 -666450 -449161
23402 -449161 -416153 -327717 -275406 -147063 -76659 -97084 36788 226738 161253 133263 288317
23391B88317J20846j72454p3498P420k7868J42703j10654j52346O1564J53280
23381B37310j2366j90151p5350K00244O3410j95701j31726J27033o3893K10888
23371A69698M8864l2030j11791k31894k34306K01362L05099J44637j35892j51067
23361b7320J40956R7956J36932r5529k741J56670l2346J2816k8365q231n8128
23350B92670k5007k7138l23201p5972N9403K28667K5556j38603j8632n3273K10186
23339A54656K7352k33644k34156L2161j19905J47755L92153j34660k6748O9859
23329G4823J73137K6769j55801j75577K3609J46211j59981n5988J18281K26594
23319B42077M3042j05690j871O9464K93525J1678l62397k91630J2950j11602J33791
$$ plain form
23391 288317 409163 236709 163211 170631 142763 285466 174812 22466 84030 237310
23381 237310 224944 34793 -40557 159687 223097 27396 -104330 22703 -41190 169698
23371 169698 218562 186532 74741 -157153 -391459 -190097 115002 259639 123747 -27320
23361 -27320 113636 211592 348524 252995 250254 406924 374578 387394 359029 350798 292670
23350 292670 267663 240525 -82676 -158648 -99245 129422 154978 16375 -2257 -55530 154656
23339 154656 182008 -51636 -285792 -253631 -373536 -225781 166372 31712 4964 74823
23329 74823 247960 274729 118928 -56649 -33040 113171 -46810 -102798 15483 242077
23319 242077 285119 179429 177558 247022 540547 552225 189828 -101802 -88852 -200454 -66663
23308f6663J35641j08737k47607j13716m8600k2775K91221J02790m1869J71338
23298E1023p9571J8328J28262o3282j68457J49960J50403j32228m8446m8325J8220
23287b4113J14164j91379j03382J47989j44232Q3195J38892j11089o0956J49224
23277a687K2192M4396Q1969J72453l9960M2771m321k73278K11911L39234J38039
23266G33719j75063j75327p7319j43486k02657p6322J2324K0508j13358K39638
23256D2657L8083l37171o0756N534L3073J38985J82300K1431k0239q2240M2757
23245D414k25490j10621q91J7302j16985k9746R3899j8052J68682K62806J03471
23234A48789k14236n5808J25406K96610k97912k75846P7415R5786j6933r1734
$$ plain form
23308 -66663 68978 -39759 -287366 -401082 -449682 -472457 -181236 -78446 -120315 51023
23298 51023 -28548 -10220 118042 54760 -113697 36263 186666 54438 5992 -42333 -24113
23287 -24113 90051 -101328 -204710 -56721 -200953 -117758 21134 -89955 -150911 -1687
23277 -1687 20505 64901 146870 319323 279363 322134 317813 44535 256446 595680 733719
23266 733719 558656 383329 306010 162524 -40133 -116455 -104131 -83623 -196981 42657
23256 42657 80740 -256431 -317187 -311653 -278580 -139595 42705 64136 43897 -38343 4414
23245 4414 -221076 -331697 -332588 -315286 -432271 -462017 -368118 -386170 -217488 45318 148789
23234 148789 -65447 -121255 4151 300761 2849 -272997 -195582 -99796 -116729 -208463
23224b08463j46219k0383K15457j02634P912L2395R5971K87570K54112k19948
23214A95770p1154M6677j66587J47394o5942j51341j85151n6074J05957N9048
23204a41403k0590K81612o6762j15100j90845L45214K20273l58161j57266J2272
23194a90756J13973P1404N8854j79562m4548R8248O826J3648j5027K18878j7809
23183A34129l5637l6183m4015K0349M6937n2254m4838j10234j2526R5036J93518
23172A54282L056o097k41863n5409r1516J43119M9435k5433j87558k08742l3651
23161e00377K26564K87175r7041j46143q3192N7542K6978r2061n809M4523N9940
23150b21901O8111J08424O2670K5322J38371k12551p4090K85621j7631j40656
$$ plain form
23224 -208463 -354682 -375065 -159608 -262242 -254330 -221935 -125964 161606 415718 195770
23214 195770 124616 171293 4706 152100 86158 -65183 -250334 -306408 -200451 -141403
23204 -141403 -161993 119619 52857 -62243 -253088 92126 312399 -45762 -203028 -190756
23194 -190756 -76783 -5379 53475 -126087 -170635 -72387 -65561 -51913 -66940 151938 134129
23183 134129 98492 62309 18294 38643 85580 33326 -11512 -121746 -134272 -39236 154282
23172 154282 157338 151241 -90622 -146031 -237547 -94428 -44993 -70426 -257984 -466726 -500377
23161 -500377 -273813 13362 -83679 -229822 -313014 -255472 -228494 -320555 -326364 -281841 -221901
23150 -221901 -153790 -45366 17304 42626 180997 -31554 -105644 179977 162346 21690
23140B1690k196n1189j42591j2025K17305P6143K5219P786l14307l48172J07874
23129d14463J94895K75922K98216K48212j97890l1637n4368k06004l37884m3854
23119b68855J66801K9869l32K1102M7062N2818q8781o5168k7313l2798J89773
23108B4178J08497l81525J61920J46109j17942k24976k37325J78059J41152J23191
23098g8662m572j32980K19022J52127j71854K25119J25522k58367j15005J5364
23088b4286Q1203o529M1594p126J23397j10629j40508M5500R9924n7069j13872
23077f8401j03974l597J19678K86574q2359l70004K28026Q2428j10295L1419K8849
23066C8344O6184J50146L34011l94859j95862J4243j33258m685j89810q6943J92186
$$ plain form
23140 21690 19494 -31695 -174286 -186311 30994 107137 132356 140142 -174165 -522337 -414463
23129 -414463 -219568 56354 354570 602782 404892 373255 318887 112883 -225001 -268855
23119 -268855 -102054 -72185 -72517 -51415 -4353 48465 -40316 -105484 -132797 -165595 24178
23108 24178 132675 -248850 -86930 59179 -58763 -283739 -521064 -343005 -201853 -78662
23098 -78662 -83234 -216214 2808 154935 -16919 208200 333722 75355 -39650 -24286
23088 -24286 56917 50388 91982 84856 208253 97624 -42884 2616 102540 45471 -68401
23077 -68401 -172375 -175972 -56294 230280 147921 -222083 5943 88371 -21924 9495 38344
23066 38344 104528 254674 588685 193826 -2036 12207 -121051 -125736 -315546 -402489 -210303
23055b10303J17140r0615K04405P6933J72283L5836n5012o3906k8861j16856j60502
23044a19458N4845l2296M6798J13451Q3540q9553P116K29891J31368k24473m73898
23033b72669j32557J98992K86902k593J2224j30702q3344m7939k77709L9870J06878
23022c02647Q4371l4495J5165m4392q2367J90406K52714K30355k62048j20743
23012g3681j14828n1927q081J82093P7805j59030L9867K05377K42150j76126l31647
23001a68028j78530J69396N0391J09007O7990r1687k1563q920J25533l23853k45647
22990e15911K28282J06552J77312M5297J136j14206N8348M5426K97734L0600m9022
22979C11548P1344K1266k22897j19930R0174j26220K9250K9305n7609j59204k46336
$$ plain form
23055 -210303 -93163 -183778 20627 97560 269843 305679 250667 186761 157900 41044 -119458
23044 -119458 -64613 -96909 -50111 63340 146880 57327 64443 294334 425702 201229 -272669
23033 -272669 -405226 -206234 80668 78075 90299 -40403 -123747 -171686 -449395 -409525 -302647
23022 -302647 -218276 -252771 -237606 -281998 -364365 -173959 78755 309110 47062 -73681
23012 -73681 -188509 -240436 -248517 -66424 11381 -147649 -107782 97595 339745 163619 -168028
23001 -168028 -346558 -177162 -126771 -17764 50226 -41461 -63024 -71944 53589 -270264 -515911
22990 -515911 -287629 -181077 -3765 41532 42668 -71538 -13190 32236 329970 360570 311548
22979 311548 382892 404158 181261 61331 151505 25285 54535 83840 26231 -132973 -379309
22968c79309J23199K15478q3382j47342N4327K10312L83193J59067k35567k35508
22958F4468J54833o4284M4001L5123j72651N9421L93531Q8089l9923k59705j58920
22947A43983Q8384J06233j97511k9986o2024J94813j57793k13976m0698L8388
22937a30187L3973K53397j27551q7399K68775J32654j75205j95229k81804K41709
22927f6867L04826L08252j86674j60928k53844k58239J07465K09855l8445k5882
22917f0481K25999j51470k29424j19534K82406J25753R9738R6663l9094m7317
22907A83239k64606P4060J75679j5311J73802L5828k8590m8254P0339q664j85103
22896A62419k9614n9964N7346J28469j29325j82693L3114K31050j10453q7429
$$ plain form
22968 -379309 -256110 -40632 -124014 -271356 -217029 -6717 376476 535543 299976 64468
22958 64468 219301 155017 199018 234141 61490 120911 514442 602531 562608 302903 143983
22947 143983 232367 338600 141089 111103 49079 243892 86099 -127877 -168575 -130187
22937 -130187 -96214 157183 29632 -57767 211008 343662 168457 -26772 -308576 -66867
22927 -66867 237959 546211 359537 198609 -55235 -313474 -206009 3846 -34599 -60481
22917 -60481 165518 14048 -215376 -334910 -52504 73249 172987 269650 230556 183239
22907 183239 -81367 -7307 168372 153061 326863 362691 334101 285847 356186 347522 162419
22896 162419 132805 72841 130187 258656 129331 -53362 -20248 210802 100349 12920
22886A2920l6321p3595n308K5835j2179M7541k03507Q1068K76845k75971j31897
22875b94569O6312m1890J05783L6998r9485L31472L05086k08996j4951N5285j55095
22864H5950j25733K6274J78320j34559j88830j1518J14931J10652P2199R6804
22854B24490M8991K39683M6110j42781K8115J3545o772L7604j06028l51127k91633
22843b59803N5989J75436j22761l2434R4220L5198Q1738O6470k4290o8475N4534
22832E5822J30750j10851j69958K2515L3449k53039M4363J93838M8822j76905
22822a81194k18714l04475K75569M13663K80952J88692o3695l18663j13149p6133
22812a17147l3361K06550J06999l4474o5103o4378m425M6382o8111k9228m9128
$$ plain form
22886 12920 -23401 -96996 -102304 -76469 -88648 -41107 -244614 -163546 113299 -162672 -294569
22875 -294569 -228257 -270147 -164364 -127366 -226851 104621 409707 200711 185760 241045 85950
22864 85950 -39783 -13509 164811 30252 -158578 -170096 -55165 55487 127686 224490
22854 224490 273481 513164 559274 416493 444608 458153 451381 488985 382957 31830 -259803
22843 -259803 -203814 -28378 -151139 -183573 -89353 -54155 27583 94053 69763 1288 55822
22832 55822 186572 75721 -94237 -71722 -38273 -291312 -246949 -53111 -4289 -181194
22822 -181194 -399908 -704383 -428814 -15151 265801 454493 390798 72135 -41014 -117147
22812 -117147 -150508 56042 163041 128567 63464 -914 -5339 41043 -27068 -56296 -105424
22801a05424J3597K30592j9892n297j98064K0880K1610O8568k75389j66258J68500
22790b46577L52140J87452k55225k73421K13862j13632o7787J57586L0434r8270
22780a13438j98254L3907O1844M4876K0991Q3165o7569J34200J06476P889l144
22769A10943P6067J28507R6731j10459k29856k35618j00267n3146k37631J94702
22759c60027K70212J54235J19324k6741k9898K09368m3004k53171J42305P5149
22749B57752l92980L5681L15922P4268q6255J29181K0099j62492j0429l7723j56879
22738a3855k6625J53755K0117j06435k13940L9942o1735j5263l3681K29956j1854
22727c9618k45590k64013J33226J60480L01122p3653O6598r2474k26900L1190
$$ plain form
22801 -105424 -91827 138765 118873 113576 -84488 -63608 -41998 26570 -248819 -415077 -246577
22790 -246577 105563 293015 37790 -235631 -21769 -135401 -203188 -45602 -15168 -113438
22780 -113438 -311692 -277785 -215941 -171065 -150074 -66909 -134478 -278 106198 114087 110943
22769 110943 187010 315517 412248 301789 71933 -163685 -263952 -317098 -554729 -360027
22759 -360027 -89815 64420 183744 157003 127105 336473 293469 40298 182603 257752
22749 257752 -135228 -99547 216375 290643 204388 333569 353668 191176 180747 143024 -13855
22738 -13855 -40480 113275 133392 26957 -186983 -147041 -208776 -224039 -257720 -27764 -39618
22727 -39618 -285208 -549221 -415995 -255515 45607 -28046 38552 -53922 -280822 -249632
22717b49632R7562P4693Q2660Q894k20509K3510J61178M9410P7228K35511O1308
22706D01813l57669r5350J45099l49343j64521m2829J25863K92997O8831j37395
22696a12504j67004J58882j23017k08841m8997O9949K30498J4839K12788J21331
22686A47924R3488o3146n2862K083Q5326l5315j22109L3150K3991L7490k2569
22675A27451j41665j65723o7213J62358K14282j61713o3437m0757J25432Q6015
22665G5030j06360l06372k12656J01563R2722K52175L48591K60935n1247k18743
22655B35638M6095j33793j55447N4834O5980P0027Q919M2317j12248j87570j04626
22644a69874J45601L22010r846L7676j52099p4934K76698j29593j78215K8007
$$ plain form
22717 -249632 -152070 -77377 5283 14177 -206332 -182822 -21644 27766 104994 340505 401813
22706 401813 44144 -51206 93893 -255450 -419971 -462800 -336937 -43940 24891 -112504
22696 -112504 -279508 -120626 -243643 -452484 -501481 -431532 -201034 -186195 26593 147924
22686 147924 241412 178266 125404 127487 212813 177498 55389 88539 112530 150020 127451
22675 127451 -14214 -179937 -247150 -84792 129490 -32223 -95660 -136417 -10985 75030
22665 75030 -31330 -337702 -550358 -448795 -356073 -103898 244693 505628 454381 235638
22655 235638 281733 147940 -7507 47327 113307 183334 192253 234570 122322 -65248 -169874
22644 -169874 -24273 297737 287891 325567 173468 98534 375232 245639 67424 95431
22634I5431J11533P2987j87133j84964J36769J93355n4144j28243K9687r3020
22624g742j56584K70087K51470j45127r8481l4544j00545m6433q721O1955j30788
22613a45453L670p304k54435k8078K16107J76502K70812L5456k37387n5889j17829
22602a43828k82599K04599M09979O540J53114J02227l13434o4970l8810n1227
22592a8409O7090L54994r0405k25357J37534J51783j65244j21744L0584p1621
22582D9205j40720J85303N7292k92981n1602J56552P9815J95366O3427j14594
22572A87063P6335K9039M6495k77664M2610J80400j52324j95519L5098J39164
22562A10697k34149n5626J67716J42596O6831N2884O2242n7459R1201o044j16382
$$ plain form
22634 95431 206964 279951 92818 -92146 44623 237978 183834 55591 85278 -7742
22624 -7742 -164326 105761 357231 212104 113623 79079 -21466 -67899 -76620 -14665 -145453
22613 -145453 -141783 -149087 -403522 -431600 -215493 -38991 231821 267277 29890 -25999 -143828
22602 -143828 -426427 -221828 188151 194691 347805 450032 136598 71628 32818 -18409
22592 -18409 48681 403675 313270 87913 225447 377230 211986 90242 120826 49205
22582 49205 -91515 93788 151080 -141901 -193503 -36951 42864 238230 301657 187063
22572 187063 263398 292437 338932 61268 103878 284278 131954 -63565 -28467 110697
22562 110697 -123452 -179078 -11362 131234 198065 250949 313191 255732 346933 340889 224507
22551B24507q5793J22200r9034l00368j21849K02860K08142J67049j45463j58986
22541A3265N2565J43170L9721m7801k0050n7168J53887j76728p8283L22193J02525
22530D47296l87369j08561R3216q4147j41427J77727K19403J70098k09261o2900
22520A14075J10695N7472j31110k72083P1549J76252k3233K6124r8722j51788
22510a20769J00782J80053P5987K79361n6732n0034j27690k01698l36014m3183
22500b99937o9881R1228L29091r1531n1775R3611J62754L6786l11505j71911L5375
22489b47695J02498J08996j8906m564l11471J86531J20541M0186m1783N5981k7195
22478c6881M3975O7745r5654j76647J17140j31498j09806Q8938m2383N6902M2739
$$ plain form
22551 224507 138714 260914 161880 -138488 -260337 -57477 150665 317714 172251 13265
22541 13265 65830 209000 248721 200920 180870 123702 277589 100861 22578 344771 447296
22530 447296 59927 -48634 44582 -39565 -180992 -3265 216138 386236 176975 114075
22520 114075 224770 282242 151132 -120951 -49402 126850 103617 129741 31019 -120769
22510 -120769 -19987 160066 236053 515414 458682 408648 280958 79260 -256754 -299937
22500 -299937 -369818 -278590 50501 -41030 -92805 806 163560 200346 -111159 -283070 -247695
22489 -247695 -145197 -36201 -55107 -59671 -371142 -184611 -64070 -23884 -65667 -9686 -36881
22478 -36881 7094 74839 -20815 -197462 -80322 -211820 -321626 -232688 -275071 -218169 -175430
22467a75430k15600j9863o7996Q2486K74995J70528J58962q8497K5852o528q437
22456A30472M3466j15018k37169l09928K83957J66084j79377P5324n4098J52460
22446d3827R3878j39298J23882K66726L16109k84612k83241M6430J39757j27549
22436A08255K6307L2754k08544Q1354K26860n0833L9000L6863j03931n953J5817
22425A97949j83202k19130k0699R8152K47384p3060k6252K34993r0661j14284
22415E1190p1625J11791J93503k97909N9306J32213L4313J61856J25756k19769
22405B80625j08889m1227N3669p9892P3033j05377j15532L11592j34035j71975
22395c8008j22997m3197J48415K03008J12263j10858o5717k3999j04714k46567
$$ plain form
22467 -175430 -391030 -410893 -478889 -396403 -121408 49120 208082 119585 145437 138909 130472
22456 130472 173938 58920 -178249 -488177 -204220 -38136 -217513 -142189 -196287 -43827
22446 -43827 50051 -89247 34635 301361 617470 332858 49617 96047 235804 108255
22436 108255 134562 167316 -41228 40126 266986 216153 255153 292016 188085 182132 197949
22425 197949 14747 -204383 -225082 -126930 120454 47394 21142 256135 165474 51190
22415 51190 -20435 91356 284859 -13050 46256 178469 212782 374638 500394 280625
22405 280625 171736 130509 184178 104286 177319 71942 -43590 268002 133967 -38008
22395 -38008 -161005 -204202 -55787 147221 259484 148626 82909 58910 -45804 -292371
22385b92371J8157R2850R753q0905P8714J377J88749K73339L5544l94440O4791
22374d442J41174R8728p6380l2537R0488j48757R2416m1652j35501j73461P2977
22363a16947N5965J98595j2868K8291J30659K05013k8868l02433j41220j02110
22353h5923J40353J27245n7356Q9046k0545j59848l3901P0557k7670J24904k7
22342A66835J23627J48419L0612l74877j43238p4245j1596J02922j39731j5006
22332a86278K24000J50177k42656l10910p9921J97530L47810N3516M4778p8386
22322A19660J00733o3776K10899o1772r3196K09928J71150j53017l16970j95703
22312g2064j32753n5899Q0218N5840k1676K27337K6369k24004j50034P5068K12316
$$ plain form
22385 -292371 -274214 -181364 -171611 -252516 -173802 -172425 16324 289663 325207 -69233 -4442
22374 -4442 136732 235460 159080 126543 217031 68274 160690 119038 -16463 -189924 -116947
22363 -116947 -60982 137613 124745 153036 283695 488708 459840 157407 16187 -85923
22353 -85923 54430 181675 124319 213365 192820 32972 -929 69628 41958 166862 166835
22342 166835 290462 438881 469493 94616 -48622 -122867 -134463 -31541 -171272 -186278
22332 -186278 37722 187899 -54757 -365667 -445588 -248058 99752 153268 198046 119660
22322 119660 220393 156617 367516 305744 212548 422476 593626 440609 123639 -72064
22312 -72064 -204817 -260716 -180498 -124658 -146334 81003 107372 -116632 -266666 -191598 20718
22301B0718r262j25534J48322L1994k65543j91350o7997n6538M880j7012J69909
22290c57413J61975k38475J92644J68507K12787J70386j04616J77337J29288j66726
22280C45694m3445m4602j25421L8174j74947p7733J34390M055k33252j75677R9531
22269b53233K2270J17772L8714L5937L398J19316k17427j0388K0756j35711J02405
22258a56191J92514K09034n8928J59634r1380K7030J38989j97604k84473p5241
22248a36616K39160m9868j59429J312p4623j37589R3871M21911k205k54609j82032
22237b40717j65839l7899J81153J83634J61604R9713K1705N2669R644P8789j97229
22226A47227j80658k5684K2074L5463j77385J6338J77244l3900K20780m0981N2334
$$ plain form
22301 20718 11456 -114078 34244 66238 -199305 -390655 -458652 -515190 -510310 -527322 -357413
22290 -357413 -195438 -433913 -241269 -72762 140025 310411 205795 383132 512420 345694
22280 345694 302249 257647 132226 170400 -4547 -82280 52110 56165 -177087 -352764 -253233
22269 -253233 -230963 -113191 -74477 -38540 -35142 84174 -133253 -143641 -122885 -258596 -156191
22258 -156191 36323 245357 186429 346063 254683 281713 420702 223098 -61375 -136616
22248 -136616 102544 52676 -106753 -105441 -180064 -317653 -223782 198129 195924 -58685 -240717
22237 -240717 -406556 -444455 -263302 -79668 81936 181649 203354 256023 265667 344456 147227
22226 147227 -33431 -59115 -37041 -1578 -178963 -162625 14619 -19281 201499 160518 212852
22215B12852m8314j01255m0758j53243L4449J04707o1702M5559J28892p8522J2935
22204E5600N0764k49732k07024j54462P136J48802N8693J78115K41743J54888
22194B84523j31910o6715m6161j0367J69090p6353m4187Q9963k19866m329Q1569
22183B5257J0642J24144k33377j41550J69284Q9299k05502M2046j81894k3698
22173c25349J8506J71625N8724K4900k924n1647l753j21371M798L9892j17922
22162c04521n3093j84272j32283k29087L91041K43215K9125J16906J05916n1967
22152f9020j7857L6653J02382j25278j75166r6722M3919J99746M9985l4509J2124
22141g3743j47555O8018k3342j10341r1393K67124J57367n44l870j101P4711k9077
$$ plain form
22215 212852 164538 63283 22525 -130718 -96269 8438 -53264 -7705 121187 42665 55600
22204 55600 106364 -143368 -350392 -504854 -497718 -348916 -290223 -112108 129635 284523
22194 284523 152613 85898 39737 29370 198460 122107 77920 167883 -51983 -56312 25257
22183 25257 35899 160043 -73334 -214884 -45600 43699 -161803 -119757 -301651 -325349
22173 -325349 -306843 -135218 -76494 -51594 -54518 -106165 -109918 -231289 -226491 -186599 -304521
22162 -304521 -357614 -541886 -674169 -903256 -512215 -269000 -239875 -122969 -17053 -69020
22152 -69020 -86877 -50224 52158 -73120 -248286 -345008 -301089 -101343 -51358 -85867 -73743
22141 -73743 -221298 -153280 -176622 -286963 -378356 -111232 46135 45591 41721 40620 115331 86254
22129H6254k22167k4591l8950j04183J94319J4986j18612M3904J39638L15397
22119B85995N5814L5351k78680k56687J40215J5175m577n4044J66162R332k90249
22108a76193P9271N8656k73558j38803L9623K70548N2296k7393L06830J21653
22098C12930l44201j25092K63830J0602J45562K36475K2165k2589k71291k16823
22088A1568j17832o0280L1580l5452R0733l4251j21144j16933m0826R4238M785
22077b93814L00100K05211J45000j21555o015k3993o6574k07607l20614K7795
22067c62066P5744J78665J64737o7135J86410K4240Q4014O1244j1103R728k31501
22056A12977l00873l07302J34682K68292J55239j57840j3469J74543R3089j16828
$$ plain form
22129 86254 -135913 -160504 -199454 -303637 -109318 -94332 -212944 -169040 -29402 285995
22119 285995 341809 377160 98480 -158207 -17992 -2817 -7394 -61438 104724 114056 -176193
22108 -176193 -96922 -38266 -311824 -450627 -411004 -140456 -88160 -115553 191277 312930
22098 312930 -31271 -156363 107467 118069 263631 500106 522271 499682 228391 11568
22088 11568 -106264 -166544 -134964 -170416 -79683 -113934 -235078 -352011 -392837 -298599 -293814
22077 -293814 6286 211497 356497 234942 228927 204934 138360 -69247 -389861 -362066
22067 -362066 -286322 -107657 57080 -10055 176355 200595 284609 345853 334750 344478 112977
22056 112977 -187896 -495198 -360516 -92224 63015 -94825 -108294 66249 159338 42510
22046D2510m4753k19460l5565J22704L5573j87248J58360J80182l4978o7867J68333
22035A17791J77140j53417k48746m3613R3053k0962J68137J8408J1814J9046Q9199
22024B27850o4209p2426M6678j8778P1449k45272p8635o5807j96350l3656O1779
22013c67377j2033J30675K32118k2038j5801n0469l60389j16630R0396j9160P2194
22002d38514L00372q8013m23856j20255K73575L09778J68350m3768n918K08132
21992A39883k08941n6351J77377J29125Q5753n7868k85949j43060P2169k3516
21982a71378J76294L19368k837M1659n9338k7428M886k29883l1584J72874M1522
21971B34155j60685j4630K8158n8127R9223N4814o4435o7598P2675J24692o5436
$$ plain form
22046 42510 -2243 -221703 -257268 -134564 -98991 -286239 -127879 52303 17325 -50542 117791
22035 117791 294931 141514 -107232 -150845 -57792 -78754 89383 107791 119605 138651 227850
22024 227850 163641 91215 137893 119115 190564 -54708 -133343 -199150 -395500 -429156 -367377
22013 -367377 -379410 -248735 -16617 -38655 -54456 -104925 -465314 -581944 -491548 -510708 -438514
22002 -438514 -138142 -226155 -650011 -770266 -496691 -186913 -18563 -62331 -68249 139883
21992 139883 -69058 -125409 51968 181093 266846 208978 -76971 -220031 -147862 -171378
21982 -171378 4916 324284 321447 363106 303768 276340 281226 51343 19759 192633 234155
21971 234155 73470 58840 86998 28871 128094 182908 118473 50875 123550 248242 182806
21960A82806j74329M7627L1642L1054j39459R98k50261j3511o36J25064L20681
21949A61676R6767j24595r8225k7208j8120m0641p7017j82676J9225L46313M800
21938F0299k5020O8997n9801m4873M3639k7524L5745J20407J9600k53488j21023
21927a83042K1284P6133J47387J14763k09552j74961L03437k7567k23171j39729
21917b95018j99746J85295J76540m8591j49597J2135o4349J44711j53242j29394
21907e21256j13019j33501J1642o4739K21779K11889R8336J39173K61606j85600
21897g3690p2778L7486l7538j29386P0660J87931L27368j05938J76411K24158
21887F04684k65920j67841k5179j54931k18829o7536R5789K05025N8764o7231
$$ plain form
21960 182806 8477 56104 87746 118800 -20659 -19661 -269922 -283433 -284069 -159005 161676
21949 161676 258443 133848 35623 8415 -9705 -50346 -127363 -310039 -290814 55499 60299
21938 60299 35279 104276 44475 -398 43241 15717 51462 171869 191469 -62019 -183042
21927 -183042 -161758 -85625 61762 176525 -33027 -207988 95449 67882 -155289 -295018
21917 -295018 -494764 -309469 -132929 -181520 -331117 -318982 -383331 -238620 -391862 -521256
21907 -521256 -634275 -767776 -756134 -820873 -599094 -387205 -288869 -149696 111910 -73690
21897 -73690 -146468 -108982 -146520 -275906 -205246 -17315 310053 204115 380526 604684
21887 604684 338764 170923 145744 -9187 -228016 -295552 -199763 5262 64026 -3205
21877c205j218K7857j06301o5717M8171J00445Q9552q2148J70756k787l63071
21866a87666P4259l2237K5695J26273R8897K74443m080k89642p6608n7250m9650
21855i7566L50986J08012l76023k15398J92970Q162J25571M6110k37059j41736
21845b35971J95755L32529n0445n9069j15737K5151K6276j52676n1672j92631
21835b78490N8209J31049N8967J9084P3306J32597l5478R1307j65689k94696N9991
21824a49843J93700k968k8866J74905k6374j49586j36298j01236K9251j9088J79949
21813c6454K70606K18703j35539M3054J5221k40966r2624J31271R693p255J0190
21802A85900L9971J37530n9022k73263L8659R9988j70395l5287K16298k0418k77007
$$ plain form
21877 -3205 -4423 23434 -82867 -148584 -100413 32 89584 7436 178192 175405 -187666
21866 -187666 -113407 -145644 -119949 6324 105221 379664 375584 85942 9334 -47916 -97566
21855 -97566 253420 361432 -14591 -229989 -37019 -28857 96714 142824 -94235 -235971
21845 -235971 -40216 292313 241868 182799 67062 92213 118489 -34187 -85859 -278490
21835 -278490 -220281 -89232 -30265 -11181 62125 194722 159244 250551 84862 -209834 -149843
21824 -149843 43857 40889 12023 186928 160554 10968 -125330 -226566 -197315 -216403 -36454
21813 -36454 234152 452855 317316 360370 375591 134625 42001 173272 182965 175710 185900
21802 185900 225871 363401 304379 31116 69775 169763 -632 -35919 180379 159961 -117046
21791a17046M1909j5748M7281K2266N9618J6056j1858q960P006R4194j00858n3570
21779a9710J35163O8202L7182j25439j63736l8470j0010J69245l4926J8539N733
21768D1773p2062j99924j5612j68491J47858J05347J50892m5495J03616l2644
21758A5258l2919J08294J20627K00586J28706k51358k11561J10220j0754k62610
21748h5511o3571R4322o5910j34200J88799P9932k79432q6785K60595j28368p5260
21737b95389J93082o0272o6386R4320l0029l0549J04937K34149J56021o4991j53179
21726H1714j32062J48771J4380M783k26779o7087j0924R8282n7933P1601J53927
21715G8673J14408l7326K20363P057j01530l37625R6709L4874j58945K20964L11004
$$ plain form
21791 -117046 -75137 -90885 -43604 -21338 38280 54336 42478 33518 40524 134718 33860 -19710
21779 -19710 115453 183655 220837 95398 -68338 -106808 -116818 52427 17501 36040 41773
21768 41773 -30289 -230213 -245825 -414316 -266458 -161111 -10219 -55714 47902 15258
21758 15258 -17661 90633 211260 411846 540552 289194 77633 187853 177099 -85511
21748 -85511 -149082 -54760 -120670 -254870 -66071 13861 -265571 -352356 -91761 -220129 -295389
21737 -295389 -102307 -162579 -228965 -134645 -164674 -195223 -90286 143863 299884 234893 81714
21726 81714 -50348 98423 112803 117586 -109193 -176280 -187204 -88922 -146855 -75254 78673
21715 78673 193081 155755 376118 383175 281645 -55980 40729 75603 -83342 137622 448626
21704D48626J2259O984k58357r0426j99930j85790j01352J49019K5658J46321
21694d6988N2117j5108Q2260m542Q7646r2792o0238K08602j32681L431j07893
21683b6186j59727j46524J28207l2083N2518J6802P4380N6853n5418K5239K11857
21672A45918q1058k29016M8841L5974j1898R8196J38408N0362o7145r0787J29217
21661A67012Q7773N0670J61296l5932j73240j74831j10085j813L9758r3171o9691
21650a52254j11428K9528J39641j52402r8754K27752L6994j21030o1679n5973
21640c19605m5425k5659l9670l7570K18926K20893K05530j47608P3763j6062j51395
21629f3882j20843J38962j6869J0686k5177l2384J65161M6332J8078J13105Q6735
$$ plain form
21704 448626 460885 467869 209512 119086 -80844 -266634 -367986 -218967 -193309 -46988
21694 -46988 5129 -9979 72281 67739 155385 62593 2355 210957 78276 81707 -26186
21683 -26186 -185913 -332437 -204230 -236313 -183795 -166993 -92613 -35760 -91178 -65939 145918
21672 145918 64860 -164156 -115315 -79341 -91239 6957 145365 195727 128582 37795 167012
21661 167012 254785 305455 466751 430819 257579 82748 -27337 -29150 10608 -82563 -152254
21650 -152254 -263682 -234154 -94513 -246915 -345669 -117917 -80923 -201953 -263632 -319605
21640 -319605 -365030 -390689 -430359 -467929 -249003 -28110 177420 29812 103575 87513 -63882
21629 -63882 -184725 -45763 -62632 -51946 -77123 -109507 55654 101986 120064 233169 319904
21618C19904o3026o2127o0605k73593m528J74204K36864O0329p0216N2999j28808
21607A81397j17348Q8651j24886J87413p0813j90988j26948j808J05804J94847
21597A25321Q5608J04814J6851M8156j47866R36j183k24089r2927M8989J12188
21586G6798K6916o9924m5843o1244l0665J12157J62232j84740j64074k2874M3629
21575a57632J61615K21349K86373O9709k49756j79642P9726j12694Q6963l12217
21565a06206k52625J49926K35200o396K04861Q723l17773J60180J93968j87382
21555H2476N6821M8725L446R2238p6787j79059k05446j41026J66917J91210k3358
21544A6157j78470J4405Q5911n7079j19881J50746J49926j08118O8468j38628
$$ plain form
21618 319904 256878 194751 134146 -139447 -143975 30229 267093 327422 257206 310205 181397
21607 181397 64049 152700 27814 215227 144414 -46574 -173522 -175330 -69526 125321
21597 125321 210929 315743 332594 380750 232884 233820 232637 8548 -84379 -35390 76798
21586 76798 103714 33790 -12053 -73297 -103962 8195 170427 -14313 -178387 -201261 -157632
21575 -157632 3983 225332 511705 581414 331658 152016 231742 119048 206011 -106206
21565 -106206 -358831 -208905 26295 19899 224760 233483 -84290 75890 269858 82476
21555 82476 139297 188022 191468 283706 206919 27860 -177586 -318612 -151695 39515 16157
21544 16157 -162313 -147908 -61997 -119076 -238957 -88211 61715 -46403 22065 -116563
21534a16563j64553P519K25976m7217O8335q561J09749J73751M7556k562j17152
21523A76278Q60J18763j14105j60210j09804o4904k18092r826j40807J87548J05647
21512b28652J38969R2159n4039O1454M6799K29347o8039m46698N946N3555J4348
21501a54851k8183q5791K38576L72475N8014k3400p5703O882j60216k09648m8816
21490a10661R7448r6796p2707J44612j85451j28809M898J83000J23767J67583
21480A26884K96626j21353j44692j38418l4210q2819k95J02994j4509J1480j52344
21469a50656K50205J59020O5745p7086j14299m433r7135R7539J37679j9516K3577
21458B70640J28541qq0374j90426m0787p7363Q2562l0275j03398R7007Q3019k88129
$$ plain form
21534 -116563 -281116 -273597 -47621 -94838 -26503 -35064 74685 248436 295992 293430 176278
21523 176278 177138 295901 181796 21586 -88218 -153122 -371214 -381040 -521847 -334299 -228652
21512 -228652 -89683 2476 -51563 9891 56690 286037 217998 -228700 -222754 -169199 -154851
21501 -154851 -183034 -268825 -30249 342226 400240 376840 301137 308019 147803 -61845 -110661
21490 -110661 -13213 -110009 -182716 -38104 -223555 -352364 -347466 -164466 -40699 126884
21480 126884 423510 302157 157465 19047 -15163 -97982 -98277 4717 -9792 1688 -150656
21469 -150656 99549 258569 324314 247228 132929 128496 31361 128900 266579 247063 270640
21458 270640 399181 399173 318799 128373 87586 10223 92785 62510 -40888 56119 139138 -148991
21446a48991m7282j07769l74328J90392L18642M7989k60192j40603K81123j0163
21436b51182J45932n0053k59367j69487l4195J30316K06004j208J17445J05034
21426f0761o0697l00610J42971J12245o9474L05560K0816k44853J72798P7855
21416I5850j12777j55991j91682K2564J92736j47769J14109j33951q2997K15978
21406a83930M787L9296L20731k25074o126K17361m1172j09244Q0211N6293J29066
21395B82199P1775J1918k68108k80697j2919J11666L24851K74998j53979m08392
21385d6688j3731L94550j95933k23253K12353K5431j64143K20090J1658r1474
21375A28860j36890j36121o0267J51183K24105J45663k3780n1395Q1670k94378
$$ plain form
21446 -148991 -196273 -304042 -678370 -487978 -169336 -121347 -381539 -522142 -241019 -251182
21436 -251182 -105250 -155303 -414670 -584157 -618352 -488036 -282032 -283240 -165795 -60761
21426 -60761 -121458 -422068 -279097 -166852 -236326 69234 90050 -154803 17995 95850
21416 95850 -16927 -172918 -364600 -342036 -149300 -297069 -182960 -316911 -399908 -183930
21406 -183930 -179143 -139847 180884 -44190 -50316 167045 125873 16629 96840 153133 282199
21395 282199 353974 365892 97784 -182913 -195832 -84166 240685 515683 361704 -46688
21385 -46688 -60419 334131 138198 -85055 127298 152729 -11414 208676 220334 128860
21375 128860 -8030 -144151 -204418 -53235 170870 316533 292753 241358 323028 28650
21365B8650q1152J41169m1333J10976J98448k09782l1138j40548k35777J97344
21355f3143Q5362l4313p9140J05275L4894J6822o30k70783k11904P1081J13453
21344b33026J857L04205P0021q7182q6135L73584K5982k40480k0409k03801r523
21333a04907K8811J05836L4316j63379O0738K10475J24086l10461k57194J88843
21323h2836n3156k2966q3322r5132m566k17007R3838K53037L7417J02293m1504
21312a13904p2384m2826k862K32129M4979j45585r8982j48809J41602L04925j26292
21301b8009p5317K9975Q2707j39853j64287j13309J2667N1144K3705L64354M8833
21290I2610O679K13695j23761j44169j64021J37899J70992j66101l43590j61686
$$ plain form
21365 28650 -52502 88667 47334 158310 356758 146976 115838 -24710 -260487 -63143
21355 -63143 22219 -12094 -91234 14041 48935 65757 65127 -205656 -417560 -346479 -233026
21344 -233026 -231169 73036 143057 55875 -30260 343324 369306 128826 108417 -95384 -104907
21333 -104907 -76096 29740 64056 -99323 -38585 171890 295976 -14485 -271679 -82836
21323 -82836 -135992 -158958 -242280 -337412 -341978 -558985 -465147 -212110 -174693 -72400 -113904
21312 -113904 -186288 -229114 -231976 153 45132 -100453 -199435 -348244 -206642 98283 -28009
21301 -28009 -103326 -73351 9356 -130497 -294784 -408093 -395426 -344282 -320577 43777 92610
21290 92610 99289 312984 189223 45054 -118967 18932 189924 23823 -319767 -481453
21280d81453N4383J15823N2293J63512J29771j77298j11282j17708j58941J5905
21270e14995J94799m616J75571J92392j93978j50766J49872J06052J56763q6629
21260B4465l88310m977o0293J93874K16513j31988n9655j841j71006K24093n8195
21249b17320k68949P0060O0656K0031J49788Q9903p7628K56749K10532m9769j57376
21238H6677j03679q5542J9796l21382R048N3278j17361j00970j73160r7547K28615
21227f02227K78609J68413J27408J05650k59268J514k2994Q5916J18464m1580
21217d0095q48j45346P3635r9453j08902J04160j37342R5572O6707P1701k598
21206a22809o6140M3597Q9136J29670j22676r342L4794J34110j05935k49365j02321
$$ plain form
21280 -481453 -427070 -311247 -258954 -95442 34329 -142969 -254251 -371959 -530900 -514995
21270 -514995 -320196 -324812 -149241 43151 -150827 -301593 -151721 -45669 111094 24465
21260 24465 -363845 -368822 -429115 -235241 -18728 -150716 -210371 -212212 -383218 -159125 -217320
21249 -217320 -486269 -416209 -355553 -335522 -185734 -95831 -173459 83290 293822 244053 86677
21238 86677 -17002 -102544 -82748 -404130 -395082 -341804 -459165 -560135 -733295 -830842 -602227
21227 -602227 -323618 -155205 -27797 77853 -181415 -179901 -202895 -116979 1485 -40095
21217 -40095 -40943 -186289 -112654 -212107 -321009 -216849 -354191 -258619 -191912 -120211 -122809
21206 -122809 -188949 -145352 -56216 73454 -49222 -58564 -23770 110340 4405 -244960 -347281
21195c47281N3353J16554p8304J15480J05904j51086m0343J30566K7992J46736
21185G9571J71481p4903j30236r7486j06593r5046J06299J59722q3598j80809
21175b51598J17089L22248Q4497K27885j649q5299R4869j24885n7215k30491r5840
21164c89j02461O8131M8994N5403j19323K33020J09183p7399M3195J11062j82796
21153A86620J05302K52695n0380p7047j27487k36811j45562J3495L1775J62164
21143A14764J16045j09598o3485J18467J9877j59165p1264Q3206l22856q226j8299
21132c00534L7813O0655K36988J48647k38099r551L07030M9177n2992K85028L707
21121E27869k75018J9842o5673k42145o8200N9042O3766j08754j13827j34884
$$ plain form
21195 -347281 -293928 -177374 -255678 -140198 -34294 -185380 -225723 -95157 -67165 79571
21185 79571 251052 176149 45913 -51573 -158166 -253212 -146913 12809 -70789 -251598
21175 -251598 -134509 187739 272236 500121 498472 413173 508042 383157 325942 95451 -389
21164 -389 -102850 -34719 14275 69678 -49645 183375 292558 215159 258354 369416 186620
21153 186620 291922 544617 494237 417190 289703 52892 -92670 -79175 -47400 114764
21143 114764 230809 121211 57726 176193 196070 36905 -34359 48847 -274009 -282235 -300534
21132 -300534 -262721 -202066 34922 183569 -54530 -64081 242949 292126 239134 524162 527869
21121 527869 252851 272693 207020 -35125 -103325 -44283 19483 -89271 -203098 -337982
21111c37982O8893J5225N4473N8528M975L72161J10313k06485R458L7626k24110
21100c6925l67785Q7736R9123j09875Q6075J11877j63230J60819J37883J23151
21090A28849L7820o8267j03228j42857J30002O9048j01500J55718J25975j6927
21080B14633O702j81976j49907K05704J42253o5510L8399K60077j07505l00312
21070F2558j84126k83427j01540L7521J93122J88490N7143M1700J0163p1175Q1130
21059C1559j28738j01938q0552l648J60009P7747k32952j35805M8805J58968J6540
21048a90005P7633r7500k47660R3906L28452J01607m1187l9862j00454J48994
21038C3924P9213j16384p9200j0574j31857R7229O1681k00231K56827K03059j61537
$$ plain form
21111 -337982 -269089 -253864 -199391 -140863 -135888 236273 346586 140101 149559 187185 -36925
21100 -36925 -404710 -316974 -217851 -327726 -241651 -129774 -293004 -132185 5698 128849
21090 128849 166669 98402 -4826 -147683 -17681 51367 -50133 105585 231560 214633
21080 214633 221335 39359 -110548 95156 237409 171899 210298 470375 362870 62558
21070 62558 -121568 -404995 -506535 -469014 -275892 -87402 -30259 11441 21604 -49571 31559
21059 31559 -97179 -199117 -279669 -283317 -123308 -45561 -278513 -414318 -365513 -206545 -190005
21048 -190005 -112372 -209872 -457532 -363626 -35174 66433 25246 -14616 -115070 33924
21038 33924 113137 -3247 -82447 -93021 -224878 -127649 -65968 -266199 -9372 193687 32150
21027C2150j23744N1612l9053j18530m4977R8519O9953r5903P0397J3358n8848
21016a45066O155J14934J21908j17662q1109J99214P2656J03858m713K6142J4542
21005C10859p8626N8283n61677p4646L43484j24705j25229k44564m254J18888
20995c82187K54494K05187J49229K55061j1207o5430k43397j87356Q0462j47040
20985i2184j76073L4334O3396L71634P0778k5175n5920P9488q9702p9276M3928
20974A45228K60519l10067m24423J10408K59404j32357k85995r9899j41798N0457
20964e68523L1631L0280L8040J47610n0439O8550K05252O0088J56321j64193J86
20953d5197N9817k13447j31325r1959N8232J51870J56810K8147o0186k88023n8269
$$ plain form
21027 32150 -91594 -39982 -79035 -197565 -242542 -144023 -74070 -169973 -99576 -86218 -145066
21016 -145066 -138911 -23977 97931 -19731 -100840 98374 171030 274888 270175 296317 310859
21005 310859 232233 290516 -271161 -345807 -2323 -127028 -252257 -496821 -501075 -382187
20995 -382187 -127693 77494 226723 481784 470577 405147 161750 -25606 54856 -92184
20985 -92184 -268257 -233923 -170527 201107 271885 246710 190790 270278 180576 101300 145228
20974 145228 405747 95680 -328743 -218335 41069 -91288 -377283 -477182 -618980 -568523
20964 -568523 -536892 -506612 -468572 -320962 -371401 -302851 -97599 -37511 118810 -45383 -45197
20953 -45197 14620 -198827 -330152 -422111 -363879 -212009 -55199 -27052 -87238 -375261 -433530
20942d33530J00976r4205P0785L20715Q9018J0201J31515j10210K21065Q1630
20932C87960k26116N7477P2191k05672p399J9534L6206l5185j29045j41779j38679
20921c10507J52921K97136J20216j71315N1885K9375k01346n9910l5712Q0073
20911d7184J05554M2861j64480j01751j0591J47030j47498j69316K43683n3703
20901a55395o0381J54813J68889J44575r6155q0625j0646J20327j50896N1614
20891H6120P3745O0050l97602k00315Q6571L40731L07278L6552J5148k15921j40135
20880E2222j14927l4279o5966j36018k0576K10540K84868l3752j15296J68798
20870A95614o6795n7680J79141k00687r4884O8252l3482M223K03415l067k01567
$$ plain form
20942 -433530 -332554 -426759 -355974 -35259 53759 63960 195475 85265 306330 387960
20932 387960 161844 219321 291512 85840 78441 97975 134181 98996 -30049 -171828 -310507
20921 -310507 -157586 139550 259766 88451 140336 169711 -31635 -91545 -127257 -47184
20911 -47184 58370 101231 -63249 -165000 -175591 -28561 -176059 -345375 -101692 -155395
20901 -155395 -215776 -60963 107926 252501 156346 75721 65075 185402 34506 86120
20891 86120 159865 219915 -177687 -378002 -291431 49300 356578 393130 408278 192357 52222
20880 52222 -62705 -96984 -162950 -298968 -319544 -109004 175864 142112 26816 195614
20870 195614 128819 71139 250280 49593 -45291 22961 -10521 -6298 197117 194050 -7517
20859g517j39326j68227r9980p2705K3146J33891J95364J46714K25901j41307
20849I5954j43756j19450j88295k96253o2995K3480L77789J89680Q1033q008j26913
20838a77734J66148q3597o0287M3091J05499M0769L22953k5034j01782Q7902M1909
20827C59837p1380j39835n8261l22331m47643j33519J4274N47679L27044q4171
20817h306n6251k47275q6285J22659K3514J05663K96591o4538k62011k8703l5366
20806b40308n4277k0801K62847l527k06830Q7952J55761L9594m08887l2297Q1228
20795c39545K3235P9611J58156J13355J58095m429m3999n3383q6495r6803L7650
20784e4552R4894J84347k13954P8805K9034j50572J7774N2144q6896j47554J29258
$$ plain form
20859 -7517 -146843 -315070 -415050 -487755 -464609 -330718 -135354 11360 237261 95954
20849 95954 -47802 -167252 -355547 -651800 -714795 -691315 -313526 -123846 -42813 -50821 -177734
20838 -177734 -11586 -95183 -155470 -112379 -6880 33889 356842 331808 230026 317928 359837
20827 359837 288457 148622 90361 -231970 -679613 -813132 -798858 -251179 75865 -8306
20817 -8306 -64557 -311832 -398117 -275458 -251944 -146281 150310 85772 -176239 -204942 -240308
20806 -240308 -294585 -315386 -52539 -56066 -262896 -174944 -19183 20411 -388476 -420773 -339545
20795 -339545 -316310 -236699 -78543 34812 192907 188478 144479 91096 4601 -92202 -54552
20784 -54552 40342 224689 10735 89540 118574 -31998 -14224 37920 -48976 -196530 -67272
20773f7272Q9461j6705r9980J47946M5273j574J2116p475J52242j81413j54993
20762h2374k20652M0747n1384j27259o7645R2190M6799O9282J8404J01990J28399
20751e1503j6060L26871J06104r1901j26694j56113l2232J57609q3877j844J4482
20740D4842j95874o4963n9774P7856J31893K11675p3290l356J76684r1974r7280
20729E6439Q2781J08141q1931J3927K0366l4551J76067K63365J67453r6559j08409
20718E67089l20536o3358l2869j07622j97595j58921l13012r0000K15013L78952
20708a22859K29633k9210k38494O5128K43167R9331k57215o6694K3625K33014
20698A79426K03714O7720k57591k02475K00120J7467l8031j67976m4565j68408
$$ plain form
20773 -67272 22189 5484 -94496 53450 98723 97149 109265 101790 254032 72619 -82374
20762 -82374 -303026 -262279 -313663 -440922 -508567 -416377 -369578 -300296 -281892 -179902 -51503
20751 -51503 -67563 259308 365412 273511 146817 -9296 -41528 116081 32204 30360 44842
20740 44842 -151032 -215995 -275769 -197913 -66020 145655 72365 69009 245693 153719 56439
20729 56439 139220 247361 165430 179357 199723 165172 341239 604604 772057 675498 567089
20718 567089 246553 183195 150326 42704 -154891 -313812 -626824 -716824 -501811 -122859
20708 -122859 106774 77564 -160930 -95802 147365 246696 -10519 -77213 -53588 179426
20698 179426 383140 450860 193269 -9206 190914 208381 170350 2374 -42191 -210599
20688b10599j25816L3032J86436K69589J09339M4565N2431L2507k58887j41561
20678h964R128J75214o0386l23358r2445L75369K93047j64619j02871l07718j99400
20667d07003Q3369K74385p7090N6087R9426J21906l883l3349o3580J5233j15348
20656d9847p4636n807N3746K91423r1575l01898N0535j4533J64507L8440j43981
20645h3626j1008J503P185o9591L6196J53329J59359K2026l8476l93462j26682
20634c43247K78517K95251o9046j07299j63069O5394m5335J92330m3404Q5579
20624A45671j4731k3786r7089N0976j10345k39149j73657K4790l0452O4140K10941
20613a92691M16249M383R8047m4121k95818k21215l33966O4968Q4526K58385R2633
$$ plain form
20688 -210599 -336415 -303383 -116947 152642 261981 306546 358977 391484 132597 -8964
20678 -8964 164 175378 114992 -208366 -300811 74558 367605 202986 100115 -207603 -407003
20667 -407003 -323634 -49249 -126339 -70252 29174 151080 147197 113848 50268 65501 -49847
20656 -49847 -124483 -130290 -76544 214879 123304 -178594 -128059 -142592 21915 60355 -83626
20645 -83626 -94634 -93131 -85946 -155537 -119341 33988 193347 215373 176897 -216565 -343247
20634 -343247 -64730 230521 161475 54176 -108893 -43499 -88834 103496 60092 145671
20624 145671 130940 107154 10065 61041 -49304 -288453 -462110 -437320 -467772 -403632 -192691
20613 -192691 223558 227941 325988 281867 -13951 -235166 -569132 -504164 -419638 -161253 -68620
20602f8620J1486J01758Q7398k40139O2188K30648N0450q8107n4598Q0855J8811
20591A92130j03435j99041r4758N8080N3047O515j2810m4312J96648J51208l53514
20580a50242p7052J1783L45720N9520R8674q4148k66709q2214o2086r844J23691
20569i2907J65539J3541K29142m3383k09554l1400J76631j0422r9947j95029m5464
20558a43253p0108M3364j8427K51423k9132J2007l3016q1528q3187n9815K1191
20547a90481o4199j7293K63424O5946r6264r694q9669j88861j40008J68n9126
20536e26057N0085O3181J42065Q3001P6021O332k55601p7247R1921J0290O0931
20525b75078j9741J38636J57296p5353k1170K8510j686K3137P3649q9227r9861
$$ plain form
20602 -68620 -57134 44624 132022 -108117 -45929 184719 235169 147062 92464 173319 192130
20591 192130 88695 -110346 -205104 -147024 -93977 -87462 -100272 -144584 52064 203272 -150242
20580 -150242 -227294 -215511 130209 189729 288403 204255 -62454 -144668 -206754 -216598 -92907
20569 -92907 72632 86173 315315 271932 62378 30978 207609 197187 97240 -97789 -143253
20558 -143253 -213361 -169997 -188424 62999 33867 45874 12858 -68670 -151857 -211672 -190481
20547 -190481 -254680 -271973 -8549 57397 -38867 -48561 -138230 -327091 -467099 -466931 -526057
20536 -526057 -475972 -412791 -270726 -187725 -111704 -105372 -360973 -438220 -346299 -336009 -275078
20525 -275078 -294819 -156183 1113 -74240 -95410 -66900 -68586 -45449 28200 -61027 -160888
20514a60888K17407R1041k12099O7647K93753j21525q4619k59448j768K0238J72089
20503B1828O0308Q7145j25886k86839K2464L8425J63704k01004k28495L92568
20493e5782K20020K52697k76529p6725J50998J66310p0687n3958k12890q2447
20483c8993K8172N608J26854m8479j22043J74528p4097j0362n6753j9937k570
20472c8072j51389j06532j17750J40851M33226Q6404m0370K68997k11730r8724
20462A64911j41163j07784J10097L6723K5278j829P134J15292k59698j82534K39259
20451E686K5075o9365n8692K09679k0430k95382Q1540Q5247J10101j52404p9508
20440a58453O1935k4553M0279j36858O1693J2671l3353K7908N1052J51476L3407
$$ plain form
20514 -160888 56519 147560 -64539 3108 296861 175336 90717 -168731 -170499 -150261 21828
20503 21828 82136 169281 43395 -243444 -220980 -182555 -18851 -219855 -448350 -55782
20493 -55782 164238 416935 140406 63681 214679 380989 310302 256344 43454 -38993
20483 -38993 -10821 -5213 121641 73162 -48881 125647 51550 41188 -15565 -35502 -38072
20472 -38072 -189461 -295993 -413743 -272892 160334 246738 206368 475365 263635 164911
20462 164911 23748 -84036 26061 62784 88062 86233 93367 208659 -51039 -233573 5686
20451 5686 30761 -38604 -97296 112383 91953 -203429 -121889 -36642 73459 -78945 -158453
20440 -158453 -96518 -121071 -80792 -217650 -155957 -143286 -176639 -148731 -97679 53797 87204
20429H7204j22571m29573K25505J55020J83380r3853K7168q869N6669k41335k19633
20418c80888J24767N0586j0028N0302O2781k23650j48313K35765K06348N7356
20408B5026j64564j50234m4019j41215j6730J49201K67166o9037j31396J26471
20398a49331j2083K54314K23907l46652k30132J30539K87177l7898j19380J85622
20388A86083J16518J07362k53677k04205K70242N3626k19447j3577k36144l05703
20378d98922j4790K18640J69980K58662j24407p1236N2279P0708J00536p0077
20368I1373j64819l8821k87663k07029J16142K3265K50251K64353M2912q5012
20358D952j34649J34557Q8966k60825l69998k4027M09887K37932j10364j70405
$$ plain form
20429 87204 -35367 -464940 -239435 -84415 98965 5112 32280 23411 80080 -161255 -380888
20418 -380888 -256121 -205535 -215563 -165261 -102480 -326130 -474443 -238678 -32330 25026
20408 25026 -139538 -289772 -333791 -475006 -491736 -342535 -75369 -144406 -275802 -149331
20398 -149331 -161414 92900 316807 -29845 -259977 -129438 157739 119841 461 186083
20388 186083 302601 409963 156286 -47919 222323 275949 56502 42925 -193219 -498922
20378 -498922 -513712 -295072 -125092 133570 9163 -62073 -9794 60914 161450 91373
20368 91373 -73446 -112267 -399930 -606959 -490817 -467552 -217301 47052 89964 4952
20358 4952 -129697 4860 93826 -166999 -536997 -561024 -151137 86795 -23569 -193974
20348a93974M6042m1416j37472J13179J82949K6866K51427J02642j4993J33796
20338D69046k365k63130l13152K303J03326J06500j81551J00465J22936J3466
20328A57844k51972j94139K08420p3570k02307M9356J25641o0374K64628J18127
20318A41654j6512q2832O7704j03735k19394M8725J45189J50r3305M1937n021
20307g5440r0033j45854J83303K32024j52723Q4085Q3433J57905J11060j98301
20297A89459j96350j14733j09833K33090K57046O4110K3135J55063k56339o235
20287B38413o921j46375k2378q445j5018J15407L7642J30l7341J88291J10020
20276D53425k29351k09651J96926J90473r9836j51185n3174J57227j39479O3099
$$ plain form
20348 -193974 -147932 -189348 -326820 -213641 -30692 -3826 247601 350243 335250 469046
20338 469046 466681 203551 -109601 -107298 -3972 102528 -79023 21442 144378 157844
20328 157844 -94128 -288267 -79847 -153417 -355724 -306368 -180727 -241101 23527 141654
20318 141654 125142 42310 110014 6279 -213115 -164390 -19201 -19051 -112356 -70419 -75440
20307 -75440 -165473 -311327 -128024 104000 -48723 35362 118795 276700 387760 189459
20297 189459 -6891 -121624 -231457 1633 258679 322789 345924 500987 244648 238413
20287 238413 231492 85117 62739 54294 39276 154683 192325 192455 155114 343405 453425
20276 453425 224074 14423 211349 401822 301986 150801 97627 254854 115375 178474
20266A78474q1489k04326l302j4072K17637M7433p2051N1336j62781j9095J34260
20255G2024j06446k01405O0408M3006L38753J47872J18098j74896r744j81726
20245A05944j45397J48427o6972j34403L5240m4380l4116j36795q7789J02685
20235b57556l963L1802J41691J18439J26580o4793k01849L0320J14809l850K1874
20224E3504j42320j51356o9372j1232r285L26582J03979l33846j07183j07344
20214d47873Q3821O4278P6687K02817M2962r3375j69168M8612K30593J5800P8226
20203A33380J43123j4188m5049P6779O625J16277k8797k9578j67240k59499j56651
20192b24818j22284J20943O3842J78542L19835J32877l19298j6458k37830J293
$$ plain form
20266 178474 96985 -107341 -110643 -124715 92922 140355 68304 119640 -43141 -62236 72024
20255 72024 -34422 -235827 -175419 -132413 206340 354212 472310 297414 287670 105944
20245 105944 -39453 108974 42002 -92401 -57161 -101541 -135657 -272452 -360241 -257556
20235 -257556 -261519 -229717 -88026 30413 156993 92200 -109649 -79329 35480 31630 53504
20224 53504 -88816 -240172 -309544 -320776 -330061 -3479 100500 -233346 -340529 -447873
20214 -447873 -364052 -299774 -223087 -20270 22692 -70683 -239851 -191239 39354 55154 133380
20203 133380 276503 262315 217266 294045 300670 416947 388150 358572 191332 -68167 -224818
20192 -224818 -347102 -226159 -162317 16225 336060 468937 149639 133181 -104649 -103356
20182a03356P3453J3236j09179j03325L1775L2871N1467K90906r4345j27066J23743
20171H0180O6902k01818l961J18506J41780m664K50426K80674J18475k25702j18425
20160E02373j92004j19363k07666O7619K06717j82304k20006K01905K6907N6143
20150A40321p9525j23955n5004p8536k18574J98890J27894j0764K7214J94173
20140A22134K25086J39242k1085K4337J0687j03243j40422L406o0816l2968J1029
20129A77387P989k3964k03119j9612k23414j27165r26J47031o385J61211J17102
20118F135J27732J26088Q1954m00242l83808N294O5539K17043l7325M3445l790
20107a51935k63503J28092o9864L5327J78938M8317j32360N0069j6435k49575
$$ plain form
20182 -103356 -29903 -16667 -125846 -229171 -197396 -164525 -113058 177848 83503 -43563 80180
20171 80180 147082 -54736 -58697 59809 201589 196925 447351 728025 846500 620798 502373
20160 502373 310369 191006 -16660 50959 257676 75372 -144634 57271 84178 140321
20150 140321 60796 -63159 -118163 -196699 -415273 -216383 -88489 -99253 -72039 122134
20140 122134 347220 486462 465377 489714 500401 397158 256736 260142 199326 166358 177387
20129 177387 185376 161412 -41707 -61319 -284733 -411898 -412824 -265793 -272178 -110967 6135
20118 6135 133867 259955 341909 -58333 -442141 -436847 -371308 -154265 -191590 -148145 -151935
20107 -151935 -415438 -287346 -357210 -321883 -142945 -94628 -226988 -176919 -193354 -442929
20097d42929M4175K22419K72851J57451k70060j67508j2391j13390J10956J16686
20087h1740J09624J56178j40719k52780j55197J94846J38856J26101k3409j37678
20077f5918q9471n5143K01007J81499j6603j27432j73796o7751J45756K92878
20067B25026J04426p9390k74630k09874J9989J77564j20295M7280L0161J2948
20057f6795l047P5536j83004p4757K8494j53713l8437K32037j9607q6613l7446
20046c27352j8938J50655j32910j70801K07551J58913l1301M7140J19464j30570
20036a28149k34935N9988J74226J92184k7817j49087l50508o1431J85023K94275
20026d6231k97966k21670K6522K20315K39843J40716m6340k16760j48129k42828
$$ plain form
20097 -442929 -398754 -176335 96516 253967 -16093 -183601 -195992 -309382 -198426 -81740
20087 -81740 27884 184062 43343 -209437 -364634 -169788 -30932 95169 71760 -65918
20077 -65918 -155389 -210532 -9525 171974 155371 27939 -145857 -213608 -67852 225026
20067 225026 329452 250062 -24568 -234442 -214453 -36889 -157184 -109904 -79743 -66795
20057 -66795 -69842 5694 -177310 -252067 -223573 -377286 -415723 -183686 -203293 -289906 -327352
20046 -327352 -346290 -195635 -328545 -499346 -291795 -132882 -164183 -117043 2421 -128149
20036 -128149 -363084 -303096 -128870 63314 35497 -113590 -464098 -525529 -340506 -46231
20026 -46231 -344197 -565867 -539345 -319030 -79187 61529 15189 -201571 -349700 -592528
20016e92528l6688N27776L18740r8036J95247J64390j60357k14487j75250q4435
20006a55628j06330N2761K41045j7758J82348l03972j1002Q6098Q1579M5067J0904
19995A05112k5177j68972J30042J89369k8022p2772P0972n2232k78536q9327L22738
19984A03195p3897j70174k761J09552M4724R7527q1028K33291o7480j76401j85926
19973a69378J58437J57042R9368j8611m4951J11239o9257j29019l346K22262M6197
19962C59983p7268j08291k21175j9210O4377Q2355J68465j72591j76660l6388
19952a36403J44484J6356j87938J11270K6630j88745j17724K03306J87356Q3818
19942A42410N2736K9516j84942l22597Q5670l6720L9589K80604J74859N8539r2326
$$ plain form
20016 -592528 -629216 -101440 217300 119264 314511 478901 318544 104057 -71193 -155628
20006 -155628 -261958 -209197 31848 14090 196438 -107534 -118536 -32438 49141 94208 105112
19995 105112 79935 -89037 41005 230374 202352 129580 200552 148320 -130216 -219543 103195
19984 103195 29298 -140876 -143637 -34085 10639 108166 27138 260429 192949 16548 -169378
19973 -169378 -10941 146101 245469 226858 181907 293146 223889 94870 91524 313786 359983
19962 359983 282715 174424 -46751 -65961 -1584 80771 249236 76645 -100015 -136403
19952 -136403 8081 24437 -163501 -52231 -25601 -214346 -332070 -128764 58592 142410
19942 142410 195146 224662 39720 -282877 -197207 -233927 -194338 86266 261125 319664 227338
19931B27338l37005j73073l58259q0629K42324q605M0259R3342k06201j89244
19921g49753j8893K12124K86546L88100R1800l92222L2127J84927J16922j71680
19911b0002N989K19218O6209j75443k15720r2979l3982K02162M6198j29913J57880
19900B9617L001k06796j67823L2956J299k94061L1712L06222J13317Q224j01841
19889b44173J30252m1169r1971J30009J88358m1181r8920j05338k49321p7030
19879e00484L45453J78437k18433j07924J69273L67171J01783j53093k88009p9411
19869a85237k33771q8634N1100n4416J89118K87022J2286j53522j92479m9304
19859d17837M7007J95923j16530j12685J37185J43420R4460M1492L3123p2987
$$ plain form
19931 227338 -109667 -282740 -640999 -721628 -479304 -487909 -447650 -354308 -560509 -749753
19921 -749753 -768646 -556522 -269976 118124 209924 -182298 -150171 34756 151678 -20002
19911 -20002 -14013 205205 271414 95971 -119749 -212728 -246710 -44548 1650 -128263 29617
19900 29617 32618 -174178 -342001 -309045 -307746 -601807 -570095 -263873 -150556 -142332 -244173
19889 -244173 -113921 -155090 -247061 -117052 71306 30125 -68795 -174133 -423454 -500484
19879 -500484 -155031 23406 -195027 -302951 -133678 233493 335276 182183 -105826 -185237
19869 -185237 -419008 -507642 -456542 -510958 -321840 -34818 -22532 -176054 -368533 -417837
19859 -417837 -370830 -174907 -291437 -404122 -266937 -123517 -29057 12435 45558 -27429
19849b7429r4342k39783j31671L20824J30297N9725q8827p9175P4461L0121q2583
19838a28382k3100J23568J3249o3939J20406M8007p95q5071j31445k06367j37799
19827d71668K4763K52791K65887J00983j52772m37799N0855J04411K85308L05394
19817C28153k10440k79171j09273K44510Q0323j68334J33728p4036k1678n4472
19807a30690j34218j52609L06526N3372p3528j45833n5905p1142j26637J51605
19797c79059J54493J25575Q7588k22728K81613K00486m0541j15405j19073l95933
19787d22984k39570O9665K59569K57853J02025n3506j48503j50992j41617K6371
19777d41689J97305n7630L2363K62451N7445q9150J033P0259r7075J35590K47844
$$ plain form
19849 -27429 -121771 -361554 -493225 -172401 -42104 17621 -71206 -150381 -75920 -45799 -128382
19838 -128382 -151482 -27914 -14665 -78604 41802 89809 89014 3943 -127502 -333869 -471668
19827 -471668 -446905 -194114 71773 172756 19984 -417815 -366960 -262549 22759 328153
19817 328153 117713 -161458 -270731 -26221 54102 -114232 19496 -54540 -76218 -130690
19807 -130690 -264908 -417517 -110991 -57619 -131147 -276980 -332885 -404027 -530664 -379059
19797 -379059 -224566 -98991 -11403 -234131 47482 247968 207427 92022 -27051 -422984
19787 -422984 -662554 -592889 -333320 -75467 26558 -26948 -175451 -326443 -468060 -441689
19777 -441689 -244384 -302014 -269651 -7200 50245 -38905 -37872 32387 -64688 70902 318746
19766C18746K7647j98115m7080J78573n720j41622j50697r086K11528K91346Q1348
19755E56868k07278k68518r3181k01162j1587L9800j2198L59317O9659k28816
19745B904j49093q7059J07384O8415Q6448P2019L17684k0232r8945L9891M10k31000
19733A08826l47851l49458J59657J80359J69538n1570k52260K08562J43090J18662
19723H7555J97264p1235q9891M1010P5269j92576k12947n0680J19349J53233J32365
19712A88716M4236j15287k31779p115P2578P7550J32792O3382j5813j94007J11389
19701A26642q4283k27075N2048K04776J68172j45125k15982R0164J2387m3361
19691f1637n4155J31467Q1353K80118L6186J09829k4470k89428j43028O8001N7194
$$ plain form
19766 318746 346393 148278 101198 279771 274051 132429 -18268 -27354 184174 475520 556868
19755 556868 349590 81072 -12109 -213271 -224858 -185058 -197256 162061 231720 2904
19745 2904 -146189 -233248 -125864 -57449 28999 101018 418702 398470 299525 339416 339826 108826
19733 108826 -239025 -588483 -428826 -248467 -78929 -130499 -382759 -174197 -31107 87555
19723 87555 284819 213584 123693 164703 239972 47396 -165551 -216231 -96882 56351 188716
19712 188716 232952 117665 -114114 -121229 -48651 28899 161691 225073 209260 15253 126642
19701 126642 42359 -184716 -132668 72108 240280 95155 -120827 -30663 -18276 -61637
19691 -61637 -115792 15675 97028 377146 413332 523161 498691 209263 66235 134236 191430
19680A91430Q6590j58859n7254j84205j6323j95337k3761J54201j7143O567J47790
19669f6304P2221k06878n6995K57840L8340J965n910j82076j8257k27307k4551
19658d17912K02483L0495j83496j2058J89403j63388k72343Q7254L03881L01287
19648F5606L56663k2893n2644n084k52020N2242k01663k08876j61133O8428K58694
19637a02680M36488Q8778j10979J96919o5863j01901J42903P8399n1234j99380
19627C11450k41669M7730J9839j7526j53185r6586j924j10582j28747j18066J84258
19616c05008O0933m7288m7653k7185P4350K39010J13881P8093r3214k36210j25518
19605c15809K16567J38786Q0213j17367j85250J11782K48065P9419M4281k9405
$$ plain form
19680 191430 278020 119161 61907 -122298 -138621 -333958 -357719 -203518 -220661 -214094 -66304
19669 -66304 5917 -200961 -257956 -116 38224 40189 34279 -147797 -166054 -393361 -417912
19658 -417912 -215429 -184934 -368430 -380488 -191085 -354473 -626816 -539562 -235681 65606
19648 65606 422269 399376 346732 341648 89628 141870 -59793 -268669 -429802 -361374 -102680
19637 -102680 333808 422586 311607 508526 442663 340762 483665 562064 510830 311450
19627 311450 69781 117511 137350 119824 -33361 -129947 -131871 -242453 -371200 -489266 -305008
19616 -305008 -244075 -291363 -339016 -366201 -291851 -52841 61040 139133 45919 -190291 -315809
19605 -315809 -99242 39544 119757 2390 -182860 -71078 176987 256406 300687 271282
19595B71282M6088R386j42476o1913j89128m3425J81371l556J24148K5865j58623
19584E9019j7884m6729L8722m1128n7147l05650j36844m5667J2550J69045M8889
19573c22824l7002Q2290K08243O0326k2683L48941o8819j17501R6500q2319j44338
19562H14k32321m305P3354L4296J71620J52677q109j26399k8828r377j7775j28967
19550a23320O5917J4499p0027p8791K29901J27825K949m8745r736k54814P1532
19539g2810j17200R2663r5939L7878j32150j37645P6858J14685J17314l5666q6034
19528b38046o5332j03081J45219M2655J38815J44602P4263j47371k03949K56630
19518D4405o5167k44646K31160K01054J34864j02648j97606j01063J54864M8168
$$ plain form
19595 271282 317370 326756 184280 122367 -66761 -110186 71185 67629 191777 217642 59019
19584 59019 41135 -5594 33128 -8000 -65147 -370797 -507641 -553308 -540758 -371713 -322824
19573 -322824 -359826 -277536 -69293 -8967 -31650 317291 248472 130971 227471 145152 814
19562 814 -231507 -235812 -162458 -128162 43458 196135 188026 61627 32799 23422 5647 -123320
19550 -123320 -57403 -42904 -112931 -191722 38179 166004 168953 120208 110472 -144342 -72810
19539 -72810 -190010 -97347 -193286 -155408 -287558 -425203 -348345 -233660 -116346 -152012 -238046
19528 -238046 -303378 -406459 -261240 -218585 -79770 64832 139095 -8276 -212225 44405
19518 44405 -20762 -265408 -34248 166806 301670 199022 1416 -99647 55217 103385
19508A03385P9046o2404q9036j54408J14270M7896N2722N3609k64701J12897K62476
19497B55752M0394N392m2519L6399J82220R9095k40417j63397j81383r3672R3508
19486h628j51030m5179K53539J4775j26725J07766J63328J7049k0475J02184j72428
19475A34176k40768J64706r0008j37198p3022M6460J13136j43082m1411J71069
19465i5942J53033O5122P5057K2994j37806J59790J81631k2022j6033q5703j06503
19454A93618M5336p0999m9054J38553O4686j14988R605j42932k39953k14153K39886
19443a40395M46103p7916m17251j03854O3822K53409J87482r3393k15154j57727
19433b54874J36486J58712j17173J37186q7552J48551n4676R4924J28343K47076
$$ plain form
19508 103385 182431 120027 30991 -123417 -9147 38749 91471 145080 -119621 -6724 255752
19497 255752 296146 301538 259019 295418 477638 576733 336316 172919 -8464 -102136 -8628
19486 -8628 -159658 -204837 48702 63477 -63248 44518 207846 224895 204420 306604 134176
19475 134176 -106592 58114 -31894 -169092 -242114 -195654 -82518 -225600 -267011 -95942
19465 -95942 57091 122213 197270 220264 82458 242248 423879 401857 385824 300121 193618
19454 193618 238954 167955 118901 257454 322140 207152 216757 73825 -166128 -380281 -140395
19443 -140395 305708 227792 -189459 -293313 -229491 23918 211400 118007 -97147 -254874
19433 -254874 -118388 40324 -76849 60337 -27215 121336 66660 161584 289927 537003
19423E37003j54635l89512O9135j43670l28745N048L39825l210J69335R0435l4478
19412A56531K1754j50561k28810R5191L8976j8052P064j94758q6671k1718m6583
19401d27637k4561K07695J59969K01493R8729k35513p6528J78637M9045n7567
19391G3762k73135P3136J62909j63839l0085N312L0081r0567m2021J29122J40113
19380A4788j61886o6800k44065M05239J97531R6449j39582k47021k64224J83402
19370b26169J66138J20928J11163J04987m0103k28370L0890J92422M7161J796
19360B80843K6602k18708j5512J31801N5776p4317p7264q8288r3548j10146O0893
19349a21868O9892k02529k05793J4601K00927J33055q7886k5327M9313J06342
$$ plain form
19423 537003 382368 -7144 61991 -81679 -410424 -405376 -65551 -68761 100574 191009 156531
19412 156531 178285 27724 -201086 -105895 -66919 -84971 -77907 -272665 -359336 -381054 -427637
19401 -427637 -452198 -244503 -84534 116959 215688 -19825 -96353 82284 131329 73762
19391 73762 -199373 -126237 36672 -127167 -157252 -151940 -121859 -212426 -254447 -125325 14788
19380 14788 -147098 -213898 -457963 -52724 144807 241256 101674 -145347 -409571 -226169
19370 -226169 -60031 60897 172060 277047 236944 8574 39464 231886 279047 280843
19360 280843 307445 88737 73225 205026 260802 186485 109221 20933 -72615 -182761 -121868
19349 -121868 -51976 -254505 -460298 -445697 -244770 -111715 -199601 -224928 -175615 -69273
19339f9273j31450M1550J58669k74510Q4742J48540R9823q6172M2637Q3397j35676
19328c7723Q3708J86603Q9148j15177k03591j27904j37489J40148K06514J58002
19318B42239l29569p7009J26399q6407j2009O4549L86424m978j12084P4898j09726
19307A62727P7161N9198m5830p2002j47037r4501K05110K1762l2553M3984L9194
19296B17213j73251k77309j1765J85417J08658J38987l8377j41674J11261l3948
19286H5212L4180J73771O8483J17214J22676j67753m9995K03466k51003n60098
19276b23847k13123J55109K51626j90771j36749Q6054K16541J96377R5250o4216
19266A72251j21360k88946m1654O110R1508j13591q9775L92886L15413L3937K873
$$ plain form
19339 -69273 -200723 -159173 -504 -275014 -190272 -41732 58091 -28081 14556 97953 -37723
19328 -37723 45985 232588 321736 206559 2968 -124936 -262425 -122277 84237 242239
19318 242239 -87330 -164339 -37940 -124347 -136356 -71807 314617 309639 197555 272453 162727
19307 162727 239888 299086 253256 181254 34217 -60284 144826 166588 134035 178019 217213
19296 217213 43962 -233347 -245112 -59695 48963 187950 149573 7899 119160 85212
19286 85212 119392 293163 361646 478860 601536 433783 383788 587254 336251 -223847
19276 -223847 -436970 -281861 -30235 -221006 -357755 -271701 -55160 141217 236467 172251
19266 172251 50891 -238055 -279709 -273599 -182091 -295682 -385457 7429 322842 356779 359652
19255C59652l6843j65061k40595j32470J95589l0072k50880k9074J55892Q0289
19245i3573K0291J31489R9382j33601j23349q931O1422n7808n3680M3146K2165
19234i3047l5907M490J24846J69843J34812j08315j62538l0053J16755r7972P4112
19223I7026J43951p0700j73911J17379K78769J89246j34641j29845k07892j35032
19213b5650M0410m7482K34260K62855j79856j38858J59373j11008j02485q3663
19203G896j49405L1057R8517J97222N2031j34139M962l0943l0626j43083R9940
19192C429R9185m4474K97037O2104k20293l9892k7812J26904N5158k2547k52638
19181C6161N4224K64526j03654L1032l51357o5252J17182L1405r9383R3375J36333
$$ plain form
19255 359652 322809 157748 -82847 -215317 -19728 -49800 -300680 -329754 -173862 -93573
19245 -93573 -73282 58207 157589 23988 -99361 -108292 -46870 -104678 -158358 -115212 -93047
19234 -93047 -128954 -124464 382 170225 305037 196722 34184 4131 120886 22914 97026
19223 97026 240977 170277 -3634 113745 392514 581760 447119 317274 109382 -25650
19213 -25650 14760 -32722 201538 464393 284537 145679 305052 194044 91559 7896
19203 7896 -141509 -110452 -11935 185287 237318 103179 108141 77198 46572 -96511 3429
19192 3429 102614 58140 355177 417281 196988 157096 129284 256188 311346 288799 36161
19181 36161 90385 354911 251257 282289 -69068 -134320 -17138 14267 -85116 8259 144592
19170A44592K69108k5950J91815J9688l36725m6123k9931J1968J2884L0963Q534
19159B50823R3032J32384j50527j15125J6134j37463O7326K10237N6922p8814
19149C44929k35072j80470k06883K48276L0246J84263j14217j10696J23292k10403
19139a26735J70800J64868j36817j83016j32878K08481L90939Q1524j60563q9324
19129A87279J55612k5313j31584J30537R0740P4629R8128M7429J01750j75753
19119E53454q4160j137k34679o6723k15031p0312k5725J42526L93177L6994N597
19108D33981J2960J87574O9859Q0048q2955p8031m48077j94446J48515j1039o1529
19097E6860P5975p6955r2567q1789J43997L21523R5088p5725k44670J54371k1789
$$ plain form
19170 144592 413700 387750 579565 599253 262528 216405 186474 198442 211326 242289 250823
19159 250823 343855 476239 325712 210587 226721 89258 156584 366821 423743 344929
19149 344929 109857 -70613 -277496 -29220 1026 185289 71072 -39624 83668 -126735
19139 -126735 44065 208933 72116 -110900 -243778 -35297 355642 437166 276603 187279
19129 187279 342891 317578 185994 316531 407271 481900 580028 627457 729207 553454
19119 553454 469294 468157 233478 166755 -48276 -118588 -144313 -1787 391390 428384 433981
19108 433981 446941 634515 704374 784422 701467 623436 175359 -19087 129428 118389 56860
19097 56860 132835 55880 -36687 -118476 25521 347044 442132 366407 121737 276108 254319
19086B54319k32387q9702K55438r5943J03576l921m9151J77485P6800J07774K08975
19075G13263J38058L071j16272j69281k2028r8929q0106K4890J01453L00105M5877
19064H40101r3134q9483k09330n7305L4333j3418p7906l3679J5279j52646j68787
19053e975K1046K04872l20928k1244J89877j08440N79P0912K3463j0616Q9204
19042A32750L9509j75917j3349J90357L33259K17381p7100J72824q9530p3933
19032F56251j3870J84527m6337j03701K08460J95311L3747Q6288K32671N8869
19022A492216J83763P6618J26974J40328j04940l29869l65474j98131j05560J97042
19012A112967J55789K15836K90823K3382k60702k76406k08397j04832p1631J03723
$$ plain form
19086 254319 21932 -67770 187668 91725 195301 191380 142229 319714 396514 504288 713263
19075 713263 851321 854392 738120 568839 546811 447882 367776 392666 494119 794224 840101
19064 840101 746967 657484 448154 390849 425182 411764 333858 300179 315458 162812 -5975
19053 -5975 15071 219943 -100985 -122229 67648 -40792 -40213 30699 54162 43546 132750
19042 132750 172259 -3658 -17007 173350 506609 723990 646890 819714 730184 656251
19032 656251 642381 826908 780571 676870 885330 1080641 1114388 1200676 1433347 1492216
19022 1492216 1675979 1752597 1879571 2019899 1914959 1585090 1219616 1021485 915925 1112967
19012 1112967 1268756 1484592 1775415 1798797 1538095 1261689 1053292 948460 876829 980552
19002I80552P9503k23536N3100J40631J30482l4272n62997k01658K9262L77576
18992G68643k5007l2694N654j11854p7485R3506j22116J11918L04444J64432O3083
18981A142524k60153k38039j20660j2723L01851J68016l4440k24731J70074J42902
18971A034621L5035J2956j65425J27401K14106J95088j561O5559p7201q9151j13515
18960A237913J27909J28683J74537J12288N310k51024j49861k25506N4750q899
18950A206100n0088K08842M0757L5858l7146l99995l35818j0551R1440J82672
18940I32071k44018j14761J51498m3598n9843p9678q8171j6702J13981n3997l9459
18929D57323N7480P6740O4533Q2068j00699q397q3533J5064p2076K1213r989m7288
$$ plain form
19002 980552 1060055 836519 889619 1030250 1160732 1126460 563463 361805 391067 768643
18992 768643 743636 710942 716596 604742 527257 620763 498647 610565 915009 1079441 1142524
18981 1142524 882371 644332 523672 510949 812800 980816 946376 721645 891719 1034621
18971 1034621 1069656 1082612 917187 1044588 1258694 1453782 1452221 1517780 1440579 1351428 1237913
18960 1237913 1365822 1494505 1669042 1781330 1786640 1535616 1385755 1160249 1214999 1206100
18950 1206100 1156012 1364854 1405611 1441469 1404323 1004328 668510 657959 749399 932071
18940 932071 688053 573292 724790 681192 621349 541671 453500 436798 550779 496782 457323
18929 457323 514803 591543 656076 738144 637445 629048 545515 560579 488503 509716 499727 452439
18917D52439M44J13168J65170J27067o8320l35365k80633J825J33543O0787j47543
18906B22582n3087m983j50364K65900K65778m4946j3109m3542k01222l82898J73623
18895C3732N10470K49855k83700k11794R1271k2277Q3020J22891l8006j04205
18885D31257M0115j49732J70537m1344Q7770m7407r2347q0011n8020L9713j20015
18874A80516r2913N9753J07841J02669j25670j0733K0009O9426m1699j35809K635
18863A36025M1358K48581J72355j4160J50147j25933l38396j13011L1555J56291
18853C44812L38151j14298l0514j70745M7077K12765O1224J43979l6618l72041
18843D23792L2596O3641K32529J66699q0987j27803k35037j80895J86096L23423
$$ plain form
18917 452439 452883 566051 731221 858288 789968 454603 173970 175795 309338 370125 222582
18906 222582 169495 164512 14148 280048 545826 500880 487771 444229 243007 -139891 33732
18895 33732 544202 794057 510357 298563 389834 367557 450577 573468 535462 431257
18885 431257 471372 321640 492177 450833 538603 491196 398849 318838 260818 300531 180516
18874 180516 87603 147356 255197 357866 232196 221463 241472 310898 269199 133390 136025
18863 136025 177383 425964 598319 584159 734306 608373 269977 156966 188521 344812
18853 344812 682963 568665 538151 367406 414483 627248 688472 832451 795833 423792
18843 423792 456388 520029 752558 919257 838270 710467 475430 294535 480631 804054
18833H04054n7295j48016l90868J59735N9230J36628K8427n5275k0628r0217J60257
18822E86032o0007J06571J5381j75177J19688R2168n7666J3274K3104O764J20754
18811G90886k08565j83529k91779J02110K30915K44630l5289Q4293M8081k17117
18801E64636k82177q4214m9693K1752O5085j22458J4652J14808J42891q1062J22196
18790D26416K28917j38640q3081n0451J4200J29805P2141k8428J84273J42746
18780H97898J03412R7004k13101k80567L54047J66279o8005J79119J88583M82320
18770A906989L36735J12197r4951N1601o3983j73972o57498n48147M1935R2582
18760A003488M502j76879j77219j04708O3298J04915O7703k3725K64653P6531
$$ plain form
18833 804054 746759 598743 207875 367610 426840 563468 591895 536620 515992 425775 586032
18822 586032 526025 632596 647977 472800 592488 684656 626990 640264 663368 670132 790886
18811 790886 582321 398792 107013 209123 440038 684668 649379 733672 781753 564636
18801 564636 282459 198245 148552 170304 235389 112931 127583 242391 385282 304220 426416
18790 426416 655333 516693 433612 383161 397361 527166 599307 570879 755152 897898
18780 897898 1001310 1098314 885213 604646 958693 1124972 1056967 1236086 1424669 1906989
18770 1906989 2243724 2355921 2260970 2312571 2248588 2074616 1417118 868971 910906 1003488
18760 1003488 1007990 831111 653892 549184 612482 717397 785100 761375 1026028 1102559
18750A102559l99598o0684J64986M8885K2321n5595J11045j29884p7484K74943
18740A001494r6670k73301j98403K7769J17502N8692J16342k7187J67026O1412
18730I54676J19458J66539j86309l2065p7737N854R3410R8868j2616k59323m7451
18719H23304l102k44395o2541Q0520j10918j7375N8282k4108M5611N2833p1380
18708E26731j49559Q1196J67152L05130K50179n4808j65685l41107l1937K43473
18698H30765J07834k15895J9862L88960M64053J20694j75524m11518j19503l43713
18688F66015n7354M7198L06913J0500n5114K9682k06991J05545J09136q3144l53011
18677E19375j59554J39506J33465K68445J40926j55766P9120k6906J76041j83760
$$ plain form
18750 1102559 702961 642277 807263 856148 878469 822874 933919 804035 726551 1001494
18740 1001494 904824 631523 433120 460889 578391 637083 753425 726238 893264 954676
18730 954676 1074134 1240673 1054364 1022299 944562 950416 1043826 1142694 1130078 870755 823304
18719 823304 820202 575807 513266 593786 482868 465493 523775 499667 545278 598111 526731
18708 526731 377172 458368 625520 930650 1180829 1126021 960336 619229 587292 830765
18698 830765 938599 722704 742566 1131526 1595579 1716273 1540749 1129231 1009728 666015
18688 666015 608661 655859 962772 973272 918158 947840 740849 846394 955530 872386 519375
18677 519375 359821 499327 632792 901237 1042163 886397 965517 938611 1114652 930892
18667I30892m502j88851j88787M6716L80306R8343k49142m0355R6174j51905J03435
18656H32324J64113k09937l4651j69065j01208J69932J51983K2908l6742j11872
18646F77785J85579K90470n2583J42563q5579k07382j9930J67634q0345M7953
18636A066165O0502J55565j78237p6421J4312L41933K18987p4083P9023m317r0486
18625A512943j15423R4278p8999p1658J05879j09066j67030j8254K59477J21304
18615A533451L2783j32541l4034k46938o3980j65795j25905J18028K10326J64777
18605A290172L41757L37899K02095N31n02687m08888k08150J32603J75041R2970
18595A453343J17193Q1369M4692j46167Q3111K17525Q0097k43537j90245K92441
$$ plain form
18667 930892 926390 737539 548752 595468 975774 1074117 824975 784620 880794 728889 832324
18656 832324 996437 786500 751849 582784 481576 651508 803491 826399 789657 677785
18646 677785 863364 1153834 1101251 1243814 1158235 950853 930923 1098557 1018212 1066165
18636 1066165 1126667 1282232 1103995 1027574 1041886 1383819 1602806 1528723 1607746 1603429 1512943
18625 1512943 1397520 1491798 1412799 1341141 1447020 1337954 1170924 1152670 1412147 1533451
18615 1533451 1566234 1433693 1399659 1152721 1088741 922946 797041 915069 1125395 1290172
18605 1290172 1631929 1969828 2171923 2172454 1669767 1260879 1052729 1185332 1360373 1453343
18595 1453343 1570536 1651905 1696597 1550430 1633541 1851066 1931163 1687626 1497381 1789822
18585A789822K22601R9467J19257j29227J35107J75905J57259q4671j99621j20989
18575B164910j09304m3630J55618P0887J43765k12011k20399J63913L13599K13461
18565B640809l5783L905j48709o3703J41608q6284j43667M0557N7254J57498L88118
18554B951603K22154J63699J87817n0478K4441M0178J33904J2076N0184J74565
18544C910143o8415j34648K18030K06283K45391L20044J77387J85990n9626L57121
18534E357700N60984N73144J73554J01718J34673J67378J50648K49721O97337
18525H166857J042913J521306J238486J380167J514896J666497K551129L910918
18517B2993169N616825O039410N247190M770036L551247j157805o576282n838302
$$ plain form
18585 1789822 2012423 2111890 2231147 2101920 2237027 2412932 2570191 2485520 2285899 2164910
18575 2164910 2055606 2011976 2167594 2238481 2382246 2170235 1949836 2113749 2427348 2640809
18565 2640809 2605026 2608931 2460222 2396519 2538127 2451843 2308176 2348733 2405987 2563485 2951603
18554 2951603 3173757 3337456 3525273 3474795 3499236 3539414 3673318 3685394 3735578 3910143
18544 3910143 3841728 3707080 3925110 4131393 4376784 4696828 4874215 5060205 5000579 5357700
18534 5357700 5918684 6491828 6665382 6767100 6901773 7069151 7219799 7469520 8166857
18525 8166857 9209770 10731076 11969562 13349729 14864625 16531122 19082251 22993169
18517 22993169 28609994 34649404 39896594 44666630 48217877 47060072 40483790 34645488
18509C4645488k657687j16176J466895K598610M518299O796730R592764J4135562
18501G0980485K3114672L9693558O0803197O9071615N6466482N2746068M7881045
18494D20757122M966593o9394887q5924131m8933330k5974438k4743595k8246949
18487A42506385j7011974k121450Q099315J0262009Q163144P174967L95702j5294113
18479A42173985k8931602k4778686j5418225r173083o016409m193851k670377
18472E0991752j717215j345099r74703m15724k57606k17177p19318k64343J03181
18463D5183748r2603J90889J300032K962900M960225P830939J3414268J9255056
18455I5005454K0104556J6991147J5971255J1380485k655861j8474728j6030171
$$ plain form
18509 34645488 31987801 31871625 33338520 35937130 40455429 47252159 56844923 70980485
18501 70980485 94095157 133788715 194591912 263663527 320130009 372876077 420757122
18494 420757122 425723715 356328828 270404697 221471367 195496929 170753334 142506385
18487 142506385 125494411 123372961 131472276 141734285 149897429 157072396 157468098 142173985
18479 142173985 113242383 88463697 73045472 63872389 57855980 53662129 50991752
18472 50991752 49274537 47929438 46954735 46539011 46281405 46064228 45344910 45080567 45183748
18463 45183748 45091145 45282034 46582066 49544966 54505191 62336130 75750398 95005454
18455 95005454 115110010 132101157 148072412 159452897 156797036 138322308 122292137
18448A22292137j690840J2689910K1401124K6937427M0215769N9465842O6379027
18441C47690396M3481183K5911512L0870112P554065o1126224j15313093q8396373
18434A90671578m9613971k7696908j6710086j1103072p471557n198915l832992
18427F9044077k538612q57338J559666L669882M076683K865516K479663J87144
18419H0486681n974438j1363109r748967n702627l800087k944796k038804j659887
18411C7253966k307907k504706k085541j687069j399420j076628j128586j118605
18403B3945504j132185q83056q70536o28050l54554o74289q36902p91190n34905
18394A7239837l34321p90168p33904p86678m15966k46981l97193o08732m48316
$$ plain form
18448 122292137 120601297 133291207 154692331 181629758 221845527 281311369 347690396
18441 347690396 391171579 417083091 447953203 455507268 394381044 279067951 190671578
18434 190671578 141057607 113360699 96650613 85547541 78075984 72877069 69044077
18427 69044077 66505465 65648127 67207793 70877675 74954358 77819874 80299537 80486681
18419 80486681 74512243 63149134 53400167 47697540 43897453 40952657 38913853 37253966
18411 37253966 34946059 32441353 30355812 28668743 27269323 26192695 25064109 23945504
18403 23945504 22813319 21930263 21059727 20431677 20077123 19402834 18565932 17774742 17239837
18394 17239837 16905516 16115348 15381444 14594766 14178800 13931819 13534626 12925894 12477578
18385A2477578n89085l87606k68513m57029k26001N1273o41m99787p09990n13586
18375H876613k19388l65944k48050j35567k25286j05096j4269l13445k01487l66201
18365F681880n31610k67195j20194p4913k60166m08353J6334m0131l33824l71054
18355D290774k63213j6558P7047j89541k53831l13155k97800k69425k62533k5815
18345B475950J26067J80890q1742O6465j8256p9108n7300J69663K03113k96135
18335B689607k78359j09392k68664k99978K8451j28461j90064j28326J64606j04733
18325A374687K9488l8742m7789N0917J20993j63724j70077j53799J6449j2581
18315A005822j00580P8231O8817J21382k8818m03059l08850l5483l8700j12089
$$ plain form
18385 12477578 11888493 11500887 11232374 10775345 10549344 10600617 10599976 10100189 9390199 8876613
18375 8876613 8657225 8291281 8043231 7907664 7682378 7577282 7563013 7249568 7048081 6681880
18365 6681880 6150270 5883075 5762881 5687968 5427802 5019449 5035783 4995652 4661828 4290774
18355 4290774 4027561 4011003 4088050 3898509 3644678 3331523 3033723 2764298 2501765 2475950
18345 2475950 2602017 2782907 2701165 2767630 2749374 2670266 2612966 2782629 2985742 2689607
18335 2689607 2411248 2301856 2033192 1733214 1761665 1633204 1443140 1314814 1479420 1374687
18325 1374687 1404175 1365433 1317644 1368561 1489554 1325830 1155753 1001954 1018403 1005822
18315 1005822 905242 983473 1052290 1173672 1144854 741795 432945 397462 358762 246673
18305B46673j8825j97183j39773J93767P2091J9934P045k05531n6313j68837R7805
18294a49147r2817J02405J22654m2159M1926R6390J46546q3302n9622k35152Q7388
18283f4890n5654q8467j46722j58492j52703q473Q2413J92788M6169J83422J87103
18272A6494j29024M9123J04090q0956k97360k64387R9424l5572r9995J53224J60457
18261c24482K34801J71924O310N1450j26187j55932K1583Q7126k39080J4193Q7939
18250a70355J46919j3015M7224J75015M9136k17758n5636n1873j26525p9885K7817
18239b68936J24276R866j5368K43548k58945m18563J39474K54831O3045O5931
18229f0841L7496j09042L8928r0256j83592q9917J0454K50656J87837o5119j9811
$$ plain form
18305 246673 227848 30665 -109108 84659 156750 176684 183729 -21802 -78115 -246952 -149147
18294 -149147 -241964 -139559 -16905 -59064 -17138 79252 225798 142496 82874 -152278 -64890
18283 -64890 -120544 -209011 -355733 -514225 -666928 -675401 -592988 -400200 -354031 -170609 16494
18272 16494 -112530 -63407 40683 -40273 -337633 -602020 -502596 -538168 -638163 -484939 -324482
18261 -324482 -89681 82243 88553 140003 13816 -142116 -120533 -33407 -272487 -258294 -170355
18250 -170355 -23436 -36451 10773 185788 234924 17166 -38470 -90343 -216868 -296753 -268936
18239 -268936 -144660 -134794 -150162 93386 -165559 -584122 -444648 -189817 -126772 -60841
18229 -60841 -23345 -132387 -93459 -183715 -367307 -457224 -446770 -196114 -8277 -73396 -93207
18218i3207K5676j35215r5943j49566Q0764K75750J28308j39457N069j21038R3353
18207a25506P5801o039p6702K39408n2169M263J82521K57420j44396l16751j82333
18196a44483K30335J7266K48275l1499P5818O1482l13334J30261J85364j16047
18186C43438k12531m8108j25375n1689M8679j2528K29308N229k73098j46229O6548
18175a76356M9172J1165j2500R9373m3890j55599J43855J57179J74680j25720
18165A21359R8681o5312K91264M550J580J01979k67158k28988j1549J90894J14687
18154C51987m752k8327J15945p1881r5974J69917J33340J38111K61649j449j49257
18143H19309L9947J63895j61228j57234L89750J47065K82940N22066J1935J55164
$$ plain form
18218 -93207 -67531 -202746 -298689 -448255 -367491 -91741 36567 -102890 -97821 -218859 -125506
18207 -125506 -49705 -55744 -132446 106962 54793 59056 241577 498997 354601 37850 -144483
18196 -144483 85852 103118 351393 319894 395712 457194 143860 274121 459485 343438
18186 343438 130907 82799 -42576 -94265 -45586 -58114 171194 176423 -96675 -242904 -176356
18175 -176356 -127184 -116019 -128519 -29146 -73036 -228635 -84780 72399 247079 121359
18165 121359 220040 154728 445992 450542 452122 554101 286943 57955 46406 237300 351987
18154 351987 347235 318908 434853 362972 266998 436915 570255 708366 970015 968566 819309
18143 819309 859256 1023151 861923 704689 1094439 1241504 1524444 2046510 2058445 2213609
18133B213609J76617K77924L13009P1280L15070L78725L33923M73351O16580Q50947
18123F021035R22338J213369J424765J889790K424735L788558N288483P690898
18115C0663971J1915872K0299910L5630391N3126048N1349918L6915437L8431278
18108B78332825K3618796k9429216q9790625p0677291l6289660j9153814j0955075
18101D5655940o832494m885912l920495l234939k490134j673836j522379j373708
18093A9722043p19328o11621q14677r95084o27760n07152n02120m97213m43277
18084A4003811n63758q33183o58816l89467n54364l47427l97391o53167l57183
18075I249055m31358m18517n15161q9965j03610k54600l50260j36336m55286j0797
$$ plain form
18133 2213609 2390226 2668150 2981159 3052439 3367509 3746234 4080157 4553508 5170088 6021035
18123 6021035 6943373 8156742 9581507 11471297 13896032 17684590 22973073 30663971
18115 30663971 42579843 62879753 98510144 151636192 202986110 239901547 278332825
18108 278332825 301951621 272522405 182731780 112054489 75764829 56611015 45655940
18101 45655940 38823446 33937534 30017039 26782100 24291966 22618130 21095751 19722043
18093 19722043 19002715 18391094 17576417 16581333 15953573 15446421 14944301 14447088 14003811
18084 14003811 13440053 12606870 11948054 11558587 11004223 10656796 10259405 9606238 9249055
18075 9249055 8817697 8399180 7884019 7794054 7690444 7435844 7085584 6949248 6493962 6483165
18065F483165k72537m42322k80108p4312l42024l50370k16093j77466k88715n055
18055D034163J32403k43533k28035k11361J25749o9954m99343k12217j28171L655
18045B703356m3774j51089j62426J64962r454l25640K4844j96575n4582J03703
18035B053325j47230l9049J37554k68645r0666M225j37103k4995J75320L6088
18025A698824l43850l85630j20170r521J70179N7973n4825K23620K40267m1372
18015A435495o9135R9207L45056j58152k02648l9979Q4392m7685j85004k54495
18005A007052K3053j77853Q8725K14879J57820j98304q3730l7940J1109k97483
17995G07328k04465k1141J80428J60259j011L61420J00144m39704l51301O9406
$$ plain form
18065 6483165 6210628 5768306 5488198 5413886 5071862 4721492 4505399 4327933 4039218 4034163
18055 4034163 4166566 3923033 3694998 3483637 3609386 3539432 3040089 2827872 2699701 2703356
18045 2703356 2659582 2508493 2346067 2511029 2501575 2175935 2200779 2004204 1949622 2053325
18035 2053325 1906095 1867046 2004600 1735955 1645289 1649514 1512411 1487416 1662736 1698824
18025 1698824 1354974 969344 849174 839653 1009832 1067805 1012980 1236600 1476867 1435495
18015 1435495 1366360 1465567 1810623 1652471 1449823 1409844 1494236 1446551 1261547 1007052
18005 1007052 1030105 852252 940977 1155856 1313676 1115372 1031642 993702 1004811 707328
17995 707328 502863 481722 662150 822409 821398 1182818 1282962 843258 491957 561363
17985E61363J40920j7786k68097M0524K74746L7159j4236k387K79366Q5502l67629
17974G49445l864J09540L2031J79442J12552J56621o0471j66919r8248M2652O0794
17963A113575p8144m6385j08353O5970K02547K79435K6294J37309l9954k04078
17953A348216k72229J0891l22944L0605m6690n7834j60169k58844l66959J63166
17943F7209K07076j457j21351K24649j60349J58312L3255k2899J89887r1617J5730
17932D98445O2315n6239L05819J62723m7714n7675N1673J03887N6919R812J08773
17921A198738j8526j07386l44496m21975k15000L22095K53275j02180k65299Q5734
17911C84980L02319K63508p7781l3968K93947j31089n25476k08592M7596j32414
$$ plain form
17985 561363 702283 684497 416400 456924 731670 768829 754593 752206 1031572 1117074 749445
17974 749445 745581 855121 887152 1066594 1179146 1335767 1275296 1108377 1010129 1052781 1113575
17963 1113575 1035431 989046 880693 946663 1149210 1428645 1454939 1592248 1552294 1348216
17953 1348216 1075987 1086878 763934 794539 747849 690015 529846 271002 -95957 67209
17943 67209 274285 272828 151477 376126 215777 374089 407344 384445 574332 482715 498445
17932 498445 560760 504521 810340 973063 925349 867674 919347 1023234 1080153 1089965 1198738
17921 1198738 1180212 1072826 728330 306355 91355 413450 666725 564545 299246 384980
17911 384980 687299 950807 873026 839058 1133005 1001916 476440 267848 315444 183030
17901A83030K64758K5687k56780j79105k03258j21789M0893P1828j34753P9483
17891b30006K006o9154l5694o6704L5491K25208Q8952k0418k41448k37744P1123
17880d78388O298j20353r834M0588n7136J24614k3676P2528O6530M8882J11083
17869b18864j13733l2971p6209j89337l9332J87909O6462J9433K7405M9105J63725
17858a56407l2458j04034O276j3924L6715k8038o6293L4765o2438j63476j1290
17847e60602j76929J77860J00612K14617n1280m9366O7609J43845Q8715k55968
17837c00887j39874j64497l3885L39623J79461j37105k37367q083N6562J84896
17827b61156R5699L9942j07383k49660J30215J13363l2610l2130k01817J9900
$$ plain form
17901 183030 447788 473475 216695 37590 -165668 -287457 -246564 -174736 -309489 -230006
17891 -230006 -228000 -297154 -332848 -399552 -364061 -138853 -49901 -70319 -311767 -549511 -478388
17880 -478388 -472090 -592443 -602277 -561689 -618825 -494211 -517887 -445359 -378829 -329947 -218864
17869 -218864 -332597 -365568 -441777 -631114 -670446 -482537 -416075 -396642 -369237 -320132 -156407
17858 -156407 -188865 -292899 -286623 -300547 -263832 -291870 -358163 -323398 -385836 -549312 -560602
17847 -560602 -737531 -559671 -459059 -244442 -295722 -345088 -277479 -133634 -44919 -300887
17837 -300887 -440761 -605258 -639143 -299520 -120059 -257164 -494531 -502614 -446052 -261156
17827 -261156 -165457 -125515 -232898 -482558 -352343 -238980 -271590 -303720 -505537 -485637
17817d85637Q2910o0869n1118n0702j71491j75085j10873J00184K37792L38569
17807c46320J47538P739N0876j28308j61278J92998J06891k48550k50626j07475
17797g36515O0900q139K00618K70695j12637l7572j80278j43670o9765l18381
17787a074744l0914K99063J60120k5105P7315n4375J14061K75387J23991K67409
17777A32208J4171k19335k57127O106J48732j56864k59799N4274K60915J36710
17767a40009q4327k28229j93287P0404J61731O5419J8567M7981k4890m9408m8198
17756d04246o0483K84323k35149k54355L3586K8731N5329O4622J21906R4404Q9102
17745a82230N8889k16427o061L49263K16063m7507k35649j57319l8226k1622j21054
$$ plain form
17817 -485637 -402727 -463596 -514714 -565416 -736907 -911992 -1022865 -922681 -684889 -346320
17807 -346320 -198782 -191043 -140167 -268475 -429753 -236755 -129864 -378414 -629040 -736515
17797 -736515 -675615 -683754 -483136 -212441 -325078 -362650 -542928 -686598 -756363 -1074744
17787 -1074744 -1105658 -806595 -646475 -671580 -594265 -648640 -534579 -259192 -135201 132208
17777 132208 146379 -72956 -330083 -323977 -175245 -332109 -591908 -537634 -276719 -140009
17767 -140009 -224336 -452565 -645852 -575448 -413717 -348298 -329731 -281750 -306640 -356048 -404246
17756 -404246 -464729 -180406 -415555 -669910 -636324 -607593 -552264 -487642 -365736 -271332 -182230
17745 -182230 -123341 -339768 -345829 3434 219497 171990 -63659 -220978 -259204 -280826 -401880
17734d01880r750j26538j50110l00673Q4266K22648K79221M639j10602Q0914K15572
17723b12293k9448k18206R5920K19331J1281P0591j54863k54859K5434N7432o8127
17712d57807O3341o0938j42929j3713J9872M6901O1903J83078n3661k49618J01855
17701e01716j14185j00187J5287L4781J75419J72515j19530p9626J16742r149
17691d09649j2256o3641j50374R0850J34963n8277L8252J27492j55914k34915
17681f93469k48214M0002L1005K46179K20534k9100j30260n3187P7557o9161J12605
17670d95509p7887j17441k85305J02558K19243N1721J14642K28122r9502k87581
17660f46939r2200K45448k1332j21438M4640L01129q1255j4719n7755q9420q614
$$ plain form
17734 -401880 -411630 -538168 -688278 -988951 -904685 -682037 -402816 -398177 -508779 -427865 -212293
17723 -212293 -241741 -459947 -364027 -144696 -133415 -62824 -217687 -472546 -447112 -389680 -457807
17712 -457807 -394466 -455404 -598333 -612046 -592174 -545273 -483370 -300292 -353953 -603571 -501716
17701 -501716 -615901 -716088 -700801 -666020 -490601 -318086 -437616 -517242 -400500 -409649
17691 -409649 -421905 -485546 -635920 -545070 -410107 -468384 -430132 -302640 -458554 -693469
17681 -693469 -941683 -901681 -870676 -624497 -403963 -433063 -563323 -616510 -538953 -608114 -495509
17670 -495509 -573396 -690837 -976142 -873584 -654341 -602620 -487978 -259856 -359358 -646939
17660 -646939 -739139 -493691 -515023 -636461 -591821 -290692 -371947 -386666 -444421 -533841 -542455
17649e42455j53329J4007J49574K55260J84063k74398j95929O5287j12020M5838
17639e64102K08472O7392M68487O06747L70630j34637p7758k2682k81364j82200
17629D58985J29433L0087k91672k97950M8600L59160L30154l622n6408Q1219p8186
17618G09800m6501J81611J063Q6011K74841J56981n9723j13856J0626j292Q077
17607A207638r4362j85840j88799m05094l48095J75929N9933j68804R600j18679
17597e6573Q4825k1296L8222J32898o007k35783n5956J30494N4459L89700J71317
17586F26300j32628k50452k39934l32591J54087J62793R8926p5668L12958K47867
17576E71658J60558L62147j14947m33006k54627O9824j52987K4347R8918J13933
$$ plain form
17649 -542455 -695784 -681777 -532203 -276943 -92880 -367278 -563207 -497920 -609940 -564102
17639 -564102 -355630 -288238 180249 786996 1157626 1022989 945231 922549 641185 458985
17629 458985 588418 618505 326833 28883 77483 436643 766797 763175 706767 787986 709800
17618 709800 663299 844910 845973 931984 1206825 1363806 1304083 1190227 1200853 1199561 1207638
17607 1207638 1113276 927436 738637 333543 -14552 161377 221310 52506 62106 -56573
17597 -56573 28252 6956 45178 178076 172069 -63714 -119670 10824 65283 454983 626300
17586 626300 493672 243220 3286 -329305 -175218 -12425 86501 10833 323791 571658
17576 571658 732216 1094363 979416 546410 291783 361607 208620 232967 331885 445818
17566D45818q5441m1987L44758L46879J92123j23032j78791m06882M6788J38533
17556F78766K48888j72347m62318k35491j2883J43557J41556j83402j76788p1946
17546a02408k03369m8923M44794j37634k20452K8083J36763K5047K60007K58240
17536D40148k81356k42620l31112r0312P5359n3596m4561P787j01457N3623K24842
17525c43255j152j51113P6399j86729r0036J94016l8886J74131m6433N5785q0104
17514d37377j99655M369J03716L2057J45916L6996L29375M4857q0518j23606k73662
17503d17532l2035M4218r2409k48865M4782J53609L6649p0631R3968n7097k6914
17492e72257J3920J50852K51338J21842j85724P5243j73061j70981K28915K5486
$$ plain form
17566 445818 360377 318390 663148 1010027 1202150 1079118 900327 493445 540233 678766
17556 678766 927654 755307 292989 57498 44615 188172 329728 146326 -30462 -102408
17546 -102408 -305777 -354700 90094 -47540 -267992 -239909 -103146 -78099 181908 440148
17536 440148 158792 -83828 -414940 -505252 -429893 -483489 -528050 -520263 -621720 -568097 -343255
17525 -343255 -344407 -495520 -419121 -605850 -695886 -501870 -540756 -366625 -413058 -357273 -437377
17514 -437377 -637032 -632663 -528947 -496890 -350974 -313978 15397 60254 -20264 -143870 -417532
17503 -417532 -449567 -405349 -497758 -746623 -701841 -548232 -511583 -582214 -488246 -545343 -572257
17492 -572257 -558337 -407485 -156147 -34305 -220029 -144786 -317847 -488828 -259913 -234427
17482b34427j76429j03930J22594o8999N0671L5883k7183r1041P3841J41660J32087
17471a45273J32539J38170j69522k95558q4679J93270K79915j35486k45157j17595
17461d49376j10660J37160P0564J0897J35045K54366J58818L0366P8998o9213
17451B46965M586K16982p7859j28354J74230K78662P0968K32088K53695L39612
17441A611575j78212o44268j76942j63735k95302J1188P3325Q7316n4990q3009
17431A86946j06663j55490J85880j14099o3913j24446j18907q8742k22579m606
17421f26619K52493J87554j54051M3762J81496K27982Q3970J75j93271K44129
17411B47620J82581k4676L4541J4198k19239l80864l48309p5135J69890J74229
$$ plain form
17482 -234427 -410856 -514786 -392192 -461191 -410520 -374637 -401820 -492861 -419020 -277360 -145273
17471 -145273 -12734 125436 -44086 -339644 -424323 -231053 48862 -86624 -331781 -449376
17461 -449376 -560036 -422876 -352312 -341415 -206370 47996 206814 237180 316178 246965
17451 246965 251551 468533 390674 262320 436550 715212 786180 1018268 1271963 1611575
17441 1611575 1433363 789095 612153 448418 153116 164304 237629 324945 269955 186946
17431 186946 80283 -75207 110673 -3426 -67339 -191785 -310692 -399434 -622013 -626619
17421 -626619 -374126 -186572 -340623 -296861 -115365 112617 196587 196762 3491 247620
17411 247620 430201 405525 440066 454264 235025 -145839 -494148 -569283 -399393 -225164
17401b25164l737J98836J54443j74036q7557o9671K10955J48416J05013j67701
17391H9797q4363j05222K22172R5575j70842K22729j8304j80764k17547j34944
17381b81713J12306Q6702N8678J22752K26946L044P9870l9949l19555L13856K58168
17370F21105k58845J18227P8915j22328o6488j48372L20940J17998l62358j21990
17360A76804l9705L81m0660J89974L9276K31433O58268J0428o6716K15160L04443
17349A679086K92289l99262o47326k93254j38492o2535p7413j62502J02185o262
17339B86514J51487L31932k2973p6556q8966j34106j85426m9560j04852k9678
17329G7816L500q6864J78759J61884l4446l07485N6999M77042j8231j42936j9556
$$ plain form
17401 -225164 -228901 -30065 124378 -49658 -137215 -206886 4069 152485 257498 89797
17391 89797 5434 -99788 122384 217959 47117 269846 251542 70778 -146769 -281713
17381 -281713 -169407 -82705 -24027 98725 325671 328715 408585 368636 49081 362937 621105
17370 621105 362260 480487 559402 437074 370586 222214 543154 661152 298794 176804
17360 176804 137099 137480 96820 286794 326070 557503 1215771 1226199 1159483 1374643 1679086
17349 1679086 1971375 1572113 924787 631533 493041 430506 353093 190591 292776 286514
17339 286514 438001 769933 746960 670404 581438 447332 261906 212346 107494 77816
17329 77816 81316 -5548 173211 335095 300649 -6836 50163 527205 508974 366038 346482
17318C46482Q3453k78448r4377L61148N0498q6237q0045M0105o880p6400J8894
17307B78193L04373L5294j61906J57484m967o0955j10917j98740L67675K68397
17297H73931L95689J06081k62274j25109K20154q957m66604l45997k15252q3509
17287H8153j52382K51740R6120J10321L50166j5826k75039m75157m3658K8007
17277c7555L84052J18921J37974n3188p5112Q3755N3874l51740j03915K3793n5580
17266A25279K28146j30969j08504J22086P2789j00048j68813K6375N6143J11693
17256B34177M7044k24511r2647j33065j25963K37303J59857k24248k96142j45322
17246e63517M2487J14958K12964K09669K1533J2769J10320k6666j68478P4267
$$ plain form
17318 346482 429935 151487 57110 418258 468756 382519 302474 342579 335699 259299 278193
17307 278193 582566 617860 455954 613438 608471 547516 436599 237859 605534 873931
17297 873931 1269620 1375701 1113427 988318 1208472 1199515 732911 386914 171662 88153
17287 88153 -64229 187511 283631 393952 744118 728292 453253 -21904 -65562 -37555
17277 -37555 346497 465418 603392 550204 475092 558847 612721 260981 157066 180859 125279
17266 125279 353425 222456 113952 236038 308827 208779 39966 66341 122484 234177
17256 234177 281221 56710 -35937 -169002 -294965 -57662 102195 -122053 -418195 -563517
17246 -563517 -521030 -406072 -193108 16561 38094 50863 161183 134517 -33961 40306
17236D0306O8075L4294L5271j13616k50433O225L03779L71456J158k44402N8279
17225C10392J3870k30940k6042J73058K13357l3964k24569l9807K11740J72293
17215E39388k5108j52653n2553J4504K06821J98661q8283k11260P5873K8529J27131
17204F61050j08765J8175k0840J14239l6431j16244K17196j4198k17907q0795
17194D15480n9267J73405K41160j5929j69591L68590J78872k05514j12418J1859
17184H26647J75190J2934J29027j39722n5413J91024o5023K18137J35822o0290
17174A368333l1052J51283K34048J60833j8359J04713q9441L5955L08776K60608
17164B485697K31420q6552L8938L04660L17601N11346P69682O18531O00134N29458
$$ plain form
17236 40306 108381 142675 177946 64330 -186103 -179878 123901 495357 496515 252113 310392
17225 310392 324262 93322 67280 240338 453695 419731 195162 155355 367095 539388
17215 539388 514280 361627 309074 323578 530399 729060 640777 429517 505390 533919 661050
17204 661050 552285 570460 549620 663859 627428 511184 728380 714182 496275 415480
17194 415480 356213 529618 770778 754849 585258 953848 1132720 927206 814788 826647
17184 826647 1001837 1014771 1143798 1004076 948663 1139687 1074664 1292801 1428623 1368333
17174 1368333 1337281 1488564 1722612 1883445 1865086 1969799 1880358 1916313 2225089 2485697
17164 2485697 2717117 2630565 2669503 2974163 3291764 3803110 4572792 5191323 5791457 6320915
17154F320915M39052J4000K05192N70478O99105Q95983J127227J819334K957888
17145A5049174M735601O923548P552366O004700N029234L945369o42894p006634
17137D1590464p552838l771063j013947R20327K730256M320556O544274R780032
17129E3548061J5242321K5255601M2355715O5223642P5424035O3367686N8636289
17122C99053350N4420096J0241653p0137923r2963478n5313724l0016584k7120856
17115A88162534k9698498j9291544m313688O581723R731490Q088625P158321J713065
17107A68132028j3465743k8995626k7220198j7407968j0195752o505321m675551
17100E9665869l644615k613033k087997j965831k099936j599765q05424k10633
$$ plain form
17154 6320915 6759967 6773967 6979159 7549637 8248742 9144725 10271952 12091286 15049174
17145 15049174 19784775 26708323 34260689 40265389 45294623 49239992 48597098 41590464
17137 41590464 34037626 30266563 29252616 30172943 32903199 37223755 43768029 53548061
17129 53548061 68790382 94045983 136401698 201625340 277049375 340417061 399053350
17122 399053350 453473446 463715099 393577176 300613698 245299974 215283390 188162534
17115 188162534 158464036 139172492 134858804 141440527 151172017 159260642 166418963 168132028
17107 168132028 154666285 125670659 98450461 81042493 70846741 64341420 59665869
17100 59665869 56021254 53408221 51320224 49354393 47254457 45654692 44849268 44638635
17092D4638635J9251N2784K4062Q65266J392509J812652L468679O638950J1613161
17083G0525949J7296440J9344102J6825272J5565339J2798695R89256j5346583
17076A37998470j6478860l636744R632083J8109798K3735649L5161975N2610631
17069B57133002O0652885M2414751K6211149L1094626J2435130m9704750j05349139
17062B74887654q4154174m7792695k6737322j6448342j1550328q589022o158374
17055G3457397m303918k736309j516589O40850K772140L193621K325075K263892
17047G6096159P69739m105415r625635r341831o135204l822310k751705k221295
17039C8862503j754767j354559j440058j267193j314849j144806j197467j042378
$$ plain form
17092 44638635 44657886 44710670 44734732 45599998 46992507 48805159 52273838 58912788 70525949
17083 70525949 87822389 107166491 123991763 139557102 152355797 153345053 137998470
17076 137998470 121519610 117882866 127514949 145624747 169360396 204522371 257133002
17069 257133002 317785887 360200638 386411787 417506413 429941543 380236793 274887654
17062 274887654 190733480 142940785 116203463 99755121 88204793 79615771 73457397
17055 73457397 69153479 66417170 64900581 65541431 68313571 71507192 73832267 76096159
17047 76096159 76865898 72760483 63134848 53793017 47657813 43835503 41083798 38862503
17039 38862503 37107736 35753177 34313119 33045926 31731077 30586271 29388804 28346426
17031B8346426j486713j963162j396440r32497p73746o98725p19821p12249o84679
17022A8978394n99711o94944o03331o00134k63703n25908o32225n03345l38986
17013A4216107k10870l79562l11338n63277l87612l21091m41143m08221l76240
17004A0816753n30883l35137k20781j43955l29908l66688k33361j78375l78289
16995H099376k05516J93907k62951l12432m78317l58127n50401l87982j77383
16986E560174O796q1312k66071r9427P6515O809l61442m20601k63888r2190j88074
16975C877289j20728r4749n6550k28049k52577k26777J93834j455j34573r1930
16965B863735k51413j16425Q7986Q0308l5094j38166J22034R5873j12668j13885
$$ plain form
17031 28346426 26859713 24896551 23500111 22567614 21793868 21095143 20375322 19663073 18978394
17022 18978394 18378683 17683739 17080408 16480274 16216571 15690663 15058438 14555093 14216107
17013 14216107 14005237 13625675 13314337 12751060 12363448 12042357 11601214 11192993 10816753
17004 10816753 10285870 9950733 9729952 9585997 9256089 8889401 8656040 8477665 8099376
16995 8099376 7893860 8087767 7824816 7512384 7034067 6675940 6125539 5737557 5560174
16986 5560174 5566970 5485658 5219587 5120160 5196675 5203484 4842042 4421441 4157553 4065363 3877289
16975 3877289 3756561 3661812 3605262 3377213 3124636 2897859 3091693 3090238 2955665 2863735
16965 2863735 2612322 2495897 2583883 2664191 2629097 2490931 2612965 2708838 2596170 2482285
16955B482285J21921k08431J25985J8925j70865K6292J5589j43247m0156Q9696
16945B317994j58709k3300J24050J37956k19860j48920j29786Q6580j68286l26744
16935A490975j73491j36646Q9893k13512j97160j47076k51014k69957P182k6684
16925A72510P9298k27186p4968K76668K28742l9898P9484k36107k35043J21794
16915A45294J06433N8329O4123j80838k38168J11445k21639j50569K10663K35692
16905A40765J09954j33502r4402J33353O3241r3285o0614Q2217P8132L4566J26608
16894C87033k15736r8055M381j54544J47924J02145J04616Q6057L8506R5867J9963
16883E18157r1138j57666J00355K47580l5888k83176L7550Q2997l05610j40474
$$ plain form
16955 2482285 2604206 2395775 2521760 2540685 2369820 2396112 2411701 2268454 2228298 2317994
16945 2317994 2159285 2135985 2260035 2397991 2178131 2029211 1899425 1986005 1817719 1490975
16935 1490975 1317484 1180838 1270731 1057219 860059 712983 461969 192012 199194 172510
16925 172510 251808 24622 -50346 226322 455064 415166 494650 258543 23500 145294
16915 145294 251727 310056 374179 193341 -44827 66618 -155021 -305590 -94927 140765
16905 140765 250719 117217 22815 156168 219409 126124 65510 147727 225859 260425 387033
16894 387033 171297 73242 77623 -76921 71003 173148 277764 363821 402327 498194 518157
16883 518157 427019 269353 369708 617288 581400 298224 335774 418771 113161 -27313
16873b7313K68913J44951k2454m1837j81510j51665j65561P839K78180L01801
16863D11344j85943o1304p3881L2186J11231k22108l53650K0268K7192l118K42512
16852e5271j46899K74596R0228j01536j8013j60850j07655K4424j12202j1440
16842c24618J18726K25026K03015n4530k13105j46492J2788J29427l35645J9665
16832c65743L08748O2193k11L3038j9385l13888j3930K8923J19329p7108P7383
16821a60651m1857j79767j20139l6710L02693n5799J35300j76545J2700M07061
16811H6286J50786p0542k38107k06817R8152J39342J10398q9512j70560j59015
16801c49589j1557O3107q1791o9637J4993Q0022n2382p2922J48974K07840j0377
$$ plain form
16873 -27313 241600 386551 364097 322260 140750 -10915 -176476 -168637 109543 411344
16863 411344 225401 164097 90216 122402 233633 11525 -342125 -321857 -294665 -297783 -55271
16852 -55271 -202170 72426 162654 61118 43105 -117745 -225400 -200976 -313178 -324618
16842 -324618 -205892 19134 222149 167619 -45486 -191978 -179190 -49763 -385408 -365743
16832 -365743 -56995 5198 4987 38025 18640 -295248 -309178 -280255 -160926 -238034 -160651
16821 -160651 -202508 -382275 -502414 -539124 -236431 -292230 -156930 -333475 -320775 86286
16811 86286 237072 166530 -71577 -278394 -180242 -40900 69498 -20014 -190574 -349589
16801 -349589 -361146 -298039 -379830 -449467 -434474 -354452 -406834 -479756 -330782 -122942 -133319
16790a33319Q3013j36979j95896n7145P6955m856J30716J92507j70288k75795
16780d91087P8763l1441N6301j3065J23048J03501j72311N5003k06792j26967
16770f25047J12392J70261J94266J0667O2157p0854o8299j22454j12893k068K162
16759d49710K18361J51804l067j92916m88079o1342M92180K04307q0241M862p0464
16748b74305N5468j75891k25195j76300L25922J79735q9975P6026J3278j7039
16738c08276j96744k58451K98039K20965k2740J7831l914j99044J17533J6289
16728c18512L2198p2326j60146P4453J70395K11652R2230k53871l81817r7597
16718g03341M28584K78316J30634J19463k8025q6834O022l34127n03172n9215
$$ plain form
16790 -133319 -50306 -187285 -383181 -440326 -363371 -368227 -237511 -45004 -215292 -491087
16780 -491087 -412324 -443765 -387464 -400529 -277481 -173980 -346291 -291288 -498080 -625047
16770 -625047 -512655 -342394 -148128 -137461 -75304 -146158 -214457 -336911 -449804 -451872 -449710
16759 -449710 -231349 -79545 -82612 -275528 -763607 -824949 -332769 -128462 -208703 -203841 -274305
16748 -274305 -218837 -394728 -619923 -796223 -470301 -290566 -380541 -304515 -291237 -308276
16738 -308276 -505020 -763471 -465432 -244467 -267207 -249376 -253290 -452334 -334801 -318512
16728 -318512 -286314 -358640 -518786 -444333 -273938 -62286 29944 -223927 -605744 -703341
16718 -703341 -274757 3559 134193 253656 225631 138797 144819 -189308 -692480 -751695
16708g51695K44971K62596P4982m0303M0800K10734N5309r5415k37078J0420R0872
16697a33807M9992n1096k1868j30570J99131J13005L334k08995j42368j45457
16687d68699p5401j02516J79299J83581j8078m0796J20837N1442L6737K27398
16677I3804m8206l33486k4537K61026J7033k12327j03633l8261J83301r963M7493
16666a67756J15553j06930r2705J6946j52463k78807K9968K76598j01619l05678
16656g66893l4342P766K16222L0706K12339k3889n2415l0117q7136K36760K75679
16645a5320L12199P681k33956k02741j61405j4017m9624P2967J0450J62853M8913
16634f2000k05176J03215L06079m4631j59041n4193j3160K62610M40055K24889
$$ plain form
16708 -751695 -506724 -244128 -169146 -209449 -168649 42085 97394 1979 -235099 -224679 -133807
16697 -133807 -83815 -134911 -156779 -287349 -88218 24787 28121 -180874 -323242 -468699
16687 -468699 -544100 -646616 -467317 -283736 -301814 -342610 -221773 -170331 -133594 93804
16677 93804 45598 -287888 -312425 -51399 -34366 -246693 -350326 -388587 -205286 -215249 -167756
16666 -167756 -52203 -159133 -251838 -234892 -387355 -666162 -636194 -359596 -461215 -766893
16656 -766893 -801235 -793469 -577247 -546541 -334202 -358091 -410506 -440623 -527759 -290999 -15320
16645 -15320 296879 304560 70604 -132137 -293542 -307559 -357183 -284216 -273766 -110913 -62000
16634 -62000 -267176 -163961 142118 97487 -61554 -115747 -128907 133703 573758 798647
16624G98647j6733K03121M0963J5179k44136n1542M7404k36638k39740k29547
16614H6978j05765J24905L47357L17308P1322K61330K50789K9667j52209j69581
16604A062101k09398l95153k23587l75183J44469K5496K01472M82L31384m9697
16594E12386j82909n5644j04596l05370k29018P6594J1908J2929q7985J68640
16584a83065N0012m7558Q722r9880N9704K35231J30278O5566K9459r8000K57250
16573D07719M43855K70046j22390j72981r6588k35959l00510k19393j29323N3976
16563a01548R2420J27576M5740j05635j05285K2241j04488o9989J96291J69725
16553A67048Q2628J86828J28734N8434K56412J0417k19965k98937k3861J58240
$$ plain form
16624 798647 781914 985035 1025998 1041177 797041 745499 792903 556265 316525 86978
16614 86978 -18787 106118 453475 770783 842105 1103435 1354224 1383891 1231682 1062101
16604 1062101 852703 457550 233963 -141220 3249 28745 230217 230699 562083 512386
16594 512386 329477 273833 169237 -136133 -365151 -288557 -276649 -263720 -351705 -183065
16584 -183065 -133053 -180611 -171889 -271769 -212065 23166 153444 219010 248469 150469 407719
16573 407719 851574 1121620 999230 826249 729661 493702 193192 -26201 -155524 -101548
16563 -101548 -9128 118448 164188 58553 -46732 -24491 -128979 -198968 -2677 167048
16553 167048 249676 436504 565238 623672 880084 890501 670536 371599 347738 505978
16543E05978j3091j14939k19061m061j92397j86826K8416n6012K32720j20838
16533a40111Q5104M2773o9189J74602P7137j80687k43286Q7191o3158J07268N8655
16522f3701l5567K01677K242l4917p4102p3249j06045o3353R799j44850r1490
16511d73556j3785K60619J33436o5991k9088R563m3973j94072j59753p8032L5095
16500f19537j47407K08842j18845O9973K85498K48755J40080K45441k29946j97152
16490a14298L4211M3002K9928O004j97651k29386m6048l9457J09758N0747q3159
16479d36349J22611m9188n4071Q4487J63859P2906r7121l682N8710r0605J43621
16468h4822Q5960K25987l8922l64167j0133r6920N0342j13006j13707n7630q3173
$$ plain form
16543 505978 492887 377948 158887 154826 -37571 -224397 -195981 -251993 -19273 -140111
16533 -140111 -55007 -12234 -81423 93179 170316 -10371 -253657 -166466 -229624 -122356 -63701
16522 -63701 -99268 102409 104651 69734 -4368 -77617 -183662 -247015 -237216 -382066 -473556
16511 -473556 -487341 -226722 -93286 -159277 -188365 -178802 -222775 -416847 -576600 -654632 -619537
16500 -619537 -766944 -558102 -676947 -606974 -321476 -72721 67359 312800 82854 -114298
16490 -114298 -80087 -37085 -7157 -1153 -198804 -428190 -474238 -513695 -403937 -353190 -436349
16479 -436349 -313738 -362926 -416997 -332510 -168651 -95745 -192866 -196548 -137838 -228443 -84822
16468 -84822 1138 227125 188203 -175964 -186097 -283017 -232675 -345681 -459388 -517018 -600191
16457f00191j18076q693J52963J059m9704j52330J81399J41739R0482J3701j9620
16446c67271j26213J81155J04075n7184j40211Q7337j15606j18186J58299J24741
16436b69064k8430N1268q0660J4156L8636j4003J82060j23482n0232o9046j26182
16425d74979j1259J9473m2313j10217J4008K20299J06046k11265p1739j24137
16415f86083o2834J93442J93412J00034O8703J57157k0070k38150k17861j1224
16405e23474P0786J33490k32766l27982J28318J18974L0683k14572j38598p9194
16395a034335L96861J83236n4964k42389k9700J30555r0313J1216P0863J42361
16385e16609J64810n9023k5879L7764J44888K12820M2845m564J14187J82836n5939
$$ plain form
16457 -600191 -718267 -726960 -573997 -572938 -622642 -774972 -593573 -451834 -361352 -347651 -367271
16446 -367271 -493484 -312329 -208254 -265438 -405649 -318312 -433918 -552104 -393805 -269064
16436 -269064 -297494 -246226 -326886 -312730 -274094 -288097 -106037 -229519 -279751 -348797 -474979
16425 -474979 -486238 -466765 -509078 -619295 -605287 -384988 -278942 -490207 -561946 -686083
16415 -686083 -748917 -555475 -362063 -262029 -193326 -36169 -56239 -294389 -512250 -523474
16405 -523474 -452688 -319198 -551964 -879946 -751628 -632654 -601971 -816543 -955141 -1034335
16395 -1034335 -637474 -454238 -509202 -751591 -781291 -650736 -741049 -729833 -658970 -516609
16385 -516609 -351799 -410822 -436701 -398937 -254049 -41229 1616 -2948 111239 294075 238136
16374B38136k32951j9410k09139j47933R1621M9183J7838L015p9545j98444M5381
16363d42248k6765l9151N7548L42446K45818j60701j72602J7798m5503j71443
16353c94803J6925L8249R374Q982M3078O3552J6857j67113k6815J40093J8821
16342b32800L73857k9780k0219j53064j79547j9934r9044j44417k7897L73944
16332a58901n8983J1547M2561j67259o4867Q9157r2736j11786J53313J05686J67113
16321h5155o6720N138k34517O2049J65361p4738j77651k6228P1138J00575l8058
16310b98806j70107o3816q6657j05680K06196L36080q3724j28629j24038K96674
16300b22507O3151O3632q4699j52187l49595j60380M1914r2853R9717K76510m3744
$$ plain form
16374 238136 5185 -14225 -223364 -371297 -279676 -230493 -212655 -209640 -289185 -487629 -442248
16363 -442248 -469013 -508164 -450616 -108170 137648 -23053 -195655 -177857 -223360 -394803
16353 -394803 -377878 -339629 -330255 -321273 -278195 -214643 -197786 -364899 -391714 -251621 -232800
16342 -232800 141057 111277 91058 -62006 -241553 -261487 -360531 -504948 -532845 -158901
16332 -158901 -217884 -206337 -163776 -331035 -395902 -306745 -399481 -511267 -357954 -252268 -85155
16321 -85155 -151875 -146737 -381254 -319205 -153844 -228582 -406233 -432461 -361323 -260748 -298806
16310 -298806 -468913 -532729 -619386 -725066 -518870 -182790 -266514 -395143 -519181 -222507
16300 -222507 -159356 -95724 -180423 -332610 -682205 -842585 -800671 -893524 -793807 -517297 -561041
16289e61041J85315L32376P8088l49847m4809J60864O1012J36542J3573j96276
16279a84203k02047l4540K52857m3664j20914k07778j46839n1213J18714R4004
16269e25623O750k68976q1244J78011L85741o7990j47714l06228l104j01938M2424
16258h89891J12768J80829J10738l2774o6456L06097K11789K3316j13530j88208
16248c45322L6889R7905r2884k04036j59424P015Q456P4502R0682k8571L1597
16237d83191J05821J14137P5473P2861K0149k11368k85667J14343j53870K47931
16227c83381L96210L8450r303k50786j57130j05774k14195k4287P8897O4416Q0955
16216d85928J24720R6671L8783j03699n3510j92861m971J41476O4473j948j41095
$$ plain form
16289 -561041 -375726 -43350 34738 -315109 -359918 -199054 -138042 -1500 12073 -184203
16279 -184203 -386250 -420790 -167933 -211597 -332511 -540289 -687128 -738341 -619627 -525623
16269 -525623 -518873 -787849 -869093 -691082 -305341 -373331 -521045 -827273 -830377 -932315 -889891
16258 -889891 -777123 -596294 -485556 -518330 -584786 -278689 -66900 -43584 -157114 -345322
16248 -345322 -308433 -210528 -303412 -507448 -666872 -659857 -651401 -576899 -486217 -514788 -483191
16237 -483191 -377370 -263233 -187760 -114899 -94750 -306118 -591785 -477442 -631312 -383381
16227 -383381 12829 51279 41976 -208810 -365940 -471714 -685909 -710196 -631299 -566883 -485928
16216 -485928 -361208 -264537 -225754 -329453 -382963 -575824 -580795 -439319 -374846 -376794 -517889
16205e17889K5411J07267q1143j76602j87518K38792K22532k39344k04248l5131
16195h47873P0857R3367J39824N2324q8892n5040Q2952L17341K03993k79706j11174
16184d22027J76991J00694k34203p3966p4545J02786K0535L7545J14264p3232
16174c25158q6851J16634n569j97787J02760L38453J00406j07754j73033k41998
16164d79897j51018M7307J59142l1385J9957J41447L2277k2194M7024o7850j99573
16153e04763j33682j1389J94131k04611l04330J68712K34152P2466J67735J37851
16143a83728j2564j15348j07813Q0859n8114N9217K7014k13817M4007m7194j55233
16132f82714P9369K8981K5694J57317k04133k0351j72245o3355J48672k006J97037
$$ plain form
16205 -517889 -492478 -385211 -466354 -642956 -830474 -591682 -369150 -608494 -812742 -847873
16195 -847873 -777016 -683649 -543825 -491501 -580393 -635433 -552481 -235140 -31147 -310853 -422027
16184 -422027 -245036 -144342 -378545 -452511 -527056 -424270 -403735 -366190 -251926 -325158
16174 -325158 -412009 -295375 -300944 -498731 -395971 -57518 42888 -64866 -237899 -479897
16164 -479897 -630915 -583608 -424466 -455851 -435894 -294447 -262170 -284364 -237340 -305190 -504763
16153 -504763 -638445 -649834 -455703 -660314 -964644 -795932 -561780 -489314 -321579 -183728
16143 -183728 -196292 -311640 -419453 -338594 -396708 -337491 -310477 -524294 -480287 -527481 -682714
16132 -682714 -603345 -574364 -548670 -391353 -595486 -615837 -788082 -851437 -702765 -704771 -507734
16121e07734J87667k8985j33995k12641k40578J00996L95550J0378k3806l050
16111d56198J05058L6120o082j34348o7267l4006J11380j10957k9467K39186J5705
16100c30876P457J20001J00480J2151j81686N0933Q4419m5739j44980k48735j35426
16089g12001J02652K9098J53667K38766l5213j81275J04018Q5291o9400M5786
16079b38611p5046j75878r9650K9581J64414N7718r1024o2790m5154n0193N7920
16068e28713Q354J60082M993n3578j27257j80986J45166l5924J41919j07815P2557
16057e01202L0699m1451J20898k56151p4595O3897K62099J18552l8097J12147
16047b03204J09263J29459j25208j27679l9496K0029P4441n404j33531N592R0551
$$ plain form
16121 -507734 -320067 -349052 -483047 -695688 -936266 -835270 -439720 -429342 -453148 -456198
16111 -456198 -351140 -315020 -321102 -455450 -522717 -556723 -445343 -556300 -585767 -346581 -330876
16100 -330876 -323419 -203418 -102938 -90787 -272473 -221540 -137121 -182860 -327840 -576575 -712001
16089 -712001 -609349 -580251 -426584 -187818 -223031 -404306 -300288 -214997 -284397 -238611
16079 -238611 -313657 -489535 -589185 -559604 -395190 -337472 -428496 -491286 -536440 -586633 -528713
16068 -528713 -520359 -360277 -355284 -408862 -536119 -717105 -571939 -607863 -465944 -573759 -501202
16057 -501202 -470503 -511954 -391056 -647207 -721802 -657905 -395806 -277254 -315351 -203204
16047 -203204 -93941 35518 -89690 -217369 -256865 -236836 -162395 -167799 -301330 -295738 -205187
16036b05187J62693l8078k5394k08351j35172K88548J0179j40515k16596N4250
16026d53623J79017L69553J32316n4924o2710j08558j41259j4603j28805L792
16016b79804l4431r1430J376P5195j11522Q2406J23480q0846l7256k06457J5084
16005e44205j53451o2360K14856R5463k60099p902L03662Q9345n2249J7186J45505
15994b14249O3111k12268j7324j3602j24214L2049K44269J80499q0892q7996K5041
15983b05576k43893r0953J12762J42491P439O7958J15368K9244k55440l8060N3835
15972c04825p4099N9564k1127J00967n2249j27304R646N6713j11103N7049O7547
15961c39221K80229k9085K8300m142J52731n4818j5875L6171k82916j74033J11627
$$ plain form
16036 -205187 -42494 -80572 -105966 -314317 -449489 -160941 -150762 -291277 -507873 -453623
16026 -453623 -274606 94947 227263 172339 109629 1071 -140188 -154791 -283596 -279804
16016 -279804 -314235 -405665 -404289 -329094 -440616 -358210 -234730 -315576 -352832 -559289 -544205
16005 -544205 -697656 -760016 -545160 -449697 -709796 -717698 -414036 -324691 -376940 -359754 -214249
15994 -214249 -151138 -363406 -380730 -394332 -518546 -486497 -242228 -61729 -142621 -230617 -205576
15983 -205576 -449469 -540422 -427660 -285169 -277730 -209772 -94404 -65160 -320600 -358660 -304825
15972 -304825 -378924 -319360 -340487 -239520 -291769 -419073 -409427 -352714 -463817 -406768 -339221
15961 -339221 -58992 -88077 -59777 -63919 88812 33994 18119 54290 -228626 -402659 -291032
15950b91032k4716j76334j90883l7833K33092J70013p7640k00475j47505K36780
15940e06533j9874O312O7047j48298j87343l9441P6773L07064J49195J99471L4011
15929f1616k51027k33515j10248p0996j46137J54365K43351k75665L29645K92929
15919a28914J95627J75260k34755j31097r3584k76312r3940L06560J50115j71903
15909c02943k88832J36173L29777j7894k66421K9570j42990m0929P1204J64472
15899c28813K7545O0326R3465l1464m6177j37332m7600n4337m8705P3581q4045
15888e23556k0377J2988J26290j21579m0963n477k9197N3463k28067j51873k4478
15877i52826j8341J22550J47054P7351J12938J10702p4814K1012J84925N9349
$$ plain form
15950 -291032 -315748 -492082 -682965 -720798 -487706 -317693 -395333 -595808 -743313 -506533
15940 -506533 -526407 -520095 -453048 -601346 -788689 -828130 -751357 -444293 -295098 -95627 -61616
15929 -61616 -312643 -546158 -656406 -727402 -873539 -719174 -475823 -751488 -421843 -128914
15919 -128914 66713 241973 7218 -123879 -217463 -493775 -587715 -281155 -131040 -302943
15909 -302943 -591775 -455602 -125825 -143719 -410140 -380570 -523560 -564489 -493285 -328813
15899 -328813 -301268 -240942 -147477 -178941 -225118 -362450 -410050 -464387 -513092 -439511 -523556
15888 -523556 -543933 -530945 -404655 -526234 -567197 -572674 -601871 -548408 -776475 -928348 -952826
15877 -952826 -971167 -848617 -701563 -624212 -511274 -400572 -475386 -454374 -269449 -210100
15867b10100o0362j09129j97705O4786M3432Q1536l6230K8980K57051J14991j78850
15856b01600j43592p2414J00467J03047O1864J44753k71319k87834o6117R5266
15846e37479O2993P7624K5325N7621m1365j81180j56061J66231J91716k5500k07209
15835e67284k4352p1024N6347K94632J00210M6500k42392k0039L9725N115Q5643
15824b96919l3611q5452n1147J12279j7504L8684L1414K36720m8381k45819P6190
15813b83546n8302J11042j78091l2124J5765j59403k2292O5969q8835m7512K39020
15802d38309L94457j306k52471N1392j34522l8430n4898j73593R8832K80791J96232
15791g1825K62832o1310k44496j51222r2710K2223J28317j19009O8110j9980J38159
$$ plain form
15867 -210100 -270462 -379591 -577296 -512510 -469078 -387542 -423772 -394792 -137741 -22750 -201600
15856 -201600 -345192 -417606 -317139 -214092 -152228 -7475 -278794 -566628 -632745 -537479
15846 -537479 -474486 -396862 -371537 -313916 -355281 -536461 -692522 -526291 -334575 -360075 -567284
15835 -567284 -591636 -662660 -606313 -311681 -211471 -164971 -407363 -427402 -387677 -382562 -296919
15824 -296919 -330530 -415982 -467129 -354850 -372354 -333670 -302256 -65536 -113917 -359736 -283546
15813 -283546 -341848 -230806 -408897 -441021 -425256 -584659 -606951 -540982 -629817 -677329 -438309
15802 -438309 -43852 -45158 -297629 -246237 -380759 -419189 -474087 -647680 -548848 -268057 -71825
15791 -71825 191007 129697 -114799 -266021 -358731 -336508 -208191 -327200 -259090 -279070 -140911
15780a40911J66104k2545O2201l0243k56378j972J85955Q1853j25823K340j86553
15769b65972K6550N2596n545J8840p7834K050j76246M3493N0280k0664n441l7856
15757c95749M614o995J69838l2496M1804K85408K02775j97715j55921j09998j1063
15746b05498k73255k9302L3709j57741j94058Q443J02248J45809k1115P2814K6446
15735d91500P1414N2475J85017N433J06226K68576q2064j93385k36746o0243j55601
15724e30398J45258J38274L7546J01284J69690n6470J05424j00569j32951K4083
15714i8829J79443j62591j58954J9159J49141m0183j21672j5026K33346q6550
15704a02716m5954N7710J30565k4829k84052k59883J34323j22634k5410L0979
$$ plain form
15780 -140911 25193 2648 64849 34606 -221772 -223744 -37789 44064 -81759 -79419 -265972
15769 -265972 -239422 -186826 -192371 -173531 -251365 -249315 -425561 -382068 -331788 -352452 -357893 -395749
15757 -395749 -391135 -398130 -228292 -260788 -218984 66424 269199 71484 -84437 -194435 -205498
15746 -205498 -478753 -508055 -474346 -632087 -826145 -817702 -715454 -569645 -590760 -517946 -491500
15735 -491500 -420086 -367611 -182594 -177161 -70935 197641 115577 -77808 -314554 -374797 -530398
15724 -530398 -385140 -246866 -209320 -108036 61654 5184 110608 10039 -122912 -98829
15714 -98829 80614 -81977 -240931 -221772 -72631 -112814 -234486 -249512 -16166 -102716
15704 -102716 -148670 -90960 39605 14776 -269276 -529159 -394836 -517470 -542880 -511901
15694e11901Q8804J85443J5799m30520j91171K34304K12556J34248K5680K85842
15684D9084O4831j82685r0163q9978J30472M7747k82032k68480O7039L03399J98365
15673e2401L4619K5158J06642N9208k43476j42015M5786j30502L6499R5253l7448
15662b02677q3558J09621K86921l61252k99343p0529p158p5112P1540K85101Q0120
15651b66326R1252R7779m2818N1330n5228j2791J73729k82748j85290J44365j4973
15640c01719j21836P5420M4781K15546J36449j22121r8420N4321n8829j67994
15630c44402o7146n6088J63416j33515N1480J33401j42153O6520J23608J00309
15620a04570K3938J67620k2771k61094k60592j10611K46901K39005J5240R4109
$$ plain form
15694 -511901 -423097 -237654 -221855 -652375 -843546 -609242 -396686 -262438 -236758 49084
15684 49084 113915 -68770 -158933 -248911 -118439 -70692 -352724 -621204 -554165 -250766 -52401
15673 -52401 -17782 7376 114018 173226 -70250 -212265 -166479 -296981 -260482 -165229 -202677
15662 -202677 -286235 -176614 110307 -250945 -550288 -620817 -627975 -703087 -631547 -346446 -266326
15651 -266326 -175074 -77295 -120113 -68783 -124011 -136802 36927 -245821 -431111 -286746 -301719
15640 -301719 -423555 -348135 -303354 -87808 48641 -73480 -171900 -117579 -176408 -344402
15630 -344402 -411548 -467636 -304220 -437735 -386255 -252854 -395007 -328487 -204879 -104570
15620 -104570 -80632 86988 64217 -196877 -457469 -568080 -321179 -82174 -66934 27175
15610B7175K44340j56298k49005R8063k0141j01830J2374K39214j21790j61280
15600a89178K0425K52808J51114o9952r2842k26201m47551n1376J72494R3678
15590c86581k24866j20913L22865J33184J18889J29861j79532m1456J9405J09212
15580a19932o5106L2552q6223r5000J07955j46839L9178J78942p7749N6266J64607
15569a1349Q4075j32962k52102q7020J01443O145j33839l1999N0085J79013p1931
15558c00441m1946j23834J0540J52355k0825J78069J19256j02537J02185M02231
15548C75053o3850j56448j5307J11237j81863l53651k0481K35073K14010P7579
15538B21352K2303k80749l07061J19940J50865R5305j44560j88683k27803J6881
$$ plain form
15610 27175 271515 115217 -133788 -35725 -55866 -157696 -145322 93892 -27898 -189178
15600 -189178 -168753 84055 235169 165217 72375 -153826 -601377 -652753 -480259 -386581
15590 -386581 -611447 -732360 -409495 -276311 -157422 -27561 -207093 -248549 -229144 -119932
15580 -119932 -185038 -152486 -238709 -333709 -225754 -372593 -333415 -154473 -232222 -175956 -11349
15569 -11349 72726 -60236 -312338 -399358 -297915 -291770 -425609 -457608 -407523 -228510 -300441
15558 -300441 -342387 -466221 -455681 -303326 -324151 -146082 -26826 -129363 -27178 375053
15548 375053 311203 154755 139448 250685 68822 -284829 -305310 -70237 143773 221352
15538 221352 243655 -37094 -344155 -224215 -73350 21955 -122605 -311288 -539091 -522210
15528e22210K25016J37862J17087k78516j77412J45431k1265P9490J34181J43446
15518a6890J47450m3836r8856j43772p5220J40274L54041r2749k53172j66389
15508b49119k40940j6824K25851j1305P8018M1892m3714m4810p1231j59444r2780
15497e84406K413P6405J05344J33545J19912q444j2942J04691r2860j83031K1770
15486c17603N9504j05586m0725K18456R4920j98799P0102J92937K66259L2347
15476B71812k271l8914o8830l46531j20333O2998l8556M2155p1399J50628N4376
15465a04865J2207k53773J1934J1534K82444Q4414n5671J09434l5484K31123n7565
15454B35732j93053J02616o726Q001r1571L2003K57921j50001r9213J8407k034
$$ plain form
15528 -522210 -297194 -159332 -42245 -320761 -498173 -352742 -374007 -294517 -160336 -16890
15518 -16890 130560 86724 -12132 -155904 -231124 -90850 263191 170442 -82730 -249119
15508 -249119 -490059 -506883 -281032 -292337 -214319 -172427 -216141 -260951 -332182 -491626 -584406
15497 -584406 -581993 -505588 -400244 -266699 -146787 -155231 -168173 -63482 -156342 -339373 -317603
15486 -317603 -258099 -363685 -404410 -185954 -91034 -289833 -219731 -26794 239465 271812
15476 271812 269541 230627 161797 -184734 -305067 -242069 -280625 -238470 -309869 -159241 -104865
15465 -104865 -92658 -346431 -334497 -322963 -40519 43895 -11776 97658 62174 293297 235732
15454 235732 42679 145295 138569 146570 54999 87002 344923 194922 95709 114116 112082
15443A12082k2568Q7049K97446p292L2178q8208j40518n5973K8767q9164n9560
15432I4239q1928j03699J44582l1383q0223L7048P2435p4060J40472J01633Q2364
15421C01480j59622j11821n1130l0098R4709k96823j25700l0488J7183L7751J22613
15410b31946J60659K00642j82451J23317J37664M1486M3044q4221j4760l2509
15400A60925p5084j23412L2498L24015n2837n5683j7302J30401J58017J38985
15390F20523k32j9122m4786k75576k764N4489k51798l16190J32907K67166J23390
15379B88007k93777j48144K82684K32667J01554K6073j69029j63017j4381k9857
15369A12780k1380o8274J23311P1532j6308K67040R410k48199m62905j00534K53289
$$ plain form
15443 112082 89514 176563 474009 466717 498895 410687 270169 214196 242963 153799 94239
15432 94239 12311 -91388 53194 21811 -58412 -21364 51071 -22989 117483 219116 301480
15421 301480 141858 30037 -21093 -51191 43518 -253305 -379005 -409493 -392310 -354559 -231946
15410 -231946 -71287 129355 -53096 70221 207885 249371 292415 208194 193434 160925
15400 160925 85841 -37571 -5073 318942 266105 210422 193120 323521 481538 620523
15390 620523 620291 601169 556383 280807 278043 332532 80734 -235456 -102549 164617 288007
15379 288007 -5770 -153914 128770 361437 462991 489064 320035 157018 142637 112780
15369 112780 91400 23126 146437 217969 201661 468701 478111 229912 -232993 -333527 -80238
15358h0238l2216P310m5944J38575R8709J59133K94250K01333M9637j43522j31647
15347E15380l20680k94321O1798K53281M6511j71456n9716P2533J16564J01475
15337C21369L6712p2192o9786L3542J56446J51570k02740j24778j17789j50969
15327c8615n8311k218K07290O8860J66865J10377j97814k26563n1156J88298o6085
15316A00928k09667P6450K52455j09631J7847O8907J85176L31389J49302J34828
15306I97984k53540r9367j76061j78212K49589K06577k40283j12374L563K21k26884
15295A71213l08372J20984Q5299K96276K50379k61871k61364n7541j8633M9992
15285F6362Q4894J48229M4725O9717j09335o9960l0287K93624J99629J69357Q6952
$$ plain form
15358 -80238 -112454 -105144 -151088 -12513 86196 245329 539579 740912 790549 647027 515380
15347 515380 194700 -99621 -37823 215458 261969 90513 30797 103330 219894 321369
15337 321369 358081 285889 216103 249645 406091 557661 354921 230143 112354 -38615
15327 -38615 -96926 -99144 108146 177006 343871 454248 256434 29871 -21285 167013 100928
15316 100928 -108739 -32289 220166 110535 128382 197289 382465 713854 863156 997984
15306 997984 744444 645077 469016 290804 540393 746970 506687 394313 397876 398097 171213
15295 171213 -137159 -16175 69124 365400 615779 353908 92544 35003 16370 66362
15285 66362 151256 299485 344210 413927 304592 234632 204345 497969 697598 866955 953907
15274I53907j98267j99884J14332l7955M0070L4957M025j6897j14989J88452k323
15263G65428j83196j73444j66304m6400L36469O1928M4774J45747o3242m4698
15253F77062J13792j30983K01226n7507q7710j19254O8625j79390R2174L11309
15243H89344k34038j29143O5455J00656M1831J00890M3197l24n6244K26248m1918
15232A005954J14248j00793j36865K15949R1311l53919q1598L6858J97833K9029
15222A018007j99415J10185P5459j37229J71960Q3002j28285R9073j6242L5945
15212A112460J29963K87174k57306k44087m7972m5460k6815J33111n6558o3713
15202I20797K1065P0521j05739R3480J05061q9226j59892k1377O7464j3154j85678
$$ plain form
15274 953907 755640 555756 670088 632133 672203 707160 711185 694288 579299 767751 765428
15263 765428 582232 408788 242484 196084 532553 594481 639255 785002 721760 677062
15253 677062 790854 659871 861097 803590 715880 596626 665251 485861 578035 889344
15243 889344 655306 526163 591618 692274 734105 834995 878192 877868 821624 1047872 1005954
15232 1005954 1120202 1019409 882544 1098493 1189804 835885 754287 791145 988978 1018007
15222 1018007 818592 928777 1004236 867007 1038967 1121969 993684 1092757 1076515 1112460
15212 1112460 1242423 1529597 1272291 1028204 980232 934772 907957 1041068 984510 920797
15202 920797 941862 1012383 906644 1000124 1105185 1015959 856067 834690 902154 889000 703322
15191G03322q1404K03467J32403K51460O3249J98115O0372M6064J00687m8254
15181A629481J3880k43584k79720r0767K09217k9108k45722L8498j9614L99955
15171A382516J51723N4631M5326j12216O2820J82245p5873Q9039r3990l36302
15161A349919j11034J97725K00334K53171P0984j30272r2624j74563J4954j50201
15151A428393k5803O0332o925L6653L027n6393K4070k1123L0146n7346o1289J74411
15139A528153r5741o5134K02292J56719N7697p282n4810n1047K0942N8257j41795
15128A608251o5205K23056m9824k26956K06440N6404J59546K66056M1296O6948
15118B286012o826k09825j6089L7776j51361k31802R1805k46909P2213J93734
$$ plain form
15191 703322 621918 825385 957788 1209248 1272497 1470612 1530984 1577048 1677735 1629481
15181 1629481 1643361 1399777 1120057 1029290 1238507 1209399 963677 1002175 982561 1382516
15171 1382516 1534239 1588870 1634196 1521980 1584800 1767045 1691172 1780211 1686221 1349919
15161 1349919 1238885 1436610 1636944 1890115 1961099 1830827 1738203 1563640 1578594 1428393
15151 1428393 1402590 1462922 1455997 1492650 1495677 1439284 1463354 1442231 1472377 1415031 1353742 1528153
15139 1528153 1432412 1367278 1569570 1726289 1783986 1776704 1721894 1670847 1691789 1750046 1608251
15128 1608251 1543046 1766102 1716278 1489322 1695762 1752166 1911712 2177768 2219064 2286012
15118 2286012 2279186 2069361 2053272 2091048 1939687 1707885 1799690 1552781 1624994 1818728
15108A818728l8625L03572J15288J42080j7655r8877P2650M9583J18142J25981
15098B590867K89427k21210k72803J06218r5299l02676K69341j7459r8076J51893
15088B400223K90503k10203Q3575j93425j85273K53937J88513J57923P6551J83674
15078C045998k36833k66663j25064N2975L54570J30922j91004k02085M1635K43511
15068B847962K64821N8508o2621j03107k4595K46144O9111q7355J22772n3195
15058C278445J00553k26703l2963L7531M8133J55970J3531O4718J91135K9147
15048C659497k3477n8474O3166j05199q2291J08304N1230j590J90064L04590m0953
15037D064867m104J01003j65268k33436m3230j3968L52429K82569L5030q5496
$$ plain form
15108 1818728 1780103 2083675 2198963 2341043 2323388 2224511 2297161 2346744 2464886 2590867
15098 2590867 2880294 2659084 2386281 2492499 2397200 2094524 2363865 2346406 2248330 2400223
15088 2400223 2690726 2480523 2564098 2370673 2185400 2439337 2627850 2785773 2862324 3045998
15078 3045998 2809165 2542502 2417438 2470413 2824983 2955905 2764901 2562816 2604451 2847962
15068 2847962 3112783 3171291 3108670 3005563 2980968 3227112 3296223 3208868 3331640 3278445
15058 3278445 3378998 3152295 3119332 3156863 3204996 3360966 3374497 3439215 3630350 3659497
15048 3659497 3636020 3577546 3640712 3535513 3453222 3561526 3612756 3611166 3801230 4105820 4064867
15037 4064867 4060763 4161766 3996498 3763062 3719832 3705864 4058293 4340862 4375892 4290396
15027D290396J9785K82864M221j26908k5738N0432l2496K3887p3717m1071L89067
15016D760722N11111Q8030j39130j14262K58413N15612P17427J378431K135008
15007A0111362L020604K426336K161135K628108R37104k524628m761344l001442
14999A0997235j703115r62867l60746l30213m98438j35441L3998j8368j72456
14990F849589J03750L11259j6868J36526k12878r8324J99004m2555l3405j59083
14980G037015k44772N7464J97988j14542R4716J0074K19107O135J01749R5993
14970G460927j2198l1329j07454Q5130j42939j43602p372L46432K50482J95700
14960G893777o5271l5624K20262Q3859j13839j80378j3970J62677k382J92957
$$ plain form
15027 4290396 4310181 4593045 4597266 4470358 4444620 4495052 4462556 4486443 4412726 4371655 4760722
15016 4760722 5271833 5359863 5220733 5106471 5364884 5880496 6597923 7976354 10111362
15007 10111362 13131966 15558302 17719437 20347545 21284649 18760021 13998677 10997235
14999 10997235 9294120 8331253 7970507 7640294 7141856 7006415 7040413 7022045 6849589
14990 6849589 6953339 7264598 7247730 7384256 7171378 7073054 7272058 7229503 7196098 7037015
14980 7037015 6792243 6849707 7047695 6933153 7027869 7037943 7257050 7263185 7364934 7460927
14970 7460927 7448729 7417400 7309946 7395076 7252137 7108535 7101163 7447595 7698077 7893777
14960 7893777 7828506 7792882 8013144 8097003 7983164 7802786 7788816 7951493 7949111 8142068
14950H142068Q0538K417J74832L6508k898R4587o5725J32790K25457O6451J01706
14939H988731O5411L9026q560o8313K15260K07551O6200M2491K95360R0635k24916
14928I708876j01252M39525K18583K9686m6921o9152L5734J06657J14274J27538
14918A0563548k61355J6655K86344J32611J45424M4316K47057J99110K7093L3721
14908A1434524J069j05687k9319M5186K69380P5703J67400J47543K85602k4784
14898A2266617k2979L70098r4900j85379J43409K52480P2072O0815j6446L8946
14888A2884733k20063J71726K02317J50362L44133J73075K36752M23162M2284
14879A4408481j42946l6242n3018j937P4493K60633J87689J03476p5500K0570
$$ plain form
14950 8142068 8222606 8225023 8399855 8436363 8433465 8528052 8462327 8595117 8820574 8887025 8988731
14939 8988731 9054142 9093168 9084608 9016295 9231555 9439106 9505306 9547797 9843157 9933792 9708876
14928 9708876 9607624 10047149 10265732 10295418 10248497 10179345 10215079 10321736 10436010 10563548
14918 10563548 10302193 10318848 10605192 10737803 10883227 10927543 11174600 11373710 11400803 11434524
14908 11434524 11435593 11329906 11300587 11345773 11615153 11690856 11858256 12005799 12291401 12266617
14898 12266617 12243638 12613736 12518836 12333457 12476866 12729346 12801418 12862233 12845787 12884733
14888 12884733 12664670 12836396 13038713 13189075 13533208 13706283 13943035 14366197 14408481
14879 14408481 14265535 14229293 14176275 14174338 14248831 14509464 14697153 14800629 14725129 14745699
14869A4745699O1167K07819J92495O6379N2845j45241j36500K7794L56728O1857
14859A5491042J11185K09682L8959L735J98141R1841k7710m9789J96588K919K75719
14848A6542312L48551k84075k50511P8313L1938k4671j07572M5515L30818J25399
14838A6836017p7858p4493J47723P8315O6553J62438j0060J18479P7405k97092
14828A7027427k49896J47189Q6477j29160j95845J14990L03463J63166r4673j6085
14818A7157053j99846j08264Q7094J77164J1886k21428l03977J34435J64417k0414
14808A6878120J33655R2127k48261O119K1594k8959r1652j150L2350J1392p6043
14797A6729292J67115n8553p8165k15406m38263j37165Q490R2352J55038K62304
$$ plain form
14869 14745699 14806866 15014685 15207180 15273559 15326404 15181163 15044663 15072457 15429185 15491042
14859 15491042 15602227 15811909 15850868 15854603 16052744 16144585 16116875 16067086 16263674 16266593 16542312
14848 16542312 16890863 16606788 16356277 16434590 16466528 16441857 16334285 16379800 16710618 16836017
14838 16836017 16758159 16683666 16831389 16909704 16976257 17138695 17128635 17247114 17324519 17027427
14828 17027427 16777531 16924720 17011197 16882037 16686192 16801182 17104645 17267811 17173138 17157053
14818 17157053 16957207 16848943 16936037 17113201 17125087 16903659 16599682 16734117 16898534 16878120
14808 16878120 17011775 17103902 16855641 16861760 16883354 16854395 16762743 16761593 16793943 16805335 16729292
14797 16729292 16896407 16837854 16759689 16544283 16106020 15968855 15977345 16069697 16224735 16487039
14787A6487039l00965l46703O7555J16876L41137J49186k16463m56541j37303
14778A5703818n6608j6414j17039J60349P0845m4435q7413j50368p8078O4406
14768A5449063j3466J24438o2556l49352k47333J32367N9845k29710j45582k4369
14758A4693345J73517k11327m51304q8737L4373K2395k68348k65141O365K41014
14748A3886152p4847j09345l1440k44612j27267r6412j28397j67630P6231R5211
14738A3077644J05049o7168j89863p7145k3181J48803j69177k57463m2565J15890
14728A2620824j0650l13571K5506j02177l18329l18725j53232k57333J05837M6248
14718A1324398R830J94040j90543l08027J75555K79937j02290j28549k41841L8845
$$ plain form
14787 16487039 16186074 15839371 15906926 16023802 16364939 16514125 16297662 15841121 15703818
14778 15703818 15647210 15630796 15513757 15674106 15744951 15700516 15613103 15462735 15384657 15449063
14768 15449063 15435597 15560035 15497479 15148127 14900794 15033161 15093006 14863296 14717714 14693345
14758 14693345 14866862 14655535 14204231 14115494 14149867 14172262 13903914 13638773 13645138 13886152
14748 13886152 13811305 13701960 13670520 13425908 13298641 13202229 13073832 12906202 12982433 13077644
14738 13077644 13182693 13115525 12925662 12848517 12825336 12974139 12804962 12547499 12504934 12620824
14728 12620824 12610174 12296603 12322109 12219932 11901603 11582878 11429646 11172313 11278150 11324398
14718 11324398 11334228 11528268 11337725 11029698 11205253 11485190 11382900 11254351 11012510 11051355
14708A1051355j16605K43344r8578k44561j26352j95821j63045N2612p303n4323
14698A0340723Q4894J41375L6240n07857k58510K4023r5002j71816j06715j09231
14688I378124j1960K01266r3907j88731j04328r549J7653N7330J2116n7366k35808
14677H964840K0618p7007j54921p4524k9601J33653N6313k45186q4246k06969
14667H302970r1262K9621j82958J3712K42218o5203j59735l0740m5954j65758
14657G846911j30200m48J22820Q5990k50104j77141J88686j75142o9136J37284
14647G579520j25511p3287p3480k539K681k10667J0941r23j85152q6472j30286
14636F704825j02099K7653m9731J13997K33807l7042n6096L4002J22852j4189
$$ plain form
14708 11051355 10934750 11178094 11079516 10834955 10708603 10512782 10349737 10402349 10395046 10340723
14698 10340723 10425617 10566992 10603232 10095375 9836865 9860888 9765886 9594070 9487355 9378124
14688 9378124 9366164 9567430 9473523 9284792 9180464 9170915 9188568 9245898 9258014 9200648 8964840
14677 8964840 8985458 8908451 8753530 8679006 8649405 8783058 8839371 8594185 8509939 8302970
14667 8302970 8211708 8241329 8058371 8072083 8314301 8249098 8089363 8058623 8012669 7846911
14657 7846911 7716711 7716263 7839083 7925073 7674969 7497828 7686514 7511372 7442236 7579520
14647 7579520 7454009 7380722 7307242 7304703 7307384 7096717 7107658 7106735 6921583 6835111 6704825
14636 6704825 6602726 6630379 6580648 6694645 6928452 6891410 6835314 6869316 6992168 6977979
14626F977979l06519j97442O1271l6900J4281R4711n0195k6997k80632k79123
14616E970434O1015Q8142q280j93910J4100j2529m0981Q3502r0344k37577N2360
14605E685932n0847J75226k7793Q9432j60342j52194K10634J84531N2158j90818
14595E815919k61935j44422j36607o6158R3465J3357Q7830j37712P5957M1576
14585E381270j27042j57233O4506m0195j1442j8742j0786L3044j81291l42005
14575D590084m5892L3387k43533P8738J36655J50792J33556o1853l97565k77818
14565D096551K59455J23239j18860j21340j8324M22173M4295k13323p3878J19221
14555D519209q9443k13004J16105L4627P6157k76252J97517J76527j62067k0642
$$ plain form
14626 6977979 6671460 6474018 6535289 6498389 6512670 6607381 6557186 6530189 6249557 5970434
14616 5970434 6031449 6119591 6111311 5917401 5931501 5918972 5877991 5961493 5871149 5633572 5685932
14605 5685932 5635085 5810311 5782518 5871950 5711608 5559414 5770048 5954579 6006737 5815919
14595 5815919 5553984 5409562 5272955 5206797 5300262 5313619 5401449 5263737 5339694 5381270
14585 5381270 5254228 5096995 5161501 5121306 5109864 5091122 5080336 5113380 4932089 4590084
14575 4590084 4544192 4577579 4334046 4412784 4549439 4700231 4833787 4771934 4374369 4096551
14565 4096551 4356006 4479245 4360385 4239045 4220721 4642894 4687189 4473866 4399988 4519209
14555 4519209 4429766 4216762 4332867 4367494 4443651 4167399 4364916 4541443 4379376 4358734
14545D358734j25572j18362j3623J37068j49549j62516m3761n3525L9969j43031
14535C725832n3080K81494L2487j99794J12656K09157j76026j47092q7189j40233
14525C558212o0967L2104J43056K86184P9320l20287l87358Q0944j30982m3118
14515C237108J25045J49997k0520j59289q6153K79422O8104j07593j07423l23910
14505C054788j73237j04874J34939K82323J90518l70461k45963m1368K62432J32913
14495C122010Q5315r3718q62J07737j17180N6628J06540L4880k22565o4514J00277
14484C114548Q2535n5282j5904q7482p2969M655Q6828l9919j21159n5655J89869
14473C030065K8504J4317J6550j91508j86291j58381j4270N0584J78701P0905
$$ plain form
14545 4358734 4233162 4114800 4101177 4238245 4088696 3926180 3882419 3828894 3868863 3725832
14535 3725832 3672752 3954246 3986733 3786939 3899595 4108752 3932726 3785634 3698445 3558212
14525 3558212 3497245 3529349 3672405 3958589 4037909 3717622 3330264 3411208 3280226 3237108
14515 3237108 3362153 3512150 3491630 3332341 3246188 3525610 3593714 3486121 3378698 3054788
14505 3054788 2881551 2776677 2911616 3193939 3384457 3013996 2768033 2726665 2989097 3122010
14495 3122010 3207325 3113607 3112745 3220482 3103302 3159930 3266470 3301350 3078785 3014271 3114548
14484 3114548 3197083 3141801 3125897 3038415 2965446 2970101 3056929 3017010 2895851 2840196 3030065
14473 3030065 3058569 3072886 3089436 2897928 2711637 2553256 2538986 2589570 2768271 2839176
14463B839176j27145k06093l3071O2439O4103Q2688K3541J34562j98536j08465
14453B533199J38591J60553M3058p6730J31015K61225m6799k89789p1986p7170
14443B705167n4353J35900J68289j15561l2487L4987r3867j67878q9575J2136
14433B502758j22272k0266K66070o8321j59886k74j04301Q0065J33377j19493
14423B387457k2709Q4805R7480l0109n7989L7085L4198k04613j91092j11105O3896
14412B087304J44150J1184j00037k19901j02087Q0857K45835k0016J19363M0606
14402B287258R9397J73691p3708j13036k93873j92711R6673J03687K06733q1531
14392B212580k87130k91532J42644N2352K4907l5468R1604Q0383K5326j36903
$$ plain form
14463 2839176 2712031 2505938 2472867 2535306 2599409 2682097 2705638 2840200 2641664 2533199
14453 2533199 2671790 2832343 2875401 2798671 2929686 3190911 3144112 2854323 2782337 2705167
14443 2705167 2650814 2786714 2955003 2839442 2806955 2841942 2748075 2580197 2490622 2502758
14433 2502758 2380486 2360220 2626290 2557969 2398083 2397809 2293508 2373573 2506950 2387457
14423 2387457 2364748 2449553 2547033 2516924 2458935 2496020 2530218 2325605 2134513 2023408 2087304
14412 2087304 2231454 2242638 2142601 1922700 1820613 1901470 2147305 2127289 2246652 2287258
14402 2287258 2386655 2560346 2486638 2373602 2079729 1887018 1983691 2087378 2294111 2212580
14392 2212580 1925450 1633918 1776562 1828914 1853821 1818353 1909957 1990340 2015666 1878763
14382A878763l9306j36604q6451l6258J51156J73824k16974j65761j5005K05878
14372A713262L6518J48612K47208P1767N1268K9151o6342j38660m0409j0440j89233
14361A852702R3342M3468p0357j03187J527N5290p3565N1993P5378n2312J00200
14350A974479p8300P5886k93290r1116K26413K1841l7997m9711q6643j20449Q6507
14339A627620J43156M8536R1180j14752j94708K33210J7858N0003j92449o5638
14329A644016n2658O1318M7589q8469k2491o3323j6996M0875L03759N7650P575
14318A918845N5672j81203l06294r1279K5429P6766j21082J1549J58641j403O3538
14307A609179n8940j04071N5623j91380j09496K05053L42334J64272L9840k03790
$$ plain form
14382 1878763 1839457 1702853 1616402 1580144 1731300 1905124 1688150 1522389 1507384 1713262
14372 1713262 1749780 1898392 2145600 2217367 2268635 2297786 2231444 2092784 2052375 2041935 1852702
14361 1852702 1946044 1989512 1919155 1815968 1817495 1872785 1799220 1851213 1926591 1874279 1974479
14350 1974479 1896179 1972065 1678775 1587659 1814072 1835913 1797916 1748205 1661562 1541113 1627620
14339 1627620 1770776 1819312 1910492 1795740 1601032 1834242 1852100 1902103 1709654 1644016
14329 1644016 1591358 1652676 1700265 1611796 1589305 1525982 1508986 1549861 1853620 1911270 1918845
14318 1918845 1974517 1793314 1487020 1395741 1421170 1497936 1376854 1388403 1547044 1545641 1609179
14307 1609179 1550239 1446168 1501791 1310411 1200915 1405968 1748302 1912574 1952414 1748624
14297A748624n9366P1250p8021j16156j50243j73583K6677J913j23347K16501
14287A364249m3457k12947P2447j1369p4281K2077j41399O1680J25590J82035
14277A344625j80278M1979K21202M753q8315l14565j23147J7996K89703K02590
14267A416543j76320j14232j98628M3329P2005O9215J1753R2770J4834j33135
14257A098134m8562J58687j68291k525O1383P8254O865k09616j33888K08107J77518
14246A226066P8967K6911j42915R4392j12425m5722j78908j1219J35752p1752
14236I99147N3908Q6663K73969J66899J34393N5028l06336k52597n9926m0852
14226A110296J56041k345l60911M7030K28414j63930j23496P0261J49393k00964
$$ plain form
14297 1748624 1689258 1760508 1682487 1566331 1416088 1242505 1269182 1271095 1147748 1364249
14287 1364249 1320792 1107845 1180292 1168923 1094642 1116719 975320 1037000 1162590 1344625
14277 1344625 1164347 1206326 1427528 1432281 1343966 1029401 906254 924250 1213953 1416543
14267 1416543 1240223 1125991 927363 970692 1042697 1111912 1123665 1216435 1231269 1098134
14257 1098134 1049572 1208259 1039968 1037443 1098826 1177080 1183945 974329 840441 1048548 1226066
14246 1226066 1305033 1331944 1189029 1283421 1170996 1125274 946366 935147 1070899 999147
14236 999147 1053055 1139718 1413687 1580586 1714979 1770007 1463671 1211074 1151148 1110296
14226 1110296 1266337 1263992 903081 950111 1178525 1014595 891099 961360 1110753 909789
14216I09789K5189K2700O9744j4528J81296N5101J39570J9252q1421n8609n7967
14205A210116j73295j32686M9278J66636o8301o6535j9189J50005J45593j46773
14195A114849j13961L1610j08244q3703q1322J09453J33714j36020j11194k2875
14185G32307j80363P5803J43210J5864j54159K8560l5654J01686O6065r7066j09728
14174E86525r2225J63660K78421R5160p0476R072o0955N9505r5774q6235J31262
14163I17940J62792k45451l30719K20499J90346M3169k9280k16073N6123K52640
14153A021986n9934K1273L6656k37058n9131K93063P7178k13410p2495j8573k6705
14142G62850r369R9278R7459J1119k50758j71949J82172K22632K74400J13491
$$ plain form
14216 909789 934978 957678 1027422 1012894 1194190 1249291 1388861 1408113 1326692 1268083 1210116
14205 1210116 1036821 904135 953413 1120049 1051748 985213 966024 1116029 1261622 1114849
14195 1114849 1000888 1032498 924254 840551 759229 868682 1002396 866376 755182 732307
14185 732307 551944 627747 770957 786821 632662 661222 625568 727254 793319 696253 586525
14174 586525 494300 657960 936381 1031541 961065 970137 909182 968687 872913 786678 917940
14163 917940 1080732 835281 504562 725061 915407 958576 929296 713223 769346 1021986
14153 1021986 962052 983325 1019981 782923 723792 1016855 1094033 880623 808128 789555 762850
14142 762850 753481 852759 950218 961337 710579 538630 720802 943434 1217834 1331325
14132A331325k09558n60637l38848J02175J94535j62600J19880K32910j23650
14123E85532k88916L9074L3211J78053M6629Q6447J10094N947j9262N7882m24540
14112D10151k02165O582J8883J95506J18430j85970J67122K48982N9770k4549
14102H12742Q7043l8069l52374j38020l5681J63650P1818p5737L12673o3274j84831
14091E59940l000K00674J67084q5636O7489J83970n7342j1924J5103m0406j93947
14080H02005j98054n9935j85242J73782L76452J44749J127j17405J95005K93577
14070A426061o4576j18605j50135k56714j40524j808L599j39320r1363K85822
14060G52437J87592Q7513J65368n0495j21765q8865k02425J7357K60261N4072
$$ plain form
14132 1331325 1121767 561130 222282 324457 518992 356392 476272 709182 585532
14123 585532 296616 335690 368901 546954 593583 680030 790124 796071 776809 834691 410151
14112 410151 207986 214568 233451 428957 547387 361417 528539 777521 837291 812742
14102 812742 899785 861716 509342 371322 335641 499291 571109 495372 808045 744771 559940
14091 559940 556940 757614 924698 839062 906551 1090521 1033179 1021255 1036358 995952 802005
14080 802005 603951 544016 358774 532556 909008 1053757 1054884 937479 1132484 1426061
14070 1426061 1361485 1242880 1092745 836031 695507 693699 697298 557978 466615 752437
14060 752437 940029 1027542 1192910 1142415 1020650 931785 729360 746717 1006978 1061050
14050A061050M4411O610L8170j63702k79535j16497j06697K23896j54571j94186
14040C58949K3352k49251J41024J06073K55037M3953r2479k1923j17919N3044
14030D99860r0721j87131P1456M2702o4053k92043L32246K47603j90740L3424
14020D02603J90708j4626m5444k09870j56294K38106k7683k51671j635J97787
14010C21981m6846Q8448N9598k1208j15066J15334K66243p4002N3898P7736j81117
13999E44999j21570J45543J75919L2718J25393L621o0376k14571N2512j24465
13989E59723j88715N696P6569K7859Q2426j79445L9348J73235J93302P9047q2346
13978G86699K03101j49321j34730r2076j7290k3288J45326j82382n777O0998R2502
$$ plain form
14050 1061050 1105461 1112071 1150241 986539 707004 590507 483810 707706 553135 358949
14040 358949 382301 133050 274074 380147 635184 679137 586658 564735 446816 499860
14030 499860 409139 222008 293464 336166 272113 -19930 312316 559919 369179 402603
14020 402603 593311 578685 533241 323371 167077 405183 377500 125829 124194 321981
14010 321981 275135 363583 423181 401973 286907 402241 668484 594482 648380 726116 544999
13999 544999 423429 568972 744891 777609 903002 906623 846247 631676 684188 559723
13989 559723 371008 376704 453273 481132 563558 384113 423461 596696 789998 869045 786699
13978 786699 989800 840479 705749 613673 596383 573095 718421 536039 530262 591260 683762
13967F83762J1914j226j86425o140K09187k7712m8667J72434j1000L0942j75811
13956F51258k40816j19147J03041J03685J24949R2525J21580j66492l91343P8124
13946C57364j27157k44178l8786J86900J44639J95264K21415k36929l59872j24745
13936b6085J55811J84028J16131K35198Q3852j26880j17393J0609O7219M4321
13926F26811m0463j44085J52455J19544j27611N1949o8628L1312j54341k64288
13916A82655j48593K4728L19769O0012j3536K6274j56562j22557k1620j30082
13906B0488K47624q1768p1097K7919O3993J63106J59603p9561j23599j65426r2167
13895F9115K55560K05002L3409o9107l05751p028L4993J30127K69797J7895l23339
$$ plain form
13967 683762 695676 694450 508025 501885 711072 683360 634693 807127 796127 827069 651258
13956 651258 410442 291295 394336 498021 622970 715495 837075 670583 279240 357364
13946 357364 230207 -13971 -52757 134143 278782 474046 695461 458532 98660 -26085
13936 -26085 129726 313754 429885 665083 748935 622055 504662 515271 582490 626811
13926 626811 586348 442263 594718 714262 586651 638600 569972 601284 446943 182655
13916 182655 34062 58790 378559 438571 425035 451309 294747 172190 150570 20488
13906 20488 268112 186344 115247 143166 207159 370265 529868 450307 326708 161282 69115
13895 69115 324675 529677 563086 493979 188228 181200 216193 346320 616117 634012 310673
13884C10673p6045r7419J78365J30512J30336j66160j60666J2334m8210R8485
13874C12205M9374j17972o3631R1993M8111L4727k6264j56539r4980j59011j88027
13863b70014p0502K73895M43279k6086L07447K1470k89662j82081r7944K0183
13853A29985l0249K5769p0198j51271j09739K43906K36279K6053j44433j10506
13843D5596K55712J2559q5386p2055l5395j2680R6746J4287l7146J92893K69904
13832F45035M5246k39497o5202j75039n184J72290J44487j1659m7157j5434j3970
13821D33916J3574M0056K212M2482J26638j37373k96143R05J45375Q9945l60577
13810A01010p8047k6611K071j46296j11726K97183L02684n1181j46234j20492
$$ plain form
13884 310673 234628 137209 315574 446086 576422 410262 249596 261930 213720 312205
13874 312205 361579 243607 179976 271969 320080 354807 328543 172004 77024 -81987 -270014
13863 -270014 -340516 -66621 376658 350572 658019 679489 389827 207746 109802 129985
13853 129985 99736 125505 55307 -95964 -205703 38203 274482 300535 156102 45596
13843 45596 301308 313867 228481 156426 121031 108351 205097 219384 182238 375131 645035
13832 645035 690281 450784 385582 210543 205359 377649 522136 510477 463320 447886 433916
13821 433916 447490 487546 489758 532240 658878 521505 225362 226267 371642 461587 101010
13810 101010 22963 -3648 -1577 -147873 -259599 37584 340268 289087 142853 22361
13800B2361P6350K46123J48653J76578k03370j05145p3275J46224J15164j34639
13790D15024q0671j32470j64263M2450J576j47839n1136J69361J62338J38598
13780C52968K81831K17991K9194l87339k30438o7478J44418k63419k34650J99957
13770D3035R6105o1012J18500J56636j867J12072j07601J40755K0109P3514m7314
13759E42932p1781K35928N9291k01558m41432Q1059J40367J51856n1851J57742
13749F02553q6529k21446p3726J39610K30926q3824P5679j14429k20218k23989
13739B4607J98032J82482m9508k49564l49470M7718J85383J50500P6355r4906
13729A21629M5018O7371J92011O4100j88324o8876J74282p449k2343N9923j15937
$$ plain form
13800 22361 98711 344834 493487 670065 466695 361550 288275 434499 549663 415024
13790 415024 334353 201883 37620 80070 81646 -66193 -117329 52032 214370 352968
13780 352968 634799 852790 881984 494645 264207 196729 341147 77728 -156922 43035
13770 43035 139140 78128 196628 353264 351397 463469 355868 496623 516732 590246 542932
13759 542932 471151 707079 766370 564812 123380 204439 344806 496662 444811 602553
13749 602553 516024 294578 220852 360462 591388 507564 583243 468814 248596 24607
13739 24607 222639 405121 355613 106049 -243421 -195703 -10320 140180 216535 121629
13729 121629 166647 234018 426029 490129 301805 232929 407211 399762 377419 437342 321405
13718C21405n0863k6003j8161J78280j09703R94L8017J86758Q5833k83554q2708
13707B40295L8532k38552p867O5663q2244Q1943J851L20295o5595j81570J98558
13696C71309J91155j90885k75891J08563J94378M4861o1381j18344o2455j9044
13686A82266j96213m8722J27640N186j2402m8650K44422j02794K804P2519O5353
13675B91409N952j69566j87968J4309J24124L8286L7719J57701J45404k36215
13665B21155j45776k18145j67918J77048m2728k6944J14512P1120J74584J01982
13655B58890l0093j71548J5590J07594K5147N2622r2361k76155j24842J13322
13645a21834J86219M6794R7276M14718r086k11029j47860j66489J15294J6059
$$ plain form
13718 321405 270542 244539 226378 404658 294955 295949 333966 520724 606557 323003 240295
13707 240295 278827 40275 32408 98071 15827 97770 99621 419916 354321 172751 371309
13696 371309 562464 371579 95688 204251 398629 443490 382109 263765 201310 182266
13686 182266 -13947 -62669 64971 70157 57755 9105 253527 150733 153537 226056 291409
13675 291409 297361 127795 -60173 -45864 78260 116546 154265 311966 457370 221155
13665 221155 75379 -142766 -310684 -133636 -176364 -203308 -88796 -17676 156908 258890
13655 258890 228797 57249 72839 180433 205580 258202 165841 -110314 -235156 -121834
13645 -121834 64385 111179 208455 623173 614087 403058 255198 88709 204003 220062
13635B20062j01114R493O3551j06141J13752P8660j23920k06797J38496J96563
13625B82605K7370k1159l9642j36535l00457J79170M4534k4526J92106J94483
13615C97949J61280l5704k17984M7759j06498j20444J10537Q4664O2667k05444
13605A78782m2727n9277l4428M7199R3268L771j10301k13733J43611J43475P1574
13594B21214J54953j33232j22591o8459M1431L7719K52775j20057J0424M5685
$$ plain form
13635 220062 118948 128441 191992 85851 199603 278263 154343 -52454 86042 282605
13625 282605 309975 288816 249174 112639 -187818 -8648 35886 11360 203466 397949
13615 397949 559229 523525 305541 353300 246802 126358 236895 321559 384226 178782
13605 178782 136055 76778 42350 89549 182817 186588 76287 -137446 6165 149640 221214
13594 221214 376167 242935 120344 51885 93316 131035 383810 263753 274177 319862
$$ [...]
##END NTUPLES=NMR SPECTRUM
##END=
