##TITLE=Analysis number 321087
Compound Code rf 04500
Project Code adrs
Chemist Name toronto research
##JCAMPDX= 6.0         $$ Bruker NMR JCAMP-DX V2.0
##DATA TYPE= NMR SPECTRUM
##DATA CLASS= NTUPLES
##ORIGIN= Bruker BioSpin GmbH
##OWNER= nmr
$$ XWIN-NMR		Version 3.5
$$ Mon Jul 24 13:35:27 2006 GMT Daylight Time (UT+1h)  MAYBRIDGE\nmr@NMR_250MHZ
##.OBSERVE FREQUENCY= 250.131544655141
##.OBSERVE NUCLEUS= ^1H
##.ACQUISITION MODE= SIMULTANEOUS (DQD)
##.ACQUISITION SCHEME= undefined
##.AVERAGES= 16
##.DIGITISER RES= 18
##SPECTROMETER/DATA SYSTEM= dpx250
##.PULSE SEQUENCE= zg30
##.SOLVENT NAME= DMSO
##.SHIFT REFERENCE= (INTERNAL, DMSO, 0, 16.522)
##AUDIT TRAIL= $$ (NUMBER, WHEN, WHO, WHERE, WHAT)
$$ ##TITLE= Audit trail, XWIN-NMR		Version 3.5
$$ ##JCAMPDX= 5.01
$$ ##ORIGIN= Bruker BioSpin GmbH
$$ ##OWNER= nmr
$$ C:\u/data/dgb/nmr/ADRS/3330/pdata/1/auditp.txt
$$ ##AUDIT TRAIL=  $$ (NUMBER, WHEN, WHO, WHERE, WHAT)
(   1,<2006-07-24 13:35:04.57 +100>,<MAYBRIDGE\nmr>,<NMR_250MHZ>,
      <created by zg, POWCHK disabled, PULCHK disabled
       configuration hash MD5:
       E2 DF 36 D8 04 B2 41 60 5A D7 A3 38 5A 4B D0 FE
       data hash MD5: 64K
       0A 39 EF 8A 19 A0 58 EB AD 91 97 21 29 FC 27 4A>)
(   2,<2006-07-24 13:35:19.62 +100>,<MAYBRIDGE\nmr>,<NMR_250MHZ>,
      <Start of raw data processing
       ef LB = 0.3 FT_mod = 6 PKNL = 1 SI = 32K 
       data hash MD5: 32K
       BC 00 84 BA CE 01 A8 75 2A 6A 20 D0 8D 96 47 6D>)
(   3,<2006-07-24 13:35:21.16 +100>,<MAYBRIDGE\nmr>,<NMR_250MHZ>,
      <apk 
       data hash MD5: 32K
       7E 41 67 AE D8 79 D4 F3 7A 60 1E 32 8C FB 43 19>)
(   4,<2006-07-24 13:35:21.91 +100>,<MAYBRIDGE\nmr>,<NMR_250MHZ>,
      <abs ABSG = 5 
       data hash MD5: 32K
       2B 07 29 F3 31 6F 6C 81 9D 79 C5 C4 D8 35 4F A9>)
$$ ##END=
$$ 
$$ hash MD5
$$ F1 AA 8F EE 09 86 1D 1C 73 AB 6E 54 2D 93 79 0F
##$RELAX= 
##$RELAX= 
##$RELAX= 
##$RELAX= 
##$RELAX= 
##$RELAX= 
##$RELAX= 
$$ Bruker specific parameters
$$ --------------------------
##$DU= <C:\u>
##$EXPNO= 3330
##$NAME= <ADRS>
##$PROCNO= 1
##$TYPE= <nmr>
##$USER= <dgb>
##$AMP= (0..31)
100 100 100 100 100 100 100 100 100 100 100 100 100 100 100 100 100 100 
100 100 100 100 100 100 100 100 100 100 100 100 100 100 
##$AQSEQ= 0
##$AQ_mod= 3
##$AUNM= <au_zg>
##$AUTOPOS= <33 >
##$BF1= 250.13
##$BF2= 250.13
##$BF3= 250.13
##$BF4= 250.13
##$BF5= 500.13
##$BF6= 500.13
##$BF7= 500.13
##$BF8= 500.13
##$BYTORDA= 1
##$CFDGTYP= 0
##$CFRGTYP= 5
##$CHEMSTR= <none>
##$CNST= (0..31)
1 1 145 1 1 1 1 1 1 1 1 1 1 1 1 1 1 1 1 1 1 1 1 1 1 1 1 1 1 1 1 1 
##$CPDPRG= <>
##$CPDPRG1= <>
##$CPDPRG2= <>
##$CPDPRG3= <>
##$CPDPRG4= <mlev>
##$CPDPRG5= <mlev>
##$CPDPRG6= <mlev>
##$CPDPRG7= <mlev>
##$CPDPRG8= <mlev>
##$CPDPRGB= <>
##$CPDPRGT= <>
##$D= (0..31)
0 1 0 0 0 0 0 0 0 0.06 0 0 0 0 0 0 0.0002 0 0 0 0 0 0 0 0 0 0 0 0 0 0 
0 
##$DATE= 1153744503
##$DBL= (0..7)
120 120 120 120 120 120 120 120 
##$DBP= (0..7)
150 150 150 150 150 150 150 150 
##$DBP07= 0
##$DBPNAM0= <>
##$DBPNAM1= <>
##$DBPNAM2= <>
$$ [...]
##$SUBNAM7= <"">
##$SUBNAM8= <"">
##$SUBNAM9= <"">
##$SW= 20.6930455092707
##$SWIBOX= (0..15)
0 0 3 0 0 0 0 0 0 0 0 0 0 0 0 0 
##$SW_h= 5175.983436853
##$TD= 65536
##$TD0= 1
##$TE= 295.16
##$TE2= 300
##$TE3= 300
##$TEG= 300
##$TL= (0..7)
0 120 120 120 120 120 120 120 
##$TP= (0..7)
150 150 150 150 150 150 150 150 
##$TP07= 0
##$TPNAME0= <>
##$TPNAME1= <>
##$TPNAME2= <>
##$TPNAME3= <>
##$TPNAME4= <>
##$TPNAME5= <>
##$TPNAME6= <>
##$TPNAME7= <>
##$TPOAL= (0..7)
0.5 0.5 0.5 0.5 0.5 0.5 0.5 0.5 
##$TPOFFS= (0..7)
0 0 0 0 0 0 0 0 
##$TUNHIN= 0
##$TUNHOUT= 0
##$TUNXOUT= 0
##$USERA1= <user>
##$USERA2= <user>
##$USERA3= <user>
##$USERA4= <user>
##$USERA5= <user>
##$V9= 5
##$VALIST= <valist>
##$VCLIST= <CCCCCCCCCCCCCCC>
##$VD= 0
##$VDLIST= <DDDDDDDDDDDDDDD>
##$VPLIST= <PPPPPPPPPPPPPPP>
##$VTLIST= <TTTTTTTTTTTTTTT>
##$WBST= 1024
##$WBSW= 4
##$XGAIN= (0..3)
0 0 0 0 
##$XL= 0
##$YL= 0
##$YMAX_a= 391748
##$YMIN_a= -453369
##$ZGOPTNS= <>
##$ZL1= 120
##$ZL2= 120
##$ZL3= 120
##$ZL4= 120
##$ABSF1= 16.522
##$ABSF2= -4.171173
##$ABSG= 5
##$ABSL= 3
##$ALPHA= 0
##$AQORDER= 0
##$ASSFAC= 0
##$ASSFACI= 0
##$ASSFACX= 0
##$ASSWID= 0
##$AUNMP= <proc_1d>
##$AZFE= 0.1
##$AZFW= 0.1
##$BCFW= 0
##$BC_mod= 0
##$BYTORDP= 0
##$COROFFS= 0
##$CY= 12.5
##$DATMOD= 1
##$DC= 0
##$DFILT= <>
##$DTYPP= 0
##$F1P= 14.0000005364418
##$F2P= -0.99999901652339
##$FCOR= 0.5
##$FTSIZE= 32768
##$FT_mod= 6
##$GAMMA= 0
##$GB= 0
##$INTBC= 1
##$INTSCL= 1
##$ISEN= 128
##$LB= 0.3
##$LEV0= 0
##$LPBIN= 0
##$MAXI= 10000
##$MC2= 0
##$MEAN= 0
##$ME_mod= 0
##$MI= 0
##$NCOEF= 0
##$NC_proc= -3
##$NLEV= 6
##$NOISF1= 0
##$NOISF2= 0
##$NSP= 0
##$NTH_PI= 0
##$NZP= 0
##$OFFSET= 16.522
##$PC= 1
##$PHC0= 161.1149
##$PHC1= 5.318976
##$PH_mod= 1
##$PKNL= yes
##$PPARMOD= 0
##$PSCAL= 4
##$PSIGN= 0
##$REVERSE= no
##$SF= 250.13
##$SI= 32768
##$SIGF1= 0
##$SIGF2= 0
##$SINO= 400
##$SIOLD= 32768
##$SREGLST= <1H.DMSO>
##$SSB= 0
##$STSI= 32768
##$STSR= 0
##$SW_p= 5175.98343685301
##$SYMM= 0
##$S_DEV= 0
##$TDeff= 65536
##$TDoff= 0
##$TI= <Analysis number 999999
Compound Code 99
Book Reference 9
Project Code 9>
##$TILT= no
##$TM1= 0
##$TM2= 0
##$TOPLEV= 0
##$USERP1= <user>
##$USERP2= <user>
##$USERP3= <user>
##$USERP4= <user>
##$USERP5= <user>
##$WDW= 1
##$XDIM= 32768
##$YMAX_p= 398450484
##$YMIN_p= -215163
$$ End of Bruker specific parameters
$$ ---------------------------------
##NTUPLES= NMR SPECTRUM
##VAR_NAME=  FREQUENCY,     SPECTRUM/REAL,   SPECTRUM/IMAG
##SYMBOL=    X,             R,               I
##VAR_TYPE=  INDEPENDENT,   DEPENDENT,       DEPENDENT
##VAR_FORM=  AFFN,          ASDF,            ASDF
##VAR_DIM=   32768,         32768,           32768
##UNITS=     HZ,            ARBITRARY UNITS, ARBITRARY UNITS
##FACTOR=    0.157963299565203, 1,           1
##FIRST=     4132.6476996994, 0,             0
##LAST=      -1043.33573715361, 0,           0
##MIN=       -1043.33573715361, -215163,     0
##MAX=       4132.6476996994, 398450484,     0
$$ Real data points
##PAGE= N=1
##DATA TABLE= (X++(R..R)), XYDATA
$$ [...]
17648a7406O820K3540N4419J12776K9032k9873m4713j2066O645j111K0911J6618
17636A65592j1328Q162j2528j7840m0051k152R056k3k6777k2994J8058L574N085
17623G5834N1393K0999o5551j2581Q603m0434j9847J5581k798L4206m2241l9277
17611a6113N6728O082J0307j9905o5906M8508N9564j7840j9510o273j1501l8613
17599a4472N786L3360k3736p889j9645K1060j1064n66p260j7186O5403P3925j1728
17586H5988l7152M476L2091N6897q886l3143J7249j16071l1714M4751L6640J8288
17574F9414K8785r81m608n889J0805l2376n1257k0966O8150M6447k4540k677J3006
17561I3313M7474l9847k4013L7433P8983L4506o779q225j884n913l522n521k5079
$$ y = [-17406, -10586, 12954, 67373, 180149, 209181, 179308, 134595, 122529, 129174, 128063, 148974, 165592, 154264, 162426, 149898, 132058, 92007, 89855, 98911, 98888, 72111, 49117, 67175, 70749, 75834, 127227, 148226, 82675, 70094, 78697, 38263, 18416, 33997, 31199, 65405, 23164, -16113, 40615, 46697, 57004, 37099, -28807, 19701, 79265, 61425, 41915, 35642, 24141, -14472, -8686, 24674, 938, -6951, -26596, -5536, -16600, -17166, -24426, -41612, 23791, 97716, 85988, 48836, 53312, 85403, 142300, 133414, 100271, 117520, 1449, -30265, 14486, 51126, 69414, 98199, 97218, 92610, 86721, 97526, 65150, 13893, -7073, 61077, 107524, 82984, 80307, 93313, 140787, 100940, 76927, 114360, 193343, 227849, 221070, 212845, 210961, 205048, 201526, 196005, 170926]
17548A70926m0979j6001K8336J6262K6351n0911j3748M3706R3272J778m7983m2153
17536A68856k133K09k0535q3687k7368P7334N0793j5965q194n269J0360K7900
17524A72301L0328P769j1346r395l0952j7301M5576P6322K4168k8196j7309m335
17512B37630N0244r557k7161j3761O534J5899o7048J3365P9180K5718k4002k2081
17500B64960k508L9718m0800o0184O4276K9835n3010l2468M4643L4972M6568l5806
17488C00196k8769K511L5123M0702k8619j0844K8192k630N6273M0376k5093j2625
17476C94793m1620R813O4238N208n9862J8074K3355J8377l8654j7562N4285P9808
17464E10253M6706k204O8048N5862m4366k3036O4722O8431K5531L6518o406l2769
$$ y = [170926, 129947, 113946, 142282, 158544, 184895, 133984, 120236, 163942, 257214, 258992, 211009, 168856, 166723, 166932, 146397, 62710, 35342, 112676, 163469, 147504, 139310, 134041, 144401, 172301, 202629, 210398, 199052, 189657, 158705, 141404, 186980, 263302, 287470, 259274, 241965, 237630, 287874, 278317, 251156, 237395, 243929, 259828, 192780, 206145, 285325, 311043, 287041, 264960, 262452, 302170, 261370, 201186, 265462, 295297, 242287, 209819, 254462, 289434, 336002, 300196, 271427, 273938, 309061, 349763, 321144, 310300, 338492, 335862, 392135, 432511, 407418, 394793, 353173, 362986, 427224, 432432, 372570, 390644, 413999, 432376, 393722, 376160, 430445, 510253, 556959, 554755, 622803, 678665, 634299, 611263, 675985, 744416, 769947, 806465, 800059, 767290]
17452G67290l5769M8118k7975n1583k089L7973L6879j1634J091j8809l1606j4186
17440F97700K0578k1864k8577K3022J02429L5023r532P064J9862L6697O943J3925
17428I03270O8855Q2247L2724m6425J0424O8315P2457o209M4381N2250o115Q2031
17416A358205M9129K3922M1590J02170J01684P3597M5524O4070R4988L0920N813
17405A991612J08508J63080J00974J12992L8791J5439J09307R9758R7107J45653
17395B983221J77360J39356J19107J80238J61190K21058K34856K08333J93782
17386D618501K04712K96804M00815L38370K10971K18277K96088K88076L59731
17377G232345L25545K96089L36296L69763M05782M16653M18323M24184M75682
$$ y = [767290, 731521, 779639, 751664, 700081, 697992, 735965, 772844, 761210, 762301, 743492, 711886, 697700, 718278, 696414, 667837, 690859, 793288, 828311, 818779, 825843, 845705, 882402, 889345, 903270, 972125, 1054372, 1087096, 1040671, 1051095, 1119410, 1191867, 1185658, 1230039, 1282289, 1276174, 1358205, 1407334, 1431256, 1472846, 1575016, 1676700, 1750297, 1795821, 1859891, 1954879, 1985799, 1991612, 2100120, 2263200, 2364174, 2477166, 2515957, 2531396, 2640703, 2740461, 2837568, 2983221, 3160581, 3299937, 3419044, 3599282, 3760472, 3981530, 4216386, 4424719, 4618501, 4823213, 5120017, 5520832, 5859202, 6070173, 6288450, 6584538, 6872614, 7232345, 7557890, 7853979, 8190275, 8560038, 8965820, 9382473, 9800796, 10224980, 10700662]
17368A0700662N68538N26454M65458M95917M61291M72184M47277L98661L89645
17359A4926087M15006L06080K17374R9142L1164k3243m6797j33060k59754l20842
17349A5211157l00431l64508m41663l98742m04330m57232n05180m78844l97854
17340A1462373m22909m18781m85239m81633m37738l91579l67168l17310l41250
17331G798766k65459l33681l09390k35399k98355l13793j96733j51951k32661
17322E461344j65976j83167j85204k17764k06901j46829j54183j69007j65854
17313C866459j56379j62616q8372j08883o7649p4490o9229j5770p6398j46958
17303B899715j57879j05814l2170k5404n8019r5240q9462p1058q1752o5661r6061
$$ y = [10700662, 11269200, 11795654, 12261112, 12757029, 13218320, 13690504, 14137781, 14536442, 14926087, 15341093, 15647173, 15864547, 15963689, 15994853, 15971610, 15924813, 15791753, 15531999, 15211157, 14910726, 14546218, 14104555, 13705813, 13301483, 12844251, 12339071, 11860227, 11462373, 11039464, 10620683, 10135444, 9653811, 9216073, 8824494, 8457326, 8140016, 7798766, 7533307, 7199626, 6890236, 6654837, 6356482, 6042689, 5845956, 5694005, 5461344, 5295368, 5112201, 4926997, 4709233, 4502332, 4355503, 4201320, 4032313, 3866459, 3710080, 3547464, 3459092, 3350209, 3282560, 3208070, 3138841, 3123071, 3046673, 2899715, 2741836, 2636022, 2603852, 2578448, 2520429, 2425189, 2335727, 2264669, 2182917, 2117256, 2021195]
17292B021195j07208k7047N148n9540l8400l8917j2651o3215J023l7241p7227
17281A565920m8371K9532j9511o4278n7828K1089Q71K3637O679o3687j2556P768
17269A389265j3596j2762j3051L4632L0594k0008m8044j2697m1201k6293o3760
17258A203079n5956l8381O439K240j0398k0110o1211k6087J0176k7485m0916Q643
17246I50033O846n4546M000j0498k1582o8140O569N737M7556k7663l5289n308
17234G97715m9279k1650O8677R0043J13562N8566m6591l0048p063L8627j1684
17223A000875l573k3277m801j4016q1077r6003q1787r7747o2579m8027l543P015
17211D91460L0939j4409k6012q753j0971m630j7025j7962p5523j8697L7752L6777
$$ y = [2021195, 1913987, 1886940, 1892088, 1832548, 1794148, 1755231, 1742580, 1679365, 1680388, 1643147, 1565920, 1517549, 1547081, 1527570, 1463292, 1405464, 1426553, 1427424, 1451061, 1457740, 1394053, 1381497, 1389265, 1375669, 1362907, 1349856, 1384488, 1415082, 1395074, 1347030, 1334333, 1293132, 1266839, 1203079, 1147123, 1108742, 1115181, 1117421, 1107023, 1086913, 1025702, 999615, 1009791, 982306, 941390, 950033, 956879, 902333, 906333, 895835, 874253, 806113, 812682, 818419, 865975, 838312, 803023, 797715, 748436, 726786, 795463, 885506, 999068, 1057634, 1011043, 980995, 973932, 1012559, 1000875, 997302, 974025, 969224, 955208, 874131, 778128, 696341, 598594, 536015, 487988, 484445, 491460, 522399, 507990, 481978, 473225, 462254, 457624, 440599, 422637, 347114, 328417, 366169, 402946]
17199D02946m585L0444L2492r544o6023l5883K1866L8263l3416k9599k8783q698
17187C09480J5719k7648L2906J5582J6462M0615l4932n4194l6544K5638k5983
17176B77101j6564o303k6671o8867m7666m338Q4981O2522l1345j816J1540R750
17164B42324M0958O6571l678p0459j2499P052L4044l9480o0092L0237N334Q929
17152B49241j3501M482M2980L3337J4124n5093k8751N044m8490r3676O4725L4740
17140B09162k8402K2657M0700n2457m4646J3117R6899L8766Q147l9972n6931M3000
17128B50040m335j1660j7358l8800R5428M0950K4225K2056L5535r503Q1415M4757
17116E12750N538P225Q6480K13067L02780K89632L11707K68894J65207N8448M1606
$$ y = [402946, 398361, 428805, 461297, 451753, 385730, 349847, 371713, 409976, 376560, 346961, 318178, 309480, 325199, 297551, 330457, 346039, 362501, 403116, 368184, 313990, 277446, 303084, 277101, 260537, 254234, 227563, 158696, 111030, 106692, 191673, 254195, 222850, 221034, 232574, 242324, 283282, 349853, 346175, 275716, 263217, 270269, 304313, 264833, 204741, 234978, 240312, 249241, 235740, 240222, 283202, 316539, 330663, 275570, 246819, 251863, 203373, 109697, 174422, 209162, 180760, 203417, 244117, 191660, 147014, 160131, 257030, 295796, 303943, 263971, 207040, 250040, 245705, 234045, 216687, 177887, 273315, 314265, 338490, 360546, 396081, 386578, 467993, 512750, 518288, 525513, 611993, 825060, 1127840, 1417472, 1729179, 1998073, 2163280, 2221728, 2263334]
17105B263334M844r183L1258r0192j02042j64532l18202l68732k49212j37934
17095H59407j07718m9826r9663j14659k9558K3952L1484j1938j26313m9860P8250
17084D03558N0747k5661l6689k7430j7999J2229o783J0876k0562K6796k1420q0685
17072B66977m4181J5591m1994K3552r610k2912j6286M1936K6866P745J7091m5033
17060B19742q6017k3249N5553M4192m4174j7446M5377L7588l4399j1912p7338
17049A07917K3276L1243j7126K5323M317l0692M7574n008m3328k7154j2951K7226
17037A30617N4235M5542k9882n1706j4747L710K8144K0396j4578M6133J0139n5787
17025A72216j3398J4841R781n0110l9739N1442L1436l2941L1106M0053l8225p7313
$$ y = [2263334, 2268178, 2258995, 2290253, 2200061, 2098019, 1933487, 1615285, 1246553, 997341, 859407, 751689, 701863, 602200, 487541, 457983, 481935, 513419, 501481, 375168, 325308, 403558, 454305, 428644, 391955, 364525, 346526, 358755, 351972, 362848, 342286, 369082, 347662, 266977, 222796, 238387, 196393, 219945, 210335, 187423, 171137, 213073, 239939, 247684, 264775, 219742, 133725, 110476, 166029, 210221, 166047, 148601, 193978, 231566, 197167, 185255, 107917, 131193, 162436, 145310, 170633, 174950, 144258, 191832, 186824, 143496, 116342, 103391, 130617, 184852, 230394, 200512, 148806, 134059, 137769, 165913, 186309, 171731, 217864, 228003, 172216, 158818, 173659, 183440, 133330, 93591, 145033, 176469, 143528, 174634, 214687, 176462, 99149]
17013I9149m1604L3288K4753k4085j6478j5640K2793K5333N5428k0464l9436J6061
17001A19098k7032j841J4039K0329J7238M8534K3998j183n3403N6311n160K766
16989B13694L9954L0444k0032k3303l0348n5210J2604L8828M9683Q362k5564o2770
16977A76342j2664J1274o683O6648K1316r6023m553N8558N798J932p368R894J05420
16964C29891N1838J4301k7914r193K0946R7132N0230K019O7137M3124j5825K5918
16952F49604j1051J8631N7078J23527Q1335J04223Q2607Q8755J28514J08417J05706
16941A537346J34689J30910J93454K42677K31911L06994M05621M57189N73443
16932D214234O65940Q94565J209670J604085K197172L224191M991207P828929
$$ y = [99149, 57545, 90833, 115586, 91501, 75023, 59383, 82176, 107509, 162937, 142473, 103037, 119098, 92066, 90225, 104264, 124593, 141831, 190365, 214363, 213180, 159777, 216088, 210928, 213694, 253648, 284092, 264060, 240757, 210409, 155199, 167803, 206631, 256314, 264676, 239112, 176342, 163678, 174952, 168269, 234917, 256233, 160210, 155657, 214215, 220013, 221945, 214577, 224471, 329891, 381729, 396030, 368116, 358923, 379869, 477001, 527231, 529250, 596387, 639511, 623686, 649604, 638553, 657184, 714262, 837789, 919124, 1023347, 1105954, 1194709, 1323223, 1431640, 1537346, 1672035, 1802945, 1996399, 2239076, 2470987, 2777981, 3183602, 3640791, 4214234, 4880174, 5774739, 6984409, 8588494, 10785666, 14009857, 19001064, 26829993]
16924B6829993J1483283J2871702N949822k526203l570916j582872Q1165J272623
16916E0808597K226622J530705n588087j3745276j0934290o354363l747607k441186
16908A1755115j702457j181188q54383n92293n59915m46858l11838k46047k64606
16899E595530k89617l43630k70795k43924k58995k48100k35584j43061j30202
16890C431622j84538j70396j78818j75586l9143j10116p1976l6554l8983r0830
16880B334682p2155j06129q0822o0541j07630r5662j05778j12241K3161k689o1153
16869A553043k8244p6312q2263j00238m9914j9214J317n2189M959p0859o3735
16858A016351k3394J7633J7191P332q0830j31052m9305n439m2195n5372K0540
$$ y = [26829993, 38313276, 51184978, 57134800, 54608597, 51037681, 49454809, 49535974, 50808597, 53035219, 54565924, 48977837, 35232561, 24298271, 17943908, 14196301, 11755115, 10052658, 8871470, 8017087, 7424794, 6864879, 6418021, 6106183, 5860136, 5595530, 5305913, 4962283, 4691488, 4447564, 4188569, 3940469, 3704885, 3561824, 3431622, 3247084, 3076688, 2897870, 2722284, 2683141, 2573025, 2501049, 2464495, 2425512, 2334682, 2262527, 2156398, 2075576, 2015035, 1907405, 1811743, 1705965, 1593724, 1616885, 1614196, 1553043, 1524799, 1448487, 1366224, 1265986, 1216072, 1196858, 1198175, 1145986, 1150945, 1080086, 1016351, 992957, 1010590, 1027781, 1035113, 954283, 823231, 773926, 768487, 726292, 670920, 691460]
16847F91460k3599k4439N2337m275n0045N0495L7278p9325o6386k1618n2269K3506
16835E33120M1961k5223r2542k9732j7805K4134P640J5976L9356q648L3241k3026
16823D98452l157N495m2557m6929k4000k6821J3141k1490n2151K0502N2676J6606
16811C89767o1864J4932k993L1131l1127N21J2251j4490m7090k7418n1416k0480
16799A91724k91J9927P1528k3036k6027j4233n4686j3832M6712K3054l8340K2882
16787B05382k8573k7945j319J6941j1705k9491m4178J8685N449j50q585M3731
16775A38242q702l2433J6225L3656O9474n1007m2194J7403k8934K3755K5895k6175
16763A35205k7871k4760m5389M0294J6776N0163L8592o4398k9503l0641m034L8249
$$ y = [691460, 667861, 643422, 695759, 691484, 641439, 691934, 729212, 649887, 583501, 561883, 509614, 533120, 575081, 549858, 457316, 427584, 409779, 433913, 441553, 457529, 496885, 488237, 521478, 498452, 495295, 500790, 458233, 411304, 387304, 360483, 373624, 352134, 299983, 320485, 373161, 389767, 327903, 342835, 339842, 370973, 339846, 340367, 352618, 338128, 291038, 263620, 212204, 191724, 191433, 211360, 282888, 259852, 233825, 219592, 164906, 151074, 197786, 220840, 182500, 205382, 176809, 148864, 147545, 164486, 152781, 123290, 79112, 97797, 103246, 103096, 94511, 138242, 129540, 97107, 113332, 146988, 216462, 165455, 123261, 140664, 111730, 135485, 161380, 135205, 107334, 82574, 37185, 77479, 94255, 144418, 183010, 118612, 89109, 58468, 54434, 92683]
16751I2683k5726k4310J8908J6727p439n446k6255k0533K0741J5606k9294J9762
16739D5424J8614M4937P5075l0589r1789N4471M5190M1518Q02J0501n1625p9328
16727H3201o7132Q299O4721o746q581k3474j2998l964j3278n645k1103J5108l60
16714H048N3597Jq0081j4737N8988N5555J9988k474m1865k0496k6402L2064O0297
16701A02483j374L6077K033J8097k4743o6399o3756j6881O0899L4423k2623J7552
16689G5788j6884L0473J00N9712m3165n4388k0709J8186L832n7350p427L6673
16677B4841M3931N3099N7567j8835o6201l9659j8476M6646Q606o9195n7115j08
16665c4899P974Q861K4741m1490l9135J3832k6840m2517O1647Q689J8382L968
$$ y = [92683, 66957, 42647, 61555, 78282, 70843, 65397, 39142, 18609, 39350, 54956, 25662, 45424, 64038, 108975, 184050, 153461, 61672, 116143, 161333, 202851, 203653, 214154, 162529, 83201, 16069, 24368, 89089, 82343, 73762, 50288, 37290, 33326, 20048, 14403, -6700, 8408, 8048, 61645, 61646, -18435, -33172, 25816, 81371, 101359, 98885, 57020, 36524, 10122, 42186, 102483, 101109, 137186, 139219, 157316, 132573, 66174, 2418, -14463, 46436, 80859, 58236, 75788, 58904, 89377, 89477, 149189, 106024, 51636, 30927, 49113, 52945, -4405, -11832, 24841, 68772, 121871, 179438, 160603, 94402, 54743, 36267, 82913, 91519, 22324, -34791, -34899, -26925, -18064, 6677, -34813, -73948, -60116, -86956, -129473, -67826, -59137, -40755, -36787]
16653c6787P267j5761j3467J484K3902k6959m2500P661L1173K5427N7620L1253
16641E0313M16l419N1468J9137j6075l4917n2618m882l1147J8835M3909j1795
16629B9225j8875P1123k1359m3101l2045l3566Q4761L9253j1347N5542l7186n171
16617G7254P551k6367n663k454K5270J8797k3976O5976o081n8524l5284k428k5749
16604H322j7978N6568J3274p55m791j9778n120k3966j02732m1056K8291Q3186
16592b6535O6188j469l9055K3913M7301k5o3470K3174L0086l2824k3627J4189
16580A7846J2567p133q8872j3387R0644k1364m664j3036r496L9809J4606r517
16568H003j6940O690M6037J8366n4363l488L0538Q879n2698k3955q955M7593J44
$$ y = [-36787, -29520, -45281, -58748, -57264, -33362, -60321, -102821, -95160, -63987, -38560, 19060, 50313, 50729, 47310, 98778, 117915, 101840, 66923, 14305, 9423, -21724, -2889, 41020, 29225, 10350, 81473, 60114, 17013, -15032, -48598, 36163, 75416, 64069, 119611, 82425, 77254, 84805, 58438, 52775, 50321, 75591, 94388, 70412, 136388, 130307, 71783, 36499, 34071, 8322, -9656, 46912, 60186, 59431, 54640, 34862, 29742, 5776, -96956, -138012, -109721, -26535, 39653, 38184, -871, 23042, 70343, 70318, 6848, 30022, 60108, 27284, 3657, 17846, 30413, 23280, -65592, -78979, 11665, -9699, -14363, -27399, -36895, 2914, 17520, 8003, -8937, -2247, 43790, 62156, 7793, 4305, 34843, 43722, -8976, -32931, -41886, 5707, 5851]
16555E851k5560M3287N6110k629p155K5618l8161m0844n2462J6522K5523j9088
16543a2988P9577L1972o0495J3691j6653l7094M760m5017M0778N0666J5462N357
16531G0016M112j2373m1729m0622l442L3267N8149M27J997L7945l4956k7673l5409
16518I709o858Q919j6557J8434K3659k4128N3278M516l7137Q42K7468j8493N27
16505D4179N031k9839j5977L4211L1742l2466o3609L7954Q6601Q8433L046L3842
16493B23148p6276r6230j12401m282J12448J1241p5729q8732m6062N115L0933
16482a16827q847k1560o329N4128P7824L5930k4459M6627K4327n028l4999R475
16470C0262J6742l8416P345J61j8802j7043q534J3454m0702L8777K4555J3935
$$ y = [5851, -19709, 23578, 79688, 77059, 69904, 95522, 57361, 16517, -35945, -19423, 6100, -12988, 66589, 98561, 38066, 51757, 35104, -1990, 2770, -42247, -1469, 49197, 64659, 70016, 74128, 61755, 20026, -20596, -24038, 9229, 67378, 67805, 69802, 107747, 72791, 45118, 9709, 2851, 11770, -4787, 13647, 37306, 13178, 66456, 70972, 33835, 34677, 62145, 43652, 44179, 49210, 19371, 3394, 37605, 69347, 36881, -26728, 11226, 97827, 186260, 189306, 223148, 146872, 50642, -61759, -66041, 46407, 57648, -18081, -106813, -152875, -147760, -116827, -125674, -147234, -153563, -99435, -21611, 14319, -10140, 36487, 60814, 55786, 20787, 30262, 47004, 8588, 15933, 16094, -2708, -19751, -28285, -14831, -55533, -16756, 7799, 21734]
16458B1734j7516J9006j5828k3185p4404n764N6377L5644N1251O3413K0433m4531
16446H6630k9932l9625J6168J6373J2042j0379k3338j0788k7718k5352k0157K6891
16434b9185O9852R525J9358l5685K403j9063k2434l7596k301k0720K5189k8422
16422f9079n7583M4032M5558l0340n5997K4477L6563K9454J024m7828P991K4346
16410d7382Q140n017J5846K729N3344K0712K1051l1938R700n1209j6184N0819
16398C0611R584J5175l2321J5680K6975j1264l6767K3027J7614M8779R37M177
16386A12207J5349j9120L460l5882L0824K3576K7993Q4340L3229j1958o1482j3515
16374A89021K631m7789L0315N8766K0556r6460q0383n7788o4048o1749O2189J08042
$$ y = [21734, 4218, 23224, 7396, -15789, -90193, -95957, -39580, -3936, 47315, 110728, 131161, 86630, 56698, 17073, 33241, 49614, 61656, 51277, 27939, 17151, -10567, -35919, -56076, -29185, 40667, 50192, 69550, 33865, 36268, 17205, -5229, -42825, -45126, -65846, -40657, -69079, -126662, -82630, -37072, -67412, -123409, -98932, -62369, -32915, -31891, -79719, -71728, -47382, -39242, -44259, -28413, -25684, 27660, 48372, 69423, 37485, 47185, -4024, -20208, 30611, 40195, 55370, 23049, 38729, 65704, 54440, 17673, 40700, 58314, 107093, 108030, 112207, 127556, 108436, 111896, 76014, 106838, 130414, 158407, 242747, 275976, 264018, 202536, 189021, 191652, 143863, 174178, 232944, 253500, 157040, 76657, 18869, -45179, -106928, -44739, 63303]
16362F3303Q812n0428l5303l2992P9569j3499l3725Q600j0342M8765L875k825
16350C3810J6191K2935j4832l3276J5748L0728J5708Q177K79k5973j3165q030
16338D8300m511j5657k9278j1918j8728k2444K5945K4762m181J7231L3072M527
16326D7120q3445p3900j39P836N096K4339L9004K1441j7219J1788k4063K9186
16314a2956M2002M6899j00299o8421M0396J34046K2554r4897m3532l3227M801
16303f2634k1317J5453N9931M2077l707k4432N5242J6279j4260n1549j219L2065
16291D1929l3639J2803O7951m9334l2062R88m8242j6928N6847J1411M6720J723
16279F0167l4398q443J4299k6655P84n705M6375j19l521j2346Q730p060K9468
$$ y = [63303, 72115, 21687, -13616, -46608, 32961, 19462, -14263, -5663, -16005, 32760, 36635, 33810, 50001, 72936, 58104, 24828, 40576, 71304, 87012, 95189, 95468, 69495, 56330, 48300, 43789, 28132, -1146, -13064, -31792, -54236, -28291, -3529, -7710, 9521, 42593, 47120, -36325, -110225, -110364, -102528, -97432, -73093, -34089, -12648, -29867, -18079, -42142, -12956, 29046, 75945, -24354, -92775, -52379, 81667, 104221, 9324, -34208, -67435, -62634, -83951, -68498, -8567, 33510, 29803, 5371, 60613, 76892, 62632, 11083, 9864, 41929, 8290, 21093, 89044, 39710, 7648, 8636, -39606, -56534, 313, 11724, 58444, 60167, 25769, 17326, 31625, 4970, 5754, 49, 46424, 46305, 42784, 30438, 39168, 32108, 61576]
16266F1576M3395j1875l1128o0174k7332o3045m441J677j4976r264L2470N0340
16254c2777J6445m493l7370O2464J6560N368M8170k0818o2773m1863n881N118
16242e1850O379J8925R84K622L0J7775L1520J1500j1600q73o106k5151P0375M9209
16228A13739m6098m891l5021n8855o0250p136J5412j9439L7008P6101j845m8615
16216c9890n5137M3919M4154K7609o1200P696Q513M2265o742p312J0610J7144
16204C1629j861L2335K7171o8931q3123J1798J2013m1990K9524M8505l0627k4265
16192e7822j218N9904l5403k7000N3167J0121k2033k634j2538l4279m0335L5985
16180g4085J21756L3l7662j5820J5974m9866m0715L2704N5956l7746L2521N0700
$$ y = [61576, 104971, 93096, 61968, 1794, -25538, -88583, -93024, -91347, -106323, -115587, -83117, -32777, -16332, -20825, -58195, 4269, 20829, 26197, 74367, 53549, -9224, -51087, -56968, -51850, -45471, -26546, -25562, -22940, -22910, -5135, 26385, 37885, 26285, 25412, 19306, -5845, 64530, 113739, 67641, 62750, 27729, -31126, -91376, -98512, -83100, -102539, -65531, 10570, 8725, -39890, -95027, -51108, -6954, 20655, -40545, -32849, -24336, 17929, 11187, 3875, 14485, 31629, 29768, 62103, 89274, 20343, -62780, -50982, -38969, -80959, -51435, -2930, -33557, -57822, -59040, 864, -34539, -61539, -8372, 1749, -20284, -22918, -35456, -69735, -110070, -74085, 47671, 47704, 10042, -5778, 10196, -39670, -80385, -47681, 8275, -29471, 3050, 53750]
16168E3750r291m9346j0963m2924m0209L1295M4901N9555N32l0859J3414j950
16156A7905j01L6935J118l2576k29J5562K8624L0808j1063n4915j3213O7357k8652
16143E7560l5537r195j5690j9346r119K706r435p028m736k2576l0442O9468Q7664
16130E4294k1706M5668n6163p3751K669N7322J1603J693j5452m3170j2437N9782
16118A0352P0902j5784q953L9805P071l2335q7868l7951J2821K8544N4428m6680
16106e648k9207l7375l7476k8912L4205M5821m994m476j4583J1653N4355M4580
16094B7943n6841l7188Q711K0104K5155N5695l3240q0540M7587P0563M1906k705
16082H7150J6232J4206m5191M251j6887j6442n0659m6149l398j4514j2972J8359
$$ y = [53750, 44459, -4887, -15850, -58774, -98983, -67688, -22787, 36768, 37300, 6441, 19855, 17905, 17804, 54739, 55857, 23281, 23052, 38614, 67238, 98046, 86983, 32068, 18855, 86212, 57560, 22023, 12828, -2862, -22208, -31327, -28621, -38056, -45084, -49820, -72396, -102838, -33370, 54294, 32588, 78256, 22093, -51658, -48989, 8333, 19936, 21629, 6177, -36993, -49430, 10352, 81254, 65470, 56517, 96322, 103393, 71058, -16810, -54761, -41940, -13396, 41032, -5648, -34855, -72230, -109706, -138618, -104413, -58592, -63586, -68062, -82645, -70992, -16637, 27943, -28898, -66086, -57375, -37271, -12116, 43579, 10339, -70201, -22614, 47949, 89855, 87150, 103382, 117588, 72397, 76648, 59761, 43319, -7340, -53489, -56887, -71401, -84373, -66014]
16070f6014P6101n5240r9650N1699Q3828j5848l103J1085K4822k1460o6254k889
16058h2923N8657r100L3068o394J400j7363j0928K4385K811l546J1393J1021K3421
16045C5902K0410p8577k6332L80l2012m7047K2782Q1684L941O05K5511p5520j9266
16032h7539J0704j6336M4157j5727R597j3954M1771Q5497K8626l312r690o517
16020F7277k7865q3642o720N8327k2249m4278q049M6944J0406k5800o733J0842
16008c1540N6901j3894K1161M1726o0038M410k4243N0973n2347k6628K3985o1962
15996g1496o8948L4265N8771l0640q504M6348M1195O3315o0034m7621K9804J390
15984a2155m2851p28K9390J0641j8465j5267p489J6235N7657N1412j4161n016
$$ y = [-66014, 10087, -45153, -144803, -93104, -9276, -25124, -28227, -17142, 7680, -13780, -80034, -82923, -24266, -33366, -298, -6692, -5292, -22655, -33583, -9198, -6387, -9933, 1460, 12481, 35902, 56312, -22265, -48597, -48217, -80229, -127276, -104494, -22810, -18869, -18264, 7247, -68273, -87539, -76835, -93171, -49014, -64741, -55144, -69098, -27327, 58170, 86796, 83484, 73794, 67277, 39412, -44230, -50950, 7377, -14872, -59150, -67199, -20255, -9849, -35649, -42382, -31540, 25361, 11467, 32628, 74354, 14316, 18726, -5517, 45456, -6891, -33519, -9534, -71496, -140444, -106179, -47408, -78048, -86552, -40204, 991, 64306, 4272, -43349, -13545, -12155, -55006, -55734, -26344, -15703, -34168, -49435, -56924, -40689, 16968, 68380, 54219, 49203]
15972D9203K229K3247p808l9525K910j0552J3071L0309j3444k9435m0200K1751
15960A756M0892l9464n330M4696k5983O987k3473m8072k9049J5731M9805J3571
15948B067O8860l9798n1554j4129r704k9178M8444N2110j0057n5077j0470N2832
15936D346O6261Q899m8552l8759p298L8632o766M1646J2085k2004m0303n9784
15924e1597r69L5096J2338J2969K5155j914n8528j3577M6680M0779M6981n4769
15912C8644p6624j6202M9624K4359J2706m7798L8194j6917n2746n1398O5523M8654
15900A6019k1814o2765k6756K8533K2998j7818O3772P1445m3647n61j9421J7932
15888B7917J5750n098o4794n194M9288L0659n6003K0976J261j4209J652L9044
$$ y = [49203, 51432, 74679, 66871, 27346, 30256, 19704, 32775, 63084, 49640, 20205, -19995, 1756, 42648, 3184, -2146, 42550, 16567, 23554, 81, -47991, -77040, -61309, -11504, 2067, 70927, 31129, -20425, -34554, -44258, -73436, -24992, 27118, 17061, -38016, -48486, 4346, 70607, 79506, 30954, -7805, -15103, 23529, 16763, 58409, 70494, 48490, 8187, -51597, -52566, -17470, -5132, 7837, 32992, 31078, -27450, -41027, 5653, 46432, 93413, 38644, -37980, -54182, -4558, 19801, 32507, -15291, 22903, 5986, -46760, -98158, -32635, 16019, -5795, -68560, -95316, -66783, -43785, -61603, 2169, 73614, 29967, 29406, 9985, 27917, 43667, 38569, -26225, -31419, 17869, 48528, -7475, 13501, 14762, 553, 2205, 41249]
15876D1249j8616p9353L9614M7222P255m965n550K9077j0058l1803l0459m8871
15864f5258j2206M8788k4971m7242l3474M3685J9520J0605m0942J7486P1216N401
15852g392j5510j8632M5843K0978o1074M9270r19j0427l9601r610L4607L7417
15840B4950j8917j0573L3431J4906K2242k0143k9207j0705m4645n5824m282Q8590
15828a0177J9831k2742n9988k7421P6317J7733K3967j0412P2021M5545n6576p8726
15816a0628l5719M4343k2311J6830j5009l7598j3101M5374L3309k10j3397j2557
15804b0674J7429L0741j7533J2170j1802L6404Q903m4732q535L3391R884k8239
15792A7407k289J2332N2488l7567p0810m7242J7738O0451L2989n961J8777O295
$$ y = [41249, 22633, -56720, -17106, 30116, 37371, 32406, 26856, 55933, 45875, 14072, -16387, -65258, -77464, -28676, -53647, -100889, -134363, -90678, -71158, -60553, -101495, -84009, -12793, -7392, -22902, -41534, 4309, 25287, -35787, 13483, 12564, 2137, -37464, -47074, -12467, 24950, 6033, -4540, 28891, 43797, 66039, 45896, 16689, 5984, -38661, -94485, -98767, -10177, 9654, -13088, -73076, -100497, -24180, -6447, 17520, 7108, 79129, 124674, 68098, -10628, -46347, -2004, -24315, -7485, -22494, -60092, -73193, -27819, 5490, 5280, -8117, -20674, -3245, 27496, 9963, 22133, 10331, 46735, 55638, 10906, 2371, 35762, 45646, 17407, 15118, 27450, 79938, 42371, -28439, -75681, -57943, 2508, 35497, 29536, 48313, 54608]
15780E4608O278J1388l5418o5827j8532P4034K3417o7721j1440J2844j105j0028
15768b7502k3728o678p129N3084K6863j3333J8574K2786K9542l6524r969J4992
15756D0978J5834K0517J9357K3885m2844j3074m6742j00202K2058L9934M2526
15745B2227m515m3716l5695L3818j0324j0981L0769j1243O2673j8210P125K8269
15733E0197l4349m4041J4154J6772N56J6696j0850j8175m2914l1778K0548K6646
15721c6538O512k2008r514k048L4180K9047m1999l4232L8247M7125k1140q0141
15709i2509j2747K753J1796M5675J0515r956l621j2671O7628M0626J2704k9426
15697C0767m2089Q65J6052M349J9740N099l7451P608M2423O129j5089m9437J1864
$$ y = [54608, 60886, 72274, 36856, -28971, -47503, 26531, 49948, -17773, -29213, -16369, -17474, -27502, -51230, -57908, -65037, -11953, 14910, 1577, 20151, 42937, 72479, 35955, 25986, 40978, 56812, 77329, 96686, 120571, 77727, 64653, 17911, -82291, -60233, -20299, 22227, 17712, -26004, -61699, -27881, -38205, -49186, -18417, -29660, 33013, 14803, 21928, 50197, 15848, -28193, -14039, 2733, 3289, 19985, 9135, -9040, -51954, -83732, -63184, -36538, -30026, -52034, -61548, -63596, -29416, -369, -42368, -76600, -38353, 8772, -12368, -92509, -105256, -102503, -90707, -45032, -34517, -44473, -48094, -60765, 6863, 47489, 60193, 30767, -11322, -10457, 5595, 9944, 29684, 34783, -2668, 4940, 47363, 53492, 38403, -11034, 830]
15684H30Q0027j0787m6453n2035m8407l3044K5087N6718P2710P6474k9810n2638
15672C8672m7536n9851K6546L2850J7678l2701K6879m0334m8782K930N9125P3136
15660D8612K990R317K5503m9764q1492k0481N0679K9675P7093j2574j05305j3681
15648c9428j6074k125N574K2026K2073o9139J3156M2117k5800J4653l1465K147
15636f2285J0427m3467N3993O8635K692R049Q530j9605j4530l6513l2413K1883
15624c3604p9294O6060R0658N391O921L4878k7604o6292O408N8773M423m8704
15612A8014m1295k822L1258K3837j9919K6744j5014j2341R451j2464o183j4821
15600a5555j9439K1320k8829K056J9008Q2809L2254j1113k3292m5483j08724N5875
$$ y = [830, 80857, 70070, 23617, -28418, -76825, -109869, -84782, -28064, 44646, 121120, 91310, 38672, -8864, -68715, -42169, -9319, 8359, -24342, 2537, -37797, -86579, -83649, -24524, 48612, 51602, 60919, 86422, 36658, -44834, -65315, -14636, 15039, 92132, 79558, -25747, -39428, -55502, -57627, -52053, -30027, -7954, -77093, -63937, -21820, -47620, -32967, -64432, -62285, -51858, -95325, -41332, 27303, 29995, 39044, 47574, 27969, 13439, -23074, -55487, -33604, -112898, -46838, 43820, 49211, 56132, 91010, 63406, -2886, 3522, 62295, 66718, 18014, -23281, -26103, 5155, 28992, 9073, 35817, 20803, 8462, 17913, 5449, -734, -15555, -34994, -13674, -42503, -40447, -21439, 61370, 93624, 82511, 59219, 13736, -94988, -39113]
15588c9113N0378k8675p4117J0928L8157M3153j3860L633l6644j3347M0144n3744
15576g3107j2456N8575J2602o760M2171O128o2810o8962l2331J9608P2444M5583
15564F85L3533j0358K9222M6849n442l5890l9494n5145l4010m4424J0558M4224
15552e9692J8547r70J3878l5077m756J9512J1079L4311O6032j5534j5674o3877
15540c2221j3542M0181M5685m9467l6961j7025j1320j4997l4658N1943K4496N688
15528d2198m5180J6918l3337N0406O9137K2625K3816K5757m1289J6471J0987k0263
15516E3850k8754k9424K0344m309J0869j2420k1779O0338m7141j307n911l8404
15504d4048j9427R6442M0252o7557k7214L3295J4772k0960r033l7750l5157l8751
$$ y = [-39113, 11265, -17410, -91527, -80599, -42442, 711, -13149, -9516, -46160, -59507, -19363, -73107, -85563, -26988, -14386, -21146, 21025, 27153, -35657, -104619, -136950, -117342, -44898, 685, 34218, 23860, 53082, 99931, 94489, 58599, 19105, -36040, -70050, -114474, -103916, -59692, -41145, -42115, -28237, -63314, -68070, -48558, -37479, -3168, 62864, 47330, 31656, -32221, -45763, -5582, 40103, -9364, -46325, -63350, -74670, -89667, -124325, -72382, -47886, -42198, -87378, -70460, -103797, -53391, 15746, 38371, 62187, 87944, 46655, 63126, 74113, 53850, 25096, -4328, 16016, 11707, 22576, 10156, -11623, 48715, 1574, 267, -5644, -44048, -63475, 32967, 73219, 5662, -21552, 11743, 26515, 5555, -3478, -41228, -76385, -115136]
15492a15136J6207K5175o609L4592M2695L0331R782j4871n941O0629n286J4598
15480H6166R592j7813o995n7568q9097n407L5534j6477N9805K3124j1843o989
15468B032M0486P065j9296o6911m6816k6766L1177P1767j7199L1046j6979j6579
15456b6973k3366n2719k8943J475k1906K0970N2685R3721K3614K672r705p7611
15444d6086P541L3866K2995j9982l5681L6769N3232M592k8087n0916q5356k9717
15432a36830J4923O488K8793K3755K9923N8454K5332Mp173l383M808n6670r899
15419b1475J3201Q748m2704l1905M7752O2459j7418L8952L2270m0512K6560L8136
15407A14064n2474J8775M062m9934k8966O743L9109L3420l5805m4482m0713K4060
$$ y = [-115136, -98929, -73754, -80363, -45771, -3076, 27255, 37037, 22166, 16225, 76854, 71568, 86166, 95758, 77945, 70950, 13382, -75715, -81122, -45588, -62065, -2260, 20864, 9021, 2032, 42518, 49583, 30287, -36624, -83440, -110206, -79029, -7262, -24461, 6585, -10394, -26973, -50339, -103058, -132001, -130526, -152432, -131462, -78777, 14944, 38558, 41230, 31525, -46086, -38545, -4679, 18316, -1666, -37347, -578, 52654, 57246, 29159, -21757, -107113, -136830, -121907, -115419, -86626, -62871, -32948, 25506, 50838, 50842, 43669, 40286, 45094, -11576, -21475, -8274, 474, -42230, -74135, -26383, 36076, 18658, 57610, 89880, 49368, 75928, 114064, 61590, 80365, 84427, 34493, 5527, 12270, 51379, 84799, 48994, 4512, -36201, -12141]
15395a2141K6470L0925r827L2805k2420j00778k7579M5302L3456J1752N558K8969
15383D2492J1710n7602K541N5018j9012o1909J682k4121M2321K5234K8939J2996
15371F0289o729m1252j217m111N057r552K2074J3405p1225k0610K7685K5736n8823
15358e9273k9618l0885j1119N6550P0285n2668K7885M0618m1626M2374L7360k9364
15346B0519m8251r197K4967M2886o5068m3096J8353n896m033O2415L3282j1471
15334A5410K4096K2164q654p3300k2917N5130m3181J8317L444J0087l8381M9838
15322A2053n244K8099j4295N489l3060j33122J670j5660K2208N7047Q247p429
15310g3997k0169p04K4319N2118J6330n422k3575J2631M4975k6089j519J8067
$$ y = [-12141, 14329, 45254, 35427, 68232, 45812, -54966, -82545, -37243, -3787, 7965, 13523, 42492, 54202, -3400, -859, 54159, 35147, -26762, -25080, -49201, -6880, 18354, 47293, 60289, 53560, 12308, 11091, 6980, 12037, 2485, 24559, 37964, -33261, -53871, -26186, -450, -59273, -88891, -119776, -130895, -74345, -4060, -56728, -28843, 11775, -29851, 12523, 49883, 20519, -27732, -36929, -11962, 30924, -34144, -77240, -58887, -64783, -68816, -6401, 26881, 15410, 39506, 61670, 53016, -20284, -43201, 11929, -31252, -12935, -9491, 596, -37785, 12053, 6809, 34908, 20613, 26102, -6958, -140080, -138410, -154070, -131862, -74815, -66568, -73997, -94166, -94870, -70551, -18433, -2103, -7525, -31100, -18469, 26506, 417, -1102, 16965]
15298A6965j05646l069k7617O4100L0706l2561K1979N2653O042o6957J6915L2626
15286F136o392j5598J2770k939M6685L2671m5689j8490l0091k7034K4354J2701
15274a0916k2738j1184N339l6771j6214O9646N6870j0733K36P8286M3582n077
15262A40326m1680n3479l8201J1022k1748n1655o760N2451N6722k4933m840P1224
15250H8449q4537j06489M6747P5786P2515N155k9126m9750m3776L8258K6486l6349
15238C369k8233k3471J9815N8720j642k4332L6314Q233o1585p3955k1995L5784
15226g2978M9444L2777J0918L4987m470j1324j7497P681r995l4721j9939n586
15214d0703J2612P4840m5293p0859M7902K0850N0052L9348o2639m3849K9117L913
$$ y = [16965, -88681, -91750, -119367, -55267, -24561, -57122, -35143, 17510, 23552, -43405, -26490, 6136, -256, -15854, -3084, -6023, 40662, 73333, 27644, 9154, -20937, -47971, -23617, -10916, -33654, -44838, -39499, -76270, -92484, -22838, 34032, 23299, 23535, 101821, 145403, 140326, 98646, 45167, 6966, 17988, -3760, -55415, -62175, -9724, 46998, 22065, 17225, 88449, 3912, -102577, -55830, 19956, 92471, 97626, 68500, 18750, -25026, 13232, 39718, 3369, -24864, -48335, -28520, 30200, 28558, 4226, 40540, 48773, -12812, -86767, -108762, -72978, -23534, 9243, 20161, 55148, 50678, 39354, 21857, 29538, 19543, -15178, -35117, -40703, -28091, 46749, 1456, -69403, -21501, -651, 49401, 88749, 26110, -17739, 11378, 15291]
15202A5291j6834l78J8144J9532M1025O723r728l5515r1912j8928K7144j674o5612
15189a12722J9690O3322m150n442N1430O228k6954q228j5195k8160N6281L6300
15177C2400l1575k7636p9193O246O3564l6495k3672L8104K6028J4840m1398m6706
15165a05493Q037M8976K1662r543l528P350J9438l6210q020j8306Q331L2110L9206
15152D010J3234l0836J8855J2102K6102m0543J5315K3631J8197J790k4172l4660
15140C025k1844R9j9810m0992k6543k8924J6463N9582R7362K9083p2457n3198
15128e8154j9272L5244q489L9838J7445n3449k2378J6346j2927K9201M0446L2986
15116C6837O1501k8986l4175p9464k4707M1412P6029N7785k4994l7745m5120l2017
$$ y = [15291, -1543, -1921, 16223, 35755, 76780, 83503, 73775, 38260, -53652, -72580, -45436, -47110, -112722, -93032, -29710, -33860, -39302, 12128, 18356, -8598, -16826, -32021, -60181, -3900, 32400, 825, -26811, -106004, -99758, -36194, -72689, -96361, -58257, -32229, -17389, -58787, -105493, -97456, -48480, -26818, -36361, -39889, -32539, -13101, -49311, -57331, -75637, -67306, -35196, 4010, 17244, -13592, 5263, 17365, 43467, 2924, 18239, 41870, 60067, 61857, 37685, 3025, -18819, -18720, -38530, -79522, -106065, -134989, -118526, -58944, 38418, 67501, -4956, -58154, -77426, -42182, -50671, -10833, 6612, -46837, -69215, -52869, -65796, -36595, 3851, 36837, 98338, 69352, 35177, -44287, -68994, -27582, 48447, 106232, 81238, 43493, -1627, -33644]
15104c3644m1133m3064L564q41L1990Q7960P62j5470q2697J0716L7139M3634J6971
15091A5887k8312J873K5240l8071J2416M0200j763n1681n1451P368J21422k4771
15079B8357l2754L0618J6311l728r5595q9755o354Q6775P8312j2619J2265o3005
15067e1172k279L7774r778j6032N9181K7431l3889J2581J2087n3846m6910N3515
15055a1337m382m6036M7862J5338k1155l5631J9215P2012M9971L3036j5732q7078
15043A6083O095l4499j2403K5446k5444K6876L0200j5685Q6141Q795j23684q1345
15031i3424k7303K9760N2866j0823j1230N2115M0825n354O656l1918o4998Q180
15019e4648j9365K6961O1550R682J5805r8168J7103Q2701p794q6787m498N5886
$$ y = [-33644, -74777, -117841, -114277, -115118, -83128, 4832, 5594, -9876, -92573, -81857, -44718, -1084, 15887, -12425, -10552, 14688, -23383, -10967, 29233, 27470, -24211, -75662, -68294, 53128, 28357, -4397, 26221, 42532, 38804, -56791, -146546, -152900, -66125, 12187, -432, 11833, -51172, -53451, -15677, -25455, -41487, 17694, 45125, 11236, 23817, 35904, -17942, -64852, -11337, -15719, -61755, -13893, 1445, -19710, -55341, -36126, 35886, 85857, 118893, 103161, 16083, 22178, -12321, -24724, 722, -24722, 2154, 32354, 16669, 102810, 111605, -12079, -93424, -120727, -90967, -38101, -48924, -60154, -8039, 32786, 27432, 34088, 2170, -62828, -54648, -74013, -47052, 14498, 24180, 39985, -58183, -41080, 41621, 33827, -52960, -57458, -1572]
15007a572j035O332J491M405M2602k8710J0798Q1007j7462q4213l0780l5528J6233
14994c6432N4183j7052k120l0389O8443N7801q0254n9261o4242k064O1941N6941
14982G495K628J347Q0649M7116k7192k0022j8334n4769o6169r421n729K7541L2914
14969a946M349n2782k7440K599Q2351r973J5297M3076j6434l1313l9752J7654
14957a4314k9750k5381L4116M984p746J0908q244K6423j7997q8248j3998P8841
14945e0406J4235l3574j1287k488O85N8415K8062P000K985l1477k0744j1485L9366
14932a0713J2062K1193L5934j4148l8412j6067L1609k5495O561M5019N8789J2566
14920A18898m740j7628j00553k8858N0002P4449k8776q539m6954n332j5110R901
$$ y = [-1572, -2607, 3725, 5216, 9621, 52223, 23513, 34311, 115318, 97856, 13643, -17137, -52665, -36432, 17751, 699, -1421, -31810, 36633, 94434, 14180, -45081, -109323, -111387, -49446, 7495, 10123, 11470, 92119, 139235, 112043, 92021, 73687, 18918, -47251, -56672, -62401, -34860, -1946, 2403, -50379, -77819, -75220, 7131, -2842, 12455, 55531, 39097, 7784, -31968, -14314, -44064, -69445, -35329, -30345, -38091, -27183, -35427, -9004, -27001, -115249, -129247, -50406, -36171, -69745, -81032, -83520, -82835, -24420, 3642, 10642, 13627, -17850, -38594, -50079, -10713, 1349, 22542, 58476, 44328, 5916, -10151, 21458, -4037, 2524, 47543, 106332, 118898, 114158, 96530, -4023, -32881, 17121, 91570, 62794, 54255, 7301, 1969, -13141, -3240]
14908c240l701O1939j3321R985M1393r49p7028o947j8145N4431J3927J8729q085
14895F8988M5235j8085p1485k1356p712L6145j0387k0521r3O190J1242J728P966
14882B7855n1558K7924L9176L2430n044k9467p9743k4544O065k236K612M0530
14870a6000N6730J959n445L6636N717m5359m3109K7634j4687p355k8081j0413
14858d1773k0492Q608l4241J488K6783k074l6031L5743M097O437L7394K4196r557
14845E78o7864l0568j4934L6400M2065L0581l1425N624R316K6637J2699L4608
14833E3717k0671p9955k1197M1656J8677n9588J4601J4346o7864l3611L1318O3154
14821d5417O8441k1657j9436O363k9699o6037j5450K0675P0704Q8786J4876O987
$$ y = [-3240, -6941, 54998, 41677, 51662, 93055, 92106, 15078, 8131, -10014, 44417, 58344, 77073, 68988, 114223, 96138, 24653, 3297, -4415, 31730, 21343, 822, 729, 6919, 18161, 19889, 27855, -23703, 4221, 43397, 75827, 70783, 41316, -38427, -62971, -56906, -59142, -56530, -16000, 40730, 42689, 37244, 73880, 79597, 34238, -8871, 18763, 4076, -3279, -31360, -41773, -62265, -53657, -87898, -86410, -59627, -61701, -97732, -61989, -57892, -51455, -14061, 10135, 578, -67286, -97854, -112788, -76388, -34323, -3742, -35167, -29543, -20227, 6410, 19109, 53717, 33046, -46909, -68106, -26450, -7773, -67361, -52760, -38414, -106278, -139889, -108571, -45417, 23024, 1367, -18069, -11706, -41405, -107442, -122892, -102217, -31513, 57273, 72149, 79136]
14809G9136k5581q2570j2756p951l0191j20J5255K779l4973o970N879J9692M3391
14796c4980l6522L813n0001L1961N6012J8903m3842L2713J7197J2945j6831m654
14784a3286n741m7942L7934m982P096L5249k9094j1222O1184N5624j4216l9419
14772C1185L0244k4733k0008M0881o572k6772j4315j9191j6512k3819l0783n805
14760h6200l2229O449K7969J5473o135J3948J9898k25p9503j4326K5677L2786
14748g6418P5750K7523L8116J8057l8023k0881j8404k1714o8343L6751M3557k4036
14736b8065j1088L8879O4285q957K652o4716j8189J02Q457K6989r688Q754J6204
14723B5619K8478q790p816j6341o9955r947L0361J7963l2148Q678K7850J7016
$$ y = [79136, 53555, -29015, -41771, -49722, -79913, -80033, -64778, -61999, -96972, -103942, -98063, -78371, -34980, -71502, -67689, -117690, -85729, -29717, -10814, -54656, -21943, -4746, 8199, -8632, -13286, -19027, -66969, -29035, -34017, -26921, 8328, -20766, -31988, 29196, 84820, 70604, 31185, 61429, 36696, 16688, 57569, 50997, 24225, 9910, -9281, -25793, -49612, -80395, -86200, -118429, -111980, -84011, -68538, -74673, -60725, -40827, -41052, -120555, -134881, -109204, -76418, -668, 26855, 64971, 83028, 45005, 24124, 5720, -15994, -84337, -47586, -4029, -28065, -39153, -274, 64011, 55054, 57706, -7010, -25199, -25097, -16640, 10349, 661, 9415, 25619, 54097, 45307, 37491, 21150, -48805, -58752, -28391, -10428, -42576, -33898, -6048, 10968]
14711A0968j554L0128R591J3597j0428n7565k0080j5832k8453m4151m9405J4249
14699a48935N4135P3407q662l9384m229L0831k931M2040j764m5038R203K7885
14687a3442P999k8506l1714J0183m6334n8183L4869K0797M4154j1374P754L836
14675e9961N0217J5561K8464J3748n4295r6047N744Q9083L4490l3066m6790k6519
14663g9371K9209Q873M1781K3640J255Q7796j8842m9114L109O6035k6003m2960
14651D5408o6121K3972L6059J0916n476n5324n3719N311K040k042K167L5287M2917
14638B1395l5575J1473O159O004J2870K1970o630K7282L6849K9205k7189k3873
14626G9940o3774q558O1480P5871q407m5512r4911l543r857K89j1397j5927M4555
$$ y = [10968, 9414, 39542, 49133, 62730, 52302, -5263, -25343, -41175, -69628, -113779, -163184, -148935, -94800, -21393, -30055, -69439, -73668, -42837, -45768, -3728, -5492, -50530, -41327, -13442, -5443, -33949, -65663, -55480, -101814, -159997, -125128, -104331, -60177, -71551, -63797, -59961, -9744, 5817, 34281, 48029, -6266, -102313, -96569, -7486, 27004, -6062, -52852, -79371, -50162, -41289, 492, 24132, 25387, 113183, 94341, 45227, 48336, 114371, 88368, 45408, -20713, 3259, 39318, 50234, 44758, -10566, -64285, -58974, -56934, -58976, -56809, -21522, 21395, -14180, -2707, 3452, 9456, 22326, 44296, 37666, 64948, 101797, 131002, 103813, 79940, 16166, 7608, 69088, 144959, 136552, 91040, -3871, -7414, -17271, -16982, -28379, -44306, 249]
14613B49N5900o309m6789L0945k4006m6675J2781J0208m9992J5425Q1238M1644
14601G4619j4213l1162Q984J6579P228L4883q556K2346q134m3879P224j8467l2929
14588A4523k3564J9002J114L6124J6208m2161q232m4232m3054O0852M2545n4225
14576b5100p187M1667k369k1804Q190L2285o928q200l2929L5162J4063n5268j1772
14563d0190K8631J9639N1860p0067n8679j8467L3624O5653J4136n471n311k7582
14551a2224j6570L3890K1377K0775j139m3770j1063J6138j0957l4034k403O244
14539c3736n8666j7182K0920j7812O504K0157k612k4919L2293M9538K5229j2075
14527a2361k629K1475l70l5136j5211j3737M9696L1053J8075m4250l7435j2823
$$ y = [249, 56149, 49840, 3051, 33996, 9990, -36685, -23904, -13696, -63688, -48263, 32975, 74619, 60406, 29244, 38228, 54807, 62035, 96918, 88362, 110708, 102574, 58695, 65919, 47452, 14523, -9041, 9961, 11075, 47199, 63407, 21246, 13014, -31218, -74272, -13420, 29125, -25100, -32287, 9380, 7011, -14793, -6603, 25682, 18754, 10554, -22375, 12787, 26850, -28418, -40190, -11559, 8080, 59940, -10127, -68806, -87273, -53649, 12004, 26140, 20669, 15358, -12224, -28794, 5096, 26473, 47248, 46109, 2339, -8724, 7414, -3543, -37577, -39980, -33736, -92402, -109584, -88664, -106476, -99972, -79815, -82427, -107346, -75053, -25515, -286, -12361, -14990, 6485, 6115, -29021, -44232, -57969, -8273, 22780, 40855, -3395, -40830, -53653]
14515e3653j9534m24k3542K5264j1310R074Q2228M4527n3327o8377M0100L994
14503b4980j1944K1790j2277l3502j1528M3738O5538j3693J2890J6745l8380j0160
14491D237j0479R256J5434P644k153L2468j3375j1592Q248o5116k3288K9384P7050
14478E7718L3082M4349m2506k3732k6045k094o4229k1123j4845O884M1412k5995
14466c7124q3889M2962N0831j617M6593O3821n9376n3858J8993N0182j8902R983
14454B8599N678J373J182R439k4745n415l940o0689p844L7452j7861k5271N9210
14441b832J1272l6665k9575K893l3049k9449l3103L3550Q0739K6462k3673p6375
14429a09805K3418N1742Q720l1897R421K8844j2293n684q7036O723L8210J5564
$$ y = [-53653, -73187, -73611, -97153, -71889, -83199, -74125, 8103, 52630, -697, -69074, -28974, -24980, -36924, -15134, -27411, -60913, -72441, -28703, 36835, 23142, 36032, 52777, 14397, 4237, -6242, 3014, 18448, 26092, 23939, 56407, 43032, 31440, 39688, -25428, -48716, -19332, 57718, 90800, 135149, 92643, 68911, 42866, 40772, -23457, -44580, -59425, -52541, -11129, -37124, -121013, -78051, -27220, -28837, 17756, 81577, 22201, -31657, -12664, 37518, 18616, 28599, 34277, 35650, 36832, 46271, 21526, 16111, 12171, -48518, -56362, -18910, -36771, -62042, -2832, 8440, -28225, -57800, -54907, -87956, -117405, -150508, -116958, -36219, -9757, -33430, -109805, -86387, -34645, -25925, -57822, -48401, -19557, -31850, -37534, -124570, -117847, -79637, -64073]
14417f4073m3524j5550O3907M2145j477j8760J8613O4270o9766k0328Q0869L4802
14405G1128p8579j0931P3570l6039n0146m392M1852L727J0549M8983J0518n8995
14393B1245j3593L337k8715L7467K6848J685K1777J144q4223l0178O7333o688
14381A7439j3065J196M1700m1069j8769j7381L6472q538L244m0909n5134L6544
14369e8270J01200j7635m8508J1062k9331m8121m955J13623L7874q188l7770m5360
14357c4379R922o906r971K7377J9940N1213J6181J1881n2192o5141K9898K8420
14345B6243L9468k883m9367p467j7021J3999l2575j5790M3025J0743K944J0787
14333B2106J5767J0459j3801J9906p130j23863q4313L2168Q5016M2439J8563L6817
$$ y = [-64073, -107597, -123147, -59240, -17095, -18572, -37332, -18719, 45551, -24215, -44543, 36326, 71128, -7451, -18382, 55188, 19149, -30997, -35389, 6463, 10190, 20739, 69722, 80240, 21245, 7652, 10989, -17726, 19741, 46589, 48274, 70051, 71195, -13028, -43206, 24127, 17439, 4374, 5570, 47270, 6201, -12568, -29949, 6523, -2015, 1229, -39680, -94814, -58270, 42930, 25295, -23213, -12151, -41482, -89603, -94558, 19065, 56939, 48751, 10981, -34379, -24457, -31363, -41334, -13957, 5983, 57196, 73377, 85258, 33066, -32075, -2177, 26243, 65711, 62828, 13461, 5994, -11027, 2972, -29603, -45393, -2368, 8375, 11319, 22106, 37873, 48332, 34531, 54437, 47307, -76556, -160869, -128701, -43685, -1246, 17317, 54134]
14321E4134q6203m1294k0069J5808M376N654R149J64L8600K2432J2125Q7756o327
14308I6305n0444o8033o0664n8474j2948J01757J0973m4279p383M1091P6069O1954
14296H5924o860p6180k0015N1928M7443j4807o1635k1474m3487p066K2037K9836
14284a4356K1777m9011m7664L4714O7691R880m6609j7607L1749j0304J5509M6194
14272D1963J7662l5496j8468n994k9867L6644M0736n2521l9023J0511M0331K7468
14260C3946m4856l3135j0063J658o495j0513J5726k842k1781p531l7978M3937
14248g9927N8987O1497j177k2946k1396j7645K0429o489k0123n8423j263L9247
14236d9229j1247j1957M2026j008P195j0402M7421K7236j8556K0947Q0513K8050
$$ y = [54134, -32069, -73363, -93432, -77624, -73248, -67594, -58445, -58281, -19681, 2751, 14876, 102632, 96305, 45861, -22172, -82836, -141310, -154258, -52501, -41528, -85807, -93190, -52099, 23970, 85924, 79064, 2884, -17131, 34797, 82240, 67433, 5798, -15676, -59163, -66229, -44192, -14356, 7421, -41590, -89254, -54540, 13151, 23031, -23578, -41185, -9436, -19740, -4231, 41963, 59625, 24129, 5661, -333, -30200, 6444, 47180, -5341, -44364, -33853, 6478, 33946, -10910, -44045, -54108, -52450, -58945, -69458, -53732, -56574, -78355, -85886, -123864, -79927, -20940, 40557, 39380, 16434, -4962, -22607, -2178, -8667, -28790, -87213, -88476, -49229, -60476, -72433, -30407, -31415, -24220, -34622, 12799, 40035, 21479, 42426, 122939, 150989]
14224A50989j19831r0274k0734Q867j128K4177m4047Q296K0273L4031M0937j5153
14212c597l2941o170J9294K6698j739N6106J5132q112n5376j8036M559l2057j0665
14199d6904j2268J537K9515O6769K7246k1550L41K0001J2509K247k8026l9296
14187A2121q639M9425L9465m220L705k8941l2015j3758k0354L3032l5848q692
14175a4719l8636O8810M918l0287J1557M0573k7582q226q888L8780K0753j6060
14163D0993O1213K2033J8390m877m8768J0841j04865j9555k662J3274P169J0666
14151C852L583L0226k382m259m1674o5334l0951O6408P0237P345m6033K2314Q017
14138B1349j4289n0813m6279K9497L6349J0565K692k8372o639m7238j2754J4819
$$ y = [150989, 31158, -59116, -79850, -70983, -72111, -47934, -91981, -83685, -63412, -29381, 11556, -3597, -36538, -42708, -23414, 3284, 1545, 57651, 72783, 64671, 9295, -8741, -4182, -36239, -46904, -59172, -57635, -28120, 38649, 65895, 44345, 44686, 64687, 77196, 79443, 51417, 12121, 3482, 52907, 92372, 88152, 91857, 62916, 30901, 17143, -3211, 29821, -6027, -14719, -53355, 15455, 20373, -9914, 1643, 42216, 14634, 6408, -2480, 36300, 57053, 40993, 102206, 124239, 142629, 137752, 88984, 99825, -5040, -24595, -27257, -13983, -6814, 3852, 7435, 37661, 35279, 31020, -10654, -75988, -106939, -40531, 29706, 37051, -8982, 13332, 21349, 7060, -43753, -90032, -60535, -24186, -13621, -10929, -39301, -45940, -93178, -105932, -91113]
14126i1113K0461K1476N0246L1232l574j8159l0920J2492N936r511M9562L8159
14114G6287J802j9876K598O2719j0467k9789j4165O375O744L460j7978n6101j0538
14101A071M5680q5441o0881j5030M0667p074k9424l7705L5019L7126K758o6590
14089a39824M44K7921Q9840L8215N1203j9310m8860o4441K9006J9664m1126m6110
14077a03378j8782M6482K7376J2175P1051J049m623L3563k6943k2402O109k5135
14065c458L648m5695K9245k4737k9617K6620l826O941M6905M0319K5709j5754
14053E6300l6570l4336J7026K9544L9486l7323m2330Q079J4415J3150l415j1303
14041A2723o4595p8070K634N0646N4652J5255K193m479l6425l0578L1066M5195
$$ y = [-91113, -70652, -49176, 1070, 32302, 28728, 10569, -20351, -7859, -1923, -11434, 38128, 76287, 78089, 58213, 60811, 123530, 113063, 83274, 69109, 75484, 82228, 85688, 67710, 11609, 1071, 46751, -38690, -99571, -114601, -73934, -81008, -110432, -148137, -113118, -75992, -73234, -139824, -139380, -111459, -21619, 16596, 67799, 48489, -371, -64812, -35806, -16142, -57268, -103378, -122160, -75678, -48302, -36127, 34924, 35973, 31350, 64913, 37970, 15568, 21677, -3458, 190, -45505, -16260, -40997, -70614, -43994, -47820, -40879, 6026, 46345, 72054, 56300, 19730, -14606, 2420, 31964, 71450, 34127, -8203, -124, 14291, 27441, 24026, 12723, -51872, -129942, -127308, -76662, -22010, -6755, -4562, -9041, -45466, -76044, -44978, 217]
14029B17K5291o8866l4892P2994O0485J287J554K0442L1839J3152j4674j4445
14017I4384r285K7376j5008l5008j2916q778n2915l6684M9606r771N909Q733K2952
14004B8595m8020L533R8358K4378m1652n7754j4581J3433M6898K817J3866K6632
13992I6503p811m1942l5509m7465j6190j9059j2669L3067O2379J2989l0482j3673
13980a9862k0391L1424j5987J9313J1533J3147K8689P024J5281m7301n2194J8860
13968a0464J9414l4324K87O5531P8408M3433j2631k3246m5043J0059M7441p419
13956A31446o0471K5822K4475q21l8605m9823j752N0651o773n3936J0891N2414
13944H3518J8733m4744l7210j0888m1410j6027P397L6842P356j8443J6749k309
$$ y = [217, 25508, -43358, -78250, -5256, 55229, 56516, 58070, 78512, 110351, 123503, 108829, 94384, 85099, 112475, 97467, 62459, 49543, 40765, -12150, -48834, 772, -8999, -3090, 5643, 28595, -19425, -15892, 82466, 106844, 65192, 7438, -7143, 6290, 53188, 56005, 69871, 96503, 88692, 46750, 11241, -36224, -52414, -71473, -84142, -51075, 11304, 24293, -6189, -19862, -40253, -8829, -24816, -5503, 6030, 19177, 47866, 54890, 70171, 22870, -29324, -10464, 8950, -25374, -25087, 40444, 118852, 162285, 149654, 126408, 81365, 91424, 138865, 131446, 70975, 96797, 121272, 120451, 81846, 32023, 30271, 80922, 74149, 20213, 31104, 83518, 102251, 57507, 20297, 9409, -32001, -48028, -40631, -3789, 3567, -14876, 1873, -436]
13932d36k5137K3417L0847M0756L6653n1106j6116l4404k6649N7427l410n9567
13920b7725l853n260k8048L3207N9261P783k5589K1364J00J0896j76J2908m0808
13907A4060l6444M655j2262L2566M3517l1816N318l5178K2226k7320k2289L3248
13895i719k5717J4043J8590l681l9105L9291N9454q304k4843N979k0235j0994
13883e241l8006p5420j6933M5135P28p301O0878j0649n4866n678Q969K2047M4548
13870c1789M6954k761k2279K8475K837j7168J6697M035n702N4750k3486k7094
13858B3469m6052k7758j3273l8108K7047J5588l6330J0400P0316J1184j4757q710
13846b6984j1779l9285M7422K3452o396K0492K0041m6445j0534j0990l965j5599
$$ y = [-436, -25573, -2156, 28691, 69447, 106100, 54994, 38878, 4474, -22175, 35252, 31842, -27725, -31578, -36838, -64886, -31679, 27582, 35365, 9776, 31140, 31240, 42136, 41960, 54868, 14060, -22384, -17729, -29991, 2575, 46092, 14276, 19594, -15584, 6642, -20678, -42967, -9719, -35436, -21393, -2803, -6484, -45589, -6298, 53156, 44852, 20009, 25988, 5753, -5241, -43247, -118667, -135600, -90465, -89737, -97038, -36160, -46809, -101675, -107353, -98384, -76337, -31789, 15165, 12404, -9875, 18600, 21437, 4269, 20966, 25001, 19299, 74049, 50563, 23469, -22583, -50341, -63614, -101722, -74675, -59087, -95417, -85017, -14701, -3517, -18274, -26984, -38763, -78048, -30626, -7174, -13570, 6922, 26963, -19482, -30016, -41006, -44971, -60570]
13834f0570j7514k621M7882N0655j1512o188O339l183o8992L6719Q4918j7055
13822C8878p4973L4534k5073m1455P109K604J0290K8169L3022P775J0889N186
13810C6955l414l3539k4047O1818L1195L6683K9985l0692j7604j1606l0850l5194
13798I690k5343K1561k0093o139q481m4459o4856L7301o263J6826N7640j3405
13786d6021j2113L5617J8098J9978K4454j9947o1511K4954l7588n2925P696N3267
13774d6041L1871r841M8702N1944P100j05468m7179J0557Q692J7310J2563M1897
13762B2107o470J8661J596l2662l1935O2974o769L902J3423K920r153N8370N4173
13749A51137l8121m0830k1596l3767q459j8521O7384O0471k9357j8927P2349J3763
$$ y = [-60570, -78084, -80705, -32823, 17832, 6320, 132, 6471, 3288, -65704, -28985, 55933, 38878, -36095, -1561, -26634, -68089, -60980, -58376, -48086, -19917, 13105, 20880, 31769, 36955, 33541, 2, -24045, 37773, 68968, 105651, 135636, 104944, 87340, 75734, 44884, 9690, -15653, 5908, -14185, -20324, -28805, -73264, -138120, -100819, -107082, -90256, -32616, -46021, -58134, -22517, -4419, 15559, 40013, 20066, -41445, -16491, -54079, -107004, -99308, -46041, -14170, -24011, 24691, 76635, 83735, -21733, -68912, -58355, -49663, -32353, -19790, 22107, 15637, 34298, 35894, 3232, -28703, 34271, 27502, 31404, 44827, 47747, 38594, 96964, 151137, 113016, 72186, 50590, 16823, 8364, -10157, 57227, 117698, 88341, 69414, 141763, 155526]
13737A55526n1265L753m6307l7618L5683K6830k7369j06653j0704J5213J3113
13726b9798J3498K9071p343j1224l7982m0833J9188L5791P4849L2408J0829l7107
13714E1347j2147k8645J7913k3458k0672L6311M112l4360k7857M2863M734j8805
13702h664J0276j829J5786k6503r5q423j1504j7841O976L7435r47J6320L7494
13689D8481k262m8329m1983o495J9513K0142m2410L8575N2803J4840K0451j4733
13677E8593m0258j4683k4878J4528J5387n414P529k0665J7617K6864j2759j0665
13665A1196l8232o2689O410L856O0268J0385n6105k5920P838n924R263n313K7791
13652e7176j4407l1121M215J7042J7071N6038M0084J7681K5795j7937k7018k8371
$$ y = [155526, 104261, 108014, 61707, 24089, 59772, 86602, 59233, -47420, -58124, -42911, -29798, -16300, 12771, 5428, -5796, -43778, -84611, -65423, -29632, 45217, 77625, 88454, 51347, 39200, 10555, 28468, 5010, -15662, 20649, 24761, -9599, -37456, 5407, 10141, -8664, 1612, -217, 15569, -10934, -11029, -19452, -30956, -48797, -41821, -4386, -5333, 10987, 48481, 46219, -2110, -44093, -50588, -31075, -10933, -53343, -14768, 38035, 52875, 73326, 58593, 18335, 3652, -21226, -6698, 8689, 3275, 10804, -9861, 7756, 34620, 21861, 11196, -27036, -89725, -83315, -79459, -19191, -8806, -64911, -90831, -82993, -88917, -79654, -84967, -57176, -71583, -102704, -98489, -81447, -64376, -8338, 31746, 49427, 75222, 57285, 30267, 1896]
13640A896L2867j792q6300l0685K3618O74k4457n258J31518J4420J5276J5171
13628H6948o8745K6450k2130k2622j434q1105L5684J07367M5798q778l8752r2751
13616c4070m1993q920N1470Q6879j9042l1088j6905J5313o5059J7164M0603p769
13604a3417K686K5541J4795j2101J5142M1780k4177m7922m3609j5287r787O9293
13592B937J8915K9304l4816j4112L2660M312n119k6954N3016k9858l4009J2193
13580H469M8523k544K385j2767o3829K3161M4378m0405M694j3280k6736K9028
13568A077L1505K8991K3103l1338n1432k0657Q893J9096l531K0489o0701m2361
13556g6866n7383L8L4775L5439L5990l257j4761P749J129O947n9964L217M0855
$$ y = [1896, 34763, 32971, -53329, -84014, -60396, -59722, -84179, -89437, 42081, 56501, 71777, 86948, 18203, 44653, 22523, -99, -1533, -82638, -46954, 60413, 106211, 97433, 58681, -34070, -76063, -84983, -33513, 53366, 34324, 3236, -13669, 1644, -63415, -46251, -5648, -13417, -10731, 14810, 29605, 17504, 32646, 74426, 50249, 2327, -41282, -56569, -66356, 2937, 21852, 51156, 16340, 2228, 34888, 39200, 34081, 7127, 60143, 30285, -3724, 8469, 56992, 54448, 56833, 44066, -19763, 3398, 47776, 7371, 12065, -1215, -27951, 1077, 32582, 61573, 84676, 53338, 1906, -18751, -9858, 9238, 5707, 26196, -34505, -76866, -134249, -134211, -99436, -63997, -28007, -31264, -46025, -38276, -37147, -30200, -90164, -86947, -46092]
13543d6092M8543J1922M643p9894k3623R056L3965P6450M2365l1598l8505p9039
13531g1807N981J5196K7110l7765m146Q5798o641j889l6309l6150J95R031K2369
13518b9027L153r126K2282P7513l0644m7291k2586J7142M3510j5152p2855l9483
13506a02564P275J6679j6371K1847M2973K3773L4905m575J0970l7039j09626l9055
13494a50808Q6852P2131o920k204L4675M9523m0210k8243j2092m5484k0879N1897
13482a1762O3226m476k4227J1001J5857r8303n9165L9619L8983K5343o330l0884
13470d1118l1091n680O4849m7556j1283L0499M2306N4299m8030P2220K3464k2301
13458H0578k4840n5186l6134J7855N9221j7696k7839n426j076j1064L603k3575
$$ y = [-46092, 2451, 14373, 19016, -60878, -84501, -75445, -41480, 34970, 77335, 45737, 7232, -71807, -65826, -50630, -23520, -61285, -65431, 20367, 13726, 11837, -24472, -60622, -60427, -51396, -29027, -25874, -35000, -12718, 64795, 34151, -13140, -35726, -18584, 24926, 9774, -63081, -102564, -95289, -78610, -94981, -73134, -30161, -6388, 28517, 23942, 34912, -2127, -111753, -150808, -63956, 8175, 1255, -949, 33726, 83249, 43039, 14796, 2704, -42780, -63659, -11762, 51464, 46988, 22761, 33762, 49619, -48684, -107849, -68230, -29247, -3904, -10234, -41118, -72209, -77889, -13040, -60596, -71879, -41380, 926, 55225, 7195, 79415, 102879, 80578, 55738, 552, -35582, -17727, 41494, 23798, -4041, -9467, -10543, -21607, -18004, -41579]
13446d1579j4432j4134Q511m9849P1013P2988O1028K5375n0341n9407n0104j0429
13434e1360j5465n0863M0417P6502P0523k4322m1709l0777j3908j9397m9551J0364
13422i9546K5371Q864k5463R665N3231l0750k5567O517M3563J8464M5053p343
13410B2059j03j0140J9820j2575j4242L1208K6752L4488N123j7946k9922n0853
13398C669j1463j1098o3246o0442L215M8697N7286M337k9395K0303K0180m3293
13386f1250m5484J5099M4975J5758j3109M6659k9137k0071N8728p848o1925L8107
13374a9498L4214J4406J3585l7575q9860J0672M5347O126l3713M0169j8335p3187
13362a07649m4464J2534M9255O6880j8504N4327k5642k607K3924M6166M6406j7195
$$ y = [-41579, -56011, -70145, -61634, -111483, -40470, 32518, 93546, 118921, 68580, 9173, -40931, -51360, -66825, -117688, -77271, -769, 69754, 45432, 3723, -27054, -40962, -60359, -109910, -99546, -74175, -65311, -90774, -81109, -27878, -58628, -84195, -77678, -34115, -15651, 29402, 22059, 21956, 11816, 31636, 19061, 4819, 36027, 62779, 97267, 102390, 84444, 54522, 3669, -7794, -18892, -82138, -142580, -139365, -90668, -33382, -29045, -58440, -38137, -17957, -61250, -106734, -91635, -46660, -30902, -44011, 2648, -26489, -46560, 12168, 4320, -57605, -19498, 14716, 29122, 42707, 5132, -84728, -74056, -28709, -22583, -56296, -16127, -34462, -107649, -152113, -139579, -90324, -23444, -41948, 12379, -13263, -15870, 8054, 54220, 100626, 83431]
13350H3431n5537n8054k1095l1352m656M0402L3802K2575j9812l3186j9459M175
13338e8766K1473k240R569j2201J2465p021P3531L434o1900L8932J1378Q348l140
13325C3862K5851J5727n7492q884q789L8867L5692l6678o4606N344J2302R108
13313C04k6765J2351l8939N4007l4608K919N0437M577l3419K0253Q3825J0422
13301A05364p5232p8090m1866K6324r197j3027j3311M6505M232k7740L8519O2434
13289B4915J1634n4290P1777O6365j7091k1117k7193o1195k7494j5669K1254L0814
13277B710o389m1968L3030M0835l9209M6550m2827M6589k7630m5117o4547N9074
13265c8899K9867k7047M887j6935M6115O7128k4700k0946m4016k4438K3510N2250
$$ y = [83431, 27894, -30160, -51255, -82607, -87263, -46861, -13059, 9516, -10296, -43482, -62941, -58766, -37293, -39533, -29964, -42165, -29700, -36721, 36810, 40244, -21656, 17276, 28654, 37002, 33862, 59713, 75440, 17948, 9064, 275, 39142, 74834, 38156, -26450, -21106, -8804, 304, -26461, -14110, -53049, 958, -33650, -30731, 19706, 24283, -9136, 11117, 94942, 105364, 30132, -47958, -89824, -63500, -72697, -85724, -99035, -52530, -48298, -76038, -37519, 24915, 36549, -17741, 54036, 120401, 103310, 82193, 55000, -6195, -33689, -49358, -28104, 2710, -3679, -45647, -12617, 28218, -10991, 35559, -7268, 39321, 11691, -33426, -97973, -38899, -9032, -36079, -31192, -48127, -2012, 65116, 40416, 19470, -24546, -48984, -25474, 26776]
13253B6776J6320J5722k857O1498n2949o4406j8812o0304m7082j3787K2006J511
13241a16364J5302Q2574L9220l8521o4651j6838l1850J9276M8215K348J4658L6311
13229a0320M394l1902j0007M2427J2548j3411q065K2681M3180m4174l8289l5838
13217f6776L9975K6416l0521j0742K6509N9827L4843K0705K8210M720m6908n9943
13205B6315n3349m2374K1283O6953L8934l0380m5898p381N7580o723p2735k3661
13193g1436K9583L3368L520j0446p8537J887L8730K2727J5989R868j2226K0685
13181C712o0429J6471N8414M9580L565q712k8175r8080p796K5220O4584j4742
13169C612j2503R704M642K1880K7018k0719P744o66k8193j8867o2499J4846Q471
$$ y = [26776, 43096, 58818, 55961, 117459, 64510, 104, -18708, -79012, -126094, -139881, -117875, -116364, -101062, -18488, 20732, -17789, -82440, -99278, -131128, -111852, -63637, -61289, -46631, -10320, -5926, -37828, -47835, -5408, 7140, -6271, -14336, 8345, 51525, 7351, -30938, -66776, -26801, -385, -30906, -41648, -15139, 44688, 79531, 100236, 128446, 133166, 86258, 26315, -27034, -69408, -48125, 18828, 57762, 27382, -18516, -25897, 31683, 24960, -47775, -71436, -41853, -8485, -4965, -15411, -93948, -92061, -53331, -30604, -14615, -4747, -16973, 3712, -56717, -40246, 18168, 67748, 71313, 62601, 34426, -63654, -71450, -46230, 18354, 3612, -8891, 813, 5455, 27335, 54353, 33634, 41378, 40712, 12519, -6348, -68847, -54001, -45530]
13156d5530o2878j0245N4765L9172K2706K0318P0250Q34j0700L479m474K9918
13144A07615m4385k3300L161L047k1590m7530L1918L1797M0700j15246o4774L6640
13132f1947N781n239J4473k4209j3103j4509J8583Q7623k965j4361L3427q118
13120A5436n3094j1860O5048K0185j9015l0948J072J7380P3475J0412m7532l7340
13108C219J2431k1608m2096k6318l2898k4431j2999J6310l037K0965P8249L2338
13096A25m807K1889R307p779k530m1585q0754k9791J919L8364O3977M8957K9425
13083D6717j24986p21P6120Q4417l9611o4698o4471j892R843J7386K6050r019
13071d4865K17K4891J1836o3706k1244J6371j0479j9606K0387l1333K7683K4079
$$ y = [-45530, -108408, -118653, -63888, -24716, -2010, 18308, 88558, 89392, 78692, 82171, 77697, 107615, 63230, 39930, 43091, 46138, 24548, -22982, 8936, 40733, 81433, -33813, -98587, -61947, -56166, -61405, -46932, -71141, -84244, -98753, -80170, 7453, 4488, -9873, 23554, 15436, -37658, -49518, 15530, 35715, 16700, -14248, -13176, 4204, 77679, 88091, 40559, 3219, 15650, -5958, -48054, -74372, -107270, -131701, -144700, -128390, -131427, -110462, -32213, 125, -4682, 17207, 26514, 18735, 16205, -25380, -106134, -135925, -134006, -95642, -31665, 17292, 46717, -78269, -78990, -2870, 81547, 41936, -22762, -87233, -89125, -79282, -61896, -35846, -44865, -44648, -19757, -7921, -71627, -92871, -76500, -86979, -106585, -86198, -117531, -89848, -65769]
13059f5769J7464P218j5828K4449J3826l1364J6371M3181L2083K8860J3297L7201
13047A20989q074p1831K2493r984n6407n748j4256l8360K5716M402M4347j9594
13035f307n077K2220n226k3288R389j4441L9208Q5120K7635p0700o6119n406N6717
13022D3725M0244q2745m2017n438J1363N4150J4668j5537K4915k6524K8622l2738
13010A2688n1468l8150j0646L4924M6838K557J1629j4475p734n907j9243M8567
12998I580j1059j3415k0583m3321N9832k7202R048J8256J6238L619n7487m2306
12986i8800j4116J00911M71J371l0060J4246M4539m2890m2803n9388r682O8766
12974f7435Q0467J1542m496J1815j7450L56n4047j381K3458J8852L862j9433j3993
$$ y = [-65769, -48305, -41087, -56915, -32466, -18640, -50004, -33633, 9548, 41631, 70491, 83788, 120989, 112915, 41084, 63577, 53593, -2814, -8562, -22818, -61178, -35462, -31060, 13287, -6307, -11384, 10836, 5610, -17678, -8289, -22730, 16478, 101598, 129233, 58533, -7586, -12992, 43725, 83969, 1224, -40793, -46231, -34868, 19282, 33950, 18413, 43328, 16804, 45426, 12688, -38780, -76930, -87576, -52652, -5814, -3257, 8372, -6103, -13837, -19744, -38987, 9580, -1479, -14894, -35477, -78798, -18966, -46168, -37120, -18864, -2626, 993, -56494, -98800, -112916, -12005, -11534, -10163, -40223, -25977, 18562, -24328, -67131, -126519, -136201, -67435, 13032, 24574, 20078, 31893, 14443, 14799, -39248, -40629, -17171, 1681, 5543, -13890, -27883]
12961b7883M5786J8749q6250j1258M2217l6824l6469K7260M4358M4433o268k892
12949A4959p231j1861k5463j278L3335M4630j734j4595K5029l7819p0583k0633
12937g3244r20J0275J8708Q1632J5823k6271k662p1438k3205R354j8285L5803
12925d4430K9476J1068l022l2495j0737K7332O5982M4797Q531l9855k8793J2490
12913D0344K8862J513k0199N7485K1060n5399j11372m7250K0746l890K2020J7654
12901b8426n3494M3268P2858K4691L1843n7893m4430K0324K5618j4641j3641O447
12889A2524P134j0441l2881n3267K5551J50213J3309o1431m7770O265L5688p3156
12877b8262j00711K147L9896Q1242O5767L2311o6781l2916K1554M4761L5255q713
$$ y = [-27883, 17903, 36652, -49598, -60856, -18639, -55463, -91932, -64672, -20314, 24119, 17851, 14959, 7728, -4133, -29596, -30874, 2461, 47091, 45357, 30762, 55791, 17972, -52611, -73244, -74164, -63889, -45181, 36451, 52274, 26003, 23341, -48097, -71302, -61948, -80233, -44430, -14954, -3886, -6908, -39403, -50140, -22808, 43174, 87971, 96502, 56647, 27854, 40344, 69206, 70719, 50520, 108005, 129065, 73666, -37706, -84956, -64210, -68100, -46080, -28426, -81920, -38652, 34206, 58897, 90740, 32847, -11583, 8741, 34359, 19718, 6077, 12524, 19658, 9217, -23664, -76931, -51380, 98833, 112142, 50711, 2941, 9206, 44894, -28262, -128973, -126826, -86930, -5688, 60079, 92390, 25609, -7307, 14247, 59008, 94263, 85550]
12865H5550J089k2544j7109J2720m2428K1385K8516K5851k333k0774m0629L2452
12853F1746J4395R708j4929o2982k5909L3646p250m0486J5709N0280M4749k55
12841G8422K067j6387n7257N3981j2676j1182P9128j2692q3944k3888j9275K9605
12829E902o600K0840J1257L8516K2962L9519J1460n2160n9623q051N818J7698
12817D7538p602k2176K0247k8618n3746M068O6424m6876o4050k7343L6517P3078
12805b539K9587P1223m4951l2675L6652M9439l7898o4969q0349j5284K2963M3936
12793b4865K1517k469L3749j2643j7428j7479k0249l2451J9715J3039J5014O0718
12781C6168L8271J6950K1475l7547k4957n2187l8730n376O997j849l7032J6569
$$ y = [85550, 86639, 64095, 46986, 59706, 17278, 38663, 67179, 93030, 90697, 69923, 29294, 61746, 76141, 85849, 70920, 7938, -17971, 15675, 8425, -32061, -16352, 33928, 78677, 78422, 80489, 64102, 6845, 60826, 48150, 36968, 116096, 103404, 19460, -4428, -23703, 5902, -698, 20142, 31399, 69915, 92877, 132396, 143856, 91696, 32073, 24022, 29840, 47538, 39936, 17760, 38007, 9389, -44357, -40289, 26135, -20741, -84791, -112134, -75617, -2539, 27048, 98271, 53320, 20645, 57297, 106736, 68838, 3869, -76480, -91764, -68801, -24865, -3348, -5817, 27932, 15289, -2139, -19618, -39867, -72318, -52603, -39564, -24550, 36168, 74439, 91389, 112864, 75317, 50360, -1827, -40557, -45933, -38936, -40785, -77817, -61248]
12769f1248N1498n206k7545K2665K0368K9006N893o5202K4483j1049n4019M6111
12757b4245L8728n2390o8453k3370K9484O2563L6088J1202K7350M429K5261J3194
12745G9841m3245n7478m6152N059J04311L5723o6045l8834K2026N5735k1495J6329
12733D5775N9504l3359K2307L2382p4556r5929r391N0609n6216n3227j9064K3219
12721a07946N0983m8350L8492L1777j3996k4168J6181M9954M4242J3752K253K6372
12709G9546l0175j0213K015l8337K8388P140j5947j6297N749J7010l3749K2765
12697A7895N0588l9329j7650J7519j4897R997K9471K1196q174K3976R221o1522
12685C8291l7192N7979j8508k8938M9104n2337o2270L2566K4588k3590l5433K6501
$$ y = [-61248, -9750, -14956, -42501, -19836, 532, 29538, 35431, -29771, -5288, -16337, -70356, -24245, 14483, -37907, -106360, -129730, -100246, -37683, -1595, 9607, 36957, 41386, 66647, 79841, 36596, -20882, -67034, -61975, 42336, 78059, 12014, -26820, -4794, 50941, 29446, 45775, 105279, 71920, 94227, 126609, 52053, -43876, -53267, -2658, -58874, -112101, -131165, -107946, -56963, -105313, -66821, -35044, -49040, -73208, -57027, -7073, 37169, 50921, 53174, 79546, 49371, 39158, 41173, 2836, 31224, 38364, 22417, 6120, 11869, 28879, -4870, 17895, 68483, 29154, 11504, 29023, 14126, 24123, 53594, 74790, 66616, 90592, 99813, 38291, 1099, 59078, 40570, 11632, 60736, 8399, -53871, -21305, 3283, -20307, -55740, -29239]
12673b9239M2179J6107j0022k7674L1290L5322m991o740l2318j6226J2681O248
12661A6617M7601j0074m9145l4665L3805k0196L4143K423M247k6113o2674j3262
12649g7293L4720L2344q143n9087k0176K4476p463j8870K01M0960K1816j1579
12637d8094N486j6581J814P2969K264J1460k2813N243L7985R358l8883o4528l4844
12624g9164O314Q8012K4228o1802o34N7525P022J0455k0897l8303q915q360j6651
12611d1170m1268Q867K4887N1879L5228L806q8377j144L6766Q935N973L5376L7920
12598G7678N787m9257k0822j5197K2493L6853P498j6637J2452K8258J190o6574
12586B3722k460K597L2590N945l5072j3805J6719l310j8916p105r150J1187k8444
$$ y = [-29239, 12940, 29047, 19025, -8649, 22641, 57963, 52972, 46232, 13914, -2312, 10369, 16617, 64218, 54144, 4999, -29666, 4139, -16057, 18086, 20509, 24756, -1357, -64031, -77293, -42573, -10229, -18372, -77459, -97635, -73159, -80622, -99492, -99291, -58331, -36515, -48094, -42608, -59189, -57375, 15594, 17858, 29318, 6505, 11748, 49733, 59091, 20208, -44320, -79164, -72850, 15162, 39390, -22412, -23046, 34479, 41501, 51956, 31059, -7244, -16159, -24519, -41170, -82438, -73571, -48684, 3195, 38423, 42229, -46148, -47292, -10526, -1591, 4382, 39758, 77678, 83465, 34208, 13386, -1811, 20682, 57535, 65033, 48396, 60848, 89106, 90296, 23722, 21262, 23859, 56449, 62394, 27322, 13517, 30236, 26926, 8010, 905, -8245, 2942, -25502]
12573b5502N8822o697o235j6449L2812L0067K2243n1231l2579K414j1381L1106
12561B7390L4508m4901o5700k864L0288J7806k6471p2642o0970N098P9099M4997
12549c4362L1849L2651K494R672m4134j23039j9586j798J83L0338J0072j410r863
12536a16933O5830J34345L0506j26216L331J9367K483L2106k4232L3115J6685
12525G0387J2101K7494J3302m6829j9213Q384m0979M895j2004n6971m3218N231
12513g7420O1059N0522P395K9108o4140K7383P969J4248o651k0481K4829K635
12501E6456L481Q132m024j7768j1116J0294o2211k2120J6068L2917L9994K5347
12489G5450L0653k8341n9378M642K350q967m4281q052l461K5630M663j4075O116
$$ y = [-25502, 33320, 26623, 20388, 3939, 36751, 66818, 89061, 37830, 5251, 7665, -3716, 27390, 61898, 16997, -48703, -51567, -21279, -3473, -29944, -102586, -163556, -158458, -79359, -34362, -2513, 30138, 32632, 42304, -1830, -124869, -144455, -146253, -146070, -115732, -105660, -107070, -116933, -51103, 83242, 113748, -12468, -9137, 10230, 12713, 44819, 20587, 53702, 70387, 82488, 109982, 123284, 76455, 57242, 65626, 24647, 29542, 17538, -39433, -82651, -77420, -16361, 34161, 41556, 70664, 6524, 33907, 41876, 56124, 49473, 28992, 53821, 56456, 59937, 68069, 64045, 46277, 35161, 45455, -16756, -38876, -22808, 10109, 50103, 75450, 106103, 77762, 18384, 23026, 25376, 16409, -27872, -35924, -39385, -13755, -9092, -23167, -17051]
12476a7051M5607j4932J0711K744j470J8678N8130m97m2525l4631k2021j989n1368
12463e0614j829K1977N6095L2890Q719J1521k1024K5579J0474L4006M6490p2724
12451A01560k3705K8253k2757j1827o413j6069m8069p0217J0889K7822K7658N1950
12439D9075O373l0227o5529n7578J2133N1314K2315J4932K2206r004n4515j66
12427c8671L4161Q056L1429p1293l8830J9183l0842O8223K3293J878L4177L838
12415D4602l5455L1674N5377K629Q971J13941K5547p9684j12499m1612K2796l2748
12403C539n1320P6897J3232n2212j756J9634P5283r554J5578Q513j3972K7026
12391A10888N897m7525k9756n8600p263K7941R306m2320N9615O673j8255j3945
$$ y = [-17051, 28556, 13624, 24335, 27079, 25609, 44287, 102417, 101920, 59395, 24764, 2743, 754, -50614, -52443, -30466, 25629, 58519, 67238, 78759, 57735, 83314, 93788, 127794, 174284, 101560, 77855, 106108, 83351, 71524, 65111, 49042, 973, -69244, -58355, -30533, -2875, 49075, 55448, 25221, -40308, -97886, -85753, -34439, -12124, 2808, 25014, 16010, -38505, -38671, -4510, 3546, 34975, -36318, -75148, -55965, -86807, -18584, 4709, 6587, 40764, 44602, 9147, 40821, 96198, 98827, 107798, 221739, 247286, 167602, 55103, 13491, 36287, 3539, -47781, 29116, 42348, -9864, -11620, 8014, 83297, 73743, 89321, 97834, 83862, 110888, 116785, 69260, 39504, -19096, -26359, 1582, 10888, -31432, 28183, 34856, 16601, 2656]
12379B656m9328m9936K8099N4768J4450k4323J6073k3168l2640Q055L6175m386
12367b3505k1936J3844L6874Q3714K5822N198n9453J0665J8720j3372k9128j237
12355D6206l6485l2818j2667j4095M2313K3273L4046L7875J1593l2120m7059m7162
12343b7100j4693J4108j6507L5784M3666O9486O2008k6547l6098j2756J0276n1305
12331E0322p48K0344m6777n902J572k7929J6470O1403m4170l9803N0793P9432
12319A15007K1979L357l7834o0735J7989M9319j1860J3000l334l8947j29789O1349
12307d99j0625M864P5973O5012Q908m5698l9838l5753L2723M3812k5178l6179
12295C7522P798o709m3000k7465K2097K4578n4908p207O740k3706M133j9015L5490
$$ y = [2656, -46672, -96608, -68509, -13741, 709, -23614, -7541, -30709, -63349, -55294, -19119, -23505, -45441, -31597, 5277, 88991, 114813, 120011, 60558, 71223, 89943, 76571, 47443, 46206, 9721, -23097, -35764, -49859, -7546, 15727, 49773, 87648, 99241, 67121, 20062, -27100, -41793, -27685, -44192, -8408, 35258, 104744, 166752, 140205, 104107, 91351, 101627, 50322, 49574, 69918, 23141, 17239, 18811, -9118, 7352, 68755, 24585, -15218, 35575, 115007, 136986, 140343, 102509, 41774, 59763, 109082, 97222, 110222, 106888, 67941, -61848, -499, -11124, -6260, 69713, 134725, 143633, 97935, 58097, 22344, 55067, 98879, 73701, 37522, 45320, 38611, -4389, -31854, -9757, 14821, -40087, -47294, -40554, -64260, -60127, -79142, -43652]
12282d3652J0018R4372M7440l3710r315l6163N191p696l1949k0810j9103j1287
12270e6664Q556N4302J4890j27679l6834J11196K6803N742J0085n4388M6459J6861
12258A9329k9511j5710J7547j1760N8840j6054J5934J5491J3930K1755L4109m1821
12246H2079o1852J0521j0115K447J757L088K7384L720m3805j3875M887k3618n0671
12233f8053K7066L2820j2741j5691n1346k4070O1460q565o126P4098N5371k3118
12221D1105j4363k4007J430O944o308k5297K1991K2808R0764O938k6253M4617
12209A40369n597m2133j44L47o7439j433k996P188M7190L351O725J5276r00N6940
12195A56744j4258m7632J3032K6162M5082L7203N7844P1455m1273m8075M0497
$$ y = [-43652, -33634, 60738, 108178, 74468, 65153, 28990, 34181, 26485, -5464, -26274, -45377, -56664, -48108, 6194, 21084, -106595, -143429, -32233, -5430, 312, 10397, -43991, 2468, 19329, -10182, -25892, -8345, -20105, 38735, 22681, 38615, 54106, 68036, 89791, 123900, 82079, 20227, 30748, 20633, 23080, 24837, 27925, 55309, 59029, 15224, 1349, 6236, -17382, -68053, -40987, -8167, -20908, -36599, -87945, -112015, -50555, -59120, -65246, 8852, 64223, 41105, 26742, 2735, 4165, 11109, 4801, -20496, 1495, 24303, 115067, 122005, 95752, 140369, 134772, 92639, 92495, 92842, 25403, 23970, 20974, 28162, 75352, 78703, 85428, 100704, 99804, 156744, 142486, 94854, 107886, 134048, 179130, 216333, 274177, 345632, 304359, 256284, 296781]
12184B96781P4631n154J3673l9914k4155L24M2639K7080j6471o8981m5373l8713
12172B16367n3011n880M807K6828j5262l3904J390J9847M1860N0591o310n1212
12160A96111k0299j3715j90m117k0621n862l208l2391K8093L6011N7889l3732
12148A83969p4873j5493J9744J3728q208l7085L6818M2241l6481l9867L5427L6685
12136A56605o2975k0206m902k5799L9598L4909J8027J7062K8354l5428j4342L3437
12124A64340L2436j7951n1109M7033J0527o9029j9927k6687J2594J5880M6820
12113A44927L1385M9176N7687j57m2046n7756k4004K4323J0816o5326j3601j7322
12101I8102K6291M969j033J243R952O1171L1928Q322m683L475q8908N411M8721
$$ y = [296781, 371412, 366258, 379931, 340017, 315862, 316186, 358825, 385905, 369434, 300453, 255080, 216367, 163356, 157476, 162283, 189111, 173849, 139945, 141335, 161182, 203042, 253633, 247323, 196111, 175812, 162097, 161907, 157790, 137169, 131307, 128099, 95708, 123801, 159812, 217701, 183969, 109096, 93603, 113347, 127075, 118867, 81782, 118600, 160841, 124360, 84493, 119920, 156605, 93630, 73424, 68522, 42723, 82321, 117230, 135257, 152319, 180673, 145245, 130903, 164340, 196776, 178825, 127716, 174749, 185276, 116247, 96320, 69633, 82227, 98107, 144927, 176312, 225488, 283175, 283018, 240972, 183216, 159212, 183535, 194351, 129025, 115424, 98102, 124393, 129362, 128329, 129572, 139524, 200695, 232623, 240945, 236262, 239737, 150829, 156240, 204961]
12088B04961N8604o277p1449m3237k4810j7434k3966k936R490m4955r455j3181
12076A5355O8934R7935r669m9967r0890l9055P0483L9094L4353K3254k5818K0347
12064A54356n98l6506K8632R3864J5964R360O1805P3825R1748O5000K2333P6032
12052F55815R8612K4036j2672R8626P8585j7739n8161n8500O9640R699j3027O4194
12040I39108K509Q706K1292J1894M8796M3390L6046n3505n5718M6068L698l4252
12028A018032o6206N0893M3812J8581m2803qm880J8459J6718L0836Q0919o678
12016A157675j2381O0891r107m1377r749O2895Q4823R1498Q4327L3384R6383L6970
12004A636232K9248K5720L3139M7133L1313j0909K7123K1006O7471N9702P4868
$$ y = [204961, 263565, 257288, 185839, 142602, 117792, 100358, 76392, 73456, 82946, 37991, 28536, 15355, 84289, 182224, 172555, 122588, 31698, -7357, 63126, 102220, 136573, 159827, 134009, 154356, 153758, 117252, 145884, 239748, 255712, 265072, 326877, 400702, 492450, 557450, 579783, 655815, 754427, 778463, 765791, 864417, 943002, 925263, 867102, 808602, 878242, 887941, 874914, 939108, 941617, 950323, 971615, 983509, 1032305, 1075695, 1111741, 1058236, 1002518, 1048586, 1052284, 1018032, 951826, 1002719, 1046531, 1065112, 1022309, 1022301, 1017421, 1035880, 1052598, 1083434, 1164353, 1157675, 1145294, 1206185, 1197078, 1155701, 1145952, 1208847, 1293670, 1385168, 1469495, 1502879, 1599262, 1636232, 1665480, 1691200, 1724339, 1771472, 1802785, 1791876, 1818999, 1840005, 1907476, 1967178, 2042046]
11993B042046P1821O1739N8214N6718M7364j0590k1502J17146J04312J02606L9539
11982B669413R2297J37438J80599J22720J51255J42578K16414J58349J59790J46339
11972D177192K82138K05405J66236K14838K97099K84186K90687K96301L86206
11963F600288L79447L80088L30988M79062O13268O88991P11631P49138Q25143
11954A1758044Q79143R31451J075990J257714J443920J551674J811080K157071
11946B2866087K375188K707008L184456L840362M641762N550784O730076Q362113
11938F0257836J0372399J3102718J6858681K2133154K9352339L8757549M9382792
11931B40217468N6955533N3660226L5312051J2305206j146131l771202k005120
$$ y = [2042046, 2113867, 2175606, 2233820, 2290538, 2337902, 2327312, 2305810, 2422956, 2527268, 2629874, 2669413, 2761710, 2899148, 3079747, 3202467, 3353722, 3496300, 3712714, 3871063, 4030853, 4177192, 4459330, 4664735, 4830971, 5045809, 5342908, 5627094, 5917781, 6214082, 6600288, 6979735, 7359823, 7690811, 8169873, 8783141, 9472132, 10183763, 10932901, 11758044, 12637187, 13568638, 14644628, 15902342, 17346262, 18897936, 20709016, 22866087, 25241275, 27948283, 31132739, 34973101, 39614863, 45165647, 51895723, 60257836, 70630235, 83732953, 100591634, 122724788, 152077127, 190834676, 240217468, 297173001, 350833227, 386145278, 398450484, 397304353, 393533151, 391528031]
11924C91528031o05926l559358j5128253l6117483n3699776n4733488m4596029
11917A83087718l3033250k3935613j7478459j3126578j0032200p945347o354739
11910G1181532n295466m484024l887738l505446l151091k935919k744961k558693
11902D2618194k276100k042540j805420j580179j381130j371029j327861j202684
11894B9631251j026304r11824q98345q25063p16974o65361p43352p12273p42775
11885B2388980q14930p40197p65596q37128q29416p82344p15151o70911o53554
11876A5579753p03993o21607n22179n04625m95536m50793m20500m43201m13865
11867A1003454l65286l46803l44381k62605k84361k74976k60333k50228k53268
$$ y = [391528031, 390922105, 387362747, 372234494, 336117011, 282417235, 227683747, 183087718, 150054468, 126118855, 108640396, 95513818, 85481618, 77536271, 71181532, 65886066, 61402042, 57514304, 54008858, 50857767, 47921848, 45176887, 42618194, 40342094, 38299554, 36494134, 34913955, 33532825, 32161796, 30833935, 29631251, 28604947, 27693123, 26794778, 25969715, 25252741, 24587380, 23844028, 23131755, 22388980, 21574050, 20833853, 20068257, 19231129, 18401713, 17619369, 16904218, 16233307, 15579753, 14875760, 14254153, 13731974, 13227349, 12731813, 12281020, 11860520, 11417319, 11003454, 10638168, 10291365, 9946984, 9684379, 9400018, 9125042, 8864709, 8614481, 8361213]
11858H361213j68356k67825j96550j75730k20585k70011j57984q3026j41213k15179
11848F464754j91561q9324k45690k36505j72935j56840j41469j71268j72991j84865
11838D701306j04956p8363q3542r3230j77152j35378r8295r3680l8945m6554r6552
11827C654659j72159j44929q5291p9526j2221l7153o5156n2275N3204K1897n9169
11816C021881q2375p5030l237p7496q5785q3834j01702o1142r3450r0485o9577
11805B197768k053m3870l0367O65k9636n0740j522J2129k5903p9261q5242j05341
11793A756627m5949J1676k6798r4372m7688k3473j2960n7951n7384j07527m5753
11782A248448M387L7222O9684m4513M8197J05208k0268j07619p1830L0639o7823
$$ y = [8361213, 8192857, 7925032, 7728482, 7552752, 7332167, 7062156, 6904172, 6821146, 6679933, 6464754, 6273193, 6183869, 5938179, 5701674, 5528739, 5371899, 5230430, 5059162, 4886171, 4701306, 4596350, 4517987, 4434445, 4341215, 4164063, 4028685, 3930390, 3836710, 3797765, 3751211, 3654659, 3482500, 3337571, 3252280, 3172754, 3160533, 3123380, 3058224, 3005949, 3059153, 3081050, 3021881, 2939506, 2864476, 2861239, 2783743, 2697958, 2614124, 2512422, 2451280, 2357830, 2267345, 2197768, 2195715, 2151845, 2121478, 2122143, 2092507, 2041767, 2040245, 2052374, 2026471, 1947210, 1861968, 1756627, 1710678, 1722354, 1695556, 1601184, 1553496, 1530023, 1517063, 1459112, 1401728, 1294201, 1248448, 1252835, 1290057, 1359741, 1315228, 1363425, 1468633, 1448365, 1340746, 1268916, 1299555, 1231732]
11771A231732p4830p3241l0693L3415J105K6771n4370j30872m5562l2166n4619
11760G96670M029J3944N6187J5072k256n2420l1334j6358J4269q4544n4207K3315
11748F82367N6397J7665k9348J8214M7396k4067K2749Q596K6726k259J255M961
11736H30652q7262n3800O4975P6273p778m4438r0492K24N7598o5203n5977p095
11724F17677j4364l3464j3781m4523J45O2085J0779j9930l7911o8835m4671K8085
11712D41292O6885P234l0485K744m0390L9192j084j8699j1232J8533J6407M2000
11700E32397M7000m8061l0716l1808N184j3865P7367L5546l6749m1544l0434m7509
11688D16808L7267P1377o3439L2488K4140k3011k1906j5085L9097r239j12816
$$ y = [1231732, 1156902, 1083661, 1052968, 1086383, 1087488, 1114259, 1059889, 929017, 883455, 851289, 796670, 800699, 814643, 870830, 885902, 883646, 831226, 799892, 783534, 797803, 713259, 659052, 682367, 738764, 756429, 727081, 745295, 792691, 768624, 791373, 799969, 826695, 824436, 825691, 830652, 743390, 689590, 754565, 830838, 823060, 778622, 688130, 688354, 745952, 680749, 624772, 617677, 603313, 569849, 556068, 511545, 511690, 573775, 584554, 564624, 526713, 457878, 413207, 441292, 508177, 515411, 484926, 487670, 447280, 486472, 485388, 466689, 455457, 473990, 490397, 532397, 579397, 531336, 500620, 468812, 473996, 460131, 537498, 573044, 536295, 494751, 464317, 416808, 454075, 525452, 462013, 494501, 518641, 495630, 473724, 458639, 497736, 488497, 375681]
11677C75681K4506Q2629J7065l4705O237j5973l0060n4983j0688k3559j5136O114
11665C27128o1483J8171K5758R344j5620K3399L3837l3940l6725k8771K1686m0058
11653B42726l3256N2094Q329q6820k7228P077O0874Q8932P028k8363o7843j4105
11641B09445K364q505M9907K3792J972Q217k3719k6157l1021O412J8095L5060
11629B65862j8588j0968k8080p2990J5093o105M3362Q0651o5005J2983M006m285
11617B15936K6596J551n4192k6524J3769n732o8481j8376j4411M4692K7089k4275
11605A17642M0324L8592q599j1452m7200J548J4842N8622l3316p7518j9556N1331
11593A25260N5704J6446J039O112L6583p982j8389k6270o4107j7583O3981j8434
$$ y = [375681, 400187, 482816, 499881, 465176, 471413, 455440, 425380, 370397, 359709, 336150, 321014, 327128, 265645, 283816, 309574, 318918, 303298, 326697, 360534, 326594, 289869, 261098, 282784, 242726, 209470, 261564, 269893, 183073, 155845, 162922, 223796, 312728, 319756, 291393, 223550, 209445, 211809, 203304, 253211, 277003, 278975, 287192, 263473, 237316, 206295, 212707, 230802, 265862, 247274, 236306, 208226, 135236, 150329, 144224, 187586, 268237, 203232, 216215, 220221, 215936, 242532, 244083, 189891, 163367, 177136, 171404, 102923, 84547, 70136, 114828, 141917, 117642, 157966, 196558, 187959, 176507, 129307, 130855, 145697, 204319, 171003, 93485, 73929, 125260, 180964, 197410, 198449, 204561, 241144, 233162, 214773, 188503, 124396, 106813, 170794, 152360]
11581A52360m278J5898j8608o4673m6038N332P2043L4756m186Q612j8254M0497
11569A73461O2704k3357k4010L6952M931j1599J6029M8952k4045n8854k8061k5822
11557A47281j178o9155L3965P169M195k5022l2094J5446j2457M6740p43J1557
11545A25704Q5628j5058n355j8857n423L1158j01163o3917M3402P7449J5126m3202
11533A25492l8184l14K6017k7948l5881N6130r380j9668K0422R937q26k6149K524
11520H2172P619P539j9001l5033j7899k0321J0931L1634L5386J6344k9745l3172
11508C6454J6467N0829M311R596n7794j9482J4496M7031K8161j7819l9387l1390
11496D1473m073L6619L9213j2442L3956N3239k5630n3758l2981M2766K5738l5145
$$ y = [152360, 148082, 163980, 145372, 80699, 34661, 39993, 112036, 146792, 142606, 151218, 132964, 173461, 236165, 212808, 188798, 225750, 230681, 219082, 235111, 284063, 260018, 201164, 173103, 147281, 146103, 76948, 110913, 118082, 122277, 97255, 65161, 80607, 68150, 114890, 114147, 125704, 211332, 196274, 190919, 172062, 166639, 197797, 96634, 32717, 76119, 153568, 168694, 125492, 87308, 86994, 113011, 85063, 49182, 105312, 95932, 76264, 96686, 106623, 105797, 79648, 82172, 89791, 97330, 78329, 43296, 25397, 5076, 16007, 47641, 83027, 99371, 69626, 36454, 52921, 103750, 108061, 117657, 59863, 40381, 54877, 101908, 130069, 112250, 72863, 41473, 37400, 74019, 113232, 100790, 134746, 187985, 162355, 108597, 75616, 118382, 144120, 108975]
11484A08975m6880p694O1256j5374K3061o411j746L3340L3972l3003j4308k3849
11472A11339N6396J108j6632P394j0298l367r446N959K5444K2656m6926k2839
11460A20788R638K814m3926n2798K2087k503K532j5567O140K9761L7251K4974
11448A41191O353n1191m9497k823o4470J3726M4006j0967L6379L4674k2175M367
11436G9573N1941j934l6146n2766o6163q034N4066K9001O453M0327p4117m0947
11424a8746R074K07M3545J8787J1664k1364l0591m1582K8168k9821J4780O0524
11412D4645k5920P098M1068K9956l726r595k5682n045J6235p47Q356J3362J9599
11399A09604k3372n7634l7406n469M1694J7953J3378L6255L4333r5860r424M3018
$$ y = [108975, 62095, 54401, 115657, 100283, 123344, 116933, 115187, 148527, 182499, 149496, 135188, 111339, 167735, 168843, 152211, 159605, 149307, 145940, 136494, 142453, 167897, 190553, 143627, 120788, 130426, 133240, 89314, 36516, 58603, 56100, 58632, 43065, 49205, 78966, 116217, 141191, 147544, 96353, 46856, 44033, -20437, -6711, 37295, 26328, 62707, 97381, 75206, 79573, 131514, 129580, 93434, 40668, -25495, -33529, 20537, 49538, 55991, 96318, 22201, -18746, -9672, -9465, 34080, 52867, 64531, 43167, 12576, -29006, -838, -30659, -15879, 44645, 18725, 25823, 66891, 96847, 93121, 83526, 57844, 52799, 69034, 68287, 76643, 90005, 109604, 86232, 28598, -8808, -14277, 27417, 45370, 58748, 95003, 129336, 33476, 24052, 67070]
11387F7070M8515n4007J4654J5155L8964l4583m8641k174l2472L0738O0504O556
11375A10279j1802j6319j0917J2828k8990R391r816p2549N459J8902K2980k8323
11363A123M639o90L2860n800J579J4247P896j3645L3102l8006j3286J7617R7232
11350A38868O006m2233k3994Q048m8763o9116R549M8152K1028j3237J2708M0303
11338H7319L3498m229k6480n0454l9872J1596O305J7739j2060L5055P6576L5625
11326A70618p3583p3906O545K2143m4828K9443j1913k5355j9271P799K0481j8675
11314a0502n0355N660J7861N9135K6083p6737J7247J6633j5468q809l5965L9354
11302a5863N9928N7510L044j8011Q359k1941j5830m6670l1399k0935M8545j5239
$$ y = [67070, 115585, 61578, 76232, 91387, 130351, 95768, 47127, 44953, 12481, 43219, 103723, 110279, 98477, 82158, 71241, 84069, 55079, 64470, 54654, -17895, -12436, 6466, 29446, 1123, 5762, 5072, 37932, 32132, 33711, 47958, 55854, 42209, 75311, 37305, 24019, 41636, 138868, 144874, 102641, 78647, 86695, 37932, -31184, -21635, 26517, 47545, 34308, 47016, 87319, 120817, 116588, 90108, 39654, -218, 11378, 17683, 35422, 23362, 58417, 134993, 170618, 97035, 23129, 29674, 51817, 6989, 36432, 24519, -836, -20107, -12308, 8173, -10502, -60857, -55197, -37336, 21799, 47882, -28855, -11608, 5025, -10443, -19252, -55217, -15863, 44065, 101575, 104619, 86608, 94967, 73026, 57196, 10526, -20873, -41808, 6737, -8502]
11290h502J8255j6468N5046j6455j2177J8626j5529N980N5119M8798k8482j7834
11278H6377J5124m626q74J0418J6400k621J3189J6627m811j7103l7971n0048k4603
11265A5478K1920N0631M4054M3433J8733o5482K3985q209n8148L7529m0150Q973
11253I2747J0312J7184r569k1491j6347L5820P2514J038l3945o7064j9653l7362
11241B4184L6761Q2067n8511l6732J5126j3251o836J4721p840n0434J4090J3458
11229B6803n6893j3769L6306L2228K2236k9643K6296K5797R355k7930K5865L6144
11217A12795J578k0207k2613m6563k5315k055l433Q834M4425n8047N1M7636j2521
11204B4565q795Q165Q208P9936j4533p210r724M497k2214r04o6998j1058J0024
$$ y = [-8502, 9753, -6715, 48331, 31876, 19699, 38325, 22796, 28776, 83895, 132693, 104211, 86377, 101501, 96875, 96001, 106419, 122819, 120198, 133387, 150014, 145203, 128100, 90129, 40081, 15478, 37398, 88029, 132083, 175516, 194249, 128767, 152752, 144543, 86395, 123924, 83774, 92747, 103059, 120243, 110674, 89183, 72836, 108656, 181170, 182208, 148263, 81199, 61546, 24184, 60945, 143012, 84501, 47769, 62895, 49644, 42808, 57529, 49689, -745, 13345, 26803, -30090, -43859, -7553, 24675, 46911, 17268, 43564, 69361, 78716, 50786, 76651, 112795, 114373, 94166, 71553, 24990, -325, -2380, -5813, 3021, 47446, -10601, -10550, 37086, 24565, 15770, 23935, 32143, 112079, 97546, 90336, 80612, 85109, 62895, 61991, -5007, -16065, -6041]
11191f041M3369j6241k7188l2856Q497L0913j6703P093n132L5300j2700l4348
11179b6037m2458j472O0355J7556p692K9375L799M4926k4666n4421n521j214N1207
11166D3737M1027n0097n5469O1375N5848j9183m2271M1677M7454n8967m0420k7720
11154c009O7839J8915J8270j1173o4092l6206J8554o459N267l0493j5505J7275
11142b0817j024K1293K2653k5563K2263O8109k0686j8770m5665R544k1266j7100
11130b7029J7126J2974J779j0744l9975k0998j5122J7433j181J6319J9693O900
11118b2825k676P0654O558r268o8618l561J7129j8915L9288J2175k8628O5574
11106E6887L3713J7973N5066p2791k1840k3029l3243L1001k8314J3225L5527j7258
$$ y = [-6041, 37328, 21087, -6101, -38957, -30460, 453, -16250, -9157, -14289, 21011, 8311, -26037, -68495, -69967, -9612, 7944, 252, 29627, 33426, 78352, 53686, -735, -6256, -7470, 43737, 84764, 34667, -20802, 40573, 96421, 77238, 34967, 76644, 124098, 65131, 24711, -3009, 64830, 83745, 102015, 90842, 26750, -9456, 9098, 2639, 7906, -22587, -38092, -20817, -21841, -548, 22105, -3458, 18805, 86914, 66228, 47458, 1793, 11337, -9929, -27029, -9903, 3071, 4850, -5894, -45869, -66867, -81989, -64556, -65737, -49418, -29725, -22825, -25501, 45153, 51711, 42443, -26175, -29736, -12607, -31522, 7766, 19941, -8687, 56887, 90600, 108573, 163639, 90848, 69008, 45979, 12736, 43737, 15423, 28648, 64175, 46917]
11094D6917l0945m1467o0382n1444L8418J02311J18339n2407q2017N1638j7275
11083B1686r440J8242K5561L5996J4611o3550k026n1950l4016P9631Q6931j6476
11071A05200j4517q5643k0218n754P094R410o6576j0308L4206j1110j2307L7857
11059c2666M1015K811O3010j1309m9407K4451M4402J5486P6803O1140k2393q6878
11047A26465m5676j0828L097M8049M3083K7997l1273M4362L8567K6611K3016l9472
11035B53998n679J15224N6540K485p463J9688q283P312L591o1695J2620J0124
11023C98462L8287l8733K4925K9163J472j1331l9389p325k6297l6148m9758m510
11011B78818M0056K7308O8327l0043p4450r6803l0575N0958k0295j6265J4328
$$ y = [46917, 15972, -25495, -85877, -137321, -98903, 3408, 121747, 69340, -12677, 38961, 21686, 12246, 30488, 56049, 92045, 106656, 43106, 41080, -10870, -44886, 34745, 121676, 105200, 90683, 5040, -15178, -20932, -13838, -4428, -71004, -81312, -47106, -58216, -70523, -32666, 8349, 11160, 74170, 62861, 13454, 37905, 82307, 97793, 174596, 235736, 213343, 126465, 80789, 69961, 73058, 121107, 164190, 192187, 160914, 205276, 243843, 270454, 293470, 253998, 248319, 363543, 420083, 422568, 415105, 434793, 426510, 433822, 437413, 375718, 388338, 398462, 436749, 398016, 422941, 452104, 453576, 442245, 402856, 395531, 369234, 333086, 283328, 278818, 318874, 346182, 414509, 384466, 310016, 213213, 182638, 233596, 213301, 197036, 211364]
11000B11364J059o373k5785l115j9364l4077k5894O81K8966L2038k6809j1505
10988A21186k463L8447m1857l6597m2340j9643n015j7647k9018N9137O9800o991
10976H6999j4707n2548j0886L3622J2484l6464p1758m8125M7378P9396M4090Q952
10964G8433j0515j9669r982l6196m8000K0601j6144K1216Q0818k3006n3050j6930
10952c2424K0393J6633n221j9468q242N9133K2131m7356k8057K1287j6733K9865
10940A1941K6452l3704K149K7439n268l7429N2099p721j0318N2951L1878P172
10928A17641k7702K142J0071J0974K352l2588q5695Q940m9721J6335j9598J6927
10916b9922M2238L9735j6451k5406o257L7960l8864n0720O1185M1124o414k6351
$$ y = [211364, 212423, 206050, 180265, 177150, 157786, 123709, 97815, 98496, 127462, 159500, 132691, 121186, 118723, 157170, 115313, 78716, 36376, 16733, 11718, -5929, -34947, 24190, 93990, 86999, 72292, 19744, 8858, 42480, 54964, 18500, -53258, -101383, -54005, 25391, 69481, 78433, 67918, 48249, 38267, 2071, -45929, -25328, -41472, -20256, 60562, 37556, -15494, -32424, -12031, 4602, -619, -20087, -28329, 30804, 52935, 5579, -22478, -1191, -17924, 11941, 38393, 4689, 6838, 34277, 29009, -8420, 43679, 35958, 25640, 78591, 110469, 117641, 89939, 92081, 102152, 113126, 115478, 82890, -2805, 6135, -43586, -27251, -46849, -29922, 12316, 52051, 35600, 10194, 3937, 41897, 3033, -47687, 13498, 54622, 48208, 21857]
10904B1857l4002J6403n306J3406N7233m3819p285J3980L4281r124o947k0306
10892C0371J9074k4608k0909l2838m27K2699l9969l2485N794j5237K5214M7777
10880a5544K7413J9814l7705Q893j8065l1296j2939n057J6822O9550M9485N0094
10868A21465O6362l6383m5199k1130m2579j8480j1564m8975M3931M1071l4114
10857A4405O621r3M6556n444J1885l1613m5792k1575l5480k13O5404J4315q640
10844A0336Q8135K5848l0487j6377m729K0262Q763m363K958k4472J4783m9582
10832D1075p013k130M5445J7908J0073J2335J6723o4956k4225K9034L2948K7914
10820A35131M73n3689q356r184j3349J168J211J9005M0971r262j0113J7171m795
$$ y = [21857, -12145, 4258, -1048, 12358, 69591, 25772, 18487, 32467, 66748, 57624, 50677, 30371, 49445, 24837, 3928, -28910, -29337, -6638, -46607, -79092, -73298, -88535, -63321, -15544, 11869, 31683, -6022, 2871, -15194, -46490, -59429, -64486, -47664, 21886, 71371, 121465, 187827, 151444, 106245, 85115, 42536, 24056, 12492, -36483, 7448, 48519, 14405, 21026, 20933, 67489, 62045, 73930, 42317, -3475, -25050, -60530, -60743, 4661, 18976, 10336, 98471, 124319, 93832, 77455, 72726, 92988, 101751, 97388, 100346, 75874, 90657, 41075, 34062, 31932, 77377, 95285, 105358, 117693, 134416, 69460, 45235, 74269, 107217, 135131, 135604, 81915, 73559, 64375, 51026, 52194, 53405, 72410, 113381, 104119, 94006, 111177, 106382]
10807A06382l1778l5889o8678o363K0596k2546L828k0382k0177M8921M2573m9953
10795c3466J0199K5888N3171l3094N4779L2124l2775o9747K6640K4342o0698J558
10783a079L5858j5996M666L2796J7697n3456P507J0053L3457l2236m0966m1025
10771d2724M992N4955o6546j0746K9049j0384L0364K1250l6901r640j2857K1457
10759b7731J7206N5699j2926m9374l9534k7734j689R474O473M1737L6076q802
10747a125o3423K7499L7712m2324M9639N5328K035l5013l5352O00n573l0261N5845
10734A5587M6127j6719k6379r31l9098j9890k7311j4922J24325M8500l49R992
10722I8932k2148l4164N4326M1684k255r892L6185l393K1320K8649m9956n6557
$$ y = [106382, 74604, 38715, -29963, -36326, -15730, -38276, -34448, -54830, -75007, -26086, 16487, -33466, -23267, 2621, 55792, 22698, 77477, 109601, 76826, 7079, 33719, 58061, -2637, -1079, 34779, 18783, 23449, 56245, 73942, 20486, 27993, 38046, 71503, 39267, -1699, -42724, -37732, 17223, -49323, -60069, -31020, -41404, -11040, 10210, -26691, -36331, -49188, -27731, -10525, 45174, 32248, -17126, -56660, -84394, -86083, -76609, -70136, -28399, 7677, -1125, -64548, -37049, 663, -41661, 7978, 63306, 65341, 30328, -5024, -4424, -9997, -40258, 15587, 61714, 44995, 18616, 17685, -21413, -41303, -68614, -83536, 40789, 89289, 88940, 98932, 76784, 42620, 96946, 138630, 136375, 126483, 162668, 159275, 180595, 209244, 159288, 102731]
10710A02731q83l5557l815L9679N0332K4733K6937K0196L7994r92N561K1030k2502
10697B65444q263j9299Q225Q621n35K4398R191o344M3133n853L1285M841M8907
10684D03751n0087l8057K8083M9725l966r2006J8820N8834Q482J435l2020J3298
10672C66292N9940K7784J320j3290O600K4740J0704K0788L3819O7443q70l0747
10660E74523K8820K2754O1387J3619N4818M4291L5822O2819O8714k386O2670J16378
10648A144229O681L7696N8769O6669R9866J22665J38284J58282J81474K77490
10638B292105L18290K48117K86004K33308K59150L35769M06132M57522M86172
10629E322569P01973Q73967J115697J430875J770349K140730K443624K607423
$$ y = [102731, 101848, 66291, 62476, 102155, 152487, 177220, 204157, 224353, 262347, 261355, 266916, 287946, 265444, 257181, 237882, 246107, 254728, 254193, 278591, 287782, 281438, 324571, 318718, 350003, 354844, 403751, 353664, 315607, 343690, 393415, 389449, 297443, 316263, 375097, 383579, 385014, 352994, 366292, 426232, 454016, 455336, 442046, 448646, 473386, 484090, 504878, 538697, 606140, 605270, 574523, 603343, 626097, 687484, 701103, 755921, 800212, 836034, 898853, 967567, 965181, 1027851, 1144229, 1150910, 1188606, 1247375, 1314044, 1413910, 1536575, 1674859, 1833141, 2014615, 2292105, 2610395, 2858512, 3144516, 3377824, 3636974, 3972743, 4378875, 4836397, 5322569, 6024542, 6898509, 8014206, 9445081, 11215430, 13356160, 15799784, 18407207]
10621A8407207K341843J917958J579035J481111J652783J888766K255153K603702
10613C4127558K849042L073044L513620L603870K981372J782629J101246J105286
10605E4137667J529422K177078K700652K777170K476922K391025K576321K652483
10597G3418740J701588J97968o33357n54362N709N02329O13676P7213j136609
10588G4192895k154753k167048j811171k028986k465221k530839k084548j534125
10580E7416204j144927j135986j545019k527511l374577l358295k864253k544956
10572C8920680k371271k190634j910556j679577j603065j667641j874496k273482
10564B3349958k545739k460405k123071j687327j370287j112139q27678p30396
$$ y = [18407207, 20749050, 22667008, 24246043, 25727154, 27379937, 29268703, 31523856, 34127558, 36976600, 40049644, 43563264, 47167134, 50148506, 51931135, 53032381, 54137667, 55667089, 57844167, 60544819, 63321989, 65798911, 68189936, 70766257, 73418740, 75120328, 75318296, 74684939, 74130577, 74136286, 74638615, 75252291, 75329504, 74192895, 72038142, 69871094, 68059923, 66030937, 63565716, 61034877, 58950329, 57416204, 56271277, 55135291, 53590272, 51062761, 47688184, 44329889, 41465636, 38920680, 36549409, 34358775, 32448219, 30768642, 29165577, 27497936, 25623440, 23349958, 20804219, 18343814, 16220743, 14533416, 13163129, 12050990, 11223312, 10492916]
10556A0492916o07472n53187m52337l50167l16558l61444l71578l67754l15181
10547F797238k52614k80484k06365j98940j85502k07708j58234j78393j52664
10538D976334j55246j69128j38293j66861j54200r0497j30265j05340r2520j37658
10528C636326j55195o6819r5193j76438j06110r9747j13245o3645n3837j5275
10518B690822q4620o6234r8230j57401l0126j3024j2014l3337j0918j33179j38563
10507A913176o341r82r7147q044k3949p4657o9334m9276l3393p6960Q065m1080
10495A440078m4112m4039m6586m5261K1689k1715r9630L6294K2084p5073r009
10484A134720n8193j11319j6923l4903k3656J5299K0264n4215k0416j1269l2362
$$ y = [10492916, 9885444, 9332257, 8879920, 8529753, 8213195, 7851751, 7480173, 7112419, 6797238, 6544624, 6264140, 6057775, 5858835, 5673333, 5465625, 5307391, 5128998, 4976334, 4821088, 4651960, 4513667, 4346806, 4192606, 4102109, 3971844, 3866504, 3773984, 3636326, 3481131, 3414312, 3319119, 3142681, 3036571, 2936824, 2823579, 2759934, 2706097, 2690822, 2606202, 2539968, 2441738, 2284337, 2254211, 2241187, 2229173, 2195836, 2184918, 2051739, 1913176, 1906835, 1905853, 1808706, 1800662, 1776713, 1702056, 1632722, 1583446, 1550053, 1473093, 1481158, 1440078, 1395966, 1351927, 1305341, 1260080, 1281769, 1260054, 1160424, 1196718, 1218802, 1143729, 1134720, 1076527, 965208, 948285, 913382, 889726, 905025, 925289, 871074, 850658, 839389, 807027]
10473H07027k8553j3148o8495k4303J8898j0526M2001l2088q501R644k5461m6458
10461F20037j897N7181l2216n2948m0360K7182K2960J839m1614m1873m3172j9282
10449D55837l7397o5099N8032Q4123j4973j9482M7110j799l705m6034j9981l5890
10437D00742n2290j8883K8634M1686l2031m161O0412K2593J2016K9556n9815m9732
10425C78727m0448K418K5158p676l3397k7536k9382l2165L0071J04838n410m9462
10413C15736l6319j6117J3545M0582J2621n1715j7900n6066J9477J12105J11410
10402D47359k5270q6459n9413j3921p9761l4733L7826J1352M5532j2550L5828
10391B65790O608n0329m7313M838M4478L1237K1827l4364l6416Q189m5764n6570
$$ y = [807027, 778474, 765326, 696831, 672528, 691426, 680900, 722901, 690813, 682312, 691956, 666495, 620037, 618140, 675321, 643105, 590157, 549797, 576979, 599939, 601778, 560164, 518291, 475119, 455837, 418440, 353341, 411373, 495496, 480523, 461041, 508151, 506352, 502647, 456613, 436632, 400742, 348452, 329569, 358203, 399889, 367858, 363697, 424109, 446702, 458718, 488274, 428459, 378727, 338279, 340697, 365855, 358179, 324782, 297246, 267864, 235699, 265770, 370608, 365198, 315736, 279417, 263300, 276845, 317427, 330048, 278333, 260433, 204367, 223844, 335949, 447359, 422089, 335630, 276217, 262296, 182535, 147802, 185628, 196980, 242512, 229962, 265790, 272398, 222069, 174756, 179594, 224072, 255309, 277136, 242772, 206356, 214545, 168781, 112211]
10379A12211K5720J5630j8667j3641J273L7888Q152L6118J7478r1715l6144O7138
10367A61441K7644j7384K7970K2969j7433q2093n2343O5693K5021J9908j2491
10356A68902k8674J5552j6489N9112m1916k9359j2006J6641Q464J9207r523k852
10344A47059J3464N6173l2062k9807j6451l1692K1390L3660J6142J7880k9084
10333A66672k7668N3027M433n7092l9918J0689L8337L3646m9024p9238L140M4395
10321A01399L4369l2840o7686l2450K9267O6193L2842R874l436m0073m5669l8301
10309A3489l1533j2403N6389N3319M7544L187n1926k317K8068r2571K0581L0653
10297F2480L1762m794P275O595j1481K1746m840k7383K2071k5452K0421O4506
$$ y = [112211, 137931, 153561, 134894, 121253, 122526, 160414, 168566, 204684, 222162, 130447, 94303, 161441, 189085, 171701, 199671, 222640, 205207, 123114, 70771, 136464, 161485, 181393, 168902, 140228, 155780, 139291, 198403, 156487, 127128, 115122, 131763, 140227, 159434, 149911, 147059, 160523, 216696, 184634, 154827, 138376, 106684, 128074, 161734, 177876, 195756, 166672, 139004, 192031, 196464, 139372, 99454, 110143, 148480, 182126, 133102, 53864, 57004, 101399, 135768, 102928, 35242, 2792, 32059, 98252, 131094, 140968, 137532, 97459, 51790, 13489, -18044, -30447, 25942, 79261, 126805, 129992, 78066, 75749, 103817, 11246, 31827, 62480, 94242, 89448, 96723, 103318, 91837, 113583, 108743, 81360, 103431, 77979, 98400, 162906]
10285A62906N391l000O5904l451k141j558M711k196j6449P647k1154p206P780
10272A97184J653J2812q211j6667n8106k2136j7079J9757m0819p9251M5969J4198
10260D9304M8174K1763r415r717K612J6429p092l8236p918R396j3164j1056J2722
10247F3802J6813M6809L330M2522K8993K3081J7263q6607l0464N98J6038J1085
10235A53263m6677n571m1452N82M3201n414j2033J3712L9576k5811j0879J0519
10223A13016m7830p2810m9708M0911O2998n2770J9373l7195k6573L3142k3164
10212d0610p232r925N2540L5140k14l2206m9862L4797Q3176N9040J0817o466n294
10199A23701o993l3267q78j1215r53P390J7017N7639l3938q2743L5081P3853O2191
$$ y = [162906, 168297, 165297, 231201, 227750, 225609, 224051, 228762, 226566, 210117, 217764, 196610, 189404, 197184, 198837, 211649, 203438, 186771, 128665, 106529, 89450, 109207, 68388, -10863, 35106, 49304, 97478, 119241, 109826, 100109, 102721, 119150, 112058, 73822, 65904, 75300, 62136, 51080, 63802, 80615, 127424, 130754, 173276, 202269, 225350, 242613, 156006, 125542, 126140, 142178, 153263, 106586, 101015, 59563, 60145, 103346, 97932, 85899, 99611, 139187, 113376, 102497, 113016, 65186, -7624, -57332, -16421, 46577, -6193, 13180, -24015, -50588, -17446, -40610, -47842, -57767, -5227, 29913, 29699, -2507, -52369, -17572, 65604, 124644, 135461, 128995, 123701, 116708, 83441, 82563, 71348, 70395, 77785, 94802, 152441, 118503, 35760, 70841, 144694, 206885]
10186B06885K7353p529K5931k5506o9951p4410o052J3064R0759Q0056o930K9056
10174B82726M3150j6855n913m6642K7026L9091N5030K6676j1400P691K621l5540
10162C67661k3908Q053P6671J6606k87K2374o9844m1491N8522m1660j6446L0885
10150C87136m4483k5914N4884J1482N2186m715m8365k536l997n4716k0117k4703
10138B76142J5151l6685j7007o3439j4808M8778K7043l1878k3123Q195o8133K5728
10126A45964p1069n9179J4341q048J0590J2795n422N3351P943m9504j5771O8666
10114A04657L0199J6720L3550J6161k3548r8424L7259O9150q375n8066l0250J8974
10102A08007L2049q605K1142j2493n8292J574j4156M8240L7541j00529l5510Q8350
$$ y = [206885, 234238, 226709, 252640, 227134, 157183, 82773, 76721, 89785, 180544, 260600, 253670, 282726, 325876, 309021, 303108, 256466, 283492, 322583, 377613, 404289, 392889, 400580, 403201, 367661, 343753, 351806, 428477, 445083, 444796, 467170, 397326, 355835, 414357, 372697, 356251, 387136, 342653, 316739, 371623, 383105, 435291, 430576, 382211, 379675, 375678, 320962, 300845, 276142, 291293, 254608, 237601, 174162, 159354, 208132, 235175, 203297, 180174, 188369, 120236, 145964, 74895, 15716, 30057, 22009, 32599, 45394, 39972, 93323, 101266, 51762, 35991, 104657, 134856, 151576, 185126, 201287, 177739, 79315, 116574, 185724, 177349, 119283, 89033, 108007, 140056, 131451, 152593, 140100, 81808, 83382, 69226, 117466, 155007, 54478, 18968, 107318]
10090A07318M0849l4828k7284l205k514L2123K9880N73P865N8390J9810l7377
10078A91600k5905r1788n5230L9438N5705j5365o2595p0620j9957K241j5907O8789
10066D06O934J8626J2292L4325P0529N9175j1378o769l2472l4076p478l1216p8144
10053G54m1537M3640l815J768k9118P361J683M2827J0252l4453K786J5259p8k4655
10039g326l0400K3071M5493j5212J344Q222L8856K732m9197k0780M501N3276J3648
10026F8228l3551L0770j4338j566j4445K3969k5630o8411m002L573O965L5631
10014G193L7944k4797n3231j3977K5071J6245m0399k020L2890M1634K0004p9473
10002c2916J2584N4568N9924L469o3063L863Q619j2111K1116K2566r902O2682
$$ y = [107318, 148167, 113339, 86055, 82850, 80336, 112459, 142339, 142912, 150777, 209167, 228977, 191600, 165695, 73907, 18677, 58115, 113820, 98455, 35860, -34760, -54717, -52476, -68383, 406, 7340, 25966, 38258, 72583, 143112, 202287, 190909, 184140, 151668, 117592, 110114, 78898, 754, -40783, 2857, -958, 810, -28308, -20947, -19264, 23563, 33815, -638, 2148, 17407, 17329, -7326, -37726, -14655, 30838, 15626, 16970, 25192, 64048, 66780, 17583, -3197, 1304, 54580, 68228, 34677, 65447, 51109, 49543, 35098, 59067, 33437, -34974, -38976, -35403, -28438, 7193, 45137, 20340, -32891, -46868, -21797, -5552, -45951, -47971, -15081, 26553, 46557, -32916, -20332, 34236, 94160, 97629, 34566, 38429, 47048, 34937, 56053, 78619, 68717, 131399]
9990A31399r7594n4562Q1905m974p9621J4731M5961O9038j578Q719m1291p7960
9978e827R130J6496k6387l677k9830k5075N7662j9995o317l3246K2343N3588o378
9965B487Q4710P40m0784l4059P854M9639P197j6806o108j6395J8887O0468n551
9952A12279n9857r1684L0919N6027o065j904J1951o11k1235k2586n8976J7779
9940c3963L3798R6046P9076k1406m3606k7173l8563k0905k9165l0017l4979j2011
9928h2868M9088K0773O279J1442R09l2974L160M3673j0100p211L3017N5907O5346
9915A56441K1544j8702j07373m9553j9656K3592L0205J0238L129n1209k0220J8863
9903b701k785M7954j8853p9436P229J6383n710P2894J4181R360L6439J8144n948
$$ y = [131399, 33805, -20757, 61148, 56174, -23447, -8716, 37245, 106283, 104705, 113424, 72133, -5827, 3303, 19799, -6588, -10265, -40095, -65170, -7508, -27503, -33820, -67066, -44723, 8865, 2487, 87197, 87937, 47153, 13094, 20948, 70587, 77784, 60978, 54870, 38475, 57362, 117830, 112279, 52422, -39262, -8343, 47684, 41619, 39715, 51666, 51055, 29820, 7234, -51742, -33963, -165, 95881, 174957, 153551, 109945, 82772, 44209, 23304, -5861, -35878, -70857, -82868, -33780, -13007, -6728, 4714, 5623, -27351, -24191, 19482, 9382, 2171, 35188, 91095, 156441, 177985, 159283, 51910, 2357, -17299, 6293, 36498, 46736, 49865, -1344, -21564, -2701, -5486, 42468, 23615, -55821, -48592, -32209, -37919, 34975, 49156, 58516, 94955, 113099, 107151]
9890A07151m5239j8906L081r71k8035l663P2207K1744o3113K2792P6925L9493
9878A83466n5665k8554O558j1806k7597m6201l2839R616R314K2849J0395k325
9866C7211L267J187K1186m1165l0193L5269J689j6531o3386k8554J6311j1871
9854g5580l4386J6352n691j865K4827L2892L6162J0853j6600o60q64k4591K8832
9841a0319J5833R453N846k5437r127P342N9871K7466Q807K8525J2241o7246n4238
9828I017k5554n2567L0694R9367Q62m7332j6187l3495l189M6947l3371j1726K1315
9815a5219M8034M4658r047j0289r7738k2454M6786K7693O910k3543k2750M2744
9803A5785j2833k4189M3490M7921J9465n2211p1393J645L6567l3885r819l1531
$$ y = [107151, 61912, 43006, 46087, 45116, 17081, 13418, 85625, 107369, 44256, 67048, 143973, 183466, 127801, 99247, 105805, 93999, 66402, 20201, -12638, -3022, 6292, 29141, 39536, 37211, 40478, 41665, 62851, 21686, -8507, 26762, 28451, 11920, -51466, -80020, -63709, -75580, -109966, -93614, -99305, -101170, -76343, -43451, -7289, 3564, -13036, -13696, -14560, -39151, -10319, 5514, 14967, 20813, -4624, -13751, -6409, 53462, 80928, 89735, 118260, 130501, 63255, 9017, -16537, -69104, -38410, 60957, 61819, 14487, -1700, -35195, -38384, 8563, -24808, -36534, -15219, 32815, 77473, 68426, 58137, -39601, -62055, -15269, 12424, 19334, -4209, -26959, 15785, 2952, -21237, 22253, 70174, 89639, 37428, -33965, -32320, 4247, -29638, -39457, -70988]
9791g0988N4330N4688N171m820n2846P0682L0752n0835K5025N7541k0035L1025
9779A29690K4262r6626k4766n734J8389j029o3195J714K5706K3317M3230Q637
9767H3595l5214r4053J0375L2318k9049l9353K66L8011L2582K4744l177j9607
9755A438Q879L1918M5228r759l5413k847N0905j9030J6535k5421p6617o0021J6085
9742e8120K2171l3700K0415Q8334M1063K2742P857m0990p3606j6247J9260N2649
9730E1828K631l9655n3401k1093K5283k8878n89J1476k3419K2192k3619l8814
9718a16058L5969M8671l7275J2149M5770L3963l0110J4129L7050m288l8739L0576
9706C1807P3181m3772j10003m059O538J6071k7854n034K173P7354p455j8155P462
$$ y = [-70988, -16658, 38030, 43201, 38381, -14465, 56217, 86969, 36134, 61159, 118700, 98665, 129690, 153952, 57326, 32560, 26826, 45215, 44186, -19009, -17295, 8411, 31728, 74958, 83595, 48381, -45672, -35297, -2979, -32028, -71381, -71115, -33104, -522, 24222, 21045, 1438, 10317, 42235, 87463, 77704, 42291, 39444, 90349, 71319, 87854, 62433, -14184, -74205, -58120, -35949, -69649, -49234, 39100, 80163, 102905, 110762, 69772, -3834, -20081, -821, 51828, 54459, 14804, -38597, -59690, -34407, -63285, -63874, -52398, -75817, -53625, -77244, -116058, -80089, -31418, -68693, -56544, -10774, 23189, -6921, 7208, 44258, 39970, 1231, 31807, 104988, 61216, -48787, -52846, -46308, -30237, -58091, -63125, -60952, 16402, 8947, -9208, -1746]
9693a746p406N7691j3086l8528m5433l2757j6819P868K7074n174K3153j4425m3502
9680a03090M2756O0180r619O867R523K5831m1773p7009M5483M8185J9541K0174
9668D7049k6660l8558l0646j6595J4166L5834M5175M744m6896O4960Q75j9139
9656C4309n5584q277R7464N9250j1797n8446L7564N650O646K1103k9367l163m9232
9643D6120j2197j000j4536O7162K4695J8638n3579m7501q8940l4012J7840K9532
9631d7778l5911k685R7023Q2736O262m156p9402p7233r196N2205l674O534r064
9618b4339O4437o504n7242l0604p491m7329r790k711K2092L7352K310j1750Q399
9605f3170Q1003K3365j6420Q884J7518O165j5338l6747m7111J4182M6628N9567
$$ y = [-1746, -9152, 48539, 35453, -3075, -48508, -81265, -98084, -90216, -63142, -68316, -45163, -59588, -103090, -60334, -154, -9773, -2906, 6617, 32448, -9325, -86334, -40851, 7334, 26875, 47049, 20389, -18169, -48815, -65410, -51244, -15410, 29765, 34509, -12387, 52573, 53448, 34309, -21275, -29552, 67912, 127162, 115365, 56919, 94483, 100133, 106779, 127882, 98515, 95352, 46120, 33923, 32923, 18387, 85549, 110244, 128882, 75303, 27802, -61138, -95150, -77310, -47778, -83689, -86374, 10649, 93385, 99647, 95491, 16089, -61144, -70340, -18135, -21809, -15275, -24339, 40098, 33594, -23648, -54252, -61743, -109072, -118862, -121573, -99481, -62129, -59819, -71569, -63170, 17833, 41198, 24778, 33662, 51180, 57345, 42007, 5260, -41851, -27669, 18959, 78526]
9593G8526O982j7463l3744K4765j985O233m594m1315m7642m8387O6945M5666M7510
9580H1497m0545o3938j9754J9646L2151m842q908K3488j9905m0250M4004K9121
9568C1765k8582L5104K9621k6304m1146K8778K223K4625K3542j0806n3526P311
9556B2605o0041j2934k5781N0786M9161K7215l5268n2925J4607l5555K564O741
9544d8825L054K5022K649n2071j8781J2288R3703j210n3306k0039k591J0185N1546
9531A624j7379L0290L2709k9532p751l4157l1878N8532Q2557K9083L7142j5619
9519A35621m3640l4603P313k7138m248N7779j2006K4602L5178n8860r0979J7877
9507F896Q395k0092k7391l0957j0242O4915M3671J3021J3492k2888l8607N1065
$$ y = [78526, 85508, 68045, 34301, 59066, 57081, 63314, 58720, 17405, -30237, -78624, -11679, 33987, 81497, 40952, -22986, -42740, -23094, 9057, 4215, -4693, 18795, -1110, -41360, 2644, 31765, 3183, 38287, 67908, 41604, 458, 29236, 31459, 56084, 79626, 68820, 15294, 22605, -37436, -50370, -76151, -25365, 23796, 51011, 15743, -37182, -22575, -58130, -55566, -48825, -45771, -20749, -18100, -70171, -88952, -76664, 17039, 15829, -37477, -57516, -60107, -49922, 1624, -15755, 14535, 47244, 17712, 9961, -24196, -56074, 2458, 85015, 114098, 151240, 135621, 91981, 57378, 64691, 37553, 33305, 91084, 79078, 103680, 138858, 79998, -10981, 6896, 15291, -4801, -32192, -63149, -73391, -8476, 35195, 48216, 61708, 38820, 213, 51278]
9495E1278l4278q159j1614p7922j7474O2334o1599m5476l869O8626P5858Q1705
9483G9410j4056l486k892J1790m2664M613m8013m976p380k4167N1804Q737L1818
9470D0538L4286o5377n6556O2140j0363N3233O9529P381l4669l7541o5848O921
9458C674P5660M4571K7106k164n9563o5814j8063K1248j8196l3386N824J9981
9446H78p536l3524J6061L0539Q3658l0087k7671J3869j8804l570n1198q0968k2118
9433a30471N5549P223r194K8951J1572m2314m4028L0837N3959N0606N1951m7361
9421A7280n3877k7646q8117l2811P7777J04673M3252p1689j4847M5943Q546J8867
9409B7351J4226O419N3683q212r9663o20K5928m1144p3705j9423n102n509O9439
$$ y = [51278, 17000, 8841, -2773, -80695, -98169, -35835, -97434, -142910, -146779, -78153, -2295, 79410, 65354, 61868, 58976, 70766, 28102, 32715, -15298, -20274, -27654, -51821, -17, 8720, 40538, 74824, 9447, -47109, 15031, 4668, 57901, 127430, 134811, 100142, 62601, -3247, 3674, 79334, 123905, 151011, 148847, 89284, 23470, 5407, 26655, 8459, -24927, -19103, 878, -6658, -40182, -24121, 6418, 90076, 59989, 32318, 46187, 27383, 23813, -27385, -108353, -130471, -74922, -67699, -76893, -47942, -36370, -78684, -122712, -91875, -37916, 12690, 64641, 17280, -36597, -64243, -152360, -185171, -107394, -2721, 40531, -31158, -46005, -62, 8484, 27351, 41577, 47996, 101679, 93467, -6196, -6816, 19112, -22032, -95737, -115160, -120262, -125771, -56332]
9396e6332K6868K8277K0501o844k1271q1075o3025M4384N5368K764m8977L4428
9384f4934O4006J9739p1506j5724P376K2951l5908k8700j4332N2540Q635k3845
9372g9702J3599K1334r724p310J7695L4214M8577J3815n3591m1412R966L5063
9360B524j7848L1965l7182K5267M8625j2108K516l582k8047K8596l3917n5115
9348d8306n092q413N027R0559K9853k6662J0773K4498K7258m0386m2277K5944
9336D2776K6858L6837K6154J3948l9056j7585k204J2328j8368p2043q233r420
9324h008j9437J352L6921J9185k9125l3378k7037o66O1177J6723j515J4577l1588
9311h19k7959p7182k6257R8504J9528J0874M3324j03k5294J02450j801n7337J6062
$$ y = [-56332, -29464, -1187, 19314, 12470, -8801, -89876, -152901, -108517, -53149, -50385, -99362, -64934, -928, 18811, -52695, -68419, -61043, -38092, -74000, -102700, -117032, -64492, -55857, -79702, -66103, -44769, -54493, -61803, -44108, -9894, 38683, 52498, -1093, -42505, -32539, 2524, -15324, 16641, -20541, 4726, 53351, 41243, 43759, 40177, 12130, 40726, 6809, -48306, -53398, -61811, -56784, 33775, 63628, 36966, 47739, 72237, 99495, 59109, 16832, 42776, 69634, 106471, 132625, 146573, 107517, 89932, 87728, 100056, 81688, 9645, 1412, -8008, -27445, -26093, 10828, 30013, 888, -32490, -59527, -60193, 984, 17707, 16192, 30769, -819, -28778, -105960, -132217, -33713, -14185, -3311, 40013, 39910, 14616, 117066, 115265, 57928, 73990]
9298G3990K1622n2208K5897L944m8033K7358J9234m5283p282R986m3075k3055
9286c6905o012K3352l4617j0319q951j4945P4948L6927j6229n7953J7155M3997
9274A0448m0326p1824P775Q3697J3215n394K797l0184M4670L5744n2718o6968
9262f9068K7725M411r050M1682K6249m8007M910K7127j5446m3682l6091O5402
9250b3838N9403K7281o2427l0178L2383m1683j7114N7946J2194l7096J1721M8387
9238C6979j5749m9854L575J9709j3398m2632l7428N9845O8312M4184l3231n3883
9226a3571l1346L9648N5536Q2107k9059m5750K2953m7857j2231l0031m9060l2736
9214i1397L8575M2815N9428J9110N5777N283q4432n3376K2305N3858l3320k9001
$$ y = [73990, 95612, 43404, 69301, 73245, 25212, 52570, 71804, 26521, 19239, 29225, -13850, -36905, -42917, -19565, -54182, -64501, -73452, -88397, -13449, 23478, 7249, -50704, -33549, 10448, -29878, -101702, -93927, -10230, 2985, -2409, 388, -29796, 14874, 50618, -2100, -69068, -41343, -36932, -45982, -4300, 21949, -26058, -21148, 5979, -9467, -53149, -89240, -23838, 35565, 62846, 419, -29759, 2624, -39059, -56173, 1773, 13967, -23129, -11408, 36979, 21230, -28624, -25049, -5340, -18738, -61370, -98798, -38953, 29359, 73543, 40312, -13571, -44917, -5269, 50267, 132374, 103315, 57565, 80518, 32661, 20430, -9601, -58661, -91397, -52822, -10007, 49421, 68531, 124308, 129591, 45159, -8217, 14088, 67946, 34626, 5625]
9202E625L0700j1954l2882k1740M2265M4338m352l972J808J0091l0227l9023L7929
9189B8606n407l1159L3569L7376M5493r944l8365j4158l4199n6984l3271P1172
9177g271K4745o0629m5290r525j8916N1150J3734o2080l7708P8625n846K6627
9165e2384M002q097j2691J3646N0655J9510l5229k7928K3701m429m4627J8399
9153e5472K9779P7232L6680k3304p3487K993p790Q9383n921Q976j0532l0002j3558
9140B4977p330J9447J121J303q432M907j4180O759L3879p028r746j6579n7188
9127b8090L6190K4641q212J8931l485m4988J0813j2990l9687J5899L8337l0018
9115b2659K0855N823L050J3318J6245j6404j8244N857K0696O2218j0615m9695
$$ y = [5625, 36325, 24371, -8511, -30251, 12014, 56352, 52000, 48028, 49836, 59927, 29700, -9323, 28606, 23199, -7960, 25609, 62985, 108478, 98534, 60169, 46011, 11812, -45172, -78443, -7271, 17474, -43155, -88445, -97970, -116886, -65736, -52002, -114082, -151790, -73165, -79011, -52384, -48382, -56479, -69170, -55524, -4869, 14641, -20588, -48516, -24815, -29244, -73871, -55472, -25693, 51539, 88219, 64915, -8572, -5579, -13369, 76014, 70093, 79069, 68537, 38535, 24977, 17647, 37094, 38215, 39518, 31086, 35993, 21813, 28572, 62451, 55423, 45677, 29098, -28090, 8100, 32741, 24529, 43460, 39975, -5013, 5800, -7190, -46877, -30978, 7359, -22659, -1804, 4019, 7069, 20387, 36632, 20228, 1984, 7841, 28537, 90755, 80140, 30445]
9103C0445r990L652R338M7656p482k5376k1746L6364m4067J3746Q1675o879l8316
9090F9020r263m9021K6928R969k3162m9958M860m9834k6501R666P5675L9747Q7245
9077A15371o9291o8216M592k4645j394j8876J357L6055L5328p745j7690L4074
9065A8920K5655k3312j5404M3359J3090r212o7821m7187K9388M338q199J9968
9053a6417k362m1526K0277j9770j5235J0694j189l6362Q722j0892K1715R286j3032
9040h6091K7280J8981p568M7270N6376J472o1610k9095k950N8737J8161L115l7548
9027F530l764O4199N5437n1253o0086p582M0569M4709K74n6261r1237m0440M1262
9014e7643J624n899J2551L063K0952k3509m8044j0322J0857K4441M0838m3505
$$ y = [30445, 20455, 24107, 33445, 81101, 73619, 48243, 26497, 62861, 18794, 32540, 114215, 107336, 69020, 59757, 10736, 37664, 47633, 24471, -25487, -20627, -70461, -96962, -87296, -11621, 28126, 115371, 46080, -22136, -17544, -42189, -43583, -62459, -61102, -25047, 10281, 2536, -15154, 18920, 44575, 21263, 5859, 49218, 62308, 53096, -14725, -61912, -32524, -28186, -36385, -16417, -18779, -60305, -40028, -59798, -75033, -64339, -65528, -101890, -93168, -104060, -82345, -73059, -86091, -58811, -39830, -47398, -128, 56248, 57720, -3890, -32985, -35935, 22802, 40963, 44078, 6530, 2766, 66965, 122402, 71149, 11063, 3481, 44050, 88759, 89033, 32772, -58465, -98905, -57643, -56019, -61918, -49367, -46304, -25352, -48861, -96905, -107227, -96370, -71929, -31091, -74596]
9002g4596k2167j2548P596L3413N0115K5560J0930p859l3604K2706k8264p880
8990c6598k3230K1671L9094l5138n0662N7687Q3255l021m7131j8824O475J8334
8978A1912m0222J3285p1037L4748L8755j4416j5660J1492J1546j0250k8191J633
8966e6405P9712K4492k5077O839O750r772K3231m539M5616q599k5943m9539j1757
8953d991N371j760k3254M145j830K6394N2893K8861m9923J5492q763K879j047
8940D4467l4837n6877m4465j2722K9597r285N1213J3699q674L2462O767p279K1843
8927B5909o1366j0382N2984J4213M6334L6707j2183p2312l4723k1819L368j3313
8915d6583k2458L5573N7843J5922O779k954o3951l3251L8389L0395n289m5744
$$ y = [-74596, -96763, -109311, -101715, -68302, -18187, 7373, 18303, 10444, -23160, -454, -28718, -36598, -59828, -38157, 937, -34201, -84863, -27176, 56079, 53058, 5927, -12897, -6422, 11912, -28310, -15025, -86062, -51314, -12559, -26975, -42635, -31143, -19597, -29847, -58038, -56405, 23307, 47799, 22722, 29561, 36311, 26539, 49770, 45231, 90847, 82248, 56305, 6766, -4991, 380, -1380, -24634, -20489, -22319, 4075, 56968, 85829, 35906, 51398, 42635, 45514, 44467, 9630, -47247, -91712, -104434, -74837, -84122, -32909, -19210, -27884, 4578, 11345, 4066, 25909, -35457, -45839, 7145, 21358, 67692, 104399, 92216, 19904, -14819, -36638, -33270, -46583, -69041, -33468, 24375, 40297, 47076, 44122, -19829, -53080, -14691, 15704, 10415, -35329]
8903c5329m72J2641m75K4430Q712K1799J5147l2552J0551J114l0420J7434O0390
8890G2970l1585m2968m7128M937N6770k6521l5509L3891J00259K7516k1828k2340
8878F8464M8079l0642l7574q3231k5729L6742l386m4371r634K5660j98M0205L2223
8865A6608k1298N0819L056m1253o0410J489L2115J3069P454l0482m2213L777M9787
8852a7482M0815j0896R134M4929K9336K3932l470k5652j5784j9764n0657J0330
8840A4771o1727J1198j1884k6441J7557J0950L3455J3812n8266k2839l1707L4606
8828g6515M1216L6037J3946n71l9363n1026n651P2666Q0538P3756l3491k3303
8816H8239j1520o1226k4143L267K8647J6192L9343p7734j4399K7713j2545l9591
$$ y = [-35329, -35801, -23160, -23635, 795, 9507, 31306, 46453, 13901, 24452, 25566, -4854, 12580, 72970, 41385, -1583, -48711, -43774, 12996, -13525, -49034, -15143, 85116, 112632, 90804, 68464, 116543, 85901, 48327, -34904, -60633, -23891, -27277, -71648, -81282, -55622, -55820, -15615, 16608, -4690, 46129, 49185, 7932, -52478, -50989, -18874, -5805, 1649, -28833, -71046, -67269, -17482, 23333, 12437, 21571, 66500, 95836, 119768, 116298, 90646, 74862, 55098, 4441, 14771, -46956, -35758, -47642, -74083, -56526, -45576, -12121, 1691, -56575, -79414, -111121, -76515, -35299, 738, 14684, 14113, -25250, -76276, -81927, -9261, 71277, 145033, 111542, 88239, 76719, 15493, -8650, -5383, 23264, 39456, 78799, 1065, -13334, 14379, 1834, -37757]
8804c7757j7607J8335M122K6298l083o4664N8600O7610L718l2519n1560K634j1185
8791c7058L8479j5385l0733M2960P314N870m6903L2888J6324j0839m5912M0467
8779b528j8494p7904K4980L8413M585M885j3064j3114o6626m8489O6381N7950
8767d3025N638P038L18K4399J8734n493J6670N6277n1401j6165M0720p001k6399
8754B0310N5055N6062j4152n9008j1543J0490L9337k5053n430n6740Q008O2369
8742G9705M4579j9123m0555l6600J3682O73O0104O0544n8600m9828N152M7123
8730A06856k6597l2514j6743r898K8647r603L55l9264n0289L572o4025L1216N9295
8717a8992R2711j315P354q3044l6314L4395J5752N4097O449j0151k9645j7317
$$ y = [-37757, -55364, -37029, -32907, -6609, -9692, -74356, -15756, 51854, 55572, 23053, -28507, -25873, -37058, 1421, -13964, -44697, -1737, 5577, 11447, -35456, -2568, 13756, 2917, -42995, -2528, -21022, -98926, -73946, -35533, -30948, -26063, -39127, -52241, -118867, -167356, -100975, -43025, -37387, -30349, -30031, -5632, 13102, 7609, 24279, 80556, 29155, 12990, 53710, 46709, 20310, 75365, 131427, 117275, 58267, 46724, 57214, 96551, 71498, 66068, 9328, 17336, 79705, 124284, 105161, 64606, 28006, 41688, 42361, 102465, 163009, 104409, 54581, 59733, 106856, 80259, 47745, 31002, 21104, 49751, 40148, 40503, 1239, -49050, -45478, -109503, -78287, -18992, 73719, 72404, 79758, -3286, -39600, -5205, 10547, 64644, 71093, 60942, 31297, 13980]
8705A3980Q237k4953l4709j5562O7784N4391j6478m286o7628l3269k2158m903
8693g9554K3143K7629L7573J8487N2974M1406l1053m4357p9609m3789M6080M1329
8681A0259J0269O9203O4601j5817l2976j7956k4682O046k5515o9474l1166J4455
8669d2753L6587J3214Q519L3327l1990l3358K66m1164O0586J2567r69j4619J3334
8656A3547k9583n0896M876L1108m3768o3841M1082N1435j7103N2921P843k9886
8644c2265m4790K0577K9086j6709J2370n540J3085P805K0610R686N6868l156O144
8631G3771o5374l0170n89l9146q62J6418M5422k1883r636M4279J7459K5468l6181
8618A8976m8827j9327k2989Q975L3936j5888k524K5419N5877N4623l4455J5176
$$ y = [13980, 22217, -2736, -37445, -53007, 14777, 69168, 52690, 48404, -19224, -52493, -74651, -79554, -56411, -28782, 8791, 27278, 80252, 121658, 90605, 46248, -33361, -77150, -31070, 10259, 20528, 89731, 154332, 138515, 105539, 87583, 62901, 68947, 43432, -26042, -57208, -42753, -6166, 7048, 15567, 48894, 16904, -16454, -16188, -57352, 3234, 15801, 14832, 213, 13547, -16036, -66932, -62056, -30948, -74716, -138557, -97475, -46040, -63143, -10222, -2379, -32265, -77055, -56478, -27392, -44101, -31731, -37271, -24186, -16381, 4229, 13915, 70783, 67627, 73771, 8397, -21773, -22362, -61508, -62370, -45952, -530, -22413, -32049, 12230, 29689, 55157, 18976, -29851, -49178, -72167, -63192, -29256, -45144, -47668, -22249, 33628, 88251, 53796, 68972]
8606F8972M6015j6113m9728k5617j4498j3189r089L0153K9016J0163L1103k2646
8594F4542K584J8062L6139M1950n775K7619P9371K766j4867k7825L515N6630j2778
8581B71933k8270N543L5888N450n8000j1430j2907p4658J9363N5640n0208q9911
8569F8433l8181j754J0113J01903N2829l0573K74o1627p0374l2924m7202L6524
8557a2559M2232M3769P9419M1919L06n4970p6350n1511m1294P7238M1367k885
8545H6681j8729m5048O628K4148l4355j7872n4926L4706P807R432n156M9881N6489
8532I9686n3751k4668K8139L1544l8139p2800N125m7111J6263N5032K21l2010
8520c2469m6764N1977N1374m322l1763k3543Q328O6819L2225Q62o5791l8314K3198
$$ y = [68972, 114987, 98874, 49146, 23529, 9031, -4158, -13247, 16906, 45922, 56085, 87188, 64542, 67126, 85188, 121327, 163277, 157502, 185121, 264492, 267258, 252391, 224566, 228081, 284711, 271933, 243663, 249206, 285094, 290544, 232544, 221114, 208207, 133549, 152912, 208552, 158344, 68433, 30252, 28498, 38611, 140514, 193343, 162770, 163044, 101417, 31043, -1881, -49083, -12559, 29673, 73442, 152861, 194780, 195086, 140116, 63766, 12255, -29039, 48199, 89566, 86681, 67952, 22904, 29532, 53680, 19325, 1453, -53473, -18767, -10960, -1528, -6684, 43197, 99686, 45935, 21267, 49406, 80950, 42811, -29989, -24864, -71975, -55712, -680, -459, -32469, -79233, -27256, 24118, 19796, -11967, -35510, -27182, 39637, 71862, 72724, 6933, -31381, -8183]
8507h183P2355P695m6864l8013o865K5543K222M8681k9781j7555j5381L7704K6146
8494E7704N916j7514Q417n9344q497n016K46K8894q859K9869K4019N3392l1835
8481G7392n5610j2215J3147M641O3597J1091j9232j2738J3246j6043K9793m3275
8469E3794m1655R461L3032J0150j3446p5107M070K1320K2720J0673q755j41j5618
8456A0498K4011L8153J4904r1571j818K382L7216k608n5398M4531J3355o0789
8444b7134J5099j3608M807q57L7795L6058r2057j6488K3044M8177P2830L1116
8432A18782q7694n1756J7888K6223j6049o5886p1614K6021K0128L9720q190o4718
8420a17145K1393P5812K7669R193N4197J5797l9865o4794L0486j559K8077J8907
$$ y = [-8183, 64172, 71867, 25003, -13010, -19875, 5668, 7890, 56571, 26790, 9235, -6146, 31558, 57704, 63620, 46106, 54523, -4821, -13318, -18334, -18088, 10806, 1947, 31816, 55835, 109227, 77392, 21782, 9567, 22714, 27355, 90952, 102043, 82811, 70073, 83319, 67276, 97069, 53794, 12139, 21600, 54632, 64782, 51336, -23771, -19701, 1619, 24339, 35012, 26257, 26116, 10498, 34509, 72662, 87566, -4005, -5823, -3441, 33775, 31167, -24231, 20300, 33655, -27134, -12035, -25643, -20836, -21693, 16102, 52160, -39897, -56385, -33341, 14836, 87666, 118782, 31088, -20668, -2780, 23443, 7394, -58492, -130106, -104085, -83957, -44237, -52427, -117145, -95752, -19940, 7729, 16922, 71119, 86916, 47051, -17743, 12743, 11184, 39261, 58168]
8408E8168K3677j526j4198m5064o7033L0509j6N892J2589L3579n549J9544l1645
8395A8927n7256o274m0881p8953l0881N2875L4575J0690m6536J1632L6747R7490
8383B155K4975l6412m3135j6795l4960M1032K6257L8972o245l0859N6125P6656
8371I7766m9279l6734J7442j6948j5023l9968K0327M1028p743j6748J8138k0540
8359h282M2764N3442k4794l7946K8465m6647k2419l6942m7712O0455N1428L3254
8347D5066j8218m0146k0606j1813n6968n4427L0080O7500N1535J6801k0077p4906
8335h6179l7547j6634K4923M2611K4941J5844J1590Q629J4769j0872o7610J853
8323g3682j3894L7129Q9678M8980j5994r7842q6707N2572R506l2698K0824L6152
$$ y = [58168, 81845, 80319, 66121, 21057, -45976, -15467, -15483, -9591, 2998, 36577, 31028, 50572, 18927, -38329, -44603, -85484, -164437, -195318, -142443, -107868, -97178, -143714, -132082, -95335, 2155, 27130, -9282, -52417, -69212, -104172, -63140, -36883, 2089, -4156, -35015, 21110, 97766, 48487, 11753, 29195, 12247, -2776, -42744, -22417, 18611, 10868, -5880, 12258, -8282, 34482, 87924, 63130, 25184, 53649, 7002, -15417, -52359, -100071, -39616, 11812, 45066, 26848, -13298, -33904, -45717, -102685, -157112, -127032, -59532, -7997, 8804, -11273, -86179, -123726, -140360, -115437, -72826, -47885, -32041, -20451, -11822, 2947, -7925, -75535, -73682, -87576, -50447, 39231, 88211, 72217, -25625, -112332, -59760, -50254, -82952, -62128, -25976]
8311b5976K198l3573l4277m265M946J6414k332L4511L9861Q712m0302N700M1192
8298A2809l1562N0285N22k2345L2064L4754l4371l8617l2037k6841K617P9327
8286B6605K0401n8647q2101n4139q019N6288N4297J6524L1505L3346k3563q71
8274A1626r605j4665l4251K5236P724j7682L9871M065o9760j8199M1701M1877
8262G938L0804m7379n8786k4585Q7801O9155K1832M7499J6975l3846n7902p248
8250E2258J1293o8665J9400K7043K2292J3824j9673l54q085n5689j6569J4613
8238h312k8026J4245O0288l051k6498k7006K3209j8165O4N3831M848J7682j2047
8225E1062L9095q283p4953n6884K2875K1320j5603R9K9122l064o3463M7926Q975
$$ y = [-25976, -23778, -57351, -91628, -95893, -90947, -74533, -76865, -42354, -2493, 6219, -34083, -28383, 12809, -18753, 31532, 32054, 9709, 41773, 76527, 42156, 3539, -28498, -55339, -52722, 26605, 47006, -11641, -93742, -147881, -155900, -99612, -45315, -28791, 2714, 36060, 12497, 11626, 2021, -12644, -46895, -21659, -13935, -31617, 8254, 12319, -57441, -75640, -33939, 7938, 38742, -8637, -67423, -92008, -4207, 64948, 86780, 134279, 151254, 117408, 59506, 52258, 63551, -5114, 14286, 41329, 63621, 77445, 57772, 57418, 49333, -6356, -22925, -8312, -36338, -22093, 38195, 35144, 8646, -18360, 4849, -13316, -13252, 40579, 45427, 63109, 51062, 90157, 81874, 6921, -49963, -27088, -5768, -21371, -21272, 7850, 4786, -58677, -10751, -1776]
8212a776j0519r709K6013J982j0565J7856k4657M9816l795k8392l9103K2268L9057
8199B8476l290j8544K4739Q184q2300l3273p8185j8498R9207k2481L6852K8140
8187c0973J8030O5682k0457l3863J4099N171L2561O7073K8885j8891m6620r01
8175G9796j7520M690k3825r1104J9541J1689N034n8712K8725L6303k7194M014
8163b8563M6163L2268l7982K2638l2312J4129k7788L8698k919l2933p788R26J6078
8150F15n0654k6047J8258O3633p0608l1427j719k4672J1356O849M2246L6781M1450
8137A6061P0442k0139k1474M590o2928l2643j0613K4350j7354l0289k0849j4340
8125a15186M1692L269j1984M4057L3206j0458J5097j1487j7280R218j334m2028
$$ y = [-1776, -12295, -22004, 4009, 5991, -4574, 13282, -11375, 38441, 34646, 6254, -32849, -10581, 28476, 25186, 6642, 31381, 39565, -42735, -76008, -154193, -172691, -73484, -95965, -59113, -30973, -12943, 52739, 32282, -1581, 12518, 17689, 50250, 117323, 146208, 127317, 80697, 79796, 62276, 66966, 43141, -47963, -28422, -16733, -11699, -70411, -41686, -5383, -32577, -28563, 17600, 49868, 11886, 34524, 2212, 16341, -11447, 27251, 24332, -8601, -16389, -15463, 615, -50039, -76086, -57828, 5805, -64803, -96230, -97949, -122621, -111265, -104416, -62170, -25389, 16061, 86503, 66364, 44890, 49480, -13448, -46091, -56704, -32354, -49708, -79997, -100846, -115186, -73494, -70225, -82209, -38152, -4946, -15404, -307, -11794, -29074, -19856, -21190, -63218]
8113f3218j1074k8683L556K4058J5L9442N2680m9064r3376K3707L6283m1638q409
8100a15721M6342N9567j7426o619K9013J7552O7852j8651j11816o565M1261o854
8088b2065L3448K0222n9281k3868r993Q060R795K9708m489L4736N8590l3398m9178
8075g713r409q13M2971m8379J9376M2506j4852l4486K565J886J2215q2176m8929
8062a25238K3118L5344j0020J1404L5502J3631l3363k2553L0869Q1869l8892K6692
8050B8363Q617J0316M58m2755J143L1246m0015l3154m0236l3505K1149j7726N935
8037a00164k6512r973O9308N5310P352r056M618N602o602J0710q476K1712K0712
8024C4541K2326l0443k2490J3449L1476R223m11m8103K5256M7745q0050m8282
$$ y = [-63218, -74292, -102975, -99419, -75361, -75346, -35904, 16776, -32288, -125664, -101957, -65674, -107312, -115721, -69379, -9812, -27238, -33857, -4844, 12708, 80560, 61909, -49907, -56472, -15211, -22065, 11383, 31605, -27676, -51544, -61537, -53477, -43682, -13974, -18463, 16273, 74863, 41465, -7713, -17122, -17935, 25036, -23343, -3967, 38539, 23687, -10799, -8234, -6348, 5867, -76309, -125238, -102120, -66776, -76796, -65392, -29890, -16259, -49622, -72175, -41306, 40563, 1671, 28363, 36980, 47296, 47754, 4999, 6142, 37388, -2627, -35781, -76017, -109522, -88373, -106099, -100164, -126676, -136649, -67341, -12031, -4679, -13735, -9117, -3515, -10117, 593, -7883, 13829, 34541, 56867, 26424, 3934, 17383, 48859, 58082, 57671, 9568, 34824, 82569, 2519, -45763]
8012d5763m9277Q071Q9816O954m837M5680N639n4410Q412j655l510k6124j2184
7999c3188J9182N6874L0926j5369K0648o2503k3863L9944J546l9579L357k3159
7987b5184l0469m6398L7262M8129L5934N010j908J00457R484j11292l936M7253
7975F4342j4814o0918l2184m117n205J4859Q2646j3041p558K3281Q2418r553m1453
7962G8703l6132M3448l2718r3632n251J7942l8277j2229J5803k0823j9306Q2196
7950b0276N7100J7836l1181K945n3075p413J1527L2541J6738m7978J2608N7589
7938D8961J204o2579j5257L5599P2526P6347o6908o6287J1704L1115k90J0476
7926G6611j764k9972o3484P606j8354j3540N9202J6943Q986K5524P111K8870K8370
$$ y = [-45763, -95040, -86969, 2847, 9801, 4964, 50644, 56283, 1873, 10285, 8630, 5120, -21004, -33188, -14006, 42868, 73794, 58425, 79073, 16570, -7293, 32651, 34197, -5382, -2025, -25184, -55653, -102051, -64789, -16660, 19274, 24284, 22376, 122833, 132317, 21025, 17089, 64342, 49528, -11390, -43574, -47691, -52896, -38037, 44609, 31568, 24010, 47291, 129709, 120156, 78703, 42571, 86019, 53301, -40331, -45582, -27640, -65917, -78146, -62343, -83166, -102472, -20276, 36824, 54660, 23479, 26424, -26651, -34064, -22537, 10004, 26742, -21236, -8628, 48961, 50165, -12414, -27671, 7928, 80454, 156801, 89893, 23606, 35310, 66425, 66135, 76611, 74847, 44875, -18609, -11003, -29357, -42897, 16305, 33248, 42234, 67758, 74869, 103739, 132109]
7913A32109m3803k6955j1633J1689m5186q5253r681P4008L5078m3574j7632j8044
7901d8877R3522J421K6358J9851P919l5719j8505K8828l0426P146N634M2157j6534
7888H2775l0464K177O48K912n8657J0170J5013J1104j4965O315l3487l5711N602
7875c6568N6379N049o4851K0717O4672K0302K1445k8019r5141L8279P9527J2535
7863I4326k8521r276k2147q388l5981k3023j0864J3141r5149n765M2163M9388
7851d0096M1943l4475O1495O5015J0656k5157J709j2943q6565l8669K190J0136
7839d4761K2644L8609L7911j8368L6703K1287o471l1194J2649M3228m314K814
7827A10737N5556M3388o6737o1989j7714n6500R191N0826j0285k5464k2647n2872
$$ y = [132109, 88306, 61351, 49718, 61407, 16221, -69032, -78713, -4705, 30373, -13201, -30833, -48877, 44645, 46066, 72424, 92275, 100194, 64475, 45970, 74798, 44372, 51518, 57152, 99309, 82775, 52311, 54488, 55136, 58048, -609, 9561, 24574, 35678, 20713, 27028, -6459, -42170, -36568, 19811, 24860, -39991, -19274, 45398, 65700, 87145, 59126, -36015, 2264, 81791, 94326, 65805, 56529, 34382, 25994, -9987, -33010, -43874, -30733, -125882, -131647, -89484, -40096, 1847, -32628, 28867, 93882, 104538, 79381, 81090, 68147, -18418, -57087, -54897, -44761, -22117, 16492, 54403, 36035, 72738, 94025, 87554, 56360, 69009, 112237, 107923, 110737, 166293, 209681, 142944, 80955, 63241, 6741, 15932, 66758, 56473, 31009, 8362, -44510]
7815d4510K5371N2893L0840M338l9922N479j200k354J4878m6328K0108O3668J2768
7802I6029l585j376K289n1210k7647L4378J4961l9315j0212j9330P607J3865M3508
7789E9962k8662m2316N7337J5840K9498J0617M2784K1617l9078j6171m0212o4884
7777F332k5025J7882M2184M1732l9236j11032l1380j4521j5967P2256J2647p059
7765e1187k7900k1853j672J5798m863R8020O3640P097L3438K930M675M1836p2724
7752H7235j04324J7919P971m2386J4993K8089j0388J6632M7792m2029r215R550
7740B1839k4396j485K1176k7935q3681j7718L8425l580l1946M344r910J9200M9511
7727d6156l1670k4112M7472L4743k6299o1366L4509M6468N4488N0429k4139l9993
$$ y = [-44510, -19139, 33754, 64594, 68932, 29010, 34489, 33289, 30935, 45813, -515, 19593, 83261, 96029, 92444, 91068, 93357, 42147, 14500, 48878, 63839, 24524, 14312, -5018, 2589, 16454, 59962, 31300, -11016, 46321, 62161, 91659, 102276, 145060, 166677, 127599, 111428, 71216, 6332, -18693, -811, 41373, 83105, 43869, -67163, -98543, -113064, -129031, -56775, -44128, -51187, -79087, -100940, -102612, -86814, -91677, 6343, 69983, 77080, 110518, 113448, 118123, 159959, 87235, -17089, 830, 8801, -33585, -18592, 9497, -891, 15741, 63533, 21504, 12289, 21839, -2557, -4042, 17134, -10801, -94482, -112200, -73775, -77355, -109301, -104957, -114867, -95667, -46156, -77826, -101938, -54466, -19723, -46022, -107388, -72879, -26411, 28077, 78506, 54367, 14374]
7715A4374J0361n2482l8557N0700q309K3698K0868j1910l4665L073L5415O9276
7703H1842J14p9579J0329m5366K3344m1942k4134j1317N2250k2827K8958L0568
7691B240n7347L3059N5922J4984n6392J5881P2601J0946n4613o0257J4214j4067
7679b2829L7158m1868o170J2483L3396N0714K6038n3068Q010n6019j8681j23N1367
7666B0408p827k4657o866P6441J1993l8576L0515n0349n2345R536N0453J0959
7654B9685J8052L3922l3671j1645J9066K7584n010l2189o6370P255q652J5985
7642e988l3578J1282K7446j0011j00252m9009q54J9244O1832K2748N1986n47l0413
7629c6114K1395N3672j0065l9683m6543o417K7112K2039J2862K6439n2195l7190
$$ y = [14374, 24735, -27747, -66304, -15604, -23913, -215, 20653, 8743, -25922, -22849, 12566, 81842, 81956, 2377, 12706, -32660, -9316, -51258, -75392, -86709, -34459, -57286, -28328, 2240, -55107, -22048, 33874, 48858, -7534, 8347, 80948, 91894, 37281, -22976, -8762, -22829, 14329, -27539, -33709, -21226, 12170, 62884, 88922, 35854, 43864, -12155, -30836, -30959, 20408, 12581, -12076, -18942, 57499, 69492, 30916, 61431, 11082, -41263, -31727, 18726, 29685, 47737, 81659, 47988, 36343, 55409, 82993, 77983, 45794, -20576, -13321, -21973, -5988, -39566, -28284, -838, -10849, -111101, -160110, -160964, -141720, -79888, -57140, -5154, -5701, -36114, -14719, 38953, 28888, -10795, -57338, -63755, -36643, -14604, -1742, 24697, -27498, -64688]
7617f4688N2190L5964K1820l7612k5863N1270N1430p83j6548k8079P1759n480
7605A05380j02537q1182l1345M6899O9504J5625n0896p939k063n8866m804N010
7593i7214L5277M9407l0970n4736M0719Q922K018O64L7584k2831j7443j6023M2244
7580b2382N4184N1952l2042q9673q7867m3156K2200j3496O8343P7412N7519n327
7568C7667l6800K8598J9729K6153n392k5631J1508o0991j4378n570L2387k1970
7556a4690l7220L4467n1482j5808N1366N0406l6756K3104M608j4637j6961R813
7544a3790N8091j2501p684L9574P034o491J3924k3286m6898o8117j3722n1103
7532a24969j3682N6145j764j1779j9691Q8770O558R910J5422l5924N3222o41n6598
$$ y = [-64688, -12498, 23466, 45286, 7674, -18189, 33081, 84511, 83728, 67180, 39101, 110860, 105380, 2843, -78339, -109684, -62785, 6719, 22344, -28552, -36491, -38554, -97420, -102224, -97214, -61937, -12530, -43500, -98236, -57517, -48595, -46577, -45913, -8329, -31160, -48603, -64626, -22382, 31802, 83754, 51712, -37961, -125828, -168984, -146784, -160280, -91937, -14525, 42994, 37667, 867, 29465, 49194, 75347, 69955, 44324, 55832, -5159, -19537, -25107, 7280, -14690, -51910, -17443, -68925, -84733, -33367, 17039, -19717, 3387, 7995, -6642, -23603, -13790, 44301, 31800, 24116, 63690, 70724, 64233, 78157, 54871, 7973, -60144, -73866, -124969, -138651, -82506, -84270, -96049, -115740, -26970, -20412, -10502, 4920, -31004, 22218, 21577, -35021]
7519c5021l6716M6046K0814j03993j5555L5180O7089N5745K5311J5272j9384j32009
7507g7221j6581R674J6676K6129J7696o83k0471j2304P604L6359L9261J0356J7027
7494E3522J77R070K5070p786j24477L9189M4768k2531m3143j8495r733l2806K8457
7481e8718l2372o6118K7138O5314O831o3128L1110N2950L704N1093j8610J1188
7469A0382o3064j3513P1827l7211n7935J5764M0003o790J2001J3004J6362J6026
7457A6856L1160K5066j1987n1886o7644L9753L6055N339m332L1481J0635n5708
7445D788p7491l0692N7743N9871K7190K0680l5387j7619K2658m7305J4066J0996
7433I498k8804l2282m784P138L7166k3620N982L4858l3803K0795o767j9374K7114
$$ y = [-35021, -71737, -25691, -4877, -108870, -124425, -89245, -22156, 33589, 58900, 74172, 54788, -77221, -93802, -84128, -67452, -41323, -23627, -24310, -44781, -57085, -49481, -13122, 26139, 36495, 53522, 53699, 62769, 87839, 80053, -44424, -5235, 39533, 17002, -26141, -44636, -54369, -87175, -58718, -91090, -157208, -130070, -64756, -57925, -121053, -89943, -36993, -33289, 17804, -806, 10382, -52682, -66195, 5632, -31579, -89514, -73750, -33747, -40537, -28536, -15532, 830, 16856, 48016, 73082, 61095, 9209, -58435, -18682, 17373, 22712, 18380, 49861, 60496, 4788, -72703, -103395, -45652, 14219, 41409, 62089, 26702, 9083, 31741, -15564, -1498, 9498, -19306, -51588, -56372, -49234, -12068, -35688, -29706, 5152, -28651, -7856, -14623, -33997, -6883]
7420f883l651n0121j902J1846j5574n6975k1228M2761L4618Q8718J8879L839l6152
7407H175m0259n0481N2950Q7949p1578j1403N8473J0890p1638j8344j1661J3553
7395d3374J583N830m3397N0365L8462K1921j808k3593j1323j3508q214K9006P987
7382I937L0170J274n8463o9465j6053N5404L4938P0424M7515j9911m141j1018
7370G0611n3881K4795j4056l2776k0630m8148j90M1373k8794k3309q781J7100
7358g6686k0906J0902K1203K8701n5091o136j0620N2857K7644L3898k7342l3849
7346e5425N2808q877l5409J6688N7871j0655N7948L2789Q089l1976p6109o8242
7334f0500N944p5568j5919N9633K4161L0788N6922j3345N9972N497p9843N6399
$$ y = [-6883, -10534, -60655, -62557, -50711, -66285, -123260, -144488, -101727, -67109, 21609, 40488, 44327, 8175, -32084, -82565, -29615, 58334, -13244, -24647, 33826, 44716, -26922, -45266, -56927, -43374, -41791, -35961, -79358, -28993, 9469, 31390, 29582, 5989, -5334, -18842, -27056, 1950, 9937, 40107, 41381, -17082, -86547, -102600, -47196, -12258, 58166, 105681, 85770, 81629, 70611, 16730, 41525, 27469, -5307, -25937, -74085, -74275, -32902, -61696, -85005, -93786, -76686, -97592, -86690, -65487, -36786, -91877, -98013, -108633, -55776, -28132, 5766, -21576, -55425, -2617, -11494, -46903, -30215, 27656, 17001, 74949, 107738, 115827, 83851, 7742, -60500, -54556, -130124, -146043, -86410, -62249, -31461, 25461, 12116, 72088, 77585, -2258, 54141]
7322E4141N6139r54j3865j8185j9768m9446N852P129j3479l9103l5928m498J449
7309g0516l0785L2105M8579R946p791J2684m4584p9190P2476O6142n811l5433
7297c2178m8477L8677M6812K0762m4345j6150K3627K1206j4096N159o5687j3005
7285g7695P1944J2500k5426O5306J5756k9818j2709p593J4977m0866N121J8696
7273A0193n3108K46N7206N6273l3788o7707m7306J6210M6992o327k927j4509l4488
7260g3040M3676o9066m1115j0320J5018N4784J6151P2466l1485o0951M6324M1825
7248D267O680k7788M2203Q843k8787q559j5364k7336j6053L5683J9915j2352K4100
7235E452j6987l3918j0066M2786K9028k2540Q1989K3803N381j0838o9995o9275
$$ y = [54141, 110280, 109326, 95461, 77276, 57508, 8062, 13914, 21043, 7564, -31539, -67467, -71965, -70516, -101301, -69196, -20617, -10671, -18462, -5778, -50362, -129552, -57076, 9066, 3255, -32178, -80655, -41978, 4834, 25596, -18749, -34899, -11272, 9934, -4162, 997, -64690, -77695, -5751, 6749, -18677, 46629, 62385, 32567, 19858, 12265, 27242, -13624, -8503, 10193, -42915, -42669, 14537, 70810, 37022, -30685, -77991, -61781, -14789, -21116, -24043, -38552, -73040, -29364, -98430, -139545, -149865, -134847, -80063, -63912, 8554, -22931, -83882, -37558, 4267, 10947, -16841, 25362, 34205, 5418, -3141, -18505, -45841, -61894, -26211, -6296, -18648, 5452, -11535, -45453, -55519, -12733, 16295, -6245, 75744, 99547, 104928, 94090, 24095, -45180]
7223d5180M7892j6703N2800R2231J8432m2692j0604J0440k5004o4480n1721m2177
7211g6766M4880K5032p8694J7654N0668J5623n8789m9116K5463O757l4921J949
7199a10260P2435K3482j9014p3626J6536r693k076L0655J1607j6157J1502L7889
7187b6720M1482L1559M0979l2162l8983J5934k297N2567k2865p6728k6347K304
7175d1277J3493l614l6079J2856J8300L0691O131J817K4033l8660m0306m8043
7163a00658J7691O3575N5530j2985K5850m1224k3832l5562Q022l831J1492k8913
7151f4845m8440K0646O5224J5737n0839n1747N3985O1283N6522M3377l1331l0534
7139C9038L3105J8702N213l0466l3807n3845P049j4866M2881O7077m2571n2624
$$ y = [-45180, 2712, -13991, 38809, 131040, 149472, 106780, 96176, 106616, 81612, 17132, -34589, -76766, -31886, -6854, -85548, -67894, -17226, -1603, -60392, -109508, -84045, -77288, -112209, -110260, -37825, -14343, -33357, -106983, -90447, -100140, -102216, -71561, -59954, -76111, -64609, -26720, 14762, 46321, 87300, 55138, 16155, 32089, 29792, 82359, 59494, -17234, -43581, -41277, -27784, -31398, -67477, -54621, -36321, -5630, 501, 2318, 26351, -12309, -52615, -100658, -82967, -19392, 36138, 23153, 49003, 7779, -16053, -51615, -43593, -47424, -35932, -64845, -113285, -92639, -27415, -11678, -62517, -114264, -60279, 1004, 57526, 100903, 69572, 39038, 72143, 90845, 96058, 65592, 31785, -22060, -15011, -29877, 13004, 80081, 37510, -15114]
7127a5114j7407p2446r547J3104K7469L6471K5840N516J3632k6151j3573O4244
7115C2038M3956m8330n5769m4493M9389J3475L7340r813K8535j9317m2641o1278
7103g6908r2250N4574R8221R2557q175L0832k6355j4478J6164j0125k8502m0193
7091d638J5393J6456N1485k9213P563L500k045n828K5581K9779l2755l9660j68
7078C5450J2510k1333p0453o7279O1104O0091N1555m532l1943j0714M9099j7525
7066D6030n5541j8700P128K5003j1981p42R575Q963L2945l7240L141K7528p2717
7053c6608p1626L7359l7400j2367P0636N3598k9486m252r658k9107r002M2210
7041c5703N7012k002j7639k781L4514M4355L1969k9645r931l4097l4686J1774
$$ y = [-15114, -32521, -104967, -114514, -101410, -73941, -37470, -11630, -6114, 7518, -18633, -32206, 32038, 75994, 27664, -28105, -72598, -23209, -9734, 27606, 17793, 46328, 27011, -15630, -76908, -169158, -114584, -16363, 76194, 68019, 98851, 72496, 58018, 74182, 64057, 35555, -4638, 10755, 27211, 78696, 49483, 57046, 60546, 58501, 52673, 78254, 108033, 75278, 35618, 35450, 47960, 26627, -43826, -111105, -50001, 10090, 61645, 57113, 25170, 14456, 63555, 46030, -9511, -28211, -21083, 3920, -8061, -8803, 772, 9735, 42680, 5440, 8581, 36109, -36608, -108234, -70875, -108275, -120642, -50006, 3592, -25894, -30146, -39804, -68911, -77913, -35703, 21309, 19307, 1668, -1113, 33401, 77756, 109725, 80080, 70149, 36052, 1366, 13140]
7029A3140j375n7418L712O4755k9878j1798M1091N187k4283r324M1160j4438R659
7016C0190J0713J2681J3430k2713J6082L547K2211l9047j5090j6481p455N0384
7004E8452j9236n3183P045M4528N78j3990j8780P815l2015m1580j4305N8095k5787
6991d2363O9263R1027m6052m1510n2961K5146j6684r786M1052k0351l6441l577
6979d3237L795k0414j3948J4556N3424k8020k5763o686k3861P8798M7926J1615
6967D8185j5132l3981L6115l7385J2922P9k0730J1817m1126m7099L7305N1603
6955B573O85L0846k8594m8843Q195K6417j1363j9209Q132j9919p3615k9910K0599
6942a34006K4626P6940J2081j1344O3753O3622k8560L7652J7165k9259q1692o9943
$$ y = [13140, 11765, -45653, -41941, 22814, -7064, -18862, 22229, 27416, 3133, -6191, 34969, 20531, 30190, 40903, 53584, 67014, 44301, 60383, 63930, 86141, 47094, 32004, 15523, 8068, 58452, 39216, -13967, -6922, 37606, 38184, 24194, 5414, 13229, -18786, -60366, -74671, -16576, -42363, 26900, 117927, 71875, 30365, -22596, 2550, -14134, -23920, 17132, -3219, -39660, -43237, -39442, -59856, -73804, -59248, -5824, -33844, -59607, -66293, -90154, -11356, 36570, 48185, 33053, -928, 35187, -2198, 10724, 10803, -9927, 1890, -39236, -86335, -49030, 2573, 3258, 34104, 5510, -43333, -35138, -8721, -20084, -39293, -31161, -51080, -124695, -154605, -134006, -109380, -32440, -20359, -31703, 32050, 95672, 67112, 104764, 121929, 92670, 10978, -58965]
6930e8965K0690N4656j0257o197N2106J8154n6768m7662J134J8666j194l3719
6918d9356l9908j1420k4922N48L1509l79P890J7000N2888j9265j7222N916K8530
6905a8191N7684O978n7775p3182L4148O8260L0665N1552l4049m4870m5517J8141
6893f156j3571o1119J9545M9153k4801j8968L6901j3593l0248j879O1981M5697
6881D2942m1184m157N0825q736r5788j8513M8323k077k7486l787K4102J8078K4110
6868F652k5187l4164j3853j0908L0017j5392K6002p4120j4501M7072Q311k6179
6856i6250K9174K7534p847N633Q3928J8663N3353J0277j7941n3006k048m064j0418
6843C6988K4472J327k8511l7736l5354K123K5219J4336L0446J764j4701l3178
$$ y = [-58965, -38275, 16381, 6124, -73, 52033, 70187, 13419, -34243, -33109, -14443, -15637, -49356, -89264, -100684, -125606, -125058, -93549, -93928, -86038, -69038, -16150, -35415, -52637, -46721, -18191, 39493, 46471, -11304, -84486, -50338, 17922, 48587, 100139, 66090, 21220, -24297, -6156, -19727, -80846, -61301, -12148, -36949, -55917, -19016, -32609, -62857, -64736, -2755, 42942, 1758, -2399, 48426, 39690, -56098, -74611, -26288, -28365, -55851, -59638, -35536, -17458, 6652, -18535, -52699, -66552, -77460, -47443, -62835, -36833, -110953, -125454, -78382, -70071, -96250, -67076, -39542, -47389, -41756, 42172, 60835, 114188, 124465, 106524, 53518, 51470, 47406, 36988, 61460, 62787, 34276, -3460, -38814, -36691, -11472, 2864, 33310, 35074, 20373, -12805]
6831a2805N159M2904L6838O3260k6388q6300Q710K491N0073k2396m5407j2518
6819C621j6384q227K9465j7639K0819J3338L3290o5m8217l923L4442J3871o4603
6806a0212r8303k8180Q3936Q0138P123o6781K3315L096K483O0656L5317m3128
6794D9460n5884m1529M840J7976Q021r63K055K5823O1957j7370l7621n3788K425
6781c4598J2250k1530k2874N0885O410K8114N9869l61o838K4450n995j7824J4438
6768H6396l8831j8815j8118l80o8543l0784k6007J4462J04682L2800l7620K6040
6756B5282k7767N803J1239n7P589k0095k4652R470N0918k1931j1326k1864J4996
6743b395L7848k2620J4241K3026o7504k9251l2274k5941L6579n330P8944r651
$$ y = [-12805, -7646, 35258, 72096, 135356, 108968, 22668, 31378, 33869, 83942, 61546, 16139, 3621, -12763, -20990, 8475, -9164, 11655, 24993, 58283, 58218, 10001, 6078, 40520, 54391, -10212, -108515, -136695, -52759, 27379, 34502, -32279, -8964, -5868, -3385, 57271, 92588, 49460, -6424, -47953, -43113, -25137, -17116, -18079, -16024, 9799, 71756, 54386, 16765, -37023, -34598, -22348, -43878, -66752, -15867, -9457, 18657, 78526, 78165, 71327, 95777, 89782, 71958, 86396, 47565, 28750, 10632, 10252, -58291, -89075, -115082, -100620, 4062, 36862, -758, 25282, -2485, 3318, 14557, 14500, 22089, 1994, -22658, -13188, 37730, 15799, 4473, -17391, -2395, 35453, 12833, 27074, 50100, -17404, -46655, -78929, -104870, -68291, -73621, 5323, -4328]
6731d328j4340l2293N3995o674P184k7881l8181K0944N312j9451l550L2915N8288
6718C1940p0624n1396N7139Q427o467J6382m4594j5708N5963K9761k825j7507
6706i509J6301j0305J5544P0003q1138q2240M5602L3552K6047l5470n8597O1871
6694h339K3706k3946l6537o8174j8022L1721L6259J6481J1859L3711j2709j0212
6682b4202k5611n163J0187o400n343M247K712k8651r770K0424J428n0613J3254
6669a03501K9012K7405k7193k3582j371M312R421j9541L7538L4933n95j907m6691
6656h1760J4139N9054K7104M2133j5003l2489l2059N712k8426j2757l8391K9535
6644f3208K1598k4909K8085M9694l096q35K378K6872M901L5501n4304o852J7410
$$ y = [-4328, -18668, -50961, 3034, -3640, 3544, -24337, -62518, -41574, -36262, -55713, -59263, -26348, 31940, -38684, -90080, -32941, -24514, -30981, -14599, -59193, -74901, -18938, 10823, 7998, -9509, 6792, -3513, 12031, 82034, 896, -81344, -35742, -2190, 23857, -11613, -70210, -8339, 15367, -8579, -45116, -113290, -131312, -99591, -63332, -46851, -34992, -1281, -13990, -24202, -49813, -54976, -44789, -51189, -56532, -52285, -49573, -78224, -87994, -67570, -66142, -116755, -103501, -74489, -47084, -74277, -97859, -99230, -94918, -85497, -105038, -67500, -32567, -33162, -35069, -81760, -67621, -8567, 18537, 60670, 45667, 13178, -18881, -13169, -41595, -54352, -92743, -63208, -41610, -66519, -38434, 11260, 8164, 7329, 9707, 36579, 41480, 76981, 22677, 15825, 33235]
6631C3235p414m8071l8976J8392j9240L8500N5180l9873j0012r030K5970m5071
6619d6410N8277N5467j5612l2616k4629n6062L758P886k1257k2596j0044n297
6607a09135M2535J2225J2278q156l0112m2630K23P0109m5614k6112J9922J1676
6595i2791O035K6481K4827Q28M254j4474l6524k1740j2528j9346J0991O2248M2715
6582a9024J891O954k034j2845J0407j6455k7724q60N6464M0383J2283M5776j8475
6569G6741k9381Q983l8146m8481J4956m446K0805O3638k9761j8585K4036M419
6557D4778m4319j0483K0567k3697J5904L1273M20p292L968n8548k9672j7712n7827
6544a32640M1138j8305K9185M7102M7520J7561o2821K4200J2282N071j9842M0339
$$ y = [33235, 25821, -22250, -61226, -42834, -62074, -23574, 31606, -8267, -18279, -27309, -1339, -46410, 11867, 67334, 51722, 19106, -5523, -61585, -57827, -49941, -71198, -93794, -103838, -109135, -66600, -54375, -42097, -50253, -80365, -122995, -122772, -52663, -98277, -124389, -104467, -92791, -86756, -60275, -35448, -34620, -30366, -44840, -81364, -103104, -115632, -134978, -123987, -61739, -19024, -17133, -10179, -12213, -25058, -14651, -31106, -58830, -59690, -3226, 37157, 49440, 95216, 76741, 47360, 56343, 18197, -30284, -15328, -19774, 1031, 64669, 34908, 16323, 40359, 44778, 459, -10024, 10543, -13154, 2750, 34023, 34443, 27151, 31119, -27429, -57101, -74813, -132640, -91502, -109807, -80622, -33520, 14000, 31561, -31260, -7060, 5222, 10293, -9549, 30790]
6532C0790k249l0417k4018O108J8304l8373m8107J1893M5437o014o8757K4475
6520h0928K0447R604n198L1516K6076j5715J0220R376N6497M136l8482k1973l3841
6507b8265N568J8886L2345k6480M8270J2919L5266k5496J0313M2904p7489j1358
6495C7383j4180m0370m5653K4731J1798p548P012l388n7195J1183L5146J2464
6483b8617l5246j9084L5172L1161m89L2097n5794l4117L0227M2578L5663O473
6471D0024r025m0818l5070j627j9992r001k7395k3695J6863L3081K8191L4264
6459a4200K6471O836L1575L6401l493n7499o6375k7431L7840O4539L1926L407
6447F9997o9241k8737n7073l9980R4228K1686q537J1932o376L1070L2160M3m3015
$$ y = [30790, 28541, -1876, -25894, -19786, -1482, -39855, -87962, -76069, -30632, -36646, -105403, -80928, -60481, -50877, -56075, -24559, 1517, -14198, -3978, 5398, 61895, 66031, 27549, 5576, -28265, -22697, -3811, 28534, 2054, 50324, 63243, 98509, 73013, 83326, 126230, 48741, 37383, 23203, -17167, -62820, -38089, -26291, -33839, -26827, -30215, -87410, -76227, -41081, -28617, -63863, -82947, -47775, -16614, -17103, 14994, -40800, -74917, -44690, -2112, 33551, 40024, 30999, -9819, -44889, -46516, -66508, -75509, -102904, -126599, -109736, -76655, -48464, -14200, 12271, 19107, 50682, 87083, 83590, 26091, -40284, -67715, -29875, 34664, 66590, 69997, 756, -27981, -85054, -125034, -30806, -9120, -17657, -5725, -12101, 18969, 51129, 51172, 8157]
6434H157k1685l20J1958L8701l5069j8864r128Q213N4395k567N542j3124K7231
6421E3440m7681r176J0111k0654n1189N46Q68J6875L4996l0820j3429M4858k234
6408a3489P913L7352q433l7077L7904j0918J3242p4101n972j6950N778N0357j9324
6395c3718N3909L4270k3609M4607j692N923k0219l5445r521k9828q337L6560k9974
6382a7074o2050o9263J0278O1124O9966k1270m6979N4531N1667M6540n600L298
6370G5168m9592k9461j4148j2178M9846J4459l1178M0757r107k0141M3155L7526
6358I5106J2481j3168k7276L033m4128k9230J7538m5657j7867J2835K6224q4470
6346i4579k2671N0272O7130Q6147o428r038n5843k6596P182K9219L2387k958j0471
$$ y = [8157, -13528, -13848, -1890, 36811, 1742, -17122, -26250, -18037, 36358, 33791, 39333, 26209, 53440, 5759, -3417, 6694, -13960, -65149, -64603, -63735, -46860, -11864, -42684, -56113, -11255, -13489, -5576, 31776, 23343, -13734, 24170, 13252, 26494, -47607, -53579, -70529, -64751, -14394, -33718, 20191, 54461, 30852, 75459, 73767, 79690, 59471, 24026, 14505, -15323, -23660, 12900, -17074, -79124, -148387, -138109, -76985, -7019, -28289, -75268, -20737, 30930, 77470, 71870, 75168, 25576, -3885, -18033, -30211, 19635, 34094, 2916, 43673, 34566, 14425, 57580, 95106, 107587, 94419, 67143, 70176, 26048, -3182, 14356, -31301, -49168, -36333, -10109, -94579, -117250, -66978, 152, 86299, 79871, 70833, 14990, -11606, -4424, 24795, 57182, 54224, 43753]
6333D3753k4552q642j3238k9157n3170L6617N272N910m42K4382O1774R521n3109
6320D919j1110L1444l4277k832K5921n059j2793J4973Q1593Q4882o9907q0600
6308B7154n2503L4564L6233q059l8891k3388m425L9180N2643k6777J4324N9673
6296A09728o9319j16341m0147J8398J07048q938o6063M0339N0724R162K5152k9972
6284B9771n2247l0644j936K1073q060p156K7077K7632j7028J0591l1493J0029
6272b2391K3437M6577J1293k6516p2335K4471k0113m2522m2038K6806R0691N0453
6260D7813L5319K5168o3317k0175l3731j5069l8125k2377M8180L4568k0595j20
6248b2461j3864M7935K8241J2221m7967P1904l3655l6247O770L4208j9521m2879
$$ y = [43753, 19201, 10559, -2679, -31836, -85006, -48389, -43117, -37207, -37649, -13267, 48507, 58028, 4919, -6191, 25253, -9024, -11856, 14065, 9006, -3787, 11186, 92779, 177661, 107754, 27154, -25349, 9215, 45448, 37389, -1502, -24890, -29315, 9865, 62508, 35731, 50055, 109728, 40409, -75932, -116079, -97681, 9367, 429, -65634, -25295, 25429, 34591, 59743, 29771, -22476, -53120, -55056, -33983, -42043, -49199, -22122, 5510, -11518, -927, -32420, -22391, 1046, 47623, 58916, 32400, -39935, -15464, -35577, -78099, -120137, -93331, -2640, 47813, 83132, 108300, 44983, 24808, -8923, -23992, -62117, -84494, -36314, -1746, -22341, -22461, -36325, 11610, 39851, 52072, 4105, 76009, 42354, 6107, 12877, 47085, 27564, -15315]
6236a5315q97J9590k3759k2996L2905J0810l2788M6856l0477J8454M76k6632m3005
6223f6778K0177N0939l4348p4883j505L2928J7856M7505M3748j9893j354m7765
6211c3373n7521j5815Q8798n14j07796l5099K4707R9376K6657k3763j3098j3659
6199f1100k3972J3115M4280K2159k8307n2980m1573L0149N0225k0201j1863j2425
6187i2493j9273N1332M5194O358J9081k0001m7944o7248l681P9591Q3652K5877
6175F0445m0017o9901J547L4491L861J805j5127k6217j4118J4197O5495M5288
6163F1749o456j3367j4895m375J0864J04403m4436O03m2956p4301L0115q054m4630
6150d5736R2859M4076m6172m0695M2592O0687l8032k7006m9958J3706j3259l6249
$$ y = [-15315, -16212, 3378, -20381, -43377, -10472, 338, -32450, 14406, -16071, 2383, 2859, -23773, -66778, -46601, 4338, -30010, -104893, -106398, -73470, -55614, -8109, 35639, 15746, 14392, -33373, -90894, -106709, -17911, -18425, -126221, -161320, -136613, -37237, -10580, -34343, -47441, -61100, -85072, -71957, -27677, -5518, -33825, -86805, -128378, -98229, -48004, -68205, -80068, -92493, -111766, -60434, -15240, -8882, 10199, -9802, -57746, -124994, -128675, -49084, 34568, 60445, 20428, -49473, -47926, -13435, -9574, -7769, -22896, -49113, -63231, -49034, 16461, 61749, 55293, 41926, 27031, 22656, 33520, 137923, 93487, 94090, 51134, -23167, 6948, -1106, -45736, 47123, 91199, 45027, 4332, 46924, 107611, 69579, 42573, -7385, 6321, -6938, -43187]
6138d3187o93p4179m3017P7268N7893o17K1180j7135k7445L0372O704n4783N900
$$ y = [-43187, -43880, -118059, -161076, -83808, -25915, -26532, -5352, -22487, -49932, -19560, -12856, -67639, -61739]
$$ [...]
##END NTUPLES=NMR SPECTRUM
##END=
