##TITLE=Analysis number 311564
Compound Code sb 00905
Project Code adrs
Chemist Name stores
##JCAMPDX= 6.0         $$ Bruker NMR JCAMP-DX V2.0
##DATA TYPE= NMR SPECTRUM
##DATA CLASS= NTUPLES
##ORIGIN= Bruker BioSpin GmbH
##OWNER= NMR
$$ XWIN-NMR		Version 3.5
$$ Mon Jul 18 23:59:27 2005 GMT Daylight Time (UT+1h)  MAYBRIDGE\NMR@NMR_250MHZ
##.OBSERVE FREQUENCY= 62.9015280498526
##.OBSERVE NUCLEUS= ^13C
##.ACQUISITION MODE= SIMULTANEOUS (DQD)
##.ACQUISITION SCHEME= undefined
##.AVERAGES= 5000
##.DIGITISER RES= 17
##SPECTROMETER/DATA SYSTEM= dpx250
##.PULSE SEQUENCE= jmod
##.SOLVENT NAME= CDCl3
##.SHIFT REFERENCE= (INTERNAL, CDCl3, 0, 219.717)
##AUDIT TRAIL= $$ (NUMBER, WHEN, WHO, WHERE, WHAT)
$$ ##TITLE= Audit trail, XWIN-NMR		Version 3.5
$$ ##JCAMPDX= 5.01
$$ ##ORIGIN= Bruker BioSpin GmbH
$$ ##OWNER= NMR
$$ C:\u/data/dgb/nmr/ADRS/5980/pdata/1/auditp.txt
$$ ##AUDIT TRAIL=  $$ (NUMBER, WHEN, WHO, WHERE, WHAT)
(   1,<2005-07-18 23:58:57.16 +100>,<MAYBRIDGE\NMR>,<NMR_250MHZ>,
      <created by zg, POWCHK disabled, PULCHK disabled
       configuration hash MD5:
       62 19 C7 07 E1 42 D1 B7 37 6C 3D D0 77 39 F9 E6
       data hash MD5: 64K
       B5 1B 02 C7 3D 80 BB F6 61 4E 4B E3 B5 F3 D2 5D>)
(   2,<2005-07-18 23:59:13.18 +100>,<MAYBRIDGE\NMR>,<NMR_250MHZ>,
      <Start of raw data processing
       ef LB = 1 FT_mod = 6 PKNL = 1 SI = 32K 
       data hash MD5: 32K
       F1 7D CF B2 AD 60 CB 0C EC 37 F2 D6 D6 FF 7E EA>)
(   3,<2005-07-18 23:59:14.58 +100>,<MAYBRIDGE\NMR>,<NMR_250MHZ>,
      <apk 
       data hash MD5: 32K
       CB BD E8 A6 2C 6A 54 C8 D9 56 9F A1 C5 08 D7 71>)
(   4,<2005-07-18 23:59:15.44 +100>,<MAYBRIDGE\NMR>,<NMR_250MHZ>,
      <abs ABSG = 5 
       data hash MD5: 32K
       FF 93 B2 D7 40 FC 79 D1 55 33 52 9E ED C3 8C 6C>)
$$ ##END=
$$ 
$$ hash MD5
$$ FE 72 E5 B8 D8 2E D3 50 52 FE 47 C3 E4 CF 60 80
##$RELAX= 
##$RELAX= 
##$RELAX= 
##$RELAX= 
##$RELAX= 
##$RELAX= 
##$RELAX= 
##$RELAX= 
$$ Bruker specific parameters
$$ --------------------------
##$DU= <C:\u>
##$EXPNO= 5980
##$NAME= <ADRS>
##$PROCNO= 1
##$TYPE= <nmr>
##$USER= <dgb>
##$AMP= (0..31)
100 100 100 100 100 100 100 100 100 100 100 100 100 100 100 100 100 100 
100 100 100 100 100 100 100 100 100 100 100 100 100 100 
##$AQSEQ= 0
##$AQ_mod= 3
##$AUNM= <au_zg>
##$AUTOPOS= <46 >
##$BF1= 62.895239
##$BF2= 250.13
##$BF3= 62.895239
##$BF4= 62.895239
##$BF5= 500.13
##$BF6= 500.13
##$BF7= 500.13
##$BF8= 500.13
##$BYTORDA= 1
##$CFDGTYP= 0
##$CFRGTYP= 5
##$CHEMSTR= <none>
##$CNST= (0..31)
1 1 145 1 1 1 1 1 1 1 1 1 1 1 1 1 1 1 1 1 1 1 1 1 1 1 1 1 1 1 1 1 
##$CPDPRG= <waltz16>
##$CPDPRG1= <>
##$CPDPRG2= <waltz16>
##$CPDPRG3= <>
##$CPDPRG4= <mlev>
##$CPDPRG5= <mlev>
##$CPDPRG6= <mlev>
##$CPDPRG7= <mlev>
##$CPDPRG8= <mlev>
##$CPDPRGB= <>
##$CPDPRGT= <>
##$D= (0..31)
0 2 0.003571429 0 0 0 0 0 0 0.06 0 0.03 2e-05 4e-06 0 0 0.0002 0 0 0 0.006896552 
0 0 0 0 0 0 0 0 0 0 0 
##$DATE= 1121727526
##$DBL= (0..7)
120 120 120 120 120 120 120 120 
##$DBP= (0..7)
150 150 150 150 150 150 150 150 
$$ [...]
##$SUBNAM7= <"">
##$SUBNAM8= <"">
##$SUBNAM9= <"">
##$SW= 239.425677416285
##$SWIBOX= (0..15)
0 1 3 0 0 0 0 0 0 0 0 0 0 0 0 0 
##$SW_h= 15060.2409638554
##$TD= 65536
##$TD0= 1
##$TE= 295.16
##$TE2= 300
##$TE3= 300
##$TEG= 300
##$TL= (0..7)
0 120 120 120 120 120 120 120 
##$TP= (0..7)
150 150 150 150 150 150 150 150 
##$TP07= 0
##$TPNAME0= <>
##$TPNAME1= <>
##$TPNAME2= <>
##$TPNAME3= <>
##$TPNAME4= <>
##$TPNAME5= <>
##$TPNAME6= <>
##$TPNAME7= <>
##$TPOAL= (0..7)
0.5 0.5 0.5 0.5 0.5 0.5 0.5 0.5 
##$TPOFFS= (0..7)
0 0 0 0 0 0 0 0 
##$TUNHIN= 0
##$TUNHOUT= 0
##$TUNXOUT= 0
##$USERA1= <user>
##$USERA2= <user>
##$USERA3= <user>
##$USERA4= <user>
##$USERA5= <user>
##$V9= 5
##$VALIST= <valist>
##$VCLIST= <CCCCCCCCCCCCCCC>
##$VD= 0
##$VDLIST= <DDDDDDDDDDDDDDD>
##$VPLIST= <PPPPPPPPPPPPPPP>
##$VTLIST= <TTTTTTTTTTTTTTT>
##$WBST= 1024
##$WBSW= 4
##$XGAIN= (0..3)
0 0 0 0 
##$XL= 0
##$YL= 0
##$YMAX_a= 2910248
##$YMIN_a= -3209336
##$ZGOPTNS= <>
##$ZL1= 120
##$ZL2= 120
##$ZL3= 120
##$ZL4= 120
##$ABSF1= 219.7173
##$ABSF2= -19.73232
##$ABSG= 5
##$ABSL= 3
##$ALPHA= 0
##$AQORDER= 0
##$ASSFAC= 0
##$ASSFACI= 0
##$ASSFACX= 0
##$ASSWID= 0
##$AUNMP= <proc_1d>
##$AZFE= 0.1
##$AZFW= 0.5
##$BCFW= 0
##$BC_mod= 0
##$BYTORDP= 0
##$COROFFS= 0
##$CY= 12.5
##$DATMOD= 1
##$DC= 0
##$DFILT= <>
##$DTYPP= 0
##$F1P= 219.217194556009
##$F2P= -20.2323013418194
##$FCOR= 0.5
##$FTSIZE= 32768
##$FT_mod= 6
##$GAMMA= 0
##$GB= 0
##$INTBC= 1
##$INTSCL= 1
##$ISEN= 30
##$LB= 1
##$LEV0= 0
##$LPBIN= 0
##$MAXI= 10000
##$MC2= 0
##$MEAN= 0
##$ME_mod= 0
##$MI= 0
##$NCOEF= 0
##$NC_proc= 2
##$NLEV= 6
##$NOISF1= 0
##$NOISF2= 0
##$NSP= 0
##$NTH_PI= 0
##$NZP= 0
##$OFFSET= 219.7173
##$PC= 1.4
##$PHC0= 198.7053
##$PHC1= -3.622731
##$PH_mod= 1
##$PKNL= yes
##$PPARMOD= 0
##$PSCAL= 4
##$PSIGN= 2
##$REVERSE= no
##$SF= 62.895239
##$SI= 32768
##$SIGF1= 0
##$SIGF2= 0
##$SINO= 80
##$SIOLD= 32768
##$SREGLST= <13C.CDCl3>
##$SSB= 0
##$STSI= 32768
##$STSR= 0
##$SW_p= 15060.2409638554
##$SYMM= 0
##$S_DEV= 0
##$TDeff= 65536
##$TDoff= 0
##$TI= <Analysis number 299884
Compound Code cd 11282
Book Reference complaint >
##$TILT= no
##$TM1= 0
##$TM2= 0
##$TOPLEV= 0
##$USERP1= <user>
##$USERP2= <user>
##$USERP3= <user>
##$USERP4= <user>
##$USERP5= <user>
##$WDW= 1
##$XDIM= 32768
##$YMAX_p= 303723512
##$YMIN_p= -231577623
$$ End of Bruker specific parameters
$$ ---------------------------------
##NTUPLES= NMR SPECTRUM
##VAR_NAME=  FREQUENCY,     SPECTRUM/REAL,   SPECTRUM/IMAG
##SYMBOL=    X,             R,               I
##VAR_TYPE=  INDEPENDENT,   DEPENDENT,       DEPENDENT
##VAR_FORM=  AFFN,          ASDF,            ASDF
##VAR_DIM=   32768,         32768,           32768
##UNITS=     HZ,            ARBITRARY UNITS, ARBITRARY UNITS
##FACTOR=    0.459616106566222, 1,           1
##FIRST=     13819.1721220387, 0,            0
##LAST=      -1241.06884181672, 0,           0
##MIN=       -1241.06884181672, -231577623,  0
##MAX=       13819.1721220387, 303723512,    0
$$ Real data points
##PAGE= N=1
##DATA TABLE= (X++(R..R)), XYDATA
$$ [...]
$$ plain form
9509 886980 1303137 1272830 1147937 972284 523123 426818 -86390 74055 296819 213208
9499 213208 553970 608949 49107 -176693 -81759 -120402 -838040 -869202 -1147804 -831544
9489 -831544 -301587 -273552 -460100 -283475 -715444 -940178 -1096212 -982190 -1027193 -866228
9479 -866228 -628023 -691528 -771372 -508111 -395455 -212531 51605 -229781 -840853 -1167723
9469 -1167723 -751587 -192000 -44509 -6071 245287 265986 659037 822290 691145 294736
9459 294736 -4195 -42308 -617063 -891950 -563328 -347243 -453975 -188030 422045 1357961
9449 1357961 1165568 1032037 724566 -204166 -59569 206625 394815 544882 -83221 -339451
9439 -339451 -418237 -381186 -29580 1195917 1558871 1055642 367661 62659 -466156 -207925
$$ packed form
9509H86980M16157l0307j24893j75653m49161r6305n13208J60445K22764q3611
9499B13208L40762N4979n59842k25800R4934l8643p17638l1162k78602L16260
9489h31544N29957K8035j86548J76625m31969k24734j56034J14022m5003J60965
9479h66228K38205o3505p9844K63261J12656J82924K64136k81386o11072l26870
9469a167723M16136N59587J47491L8438K51358K0699L93051J63253j31145l96409
9459B94736k98931l8113n74755k74887L28622K16085j06732K65945O10075R35916
9449A357961j92393j33531l07471r28732J44597K66194J88190J50067o28103k56230
9439c39451p8786L7051L51606J225497L62954n03229o87981l05002n28815K58231
$$ plain form
9429 -207925 830824 1054103 288623 51996 145282 -365297 156261 294212 -181875 254451
9419 254451 528434 452719 326818 761244 183323 271827 769355 746590 619768 337818
9409 337818 576340 508053 62110 -157608 -151397 -123871 146786 845425 1235691 1152499 1122033
9398 1122033 504105 47528 -71924 -528208 -859397 -778581 -805859 -1763221 -2609672 -1940038
9388 -1940038 -666037 -340703 -314257 -24438 499550 196619 659089 1323088 1306605 1146369
9378 1146369 428081 -144049 -73227 -41701 -299865 -203190 -5326 21463 113837 168789 294838
9367 294838 -230567 -695459 -461677 383721 717307 382843 144250 -320696 -158216 329354
9357 329354 454598 449856 381338 -194855 -79305 -27381 -379113 -322355 20845 264065 393936
$$ packed form
9429b07925J038749K23279p65480k36627R3286n10579N21558J37951m76087M36326
9419B54451K73983p5715j25901M34426n77921Q8504M97528k2765j26822k81950
9409C37818K38522o8287m45943k19718O211K7526K70657O98639L90266q3192l0466
9398A122033o17928m56577j19452m56284l31189Q0816k7278r57362q46451O69634
9388a940038J274001L25334K6446K89819N23988l02931M62470O63999j6483j60236
9378A146369p18288n72130P0822L1526k58164R6675J97864K6789R2374N4952J26049
9367B94838n25405m64892K33782Q45398L33586l34464k38593m64946J62480M87570
9357C29354J25244m742o8518n76193J15550N1924l51732N6758L43200K43220J29871
$$ plain form
9346 393936 -528392 -1001692 -509134 -119643 102357 221995 -30015 -546792 -412410 45857
9336 45857 366205 891562 1040376 673159 423477 128162 -226950 -531980 -576308 -843442
9326 -843442 -966773 -546811 204010 432990 -64861 -7029 322818 90 -391889 -248244
9316 -248244 -161702 -551789 104798 770363 342281 110263 -112035 -770511 -1225541 -964366
9306 -964366 -915956 -363542 -326978 -619457 -545042 -482233 -281012 281144 874377 281199
9296 281199 -128800 -731971 -859979 -693010 -251209 -84801 -521251 -419244 149700 446292
9286 446292 305086 259115 -93855 -527796 -185575 427241 387912 -444274 -2130975 -3927162
9276 -3927162 -3407693 -1794740 -1140836 -478304 -269347 -59860 -226612 -264023 -170883 -679200
$$ packed form
9346C93936r22328m73300M92558L89491K22000J19638k52010n16777J34382M58267
9336D5857L20348N25357J48814l67217k49682k95315l55112l05030m4328k67134
9326h43442j23331M19962P50821K28980m97851N7832L29847l22728l91979J43645
9316b48244Q6542l90087O56587O65565m28082k32018k22298o58476m55030K61175
9306i64366M8410N52414L6564k92479P4415O2809K01221N62156N93233n93178
9296B81199m09999o03171j28008J66969M41801J66408m36450J02007N68944K96592
9286D46292j41206m5971l52970m33941L42221O12816l9329q32186j686701j796187
9276c927162N19469J612953O53904O62532K08957K09487j66752l7411R3140n08317
$$ plain form
9266 -679200 -569267 -373232 -1076243 -1482283 -918962 -706372 -584167 -301396 142222 817871
9256 817871 662828 -349024 -1427332 -1909449 -1820776 -1013659 -71870 491253 280627 -368994
9246 -368994 -397953 -269703 -273620 185330 181483 23282 -669817 -1060270 -637183 -718942 -379910
9235 -379910 346266 977975 1559067 1854895 1652138 1822730 1103493 14135 -154521 414815
9225 414815 671610 418471 670773 501405 449215 1114618 1437590 1458513 1135169 855012
9215 855012 417133 293000 633272 186800 559230 555443 -73602 214477 1329536 1106659
9205 1106659 358961 -624293 -1078775 -376033 -16489 -489454 -616690 -945195 -810236 -709543
9195 -709543 -366369 -298241 -312643 -170901 212406 985879 939003 1046888 131828 -289778
$$ packed form
9266f79200J09933J96035p03011m06040N63321K12590J22205K82771M43618O75649
9256H17871j55043j011852j078308m82117Q8673Q07117R41789N63123k10626o49621
9246c68994k8959J28250l917M58950l847j58201o93099l90453M23087q1759L39032
9235c79910P26176O31709N81092K95828k02757J70592p19237j089358j68656N69336
9225D14815K56795k53139K52302j69368n2190O65403L22972K0923l23344k80157
9215H55012m37879j24133L40272m46472L72430l787o29045K88079J115059k22877
9205A106659p47698r83254m54482P02742L59544m72965j27236l28505J34959J00693
9195g09543L43174O8128j4402J41742L83307P73473m6876J07885r15060m21606
$$ plain form
9185 -289778 -23078 -227106 46931 -378825 -891024 -763235 -554931 -689121 -644787 -435026
9175 -435026 -361198 -573921 -931345 -476978 -581079 -353187 227203 715363 -71706 -926947
9165 -926947 -1066408 -873001 -1168639 -764401 414891 542542 -188743 -223379 -249097 -474075
9155 -474075 -531230 -763983 -407433 -857647 -1427592 -1714803 -910197 131548 215121 731605
9145 731605 722893 429248 23587 -348086 -448071 245832 350156 801205 1434778 1439288 1204992
9134 1204992 853196 828119 1093075 919555 843750 135919 264207 647062 690720 540989
9124 540989 140525 -559654 -618414 -250344 58859 390178 348860 452298 642435 153482
9114 153482 -453486 -419287 -287521 -853861 -901919 -612492 -267418 118615 -201483 -696805
$$ packed form
9185b89778K66700k04028K74037m25756n12199J27789K08304j34190M4334K09761
9175d35026P3828k12723l57424M54367j04101K27892N80390M88160p87069q55241
9165i26947j39461J93407k95638M04238J179292J27651p31285l4636k5718k24978
9155d74075n7155k32753L56550m50214n69945k87211Q04606J041745Q3573N16484
9145G31605q712k93645m05661l71673r9985O93903J04324M51049O33573M510k34296
9134A204992l51796k5077K64956j73520p5805p07831J28288L82855M3658j49731
9124E40989m00464p00179n8760L68070L09203L31319m1318J03438J90137m88953
9114A53482o06968L4199J31766n66340m8058K89427L45074L86033l20098m95322
$$ plain form
9104 -696805 -1211802 -700357 -891431 -1107579 -963736 -150371 562336 173538 58378 -381558
9094 -381558 -827029 -121301 442334 286998 324842 -229785 -1104301 -1286290 -1288138 -1936985
9084 -1936985 -1545124 -807620 -1210255 -651212 157190 105504 -507660 -205047 1086673 1522090
9074 1522090 1513125 1571817 1151600 808647 943657 967199 51043 -1061066 -837366 -378477
9064 -378477 -249998 -825660 -1349395 -1230975 -1122436 -815279 -780003 -539951 -1011048 -1198950
9054 -1198950 -864771 -311181 63204 292985 731697 932721 704645 337778 152916 -129728
9044 -129728 -403566 -306624 -453871 -546736 -737607 -517292 -177810 -62759 -563096 58764
9034 58764 -427362 -722032 -546989 -756593 -1071155 -1389074 -1109250 -700934 -86667 639640
$$ packed form
9104f96805n14997N11445j91074k16148J43843Q13365P12707l88798j15160m39936
9094c81558m45471P05728N63635j55336L7844n54627q74516j81989j848o48847
9084a936985L91861P37504m02635N59043Q08402n1686o13164L02613J291720M35417
9074A522090q965N8692m20217l42953J35010K3542r16156j112109K23700M58889
9064c78477J28479n75662n23735J18420J08539L07157L5276K40052m71097j87902
9054a198950L34179N53590L74385K29781M38712K01024k28076l66867j84862k82644
9044a29728k73838R6942j47247r2865j90871K20315L39482J15051n00337O21860
9034E8764m86126k94670J75043k09604l14562l17919K79824M08316O14267P26307
$$ plain form
9024 639640 534169 291084 -418856 -888100 -833564 -1122655 -1084593 -543345 313631 227222
9014 227222 -763528 -721957 -347937 -292843 -82482 443526 877824 1078546 793184 286337
9004 286337 699930 698993 221359 -445461 -904731 -911420 -589457 -274407 155920 153638 -375878
8993 -375878 -468451 211251 -81201 247568 251817 497300 317709 -145903 -559211 -1170511
8983 -1170511 -1276118 -601519 -223 68395 196344 795688 531641 -193126 -153315 -366752
8973 -366752 -84425 581299 649918 544688 343407 -288928 522736 1971328 2046747 1368702
8963 1368702 73083 -574604 13886 69237 85646 671255 1010638 1165421 849803 908258
8953 908258 1002941 1172033 565993 -60025 -154528 137582 422331 168069 397355 340617
$$ packed form
9024F39640j05471k43085p09940m69244N4536k89091L8062N41248Q56976q6409
9014B27222r90750M1571L74020N5094K10361N26008M34298K00722k85362n06847
9004B86337M13593r37m77634o66820m59270o689L21963L15050M30327k282n29516
8993c75878r2573O79702k92452L28769M249K45483j79591m63612m13308o11300
8983a170511j05607O74599O01296O8618J27949N99344k64047p24767L9811k13437
8973c66752K82327O65724O8619j05230k01281o32335Q11664J448592P5419o78045
8963A368702j295619o47687N88490N5351J6409N85609L39383J54783l15618N8455
8953I08258R4683J69092o06040o26018r4503K92110K84749k54262K29286n6738
$$ plain form
8943 340617 282493 671414 1577003 2289363 1949982 1473294 1553494 1525597 1293177 1556479
8933 1556479 1407876 1607039 1520464 1204980 519365 74268 -248285 272792 103141 -212643
8923 -212643 -358980 -604478 -433777 -219747 162017 454007 314801 359153 -124663 -616465
8913 -616465 -1300991 -1283095 -1496464 -1214552 -879067 -1209076 -881228 -174606 -582878 -641605
8903 -641605 -350111 -31227 135457 -83960 -493570 -252677 31947 280638 294122 159244
8893 159244 708044 313136 128242 306926 517262 309003 -67805 463294 352868 -259550
8883 -259550 -808926 -478455 11695 -146144 19948 339148 400433 -342457 -945897 -464802
8873 -464802 478942 1250852 1241818 1315744 1820513 1503126 1045792 1153549 1174291 935539
$$ packed form
8943C40617n8124L88921R05589P12360l39381m76688Q0200k7897k32420K63302
8933A556479j48603J99163q6575l15484o85615m45097l22553N21077j69651l15784
8923b12643j46337k45498J70701K14030L81764K91990j39206M4352m83816m91802
8913f16465o84526J7896k13369K81912L35485l30009L27848P06622m08272n8727
8903f41605K91494L18884J66684k19417m09610K40893K84624K48691J3484j34878
8893A59244N48800l94908j84894J78684K10336k08259l76808N31099j10426o12418
8883b59550n49376L30471M90150j57839J66092L19200O1285p42890o03440M81095
8873d64802R43744P71910r034P3926N04769l17387m57334J07757K0742k38752
$$ plain form
8863 935539 473114 -149387 50436 959742 601148 92230 -23539 -183557 -173915 -155831
8853 -155831 -595947 -780949 -541585 -617287 -118246 -145145 -673704 -731841 -488369 -103665
8843 -103665 -127284 -315753 -258441 -308485 -883801 -951926 -233280 10912 -443032 -609645
8833 -609645 -501395 -230061 -32035 513512 758696 896292 868374 108150 254065 35337
8823 35337 122591 179714 -166380 -166597 -156234 199059 388625 270494 53429 71989 416590
8812 416590 577189 60914 54752 93581 108985 -77558 111583 927364 1148783 1329552
8802 1329552 1278140 1126180 937428 622942 667117 -6741 -674414 -113652 748063 836963
8792 836963 -10918 -534449 -445177 -374325 -511958 -937164 -1192135 -853129 -1039849 -806355
$$ packed form
8863I35539m62425o22501J99823R09306l58594n08918j15769j60018R642J8084
8853a55831m40116j85002K39364p5702M99041k6899n28559n8137K43472L84704
8843a03665k3619j88469N7312n0044n75316o8125P18646K44192m53944j66613
8833f09645J08250K71334J98026N45547K45184J37596k7918p60224J45915k18728
8823C5337Q7254N7123l46094k17J0363L55293J89566j18131k17065J8560L44601
8812D16590J60599n16275o162L8829J5404j86543J89141Q15781K21419J80769
8802A329552n1412j51960j88752l14486M4175o73858o67673N60762Q61715Q8900
8792H36963q47881n23531Q9272P0852j37633m25206k54971L39006j86720K33494
$$ plain form
8782 -806355 -310011 378744 1064349 1325333 984401 659664 47045 -955971 -669331 847906
8772 847906 1184692 787150 454240 561319 99483 -245066 -385738 -613257 -787625 -583077
8762 -583077 -620636 -1598685 -1594185 -1038985 21421 802074 788957 1048371 1277131 1314589
8752 1314589 1310967 816216 796943 766447 213936 -417062 -940134 -778295 -319819 202099
8742 202099 11152 -1035030 -1635340 -213425 830317 159790 -117362 617271 515332
8733 515332 63583 299191 395795 156636 -539733 -983390 -1284991 -425823 456102 332807
8723 332807 268173 342188 539918 739840 422983 247038 -73318 232461 349640 138171
8713 138171 -490141 -432709 47896 83867 279033 371292 33142 -546266 -886878 -997054
$$ packed form
8782h06355M96344O88755O85605K60984l40932l24737o12619j003016K86640J517237
8772H47906L36786l97542l32910J07079m61836l44549j40672k27519j74368K04548
8762e83077l7559r78049M500N55200J060406P80653j3117K59414K28760L7458
8752A314589l622m94751j9273l0496n52511o30998n23072J61839M58476N21918
8742B02099j90947j046182o00310J421915J043742o70527k77152P34633j01939
8733E15332m51749K35608R6604k39159o96369m43657l01601Q59168Q81925j23295
8723C32807o4634P4015J97730J99922l16857j75945l20356L05779J17179k11469
8713A38171o28312N7432M80605L5971J95166R2259l38150n79408l40612j10176
$$ plain form
8703 -997054 -422286 -101385 -547112 -20765 255628 323722 797877 772954 49387 356168
8693 356168 256585 -293326 -160889 216423 -27980 90483 270839 -43 124896 142818
8683 142818 101421 -60002 -120049 162774 360082 563347 254400 -263429 130117 490703
8673 490703 1152790 964884 547672 346458 411174 -116020 -638595 -744777 244190 1239168
8663 1239168 886962 747077 658172 245827 -20924 120888 93270 289445 193201 -28208
8653 -28208 -81083 -158784 -288488 -748729 -932781 -1586827 -1763835 -819347 320629 332311
8643 332311 173587 297157 832134 701788 679471 536509 41466 -397875 -254970 117038
8633 117038 131848 143264 21093 -780235 -694363 153914 205919 419346 376575 150802 -94824
$$ packed form
8703i97054N74768L20901m45727N26347K76393O8094M74155k4923p23567L06781
8693C56168r9583n49911J32437L77312k44403J18463J80356k70882J24939J7922
8683A42818m1397j61423o0047K82823J97308K03265l08947n17829L93546L60586
8673D90703O62087j87906m17212k01214O4716n27194n22575j06182R88967R94978
8663A239168l52206j39885q8905m12345k66751J41812k7618J96175r6244k21409
8653b8208n2875p7701j29704m60241j84052o54046j77008R44488J139976J1682
8643C32311j58724J23570N34977j30346k2317j42962m95043m39341J42905L72008
8633A17038J4810J1416j22171q01328Q5872Q48277N2005K13427m2771k25773k45626
$$ plain form
8622 -94824 123048 543747 338781 374392 347648 691204 583820 350015 278814 -119594
8612 -119594 -361577 297730 903858 518486 175077 406527 276389 -139481 -638633 -1094764
8602 -1094764 -1305892 -1227421 -1390848 -1068207 -415638 -323162 241162 -64021 -1021003 -1357369
8592 -1357369 -1579568 -1046161 -201006 107041 545512 761238 322300 26399 91783 549358
8582 549358 573433 343054 94447 629503 1095287 1609671 956225 -265623 -679313 -209493
8572 -209493 123367 525453 -271098 -619427 -368999 100584 -239111 -883971 -1164124 -600475
8562 -600475 -495075 12970 1149071 1650339 1259239 934124 683179 681814 952090 207863
8552 207863 -267933 9541 -778139 -765398 -226029 54182 366611 -258802 -692795 -37085
$$ packed form
8622i4824K17872M20699k04966L5611k6744L43556j07384k33805p1201l98408
8612a19594k41983O59307O06128l85372l43409K31450j30138m15870m99152m56131
8602a094764k11128P8471j63427L22641O52569R2476N64324l05183r56982l36366
8592a357369k22199N33407Q45155L08047M38471K15726m38938k95901O5384M57575
8582E49358K4075k30379k48607N35056M65784N14384o53446j221848m13690M69820
8572b09493L32860M02086p96551l48329K50428M69583l39695o44860k80153N63649
8562f00475J05400N08045J136101N01268l91100l25115k50945j365K70276p44227
8552B07863m75796K77474p87680J2741N39369K80211L12429o25413m33993O55710
$$ plain form
8542 -37085 480743 693228 1396088 1666957 1375559 1182988 954570 962413 1148947 858331
8532 858331 -20766 -569553 -1198404 -676724 452983 579490 159355 -443396 -101364 367412
8522 367412 652769 840334 470202 9726 -174175 294474 747522 928365 973456 770976
8512 770976 409372 -212462 -193378 436634 783434 1097042 1157211 863721 467069 251554
8502 251554 284261 154253 296247 451739 590122 933168 937405 962966 752505 676801 446765
8491 446765 -131493 -194125 388003 317040 393643 412451 999143 1244644 961220 953425 1318380
8480 1318380 1340309 790458 534884 438237 39577 -646681 -838472 -387134 5687 -181864
8470 -181864 -418432 -59330 -426885 -631899 -738584 -552143 -391790 -985887 -994364 -655099
$$ packed form
8542c7085N17828K12485P02860K70869k91398j92571k28418P843J86534k90616
8532H58331q79097n48787o28851N21680J129707J26507m20135o02751L42032M68776
8522C67412K85357J87565l70132m60476j83901M68649M53048J80843M5091k02480
8512G70976l61604o21834J9084O30012L46800L13608O0169k93490l96652k15515
8502B51554L2707j30008J41994J55492J38383L43046M237K5561k10461p5704k30036
8491D46765n78258o2632N82128p0963P6603J8808N86692K45501k83424p795L64955
8480A318380K1929n49851k55574r6647l98660o86258j91791M51338L92821j87551
8470a81864k36568L59102l67555k05014j06685J86441J60353n94097q477L39265
$$ plain form
8460 -655099 -303526 119454 -134936 -900800 -656625 -39529 408103 -289641 -827292 -1114494
8450 -1114494 -1332128 -1475700 -1151469 -554907 -566047 -439575 -568809 -193480 655799 364049
8440 364049 118849 85686 479767 878865 1122096 1008467 772777 363617 -104980 -384241
8430 -384241 103378 422629 535763 -2921 481745 575814 837815 1058496 479155 483790
8420 483790 579705 478749 -139313 133411 933707 741504 404509 293170 544758 572159
8410 572159 415945 4815 -527109 -520853 -783655 -1381537 -823200 -506966 -535293 27268
8400 27268 -488773 -800027 -466027 -722171 -364731 -160005 -160489 -330981 -398437 341244 543875
8389 543875 565170 234263 -131194 -289927 -495861 -123505 -282142 -752953 -915266 -222619
$$ packed form
8460f55099L51573M22980k54390p65864K44175O17096M47632o97744n37651k87202
8450a114494k17634j43572L24231N96562j1140J26472j29234L75329Q49279k91750
8440C64049k45200l3163L94081L99098K43231j13629k35690m09160m68597k79261
8430c84241M87619L19251J13134n38684M84666R4069K62001K20681n79341M635
8420D83790R5915j00956o18062K72724Q00296j92203l36995j11339K51588K7401
8410E72159j56214m11130n31924O256k62802n97882N58337L16234k8327N62561
8400B7268n16041l11254L34000k56144L57440K04726m84j70492o7456P39681K02631
8389E43875K1295l30907l65457j58733k05934L72356j58637m70811j62313O92647
$$ plain form
8379 -222619 -472105 -340193 198863 296939 535292 388994 -162327 -294637 -349621 165806
8369 165806 185384 264159 31595 -329222 -296422 786293 567253 -186656 -17585 208307
8359 208307 -25564 -548311 300255 1069300 1010263 693927 217362 106811 378687 574208
8349 574208 725055 698628 52367 164710 836601 780420 541351 1059294 769502 485232
8339 485232 516020 870870 1818308 2267302 1913455 1064459 549668 116074 -290000 -615341
8329 -615341 -604301 -255130 -241451 687691 1171215 1205781 840962 818210 1378108 1212964
8319 1212964 281821 -53970 416865 429175 -199443 353508 1149018 1196200 1253844 722433
8309 722433 959633 943870 617136 337414 206747 756388 783428 1018609 796230 -111852
$$ packed form
8379b22619k49486J31912N39056R8076K38353j46298n51321j32310n4984N15427
8369A65806J9578P8775k32564l60817L2800J082715k19040p53909J69071K25892
8359B08307k33871n22747Q48566P69045n9037l16336m76565j10551K71876J95521
8349E74208J50847k6427o46261J12343O71891n6181k39069N17943k89792k84270
8339D85232L0788L54850R47438M48994l53847q48996n14791m33594m06074l25341
8329f15341J1040L49171J3679R29142M83524L4566l64819k2752N59898j65144
8319A212964r31143l35791M70835J2310o28618N52951P95510M7182N7644n31411
8309G22433K37200j5763l26734k79722j30667N49641K7040K35181k22379r08082
$$ plain form
8299 -111852 -335785 45569 100149 -24408 -92115 -989106 -1861256 -1753485 -701547 -654013
8289 -654013 -321541 43145 -148973 -1009781 -1372500 -1099492 -798858 -136691 237211 -82012
8279 -82012 237738 500894 159894 -58314 -464278 -381799 97782 501615 544178 947104
8269 947104 650275 216779 -203050 52166 182014 514559 782940 599270 661301 21847
8259 21847 -831825 -1093367 -1330596 -929098 -725562 -492354 -631059 -490411 64218 93996
8249 93996 443886 396166 48572 325089 212438 20282 551049 269780 119227 375659
8239 375659 371537 343009 -539442 -165611 541347 775739 589590 439778 287813 172498
8229 172498 -128504 215080 733920 448814 -199480 -1211304 -748312 -441979 -827072 -857007
$$ packed form
8299a11852k23933L81354N4580j24557o7707q96991q72150J07771J051938M7534
8289f54013L32472L64686j92118q60808l62719K73008L00634O62167L73902l19223
8279h2012L19750K63156l41000k18208m05964Q2479M79581M03833M2563M02926
8269I47104k96829m33496m19829K55216J29848L32545K68381j83670O2031o39454
8259B1847q53672k61542k37229M01498K03536K33208j38705J40648N54629K9778
8249I3996L49890m7720l47594K76517j12651j92156N30767k81269j50553K56432
8239C75659m122k8528q82451L73831P06958K34392j86149j49812j51965j15315
8229A72498l01002L43584N18840k85106o48294j011824M62992L06333l85093k9935
$$ plain form
8219 -857007 -139929 -329022 -433484 -656204 -693477 -149700 -96298 76396 329983 382554
8209 382554 -486688 -1422621 -1095719 -163152 287362 472217 582350 766886 357660 -199353
8199 -199353 2790 219934 90331 202358 690128 395492 260244 -123459 -516330 -752287
8189 -752287 -645139 -1275292 -1199028 -890991 -861295 -908536 -975131 -292399 94155 -255405
8179 -255405 -436304 -735110 -187552 250281 469447 1019589 1037787 889555 275639 -79669
8169 -79669 -796455 -787995 -650890 -583509 -902506 -773130 16239 176133 -351738 219177
8159 219177 762608 49203 -209143 -429397 -1370206 -2151952 -1630228 -786555 101717 881646
8149 881646 598585 145870 -82642 -136924 112052 678042 46832 -558255 -181970 -13708
$$ packed form
8219h57007P17078j89093j04462k22720l7273N43777N3402J72694K53587N2571
8209C82554q69242r35933L26902R32567M50514J84855J10133J84536m09226n57013
8199a99353K02143K17144j29603J12027M87770k94636j35248l83703l92871k35957
8189g52287J07148o30153P6264L08037K9696m7241o6595O82732L86554l49560
8179b55405j80899k98806N47558M37833K19166N50142J8198j48232o13916l55308
8169g9669p16786Q460J37105O7381l18997J29376P89369J59894n27871N70915
8159B19177N43431p13405k58346k20254r40809p81746N21724Q43673Q88272P79929
8149H81646k83061m52715k28512n4282K48976N65990o31210o05087L76285J68262
$$ plain form
8139 -13708 -327575 -909490 -1026536 -653750 -131412 443804 420578 383491 503628 435773
8129 435773 222176 242945 674267 238709 116969 592069 847595 1098166 1776985 1800164
8119 1800164 1466031 1049094 1347911 1272420 816432 76454 -167380 -249623 154662 32887
8109 32887 220772 610532 347849 753720 806984 29130 -361018 -946016 -1113085 -749308
8099 -749308 303356 1077862 983941 104811 -32866 416397 240073 -91833 -217848 -15231
8089 -15231 -376983 -340865 -49472 -330501 -414207 -667331 -369437 287014 739669 508208
8079 508208 540390 532212 -69730 -675492 -992513 -660499 -337292 -133275 303882 280327
8069 280327 -858204 -1347776 -1670272 -1189259 -643726 -921008 -643991 408570 762675
$$ packed form
8139a3708l13867n81915j17046L72786N22338N75216k3226l7087J20137o7855
8129D35773k13597K0769M31322m35558j21740M75100K55526K50571O78819K3179
8119A800164l34133m16937K98817p5491m55988p39978k43834q2243M04285j21775
8109C2887J87885L89760k62683M05871N3264p77854l90148n84998j67069L63777
8099g49308J052664P74506r3921q79130j37677M49263j76324l31906j26015K02617
8089a5231l61752L6118K91393k81029q3706k53124K97894O56451M52655k31461
8079E08208L2182q178o01942o05762l17021L32014L23207K04017M37157k3555
8069B80327j138531m89572l22496M81013N45533k77282K77017J052561L54105
$$ plain form
8060 762675 633985 -56215 -290580 -360555 -257384 41634 584469 664206 -512072 -923185
8050 -923185 -1400353 -1471942 -1167102 -261050 600797 771402 398327 362154 424333 -91934
8040 -91934 -649654 -943648 -323410 256988 52897 -480146 338375 830911 525070 179763
8030 179763 -66719 -5912 -27722 -73610 365324 -121447 -166719 -1033380 -1075285 -629436 -269808
8019 -269808 196920 436482 899286 862235 747750 1396038 554449 -331122 -986614 -494049
8009 -494049 237835 571156 383643 471441 656158 -129974 -429791 -316754 -459661 -270862
7999 -270862 307286 618504 562522 49535 97712 351680 556061 881947 1046258 861004
7989 861004 1036300 843602 -212943 -360822 142382 -114332 201502 999021 1232714 849910
$$ packed form
8060G62675j28690o90200k34365o9975J03171K99018N42835P9737j176278m11113
8050i23185m77168p1589L04840R06052Q61847J70605l73075l6173O2179n16267
8040i1934n57720k93994O20238N80398k04091n33043Q18521M92536l05841l45307
8030A79763k46482O0807k1810m5888M38934m86771m5272q66661m1905M45849L59628
8019b69808M66728K39562M62804l7051j14485O48288q41589q85571o55492M92565
8009d94049P31884L33321j87513Q7798J84717p86132k99817J13037j42907J88799
7999b70862N78148L11218n5982n12987M8177K53968K04381L25886J64311j85254
7989H61004J75296j92698j056545j47879N03204k56714L15834P97519K33693l82804
$$ plain form
7979 849910 253076 -77891 -257541 -2108408 -5652424 -9553360 -8004980 -4763767 -3336081
7970 -3336081 -2346576 -1630239 -1603831 -1222012 -183622 127761 -157895 -606096 -351054 -189884
7960 -189884 -246156 -134832 78172 -181223 -356922 79962 155771 -602130 -1116319 -1195026
7950 -1195026 -922758 -937570 -954973 -164328 -3183 367170 730193 1333447 2238665 2294212
7940 2294212 1079367 731564 733876 779180 715238 529226 623342 751087 807744 638664
7930 638664 939818 1030306 241302 588161 917661 992737 458790 -324676 -503302 -735896
7920 -735896 -1042688 -981439 -1004718 -1354132 -1152160 -490134 -114204 537953 338876 -62828
7910 -62828 -363772 -760702 -1004085 -1174071 -683254 634763 1133404 1317216 1899024 1367158
$$ packed form
7979H49910n96834l30967j79650j850867l544016l900936J548380L241213J427686
7970c336081R89505P16337K6408L81819J038390L11383k85656m48201K55042J61170
7960a89884n6272J11324K13004k59395j75699M36884P5809p57901n14189p8707
7950a195026K72268j4812j7403P90645J61145L70353L63023O03254R05218N5547
7940B294212j214845l47803K312M5304o3942j86012R4116J27745N6657j69080
7930F38664L01154R0488p89004L46859L29500P5076n33947p83466j78626k32594
7920g35896l06792O1249k3279l49414K01972O62026L75930O52157j99077m01704
7910f2828l00944l96930k43383j69986M90817J318017M98641J83812N81808n31866
$$ plain form
7900 1367158 537474 224088 -594290 -1197161 -1054013 -320383 -120782 -446386 -1020935 -881580
7890 -881580 80431 1198023 1262074 1213976 783849 252497 7525 -11488 975772 1459650
7880 1459650 1123982 443878 -33675 -612607 -774194 -214397 274586 791222 769212 292480
7870 292480 -283648 -526055 -717958 -313145 399531 429775 -235953 -469870 -223560 -254958
7860 -254958 -219646 778142 390142 -295801 -519152 -358424 -29530 -552866 -1075805 -960295
7850 -960295 -530871 -588501 -160315 46755 253604 792489 731863 -55644 -448748 -420193
7840 -420193 -987732 -861746 -74055 302278 82356 326902 598925 373378 601803 -69275
7830 -69275 525830 1189563 1086362 978166 231042 -4474 -359087 -1130668 -1523306 -742925
$$ packed form
7900A367158q29684l13386q18378o02871J43148P33630J99601l25604n74549J39355
7890h81580R62011J117592O4051m8098m30127n31352k44972j9013R87260M83878
7880A459650l35668o80104m77553n78932j61587N59797M88983N16636k2010m76732
7870B92480n76128k42407j91903M04813P12676L0244o65728k33917K46310l1398
7860b54958L5312R97788l88000o85943k23351J60728L28894n23336n22939J15510
7850i60295M29424n7630M28186K07070K06849N38885o0626p87507l93104K8555
7840d20193n67539J25986P87691L76333k19922K44546K72023k25547K28425o71078
7830f9275N95105O63733j03201j08196p47124k35516l54613p71581l92638P80381
$$ plain form
7820 -742925 -874368 -416808 798603 502049 -244056 -81682 306043 214273 77860 -374169
7810 -374169 -267564 -757516 -1131102 -967086 -597441 -739121 48539 670179 28346 -520959
7800 -520959 -881305 -784885 -201295 -201452 -669063 -379667 262685 746304 474610 353100
7790 353100 881079 478932 -168403 301263 622859 362045 23275 630831 913158 780972
7780 780972 443540 204902 457918 359194 489254 999316 1072356 875338 892755 1127848
7770 1127848 740677 85534 -101044 111882 514431 477891 394447 569083 308170 -159807
7760 -159807 -395498 105911 903557 1232904 649670 547395 689256 -160917 -834685 -1064840
7750 -1064840 -1043033 -465925 595417 453716 -59759 79568 304416 584982 699524 359601
$$ packed form
7820g42925j31443M57560J215411k96554p46105J62374L87725r1770j36413m52029
7810c74169J06605m89952l73586J64016L69645j41680P87660O21640o41833n49305
7800e20959l60346R6420N83590j57m67611K89396O42352M83619k71694j21510
7790C53100N27979m02147o47335M69666L21596k60814l38770O07556K82327j32186
7780G80972l37432k38638K53016r8724J30060N10062P3040j97018J7417K35093
7770A127848l87171o55143j86578K12926M02549l6540q3444J74636k60913m67977
7760a59807k35691N01409P97646L29347n83234j02275J41861q50173o73768k30155
7750a064840K1807N77108J061342j41701n13475J39327K24848K80566J14542l39923
$$ plain form
7740 359601 -212738 -392779 -597867 -394654 39313 -18226 -306735 -148338 -88025 366583
7730 366583 497753 119140 -277800 211920 1047889 918999 444738 166549 266865 -52526
7720 -52526 -24383 145709 659867 516534 1024562 787695 533632 219149 300876 684538
7710 684538 689157 1117611 1597994 1613068 540513 -200322 -95426 130734 96610 149847
7700 149847 1091349 1175567 834499 212160 14656 41484 576865 1413382 1826378 2020064
7690 2020064 689166 -530650 -538699 -441454 -663432 -847603 -499709 81922 370245 105345
7680 105345 342014 983887 994219 -132523 -708399 -362803 -64078 -637251 -568795 81763
7670 81763 319402 69478 -160509 449693 1150515 1220354 705711 129540 149682 -338477
$$ packed form
7740C59601n72339j80041k05088K03213M33967n7539k88509J58397O0313M54608
7730C66583J31170l78613l96940M89720Q35969j28890m74261k78189J00316l19391
7720e2526K8143J70092N14158j43333N08028k36867k54063l14483Q1727L83662
7710F84538M619M28454M80383J5074j072555p40835J04896K26160l4124N3237
7700A49847R41502Q4218l41068o22339j97504K6828N35381Q36517M12996J93686
7690B020064j330898j219816q049R7245k21978j84171L47894N81631K88323k64900
7680A05345K36669O41873J0332j126742n75876L45596K98725n73173O8456O50558
7670H1763K37639k49924k29987O10202P00822O9839n14643n76171K0142m88159
$$ plain form
7660 -338477 -1448783 -1871617 -1354500 -1033011 -332012 -272282 -131318 -262654 -54536 104592
7650 104592 -42920 94515 -56847 395427 1460044 1414481 1687889 1606081 1139494 447198
7640 447198 779980 1497308 1770985 966203 234806 545176 1406111 2808599 5787414
7631 5787414 11331718 15264708 10052849 5382680 2775953 1587001 531401 -137667
7623 -137667 -508274 -220302 25707 227466 295694 -33854 199168 325240 -197269 -1106609
7613 -1106609 -1505663 -1059904 -536199 -393957 -71547 387837 594692 915380 812918 696476
7603 696476 848066 656493 194283 -482298 -1282921 -819110 -384666 -761034 -888616 -380560
7593 -380560 404133 575981 677646 637459 737276 933528 44518 -586165 -52954 154822
$$ packed form
7660c38477j110306m22834N17117L21489P00999N9730J40964j31336K08118J59128
7650A04592j47512J37435j51362M52274J064617m5563K73408q1808m66587o92296
7640D47198L32782P17328K73677q04782p31397L10370Q60935J402488K978815
7631E787414N544304L932990n211859m670169k606727j188952j055600o69068
7623a37667l70607K87972K46009K01759O8228l29548K33022J26072n22509r09340
7613a106609l99054M45759N23705J42242L22410M59384K06855L20688j02462j16442
7603F96476J51590j91573m62210o76581q00623M63811M34444l76368j27582N08056
7593c80560P84693J71848J01665m0187R9817J96252q89010o30683N33211K07776
$$ plain form
7583 154822 -146158 294544 1110815 1133721 888088 829430 469231 559773 910400 906483 722730
7572 722730 927421 836098 964858 631516 310277 316621 16132 72468 -8978 -337843 -458241
7561 -458241 -613833 -676042 274549 615751 305510 -7424 -485817 -306394 -227065 -341463
7551 -341463 -304135 -540103 217281 752314 531671 98784 -610781 -350778 -112790 -287512
7541 -287512 -852 445567 679533 494806 555841 718098 1560792 1889394 828070 338720
7531 338720 483458 492292 32461 -340644 650135 1402343 942219 -82884 -447834 -1035805
7521 -1035805 -1283509 -1234301 -820393 -1101234 -654413 31028 611803 944163 404658 -245237
7511 -245237 -549421 -1031125 -1237832 -944255 -377434 -571392 -585246 -88814 281120 -321129
$$ packed form
7583A54822l00980M40702Q16271K2906k45633n8658l60199R0542L50627l917j83753
7572G22730K04691r1323J28760l33342l21239O344l00489N6336q1446l28865j20398
7561d58241j55592o2209R50591L41202l10241l12934m78393J79423P9329j14398
7551c41463L7328k35968P57384N35033k20643m32887p09565K60003K37988j74722
7541b87512K86660M46419K33966j84727O1035J62257Q42694L28602j061324m89350
7531C38720J44738Q834m59831l73105R90779P52208m60124j025103l64950n87971
7521a035805k47704M9208M13908k80841M46821O85441N80775L32360n39505o49895
7511b45237l04184m81704k06707K93577N66821j93958j3854M96432L69934o02249
$$ plain form
7501 -321129 -1188842 -1158104 -914438 -423171 177957 -197888 -507513 -870749 -710637 -180812
7491 -180812 -11096 61878 -66789 -2235 819937 1191298 1175461 566801 1175800 3564932
7481 3564932 4456660 2577036 1851404 1509230 845307 965951 1245237 999886 676810
7472 676810 66561 555167 860209 964987 774174 721646 -72070 -279240 -721234 -1071511
7462 -1071511 -1568120 -911125 -345151 -95553 257608 685874 476131 -78622 -223200 -260184
7452 -260184 -383594 -160450 664471 806428 485538 1083754 922341 237790 -5461 223383
7442 223383 470145 323347 -415601 -670414 -48884 294787 163395 -111987 -34212 109196
7432 109196 569781 383168 75930 -767292 -689848 -554608 -551498 47573 28638 454558
$$ packed form
7501c21129q67713L0738K43666M91267O01128l75845l09625l63236J60112N29825
7491a80812J69716P2974j28667O4554Q22172L71361j5837o08660O08999K389132
7481C564932Q91728j879624p25632l42174o63923J20644K79286k45351l23076
7472F76810o10249M88606L05042J04778j90813n2528p93716k07170m41994l50277
7462a071511m96609O56995N65974K49598L53161M28266k09743n54753j44578l6984
7452b60184j23410K23144Q24921J41957l20890N98216j61413o84551k43251K28844
7442B23383K46762j46798p38948k54813O21530L43671j31392k75382P7775J43408
7432A09196M60585j86613l07238q43222P7444J35240L110N99071j8935M25920
$$ plain form
7422 454558 597173 431748 -476412 -809217 487 593779 237316 -159059 -603840 -1121456
7412 -1121456 -1406343 -1077912 -435615 -553546 -987980 -1106480 -976281 -393811 500862 47717
7402 47717 -53400 834445 1132308 934984 -46616 -604225 -49351 437088 1042555 1293212
7392 1293212 841035 473329 916309 689401 698763 429110 659533 778470 470215 104972
7382 104972 20997 -842936 -1036017 -494434 -603431 -214714 38249 342826 644056 267808
7372 267808 122788 -192319 -436182 13989 693056 638269 545939 339578 361777 398475
7362 398475 276419 638683 345391 158673 427945 500275 155462 422732 1119530 1340125
7352 1340125 949253 177583 -228613 -745851 -1003276 -772503 -7354 633889 1136139 456346
$$ packed form
7422D54558J42615j65425r08160l32805Q09704N93292l56463l96375m44781n17616
7412a121456k84887L28431O42297j17931m34434j18500J30199N82470Q94673m53145
7402D7717j01117Q87845K97863j97324r81600n57609N54874M86439O05467K50657
7392A293212m52177l67706M42980k26908R362k69653K30423J18937l08255l65243
7382A04972q3975q63933j93081N41583j08997L88717K52963L04577L01230l76248
7372B67808j45020l15107k43863M50171O79067n4787r2330k06361K2199L6698
7362C98475j22056L62264k93292j86718K69272P2330l44813K67270O96798K20595
7352A340125l90872p71670m06196n17238k57425K30773P65149O41243N02250o79793
$$ plain form
7342 456346 358920 607435 559640 1179979 1625974 1438395 1025547 608126 587175 748139
7332 748139 845038 1393022 3074132 3734654 2826585 2122838 1649976 1121053 834085 1094702
7322 1094702 1284797 983711 767005 765954 560911 221794 -93252 116578 -440146 -675363
7312 -675363 -169128 188572 8346 -40749 65872 -671424 -751515 -489463 36170 -71824
7302 -71824 -729865 -422083 -69567 -38085 381781 127457 -19160 -277474 -371730 -333170
7292 -333170 -400129 -260413 -139215 -378012 3024 451434 296927 -105045 -509183 -173690
7282 -173690 415101 586432 -10873 -54582 68522 -79914 -198775 -228740 -306920 -178315
7272 -178315 282566 124522 -1122948 -1153441 -343500 226887 -109973 -109821 311119 237719
$$ packed form
7342D56346r7426K48515m7795O20339M45995j87579m12848m17421k0951J60964
7332G48139R6899N47984J681110O60522r08069p03747m72862n28923k86968K60617
7322A094702J90095l01086k16706j051k05043l39117l15046K09830n56724k35217
7312f75363N06235L57700j80226m9095J06621p37296q0091K62052N25633j07994
7302g1824o58041L07782L52516L1482M19866k54324j46617k58314r4256L8560
7292c33170o6959J39716J21198k38797L81036M48410j54507m01972m04138L35493
7282a73690N88791J71331n97305m3709J23104j48436j18861k9965p8180J28605
7272a78315M60881j58044j247470l0493Q09941N70387l36860J52M20940p3400
$$ plain form
7262 237719 80541 -792629 -1050875 -711101 -122677 234256 338267 176229 276957 814424
7252 814424 596365 220469 32569 245053 -13772 -236059 -442750 -351111 -155518 189764
7242 189764 183448 221791 954406 1405400 968197 232047 -490042 -326312 230874 535160
7232 535160 218846 -289306 -272162 -110590 296965 600388 561677 62691 -61585 155781
7222 155781 124122 720788 171064 -297209 -689448 -623391 -239491 702589 1052778 339779
7212 339779 -321158 -835298 -718302 -333137 -864195 -1424760 -1323957 -842173 -612845 44946
7202 44946 -105126 -508284 -484621 -614378 -794447 -941803 -311984 -129532 -642131 -1276576
7192 -1276576 -1032796 -466913 -16331 601976 184627 127744 786177 886452 508887 54915
$$ packed form
7262B37719j57178q73170k58246L39774N88424L56933J04011j62038J00728N37467
7252H14424k18059l75896j87900K12484k58825k22287k06691R1639J95593L45282
7242A89764o316L8343P32615M50994m37203p36150p22089J63730N57186L04286
7232E35160l16314n08152J7144J61572M07555L03423l8711m98986j24276K17366
7222A55781l1659N96666n49724m68273l92239O6057L83900R42080L50189p12999
7212C39779o60937n14140J16996L85165n31058n60565J00803M81784K29328O57791
7202D4946j50072m03158K3663j29757j80069j47356O29819J82452n12599o34445
7192a276576K43780N65883M50582O18307m17349n6883O58433J00275l77565m53972
$$ plain form
7182 54915 103689 517453 471424 -21252 -691680 -878772 -468978 -795539 -873661 -712831
7172 -712831 -576845 -14040 -41610 441924 885921 888640 179066 592701 650715 -674
7162 -674 1052786 1822327 898602 220710 515850 864162 497842 -484736 -1078227 -917782
7152 -917782 -472284 -508526 -708673 -936754 -1172931 -1255003 -818732 -455671 -402501 -411346 -479863
7141 -479863 -920274 -820043 -605828 -763737 183683 332944 261624 152839 80291 618130
7131 618130 394036 -641355 -343173 -40454 -357054 -517759 -353316 -267289 -394229 -104566
7121 -104566 -218227 -321014 -711410 -499177 186956 876603 1100840 723406 407324 -316020
7111 -316020 -480719 -129696 -219168 -360689 223958 220875 445677 645311 966689 1637888
$$ packed form
7182E4915M8774M13764m6029m92676o70428j87092M09794l26561p8122J60830
7172g12831J35986N62805k7570M83534M43997K719p09574M13635N8014o51389
7162f74J053460P69541r23725o77892K95140L48312l66320r82578n93491J60445
7152i17782M45498l6242k00147k28081k36177q2072M36271L63061N3170q845o8517
7141d79863m40411J00231K14215j57909R47420J49261p1320j08785p2548N37839
7131F18130k24094j035391K98182L02719l16600j60705J64443Q6027j26940K89663
7121a04566j13661j02787l90396K12233O86133O89647K24237l77434l16082p23344
7111c16020j64699L51023q9472j41521N84647l083K24802J99634L21378O71199
$$ plain form
7101 1637888 1773539 993227 -110838 -733140 -930739 -573593 -81693 -144305 -149347 -109077
7091 -109077 326436 549664 178477 -340272 -636518 -370598 217621 247190 -205953 -506713
7081 -506713 -510406 6032 -107898 -491028 -736346 -840701 -1017821 -693856 -15354 -312434
7071 -312434 -433109 -507927 -382470 -618257 -809724 32492 742155 685236 321006 193239
7061 193239 433203 459829 131923 -298584 -704196 -965087 -398411 181583 -7109 108182
7051 108182 379175 807717 331349 -193636 39 -186957 -267086 490209 1105594 694385
7041 694385 440307 675682 1105011 1103804 644783 337340 278133 121564 -415254 -201523
7031 -201523 307306 46022 -355548 -519324 -429737 -699299 -698578 -672191 -464538 -27046 -437377
$$ packed form
7101A637888J35651p80312j104065o22302j97599L57146M91900o2612n042M0270
7091a09077M35513K23228l71187n18749k96246K65920N88219K9569m53143l00760
7081e06713l693N16438j13930l83130k45318j04355j77120L23965O78502k97080
7071c12434j20675p4818J25457k35787j91467Q42216P09663n6919l64230j27767
7061A93239K39964K6626l27906m30507m05612k60891N66676N79994j88692J15291
7051A08182K70993M28542m76368n24985J93675j86996q0129P57295O15385m11209
7041F94385k54078K35375M29329j207m59021l07443n9207j56569n36818K13731
7031b01523N08829k61284m01570j63776Q9587k69562P21K6387K07653M37492m10331
$$ plain form
7020 -437377 -394262 -79670 185943 91607 -212120 -739441 -1210363 -424397 705933 794143
7010 794143 137356 -34177 118748 299250 447491 481577 312989 482486 263111 -797397
7000 -797397 -792118 -723149 -486276 -79280 853166 145889 -566970 -483266 422136 1416718
6990 1416718 1800224 1406116 1296793 1172838 257001 -495587 -1053081 -535656 588 360851
6980 360851 -94377 -141611 -158777 394405 1007988 1100920 1366820 1561582 1549512 1101894
6970 1101894 1027302 1621446 1425211 487673 794352 1465198 1683096 1515777 853198 341615
6960 341615 103526 646949 1366879 717273 -725823 -1577556 -1804142 -2051930 -1733544 -1369815
6950 -1369815 -912169 -817489 -761871 -328805 144564 11801 107384 577213 450377 441933
$$ packed form
7020d37377M3115L14592K65613r4336l03727n27321m70922P85966J130330Q8210
7010G94143o56787j71533J52925J80502J48241L4086j68588J69497k19375j060508
7000g97397N279O8969K36873M06996R32446p07277p12859Q3704R05402R94582
6990A416718L83506l94108j09323j23955r15837p52588n57494N17425N36244L60263
6980C60851m55228m7234j7166N53182O13583R2932K65900J94762j2070m47618
6970A101894p4592N94144j96235r37538L06679O70846K17898j67319o62579n11583
6960C41615k38089N43423P19930o49606j443096q51733k26586k47788L18386L63729
6950a369815M57646R4680N5618M33066M73369j32763R5583M69829j26836q444
$$ plain form
6940 441933 364818 348674 76860 360850 460085 415490 668947 569898 514794 771576 973808
6929 973808 129289 -582502 -1164125 -978860 -359583 431536 1235951 1495167 2048684 3294161
6919 3294161 3835621 4257964 5860424 7268231 10019496 14413850 20489170 32093388
6911 32093388 57637665 121534510 260597806 303723512 183190808 110611878 68861397
6904 68861397 43257357 28592142 20045412 15041302 11777545 8759128 6373702 4982120
6896 4982120 4249995 3578833 3168190 3068421 3354410 2574319 1559256 1219655 1792380 1777371
6886 1777371 2280762 1799642 584909 -5979 454647 1106038 1420612 797045 63040
6877 63040 -129841 215150 582916 341416 265576 145626 280367 510710 323359 1055091
$$ packed form
6940D41933p7115j6144k71814K83990R9235m4595K53457r9049n5104K56782K02232
6929I73808q44519p11791n81623J85265O19277P91119Q04415K59216N53517J245477
6919C294161N41460M22343J602460J407807K751265M394354O075320J1604218
6911C2093388K5544277O3896845J39063296M3125706j20532704p2578930m1750481
6904F8861397k5604040j4665215q546730n004110l263757l018417k385426j391582
6896D982120p32125o71162m10643r9769K85989p80091j015063l39601N72725j5009
6886A777371N03391m81120j214733n90888M60626O51391L14574o23567p34005
6877F3040j92881L44991L67766k41500p5840j19950J34741K30343j87351P31732
$$ plain form
6867 1055091 1612828 744394 159824 -111180 334251 300504 476212 171218 -188075 -393392
6857 -393392 -669494 -423797 -708059 -906391 -522543 -139323 807421 1384321 1446847 997415
6847 997415 481909 440029 798502 665829 470740 503292 216707 293688 1163210 1164118 859661
6836 859661 1421382 694518 423579 596218 219076 179591 677413 834774 190740 -420520
6826 -420520 73895 312057 501167 -15776 -90255 -174021 -130707 -337626 -478665 -152162
6816 -152162 -309615 -286422 384124 1118323 945977 -690868 -1386292 -695415 -71575 -243040
6806 -243040 -961566 -1328182 -937724 -255772 424401 858124 393504 230311 -393013 -807168
6796 -807168 -887428 -430896 -175830 -610130 24330 701345 814496 -126063 -826491 -1034358
$$ packed form
6867A055091N57737q68434n84570k71004M45431l3747J75708l04994l59293k05317
6857c93392k76102K45697k84262j98332L83848L83220R46744N76900O2526m49432
6847I97415n15506m1880L58473j32673j95089L2552k86585P6981Q69522R08l04457
6836H59661N61721p26864k70939J72639l77142l9485M97822J57361o44034o11260
6826d20520M94415K38162J89110n16943p4479q3766M3314k06919j41039L26503
6816a52162j57453K3193O70546P34199j72346j636845o95424O90877O23840j71465
6806b43040p18526l66616L90458O81952O80173M33723m64620j63193o23324m14155
6796h07168q0260M56532K55066m34300O34460O77015J13151r40559p00428k07867
$$ plain form
6786 -1034358 -718864 -24861 -80018 274252 429921 252007 560240 257323 161036 768369
6776 768369 477066 625266 178555 -870018 -927650 -494516 177740 713581 753379 613077
6766 613077 150590 -273647 69299 795767 -90691 -319922 177646 784592 1085834 931448
6756 931448 168097 -474900 -1282002 -1321016 -693733 -601191 -605353 -100456 1121352 1661644
6746 1661644 753533 487951 -95402 -454797 289035 508619 553792 310636 162667 3722
6736 3722 70908 351780 911947 587545 115330 -460836 -589767 -781421 -107877 211019
6726 211019 78330 496084 778509 76302 317858 1177459 821347 376137 497592 549485
6716 549485 375726 -178046 -182692 478257 1005043 595568 298767 805886 1120559 274414
$$ packed form
6786a034358L15494O94003n5157L54270J55669j77914L08233l02917r6287O07333
6776G68369k91303J48200m46711j048573n7632M33134O72256N35841L9798j40302
6766F13077m62487m24237L42946P26468q86458k29231M97568O06946L01242j54386
6756I31448p63351o42997q07102l9014O27283R2542m162N04897J221808N40292
6746A661644r08111k65582n83353l59395P43832K19584M5173k43156j47969j58945
6736C722O7186K80872N60167l24402m72215n76166j28931j91654O73544L18896
6726B11019j32689M17754K82425p02207K41556Q59601l56112m45210J21455N1893
6716E49485j73759n53772m646O60949N26786m09475k96801N07119L14673q46145
$$ plain form
6706 274414 -552010 -957748 -1455061 -1182243 -651010 -267063 -588111 -712317 -737502 -667615
6696 -667615 -567790 -798807 -1102444 -922737 -602858 -1026127 -1300872 -695172 -217827 -314846
6686 -314846 -231311 50106 286945 -212736 -298450 -377977 -808877 -1061399 -1152675 -628460
6676 -628460 244051 747085 890120 777736 288910 214013 473463 131759 -442325 -284726
6666 -284726 -499163 -782692 -926820 -1219969 -1208341 -1323389 -544775 -385448 61738 175314
6656 175314 -1097 -556564 -747604 -605152 -1049758 -1487844 -1179893 -875666 -1046517 -1460509
6646 -1460509 -1045459 -191521 395149 133592 -52885 -491695 78500 1378207 1531927
6637 1531927 1143148 662656 729440 613033 641925 819561 574133 823548 939221 926850
$$ packed form
6706B74414q26424m05738m97313K72818N31233L83947l21048j24206k5185O9887
6696f67615R9825k31017l03637J79707L19879m23269k74745O05700M77345r7019
6686c14846Q3535K81417K36839m99681q5714p9527m30900k52522r1276N24215
6676f28460Q72511N03034J43035j12384m88826p4897K59450l41704n74084J57599
6666b84726k14437k83529j44128k93149J1628j15048P78614J59327M47186J13576
6656A75314j76411n55467j91040J42452m44606m38086L07951L04227j70851m13992
6646a460509M15050Q53938N86670k61557j86477m38810N70195J299707J53720
6637A531927l88779m80492O6784j16407K8892J77636k45428K49415J15673j2371
$$ plain form
6627 926850 158062 82225 38567 -319741 -313874 180725 -511068 -943489 -905063 -610901 -357778
6616 -357778 -506909 -204504 -247659 -129779 -349421 -923894 -1184201 -1041434 -106002 106470
6606 106470 -486804 -462051 530268 1107541 729766 -175193 -386465 -31232 254626 47257
6596 47257 165188 330709 222927 722031 986022 1164630 1588738 1904731 1444749 949955
6586 949955 390432 119767 230621 327521 253398 -4134 415103 651681 317024 -382985
6576 -382985 -639106 -481010 -347158 -394927 -150039 618890 911124 138103 -580511 -436088
6566 -436088 -235095 64277 90977 352889 -390672 -758063 -620811 -982720 -859387 -905486
6556 -905486 -1032504 -801977 -653169 -206775 -131669 -671263 -787915 -934704 -1215986 -916292
$$ packed form
6627I26850p68788p5837m3658l58308N867M94599o91793m32421L8426K94162K53123
6616c57778j49131L02405m3155J17880k19642n74473k60307J42767R35432K12472
6606A06470n93274K4753R92319N77273l77775r04959k11272L55233K85858k07369
6596D7257J17931J65521j07782M99104K63991J78608M24108L15993m59982m94794
6586I49955n59523k70665J10854R6900p4123k57532M19237K36578l34657p00009
6576c82985k56121J58096J33852m7769K44888P68929K92234p73021p18614J44423
6566d36088K00993K99372K6700K61912p43561l67391J37252l61909J23333m6099
6556i05486j27018K30527J48808M46394P5106n39594j16652j46789k81282K99694
$$ plain form
6546 -916292 -964983 -995652 -1084315 -375430 -86100 943575 1544016 1138741 1204506 913741
6536 913741 331580 170184 636523 1056269 572804 74909 -192940 104420 -84541 -161284
6526 -161284 -31363 1131158 1455154 1693136 1393104 1277452 1265769 1139524 1285615 1469324
6516 1469324 1279176 97031 -346014 -211415 -200427 -111046 -577381 -378977 -14256 -283302
6506 -283302 -687440 -1022195 -1067351 -1474454 -1153184 -414700 427648 257962 81295 249639
6496 249639 451478 1008930 1052791 691994 227047 -255566 -780751 -814729 -866472 -798960
6486 -798960 -415785 -380332 98004 858785 1049090 574631 554086 628886 59994 9988
6476 9988 471106 329143 -408365 -671142 -186190 -237969 -437323 223684 598449 519261
$$ packed form
6546i16292m8691l0669q8663P08885K89330J029675O00441m05275O5765k90765
6536I13741n82161j61396M66339M19746m83465m97895k67849K97360j88961p6743
6526a61284J29921J162521L23996K37982l00032j15652j1683j26245J46091J83709
6516A469324j90148j182145m43045J34599J0988Q9381m66335J98404L64721k69046
6506b83302m04138l34755m5156m07103L21270P38484Q42348j69686j76667J68344
6496B49639K01839N57452M3861l60797m64947m82613n25185l3978n1743O7512
6486g98960L83175L5453M78336P60781J90305m74459k0545P4800n68892n0006
6476I988M61118j41963p37508k62777M84952n1779j99354O61007L74765p9188
$$ plain form
6466 519261 562008 1021829 1295148 1447524 1413241 1077430 804386 414428 438385 565484
6456 565484 133721 -682841 -523565 -437553 -1130413 -771955 -716869 -995012 -1581547 -1300525
6446 -1300525 -806991 -473322 113702 403752 706666 889053 1143833 686742 625739 947450
6436 947450 1036855 1152928 869826 473358 -7370 -107649 -385428 -961120 -1034932 -1156946
6426 -1156946 -1242515 -1600284 -1371288 -1203681 -620471 -945552 -721916 -555654 -1158750 -1530361
6416 -1530361 -1781500 -1114525 194505 434283 498064 422954 217524 181373 609160 689473
6406 689473 625440 916868 592233 -26200 207330 173043 -120192 285854 633414 527109
6396 527109 421892 14189 -307988 -112455 -245784 -584238 -1110321 -1281284 -986110 -645826
$$ packed form
6466E19261M2747M59821K73319J52376l4283l35811k73044l89958K3957J27099
6456E65484m31763q16562J59276Q6012o92860L58458N5086k78143n86535K81022
6446a300525M93534L33669N87024K90050L02914J82387K54780m57091o1003L21711
6436I47450Q9405J16073k83102l96468m80728j00279k77779n75692p3812j22014
6426a156946q5569l57769K28996J67607N83210l25081K23636J66262o03096l71611
6416a530361k51139O66975J309030K39778O3781p5110k05430l6151M27787Q0313
6406F89473o4033K91428l24635o18433K33530l4287k93235M06046L47560j06305
6396E27109j05217m07703l22177J95533j33329l38454n26083j70963K95174L40284
$$ plain form
6386 -645826 46398 390785 -159452 -820279 -1199917 -762126 -181753 107532 2555 -253727
6376 -253727 -271890 93820 444844 -86669 -66249 279845 460555 464240 400320 403867 272284
6365 272284 649729 567531 682635 296744 -33883 -247501 35226 534671 222317 414019
6355 414019 659784 785480 76923 -806871 -3271699 -4184596 -2494224 -1541747 -1186395
6346 -1186395 -932966 -115811 124452 256445 -346125 -370709 -143864 471125 733926 348698
6336 348698 455146 454075 -233749 -1106014 -218971 485352 -60985 -959605 -651429 -1110023
6326 -1110023 -1015718 -920988 -368479 235342 390583 698606 1126345 661690 575401 638607
6316 638607 955043 765147 1181875 1411352 947247 755042 937541 1044733 943276 1629021
$$ packed form
6386f45826O92224L44387n50237o60827l79638M37791N80373K89285j04977k56282
6376b53727j8163L65710L51024n31513K0420L46094J80710L685o3920L547j31583
6365B72284L77445q2198J15104l85891l30627k13618K82727M99445l12354J91702
6355D14019K45765J25696p08557q83794k464828r12897J690372R52477L55352
6346a186395K53429Q17155K40263J31993o02570k4584K26845O14989K62801l85228
6336C48698J06448j071o87824q72265Q87043P04323n46337q98620L08176m58594
6326a110023R4305R4730N52509O03821J55241L08023M27739m64655q6289O3206
6316F38607L16436j89896M16728K29477m64105j92205J82499J07192j01457O85745
$$ plain form
6306 1629021 2125104 1945064 808140 403506 668188 679305 -243383 -581267 -765479 -752595
6296 -752595 -770981 -1077097 -973173 -534157 72352 -203235 -1011207 -916211 -282303 308443
6286 308443 574773 648100 551452 504629 742716 390539 513147 438319 -103658 -39416 374559
6275 374559 940843 1221175 796010 129865 34778 204643 -643017 -1297635 -1298893 -1411775
6265 -1411775 -716299 -118829 312706 -38053 -215500 -632398 -797942 -429983 -185004 689950
6255 689950 1525480 1912237 931222 261948 232955 318461 304990 -130763 -471239 -445563
6245 -445563 -171359 150574 -139545 -334918 -794686 -1396450 -1124084 -154568 -14202 28832
6235 28832 -346960 -1081536 -538186 126411 -87478 186561 656831 505308 -193496 -200949
$$ packed form
6306A629021M96083j80040j136924m04634K64682J1117r22688l37884j84212J2884
6296g52595j8386l06116J03924M39016O06509k75587q07972R4996O33908N90746
6286C08443K66330P3327r6648m6823K38087l52177J22608p4828n41977O4242M13975
6275C74559N66284K80332m25165o66145r5087J69865q47660o54618j258j12882
6265a411775O95476N97470M31535l50759j77447m16898j65544L67959K44979Q74954
6255F89950Q35530L86757r81015o69274k8993Q5506j3471m35753l40476K5676
6245d45563K74204L21933k90119j95373m59768o01764K72366R69516J40366M3034
6235B8832l75792p34576N43350O64597k13889K74039M70270j51523o98804p453
$$ plain form
6225 -200949 183661 -160393 -534219 -826319 -179984 372018 913639 745588 472817 -93735
6215 -93735 -296857 247886 -80713 -287019 -162558 512844 1072269 1266918 1092076 487778
6205 487778 -304233 -118714 -103722 -330966 -109320 -505996 -958710 -691359 -221655 -284480
6195 -284480 -260469 -110316 -243967 100543 -250265 -956722 -570002 -301878 -603198 -308778
6185 -308778 -29611 -104076 -488133 -864192 189230 643103 732923 1177595 687258 547301
6175 547301 821083 828800 355479 127460 36716 -196234 -196850 333734 250185 569606 776798
6164 776798 38473 -561979 -378346 -316446 -585350 -134507 67149 654054 742829 743241 67106
6153 67106 -839953 -1251457 -658893 200395 414028 884859 60932 -527250 -1272491 -1873079
$$ packed form
6225b00949L84610l44054l73826k92100O46335N52002N41621j68051k72771n66552
6215i3735k03122N44743l28599k06306J24461O75402N59425J94649j74842o04298
6205D87778p92011J85519J4992k27244K21646l96676m52714K67351M69704o2825
6195b84480K4011J50153j33651L44510l50808p06457L86720K68124l01320K94420
6185c08778K79167p4465l84057l76059J053422M53873Q9820M44672m90337j39957
6175E47301K73782P717m73321k28019r0744k32950o16N30584q3549L19421K07192
6164G76798p38325o00452J83633O1900k68904M50843K01656N86905Q8775M12o76135
6153F7106r07059m11504N92564Q59288K13633M70831q23927n88182p45241o00588
$$ plain form
6143 -1873079 -1382944 -409878 -342336 -926618 -892963 -819006 -233314 919610 703407 47397
6133 47397 78546 195643 -56203 -576365 -670521 -341238 226034 274799 149080 480842
6123 480842 298751 266035 -165636 -1608304 -1419931 -1070411 -823318 -773093 -899449 -621681
6113 -621681 -208802 -206462 -531536 -63236 2025 -335699 -76780 -340737 -846342 -1149649
6103 -1149649 -1375899 -1392705 -1201665 -738090 -495989 -69845 -178732 126271 791150 311287
6093 311287 -288039 -578904 -170055 -333943 -484983 294228 622138 209589 -76036 -480852
6083 -480852 -600336 -1275319 -1316179 -1272175 -289109 738310 670749 183002 163349 150277
6073 150277 25629 55722 450368 105142 -629486 -755797 -1032911 -994969 -195269 -3403
$$ packed form
6143a873079M90135R73066O7542n84282L3655P3957N85692J152924k16203o56010
6133D7397L1149J17097k51846n20162r4156L29283N67272M8765j25719L31762
6123D80842j82091l2716m31671j442668J88373L49520K47093N0225j26356K77768
6113f21681M12879K340l25074M68300O5261l37724K58919k63957n05605l03307
6103a149649k26250j6806J91040M63575K42101M26144j08887L05003O64879m79863
6093C11287n99326k90865M08849j63888j51040P79211L27910m12549k85625m04816
6083d80852j19484o74983m0860M4004R83066J027419o7561m87747j9653j3072
6073A50277j24648L0093L94646l45226p34628j26311k77114L7942P99700J91866
$$ plain form
6063 -3403 -879498 -1173222 -1500035 -1439870 -1223018 -706644 35962 262385 248508 220586 -45499
6052 -45499 -485850 -579836 -648254 -357666 219460 403011 616497 586580 692418 140716
6042 140716 -761848 -942047 -189535 144468 152593 317993 194279 437343 -510 -763397
6032 -763397 -862727 -590601 -28492 463343 220330 -77441 -159044 249871 765042 278050
6022 278050 424878 168117 -226362 195418 452843 585791 854735 443876 236610 694953
6012 694953 799717 242069 528149 691467 28912 -912043 -727931 89270 1098073 899413
6002 899413 1253922 910783 -194827 -847696 -641158 815890 1203052 1088661 694253
5993 694253 492586 856385 549485 415066 640264 868397 1088597 680867 143824 31809
$$ packed form
6063c403q76095k93724l26813O0165K16852N16374P42606K26423j3877k7922k66085
6052d5499m40351r3986o8418K90588N77126J83551K13486k9917J05838n51702
6042A40716r02564j80199P52512L34003Q125J65400j23714K43064m37853p62887
6032g63397r9330K72126N62109M91835k43013k97771q1603M08915N15171m86992
6022B78050J46828k56761l94479M21780K57425J32948K68944m10859k07266M58343
6012F94953J04764n57648K86080J63318o62555r40955J84112Q17201J008803j98660
6002H99413L54509l43139j105610o52869K06538J457048L87162j14391l94408
5993F94253k01667L63799l06900j34419K25198K28133K20200m07730n37043j12015
$$ plain form
5983 31809 830761 771119 59477 -348764 -317930 -295537 -132614 -191011 413419 340963 261755
5972 261755 249432 40385 95539 1018162 1458166 1310256 1204347 913033 233874 -24242
5962 -24242 -73839 -621400 -950596 -1013260 -1022576 -594742 -363663 605360 1107675 1451375 1702844
5951 1702844 1617675 1039472 240070 -191250 -261642 -791138 -713173 67360 459197 434180
5941 434180 705920 123841 -522055 -908651 -1101996 -731342 -196162 -181086 -1000536 -966317
5931 -966317 -453485 -742443 -904420 -945030 -496652 -585734 -899818 -991375 -1098727 -845722
5921 -845722 -1043824 -1132226 -1053234 -836479 -553786 -773344 -723394 -631694 385945 340095
5911 340095 -118595 -343157 27699 535064 676313 1014611 591041 -280101 -844989 -899850
$$ packed form
5983C1809P98952n9642p11642m08241L0834K2393J62923n8397O04430p2456p9208
5972B61755j2323k09047N5154R22623M40004j47910j05909k91314o79159k58116
5962b4242m9597n47561l29196o2664r316M27834K31079R69023N02315L43700K51469
5951A702844q5169n78203p99402m31320p0392n29496P7965P80533L91837k5017
5941D34180K71740n82079o45896l86596j93345L70654N35180J5076q19450L4219
5931i66317N12832k88958j61977m0610M48378q9082l14084r1557j07352K53005
5921h45722j98102q8402P8992K16755K82693k19558M9950R1700J017639m5850
5911C40095m58690k24562L70856N07365J41249L38298m23570q71142n64888n4861
$$ plain form
5901 -899850 -651707 -500006 -102157 484098 1083151 1221977 761968 420776 187038 -61017
5891 -61017 -393347 -438739 -680374 -438447 -1007453 -959460 -305699 -78225 -44865 -955718
5881 -955718 -725835 -248011 -90659 406827 257123 95626 241589 -40385 -201936 -904574
5871 -904574 -994739 -684944 -230848 -172404 -513977 -246184 815485 1194898 1076785 683139
5861 683139 362915 974008 721329 291733 250500 196277 -489774 -981679 -997873 -938779
5851 -938779 -1398565 -1148257 -772024 -430021 152451 196680 -216563 395528 638563 626928
5841 626928 598998 -586168 -1398044 -1516957 -805695 -4900 411010 458104 783389 728470
5831 728470 87494 -837151 -1361548 -1390577 -934867 -367996 -290337 -285035 -496054 -153548
$$ packed form
5901h99850K48143J51701L97849N86255N99053J38826m60009l41192k33738k48055
5891f1017l32330m5392k41635K41927n69006M7993O53761K27474L3360r10853
5881i55718K29883M77824J57352M97486j49704j61497J45963k81974j61551p02638
5871i04574r0165L09795M54096N8444l41573K67793J061669L79413j18113l93646
5861F83139l20224O11093k52679m29596m1233n4223o86051m91905j6194N9094
5851i38779m59786K50308L76233L42003N82472M4229m13243O12091K43035j1635
5841F26928k7930j185166q11876j18913P11262Q00795M15910M7094L25285n4919
5831G28470o40976r24645n24397k9029M55710N66871P7659N302k11019L42506
$$ plain form
5821 -153548 139659 394324 702166 650037 1288668 1240534 768195 525703 734233 528771
5811 528771 630616 536041 50379 468876 825659 772827 459260 -322122 -1053799 -858650
5801 -858650 -418459 289433 518132 294573 -261618 -512122 -591112 -639103 -295964 -318456
5791 -318456 -259017 -339855 -487064 -687017 -721799 -487259 -425810 -1074922 -1831701 -2180682
5781 -2180682 -1510901 -878107 -668705 -719151 -684855 -200291 374711 1189637 1167772 740078
5771 740078 24681 234347 490765 876308 1021724 820424 399566 161426 286681 117272
5761 117272 -256040 -782514 -1129748 -1500585 -1405020 -366374 165493 746206 1035526 856041
5751 856041 446353 -4744 78348 -137244 -891148 -985625 -998979 -898488 -29525 696056
$$ packed form
5821a53548K93207K54665L07842n2129O38631m8134m72339k42492K08530k05462
5811E28771J01845r4575m85662M18497L56783n2832l13567p81382p31677J95149
5801h58650M40191P07892K28699k23559n56191k50504p8990m7991L43139k2492
5791c18456N9439q0838j47209j99953l4782K34540O1449o49112p56779l48981
5781b180682O69781O32794K09402n0446L4296M84564N75002Q14926k1865m27694
5771G40078p15397K09666K56418L85543J45416k01300m20858k38140J25255j69409
5761A17272l73312n26474l47234l70837R5565J038646N31867N80713K89320j79485
5751H56041m09688m51097Q3092k15592p53904r4477j3354J00491Q68963P25581
$$ plain form
5741 696056 714563 712816 227585 -130375 354089 835509 816498 584320 69389 -281965
5731 -281965 -203364 -331850 -243607 -70512 -139002 117197 90642 -246435 -318573 147514 -78100
5720 -78100 43916 507596 245411 -113033 -414497 -363001 -92651 -205289 187719 310962
5710 310962 -93278 -540439 -301805 -366955 -22012 450153 66754 -323579 -578826 -200328
5700 -200328 -734550 -945410 -844094 -641170 -92094 281217 214437 335060 427643 1135189
5690 1135189 639524 82512 707616 1674379 1770750 1496281 1193584 1435318 1197750 289723
5680 289723 -157774 -494884 -645361 -60038 36252 593588 701077 183335 -420218 -430915
5670 -430915 342781 146617 -178111 72692 388175 985992 1232388 1282201 788036 221571
$$ packed form
5741F96056J8507j747m85231l57960M84464M81420j9011k32178n14931l51354
5731b81965P8601j28486Q8243J73095o8490K56199k6555l37077p2138M66087k25614
5720g8100J22016M63680k62185l58444l01464N1496K70350j12638L93008J23243
5710C10962m04240m47161K38634o5150L44943M72165l83399l90333k55247L78498
5700b00328n34222k10860J01316K02924N49076L73311o6780J20623R2583P07546
5690A135189m95665n57012O25104R66763R6371k74469l02697K41734k37568r08027
5680B89723m47497l37110j50477N85323R6290N57336J07489n17742o03553j0697
5670d30915P73696j96164l24728K50803L15483N97817K46396M9813m94165n66465
$$ plain form
5660 221571 35874 -40462 299662 650712 537363 876563 1475565 1552036 838668 622808
5650 622808 494296 162056 231116 527987 -546573 -1207328 -1497984 -1508564 -1578197 -1481796
5640 -1481796 -1096981 -1421915 -1249519 -876142 -382172 -74500 -307161 -446531 -1129174 -1484067
5630 -1484067 -2031406 -1937811 -1730007 -1425482 -839960 -512331 -687713 -1078968 -913293 -320701
5620 -320701 -168125 65634 342778 88568 -323818 -216234 79383 -63039 -163256 -201548
5610 -201548 -91435 148174 -467055 80018 41319 -554403 -504681 -1390675 -1598724 -1005424
5600 -1005424 -575832 -499957 -411916 -131824 337273 169801 39606 441959 925365 595104
5590 595104 255354 467991 94743 -243012 -90223 66957 334679 226166 -265311 -844046
$$ packed form
5660B21571j85697p6336L40124L51050j13349L39200N99002P6471p13368k15860
5650F22808j28512l32240O9060K96871j074560o60755k90656j0580o9633R6401
5640a481796L84815l24934J72396L73377M93970L07672k32661j39370o82643l54893
5630a484067n47339R3595K07804L04525N85522L27629j75382l91255J65675N92592
5620c20701J52576K33759K77144k54210m12386J07584K95617j42422j00217l8292
5610b01548J10113K39609o15229N47073l8699n95722M9722q85994k08049N93300
5600a005424M29592P5875Q8041K80092M69097j67472j30195M02353M83406l30261
5590E95104l39750K12637l73248l37755J52789J57180K67722j08513m91477n78735
$$ plain form
5580 -844046 -608725 -283759 95218 -67690 123779 355354 370790 -199250 -891083 -1060513
5570 -1060513 -900656 -528507 147369 268204 93301 43597 -64103 -301878 457876 691991
5560 691991 1428036 1257964 1226021 925106 664001 1184755 1640857 1545983 1776222 1652477
5550 1652477 1518732 1543383 1304550 810110 144103 -31151 504087 878084 724596 -194286
5540 -194286 -744962 -359801 -297212 -132207 -504437 -1090102 -1733836 -1644217 -1936511 -1894284
5530 -1894284 -1607690 -1401920 -916543 -233991 31664 -44479 331982 449441 244241 136804
5520 136804 -657911 -1335566 -1055308 -99668 881326 1079186 884928 688555 590049 545844
5510 545844 823515 1282906 825254 322395 -91767 -419492 -508338 -280374 -654091 -770468
$$ packed form
5580h44046K35321L24966L78977j62908J91469K31575J5436n70040o91833j69430
5570a060513J59857L72149O75876J20835j74903m9704j07700k37775P59754K34115
5560F91991P36045j70072l1943l00915k61105N20754M56102r4874K30239j23745
5550A652477j33745K4651k38833m94440o66007j75254N35238L73997j53488r18882
5540a94286n50676L85161O2589J65005l72230n85665o43734Q9619k92294M2227
5530a894284K86594K05770M85377O82552K65655p6143L76461J17459k05200j07437
5520A36804p94715o77655K80258R55640R80994J97860j94258j96373r8506m4205
5510E45844K77671M59391m57652n02859m14162l27725q8846K27964l73717j16377
$$ plain form
5500 -770468 -300832 -25969 1031232 1082085 740101 282509 237722 1140676 1381123 1176392
5490 1176392 579695 368687 185803 283954 548377 800826 490374 -120796 -194915 -287338
5480 -287338 -1236457 -1232063 -843619 -455754 -448315 -742225 -347290 -311089 -517876 -512009 -498633
5469 -498633 -1130716 -842049 -621486 -1624223 -1652064 -565543 -388690 -112695 -21708 -445523
5459 -445523 -692502 -457301 -22788 35707 11819 78185 -30398 -494328 -285535 -256267
5449 -256267 213573 23483 -321826 -95845 -280389 -815691 -530014 702211 894481 915027
5439 915027 909295 790899 212348 43470 331631 418717 163085 13915 167798 512427
5429 512427 1023219 1193604 266622 -885879 -1016157 -1114616 -588291 -210273 -572479 -1124702
$$ packed form
5500g70468M69636K74863J057201N0853l41984m57592m4787R02954K40447k04731
5490A176392n96697k11008j82884R8151K64423K52449l10452o11170p4119r2423
5480b87338r49119M394L88444L87865P439k93910L94935L6201k06787N867J3376
5469d98633o32083K88667K20563j002737k7841J086521J76853K75995R0987m23815
5459d45523k46979K35201M34513N8495k3888O6366j08583m63930K08793K9268
5449b56267M69840j90090l45309K25981j84544n35302K85677J232225J92270K0546
5439I15027n732j18396n78551j68878K88161Q7086k55632j49170J53883L44629
5429E12427N10792J70385r26982j152501j30278r8459N26325L78018l62206n52223
$$ plain form
5419 -1124702 -1184691 -838965 -876824 -1724501 -1631067 -981782 -624266 -450478 -480308 -660267
5409 -660267 -139381 -235728 -264625 50015 14873 -520469 -714121 -73408 58643 -456054
5399 -456054 -269024 273988 -16182 -1013422 -1603808 -1006447 -529569 -20925 643750 940682
5389 940682 936432 799393 926236 1029223 1259302 1161149 881492 803346 458038 392241 -259610
5378 -259610 -956058 -893645 -388331 -28730 -18230 55349 -63388 256171 -96212 -860135
5368 -860135 -1177777 -1314908 -1092780 -1135309 -963501 -91999 614893 175142 -509556 -97288
5358 -97288 354012 756391 1359459 1080777 180973 -16979 -325715 -152928 -2948 378908
5348 378908 202501 314422 574323 283011 -164276 -508426 -916576 -994655 -1062557 -1386183
$$ packed form
5419a124702n9989L45726l7859q47677R3434O49285L57516J73788k9830j79959
5409f60267N20886r6347k8897L14640l5142n35342j93652O40713J32051n14697
5399d56054J87030N43012k90170r97240n90386N97361M76878N08644O64675K96932
5389I40682m250j37039J26843J02987K30079r8153k79657p8146l45308o5797o51851
5378b59610o96448O2413N05314L59601J0500P3579j18737L19559l52383p63923
5368h60135l17642j37131K22128m2529J71808Q71502P06892m39751o84698M12268
5358i7288M51300M02379O03068k78682q99804j97952l08736J72787J49980L81856
5348C78908j76407J11921K59901k91312m47287l44150m08150p8079o7902l23626
$$ plain form
5338 -1386183 -1069681 -522980 -462015 -274919 -186229 541505 709900 625875 222733 -483827
5328 -483827 -783234 -789101 -918356 -1186309 -1270263 -1122732 -1204651 -200493 324613 258405
5318 258405 -348195 -66388 106274 -555843 -472859 -830818 -1096417 -822202 -1212374 -1294887
5308 -1294887 -1475431 -1339064 -738679 -34356 -206381 -266793 -497394 -819591 -354134 756339
5298 756339 1543594 751052 607420 1096323 1784201 1448398 1264648 1084133 1029985 1102397
5288 1102397 631593 -61113 -163383 495671 -186115 -661377 -330096 -209472 271495 91929
5278 91929 -69168 37687 -185507 -228995 -6811 295792 781873 737686 244820 187343
5268 187343 -515264 -1313756 -1314026 -1247415 -1163887 -651208 -290108 -523311 -541971 -320764 -474521
$$ packed form
5338a386183L16502N46701O0965J87096Q8690P27734J68395q4025m03142p06560
5328d83827k99407n867j29255k67953q3954J47531q1919J004158N25106o6208
5318B58405o06600K81807J72662o62117Q2984l57959k65599K74215l90172q2513
5308a294887j80544J36367O00385P04323j72025o0412k30601l22197M65457J110473
5298G56339P87255p92542j43632M88903O87878l35803j83750j80515n4148P2412
5288A102397m70804o92706j02270O59054o81786m75262L31281J20624M80967j79566
5278I1929j61097J06855k23194m3488K22184L02603M86081m4187m92866n7477
5268A87343p02607p98492k70O6611Q3528N12679L61100k33203j8660K21207j53757
$$ plain form
5257 -474521 -611172 -587645 204665 901577 673690 396790 -129168 -254350 -500829 -425148
5247 -425148 -470338 -574387 -710408 -220008 82917 -541615 -560448 -411084 -515828 -675966
5237 -675966 -1050761 -936315 -908263 -1510691 -1567753 -863553 -697877 -784704 -754385 -1313520
5227 -1313520 -1805232 -1748506 -1328538 -492220 166945 889578 617181 473185 203448 139901
5217 139901 -309018 -440359 -870953 -1140105 -1445805 -1308313 -871938 -256064 611719 949929
5207 949929 1051208 814532 533164 857174 413465 -367093 -208660 115441 658190 594758
5197 594758 742972 572949 93628 116215 169177 -55988 -227724 -1023811 -1273078 -1137637
5187 -1137637 -305753 54675 -42596 -50145 -176909 54053 -21389 -274825 243329 397693
$$ packed form
5257d74521j36651K3527P92310O96912k27887k76900n25958j25182k46479P5681
5247d25148m5190j04049j36021M90400L02925o24532j8833J49364j04744j60138
5237f75966l74795J14446K8052o02428n7062P04200J65676q6827L0319n59135
5227a313520m91712N6726M19968Q36318O59165P22633k72397j43996k69737o3547
5217A39901m48919j31341m30594k69152l05700J37492M36375O15874Q67783L38210
5207I49929J01279k36676k81368L24010m43709p80558J58433L24101N42749o3432
5197E94758J48214j70023m79321K2587N2962k25165j71736p96087k49267J35441
5187a137637Q31884L60428r7271p549j26764K30962p5442k53436N18154J54364
$$ plain form
5177 397693 318890 -81115 -284154 -873244 -645386 -816595 -920659 -637619 -368672 -473086
5167 -473086 -562173 -550004 138778 498813 198883 448840 -74003 -1182331 -1413257 -1232416
5157 -1232416 -1135537 -880376 -788508 -554522 -460998 -68984 202807 3737 -1284928 -1673269
5147 -1673269 -1204779 -990236 -1138956 -1338520 -570760 98144 197017 480989 430074 63370
5137 63370 315025 849672 988678 594531 244511 570951 867617 701291 376811 578407
5127 578407 697146 371623 5047 50502 444422 431542 1047582 923089 803847 286150
5117 286150 27892 -191744 -1140713 -1468526 -564449 238877 127862 -49474 -523886 -860818
5107 -860818 -853723 -170857 654636 680450 734386 491243 304500 86880 10049 385892 64103
$$ packed form
5177C97693p8803m00005k03039n89090K27858j71209j04064K83040K68947j04414
5167d73086q9087J2169O88782L60035k99930K49957n22843j108328k30926J80841
5157a232416R6879K55161R1868K33986R3524L92014K71791j99070j288665l88341
5147a673269M68490K14543j48720j99564P67760O68904R8873K83972n0915l66704
5137F3370K51655N34647J39006l94147l50020L26440K96666j66326l24480K01596
5127E78407J18739l25523l66576M5455L93920j2880O16040j24493j19242n17697
5117B86150k58258k19636r48969l27813R04077Q03326j11015j77336m74412l36932
5107h60818P095O82866Q25493K5814N3936k43143j86743k17620p6831L75843l21789
$$ plain form
5096 64103 -656365 2708 449270 79115 162724 -373613 -85083 307431 393262 529826
5086 529826 351576 409903 137236 -280958 -321803 -563089 -437679 -107240 -22498 360370
5076 360370 -162459 -1048540 -1437286 -1151116 -454775 2465 9292 351642 474954 -37501
5066 -37501 -730258 -757307 -583764 -384903 -732847 -1080967 -260037 3549 -455012 -1087951
5056 -1087951 -1539733 -273792 517615 748232 1048014 1354072 1608506 1385804 525612
5047 525612 308330 769812 694264 454251 72565 -135086 -188241 -567598 -918837 -944170
5037 -944170 -853124 -662107 -54871 247635 491280 -379793 -265875 527781 246124 -669798
5027 -669798 -1037020 -983019 -1357880 -1207805 -1394229 -1909966 -2421389 -1446767 198063 977232
$$ packed form
5096F4103p20468O59073M46562l70155Q3609n36337K88530L92514Q5831J36564
5086E29826j78250N8327k72667m18194m0845k41286J25410L30439Q4742L82868
5076C60370n22829q86081l88746K86170O96341M57240O827L42350J23312n12455
5066c7501o92757k7049J73543J98861l47944l48120Q20930K63586m58561o32939
5056a087951m51782J265941P91407K30617K99782L06058K54434k22702q60192
5047E25612k17282M61482p5548k40013l81686k07651n3155l79357l51239k5333
5037i44170R1046J91017O07236L02506K43645q71073J13918P93656k81657r15922
5027f69798l67222N4001l74861J50075j86424n15737n11423R74622J644830P79169
$$ plain form
5017 977232 463802 -68427 -343783 -366953 68856 104459 161459 334105 692656 996037
5007 996037 593094 -296504 -260434 434090 959871 848243 150613 1604 -402431 -721015
4997 -721015 -536451 8043 1056538 1156823 1469966 1644057 1320620 448232 -990700
4988 -990700 -1304922 -1114738 -443831 -296216 -452095 -678389 -1243179 -1686715 -1319779 -787602
4978 -787602 -776475 -955636 265879 882678 774891 -222396 -1000412 -1244711 -690909 -461761
4968 -461761 -365141 -343465 372475 347479 -112924 -209240 -69689 215857 -51048 -500939
4958 -500939 -52959 352555 -408652 -306263 -91163 -91175 72226 97282 -68185 -306320 -608530
4947 -608530 -358541 -189698 2573 -295709 -780489 -587440 -16090 302551 212680 -19178
$$ packed form
5017I77232n13430n32229k75356k3170M35809L5603N7000J72646L58551L03381
5007I96037m02943q89598L6070O94524N25781j11628o97630j49009m04035l18584
4997g21015J84564N44494J048495J00285L13143J74091l23437q72388j438932
4988i90700l14222J90184O70907J47615j55879k26294n64790m43536L66936N32177
4978g87602J1127j79161J221515O16799j07787r97287p78016k44299N53802K29148
4968d61761R6620K1676P15940k4996m60403r6316J39551K85546k66905m49891
4958e00939M47980M05514p61207J02389K15100j2J63401K5056j65467k38135l02210
4947f08530K49989J68843J92271k98282m84780J93049N71350L18641q9871k31858
$$ plain form
4937 -19178 -45182 -226392 -526045 -441409 171669 336335 312140 127935 53077 401916 668371
4926 668371 317996 72615 181758 -151753 -467119 -542536 -516749 -552281 -632356 -369048
4916 -369048 492310 928429 728727 504413 257889 -667221 -988755 -369739 -423572 -610169
4906 -610169 -374528 -101825 11101 235717 591217 793521 725565 1023958 957904 1019377
4896 1019377 545471 -368931 -925782 -565019 -482585 -475550 30562 479131 994710 1415847
4886 1415847 1553058 499703 -60002 -85642 117814 411886 -17161 -807018 -654554 -320214
4876 -320214 441024 519684 470348 733407 624000 60541 -42954 125015 398087 405811
4866 405811 453691 264219 288195 118114 255630 388028 70161 -114904 60906 11931
$$ packed form
4937a9178k6004j81210k99653Q4636O13078J64666k4195j84205p4858L48839K66455
4926F68371l50375k45381J09143l33511l15366p5417K5787l5532q0075K63308
4916c69048Q61358M36119j99702k24314k46524r25110l21534O19016n3833j86597
4906f10169K35641K72703J12926K24616L55500K02304o7956K98393o6054O1473
4896A019377m73906r14402n56851L60763Q2434P035N06112M48569N15579M21137
4886A415847J37211j053355n59705k5640K03456K94072m29047p89857J52464L34340
4876c20214P61238P8660m9336K63059j09407n63459j03495J67969K73072P724
4866D05811M7880j89472K3976j70081J37516J32398l17867j85065J75810m8975
$$ plain form
4856 11931 -316728 -561221 -391857 -8570 284255 54602 -54375 180962 -127633 -296245
4846 -296245 -243351 -752394 -791057 -920285 -643465 411676 813911 275056 88426 651532
4836 651532 1053548 808036 592687 267815 -75781 -48020 104572 158084 -5947 56202
4826 56202 -51348 -38653 -22523 257485 230967 -460007 -622356 -429034 -815296 -708255
4816 -708255 -374485 -53851 180207 -361130 -662337 -558870 -742155 -336832 -279913 -100153
4806 -100153 437419 433226 -1048712 -3451293 -3480311 -2458216 -1793476 -1064649 -758233 -746816
4796 -746816 -297778 -392080 -443164 -1034468 -1596319 -1172423 -595735 -574003 -368110 -366391 -497319
4785 -497319 -482240 -833566 -1291399 -1022863 -1656997 -2754241 -2382420 -1878142 -1446620 -1162892
$$ packed form
4856A1931l28659k44493J69364L83287K92825k29653j08977K35337l08595j68612
4846b96245N2894n09043l8663j29228K76820J055141M02235n38855j86630N63106
4836F51532M02016k45512k15349l24872l43596K7761J52592N3512j64031O2149
4826E6202j07550J2695J6130K80008k6518o90974j62349J93322l86262J07041
4816g08255L33770L20634K34058n41337l01207J03467j83285M05323N6919J79760
4806a00153N37572m193j481938k402581k9018J022095O64740P28827L06416J1417
4796g46816M49038r4302n1084n91304n61851M23896N76688K1732K05893J719j30928
4785d97319J5079l51326m57833K68536o34134j097244L71821N04278M31522K83728
$$ plain form
4775 -1162892 -857249 -203049 516573 1054183 719469 24447 276692 581604 341836 -228599
4765 -228599 -551375 -885397 -212552 -272179 -645840 -1207726 -1912708 -1941261 -1242674 -529750
4755 -529750 61089 907350 898181 748131 487923 492418 220848 305396 -48849 -103472 526037
4744 526037 994805 664691 235654 248322 391037 493631 355017 -609057 -1012232 -900519
4734 -900519 -726892 -169471 -170793 -372875 -455339 344856 434398 424930 790536 932076 909553
4723 909553 855520 905257 945129 839368 900329 722032 556309 402532 -33573 -64432 -192180
4712 -192180 -476520 -540797 -259696 -85598 -302524 -652626 -292220 -244343 -599511 -551993
4702 -551993 -381887 -368050 29696 345735 70942 -497376 -1128704 -621642 -30370 307732
$$ packed form
4775a162892L05643O54200P19622N37610l34714o95022K52245L04912k39768n70435
4765b28599l22776l34022O72845n9627l73661n61886p04982k8553O98587P12924
4755e29750N90839Q46261r169j50050k60208M495k71570Q4548l54245n4623O29509
4744E26037M68768l30114m29037J2668J42715J02594j38614r64074m03175J11713
4734i00519J73627N57421j322k02082q2464Q00195Q9542r468L65606J41540k2523
4723I09553n4033M9737L9872j05761O0961j78297j65723j53777m36105l0859j27748
4712a92180k84340o4277K81101J74098k16926l50102L60406M7877l55168M7518
4702e51993J70106J3837L97746L16039k74793n68318o31328N07062N91272L38102
$$ plain form
4692 307732 -62759 -167152 159685 224550 85243 -577233 -1132945 -1110436 -1209794 -1454807
4682 -1454807 -1389661 -936282 -790557 -782738 -1085284 -967443 -1143051 -1342034 -693125 274047
4672 274047 653214 296665 236858 -290688 -824668 -1132295 -762792 -1267466 -1754975 -2212940
4662 -2212940 -2517158 -1688638 -1130323 -7206 -31494 -282841 -141904 -86088 -79530 -618040
4652 -618040 -1281836 -1379527 -1416473 -1304924 -1500197 -694325 -372056 -632806 -580444 -1356217
4642 -1356217 -1871190 -2331952 -2054088 -1336817 -1144648 -1303332 -2343249 -3287128 -3293770 -3110125
4632 -3110125 -3919526 -4670658 -4810955 -4508054 -4458135 -4912227 -4193721 -3373110 -3026884 -3275780
4622 -3275780 -3734662 -3952717 -3883895 -4343838 -6270283 -9457394 -13598257 -19514196 -23587612
$$ packed form
4692C07732l70491j04393L26837O4865j39307o62476n55712K2509r9358k45013
4682a454807O5146M53379J45725P819l02546J17841j75608j98983O48909R67172
4672B74047L79167l56549n9807n27546n33980l07627L69503n04674m87509m57965
4662b212940l04218Q28520N58315J123117k4288k51347J40937N5816O558n38510
4652f18040o63796r7691l6946J11549j95273Q05872L22269k60750N2362p75773
4642a356217n14973m60762K77864P17271J92169j58684j039917r43879o642J83645
4632c110125q09401p51132j40297L02901M9919m54092P18506Q20611L46226k48896
4622c275780m58882k18055O8822m59943j926445l187111m140863n915939m073416
$$ plain form
4613 -23587612 -27144041 -31383004 -39141907 -62267899 -115731767 -205516335 -231577623 -165091933
4605 -165091933 -104070292 -67837294 -49129792 -39877662 -30748448 -21756012 -14933478 -10541232
4597 -10541232 -8035345 -7192265 -7146845 -7044541 -6518996 -5292073 -4126645 -2795656 -2657365
4588 -2657365 -3318651 -4118805 -3876986 -2833817 -1759241 -1044773 -596547 -952305 -1344644
4579 -1344644 -762012 -277165 -97584 -860755 -1423678 -1416547 -1141603 126855 942099 1231121
4569 1231121 1590011 1573973 757711 307351 -58727 -444927 -286908 -251391 -288087 -542609
4559 -542609 120293 510204 95099 359574 248161 -78674 -410 -101353 -366771 -222443
4549 -222443 -81224 51654 -42434 -53550 -43629 -543765 -795614 -713696 -588478 -445430 -320092
$$ packed form
4613b3587612l556429m238963p758903k3125992n3463868q9784568k6061288O6485690
4605a65091933O1021641L6232998J8707502R252130R129214Q992436O822534M392246
4597a0541232K505887Q43080M5420J02304N25545J226923J165428J330989J38291
4588b657365o61286q00154K41819J043169J074576P14468M48226l55758l92339
4579a344644N82632M84847J79581p63171n62923P131K74944J268458Q15244K89022
4569A231121L58890j6038q16262m50360l66078l86200J58019L5517l6696k54522
4559e42609O62902L89911m15105K64475j11413l26835P8264j00943k65418J44328
4549b22443J41219J32878r4088j1116R921n00136k51849Q1918J25218J43048J25338
$$ plain form
4538 -320092 -47662 -200854 -8474 -459238 -353482 492324 392600 -114626 -375684 -1183782
4528 -1183782 -1660219 -1377613 -1319060 -1447459 -1018078 -526507 -52028 -402287 -645441 -795108
4518 -795108 -1279634 -1172066 -618594 -667291 -308079 -765609 -1228890 -1030468 -1078071 -827422
4508 -827422 -422948 -112024 252385 -263291 -701464 -604966 -373161 -126576 133951 -485011
4498 -485011 -1103962 -852598 -164324 -370336 -711124 -526207 46685 547206 215829 -326341
4488 -326341 -593263 -736892 -1132507 -1947405 -2776623 -1973791 -1357759 -830317 -995783 -1530720
4478 -1530720 -1331970 -796235 -428432 11648 354136 -85538 -625954 -118762 759150 701863
4468 701863 340781 535272 406775 420418 212866 1251439 1747443 1233364 1110064 1251571
$$ packed form
4538c20092K72430j53192J92380m50764J05756Q45806r9724n07226k61058q08098
4528a183782m76437K82606N8553j28399M29381M91571M74479l50259k43154j49667
4518g95108m84526J07568N53472m8697L59212m57530m63281J98422m7603K50649
4508h27422M04474L10924L64409n15676m38173R6498K31805K46585K60527o18962
4498d85011o18951K51364O88274k06012l40788J84917N72892N00521l31377n42170
4488c26341k66922j43629l95615q14898q29218Q02832O16032N27442j65466n34937
4478a530720J98750N35735L67803M40080L42488m39674n40416N07192Q77912n7287
4468G01863l61082J94491j28497J3643k07552J038573M96004n14079j23300J41507
$$ plain form
4458 1251571 1287404 828788 770173 878213 226128 -10323 121103 427625 476506 121980
4448 121980 -287820 23113 346973 350910 155096 -823983 -1025842 -685231 -427948 -468373
4438 -468373 -21401 -278027 -731434 -1316327 -1639977 -1212790 -571552 632128 1578394 1326633
4428 1326633 580090 54196 228425 171837 29212 433583 451528 -227438 -1244051 -1701311
4418 -1701311 -801519 -122519 4397 67045 -405644 -111967 79418 -546290 -543929 -652828
4408 -652828 -425359 348579 430801 -495460 -824742 -722043 -885475 -899651 -719970 -561724
4398 -561724 67340 406360 -3948 -593321 -1286823 -519994 -249315 367205 894819 1024699
4388 1024699 566031 -321901 -446723 157649 624349 799982 931138 1177338 1353929 1203735
$$ packed form
4458A251571L5833m58616n8615J08040o52085k36451J31426L06522M8881l54526
4448A21980m09800L10933L23860L937j95814r79079k01859L40611K57283m0425
4438d68373M46972k56626m53407n84893l23650M27187O41238J203680R46266k51761
4428A326633p46543n25894J74229n6588j42625M04371J7945o78966j016613m57260
4418a701311Q99792O79000J26916O2648m72689K93677J91385o25708K361j08899
4408f52828K27469P73938Q2222r26261l29282J02699j63432j4176J79681J58246
4398e61724O29064L39020m10308n89373o93502P66829K70679O16520N27614J29880
4388A024699m58668q87932j24822O04372M66700J75633J31156K46200J76591j50194
$$ plain form
4378 1203735 643260 370889 123196 -154847 -391429 -840292 -603627 15471 107285 -466976
4368 -466976 -581739 -125680 -496401 -856407 -678304 232721 52086 -62488 45737 138732
4358 138732 73100 -123034 -334986 -476495 -720473 -882887 -896124 -469964 -59275 -202101
4348 -202101 168629 85851 -102802 327365 468963 -385378 15642 312259 10920 197785
4338 197785 629111 169718 -407146 -380841 19203 -289377 -457647 -898174 -1571577 -1425496
4328 -1425496 -735103 -618655 -321676 -295108 -45441 379592 634001 469985 196335 84650
4318 84650 -388228 -705220 -829466 -107661 539955 -21235 96117 750214 685154 -114998
4308 -114998 -565236 -375086 -158679 -367407 -998131 -1469094 -1405051 -1101477 -882484 -1026200
$$ packed form
4378A203735n60475k72371k47693k78043k36582m48863K36665O19098R1814n74261
4368d66976j14763M56059l70721l60006J78103R11025j80635j14574J08225R2995
4358A38732o5632j96134k11952j41509k43978j62414j3237M26160M10689j42826
4348b02101L70730q2778j88653M30167J41598q54341M01020K96617l01339J86865
4338A97785M31326m59393n76864K6305M00044l08580j68270m40527o73403J46081
4328a425496O90393J16448K96979K6568K49667M25033K54409j64016k73650j11685
4318H4650m72878l16992j24246P21805O47616n61190J17352O54097o5060q00152
4308a14998m50238J90150K16407k08728o30724m70963O4043L03574K18993j43716
$$ plain form
4298 -1026200 -927642 -853636 -75077 916201 1395546 1344460 790468 781259 432490 -69633
4288 -69633 -356886 -1016439 -694809 -363253 116634 505171 532528 503130 972151 281512
4278 281512 106199 372528 -2343 -42714 -243291 -244972 -688504 -628750 -1049270 -1002856 -534787
4267 -534787 -284489 102690 493901 375981 -257284 19436 384770 224404 -35108 -257292
4257 -257292 -86952 -212090 -613419 -1117804 -229355 -153344 -608353 -627702 -872156 -928915
4247 -928915 -728203 -569384 -379753 -451151 -277406 -50716 192847 627710 1047315 1015154
4237 1015154 1340292 1521115 897443 364107 46456 462985 -19665 108156 587572 1061074
4227 1061074 1118334 248245 -402426 -151028 -123418 -118573 -899890 -1584552 -1342726 -516338
$$ packed form
4298a026200R8558P4006P78559R91278M79345n1086n53992r209l48769n02123
4288f9633k87253o59553L21630L31556M79887L88537K7357k9398M69021o90639
4278B81512j75313K66329l74871m0371k00577j681m43532N9754m20520M6414M68069
4267e34787K50298L87179L91211j17920o33265K76720L65334j60366k59512k22184
4257b57292J70340j25138m01329n04385Q88449P6011m55009j9349k44454n6759
4247i28915K00712J58819J89631p1398J73745K26690K43563M34863M19605l2161
4237A015154L25138J80823o23672n33336l17651M16529m82650J27821M79416M73502
4227A061074N7260q70089o50671K51398K7610M845p81317o84662K41826Q26388
$$ plain form
4217 -516338 667123 1513625 1382435 733511 346223 -14783 -367889 -225333 214366 942459
4207 942459 875436 897639 439050 -105238 -631138 -496041 -507232 -568805 -411643 -986707
4197 -986707 -1024174 -170088 495264 657756 422611 231121 96789 15114 65083 -206019
4187 -206019 -179932 -443481 -883981 -958476 -1207507 -1516047 -1631148 -883810 -482404 -648169
4177 -648169 -1032059 -394429 -28537 -791511 -1294795 -1701424 -2303505 -2172857 -969986 -539389
4167 -539389 -463968 -443748 -515678 -333231 -78528 380859 402055 603449 450105 182208
4157 182208 -342904 -1231002 -1065942 -644926 76902 106809 -701849 -1031765 -1143154 -992345
4147 -992345 -868839 -404621 256645 69312 -88251 881655 1768866 1691940 1635973 1157708
$$ packed form
4217e16338J183461Q46502j31190o48924l87288l61006l53106J42556M39699P28093
4207I42459o7023K2203m58589n44288n25900J35097j1191o1573J57162n75064
4197i86707l7467Q54086O65352J62492k35145j91490j34332q1675M9969k71102
4187b06019K6087k63549m40500p4495k49031l08540j15101P47338M01406j65765
4177f48169l83890O37630L65892p62974n03284m06629o02081J30648J202871M30597
4167e39389P5421K0220p1930J82447K54703M59387K1196K01394j53344k67897
4157A82208n25112q88098J65060M21016P21828K9907q08658l29916j11389J50809
4147i92345J23506M64218O61266j87333j57563R69906Q87211p6926n5967m78265
$$ plain form
4137 1157708 1037484 951062 804651 672103 223283 366279 991484 1149439 812509 618149
4127 618149 568570 451997 131207 -197724 -380453 -614152 -745645 -673827 -349792 -156970
4117 -156970 -415277 -668134 -315837 -577697 -1231885 -1203353 -710799 -222745 -124039 -168776
4107 -168776 -125369 50881 857047 1817041 1226217 498348 439123 -210228 -1005322 -1314042
4097 -1314042 -1167337 -947993 -365367 27424 563295 1243436 1271735 1381561 863774 296958
4087 296958 294314 563728 1200941 1317561 1322867 1118122 -67195 -609909 -133333 -516107
4077 -516107 -639163 -269761 325314 684966 477752 -5790 -424524 -680686 -82252 857666
4067 857666 806421 -83720 -670163 -459919 65297 -268190 -346379 -486655 -1152298 -1550456
$$ packed form
4137A157708j20224q6422j46411j32548m48820J42996O25205J57955l36930j94360
4127F18149m9579j16573l20790l28931j82729k33699j31493P1818L24035J92822
4117a56970k58307k52857L52297k61860o54188K8532M92554M88054R8706m4737
4107a68776M3407J76250Q06166R59994n90824p27869n9225o49351p95094l08720
4097a314042J46705K19344N82626L92791N35871O80141K8299J09826n17787n66816
4087B96958k644K69414O37213J16620N306k04745j185317n42714M76576l82774
4077e16107j23056L69402N95075L59652k07214m83542m18734k56162N98434R39918
4067H57666n1245q90141n86443K10244N25216l33487p8189j40276o65643l98158
$$ plain form
4057 -1550456 -1899288 -1316576 -550395 -351538 -194998 42837 182304 313727 20852 -111415
4047 -111415 -96701 -110931 66212 -88648 -325595 -435201 -200984 545619 593766 -177478
4037 -177478 -956668 -1118377 -671750 -4559 303044 592770 1215966 1555417 691972 163611
4027 163611 20014 21206 27489 644242 394275 -460884 -433241 -19477 -86721 3691 259552
4016 259552 519300 177178 395981 817513 1341732 905476 908574 689448 816588 1097396
4006 1097396 899662 545870 878370 492466 -406643 -707823 -231943 122149 -162749 -381358
3996 -381358 -473090 34283 347022 488361 533946 305923 750862 846345 270141 101172
3986 101172 -178488 -812363 -751979 -182623 -756515 -760388 49529 51908 331193 714792 669418
$$ packed form
4057a550456l48832N82712P66181J98857J56540K37835J39467J31423k92875j32267
4047a11415J4714j4230J77143j54860k36947j09606K34217P46603M8147p71244
4037a77478p79190j61709M46627O67191L07603K89726O23196L39451q63445n28361
4027A63611j43597J192O283O16753k49967q55159K7643M13764o7244R0412K55861
4016B59552K59748l42122K18803M21532N24219m36256L098k19126J27140K80808
4006A097396j97734l53792L32500l85904q99109l01180M75880L54092k84898k18609
3996c81358r1732N07373L12739J41339M5585k28023M44939R5483n76204j68969
3986A01172k79660o33875O0384N69356n73892l873Q09917K379K79285L83599m5374
$$ plain form
3975 669418 1047979 836330 326605 22255 -584746 -1423057 -1985655 -1155316 51029 709917
3965 709917 -281200 -1048445 -823737 -778969 -795307 -1026983 -1325985 -761521 -119542 31802
3955 31802 345573 162553 357025 220957 7608 762257 316141 -692622 -277198 50960
3945 50960 33516 -290900 -415606 -261700 59043 -700327 -1494920 -1472074 -903277 -69432
3935 -69432 474874 208727 -202504 -319538 -40772 350990 318054 -55453 -464097 -1304451
3925 -1304451 -1455563 -572476 266956 740834 316611 -589899 -591194 94259 -190874 237763
3915 237763 615468 1115605 778631 -78323 -23453 -41923 -1774 -76069 724120 905610
3905 905610 888809 657701 -703589 -980497 125294 578967 12003 -295030 -391889 -421504
$$ packed form
3975F69418L78561k11649n09725l04350o07001q38311n62598Q30339J206345O58888
3965G09917r91117p67245K24708M4768j6338k31676k99002N64464O41979J51344
3955C1802L13771j83020J94472j36068k13349P54649m46116j008763M15424L28158
3945E0960j7444l24416j24706J53906L20743p59370p94593K2846N68797Q33845
3935f9432N44306k66147m11231j17034K78766L91762l2936l73507m08644q40354
3925a304451j51112Q83087Q39432M73878m24223r06510j295O85453k85133M28637
3915B37763L77705N00137l36974q56954N4870j8470M0149p4295Q00189J81490
3905I05610j6801k31108j361290k76908J105791M53673n66964l07033r6859k9615
$$ plain form
3895 -421504 -595806 -499985 59427 -44839 -233872 -151433 370538 583578 -543920 -1428766
3885 -1428766 -1652335 -1197444 -714111 -167922 117857 -177862 203834 946252 750575 181546
3875 181546 -160653 761648 925755 608865 802694 602774 75739 -542020 -663377 -902488
3865 -902488 -1102668 -711766 -237970 342820 31530 -149735 -35874 120102 26609 -496482
3855 -496482 8399 -83737 -508531 165527 495941 321882 350063 349232 -190905 -100871 -150383
3844 -150383 -569287 -908665 -530092 -611667 -370112 -575651 -889645 -799613 -324369 -48130
3834 -48130 212348 191309 664179 644492 824783 325767 -22785 -39091 451404 95109
3824 95109 -97637 58584 685992 363763 37686 517289 561457 653154 -204221 -958090
$$ packed form
3895d21504j74302R5821N59412j04266j89033Q2439N21971K13040j127498q84846
3885a428766k23569M54891M83333N46189K85779k95719L81696P42418j95677n69029
3875A81546l42199R22301J64107l16890J93829j99920n27035o17759j21357k39111
3865i02488k00180L90902M73796N80790l11290j81265J13861J55976r3493n23091
3855d96482N04881r2136m24794O74058L30414j74059K8181q31n40137R0034m9512
3844a50383m18904l39378L78573q1575K41555k05539l13994R0032M75244K76239
3834d8130K60478k1039M72870j9687J80291m99016l48552j6306M90495l56295
3824I5109j92746J56221O27408l22229l26077M79603M4168R1697q57375p53869
$$ plain form
3814 -958090 -421703 49727 -251935 -518775 -725571 -773866 -309731 -91491 -54992 812434
3804 812434 1505698 2049651 1507823 963813 692214 -332053 -626611 -424565 -328051 -188325
3794 -188325 246311 583237 896672 655241 470149 613822 151535 216401 799365 741187
3784 741187 356628 357693 679872 412613 602376 1004644 1185218 1362881 1221518 638632
3774 638632 545432 714714 370213 418630 879145 1077201 225573 -429812 309996 840918
3764 840918 466712 -42280 -673977 -912227 -1005065 -1112322 -1088175 -679471 42630 443478
3754 443478 -91602 -104018 43467 -439493 -745650 -562348 -956831 -1188919 -758145 -211475
3744 -211475 345401 453967 124543 -289048 -264136 -198871 483837 736996 894646 1304816
$$ packed form
3814i58090N36387M71430l01662k66840k06796m8295M64135K18240L6499Q67426
3804H12434O93264N43953n41828n44010k71599j024267k94558K02046R6514J39726
3794a88325M34636L36926L13435k41431j85092J43673m62287O4866N82964n8178
3784G41187l84559J065L22179k67259J89763M02268J80574J77663j41363n82886
3774F38632r3200J69282l44501M8417M60515J98056q51628o55385P39808N30922
3764H40918l74206n08992o31697k38250r2838j07257K4147M08704P22101M00848
3754D43478n35080j2416J47485m82960l06157J83302l94483k32088M30774N46670
3744b11475N56876J08566l29424m13591K4912O5265O82708K53159J57650M10170
$$ plain form
3734 1304816 1018529 975790 1090640 848017 453844 296183 256024 949578 1071832 205384
3724 205384 -34907 -249818 -469729 -682216 -777002 -416602 -144305 -666803 -870892 -752684
3714 -752684 -395332 -275872 -3447 -175953 -642151 -902308 -1456295 -1229690 -1142484 -602400
3704 -602400 -202837 -205492 -192977 328790 245596 -486949 -337878 254376 458 -353850
3694 -353850 227423 1070896 1214528 484772 775385 1126213 726401 374555 322040 100943
3684 100943 92859 -333086 -732467 -1178694 -912315 -850845 -948231 -547812 31358 338836
3674 338836 1032782 1541145 688276 337547 902770 844146 675034 959854 1509592 1219566
3664 1219566 736574 694594 832672 660138 733503 519792 228280 -12273 465770 507316
$$ packed form
3734A304816k86287m2739J14850k42623l94173j57661m0159O93554J22254q66448
3724B05384k40291k14911k19911k12487r4786L60400K72297n22498k04089J18208
3714g52684L57352J19460K72425j72506m66198k60157n53987K26605Q7206N40084
3704f02400L99563k655J2515N21767q3194p32545J49071N92254k53918l54308
3694c53850N81273Q43473J43632p29756K90613L50828l99812l51846n2515k21097
3684A00943q084m25945l99381m46227K66379O1470r7386M00419N79170L07478
3674C38836O93946N08363q52869l50729N65223n8624j69112K84820N49738k90026
3664A219566m82992m1980J38078j72534P3365k13711k91512k40553M78043M1546
$$ plain form
3654 507316 9276 -174489 279480 -313144 -788127 -274855 -45919 317083 750189 729349
3644 729349 -93890 -800902 -839312 -923408 -556576 23833 469214 403850 52118 394251
3634 394251 445343 -263950 -727352 -643594 -151178 -115570 -451898 -493873 -340081 -201422
3624 -201422 -154667 2834 1030 -652402 -833498 -301418 188703 198972 -555347 -1460515
3614 -1460515 -1128815 -45839 91380 689411 744063 -100071 -502045 -624999 -565409 -83310
3604 -83310 338800 167102 -53721 362623 726872 696609 1087845 1155339 1180170 518899
3594 518899 119031 -701929 -944633 -614599 -388138 -242895 -171848 -102259 -540746 -295742
3584 -295742 310102 -178780 -1035287 -1992088 -1963696 -1377165 -425228 276771 -82508 193945
$$ packed form
3654E07316m98040j83765M53969n92624m74983N13272K28936L63002M33106k0840
3644G29349q23239p07012l8410q4096L66832N80409M45381o5364l51732L42133
3634C94251N1092p09293m63402Q3758M92416L5608l36328m1975J53792J38659
3624b01422M6755J57501j804o53432j81096N32080M90121J0269p54319r05168
3614a460515L31700J082976J37219N98031N4652q44134m01974j22954N9590M82099
3604h3310M22110j71698k20823M16344L64249l0263L91236O7494K4831o61271
3594E18899l99868q20960k42704L30034K26461J45243P1047O9589m38487K45004
3584b95742O05844m88882q56507r56801K8392N86531R51937P01999l59279K76453
$$ plain form
3574 193945 447313 96071 -451830 -720433 -503490 -531975 -429839 -454706 311763 184713
3564 184713 -146295 -58091 -1243820 -1706927 -1020677 -576724 -312345 -37806 -108741 68383
3554 68383 -74364 -519344 -1133701 -1524264 -1398722 -963064 -739316 -678878 -1160907 -620988
3544 -620988 230826 497435 381487 161024 89977 570966 417081 -117613 464853 1410755
3534 1410755 1549986 1255080 677328 -105398 -61957 -3417 -408242 -548032 349952 924387
3524 924387 1019591 906579 557962 -635042 -1545767 -1981047 -784528 -718872 -1526334 -1700564
3514 -1700564 -1307012 -770237 -594525 -667089 -587873 -225877 -412497 -328341 -426584 -429627 383644
3503 383644 596667 86957 330518 320058 180580 37031 -642024 -863628 -361841 -317945
$$ packed form
3574A93945K53368l51242n47901k68603K16943k8485J02136k4867P66469j27050
3564A84713l31008Q8204j185729m63107O86250M43953K64379K74539p0935J77124
3554F8383j42747m44980o14357l90563J25542M35658K23748O0438m82029N39919
3544f20988Q51814K66609j15948k20463p1047M80989j53885n34694N82466R45902
3534A410755J39231k94906n77752p82726M3441N8540m04825j39790Q97984N74435
3524I24387R5204j13012l48617j193004r10725m35280J196519O5656q07462j74230
3514a700564L93552N36775J75712p2564P9216L61996j86620Q4156r8243l043Q13271
3503C83644K13023n09710K43561j0460j39478j43549o79055k21604N01787M3896
$$ plain form
3493 -317945 -837187 -1181147 -616435 717300 1041223 161984 -146049 -305246 299771 227971
3483 227971 -226928 -363687 -14683 607681 548353 112081 709336 746399 681373 962191
3473 962191 1242097 1291994 1129631 288581 -346260 -239247 -190148 -43142 104696 340961
3463 340961 -191400 -59053 98980 61980 293591 323632 327446 223445 -225799 -397257
3453 -397257 -566355 -304301 100971 139538 -69372 -206777 161229 -5765 -673020 -1038697
3443 -1038697 -1059254 -483555 346737 231903 -291822 -408793 -468632 -33779 -16700 -300998
3433 -300998 -472044 -888945 -1760574 -2203448 -2134789 -1197107 -789685 -832404 -325110 -318965
3423 -318965 -449768 -709145 -703307 -467603 -425476 -995235 -1510943 -1854568 -1156858 -276327
$$ packed form
3493c17945n19242l43960N64712J333735L23923q79239l08033j59197O05017p1800
3483B27971m54899j36759L49004O22364n9328m36272N97255L7063o5026K80818
3473I62191K79906M9897j62363q41050o34841J07013M9099J47006J47838K36265
3463C40961n32361J32347J58033l7000K31611L0041L814j04001m49244j71458
3453c97257j69098K62054M05272L8567k08910j37405L68006j66994o67255l65677
3443a038697k0557N75699Q30292j14834n23725j16971n9839M34853J7079k84298
3433c00998j71046m16901q71629m42874O8659R37682M07422m2719N07294O145
3423c18965j30803k59377N838K35704M2127n69759n15708l43625O97710Q80531
$$ plain form
3413 -276327 -770841 -614808 25536 -133790 176818 793075 1345088 1098331 -61694 16688
3403 16688 678187 1363597 1454001 1861470 1977941 1745477 978462 494172 222067 -69681
3393 -69681 -308482 -371432 125651 306059 -116889 -59615 845320 411962 -531181 -528414 191814
3382 191814 508972 768729 475805 147212 -108788 -553300 -989863 -837875 -713649 -1206254
3372 -1206254 -903491 -536343 -181122 468729 565694 -184103 -578200 -456190 471107 911003
3362 911003 212634 -557383 -952322 -924103 -520482 -382720 382489 638162 459546 73071
3352 73071 -283628 297913 1057442 998894 362989 -130590 207149 818376 1038450 475420
3342 475420 5825 -111066 -114195 -80692 265390 728674 722760 1361401 1582044 1428671 1387696
$$ packed form
3413b76327m94514J56033O40344j59326L10608O16257N52013k46757j160025P8382
3403A6688O61499O85410R0404M07469J16471k32464p67015m84290k72105k91748
3393f9681k38801o2950M97083J80408m22948N7274R04935m33358r43143K767P20228
3382A91814L17158K59757k92924l28593k56000m44512m36563J51988J24226m92605
3372a206254L02763L67148L55221O49851R6965p49797l94097J22010R27297M39896
3362I11003o98369p70017l94939K8219M03621J37762P65209K55673j78616l86475
3352G3071l56699N81541P59529n8548o35905m93579L37739O11227K20074n63030
3342D75420m69595j16891l129L3503L46082M63284n914O38641K20643j53373m0975
$$ plain form
3331 1387696 785860 352141 662135 692296 830189 769792 194435 -361132 -306892 511352
3321 511352 846757 420927 226324 -94360 -681694 -852773 -812662 -440998 21487 -38704
3311 -38704 -280803 -1021943 -1616730 -1146015 -716025 -1004555 -327413 -79773 -462062 -1239919
3301 -1239919 -1214528 -1277686 -1140881 -460270 -365894 -350808 100942 966168 1036140 568474
3291 568474 15350 -232027 -124684 -246637 -752 -68401 -424211 -1041504 -88391 363082
3281 363082 815722 1611263 1775485 817952 580905 1022106 965100 626279 213710 -106299
3271 -106299 -397238 -439463 -738625 -942860 -563485 -899192 -1168871 -571146 254759 572767
3261 572767 954662 916273 874104 794771 443907 86385 34325 -466815 -585375 -182225
$$ packed form
3331A387696o01836m33719L09994L0161J37893o0397n75357n55567N4240Q18244
3321E11352L35405m25830j94603l20684n87334j71079M0111L71664M62485o0191
3311c8704k42099p41140n94787M70715M29990k88530O77142K47640l82289p77857
3301a239919K5391o3158J36805O80611R4376J5086M51750Q65226O9972m67666
3291E68474n53124k47377J07343j21953K45885o7649l55810o17293R53113M51473
3281C63082M52640P95541J64222r57533k37047M41201n7006l38821m12569l20009
3271a06299k90939m2225k99162k04235L79375l35707k69679N97725Q25905L18008
3261E72767L81895l8389m2169p9333l50864l57522n2060n01140j18560M03150
$$ plain form
3251 -182225 256905 548041 371888 157920 -53008 214475 822598 969523 377816 498230
3241 498230 1123837 1223279 422043 -202410 171259 547594 607733 195850 41374 184768
3231 184768 134284 -275015 14155 -467456 -810615 -95987 -602230 -1104093 -1207818 -762243
3221 -762243 -681489 -629788 -207914 -432430 -592699 -294791 -324409 -394479 -260183 -341938 -755091
3210 -755091 -291301 404450 306784 -150800 -252448 -381698 -612415 -290301 402204 -162945
3200 -162945 -225832 -263655 -158941 -556199 -214223 -76321 -675450 -978241 -1211391 -716571
3190 -716571 -673637 -195685 -181974 367576 1260938 1691654 1878362 1512277 787638 405674
3180 405674 -79534 -838104 -582366 616815 1179610 1289263 858826 611335 1344665 1124584
$$ packed form
3251a82225M39130K91136j76153k13968k10928K67483O08123J46925n91707J20414
3241D98230O25607R9442q01236o24453L73669L76335O0139m11883j54476J43394
3231A84768n0484m09299K89170m81611l43159P14628n06243n01863j03725M45575
3221g62243Q0754N1701M21874k24516j60269K97908k9618p0070J34296q1755m13153
3210g55091M63790O95751r7666m57584j01648j29250k30717L22114O92505n65149
3200a62945o2887l7823J04714l97258L41976J37902n99129l02791k33150M94820
3190g16571M2934M77952J3711N49550Q93362M30716J86708l66085p24639l81964
3180D05674m85208p58570K55738J199181N62795J09653m30437k47491P33330k20081
$$ plain form
3170 1124584 546282 317179 -35712 -175923 369151 333661 60406 -289215 -1096416 -1125467
3160 -1125467 -503347 -490824 -691992 -1007469 -407064 -13234 340324 268818 313550 364329
3150 364329 188711 246685 807724 881690 427382 125170 504319 235130 363286 756951
3140 756951 1486207 1808918 1305726 583354 108990 211770 -307764 -554086 -634000 -733518
3130 -733518 -729715 -1194275 -1700574 -1672507 -892386 -638903 -187967 477553 1276 -664386
3120 -664386 -306367 -91976 -149188 -554539 -774122 -658301 -591921 -560498 -496035 -1231246
3110 -1231246 -882494 398474 779542 701738 919341 616520 -213091 -415301 -124273 -253719
3100 -253719 -901677 -1110688 -626375 -1148740 -1378085 -522247 77736 807624 655200 686901
$$ packed form
3170A124584n78302k29103l52891j40211N45074l5490k73255l49621q07201k9051
3160a125467O22120J2523k01168l15477O00405L93830L53558p1506M4732N0779
3150C64329j75618N7974N61039P3966m54308l02212L79149k69189J28156L93665
3140G56951P29256L22711n03192p22372m74364J02780n19534k46322p9914r9518
3130g33518L803m64560n06299K8067P80121K53483M50936O65520m76277o65662
3120f64386L58019K14391n7212m05351k19583J15821O6380L1423O4463p35211
3110a231246L48752J280968L81068p7804K17603l02821q29611k02210K91028j29446
3100b53719o47958k09011M84313n22365k29345Q55838N99983P29888j52424L1701
$$ plain form
3090 686901 616870 172527 289316 466350 526690 -37319 405802 723336 252114 378420
3080 378420 676906 474350 16277 -263209 -650385 -927090 -592781 -280274 -432263 -75696
3070 -75696 206970 -107929 -674180 -1055697 -718428 -651296 -72660 407564 770042 875898
3060 875898 129278 58689 404823 336385 -207468 -663305 -747157 -181135 133141 644719
3050 644719 965614 1380998 1359265 998089 536928 925606 406536 293924 783671 823976
3040 823976 423498 258266 -494630 -997177 -698986 -440276 -582935 -1105813 -1060050 -599102
3030 -599102 -1238561 -1010594 -578290 327169 499429 438649 235707 -20533 -5498 -511849
3020 -511849 -566505 -614236 -526751 -119262 699367 1178007 1078574 402513 205584 182109 234243
$$ packed form
3090F86901p0031m44343J16789J77034O0340n64009M43121L17534m71222J26306
3080C78420K98486k02556m58073k79486l87176k76705L34309L12507j51989L56567
3070g5696K82666l14899n66251l81517L37269O7132N78636M80224L62478J05856
3060H75898p46620p0589L46134o8438n43853m55837q3852N66022L14276N11578
3050F44719L20895M15384k1733l61176m61161L88678n19070j12612M89747M0305
3040H23976m00478j65232p52896n02547K98191K58710j42659n22878M5763M60948
3030e99102o39459K27967M32304R05459J72260o0780k02942k56240J5035n06351
3020e11849n4656m7731Q7485M07489Q18629M78640r9433o76061j96929k3475N2134
$$ plain form
3009 234243 270550 67843 49036 697070 1351922 1338293 1468669 1531366 1012155 913723 516491
2998 516491 -150972 118016 141802 -260227 -82449 -133467 -113169 47311 -144870 -282613
2988 -282613 -331625 -509400 -798891 -151572 15628 -19676 410408 284358 173350 380846
2978 380846 189249 139332 420005 780859 1334633 1044549 1210890 1427140 1265163 1187605
2968 1187605 437640 -647283 -1334214 -1358155 -1194763 -909666 119111 808661 791428 814155
2958 814155 452901 -518888 -943562 -742168 -1116318 -1372239 -1092671 -711088 -966277 -385774
2948 -385774 483618 -153177 -889809 -772383 -508987 -98415 763590 977935 -118525 -505532
2938 -505532 -382351 -731436 -178205 39009 -101081 442138 1032655 814566 305623 -335334
$$ packed form
3009B34243L6307k02707j8807O48034O54852j3629J30376O2697n19211r8432l97232
2998E16491o67463K68988K3786m02029J77778n1018K0298J60480j92181j37743
2988b82613m9012j77775k89491O47319J67200l5304M30084j26050j11008K07496
2978C80846j91597m9917K80673L60854N53774k90084J66341K16250j61977p7558
2968A187605p49965j084923o86931k3941J63392K85097J028777O89550j7233K2727
2958H14155l61254r71789m24674K01394l74150k55921K79568L81583k55189N80503
2948c85774Q69392o36795p36632J17426K63396M10572Q62005K14345j096460l87007
2938e05532J23181l49085N53231K17214j40090N43219N90517k18089n08943o40957
$$ plain form
2928 -335334 -83681 125966 661445 796210 1307473 1404074 655079 -169078 457667 623564
2918 623564 971589 820681 703601 712578 163265 -428738 6655 427198 635900 205537
2908 205537 -5954 693091 791032 1144474 237456 -290881 -578061 -443749 410907 1081898
2898 1081898 1292389 1063556 824833 205191 24432 -606054 -1371881 -1336589 -114327 284612
2888 284612 521726 511671 302199 17895 -21823 597912 633693 463506 -135165 -542015
2878 -542015 -395618 -210828 -368404 -679048 114225 514789 -212839 -193636 249548 252597
2868 252597 13844 117673 555362 968446 820575 274529 -254578 -44374 51570 71869
2858 71869 89946 -411506 -154159 -260379 -508860 -584219 -343270 -198321 -403516 -384031
$$ packed form
2928c35334K51653K09647N35479J34765N11263R6601p48995q24157O26745J65897
2918F23564L48025j50908j17080Q977n49313n92003M35393M20543K08702m30363
2908B05537k11491O99045R7941L53442r07018n28337k87180J34312Q54656O70991
2898A081898K10491k28833k38723o19642j80759o30486p65827L5292J222262L98939
2888B84612K37114j0055k09472k84304l9718O19735L5781j70187n98671m06850
2878e42015J46397J84790j57576l10644P93273M00564p27628J9203M43184L049
2868B52597k38753J03829M37689M13084j47871n46046n29107K10204R5944K0299
2858G1869J8077n01452K57347j06220k48481p5359K40949J44949k05195J9485
$$ plain form
2848 -384031 -264909 -660841 -782158 -417943 -86750 134916 383481 -139789 -445630 -472125
2838 -472125 -919109 -206795 1208199 1917709 1091846 384294 567880 537495 660393 195224
2828 195224 -300670 -356554 -192148 20582 -252020 -499948 109460 286057 475665 765621
2818 765621 638598 174898 -1101198 -1563231 -1160374 -363436 499903 41938 -269429 190115
2808 190115 611237 371140 -200971 -376802 -689342 -1150379 -1133706 17706 641148 80148
2798 80148 -780401 -1369781 -1692820 -1433003 -547718 392672 685521 885553 851509 214749
2788 214749 136811 210208 436308 1290834 884320 132686 -476244 -525096 -101060 -56129
2778 -56129 -141522 -409302 -402380 116894 900842 1314466 947953 1044570 1058585 975639 895361
$$ packed form
2848c84031J19122l95932j21317L64215L31193K21666K48565n23270l05841k6495
2838d72125m46984P12314J414994P09510q25863p07552J83586l0385J22898m65169
2828A95224m95894n5884J64406K12730k72602k47928O09408J76597J89608K89956
2818G65621j27023m63700j276096m62033M02857P96938Q63339m57965l11367M59544
2808A90115M21122k40097n72111j75831l12540m61037J6673J151412O23442n61000
2798H0148q60549n89380l23039K59817Q85285R40390K92849K00032l4044o36760
2788B14749p7938P3397K26100Q54526m06514p51634o08930m8852M24036M4931
2778e6129q5393k67780O922N19274P83948M13624l66513R6617J4015q2946q0278
$$ plain form
2767 895361 549971 43529 34123 403304 343125 54627 -180018 -137396 -313178 -447371
2757 -447371 141968 -123755 -434170 -598705 -479156 -328797 57054 504781 171902 -589101
2747 -589101 -303348 -543875 -710710 217088 949358 678345 290909 -145214 -295613 -50376
2737 -50376 444437 442414 84417 -165026 159377 571335 1096589 1038897 595278 680891 86409
2726 86409 -361415 -636639 -164312 368790 1081566 1277279 1356927 1337213 681321 114835
2716 114835 40044 235961 369897 204312 344551 226749 307949 644868 943259 1085623
2706 1085623 71872 -295723 338780 390568 -14106 -9521 -253733 -473673 159174 27112
2696 27112 -1026434 -1136543 154139 1133997 483019 18106 -612015 -44 1186171
$$ packed form
2767H95361l45390n06442r406L69181o0179k88498k34645M2622j75782j34193
2757d47371N89339k65723l10415j64535J19549J50359L85851M47727l32879p61003
2747e89101K85753k40527j66835R27798P32270k71013l87436m36123j50399K45237
2737e0376M94813k023l57997k49443L24403M11958N25254n7692m43619Q5613n94482
2726H6409m47824k75224M72327N33102P12776J95713P9648j9714o55892n66486
2716A14835p4791J95917J33936j65585J40239j17802Q1200L36919K98391J42364
2706A085623j013751l67595O34503N1788m04674M585k44212k19940O32847j32062
2696B7112j053546j10109J290682R79858o50978m64913o30121O11971J186215
$$ plain form
2687 1186171 1344688 1340343 1441071 1042980 320620 -781071 -1381077 -1149130 -940582 -1462602
2677 -1462602 -1685601 -2325566 -2218998 -1105246 -270723 -446804 -465492 -372778 -414876 -696594
2667 -696594 -149133 876073 777289 825965 1334804 1411198 1290156 905912 456760 544608
2657 544608 966714 1611399 2038271 1607943 1375840 1416145 1760034 1858776 1229354 648523
2647 648523 -299791 -503232 -30376 670910 1185069 764943 249190 195519 531750 441826
2637 441826 -238883 48425 21931 18784 460801 438755 482328 291587 371924 755093 315704
2626 315704 95606 38413 -179825 434032 1011386 1040237 207629 -605740 -698551 -623052
2616 -623052 -324147 296863 -19956 -130310 -743187 -870589 -985330 -934671 -488558 65766
$$ packed form
2687A186171J58517m345J00728l98091p22360j101691o00006K31947K08548n22020
2677a462602k22999o39965J06568J113752Q34523j76081j8688R2714m2098k81718
2667f96594N47461J025206r8784M8676N08839P6394j21042l84244m49152Q7848
2657E44608M22106O44685M26872m30328k32103M0305L43889R8742o29422n80831
2647F48523r48314k03441M72856P01286N14159m20126n15753n3671L36231q9924
2637D41826o80709K87308k6494l147M42017k2046M3573j90741Q0337L83169m39389
2626C15704k20098n7193k18238O13857N77354K8851q32608q13369r2811P5499
2616f23052K98905O21010l16819j10354o12877j27402j14741N0659M46113N54324
$$ plain form
2606 65766 123372 411076 737495 1519625 1614500 1238567 465588 193328 626150 605241
2596 605241 28819 -759208 -1053455 -1058289 -411043 -98285 -165321 131037 156146 -66988
2586 -66988 -3616 434925 487525 891946 509637 121353 187237 161003 -158197 -193793 -121127
2575 -121127 93362 530791 874405 691525 616516 234639 -405252 -623668 -367639 187753
2565 187753 608870 496993 -297630 -1119548 -1126989 -185908 305338 -73220 -553447 -353319
2555 -353319 -424030 -597810 -645711 240326 1197110 830973 801765 617845 63537 -571274
2545 -571274 -731025 -337012 -64141 -338564 415322 392617 403580 394793 -4312 34079 564102
2534 564102 530071 20393 -388954 -397932 350491 1159684 1223061 337401 -23073 204335
$$ packed form
2606F5766N7606K87704L26419P82130R4875l75933p72979k72260M32822k0909
2596F05241n76422p88027k94247m834O47246L12758o7036K96358K5109k23134
2586f6988O3372M38541N2600M04421l82309l88284O5884k6234l19200l5596P2666
2575a21127K14489M37429L43614j82880p5009l81877o39891k18416K56029N55392
2565A87753M21117j11877p94623q21918p441R41081M91246l78558m80227K00128
2555c53319p0711j73780m7901Q86037R56784l66137k9208j83920n54308o34811
2545e71274j59751L94013K72871k74423P53886k2705J0963q787l99105L8391N30023
2534E64102l4031n09678m09347q978P48423Q09193O3377q85660l60474K27408
$$ plain form
2524 204335 2205 -664873 -273677 277618 82743 -521314 -918118 -357078 -138090 -346643
2514 -346643 77283 210951 397391 463299 208186 -259603 -377602 -149688 -33137 -36370
2504 -36370 -250529 -774650 -1428055 -640553 346364 283593 338610 695171 330521 93694
2494 93694 679240 697803 46783 -101316 -489603 -945608 -1143025 -1197000 -546466 490877
2484 490877 427944 123483 14771 494949 1027081 827861 166031 -166478 270208 366240
2474 366240 233248 94126 -10090 217953 231453 531153 329620 56602 -475882 -127813
2464 -127813 410870 614727 1123361 1657398 1547524 991553 249593 -336504 18339 18280
2454 18280 -543516 -1825959 -1660636 -840490 -950356 -718740 380943 715196 -70974 -801121
$$ packed form
2524B04335k02130o67078L91196N51295j94875o04057l96804N61040K18988k08553
2514c46643M23926J33668J86440O5908k55113m67789j17999K27914J16551l233
2504c6370k14159n24121o53405P87502R86917o2771N5017L56561l64650k36827
2494I3694N85546J8563o51020j48099l88287m56005j97417n3975O50534J037343
2484D90877o2933l04461j08712M80178N32132j99220o61830l32509M36686R6032
2474C66240j32992j39122j04216K28043J3500K99700k01533k73018n32484L48069
2464a27813N38683K03857N08634N34037j09874n55971p41960n86097L54843n9
2454A8280n61796j282443J65323Q20146j09866K31616J099683L34253p86170p30147
$$ plain form
2444 -801121 -501020 -351140 25012 -39552 -400963 -263964 134031 569615 1049386 891849
2434 891849 823383 451473 81785 336100 -4722 -774136 -654766 -973975 -1028175 -752509
2424 -752509 -363141 485405 660785 402505 881028 771293 435931 1041559 933950 265460
2414 265460 636117 1127368 944365 1217882 1400790 1064560 445512 -407293 -363816 885523
2404 885523 2091918 2159301 1972202 1434319 362318 142215 425271 594268 632914 304053
2394 304053 390051 316277 207759 510964 808847 912233 1038520 845938 763824 515022
2384 515022 291638 -253477 -415421 -848860 -1357728 -1377469 -904439 -490606 -21250 425232
2374 425232 559520 286422 -474277 -770336 -934998 -835073 -1288329 -1639357 -1348290 -540900
$$ packed form
2444h01121L00101J49880L76152o4564l61411J36999L97995M35584M79771j57537
2434H91849o8466l71910l69688K54315l40822p69414J19370l19209n4200K75666
2424g52509L89368Q48546J75380k58280M78523j09735l35362O05628j07609o68490
2414B65460L70657M91251j83003K73517J82908l36230o19048q52805M3477J249339
2404H85523J206395O7383j87099n37883j072001k20103K83056J68997L8646l28861
2394C04053Q5998p3774j08518L03205K97883J03386J26287j92582q2114k48802
2384E15022k23384n45115j61944m33439n08868j9741M73030M13833M69356M46482
2374D25232J34288k73098p60699k96059j64662R9925m53256l51028K91067Q07390
$$ plain form
2364 -540900 -363154 -510808 -363262 -375997 -346993 -44441 162265 426595 -209996 -127143
2354 -127143 -69263 254537 161101 625957 1176446 1289125 1252523 1435244 1300858 1003023
2344 1003023 674126 -109648 -303199 -119574 707968 953734 588841 501408 60208 -284765
2334 -284765 -247457 21507 -134290 78204 -4038 -159335 -70908 408765 734542 1219273
2324 1219273 1200433 630555 165922 -258647 -522095 301978 985085 575377 788625 173362
2314 173362 -89386 262460 655932 225577 -556546 -427046 -251187 210906 -79329 82508
2304 82508 717621 1038950 822045 659821 509015 266380 -503405 -403625 758893 1356417
2294 1356417 1733485 1499833 806252 902263 1236227 745375 725443 711875 156435 -106135
$$ packed form
2364e40900J77746j47654J47546j2735K9004L02552K06706K64330o36591Q2853
2354a27143N7880L23800r3436M64856N50489J12679l6602J82721j34386k97835
2344A003023l28897p83774j93551J83625Q27542K45766l64893q7433m41200l44973
2334b84765L7308K68964j55797K12494q2242j55297Q8427M79673L25777M84731
2324A219273j8840n69878m64633m24569k63448Q24073O83107m09708K13248o15263
2314A73362k62748L51846L93472m30355p82123J29500J75859M62093k90235J61837
2304H2508O35113L21329k16905j62224j50806k42635p69785R9780J162518N97524
2294A356417L77068k33652o93581R6011L33964m90852j9932j3568n55440k62570
$$ plain form
2284 -106135 -159941 -123995 140180 29637 186517 450901 743094 902170 346261 -468335
2274 -468335 -859640 -1093413 -1108768 -1495377 -1714595 -1945948 -1636929 -1038781 -575267 -713037
2264 -713037 -1275876 -1055287 -769621 -295729 232245 584437 481845 196925 9595 -242174
2254 -242174 -932659 -719189 -284573 301269 240231 755189 944928 427079 -223477 -305239
2244 -305239 349743 76315 -343464 -420213 -51244 -135411 4981 325727 806313 1328428
2234 1328428 1138554 1021617 566506 1007380 706696 574026 374325 353856 45540 -588304
2224 -588304 -590937 175065 242878 946577 1099838 791440 -181375 -1488774 -1917322 -1288027
2214 -1288027 -838055 -163135 252582 804012 750871 350269 -81929 -346591 -270099 133758
$$ packed form
2284a06135n3806L5946K64175j10543J56880K64384K92193J59076n55909q14596
2274d68335l91305k33773j5355l86609k19218k31353L09019N98148M63514j37770
2264g13037n62839K20589K85666M73892N27974L52192j02592k84920j87330k51769
2254b42174o90485K13470M34616N85842o1038N14958J89739n17849o50556q1762
2244c05239O54982k73428m19779p6749L68969q4167J40392L20746M80586N22115
2234A328428j89874j16937m55111M40874l00684j32670j99701k0469l08316o33844
2224e88304k633P66002O7813P03699J53261l08398r72815j307399m28548O29295
2214a288027M49972O74920M15717N51430n3141m00602m32198k64662P6492M03857
$$ plain form
2204 133758 -34883 -274417 500175 493966 738381 844280 1219110 1244246 562735 55231
2194 55231 -161533 -534230 -290239 129439 48290 -453159 -637076 -207101 -166588 259096
2184 259096 806458 154399 -624259 -1000473 -431524 333908 296348 -140391 -878084 -1664507
2174 -1664507 -1581506 -1885810 -1532441 -760693 -239745 -41175 -253537 -212262 -44688 -136366
2164 -136366 -290619 -86768 406883 466821 515655 455921 658090 148388 -679089 -856681
2154 -856681 -431785 324856 323346 24142 -472221 -273057 -93096 251037 244265 242240 64224
2143 64224 -2475 160666 416555 784018 728499 855784 584564 545698 329390 853331
2133 853331 1214446 1078938 614805 684657 76786 -1074043 -1374645 -1138191 -762838 -840260
$$ packed form
2204A33758j68641k39534P74592o209K44415J05899L74830K5136o81511n07504
2194E5231k16764l72697K43991M19678q1149n01449j83917M29975M0513M25684
2184B59096N47362o52059p78658l76214N68949P65432l7560m36739p37693p86423
2174a664507Q3001l04304L53369P71748N20948J98570k12362M1275J67574r1678
2164a36366j54253K03851M93651N9938M8834n9734K02169n09702q27477j77592
2154h56681M24896P56641j510k99204m96363J99164J79961L44133o772k025j78016
2143F4224o6699J63141K55889L67463n5519J27285k71220l8866k16308N23941
2133H53331L61115j35508m64133O9852o07871j150829l00602K36454L75353p7422
$$ plain form
2123 -840260 -1189500 -899892 -199962 -142087 -631459 -1124425 -661005 -358020 72550 327738
2113 327738 51481 -3186 184784 -97333 -299355 -301676 -786495 -973254 -1345240 -1787332
2103 -1787332 -1231702 -804382 -969455 -814507 -440858 -672365 -750276 -461165 -283457 521024
2093 521024 614112 753309 484323 960479 1650405 1369193 1183984 1576567 1306831 539418
2083 539418 134804 184220 686530 604816 164093 16205 -401232 -689164 -670169 -331010
2073 -331010 218458 9679 -720713 -575375 -194647 129444 193971 -430851 -250010 428984
2063 428984 841122 -361544 -1702783 -2187784 -2045573 -1451347 -1522554 -1504407 -1265971 -767144
2053 -767144 371380 1110779 809833 369033 -123533 63 306902 726410 753640 566464
$$ packed form
2123h40260l49240K89608O99930N7875m89372m92966M63420L02985M30570K55188
2113C27738k76257n4667J87970k82117k02022k321m84819j86759l71986m42092
2103a787332N55630M27320j65073J54948L73649k31507p7911K89111J77708Q04481
2093E21024R3088J39197k68986M76156O89926k81212j85209L92583k69736p67413
2083E39418m04614M9416N02310q1714m40723j47888m17437k87932J8995L39159
2073c31010N49468k08779p30392J45338L80728L24091O4527o24822J80841O78994
2063D28984M12138j202666j341239m85001J42211N94226p1207J8147K38436M98827
2053g67144J138524P39399l00946m40800m92566J23596L06839M19508K7230j87176
$$ plain form
2043 566464 776593 547134 321602 692629 1189334 1136636 970860 754989 248656 -339299
2033 -339299 -494271 -435310 244828 612240 287064 241750 237133 869556 591557 422742
2023 422742 80561 -196722 -265184 -326647 -371133 -194393 252434 257718 -14185 88356 108775
2012 108775 -499560 -1492351 -871471 -158425 147030 471083 466931 -109022 -641618 -887705
2002 -887705 -936628 -1307164 -1257818 -1192813 -733888 -288040 149097 343167 734140 659857
1992 659857 -351306 133236 -17684 -625245 -246034 929440 1679939 1705100 1197050 540945
1982 540945 763120 1420996 1162905 754046 787369 656369 331654 330656 -29014 -212397
1972 -212397 110270 452576 -323787 -771695 -378154 734329 1124423 501705 313340 324158
$$ packed form
2043E66464K10129k29459k25532L71027M96705n2698j65776k15871n06333n87955
2033c39299j54972N8961O80138L67412l25176m5314m617O32423k77999j68815
2023D22742l42181k77283o8462o1463m4486J76740M46827N284k71903J02541K0419
2012A08775o08335r92791O20880P13046L05455L24053m152n75953n32596k46087
2002h87705m8923l70536M9346O5005M58925M45848M37137J94070L90973p4283
1992F59857j011163M84542j50920o07561L79211J175474P50499K5161n08050o56105
1982E40945K22175O57876k58091m08859L3323j31000l24715r98l59670j83383
1972b12397L22667L42306p76363m47908L93541J112483L90094o22718j88365J0818
$$ plain form
1962 324158 165024 -85777 -582922 -879272 -936860 -595235 -466249 42389 488772 551697
1952 551697 170340 -55039 -124641 -20044 45765 -191121 -500020 -443577 -113746 -390956
1942 -390956 -170567 262098 524709 -128682 -670377 137063 514481 977052 1260557 1046013
1932 1046013 666147 847725 570794 366394 -215007 -814091 -900879 -300684 -89817 -273517
1922 -273517 -200956 -218776 -100472 -86408 58215 526639 441074 -256056 -835766 -555506
1912 -555506 -377052 -199364 153222 600215 522346 551773 1036232 1437245 2011448 2017460
1902 2017460 1260247 588566 302159 508416 603296 9799 118148 513519 352883 18683
1892 18683 174058 -345044 -779020 -730616 -224151 455367 262469 -113328 797960 1199433
$$ packed form
1962C24158j59134k50801m97145k96350n7588L41625J28986N08638M46383O2925
1952E51697l81357k25379o9602J04597O5809k36886l08899N6443L29831k77210
1942c90956K20389M32665K62611o53391n41695Q07440L77418M62571K83505k14544
1932A046013l79866J81578k76931k04400n81401n99084q6788O00195K10867j83700
1922b73517P2561j7820J18304J4064J44623M68424q5565o97130n79710K80260
1912e55506J78454J77688L52586M46993p7869K9427M84459M01013N74203O012
1902B017460p57213o71681k86407K06257R4880n93497J08349L95371j60636l34200
1892A8683J55375n19102m33976M8404N06465O79518j92898l75797R11288M01473
$$ plain form
1882 1199433 1084171 1109192 275621 313405 315598 225776 556017 442518 459948 816977 584496
1871 584496 8031 -255410 -732964 -1142724 -994212 -872845 -393453 36985 541189 381652
1861 381652 121952 343069 272532 305905 584212 213178 347983 518507 375099 -93765
1851 -93765 -560676 -451115 361171 457999 97038 -479215 -768709 -579180 7838 524039
1841 524039 383983 270719 392576 465378 300670 -121387 -264800 53642 282859 435165
1831 435165 273543 -443901 -523239 -319635 115180 500972 189817 382394 386178 -54527
1821 -54527 372269 259083 193756 -14073 -30347 -177227 -180164 -86812 -90550 -314307 -229540
1810 -229540 -296205 -119441 -51155 -493972 -917784 -739182 -106463 142822 100981 -449428
$$ packed form
1882A199433j15262K5021q33571L7784K193q9822L30241j13499J7430L57029k32481
1871E84496n76465k63441m77554m09760J48512J21367M79392M30438N04204j59537
1861C81652k59700K21117p0537L3373K78307l71034J34805J70524j43408m68864
1851i3765m66911J09561Q12286R6828l60961n76253k89494J89529N87018N16201
1841E24039j40056j13264J21857P2802j64708m22057j43413L18442K29217J52306
1831D35165j61622p17444p9338K03604M34815L85792l11155J92577L784m40705
1821e4527M26796j13186o5327k07829j6274j46880k937R3352l738k23757Q4767
1810b29540o6665J76764O8286m42817m23812J78602O32719K49285m1841n50409
$$ plain form
1800 -449428 -325167 314074 1592032 1976242 1440945 793109 413198 1000370 636079 354303
1790 354303 168740 -329669 -302713 -281303 -414719 -212664 5460 95227 140976 221015 442438
1779 442438 381798 304186 61607 622320 838938 396968 745458 882767 602613 460480
1769 460480 10336 216233 873221 946713 335204 -71026 12759 109533 633583 622231
1759 622231 102586 -242571 14226 29595 -131382 214523 638997 956109 473733 -198520
1749 -198520 -723691 -564460 -53217 -73193 295958 673964 457770 442821 342934 -49339
1739 -49339 -504752 -724335 -504704 -264652 -44222 -7585 616278 910964 222673 -1717
1729 -1717 -35110 -341598 -66592 -252008 -783411 -797915 -864329 -858305 -625883 -765948 -1184268
$$ packed form
1800d49428J24261O39241J277958L84210n35297o47836l79911N87172l64291k81776
1790C54303j85563m98409K6956K1410j33416K02055K18124Q9767M5749Q0039K21423
1779D42438o0640p7612k42579N60713K16618m41970L48490J37309k80154j42133
1769D60480m50144K05897O56988P3492o11509m06230Q3785R6774N24050j1352
1759F22231n19645l45157K56797J5369j60977L45905M24474L17112m82376o72253
1749a98520n25171J59231N11243j9976L69151L78006k16194j4949r9887l92273
1739d9339m55413k19583K19631K40052K20430L6637O23863K94686o88291k24390
1729a717l3393l06488K75006j85416n31403j4504o6414O024K32422j40065m18320
$$ plain form
1718 -1184268 -1108635 -550379 -190230 -758970 -798653 -874826 -876958 -1016983 -1752590 -2357908
1708 -2357908 -1953215 -1272817 -459078 541779 660091 1239918 1365076 1378927 1249105 449135
1698 449135 -485286 -443150 -176260 -486982 -376453 40246 375015 -432421 -291582 -215861
1688 -215861 53615 202774 780105 993219 212762 -375178 -488927 -711080 -687688 -559818
1678 -559818 -525396 -90864 48060 -365111 -789403 -896385 -719767 -190331 17116 -361149
1668 -361149 -341254 11120 414018 153067 -197574 434444 679269 -13270 -206052 -40412
1658 -40412 -380340 -385739 -526885 -325842 344546 920424 1065265 947613 688376 837316
1648 837316 495381 323113 -136683 -359509 223052 400090 565154 747142 -320169 -1235170
$$ packed form
1718a184268P5633N58256L60149n68740l9683p6173k132j40025p35607o05318
1708b357908M04693O80398Q13739J000857J18312N79827J25158J3851j29822p99970
1698D49135r34421M2136K66890l10722J10529M16699L34769q07436J40839P5721
1688b15861K69476J49159N77331K13114p80457n87940j13749k22153K3392J27870
1678e59818L4422M34532J38924m13171m24292j06982J76618N29436K07447l78265
1668c61149J9895L52374M02898k60951l50641O32018K44825o92539j92782J65640
1658d0412l39928n399j41146K01043O70388N75878J44841j17652k59237J48940
1648H37316l41935j72268m59796k22826N82561J77038J65064J81988j067311r15001
$$ plain form
1638 -1235170 -1237695 -632265 243260 615465 139876 -228837 228332 1139871 1690053 2303338
1628 2303338 1510319 -5862 -457165 29513 880010 813986 272847 149125 95740 945
1618 945 205514 -223957 -417090 -686596 -243388 -127010 -88367 229553 766770 844240 763637
1607 763637 1311548 1206318 651379 764958 1076068 839990 583116 696697 1214241 1175490
1597 1175490 757238 153750 305334 1052985 1716794 1915309 1538538 1173587 685995 35754
1587 35754 41726 -167185 -1358807 -1255504 -1449128 -1596373 -1170039 -676097 -975499 -1348915
1577 -1348915 -1235104 -924222 -1158096 -696831 -59087 -371897 -1069311 -1181267 -657481 -350437
1567 -350437 -667811 -701472 -740361 -733002 -714452 -701196 -1187164 -1601070 -980453 -391583 -285111
$$ packed form
1638a235170k525O05430Q75525L72205m75589l68713M57169R11539N50182O13285
1628B303338p93019j516181m51303M86678Q50497o6024n41139j23722n3385r4795
1618I45K04569m29471j93133k69506M43208J16378L8643L17920N37217P7470q0603
1607G63637N47911j05230n54939J13579L11110k36078k56874J13581N17544l8751
1597A175490m18252o03488J51584P47651O63809J98515l76771l64951m87592o50241
1587C5754N972k08911j191622J03303j93624j47245M26334M93942k99402l73416
1577a348915J13811L10882k33874M61265O37744l12810o97414j11956N23786L07044
1567c50437l17374l3661l8889P359J8550J3256m85968m13906O20617N88870J06472
$$ plain form
1556 -285111 -379159 -1259278 -1404223 -625967 -274647 169504 -62917 -208395 -45802 -230704
1546 -230704 -597314 -867663 -534053 -537820 -473299 -944259 -748294 -315845 165404 -371428
1536 -371428 -912612 -807903 -613697 -707566 -301433 35077 -152038 3975 1134944 1448794
1526 1448794 1304440 565643 -335647 -640976 -617653 -615059 -464037 116055 -58375 -507930
1516 -507930 155182 198288 49056 -633879 -502566 135923 185903 69231 20330 160587
1506 160587 -208815 -163891 -221416 56159 -170913 -1138924 -1554290 -1442313 -1129740 -317205
1496 -317205 -129530 -54558 -145563 353894 522335 648285 1032212 1863955 1458032 941769
1486 941769 231417 182870 671223 642542 645645 123777 1909 746388 1044568 1007431 783672
$$ packed form
1556b85111r4048q80119j44945P78256L51320M44151k32421j45478J62593j84902
1546b30704l66610k70349L33610l767O4521m70960J95965M32449M81249n36832
1536c71428n41184J04709J94206r3869M06133L36510j87115J56013J130969L13850
1526A448794j44354p38797r01290l05329K3323K594J51022N80092j74430m49555
1516e07930O63112M3106j49232o82935J31313O38489M9980j16672m8901J40257
1506A60587l69402M4924n7525K77575k27072r68011m15366J11977L12573Q12535
1496c17205J87675P4972r1005M99457J68441J25950L83927Q31743m05923n16263
1486I41769p10352m8547M88353k8681L103n21868j21868P44479K98180l7137k23759
$$ plain form
1475 783672 206376 -820697 -973079 -176177 702847 327706 164519 6694 -585248 -918945
1465 -918945 -705597 -720053 -174033 -43629 169284 344601 34829 112499 -516692 -678719
1455 -678719 -324192 -340114 -478091 -328751 -491011 -902453 -683025 -832183 -1555122 -846920
1445 -846920 -188885 22018 270592 452965 481567 -626381 -2152858 -3097986 -2591816 -2030155
1435 -2030155 -1796064 -1588654 -2011130 -1596988 -1490959 -940601 -525812 -429565 -207590 -269876
1425 -269876 -354267 144549 336278 276085 -70324 331489 89854 -456008 -63741 5609
1415 5609 100955 782416 1254649 1315074 1275258 565293 -141699 -57160 394458 28042 -159353
1404 -159353 -271588 -505495 -388782 -428989 -1019105 -1094522 -592710 -143289 -36327 -646421
$$ packed form
1475G83672n77296j027073j52382P96902Q79024l75141j63187j57825n91942l33697
1465i18945K13348j4456N46020J30404K12913J75317l09772P7670o29191j62027
1455f78719L54527j5922j37977J49340j62260m11442K19428j49158p22939P08202
1445h46920O58035K10903K48574J82373K8602j107948j526477r45128N06170N61661
1435b030155K34091K07410m22476M14142J06029N50358M14789R6247K21975o2286
1425b69876q4391M98816J91729o0193l46409M01813k41635n45862L92267O9350
1415E609R5346O81461M72233O0425l9816p09965p06992Q4539M51618l66416j87395
1404a59353j12235k33907J16713m0207n90116p5417N01812M49421J06962o10094
$$ plain form
1394 -646421 -196853 622852 786856 340029 -99033 -236047 -526192 -451773 -502595 -580334
1384 -580334 -1035986 -922124 -274055 -444859 -575437 -481913 -354840 -438224 -35114 -442904
1374 -442904 -882465 -664754 -244184 178613 695637 726278 806405 650603 464586 555078
1364 555078 526715 708207 460123 133484 70226 -8714 -395238 -571919 -511833 -455924 -291441
1353 -291441 -195036 -1023548 -1775561 -1498648 -1104955 -503824 37792 705343 826022 380997
1343 380997 1019143 1330930 599769 107634 372578 296383 -404903 -924973 -886614 -29295
1333 -29295 876321 1093723 844317 -93755 -277627 -779073 -1122982 -740629 -86264 246457
1323 246457 295491 232820 15628 182383 -138195 -239908 56872 372490 710762 1313429
$$ packed form
1394f46421M49568Q19705J64004m46827m39062j37014k90145P4419n0822p7739
1384e80334m55652J13862O48069j70804j30578R3524J27073q3384M03110m07790
1374d42904m39561K17711M20570M22797N17024L0641Q0127j55802j86017R0492
1364E55078k8363J81492k48084l26639o3258p8940l86524j76681O0086N5909J64483
1353b91441R6405q28512p52013K76913L93693O01131N41616O67551J20679m45025
1343C80997O38146L11787p31161m92135K64944p6195p01286n20070L8359Q57319
1333b9295R05616K17402k49406r38072j83872n01446l43909L82353O54365L32721
1323B46457M9034o2671k17192J66755l20578j01713K96780L15618L38272O02667
$$ plain form
1313 1313429 1320733 623821 -331087 -32073 932633 941999 968764 336543 64017 232777
1303 232777 439761 567789 100133 114127 1955 -896599 -1367967 -453676 578909 450456
1293 450456 -19531 -784325 -926395 -463496 -327326 -1055958 -1330937 -524260 -8179 215788
1283 215788 198965 313769 -438377 -814196 -312579 -4467 -566471 -658719 -967178 -685045
1273 -685045 120155 885051 880548 1123980 748581 425505 424295 392579 665402 887598 1093734
1262 1093734 865644 481692 -11484 77943 843586 1226403 1200707 1021380 566154 372955
1252 372955 1470 175037 614044 453179 -482815 -660930 -401915 -526041 -925311 -873704
1242 -873704 -668821 -518064 3720 525877 905736 236786 204590 819063 206045 -630797
$$ packed form
1313A313429P304o96912r54908K99014R64706R366K6765o32221k72526J68760
1303B32777K06984J28028m67656J3994j12172q98554m71368R14291J032585j28453
1293D50456m69987p64794j42070M62899J36170p28632k74979Q06677N16081K23967
1283B15788j6823J14804p52146l75819N01617L08112n62004r2248l08459K82133
1273f85045Q05200P64896m503K43432l75399l23076j210l1716K72823K22196K06136
1262A093734k28090l83952m93176Q9427P65643L82817k5696j79327m55226j93199
1252C72955l71485J73567M39007j60865r35994j78115K59015j24126l99270N1607
1242h73704K04883J50757N21784N22157L79859o68950l2196O14473o13018q36842
$$ plain form
1232 -630797 -928259 -783603 -877409 -729815 -668469 -294205 -165946 -362175 -585444 -693590
1222 -693590 -369751 65544 218777 364391 92947 -463746 -819803 -830324 -261905 -404482
1212 -404482 -838251 -96481 212725 227055 306853 499046 753376 258102 -212805 -327557
1202 -327557 -388034 -739147 -651146 -172549 46374 412012 399624 169365 -101187 522899
1192 522899 844409 847264 624921 -273415 -289969 73578 -104167 283710 259299 32023
1182 32023 -336323 -326340 -210379 -514398 -525477 201939 171485 740380 601640 343538 -130019
1171 -130019 -428872 666008 1258468 799546 492322 -413598 -653799 -425203 -2090 169513
1161 169513 146094 262353 -129493 -453072 -262991 130738 531413 960765 1509646 1133458
$$ packed form
1232f30797k97462J44656r3806J47594O1346L74264J28259j96229k23269j08146
1222f93590L23839M35295J53233J45614k71444n56693l56057j0521N68419j42577
1212d04482m33769P41770L09206J4330P9798J92193K54330m95274m70907j14752
1202c27557o0477l51113Q8001M78597K18923L65638j2388k30259k70552O24086
1192E22899L21510K855k22343q98336j6554L63547j77745L87877k4411k27276
1182C2023l68346R983J15961l04019j1079P27416l0454N68895j38740k58102m73557
1171a30019k98853J094880N92460m58922l07224r05920k40201K28596M23113J71603
1161A69513k3419J16259l91846l23579J90081L93729M00675M29352N48881l76188
$$ plain form
1151 1133458 873956 125189 -508272 -646018 76896 343544 -361385 -1417083 -1168689
1142 -1168689 -869655 -980789 -1051040 -890395 -1191795 -1435096 -1109125 -450581 -227273 -256014
1132 -256014 -568672 -939450 -929690 -758813 -604851 -323670 -411138 -392088 428835 195919
1122 195919 -71095 -562713 -703268 -158386 570589 663363 247800 -442913 -707866 -444348
1112 -444348 -402234 -792357 -959865 -1239425 -1529777 -1676557 -1718681 -1322874 -402705 -132402
1102 -132402 -316123 -356962 -798704 -788291 -194417 155935 -444281 -680232 -679733 -983093 -792805
1091 -792805 -660838 -495077 -685606 -901909 -420614 -105572 -447028 -238111 443133 1013531
1081 1013531 717204 -59477 140764 770553 527947 -206457 15900 149267 -30879 -141089
$$ packed form
1151A133458k59502p48767o33461j37746P22914K66648p04929j055698K48394
1142a168689K99034j11134p0251J60645l01400k43301L25971O58544K23308k8741
1132b56014l12658l70778R760J70877J53962K81181q7468J9050Q20923k32916
1122A95919k67014m91618j40555N44882P28975R2774m15563o90713k64953K63518
1112d44348M2114l90123j67508k79560k90352j46780m2124L95807R20169K70303
1102a32402j83721m0839m41742J0413N93874L50352o00216k35951M99l03360J90288
1091g92805J31967J65761j90529k16303M81295L15042l41456K08917O81244N70398
1081A013531k96327p76681K00241O29789k42606p34404K22357J33367j80146j10210
$$ plain form
1071 -141089 -284601 -274427 -663643 -1496562 -1205551 -1655289 -1626430 -644547 -41242 -627881
1061 -627881 -858929 -328505 601029 793818 739960 251628 257728 108747 36382 519216
1051 519216 1082456 1729353 1506107 680461 730647 432634 259140 430312 428209 218984
1041 218984 44442 139303 -115842 -635654 -161801 642351 613922 1142206 993931 684234
1031 684234 -345937 -616375 -417567 -385450 -239505 319002 1107558 1520402 1245217 532413
1021 532413 266427 568063 647047 426105 573539 1020129 1283947 1595053 1117422 900229
1011 900229 841022 511967 -224326 -927568 -1120236 -315911 -349405 -475209 -798484 -902379
1001 -902379 -790921 -765573 -859405 -421814 -455635 -606150 -173146 375823 250144 -72619
$$ packed form
1071a41089j43512J0174l89216q32919K91011m49738K8859R81883O03305n86639
1061f27881k31048N30424R29534J92789n3858m88332O100j48981p2365M82834
1051E19216N63240O46897k23246q25646N0186k98013j73494J71172k103k09225
1041B18984j74542R4861k55145n19812M73853Q04152k8429N28284j48275l09697
1031F84234j030171k70438J98808L2117J45945N58507P88556M12844k75185p12804
1021E32413k65986L01636P8984k20942J47434M46590K63818L11106m77631k17193
1011I00229n9207l29055p36293p03242j92668Q04325l3494j25804l23275j03895
1001i02379J11458K5348r3832M37591l3821j50515M33004N48969j25679l22763
$$ plain form
991 -72619 119799 773309 445486 670114 493585 52380 253729 428914 393381 538268
981 538268 131114 -398989 -356682 -392478 -490671 -1110939 -1285977 -968616 -187764 762117
971 762117 986066 1112894 655028 206206 364049 385497 599774 1103447 1067393 787106
961 787106 643146 -73426 -245937 214145 -285853 -474122 -746846 -805233 36774 419711
951 419711 -28223 -130443 95839 84858 -57713 161725 254161 -359473 -294623 225410
941 225410 572135 780399 1101560 917186 990568 1080410 -38573 -615455 -393985 -1153455
931 -1153455 -630695 70594 197164 -127422 -382286 -86588 149003 457429 618207 540207
921 540207 620069 1009422 1191361 1570286 1136422 571536 641052 828438 436117 92231
$$ packed form
991g2619J92418O53510l27823K24628j76529m41205K01349J75185l5533J44887
981E38268m07154n30103M2307l5796r8193o20268j75038L17361P80852R49881
971G62117K23949J26828m57866m48822J57843K1448K14277N03673l6054k80287
961G87106j43960p16572j72511M60082m99998j88269k72724n8387Q42007L82937
951D19711m47934j02220K26282j0981j42571K19438R2436o13634O4850N20033
941B25410L46725K08264L21161j84374P3382Q9842j118983n76882K21470p59470
931a153455N22760P01289J26570l24586k54864K95698K35591L08426J60778p8000
921E40207P9862L89353J81939L78925m33864n64886O9516J87386l92321l43886
$$ plain form
911 92231 550406 643893 616564 248050 294888 -416890 -892694 -752775 -767062 -1069993 -827896
900 -827896 -899250 -405539 154632 -84820 -359587 -63500 712607 550954 889132 871045
890 871045 421304 -129097 -331347 383285 747316 595953 289360 932704 964303 935808
880 935808 697558 356578 220608 66179 -687649 -1181452 -1020866 -877983 -404611 -25006
870 -25006 148932 134106 -199611 -238323 -413065 -594058 -105575 29057 8684 405441 975844
859 975844 814507 -759770 -1523862 -1638664 -943744 -387289 -290951 -840201 -1046538 -681975
849 -681975 -887214 -1167126 -992952 -182956 245981 621456 685495 188910 -405472 -84163
839 -84163 29852 -236316 -730563 -1122030 -655556 -185440 -358093 -424649 -1050729 -1234968
$$ packed form
911I2231M58175R3487k7329l68514M6838p11778m75804J39919j4287l02931K42097
900h27896p1354M93711N60171k39452k74767K96087P76107j61653L38178j8087
890H71045m49741n50401k02250P14632L64031j51363l06593O43344L1599k8495
880I35808k38250l40980j35970j54429p53828m93803J60586J42883M73372L79605
870b5006J73938j4826l33717l8712j74742j80993M88483J34632k0373L96757N70403
859I75844j61337j574277p64092j14802O94920N56455R6338n49250k06337L64563
849f81975k05239k79912J74174Q09996M28937L75475O4039m96585n94382L21309
839h4163J14015k66168m94247l91467M66474M70116j72653o6556o26080j84239
$$ plain form
829 -1234968 -751297 -358836 -162178 -12767 576483 738736 630710 843273 886702 133595
819 133595 -211248 332024 856203 1448337 1321859 724975 575515 -294474 -232855 -30220
809 -30220 -399494 -565393 -166057 61025 714761 690823 -113401 -452755 -237186 836078
799 836078 959788 639446 226516 -493992 -174068 -488433 -575571 57451 548685 696000
789 696000 3758 -393894 -341359 -325250 114030 633598 532911 -82246 38166 436390
779 436390 1184662 1862416 1857831 1553190 793188 682494 658538 694241 1227543 1097353 733503
768 733503 1375928 1337713 532519 206491 161332 472299 484519 606792 761693 994556
758 994556 833614 -27265 -47883 605965 819544 434647 -54718 -648984 -686121 -1027357
$$ packed form
829a234968M83671L92461J96658J49411N89250J62253j08026K12563M3429p53107
819A33595l44843N43272N24179N92134j26478n96884j49460q69989O1619K02635
809c0220l69274j65899L99336K27082O53736k3938q04224l39354K15569J073264
799H36078J23710l20342m12930p20508L19924l14365q7138O33022M91234J47315
789F96000o92242l97652N2535J6109M39280N19568j00687o15157J20412L98224
779D36390P48272O77754m585l04641p60002j10694k3956L5703N33302j30190l63850
768G33503O42425l8215q05194l26028m5159L10967J2220J22273J54901K32863
758I94556j60942q60879k0618O53848K13579l84897m89365n94266l7137l41236
$$ plain form
748 -1027357 -653738 -704044 -743156 -769378 -249172 54714 -397205 -350531 -464242 -515261 -401677
737 -401677 -484645 -145508 -273822 140968 571464 431842 -58527 170598 729958 1740263
727 1740263 2543391 2595460 2819834 2153678 1548886 1147870 1137603 737258 439111 195527
717 195527 21629 467217 654103 543293 -494701 -1317472 -1235939 -123712 690614 389260
707 389260 951133 1054432 393585 -240775 -924432 -733515 -314128 -191200 47818 171269
697 171269 106049 364057 -320854 -872074 -681379 -487589 -423709 -145725 -377145 -955595
687 -955595 -1079859 -1088526 -1049679 -887191 -631098 -39109 410412 -204306 -944315 -1170617
677 -1170617 -1039393 -1208774 -711180 -456321 -585100 -484285 293328 658577 836856 538126
$$ packed form
748a027357L73619n0306l9112k6222N20206L03886m51919M6674j13711n1019J13584
737d01677q2968L39137j28314M14790M30496j39622m90369K29125N59360J010305
727A740263Q03128N2069K24374o66156o04792m01016j0267m00345k98147k43584
717A95527j73898M45588J86886j10810j037994q22771Q1533J112227Q14326l01354
707C89260N61873J03299o60847o34360o83657J90917M19387J22928K39018J23451
697A71269o5220K58008o84911n51220J90695J93790O3880K77984k31420n78450
687i55595j24264q667L8847J62488K56093N91989M49521o14718p40009k26302
677a170617J31224j69381M97594K54859j28779J00815P77613L65249J78279k98730
$$ plain form
667 538126 514993 918197 1291386 1601746 1305439 987158 871829 974236 451461 522521
657 522521 458524 612029 321254 527992 959998 758515 649461 -26689 -321553 932441
647 932441 2012352 2405970 1712463 850946 -90272 -307208 -446830 -724238 -735490 -1055154
637 -1055154 -1050964 -122400 876927 1309997 1027853 1414283 1991305 1611847 1223792 736439
627 736439 440150 308873 375886 484943 589325 989607 1059675 258807 -245331 700405
617 700405 1411949 1224981 979396 923610 1073770 1259238 1073091 685566 455880 1179710
607 1179710 1663594 1336139 434366 -153066 -375677 -277329 759747 2081506 2511165 2096751
597 2096751 1737332 1348805 774001 269344 558914 499704 96767 81587 414678 663682
$$ packed form
667E38126k3133M03204L73189L10360k96307l18281j15329J02407n22775P1060
657E22521o3997J53505k90775K06738M32006k01483j09054o76150k94864J253994
647I32441J079911L93618o93507q61517r41218k16936j39622k77408j1252l19664
637a055154M190R28564R99327M33070k82144L86430N77022l79458l88055m87353
627G36439k96289j31277O7013J09057J04382M00282P0068q00868n04138R45736
617G00405P11544j86968k45585n5786J50160J85468j86147l87525k29686P23830
607A179710M83884l27455r01773n87432k22611R8348J037076J321759M29659m14414
597B096751l59419l88527n74804n04657K89570n9210m02937j5180L33091K49004
$$ plain form
587 663682 390054 -394474 -994348 -806532 -378558 -471720 -203603 -41193 476951 469182
577 469182 -670246 -1295001 -376828 398413 965139 1066020 1208286 1056521 432848 474050
567 474050 139057 -62012 -283985 -377297 -926684 -1265849 -587483 -602364 -956578 -1478253
557 -1478253 -1431951 -984025 -471890 -132824 -728196 -830654 -616831 -361240 -755117 -344697
547 -344697 723493 654373 142447 132509 627760 772196 806195 1101670 707541 627579 93909
536 93909 -207212 436477 1177315 988296 761379 -39419 -345380 -111696 74150 250516
526 250516 384462 767745 855082 655035 653729 447134 -226681 -1006333 -1117029 -92538
516 -92538 557416 537602 1041236 1167110 881731 1069761 1207064 1033845 629179 322163
$$ packed form
587F63682k73628p84528n99874J87816M27974r3162K68117J62410N18144p769
577D69182j139428o24755R18173P75241N66726J00881J42266j51765o23673M1202
567D74050l34993k01069k21973r3312n49387l39165O78366j4881l54214n21675
557a478253M6302M47926N12135L39066n95372j02458K13823K55591l93877M10420
547c44697J068190o9120n11926r938M95251J44436L3999K95475l94129p9962n33670
536I3909l01121O43689P40838j89019k26917q00798l05961K33684J85846J76366
526B50516J33946L83283Q7337k00047j306k06595o73815p79652j10696J024491
516i2538O49954j9814N03634J25874k85379J88030J37303j73219m04666l07016
$$ plain form
506 322163 235980 277529 -2515 115937 -241303 -315055 53857 620739 325512 430311
496 430311 961494 1104813 898105 541169 762690 826723 557525 901768 1347732 1553274
486 1553274 953832 649206 336936 471844 50402 352220 192419 609410 1164829 1101010
476 1101010 1534131 1479516 902344 236239 131375 235727 -503183 -866682 41053 1084332
466 1084332 1194538 992615 932870 313918 154867 148460 326790 662581 -161795 -325936
456 -325936 -168546 -15435 376037 547694 192119 255788 945408 655729 777283 115036
446 115036 147248 490513 713659 931875 1233108 1800379 2212206 1962198 1636939 1092230
436 1092230 295531 342344 230812 124063 20503 -559276 -1150343 -888164 -462087 313233
$$ packed form
506C22163q6183M1549k80044J18452l57240p3752L68912N66882k95227J04799
496D30311N31183J43319k06708l56936K21521O4033k69198L44243M45964K05542
486A553274n99442l04626l12270J34908m21442L01818j59801M16991N55419o3819
476A101010M33121n4615n77172o66105j04864J04352p38910l63499R07735J043279
466A084332J10206k01923n9745o18952j59051o407J78330L35791q24376j64141
456c25936J57390J53111L91472J71657l55575O3669O89620k89679J21554o62247
446A15036L2212L43265K23146K18216L01233N67271M11827k50008l25259n44709
436A092230p96699M6813j11532j06749j03560n79779n91067K62179M26077P75320
$$ plain form
426 313233 726488 182990 -130763 -788847 -1514435 -1885100 -1950188 -1329541 -539962 266740
416 266740 640903 647736 811725 1299806 1206646 780179 495585 1065806 1459707 807809
406 807809 846823 840145 705882 290111 66386 -30392 185936 152724 -59173 451980 436123
395 436123 515700 324700 -212273 -72873 362778 605911 869828 826865 545795 910915
385 910915 1154806 605754 257722 172140 346319 -108941 -389701 -325196 -614600 -805894
375 -805894 -470632 -6100 346228 466763 219564 401076 333281 609401 583941 465421
365 465421 446128 502583 628972 783469 742926 209989 509846 1409622 1538551 1151997
355 1151997 783806 525634 270449 428119 597329 204342 616751 819514 554843 805510
$$ packed form
426C13233M13255n43498l13753o58084p25588l70665o5088O20647P89579Q06702
416B66740L74163O833J63989M88081r3160m26467k84594N70221L93901o51898
406H07809L9014o678j34263m15771k23725r6778K16328l3212k11897N11153j5857
395D36123P9577j91000n36973J39400M35651K43133K63917m2963k81070L65120
385I10915K43891n49052l48032q5582J74179m55260k80760O4505k89404j91294
375h05894L35262M64532L52328J20535k47199J81512o7795K76120k5460j18520
365D65421j9293N6455J26389J54497m0543n32937K99857Q99776J28929l86554
355A151997l68191k58172k55185J57670J69210l92987M12409K02763k64671K50667
$$ plain form
345 805510 597955 626306 880906 690069 818696 943134 878745 997516 1129299 971092
335 971092 729171 -6419 -233782 -474888 -488058 -251624 -89767 212504 685132 1076045
325 1076045 1137695 1293280 1033634 995524 1447626 1094458 514468 337775 -172677 -592543
315 -592543 -490175 -158942 -62637 -3429 -178693 -890305 -877320 -230899 125944 22816
305 22816 23927 -102541 -629548 -747985 -474275 -399047 -201812 -269653 -332507 -56899 -96040
294 -96040 -386988 -442714 -343902 349898 548048 357273 -144275 -88180 160773 -35579 -181366
283 -181366 341032 424451 -456781 -361894 -70316 650377 1114623 1308265 935440 428636
273 428636 517960 921736 1262843 1319005 1150528 492978 -25628 -220346 245914 -106068
$$ packed form
345H05510k07555K8351K54600j90837J28627J24438o4389J18771J31783j58207
335I71092k41921p35590k27363k41106j3170K36434J61857L02271M72628L90913
325A076045O1650J55585k59646l8110M52102l53168n79990j76693n10452m19866
315e92543J02368L31233R6305N9208j75264p11612J2985O46421L56843j03128
305B2816J111j26468n27007j18437K73710P5228J97235o7841o2854K75608l9141
294i6040k90948n5726R8812O93800J98150j90775n01548N6095K48953j96352j45787
283a81366N22398Q3419q81232R4887K91578P20693M64246J93642l72825n06804
273D28636Q9324M03776L41107N6162j68477o57550n18606j94718M66260l51982
$$ plain form
263 -106068 -402557 -417801 117762 872852 896816 591638 297374 452606 836618 1303004
253 1303004 1667493 1381038 843584 634655 475220 -89502 -182090 300360 1013095 1136508
243 1136508 734663 280204 282773 723126 1264077 1343326 1475806 1042619 506427 502318 652826
232 652826 660285 715028 1217101 898557 650717 770938 732892 1022076 957193 365989 -14470
221 -14470 -340770 -300712 -84488 -154120 -468871 -736460 -289125 -116715 -398319 -623055
211 -623055 -951217 -827067 -474939 -56382 260802 1040179 1167623 1250442 883146 98412
201 98412 -204677 401869 434794 290865 515566 1286297 1646895 1485988 1250280 918715
191 918715 444053 -209344 -341660 -17083 652667 691893 548355 527494 612884 663080 696093
$$ packed form
263a06068k96489j5244N35563P55090K3964l05178k94264J55232L84012M66386
253A303004L64489k86455n37454k08929j59435n64722r2588M82450P12735J23413
243A136508m01845m54459K569M40353N40951P9249J32480m33187n36192m109J50508
232F52826P459N4743N02073l18544k47840J20221l8046K89184o4883n91204l80459
221a4470l26300M0058K16224o9632l14751k67589M47335J72410k81604k24736
211f23055l28162J24150L52128M18557L17184P79377J27444Q2819l67296p84734
201I8412l03089O06546L2925j43929K24701P70731L60598j60907k35708l31565
191I18715m74662o53397j32316L24577O69750L9226j43538k0861Q5390N0196L3013
$$ plain form
180 696093 988590 950250 1061598 915907 802507 835435 662948 204457 -232316 -326269
170 -326269 -925367 -1403268 -1274293 -325059 81465 274950 -127217 -153013 -124384 -447
160 -447 -233989 -840 556566 942119 1254825 901667 138711 -45367 -247272 197529
150 197529 390972 540828 812210 646309 648953 854542 1132655 998098 569161 367481
140 367481 364599 248480 -292901 -850464 -874933 -693420 -506240 420065 997015 1327243
130 1327243 1477087 965625 174609 -435554 -438475 60455 135961 458751 520994 723111
120 723111 321969 -187611 -61590 267331 246650 477925 283615 206715 356079 479640
110 479640 456929 670052 770634 729317 684227 735078 1036173 1391467 1504692 1220387 354035
$$ packed form
180F96093K92497l8340J11348j45691j13400L2928j72487m58491m36773r3953
170c26269n99098m77901J28975R49234M06524J93485m02167k5796K8629J23937
160d47k33542K33149N57406L85553L12706l53158p62956j84078k01905M44801
150A97529J93443J49856K71382j65901K644K05589K78113j34557m28937k01680
140C67481k882j16119n41381n57563k4469J81513J87180R26305N76950L30228
130A327243J49844n11462p91016o10163k921M98930P5506L22790O2243K02117
120G23111m01142n09580J26021L28921k0681K31275j94310p6900J49364J23561
110D79640k2711K13123J00582m1317m5090N0851L01095L55294J13225k84305q66352
$$ plain form
99 354035 -54071 -102055 342433 1048692 1294659 1340181 1048664 986568 490639 418061 503296
88 503296 452459 603344 553646 733227 982812 771917 322399 317937 1056574 1314795 1405441
77 1405441 1823554 1612518 1009600 299252 65280 1035009 1362501 1382672 1218491 1032883
67 1032883 720604 873572 1015193 771929 625623 456535 122049 -22045 311562 335100
57 335100 438716 230875 -43545 496094 970205 952059 1102632 1047456 446238 35462
47 35462 -329246 -401352 61432 93759 231450 343226 264740 -10355 -133795 665175 1103102
36 1103102 1269849 1113346 1165465 807375 692579 563503 431268 591265 309689 -31714
26 -31714 483527 944455 899854 878726 503678 -56908 -198292 29733 169774 -83574 -267587
$$ packed form
99C54035m08106m7984M44488P06259K45967M5522k91517o2096m95929p2578Q5235
88E03296n0837J50885m9698J79581K49585k10895m49518m462P38637K58221R0646
77A405441M18113k11036o02918p10348k33972R69729L27492K0171j64181j85608
67A032883l12279J52968J41621k43264j46306j69088l34486j44094L33607K3538
57C35100J03616k07841k74420N39639M74111j8146J50573n5176o01218m10776
47C5462l64708p2106M62784L2327J37691J11776p8486k75095j23440P98970M37927
36A103102J66747j56503N2119l58090j14796j29076j32235J59997k81576l41403
26c1714N15241M60928m4601k1128l75048n60586j41384K28025J40041k53348j84013
$$ plain form
15 -267587 -430444 -475555 -644770 -297277 -83928 78523 118658 -42175 303908 545777
5 545777 542597 445212 342037 728912 1165825
0 1165825
$$ packed form
15b67587j62857m5111j69215L47493K13349J62451M0135j60833L46083K41869
5E45777l180r7385j03175L86875M36913
0A165825
$$ Imaginary data points
##PAGE= N=2
##DATA TABLE= (X++(I..I)), XYDATA
$$ plain form
32767 -589573 -258246 -481971 -833887 -698687 -460861 -129392 124972 235553 117142 -176946
32757 -176946 -7871 -22418 168676 4652 -123457 327197 274183 -280252 -465740 -345677
32747 -345677 -52556 -285062 -737619 -671460 -424675 -81169 366833 277779 -306370 -586736
32737 -586736 -255003 113861 624104 831231 592137 282307 119457 263454 613301 1097377
32727 1097377 1090287 860184 938590 1439110 1847873 1895743 1127787 405549 348160 378460
32717 378460 669263 949611 795807 391345 267182 649001 540464 293298 51130 -120730
32707 -120730 -230488 -305153 -219210 -579088 -757297 -409796 -51405 -119753 -207783 -190113
32697 -190113 -57862 -145582 -491478 -925476 -1338980 -1380647 -1615910 -945052 -469028 -744502
$$ packed form
32767e89573L31327k23725l51916J35200K37826L31469K54364J10581j18411k94088
32757a76946J69075j4547J91094j64024j28109M50654n3014n54435j85488J20063
32747c45677K93121k32506m52557O6159K46785L43506M48002q9054n84149k80366
32737e86736L31733L68864N10243K07127k39094l09830j62850J43997L49847M84076
32727A097377p090k30103P8406N00520M08763M7870p67956p22238n7389L0300
32717C78460K90803K80348j53804m04462j24163L81819j08537k47166k42168j71860
32707a20730j09758p4665Q5943l59878j78209L47501L58391o8348q8030J7670
32697a90113J32251q7720l45896m33998m13504m1667k35263O70858M76024k75474
$$ plain form
32687 -744502 -929709 -920673 -277215 538863 385878 -4349 -188647 -85498 364425 479128
32677 479128 366896 77210 179370 332604 195685 -373131 -657857 -652992 -515370 -218467
32667 -218467 -357254 -226316 -294714 261493 430815 569868 376616 -91924 -292996 -131479
32657 -131479 -78231 23348 153061 120619 151974 176122 721 -17201 -370345 -733695
32647 -733695 -482147 -397311 -222783 -140066 56226 406527 222681 -159315 90459 294906
32637 294906 -15451 -94004 -675833 -1156915 -1207091 -1030366 -765218 -292100 505044 206552
32627 206552 -161983 71989 -212378 -109930 1118 -138049 -354716 -160548 -119926 331953
32617 331953 789518 893908 617717 811365 963703 1334053 1240897 691608 -156566 -446191
$$ packed form
32687g44502j85207R036O43458Q16078j52985l90227j84298J03149M49923J14703
32677D79128j12232k89686J02160J53234j36919n68816k84726M865J37622K96903
32667b18467j38787J30938o8398N56207J69322J39053j93252m68540k01072J61517
32657a31479N3248J01579J29713l2442L1355K4148j75401j7922l53144l63350
32647g33695K51548Q4836J74528Q2717J96292L50301j83846l81996K49774K04447
32637B94906l10357p8553n81829m81082n0176J76725K65148M73118P97144k98492
32627B06552l68535K33972k84367J02448J11048j39167k16667J94168M0622M51879
32617C31953M57565J04390k76191J93648J52338L70350r3156n49289q48174k89625
$$ plain form
32607 -446191 -95025 172667 509039 775526 288458 -220375 -18845 214116 1034159 1212165
32597 1212165 578633 170398 -110620 165660 623770 513116 442622 233684 -604982 -901527
32587 -901527 -476281 -381024 -642222 -502280 -220432 -146724 -94037 -458008 -931968 -981214
32577 -981214 -645474 -406788 62541 39925 290140 202120 61046 -277275 -609963 -595671
32567 -595671 -365127 -62688 22926 356450 153031 -492667 -669625 -98406 -583777 -679437
32557 -679437 -79571 -325506 -672981 -538503 -479751 -21517 405907 417869 509370 875860
32547 875860 1392267 1201306 1120829 1270346 1293562 287530 -840708 -1050287 -540529 131490
32537 131490 319025 -317294 -273817 123186 642814 715565 694742 660827 348087 656873
$$ packed form
32607d46191L51166K67692L36372K66487m87068n08833K01530K32961Q20043J78006
32597A212165o33532m08235k81018K76280M58110j10654p0494k08938q38666k96545
32587i01527M25246R5257k61198J39942K81848P3708N2687l63971m73960m9246
32577i81214L35740K38686M69329k2616K50215q8020j41074l38321l32688J4292
32567e95671K30544L02439Q5614L33524k03419o45698j76958N71219m85371r5660
32557f79437N99866k45935l47475J34478N8752M58234M27424J1962R1501L66490
32547H75860N16407j90961q0477J49517K3216j006032j128238k09579N09758O72019
32537A31490J87535o36319M3477L97003N19628P2751k0823l3915l12740L08786
$$ plain form
32527 656873 971457 605339 -293243 -472112 -70408 583172 817808 468358 279845 379340
32517 379340 467070 71613 141072 150907 -233455 -316289 217743 405716 462953 809179 734527
32506 734527 449657 620426 559090 82398 374384 718047 875402 698878 437600 -158625
32496 -158625 -492555 -367945 -465246 -895861 -728943 -270414 60945 645967 782480 456551
32486 456551 292433 769457 794566 189836 -404952 -455786 -305494 -610989 -480332 130229
32476 130229 753902 352422 54479 -179564 -545516 -633059 -694623 -878101 -831930 -393147
$$ packed form
32527F56873L14584l66118q98582j78869M01704O53580K34636l49450j88513R9495
32517C79340Q7730l95457O9459R835l84362q2834N34032J87973N7237L46226p4652
32506G34527k84870J70769o1336m76692K91986L43663J57355j76524k61278n96225
32496a58625l33930J24610r7301m30615J66918M58529L31359N85022J36513l25929
32486D56551j64118M77024K5109o04730n94788n0834J50292l05495J30657O10561
32476A30229O23673m01480k97943k34043l65952q7543o1564j83478M6171M38783
$$ [...]
##END NTUPLES=NMR SPECTRUM
##END=
