##TITLE=Analysis number 321118
Compound Code sb 01040
Project Code adrs
Chemist Name andrew smith
##JCAMPDX= 6.0         $$ Bruker NMR JCAMP-DX V2.0
##DATA TYPE= NMR SPECTRUM
##DATA CLASS= NTUPLES
##ORIGIN= Bruker BioSpin GmbH
##OWNER= nmr
$$ XWIN-NMR		Version 3.5
$$ Tue Jul 25 18:13:16 2006 GMT Daylight Time (UT+1h)  MAYBRIDGE\nmr@NMR_250MHZ
##.OBSERVE FREQUENCY= 250.131544655141
##.OBSERVE NUCLEUS= ^1H
##.ACQUISITION MODE= SIMULTANEOUS (DQD)
##.ACQUISITION SCHEME= undefined
##.AVERAGES= 16
##.DIGITISER RES= 18
##SPECTROMETER/DATA SYSTEM= dpx250
##.PULSE SEQUENCE= zg30
##.SOLVENT NAME= CDCl3
##.SHIFT REFERENCE= (INTERNAL, CDCl3, 0, 16.522)
##AUDIT TRAIL= $$ (NUMBER, WHEN, WHO, WHERE, WHAT)
$$ ##TITLE= Audit trail, XWIN-NMR		Version 3.5
$$ ##JCAMPDX= 5.01
$$ ##ORIGIN= Bruker BioSpin GmbH
$$ ##OWNER= nmr
$$ C:\u/data/dgb/nmr/ADRS/3530/pdata/1/auditp.txt
$$ ##AUDIT TRAIL=  $$ (NUMBER, WHEN, WHO, WHERE, WHAT)
(   1,<2006-07-25 18:12:50.95 +100>,<MAYBRIDGE\nmr>,<NMR_250MHZ>,
      <created by zg, POWCHK disabled, PULCHK disabled
       configuration hash MD5:
       E2 DF 36 D8 04 B2 41 60 5A D7 A3 38 5A 4B D0 FE
       data hash MD5: 64K
       FA 57 61 68 70 1E B4 D2 60 4C D9 6D DB 56 E1 61>)
(   2,<2006-07-25 18:13:05.05 +100>,<MAYBRIDGE\nmr>,<NMR_250MHZ>,
      <Start of raw data processing
       ef LB = 0.3 FT_mod = 6 PKNL = 1 SI = 32K 
       data hash MD5: 32K
       3C 2F 6A 88 6D B4 FB AF C0 45 A9 51 02 4C F2 6F>)
(   3,<2006-07-25 18:13:07.12 +100>,<MAYBRIDGE\nmr>,<NMR_250MHZ>,
      <apk 
       data hash MD5: 32K
       77 9A 2F 60 93 54 EB AA 21 15 3C 44 BA 3B 08 48>)
(   4,<2006-07-25 18:13:07.85 +100>,<MAYBRIDGE\nmr>,<NMR_250MHZ>,
      <abs ABSG = 5 
       data hash MD5: 32K
       E1 B1 9F DA CB 2A 27 76 CF 4E 29 0C 12 22 A2 47>)
$$ ##END=
$$ 
$$ hash MD5
$$ A0 5D AD 12 71 A3 57 F6 F3 6C 22 E4 F9 0D 6B BE
##$RELAX= 
##$RELAX= 
##$RELAX= 
##$RELAX= 
##$RELAX= 
##$RELAX= 
##$RELAX= 
$$ Bruker specific parameters
$$ --------------------------
##$DU= <C:\u>
##$EXPNO= 3530
##$NAME= <ADRS>
##$PROCNO= 1
##$TYPE= <nmr>
##$USER= <dgb>
##$AMP= (0..31)
100 100 100 100 100 100 100 100 100 100 100 100 100 100 100 100 100 100 
100 100 100 100 100 100 100 100 100 100 100 100 100 100 
##$AQSEQ= 0
##$AQ_mod= 3
##$AUNM= <au_zg>
##$AUTOPOS= <6 >
##$BF1= 250.13
##$BF2= 250.13
##$BF3= 250.13
##$BF4= 250.13
##$BF5= 500.13
##$BF6= 500.13
##$BF7= 500.13
##$BF8= 500.13
##$BYTORDA= 1
##$CFDGTYP= 0
##$CFRGTYP= 5
##$CHEMSTR= <none>
##$CNST= (0..31)
1 1 145 1 1 1 1 1 1 1 1 1 1 1 1 1 1 1 1 1 1 1 1 1 1 1 1 1 1 1 1 1 
##$CPDPRG= <>
##$CPDPRG1= <>
##$CPDPRG2= <>
##$CPDPRG3= <>
##$CPDPRG4= <mlev>
##$CPDPRG5= <mlev>
##$CPDPRG6= <mlev>
##$CPDPRG7= <mlev>
##$CPDPRG8= <mlev>
##$CPDPRGB= <>
##$CPDPRGT= <>
##$D= (0..31)
0 1 0 0 0 0 0 0 0 0.06 0 0 0 0 0 0 0.0002 0 0 0 0 0 0 0 0 0 0 0 0 0 0 
0 
##$DATE= 1153847569
##$DBL= (0..7)
120 120 120 120 120 120 120 120 
##$DBP= (0..7)
150 150 150 150 150 150 150 150 
##$DBP07= 0
##$DBPNAM0= <>
##$DBPNAM1= <>
##$DBPNAM2= <>
$$ [...]
##$SUBNAM7= <"">
##$SUBNAM8= <"">
##$SUBNAM9= <"">
##$SW= 20.6930455092707
##$SWIBOX= (0..15)
0 0 3 0 0 0 0 0 0 0 0 0 0 0 0 0 
##$SW_h= 5175.983436853
##$TD= 65536
##$TD0= 1
##$TE= 295.16
##$TE2= 300
##$TE3= 300
##$TEG= 300
##$TL= (0..7)
0 120 120 120 120 120 120 120 
##$TP= (0..7)
150 150 150 150 150 150 150 150 
##$TP07= 0
##$TPNAME0= <>
##$TPNAME1= <>
##$TPNAME2= <>
##$TPNAME3= <>
##$TPNAME4= <>
##$TPNAME5= <>
##$TPNAME6= <>
##$TPNAME7= <>
##$TPOAL= (0..7)
0.5 0.5 0.5 0.5 0.5 0.5 0.5 0.5 
##$TPOFFS= (0..7)
0 0 0 0 0 0 0 0 
##$TUNHIN= 0
##$TUNHOUT= 0
##$TUNXOUT= 0
##$USERA1= <user>
##$USERA2= <user>
##$USERA3= <user>
##$USERA4= <user>
##$USERA5= <user>
##$V9= 5
##$VALIST= <valist>
##$VCLIST= <CCCCCCCCCCCCCCC>
##$VD= 0
##$VDLIST= <DDDDDDDDDDDDDDD>
##$VPLIST= <PPPPPPPPPPPPPPP>
##$VTLIST= <TTTTTTTTTTTTTTT>
##$WBST= 1024
##$WBSW= 4
##$XGAIN= (0..3)
0 0 0 0 
##$XL= 0
##$YL= 0
##$YMAX_a= 701793
##$YMIN_a= -701118
##$ZGOPTNS= <>
##$ZL1= 120
##$ZL2= 120
##$ZL3= 120
##$ZL4= 120
##$ABSF1= 16.522
##$ABSF2= -4.171173
##$ABSG= 5
##$ABSL= 3
##$ALPHA= 0
##$AQORDER= 0
##$ASSFAC= 0
##$ASSFACI= 0
##$ASSFACX= 0
##$ASSWID= 0
##$AUNMP= <proc_1d>
##$AZFE= 0.1
##$AZFW= 0.1
##$BCFW= 0
##$BC_mod= 0
##$BYTORDP= 0
##$COROFFS= 0
##$CY= 12.5
##$DATMOD= 1
##$DC= 0
##$DFILT= <>
##$DTYPP= 0
##$F1P= 14.0000005364418
##$F2P= -0.99999901652339
##$FCOR= 0.5
##$FTSIZE= 32768
##$FT_mod= 6
##$GAMMA= 0
##$GB= 0
##$INTBC= 1
##$INTSCL= 1
##$ISEN= 128
##$LB= 0.3
##$LEV0= 0
##$LPBIN= 0
##$MAXI= 10000
##$MC2= 0
##$MEAN= 0
##$ME_mod= 0
##$MI= 0
##$NCOEF= 0
##$NC_proc= -3
##$NLEV= 6
##$NOISF1= 0
##$NOISF2= 0
##$NSP= 0
##$NTH_PI= 0
##$NZP= 0
##$OFFSET= 16.522
##$PC= 1
##$PHC0= 162.7028
##$PHC1= 6.022343
##$PH_mod= 1
##$PKNL= yes
##$PPARMOD= 0
##$PSCAL= 4
##$PSIGN= 0
##$REVERSE= no
##$SF= 250.13
##$SI= 32768
##$SIGF1= 0
##$SIGF2= 0
##$SINO= 400
##$SIOLD= 32768
##$SREGLST= <1H.CDCl3>
##$SSB= 0
##$STSI= 32768
##$STSR= 0
##$SW_p= 5175.98343685301
##$SYMM= 0
##$S_DEV= 0
##$TDeff= 65536
##$TDoff= 0
##$TI= <Analysis number 999999
Compound Code 99
Book Reference 9
Project Code 9>
##$TILT= no
##$TM1= 0
##$TM2= 0
##$TOPLEV= 0
##$USERP1= <user>
##$USERP2= <user>
##$USERP3= <user>
##$USERP4= <user>
##$USERP5= <user>
##$WDW= 1
##$XDIM= 32768
##$YMAX_p= 342345966
##$YMIN_p= -56948
$$ End of Bruker specific parameters
$$ ---------------------------------
##NTUPLES= NMR SPECTRUM
##VAR_NAME=  FREQUENCY,     SPECTRUM/REAL,   SPECTRUM/IMAG
##SYMBOL=    X,             R,               I
##VAR_TYPE=  INDEPENDENT,   DEPENDENT,       DEPENDENT
##VAR_FORM=  AFFN,          ASDF,            ASDF
##VAR_DIM=   32768,         32768,           32768
##UNITS=     HZ,            ARBITRARY UNITS, ARBITRARY UNITS
##FACTOR=    0.157963299565203, 1,           1
##FIRST=     4132.6476996994, 0,             0
##LAST=      -1043.33573715361, 0,           0
##MIN=       -1043.33573715361, -56948,      0
##MAX=       4132.6476996994, 342345966,     0
$$ Real data points
##PAGE= N=1
##DATA TABLE= (X++(R..R)), XYDATA
$$ [...]
14690f365p484l37L896O149K07K186K324j3438n42P035l818l698P789P392O19
14675A915M036P069n267n55k133L270P761J466q099o655N87m952l369p39N837
14660A72r2q353l463N845n108m280j80J988Q532J0695N45o008l168j0050n32p929
14644b1386k859O265J903j375K680J3402j4473M317P784o664J0903r02J387Q31
14630A813L242K122K386L06P504j209o242p442Q101j933J455o435j29m724L888
14615B703l444j4322j1592j218J4230J0335m945j4354J79J718N547O176O961M208
14601B182o625Q89N032l862P7M18Q988L611r762p139L457N131N510r632j5637
14586a7362o457O892N964J711N60K275K0147J277j3128o091m958J521p686m341
$$ y = [-6365, -13849, -14186, -10290, -4141, -3934, -1748, 576, -12862, -13404, -6369, -10187, -13885, -6096, 1296, 1915, 5951, 13020, 7753, 7198, 5065, 8335, 16096, 17562, 9463, 2808, 3395, -1557, -4926, -5665, 172, 80, -8273, -11736, -5891, -10999, -15279, -15459, -13471, -4939, 5756, 6301, 293, -2875, -12925, -13457, -21386, -24245, -17980, -16077, -17452, -14772, -1370, -15843, -11526, -3742, -10406, 497, -405, 982, 1813, 5055, 7177, 9563, 9869, 17373, 16164, 9922, 2480, 10581, 8648, 10103, 3668, 3539, -1185, 2703, -741, -15063, -26655, -27873, -13643, -3308, -8253, -22607, -22428, -20710, -15163, -8987, -2026, 2182, -4443, -3554, 1478, -2384, -2307, -1889, 7099, 10710, 948, -6191, -2734, 2397, 7907, -1725, -17362, -23819, -16927, -10963, -9252, -8692, -6417, 13730, 15007, 1879, -4212, -9170, -7649, -15335, -19676]
14572a9676o377O513N695M112L379j165m485J264O600J0588k325j8158j477N040
14558a0472l322M68J168k375p15J3613J2366J062L933J4434l144j0351j9601j4180
14544a7116P145J6067Q81N200O138J3559j4950j1068n218o407O817j1035M145
14531e842J8105q676o787J600n743O557L697K458O925m526n292l8N50n876j5538
14516a8426K147j678L164J0137J0638O557Q89K356O073j2921j1267R571J42m291
14502C091o092M158L415n939j144q1j0272K284o81Q413J1605j3703j1273J6697
14488D78J651n923J1192J3294k966j2140R6R332p08j2749r812m543J089K655j0156
14473a9210j1483O95P812J1124j729N674J824L860J033l36j536m170m529K056
$$ y = [-19676, -26053, -19540, -13845, -9733, -6354, -7519, -12004, -10740, -4140, 6448, 4123, -14035, -15512, -10472, -13794, -13326, -12158, -14533, -15248, -1635, 10731, 11793, 15726, 30160, 27016, 16665, -2936, -17116, -9971, 6096, 6977, 12177, 18315, 31874, 16924, 5856, 638, -5769, 1048, -9987, -5842, 12263, 3587, -3200, -1600, -7343, -786, 2911, 5369, 12294, 7768, 2476, 2438, 2988, -2888, -18426, -16279, -17957, -14793, -4656, 5982, 12539, 13428, 15784, 21857, 8936, -2331, 7240, 7382, 3091, -3001, 1157, 4572, -1367, -2511, -2592, -12864, -10580, -11261, -2848, 8757, -4946, -16219, 478, 2129, -3794, 7398, 20692, 17726, 5586, 5682, 15014, 14306, 1557, -8255, -12798, -11709, -9054, -19210, -30693, -29998, -22186, -11062, -12791, -7117, -5293, -1433, -400, -736, -2272, -6442, -10971, -8915]
14459h915J0143M792m052q105l126n249l615j3071j290J7637J8509O799p08p665
14445B084Q118r002j2198N640Q034R266K577N202q190m926j634K569L083o265
14431D358p183j0913p061Q532p335n426Q315k360j748p130P274J3141O740O917
14417F121m058j4621l411K411R14M325p459J1726J318j3803m896J2472K1138J3116
14403B5293m903r062j3027o407R467P432p454L856J3467m34j5731R475L219j1800
14389C391j5878n201M744O103p54j2403j529J5294N916k570J1880l529M907J4020
14375B4391O165k0612j3233o582L609R113J155k426m669M493K875n218o690P902
14361B73O504M993q609j6222j059P172K793n488N746O339m987R544O503m018j2530
$$ y = [-8915, 1228, 6020, 1968, -6137, -9263, -14512, -18127, -31198, -32488, -14851, 3658, 10457, 9749, 2084, 10202, 1200, -10998, -5358, 2676, 11942, 14519, 19721, 11531, 6605, 4971, 7540, 10623, 4358, -2825, -13738, -20799, -12267, -19602, -25028, -16713, -19073, -20821, -27951, -20677, -7536, -796, 6121, 2063, -12558, -15969, -13558, -12644, -8319, -15778, -4052, -2734, -16537, -21433, -8961, 12177, 25293, 20390, 11328, -1699, -8106, 1361, 8793, 1339, 5195, 18662, 18228, 2497, 11972, 15191, 3391, -12487, -17688, -12944, -6841, -7595, -19998, -21527, -6233, -317, -2887, 8993, 5464, 10371, 24391, 30556, 9944, -3289, -9871, -6262, 2851, 4006, 1580, -3089, 1404, 4279, -939, -7629, 273, 6777, 11770, 3161, -13061, -14120, -6948, -4155, -9643, -3897, 2442, -2545, 6999, 13502, 9484, -3046]
14346c046j8400L882P148N855r949M860J728q014q116J1310J9061l599k0374m814
14332b2468l196M705J2373n995J647J4404P519J673N964j0197j3895j3876R188
14319a2154J742O403K107m505o232J645P352J61J7574M354o311j220P88N98R598
14304B1900J399L392o345j7221k504R421N050j1728q391J082J026n370p994Q321
14290g962P725O954L979m034R758P473J433j2650n249r10p05j3076k130j900j582
14275a2876O379M190M072m423o177o926o093N592J9338n260L56o680o059O018
14261h549n077j279Q286J2523j308p586o429o466N156q162q97P116J1221j537
14247b988j1172J902J447K878J42j2397j405J6114J4556m601l151M348L721L55
$$ y = [-3046, -21446, -17564, -10416, -4561, -14510, -9650, -7922, -15936, -24052, -12742, 6319, 2720, -17654, -22468, -25664, -20959, -8586, -14581, -12934, 1470, 8989, 10662, 16626, 6429, -7466, -21342, -12154, -10412, -4009, -1902, -6407, -12639, -10994, -3642, -3481, 14093, 18447, 12136, 10916, 11704, 12302, 21900, 23299, 26691, 20346, 3125, 621, 10042, 15092, 3364, -5027, -3945, -2919, -8289, -16283, -7962, -237, 6717, 10696, 6662, 16420, 23893, 25326, 12676, 7427, 6517, 5812, -7264, -9394, -11294, -12876, -6497, -2307, 1765, -2658, -8835, -15761, -21854, -16262, 3076, -2184, -1828, -8508, -14567, -8549, -13626, -14905, -6619, 5904, 4596, -2990, -9419, -15885, -10729, -18891, -19788, -12672, -1451, -2988, -14160, -12258, -10811, -7933, -7791, -20188, -21593, -5479, 9077, 4476, 1325, 5673, 9394, 9749]
14233I749L894p276P971J4264r343j3421o506J381o16j3900Q485K0003O124k085
14219A8724K980j6657j4443p700j1074J3908J7317J88J2855q71j5707j0757J7135
14206E898M278j417o305K778r58l359J814r398k184j489Q049J2674J4315P936
14192C2632p64r741k012j0662q365J280L970j1741p275N603j299M409J1012p352
14178c05o373K044j0461J71O016j82J157J155j882M531R258k0987j6787j821J4084
14163b0382J0355L897J822J2831P821L70q289j9195j5803K723O299O281M179N228
14149a863M202m129R712J324j0840j1144P299M265j0217N092m743Q621m10N457
14135B626j6744K59J2378M70L375J3365J0542j0092j1013l302n199j3319J5162
$$ y = [9749, 13643, 6367, 14338, 28602, 19259, 5838, -668, 713, 97, -13803, -5318, 14685, 20809, 18724, 21704, 5047, -9396, -17096, -28170, -14262, 3055, 3243, 16098, 15227, -480, -11237, 5898, 10176, 8759, 2454, 5232, 4274, 915, 2729, -6669, -8853, -10342, -2293, 10381, 24696, 32632, 31868, 22127, 20115, 9453, 1088, 2368, 6338, -5403, -12678, -7075, -8374, -3965, 7047, -305, -6678, -4634, -15095, -14924, -8908, -9090, -7933, -6778, -8660, -4129, 5129, -15858, -32645, -34466, -20382, -10027, -6130, -4308, 8523, 16344, 16714, 8425, -10770, -26573, -23850, -17551, -11270, -7091, -1863, 2339, -1790, 7922, 9246, -1594, -12738, -5439, -1174, -11391, -6299, -11042, -2421, -2831, 2626, -14118, -13859, -1481, -1011, 2364, 15729, 26271, 16179, 5166, 1864, -3335, -16654, -1492]
14122a492R496k0477P940J0320Q93l709L140k599n134m304r02J037p007m757r2
14107a7647N211J7396J4422r171j7360J3052P696j4853k98M218O667M460j682
14094A2111p901j672k968p971q572K169K839J56j097j4735P976J2464N936l19
14080a584q858J1043N996q911q375M879J6141Q334m732k432j4220j0702L279J7266
14066G124R436l337j4405j0679q146j3484L139J1951J652N133Q791R480m349j63
14052B143J3527k021n02j92m259o284m742j2604J6749j599L78m380M691k11K846
14037C540r900o542J7748P704J537j6296r648l933Q437q66O302K331R247j2917
14023c256j1046J2706K2287K345j6554j4189Q483J710R081m821p753p117l773
$$ y = [-1492, 8004, -12473, -4533, 5787, 6680, 2971, 6111, 3512, -1622, -5926, -6828, -5791, -12798, -17555, -17647, -12436, 4960, 19382, 10211, -7149, 5903, 13599, -1254, -1552, 2666, 9333, 13793, 12111, 4210, 2538, -430, -8401, -16973, -14804, -11965, -11809, -12906, -27641, -19665, -7201, -1265, -1584, -10442, 601, 6597, -2314, -10689, -5810, 10331, 18665, 13933, 11501, -2719, -13421, -10142, 7124, 16560, 13223, -1182, -11861, -20007, -33491, -30352, -18401, -16749, -11616, -2825, 6655, 2306, 2143, 15670, 13649, 13147, 12955, 8696, 2412, -2330, -14934, 1815, 216, 594, -3786, 905, 694, 3540, -6360, -12902, 4846, 12550, 14087, -2209, -11857, -15790, -7353, -8219, -1917, 414, 9661, -3256, -14302, -1596, 20691, 23036, 6482, -7707, 776, 2486, 11567, 6746, -1007, -8124, -11897]
14010a1897j0441N438J1473J3360j177j2700O991R850l79M99q153M972m515J95
13996C516O268L247J779l088J4277m9j1390j957k773K833O150L039p915j0029
13982C908n70O229K747l986O619J3316j2348o144K5999J8200n910j3305j5750
13969A9005k524m177j2941q19p973L075P153L949L84N662J3296j1246j827L503
13955A4520R378p535j2829m049J1407P760J154j3807o273n654j7572N977Q889
13942h634J3845n534L362k698P08m562M188o6J1700R768J691q873l429J1470p817
13927A5119j5349m658O692L477Q84M482J1304J3817r911j876N11j2316q789K760
13913F147J23J3435N746R239j290M092j0947p918j888l668k2878J010Q68J0556
$$ y = [-11897, -22338, -16900, -5427, 7933, 6756, -5944, 1047, 10897, 10518, 11017, 2864, 7836, 3321, 3516, 9784, 13031, 14810, 11722, 25999, 25950, 14560, 12603, 9830, 12663, 18813, 21852, 13937, 3908, 3338, 9567, 12314, 8328, 14947, 28263, 15915, 9771, 35770, 53970, 48060, 34755, 19005, 16481, 12304, -637, -1456, -9429, -6354, 799, 4748, 5132, 10794, 24090, 12844, 11017, 14520, 23898, 16363, 3534, -515, 10892, 18652, 19806, 5999, -274, -5928, -23500, -17523, -8634, 5211, -323, 3039, 341, 1049, -3513, 675, 609, 12309, 22077, 23768, 14895, 11466, 22936, 15119, -230, -4888, 1804, 5281, 6165, 10647, 21951, 35768, 25857, 23981, 24492, 12176, 3387, 6147, 6270, 19705, 25451, 34690, 33400, 37492, 26545, 18627, 16739, 13071, -9807, -8797, -7929, 2627]
13899B627P6O236r476q157O008J0123l13j3953P174n404q29l407j558m743m90
13884a6086J2955l841Q773J3976L417k1085n120J8270O890P417p840j1273K290
13871H743J700R787n867o744m745o4O112o724j542n684J0495J5533r442k1679
13857a0121K731Q466M160p17m803K196n00O834l91k790j87K852o229m5J8021j5042
13841D435j31j876j2320l289J6428J2387N912K349J057M565n203J543q529L85
13827A7713J2091p48n498l498R952Q73o272L421p523J1728R905j440j3687M353
13813C1370o916LO47j4531n55r239j7068J5868K3750J0256p586j3591N830J306
13799A9544J1639K927k083j7062n517k139P264r983n666O68q496j0828O453k631
$$ y = [2627, 2703, 8939, -537, -8694, -2686, 7437, 7124, -6829, 345, -5059, -5888, -9295, -10853, -15596, -16086, -3131, -6972, 1801, 15777, 19194, -1891, -7011, 11259, 18149, 25566, 17726, 6453, 8743, 10443, 20230, 14363, 7619, 2874, 2810, 8922, 2198, 656, -5028, 5467, 21000, 11558, -10121, -7390, 1076, 5236, 4519, -284, 1912, 1412, 8246, 7855, 5065, 4878, 7730, 1501, 1456, 19477, 4435, 4304, 2428, -9892, -13181, 3247, 15634, 21546, 23895, 24952, 29517, 24314, 25857, 17328, 17713, 29804, 29056, 23558, 20060, 30012, 30885, 24613, 28034, 20511, 32239, 42144, 40704, 27017, 31370, 24454, 24457, 25104, 10573, 10018, 779, -16289, -421, 23329, 33585, 25999, 12408, 18238, 19544, 31183, 34110, 32027, 14965, 9448, 7309, 14573, 4590, -1076, -408, -8904, -19732, -13279, -15910]
13785a5910q39J6721K0940k383P932j4669n619m745q024J3920K834R195K031O585
13771B7969K769j1623n335J5243k123M03j4980n663l719p322R152J1112R745J655
13757B7283o706k3743j4563N44Q931J3376J2186l816k9J7369q231k0260Q883P288
13743A8512p286o307p804O069k904O067J089J0839j374j4844l464l032J1334J78
13729G073L05j4733N042J6806M989Q827J0700j5989q833l310j436j949L397J4445
13715B5334o189J330K658P730L004n86o520k852o623l820j439m193J1898m442
13701A5290R35K0230P3q977k467M283m197N05m452N18P966l056o489P09J922K273
13685B5066J046k086j3301j2927M330J25m341j962M074J8498J1022n652k804o405
$$ y = [-15910, -16749, -28, 20912, 18529, 26461, 11792, 6173, 1428, -6596, 7324, 10158, 19353, 21384, 27969, 30738, 19115, 13780, 29023, 26900, 27303, 12323, 6660, 2941, -4381, 4771, 15883, 25628, 27283, 20577, -3166, -17729, -17185, -8254, 5122, 17308, 13492, 13463, 30832, 22601, 2341, 11224, 18512, 11226, 4919, -2885, 3184, 280, 6347, 7436, 18275, 16901, 2057, -1407, -4439, 6895, 7073, 7378, -7355, -2313, 14493, 19482, 28309, 39009, 23020, 14187, 10877, 9441, 7492, 10889, 25334, 19145, 20475, 23133, 30863, 33867, 33281, 26761, 23909, 17286, 13466, 12027, 7834, 19732, 15290, 16225, 36455, 36528, 27551, 25084, 29367, 25170, 25675, 21223, 21741, 29707, 26651, 20162, 20871, 22793, 25066, 26112, 24026, 10725, -2202, 2128, 2253, -2088, -4050, 24, 18522, 29544, 23892, 21088, 14683]
13671A4683m977l05K543j63M58p252O840J449J502k372l378j120J0263O386q898
13656A5659K236J4814o386r469R029O55N641P477l465j2104r368m537J3448R14
13642B4544l887J4O776m556r929K905P901L913M94j712m346m364J2348J2575K854
13627D5530J347j2008k717Q74M044R898O572m081R850q94R163R591M258L467L3176
13612A18070L6217J7874J8779J0110M756J627P938j7527m2123l9791k1815r947
13600H4168q282q984j7505j7050J3244L381r789P475p457p835J0417J8251o400
13587E3634Q219M375l431j775R574P982O926N012p886o063N412K951J0981J6364
13573A12275L928P379L0343L4843M0029P3598R1831Q5908M9376K947j0691P828
$$ y = [14683, 9706, 9401, 11944, 11781, 12239, 4987, 11827, 13276, 14778, 12406, 9028, 7908, 18171, 24557, 15659, 17895, 32709, 26323, 16854, 25883, 26538, 32179, 39656, 36191, 24087, 14719, 10182, 23630, 24544, 20657, 20671, 27447, 22891, 12962, 15867, 23768, 27681, 28175, 26463, 22117, 17753, 30101, 42676, 45530, 46877, 34869, 32152, 33026, 37070, 46968, 53540, 49459, 59309, 58415, 67578, 77169, 81427, 84894, 118070, 154287, 172161, 190940, 201050, 205806, 207433, 215371, 197844, 155721, 115930, 94115, 84168, 75886, 66902, 49397, 32347, 45591, 48972, 39183, 46658, 39201, 31366, 41783, 60034, 53634, 61853, 66228, 62797, 61022, 70596, 78578, 85504, 90516, 82630, 76567, 81979, 84930, 95911, 112275, 116203, 123582, 153925, 188768, 228797, 302395, 394226, 480134, 529510, 532457, 521766, 529594]
13561E29594J0822n1961r2335r5703o1286l7162l1392l6283k0436j2040l911R692
13549A07599j1590r811L444K502j0809j6763j285M738J463R544J4646L067r173
13536H7572o564O355M747o104K641J3192P004P806J4905J1307K1326L1983L7001
13523B33171Q3541R6215P7238N7832K4612m104o702l6459l2954o4554q8998p9487
13511B59351m8138l0395k9300l5394k5453j6102k367K586K367O227k158q147n236
13498F7841J698K992m664k64M785o033j0627l039J1254J6511j6091q852M409k676
13484E7244Q329J4859J2299J0885M50J4155K4494K5063J9353K6725J7363J381
13472B32600m321n169j428l0829l4325l3105l4205o656r12p41m981j3189j2324
$$ y = [529594, 540416, 488455, 396120, 300417, 239131, 201969, 170577, 134294, 113858, 101818, 97907, 107599, 96009, 86198, 89642, 92144, 81335, 64572, 63287, 68025, 69488, 79032, 93678, 96745, 87572, 81008, 87363, 92110, 86006, 88647, 101839, 108843, 116649, 131554, 142861, 164187, 196170, 233171, 316712, 412927, 490165, 547997, 572609, 568505, 561803, 525344, 492390, 427836, 338838, 259351, 211213, 180818, 151518, 116124, 90671, 74569, 72202, 74788, 77155, 83382, 81224, 73077, 67841, 69539, 72531, 67867, 67603, 72388, 66355, 55728, 52689, 63943, 80454, 64363, 55511, 59920, 57244, 65573, 80432, 92731, 103616, 104066, 118221, 142715, 167778, 187131, 213856, 231219, 232600, 228279, 223110, 221682, 190853, 156528, 123423, 89218, 82562, 81650, 80909, 75928, 62739, 50415]
13459E0415M541K77j2373n079J0823N870L111m744k905o195p810n662R95L523
13445C4787P885m860r071Q940L695j619K63O5l759L080l277M94l405J167J0805
13430D5190M759j634k256P287J589j0620L774o652p326P698J266j678N860R33
13416D8190O55o976j3383j62J2580J1295j110M325M100K317j3229j2221O157K603
13402D5141m446J387m716p007Q853r28N240l27j3262O888J0471L725r874L790
13388D4935J8411j0891j0291J1525N072j0284L407M94j397k675J4342J4512J577
13375G8737p440J775P109J6567J078k1428k5967m578L828l644J0773M407n75J5837
13361G6479K8538L7763R11k2842j7549k0206O66K667P4J38j6679m004j9478L569
$$ y = [50415, 54956, 55233, 42860, 37781, 48604, 54474, 57585, 52841, 49936, 43741, 35931, 30269, 31264, 34787, 42672, 37812, 28741, 37681, 41376, 39757, 40020, 40085, 36326, 39406, 36129, 36623, 33218, 34385, 45190, 49949, 48315, 46059, 53346, 54935, 44315, 48089, 41437, 34111, 41809, 43075, 41397, 47257, 48190, 48845, 41869, 28486, 28324, 40904, 52199, 51089, 55414, 59514, 61831, 48602, 36381, 42538, 45141, 40695, 42082, 37366, 30359, 39212, 38284, 43524, 43197, 29935, 36823, 47294, 51019, 41145, 44935, 63346, 52455, 42164, 53689, 58761, 48477, 51884, 52378, 50981, 48306, 62648, 77160, 78737, 71297, 73072, 80181, 96748, 97826, 76398, 50431, 45853, 49681, 46037, 56810, 61217, 60642, 76479, 105017, 142780, 143691, 120849, 103300, 83094, 83760, 86427, 86501, 86639, 69960, 65956, 46478, 50047]
13347E0047R749l003o468K212O199J0090Q703P073P511P461J2143p381j8413o204
13333G9719L018m768L342L864J6341o722l938k1875m514J564r435M907M659K4339
13319I0501M041N490P860J3212J2274J6228J921j4433q854p823j2151L199J528
13306A12993j3531n425k813n441L284k249n044l217M336m95J4683J3209O642L932
13292A20864p302p209j1919J0535J6603Q51j7320j106L499j628j1814l670J2547
13279A02931J2076j474J1597J2744P648J5673K4391J4658J1610l637q216m85k817
13266A96699L976q774q988q723O142M692Q764o839n342m930m406M845J435Q697
13252A87248j7063l789N314N745l692O944J0898M295n348j0467M480J6489R594
$$ y = [50047, 59796, 56793, 50325, 52537, 58736, 68826, 77529, 84602, 92113, 99574, 111717, 104336, 85923, 79719, 82737, 77969, 81311, 85175, 101516, 94794, 90856, 68981, 64467, 66031, 56596, 61503, 66162, 90501, 94542, 100032, 107892, 121104, 133378, 149606, 151527, 137094, 128240, 120417, 108266, 111465, 112993, 99462, 94037, 91224, 85783, 89067, 86818, 81774, 78557, 82893, 82398, 97081, 110290, 116932, 120864, 113562, 106353, 94434, 104969, 121572, 122423, 105103, 103997, 107496, 105868, 94054, 90384, 102931, 115007, 113533, 125130, 137874, 145522, 161195, 185586, 200244, 211854, 208217, 200001, 199516, 196699, 200675, 191901, 182913, 174190, 180332, 185024, 193788, 186949, 181607, 176677, 172271, 177116, 178551, 187248, 170185, 166396, 171710, 177455, 173763, 180707, 191605, 195900, 190552, 180085, 184565, 201054, 210648]
13239B10648j042L701P034P17j644L2306K8300O688J6076K6923L1916O454J6320
13226C84397K4910Q040j8277k4901j2710P871N947l596J079J2576K3217K229M297
13213D15079m092J451J4903J6873k61Q404J6288K7462L1177K3735K8781O1305
13201F41105P2522P7932Q3499Q7496P7485M4576K6656J2169o585l8746o7020n0181
13189I60908l3432k6497j0080L054L535J5137L1027L5950L7814J1245J7983P003
13177A053647N890K241L3106M2065L5286M0578P3452R3145P9669R8679J23692
13166A681450J37762J33649J70301K00846K49718K91575L56875M64533N91392
13157D278101P41268R97560J389018J933791K776976M060461N482993N916085
$$ y = [210648, 209606, 213307, 220341, 221058, 219414, 251720, 280020, 286708, 302784, 329707, 361623, 368077, 384397, 409307, 417347, 399070, 374169, 361459, 369330, 375277, 371681, 372760, 385336, 408553, 410782, 415079, 410987, 412438, 427341, 444214, 443953, 452357, 468645, 496107, 527284, 551019, 579800, 641105, 713627, 791559, 875058, 962554, 1040039, 1084615, 1111271, 1123440, 1116855, 1078109, 1011089, 960908, 927476, 900979, 890899, 893953, 897488, 912625, 943652, 979602, 1017416, 1028661, 1046644, 1053647, 1059537, 1061778, 1094884, 1136949, 1172235, 1212813, 1286265, 1379410, 1459079, 1557758, 1681450, 1819212, 1952861, 2123162, 2324008, 2573726, 2865301, 3222176, 3686709, 4278101, 5019369, 6016929, 7405947, 9339738, 12116714, 16177175, 21660168, 27576253]
13149B7576253M272330J625268r9326o21661q97657k085098m308877n163642m181976
13140A6115614k919749k039625j486422j108125q48283o42508m97057m09134l06427
13131E858284k33520j67788r3822m5585j193O7712J26827J63868J96665J98136
13121F069584K35831L15004L76611M38618N45050O88935Q85602J165648J510240
13112A2231123J902161K472347L428380M968091P414841J1172663J5850237J8420178
13104G7860021J4483783N932974p1953j838160k239018m839888j1836164j6357777
13096F1093818j3725034r489633o569840m778138l566780k715791k104330j663321
13088A6480951j356802j098641q61434o58761n08762l83713k50494j48713p7556
$$ y = [27576253, 31848583, 33473851, 33374525, 32752864, 31855207, 29770109, 25461232, 20297590, 16115614, 13195865, 11156240, 9669818, 8561693, 7713410, 7070902, 6573845, 6164711, 5858284, 5624764, 5456976, 5363154, 5317569, 5316376, 5384088, 5510915, 5674783, 5871448, 6069584, 6305415, 6620419, 6997030, 7435648, 7980698, 8669633, 9555235, 10720883, 12231123, 14133284, 16605631, 20034011, 25002102, 32416943, 43589606, 59439843, 77860021, 92343804, 98276778, 98204825, 96366665, 94127647, 89287759, 77451595, 61093818, 47368784, 37879151, 31309311, 26531173, 22964393, 20248602, 18144272, 16480951, 15124149, 14025508, 13164074, 12505313, 11996551, 11612838, 11362344, 11213631, 11136075]
13079A1136075k0871P545J5910J9528O8125J11619J81032K86038M63641O99275
13069A2967917R67816J279546J655830K207538L071463M508336O870171J0525029
13061D4053646J5295552J8506707J5516581P043858L84270j801217k198219m358002
13053I2443176j1008967j6549401j4602582j0229078p043353n091645l812176
13046B4105974k921436k268099j807188j486436j215064r67643p78137o27769
13038A2034202m96607l86571k97657k42092k01927k00351k10253k47569k48467
13029I502708k45057k14834j63067q5664J0229J20680K31947L70182N58910Q35569
13019A0921603J301889K063861L287267M876491N989462N181893K568869L52290
$$ y = [11136075, 11115204, 11122749, 11138659, 11158187, 11226312, 11337931, 11518963, 11805001, 12268642, 12967917, 13935733, 15215279, 16871109, 19078647, 22150110, 26658446, 33528617, 44053646, 59349198, 77855905, 93372486, 100416344, 100800614, 98999397, 96801178, 92443176, 81434209, 64884808, 50282226, 40053148, 33009795, 27918150, 24105974, 21184538, 18916439, 17109251, 15622815, 14407751, 13440108, 12661971, 12034202, 11537595, 11151024, 10853367, 10611275, 10409348, 10208997, 9998744, 9751175, 9502708, 9257651, 9042817, 8879750, 8794086, 8804315, 8924995, 9156942, 9527124, 10086034, 10921603, 12223492, 14287353, 17574620, 22451111, 28440573, 33622466, 36191335, 36543625]
13011C6543625n37526p79206j519472l639360n417820n002219l669993k586944
13003A3391085j884192j407253j081149q55007o90207n62406m60596l96383l18845
12994E735047k51088k02867j90654j67974j78789j51124j39346j54031j77130
12985D122044j84938j84139j75941j71164j60981j25925j20008j33536j24081
12976B741331j04429r0331q6427p8844q8292p7165o2200n6924m8141o0232n9130
12965A929216n9405n6104n8750n4407n4004n9885m6928k9840k6087m8130l9107
12954A396569l1784k2213k3145k4393l1859l4967l7180l6307k9286l9211m3092
12943A043132m4666m1218l3376m7400n6623l1443j2077k5542k5491j1906j1271
$$ y = [36543625, 36006099, 35226893, 33707421, 30068061, 24650241, 19648022, 15978029, 13391085, 11506893, 10099640, 9018491, 8163484, 7473277, 6910871, 6450275, 6053892, 5735047, 5483959, 5281092, 5090438, 4922464, 4743675, 4592551, 4453205, 4299174, 4122044, 3937106, 3752967, 3577026, 3405862, 3244881, 3118956, 2998948, 2865412, 2741331, 2636902, 2546571, 2460144, 2381300, 2293008, 2215843, 2153643, 2096719, 2048578, 1988346, 1929216, 1869811, 1813707, 1754957, 1700550, 1646546, 1586661, 1539733, 1509893, 1483806, 1435676, 1396569, 1364785, 1342572, 1319427, 1295034, 1263175, 1228208, 1191028, 1154721, 1125435, 1086224, 1043132, 998466, 957248, 923872, 876472, 819849, 788406, 776329, 750787, 725296, 713390, 702119]
12932G02119j2970j1005j529M479Q259k2647j6219j982j4387j8914k2610j5435
12920E77159r483k8293k4731k5410j3278k2346j8457k1303k404M798r989j7286
12908C88977j4898M338L098K983j286q173j0095p456j2005L889M327j9126k1566
12895C13007r707k7288k6646j3108k0050N347J8183R902P926J3592M751Q121R205
12882B93235j1987j5164n248j4064r58j312j6446l996J896j0074j6000r363N155
12869A95674J2772n143r905p579l047J4505N723L801N87j0951M283n558N971L043
12855B04176P595j303j6413j3514j2654J4052M413j4994j089n115k8840o506J6102
12842A45910J9124M107j0721R393N825j9824n159R488l349j0884j1887j3868m29
$$ y = [702119, 689149, 678144, 676615, 681094, 689353, 666706, 650487, 648505, 634118, 615204, 592594, 577159, 567676, 539383, 514652, 489242, 475964, 453618, 435161, 413858, 411454, 416252, 406263, 388977, 374079, 378417, 381515, 384498, 383212, 375039, 364944, 357488, 345483, 349372, 353699, 334573, 313007, 303300, 276012, 249366, 236258, 216208, 221555, 239738, 249640, 257566, 271158, 275909, 284030, 293235, 281248, 266084, 260836, 246772, 245814, 244502, 228056, 224060, 225956, 215882, 199882, 190519, 195674, 208446, 203303, 193398, 185819, 182772, 197277, 203000, 206801, 207388, 196437, 200720, 195162, 201133, 204176, 211771, 210468, 194055, 180541, 167887, 181939, 186352, 171358, 170269, 165154, 136314, 129808, 145910, 165034, 169141, 158420, 167813, 173638, 153814, 148655, 158143, 154794, 143910, 132023, 118155, 117726]
12829A17726J3421l241o465O405O087o594j0110k135j822N566M061J392l073J2096
12815A33314p2O469N643l186j298N835L132j6066m1n614l181j923j5260p464m450
12800I5838R529J903j43J3399L436j5659n896M240o245R030j3517j474P112r963
12786I1590j3793R139l059n382O85j0484J734L130j2549k225J441Q471j649j9315
12772D7734o774J2569J5606J1067L856j628M195o422j8431K721K2726l476j0408
12759G3335J619M715M741j4171n213K107J0000R066l703N811m388n915R177j8313
12745F8868j302L939p797k560k546N705m325j0200J1436J4368j3827q299J0941
12732F4401l52j1363l179r581J1079J6868p385q534O282j29J1995k314j1389l375
$$ y = [117726, 131147, 127906, 121441, 127846, 133933, 127339, 117229, 115094, 113272, 118838, 122899, 124291, 121218, 133314, 133242, 139711, 145354, 142168, 140870, 146705, 149837, 133771, 133730, 128116, 124935, 123012, 107752, 100288, 95838, 105367, 107270, 107127, 120526, 123962, 108303, 102407, 106647, 100402, 109432, 95915, 94441, 101553, 91590, 77797, 86936, 83877, 78495, 79180, 68696, 70430, 73560, 61011, 58786, 60227, 68698, 67049, 47734, 40960, 53529, 69135, 80202, 84058, 82430, 86625, 80203, 61772, 64493, 87219, 83743, 73335, 74954, 79669, 84410, 70239, 65026, 67133, 77133, 86199, 82496, 88307, 83919, 78004, 87181, 68868, 67566, 71505, 63708, 61148, 58602, 64307, 59982, 49782, 61218, 75586, 61759, 53460, 64401, 64049, 52686, 49507, 39926, 51005, 67873, 60488, 51954, 58236, 58107, 70102, 67788, 56399, 53024]
12718E3024P810J2864m111q76L040J7122L107p730M566R341Q424l008k1437j5990
12704F6146j4027l192J0074P007q928o726Q163o89j959O721J4621N702K887k381
12690H3419p595R715l459R377J2691K6561J7639J8846K9592K3609L1296M2390
12678B94081K3328K3347R879K2605J4116L1961K8324O5361J07430J47900J41313
12667I09645J26631Q7424M2723J3447l0340o7496j03964j32605j37094j26086
12657E82285q7372o8715n0551m0718j8197k7034l3785k3423j3395k558R921P00
12645B27158M188j1475j703l811J4793K5501K1364M2781N5801P9273Q9204Q4087
12633F27161J5779j2429j2717q618k7346o4990q2714o7643o7170n1611j4516k0066
$$ y = [53024, 60834, 73698, 69587, 68711, 71751, 88873, 91980, 84250, 88816, 98157, 106581, 103573, 82136, 66146, 52119, 48927, 59001, 66008, 57080, 50354, 58517, 57828, 55869, 62590, 77211, 82913, 85800, 83419, 75824, 85539, 82080, 91457, 104148, 130709, 148348, 167194, 196786, 220395, 251691, 294081, 317409, 340756, 350635, 373240, 387356, 419317, 447641, 513002, 620432, 768332, 909645, 1036276, 1123700, 1166423, 1179870, 1149530, 1082034, 978070, 845465, 708371, 582285, 494913, 426198, 375647, 334929, 316732, 289698, 255913, 232490, 219095, 216537, 226458, 227158, 231346, 219871, 218168, 214357, 229150, 254651, 276015, 318796, 374597, 453870, 543074, 627161, 642940, 630511, 617794, 609176, 581830, 516840, 434126, 366483, 299313, 247702, 233186, 213120]
12621B13120j9696j3059j7772j8524j2625J5951M812o106q665n008K383N333J5117
12608A55261o083m22P772j214q186J7679J6119j1488j1738n11O362j963J2341
12595A73929K8337M3327N1500M7099R5113J13503Q4762K9882R495r162m624j1483
12583F51678n1645q7707q1553n5630l6231l1150p682K1556K4636J4239m408J0029
12571C66132J2947J6179K4165M8661P3169Q7039Q4074M7187L3215L3552M2315
12560H68635K5404l5570o8704l9561r345j7496k4706m8658k3450j399J7670J0108
12548F52928L0343N5230O2945O1876M2418J2694O17K4550L7722L1571l814k0000
12536I89080j1986L454R30M339K220Q349L2457N8711P0729R5714J16024J69768
$$ y = [213120, 193424, 180365, 162593, 144069, 131444, 147395, 152207, 146101, 137436, 132428, 134811, 140144, 155261, 149178, 148756, 156528, 155314, 147128, 164807, 180926, 169438, 157700, 157189, 163551, 161588, 173929, 202266, 245593, 297093, 344192, 439305, 552808, 637570, 667452, 676947, 667785, 663161, 651678, 600033, 512326, 430773, 375143, 338912, 307762, 300080, 321636, 346272, 360511, 356103, 366132, 379079, 395258, 419423, 468084, 541253, 628292, 712366, 759553, 792768, 826320, 868635, 894039, 858469, 789765, 750204, 740859, 723363, 698657, 649999, 626549, 625150, 642820, 652928, 683271, 738501, 801446, 863322, 905740, 918434, 919051, 943601, 981323, 1012894, 1009080, 989080, 977094, 980548, 981478, 985817, 988037, 996386, 1028843, 1087554, 1158283, 1253997, 1370021, 1539789]
12524A539789J98239J70308R5676J7340l747p565l8568j17137j93836j53044r8782
12513A408673q0974p8510n9630m8115k7323j2370q708j1317k7405j7352q685l2584
12501I95700m6719m1152k1445J689q822l4531l6357k7941j6684j6663q393j0661
12489G28021o814J2911K5153J2322P505M5022O1068O6368N2671m090m3547n8735
12477H97855l9538l8529o5037r1257p7682o0289m0637k5312k4437k9123l0139
12466C75875k0874l3588k4428j3868n859j3333j0470j0614j3141N154R092j913
12454B42033j4167j2844n402r589j0628j2789l196m717j2671o616n445J244j464
12441A43749r481k1382J715l666N381P622P677n935j1936k522q190j9099j4490
$$ y = [1539789, 1738028, 1908336, 2004012, 2021352, 2017605, 2010040, 1971472, 1854335, 1660499, 1507455, 1408673, 1327699, 1249189, 1189559, 1141444, 1114121, 1101751, 1093043, 1081726, 1054321, 1036969, 1028284, 995700, 948981, 907829, 886384, 888073, 879251, 844720, 808363, 780422, 763738, 747075, 738682, 728021, 721207, 734118, 759271, 771593, 779098, 824120, 885188, 951556, 1004227, 1000137, 956590, 897855, 858317, 819788, 754751, 663494, 585812, 525523, 484886, 459574, 435137, 406014, 375875, 355001, 321413, 296985, 283117, 277258, 263925, 253455, 242841, 229700, 234854, 243946, 242033, 227866, 215022, 209620, 200031, 189403, 176614, 173418, 168701, 156030, 149414, 143969, 145213, 143749, 134268, 112886, 114601, 110935, 116316, 123938, 131615, 125680, 113744, 111222, 103032, 83933, 69443]
12428F9443N646J0547k345l325Q694J2672L138L157N179j399j8329p091q174Q310
12414H6123N698j3038l310Q116o255M082R848q742J133N639N038k309j5148n413
12400G1462j1117M25r72l0J167k489K039m828o730J2047J7131j3989q510o366
12386D9240J142P32L289P736j0223l20J5734J2969J0286K7932J3672M5682M5530
12373B23401M8200L1087Q871r881J683q669l7766n4536l8734m0589l0563r572
12361H2932m330Q213m142n291m666k0019m538j2150J0933j240o280K0956r699
12348E0679o705O866N018k0150n907K02k043Q640K548R419l270r046j0510j8599
12334G142R021k873j2146j528O144k56o450J770Q210j2735R851J3893O494n956
$$ y = [69443, 75089, 85636, 83291, 79966, 88660, 101332, 104470, 107627, 112806, 111407, 93078, 85987, 77813, 86123, 91821, 78783, 75473, 83589, 77334, 81416, 91264, 82522, 83655, 89294, 94332, 92023, 76875, 71462, 60345, 60770, 59798, 59768, 60935, 58446, 60485, 55657, 48927, 60974, 78105, 64116, 55606, 49240, 50382, 51114, 54403, 62139, 51916, 51596, 67330, 80299, 90585, 118517, 132189, 177871, 223401, 271601, 302688, 311559, 301678, 303361, 294692, 256926, 202390, 163656, 123067, 92504, 82932, 78602, 86815, 82673, 77382, 72716, 52697, 48159, 36009, 46942, 45702, 39422, 60378, 50679, 43974, 50840, 55858, 35708, 29801, 30003, 27960, 36600, 39148, 48567, 45297, 36251, 25741, 7142, 16163, 13290, 1144, -384, 5760, 5504, -946, 824, 9034, -3701, 6150, 20043, 26537, 20581]
12320B0581m989j136k193N435J768r027M670l570j58l094n565q021J3793m616
12306C878J309P441j1129rR030M972k877j243L910j2787m576J5476K522r63Q618
12291B3572n632q538j3229j8395Q984m232r615o932J3065K0428p00J9596M371
12278B2743o290q607N375K25R419j092k004j402O948m343j5379J982Q155l570
12264A2160p094q098p361R55J3237M300l657k915N002k834J0076k569J0562J2635
12250C4399M142j2308r349N438p6j1269p926o711r169M983J3961J462n955N485
12236G107P960P123l088o458k516m38M76r417j0108Q810P404p014N022J5855K308
12221B3026j9505k0086q64n198M239L726K4659L252j3828q393Q559P557M691o536
$$ y = [20581, 15592, 14456, 12263, 17698, 19466, 10439, 15109, 11539, 11381, 8287, 2722, -5299, 8494, 3878, 5187, 12628, 1499, 1490, 10520, 15492, 12615, 11372, 15282, 2495, -2081, 13395, 15917, 14954, 23572, 17940, 9402, -3827, -22222, -13238, -17470, -27085, -34017, -20952, -524, -1224, 18372, 22743, 16453, 7846, 13221, 13446, 22865, 21773, 19769, 18367, 25315, 20972, 5593, 7575, 15730, 12160, 5066, -3032, -10393, -9438, 3799, 8099, 4442, 1527, 6529, 3695, 13771, 11202, 21764, 34399, 38541, 26233, 16884, 22322, 22246, 10977, 3051, -3660, -12829, -7846, 6115, 7577, 1622, 7107, 15067, 22190, 19102, 12644, 10128, 9690, 10166, 749, -9359, -549, 6855, -159, 4863, 20718, 23026, 3521, -16565, -17429, -22627, -18388, -14662, 9997, 13249, -579, -8972, -413, 7144, 11835, 5299]
12207E299R782j1776n601M133P08O048R26n319p367J2414p979k2575r832J4759
12193a6380J9447l885j1660O511J1856J3142m068P503K09q411j056N256J3757
12180C2221R918m02J318q101j3291p447M170p838J95j671K501M498K772M981L403
12165B7227k114J1566J2813R980q496j0020o899n508r363j802q371n94p571J3329
12151A4177m381q66J9798Q402k4220j598M082K564K1211K1138k883k1350K787
12138C8861J5680J2334M556p24o85m82o436J7314J2232p687N403K7674O1554N9999
12124B39593N5546M9394L7073R314m127j2013k6826k5969m7886n2963l9417l2090
12112A49629j7825j6399o671j171j1142L129r802M77L979P310k36n604J3920J1907
$$ y = [5299, 15081, 3305, -2296, 1837, 2545, 8593, 9519, 4200, -3167, 9247, 1268, -21307, -31139, -16380, 3067, -818, -12478, -5967, 5889, 19031, 14963, 22466, 22675, 14264, 13208, 18464, 32221, 42139, 41737, 43055, 34954, 21663, 14216, 18386, 10548, 10743, 9072, 11573, 16071, 18843, 23824, 27227, 25113, 36679, 49492, 59472, 50976, 40956, 34057, 28549, 19186, 17384, 9013, 8419, 848, 14177, 9796, 8930, 28728, 37130, 12910, 11312, 15394, 17958, 39169, 60307, 57424, 36074, 38861, 54541, 66875, 71431, 70707, 70022, 69540, 63104, 80418, 92650, 84963, 90366, 118040, 179594, 239593, 295139, 344533, 381606, 390920, 386793, 374780, 347954, 321985, 274099, 221136, 181719, 149629, 131804, 115405, 108734, 107563, 96421, 99550, 89748, 90225, 94204, 101514, 101278, 95674, 109594, 121501]
12098A21501M902J7381J1456L024N112J226J2360J0611J6541Q608j3177J8988
12086B18533K8114L0798M8989Q3833J40727J59600J66340J38181R9964O5487K6101
12075A206667p718l0626q9946j45132j33638q8606o9020o2508k9744q837p32j1719
12063E28441k8785k4971j9909k6386j9717k0624m5280l5308j1935J0038N561l197
12051C07928r430r734j4183j661o09O641L286K8521L1099L6828L5576M1256R0127
12038E45645J51795K01635K31891K12203J43964N4312K8818j4167n2074r5045
12028A408977j36710j25438p7669n0513l8425m6930o4984p1682n9857m0526p1834
12017F24409r8223p1507m3328l3074m3274j1838J0843o626k8177p204k6500j5334
$$ y = [121501, 126403, 143784, 155240, 158264, 163376, 164602, 176962, 187573, 204114, 212722, 199545, 218533, 246647, 277445, 326434, 410267, 550994, 710594, 876934, 1015115, 1115079, 1180566, 1206667, 1198949, 1168323, 1078377, 933245, 799607, 711001, 641981, 579473, 549729, 540892, 540160, 528441, 499656, 474685, 454776, 428390, 408673, 388049, 342769, 307461, 295526, 305564, 311125, 307928, 298498, 288764, 274581, 272920, 272311, 278952, 282238, 310759, 341858, 378686, 414262, 455518, 545645, 697440, 899075, 1130966, 1343169, 1487133, 1541445, 1570263, 1556096, 1504022, 1408977, 1272267, 1146829, 1069160, 1018647, 980222, 933292, 868308, 796626, 736769, 696243, 624409, 526186, 454679, 411351, 378277, 335003, 323165, 334008, 327382, 299205, 292001, 265501, 250167]
12005B50167l406L102l933O215K603R53K2110K0806K9045N2221O1012N2387M5852
11992E39134O7209P2776L9570J4934Q915n895j1762p471l0054n0688n2264l7113
11980E47291l5264l8830n2463n0110m1545k0463n558k1095j4101j382o48J1296
11968B77128r284l986p189m009l493L956J136j28j4377j2710j8081j8859j6927
11955A73177j3059j013r246J257L106j0137L387O28N85J770M916L512n695j304
11941A51884J7709Q043p384l448j890o940j3603J2160N687p992n430p826q460
11928A32510j325j2048j4792J30k121j427m606K442m530n439P497j1583j0872
11915G3836J856n184k1439q317J501K44o072M835O401l895j462k826j45j8104
$$ y = [250167, 246761, 249863, 245930, 252145, 254748, 255701, 277811, 298617, 327662, 379883, 440895, 493282, 539134, 606343, 679119, 718689, 733623, 742538, 736643, 724881, 717410, 687356, 636668, 584404, 547291, 512027, 473197, 420734, 370624, 329079, 308616, 303058, 281963, 267862, 266480, 265832, 277128, 267844, 263858, 256669, 252660, 249167, 253123, 254259, 254131, 239754, 227044, 208963, 190104, 173177, 160118, 159105, 149859, 151116, 154222, 144085, 147472, 148100, 148685, 150455, 155371, 158883, 153188, 151884, 169593, 177636, 170252, 166804, 164914, 157974, 144371, 156531, 162218, 154226, 148796, 140970, 132510, 131185, 119137, 104345, 104475, 102354, 100927, 96321, 98763, 94233, 88794, 96291, 84708, 73836, 75692, 70508, 49069, 40752, 42253, 42497, 36425, 41260, 47661, 43766, 42304, 39478, 39333, 21229]
11901B1229j0637J5655P813q851j3719N236J895j0698L843o493K542K55j1407
11888c337P367J0215k013N303q276l374J6454n35n097r376j336p648n420o256
11874a3329J652p126J0783J2347R94q652J907M379k243j22L905L58j5884p693
11860a8724P350m071J649J2317J0924K904P60j568L4j0416M57J6336m401n584
11846G967Q386J4O100j640K777k671l68J0218J3529o883p281p23P187r008k4289
11831C315j863Q262k407j4739q688j0330R26M921N585N485l026N82J9206o313
11817I16r125J7546r063l311N6L584J3296j7246p882q1l979M336o133j014J8802
11802G02L758k0248L629J410q547O351J0956J0207m150P229P865p104l204k0314
$$ y = [21229, 10592, 26247, 34060, 25209, 11490, 16726, 18621, 7923, 11766, 5273, 7815, 8070, -3337, 4030, 14245, 12232, 17535, 9259, 5885, 22339, 21804, 16707, 7331, 5995, -1653, -7073, -13329, -11677, -18803, -8020, 4327, 5321, -3331, -1424, 2955, 712, 590, 4495, 4853, -11031, -18724, -11374, -15445, -13796, -1479, 9445, 12349, 13109, 11541, 11575, 1159, 1616, 17952, 13551, 7967, 16353, 16367, 22467, 20827, 23604, 20933, 20565, 30783, 44312, 37429, 30148, 29425, 36612, 27604, 3315, 1452, 9714, 7307, -7432, -16120, -26450, -25524, -20603, -15018, -9533, -12559, -11977, 7229, 916, -8209, 9337, 274, -3037, -2981, 603, 13899, -3347, -11229, -11310, -15289, -10953, -17086, -18100, 702, 4460, -15788, -12159, -10749, -19296, -12945, -1989, 8218, 4068, 11297, 19162, 12058, 8854, -11460]
11788a1460r497L390l931O936N929R684J2375r626o473k490m913J195N775n285
11774h391M013j12K406j810n699O6J932Q668J2130j484Q13J086m954L143l992
11759G815p726j0334j1991m87K3412N732j304L377n223j586P149K743m826r278
11745b527m228M593o495J331k194J152N620o62M728K161r07q565j5019k754m98
11730b4264P099P030m348j1429K168Q144J0330P56p111q440m480J6707O421K916
11716A499L789N39j6696k331J0665l359N102l622k010J995k523o613m754M817
11702a3502K1019Q745j1914j1612m706q692o935J6334M876J5852L519p724l454
11689A806j1696n970K544N151j1542M735K336n95J2501m075j230R491L423J3767
$$ y = [-11460, -20957, -17567, -21498, -14562, -8633, 1051, 13426, 3800, -2673, -5163, -10076, -8881, -3106, -8391, -4378, -4490, -2084, -3894, -9593, -9527, -7595, 1073, 13203, 11719, 12532, 13618, 8664, 11807, 7815, 89, -10245, -22236, -22723, 689, 6421, 5117, 8494, 3271, 1685, 8834, 11577, 6751, -2527, -6755, -2162, -8657, -7326, -9520, -8368, -2748, -3410, 1318, 3479, 2572, -5993, -21012, -23766, -24264, -17165, -10135, -14483, -25912, -23744, -15600, -5270, -4514, -11625, -20065, -24545, -7838, -1417, 1499, 5288, 5827, -10869, -13200, -2535, -5894, -792, -4414, -6424, -4429, -6952, -13565, -18319, -13502, 7517, 16262, 4348, -7264, -11970, -20662, -27597, -11263, -6387, 9465, 12984, 5260, 1806, -9890, -15860, -13316, -8165, -19707, -14972, -12636, -13231, -730, -4805, -6035, 3456, 6879, 20646]
11675B0646J756j2713j7512J111J3539p862m937Q708P726p285r538L154K1809
11662A8602k245j7871l810Q9n525r811k175N342K347m357n0p568j0509O25J044
11647c5872J2274J1457J0453O421l837n557j285q063k172J6640l387o40l740r949
11633a7257K554P857J1884j779o823j227l356Q496J2199J4407k4087m007R220
11620H081r948r345p71J2506j419O958R103j3419m912K26l943M908J172k787q46
11605d436l997m140k39K570p19o309k592m370j951j254N245L715R186J021j0339
11590a8609J54j4928j0577J2987K4729N184O584J5418M358k3829j0941K719l233
11577i984r107o687J6403N781k474k620j4525k0288R275K7266N731p917q829Q624
$$ y = [20646, 22402, 9689, -7823, -6712, 6827, -1035, -5972, 2736, 10462, 3177, -6361, -3207, 18602, 16357, -1514, -5324, -5235, -10760, -20571, -22746, -17404, -15057, -19414, -19464, -27032, -37541, -36916, -35872, -23598, -12141, -1688, 4733, 896, -4661, -5946, -14009, -16181, 459, -2928, -3568, -7308, -17257, -14703, -6846, 5038, 3259, -3564, -4791, -8147, 349, 12548, 26955, 2868, -1139, 8081, -1867, -11212, -11983, 523, -896, 6062, 15165, 1746, -3166, -2940, -6883, -1975, -803, -3590, -4436, -8433, -12573, -12812, -10242, -10961, -17270, -19862, -24232, -26183, -27437, -22192, -18477, -9291, -8270, -18609, -18455, -33383, -43960, -30973, -6244, -1060, 5524, 20942, 25300, 1471, -9470, -6751, -9984, -19091, -25778, -9375, -3594, -6068, -8688, -23213, -43501, -34226, -6960, -1229, -9146, -17975, -9351]
11563i351M885j2105j1319j874l984J3807J2870q318j0318N242J6624o691j4093
11550b4625o418L757n863k052J1337J6177p072j6446k988K5476J2908q546l153
11537g508m388p585n850K0535N088o415O273R35r622J5674J0234j492j3936r111
11523g168j0862J088k209K527n254J3608P16o998J9688J8337k308j0433j1702
11510i70p111m457n680M953j954n398J771N473r823j0557O402K439J76j029M502
11495b1263p20J3354J232L862J616m302J485j496o060j2096l830N004M688o133
11481b4659J795J7846O962j9639j9795J737K4425K771j0018j452p454m315j970
11468c3766Q947o090l946O806L018o94l736N827K2409L263p964j4238k064R845
$$ y = [-9351, -4466, -16571, -27890, -29764, -33748, -19941, -7071, -15389, -25707, -20465, -3841, -10532, -24625, -31043, -27286, -33149, -35201, -23864, -7687, -14759, -31205, -34193, -8717, 4191, -4355, -7508, -11896, -19481, -25331, -4796, 292, -6123, 150, 1085, -8537, 7137, 17371, 15879, 1943, -7168, -18030, -16942, -19151, -16624, -21878, -8270, -7554, -14552, 5136, 23473, 21165, 10732, -970, -8081, -12538, -18218, -13265, -15219, -20617, -18846, -13373, -23196, -33753, -27351, -24912, -24736, -25765, -21263, -21983, -8629, -7397, -3535, -1919, -6221, -4736, -6232, -12292, -24388, -28218, -23214, -18526, -24659, -22864, -5018, 1944, -17695, -37490, -35753, -11328, -8557, -18575, -20027, -27481, -31796, -33766, -24819, -30909, -34855, -28049, -25031, -25725, -29461, -23634, -1225, 2038, -5926, -20164, -22228, -12383]
11454a2383q224j424j0809M309L922q95n966l398O672l150J0898p287j0956R149
11440b9542J9121N469j178o281R253K733o252p108q762n73N331K179N773N586
11426d251M928N203k904L958q438q849k686o278N801J1092n648j7623K169P08
11412b2818J9152R953l859j398J1241R68j404q169J277o885n72J3589N01k489
11398I087M079j9238o206J0796K373o779Q629N855J916J274m282L482j0319j3161
11384a2494n384j058N893p291j0316l71R718J5088M514j1880r393J2142R160K449
11370G77j734J3406o343q416m976j1256Q72n647J6437Q764K584l629k3o223o858
11355a2265J1732m812j4999j4008R962P87N407J6646M953K117j4643J569J3019
$$ y = [-12383, -20607, -22031, -32840, -28531, -24609, -25504, -31470, -34868, -28196, -31346, -20448, -27735, -38691, -29542, -10421, -4952, -6130, -12411, -3158, -425, -6677, -13785, -22547, -23120, -17789, -15610, -9837, -4251, 677, 5880, 2976, 6934, -1504, -10353, -13039, -19317, -13516, -2424, -8072, -25695, -23526, -22818, -3666, 6287, 2428, 1030, 12271, 13239, 11835, 3666, 4943, -1942, -2514, 11075, 11576, 9087, 13166, -6072, -12278, -1482, 891, -5888, 2741, 8596, 10512, 11786, 7504, 10986, 667, -12494, -17878, -18936, -13043, -20334, -30650, -31021, -21303, -6215, -1701, -13581, -22974, -10832, -1672, 777, -957, 12449, 6106, -2310, -7286, -18542, -17670, -23317, -6880, 1884, 4468, 839, 816, -5407, -12265, -533, -5345, -20344, -34352, -24390, -23603, -18196, -1550, 3403, 5520, -9123, -7554, 5465]
11342E465j392k4075q119K874O416l052p675q803j690J2176P813p850Q322Q447
11328a1143K075L646J313K025p582O38L425O140J0089K620j4526k4148J2428J3293
11314B93J039k139j7666j1609l451P937J0945p462m297R644m918Q29J6221R231
11300D597j304P21M066o031l848p864n756j592M486j5499m766N388m647P685J3980
11285a0384l259q421Q809J8331N910q816j1814J3371R503j035p552p569k3471
11272b6397r151K173N904J4603K109L963Q855Q155m605q994J292R317k476l888
11258H60o714M77J305o75K448k413N165j937l129P818P504R13j4218j3386k936
11243a8918q07l54J3062O05k205K216J5254l682J4934P53k1945J1673J4504j2717
$$ y = [5465, 4073, -20002, -28121, -25247, -18831, -21883, -29558, -38361, -40051, -27875, -20062, -27912, -19590, -11143, -9068, -5422, -4109, -2084, -9666, -9028, -5603, 537, 10626, 13246, -1280, -25428, -13000, 293, 1332, -807, -18473, -30082, -33533, -25596, -14651, -22113, -26410, -16766, -21684, -20855, -4634, 4597, 3293, 4014, 8080, 2049, -1799, -9663, -15419, -17011, -12525, -28024, -32790, -27402, -32049, -24364, -10384, -13643, -22064, -13255, 5076, 10986, 2170, -9644, 3727, 13230, 12195, 4643, -2926, -26397, -35548, -33375, -27471, -12868, -10759, -6796, 2059, 10214, 5609, -3385, -2093, 7224, 4748, 860, -5854, -5377, -4072, -4747, -2299, -4712, 453, -1484, -4613, 3205, 10709, 11622, -2596, -15982, -18918, -19725, -20079, -7017, -6412, -8617, -6401, 8853, 5171, 20105, 20858, -1087, 10586, 25090, 12373]
11229A2373m620j52L039K016j5279j0616j091J495K126L701M71Q31N143j2578
11215a3141J0362J9732l170j0688j642R507r759L855k705j3451M681J245k492
11202g666l696K019N953j83J007K974q941J0158j809r717j696K97o315L038K4369
11187I792l138m702m549k0150M72J6J1099j4732N346O38J438o555K6L716J5138
11172f145N485N838m976l070K65m161j1900j598Q47k60J7111o58R062L108o241
11157B707q413m401p378n161N610M17K834L91m429n022R94J5815j769l121J1487
11142E61K826j6246J2471m193o267m587O717P447j0787q861o88O989p813n558
11128b7989J0420J1054N390j962N978j461j0951o4l662N807j821o158J2391J414
$$ y = [12373, 7753, 7601, 10640, 12656, -2623, -13239, -14330, -12835, -10709, -7008, -6537, -5706, -563, -13141, -2779, 16953, 13783, 3095, 1453, 10960, 1201, 5056, 2351, -11100, -6419, -5174, -7666, -11362, -9343, -3390, -3573, -2566, 408, -8533, 1625, -184, -9901, -11597, -11300, -17615, -14577, 9792, 6654, 1952, -2597, -22747, -22275, -22259, -11160, -25892, -20546, -19908, -18470, -25025, -24999, -21283, -6145, -660, 5178, 202, -2868, -2603, -6764, -18664, -20262, -19415, -19675, -2564, -3222, 5840, 8948, 2707, -5706, -10107, -17485, -22646, -17036, -16619, -13785, -13394, -17823, -22845, -21851, -6036, -7805, -10926, 561, 3387, -12859, -388, -4581, -10848, -15435, -8718, -1271, -12058, -20919, -21607, -14618, -22431, -27989, -17569, -6515, -1125, -3087, 2891, 1430, -9521, -9585, -13247, -7440, -9261, -15419, -3028, -1614]
11114a614o115r63q72o362o588L791Q174j1484K613K1687L888o475n102P47l970
11099h645o406j0536j1334J5401p74J0057M979j8624k860J746n347j492J2620
11086b1215O073j364j3025J689O055K178J0241J4547J5314k142j2706K351m577
11073C419n406m612q580k68n13L86m256j281p9O954L070j4829j2923R125O347
11058b3446l571j156J1398J3505J19N099j968j0324j6521j039k022K444J0532
11045a6950j802q554O939K133J3921P159o949l16Q812L049o356m406j321N386
11031G45L841Q426p165r684M18Q431o558k43q097k2389j7597p076J2000J2235
11017c2713q072J559J1045J2256P754l155j6493m486K176O050O842O531K641j474
$$ y = [-1614, -7729, -8692, -9564, -15926, -22514, -18723, -10549, -22033, -19420, 2267, 6155, -320, -5422, -4675, -8645, -15051, -25587, -36921, -21520, -22294, -12237, -7258, -25882, -28742, -26996, -32343, -33835, -21215, -15142, -16506, -29531, -27842, -21787, -19609, -9368, 5179, 20493, 18351, 5645, 7996, 3419, -1987, -6599, -15179, -15447, -15960, -15574, -19830, -21111, -21190, -14236, -11166, -25995, -38918, -29793, -23446, -27017, -28173, -16775, -3270, -3151, 1948, -20, -10344, -26865, -27904, -29926, -27482, -16950, -18752, -27306, -20367, -18234, -4313, 2846, -4103, -4419, 4393, 7442, 1086, -3320, -4641, 745, 4586, 13012, 5847, -3837, -3419, 5012, -1546, -1789, -9886, -32275, -49872, -56948, -44948, -32713, -40785, -39226, -28181, -15925, -8171, -11326, -27819, -32305, -30129, -24079, -17237, -10706, -8065, -9539]
11003i539j8112j7320O87J2868O591Q407q598j5862J3312P111r506m596J647J2122
10989b0788q068R71P198N800N907q286j7085N140J1208L786L755N866N583o287
10975e300p279p457Q825q441k978j559j208R898o123q779r425j46J3188P142Q78
10960a8764k571O003k265J1554l072L771J048J2252N518q429k3488j3240J0047
10947b1636Q839n189r03R964J0524J72p038j7221R418M055N35K970m006j6922
10933b6438J2252J1730O857J204L49p893l406N794p506Q57j1611M756p642j240
10919b1937J8701K985q883k903Q407L003q355o240p300o28N766N176l190O016
10905i382J500o991L422M353n006p935L04Q373L728j101R82N878o275j0798o276
$$ y = [-9539, -27651, -44971, -44284, -31416, -24825, -16418, -25016, -40878, -27566, -20455, -29961, -34557, -32910, -20788, -28856, -27885, -20687, -14887, -8980, -17266, -34351, -29211, -18003, -14217, -10462, -4596, 987, -5300, -12579, -20036, -11211, -19652, -22630, -24189, -25397, -15499, -21622, -30401, -39826, -39972, -26784, -19642, -18764, -21335, -15332, -17597, -6043, -9115, -5344, -4296, 7956, 13474, 5045, -18443, -31683, -21636, -12797, -17986, -18889, -8925, 1599, 1771, -5267, -22488, -13070, -9015, -8480, -5510, -9516, -26438, -14186, -2456, 4401, 5605, 5954, -1939, -5345, 449, -7057, -6200, -17811, -13055, -20697, -21937, -3236, -251, -9134, -12037, -3630, -627, -8982, -15222, -22522, -23150, -17384, -12208, -15398, -9382, -7882, -14873, -11451, -7098, -12104, -20039, -19735, -11362, -7634, -8735, -7753, -1875, -8150, -18948, -25224]
10890b5224P817R528J782n130L057j0288j2049k6R595R898Q285K26n994j1043
10876a9566j8022j3093J3100J2171J6389R666o865M520j299M428j2337j5082M815
10863b1175O870m084L461N938J2670J341l369p202q395q20n454K587j415M584
10849a4463O581n92j734j107M819J3611R148K909L490o459j2745k017r96M771
10835E216k032j3329n508l975P428M250K103j012M917q02j7994k2366j889J4746
10821c0247J2671O832m139K561k017n619R568J329N767O253j1083j1565j753O359
10807a5083J0877J990j4393Q09J6766Q143j2157L573p52J5848n321J294m45L85
10793A1534L706j633j2045K60J8797o026p138k584o333j1985m425J2112J8184
$$ y = [-25224, -17407, -7879, -6097, -11227, -8170, -18458, -30507, -30533, -20938, -11040, -2755, -2529, -8523, -19566, -37588, -50681, -37581, -25410, -9021, 645, -6220, -1700, -2999, 1429, -10908, -25990, -21175, -14305, -18389, -14928, -8990, 3680, 5021, 1652, -5550, -13945, -14765, -20219, -17632, -19047, -14463, -7882, -8474, -10208, -11315, -6496, 7115, 16263, 19172, 22662, 16203, 3458, 1441, 445, 5216, 3184, -10145, -15653, -19628, -12200, -7950, -5847, -6859, -1942, -2744, -20738, -43104, -44993, -30247, -17576, -10744, -14883, -12322, -14339, -19958, -10390, -9061, -3294, 2959, -8124, -19689, -21442, -15083, -4206, -2216, -16609, -15800, 966, 9109, -3048, 525, -227, 15621, 10300, 11594, 11149, 11534, 15240, 13607, 1562, 1822, 20619, 14593, 7455, 4871, -1462, -13447, -17872, -5760, 12424]
10780A2424J3674N029j3524o808J4305N818o039j8056q485k192R994N798O567
10767A8505O061K885N030J4029L729O494l327J4393P261N444J9400J4132j157
10754A12879r206M268M935j3296j0728r033o747o455l644j2257l412K737l212
10741D6829j1929p138j0319n132J2590M965J547m338j847j5940q513M98J212o751
10727d266J0027P600J480P848J1677K917J4723J8262J9668K0778Q983J2523K2557
10714A54777K0249P936K3950K0750o68j0192j834J76j8477q664r356k2368j0090
10701A46189q833j7045j4471j4098j6808n825J157j0783m178l407n300p831M284
10688D3051q536r306K714O000l942q012O305J1347M097N145N009J0528K6954K4249
$$ y = [12424, 26098, 31127, 17603, 10795, 25100, 30918, 24879, 6823, -1662, -3854, 6140, 11938, 18505, 24566, 27451, 32481, 46510, 50239, 56733, 53406, 67799, 75060, 80504, 99904, 114036, 112879, 103673, 107941, 112876, 99580, 88852, 79819, 73072, 66617, 62973, 50716, 47304, 50041, 46829, 34900, 27762, 17443, 12311, 24901, 29866, 31413, 27075, 25228, 9288, 775, 1273, 2485, -4266, 5761, 13361, 14841, 22689, 34366, 37283, 52006, 70268, 89936, 110714, 119697, 132220, 154777, 175026, 182962, 206912, 227662, 226994, 216802, 214968, 215144, 196667, 188003, 178647, 156279, 146189, 137356, 120311, 105840, 91742, 74934, 69109, 70266, 59483, 55305, 51898, 46598, 38767, 43051, 34515, 25209, 27923, 33923, 29981, 21969, 28274, 39621, 43718, 48863, 53872, 64400, 91354, 115603]
10674A15603J5679J8311J1423K0882J1752L1121J5536j850p131J850M781j158
10662B36799q512j6502k3493r530j9413k3123j2956j1671j5309j0251K211p259
10650H0991k1910j0168k3565r659J0073J6851P880j5453l949o921j6323M924n950
10637F821J1079J1269J3962J298J3983O667n911J835J2372J4755K348J6915R507
10624A16900j958L682N143J4899L744j1512j2662j7854l804J2583j0958j8664
10612G9539j1304k963o473j6167n25q737r858m397O377J0521O858J3904N725l326
10598E9174j2697j1394n301j8349K56J3753L15k143q43n541O17L61r451R245J5681
10583C3683o684m715K862P727n158J4201J2705J591r58k198R115k0922j8165n205
$$ y = [115603, 131282, 149593, 161016, 181898, 193650, 224771, 240307, 238457, 231326, 233176, 237957, 236799, 228287, 211785, 188292, 178762, 159349, 136226, 123270, 111599, 96290, 86039, 88250, 80991, 59081, 48913, 25348, 15689, 25762, 42613, 50493, 35040, 31091, 24170, 7847, 12771, 6821, 17900, 29169, 43131, 44429, 58412, 65079, 59168, 61003, 73375, 88130, 90478, 107393, 116900, 114942, 118624, 123767, 138666, 142410, 130898, 118236, 100382, 96578, 109161, 98203, 79539, 68235, 65272, 58799, 42632, 42107, 33370, 23512, 19115, 25492, 36013, 42871, 56775, 62500, 59174, 46477, 35083, 29782, 11433, 11689, 25442, 25757, 23614, 22771, 17230, 17847, 18208, 8757, 18002, 33683, 26999, 22284, 25146, 32873, 27715, 41916, 54621, 56212, 55254, 53056, 62171, 41249, 23084, 17879]
10569A7879n259j1719o992k99J0837J7567n197j0552r456m472k849k873n533j310
10555b0228J2581J327p681N81j12K319J2092J3j928L479n869p768M481j7572M691
10540a9594L741O771k29N781K477K449M21Q566K014p345k470j050j2557k754n341
10525a9120j01J2315P563Q93p342J1648L736p215J14J0739j1159n829m901p420
10511a6079q29j1048j421K373N971J3792P86p810p83P933p628J5150J3473p367
10497F513j7258J2928K051J0739n311o747r850L88j0823r21J2046M942n267L751
10483b819L558j0834j4062J6860K3942J0352n300j3909j105r217Q59K715o9o991
10469f020L009n497q222Q830m307o183k390P273l924r276N826O4p165Q00L620
$$ y = [17879, 12620, 901, -6091, -6390, 4447, 22014, 16817, 6265, -3191, -7663, -10512, -13385, -18918, -20228, -7647, -6320, -14001, -13420, -13532, -11213, 879, 892, -1036, 2443, -3426, -11194, -6713, -24285, -19594, -15853, -9082, -9311, -3530, -1053, 1396, 1817, 10383, 12397, 5052, 2582, 1532, -11025, -13779, -19120, -19221, -6906, 657, 1550, -5792, 5856, 9592, 2377, 2491, 13230, 2071, -3758, -8659, -16079, -16908, -27956, -29377, -27004, -21033, -7241, -6455, -14265, -15048, -7115, -14743, 407, 13880, 6513, -10745, 2183, 4234, 14973, 9662, 2915, -6935, -6547, -17370, -18291, -6245, -1303, -6570, -2819, 739, -10095, -24157, -7297, 16645, 26997, 21697, 7788, 6683, -2534, -1675, 1040, 971, -6020, -3011, -8508, -16730, -7900, -12207, -18390, -20780, -13507, -17431, -26707, -20881, -20817, -27982, -27182, -23562]
10454b3562J1650Q844r035n698J659R314q59J666Q261j5687m022P950J0638k903
10440a784j473K510o899j0161n864J0771Q228P941K50J1788K195N469q512k0102
10426e643K785L336k255m55R679K325j0929m168K338Q575k291j1702J24J5413
10412G132j1233j884P043P00k505k973j6904P21N657j1002Q353J7015J183o24
10398F79n2R898j992q916M629m279k361k439j656j2476m360K747R926J5281Q88
10383E517m845n968N722R724M100j1133j3269j1623K0411R368j0416q426l565
10370a4403n239J1257O401r906n127K625P065j903l924k897O507J5390Q869J4163
10356B8878r692j1745j664N866N75K674n008k1898O663J868j595k420j3481r927
$$ y = [-23562, -11912, -3068, -12103, -17801, -16142, -6828, -7687, -6021, 2240, -13447, -17469, -9519, 1119, -1784, -3257, -747, -7646, -17807, -23671, -12900, -4672, 3269, 3519, 15307, 17502, 22971, 14459, -5643, -2858, 478, -1777, -2232, 7447, 9772, -1157, -5325, -2987, 5588, 3297, -8405, -8281, 7132, -4101, -5985, 1058, 1758, -747, -3720, -20624, -19903, -14246, -25248, -16895, 120, 1303, 679, 627, 10525, 8533, -383, 4246, -33, -2394, -4833, -6489, -18965, -23325, -20578, -10652, 4629, 5517, 672, -5296, 426, 10150, 14250, 3117, -10152, -21775, -1364, 8004, -2412, -10838, -14403, -19642, -8385, -1984, -11890, -17017, -14392, -7327, -9230, -13154, -16051, -9544, 5846, 14715, 28878, 19186, 7441, 5777, 11643, 12218, 14892, 9884, -12014, -5351, -3483, -5078, -7498, -20979, -30906]
10342c0906J4841J1164P033N459q611l865R386k260j700R392R757j5715J787m345
10328A417n216n552k843L221R089J1782l024p365o554M629R994q981K8J6909J8353
10313C5887j1217r892M638j0342P197o220o152J826o613K216m737K912J0642J673
10299A1818j0586k454J0036j342J346L847n020l502j3348J4738J3577k32j4305
10286D573L913L956K0194L182j3125J4508N695j2404n900P67O59j1386n981J4127
10272B2778N288j363K902K912p13l730j9869j0453k739k714o546R98J5895J2688
10258A5334L523l109N126p694j3413Q133O694p869n022J7268j1512j2516R765
10245D708R207O565j3379j5498M054K0768n123K552P485r945j555l813m880K038
$$ y = [-30906, -16065, -4901, 2132, 7591, -1020, -4885, 4501, 2241, 541, 9933, 19690, 3975, 5762, 1417, -3799, -9351, -12194, -8973, 116, 11898, 8874, 1509, -5045, -416, 9578, 597, 625, 17534, 35887, 24670, 14778, 19416, 9074, 16271, 10051, 3899, 5725, -888, 1328, -3409, -497, 10145, 11818, 1232, -1222, 8814, 7472, 8818, 12665, 7645, 4143, -9205, 5533, 19110, 18878, 4573, 8486, 12442, 32636, 35818, 22693, 37201, 42896, 30492, 24592, 25359, 26018, 14632, 8651, 22778, 28066, 26703, 29605, 32517, 31804, 28074, 8205, -2248, -4987, -7701, -14247, -13249, 2646, 15334, 18857, 15748, 20874, 13180, -233, 7900, 14594, 6725, 1703, 18971, 7459, -5057, 4708, 13915, 20480, 7101, -8397, -4343, 16425, 11302, 13854, 21339, 11394, 9839, 6026, 1146, 3184]
10231C184Q0o597J447J0272m733l728o175r391o712N609M732J8384J4970K265
10217B3607j2727P766J443l540o565n990n444L44p709j763l390N713J6092Q890
10203A6727Q205P641j240j7673m888L747l659p050l401K044O035r280L450M557
10189E215N425J165j7925j0528j1383n490J0420N013k401N043J6811Q221k186
10176G400J1980J1704P425j9117j1059r88R056P975j930j4462k859m382j0109
10163i366N897K11j814J36N492n836m98N668K367R350m18l207q861j370P260O25
10147E636L802J5645n207j2634J559k38m46j3711r24J2853N220j270o176o35Q634
10132A2108R680N426p535n108n818o563K4r647l153M434J4594q301q410Q03K665
$$ y = [3184, 3264, -3333, -1886, 8386, 3653, -75, -6250, -15641, -22353, -16744, -12012, 6372, 21342, 23607, 10880, 18646, 20089, 16549, 9984, 3994, -1450, -1106, -8815, -10578, -13968, -8255, 7837, 16727, 24932, 32573, 31333, 13660, 8772, 12519, 8860, 1810, -1591, 453, 6488, -2792, 658, 5215, 10640, 11805, -6120, -16648, -28031, -33521, -23101, -18088, -20489, -15446, 1365, 9586, 7400, 19380, 31084, 38509, 19392, 8333, 7345, 16401, 24376, 22446, 7984, 5125, 743, -9366, -3469, -3258, -5072, -4936, 556, -5280, -5778, -110, 2257, 11607, 11189, 7982, -879, -2249, 5011, 5636, 9438, 25083, 19876, 7242, 8801, 8563, 8117, -5594, -6518, 6335, 11555, 10285, 4109, 3474, 12108, 21788, 27214, 19679, 14571, 8753, 2190, 2214, -7433, -10586, -6152, 8442, 141, -8269, -7466, -4801]
10117d801O485P154N051l153J084l954K647j946P676l20o538j4001q791k992J2655
10102c744P680N959L631l056L907k38M524p601o83n417K20k727o412o07O177J3002
10086A4615j496n436l531K179j532M86J622J0189J0695j352n484j4173j1945O30
10072d533m273k53o680O318K1975J0717O376k931r693m549r45j961R455j804j0180
10057G039m282M130K357r704o542O507L345J1613j125p988m542K361J0181M291
10043A7641K274R80R260m244n160P476R601J4205P881J6074J8229K5554J3709
10030A33480p251j3295J840N120k2596l2309j9454m176L364j7192q458r09N715
10017B3879N183n865r220r611L798K0529O988M696M444R7K360j0397j990q384
$$ y = [-4801, 1684, 8838, 13889, 10736, 11820, 7866, 10513, 8567, 16243, 15923, 9385, -4616, -13407, -16399, -3744, 3936, 9895, 13526, 10470, 14377, 14139, 18663, 11062, 10379, 4962, 5182, 2455, -3957, -4564, 1613, 14615, 13119, 7683, 4152, 6331, 4799, 5285, 6907, 17096, 27791, 26439, 20955, 6782, -5163, -4533, -8806, -9059, -15739, -9421, 12554, 23271, 29647, 26716, 17023, 12474, 11529, 9568, 19023, 17219, 7039, 2757, 6887, 9244, -460, -7002, -495, 2850, 14463, 13338, 5350, 808, 3169, 13350, 17641, 19915, 20895, 30155, 25911, 20751, 28227, 37828, 52033, 59914, 75988, 94217, 119771, 133480, 126229, 112934, 114774, 119894, 97298, 64989, 45535, 41359, 44723, 27531, 19073, 18164, 23879, 29062, 23197, 13977, 4366, 8164, 28693, 35681, 40377, 44821, 44918, 47278, 36881, 34891, 26507]
10003B6507n326p096J7083L720n244j0716k972M828l805m171J5286K091j741l994
9989B4450J740L610J98k718j0067l750k63j2177q133L385M938J2536P120L489
9975B4358N716K037r917j2996K266J430O280p758J953l681J640N117m47L29J96
9960A6523q448J1R597l463k968N598j1301O696r104L494K580j450k555l969j085
9945A56m944J2191m213m893L318O09r950k1193L318K474J0337o481k735J5813
9931f193L3153K782j2132j9458l418J5769j69j7398q96k234R392J0980J0638j4295
9917F521j0589j0207l172R147M503J6149k314j280R980J0973J3235l738j2637
9904B6571m980j7642o619p702L611M16J7363L421l525j3398J466J8622J763L096
$$ y = [26507, 21181, 14085, 31168, 34888, 29644, 18928, 15956, 20784, 16979, 12808, 28094, 30185, 28444, 24450, 26190, 29800, 29998, 27280, 17213, 13463, 13200, 1023, -7110, -3725, 1213, 13749, 20869, 24358, 30074, 32111, 22194, 9198, 11464, 12894, 19174, 11416, 13369, 9688, 11328, 16445, 15998, 16327, 16523, 8075, 8086, 17683, 14220, 11252, 16850, 5549, 12245, 3141, 6635, 9215, 7765, 5210, 1241, 156, -4788, 7403, 3190, -1703, 1615, 2224, -7726, -28919, -25601, -23127, -12790, -19271, -22006, -6193, 26960, 29742, 17610, -1848, -5266, 10503, 10334, -7064, -7960, -10194, -802, 10178, 20816, 6521, -4068, -14275, -17447, -8300, -3797, 12352, 10038, 8758, 18738, 29711, 42946, 39208, 26571, 21591, 3949, -2670, -10372, -6761, -6345, 11018, 14439, 10914, -2484, -1018, 17604, 19367, 22463]
9890B2463J006m847j528j9805J0330J2750N324J1209M070j1011L012M984p359
9877C0598K867l157J4987J196m570L854r823j4193N574O625J3827J5716K099J3353
9863G8953K7170K2357L0081L4375P010L003J02N692m301k9541l4597k7510j6081
9850I6713j6092j2611m845j5773o648N503o534L633L585N466k860J3374N137J581
9836F9629M445N982J3701J5923p284J589O115P014p615j8k903q349j1696r520
9822G7013r895j2480l478n542L409p972l126N800o59q996O810l237L935J991l204
9807D0369l262m291J871P647n300R136k237j5358P729M182J5370N362J2434K0388
9793I4040J0669K5298K1246K107m176l590j872k429o123r755j116q446p457o649
$$ y = [22463, 23469, 18622, 17094, -2711, 7619, 20369, 25693, 36902, 40972, 29961, 32973, 37957, 30598, 33465, 30308, 45295, 46491, 41921, 45775, 35952, 21759, 27333, 33958, 47785, 63501, 65600, 78953, 106123, 128480, 158561, 192936, 199946, 202949, 203051, 208743, 204442, 174901, 140304, 112794, 96713, 80621, 68010, 63165, 47392, 40744, 46247, 39713, 43346, 46931, 52397, 49537, 62911, 68048, 69629, 74074, 80056, 93757, 109680, 102396, 103985, 110100, 117114, 109499, 109481, 106578, 98229, 86533, 77013, 67118, 54638, 51160, 45618, 49027, 41055, 37929, 43729, 43070, 34074, 40884, 37647, 41582, 43573, 40369, 37107, 32816, 34687, 42334, 37034, 46170, 43933, 28575, 36304, 40486, 55856, 61218, 73652, 94040, 104709, 130007, 151253, 153360, 149184, 145594, 143722, 141293, 135170, 125415, 124299, 115853, 108396, 101747]
9779A01747o731n75j4578n01l448j0660n101P205r948K537K283j238J403r114
9765E3281p074k076m476n120j0748P324J7041J8745j2253j6535j147K179K2768
9752F1909J4933J638K3186J0304J7606K4601q37M953J2065K7281J7424N058K778
9739B22899N0l971k4002k8015k5316j2354r914k0893k6946n009l845K862J3952
9726G9498j2920k3856Q295J8072K870j1369q4Q054l230l459L045O370J4772R616
9712I5674j861r7M154j972J059K3515L3586L5403K1441P475J3157J9401J1303
9699B62238j1209j2797j7500j5863j5919l509J0375o891k7510o791J574p090k3038
9686A26070j5178j5746O714k065J2329n096j6386o081p120j303p131M054L897
$$ y = [101747, 95016, 94441, 79863, 79362, 75914, 65254, 60153, 67358, 57410, 59947, 62230, 60992, 62395, 53281, 46207, 44131, 39655, 34535, 23787, 31111, 48152, 66897, 54644, 38109, 36962, 39141, 61909, 76842, 78480, 101666, 111970, 129576, 154177, 153340, 158293, 170358, 197639, 215063, 220121, 222899, 222949, 218978, 194976, 166961, 141645, 129291, 119377, 98484, 71538, 66529, 62684, 65546, 79498, 66578, 42722, 51017, 69089, 71959, 60590, 60506, 68560, 65330, 61871, 64916, 71286, 86058, 95674, 93813, 93716, 97870, 95898, 96957, 120472, 154058, 189461, 210902, 218377, 231534, 250935, 262238, 251029, 238232, 220732, 204869, 188950, 185441, 195816, 188925, 161415, 154624, 156198, 149108, 126070, 110892, 95146, 101860, 99795, 112124, 107028, 90642, 84561, 77441, 76138, 69007, 73061, 76958]
9673G6958Q285Q007M505N470M154J1811J0637N546Q970O775K40P419J4190J5867
9659A88834m896j2903O39J2218J7917J6622K3232l492J003m007j6981j1454j5148
9646A91584j4746k0225p528j4355j7941j4907o059l182l703M962M557N28n93l412
9632I4980J1179M786L605q969q537j100P81M794l571j4405o684N498O107o13l033
9617H4818K3076K1265K3618L3420J9701K0187O264r740j1343r548k254j2149k6418
9604A60897j9150j0609j3099P553r175j3622J1147M179k473m330J088L588J2711
9591A28705r938j2084J6293J0680p22K2646K3585J2516R735J781j27K2369K0659
9578B46098P329K1816K4674J0496J3615K3302K2441L9934Q8411J03818Q8573N9191
$$ y = [76958, 85243, 93250, 97755, 103225, 107379, 119190, 129827, 135373, 144343, 151118, 151358, 158777, 172967, 188834, 183938, 171035, 171674, 183892, 201809, 218431, 241663, 238171, 239174, 235167, 218186, 206732, 191584, 176838, 156613, 149085, 134730, 116789, 101882, 95823, 92641, 88938, 93900, 98457, 98985, 98392, 94980, 106159, 110945, 114550, 105581, 97044, 95944, 96725, 101519, 97948, 83543, 76859, 82357, 88464, 87851, 84818, 107894, 129159, 152777, 186197, 205898, 226085, 232349, 222609, 211266, 201718, 199464, 187315, 160897, 141747, 131138, 118039, 125592, 116417, 102795, 113942, 118121, 115648, 111318, 112406, 115994, 128705, 118767, 106683, 122976, 133656, 132934, 155580, 179165, 191681, 201416, 203197, 203070, 225439, 246098, 253427, 275243, 299917, 310413, 324028, 347330, 369771, 409705, 498116, 601934, 690507, 749698]
9566G49698K9336L1183L7357k198m9679p2093o9768m3192l4520k4153j7189k908
9554E31874J8453L5492N5408O9071P5551P3168O3331O3866K5458R576K0035J0553
9542A051836j7061j7985k8706k6253j2576l1240k8290j7136m768J2125O0453P6901
9530A017300Q6412J62189K29082K87117K62590J40638M8520j0604m0830q4675
9520B097739j74237k51189k27191j70112j17096p9265l6400j6933j6247n994J4084
9509A017159K5360L2149J9456K7728K6986K2650J8148P693j0001l3131n8583o6406
9497A029208p1335o9933p1514p7323n7479l5484n760K2502L8223M0741L8640M6135
9485H26621N4022M9786J5623j9346l1017k8971k9662n4693q8422q4904n0019l0208
$$ y = [749698, 779034, 810217, 847574, 845376, 795697, 723604, 653836, 610644, 576124, 551971, 534782, 531874, 550327, 585819, 641227, 710298, 785849, 859017, 922348, 986214, 1011672, 1021248, 1041283, 1051836, 1034775, 1016790, 988084, 961831, 949255, 918015, 889725, 872589, 867821, 879946, 940399, 1017300, 1103712, 1265901, 1494983, 1782100, 2044690, 2185328, 2233848, 2223244, 2182414, 2097739, 1923502, 1672313, 1445122, 1275010, 1157914, 1078649, 1042249, 1025316, 1009069, 1003075, 1017159, 1042519, 1074668, 1094124, 1121852, 1148838, 1171488, 1189636, 1197329, 1187328, 1154197, 1095614, 1029208, 957873, 887940, 816426, 739103, 681624, 646140, 640380, 662882, 701105, 741846, 780486, 826621, 880643, 930429, 946052, 926706, 895689, 866718, 837056, 782363, 693941, 609037, 559018, 528810]
9473E28810j6984l3459k6865k4707k9049k4958k6389j7520k6518j5160j5405n011
9461B66785r721J242K142J128n087k4402k1438l618J037r3p9j1990j808M557J6470
9446B15125K1805Q958M418N851J0258J196m256J128r955l464j2790j4014j4313
9433B09947m21r517J224k2575j1014P939L131p436q738L775J4963m887p144L656
9419A72903J3089P593j0783j327R859N932j9371r403L933l624M105k820j1212
9406A58874j0328k26m566N032O977o665l016o86m081J858J2939K92M541k577L359
9391A61727Q816Q126j720j2793j4992K398M18j0156p407M214L858Q075P99N507
9377A56870J0335M275j1177J3358J2999k348j7141N920K3664K799N165j0313J2324
$$ y = [528810, 511826, 478367, 451502, 426795, 397746, 372788, 346399, 328879, 302361, 287201, 271796, 266785, 257064, 258306, 260448, 261576, 256489, 232087, 210649, 207031, 208068, 207975, 207896, 195906, 194098, 198655, 215125, 236930, 245888, 250306, 256157, 266415, 267611, 263355, 264483, 254528, 251064, 238274, 224260, 209947, 209526, 200009, 201233, 178658, 167644, 175583, 178714, 171278, 162540, 166315, 181278, 176391, 169247, 172903, 185992, 193585, 182802, 181475, 191334, 197266, 177895, 168492, 172425, 168801, 172906, 170086, 158874, 148546, 148320, 143754, 148786, 155763, 149098, 146082, 145396, 141315, 143173, 156112, 156404, 160945, 158368, 161727, 170543, 178669, 176949, 164156, 149164, 151562, 151980, 141824, 134417, 138631, 142489, 150564, 151363, 156870, 167205, 171480, 160303, 173661, 186660, 184312, 167171, 173091, 196755, 199554, 204719, 194406, 206730]
9364B06730K7761j438j740O123J0630J0415L826j9205o358J5975P594J4903K1090
9351B96306L3837J3313O254l073J911M0064M5486J6227K5092L7866M2714O3430
9339F19427N0942M5619P9645Q3759Q1058Q8512J26230J73380K05824K35923L10522
9328B100841M20070N76296Q27986J197713J744540K352799K666910K166337J118781
9319A5172273K46175j55990l65121q11911j723740k293740k074768j570749j146486
9310E275943q46962o34058m85571l90720l28685k52520j92923j55661j26195r6762
9300A765886q9441n9352m7579n7961m2382n7409o7375n6373n7820o7389n1299
9289A111506m6979m8380k3854m1977m1402k8442k5700k1937l1920j4625j9477
$$ y = [206730, 234491, 233053, 231313, 237436, 248066, 258481, 262307, 243102, 236744, 252719, 260313, 275216, 296306, 330143, 343456, 349710, 346637, 348548, 388612, 434098, 450325, 475417, 513283, 555997, 619427, 670369, 715988, 795633, 879392, 960450, 1048962, 1175192, 1348572, 1554396, 1790319, 2100841, 2520911, 3097207, 3925193, 5122906, 6867446, 9220245, 11887155, 14053492, 15172273, 15418448, 15262458, 14897337, 14085426, 12361686, 10067946, 7993178, 6422429, 5275943, 4428981, 3794923, 3309352, 2918632, 2589947, 2337427, 2144504, 1988843, 1862648, 1765886, 1676445, 1617093, 1569514, 1511553, 1469171, 1411762, 1344387, 1288014, 1230194, 1162805, 1111506, 1064527, 1016147, 992293, 950316, 908914, 880472, 854772, 832835, 800915, 786290, 766813]
9278G66813j6559n928P667K3825K5212J8689O907o778k8089k0345k6858l7066
9266G07490k4914m0096m9695k9365k7926k4512j8639j9613j5189j4428j5097m780
9254D23236p679l583o016l134j3554j9732j1961N809j652R328j0309q524p707
9241C44522j2131N130j3865O288L2273L4181K7633K5872K5070J3810R823M353
9229E02959p710o705k6433j9897l304j6719k8576l4601j5967M14m586j7394k7223
9216B94258j2788l795l398m771j1354j8428j7535j5146j3075j8088K717J7248
9204A95845J1374J2085K227j0729K898n00K9675L0913J0825J6666K2538K2175
9192C45992J6417N854j990O288N748J3015J2813q920j2188q6R942j1691k0198
$$ y = [766813, 750254, 744326, 751993, 775818, 801030, 819719, 826626, 819848, 791759, 771414, 744556, 707490, 682576, 642480, 592785, 563420, 535494, 510982, 492343, 472730, 457541, 443113, 428016, 423236, 415557, 411974, 405958, 402824, 389270, 369538, 357577, 363386, 361734, 371062, 360753, 352229, 344522, 332391, 337521, 323656, 329944, 362217, 396398, 424031, 449903, 474973, 488783, 498606, 502959, 495249, 488544, 462111, 442214, 438910, 422191, 393615, 359014, 343047, 343461, 338875, 321481, 294258, 281470, 277675, 274277, 269506, 258152, 239724, 222189, 207043, 193968, 175880, 178597, 195845, 207219, 219304, 221531, 210802, 213700, 213200, 242875, 273788, 284613, 301279, 323817, 345992, 362409, 368263, 366273, 372561, 378309, 391324, 404137, 395217, 383029, 382943, 392885, 381194, 360996]
9179C60996j9702j0502p141k3106j5574k9120k0772m554m920j399J4393J1867
9167B50466J4851L1688M6116L7621J8735J5443o978j6109k9082k5298j1356j1834
9155C14263l0492l863k977P290N709J2693J8730L9428M2566L9413M5026M0324
9143E28110K5370R920j1958k2023l4880l6765k4176l6527l2121o476J4492M488
9131C77454j3979k9879j2439q250p304j1250l867J0007L040J4550J1187J4754
9119C44024J6669K5363L9636O7443Q1001L7516N999J458k070k1385l8565m5841
9107E11248m9901m1282k4246r780q768j1849m758j0198k2123n950J633p189J5345
9094C32182K1550J3269J1003K1572p721J831K2710K2246J224J176K5259L1561
$$ y = [360996, 341294, 330792, 323651, 300545, 284971, 255851, 235079, 230525, 225605, 224206, 238599, 250466, 265317, 297005, 343121, 380742, 399477, 414920, 407942, 391833, 362751, 337453, 326097, 314263, 283771, 279908, 276931, 284221, 289930, 302623, 321353, 360781, 403347, 442760, 487786, 528110, 553480, 563400, 551442, 529419, 494539, 457774, 433598, 397071, 364950, 358474, 372966, 377454, 363475, 333596, 321157, 312907, 305603, 294353, 290486, 300493, 303533, 318083, 329270, 344024, 360693, 386056, 425692, 493135, 574136, 611652, 617651, 619109, 617039, 595654, 557089, 511248, 461347, 420065, 395819, 386039, 377271, 365422, 360664, 350466, 328343, 322393, 324026, 316837, 332182, 353732, 367001, 378004, 399576, 391855, 393686, 416396, 438642, 439866, 441042, 466301, 497862]
9082D97862Q686k941q204o440j4505l0634l7398k7996l2522q845J6751J959l157
9069C52616r351j281K2752K7878L2917K0232K5978J4734J4263J898Q001Q787k1261
9056D98163j6533j5199j8994o594j3464k0053j3145l4404l1378J814j166j475
9044C27572l780k799J2373J7898L5288K3288K3241L6784L3478M3818N3695N4889
9032F55745K9571M1427O9963Q4747J25025J43554J72889J82672K01394J88361
9022A895348J21729P1515N3165j2707p9709j36481j74403j68916j58516j45348
9012A265677j34934j29045r5785p4006p3824n3129m2951l7368l3873l0661k4009
9001E36092o974M740J0568m208J8534L3270L6744M9984Q0030R7323R6091N3667
$$ y = [497862, 506548, 503607, 495403, 488963, 474458, 443824, 406426, 378430, 345908, 337063, 353814, 355773, 352616, 343265, 341984, 364736, 392614, 425531, 445763, 471741, 486475, 500738, 502636, 510637, 519424, 498163, 481630, 466431, 447437, 440843, 427379, 407326, 394181, 359777, 328399, 330213, 329047, 327572, 323792, 320993, 333366, 351264, 386552, 409840, 433081, 469865, 503343, 547161, 600856, 655745, 685316, 726743, 796706, 881453, 1006478, 1150032, 1322921, 1505593, 1706987, 1895348, 2017077, 2088592, 2141757, 2129050, 2049341, 1912860, 1738457, 1569541, 1411025, 1265677, 1130743, 1001698, 905913, 831907, 758083, 704954, 662003, 624635, 590762, 560101, 536092, 529118, 533858, 544426, 540218, 558752, 592022, 628766, 678750, 758780, 856103, 952194, 1005861]
8989A005861J4323k3764k7439k8222m5543r5617j00165p9338n4346j3363l591
8978E48796o711k2519P339J0792J3298M692M952p888k0740k1582j6540l0383l2029
8965D31477k1305j5165j1732l865o802l179K1947J8698N231K1904J9306J1061
8953D67576K0511M1966N3453Q3932J13016J51365J97643J94592J08192K1098l0604
8942A422740l0896l9702r0374j73401j83567j55479r5756p8228p5398o0781k1835
8931D17323k6199k3097j5199j6429K938q502k992J3118k127q208M238k958n566
8918C26340q85p993n418m689o963p993K074N600K1158J4711J5860J2666J9551
8905C84019K7027N9788P4594Q3761J08303Q5500L0099m65j8934k5852k5526n1586
$$ y = [1005861, 1020184, 996420, 968981, 940759, 895216, 799599, 699434, 620096, 565750, 552387, 548796, 542085, 519566, 526905, 537697, 550995, 555687, 560639, 552751, 532011, 510429, 493889, 463506, 431477, 410172, 395007, 383275, 379410, 372608, 369429, 391376, 410074, 415305, 437209, 456515, 467576, 488087, 530053, 583506, 667438, 780454, 931819, 1129462, 1324054, 1432246, 1453344, 1422740, 1391844, 1352142, 1261768, 1088367, 904800, 749321, 653565, 575337, 499939, 439158, 417323, 391124, 368027, 352828, 336399, 339337, 330835, 327843, 340961, 338834, 330626, 334864, 331906, 326340, 325455, 317462, 312044, 307355, 300392, 292399, 294473, 300073, 321231, 335942, 351802, 364468, 384019, 411046, 470834, 545428, 629189, 737492, 822992, 853091, 852626, 833692, 807840, 782314, 730728]
8893G30728r0700o4528m0527j3723l4509j9818k6208k885P539M928J5231J5216
8881D80744J5134J9034K2244M257n312j6878k2632o53j7740l1127j7671o843m052
8868D18505n842o417J3754J322j2857J87K0085P135j0998L673J0904m936j0311
8855D24204o353j5006o235O253K0483J0668J2828l353P403P159j8258l1318j8264
8842C90211r824J8401J4449j231p654M837L929n339k3424j3289K6575J0620j0832
8829C97429O520l576m430J277o21N254K349p425J973J8150Q005o216J7708P059
8815D43456P32o383j4184n003M788M301K1568J1078Q592K5418Q496K0046K2787
8802E45692K7147J0014j2506j8149k4758k4075j92K931j5896j0776j1275j575
$$ y = [730728, 640028, 575500, 534973, 521250, 486741, 466923, 440715, 437830, 445369, 450297, 465528, 480744, 495878, 514912, 537156, 541413, 536101, 519223, 496591, 495938, 478198, 447071, 429400, 422557, 418505, 412663, 406246, 420000, 421322, 408465, 408652, 428737, 435872, 424874, 428547, 439451, 434515, 424204, 417851, 402845, 396610, 402863, 423346, 434014, 446842, 443489, 450892, 458051, 439793, 408475, 390211, 380387, 398788, 413237, 412006, 404352, 409189, 413118, 407779, 384355, 371066, 397641, 408261, 397429, 403949, 400373, 395943, 397220, 396599, 401853, 404202, 396777, 398750, 416900, 424905, 418689, 436397, 443456, 444188, 437805, 423621, 418618, 423406, 427707, 449275, 460353, 468945, 494363, 502859, 522905, 545692, 572839, 582853, 570347, 552198, 527440, 503365, 503173, 506104, 490208, 479432, 468157, 466582]
8790D66582J4885J8928M974J5083J1642J8367J4659J8694J6549J7079M635k989
8778F19088L213P791Q591o97m959o271j1299O722j4984j5631k4271L677J5309
8765E86279O493J7196K1462J7309K8773O354J0644J0915Q145J1463K0911J6172
8753G62116K0261N0581N9100O4427O6098R6656Q8962N6464N6543M0997M3951K9461
8741A435617n90j3079k0010k3675q165K23m582j9330j9396j4307k372o827j2549
8728A290958k1639k422J0149J6848Q973K7638L3788J8509L3740M6381M1404L5394
8716A539721L3789K6899K6020J8065k145j5566J3508Q302J8673L4510M6938N7233
8704A805947M6642N2782J1881K22M62L012p245r09j023j1340M521J2507J9826
$$ y = [466582, 481467, 500395, 505369, 520452, 532094, 550461, 565120, 583814, 600363, 617442, 622077, 619088, 622301, 630092, 638683, 637986, 633027, 626756, 615457, 622179, 607195, 591564, 567293, 570970, 586279, 592772, 609968, 631430, 648739, 677512, 683866, 694510, 705425, 713570, 725033, 745944, 762116, 782377, 832958, 892058, 956485, 1022583, 1119239, 1208201, 1264665, 1321208, 1362205, 1406156, 1435617, 1435027, 1421948, 1401938, 1378263, 1370098, 1370321, 1365739, 1346409, 1327013, 1312706, 1310334, 1303507, 1290958, 1269319, 1266897, 1277046, 1293894, 1302867, 1330505, 1364293, 1382802, 1416542, 1462923, 1504327, 1539721, 1573510, 1600409, 1626429, 1644494, 1642349, 1626783, 1640291, 1648593, 1667266, 1701776, 1748714, 1805947, 1852589, 1905371, 1917252, 1917474, 1917936, 1920948, 1913703, 1912794, 1911771, 1900431, 1904952, 1917459, 1937285]
8691A937285M998o37J7411J8765K1517M2407N0664N4237N6641O4329O5724N5628
8679B388969R0416R1976Q7474R6745R6062J12873J14045J23166J41308J71157
8669C514191K00009K10127K12945K06108K65984L24061L59207L75169L68166L53049
8659F389016L35516K83788K59555K16238J62451J40277J36662J54191J86138K14989
8649H478821K92911L80334M79404O02853P47281R12415J099778J307310J557746
8640A5858853J842604K184687K527263K900404L294959L667049M102752M836358
8632D1214929O050265Q046088J1170503J5830377K1844020K8209752L4047435
8625A66413369L8693823M0491044L7534475K9990931J9854893R367431j265354
$$ y = [1937285, 1942283, 1941646, 1959057, 1977822, 1999339, 2041746, 2092410, 2146647, 2203288, 2267617, 2333341, 2388969, 2479385, 2571361, 2658835, 2755580, 2851642, 2964515, 3078560, 3201726, 3343034, 3514191, 3714200, 3924327, 4137272, 4343380, 4609364, 4933425, 5292632, 5667801, 6035967, 6389016, 6724532, 7008320, 7267875, 7484113, 7646564, 7786841, 7923503, 8077694, 8263832, 8478821, 8771732, 9152066, 9631470, 10234323, 10981604, 11894019, 12993797, 14301107, 15858853, 17701457, 19886144, 22413407, 25313811, 28608770, 32275819, 36378571, 41214929, 47265194, 55311282, 66481785, 82312162, 104156182, 132365934, 166413369, 205107192, 245598236, 283132711, 313123642, 332978535, 342345966, 341080612]
8618C41080612j3065134k4686515l2663822l5265185l4255106l1954898k8851364
8611A40338588k4030459j8192712j3146801r541098p058662n348368m184145l326279
8603E5510064k576669j863500j191787n02965K46803J279475K821863N277996
8595E9001280R211399J4643827J8849843J6431614P668121L72524k221352k489672
8587A21467584m350773j1503388j7912358j6394447j1878458q188765n767867
8580D5471528m243457l303183k625396k074757j626125j325210j254576j192303
8572B7826521j011915p89571o14341m70121k87179j44831m7570j210N7042J63645
8562B4680470L34290N00831O38693P76745J022066J424456J991557K736289L725657
$$ y = [341080612, 328015478, 303328963, 270665141, 235399956, 201144850, 169189952, 140338588, 116308129, 98115417, 84968616, 75427518, 68368856, 63020488, 58836343, 55510064, 52933395, 51069895, 49878108, 49375143, 49621946, 50901421, 53723284, 59001280, 68212679, 82856506, 101706349, 118137963, 125806084, 126178608, 123957256, 121467584, 117116811, 105613423, 87701065, 71306618, 59428160, 51239395, 45471528, 41228071, 37924888, 35299492, 33224735, 31598610, 30273400, 29018824, 27826521, 26814606, 26025035, 25410694, 24940573, 24653394, 24508563, 24460993, 24459783, 24516825, 24680470, 25014760, 25515591, 26154284, 26931029, 27953095, 29377551, 31369108, 34105397, 37831054]
8553C7831054N238995P820872J2198192J9526464L0253422L9507077L5634807
8546A88010883J7635180K416311k713878k785457n202564j9321449l3921415l1370499
8538A12747112k2126793j4711935r883419o645579m320086k488298j176499l69627
8530E1024876J69555M98150M70252J61997k90090p16280j020036j385441j847572
8521D7065411k111169k039441j933388j932135j608225j031043m73105Q4492Q25129
8512C6846526J811327L073124M591664O328697Q315004J0778514J3913394J7607508
8504A03265758K1763144K5037193K2929382J3358315K978609k991423n671803
8497A80669175q025705j4193456k2033342k1929824j6224112j0439987n866622
$$ y = [37831054, 43070049, 50890921, 63089113, 82615577, 112868999, 152376076, 188010883, 205646063, 208062374, 205348496, 202563039, 197360475, 178039026, 144117611, 112747112, 90620319, 75908384, 66024965, 59379386, 55059300, 52571002, 51394503, 51024876, 51194431, 51692581, 52162833, 52324830, 52034740, 51318460, 50298424, 48912983, 47065411, 44954242, 42914801, 40981413, 39049278, 37441053, 36410010, 35936905, 36021397, 36846526, 38657853, 41730977, 46322641, 52651338, 60966342, 71744856, 85658250, 103265758, 125028902, 150066095, 172995477, 186353792, 189332401, 186340978, 180669175, 172643470, 158450014, 136416672, 114486848, 98262736, 87822749, 81956127]
8490H1956127k133728R97036L813066N741482N944504N170692M221756K581382
8482A08292317K16676k551736n451318p036647p494282q335639q878345q011428
8474F0749598o703608n622543m490046l209477k113839j231379n22161J85085
8466C7041630R18851J395955J488428J564981J719214J602783J032747J78883
8458D6943472o60194j249615j826995k564260l139585l256493l120277l078058
8450B8047995k876622k407845k000246j733252j441269j172614r49934p94052
8442A4672161o68646n57294m77941m28544l94405l75203l69326l37568l16547
8433A0746687k99041k93687k87112k55482j70205r3319r430J7301l6660j41569
$$ y = [81956127, 79822399, 80819435, 84632501, 90373983, 96318487, 101489179, 105710935, 108292317, 108508993, 105957257, 100505939, 93469292, 85975010, 77639371, 68761026, 60749598, 54045990, 48423447, 43933401, 40723924, 38610085, 37378706, 36856545, 37041630, 37960481, 39356436, 40844864, 42409845, 44129059, 45731842, 46764589, 46943472, 46283278, 45033663, 43206668, 40642408, 37502823, 34246330, 31126053, 28047995, 25171373, 22763528, 20763282, 19030030, 17588761, 16416147, 15466213, 14672161, 14003515, 13446221, 12968280, 12539736, 12145331, 11770128, 11400802, 11063234, 10746687, 10447646, 10153959, 9866847, 9611365, 9441160, 9347841, 9338411, 9355712, 9319052, 9177483]
8423I177483j80716j76040j73446j69249k19906k36455j62955r9537j34559k10767
8413G413853k43021k45627k71590l05518l58245l53939l13197k77620k17696k00626
8403D626774j66470j27878j19424j12199j08921r7024p4328p0577o6197p9862
8393C603894p9734o7068o3297q4877q8817q5934r8384r1468p8270r2767p9629
8382B693649n4157n4534o6516m2119j4834j7022m67K2788N4930P4877R9349J21397
8370B817341J38754J82709K22653K42052K14437J79905J50025P6094k9862j09422
8360D084686j86497k17086k49497k75653k40531j97574j70572j35351o8048l448
8350B340429N3080Q7051J08153J24767J11268Q1419K6834k0332q4233j31791j78629
$$ y = [9177483, 8996767, 8820727, 8647281, 8478032, 8258126, 8021671, 7858716, 7759179, 7624620, 7413853, 7170832, 6925205, 6653615, 6348097, 5989852, 5635913, 5322716, 5045096, 4827400, 4626774, 4460304, 4332426, 4213002, 4100803, 3991882, 3894858, 3820530, 3749953, 3683756, 3603894, 3524160, 3457092, 3393795, 3308918, 3220101, 3134167, 3035783, 2944315, 2866045, 2773278, 2693649, 2639492, 2584958, 2518442, 2476323, 2461489, 2444467, 2444000, 2466788, 2521718, 2596595, 2695944, 2817341, 2956095, 3138804, 3361457, 3603509, 3817946, 3997851, 4147876, 4223970, 4194108, 4084686, 3898189, 3681103, 3431606, 3155953, 2915422, 2717848, 2547276, 2411925, 2343877, 2340429, 2393509, 2480560, 2588713, 2713480, 2824748, 2906167, 2933001, 2912669, 2828436, 2696645, 2518016]
8339B518016j83927k00051j96029j64428j39859r9164n8427l8240k6592l504j2282
8328A395513q274k881P450r630k9879k5359k1857m5717o5196m8391l3273m3294
8316A069212l0813j1178j3153l2512k4871j5742j5686j0268r083m0227l1327k1166
8304H13186j3279j2873L504J4716o408j2082J1643j2341j2543j002o801k4298
8292G41422k1999n234j3602j9944k0777j2754O925k561l761q362j2048j2092J5035
8279F30248K476j9341j2129k241m097k7656k9775r828n093L450q937j2267j4326
8266D90484l131J989J2417O848Q641L951o071Q168P384k696N917J0391M98n576
8252E39214Q083L96M002n762j7376k2236r316L814j0389M31r842p10N478K48k386
$$ y = [2518016, 2334089, 2134038, 1938009, 1773581, 1633722, 1534558, 1476131, 1437891, 1411299, 1407795, 1395513, 1387239, 1384358, 1391808, 1382178, 1352299, 1326940, 1305083, 1259366, 1194170, 1145779, 1112506, 1069212, 1038399, 1027221, 1014068, 981556, 956685, 940943, 925257, 914989, 905906, 865679, 834352, 813186, 799907, 787034, 790538, 805254, 798846, 786764, 798407, 786066, 773523, 772521, 765720, 741422, 719423, 714189, 700587, 680643, 659866, 647112, 654037, 651476, 647715, 639353, 627305, 615213, 630248, 632724, 613383, 601254, 599013, 594916, 567260, 537485, 527657, 522564, 526014, 517077, 504810, 490484, 487353, 489342, 501759, 508607, 517248, 521199, 515128, 523296, 530680, 527984, 533901, 544292, 544790, 539214, 547297, 547693, 551695, 545933, 528557, 506321, 497005, 500819, 490430, 490861, 481019, 480309, 485787, 486035, 483649]
8237D83649p967J1512M971j6463n25L901O578o542L66P635L4028J3090L3146L8887
8223F06266O2601J11020J33829J56163J93125J95174K08143J71337J43944Q5743
8213B067345J2232k7314q0902j45265j68351j71429j54768j20333j00965p9430
8203A030820o0559n4838l4017l1099k1353j9118m920j2453K996J1107K2737K2461
8191H51764L1677M9755Q0911R7020O6604K0038j2018j6363j8762m4415q2947q4954
8179I38310n3665k9134j0784J2838O4605Q8326O1245L1170o307l888r808l6559
8167A046349o6447o7515o0830n7222l2975j8643l125J1955M8544Q9446J10970
8156A000507J21305J12930R5443O3706J2125j6721l4959m5842n7771k5933O9344
$$ y = [483649, 475682, 487194, 492165, 475702, 475177, 479078, 485656, 479114, 479480, 487115, 521143, 534233, 567379, 606266, 668867, 779887, 913716, 1069879, 1263004, 1458178, 1666321, 1837658, 1981602, 2067345, 2079577, 2052263, 1971361, 1826096, 1657745, 1486316, 1331548, 1211215, 1110250, 1030820, 970261, 915423, 881406, 850307, 828954, 809836, 804916, 792463, 795459, 806566, 829303, 851764, 883441, 933196, 1014107, 1111127, 1177731, 1197769, 1185751, 1169388, 1150626, 1106211, 1023264, 938310, 884645, 855511, 844727, 857565, 922170, 1010496, 1071741, 1102911, 1096604, 1092716, 1082908, 1046349, 979902, 912387, 851557, 794335, 761360, 742717, 739592, 751547, 800091, 889537, 1000507, 1121812, 1234742, 1330185, 1393891, 1406016, 1389295, 1354336, 1308494, 1250723, 1224790, 1294134]
8145A294134J55649K04800J92916J30275M2053J2374K522k2554p5837j70671j70772
8134A594889j11921p5071o6054m3418k3876k490K76J6892J0176N004m261l4994
8122A265152n9262o0059n7850p3102q5194p0657j8362J3405O31j8012j8678j5435
8110H02577l040L529n580K270M073j6077J9K7572L0468K5470N5141Q8429J07971
8097A122822O3586J5511k9505l9210l7016o2162q7243j14173j12214q3013p0540
8086E66843n2719l4012j9397j0595p104J676j515r885j160L2739J8939Q956L0417
8073E23183N0377J8678J9779M141p184q987j5537j0313n094k9485k1571j0258
8061E07729j0793k3809k7460k4914l3986l1008k6109j5246j5733j3025Q514l367
$$ y = [1294134, 1449783, 1654583, 1847499, 1977774, 2019827, 2032201, 2034723, 2012169, 1936332, 1765661, 1594889, 1482968, 1407897, 1341843, 1298425, 1274549, 1272059, 1272335, 1289227, 1299403, 1304407, 1300146, 1265152, 1205890, 1145831, 1087981, 1014879, 929685, 859028, 840666, 854071, 854702, 836690, 818012, 802577, 799537, 803066, 797486, 799756, 803829, 787752, 787771, 815343, 845811, 871281, 926422, 1014851, 1122822, 1186408, 1201919, 1172414, 1133204, 1096188, 1034026, 946783, 832610, 720396, 637383, 566843, 514124, 480112, 460715, 450120, 443016, 444692, 443177, 433292, 432132, 464871, 483810, 492766, 523183, 573560, 592238, 612017, 616158, 608974, 599987, 584450, 574137, 569043, 539558, 517987, 507729, 496936, 473127, 445667, 420753, 386767, 355759, 329650, 314404, 298671, 285646, 294160, 290793]
8049B90793p658J1750R799M353O68o502J2691J9086J9912J0763M136L689j3624
8036C59856J3094O477M57N508Q191J1685j1022J0139Q769k9494p431j889L078
8023C77418J1943J1067J1879m142p432J1619J1286o82O858J213J1145Q717P018
8010D57907K949p253p833o421j4016j1458k1117j9321q330j7107k5128p375N614
7997C21111m640M601R242J6252J7805J4831R419J3025K8092J3993J2479M315J6580
7984D77105J5596J0624J3778J2620J2445K1505L3242J5087j5703k1177j4877N233
7972E65478M912J317l86J2217m246L081K595J4564L3662L2917M7958O2250Q6760
7959H63079P2811K5391O542m474k2470m7881n7115o8406p9932n8457k8411j9438
$$ y = [290793, 283135, 294885, 304684, 309037, 309705, 303203, 315894, 334980, 354892, 365655, 369791, 373480, 359856, 372950, 379427, 379884, 385392, 393583, 405268, 394246, 404385, 413154, 383660, 376229, 374340, 377418, 389361, 400428, 412307, 408165, 400733, 412352, 423638, 422956, 429814, 431027, 442172, 450889, 457907, 460856, 453603, 445770, 439349, 425333, 413875, 392758, 373437, 365107, 348000, 322872, 315497, 321111, 316471, 321072, 330314, 346566, 364371, 379202, 388621, 401646, 429738, 443731, 456210, 460525, 477105, 492701, 503325, 517103, 529723, 542168, 563673, 596915, 612002, 596299, 575122, 560245, 565478, 570390, 571707, 571321, 583538, 579292, 582373, 584968, 599532, 633194, 666111, 714069, 776319, 863079, 935890, 961281, 967823, 963349, 940879, 892998, 835883, 767477, 687545, 629088, 600677, 581239]
7947E81239j7456o521j171K4805M0404M9908M4676K0896Q351j5274j4361m422
7935G11074j5740k2060j5096K6327L5855L4507M7665K8770L522j4043k6572l8014
7923G56195m4245n0096o9187p2434l9609j1966p004L88J0020J7403N9690P6481
7911F25636Q9050R8047J07608Q2079N3811L9172J3873q371n7926r1977r3804q4427
7899G72771o7595o3306o3291m6462j6328r604L156M3900N0672M3001L6265J5582
7887F98761K616n375j5944j2794l7993l5731k7103k5689l2895k5669k1300j7133
7875D43751l0775l7874l3458N9J373K112M681r353p085l8j5075J2324J6677J802
7861C49121J2004J1836L654m045r250j7156j0031j6318l3900j1820j0221p824
$$ y = [581239, 563783, 557262, 556091, 580896, 621300, 671208, 715884, 736780, 745131, 729857, 715496, 711074, 695334, 673274, 658178, 684505, 720360, 754867, 802532, 831302, 834824, 820781, 794209, 756195, 711950, 661854, 592667, 520233, 480624, 468658, 461654, 462042, 472062, 489465, 549155, 625636, 714686, 812733, 920341, 1002420, 1056231, 1095403, 1109276, 1100905, 1042979, 951002, 857198, 772771, 705176, 641870, 578579, 532117, 515789, 506185, 509341, 553241, 603913, 646914, 683179, 698761, 701377, 696002, 680058, 667264, 629271, 593540, 566437, 540748, 507853, 482184, 460884, 443751, 412976, 375102, 341644, 341703, 343076, 345188, 349869, 340516, 333431, 333393, 318318, 330642, 347319, 349121, 361125, 372961, 376615, 372570, 363320, 346164, 336133, 319815, 285915, 274095, 263874, 256050]
7849B56050o000k554J101M430j1926j1012N300J080m899o705J7094J118k2691
7836B20386j9217m088K285J1684m824r168n348N4j1683J457P891j352m970M293
7822A87400N971o651j7786l82K733P088r812N491L377p726J1173K1106O010N527
7808B13519q958l579M837J3502j0000l293P420M423j3672r537j108J2428N588
7795B11570j643k59j000p390k727j7355J0165K6015J2430q143J3073J7511J9922
7782B72169J084J6933K930K1853L0380J9714P405l16O748J8805j0137P26M389
7769C92683J0278J3802N297K697o90k025K8132M6685O3301N4271P4516Q7700J08356
7756H85003J49231J96308K56949L53337M12109L96492L01821J41601J9749m8418
$$ y = [256050, 250050, 247496, 248597, 253027, 241101, 230089, 235389, 236469, 231570, 224865, 241959, 243077, 220386, 201169, 197081, 199366, 211050, 206226, 197058, 191710, 191764, 180081, 181538, 189429, 188077, 183107, 187400, 193371, 186720, 168934, 168552, 171285, 178373, 168561, 174052, 177429, 169703, 180876, 201982, 207992, 213519, 204561, 200982, 205819, 219321, 209321, 206028, 213448, 217871, 204199, 194662, 193554, 205982, 211570, 209927, 209668, 208668, 201278, 198551, 181196, 191361, 217376, 229806, 221663, 234736, 252247, 272169, 273253, 290186, 293116, 314969, 345349, 365063, 372468, 372152, 378900, 397705, 387568, 388294, 392683, 402961, 416763, 422060, 424757, 424067, 422042, 450174, 496859, 560160, 614431, 688947, 776647, 885003, 1034234, 1230542, 1487491, 1840828, 2252937, 2649429, 2951250, 3092851, 3112600, 3064182]
7746C064182j04417k06929k87854l22429k94845k39989j77812j36209q8340o1246
7736A144112n8574l8966l5559m3845k9448k4759j5799j4824k7437m317k836j1768
7724H35980q527r842j3347k5808j0265j0457J138P14J0448J5580K1148J7733k526
7711H21969p231J0249J8680m559j3578n075n906q784Q175J5406J6709K3423K0693
7698H90171J6561K0643L2865K2055M7235O5426N2395P2255P8293O6399O5042M8707
7686A478047K1929L7939L2115J4478q329L295K9443L8834P3972J01134J05747
7675A928604J33244J62709J82976K18551K37016K47580K79697L05355L33305L77995
7665D407032M62417N91143P61942J006686J409133K023849K803507L514362L762902
$$ y = [3064182, 2959765, 2752836, 2464982, 2142553, 1847708, 1607719, 1429907, 1293698, 1205358, 1144112, 1085538, 1046572, 1011013, 967168, 937720, 912961, 897162, 882338, 854901, 850584, 847748, 835980, 827453, 817611, 804264, 778456, 768191, 757734, 758872, 759586, 770034, 785614, 806762, 824495, 821969, 814738, 824987, 843667, 839108, 825530, 820455, 814549, 805765, 813940, 829346, 846055, 869478, 890171, 906732, 927375, 960240, 982295, 1029530, 1094956, 1147351, 1219606, 1297899, 1364298, 1429340, 1478047, 1499976, 1537915, 1570030, 1584508, 1576179, 1579474, 1608917, 1647751, 1721723, 1822857, 1928604, 2061848, 2224557, 2407533, 2626084, 2863100, 3110680, 3390377, 3695732, 4029037, 4407032, 4869449, 5460592, 6222534, 7229220, 8638353, 10662202, 13465709, 16980071, 20742973]
7656B0742973L537618L213643L037762K687441J707176J09516j372965k122331
7648C1540833k255136k349562k572161k597080k191533j523165q14883j64944
7640A7072369M19031J028173J771383K777349M344065O664895R702157J2833983
7632E6613405J4649356J3780495J0064426N108050J079432j718926m431329p652556
7624H7492353j0708959j1747470j0121948p207177m300454j786543O35609L333088
7616D5588499O541645R913300J2261923J2153570R236998M899481R95719j852744
7608I9738391m477678p611990j0659445j2132298j1355534r180765o853719m982555
7600C2484407l671208k728951k049242j509762j012005n06147M9587P32345J550486
$$ y = [20742973, 24280591, 27494234, 30531996, 33219437, 34926613, 35036129, 33663164, 31540833, 29285697, 26936135, 24363974, 21766894, 19575361, 18052196, 17237313, 17072369, 17491400, 18519573, 20290956, 23068305, 27412370, 34077265, 43779422, 56613405, 71262761, 85043256, 95107682, 100215732, 101295164, 99576238, 95144909, 87492353, 76783394, 65035924, 54913976, 47706799, 43406345, 41619802, 42255411, 45588499, 52130144, 62043444, 74305367, 86458937, 95695935, 100595416, 101591135, 99738391, 95260713, 87648723, 76989278, 64856980, 53501446, 44320681, 37466962, 32484407, 28813199, 26084248, 24035006, 22525244, 21513239, 21007092, 21056679, 21789024, 23339510]
7591B3339510K290374K664020K549016K208611J921148J621364Q98661m03485
7583C7089219j800153k662971k871317k873164k993821l050189k791482k284883
7575A5761239j769083j332658j057793q37000o80790n73966m83707m00792l59272
7566H266178l09477k81769k62756k30145k39591k46831k29000k25763k33154k31188
7556E776504k17320k12778j99479j79285j67704j59992j46721j38603j31690j37731
7546D085201j31954j18812j17746j08740j07612r6398j05859r0617r0068r7162
7536C020233q5253j15914j07427r3570q8587r0736r1099p8247n3656n9186m5684
7525B110874l6679l5970l9617m4302n4604p5561p7422o3432n7612m0029m8642
$$ y = [23339510, 25629884, 28293904, 30842920, 33051531, 34972679, 36594043, 37492704, 37089219, 35289066, 32626095, 29754778, 26881614, 23887793, 20837604, 18046122, 15761239, 13992156, 12659498, 11601705, 10764705, 10083915, 9509949, 9026242, 8625450, 8266178, 7956701, 7674932, 7412176, 7182031, 6942440, 6695609, 6466609, 6240846, 6007692, 5776504, 5559184, 5346406, 5146927, 4967642, 4799938, 4639946, 4493225, 4354622, 4222932, 4085201, 3953247, 3834435, 3716689, 3607949, 3500337, 3403939, 3298080, 3207463, 3117395, 3020233, 2934980, 2819066, 2711639, 2618069, 2529482, 2438746, 2347647, 2269400, 2215744, 2156558, 2110874, 2074195, 2038225, 1998608, 1954306, 1899702, 1824141, 1746719, 1683287, 1625675, 1585646, 1537004]
7514A537004n4184m4117l7353k8528l2078l0371l3405k5928j5527m829N580p805
7502A228459l213J9088J6187M0756P8999J14388J60135J98573J66586R1549L3937
7491B145444r154m8787r2127j55047j97805j83332j63130j33890j00789q0103
7481I81280p6451o3108m2291l5332j6548l3751m3674p456l840n356l0786k7592
7469E95095k2822k3484k7582k0029j7748k8052l631q797j66J3209j819p491m400
7456D42283J4920l39j9093k6726k489j4527j2015j0703k1983k293N718m219l608
7443C44926j2382k392M860L940m876N265q373q499Q086M38r57j0190j6509l187
7429C00150J236j2205o764K778J4070j0793r138j0352J14N137j4065J0684R886
$$ y = [1537004, 1482820, 1438703, 1401350, 1372822, 1340744, 1310373, 1276968, 1251040, 1235513, 1230684, 1236264, 1228459, 1225246, 1244334, 1260521, 1301277, 1380276, 1494664, 1654799, 1853372, 2019958, 2111507, 2145444, 2136290, 2087503, 1995376, 1840329, 1642524, 1459192, 1296062, 1162172, 1061383, 981280, 904829, 841721, 799430, 764098, 747550, 713799, 670125, 662669, 658829, 653473, 622687, 595095, 572273, 548789, 521207, 501178, 483430, 455378, 451747, 442950, 442784, 455993, 454174, 446683, 442283, 457203, 456864, 437771, 411045, 408556, 394029, 382014, 371311, 349328, 347035, 352753, 348534, 344926, 332544, 330152, 335012, 338952, 334076, 339341, 330968, 322469, 330555, 330993, 330036, 319846, 303337, 300150, 301386, 289181, 282417, 285195, 299265, 288472, 279334, 268982, 269096, 274233, 260168, 270852, 280738]
7416B80738o115J3914K942j0428o71M344R119j850K1257j0600q300j8730j6076
7403B59544l069O60l127R334P177p716j1732J732r917J766r795k082P808N436
7389B46019o351j0644L122J0027k19p391L909K462j8303L046j5847p344L675J345
7375B07506j0584k4402p456J176J0056j427L910o306k456j382n793K154j329K59
7361A63926j097N866l343J1007o228m708r935J2111O511k226O054J5136Q489J466
7347B03029p463R72J1779P5j4553m576P216L675l860q610K499p413m845p234J3152
7332A83843O761J595J538K7600J7642J7078P334k895J0430L651n337J6023K3436
7319C08699N505J7042L6197K2348Q731K7557J1261J3786Q096J4276K7190K4404
$$ y = [280738, 274623, 288537, 291479, 281051, 280380, 284724, 293843, 291993, 313250, 302650, 294350, 275620, 259544, 256475, 257135, 254008, 263342, 270519, 262803, 251071, 252803, 242886, 244652, 234857, 232775, 240583, 246019, 239668, 229024, 232146, 242173, 241954, 234563, 238472, 240934, 222631, 225677, 209830, 202486, 206161, 207506, 196922, 172520, 165064, 166240, 176296, 174869, 178779, 172473, 170017, 168635, 162842, 164996, 163667, 163926, 162829, 168695, 165352, 176359, 170131, 165423, 155488, 167599, 174110, 171884, 177938, 193074, 201563, 203029, 195566, 196538, 208317, 208392, 193839, 189263, 196479, 200154, 196294, 187684, 190183, 182770, 177925, 170691, 183843, 190604, 192199, 193737, 221337, 238979, 256057, 263391, 260496, 270926, 274577, 269240, 285263, 308699, 314204, 331246, 367443, 389791, 398522, 426079, 437340, 451126, 459222, 473498, 500688, 525092]
7307E25092Q318q860j0411K305j9650j4701j6965k9645m4137m6385l4268j5376
7295B95317j3571j7120j4557j5457j1872O401j854O172P367N083P077J0733m636
7282B59083m442R078N861l103j4732k6440r906p927p851j3572j1789k4745r821
7269A39694K727L180j9913J892J0905j1115r54m287j090L412k248R30r658L126
7255A16601Q419j0920q855J3069M172j6582q231L655J6448l456K58Q529P822k334
7241A28595K185M526k635l035R916o324j2203k459o70L028j127J9618K2144J2437
7227A73996J3175K28J971J4318N64J224J3365o452M499n557m883k306r987o557
7213A87598r779L521l355j3898L934N053J967K85J382r060M961Q441K0765J253
$$ y = [525092, 533410, 524550, 514139, 516444, 496794, 482093, 465128, 435483, 391346, 344961, 310693, 295317, 281746, 264626, 250069, 234612, 222740, 229141, 227287, 233459, 240826, 245909, 252986, 263719, 259083, 254641, 263719, 269580, 266477, 251745, 225305, 215399, 207472, 199621, 186049, 174260, 149515, 139694, 142421, 145601, 125688, 127580, 138485, 127370, 126416, 122129, 121039, 124451, 122203, 123133, 113475, 116601, 125020, 114100, 105245, 118314, 122486, 105904, 97673, 101328, 117776, 114320, 114578, 123107, 130929, 128595, 130780, 135306, 132671, 129636, 139552, 133228, 121025, 118566, 117896, 120924, 119797, 139415, 161559, 173996, 187171, 187399, 189370, 203688, 204252, 205476, 218841, 212389, 216888, 211331, 206448, 204142, 194155, 187598, 177819, 181340, 177985, 164087, 168021, 173074, 175041, 175326, 176708, 167648, 172609, 181050, 201815, 203068]
7199B03068Q147K7677n06j3274K793j440k1951j1525j2144j5149k0634k2837j3834
7186A08391j0125N188o223m909N774M6K611l571m291k041J5410J5226L63l706
7172A18143N273J5437J7396J9134L1306L8334K4611J5467J5440K2483M524J604
7160C29152J2624L428J5483N417j6734j1014n749p910r192k2781k2689j6555r023
7147B44457l52J5285K4319K0491K7707K6558L7451M1493M4273L4908K8545J7601
7135E62736J6978K5474L9315J6722J2690k174o40K961k476Q102M136R466Q658
7122G01948l79K450r639j2367j3007j3374k9906k1001k4878j5704j5987R016J6476
7109E73648J0810P757M985L017j2628j3827j9325j6805j4668N249R861j8238k7040
$$ y = [203068, 211215, 238892, 238386, 225112, 227905, 226465, 204514, 192989, 180845, 165696, 145062, 122225, 108391, 98266, 103454, 97231, 92322, 98096, 98142, 100753, 97182, 92891, 90850, 106260, 121486, 121849, 118143, 123416, 138853, 156249, 175383, 206689, 245023, 269634, 285101, 300541, 323024, 327548, 329152, 341776, 345204, 360687, 366104, 349370, 338356, 332607, 324697, 315505, 292724, 270035, 253480, 244457, 244105, 259390, 283709, 304200, 331907, 358465, 395916, 437409, 481682, 516590, 545135, 562736, 579714, 605188, 644503, 661225, 673915, 671741, 671101, 674062, 671586, 679688, 683824, 693290, 701948, 701569, 704019, 694380, 682013, 669006, 655632, 625726, 604725, 579847, 564143, 548156, 557172, 573648, 584458, 592215, 597200, 600217, 587589, 573762, 554437, 537632, 522964, 528213, 538074, 519836, 492796]
7096D92796j5651K534j9204l1419k0403k5149k4585o728O069K326P319P715o691
7083C68929j043J855j3956j4018q956k0905j9695k7174j7231j1805l270M947j2693
7070B24985p655K1086K1864q699O992J5161P758j3391q889J0354j0103j6313k2900
7057B20250j3497k3390j8314j7706O02m907K750k814l1056M643J8185M940J4037
7044A53723K3005J1280J2950K1804J5022j297j0568q572q695k5206k2133j7310
7032A44003l4589j2917j5010m5K429m784R17K1786K712l46j854q108l287P48n206
7017H6449q112j6052Q22M356M581J0316K840o843m626o187J973P142K570n533
7003G3696n098m736K048k449j5684Q423j2465r22J0135N394L837m39j2978J645
$$ y = [492796, 477145, 479679, 460475, 429056, 408653, 383504, 358919, 352191, 358260, 360586, 367905, 375620, 368929, 367886, 369741, 355785, 341767, 332811, 311906, 292211, 265037, 247806, 236001, 232731, 237678, 224985, 217330, 238416, 260280, 251581, 258573, 273734, 281492, 268101, 259212, 269566, 259463, 243150, 220250, 206753, 183363, 165049, 147343, 147945, 143038, 145788, 142974, 111918, 116561, 134746, 139686, 153723, 176728, 188008, 200958, 222762, 237784, 236487, 225919, 217347, 208652, 183446, 161313, 144003, 109414, 96497, 81487, 81442, 83871, 79087, 80004, 101790, 104502, 104156, 102302, 94194, 90907, 91655, 86449, 78337, 62285, 63107, 67463, 72044, 82360, 85200, 78357, 73731, 67544, 69517, 76659, 79229, 73696, 68598, 63862, 65910, 63461, 47777, 56200, 43735, 42813, 52948, 58342, 62179, 61740, 48762, 50407]
6989E0407J2790M688J758p780q081K518p541l125J7100J0020q655P333j5358r135
6975D6939M62J0605R23P500J3951P666o743k93q716j3665m99M609P600j4053q397
6960D7889j887k673m069Q170M307N047o521j799M504J3047J652k2747k2412O158
6946B8666R877n570k903J92k718n28R648L185P755o666j7611m152j107j3936Q685
6931A2817J3197K823J241M608M448l551q315k699P703J598J1657q629j204O340
6917D2034o596n844K067K550Q301o646l063k332n936R462j729m156L956J3026
6903D5094l416q283J2491L19j2252m628k951o437N313j401M31n995l006J626L171
6888B0076O971L577q735l589J668L87n2Q826l19N307n889r764j2565J152P552
$$ y = [50407, 63197, 67885, 69643, 61863, 53782, 56300, 48759, 45634, 62734, 72754, 64099, 71432, 56074, 46939, 47401, 58006, 58929, 66429, 80380, 88046, 81303, 81010, 72294, 58629, 58130, 62739, 70339, 56286, 47889, 46002, 43329, 39260, 47430, 51737, 56784, 50263, 48464, 52968, 66015, 67667, 44920, 22508, 28666, 38543, 32973, 30070, 30262, 27544, 27016, 36664, 39849, 47604, 40938, 23327, 19175, 18068, 4132, 12817, 26014, 28837, 30078, 34686, 39134, 35583, 27268, 24569, 32272, 33870, 45527, 36898, 35694, 42034, 35438, 29594, 31661, 34211, 42512, 35866, 32803, 30471, 24535, 33997, 32268, 28112, 32068, 45094, 41678, 33395, 45886, 46205, 33953, 29325, 26374, 19937, 25250, 23849, 24280, 18285, 15279, 16905, 20076, 27047, 30624, 21889, 18300, 19968, 20355, 20303, 29129, 28810, 34117, 28228, 18464, 5899, 7051, 14603]
6873A4603K85n704r4J2315Q296O322Q815K451j1511Q749Q324J0512M800j139J2107
6858G9131N295q262J3728j22k5530j7680J819P986k1048k620o949l685P07J38
6844B2908r78p315k291j0729m083J1245J1021m1j353j2596P073J0102J2137l75
6830C4725j1124N012P514r077j0155q096J7339J3397k308p253K213N290j316k945
6816C3216j6380k377R262Q367R046k591j5626o364q944k422J2098J5224M54J4496
6802D7459l002p11q61q880j4886j6826J8386O055O431m159p291l103K241j787
6788A9066L364K900N203j0732o029R069j2821l400N153r132j494J7070J62m850
6774A3529J0323K988p881k699m768O922K780K3097L267q959o623j5432Q54P424
$$ y = [14603, 14888, 9184, 9090, 21405, 29701, 36023, 44838, 47289, 35778, 44527, 52851, 63363, 68163, 67024, 79131, 84426, 76164, 89892, 89770, 64240, 46560, 48379, 56365, 35317, 32697, 25748, 22063, 22770, 22908, 21930, 14615, 12324, 1595, -2488, 8757, 19778, 19737, 18384, 5788, 12861, 22963, 35100, 34725, 23601, 28613, 36127, 27050, 16895, 8799, 26138, 39535, 37227, 29974, 32187, 37477, 36161, 33216, 16836, 14459, 23721, 32088, 41134, 38543, 22917, 16553, 7609, 5187, 17285, 32509, 32963, 47459, 44457, 43746, 42885, 34005, 19119, 2293, 20679, 26734, 33165, 29006, 21715, 18612, 20853, 19066, 22430, 25330, 30533, 19801, 13772, 22841, 10020, 6620, 11773, 2641, 1147, 18217, 18379, 13529, 23852, 26840, 18959, 16260, 11492, 18414, 21194, 44291, 47558, 38599, 31976, 16544, 17398, 24822]
6760B4822j300N010j074p500Q66k026j3327j3327P075J662K052O751k120k296
6746E268Q76j3711o332J7541K9621K02r229n750j964k094o785O635N922j0539
6732I661j9162q049k963o503R749o627J2966K8644J0411M835p119j6872k109o795
6718F7k075j0601J2235j0957K773M915n813P965R159l970K82L507J3224l58L089
6703B3442r045J6272J5533k161J724q358l165j384R960K2927l0j6147k1362j7941
6689A0265j8869J55m499o146P76M695R684j931j0586O228J9579M34j7551M673
6675c093O654L763J439N425j129Q544j1756q880j105j928K646R933L246N786J251
6660B0796M069J1862N9j9014j1334j4971J318P681r898k368Q456N620M236J1260
$$ y = [24822, 23522, 28532, 27458, 19958, 20824, 18798, 5471, -7856, -781, 881, 2933, 9684, 7564, 5268, 6144, -7567, -13899, 3642, 33263, 33465, 24236, 18486, 16522, 14428, 7643, 14278, 20200, 9661, -9501, -17550, -20513, -27016, -17267, -23894, -10928, 17716, 28127, 32962, 25843, 8971, 6862, 67, -2008, -12609, -374, -11331, -8558, -3643, -9456, -1491, 7668, 3698, 3980, 7487, 20711, 20353, 23442, 14397, 30669, 46202, 44041, 45765, 37407, 34242, 32858, 42818, 65745, 65715, 49568, 28206, 10265, -8604, -8449, -12948, -19094, -18318, -13623, -3939, -5870, -16456, -10228, 9351, 9785, -7766, -3093, 3561, 7324, 8763, 14188, 13059, 21603, 9847, 967, -138, -2066, 580, 10513, 13759, 19545, 20796, 24865, 36727, 36786, 17772, 6438, -8533, -7215, 466, -9432, -11800, -3344, 2276, 6512, 17772]
6646A7772N771l235o374m353k850N307l950l777P09j944J340O352O80n556r382
6631c490M096p173o21N896R964r86j515L741J5502P825N026K568j8533p178J0004
6616B5126K38j3977p510J66O693j1444p048P178j21J6257o545m487J7073n966
6602A5633j1383l362m793M870j9622J003R385N628L34M084n463p149M352K0011
6588A3528M168o383j0851J6365K3293M800r752o038n136o817j41m952n056o446
6574E82m500M138l55J181O768J938q58N624J554o908L216K469N895J291n161L801
6558B0675M415n453J662J0735l093j5995j3553N061j340l976j0012r353P608O835
6544e784J4548M433j1885j5264o386L3J0549K673q274l955J4301q91J2044l289
$$ y = [17772, 23543, 20308, 13934, 9581, 6731, 12038, 8088, 4311, 5020, 3076, 4416, 10768, 11448, 5892, -3490, 606, -6567, -7188, -1292, 8672, 7686, 6171, 9912, 25414, 33239, 38265, 40833, 22300, 15122, 25126, 25364, 11387, 3877, 4043, 10736, -708, -7756, -578, -699, 15558, 9013, 4526, 21599, 15633, 4250, 888, -3905, 965, -18657, -17654, -8269, -2641, -2307, 1777, -3686, -10835, -6483, 13528, 17696, 11313, 462, 16827, 40120, 44920, 35168, 29130, 23994, 17177, 17036, 12084, 7028, 582, -3918, 220, -135, 1046, 7814, 9752, 8894, 14518, 16072, 9164, 12380, 14849, 20744, 22035, 16874, 20675, 25090, 19637, 21299, 32034, 28941, 12946, -607, 4454, 3114, -862, -10874, -20227, -12619, -5784, 8764, 13197, 1312, -13952, -20338, -20305, -9756, -7083, -15357, -19312, -5011, -5902, 6142, 2853]
6530B853q620r310L343Q38O584J1633N517o640q518j8105J468J1581q6Q602M845
6515E985L291P486O888L049j8829k41m853R14K379N771j7901o370J3443j247q920
6500i155j2203J3753Q827j199l52j0086j296M653q82o475L119J2105L988P87J490
6485G074N472k642q728m956r53Q086K6011N704n045k3158p726l508j3853j8926
6471c7148m196K5857J4906J4191J5751j98l665m175n589o481m169P18n297o168
6457e663M140j892p667r07J2409j024r837l948M690j36J0658J104N243n110k536
6442d76n026j915N666R416J2497o970m980j752m533j5344j1734O40M585O769J3406
6427B49k167r053J732j0467n680P059K895N888N523K4864l601j708K304Q78N085
$$ y = [2853, -5767, -15077, -11734, -10896, -4312, 7321, 12838, 6198, -2320, -20425, -18957, -7376, -7462, 1140, 5985, 9276, 16762, 23650, 26699, 7870, 7629, 2776, 3690, 6069, 11840, -6061, -12431, 1012, -235, -9155, -21358, -7605, 1222, 23, -329, -10415, -11711, -7058, -7940, -14415, -11296, 809, 4797, 5584, 7074, 12546, 9904, 1176, -3780, -4733, 3353, 29364, 35068, 30023, 6865, -861, -4369, -18222, -37148, -41344, -15487, -581, 13610, 29361, 29163, 25498, 21323, 15734, 9253, 5084, 5802, 505, -5663, -1523, -3415, -11082, -11989, 420, -604, -10441, -14389, -9699, -9835, 823, 1927, 7170, 2060, -476, -5502, -7417, -1751, 7665, 20162, 13192, 8212, 6460, 1927, -13417, -25151, -24511, -19926, -13157, 249, -1918, -10971, -9239, -19706, -25386, -18327, -15432, -9544, -4021, 20843, 17242, 15534, 17838, 18716, 23801]
6412B3801j4017o916N20P584L200k688q003N990j76o061j123r495J8638J6362
6398B7616O727J1570J887n323j2398j1600j0664j791L067j0463l16J960k474J0664
6384H462L970n556o993L988O895O506n448j2961M798N551M084j3567J589J7108
6370A8426J945p978L044n572K325P463j1179J099O100j0829K568N693J507L767
6356A8379r32J3141K622j9950j3161n889k588K551Q156l688L942q16p08m38Q380
6341I001n963K55j717p940p373Q897Q166J46q292k466K472J8205J2759n924n173
6326A5053n590p023P112j6372m881L966L337J8467J0569j6554n01P106l323j1227
6312A39j2883M095M901J1912J0738r32o762j894o759k87p973K16k183K767Q784
$$ y = [23801, 9784, 2868, 3388, 10972, 14172, 11484, 3481, 9471, 9295, 3234, 2111, -7384, 11254, 27616, 34343, 45913, 47800, 42477, 30079, 18479, 7815, 6024, 9091, -1372, -1688, 272, -2202, 8462, 12432, 6876, -117, 3871, 10766, 17272, 11824, -1137, 3661, 9212, 13296, -271, 1318, 18426, 20371, 12393, 15437, 9865, 12190, 19653, 8474, 9573, 15673, 4844, 7412, 13105, 14612, 18379, 17447, 30588, 33210, 13260, 99, -5790, -8378, -5827, 2329, -1359, 2583, 1767, 1059, 621, 9001, 3038, 3293, 1576, -6364, -13737, -4840, 3326, 3472, -4820, -7286, -4814, 13391, 26150, 20226, 15053, 9463, 2440, 9552, -6820, -11701, -7735, -4398, 14069, 24638, 8084, 7583, 14689, 11366, 139, -12744, -8649, -3748, 8164, 18902, 17970, 11208, 9314, 2555, 2268, -5705, -5489, -7672, -4905, 3879]
6297C879J4504K934J8900q30j2472r396j0304l44J898N821N59m871M86R683l66
6282B0081j1550N31L733O13n257j0938J785m898o553M786P251j244Q409n395J578
6267B932R623p752o926n379k594J561k907J1851j140K945L706m279q794m374J4287
6252B760J1912K133q543r909l456R215n774o371J1440K105j240q434M686J0774
6238A1298J2956N5j1755j6214P887o926o90P391J0023m293L237j4034j8542j878
6224b1485K2191P449j1911O009P514j0912j1241N645j322p385q586L460r87J2463
6210i098Q927N966P500j7300q636r057L121J2960J0588M080P825j1635j3389k115
6196a0263Q758J5387L547j1299j4313k840Q850O667m009o213k618j8859j2983
$$ y = [3879, 18383, 21317, 40217, 39387, 26915, 17519, 7215, 6871, 8769, 14590, 15149, 10278, 10764, 20447, 20081, 8531, 9062, 12795, 13408, 8151, -2787, -1002, -5900, -12453, -7667, -416, -1660, 6749, 1354, 2932, 12555, 4803, -2123, -7502, -10096, -8535, -11442, 409, -731, 2214, 5920, 1641, -7153, -11527, 2760, 14672, 16805, 8262, -1647, -5103, 4112, -1662, -8033, 3407, 5512, 4272, -4162, 524, 11298, 24254, 24309, 12554, -3660, 4227, -2699, -3389, 4002, 14025, 9732, 12969, -1065, -19607, -21485, 706, 8155, -3756, 2253, 9767, -1145, -12386, -6741, -8063, -15448, -24034, -20574, -21561, -9098, -171, 5795, 13295, -4005, -12641, -21698, -18577, -5617, 4971, 9051, 16876, 5241, -8148, -10263, -1505, 13882, 17429, 6130, -8183, -11023, -2173, 4494, 485, -5728, -8346, -27205, -40188]
6183d0188J1011J2820N499j263k701O775J1421p778p174O552J5231R505j1539
6170H171o835N607K993m816o99j4089Q738O397J1793j142Q97k227k0741R66J6596
6155A1609k257l913m014j449L814Q647p086j8200M044M062o131J719J2234J150
6141D229n748n229R093L192m352n444L648q036o046K177J212q982R987J3224j0301
6126g376o261K687n488Q881l44J951J4853O144j6486j0480r480L823k329n741
6112b5646O435J2732j996M338p461O033O825N888J1092l281j3241m649k263l699
6098h893m561L97Q164J1697l601J901J464L606k389j118m934L832p139l462p23
6083e759l605J1610M718L061j0919m298J467O849R893k620r103K650N095o512
$$ y = [-40188, -29177, -16357, -10858, -12121, -14822, -8047, 3374, -4404, -11578, -5026, 10205, 19710, 8171, 1336, 6943, 9936, 5120, 4421, -9668, -930, 5467, 17260, 16118, 17015, 14788, -5953, -4987, 11609, 9352, 5439, 1425, -24, 3790, 12437, 5351, -12849, -8805, -4743, -10874, -9155, 3079, 4229, -1519, -6748, 2345, 5537, 1185, -4259, -611, -8647, -14693, -12516, -11304, -20286, -10299, 2925, -7376, -13637, -10950, -16438, -7557, -7901, -5950, 8903, 15047, -1439, -11919, -21399, -17576, -19905, -25646, -19211, -6479, -8475, -4137, -11598, -5565, 1260, 7148, 18240, 14959, 1718, -2931, -5194, -8893, -13454, -13057, -4893, 6804, 3203, 5104, 6568, 10174, 7785, 6667, 1733, 5565, -1574, -5036, -5759, -9364, 2246, 6964, 10025, -894, -5192, -3725, 3124, 13017, 10397, 1294, 3944, 9039, 2527]
6069B527q260L131R626R45q352n229J5001J1500j5389J8987K375K894p170j7643
6055D943K343O826J5530q878j5387o259j19n796m249K07R005l330L417O560L892
6040H705p832m425r10j3339m283J933K282p881M556J3728M142L159j2789q139
6026b1093P056p026J516R86K575K319J445J253R434l515r153k135N415O599M311
6011a3m704M392J0801r891p768J0334l385l645J3341J1013j2392j1359j3884k664
5997a9824Q131J2802Q234k630K03r202r910M021M257K385J5363J689j1275q615
5983d371r651r414K608J0340k449J930J6260l124p767k0497j1274R971K1134Q608
5969B304l034j974l076L331l292O566N761J5383K282m282k2071q692J864r105
$$ y = [2527, -5733, -2602, 7024, 7969, -383, -5612, 9389, 20889, 5500, 24487, 26862, 29756, 22586, 4943, 7286, 14112, 29642, 20764, 5377, -882, -1001, -6797, -11046, -10839, -1834, -5164, -1747, 4813, 8705, 873, -3552, -4462, -17801, -22084, -20151, -17869, -25750, -21194, -7466, -3324, -165, -12954, -21093, -14037, -21063, -19547, -18561, -15986, -13667, -12222, -10969, -1535, -5050, -14203, -16338, -10923, -4324, -13, -4717, -325, 10476, 585, -7183, 3151, -234, -3879, 9462, 20475, 8083, -3276, -17160, -19824, -11693, 1109, 9343, 6713, 6916, -2286, -12196, -8175, -3918, -1533, 13830, 15519, 4244, -4371, -14022, -23436, -20828, -10488, -12937, -11007, 5253, 2129, -5638, -26135, -37409, -27438, -6304, 2304, -730, -2704, -5780, -2449, -5741, 825, 6586, 21969, 24251, 19969, -2102, -10794, -8930, -18035]
5955a8035j3616R397J3281o873P525M381j7535j353J2854J7871J1077R067r220
5942A8821q213J2669M016m707j1888j0338L963M898q472p907q531q113p9J7155
5928f726N386K433M831J947q654K692l034m519O205J1007j1152j2322L74M194
5914g338K520J513K487j947Q117l112j3681n233r713M027l468l631J643M527K140
5899b1149Q299j0049L747J2594Q190m055m128j2102q346R481J4449J246K99J8254
5885A6730L761O70Q883j2136j9751j7357j332k290l647J4119J4611j206K714m965
5871a196q729O101P836J3182r345l655J1528j3156q376R410J348O000o734p214
5857c000K077k3974L029K2359K379m113L380j427j1515j6197j1180J3667Q825
$$ y = [-18035, -31651, -22254, -8973, -15846, -8321, -3940, -21475, -22828, -9974, 7897, 18974, 28041, 18821, 10608, 23277, 27293, 22586, 10698, 360, 4323, 9221, 749, -7158, -15689, -23802, -23881, -6726, -1340, 1093, 5924, 7871, -783, 1909, -1125, -5644, 561, 11568, 416, -11906, -11532, -7338, -4818, -3305, -818, -2765, 5352, 2240, -11441, -16674, -26387, -22360, -25828, -29459, -27816, -23289, -21149, -12850, -22899, -19152, -6558, 1632, -2423, -6551, -18653, -26999, -17518, -3069, -1823, -1524, 16730, 20491, 21161, 30044, 17908, -1843, -19200, -20532, -22822, -26469, -12350, 2261, 1055, 3769, -1196, -9925, -3824, 4012, 17194, 7849, 4194, 15722, 2566, -5810, 3600, 4948, 10948, 4214, -3000, -923, -24897, -21868, 491, 2870, -1243, 2137, 710, -10805, -27002, -38182, -24515, -15690]
5844a5690K074o16L19P984J0276O971M183R120q192m528P82O236J0291r944J034
5829B0300P232j2517q860k802l97M496n315K043Q131p792n508Q450l179k676j5199
5814a3593l492N479L587L016R49m998M150j308J0824J0498q740n050L10J59J215
5799C006l50R950N352j7062N592J0196o27L276n986q166n50O951r943p710O771
5784G00j0962k363N174o924L110O264j4665J1899J1594n129r681N507P219j4900
5770a3157o554m102R33J3635k281r974j4923J0056K7123K1387K159N949l347j5249
5756A1655j6645j0820M022J7192m126m077l279K54k17R370N245j4703j2452N023
5742a3558R272r203K176P629R634R148J660k14r052r277K441J4328j7675k516
$$ y = [-15690, -13616, -14232, -13913, -5929, 4347, 11318, 15501, 24621, 16429, 11901, 12683, 18919, 29210, 19266, 20300, 27532, 15015, 6155, 3353, 2956, 7452, 2137, 4180, 12311, 4519, -989, 7461, 4282, 1606, -13593, -17085, -11606, -8019, -5003, -4054, -9052, -4902, -6210, 4614, 15112, 6372, 1322, 1632, 1791, 3006, 2656, 12606, 17958, 896, 6488, 16684, 16057, 19333, 13347, 5181, 4631, 11582, 1639, -6071, 700, -10262, -12625, -7451, -14375, -11265, -5001, -19666, -7767, 3827, -1302, -10983, -5476, 1743, -13157, -19711, -23813, -22880, -9245, -11526, -21500, -36423, -26367, 756, 22143, 24302, 30251, 26904, 11655, -4990, -15810, -11788, 5404, 1278, -2799, -6078, -5824, -6041, 3329, 8574, -6129, -18581, -13558, -4286, -13489, -11313, -3684, 5950, 15098, 16758, 16544, 7492, -1785, 656, 14984, -2691, -5207]
5728e207K648Q884K717j672p134N062j644P653j4333j0330O069K483O552N546
5714G294M291o594O683M91k32m338j236K649J018K129j0561L120n801j1894j4422
5699b7403J2136J6616J0147j120Q593J1062J255k0119p398L551K796K979M215
5686A7310j110l339P57P315j8020j2425k195Q62J4423j1345k2323L578P610m108
5672b3010J4457J1332N874l106p297p437j007N101L435P673K534k076j1270o487
5658a1284j0042N177J3652n556q261k379J6099J0108j7162r199K627J4451J5839
5645A4070M766j2549k389p96R37m646J3535J0215j5574j1983M619O986M761q553
5631C399l283k136P095L69o659Q206L113j7951r396M049J3334k073q088k274M33
$$ y = [-5207, -2559, 6325, 9042, 7370, 236, 5298, 3654, 11307, -3026, -13356, -7287, -4804, 1748, 7294, 11585, 4991, 11674, 12165, 11933, 7595, 6359, 9008, 10026, 12155, 1594, 4714, -1087, -12981, -27403, -15267, 1349, 11496, 10376, 18969, 30031, 31286, 11167, 3769, 7320, 10116, 13095, 17310, 16200, 12861, 13618, 20933, 2913, -9512, -11707, -10845, 3578, -7767, -30090, -26512, -18902, -23010, -8553, 2779, 8653, 5547, -1750, -9187, -10194, -5093, -1658, 6015, 8549, 6473, -4797, -11284, -21326, -16149, -2497, -8053, -16314, -18693, -2594, 7514, -9648, -18847, -16220, -1769, 14070, 18836, 6287, 3898, 3102, 4039, -607, 12928, 23143, 7569, -4414, 205, 7191, 11952, 3399, 116, -2020, 5075, 5444, -1215, 6991, 10104, -7847, -17243, -13194, 140, -1933, -10021, -12295, -11862]
5616a1862Q263L584M467K269n846p736j3927N700K140J978N348l29Q876O003J3107
5601B2035N41k183j6600j1545j144J840J0215M593K523N151j1833l644N209k008
5587C150O011j891j7160m112P539q246O181N943j2054p647Q239J3023M316j4281
5573a0989l325j939J6480j265l688L733j8699J446J4449J0389P598p244j923o223
5559a200O308j28L343k930q122j1942m409L213j859k632M61J670J601J0976J4987
5544I337P263j3244m850N900m696j1649J542r943R223L876J439O747j129l301
5530c485M040L235R355p307j8073p147P83K132M171m20m947P451k592m375L612
5515a3567M499J0957J1176j0401j2095Q45J3087L729j9197m829m549l254J0084
$$ y = [-11862, -3599, -15, 4452, 6721, 875, -6861, -20788, -15088, -12948, -10970, -5622, -5951, 2925, 8928, 22035, 22576, 20393, 3793, -7752, -8896, -7056, 3159, 7752, 10275, 15426, 3593, -51, 5158, 3150, 9161, 7270, -9890, -14002, -6463, -14709, -8528, -2585, -14639, -22286, -14047, -1024, 3292, -10989, -14314, -16253, 227, -1038, -4726, -993, -19692, -18246, -3797, 6592, 14190, 6946, 5023, -1200, 5108, 4980, 8323, 5393, -2729, -14671, -19080, -15867, -17726, -20358, -19897, -18227, -16626, -5650, 9337, 16600, 3356, -1494, 4406, -290, -11939, -10397, -20340, -11117, -7241, -5802, 945, -184, -3485, 555, 3790, 13145, 5838, -12235, -19382, -18599, -16467, -12296, -12716, -17663, -10212, -12804, -17179, -13567, -9068, 1889, 13065, 2664, -9431, -8586, 4501, 8230, -10967, -15796, -20345, -23599, -13515]
5502a3515J0741j0109o781L379O739P450j0350P476J405k140p716P986P039J264
5488B868Q490j3653n564j125L046l017J2616K272k0958M254l075R325M619L884
5474C982P01j1357l03j2390R207M783j814k254o023k653q137J1443J3226J946
5460C57L122L614r376k525J797j4133j2183P456M566K564K335n404O266M370R300
5445B126P818k4657k2704M14J7119M847R431k407m311J6520L155j4432j3828o885
5431b7794J1987M157m254j121m348J6186k260J079K485j750j569J1186R388r232
5417D140j0853m565Q076J2731j372j4131N134N592J2620j3431k1299k0795J5812
5404b2341O444p571R484M699K474q063j788q864J2372p22M07O300N131P845o70
$$ y = [-13515, -2774, -12883, -19664, -16285, -9546, -2096, -12446, -4970, -3565, -5705, -13421, -5435, 1604, 2868, 11358, -2295, -7859, -8984, -5938, -8955, 3661, 5933, -15025, -10771, -13846, -4521, 98, 3982, 4683, -6674, -6977, -19367, -10160, -5377, -7191, -9445, -15468, -18121, -26258, -14815, -1589, 357, 3479, 7093, -2283, -4808, -3011, -17144, -29327, -21871, -17305, -14741, -12406, -17810, -11544, -7174, 2126, 9944, -14713, -37417, -37003, -19884, -15037, -5606, -8013, -12324, 4196, 7351, -7081, -20909, -27794, -15807, -11650, -15904, -17025, -21373, -5187, -7447, -6368, -3883, -5633, -7202, 3984, 13372, 4140, -6713, -11278, -3202, 9529, 8157, -5974, -840, 4752, 17372, 3941, -17358, -38153, -22341, -15897, -23468, -13984, -9285, -6811, -14874, -16662, -25526, -13154, -13876, -13469, -7169, -2038, 5807, 5137]
5389E137M853l00P656p355k403O863n706p391o697J356K324J4671O518j1743j5007
5374g224n848m46M788M167R605J082n627M498r742n124J4192J2559r159j1212
5360c491P865L295o174j0378p053J8537P717m961m046L469j1847m178J0423m356
5346e178m820J7385J1440K484j6543L52P732m023k952J2978p263j1682l062N667
5332B515r180q639j573l281J931P095J9182K0465j57n443q439r550J1387N562
5318B1875j4469n985Q036N311j1181j0074m422R147K359q678L340L266k283o317
5304a0075j664q99J0122J009m032P462j206k997j4551l303J256n836p400J8949
5290a3165J8210n188r39K024l055K055n45r782J174R930l003J5223L948j4058
$$ y = [5137, 9990, 9690, 17346, 9991, 7588, 14451, 8745, 1354, -5343, -3987, -1663, 13008, 19526, 7783, -7224, -13072, -13518, -8730, -4563, 5042, 6124, 497, 4995, -4747, -9871, 4321, 16880, 7721, -3491, 4374, 7669, 1495, -8883, -15936, 2601, 10318, 5357, 1311, 4780, -7067, -11245, -822, -5178, -9998, 7387, 18827, 21311, 4768, 5120, 12852, 8829, 5877, 18855, 11592, -90, -3152, 2515, -6665, -15304, -16877, -20158, -18227, -11132, 8050, 28515, 28358, 22915, 14476, 4926, 16313, 21875, 7406, 1421, 9457, 14768, 3587, -6487, -10909, -1762, 597, -8081, -4741, -1475, -3758, -10075, -11739, -12638, -2516, -1507, -5539, 1923, 717, -2280, -16831, -20134, -18878, -24714, -32114, -13165, 5045, -143, -1082, 942, -2113, -58, -603, -10385, -9211, 719, -2284, 12939, 16887, 2829]
5276B829r890n478K963P544n354o11L790j0327j83L078m80J5934J2961R909n148
5261B1537j5671K558J4999r596j96j1476n038J2050K026j408j4171J3J6454K762
5247A4843j4930R317L126j2630j8028J3033J6638j716j0033r732l65j3872Q244
5234a6105K844r351p062O946N482K743n171M192J121k186N644J78J464P063R481
5219G283Q918OP25l743j3366l812N979l914l089J4031J0437r217q950r685K855
5204e542q83O237J0146K96M752j881j3758K98J4415L044L290k962J159M343j2724
5189A0230j5496O451K6100q249j9082K631l63j7523K50R276Q319P713N073k518
5175A2812N998k237j288q82l870j6636j0842j1445N441P466K284J1553J5693R160
$$ y = [2829, -7061, -12539, -9576, -2032, -7386, -7997, -4207, -14534, -14717, -11639, -12119, 3815, 16776, 26685, 21537, 5866, 8424, 23423, 13827, 13631, 2155, -2883, 9167, 11193, 9785, -4386, -4373, 12081, 14843, -87, 9230, 12356, -274, -18302, -5269, 11369, 9653, -380, -10112, -10477, -24349, -16105, -13261, -22612, -29674, -22728, -17246, -14503, -19674, -15482, -14361, -16547, -10903, -10725, -9261, -2198, 7283, 16201, 16207, 16932, 13189, -177, -3989, 1990, -1924, -5013, 9018, 19455, 10238, 1288, -8397, -5542, -6425, -188, 9958, 10254, 15006, 13125, -633, -335, 14080, 17124, 20414, 17452, 18611, 22954, 10230, -5266, 1185, 27285, 19036, -46, 2585, 2222, -15301, -15051, -5775, 2544, 10257, 15330, 12812, 18810, 16573, 15285, 14403, 10533, -6103, -16945, -28390, -22949, -15483, -13199, -1646, 14047, 23207]
5161B3207l186j3276p087N019Q164p32j8317j1336L461K407J7074L634r038o680
5147f686M889k641K25n305J2568P905J0295n564j0798l519r270J1085R481J5484
5133B8149L873j3021j2835j0459l750k007L400J6552R386o248j4320j0117r625
5120b1022J0360J2625j2535j954N160J1041j3961j7557J8578M004M290L16p809
5107h464m15r51j301O034l178r25K770J073J2364q52k415m616q522L746J1285
5092E633N319l487M810m676Q15j672k380J2600J5077o023j0590m807J112o495
5078E236j8365O15K340Q692R996j6130o347K330m847J054L424P728m675q607L075
5063a4481O851O736j673l723j0801N258M158J4348J2284J659k795k95k740j1297
$$ y = [23207, 20021, 6745, -342, 4677, 12841, 12109, -6208, -17544, -14083, -11676, 5398, 9032, -6, -6686, -1797, -4438, -4213, -9518, 3050, 10955, 21250, 15686, 4888, 1369, -7901, 3184, 12665, 28149, 32022, 19001, 6166, -4293, -8043, -10050, -6650, 9902, 19288, 13040, -1280, -11397, -21022, -10662, 1963, -10572, -12526, -7366, 3675, -10286, -27843, -9265, -5261, -971, -655, -8464, -8879, -9830, -11131, -5097, -8275, -9200, -6430, -5357, 7007, 6155, 3740, -876, -9398, -5652, 5633, 10952, 7465, 12275, 7599, 8414, 6742, 4362, 16962, 32039, 26016, 15426, 10619, 11731, 5236, -13129, -12514, -10174, -1482, 8514, -7616, -13963, -11633, -16480, -15426, -12002, -4274, -8949, -17556, -14481, -7630, -894, -2567, -6290, -17091, -11833, -7675, 6673, 18957, 20616, 17821, 17526, 14786, 3489]
5049C489n949Q9R355J5204q11j7267q453O965N079L882o96k337J5597Q766j2536
5034B0377j4753L680J3082n535k3703k7387J860K2242R537J252J0455j515j2767
5021c175J511r889o523K703N247n559K457L529r070q87N751m61j1301k219N990
5006b1896J1960O570L177n217j421p774M42J3152N791r493J3092L487j2838N363
4992D395O349r162j400m567J576J5306k331k0250j4071L48J9153J3710M91p932
4978A615o47m077K019M620P23q544n167N005j753J1189J3735m514p352j0507j1615
4963a5270L632P388l129j6628J2233O577j216R30L606J3535J1656L675o340m419
4949A6230k016k109j1108J594k508M785l302O96k126j0441N611J7495J2394M09
$$ y = [3489, -2460, -2371, 6984, 22188, 21377, 4110, -4343, 2622, 7701, 11583, 10887, 8550, 24147, 32913, 20377, 5624, 9304, 22386, 16851, -6852, -34239, -32379, -10137, -600, 652, 11107, 9592, -3175, -1664, -11553, -18076, -15373, -10126, -15685, -13228, -9699, -18769, -19656, -13905, -14366, -25667, -27886, -21896, -9936, -3366, -189, -5406, -6827, -14601, -14159, -1007, 4784, -4709, 8383, 11870, -968, 4395, 10744, 1582, 182, -4385, -2809, 12497, 10166, -10084, -24155, -23807, -4654, 9056, 9547, 1615, 968, -3109, -1090, 3530, 4253, -4291, -9458, -4453, -6206, 4983, 18718, 14204, 6852, -3655, -15270, -11638, -4250, -7379, -24007, -11774, -5197, -6413, -5483, -1877, 11658, 23314, 26989, 20649, 16230, 14214, 12105, 997, 2591, 83, 4868, 1566, 2262, 136, -10305, -4694, 12801, 25195, 25604]
4935B5604j2630N269p42j3678j8518j764J9977n783r945j66Q413K114m629N651
4921h27l786K283j703m782J12J549J106L0J1360O822l141o544o376Q26l762J0174
4905C341J3089p55L279N482o404k0616m858n780m022Q178R717O075n764l561n393
4890g992n303O398J3797N666o381L255k459q282L33n286p441J1310K008J086R745
4875A0454P867J6827m627o046q300j0582M029P286K026k1170j7209L666L761M026
4861g992j691P115K783p589j050N578N420P857J1601j2679j6878j5866K452M354
4847a6585p137q834O640K0244Q574n830L55o141n485r77J655j0214M823P155R85
4832a0772j4331j0777O52R170l38J5958J1276k2877j9740N006J526M98J6149K611
$$ y = [25604, 12974, 18243, 17501, 3823, -14695, -16459, 3518, -2265, -12210, -12376, -3963, -1849, -6478, -827, -4613, -2330, -4033, -8815, -8703, -7154, -6048, -6018, 5342, 12164, 9023, 2479, -3897, -3071, -6833, 3341, 16430, 15675, 18954, 24436, 18032, -2584, -7442, -13222, -17244, -9066, 651, 6726, 962, -2599, -7992, -13295, -6897, 6900, 12566, 6185, 9440, 6981, -1301, -968, -6254, -13695, -2385, -377, 709, 10454, 18321, 35148, 30521, 24475, 16175, 5593, 9622, 16908, 18934, -2236, -19445, -15779, -12018, -7992, -9683, -2568, 215, -7374, -8424, -2846, 2574, 10431, 22032, 9353, -7525, -23391, -20939, -16585, -23722, -32556, -25916, -5672, 2902, -2928, -2573, -8714, -14199, -15176, -13521, -23735, -18912, -11757, -10772, -25103, -35880, -35228, -26058, -26396, -10438, 838, -22039, -41779, -36773, -35247, -34749, -18600, -15989]
4818a5989Q082L941j977R34q041m215l185m657J8551R078n607r974K406J396O297
4803b960M984Q357j13n282P915p274J807j0590J381K582j3684Q939p506m077J0705
4788d816J564J4950j2901j815M976j4421j0522P577L019J7597R638p970o717J80
4774C39j100n282r465n912j91r44p96J6105L799N743l249M438K990r705M567J0068
4758A1405p54J2278r677k9382K476P743P01n236K280K301q535p523Q218R402l332
4743g635N216N432K6j0127l638J0342k768o193j060r630q656M248J2804k17K439
4728i417J4714k977r596q168O123r048R29L294L1M089q119k002j0750j1338R92
4713d1243R431M878o431L592Q715N639R705j0905L994J1962O179L120R234L854
$$ y = [-15989, -7907, -3966, -5943, -5009, -13050, -17265, -20450, -25107, -6556, 2522, -3085, -13059, -10653, -9257, -2960, 2024, 10381, 10268, 4986, 12901, 5627, 7434, -3156, -1775, 807, -12877, -3938, -11444, -15521, -4816, -3252, 11698, -1203, -3018, 1958, -12463, -22985, -15408, -12389, 5208, 14846, 6876, 159, 339, -761, -6043, -15508, -21420, -21611, -22555, -23351, -7246, -3447, 2296, -953, 3485, 6475, -3230, 1337, 11405, 10651, 22929, 13252, -16130, -13654, -5911, -5210, -10446, -8166, -5865, -14400, -21923, -13705, -4303, -7635, -2419, 3013, 3039, -7088, -10726, -384, -3152, -9345, -10405, -20035, -28691, -24443, -11639, -11856, -9417, 5297, 2320, -7276, -15444, -9321, -18369, -17440, -14146, -14115, -10026, -18145, -20147, -30897, -42235, -41243, -31812, -26934, -33365, -29773, -21058, -15419, -5714, -16619, -12625, -663, 5516, 8636, 17870, 21724]
4699B1724j4917j6717l20n036J2735Q713m298j2931r916N655k533k758M906l507
4685a9200K617J3123N835J004j4287j7812m732J3362O952J7414K843O395j085
4672A2429m833j5311o950J3309j338j4340O361o2l320J5000n589L888J5570n231
4658I583p746l539n594l354J555J1000j843l741m810K876Q133k288n063O948O788
4643H905m225j3657k329J119o396J779J2365O020Q62p995P922J2741l954n14l063
4628I580J768m190N176N782k0751q401O975N687Q327J52L88Q728r950p478L830
4613E623j436p567l070k385m99q855N691J8095o115r555n861J0679K6976O56j0294
4598A2083r15r014n590o240r865J3388J2319o760j1287j036O98R750P297k323
$$ y = [21724, 6807, -9910, -10230, -15266, -2531, 6182, 1884, -11047, -20963, -15308, -17841, -20599, -15693, -19200, -16583, -3460, 2375, 3379, -10908, -28720, -33452, -20090, -13138, 4276, 7119, 13514, 12429, 7596, -7715, -14665, -1356, -2694, -17034, -10673, -10735, -14055, 945, -4644, -756, 14814, 9583, 1837, -1702, -7296, -10650, -9095, 1905, 62, -3679, -8489, -5613, 2520, 232, -4831, 2117, 8905, 4680, -8977, -11306, -10187, -16583, -14804, -2439, 3581, 4443, -3552, 4370, 17111, 13157, 12643, 9580, 11348, 7158, 12334, 18116, -2635, -11036, -4061, 1626, 9953, 10105, 10493, 19221, 9271, 1793, 5623, 4187, -3380, -6450, -8835, -9334, -18189, -12498, 5597, -518, -10073, -15934, -5255, 21721, 22377, 12083, 11168, 2154, -3436, -9676, -19541, -6153, 6166, -594, -11881, -12917, -12219, -2469, 4828, 2505]
4584B505j0226j0888K493m84J1450J2021r516R572M188n560q095L097l351r608
4570a2402k893K615O279Q37N146L640n052K08m750j2898m409o49J4595Q572J961
4555H00j2421J2183J745n258o526o809j0657o482k661k41P594K0122p480o359
4541b2450J8175L159j1Q820J5102n347l504q637p718r552L500m455Q079m534K49
4526i124j10P383k391o690k871k251J427R254j34K845J556J3893j1239j5304Q87
4511a2869O40P17M807J1004m241j7913m136J1462J7946l760l201R526l188r643
4497b849p663R956P220m123o617j3781j1916J638O34J3149J7167R155p30j1725
4483d85N627j75j2537Q731M219o628l872o924j6726J1051J1407J88j0372M841
$$ y = [2505, -7721, -18609, -16116, -16600, -5150, 6871, -2645, 6927, 11115, 5555, -2540, 557, -2794, -12402, -15295, -12680, -6401, -5564, -418, 3222, -1830, -1622, -6372, -19270, -23679, -24328, -9733, -1161, 800, -11621, 562, 2307, -2951, -9477, -16286, -26943, -33425, -36086, -36327, -28733, -8611, -16091, -22450, -4275, -1116, -1127, 7693, 22795, 17448, 13944, 5307, -2411, -11963, -8463, -12918, -4839, -9373, -9124, -9234, -1851, -4242, -10932, -13803, -16054, -14627, -5373, -5507, -2662, -1106, 12787, 1548, -13756, -12869, -12229, -11512, -6705, 4299, 58, -17855, -21991, -10529, 7417, 3657, 456, 9982, 6794, -2849, -10512, -556, 6664, 2541, -4076, -17857, -29773, -28135, -27501, -14352, 2815, 11970, 11240, -485, 5142, 4967, -7570, 1161, 5380, -1248, -5120, -12044, -28770, -17719, -6312, -6124, -16496, -11655]
4469a1655M503O510L61R713m759p289j4661j1361J4801q000m181J8356J4510l670
4455C178j5487j5086o809Q5l674K472J6336l655N246Q702r412J2724O141j474
4441g13J5562r325o747q188m799q46j623L928P984P231J289m375m993N56N259
4426B00O043L341o082k229n601k697R643O155k949j74p142j0288j3066J2964j111
4411a2993K1348K082j5376j0142K280J25Q226P982O91k03r157k916J0474j899
4397E22J5409j298m106J0167p57m036r138J030J0615r057n157m903j0587J1035
4383b61N286p7J1190J9626l355m342L504P139Q6j6163k6789j7381j1880J0442
4369b2975J7628O434k432j137r252n120q45o747j1792J1619J6430l954M584Q180
$$ y = [-11655, -7152, -642, -281, 9432, 4673, -2616, -17277, -28638, -13837, -21837, -26018, -7662, 6848, 3178, -12309, -27395, -34204, -34119, -37793, -35321, -18985, -22640, -17394, -8692, -18104, -5380, 761, -713, 14849, 5524, -1223, -9411, -14210, -15056, -16679, -12751, -4767, 2464, 3753, -622, -5615, -5059, 200, 6243, 9584, 3502, 1273, -4328, -7025, 2618, 8773, 5824, 5650, -1492, -11780, -24846, -11882, -12993, 8355, 10437, -4939, -15081, -12801, -12676, -4450, 3532, 4223, 4020, -5137, -8053, 2421, 522, 15931, 14633, 10527, 20694, 19937, 15901, 6763, 7793, 18408, 9351, 4194, -709, -11296, -261, 5025, 4948, 16138, 35764, 32409, 28067, 31571, 38710, 38796, 22633, -4156, -21537, -33417, -22975, -5347, 1087, -1345, -2482, -11734, -16854, -17699, -24446, -36238, -24619, -8189, -12143, -7559, 621]
4355F21L513l167j1917K402L645L43J1639r550n446o767K064L829J695N318P97
4340i81j6292K095Mr292Q520Q440K519J4642q966k5824M075J2877K1255J0132
4326B3204j3080m498p296M367r019K541J0351l304j9055j4110l018k697O140J8894
4312a0580k927q214J6898J2052j5494j1282N785J4019J4436j4944j5470n541r655
4299c0917J232J0267O731j897N235R865K10m028o810j0139o123J6705J4467J2611
4285A7409o675j087j5731K661j776r876L55j1609R143J0817m55J2692R410K052
4271A7330j2772j0590k97n976J178N490K555n41N833P934m046p009j0174n795
4257a6880J2860P897L491L792k0554p54r702J0598K263p911M668J2284M857j416
$$ y = [621, 4134, 967, -10950, -8548, -4903, -4560, 7079, -2471, -7917, -14684, -12620, -8791, -7096, -1778, -981, -17273, -15178, -15174, -24466, -15946, -7506, -4987, 9655, 689, -25135, -21060, -8183, 13072, 23204, 10124, 5626, -1670, 2697, -6322, -3781, 6570, 3266, -15789, -29899, -32917, -35614, -29474, -10580, -13507, -21721, -4823, 7229, -8265, -19547, -13762, 257, 14693, -251, -15721, -21262, -30917, -29685, -19418, -12687, -14584, -9349, 516, 726, -3302, -10112, -20251, -26374, -9669, 4798, 17409, 10734, 9647, -6084, -3423, -5199, -15075, -14720, -26329, -17186, -6369, -6824, 5868, 15278, 17330, 4558, -6032, -6329, -12305, -11127, -5637, -3082, -3623, 2210, 10144, 6098, -911, -11085, -16880, -4020, 3877, 7368, 11160, -9394, -10148, -19850, -9252, -6989, -14900, -10232, 2052, 6909, 5493]
4243E493k322p697n318m93J854k547o86O966J3848J3367o231o922m658L364m921
4228C097j2322J200L547o243R805O319r107K944L382m394k984l900l138n257J0166
4213f885m298r291L146M942K865J1798j2335j0894P141j141K08J091j97l399P985
4198i264O978j2818j740j1424o316L652K9481K1452j5397O025O406l126o867J2158
4184A9200m448j200j2051j1684j5912o686K0657L1208p612L18M611r41Q236J0092
4170C3788n512r624k1146q866l789R537J0774J0235q164R183J0518p127J344p600
4156A3551p776l698j3130j158o734p495K781O629N053j0393m80O880L33O292o65
4141a0010l007L912l117J535N128n844R834K010m738l921J380M109N066J0304
$$ y = [5493, 3171, -4526, -9844, -10337, -8483, -11030, -11716, -4750, 9098, 22465, 16234, 9312, 4654, 8018, 3097, -9225, -8025, -4478, -10721, -916, 5403, -3704, -760, 2622, -1772, -4756, -8656, -11794, -17051, -6885, -11183, -20474, -17328, -12386, -9521, 2277, -10058, -20952, -13811, -14952, -14744, -13653, -13850, -17249, -9264, -2286, -15104, -16844, -28268, -34584, -30932, -1451, 20001, 4604, 10629, 17035, 13909, 7042, 19200, 14752, 13552, 1501, -10183, -26095, -32781, -12124, 19084, 11472, 11790, 16401, 15460, 23696, 33788, 28276, 18652, -2494, -11360, -15149, -5612, 5162, 15397, 7233, 16416, 26934, 19807, 21151, 13551, 5775, 2077, -11053, -12211, -18945, -26440, -23659, -17030, -11977, -22370, -22850, -15970, -15637, -9345, -10010, -13017, -9105, -12222, -10687, -5559, -11403, -1569, 441, -4297, -8218, -6838, -2729, 2337, 12641]
4127A2641q585j603j084j775M825J821j0991M380k050Q67J6677r473m642k291
4113a283J0884k568q63O500K807k353k0555K403J0703j3489o288p52j1479j742
4099b8075P314P131j0438q47O260r194K17J2294J5877k656p752j1172k398M743
4085a8696O149O656K137P706O427L3R756q454o433p7p781o146L832L1q323N902
4069g281J0869J3269J677l485J0414L838R613j4222j6335m372j491k264r019P025
4055a764L758L099q329m857n7J7680J1450j0447j391J0399J091r383o916j6317
4041a1984r494Q800R063M793m764o998p234J5261K3035L571j8982n815p830R03
4027g675n075o374R29J0423J6659M907p777j0188r984J3962J0679L51j1061O308
$$ y = [12641, 4056, 2453, 1369, -406, 4419, 6240, -4751, -371, -2421, -1554, 15123, 5650, 1008, -1283, 9601, 7033, 6170, 12670, 15477, 13124, -7431, -5028, 5675, -7814, -14102, -14854, -26333, -28075, -20761, -13630, -24068, -24915, -18655, -27849, -27632, -15338, 539, -2117, -9869, -21041, -23439, -18696, -12547, -5891, -3754, 3952, 10379, 10412, 20168, 11714, 5281, 5204, -2577, -8723, -4891, -4860, -13183, -7281, 3588, 16857, 18534, 15049, 25463, 29301, 38914, 24692, 8357, 3985, 2494, 230, -8789, -1764, 1994, 5093, -3236, -8093, -8150, 9530, 20980, 10533, 9142, 19541, 20632, 11249, 4333, -11984, -21478, -12678, -3615, 1178, -3586, -10584, -17818, -2557, 20478, 24049, 5067, -748, -8578, -7675, -12750, -19124, -18195, -7772, 8887, 13794, 6017, -4171, -14155, -193, 10486, 10837, -224, 6084]
4013F084J6600n969r048j5645j3204P76P845P852p984m38N127J1717R684j369
3999A2028k5008l702N700L26r997J743M591P32n91j209J6155K1906j769o585j4555
3984b35j38Q402N312n057k4042J1500J3829P621j1245l361j4850L518J0045L764
3970E063P29n726m90J0459P77j1024o12N21O493o792P013k319m098O330k307o452
3954b435J2945k111P700j3508k3761j63K1631Q643j2850j0927J523J8348J6569
3941B1604r122j3484M398l345N740n043j5385j418J417J0790m29p729P063r08
3927e851o130P177r338j2752k070O27M513K374L34O116P042L07n703P674M789
3912h91p021O913P327j1916l861O296L554r020n192j0735Q448M851M064j2085
$$ y = [6084, 22684, 16715, 7667, -7978, -21182, -20406, -12561, -4709, -12693, -13131, -8004, 3713, 13397, 12028, -12980, -16682, -10982, -10656, -20653, -18910, -14319, -13587, -14178, -15387, 768, 22674, 20905, 14320, -235, -373, 8029, 13341, 8284, -15758, -4258, 9571, 17192, 5947, 2586, -12264, -8746, 1299, 5063, 5792, 66, -424, 10035, 10812, -212, -824, -303, 6190, -602, 6411, 4092, -6, 6324, 4017, -2435, 10510, 8399, 16099, 2591, -21170, -21333, 298, 8941, -3909, -14836, -13313, 5035, 21604, 12482, -1002, 3396, 51, 5791, 748, -14637, -16055, -14638, -3848, -4277, -12006, -4943, -5851, -11981, -4804, -14142, -26894, -28964, -28337, -23824, -21450, -21116, -15000, -7958, -7651, -13354, -5680, -891, -7912, -999, 6328, -5588, -9449, -3153, 401, -8619, -13811, -24546, -16098, -11247, -7183, -19268]
3898a9268J703q05Q859Q386j5763M232P958r02o875J2343M166k892o391K280M625
3883A656r458L90q477j137O743O618m056j757l387K842j4884j1393K30M789K376
3868b8905n445k940K774N542n168K681P757q848J3670N461j0144J1704k120k328
3854a6309J5887K936N278P953n763j1449l510N73K593M175j0308m642n648J0592
3840g642N969L230o246j1490M99N40l68k044p232K0190K742R74j5727O39R317
3825f649K43M864j0623O81N81j5199J952k735Q617N716J4860l035K127o414l45
3810e359k370M811j0313j4164J689J2989R436K959N156q811j497J2540K296m336
3796E026j637K673J89J9066q460j0494o793K259Q56r75L56m523J1114q174O167
$$ y = [-19268, -17565, -18370, -9511, -1125, -16888, -12656, -4698, -5600, -12475, -132, 4034, 1142, -5249, -2969, 1656, -7802, -7412, -15889, -17026, -10283, -3665, -7721, -9478, -12865, -10023, -24907, -36300, -36070, -31281, -28905, -34350, -37290, -34516, -28974, -34142, -31461, -23704, -32552, -18882, -13421, -23565, -11861, -13981, -16309, -422, 2514, 7792, 15745, 9982, -1467, -4977, -4404, -1811, 2364, -7944, -12586, -18234, -7642, -1673, 1557, -4689, -16179, -15680, -15140, -15508, -17552, -24784, -4594, -1852, -878, -16605, -15966, -6649, -6406, -1542, -12165, -11484, -10903, -26102, -24150, -26885, -18268, -12552, 2308, -727, 1400, -5014, -5359, -7729, -2918, -13231, -27395, -25706, -12717, -3281, -322, 4834, -3977, -5474, 7066, 9362, 5026, 3389, 6062, 6251, 25317, 16857, 6363, -430, 1829, 2685, 1710, 2066, -2457, 8657, 483, 6650]
3781F650J918N988j5975j1081j1258R592J4848j5226l530J7244Q365m263m870
3768a598M77O422p20j2920j2370q708J0690P160l50M011r125Q33k796P684j776
3753a3086k550m717R009J1991o149M924P115K647o269j6842p001N248n819R365
3739a2134J1724j95L589p466J803n225n840j053N674P941J3269J710q302j6435
3725a0940j367O159p985o573K2417j121k536m78k333J523j2650q267r63K520P715
3710a4879P523J367J659J372M052O08P699M054j2455m490m513j751P484M037n205
3695c438j0724O674J3965j6851l048r130m550L065P993K5277P447n624K109p877
3681E288j239j3827m43K405J438P302O416N567k162k1272q739Q992r37lJ482L852
$$ y = [6650, 8568, 14556, -1419, -12500, -23758, -14166, 682, -14544, -18074, -830, 7535, 3272, -1598, -1121, 5301, 4581, -8339, -20709, -29417, -18727, -11567, -11917, -7906, -17031, -16198, -18994, -11310, -13086, -15636, -20353, -11344, 647, -5502, -578, 6537, 9184, 2915, -13927, -20928, -15680, -21499, -12134, -410, -605, 2984, -4482, -2679, -7904, -13744, -14797, -9123, -1182, 12087, 13797, 5495, -10940, -12307, -6148, -14133, -20706, 1711, 590, -1946, -2424, -4757, -3234, -15884, -24151, -25114, -22594, -14879, -7356, -5989, -4330, -2958, 1094, 1702, 9401, 13455, 1000, -3490, -8003, -9754, -2270, 1767, -3438, -14162, -7488, 6477, -10374, -13422, -22552, -27102, -24037, -16044, 9233, 16680, 11056, 13165, 5288, 4049, -9778, -10221, -7816, -6378, 924, 7340, 12907, 10745, -10527, -19266, -10274, -11211, -11214, -9732, -5880]
3665e880n998O75J1074P678n248M796J2070K17p799M233j0459m892l580n455J623
3650f945L445L728J522p229k51k951p997K10J689M805J0678J2240N22q4l477m751
3634E154p205p31J3013J1135q867j8093J275M749o009r514m478j831M905K3241
3620F744q602l749L814l905j7136k987J245J1303J1218k427P2j293K18j1409M378
3605a2516M348j736J1227J5476J4888K865q078r905Q589n144p846j6706j7446
3592b1984n385m753k36J755Q186j637J8058R173l566p223m05K0942K075r965k894
3577B141j073j430l51l155N08L015m033n739J5092P37o027n052M203J6090R258
3562B4184j4001j2152k221J1085K278K149q294j3952p503J4248R454N722K24M121
$$ y = [-5880, -11878, -11203, -129, 7549, 2301, 7097, 19167, 19384, 11585, 15818, 5359, 467, -3113, -8568, -6945, -3500, 228, 1750, -5479, -5730, -8681, -16678, -16468, -14779, -9974, 704, 12944, 13466, 13382, 9905, 5154, -2051, -2782, 10231, 21366, 12499, -5594, -4319, 430, -5579, -15093, -19571, -21402, -16497, 6744, -1858, -5607, -1793, -5698, -22834, -25821, -24576, -13273, -2055, -4482, -4410, -5703, -5485, -16894, -12516, -8168, -9904, 1323, 16799, 31687, 34552, 26474, 16569, 25158, 20014, 12168, -4538, -21984, -27369, -32122, -32358, -30603, -22417, -24054, -5996, 3177, -389, -7612, -8017, 12925, 15000, 5035, 2141, 1068, -362, -713, -3868, -3360, -345, -4378, -10117, 4975, 5712, -315, -5367, -1164, 14926, 24184, 10183, -1969, -4190, 6895, 9173, 11322, 3028, -10924, -18427, -4179, 5275, 10997, 11221, 15342]
3548A5342N281j0547k508j0070j0982M034j850P444J2091J0404k981r121j132
3535E405L772j2156l043P853P355l345r932J770o542O128J3747l252O084n307
3521H537O077j1627j4042J5776p225p165K488M610k530N372K875l373R192o892
3507B073n125Q835J8634q509j6526k54O086R662j0778k1385J593R716J0582p51
3493C853o216P973J035J573r18p617r025K619O155k720m837M900L408r73j2912
3478a3702j0330o658J4075K0519K0848N099k471r764j3536N581o338r263J738
3465d202Q85k387N53M307J219l270q124n05J1423p315n796j4489J667R409K0919
3450D294O069l094J59j1036j4141P11k11L228J0268K1760k096l145q927J0580
$$ y = [15342, 20623, 10076, 7568, -2502, -13484, -9450, -11300, -3856, 8235, 18639, 15658, 6537, 5405, 9177, -2979, -6022, 1831, 9186, 5841, -4091, -2321, -8863, -2735, 11012, 7760, 13844, 8537, 14614, 2987, -11055, 4721, -2504, -9669, -7181, -2571, -5101, 271, 3146, -227, 8965, 2073, -3052, 5783, 24417, 15908, -618, -872, 5214, 14876, 4098, -17287, -15694, -5978, 4604, 3853, -2363, 5610, 6645, 8218, 7300, -317, -9342, -6723, -568, -3288, -8125, -3225, 183, -790, -13702, -24032, -30690, -16615, 3904, 24752, 29851, 27380, 17616, 4080, 9661, 3323, -5940, -4202, -3317, -5704, -5151, -844, 375, -2895, -11019, -11524, -101, -7416, -13212, -27701, -26034, -16625, 4294, 10363, 7269, 7428, -3608, -17749, -17038, -17249, -14021, -3753, 18007, 15911, 12766, 3839, 14419]
3436A4419J0534j15n850k5962j1138m959K0046J0467O384pj4228r753k573k754
3422a5489L595Q901N381j699L080O182j880r439m130n921q089N825J0456J1174
3408G947P257j2314k062r268l497J5903M495j3863O47R086M437K775J808j437
3394A1914J830j398j1246n316o780J154J1995m459j5016P35O171l490Q112p587
3380a3381K530P973J2989M5j4269k322L532k655N415K1701K494k0911l479P298
3366F960n162n470R8J606P40K583r4O33R189J0163m539j7371r474J5686J773J1489
3350A8810J8974q699j4708r568m826j0066L642R199j2682m844J3829p467p775
3337a6181k547j4320n39J4724L007M827K848l309o759J1398J970O26k746P736
$$ y = [14419, 24953, 24838, 18988, -6974, -18112, -23071, -3025, 7442, 13826, 13819, -409, -10162, -12735, -15489, -11894, -2993, 2388, 689, 3769, 9951, 8071, -1368, -5498, -11419, -19508, -13683, -3227, 7947, 15204, 2890, 828, -8440, -11937, 3966, 8461, -5402, -4755, 4331, 8768, 11543, 13351, 11914, 13744, 12346, 1100, -4216, -10996, -9842, 2153, -2306, -17322, -16587, -10416, -13906, -5794, -13381, -10851, -2878, 10111, 10156, -4113, -6435, -2903, -5558, -143, 21558, 24052, 3141, -338, 6960, 1798, -3672, -3574, -1968, -1228, 1355, 1261, 1894, 11083, 21246, 16707, -664, -10138, 5548, 7321, 18810, 37784, 29085, 14377, 4809, -17, -10083, -6441, 2758, -9924, -14768, -939, -8406, -16181, -18728, -33048, -33587, -18863, -15856, -11029, -8181, -11490, -18249, -6851, -4881, -4255, -7001, 735]
3323G35O505j1484l173p053k767J5072J201R808O987K491J156j1471k978j385
3309C644p484j3406J388J3903L096r01J246m312N138P431R403K392J0534j6647
3295A5425k141P943o992K77M437k626o586j2529o679r934J5251P111q070K90m932
3280i755J078j705J7938Q498m267j3312k707J3429J3770l448j3265j4125m791
3267a2662r772p381M711L093K434J3126j0079P125J963J0440p815N618K521o508
3253c186l85j424K266O177p656Q451J3710o320q864j8889j6931R759N425J0550
3239g317J0812J3969J235j9367l337n234q563J2638J0478O535o309n298R653l164
3225F731k875p004l426k561p990R658l460M247J3483m435l323o804J0411O389
$$ y = [735, 7240, -4244, -7417, -14470, -17237, -2165, -964, 8844, 15831, 18322, 19478, 8007, 5029, 3644, -3840, -17246, -15858, -1955, 1141, 240, 1486, -2826, 2312, 9743, 19146, 21538, 32072, 15425, 13284, 21227, 14235, 14512, 18949, 16323, 9737, -2792, -9471, -19405, -4154, 2957, -5113, -4823, -9755, -8677, -10382, 7556, 16054, 11787, -1525, -4232, 9197, 22967, 19519, 6254, -7871, -12662, -22434, -29815, -25104, -22011, -19577, -6451, -16530, -9405, -7442, 2998, -4817, 801, 3322, -3186, -3571, -4995, -2729, 3448, -4208, 4243, 17953, 11633, 2769, -16120, -33051, -23292, -17867, -7317, 3495, 17464, 18699, -668, -4005, -9239, -17802, -5164, 5314, 11849, 5540, 242, 9895, 6731, 3856, -3148, -6574, -9135, -17125, -7467, -10927, -6680, 6803, 2368, -955, -7759, 2652, 9041]
3211I041O288o931p974l145k180O094k452r062M874R382j261O44j1470j2369J0257
3196a0264K991n031K0529M923j4862m184j402M556Q056q400M294J549M038N920
3182A2713J532K68Lj972m649M731J544O713L824j2093j1592j5786p802m507M775
3167b2298J1497N007l239Q578N224q008o445q369M591L699P756O178J4640k622
3153A6189q893M027n644l103m396N041J4303J075m888q904P568J751r264q446
3139c584N112l704n632j4539p246K97J2362J3489J2247N144O58j339j984q65p280
3124C136j5885r846m849J3194n630j216J6431R819Q38J1349N767L251K819Q381
3110C7559K53j9042l0432l927M672O831Q848j1418m814J1962J5787J208l772K909
$$ y = [9041, 15329, 8398, 424, -2721, -4901, 1193, -1259, -10321, -5447, 3935, 2674, 3318, -8152, -20521, -10264, -7273, -12304, 8225, 13148, -1714, -5898, -7300, -2744, 5312, -3088, 1206, 2755, 6793, 12713, 14245, 14513, 14516, 12544, 7895, 12626, 14170, 20883, 24707, 12614, 1022, -14764, -22566, -27073, -22298, -10801, -5794, -9033, -455, 4769, -3239, -9684, -18053, -13462, -9763, -2007, 4171, 18811, 16189, 7296, 11323, 5679, 2576, -1820, 3221, 17524, 18599, 13711, 4807, 12375, 14126, 4862, -3584, 1528, -2176, -7808, -22347, -29593, -29296, -16934, -3445, 8802, 13946, 14604, 13265, 11281, 10416, 3136, -12749, -22595, -27444, -14250, -19880, -21096, -4665, 5154, 5992, 17341, 23108, 26359, 29178, 37559, 37812, 18770, -11662, -15589, -10917, -4086, 4762, -6656, -11470, 492, 16279, 17487, 13715, 16624]
3096A6624j5191K314R527O056l341r901r579j565K359J162J281o745O039Q809
3082G849Q944O226j5611o698L474O344J113n052K669l852J0235q941k898l37j2768
3067i303J756j794n229J89J2652L560l002j743J848Q626j758k205J400p328l937
3052f268k713M989O991o117m639j4533j485n439J1870J6320K429O128j398k787
3038C348K632q020p477L347m161m311n509o9J1126L796O126m351j0991J1941J4983
3023A2410q838j4356j2057N187J2333J1139n572j1728k374P072M267O418Q731
3010A2632j1013j1270K876J1007J0186j5081M270k594n952n208m029J0578R451
2997E853r579K22J1216p635r571q40o051J223K608J4055J0338l463K711R441r136
$$ y = [16624, 1433, 3747, 13274, 19330, 15989, 6088, -3491, -5056, -2697, -1535, -254, -6999, -960, 7849, 16793, 23019, 7408, 710, 4184, 10528, 11641, 6589, 9258, 5406, 15641, 6700, 3802, 3465, -9303, -7547, -9341, -14570, -14381, -1729, 1831, -1171, -2914, -1066, 7560, 5802, 3597, 4997, -2331, -6268, -8981, -3992, 2999, -3118, -7757, -22290, -23775, -29214, -17344, -1024, 1405, 7533, 6135, 3348, 5980, -2040, -9517, -6170, -10331, -14642, -20151, -20220, -9094, -5298, 828, -3523, -14514, -2573, 12410, 3572, -10784, -22841, -17654, -5321, 5818, 246, -11482, -13856, -6784, -2517, 3901, 12632, 1619, -9651, -6775, 4232, 14418, -663, 3607, 1013, -4939, -10147, -14176, -3598, 5853, -3726, -3504, 7712, 77, -9494, -10334, -16385, -15162, -12554, 1501, 11839, 8376, 11087, 20528, 11392]
2982A1392p78l533q352o34m433P088K987j0073Q502J3371J9038j002j2935k489
2968A8149n276Q77J712m432l152q18J7488K870j2940m721p759o730m892j198J3606
2953B784K0038j1694m725o93q075j202J2661k1074r759J1518K155j5650K363N779
2939a5574K55k548j850Q894k271p95m219l019R979M727o518J1670R260P54p463
2924A282o700l120K860n469R03m68O155J773J76k084n398o850o995L633J0708
2909i594j962R186l546m665q622N70J6329J3297l938r176J185K412j76r473j1076
2894a9249J993J3168J0828m698j3773L387l577L397M513M41o098n084L19K765
2880a1668P991J2847j333j877o989R501N818J273j4869N63Q524j1219j1669q98
$$ y = [11392, 10614, 7081, -1271, -1905, -6338, 750, 3737, -6336, 2166, 15537, 34575, 33573, 20638, 18149, 12873, 13750, 15462, 11030, 7878, 7060, 24548, 27418, 14478, 9757, 1998, -4732, -9624, -10822, 2784, 22822, 11128, 6403, 5710, -2365, -3567, 9094, -11980, -21739, -10221, -8066, -23716, -21353, -15574, -15319, -17867, -19717, -10823, -13094, -13889, -18108, -21127, -11148, -6421, -12939, -1269, 7991, 8745, 1282, -5418, -8538, -5678, -11147, -10244, -10712, -4557, -2784, -2608, -4692, -10090, -16940, -23935, -20302, -9594, -11556, -2370, -5916, -10581, -19203, -18633, -2304, 10993, 7055, -2121, -936, 1476, 1300, -8173, -19249, -17256, -4088, 6740, 2042, -11731, -8344, -11921, -8524, -4011, -3570, -9668, -14752, -14433, -11668, -3677, 9170, 7837, 5960, -1029, 8472, 14290, 15563, 694, 1257, 9781, -1438, -13107, -14005]
2866a4005m140N909K5459N650j179n039K995M801k0131j0450R251q892O576L66
2852b829N884m819j191J0103Q451j299J134P10K748O494q458m554n955j600J073
2837E892N678J176k746R339j6098j8779j3133M9P099p152K831R491l462J0506
2823i309q932p273N933Q252O676P647P422L507O287j0271p516r016Q848R832O281
2808A8368n126j0398n069j2501L92R940o030l513j639N539R84j2673P435J7292
2794C001M773M911L458K257J532K719J2186J130k759j4403k1114n077q544o267
2780b2197o491L957J4745N734O118J0272M792J660M250j2191o059N645p805m393
2766a963j4279M813J1491p381r176M498q004R571J985K394l701q508R258Q657
$$ y = [-14005, -18145, -12236, 13223, 18873, 17694, 12655, 15650, 20451, 320, -10130, -879, -9771, -3195, -2829, 3055, -1764, -2955, 7148, 15599, 14300, 15434, 16144, 18892, 25386, 16928, 12374, 6419, 4819, 5892, 11570, 12746, 10000, 19339, 3241, -15538, -28671, -28622, -21523, -28675, -25844, -16353, -19815, -9309, -18241, -25514, -19581, -11329, -4653, 2994, 10416, 13923, 20210, 9939, 2423, -6593, 2255, 12087, 18368, 13242, 2844, -2225, -14726, -14334, -4394, -10424, -13937, -15576, -10037, -9053, -21726, -14291, 3001, 7774, 12685, 16143, 18400, 19932, 22651, 34837, 35967, 33208, 18805, -2309, -7386, -15930, -22197, -28688, -24731, -9986, -4252, 1866, 12138, 16930, 18590, 22840, 10649, 4590, 10235, 2430, -1963, -16242, -11429, 62, -7319, -16495, -11997, -20001, -10430, -8445, -6051, -9752, -18260, -9002, -345]
2752c45K894j2909j5327O201J1604k50P53M540j538p276n686k459P907N558O557
2737B24K97K920R997J7057m746j5856k2331o579J3147N94m694O182M306N511M577
2722A0606l11p714q365K681j6250r121Q268J933m883m091O871K4034m896r344
2708a0582l535J4058K0572k572n292j2381P832J1342J5730j0476j0242j0042j0146
2695e734p376j987J7156Q046L726O883K804J621j0658n609P5m567l071N183n999
2680D93q250j4014n703O03J3165m315J6542P258J181l671J4527j369l397J1617
2666B4667l337k3227j4690q113J0376P408k409o351K897j09Q607K0092j7553k931
2652d673M663k340R279M940P20n996m700P858n261J1587K961J500m61o366p290
$$ y = [-345, 2549, -10360, -25687, -19486, -7882, -8132, -7379, -2839, -4377, -11653, -17339, -19798, -11891, -6333, 224, 521, 3441, 13438, 30495, 25749, 9893, -12438, -19017, -5870, -5276, -9970, -3788, 518, 6029, 10606, 10295, 2581, -5784, -3103, -19353, -28474, -20206, -18273, -23156, -27247, -20376, 3658, -1238, -10582, -14117, -59, 20513, 17941, 12649, 268, 8100, 19442, 35172, 24696, 14454, 4412, -5734, -13110, -15097, 2059, 10105, 13831, 20714, 23518, 25139, 14481, 8872, 8947, 4380, 1309, 6492, 493, -7757, -21771, -27474, -26871, -13706, -18021, -1479, 5779, 6960, 3289, 17816, 16447, 13050, 24667, 21330, -1897, -16587, -24700, -14324, -6916, -9325, -15676, -12779, -12888, -4281, 15811, -1742, -4673, -10, -2350, 6929, 11869, 12589, 6593, 1893, 9751, 4490, 16077, 19038, 20538, 20077, 13711, 6421]
2637F421j6344J1292K559j0702L688Q915M70N831J66K517j238K400j3728q588
2623f341N796r995l553l110j3175J367p616Q004K5622L809K099J0818j5690m993
2609f958N199Q046J559j2939Q642J2894p281k356j090k81k043O523j0655L654
2595B914J182P665K975J949L629j181o43j2154j1775q181k067J614M522K277n17
2580g791l59N919Q371j879j2975n032Q777K095P73N33k108O707j735m463p227
2565a0394N660n295r678O988P746P730n149r28J0245q227m83J3639p497Q159R739
2550B2255N638k893j5951j2301j596k030P548j4233n765L353J0342R216L237q967
2536b147k43R427j7l902q798q531M085Q892K942r4o317j2479o916m204N854J889
$$ y = [6421, -9923, 1369, 3928, -6774, -3086, 5829, 6299, 12130, 12296, 14813, 13575, 15975, 2247, -6341, -545, -10540, -14093, -17203, -30378, -29011, -36627, -28623, -3001, 808, 2907, 13725, -1965, -6958, -1759, 6287, 7846, -5093, 3549, 16443, 9162, 6806, 5716, 5435, 3392, 9915, -740, 2914, 4096, 11761, 14736, 16685, 20314, 19133, 18490, 6336, -5439, -13620, -15687, -14073, -9551, -7274, -7791, -8150, -2231, 6140, 4261, -8714, -13746, -4969, -2874, -2101, -1568, -3676, 3031, 1296, -3167, -10394, -4734, -10029, -19707, -12719, -4973, 2757, -2392, -3320, 6925, -1302, -1785, 11854, 4357, 12516, 22255, 27893, 25000, 9049, -3252, -4848, -6878, 670, -13563, -19328, -15975, -5633, 3583, 6820, -2147, -2390, 7037, 7020, 3118, -5680, -14211, -10126, -1234, 1708, 1614, -4703, -17182, -24098, -28302, -22448, -20559]
2520b0559Q297Q63l719j3M786K691l765J551J175J1538R412j955q449l855q769
2505a0771k1325p894J0157K6367J9837Q509j3178j5737o06O506k111j1890j8950
2492c1086K459J7599R550J7882j73K971j919p076r856p364J0252R057n192r118
2478b014k332n68q9j227q17j4170j4783m718J5326J6166j528J974q800M960O362
2463f258J222N964O111o180K169M639j8170j7850j394P669j0521j934J1934R274
2449a3325j5339N243J2312R088J858l200l703o54r792o934N908J1189j148q581
2435a7078p485N920J4146J709p520j1242J4745J4837j366N501M156n298O868k68
2421A7625k0017o484K454P965L884k942j3084L302N28j3982K920J7489M405j4679
$$ y = [-20559, -12262, -11399, -15118, -15131, -10345, -7654, -11419, -9868, -8693, 2845, 12257, 10302, 1853, -2002, -10771, -32096, -39990, -29833, -3466, 16371, 24880, 11702, -4035, -4641, 1865, -246, -12136, -31086, -28627, -11028, -1478, 16404, 16231, 19202, 17283, 10207, 351, -7013, 3239, 12296, 7104, -2014, -4346, -4914, -5003, -6230, -7047, -21217, -36000, -40718, -25392, -9226, -10754, -8780, -17580, -12620, -6258, -5036, 928, 7039, 859, 3028, 7667, -10503, -28353, -29747, -22078, -32599, -34533, -22599, -13325, -28664, -23421, -11109, -2021, -163, -3363, -7066, -7720, -17512, -24446, -18538, -7349, -8497, -17078, -24563, -18643, -4497, -2788, -10308, -21550, -6805, 8032, 6666, 12167, 16323, 11025, 17893, 17625, -2392, -8876, -6422, 1543, 5427, 2485, -10599, -7297, -6769, -20751, -17831, -342, 4063, -10616]
2407a0616p232N280p529m25L511R680o11K453P387q262o599J0474m450J346P000
2392A407o286p630L997k731J977J1036o532k2228K999J324N13J309Q878M142J3672
$$ y = [-10616, -17848, -12568, -20097, -20522, -17011, -7331, -7942, -5489, 1898, -6364, -12963, -2489, -6939, -5593, 1407, -4879, -12509, -8512, -11243, -9266, 1770, -4762, -26990, -23991, -22667, -22154, -20845, -11967, -7825, 5847]
$$ [...]
##END NTUPLES=NMR SPECTRUM
##END=
