##TITLE=317006
sb 01910
adrs
synthon
##JCAMPDX= 6.0         $$ Bruker NMR JCAMP-DX V2.0
##DATA TYPE= NMR SPECTRUM
##DATA CLASS= NTUPLES
##ORIGIN= Bruker BioSpin GmbH
##OWNER= nmr
$$ XWIN-NMR		Version 3.5
$$ Wed Jul 12 08:28:18 2006 GMT Daylight Time (UT+1h)  MAYBRIDGE\nmr@NMR_250MHZ
##.OBSERVE FREQUENCY= 250.131544655141
##.OBSERVE NUCLEUS= ^1H
##.ACQUISITION MODE= SIMULTANEOUS (DQD)
##.ACQUISITION SCHEME= undefined
##.AVERAGES= 1
##.DIGITISER RES= 18
##SPECTROMETER/DATA SYSTEM= dpx250
##.PULSE SEQUENCE= zg30
##.SOLVENT NAME= CDCl3
##.SHIFT REFERENCE= (INTERNAL, CDCl3, 0, 16.522)
##AUDIT TRAIL= $$ (NUMBER, WHEN, WHO, WHERE, WHAT)
$$ ##TITLE= Audit trail, XWIN-NMR		Version 3.5
$$ ##JCAMPDX= 5.01
$$ ##ORIGIN= Bruker BioSpin GmbH
$$ ##OWNER= nmr
$$ C:/u/data/dgb/nmr/ADRS/15591/pdata/1/auditp.txt
$$ ##AUDIT TRAIL=  $$ (NUMBER, WHEN, WHO, WHERE, WHAT)
(   1,<2006-02-03 11:46:47.58 +000>,<MAYBRIDGE\nmr>,<NMR_250MHZ>,
      <created by zg, POWCHK disabled, PULCHK disabled
       terminated by command 'halt'
       configuration hash MD5:
       84 BC 41 DB A1 6E 1D 46 DA 25 12 A5 C1 ED C5 3A
       data hash MD5: 64K
       2A C7 55 0E 9B 4E 38 22 A9 18 4F EE BF 2C 5D 03>)
(   2,<2006-02-03 11:46:57.50 +000>,<MAYBRIDGE\nmr>,<NMR_250MHZ>,
      <Start of raw data processing
       ef LB = 0.3 FT_mod = 6 PKNL = 1 SI = 32K 
       data hash MD5: 32K
       8D 89 22 32 C2 96 CB 40 51 94 5D 39 92 FD F8 51>)
(   3,<2006-02-03 11:47:01.39 +000>,<MAYBRIDGE\nmr>,<NMR_250MHZ>,
      <apk 
       data hash MD5: 32K
       AB 63 B8 9C 6D CD E3 52 5C 01 49 65 BA 8C BE 60>)
(   4,<2006-02-03 11:47:02.58 +000>,<MAYBRIDGE\nmr>,<NMR_250MHZ>,
      <abs ABSG = 5 
       data hash MD5: 32K
       5D AB 31 7F 98 DE 45 C6 23 27 66 09 90 B0 B4 AD>)
$$ ##END=
$$ 
$$ hash MD5
$$ 73 0C 03 0A 49 06 AC 6C 84 AB 69 0D 95 A9 E8 8A
##$RELAX= 
##$RELAX= 
##$RELAX= 
##$RELAX= 
##$RELAX= 
##$RELAX= 
##$RELAX= 
$$ Bruker specific parameters
$$ --------------------------
##$DU= <C:\Restored>
##$EXPNO= 15591
##$NAME= <ADRS>
##$PROCNO= 1
##$TYPE= <nmr>
##$USER= <dgb>
##$AMP= (0..31)
100 100 100 100 100 100 100 100 100 100 100 100 100 100 100 100 100 100 
100 100 100 100 100 100 100 100 100 100 100 100 100 100 
##$AQSEQ= 0
##$AQ_mod= 3
##$AUNM= <au_zg>
##$AUTOPOS= <9 >
##$BF1= 250.13
##$BF2= 250.13
##$BF3= 250.13
##$BF4= 250.13
##$BF5= 500.13
##$BF6= 500.13
##$BF7= 500.13
##$BF8= 500.13
##$BYTORDA= 1
##$CFDGTYP= 0
##$CFRGTYP= 5
##$CHEMSTR= <none>
##$CNST= (0..31)
1 1 145 1 1 1 1 1 1 1 1 1 1 1 1 1 1 1 1 1 1 1 1 1 1 1 1 1 1 1 1 1 
##$CPDPRG= <>
##$CPDPRG1= <>
##$CPDPRG2= <>
##$CPDPRG3= <>
##$CPDPRG4= <mlev>
##$CPDPRG5= <mlev>
##$CPDPRG6= <mlev>
##$CPDPRG7= <mlev>
##$CPDPRG8= <mlev>
##$CPDPRGB= <>
##$CPDPRGT= <>
##$D= (0..31)
0 1 0 0 0 0 0 0 0 0.06 0 0 0 0 0 0 0.0002 0 0 0 0 0 0 0 0 0 0 0 0 0 0 
0 
##$DATE= 1138967206
##$DBL= (0..7)
120 120 120 120 120 120 120 120 
##$DBP= (0..7)
150 150 150 150 150 150 150 150 
##$DBP07= 0
##$DBPNAM0= <>
##$DBPNAM1= <>
##$DBPNAM2= <>
##$DBPNAM3= <>
$$ [...]
##$SUBNAM7= <"">
##$SUBNAM8= <"">
##$SUBNAM9= <"">
##$SW= 20.6930455092707
##$SWIBOX= (0..15)
0 0 3 0 0 0 0 0 0 0 0 0 0 0 0 0 
##$SW_h= 5175.983436853
##$TD= 65536
##$TD0= 1
##$TE= 293.16
##$TE2= 300
##$TE3= 300
##$TEG= 300
##$TL= (0..7)
0 120 120 120 120 120 120 120 
##$TP= (0..7)
150 150 150 150 150 150 150 150 
##$TP07= 0
##$TPNAME0= <>
##$TPNAME1= <>
##$TPNAME2= <>
##$TPNAME3= <>
##$TPNAME4= <>
##$TPNAME5= <>
##$TPNAME6= <>
##$TPNAME7= <>
##$TPOAL= (0..7)
0.5 0.5 0.5 0.5 0.5 0.5 0.5 0.5 
##$TPOFFS= (0..7)
0 0 0 0 0 0 0 0 
##$TUNHIN= 0
##$TUNHOUT= 0
##$TUNXOUT= 0
##$USERA1= <user>
##$USERA2= <user>
##$USERA3= <user>
##$USERA4= <user>
##$USERA5= <user>
##$V9= 5
##$VALIST= <valist>
##$VCLIST= <CCCCCCCCCCCCCCC>
##$VD= 0
##$VDLIST= <DDDDDDDDDDDDDDD>
##$VPLIST= <PPPPPPPPPPPPPPP>
##$VTLIST= <TTTTTTTTTTTTTTT>
##$WBST= 1024
##$WBSW= 4
##$XGAIN= (0..3)
0 0 0 0 
##$XL= 0
##$YL= 0
##$YMAX_a= 22015
##$YMIN_a= -24441
##$ZGOPTNS= <>
##$ZL1= 120
##$ZL2= 120
##$ZL3= 120
##$ZL4= 120
##$ABSF1= 16.522
##$ABSF2= -4.171173
##$ABSG= 5
##$ABSL= 3
##$ALPHA= 0
##$AQORDER= 0
##$ASSFAC= 0
##$ASSFACI= 0
##$ASSFACX= 0
##$ASSWID= 0
##$AUNMP= <proc_1d>
##$AZFE= 0.1
##$AZFW= 0.1
##$BCFW= 0
##$BC_mod= 0
##$BYTORDP= 0
##$COROFFS= 0
##$CY= 12.5
##$DATMOD= 1
##$DC= 0
##$DFILT= <>
##$DTYPP= 0
##$F1P= 14.0000005364418
##$F2P= -0.99999901652339
##$FCOR= 0.5
##$FTSIZE= 32768
##$FT_mod= 6
##$GAMMA= 0
##$GB= 0
##$INTBC= 1
##$INTSCL= 1
##$ISEN= 128
##$LB= 0.3
##$LEV0= 0
##$LPBIN= 0
##$MAXI= 10000
##$MC2= 0
##$MEAN= 0
##$ME_mod= 0
##$MI= 0
##$NCOEF= 0
##$NC_proc= -7
##$NLEV= 6
##$NOISF1= 0
##$NOISF2= 0
##$NSP= 0
##$NTH_PI= 0
##$NZP= 0
##$OFFSET= 16.522
##$PC= 1
##$PHC0= 103.5314
##$PHC1= 9.819576
##$PH_mod= 1
##$PKNL= yes
##$PPARMOD= 0
##$PSCAL= 4
##$PSIGN= 0
##$REVERSE= no
##$SF= 250.13
##$SI= 32768
##$SIGF1= 0
##$SIGF2= 0
##$SINO= 400
##$SIOLD= 32768
##$SREGLST= <1H.CDCl3>
##$SSB= 0
##$STSI= 32768
##$STSR= 0
##$SW_p= 5175.98343685301
##$SYMM= 0
##$S_DEV= 0
##$TDeff= 65536
##$TDoff= 0
##$TI= <Analysis number 999999
Compound Code 99
Book Reference 9
Project Code 9>
##$TILT= no
##$TM1= 0
##$TM2= 0
##$TOPLEV= 0
##$USERP1= <user>
##$USERP2= <user>
##$USERP3= <user>
##$USERP4= <user>
##$USERP5= <user>
##$WDW= 1
##$XDIM= 32768
##$YMAX_p= 341837710
##$YMIN_p= -1017406
$$ End of Bruker specific parameters
$$ ---------------------------------
##NTUPLES= NMR SPECTRUM
##VAR_NAME=  FREQUENCY,     SPECTRUM/REAL,   SPECTRUM/IMAG
##SYMBOL=    X,             R,               I
##VAR_TYPE=  INDEPENDENT,   DEPENDENT,       DEPENDENT
##VAR_FORM=  AFFN,          ASDF,            ASDF
##VAR_DIM=   32768,         32768,           32768
##UNITS=     HZ,            ARBITRARY UNITS, ARBITRARY UNITS
##FACTOR=    0.157963299565203, 1,           1
##FIRST=     4132.6476996994, 0,             0
##LAST=      -1043.33573715361, 0,           0
##MIN=       -1043.33573715361, -1017406,    0
##MAX=       4132.6476996994, 341837710,     0
$$ Real data points
##PAGE= N=1
##DATA TABLE= (X++(R..R)), XYDATA
$$ [...]
19854 104594 117900 132862 134586 101286 198807 213079 137052 -14906 -11082 56371 -7367 -4374
19842 -4374 -178717 -291814 -425415 -253871 -102062 -54715 105322 111212 55909 71733 134106
19831 134106 178604 154364 128059 115279 145200 75453 139896 183259 113358 61399 34725
19820 34725 86640 166401 94717 -44911 -166501 -188619 -76152 -90062 -339658 -305777 -93664
19809 -93664 -57240 -60936 108668 111388 -38320 141269 298608 230643 226491 -7049 -228906
19798 -228906 -318842 -274184 -367339 -272133 -179012 -156350 -125935 77044 245695 124639 78637
19787 78637 53739 1300 -19140 -233643 -214114 -248892 -198818 -47863 70619 91356 2
19776 2 37663 198197 304077 355190 243388 82097 99116 220861 304486 245998 336551
19765 336551 143401 101849 -103600 -42900 -125056 -66756 135310 251173 221660 -46565
19755 -46565 -51109 62691 -10733 -131086 -65067 -21864 -36141 106365 130011 40447 117058
19744 117058 231172 122065 -31568 -31739 -40539 92240 58639 -122522 -124654 -28917 18378
19733 18378 -93593 -117662 -78679 -72084 -64300 -56685 -80786 -94078 -106458 -36471 -27882 -182384
19721 -182384 -315033 -236144 -191587 -97702 -82248 -20560 127498 275014 396718 311449 261222
19710 261222 252589 188584 296579 187735 22945 -120251 -63659 10137 216123 147677 221728
19699 221728 63799 -62990 79636 132727 -569 -253137 -292088 -380643 -410034 -458598
19689 -458598 -182282 27145 -1440 -119318 -232257 -257182 -105824 -113045 -107232 61620 103998
19678 103998 120411 -54865 31207 221416 320781 242515 336713 369799 230896 256274 358182
19667 358182 268213 224844 265709 167784 135657 99383 144816 137622 107058 69465 108995 278661
19655 278661 433245 463087 458582 336977 219588 225590 262656 310124 425961 361759 373659
19644 373659 264727 172551 258420 38957 104377 95096 70090 43245 76487 132691 43059
19633 43059 -168023 -211918 -76868 127084 168009 36333 54092 49603 -79136 -157700 23628
19622 23628 128558 180104 265233 374874 483296 604463 534916 333486 116483 -65458
19612 -65458 -41490 146033 342297 488378 545955 458867 498505 444788 360243 106936 109141
19601 109141 175524 153917 225132 268097 72459 71263 186571 80623 168806 148278 93932
19590 93932 -49416 -28013 -4444 5223 -24627 -14176 -91871 -82883 -62583 -2068 -73427 -134609
19578 -134609 -131040 41580 450108 415112 260299 79651 -78881 -374 -23659 61805 107123
19567 107123 6246 -106809 -63442 -108866 -72761 -8522 59531 -9958 23525 53803 125639
19556 125639 15659 38810 51890 117008 278994 234338 243080 101817 30509 135782 85794
19545 85794 -71545 -132350 -109261 -79564 56521 -30521 -164013 -50609 80992 135221 62971
19534 62971 -105647 -110377 -70028 -109550 -30849 90690 165702 -23458 -40860 76021 16477
19523 16477 -29377 -62912 13867 246649 280141 100933 -14352 72501 21961 -57169 -100597
19512 -100597 -103707 -28732 -57310 101221 214170 305365 217224 241124 278708 260129 246556
19501 246556 29394 -87952 35508 69182 40170 -219304 -169692 129550 283735 358706
19491 358706 410440 400393 29118 -261619 -48400 -19161 -194161 -24457 225851 167061
19481 167061 -14803 -20488 -5229 177238 73249 -52530 30940 72023 121557 30695 -28871
19470 -28871 121926 218913 102232 33972 -87231 -138285 -124668 -86455 94018 153277 239596
19459 239596 336707 267506 304668 244502 325817 435132 401979 144672 -12753 16929 88869
19448 88869 12769 -82425 36482 170943 57771 -46330 5385 132893 230758 311654 265680
19437 265680 131570 26265 -88090 -81417 -151102 -163480 -111782 -78538 79657 -90450 -197849
19426 -197849 -64858 4329 19429 -130813 -228995 -247919 -212165 -75720 78470 183115
19416 183115 142777 -28046 -138100 -23289 -7757 -36152 -72684 94616 220926 164927
19406 164927 55582 36415 176887 255262 181426 139614 141219 89880 5256 15842 115512
19395 115512 32503 -212156 -89526 110267 21679 -60054 -12292 -28302 35879 57979 84651
19384 84651 233443 415619 311517 211273 238634 294496 106179 27324 180647 164156
19374 164156 159975 154020 503 -115897 14013 173752 44141 -29484 52377 199993 262377
19363 262377 501003 462291 283194 161662 136596 121472 410895 391594 194128 20882
19353 20882 110184 193598 38872 152385 55825 -205884 -168775 -138814 -177138 -101377 74658
19342 74658 186865 151358 124545 116695 -12644 -101013 -148325 -89804 68200 241170 212889
19331 212889 116881 81368 12708 -13988 133417 163659 32374 89554 59425 24889 -26597
19320 -26597 113350 280696 210538 123176 153656 222718 198963 272021 342856 315501 290648
19309 290648 180063 162118 144537 198551 118774 158554 122842 36982 177395 265145 190205
19298 190205 300338 257797 29347 56820 34256 -7658 133264 149502 150930 224455 205562
19287 205562 174224 251938 304055 175765 90512 54035 92067 271357 270725 181714 155932
19276 155932 -66112 -64892 -88471 -232723 -298978 -232076 -268147 -131545 -51028 110320 243732
19265 243732 330806 555748 463966 470808 610248 628967 634288 490767 449928 527191 388686
19254 388686 354379 357187 415047 403735 392798 467494 491572 542676 616125 647424 532637
19243 532637 437765 356537 285855 237672 226537 121630 82301 154426 123433 39907 69573
19232 69573 249141 216717 214568 188226 11003 86510 223490 266993 331365 435982 481383
19221 481383 436010 221574 86633 257993 411916 470258 486722 330923 448785 572045
19211 572045 604263 754222 791721 604866 534934 372533 226508 228748 567165 629196 413533
19200 413533 422252 578297 523936 517012 523665 487511 477050 475244 283165 376268 509268 611332
19188 611332 724537 661669 659817 639836 670823 659002 720453 824472 762682 717173 665431
19177 665431 715584 715615 809437 787507 1029879 984748 893111 1141379 1462582 1526881 1692796
19166 1692796 1913433 2260911 2565548 2597843 2640591 2883707 3331472 4080906 5062700 6296092
19156 6296092 8193039 10524419 12410117 13703828 14133754 13734122 13019487 12664646 13367824
19147 13367824 15799029 20741379 29430836 42682555 59961471 78916915 93505621
19140 93505621 101488605 100638837 92011669 78829777 64985414 52684843 42836273 36038766
19132 36038766 32686954 32083833 33720002 35506167 35526607 33065752 28215877 22347965
19124 22347965 16837271 12599358 9881779 8237542 7139696 6448044 5976911 5760457
19116 5760457 5751489 5594254 5370315 5365697 5554189 5697613 5762425 6061799 6373482 6706973
19106 6706973 7512651 8958635 11420006 15099050 20031507 26096440 31796751 35486601
19098 35486601 36513611 34971584 32384445 30859480 32299417 37573351 47126594 60247195
19090 60247195 76310621 93539757 109423147 119256008 118665869 108213476 89647501
19083 89647501 67907378 48602799 34670190 25973134 21151111 18618775 17681559 17972961
19075 17972961 18524255 18287444 16981387 14527748 11557825 8864112 6787888 5381018
19067 5381018 4470448 4051412 3685139 3441893 3343154 3219204 3095451 2728150 2268212 1988904
19057 1988904 1870192 1668330 1483340 1293800 1190455 965019 957170 973099 785388 703975
19047 703975 741584 831438 839966 747360 425293 323440 316652 356996 273662 295750 380871
19036 380871 337407 244362 206866 254511 167679 43186 156483 442723 444453 298216 219521
19025 219521 353667 350746 301174 334097 227959 43972 -124788 -86090 -79734 117295 242180
19014 242180 122410 22092 -9026 -81091 34335 -59009 -118274 56214 259807 28256
19004 28256 -46966 -10944 28243 59177 -70519 -97267 20656 105674 154878 130984 19873
18993 19873 -140317 -136823 -2312 14685 138916 170192 35154 -155558 -197944 -74172 35441
18982 35441 -990 -71733 9064 17456 -47302 -199623 -263903 -206166 -127929 -68979 -33779 20301
18970 20301 174754 227231 109773 62509 111936 85209 17537 -33102 -80095 -206163 -258257
18959 -258257 -22815 99102 117595 139136 167660 340941 427348 557596 437388 519628
18949 519628 570610 450590 424534 381551 330808 304552 379009 447971 447446 401203 556019
18938 556019 668050 622177 811501 799489 561398 410606 237039 28065 -44998 28461
18928 28461 51900 59473 85914 100457 150340 55084 -40856 93961 198312 178192 97057
18917 97057 -46599 3745 47116 71846 4987 -37144 -64786 121867 324374 345856 53601
18906 53601 -204475 -158812 -107601 26043 177294 307346 442213 460813 570529 641512
18896 641512 465383 326840 95206 47595 88764 32547 47688 25045 -26721 108816 195318
18885 195318 -59039 -227912 -211003 -63101 35507 60236 144314 124765 -5371 -23535 -29294
18874 -29294 128735 252984 411588 296770 242088 71831 92567 12427 7969 -53154 34604
18863 34604 20054 -123880 -79016 26042 75948 103771 186168 221171 101621 142714 164497
18852 164497 366917 508298 506094 260961 4460 -180691 -119542 30632 2519 -36005
18842 -36005 -216282 -255082 -235362 -132512 -68693 90208 174272 67701 -80124 -74645 -161726
18831 -161726 -100326 -176838 -49935 59925 -31877 -52667 6501 54939 133856 157951 67681
18820 67681 37636 13203 -84603 79996 183407 -24892 -163109 -224532 -126114 -132286 -175565
18809 -175565 -50691 -131278 -162174 -103451 3817 -174054 -166453 -213110 -7265 170101 440475
18798 440475 383801 188633 151820 99550 -148795 -96640 -52093 -4576 73793 -28216 -98344
18787 -98344 59473 -18961 121356 187992 130579 55791 207301 339460 307160 436076 479061
18776 479061 359113 290288 276036 343411 373303 277092 149964 72051 400488 575149 510012
18765 510012 359500 338705 226167 224087 227777 171126 110898 85548 11376 -114597 -19672
18754 -19672 16874 -118845 -53230 -15500 -106768 -112379 -159504 -87728 -58973 75459 70902 -20711
18742 -20711 -80068 -17143 -49605 -128454 73333 87050 -17449 -90821 -13983 132512 51418
18731 51418 36149 225586 356175 338727 176124 95507 131042 74700 -4325 23901 120300
18720 120300 32783 -110967 3731 192681 90340 -46809 -41418 -23404 23799 166315
18710 166315 185380 72384 -72321 49792 74263 20158 -41664 8433 15828 23879 -24229
18699 -24229 -64862 -85947 -96774 -193455 -371305 -191954 -107779 -54293 -99580 -267464 -319806
18688 -319806 -255777 -203181 -79414 28546 -2888 -60503 -181744 -46705 78278 34870
18678 34870 2242 -213431 -276236 -255797 -331543 -436229 -358173 -43390 99710 17967 -57854
18667 -57854 -101319 -83973 -180466 -307322 -190603 -51723 114312 147914 214548 297985 255897
18656 255897 66375 -71534 -103613 73906 47854 -139521 38174 233697 271594 302132
18646 302132 297924 145628 31855 -87137 48424 71622 49474 67132 67173 67341 81108 -29267
18634 -29267 20722 167355 182033 308057 300558 208991 52681 124987 138485 -2241 102082
18623 102082 248927 493729 540131 343139 221183 323673 341713 288097 367135 404273
18613 404273 303932 60953 -3662 125542 272559 498745 468529 436810 417029 306176
18603 306176 240688 294088 343371 295791 338016 441081 433922 331418 183798 53124 314226
18592 314226 319516 227873 223587 343944 347952 401121 313397 234298 295975 327028 236997 -23823
18580 -23823 -112090 -30610 -6115 53843 54288 106215 -25146 -159694 -79516 122264 360509
18569 360509 534396 546768 636663 628457 592857 855679 919082 789214 646911 482558 399453
18558 399453 460925 411427 349701 404400 544920 601363 776943 812690 783441 642343 628388
18547 628388 763761 812686 710002 428951 395576 469993 432757 399140 272093 201987 121394
18536 121394 190345 284445 390786 486981 273518 194004 14986 -213699 -404927 -338810
18526 -338810 -187259 -106163 -153370 -112453 -48334 121917 131685 86899 94436 106636 176262
18515 176262 64539 185917 271372 181163 110891 44836 142653 300231 394646 552720 714970
18504 714970 587429 444571 401156 504044 581096 481122 461386 469273 494651 372867 349893
18493 349893 378770 500606 566919 576814 478891 522671 677227 571084 490541 494350 355038
18482 355038 349079 623971 752323 720892 752056 824748 795623 828764 850936 950689 1187016
18471 1187016 1235264 1298239 1387508 1312082 1549638 1801964 1976170 2161325 2024295 2109098
18461 2109098 2407041 2787231 3239935 3646992 4220387 5195468 6264908 7293421 8386230
18452 8386230 10056348 12193142 13311425 13541039 14194642 16266185 19261675 22443963
18444 22443963 27124935 33355640 39222522 45509391 55836572 70057665 78151211 77801549
18436 77801549 77485295 84190545 89270590 83897215 73429490 66717555 62888816 56635222
18428 56635222 48978610 43723471 40933278 37501445 32604093 29094833 28159204 27109583
18420 27109583 23712942 19607475 16608824 14497184 12617933 10491183 8752891 7827861
18412 7827861 7415034 7020136 6590124 6246693 6296740 6665443 6827334 6917052 7421777 8535083
18402 8535083 10094654 11874912 13625738 15462412 18465740 22187613 24483050 25298314
18394 25298314 26881073 30573458 34587730 37316060 40485386 46590016 52705202 56552028
18386 56552028 60378088 68248495 76318708 75508223 68931290 65428450 67313117 64292284
18378 64292284 53850214 42541269 35985659 31279305 26113525 21429403 18333959 16068713
18370 16068713 13790365 12286223 11945490 11413594 10165477 8421517 7111597 6059804
18362 6059804 5152848 4396291 3661777 3426545 3012996 2550659 2403371 2363092 2058872 1938232
18352 1938232 1749054 1394810 1056340 937453 781144 773275 1015189 967663 924129 870942
18342 870942 651998 559598 493293 391466 438325 443275 402305 311298 326547 413690 401234
18331 401234 218163 178172 58172 58213 145717 260085 168344 -159300 -306374 -283093 -84455
18320 -84455 166616 283538 225772 271607 227431 156386 44467 130400 -21644 -179904 -199339
18309 -199339 -225761 -131767 -70781 -105733 -51784 -3870 82158 4626 -15531 -30997 -64852
18298 -64852 -4320 223120 279453 197850 189999 202305 247660 317509 196343 114060 266126
18287 266126 384494 541468 653450 461142 288656 113046 -10644 -122110 -204696 -240139
18277 -240139 -94609 -21843 -6691 -95390 -47204 39452 184222 357528 206898 -1221
18267 -1221 153804 411920 307740 223640 129267 153310 -27002 -216267 -166109 121189 138174
18256 138174 95017 133600 200964 61629 95390 160945 126929 187783 256412 160071 156034
18245 156034 235241 192566 12307 -37917 48894 147880 195336 296491 321776 344428 347210
18234 347210 531618 539899 265670 56993 75658 109338 17920 64992 -30506 -234945 -218872
18223 -218872 -55688 22000 66852 256522 216030 69152 -4446 57493 32268 -4157 75334
18212 75334 7287 -75714 -204636 -212341 -156572 -88797 -59808 -88557 -76218 -16038 151955
18201 151955 233429 367414 335841 133594 119927 144546 243904 283652 167715 -26698 -28955
18190 -28955 156557 118868 18208 148059 184042 91893 -179439 -155519 -4913 38226 -70519
18179 -70519 -84256 -72131 -84008 -46473 -52076 -48410 -20244 -9126 26746 -16419 -145497 -69954
18167 -69954 107847 36179 56509 303828 567914 582249 441997 222873 -5623 -28070
18157 -28070 30188 91191 227038 140769 89172 32914 144540 342982 397868 244870 197010
18146 197010 142280 66708 117426 181801 92014 177972 210021 158140 197588 359757 349579
18135 349579 303500 439312 539454 538251 775570 856223 991556 1020582 1113150 1274281 1508731
18124 1508731 1652765 1644759 1734763 1916233 2294056 2556607 2734090 3286111 4387925 6311645
18114 6311645 9492011 14402434 22771493 37693315 66696194 98217391 92506870 59050605
18106 59050605 30948879 18258294 12615259 9565396 7439998 5898294 4674427 3579321
18098 3579321 2919516 2630767 2306428 1902291 1520921 1120270 983052 737960 704406 730176
18088 730176 742428 764239 959096 1059085 1063208 898442 811361 655351 681773 662478 513219
18077 513219 417349 337597 320654 330181 270763 200311 296135 474975 491356 427135 407613
18066 407613 95268 -199944 -88353 60500 45548 -14041 75390 138411 239556 375438
18056 375438 365400 178565 71083 -6348 22060 -95896 -59070 62892 -2382 -66119 -136519
18045 -136519 -6287 182290 180342 21584 -72127 -134158 -182710 -172540 -178205 -177315 -108595 -47712
18033 -47712 25262 57061 -43509 -54162 -47386 -97372 -298625 -414295 -361259 -261121 -96723
18022 -96723 -87071 -17470 10008 -61478 -95487 -34904 112479 214422 94755 123380 132238
18011 132238 -3826 -199937 -348419 -357275 -240905 -232934 -34162 98199 50811 23192 -140346
18000 -140346 -129070 -107543 -55802 -57388 -37576 -57690 16882 201347 218195 -81284 -146547
17989 -146547 -80026 65020 104888 -73736 -146252 -265576 -180651 -105911 -84636 -89422 -93377
17978 -93377 -168059 -194819 -229293 -198790 -100047 -58833 129803 111599 55933 12251 -58240
17967 -58240 -18318 44974 42177 -69029 -42473 103937 147387 42112 53713 -57358 -36186
17956 -36186 -118044 -41925 148288 -36497 -229646 -318949 -115856 -121477 -277010 -386324 -346760
17945 -346760 -304776 -132231 -102611 -177169 -348599 -325856 -48821 132986 -11321 12913
17935 12913 42552 -85598 -83893 -75618 -55657 -15133 109680 190148 105190 68102 32105 63295
17923 63295 131787 233816 439014 590657 617131 378134 168518 177987 286321 164454
17913 164454 178924 98886 -6126 72259 81690 127423 225194 133145 122155 131599 109343 36215
17901 36215 12997 46347 93596 68926 155850 185044 319353 367217 228902 187359 93010
17890 93010 -110882 41471 253162 426414 364579 62798 97702 263746 217885 227466 421733
17879 421733 355965 292444 275332 404581 423906 368943 312209 415064 361691 71743 70055
17868 70055 52671 82941 243912 372356 425546 407349 165619 -128393 -23004 84784
17858 84784 7386 -14623 28192 59765 173735 230931 156058 32939 -85447 -204648 -226500
17847 -226500 -144514 -26289 -207900 -160176 -92479 -174835 -271885 -91007 -26016 -42416 -217330
17836 -217330 -405747 -287196 -214859 18135 54325 -4556 -67850 113006 284001 344708
17826 344708 442923 316539 40900 -91646 -6729 77084 -10031 -129453 -129073 -68894 -235842
17815 -235842 -159390 -126018 -46949 -178442 -268794 -276121 -216577 -233879 -119036 58838 31557
17804 31557 -284573 -366664 -324523 -273283 -283345 -224962 -74658 75342 52829 54884 -17423
17793 -17423 -87386 -161703 -183414 -183403 -179297 27975 -28405 7597 298581 372385 214789 28147
17781 28147 157867 322034 374465 317793 168074 36017 -36741 -1231 77501 145074 139536
17770 139536 134320 45613 53245 44187 49989 -8908 106870 -38022 -191217 -203137 -160906 -148815
17758 -148815 3792 134715 41750 -160277 -72043 -61805 -190828 -233547 -140569 -235491 -279499
17747 -279499 -265919 -239720 -212233 74817 290342 124644 -12081 76741 112617 75634 23463
17736 23463 31718 -27410 8990 45660 53572 3568 -23521 -24245 -78996 -100717 10926 217989
17724 217989 211198 141648 82639 -43061 -65076 -40598 -112204 -91697 -93333 -132169 -192666 -150094
17712 -150094 -57037 -150320 -62648 53395 55733 91008 85562 -96799 -254359 -366566 -391761
17701 -391761 -370593 -340132 -368304 -418758 -457526 -457180 -447150 -264190 -127095 34088 -28086
17690 -28086 -232532 -243652 -239591 -268217 -272138 -464156 -440301 -177228 38261 46680 95469
17679 95469 -20993 -140626 -201102 -268314 -39571 186307 272110 58901 24799 113794 -21516
17668 -21516 5596 107084 62168 91607 187650 64188 -97625 -106231 -188831 -24741 70410
17657 70410 -45118 -48455 -6703 66638 -3416 -45344 -48368 -87080 -124054 -50317 57136 73991
17645 73991 116767 102140 90747 124152 283419 236489 169113 54999 90106 128759 2224
17634 2224 21612 4865 62368 126568 -42789 -59842 58327 190641 50408 44646 86156
17623 86156 -82160 -227644 -74405 96957 -121359 -220035 -73757 134323 121531 103755
17613 103755 17263 123183 123942 115439 132545 46653 -32852 -134719 -326713 -271362 -64202
17602 -64202 -118309 -157428 -45084 52925 -50677 -146615 116749 164977 48092 127290 185950
17591 185950 203690 131566 119319 353090 312068 151340 70357 228310 252312 173787 97601
17580 97601 -164858 -198218 -54334 119475 199422 117451 144410 -59081 12701 47904 -6811
17569 -6811 1637 7219 -122552 -69936 -62087 -111673 -163442 -108160 -91880 -124115 -37515 112987
17557 112987 193714 198604 129856 16141 -73878 -44526 3663 -215089 -100845 12119 1732
17546 1732 -125582 -246357 -12941 196079 297966 209835 -71157 -160993 -83075 -41800 -49052
17535 -49052 -130521 -168694 -43984 -110037 -59183 166511 212211 28070 -35607 10888 64923
17524 64923 61448 -60907 6063 -9303 -21505 -15613 144638 149936 163950 194317 175325 123062
17512 123062 41190 -47530 -140884 -119864 -135352 -80541 -245832 -197304 -225477 -108129 -17903
17501 -17903 -39400 -103605 -49626 -110959 -192066 -158282 -154947 -241365 -211764 -110021 14536
17490 14536 -25562 17439 41436 147134 158230 205260 159056 7455 235106 410567 186736
17479 186736 181270 315523 434480 181169 4206 175649 132004 55293 82581 97634 31267
17468 31267 12135 97191 224828 272981 184572 106308 -36991 -104872 -10559 105375 224966
17457 224966 223037 245168 97613 8348 86927 27823 -96434 -155374 -151031 -118099 -46477
17446 -46477 33938 69714 119334 521677 598977 368335 257953 296482 435234 264715 93071
17435 93071 31426 32935 94075 106952 81487 79752 165831 174685 147444 98905 187250 113919
17423 113919 -716 74480 164940 193944 -17790 -93525 -42685 112373 292120 375570 456779
17412 456779 346836 199893 121290 133316 218015 221879 145019 369698 337319 102704 130646
17401 130646 172054 111398 110098 184165 127702 207401 188034 36935 -187910 -110027 28573
17390 28573 -880 6201 -14012 -52005 -143607 -218461 -323234 -364199 -265756 -166855 -227333 -222553
17378 -222553 -262 132260 2022 -13977 -42120 97063 83921 104505 80509 -71478
17368 -71478 -140751 -52974 -2239 75294 -140618 -96719 -184954 -236811 -188726 56305 32025
17357 32025 140954 113766 67118 207233 179965 -14305 -195446 -101926 -68193 10981 -105202
17346 -105202 5745 -123243 -186969 -118532 -120764 -109134 82587 -25162 -83112 910 102641
17335 102641 135993 22431 -101660 -163014 -59575 -47717 -177675 -342272 -466611 -323780
17325 -323780 -311750 -295128 -248152 -356256 -296173 -272463 -215235 -270237 -148493 -130219 -53834
17314 -53834 -53709 -70658 -57252 -161657 -238012 -202269 -141115 -172889 -49794 86052 139881
17303 139881 -36303 -78874 -75429 -167612 -175885 -231004 -154253 -182966 -207123 -67748 -19093
17292 -19093 14437 -76356 -199068 -258631 -189185 -203530 -257460 -297269 -260475 -202480 -114106
17281 -114106 -170803 -276954 -232864 -188233 -249695 -20822 45494 -20650 84579 15949 -101151
17270 -101151 54004 132131 -107346 -247173 -198814 -798 54676 -92633 -149325 -124900
17260 -124900 -143967 -193940 -197609 102962 193666 56561 175992 235751 253881 106903 -22611
17249 -22611 -186297 -104401 -30924 -81678 83980 197909 191368 92171 -71610 -116486 -121414
17238 -121414 -150911 -149011 -25825 166633 136966 -46774 -39033 75158 -133934 -143682 -87240
17227 -87240 -118728 -72743 -38125 10862 35412 -16843 -1718 99560 11088 -16767 -119976
17216 -119976 -208289 -172131 -223142 -138406 -157114 -79659 -79336 -75776 -61835 -7608 63575 10275
17204 10275 -106643 -16592 110703 165183 125672 251363 277561 192710 -31979 -43493 -45128
17193 -45128 -181948 -268362 -95481 89957 85894 147080 151510 55534 22986 -233701 -328047
17182 -328047 25924 164749 -61178 -186005 -168707 -94230 -38765 18729 124145 -108442
17172 -108442 -159714 -88194 -168407 -17385 -37942 -118105 -184410 -188287 -188433 -58260 -62858 -150229
17160 -150229 -88627 -68908 -151393 -69832 -90610 -114013 -110503 -11901 -97520 -22971 -57810 -139218
17148 -139218 -212048 -20156 11292 103713 101114 118268 78092 54858 -11278 34137 -30287
17137 -30287 -111377 7064 116683 -4925 26186 38917 94809 149505 250581 439863 392382
17126 392382 190845 90502 15823 -17112 -65881 -39038 124094 61416 -10638 60800 22352
17115 22352 188609 182152 196759 111825 158144 240485 28391 13169 63159 129951 168559
17104 168559 114400 62708 37187 -52204 -32784 -60529 -77616 153847 154705 159081 121708 57187
17092 57187 185638 143986 96752 -52067 -186920 -119023 -138346 -264507 -268869 -168416 -36203
17081 -36203 226036 234577 -16104 -41157 6932 2730 43663 70850 81069 -26166 -2605
17070 -2605 -42961 57342 14703 -179955 -165146 -6144 144428 158990 164703 27058 35517
17059 35517 193668 192461 144017 244274 532886 641935 525050 410865 399703 313917 302941
17048 302941 102540 168578 117111 -49244 -68376 -59346 -73071 -124679 -238677 -202105 -83375
17037 -83375 -93534 11044 88792 -102686 -195834 -208028 -277554 -363141 -275260 -116121 -96778
17026 -96778 -5883 34321 3907 55580 126835 9022 28952 96542 9896 -95767 -11003
17015 -11003 -74410 -26066 -37642 -50077 -45205 -49709 60747 74617 34210 -3299 -182621 -238187
17003 -238187 -288470 -241588 -371274 -280010 -63538 26232 43691 -20235 -222354 -201511 -122180
16992 -122180 -125768 -61742 -171682 -315760 -439281 -237740 -122460 -59940 -36743 -89740 -41597
16981 -41597 -72469 -83773 -51545 51406 21254 -111686 -111355 -138168 -150870 33498 126197
16970 126197 98038 195270 223983 84697 -66714 45007 122143 265033 141434 -15114
16960 -15114 9357 88124 -131433 -298815 -329754 -318993 -197092 -96716 -160486 -133631 -84150
16949 -84150 -26554 142268 -78041 -260024 -304531 -303163 -279298 1419 130779 52401 -22136
16938 -22136 -5220 109464 265679 143409 47108 76969 8573 -61300 -91229 -177549 79899
16927 79899 74907 153929 250867 122554 -173241 -270703 -359215 -238793 -233116 -256205 -79257
16916 -79257 37423 144602 125888 -38079 -118673 -157139 -226051 -200504 -200332 -136126 -61569
16905 -61569 -52476 -40679 -144376 -285960 -275549 -426591 -213556 -79623 -50686 -113027 -61076
16894 -61076 74175 153755 77026 -22134 17467 -16515 152027 351032 225769 168573 87477
16883 87477 69721 22691 -73180 -87382 -92010 -212246 -169532 11649 83381 83284 69227 -70051
16871 -70051 -165886 135909 379190 360008 215423 -10094 174 -7279 -12093 -51560 -306081
16860 -306081 -375990 -279601 -277205 -268593 -121972 -156269 -230798 -154157 -23972 191797 131205
16849 131205 99094 70910 96125 193046 174532 137060 224321 191201 100521 -22626 -133424
16838 -133424 -42149 -28676 -123219 -56691 127905 14111 -182094 -253485 -107992 14478
16828 14478 89912 92684 33727 78015 -31800 34260 114249 -2577 -3080 -99881 -94525 -107207
16816 -107207 979 64697 -53188 52047 182746 50427 67975 120114 90465 68084
16806 68084 -24440 -97461 -248725 -176950 183772 249334 95976 -66976 -157257 -257307 -395200
16795 -395200 -299202 -223248 -155341 -208370 -187120 -202048 -24713 117474 148686 88125 -79185
16784 -79185 -88346 1053 49831 136294 188989 125138 256030 302821 -4036 40256 97789
16773 97789 110555 90780 91161 28166 -58254 -296072 -244169 -124350 -90073 -211611 -422628
16762 -422628 -475506 -244515 -162584 -160174 -152797 -202787 -116890 -144376 -132344 127167 27453
16751 27453 -76768 -99862 -240847 -102852 -83675 -200386 -294838 -274798 -181028 -108190 -127192
16740 -127192 -116808 -300423 -344146 -233201 -177732 -208645 -204709 -185092 -160432 -175155 -255080
16729 -255080 -242766 -34987 -37766 -98441 -70521 10810 105781 181854 168391 6108 -169461
16718 -169461 -154512 -163334 -226439 -225930 -227506 -159306 -66807 -183108 -287066 -226540 -90072 -93574
16706 -93574 -115899 -52281 -81423 -140056 -49974 163586 235560 142285 15238 -114397 -107980
16695 -107980 -112105 -117569 -76674 7320 9046 -110155 -67196 1510 52932 -16129 145218 254361
16683 254361 130074 290266 191335 155423 183917 273686 362608 307433 211554 201279 202218
16672 202218 192637 237378 347146 229448 95139 88829 9635 -135227 -46169 -30270 -73205
16661 -73205 -218859 -184208 -173958 -182693 -288458 -279360 -274936 -247618 -65840 11671 17866 -73484
16649 -73484 3010 78477 125812 -48092 -198026 -339429 -401102 -231244 57212 5578 -64779
16638 -64779 -39161 -171909 -103401 28112 30085 74676 42924 72193 -2365 -11123 41610 81751
16626 81751 152780 236346 152253 -11148 -170630 -171031 -208745 -310765 -405115 -216345 40609
16615 40609 168537 229845 224133 267297 178611 186014 257060 104343 -50091 -58311 -20587 32085
16603 32085 96304 2286 36630 14847 -202311 -242040 -111362 28973 123785 -83122 -232552
16592 -232552 -278981 -87706 -30118 -53757 58485 69241 59084 33552 22438 35927 56722
16581 56722 47261 -22681 -117702 -95057 -92837 -118132 -194985 -72395 -50247 17524 5045 75945
16569 75945 76226 7615 -35179 -67994 -267283 -154721 -16938 -73597 -199281 -229310 -92699
16558 -92699 -53858 -116338 -266847 -261238 -104335 -77329 29837 114011 127385 48928 31284
16547 31284 40750 112771 -1623 69246 197431 -32162 -170430 -382053 -394614 -252091 -152028
16536 -152028 -118610 -101836 -60820 25346 77853 -83020 -66190 -111606 -124673 -197434 -260538
16525 -260538 15317 118222 106691 81588 -116017 -96680 -128259 -131440 36662 -50058 -263345
16514 -263345 -249879 -148799 -154759 -158721 -53670 -175730 -271221 -61305 140558 104156 18511
16503 18511 82140 111515 136828 76674 -123439 -124914 2806 -18299 -47294 -119708 -158186
16492 -158186 -263233 -300096 -215323 -138080 -9560 24693 -10417 67057 17530 -4886 -1893
16481 -1893 -124209 -76200 93192 208790 207582 -61518 -120023 -22576 94126 151526 252300
16470 252300 180795 91344 210710 230066 121196 131310 116574 86693 47770 32799 151071
16459 151071 209255 222693 -24465 -121001 -9466 201408 235264 55969 -46122 -81910
16449 -81910 -15723 -1586 41856 152280 239057 -24753 -164583 25737 109479 -11991 25710
16438 25710 278594 151707 159747 195323 189456 162251 138657 -22923 -150809 -97716 144169
16427 144169 199291 167233 86187 -106828 -160774 -204891 -55381 -40946 134959 93014 108890
16416 108890 166687 39579 -40577 -52057 32013 78299 -27524 -201272 -25091 71136 144679
16405 144679 -11467 -149885 -239700 -74338 31702 112633 98004 51959 71379 90996 72893
16394 72893 -96781 -239174 -319080 -196378 -96676 -182277 -387832 -244286 117255 231852
16384 231852 210936 208401 65010 -17703 -13202 95207 137615 15676 -122215 -136432 -205878
16373 -205878 -298782 -366626 -320622 -263092 -192933 -136463 -39659 80120 66385 81191 174225
16362 174225 255679 56205 -156965 -15717 10473 173115 232397 162072 -50443 29407
16352 29407 141733 81629 16732 -73471 -83776 -238868 -248672 -101777 -51400 -57131 -118678
16341 -118678 -105671 42981 -33245 -182080 -70928 -56000 4852 -73654 -59247 32180 -30185
16330 -30185 125586 208518 38596 109909 38614 105061 52845 124813 49366 22617 -33293
16319 -33293 -179073 -243988 -74533 49857 6275 -130524 29752 107853 -50055 -122554
16309 -122554 -9604 171046 240670 217603 48424 167348 126529 -163392 -235351 -280908
16299 -280908 -331226 -300319 -380074 -275105 -166554 26328 -107479 -55115 -91041 -218380
16289 -218380 -86382 85090 68633 -76736 -92407 -174499 -150877 -228600 -322084 -326226 -332338
16278 -332338 -240423 -244197 -182106 -288016 -246671 -164517 -252762 -82477 76895 -45598 -106798
16267 -106798 -59584 -157189 -101875 -140393 -136183 59712 -17202 -134635 -280670 -210853 -112275
16256 -112275 -116999 -15405 55603 114419 -6802 -100289 6463 -106325 -114658 -1752 143373
16245 143373 145023 -3110 79041 82686 67640 121743 153088 377490 474943 377684 339144
16234 339144 362062 329355 268652 355672 244784 175279 286578 341548 163772 223659 289577
16223 289577 166150 49961 -98955 -164587 -119507 47333 139685 229283 244772 184677 235301
16212 235301 45316 2115 65256 45778 -33883 -13564 -111058 -177054 -120816 -93134 38858
16201 38858 5671 -41366 -149657 -35552 -56575 -49796 -28229 -9674 -119654 -297339 -233901
16190 -233901 -64712 -29380 -52828 -49289 -98489 -116862 -25212 83868 -60714 -24764 42255
16179 42255 20618 27724 -132369 -177563 -18885 -1123 127719 100660 -21891 -80338 -131517
16168 -131517 -187500 -200975 -234618 -257925 -278127 -117818 49736 65718 94011 24712 46129
16157 46129 15700 -3690 83665 24553 -9728 -147457 -96820 -39156 103745 62308 5664
16146 5664 -143436 -330174 -268080 -221009 -331271 -262571 -105137 30529 -23320 -32458 -39729
16135 -39729 144590 130291 -135504 -213615 -77812 82006 -5871 -144097 -14930 21531
16125 21531 -187496 -186660 20122 278017 285180 100078 73733 47305 42659 68096 123010 11328
16113 11328 -46574 9854 -1057 -92126 -305595 -366613 -434092 -547454 -193197 -43927 -112158
16102 -112158 -30657 -35723 143442 152656 246140 326790 232504 15542 -242093 -275600 -290760
16091 -290760 -208913 -92626 19539 7975 -83265 -198145 -127230 -14771 5788 -116441
16081 -116441 -184626 -218861 -115490 6347 -79949 -10867 151977 161877 -97005 -65361 -28424
16070 -28424 -3129 -69432 -116569 -61615 -81428 -115049 41069 88810 -42775 -190569 -163302
16059 -163302 -18413 35681 -95924 -191239 -260345 -108912 -46530 7411 238042 174150 178071
16048 178071 52437 -305024 -300196 -87554 191632 217727 95490 -40108 -14471 -34187
16038 -34187 66941 -18071 -103825 21067 -161158 -72124 137085 128710 55600 38333 -79155
16027 -79155 -117621 -168083 -38597 -169986 -435782 -380001 -207108 -144543 885 119847
16017 119847 128730 71810 -46044 -155072 -74642 54845 48397 -2246 102534 221231 376038
16006 376038 417591 306370 159872 158812 86916 -32650 -181331 -144664 -98140 -47575 -60736
15995 -60736 -22049 89721 115883 34059 -107659 -165096 -47983 -64958 -208167 -161911 -136672
15984 -136672 -117235 -108335 -72566 -248650 -260566 -129040 -95691 -43713 -62648 -8289 54680
15973 54680 -36403 -38348 -44387 -158214 -161603 50665 129591 53725 179593 253196 101056
15962 101056 -116837 -74017 119287 147939 75638 52804 44722 73477 -36042 -161762 -217965
15951 -217965 -317285 -369678 -272377 -35420 16835 97346 121738 150034 117162 -39880 -90324
15940 -90324 -42388 36336 -14382 -150693 -115927 -149728 -38358 -3008 -67035 -58242 -114530
15929 -114530 -132158 -112465 -156372 -250840 -280717 -289708 -292766 -242537 -114882 -49169 -69441 -61586
15917 -61586 -13938 121487 297014 409958 239467 281229 282828 203358 211645 148310 92858
15906 92858 79126 146803 304968 263516 60146 78273 92910 127137 -48656 -52215 -57372
15895 -57372 36580 140281 214525 150167 282899 240189 282593 207223 74211 30980 1109
15884 1109 -9183 213518 127288 44316 -26601 154918 264052 224122 -48608 -93892 -99792
15873 -99792 -225854 -269506 -186140 26510 -22054 -172936 -226634 -40052 -102902 -116275 39438
15862 39438 201513 258939 154941 201611 52544 -93462 94592 6581 -79982 31000
15852 31000 21049 6185 17652 -134165 -218645 -242951 -205885 -137648 21921 36061 55821
15841 55821 106571 151751 84930 184758 144169 195263 220504 213497 86148 157255 104157 121967
15829 121967 -21069 2869 -33128 -157781 56000 66120 -16080 -113060 -26887 -89710 -113620
15818 -113620 -69844 -147480 -278475 -331077 -287963 -325043 -329552 -231965 -205581 -339772 -276406
15807 -276406 -99647 1498 136402 154875 28548 -137979 -182300 -271356 -198019 -73483
15797 -73483 -116232 -122135 -49320 176254 220075 50483 77697 -30689 -225485 -238773 -155261
15786 -155261 -35296 56134 78979 215154 225606 65009 -4848 118947 94049 -45906
15776 -45906 -224826 -353846 -207972 -162918 -221703 -136105 30838 -6273 24274 -1580 -60179
15765 -60179 -161134 -329018 -213693 -54822 86468 53976 41895 4975 -97226 -134209
15755 -134209 -63819 28253 92622 35215 85908 51435 -19460 -184095 -282663 -102013 32646
15744 32646 23462 100994 38338 110290 3773 -103000 -86098 64753 69028 -10586 17461
15733 17461 -20637 -7282 -90549 26003 90571 128326 107647 50106 63823 -40062 -6722
15722 -6722 -29500 -107701 -51890 -53410 -100396 -174157 -122407 -69303 -203343 -272494 -393520 -214623
15710 -214623 23665 14377 -82736 -106588 -239285 -152836 -176352 -121332 47817 116256 36221
15699 36221 79984 272311 405384 311021 244995 162348 50414 -9827 -88236 -126112 -104614
15688 -104614 -17370 -93338 -92448 -38612 22825 64056 2845 87802 97903 95985 -5527 -71166
15676 -71166 34153 105929 54021 194828 172066 151660 106448 35772 -8430 -142720 -267831
15665 -267831 -228656 69826 336482 265630 271589 195081 121072 -60357 -234018 -431018 -325633
15654 -325633 -315140 -182474 -1120 121694 64957 12216 -158847 -115897 -24071 25896 104129
15643 104129 65392 -144191 -395088 -564376 -378556 -152505 -254155 -334362 -146423 -28569
15633 -28569 55807 -30901 -18941 -6255 -196140 -206335 -181332 -109014 54986 116908 -23942
15622 -23942 -102726 -209702 -104004 -158237 -149304 -140126 -16758 -11886 -56357 -9130 70123 34840
15610 34840 -26212 79781 -21774 -98598 -15204 104035 72101 -128820 -237892 -117022
15600 -117022 -35802 -78297 -66180 -2250 -46357 -32188 -217798 -214162 -14381 -99092 -152413
15589 -152413 -131001 -160268 -111331 106674 111003 36262 -153516 -162084 -85660 48132 -32284
15578 -32284 -14223 225528 268658 92008 142657 171136 179809 53303 -142881 -181125 -101531
15567 -101531 -236353 -206735 -150064 -175307 -33063 -13899 31142 188620 247050 166676 82902
15556 82902 84255 11939 -7817 -44621 -144976 -131387 -1177 129325 167384 149064 81459
15545 81459 -15776 -20768 55447 17188 123573 231188 362249 518862 546171 270260 136690
15534 136690 103816 3674 246933 264329 214295 244353 256794 150764 -24599 -15205 75197
15523 75197 -28863 -248328 -192446 -173741 -194768 -178212 -253380 -227514 -87510 6476 33537
15512 33537 43521 97297 207630 127865 -23158 -37087 120256 214183 274597 162818 126884
15501 126884 -114999 -148173 -128562 -21964 116969 86780 9058 -8670 338607 455179
15491 455179 336116 390070 377869 183625 52542 -130320 -278190 -270505 -339733 -235632
15481 -235632 -85865 86410 -127 -136759 -106254 -103587 -89800 16575 -507 28822 -3465
15470 -3465 16288 -52394 69089 109158 153479 92989 69889 4107 -81216 -123494 15114
15459 15114 63618 92941 38656 -86510 -81039 -257 -141702 -106048 -192913 -181684 -105802
15448 -105802 45781 -1383 -174305 -107677 -81599 -135058 -241681 -54634 -103767 -204225
15438 -204225 -238971 -155868 -47936 -40716 32581 57074 -34150 -145481 -182483 -91783 -100387
15427 -100387 -48588 -673 1483 20819 8747 -38522 -9861 98254 -9484 -144844 34784
15416 34784 20613 103963 256244 253979 141069 -22786 -63926 139591 85447 -11722 -7635
15405 -7635 107846 285205 197963 197071 282754 256844 246402 173564 302037 200898 86288
15394 86288 160948 189412 15934 45260 88555 101254 137963 192129 199563 152154 190431 106785
15382 106785 150237 292535 368926 398904 203654 161044 18998 -98463 68162 91981
15372 91981 59832 2032 -131840 -66667 -150025 -150999 -115205 1197 108083 257959 225729
15361 225729 100342 -71689 -171252 -150861 -58074 7552 59336 181828 302057 183028
15351 183028 83450 150690 116995 22284 83765 140893 304869 370379 368248 188425 -44481
15340 -44481 -62147 91606 222275 55643 19459 -62020 -30192 55903 108829 -4431 -8627
15329 -8627 -34147 -3274 16972 -25252 -83151 -80811 23374 77492 48788 -66882 -97029 101544
15317 101544 261157 -791 -50248 -30432 -58127 -53398 1987 34173 -154183 -187648 -141045
15306 -141045 -23103 134410 130151 164551 67340 -10016 -100188 131044 235119 199260 229447
15295 229447 341116 137106 -100654 -96234 36458 265890 183874 85151 77422 45650 34148
15284 34148 -43233 -210209 -185325 -68575 238377 152526 -18690 49326 7399 -46283 12085
15273 12085 -39825 -100963 -3996 90611 143665 100218 204778 140425 65294 255882 499886
15262 499886 385931 176830 55653 -8326 -215160 -251567 -229286 -192588 -78434 -122364
15252 -122364 -107076 -5002 169126 107713 -27717 -126281 -104185 -122038 -213293 -210136 -94110
15241 -94110 -147000 -212453 -110686 -28698 -88432 -187597 -350179 -215619 -156626 -159061 50209
15230 50209 84446 147768 69192 -15389 -134355 -171382 17054 -33842 -9715 1187 -45538
15219 -45538 36990 -8951 35985 -36991 -60916 -113272 -265587 -472597 -462700 -368151 -224065
15208 -224065 -42195 84 -120074 -206759 -229851 27386 99390 -19238 -120612 -210072
15198 -210072 -181060 67920 217265 228621 245593 252174 132618 41825 138917 145157 -85954
15187 -85954 -227968 -283564 -193938 -2252 83398 229722 166124 150747 -32422 -86821 34078
15176 34078 208374 349749 240191 144988 -17717 -24284 -10125 -44205 39998 147767 358617
15165 358617 417279 259346 240717 297881 171885 -35172 -122769 -111339 -237151 -182809 -146751
15154 -146751 58095 73496 -55647 3037 258099 43867 -83008 -106548 -39448 -54289
15144 -54289 85222 -52506 -225168 -141847 -4140 109305 286894 170077 220318 291243
15134 291243 126288 2245 -74548 -150943 -100458 -4516 5526 -13668 41013 48555 -71845
15123 -71845 -218080 -311913 -202172 33887 84764 -65512 -196084 -162751 -98106 -5160 82347
15112 82347 97949 166911 152527 111177 98770 109971 59098 204941 526400 542094 446164
15101 446164 286365 364197 108046 -29837 65935 8376 166129 123384 -10798 69056
15091 69056 218643 168351 -71994 -108924 -125612 11860 40492 22829 153106 201706 244849
15080 244849 153511 81836 -93999 -193436 -117658 -203667 -170724 35785 -46898 -186770 -178155
15069 -178155 -99175 -3517 84019 131443 12877 -30982 -177648 -137974 54720 13962 -59345
15058 -59345 -192721 -199233 -84856 10666 14002 66396 38786 2460 -23833 -57714 -77773 -57074
15046 -57074 -100752 -223444 -202610 -111967 -166496 -260528 -314519 -161414 182662 43983 -65660
15035 -65660 -132867 -246402 -181719 -128769 -72808 -45029 -35748 -35588 -73422 106721 177741 127378
15023 127378 261551 227702 260292 407318 438988 420768 613174 652585 682541 702241 732713
15012 732713 527542 366363 560799 768212 896362 1531455 2774623 4869519 6823520
15003 6823520 6123025 3843439 2055533 1406106 1178802 953398 714578 649322 549914
14994 549914 385791 179870 110112 207425 91829 -104074 -96584 92623 164726 169603 -77196
14983 -77196 -111541 -156010 -184723 -158476 -122071 -165922 -167443 -599 -8622 33266 15221 -115888
14971 -115888 -86737 -144719 -183313 -215523 -255949 -143696 -266850 -250284 12937 110133 15426
14960 15426 26370 3769 -35860 -183898 -204906 -167002 -193565 -199645 -106233 -44876 -18372 49533
14948 49533 55861 -72224 -91979 -154980 -293822 -378152 -180662 -15146 97098 -51683 -151794
14937 -151794 -103262 -132006 -4548 44225 76358 171866 10604 -101902 -77941 -198180 -230816
14926 -230816 -145673 -60168 73612 26020 2646 98718 107159 182119 75432 40322 109415
14915 109415 3054 -69608 -57868 -74752 -205685 -207971 -178662 -131580 -27329 31242 188658
14904 188658 123609 51136 97644 -25489 -48443 14492 37556 -80533 -212014 -142382 -232331
14893 -232331 -357545 -333718 -170503 -109547 -51255 37499 -37190 -77120 -214610 -250171 -115332
14882 -115332 -42633 -258422 -233150 -111858 12387 38583 136126 198798 171593 204960 286493
14871 286493 309107 269145 164912 140651 136550 184925 221472 80543 156146 221398 133039
14860 133039 -41005 -225218 -369391 -355751 -90488 -5990 -81935 -51942 -120377 -202395 -106890
14849 -106890 -71185 -50263 -18786 57802 106924 -23049 23992 -16808 -21994 67163 85816
14838 85816 276958 44819 -2863 -48841 -305157 -200251 13551 72144 99853 168791 139848
14827 139848 113336 110545 206495 191809 44468 24616 125358 233093 196033 107582 183603
14816 183603 7690 -37554 48632 -6047 -58475 -238545 -195899 -104393 -173674 -70965 -41610
14805 -41610 -29982 -56681 78560 196280 154142 -14803 -88797 -96037 -115153 -73789 135546
14794 135546 208126 340871 241031 204260 195000 28972 -157708 -133003 -11431 53649 52814
14783 52814 109964 77120 -31445 -78528 65529 46750 -67887 -22381 42762 87076 167953
14772 167953 189574 64937 61392 197583 311391 364114 196024 109875 161885 101139 -117077
14761 -117077 -124038 75875 74619 -42216 -200103 -324328 -364384 -371483 -256564 -111961 34026
14750 34026 192363 207498 267007 329383 208889 54679 -250 -96137 34552 -21684 -43365
14739 -43365 -43500 -27580 -36260 11832 51039 89621 -10526 -114265 -240059 -42966 26643
14728 26643 -43146 -145279 -77912 112054 89545 -126526 29384 287292 261210 78483
14718 78483 94491 -57623 -211980 -73021 116866 82368 64193 167470 207599 124381 150657
14707 150657 303930 296598 258432 186683 71993 -58418 -60776 -40332 148190 50356 -107537
14696 -107537 -58158 -35222 -52588 75072 243095 345780 248529 265679 328343 294297 207227
14685 207227 53211 -51328 -25004 -169670 -244772 -241361 -106730 -82719 -113273 -87732 -42518
14674 -42518 -89012 -227394 -317543 -202564 66268 -38581 -102438 -104575 -30699 -78093 -152097
14663 -152097 -128264 -214992 -188904 -106566 -80130 -34763 19317 93743 147794 212064 303472
14652 303472 308376 298847 377828 358609 393851 283913 220351 52384 16415 256050 209712
14641 209712 62742 -57466 24923 44016 220865 452482 511144 200852 165866 178438
14631 178438 217754 287040 193650 126753 18347 37797 -64584 -70555 -66961 -45413 -84181
14620 -84181 -145849 53896 -46135 -275487 -247509 -121659 -39370 -145833 -20184 170573
14610 170573 170538 292119 247432 116334 17036 -437 -4101 -47271 -14519 86611 146827 118724
14598 118724 53161 -97726 -181901 -93683 25295 -15537 -36895 -15493 68639 6905 76970
14587 76970 142562 42245 -112708 -95727 -155204 -249063 -128955 -144119 -169018 -68500 73705
14576 73705 98302 59388 18391 44512 87448 76143 42537 43619 66940 21665 -92038 -88877
14564 -88877 -43951 29776 157649 70900 33244 194569 185520 109184 122267 180998 -119111
14553 -119111 -185242 -190670 -226473 -81852 45645 139543 166005 80948 149491 176084 -20779
14542 -20779 56931 25567 -79728 -191351 -298149 -254533 -184088 -27718 -160133 -163048 -139930
14531 -139930 -48349 69851 38248 -122527 -243694 -340676 -166411 -18621 66816 159492
14521 159492 72532 -119698 -52125 -23159 84622 122046 16340 35185 50029 100206 170384
14510 170384 246752 272003 163972 108740 73534 -43213 -28780 -14632 -219777 -252610 -296308
14499 -296308 -383990 -317224 -161153 34857 49941 80597 109143 149633 278168 305852 173580
14488 173580 4362 -123167 -24473 186062 113955 134006 166206 49275 57210 53429 48933
14477 48933 201597 272642 421753 112929 -15252 -99240 -254802 -368946 -237999 -106339
14467 -106339 -88300 -156024 -244547 -213216 -247098 -330005 -340185 -216693 -190216 -219833 -178760
14456 -178760 -209361 -62850 78007 174141 218416 219564 443426 428578 76739 -29202 -22424
14445 -22424 -122277 -102369 -31836 -18604 14600 185637 5578 -104325 -28893 -170216 -234911
14434 -234911 82332 240823 183079 164447 54119 -52904 37137 -29150 -265488 -287182
14424 -287182 -169728 -100630 -79524 -149834 -331755 -220374 -129256 -187162 -153677 -148601 -20917
14413 -20917 69605 59504 -84415 -223221 -123130 42390 216740 182292 225939 240956 299517
14402 299517 315999 290661 167489 22366 -21544 7050 155029 262750 283888 302600 288376
14391 288376 283622 352139 326753 325537 148427 46329 133014 235632 183045 -32217 20107
14380 20107 136081 -28320 -160915 -278309 -194682 -128668 -169257 -331676 -312698 -252790 -137225
14369 -137225 67647 166795 208172 147583 218447 344108 197596 134241 239524 358605
14359 358605 716445 959109 1294651 1402018 1263607 1105190 937278 423070 332632 411588
14349 411588 366609 279068 201126 117956 66005 -101651 34526 278279 158003 4389
14339 4389 39513 -83232 -149638 -371669 -196329 -38922 71289 206229 343470 231077
14329 231077 68088 69777 148990 163250 237095 215435 283928 387423 261434 33810 144779
14318 144779 314538 215113 156162 138383 79490 43380 97237 46110 48300 -52908 23185
14307 23185 132425 198225 201253 356912 379566 240277 74306 16724 59325 98285 7727
14296 7727 -145047 -230232 -111854 -28055 13849 -74784 -60337 37263 160425 305922 337521
14285 337521 381930 366855 411870 248302 143838 99639 174102 236895 142831 177004 206588
14274 206588 210705 72127 13011 -175102 -187059 -12395 58928 -72476 -110556 26942 20250
14263 20250 -92817 -70932 28236 -45060 -146873 -244087 -272596 -225099 -83199 -65905 -1205
14252 -1205 -42242 -239730 -172462 -100251 -166791 -108751 6981 67752 71615 -61325 -63645 185624
14240 185624 332590 297883 256722 120808 -16530 10236 -59187 -56508 -50307 -39694 -54456
14229 -54456 -1044 30790 142596 173836 64496 -14474 67508 147376 226814 318103 354403
14218 354403 216556 211224 318654 184049 54499 90340 -135850 -127262 -191041 -101898 44224
14207 44224 47821 6906 90987 228896 336362 515145 454008 351544 219092 64762 85190
14196 85190 216298 235605 194079 134842 129624 250664 241721 561903 488925 176258 54108
14185 54108 57546 -41111 -2295 174059 286898 150683 31770 -114505 -184574 -131463 7338
14174 7338 -45011 -110748 -252934 -184226 -6377 87171 263866 395219 382907 270153 137058
14163 137058 -57891 -220824 -284966 -326612 -470573 -361798 -217422 -205530 -41701 55470
14153 55470 86264 5315 2969 12276 154187 147852 106497 125316 142793 243384 191853 172421
14141 172421 242042 158814 63293 12423 -46395 52151 120532 121242 303306 235721 141117 -16071
14129 -16071 -10369 -48476 -122759 -64747 -77640 -56055 98479 109969 9532 -19330 123887
14118 123887 211624 317476 345591 181219 125916 52336 155740 99727 -49058 -88228 -135506
14107 -135506 -197593 -136695 3787 19239 17212 89567 69431 20890 -51959 25423 93547
14096 93547 15433 -71056 91403 186028 155247 127710 184950 220935 239750 245773 456929
14085 456929 569862 512499 390915 142887 76927 -61350 -171903 -145354 -94799 170288
14075 170288 162808 11971 79507 212729 291741 294866 266107 124208 -30865 82540 173902
14064 173902 55684 179173 36005 77984 104911 113200 37596 -79636 -155489 -191325 -224269
14053 -224269 -324497 -281701 -147030 20370 176516 335510 334162 193075 85037 138176
14043 138176 364874 291135 395974 286268 268985 341889 426513 465797 357674 55863
14033 55863 51117 32535 6101 299551 615715 670584 623050 479229 566892 536146 504869
14022 504869 725701 711439 485047 247949 146378 -128917 -179113 -225655 -321978 -286034
14012 -286034 -339734 -177610 -77193 -178151 -293963 -225330 -156821 -21649 30063 2796
14002 2796 82060 104852 229815 317933 331004 132091 -31970 7224 155033 440790 841988
13991 841988 1164931 1291984 1429393 1392662 1143348 833574 578745 403036 402975 405025 449293
13980 449293 306411 238776 306172 371067 368726 361696 225564 166173 129725 189121 328658
13969 328658 467734 421385 307218 214696 102692 -27625 -15164 11931 78068 336827
13959 336827 377183 327497 273908 189942 89309 31376 115213 228845 422649 616693 491553
13948 491553 391156 124229 27536 53931 37313 214595 331052 328835 133597 11793
13938 11793 -38671 110549 176731 142220 196236 223629 242859 332664 352717 466404 668857
13927 668857 833198 899183 875064 845527 921463 882711 899174 711285 565330 652296 719843
13916 719843 1020789 1112860 810251 806701 922328 1040492 1263665 1384773 1563487 1763205
13906 1763205 2019188 2207718 2256304 2292741 2261565 2194458 2216981 2252598 2408216 2447431 2502844
13895 2502844 2628006 2781498 2956868 3087461 3381522 3940108 4587351 5288911 6002140
13886 6002140 6680537 7473828 8356550 9370082 10414434 11700619 13043076 14429687 16467302
13877 16467302 19223244 22650884 27067112 32827100 40601687 51384588 67064490 90084159
13869 90084159 123184124 169195296 226572865 281132846 306421985 286212669 233522401
13862 233522401 175844245 129974287 98177204 76634997 61756792 50890899 42270025
13855 42270025 35149354 29337725 24544053 20647248 17710071 15224410 13288441 11635066
13847 11635066 10408183 9356425 8493075 7998982 7639239 7271650 6690553 6125795 5605479
13838 5605479 5102049 4787477 4547405 4314030 4049934 3615299 3067024 2788753 2441785
13829 2441785 2121735 1770892 1695927 1603781 1379315 1264119 1157173 1080568 1199387 1262583
13819 1262583 1190942 1286822 1476837 1396876 1268547 1209146 1248528 1165794 931848 738121
13809 738121 648305 565785 723878 965244 912064 892640 940212 1128253 1023392 941984 935460
13798 935460 824727 882681 811396 855155 967986 883883 557521 558215 663384 618037 348636
13787 348636 130352 147654 392508 688444 781555 710644 673460 563156 617607 638470 541109
13776 541109 544066 620790 646742 670188 693895 663101 653819 495729 527263 367776 326499
13765 326499 350936 477510 499678 413238 139000 106893 154532 150635 188059 98455 -109493
13754 -109493 -159560 -222436 -108126 -50738 -133551 -202818 -16048 -45457 -94266 -229006 -318743
13743 -318743 -468808 -660849 -620988 -544479 -430682 -199997 78586 147634 328820 423563
13733 423563 317788 228549 68228 -84158 -34065 236410 270078 320529 219033 187243
13723 187243 276127 531315 573365 409187 396094 454940 496065 521950 564486 613265 521191
13712 521191 330036 123309 -179775 -332496 -398268 -370920 -213542 -49614 -169719 -191679
13702 -191679 -80653 -46956 -142633 -218947 -124560 -62379 5580 145428 243352 286762 122392
13691 122392 33060 -3898 74672 -67594 -102789 -96443 81974 178469 252894 341223 217057
13680 217057 164837 194417 381554 573509 570917 498956 463572 331644 292453 -11252 -156917
13669 -156917 -107668 -162252 -140730 -143798 -97434 -166937 -137565 -37884 -7255 34416 82013 -7778
13657 -7778 -144250 -165983 -48964 72486 105037 63554 120505 50827 199304 218747 65215
13646 65215 -33582 -129222 -166232 -56736 5124 -93557 -156429 -107668 -100512 18867 79378
13635 79378 -19629 48578 -93036 -67093 -24318 9261 51448 11126 -40158 -188348 -130494
13624 -130494 -101099 -35307 10173 -141567 -151866 -36105 -51001 35356 34103 103347 129790
13613 129790 188773 289598 207167 128985 -21378 96572 83049 23805 58959 83394 41270
13602 41270 -58629 -136646 160450 216231 245353 146210 56057 -13966 34438 55630 155155
13591 155155 218672 243146 227275 295537 280400 212763 271591 348692 253224 133396 215319
13580 215319 254652 318212 278574 116937 244023 302044 355945 248796 177623 341351 437794
13569 437794 278181 54785 -187179 -321483 -351973 -250317 -357834 -378609 -239025 -44719
13559 -44719 120751 139654 73099 89134 413620 648301 570787 388010 373933 256329 127506
13548 127506 67278 -109662 -314967 -306885 -280892 -237488 -26635 149367 157417 89355 -24726
13537 -24726 35632 -39111 194426 254555 100412 -86923 -154481 -106124 -150736 -234338 -221585
13526 -221585 -90413 15656 -31237 -27680 -34922 -322266 -317621 -209109 73998 -34140 -184021
13515 -184021 -79170 -14607 137596 17308 -192264 -180684 2332 63003 113186 211533
13505 211533 96609 6945 -88386 -93668 -144109 -258501 40877 366656 306293 183719 253382
13494 253382 339558 258028 -20607 4472 12158 -41791 20179 18831 -83392 -243426 -318442
13483 -318442 -191023 -194880 -9773 177832 23095 -3540 43630 90159 65254 -19432 -167921
13472 -167921 -297296 -234135 -408039 -525070 -392820 -140338 -148687 -95070 -131219 -146176 -273986
13461 -273986 -246681 -233217 -149207 1696 -74405 -128435 -142393 -148955 -129332 70692 68779
13450 68779 -14575 -20998 186801 173097 70204 -91900 11278 8172 -204869 -244397 -215216
13439 -215216 -257150 -190280 57334 230105 178493 76616 77217 -27981 -57440 -36226 -108523
13428 -108523 -159336 -175437 -136146 -126436 -204454 -337025 -213973 -108304 -24088 -137971 -334105
13417 -334105 -515511 -138814 -7729 -76676 -126272 -99197 -49894 -106723 -140993 31717 -16668
13406 -16668 -31982 62098 -24403 -191243 -97687 -27579 -93771 91771 174983 169127 205938
13395 205938 219934 179942 67960 44351 290774 556542 663241 355091 257437 134215
13385 134215 33287 -20363 49441 158486 214958 253722 272268 315707 425233 368430 526468
13374 526468 662224 650531 774172 922716 1126189 1320837 1409275 1348433 1276663 1084200
13364 1084200 841913 580224 575956 467064 270219 189811 61752 130855 128414 60648 98360
13353 98360 79709 82622 68820 112562 229354 62129 41715 118797 318766 340388 238136
13342 238136 259330 257555 13920 22442 5298 124281 266681 262088 190815 52405 -86217
13331 -86217 -157861 -43634 91496 66151 -29191 84184 197710 125619 109264 8278 231489
13320 231489 243325 124798 69840 -74459 -113687 21759 127059 119173 69844 167430 233654
13309 233654 193419 204585 202372 121305 220667 381588 333120 155149 83937 117954 4703
13298 4703 52909 -37880 -18312 -5765 92403 304911 546835 500463 342274 217155 94624
13287 94624 154297 328440 446532 262792 53363 45887 164868 215347 199774 152529 132058
13276 132058 114184 169276 264866 422042 379299 230875 227660 177836 248600 266023 161828
13265 161828 125542 114273 35803 -50411 -73026 83495 87823 78695 52055 59204 122012 54846
13253 54846 64416 155269 103123 -6721 51579 48429 1196 -1187 29602 37512 78626 154002
13241 154002 131882 26865 135640 350133 327750 266739 189163 68571 -1576 62814 66010
13230 66010 -53002 -101675 26512 208813 402354 453348 324593 317173 268151 419130 415064
13219 415064 196667 246566 493229 470804 319704 66119 -158747 -47834 85344 106674
13209 106674 67591 58939 -140859 -169755 -83235 -31043 133874 88415 85122 101335 158220
13198 158220 -15309 -254089 -124446 -62495 -69993 -81415 -113337 -121926 19778 -83699 -204929
13187 -204929 -394037 -257184 3725 -37086 -163507 -250937 -78277 21075 105054 67691
13177 67691 54997 73071 -26874 12038 -125761 -81159 22410 8551 39201 19767 156966
13166 156966 265975 96287 50939 19517 -26423 -115019 -31506 211956 225487 58013 -78296
13155 -78296 -152459 -200302 -112661 -135808 -276291 -186970 22742 81816 160153 104913 -205686
13144 -205686 -353882 -228333 11656 -1209 -39554 136602 279502 46436 -12009 131648
13134 131648 254449 178403 105848 203087 239418 70082 13305 -21668 -148605 -235021 -350842
13123 -350842 -208274 -8730 -84162 15033 45382 -101464 -147077 -173535 -13260 -13749 -23641
13112 -23641 23092 241726 134006 25082 16373 31280 159355 123061 -22612 -106240 -153081
13101 -153081 -51717 -159340 -290568 -297224 -20883 68225 55768 275265 204563 271174 174318
13090 174318 -46909 104376 225227 197505 135729 69945 -77258 -177647 -224301 -235854
13080 -235854 -237364 -331529 -346940 -348749 -248134 -62177 -109436 -245447 -184586 -84041 -43086
13069 -43086 61538 194970 51537 340 17311 214183 321197 116217 226542 313013
13059 313013 185653 142196 130553 146194 173819 156661 118395 92893 33131 68660 162864
13048 162864 159966 -28757 -77979 -266802 -306856 -185193 -220559 -174268 -69622 -98132 -176384
13037 -176384 -28230 105314 70876 99870 185602 99823 -40140 -178346 -216165 -172735 -286736
13026 -286736 -419102 -165090 144028 75776 -18484 -58769 101676 228026 365351 373267
13016 373267 250163 161897 80700 169820 271591 190365 136711 7597 26850 135572 274757
13005 274757 214907 2137 -64404 45030 96514 107223 127648 -108393 -157265 -96777 -53776
12994 -53776 77751 200059 187799 221856 189398 115779 165464 222539 300807 289401 346628
12983 346628 301688 320325 290523 56644 41149 188480 327157 142338 94027 3914 -176904
12972 -176904 -159225 -17331 -13493 -118357 -225701 -98577 187419 233382 24951 -265861
12962 -265861 -226015 -74134 42702 114082 -165804 -414799 -556164 -520990 -358937 -284247
12952 -284247 -85770 -46188 -117262 -205582 -176871 -13845 39314 186513 111392 80091 -32191
12941 -32191 -62648 371 111312 134323 142858 19537 -67155 57116 186990 296568 191590
12930 191590 225523 247698 231954 124958 75405 190875 46659 -63567 -43613 45012 41875
12919 41875 -63585 -27337 -58546 -62321 113735 121367 332142 519952 413685 345575 455181
12908 455181 416517 269810 233224 35039 -4517 150311 190355 196073 340392 284394 111330
12897 111330 18265 54712 113312 170046 74333 663 56653 189456 95296 146232 92234
12886 92234 -38554 -19076 -52220 -103112 -86728 18814 80412 -13144 121417 86508 -20741
12875 -20741 -171884 -209428 -106531 -46864 4108 80368 -19121 -80044 -2121 11816 146477
12864 146477 289149 288104 304647 318498 185134 4550 25003 -30832 -82582 -62931 -92322
12853 -92322 -160679 -236350 -89730 -68598 -98193 91840 125102 138341 99680 4717 82925
12842 82925 6550 20085 188799 172046 -243745 -255277 -281196 -170099 -19695 23925 53930
12831 53930 -562 76096 -18343 -88585 -95880 -159351 -176795 -256568 -337277 -331800 -216280 -126510
12819 -126510 -137488 -135369 -280405 -271580 -70611 -123125 -71853 -38378 -58372 -50180 -40317 14142
12807 14142 58030 -365 -192516 -150605 -13150 -44651 -55424 -73609 -97814 -189613 -23331
12796 -23331 -132322 -143820 -16740 -85017 -100279 -13432 143776 29396 -65103 42648 71850
12785 71850 51235 7062 -96555 -170583 -31109 -26120 -49672 -59054 -35758 -122984 -184924 27900
12773 27900 162304 134027 55644 -76098 -69823 -109814 -301354 -365872 -294616 -280712 -211724
12762 -211724 -110724 85754 67544 88557 69767 -14823 -59040 -128608 -56390 59440 165784
12751 165784 198149 211606 196573 63708 128662 205009 -57684 -91816 -45491 -99212 -93616
12740 -93616 39495 66007 3565 -13288 52726 133420 145858 137516 122677 28047 4987 101904
12728 101904 269058 283507 133747 -40778 -81130 -240699 -224038 -15319 -103168 -146544
12718 -146544 62056 170409 111878 49350 -75533 -163113 -137075 -132422 -92988 -130051 -84250
12707 -84250 101708 95793 -62132 -38276 10164 6895 69207 -95090 -187801 -17148 238819
12696 238819 240416 84370 -57571 21161 83663 235967 414050 499524 327140 55298
12686 55298 104634 111395 92602 61982 188249 161831 168190 250510 264741 31510 36518 144744
12674 144744 242998 95208 -54879 45922 -70555 27164 106846 81467 33371 -61748 29860
12663 29860 131887 136248 128408 86151 10725 -36342 25668 -34036 70138 112457 275564
12652 275564 156669 -111086 -340366 -371582 -387527 -249010 -52312 20097 -14758 119586
12642 119586 110398 122502 -40679 -141057 -70855 78466 105853 61478 372288 300502 248291
12631 248291 174404 188899 406176 380441 296859 179404 61081 234848 259256 23654
12621 23654 -144906 -45279 -132256 -89608 -82391 50141 160298 20376 57999 36577 -10348
12610 -10348 52748 26561 42287 5053 127219 333602 311564 272480 186500 148999 61527
12599 61527 -200747 -302059 -362985 -296517 -119417 36006 47827 3545 -15713 50826 136763
12588 136763 242275 291351 117533 -50452 -135864 -257882 -333504 -360461 -267028 -16792
12578 -16792 115649 -10226 -41516 50484 160917 60193 -65529 57157 -13053 18051
12568 18051 16483 17504 2246 9278 -48046 -78996 27741 84871 171186 225283 19510 -153357
12556 -153357 -121263 -78804 -159222 -91793 -40280 170130 219820 57454 -114849 -134069 -185702
12545 -185702 -90842 85723 230591 108150 212747 36305 -85158 966 243463 128469
12535 128469 -106818 -22291 -96044 -227186 -47850 60586 76974 -234213 -415601 -382064
12525 -382064 -320907 -183427 -76957 -58949 -26629 96780 130723 235392 335445 425047
12515 425047 446490 411899 392779 266126 56789 -141792 -86266 -139840 -136582 -167037 -168332
12504 -168332 -329397 -382566 -424938 -405538 -251208 -97662 361 46405 31687 -28385 -61699
12493 -61699 -198628 -414361 -306006 -92442 44751 -16029 -120285 -52175 -35260 316
12483 316 105852 -415 34436 56711 56225 -11216 101706 162241 258447 159326 -65586 -191781
12471 -191781 -89371 -6740 101135 200766 291322 212974 119252 41028 -159561 -107967 -66523
12460 -66523 27992 3293 -36817 11503 -79000 -45652 -26196 70013 176009 318093 402220
12449 402220 273155 272285 241918 260309 156878 74079 23983 9028 -33030 74568 87392
12438 87392 13348 -70201 -185606 -192711 -102383 -3055 -2211 -87239 -33200 37958 36775 29036
12426 29036 69328 152313 173905 325633 401643 338527 125690 -34101 87681 35252 205272
12415 205272 91956 -160359 -16280 105312 299697 87596 7768 79487 42775 7498
12405 7498 -7072 -50180 -117577 -18332 131153 178190 194706 220343 273185 156087 219786
12394 219786 117552 -12504 49558 85830 113472 187556 87804 150233 112220 62711 87555
12383 87555 34702 -14455 -5622 -61783 18846 79045 13191 -28725 8478 200519 136681 117610
12371 117610 172189 288097 137544 181569 234753 78175 -92923 -186319 -223853 -88833
12361 -88833 -89351 -187505 -163392 -192817 -225258 -262724 -141748 -80522 152818 390346 233753
12350 233753 -40051 -83348 139467 239672 82540 -180783 -213808 -240621 -223798 -226737 -250312
12339 -250312 -231005 -190106 -132439 -69289 153396 302198 207933 60783 -160328 -166483 -56444
12328 -56444 -119455 -181175 -150556 -34546 151978 4523 168706 252300 276641 72557 -233455
12317 -233455 -355509 -297093 -213294 -123203 -44546 -38050 -134121 -243474 -298788 -257016 -106126
12306 -106126 7398 -7512 71342 -14302 -125248 -69808 -184507 -329316 -277323 -371281 -565771
12295 -565771 -493566 -309412 -200251 -163550 -125323 -143033 -143201 -144706 -322953 -298509 -223419
12284 -223419 -229090 -170966 -133270 -262700 -330017 -217628 21202 277190 397321 249158
12274 249158 194460 148798 138893 99855 138759 50644 -10554 880 -15009 -120986 -160548
12263 -160548 -54647 14910 142542 -78162 -224792 -230638 -148090 11164 120789 87035
12253 87035 -91502 -179078 10034 132923 21764 -50839 99866 76307 113798 116209 46980
12242 46980 -84960 -148193 -184693 -224713 -226067 -29991 84215 42914 -188100 -413526 -517191
12231 -517191 -564880 -539444 -466849 -351971 -106301 -7036 -100045 -167529 -174708 -210481 -226838
12220 -226838 -244091 -233811 -120842 7418 157597 173594 104467 -33539 -179090 -163860
12210 -163860 -79125 -144245 -244060 -119838 -75170 -191031 -97707 59352 103297 37922 -74638
12199 -74638 -146284 -93022 -99008 -245377 -143458 16263 86608 -71337 3751 -17844 -112422
12188 -112422 -101846 -6058 109507 217236 136540 15963 43898 66977 96918 49311 81501
12177 81501 193285 302605 159811 136579 135122 -98559 -263004 -182285 -123916 -169888 -290171
12166 -290171 -214241 -95671 99195 178300 219797 7393 -172179 -108779 53601 -18417
12156 -18417 -147986 -224078 -213255 -49564 -50841 19723 150758 131927 178005 21479 -74522
12145 -74522 58030 208022 394873 170353 40805 8683 -107586 -188058 -251032 -150467
12135 -150467 -60583 130036 94731 -59981 -182735 -250860 -220369 -48603 47065 119097 164454
12124 164454 219937 159268 260474 132716 90958 70730 -12026 117045 202463 115751 43365
12113 43365 180850 257416 207273 166279 82756 164673 221025 342922 287066 116995 152523
12102 152523 287634 170197 -202534 -467248 -428126 -243689 -65793 -99149 -240891 -244817
12092 -244817 -209708 -187179 -275503 -347010 -304091 -321398 -446093 -417300 -344401 -379265 -381015
12081 -381015 -122657 -33315 -58077 -8145 13663 51633 -115667 -107983 -114834 -240008 -118258
12070 -118258 -111166 -187553 -296661 -372496 -298089 -146190 20710 -84457 -227127 -235335 -132206
12059 -132206 -39217 9731 -37981 -11705 -13104 4556 34445 24564 -65944 -156816 -9921 202862
12047 202862 138031 86394 114225 23521 -6253 79992 58170 -263744 -350450 -298456 -220559
12036 -220559 -213000 -196796 -150883 -245472 -264980 -451815 -471312 -389330 -219194 -45032 -112019
12025 -112019 -173566 -41971 -25212 39788 158082 182712 75957 141487 124465 -163528 -147254
12014 -147254 43844 -729 -64859 10218 169054 124743 105434 -74051 -104790 182077 316731
12003 316731 360142 150307 140836 65799 -38690 14174 259205 109191 52997 83478 -8753
11992 -8753 65899 217159 431623 328032 288887 284825 19951 -180199 -234254 -363037 -281283
11981 -281283 -244705 -206491 -42303 69391 -73432 -24783 67997 110587 50965 76894 155851
11970 155851 143657 -18538 -121902 -146870 -125099 -109760 -104612 -91180 -830 24870 -184068
11959 -184068 -188082 -165514 -151856 -90048 -7688 112641 257115 36782 -37125 75607 139635
11948 139635 135588 -34171 -62070 -8556 5005 15127 6050 209481 263887 143452 -14275
11937 -14275 -10480 -55897 -131668 -171363 -209568 -54655 127214 218367 216306 167759 134633 151548
11925 151548 65038 124931 240630 360775 264022 112379 191631 188443 196604 38573 -100811
11914 -100811 -25584 148339 132956 10968 22949 -61700 -156150 -120052 -121716 -136835 -224567
11903 -224567 -144012 68228 163812 37578 -113249 299 68809 -60164 -94116 -148349
11893 -148349 -167338 -50681 115755 -57396 -136356 -105467 -50376 65543 97119 -23572
11883 -23572 -20407 11611 -15861 8175 110014 132144 221235 168027 77754 20356 66949 35845
11871 35845 -135560 48445 297446 187677 211367 38945 -66506 -132305 -54918 19909
11861 19909 130716 190465 193064 -17136 -34688 -47488 -34143 -83669 -140037 -128711 10164
11850 10164 202897 386941 433360 421367 335832 136850 91375 -29051 -208302 -281866 -135760
11839 -135760 -43612 46349 91048 91618 -115538 -244521 -165486 -151287 -56354 -29067 -90625
11828 -90625 -28061 -106591 116437 115793 -45524 78437 148732 159030 42769 -10437 -141309
11817 -141309 -223838 -219217 -67707 -25887 -144422 -158850 -137916 -49077 177322 221648 -4174
11806 -4174 -48476 9554 -115664 -87998 -1429 -16426 -140521 -186307 88589 330772 278803
11795 278803 225974 -18700 -150900 -22466 76773 23144 43730 26004 -104092 -203651 -165064
11784 -165064 -122058 -176227 -169657 -117478 -91705 -7699 -206364 -94255 -110832 -84246 -123278
11773 -123278 -157807 -234223 -239140 -282994 -270295 -128020 107446 123054 -128658 -117544 9535
11762 9535 -4082 -79907 42233 222639 314320 322941 330506 218964 298080 325037 134056
11751 134056 140153 208430 83539 47298 144227 56796 -202455 -161657 -128292 -52317 7138
11740 7138 141239 96845 92640 7230 7449 22705 -27987 189552 198278 90802 134149 16373
11728 16373 -23097 22287 -28901 -142669 -21012 33712 -65265 -110312 -75719 -132144 20080
11717 20080 67052 101567 -73902 -181530 42962 197790 117110 76523 104424 115097 -63783
11706 -63783 22779 22284 48282 107178 -118562 -319728 -354633 -225100 9832 -9022 -140618
11695 -140618 -202367 -206752 -239279 -203962 -99249 -131986 -2218 94992 -25177 -68767 -141786
11684 -141786 -291473 -321881 -294129 -111653 45407 139829 221844 271712 43844 -184630
11674 -184630 -81206 185131 320348 353147 230836 188038 -20897 -86908 -10674 153110
11664 153110 152015 112589 -26182 -36689 3673 145873 22035 -13046 -27051 -132190 -195429
11653 -195429 -120819 -54055 47176 150191 268253 62119 -199517 -187712 -137714 -77193
11643 -77193 -126576 -89686 143600 211297 79550 -80590 72083 249811 106484 9764
11633 9764 16591 -31828 41517 128835 223899 366709 250938 275942 117731 49438 6258
11622 6258 -217592 -143210 25736 112230 212804 23282 -164475 -146413 -96079 -60119 -58680
11611 -58680 65780 -1503 -6069 127068 60656 -58848 29915 68076 97244 329830 366770
11600 366770 345222 396107 386299 558352 438667 327947 200986 124900 22108 102405 79881
11589 79881 34869 103379 238235 318793 252021 151606 76010 -40284 -117135 -300141 -239118
11578 -239118 -104113 -35840 -80861 -93495 -69588 42841 84653 114806 222434 321223 207258
11567 207258 3100 26069 -50317 -35623 -69825 -134823 55331 92920 125485 171618 82941
11556 82941 -68333 -66050 28526 176439 109299 -41287 -114481 -5764 47934 179241 135088
11545 135088 29402 74459 -60619 -141374 -87427 -32496 45437 -100579 87005 111868 95019
11534 95019 59182 -117309 40411 52319 65538 -2985 -126342 -200674 -88272 47879 4540
11523 4540 69619 6726 -18744 150384 94100 60853 -103121 -163137 -14195 88268 121636
11512 121636 -34671 -26284 -45015 -114459 -71099 -141077 -174803 -132731 -61151 -198348 -136750
11501 -136750 39120 -83104 -136954 -203343 -288065 -247095 -215864 37131 91859 4672 12120
11490 12120 43688 15361 -74056 -86929 10136 -127084 -124345 21759 103988 15899 -122186
11479 -122186 -167168 -34653 -11811 -187792 -272629 -195183 -203918 -224903 -86335 -77565 -211588
11468 -211588 -232040 -174558 -156106 -37204 44282 -76662 39370 104849 201342 134118 21045
11457 21045 -209044 -342654 -102345 239579 274245 118930 7694 76559 24303 41392
11447 41392 102970 23006 -58547 38146 67368 -188766 -244101 -51074 -41246 -84346 -43495
11436 -43495 -239159 -413245 -433422 -499310 -461401 -391960 -214768 -160390 -117175 -186942 -136787
11425 -136787 -46579 -24876 140175 273007 292462 357666 305973 228916 123932 -99744 -269322
11414 -269322 -106437 -65779 -172799 -221483 -233386 -176806 -240184 -57545 59636 19649 164552
11403 164552 168445 -6199 -48983 63905 150459 160481 149990 2139 -185922 -308144 -276307
11392 -276307 -175401 -117615 -115194 -71923 153449 248112 160381 -86491 -227738 -98915 20747
11381 20747 -92998 9923 140707 177908 50458 -115969 -230601 -158751 -42519 -59275
11371 -59275 -79369 -233150 -306753 -139666 -102663 -120992 -226412 -217828 -219268 -54890 -42183
11360 -42183 -55675 37221 1282 104787 191230 118981 89659 33952 178547 145966 -51691
11349 -51691 -180512 -302982 -340300 -235176 -102354 -84442 -153219 -102215 -47210 27966 32926
11338 32926 64109 -48351 -180465 -62648 130009 291193 305692 320495 329164 181298 145732
11327 145732 183721 13552 -164066 -107966 -3614 -54557 -171318 -220442 -243354 -207565 -250291
11316 -250291 -262982 -136505 111030 143666 -5258 -60346 -22933 -159787 -239584 -161513 -184797
11305 -184797 -238615 -218069 -94687 41347 -66485 -131180 -310371 -281060 -200523 59394
11295 59394 108643 44709 45060 -24945 -66452 -95272 -48091 -30126 4711 176451 -14277 -167639
11283 -167639 -68278 -73027 -131722 1056 166786 163984 217075 207111 206510 132696 36037 106262
11271 106262 121191 131668 66982 -111 -37904 -54519 186153 -8846 -183832 -118795 -94398
11260 -94398 -112503 -131794 39992 40965 16475 -109519 -212969 -306648 -225367 -30497 11100
11249 11100 -130561 -179644 -219842 -125068 -23954 -91834 -128456 -36014 33654 55612 -113629
11238 -113629 -224533 -159454 -149766 -77807 -88019 -264893 -204016 -61643 -146384 -202004 -228085
11227 -228085 -6798 188773 166474 21847 -56126 73732 207149 264381 310561 141183
11217 141183 122596 109205 223549 229845 150241 198577 162767 235666 166961 -70234 -17814
11206 -17814 14236 125941 116509 -62679 -41613 -139329 -126013 30295 163320 148412 -3241
11195 -3241 -25538 30129 -131639 -190297 -254635 -297344 -186858 -95540 -76148 96323 208549
11184 208549 173942 192283 163066 48933 -18085 8935 63491 73339 -43388 -93963 -70531
11173 -70531 -86496 -249808 -289859 -306920 -246436 80937 161229 100820 82903 -79950 -46336
11162 -46336 17424 -56977 -213318 -118039 -184012 -104602 -25778 -73511 -20671 -6024 154253
11151 154253 93914 49144 101442 149700 58370 -59596 -191892 84581 171836 51294 -37288
11140 -37288 -181559 -284290 -279376 -270747 -295369 -259338 -277645 -267824 -66725 -69044 -117956 -57774
11128 -57774 -14188 -50134 12132 49055 107461 121867 186536 106011 -12085 -91997 -184397
11117 -184397 -162511 -273470 -187280 -166612 3455 94252 211363 232921 16157 -148161
11107 -148161 -210325 -224025 -249491 -323429 -320535 -238787 -211426 -261446 -285731 -372812 -416804 -363626
11095 -363626 -236318 -146340 147886 147832 -65455 35243 -35476 -156195 -108441 -136662 -201590
11084 -201590 -335275 -331780 -267933 -112376 -101510 -143111 -93940 -136321 -209580 -113822 -178413
11073 -178413 -251080 -264133 -123405 -64240 -89284 -135217 -197429 -244258 -90180 -20983 -87730
11062 -87730 -235287 -310672 -207830 -90864 -60562 -168402 -166710 -179872 -85316 -175448 -287605
11051 -287605 -275038 -242348 -271569 -460959 -549922 -508674 -444211 -371991 -363217 -154101 46339
11040 46339 196077 188602 48524 7544 -15168 -109725 -76597 -34146 -19451 -121344 -79009
11029 -79009 -54234 42228 24155 -93256 -66533 91545 93756 79520 13761 -54936 105541
11018 105541 286036 266740 211856 312984 352205 310049 225125 25703 -7041 -18111 -20579
11007 -20579 -94989 -80061 -8161 301124 351025 349319 248116 118045 -5947 -32669 114204
10996 114204 188829 472828 590995 547481 474077 290506 109245 89471 -3552 92490 20303
10985 20303 -112001 -134153 -84752 -28477 87818 256269 314837 398043 595120 870083 1105029
10974 1105029 1416215 1596335 1733593 1764558 1964018 2021153 1823591 1519267 1251077 1157955
10964 1157955 982607 698909 370353 265230 157700 41662 192618 185363 113112 133388
10954 133388 92423 -37744 -142668 -150946 -98361 89672 199006 99477 -49904 -29167 70570
10943 70570 53065 93051 272561 356697 280208 336040 297892 185547 50930 145589 52628
10932 52628 -129914 -339383 -330575 -235835 -65390 123603 173671 63698 -177459 -94945 -47581
10921 -47581 -42501 -4443 10645 139853 64218 54992 85650 -39898 -92696 -99947 -121780 -253294
10909 -253294 -172903 14931 43132 -3900 -63247 24751 17742 3895 -58605 -48374 -48484 -175581
10897 -175581 -50608 -172981 -114533 -41049 138189 5306 -52307 -112216 -234050 -326945
10887 -326945 -255863 -174118 -99802 -201619 -201788 -209722 -256842 -183553 -164486 -220136 -266423 -345594
10875 -345594 -309358 -308606 -181865 -107982 -66851 -173333 -228575 -190551 -203845 -193013 -171467
10864 -171467 -264405 -325055 -318927 -320562 -199756 -157737 -209706 -269536 -489219 -575429 -574329 -438603
10852 -438603 -478751 -481297 -470716 -319083 -222823 -162555 19988 147298 127779 93980 210983
10841 210983 140998 -24466 -28426 176572 268413 246571 188695 50096 56016 222456 288600
10830 288600 311932 304775 112809 159905 210772 177107 9214 -65294 -82878 -11861 198618
10819 198618 253039 382764 346352 149334 47969 20643 114388 99653 -43434 -313485
10809 -313485 -279891 -326038 -202870 -140134 -106090 -10824 18229 -20620 -21914 126746 28019
10798 28019 -62679 -117582 -94680 -111885 -25677 68850 69375 76749 87564 159709 134477 65540
10786 65540 -67052 -141356 -179396 -63376 -76659 -163439 -115523 -56281 -85414 76609 101852
10775 101852 190945 302118 430767 508745 455677 333838 285124 431434 329424 171422
10765 171422 -22062 -52971 -22317 -82038 -148084 -291970 -434636 -429842 -368660 -337144 -238247
10754 -238247 -45938 -77829 -79747 19983 170909 240484 108960 13029 -42688 -43142 43827
10743 43827 69892 47748 -105951 -260440 -310108 -308469 -89668 -70857 -11142 206351 335102
10732 335102 505576 500212 426990 437454 531288 557450 556409 564051 454359 297456 28121
10721 28121 -353717 -467148 -490924 -444332 -394435 -452848 -404859 -312279 -573717 -671151 -496438
10710 -496438 -266476 -143219 -309641 -419203 -264647 -139179 -57090 18247 51695 151896
10700 151896 431871 629143 880751 1071586 1154151 1274379 1231984 1343262 1388767 1315942
10690 1315942 1379763 1131411 933682 964593 823768 557059 425485 305491 383515 312835
10680 312835 323110 316678 328370 198825 311291 303469 205113 154486 73911 211163 329288
10669 329288 429815 289953 241537 364749 392722 301656 65249 -1496 -69755 -141578 -175634
10658 -175634 -194293 -163363 -186164 -135011 -13045 -22319 -61688 -194465 -266080 -223043 -285837
10647 -285837 -335154 -256625 -391295 -459387 -174437 -114895 -103967 -13419 179862 241279 82241
10636 82241 223751 397557 273815 241896 191497 301641 462997 602622 498781 227543
10626 227543 418630 557800 492338 458906 561974 553261 543347 613414 600654 645873 881875
10615 881875 1023808 1087814 1078854 1228337 1574404 1737366 1884455 1912649 1922590 1921776 2130291
10604 2130291 2263714 2211719 2067824 2152230 2099406 2166515 2419955 2706547 3294595 3955245
10594 3955245 4952395 6048049 7111219 8461416 9669054 10957767 12563502 14004905
10586 14004905 15229729 16481267 17811952 19473603 21751697 25161682 31007094 40593953
10578 40593953 56117656 80523971 114315098 153731947 194832968 234091292 271938910
10571 271938910 305372661 331366484 341837710 333433588 309289326 276521040 240758596
10564 240758596 202856735 163803218 125293985 91978317 67319013 51184109 40934403
10557 40934403 34024702 29231075 25689008 22966632 20677387 18553928 16963970 15452188
10549 15452188 13870616 12382202 11165471 10139670 9074444 8340319 7751074 6912022
10541 6912022 6251562 5811782 5273182 4846424 4414974 3938911 3609446 3156606 2781384
10532 2781384 2492975 2194688 2030457 1962835 1882707 1787417 1717048 1742529 1697065 1595037
10522 1595037 1437464 1502802 1697818 1753606 1845684 1793940 1519057 1293144 1213273 1187463
10512 1187463 1182443 1133277 1093077 1017846 844673 702169 780318 723522 707620 748223 791682
10501 791682 883207 1008966 991138 1107938 1043061 836270 710358 519187 663419 910584
10491 910584 951931 955070 1000672 1036256 1101220 1145115 1071635 1074284 1008084 946499 815497 949208
10479 949208 1054503 1034175 782301 496611 367540 486409 493470 519382 419944 426675 406105
10468 406105 483300 458496 349263 171886 160632 198483 328291 272211 220065 191703 137729
10457 137729 233473 271578 166591 164048 184766 236908 55708 -164571 -135191 -260257 -597577
10446 -597577 -880173 -1017406 -925869 -798344 -474683 -191910 -87679 65808 272926 397792
10436 397792 447945 507469 529891 518406 419986 432977 462499 639769 671191 699723 817423
10425 817423 890772 916088 823461 779028 727804 641242 554902 485042 392271 395889 208385
10414 208385 151037 37349 -255583 -310777 -187934 -192697 -247532 -326225 -103528 63304 -93062
10403 -93062 -101631 8874 38480 181994 452235 534067 306936 280338 268271 343252 484079
10392 484079 314767 102627 52575 158253 157784 182131 132553 318879 269978 279415 356634
10381 356634 507380 751173 863510 836073 722517 579130 612999 542343 500275 461490
10371 461490 188917 -41939 85978 -119362 -207009 -112443 -6219 64256 150193 94259
10361 94259 -29867 -105886 -39499 85936 254969 266755 318963 419195 481369 401871 191754
10350 191754 -51583 -57733 68449 121452 63608 -40993 12849 185102 199538 120432 15633
10339 15633 -13376 -24599 19869 30371 -69648 -44938 -209418 -154900 -12066 41150 183185
10328 183185 162606 114316 92078 145462 38668 -22035 10265 56586 181494 338108 286372
10317 286372 298451 340615 363520 154097 282525 378448 367092 338775 225814 177461 172417
10306 172417 89853 -67704 -75777 -91718 -142582 -64852 75686 122928 357948 271952 133935
10295 133935 105253 61350 141165 229201 44850 -31657 -38043 70344 49307 -41446 21034
10284 21034 80943 70581 90057 38306 191267 278424 478851 636196 474886 112521 124859
10273 124859 232327 218806 243087 356013 322956 264531 289383 274786 351702 311156 335502
10262 335502 296582 273896 287928 249236 250027 124305 63867 185311 281945 200344 241097
10251 241097 217542 48812 -11247 71357 44131 -48151 -8381 -60946 -110729 -213181 -320078
10240 -320078 -216192 -198729 -102966 31109 -37635 -98208 -199368 -200965 -233588 -296709 -354511
10229 -354511 36024 320683 235684 -7463 -7154 39488 3933 -144788 -216234 -190950 10648
10218 10648 23898 -31328 49495 56820 46353 105610 70461 74819 112055 112818 -13331 80241
10206 80241 162865 151357 119283 42200 -128033 -213689 -120072 -121194 -86443 -30408 43419 -22360
10194 -22360 20100 189556 200378 -22927 -31602 30096 -65732 -144307 -18309 55918 31164
10183 31164 1097 87100 177910 157056 61018 24960 140301 336921 419229 450121 384469
10172 384469 405351 627452 745877 833661 1073020 1506819 1856611 2023474 2107263 2157295
10162 2157295 1923353 1827572 1586421 1375386 1251645 1083366 870202 761918 651896 459094
10152 459094 368302 427389 352648 286630 263279 222346 78259 -37089 -193962 -210218 -212518
10141 -212518 -23473 -141316 -80412 -12174 -55250 19204 116265 125309 123986 266077 242190
10130 242190 59894 48596 172289 354981 247424 139097 294832 165782 177028 252250
10120 252250 207343 148059 32432 -61498 -129106 -260654 -213388 -34483 96481 -24634
10110 -24634 -131937 -65385 -39782 -29911 58523 111147 141034 154400 68295 -23818 55678 118656
10098 118656 219218 274151 419417 362511 182507 147955 53120 8579 82132 100196 191438
10087 191438 282369 162518 110699 182207 28025 -46423 -52810 69365 256545 270808 265562
10076 265562 96266 73534 87337 35733 105072 192109 309519 352696 352847 178402 73856
10065 73856 35127 54626 80268 363346 638000 589066 589009 450019 394135 677179 1046472
10054 1046472 1893957 3160582 5586798 9484480 10227407 7139359 3869970 2392329
10046 2392329 1699381 1292932 1113808 897770 626685 659464 696378 591906 342123 181270
10036 181270 182927 79162 40666 -22324 71833 60372 261058 403886 388628 484999 409378
10025 409378 393325 276965 161082 173574 203618 176318 114246 46107 99508 54908 -131605
10014 -131605 -168449 -197311 -20666 143886 136880 127702 38414 -19373 46304 45393 15551 99940
10002 99940 344036 263782 119251 80502 12442 117678 139226 230981 237741 85114 101104
9991 101104 88626 152587 173602 212767 113474 231864 338199 424875 359030 124082 -15693
9980 -15693 46947 23860 -105384 -24209 74765 23704 -36807 77353 147788 251873 425384
9969 425384 397997 189057 58476 54206 75969 52187 69511 65846 44294 46288 26795 108226
9957 108226 237709 304488 317704 38942 -55236 -95793 -7911 58820 118338 104833 24848
9946 24848 171389 305373 183398 -21990 -29344 90583 155600 137034 141692 48592 -17516
9935 -17516 -621 -43991 -107663 -89019 -61972 -112790 -163101 -92217 -134512 -249164 -264023 -310408
9923 -310408 -177403 -176191 -80531 67371 -69918 -57102 -5899 -132198 -128859 -52331 -260675
9912 -260675 -309647 -93721 -102052 -136488 -56363 73419 38175 395 -153442 -269685 -218746
9901 -218746 10927 7748 21298 54644 -21239 -16965 -76170 -173240 -285744 -212463 -125045 -165809
9889 -165809 -159202 -115676 -150940 -20079 -61588 28974 151606 102598 29052 24420 116872 169510
9877 169510 128720 207624 122197 -53952 -115466 -46329 -7656 -35721 -183448 -206965 -154670
9866 -154670 -170438 -368189 -266876 -186767 -165430 -315055 -382942 -396982 -295468 -39632 54678
9855 54678 -98699 -162524 -78727 36781 -25519 -94772 71995 83417 -144072 -224969 -51017
9844 -51017 66209 70977 -3590 -38880 73719 125304 108417 117657 199343 245551 195701 92754
9832 92754 -46789 -135647 -219550 -84011 -50966 -60463 -112903 -231548 -212258 -129698 -93494
9821 -93494 -265191 -358504 -277777 -7732 -16074 -96200 60367 152046 213865 83971 138608
9810 138608 121336 44546 -75301 -197016 -207245 -306279 -327646 -193612 -82872 -65619 8274
9799 8274 -98923 -107517 17206 281557 249856 234926 254081 -8229 -113502 -36478 113737
9788 113737 27190 17767 49102 5634 -155737 -157104 121658 214625 72887 -43612 22017
9777 22017 -4068 24775 108824 49480 -23422 -160928 -103976 -43321 -23609 193802 166118
9766 166118 38712 -41405 -6520 -22243 -31810 75836 127707 72395 4446 97668 9448
9755 9448 55472 157803 272508 321294 300143 98663 -46726 -103065 -25204 112753 100643
9744 100643 36063 -67370 -96240 -196585 -293047 -226063 -240247 -171327 -117939 -198282 -201231
9733 -201231 -197549 -299473 -231957 -86805 45904 19595 -19852 -74354 -65334 -58399 -94209 -191229
9721 -191229 -265016 -131354 -40447 8488 72973 222969 164426 36153 108955 84607 121254
9710 121254 142807 134788 226791 234838 233261 201709 105077 29470 35862 -95250 -166335 -191845
9698 -191845 -260575 -305855 -41006 95342 141526 51307 -71180 -126041 -154984 -39283 110386
9687 110386 33560 -20336 66503 -28338 -213766 -165114 -143004 49086 273919 147898 -48121
9676 -48121 -74759 -9808 14760 34971 17056 33597 34346 -58377 -173460 -134362 -92933 -207889
9664 -207889 -94495 -185461 -133519 -5384 42671 105611 82231 -90245 -38052 32131 -34593
9653 -34593 -128040 -152783 -132872 -190077 46777 165877 92862 -99985 -240266 -405411 -381639
9642 -381639 -183287 -141300 -109883 -12806 56010 15025 -189744 -213152 -183121 -304989 -247879
9631 -247879 -252549 -136113 3764 119870 -38831 12757 68371 -129341 -328997 -125061
9621 -125061 241315 219898 63780 -32343 -96189 -15286 64815 21488 -9375 78728 169234
9610 169234 101866 95949 32024 21975 4937 91472 -5497 84124 178760 153499 -40865 -172368
9598 -172368 -266461 -135990 -125910 -90914 7659 90066 332586 284569 193325 118193 -60399
9587 -60399 -121269 -105548 43480 96767 62984 80515 91710 -59129 -197075 -166292 593
9576 593 87244 -4913 70771 -14385 -169252 -308959 -246303 -265984 -207994 -242647 -188441 -153540
9564 -153540 -49245 47753 -6831 4633 -57111 -51758 -35079 13691 28177 -85026 -7295
9553 -7295 -48704 -218500 -314067 -265499 -161406 -193503 -20938 -114394 -179091 -180058 -142239 -276055
9541 -276055 -307313 -222365 24870 142707 26996 -13114 115475 116096 -70437 -190976 -163839
9530 -163839 -75948 -26862 38034 79415 46930 -116730 -138203 120383 114559 88061 19361
9519 19361 21738 59096 4504 24566 92965 124848 166720 278927 274752 260089 281053 329324
9507 329324 175044 -23377 -174447 -31011 121441 -116385 -414679 -452025 -199406 -81843
9497 -81843 23143 22787 153485 207514 141584 333186 344357 341677 274288 224169 69982 84521
9485 84521 86471 51920 185680 311811 232313 127239 57316 171959 246843 133300 -68480
9474 -68480 -9923 -48654 -150118 -181416 -131162 -86338 -186101 -224862 -220485 -192434 35177 214234
9462 214234 139640 211334 62568 -181039 -187116 -300147 -495370 -296486 23851 257462
9452 257462 429596 230392 34099 25737 -87105 -126080 14926 58465 167387 173502 87136
9441 87136 120583 148898 87287 38887 -11628 -33409 78719 30803 -60168 -100181 -74589 144174
9429 144174 225385 309281 303469 293417 262018 31227 -14563 -159336 -263181 -221896 -169296
9418 -169296 -180642 -293016 -314884 -280966 -147659 -65587 -16769 17779 -54334 -141516 -182446
9407 -182446 -234346 -152217 -79124 22711 105342 121129 125484 18027 -51189 52627 170109
9396 170109 132409 99920 157204 74206 -107076 -211815 -92373 -38891 -31378 -163646 -108525
9385 -108525 -33823 -36443 -131105 -147327 -13198 11708 -72920 -164917 -172176 -206739 -199137 -31631
9373 -31631 174313 281602 166580 55960 3989 28434 223197 402657 418664 403375 423508
9362 423508 233796 9596 10214 7321 -15986 4816 202924 274457 285838 230955 167178 214903
9350 214903 336493 490214 540101 273311 -6220 -173675 -69675 -34238 53757 49457 122604
9339 122604 140053 142738 175133 119952 -17651 -103104 -348715 -386331 -398360 -270187 -67411
9328 -67411 -97556 -148598 -52551 -16035 -35877 -26402 -102407 -91094 -30418 56531 -18231 -108842
9316 -108842 -86280 -52922 -135089 -35095 62092 66596 67286 -192154 -97913 -60878 -84295 -222418
9304 -222418 -254703 -315947 -202014 -7214 157743 96219 -49324 -134345 -39580 -15230 10172
9293 10172 155776 262243 209958 90793 -25980 -93136 29230 234119 35622 -180027
9283 -180027 -107468 167083 383952 173207 -159202 -122665 -57793 -103333 -160324 -152320 -118488
9272 -118488 14332 -9476 -110139 -29228 84445 65385 39932 28832 115474 242217 203020
9261 203020 18071 -222776 -213886 -99958 -86697 -132692 -56204 -17307 103973 60879 70191
9250 70191 -112619 -168416 -200892 -139608 -172092 -135968 49348 126574 142594 -17885 -170576
9239 -170576 -205109 -99917 -154234 -102886 -39601 36647 86420 58359 113261 131191 120341
9228 120341 95210 117445 41690 202209 361231 341301 9021 -67085 26557 219387 358143
9217 358143 159212 98384 88631 43060 -135120 -104861 107306 134011 -17734 51679 -62724
9206 -62724 -80933 -152045 -282825 -339263 88797 415831 431064 310809 268668 140803 154742
9195 154742 180307 -17031 162906 134863 -71989 -42796 33139 109035 85878 187444 262752
9184 262752 265028 74504 -46627 -116889 -130874 -62651 -20536 -11678 -39883 -83213 -112190 55832
9172 55832 153242 277264 251812 254419 266157 15116 6943 143644 70167 -6047 -148700
9161 -148700 -142742 -351207 -494914 -371781 -185518 21586 63743 -123243 -422756 -533314
9151 -533314 -450660 -309004 -102127 178554 262968 94099 -15961 5125 167545 266540
9141 266540 181371 201151 303309 350629 238374 253063 86059 -66743 -49737 136315 208000
9130 208000 166889 86948 131041 186089 4565 -136377 -127609 -115481 -142867 -129650 103900
9119 103900 91569 -122968 -207587 -44377 243123 303972 310117 269666 233928 317217 418271
9108 418271 483641 373196 244740 388468 582005 720117 804128 913517 1199745 2036071
9098 2036071 3330583 5057996 8308001 14797134 20147373 17718049 10781132 5833847
9090 5833847 3545395 2541264 2062706 1660607 1315719 956135 827047 762595 945062
9081 945062 865951 724623 492903 289002 -10332 -45350 -163401 -159465 1782 -55387 -74744
9070 -74744 20683 33621 1580 157694 332487 298835 263748 102194 65923 123009 164941
9059 164941 105774 -75421 26731 144602 29258 -9485 35754 -30337 -77620 -41730 10081
9048 10081 -69737 -92134 -75437 -182720 -165449 36115 112605 47166 -4579 20417 185358
9037 185358 158620 97384 152631 258824 307174 223356 -103026 -265764 -224964 -229719 -23771
9026 -23771 -68510 -64587 -29543 -91056 -190859 -38775 3805 -71243 -180373 -126877 20720
9015 20720 25978 -86895 -200402 -272914 -264062 -238263 -159541 -168653 -148149 95807 34014 -91131
9003 -91131 19606 -29457 -206566 -84655 56218 63490 155145 166990 66621 -38620 22523
8992 22523 3330 120186 71625 153103 317581 297913 -23120 -129832 -98623 12917 58370
8981 58370 -39084 -80694 -176795 -122174 -67261 -26755 -116614 -147368 78560 -1981 -118357
8970 -118357 -75206 26679 119008 -9058 -87146 -42586 204376 20661 -121513 -170346 -99210
8959 -99210 106078 204045 199766 112480 -137905 -153115 -85931 29862 54787 57851 -22578 46903
8947 46903 73511 101936 92716 34677 -179115 -356211 -240368 -48031 29533 -95687 -142814
8936 -142814 -78166 -226879 -351100 -232440 -162542 -118602 -225682 -108346 -107055 32096 -11808
8925 -11808 -6387 -188590 -190246 -171098 -205618 -72734 104033 132869 246569 268394 91366
8914 91366 -215467 -190611 67895 130372 59690 106336 -134823 -313614 -201990 18779 -18400
8903 -18400 -193997 -172235 -134138 -3617 -14853 -148695 40173 88676 -12203 -202132 -102581
8892 -102581 -98036 -172820 -57330 135747 61921 17343 -88976 -170436 -231109 -250029 45230
8881 45230 60922 15822 -101976 -327469 -296411 -200155 -175218 -89041 29194 82407 187018
8870 187018 303800 275815 227366 203103 209920 143133 -21177 -15694 120672 175016 -31735
8859 -31735 -54791 37396 135035 121872 192712 281943 189861 148412 176088 51314 74233 74684
8847 74684 -65218 -246327 -269063 -166360 21172 118533 128896 16226 -25972 82251 264650
8836 264650 258245 126667 13668 67553 90632 -19396 -113560 -124569 -36200 94184 9333
8825 9333 96178 80516 -59229 -58091 -155429 -190600 -197856 -232852 -148506 -64213 -66618 12292
8813 12292 -42904 -145450 -84822 -35106 -48379 179104 198013 446758 355761 304984 234708
8802 234708 77219 -33884 1588 -13908 63593 101588 87152 -14697 30001 -220382 -257948
8791 -257948 -155912 -13796 -41932 -58479 -80490 -193197 -84050 47661 22596 142143
8781 142143 179398 83710 148775 50314 84680 287031 401866 328742 200302 87927 78945
8770 78945 114426 188943 109731 49093 78163 -2122 236734 244925 58282 172612 285385
8759 285385 198151 140901 103922 148315 71266 -42600 102305 111279 270335 359545 392179
8748 392179 454242 402309 145082 131127 163858 328219 314421 206425 128369 20147 -48338
8737 -48338 -62592 98701 266345 68631 -10452 108713 29062 130401 -28532 -145027
8727 -145027 -51700 5995 66516 117262 107364 -2995 -56275 22630 17063 -12051 -35008 110223
8715 110223 -27946 -187659 -178065 -12137 146077 94201 -83213 -116882 10161 24419 -4462
8704 -4462 -92187 -46759 187265 306319 267274 221374 208987 393437 400170 196674 47934
8693 47934 117628 181029 158254 68363 -77439 64708 73150 2739 67062 1927 -95428 -38843
8681 -38843 -64478 17899 59911 64617 -28615 -1586 69558 198108 130624 -197833 -270211 -184499
8669 -184499 -81488 87968 241871 255695 157811 52701 134318 222326 175538 114491 154521
8658 154521 206862 152364 110415 225686 8856 -106038 -68477 -63807 9754 -52142 32303
8647 32303 106712 208576 219168 65051 17948 33349 -27405 53374 145526 152052 220812 155047
8635 155047 -5198 -66900 -108696 -241067 -294785 -238759 -106987 25103 73162 95102 57276
8624 57276 193238 172693 133577 255464 211802 231586 319972 274200 128977 151531 342945
8613 342945 200424 135766 254407 249674 306669 325123 50463 -82976 25243 120362 297117
8602 297117 344853 275674 34958 37960 56374 -6474 -7188 842 83063 218920 310624 277082
8590 277082 273178 230351 328257 397626 463240 313329 66643 38793 114627 -9433 -124314
8579 -124314 -104531 -176515 -176670 -91210 -135975 -229858 -47446 28838 93868 61409 -161630 -175165
8567 -175165 75452 135642 48944 81089 11754 70140 201581 138133 217825 104283 -61329
8556 -61329 96218 183011 229377 169385 202860 287213 166242 158174 126858 -57974 -158380
8545 -158380 -31768 -97706 -199057 -163296 -150489 -204379 -213888 -225640 -129954 -13108 -163534
8534 -163534 -244417 -121749 37559 232603 79380 35252 110396 103274 105338 164421 192152
8523 192152 29791 88392 125307 201391 171738 85425 43121 102161 208740 142572 -90730
8512 -90730 -189567 -173624 -150323 -108712 -136275 -54571 -43456 -117566 -34243 83315 178589 218675
8500 218675 256536 278658 48920 -13304 68411 -82695 120521 81712 54255 4151 -71654
8489 -71654 36280 255720 255691 142457 6897 -19753 -56181 -143676 -166452 -84297 -147535 -52791
8477 -52791 -11982 -6556 -95345 -109927 -219666 -167688 -60198 158546 295932 89082 7474
8466 7474 51911 158374 262520 158326 -12139 -55646 -122622 -146852 -109973 -51014 -14113
8455 -14113 -35863 18914 151501 233434 153447 167850 290750 332054 343681 309500 228977
8444 228977 -66836 -185730 -222775 19624 23421 -3173 72589 11888 10168 10280 -97004 -80970
8432 -80970 -56606 -40808 -113571 -216181 -223337 -134394 -109154 82996 241414 272517 172979
8421 172979 98732 92611 73485 163288 -33311 -196458 -237444 -200715 -216784 -159190 130962
8410 130962 288748 156019 -77223 -70078 -78612 56853 60468 30360 -1965 130680 127478
8399 127478 -50150 -115909 -135185 -26195 -13644 4989 58388 22998 38110 -14582 -129429
8388 -129429 28745 196570 244676 265441 128461 -49566 97933 206100 301368 186420
8378 186420 -30925 -70673 -124674 -333251 -289701 -328228 -160166 109066 6248 -151236
8368 -151236 -108081 -160038 -243257 -213542 17962 184185 312122 165186 -90201 -79353 78659
8357 78659 87150 122151 64419 -17916 8561 16066 -44671 -6491 4337 6143 -26672 73826
8345 73826 92002 105345 273016 155295 -4936 68860 89112 46574 99486 -40 -71648
8334 -71648 -266129 -346413 -177322 -116422 2074 93400 158587 131982 -35987 35953 94629
8323 94629 -6874 -142639 -219140 -140373 87424 -34406 30824 198002 94295 -44333
8313 -44333 -36924 -138607 -158137 -175896 -188833 -73681 -5325 7416 6136 -178906 -235314 -191326
8301 -191326 -107581 -31457 -96141 -135441 -63165 77756 105358 -33722 -236988 -304038 -269490
8290 -269490 -69460 7790 -91698 -438630 -396106 -315572 -84109 889 31194 15738 98602
8279 98602 43918 4567 -1965 14582 148 24612 1507 153913 281822 343666 303091 173278
8267 173278 198005 132826 -64552 -157566 -56124 -33949 -125645 -221816 -147367 20555 -72254
8256 -72254 -39657 46694 91228 35274 -74230 -97039 -190918 -248673 -129036 102906 340711
8245 340711 229764 216308 220795 149544 117733 154448 188968 152119 154517 230963 91186 165110
8233 165110 220264 68981 -74597 33359 48253 -56041 -44627 -91845 -111825 -238478 -277129
8222 -277129 11260 113667 153930 187920 232550 183131 152415 95253 103534 208194 243102
8211 243102 159901 54100 -55943 -156914 9340 128320 109274 126407 21295 2498
8201 2498 -22989 36629 81553 128440 240020 131424 -11800 -111342 -252915 -263560 -256644
8190 -256644 -55400 -63498 906 130056 149829 139967 129068 86194 45803 45609 -145701 -240138
8178 -240138 -157049 -108797 -13404 49248 189132 123185 80445 49200 71785 -15770 82131
8167 82131 218625 105388 162173 172842 -30198 -62127 80942 148572 176678 216817 319769
8156 319769 300872 72163 -30160 45757 199679 256021 236992 226574 90112 58570 153598
8145 153598 140618 6734 156664 195257 72446 4367 -38679 -123108 -329068 -413749 -419403
8134 -419403 -235099 -104942 -113732 -78343 -11568 35772 115410 -3889 -237283 -266842 -357179
8123 -357179 -287928 -170418 -153015 18097 103957 224212 206253 -19226 11602 176249 33900
8112 33900 -34981 -37384 40573 -78092 -97922 -107402 -131900 37386 -35250 -128605 -189097 -112169
8100 -112169 16877 -11023 174345 207064 113278 163814 134686 100269 143175 62247 -15521
8089 -15521 -52980 30537 112722 70908 -58880 -39789 -209567 -158287 -220256 -190505 -196049 -191604
8077 -191604 -39681 73032 68675 -109529 -222516 -139071 7683 -8719 -5060 35981 83303
8066 83303 213719 109284 94464 5649 106461 66053 107671 147927 67564 -90929 -4188
8055 -4188 109620 250076 184158 55866 -822 98506 185758 298232 424042 294091 186166
8044 186166 23443 -216328 -184983 -107720 -80977 -116376 -112725 -250103 -246937 -93027 -942
8033 -942 53515 30520 201507 388982 220701 -6273 -5739 149035 204612 259153 217088 71016
8021 71016 25833 -131165 -239134 118892 327426 153552 -59059 -12522 -104226 -49003 200484
8010 200484 321227 196145 -8602 -68521 208531 308302 199135 95548 -120335 -259465
8000 -259465 -120477 -134117 -170934 -40533 -23 -49109 62386 167941 264432 267159 218747
7989 218747 196457 104201 193620 71632 69905 135671 103217 42131 83757 -5038 -163802
7978 -163802 -186797 35900 53712 215978 425287 617882 641562 411411 168673 31333
7968 31333 -50178 36451 100730 131740 -134263 -314304 -328717 -201379 61155 99269 52809
7957 52809 -4656 63604 192914 157175 -46090 -109600 -102546 10899 -90878 -100686 1797
7946 1797 81505 54998 83102 82265 164500 271279 367340 406925 65553 -127304 -65276 -65886
7934 -65886 -20340 52822 49180 -17164 -36515 24234 -94669 -55885 -44853 -186884 -67435
7923 -67435 174462 232794 268641 389666 293440 118491 114236 73246 -9615 -155 57130 114999
7911 114999 36552 208207 187653 258246 233294 178160 234909 -7025 -73913 68557 143735
7900 143735 272049 272878 108305 103771 -24021 156769 89153 -98003 -67588 -51470 38916
7889 38916 116179 199580 89072 7637 -95769 -10221 55055 105978 93146 90780 261036
7878 261036 93775 52405 -36453 -106188 31176 23810 -3253 -102730 -186722 -68325 -410
7867 -410 84836 -16498 -51126 -163887 -146833 -51128 165122 162754 66579 4132 46059 62240
7855 62240 -61683 -204734 -168728 -157471 -123653 -218534 -92464 -171657 -372778 -232636 -19206
7844 -19206 -120726 3808 105108 60142 -128539 -303503 -367649 -391456 -355088 -349944 -274635
7833 -274635 -110886 -123631 -183864 -200570 -135856 28603 -33626 -100827 -114618 -58444 -77318
7822 -77318 -222631 -125587 -60646 9213 201955 105212 -10706 105101 238825 231194 157254
7811 157254 107484 35176 9843 -84952 24837 5381 -131138 -40232 127769 180719 175912
7800 175912 179197 101694 29312 66611 -23954 -124872 -179766 -170259 -297319 -239369 -112617
7789 -112617 -213117 -169346 -146377 -66449 219508 97752 -39186 102695 58218 -63181
7779 -63181 36983 2153 97450 150570 279527 310545 154572 46250 -86826 -316337 -335228
7768 -335228 -291600 -250589 -76708 -126417 -50522 -23210 -58435 -183178 -421405 -295944 -105874
7757 -105874 -134967 -47205 72485 199738 121939 54304 3549 -56966 -236987 -227847 45885
7746 45885 209280 131013 -26145 -219058 -316822 -136912 112261 203088 17636 88492 194286
7735 194286 177454 95806 212 58644 281313 218426 -93806 -266561 -73414 -37101 27571
7724 27571 79797 145805 70774 119360 185213 161026 -6348 -99703 -94793 -184467 -334422 -547224
7712 -547224 -465490 -345996 -292958 -197406 -72659 -15449 16963 48306 -91645 -234418 10662
7701 10662 -20029 -31698 188455 185846 147602 220962 26726 -68214 -99821 -123198 -79412 -1473
7689 -1473 125146 77375 77044 137966 3848 4559 2578 -44741 -16593 -129305 -163228 -29113
7677 -29113 124582 103648 -28812 -304651 -281172 -326957 -410386 -534482 -441217 -271249 -95392
7666 -95392 -15361 142352 161637 -109820 -259461 -70348 44029 -680 17509 79393 28508
7655 28508 15968 44830 232732 162855 109034 69035 -19529 63530 -18849 -238325 -299932
7644 -299932 -241524 -156358 -188512 -232096 -200137 -176303 -36308 -103369 -104236 -187820 -346075 -362746
7632 -362746 -354716 -289885 -148210 -355079 -261474 -229037 -189645 46045 98054 141143 6583
7621 6583 -136054 -129583 -177201 -326843 -147649 38713 245925 311388 342472 295891 180154
7610 180154 66098 38516 40468 38139 -93262 65462 83393 29526 105257 50574 154430
7599 154430 129612 58476 -11270 -5794 114698 281538 302102 148961 28582 15136 -86658
7588 -86658 -106286 -48208 -21282 -218744 -353356 -333685 -252344 -106917 -68853 -229894 -391244
7577 -391244 -456343 -419435 -243610 -70706 -87029 -202062 -311713 -204274 -235335 -60247
7567 -60247 123749 95225 -51939 -39558 106084 131906 21797 522 21354 109130 136006
7556 136006 -4271 -52546 -49408 -7118 -7940 149169 172459 -75138 -128426 18252 146341
7545 146341 41819 -124007 -138511 -132918 -31372 79584 24213 -50870 59733 118368 109863
7534 109863 129325 199351 288795 256875 162712 69423 -93829 -24052 -25158 -73608 -60092 -112675
7522 -112675 -111982 21120 38009 -148233 -298423 -245419 -2401 159022 175809 32614 -140355
7511 -140355 -156296 53578 256613 281459 178055 170411 22757 -35790 8492 -54268 -262708
7500 -262708 -192037 -102312 -256655 -366453 -349332 -232851 -168567 -133851 -155862 -184670 -25847
7489 -25847 58501 72527 259864 69473 25522 -84360 -166169 -72508 -40355 4469 -53021
7478 -53021 -157909 -206528 -230716 -82683 -27479 45910 172014 77587 -51632 -52763 -75275
7467 -75275 -212219 -281165 -241113 -278308 -340251 -240736 -146911 -71920 -7850 -5457 108574 41633
7455 41633 -53085 39928 65238 84514 78079 38250 -66665 -54966 -80310 -69421 111423 257117
7443 257117 174850 116657 20130 -47077 21503 41934 100138 56429 49178 89514 -8925 -131389
7431 -131389 -167765 -123346 -167243 -112694 34443 137852 28906 -23298 -38396 83190 27279
7420 27279 14174 52608 137133 97295 118958 12206 -8423 -8241 -76591 -135629 -49284 65467
7408 65467 -21891 -196611 -374225 -254937 -71585 -225742 -114808 -90921 -140038 -50807 10451
7397 10451 -30294 -83987 -187097 -146597 -2315 27495 112059 268371 447237 445363 334178
7386 334178 285503 210150 61885 -6225 -108075 -311033 -526258 -709393 -401600 -328489
7376 -328489 -91688 114665 -29176 -111260 -101247 -14728 -10448 -22578 86801 196207 69910
7365 69910 -114912 -182770 -99425 10154 160740 228078 136432 138363 84364 -9762 -73821
7354 -73821 -65282 -49492 -121851 -243258 -76102 72997 41376 129719 64729 87392 -1081
7343 -1081 30269 -69211 -187416 -176602 -222584 -196581 50885 27560 66057 -87099 -89581 -11259
7331 -11259 -79017 -17059 92901 44360 15589 -9800 22135 25523 -4840 9460 48139 118955
7319 118955 120601 101277 58515 125058 218410 280039 90325 -97488 -9804 8438 -2920
7308 -2920 149110 238804 112245 -114646 -163421 -118026 -218797 -106416 -123271 676 -111412
7297 -111412 -110590 -115502 -101698 -120580 -129945 54559 211553 58607 121171 74869 63688 249159
7285 249159 194912 79060 89884 247917 273327 108002 -159723 -371835 -214295 -134207
7275 -134207 -174769 -236686 -129688 -35690 -11305 72665 121274 123952 65019 8864 -103913
7264 -103913 29634 69827 48409 173464 178978 -104918 -127184 -174558 -202007 -29647 -95720
7253 -95720 -22074 -91046 106241 205413 262226 132544 -29527 -74558 18219 51442 55973
7242 55973 72918 -28438 -71296 -91477 -78571 -92245 -99311 3644 137243 36588 4464
7231 4464 -134358 -177037 -170677 -214594 -306113 -308010 -396056 -320138 -173571 -45828 -79256 -50883
7219 -50883 31323 7969 40303 121064 91787 135055 73355 -96105 -114723 44959 114908
7208 114908 55012 -122370 -174076 -73491 -25665 6088 -74459 -131784 -140051 -277950 -134736
7197 -134736 -58514 40721 17692 133352 146272 -70057 -81082 -82788 -144242 -49065 -32347
7186 -32347 113264 294731 382037 155389 196114 241873 69258 -121222 -117619 -3127 126917
7175 126917 16309 -161558 -242166 -181707 -303165 -159405 2823 75943 86607 -28290
7165 -28290 -92472 -109739 -174165 -266104 -241012 45189 316176 320112 81731 129128 148092
7154 148092 57714 23134 -97677 -43301 -116444 -110160 -170103 -316688 -386624 -216287 -76292
7143 -76292 -182619 -343161 -218765 -4921 -53377 -19247 38024 16591 28481 -41468 -220038
7132 -220038 -177295 -89387 -123992 -166187 -66986 56643 166436 151763 112016 -22913 -90912
7121 -90912 -233457 -35561 3040 165359 278123 271412 245957 -11678 -229626 -222156 -291060
7110 -291060 -430899 -269775 -164853 98403 166830 196375 170767 83540 159059 116301 83458
7099 83458 -29503 -162798 -183117 -117448 102656 302173 220680 259205 334136 281101 207506
7088 207506 114832 -66669 -273819 -109288 -29727 -126111 -208736 -171174 75972 67056 48634
7077 48634 50366 110100 148101 232756 154501 59598 -90304 -5159 139094 203312 338657
7066 338657 324282 194191 160841 -46 -104593 -75816 86065 174009 55215 83551 198927
7055 198927 118571 69569 9810 41729 63390 106534 125267 -5131 -23833 37440 93109
7044 93109 98083 164681 166310 71959 -78461 21466 280727 190449 59736 -98975 -112972
7033 -112972 -56419 67727 4688 -48249 100988 202088 -7430 -240047 -176502 101909
7023 101909 111080 -105061 -251638 68475 119779 174612 167423 62528 140987 32583 21355
7012 21355 238626 188777 256319 358263 103722 89905 109261 54727 32418 34808 62313
7001 62313 149117 175816 439033 489861 352500 371616 255626 59989 -43529 91884 106794
6990 106794 188135 268368 129362 179612 291803 309007 316027 222740 -70529 -160036 -59155
6979 -59155 -33091 -69997 84460 264507 333181 342011 261543 334221 261124 148023 130263
6968 130263 237300 301890 233540 100140 -45012 -281 92814 93860 19443 78468 -90637
6957 -90637 -76973 32551 52846 86370 66512 3323 105250 112870 -7389 -65240 -43003
6946 -43003 -6082 -94365 -154663 -190561 -189132 -110242 -3823 -46668 47341 137527 217687 188680
6934 188680 160559 106512 54358 35826 -62927 -62749 86465 253156 342366 188680 -49425
6923 -49425 -121046 -82779 31262 116511 145197 152282 -9180 -57600 -6026 7813 -21666 -11785
6911 -11785 101426 34544 -51617 -184259 -52090 12885 25967 13859 81307 40246 22350
6900 22350 96734 -128046 -311492 -287073 -119947 -107490 -146151 -233385 -367455 -400517 -153598
6889 -153598 110283 -18378 -232544 -282118 -328579 -168057 -135483 -290579 -204491 57846
6879 57846 46182 23960 124986 71315 118030 171166 24734 10096 163960 308416 170303
6868 170303 127660 168515 196422 154953 4512 -76356 184 92592 38586 -4953 -4847 13923
6856 13923 100006 138457 -18998 -158547 -168428 -125842 -188427 -62290 127611 225883 215410
6845 215410 207838 70689 77486 213935 234137 266529 269276 51136 -60901 -65287 123565
6834 123565 126104 111892 75669 -116904 -180929 -246292 -260362 45863 150773 205563 418392
6823 418392 539175 520122 337817 384126 272577 -56530 91635 221009 60891 16298
6813 16298 42316 -16534 -132682 -240944 -178473 21259 -4224 22403 54030 91910 80097
6802 80097 203542 211498 81683 -127155 -226600 -282254 -352093 -230351 -103478 -31119 12515
6791 12515 148912 75154 -142303 -251248 -300011 -250539 -210829 -155323 -157796 -196437 -376797
6780 -376797 -321844 -248440 -99550 111479 85416 15182 -22586 -178037 -142640 -75409 -122478
6769 -122478 -121406 -65834 -45151 8728 1529 -150438 -114917 -199442 -193230 -13614 108756 117367
6757 117367 127738 231218 235128 239445 309041 321494 234733 231602 139589 28548 96126 190047
6745 190047 107542 55272 52570 61390 95122 61005 -104139 -125006 -145430 -37247 27944 -3976
6733 -3976 28622 27622 -15841 88324 166504 69478 20434 157491 189596 184386 156165 174786
6721 174786 284397 328181 337476 215445 140777 319681 355320 208651 226314 190762 164562
6710 164562 156313 177074 386097 359585 202465 165858 13817 -15915 13647 -10014 -55153
6699 -55153 136096 116068 -68627 -24173 -44420 -291468 -206347 -72618 -100545 -58115 -55719
6688 -55719 -135112 -41610 -77948 132913 292231 315979 213331 110159 -68652 -142408 -196273
6677 -196273 -48542 138868 -44628 -238721 -125939 -30537 89694 232576 334925 327435
6667 327435 314358 211057 57064 -110534 -109009 110210 115852 192120 332213 428780 286171
6656 286171 87425 -56345 -16648 124877 264858 323097 449988 291649 221797 189172
6646 189172 223396 245335 110586 -113361 -79810 73160 186652 74082 17678 170832
6636 170832 -146698 -248876 -173082 -134679 -151906 -136398 -103646 -111122 -236777 -196774 -153851
6625 -153851 -219803 -397225 -300999 -206869 -38524 131173 233649 100480 -40621 26941
6615 26941 149404 67576 6777 -7640 25840 -51144 -182776 -49935 41897 -60569 -190054
6604 -190054 -56627 57178 87758 129066 199093 120686 57992 -7604 49281 69858 19636
6593 19636 -142265 -172346 -170131 -42497 5495 -220031 -308053 -143987 52972 -14986 -44029
6582 -44029 74712 180615 290611 404160 468081 531899 497432 277767 148491 -26998
6572 -26998 -97883 -89199 -163337 -90247 33448 -31426 -938 72100 8517 52273 -49940 -187775
6560 -187775 -186627 -106590 -1974 157758 256287 272477 156522 9971 -87434 -118945 -93550
6549 -93550 -103328 22560 183967 75025 140642 108951 134419 90254 259723 328947 304207
6538 304207 242708 206550 207131 31520 94629 180456 203694 101433 -96926 -133048 29723
6527 29723 132523 103473 235733 107083 -24657 -18764 68481 89059 37046 -37743 -29623
6516 -29623 110291 128580 70084 -170159 -260552 -312182 -239311 -114389 26522 29846 66241
6505 66241 30802 -26195 45179 37413 -163004 -89945 23137 -4002 117318 -19613 -8688
6494 -8688 150215 204519 61475 -127984 -197460 -201543 -231176 -288292 -133309 85945 41435
6483 41435 -87236 -137272 -269570 -292370 -63149 79126 -96764 -225828 -189159 -31619
6473 -31619 106798 198199 162082 155103 42094 26938 24979 -28219 -102850 91548 244246
6462 244246 312014 195908 129086 118214 129282 104759 -210247 -394460 -234203 -163660 -254795
6451 -254795 -264182 -172893 -16693 -73637 -74754 47965 57144 31547 100592 94571 100951 -176684
6439 -176684 -207506 -200564 -177736 -83197 42816 217649 128594 -104180 -238409 -342985 -248396
6428 -248396 -122288 -103932 -73812 83376 113621 58391 -3603 33120 63240 -157136 -295114
6417 -295114 -392205 -404603 -245247 -186513 -208912 -119651 -156058 -199323 -287315 -231290 -77056
6406 -77056 -162359 -262547 -209207 -278260 -238201 -252120 -106714 -139897 -170400 -64968 7252
6395 7252 -44635 -203260 -167779 87340 372037 379428 225434 80106 28984 149609 249088
6384 249088 250796 230122 164057 151978 212306 260226 239406 159761 22428 93849 13703 117344
6372 117344 69029 12864 42286 206744 294643 178948 113842 133974 -74161 -190207 -83444
6361 -83444 -13009 -22451 1106 -30754 5266 -34045 -183913 -238615 -155798 63898 -23496 -72066
6349 -72066 -51065 125722 86631 48299 27972 -17082 50312 -24663 529 3360 -59907 -134059
6337 -134059 -70399 -114487 -239709 -70460 -73831 -23382 74662 -12093 63784 108730 31218
6326 31218 -69800 25851 123444 119361 71299 -115818 -339281 -315998 -97068 -70557 -22376
6315 -22376 -323661 -476170 -421547 -331948 -412451 -568334 -605736 -415940 -318319 -368027 -381010
6304 -381010 -224643 -79843 134487 171066 -47260 -103345 -268296 -163774 17104 37303
6294 37303 61996 187243 69266 -132413 -111102 -73053 -190929 -216021 -137506 85592 142778
6283 142778 23207 -159322 -113073 -343667 -293405 -254570 -79373 29738 9417 -88502 -169464
6272 -169464 -43704 41831 -6753 114041 134294 243311 154959 -25181 -77758 -243371 -309769
6261 -309769 -30582 261335 98991 -164199 -115126 -114057 -76926 75537 -27466 -65328 -64080
6250 -64080 -61934 -198845 -233178 -116732 108176 229025 181288 116024 124097 48846 -32436
6239 -32436 58839 34843 -200782 -296167 -286851 -182830 -30196 58542 -7717 -88496 -15920
6228 -15920 60939 96978 -55036 -163160 -119503 -63190 174294 209672 194755 369228 419161
6217 419161 104324 -169838 -215931 -27579 62531 -46518 -134405 -63920 -45974 -236125 -317700
6206 -317700 -143142 -3112 117890 176764 35914 -136784 -34163 -78263 29064 113365
6196 113365 -51077 -101381 -168348 -111688 134097 113627 -90179 -66170 41564 74755 57266
6185 57266 -76443 -108988 -101562 4261 -58446 85229 93957 -79238 84446 221907 277680
6174 277680 97737 48733 21088 -686 181362 -9218 -167193 -306012 -279176 -22624
6164 -22624 160399 182501 251084 258197 116462 99626 204889 162844 119789 -32239 -47769
6153 -47769 11050 -43476 -129601 -162395 -70611 34247 94965 76693 15200 94636 13079 -50965
6141 -50965 -74599 -144479 -144316 -118531 -98951 -5053 55962 52752 72390 170946 159013 -29123
6129 -29123 -72757 53463 6099 71375 56868 -105342 -111539 -206954 -90667 -118947 -55272
6118 -55272 94131 148436 212399 163940 86367 -6858 61123 57653 -27213 81187 -7402 -2472
6106 -2472 33498 22036 3240 -120905 -149545 -41198 60603 82142 181597 110962 3060
6095 3060 -36292 -80206 -88691 -184364 -151269 -53598 55638 65110 -53148 28971 11352 47080
6083 47080 -42469 44570 142759 141520 205519 287578 382453 421214 398346 357476 356505 361588 308920
6070 308920 500712 461489 160033 54595 -11138 -681 36610 -83008 -140001 -134286 -72182
6059 -72182 -169544 -84625 -45884 -73424 -15851 -37482 76587 147984 326165 339084 356963
6048 356963 260708 254991 245074 359830 245726 111039 -8105 -42942 -31613 -24308 -172083
6037 -172083 -240305 -309352 -366971 -293235 -85923 24065 24985 73466 40035 190875 416861
6026 416861 414517 223444 254346 288750 128133 -11953 8741 -124251 -181655 -168016 -77958
6015 -77958 -116602 -230064 -282166 -185101 -172685 -49873 -118883 -62822 -115840 -44001 -180434
6004 -180434 -167335 -117169 -178072 65798 156656 -43548 -217865 -116702 -68425 8460 -10905
5993 -10905 46555 150106 104640 -151682 -201618 -139923 -226331 -214074 -21881 620 -25994
5982 -25994 -33155 -18551 -79444 -122024 -91893 43746 -55135 -228158 -155157 -133313 -248105
5971 -248105 -348887 -285945 -238323 -198244 -188609 -185691 -85079 -4589 4651 -102791 -62323 -19001
5959 -19001 46576 -85693 -80901 -55412 -82889 -157436 -246727 -350526 -315671 -157824 -95893
5948 -95893 -64467 -37308 18412 -49610 -140691 -51866 -152867 -97903 -1879 -23299 36579 240706
5936 240706 22994 -136233 -1618 -43072 53601 130308 281746 283690 119679 -116533 -108279
5925 -108279 -99421 -81700 -13132 110705 -31203 -70012 -115882 -45948 -90251 -9887 -38797
5914 -38797 139474 126360 168886 190085 175477 126418 71997 121716 72710 53055 -91532
5903 -91532 43998 190603 233317 282627 337776 313430 132572 -89377 -72590 -80964 -236409
5892 -236409 -108848 141235 170867 104303 116595 181358 205642 314195 199491 146072 -47873
5881 -47873 -159836 -83439 -124042 -294878 -177736 -196515 -245288 -287341 -234889 -127756 -3859
5870 -3859 23612 -89662 -32753 71934 45314 -16028 31686 57110 93666 86358 211029 234578
5858 234578 207802 7434 -182588 -168301 -122266 -45449 -64844 -27602 -96633 -156038 -96250
5847 -96250 -20603 91322 -40768 -148076 -142644 -224638 -288413 -232869 -149637 -134391 -64752
5836 -64752 -64470 -243274 -318531 -99382 47065 63738 298980 322259 107163 68434 63192
5825 63192 -22736 -69950 16138 -34739 -35670 -12939 75407 287624 268799 187639 211695 113559
5813 113559 4940 -36447 -31384 -178355 -166105 8868 170944 103198 138295 115573 79979
5802 79979 128792 157519 177745 173116 185892 154838 -44238 -122410 -227498 -237976 -311627 -287809
5790 -287809 -232366 -152763 -220993 -335326 -242703 -15502 33324 4859 16825 103438 227853
5779 227853 301024 165682 175954 370558 381745 185743 48791 120552 195396 39344 46340
5768 46340 160122 248243 266265 366215 278987 224397 124240 -76858 -288229 -271406 -172846
5757 -172846 -150611 -51774 -7547 79087 34950 2497 164116 322962 93048 103003 18444
5746 18444 -2074 -172333 -257627 -35615 36044 117815 688 647 97695 212661 216245 123713
5734 123713 102289 93801 -57323 -103991 -91967 56748 71279 75852 -79672 -46840 -24084
5723 -24084 59066 47925 -55305 215112 248565 50406 -19181 -37992 -150367 -78012 15162
5712 15162 -12331 -83871 11397 5787 45236 -6523 31028 162709 197058 51783 83698 34206
5700 34206 52316 -2113 87040 171278 160143 135915 96473 8887 87869 181597 151598 -56766
5688 -56766 -32721 -46783 -167153 -234485 -127551 145476 251963 290189 140690 86419 -3905
5677 -3905 164122 181090 6550 -184947 -134158 -41139 10398 51250 112807 45213 -121309
5666 -121309 -117327 5466 202732 304224 226913 66360 85443 46574 40755 -91464 -84431
5655 -84431 -4170 108483 177120 227812 218837 103597 12991 71674 9452 -105835 -244070
5644 -244070 -82772 31628 16574 131537 123514 232298 245589 12347 -183587 -279985 -283701
5633 -283701 -83316 71721 195172 109712 60136 -38157 -242939 -242579 -211671 -198397 -249587
5622 -249587 -9970 58071 -32249 -112924 -105844 -117373 -137384 -187467 -205399 -143103 -114404 98418
5610 98418 103176 38391 98800 58792 -41827 -50166 -82123 -114003 -60298 -100046 -145948 -110345
5598 -110345 -138621 -161061 -185515 -280839 -383964 -481036 -423386 -194511 -128208 -73858 85611
5587 85611 215392 269008 20807 -257940 -137875 -33563 -143195 -194742 -238153 -276608 -252558
5576 -252558 -179588 -136873 -253292 -138103 -49849 -42113 -139244 -56404 -30380 120399 109169
5565 109169 92583 23892 -28019 -97005 -3850 48207 93223 174466 180657 114528 -41703 -194742
5553 -194742 -308780 -59403 48397 -63101 -67050 84568 -18740 -112359 -47538 -86692 -44083
5542 -44083 -33558 -80494 -141108 -73877 -115650 -189168 -235345 -103185 96400 144504 -45416
5531 -45416 -81007 74954 131069 -38250 -151210 -223812 -348258 -286987 -209794 -275070 -137630
5520 -137630 -4530 -151841 -278812 -158592 -90804 -41108 -61971 -111539 -171093 -81075 -15139
5509 -15139 89502 39646 -156452 -243927 -182094 -272453 -543196 -547279 -187149 2354 100087
5498 100087 33718 -91991 -61003 -30391 -4038 -89518 -137937 -190398 -117237 -82825 5321
5487 5321 -32840 112678 299887 314435 271341 292990 277550 -22251 -284655 -289583 -88531
5476 -88531 100317 110421 15754 12349 -52914 -209481 -219794 -120560 -47254 90537 105014
5465 105014 183914 146812 154694 29054 -65483 20627 117925 233002 178619 193778 122822
5454 122822 116246 98039 69798 220261 97575 -94546 -196174 -155563 -73014 28334 -227698
5443 -227698 -321708 -442082 -307717 -99891 -211329 -209770 -156241 -85211 -36501 31627 135660
5432 135660 77201 -48552 22763 92358 186806 164620 97146 262403 384615 246454 170684
5421 170684 68019 74509 172039 75775 19163 29869 88954 140890 203783 247744 164239 166950
5409 166950 74088 -63504 -123108 -52168 -78529 -30674 117059 161263 177023 66572 -33459
5398 -33459 -29663 138480 233343 373805 265683 233130 262599 392069 211319 85482 135179
5387 135179 113519 -139096 -186452 -26530 -54908 -121461 -156458 -150947 -172202 -266283 -242841
5376 -242841 -267004 -161867 -145987 -150935 -266842 -246080 -130619 8490 -117002 -141143 6108
5365 6108 140283 183502 259360 107091 29483 -125837 -70120 -223977 -300336 -163939 -77512
5354 -77512 1669 -136263 -231415 -325165 -337941 -294730 -297499 -242292 -196018 23820 -12051 -60676
5342 -60676 -16310 -89761 -75745 47788 94712 -66833 -262777 -216834 -52332 63123 170080
5331 170080 402530 257481 15432 -92314 -99242 -115696 -18495 218279 113668 86304 393636
5320 393636 460751 486559 456982 290846 65864 -180164 -352200 -298689 -264697 -235817 -137109
5309 -137109 98216 190377 218510 227684 129143 21916 -45376 -84326 37513 -5643 -139557
5298 -139557 -357296 -457544 -327733 -216348 -154646 -301 155582 116104 72571 56290
5288 56290 58666 115520 39358 129748 92182 116458 199150 275406 -32476 -158248 10723
5277 10723 154020 160138 81383 64974 28448 -72799 -187960 -239544 -433217 -498738 -446946
5266 -446946 -367784 -264236 -205885 -103085 -70716 -158324 -374436 -398436 -214746 -220751 -136201
5255 -136201 -176750 -250994 -48973 105668 45296 35027 56039 19850 -6465 -110205 -10680
5244 -10680 -83808 -119145 53620 228416 282241 243873 207668 255072 246863 164350 93960 123555
5232 123555 -24171 -52006 102539 125757 -53514 -116727 -176131 -29016 34509 71971 115390
5221 115390 101106 15884 -78664 -95841 104434 88153 -71868 -59039 -41567 131729 170790
5210 170790 -8971 -136149 -154775 -144872 -255416 -227788 23177 182536 268429 330644 319180
5199 319180 157530 4056 -35593 51101 91937 221067 99847 149607 113771 13590 24452
5188 24452 37287 98056 221810 207525 182689 113998 177831 210420 19560 -171837 -112830
5177 -112830 -13581 -29275 56499 26178 -173651 -134373 -216867 -64924 -2806 11497 -17705
5166 -17705 -105163 -152600 -207024 -241323 -206746 -94607 -14712 -164257 -96610 -117068 -41511
5155 -41511 13303 -7400 -109528 -179479 -369241 -341643 8166 213185 120018 123809 104576
5144 104576 124121 -15886 -47510 -48474 -143712 -212959 -295858 -220119 -243866 -175953 -2931 12970
5132 12970 -171458 -223655 -128817 -170198 -298315 -427091 -313015 -226984 -271657 -426907 -477896
5121 -477896 -296657 -295504 -132300 -86568 -125410 -228334 -140635 -90394 8720 -3357 52269
5110 52269 25078 -84732 -55926 -75077 -56380 -56965 -209676 -236037 -140966 -123075 -25197 -122484
5098 -122484 -184883 -261786 -144156 -6420 176996 384035 453002 202153 -47073 -126868
5088 -126868 -39955 -35416 -122298 -16083 -16097 -43638 -155021 -201457 -51550 66406 3022 5154
5076 5154 5657 18674 -27820 -90765 -272554 -305340 -94346 -11743 27837 90965 62751 115724
5064 115724 68089 -104488 15280 81387 -27605 -14431 19767 109704 121399 122834 66584
5053 66584 152072 121724 61141 64338 5452 -2898 -7267 102604 202684 217013 166915 121414
5041 121414 79550 46681 -105648 -242591 -309834 -405029 -462486 -430567 -281696 -190913 -124265
5030 -124265 -142874 -74843 59139 125830 261771 196352 215378 186895 207603 166472 112147
5019 112147 157375 3495 -79469 -175616 -72741 89241 37310 3548 105218 58817 -78139
5008 -78139 -64636 -42053 -43163 -79806 26347 191425 -34644 7085 7736 -145829 -6230
4997 -6230 149307 213825 -30234 -187285 -74684 97882 22581 -203874 -154898 -90963 4932
4986 4932 125562 129615 122274 98100 113525 123282 46697 27200 -142790 -26495 170990 -4917
4974 -4917 83643 202367 141891 133108 101408 18629 3019 38442 -94223 -26499 27758 -74486
4962 -74486 -103139 -69898 -13526 -64031 -26842 -10495 -90658 -140904 -82864 -86003 39150 190150
4950 190150 102831 139729 172043 148508 209326 216055 66120 13876 43211 90540 193340
4939 193340 90923 30802 -60002 -1617 -106577 -306980 -211497 -83432 -53998 71486 116333
4928 116333 2453 -119461 30573 40445 -86281 -38576 -22790 -25630 -119992 -328492 -502452
4917 -502452 -404424 -233417 -173980 -59957 -112351 -152828 -20377 23062 137914 178514 67320
4906 67320 207133 206246 163338 162279 -27073 -94799 -2573 -110187 -184925 -194072 -259031 -190385
4894 -190385 -108923 -113855 -48879 84011 87939 128450 231955 23432 -147169 -172117 -79372
4883 -79372 41327 161375 177291 212556 130793 191111 203326 178659 76781 -85192 -161716
4872 -161716 -164398 -90848 -95624 -130651 -103728 33202 76938 12537 157899 287079 180965
4861 180965 -177940 -308234 -65453 -30942 -177372 -288596 -203182 -127262 -93663 -108339 -66026
4850 -66026 -24128 9918 -1692 -120883 -198958 59871 40199 -105243 -155225 -220772 -332122
4839 -332122 -310334 -109574 149417 303615 269455 83312 -13923 276998 395915 354676
4829 354676 121062 15959 16400 64416 166023 249348 306992 443927 308807 144190 326628
4818 326628 290156 208284 298943 60880 -93339 -35099 70446 182272 131191 -60331 -164657
4807 -164657 -4812 90292 179659 150327 21187 138994 167598 135618 -58644 -91202 -23762
4796 -23762 -28883 111950 238013 91839 5417 34859 38900 43942 -150375 -202992 -73254
4785 -73254 -83465 147290 227924 66584 -56965 -23363 98812 55384 72275 -35397 -28488
4774 -28488 139054 240894 45847 134799 137616 48800 51000 20963 -36302 -7642 60229 -1075
4762 -1075 -139413 -162434 -204783 -17017 72262 25781 42310 12567 45348 131758 237081
4751 237081 186468 96140 -166358 -194206 -150782 28789 160668 198377 115017 32373 -9405
4740 -9405 -54753 55836 36761 41934 11216 -86105 -121382 -68194 -6277 100824 24937 -74392
4728 -74392 -156474 -94317 -126763 -206572 -143780 -43579 -34927 -90099 -168761 -294872 -152722
4717 -152722 -218317 -114251 -2607 -52124 -138793 -144949 -176701 -263539 -302230 -276755 -186325
4706 -186325 -99878 -147632 -199775 -264820 -63825 54994 -54937 -132474 -160591 -142656 -2355
4695 -2355 -20864 -138216 -92206 -157533 -126632 113299 65586 -84639 -98362 47375 21028
4684 21028 90918 160012 -94620 -145316 -85129 -173681 -251831 -204876 -129700 -101719 -19324 29880
4672 29880 24805 137879 176283 50046 37099 125307 182624 182118 180041 87896 -151999 -202444
4660 -202444 -159213 -72626 -49119 -96544 -124201 -131335 -22639 10352 117067 194460 93748
4649 93748 65332 122590 197372 238823 115716 53525 156851 158369 76937 98519 -23334
4638 -23334 -148392 -148521 -108362 11638 -36529 23130 155241 265014 272606 -27488 -199063
4627 -199063 -154202 4847 90448 73301 52863 57167 171720 218829 116330 -42068 -15048
4616 -15048 -34946 -118549 -214240 -224364 -126982 -53118 64873 112630 -4505 -202103 -153634
4605 -153634 -234689 -156422 -43601 88157 139840 206519 179541 150109 -87508 -14614 -73363
4594 -73363 -65190 -182705 -309129 -272204 -284430 -120728 123767 190570 128819 -6841 35193
4583 35193 -16501 -47917 -117170 52585 62248 27751 157720 340985 323912 249470 237338
4572 237338 112514 207691 311859 253648 294715 224049 169963 163138 19825 136779 200853
4561 200853 214511 155563 19200 -160425 -346404 -129384 16612 -4437 -7012 -551 -55247
4550 -55247 110862 32970 -73111 -3221 91140 -43302 2520 -17219 -49088 -36935 30739
4539 30739 58559 77904 90031 4270 -21934 75074 12333 -167695 -104243 37245 36604 18260
4527 18260 52063 154336 290095 157004 -15191 -235332 -209347 -148280 -279737 -260813 -258704
4516 -258704 -153271 -108490 -102197 -67035 -131415 -252003 -329153 -141371 -149328 -92339 20514
4505 20514 -40881 -77234 -10656 -34838 -108517 -195619 13209 105445 227602 421357 349476
4494 349476 237248 168620 100160 190621 82216 -99805 -136090 -30082 85626 279124
4484 279124 202691 154269 159415 -3905 -131726 -83270 -22340 -73151 -206603 -150165 46602
4473 46602 204636 241753 121413 91938 175437 120906 26280 17846 -29324 -36265 -78526 -262372
4461 -262372 -84090 -28942 132387 71788 -134268 -419896 -402063 -196437 -81991 -48128
4451 -48128 -144788 -134723 52364 109549 96752 38072 50816 -40163 -153806 -127933 151621
4440 151621 245996 183061 38996 -32262 -3388 234260 229292 85914 -17198 -21856 -124179
4429 -124179 -137063 -202570 -190237 40864 30199 -24598 -10757 74604 262301 79547 -244562
4418 -244562 -214348 -132940 -232528 -218590 34210 148309 40084 -51859 -174416 -311103 -243335
4407 -243335 -72189 -145050 -180347 88751 237561 142755 268458 318273 286704 213923 142079
4396 142079 33712 27373 45778 32745 14603 -5629 85033 96284 120756 314113 104235
4385 104235 53304 2294 59013 5013 -112410 38560 193213 115537 10373 -148075 -265138
4374 -265138 -95829 -97416 -125626 -145096 -102615 -63324 -43565 50911 92382 47563 107653 163636
4362 163636 -37942 -63547 -100652 43693 247776 138465 36482 25583 107187 70072 133843
4351 133843 204519 166491 223642 244513 271402 222858 257041 141742 -26408 -157496 -138426
4340 -138426 -93787 81639 96152 57083 108343 -98607 -442921 -458480 -347043 -204676 -129999
4329 -129999 -152562 -290186 -229543 -11849 65753 -142059 -157389 -113144 -283613 -330226 -196824
4318 -196824 -120342 -51514 161782 337338 196235 29800 -132989 -176319 -80533 29739
4308 29739 -100754 -188470 -75611 -68435 -36640 -38975 -58582 -98757 -1390 33128 37444 -2393
4296 -2393 129571 139823 62097 -30994 -125113 -14114 -156228 -179319 -143400 15843 23803
4285 23803 -83702 19086 133162 284143 245494 37167 -160770 -66370 -103856 -213875
4275 -213875 198441 232326 200866 126172 18385 -133245 -200043 -152583 -115699 -97015 -100550
4264 -100550 -64182 -106644 -45338 7531 -74661 35603 -39426 30437 -41203 -252155 -150912
4253 -150912 -64655 -45248 51850 262421 162625 116987 143582 275585 368608 283377 20411
4242 20411 -79554 -50982 31953 90621 154325 171531 72659 -107056 -213090 -86843 -98570
4231 -98570 -150242 -116537 -159728 -130733 4155 194317 178685 38047 73701 -9165 -173599
4220 -173599 -195088 -189632 -88776 -78467 -108250 -46480 -89411 -238619 -67571 89685 80151
4209 80151 306102 310591 213313 217679 138631 96556 -1705 -16747 -199359 -241793 -207739 -90903
4197 -90903 -11953 85539 118462 93429 -35456 62665 246724 137722 58193 78285 207789
4186 207789 158787 106409 142376 56900 75597 100232 126289 48048 -1705 92695 96242 171834
4174 171834 263019 192173 179721 -863 -144658 -105613 -145184 -54241 -77869 -70972 -48140
4163 -48140 -840 64951 22381 -62637 -151010 -224447 -158793 -34638 102339 196959 175786
4152 175786 -18599 -15772 -25096 -150375 -69937 -81083 -30234 45642 9983 -9557 -11766 6784
4140 6784 154476 145108 183477 50280 -107348 -37621 238928 181725 57057 96340 -19814
4129 -19814 37232 -45405 -238135 -203358 -30483 1829 150950 46970 56583 117410 52509
4118 52509 -59587 -140732 -214584 -233879 -244017 -135688 -217796 -177886 -139504 -51537 19604
4107 19604 85029 44475 141211 286495 302410 179953 200452 201292 122565 -52036 -207507
4096 -207507 -200164 -81797 -10725 54816 89927 150199 75962 25184 152572 132546 148619
4085 148619 303701 507667 420939 371020 411816 351351 300649 187455 59494 214438 231518
4074 231518 52212 24937 -70167 -45713 163480 255910 158469 62734 -48198 15776 67167
4063 67167 109229 70892 25684 -102738 -227077 -389059 -438829 -306859 55842 80864 -74987
4052 -74987 -72877 -38224 -121083 -94889 -24468 29971 -89994 -68570 -96563 -11006 -46466 2379
4040 2379 110931 117277 127863 103670 96028 141652 -39423 67342 20309 55257 48694 88522
4028 88522 144809 -115507 -202281 -136767 -127434 -107948 -32097 74530 108669 64421 88904 -39307
4016 -39307 -144246 -269889 -241183 -154249 -67536 -43937 -38081 -57997 -41606 -129608 -231628
4005 -231628 -212305 -197900 -201172 -254149 -393848 -363511 -90525 31674 133408 191768 191635
3994 191635 120436 70861 53287 20888 -18465 -33060 -97503 40232 66623 24022 -33053
3983 -33053 91928 185337 -93133 -326225 -246777 -261953 -183041 -23662 153809 79470 30388
3972 30388 72042 157504 280165 179525 -86575 -17853 22756 102566 129449 251426 202346
3961 202346 230261 216770 105419 -13058 -28620 -217718 -109528 -6923 82072 86524 8788
3950 8788 -36752 -13897 92708 129021 -88781 -126607 142428 -973 -132026 -154498 -38142
3939 -38142 -30734 107528 35429 -43970 -74108 -188858 -167776 13935 87648 334079 245905
3928 245905 147379 87840 -96956 -235223 -196070 -227348 -245072 -263797 -186756 -291246 -333698
3917 -333698 -392457 -521394 -478323 -274861 -175371 -99068 -55293 -151559 -45450 -8171 127006
3906 127006 119921 76241 -128157 -284220 -295428 -306729 -56610 -84245 -204120 -123438 -125851
3895 -125851 10121 -21729 -38399 -270271 -241326 -128832 -69990 -58812 -130596 -217379 -84063
3884 -84063 -1061 -98517 -250687 -185957 -63294 72771 99939 87142 -59130 -151738 -190618
3873 -190618 -343272 -364461 -127382 210341 290162 218724 151613 79977 225827 206090 188540
3862 188540 44918 102939 -15229 -135966 -152055 -131830 -43716 -126212 -89154 -133541 -101977
3851 -101977 -60097 -32054 -180457 -162131 -158238 -53652 88789 149561 162457 -51999 -170430
3840 -170430 -43922 -10804 -97085 -374973 -443662 -178754 91247 61599 -146811 -338274
3830 -338274 -281850 -62521 49972 39605 149695 83463 -127414 -210751 -135069 -84370 210264
3819 210264 313195 191802 87915 475 12718 -115954 -154101 -103073 -59705 -157433 -200967
3808 -200967 -214672 -124102 -180593 -346200 -326181 -188028 -117262 17019 255765 214504 46417
3797 46417 -20758 4277 52143 89110 252982 298186 197938 125995 15296 -104182 53341
3786 53341 93439 11480 -27731 -79600 -231519 -304978 -211444 -119480 -252802 -168070 19496
3775 19496 20464 -101580 -329813 -363569 -171754 -86983 48736 -183 -129340 59101 139242
3764 139242 64844 -95838 -118729 -87236 -95679 -93369 40057 146898 179468 118542 173661
3753 173661 245148 295165 233176 238314 151702 229271 378855 452896 391333 342273 268302 -19763
3741 -19763 18437 110018 99283 176526 170779 177852 201067 157157 88150 143041 98616 -2406
3729 -2406 -233421 -360327 -279965 -161219 -102007 -38754 -49921 -30635 -52732 -56718 -175004
3718 -175004 -211122 -226685 -144089 -115970 103617 159668 118451 148317 -28229 -135514 -27285
3707 -27285 77986 221921 196426 236280 133362 -69524 -92432 64978 10374 -102554 -45173
3696 -45173 -150848 -89480 -165110 -2652 38987 61657 16570 26092 192956 63211 -1164
3685 -1164 -3682 65857 144705 45449 -36790 -85819 -29951 122446 184575 136991 -88063 -281581
3673 -281581 -241081 -65480 -76827 -246550 -157746 -142062 -183306 -107449 121532 60939 6111
3662 6111 -7872 30520 14254 -203284 -223380 -96409 95051 -50941 -199747 -127991 -81073
3651 -81073 -46730 -76030 -117865 -106546 -31814 -41734 50899 -2045 -115925 -9524 -12085 -62815
3639 -62815 102349 58968 88044 39776 38706 104951 107789 -211267 -111215 -13108 100090
3628 100090 309446 317380 206757 26742 -229132 -288756 -20782 206683 264244 190417 244216
3617 244216 56312 -112988 -208939 -94567 -38063 48135 42895 -124058 -77256 -67746 -116100
3606 -116100 -20712 -20959 -408 -107156 -90536 -66062 -2709 -40910 -101955 -155200 -235088 -221673
3594 -221673 -223584 -187140 -24889 -163717 -304661 -406952 -165140 -62458 -62155 -67367 -219024
3583 -219024 -169084 20242 110546 38757 124280 107058 10016 66947 17361 -114295 -91466
3572 -91466 -125266 -168672 -288714 -203090 -37254 304256 233628 264004 272290 235056 166698
3561 166698 224744 175156 -32372 18919 195425 218983 41012 -229879 -257119 -56525 42843
3550 42843 107652 130161 275159 271600 206137 142918 48994 -91967 -133559 -98545 7024
3539 7024 -60831 -173995 -140738 33298 10936 -128912 -118829 -203 208469 157605 117545
3528 117545 205456 149949 108802 245159 -709 -72779 -95824 -91831 -122952 105539 347818
3517 347818 232541 128780 99936 -68841 -304104 -408006 -268022 -240222 -233933 -56923
3507 -56923 -74778 -75367 -32373 66177 215989 395382 205470 89779 176757 451382 429475
3496 429475 344121 424221 246552 65120 -38513 32737 244535 392397 369139 302091 334301
3485 334301 191308 -42727 -89579 -38109 -87537 -36220 61314 219506 139575 15022 180757
3474 180757 190380 87065 109401 61675 -18507 70040 116372 132424 80827 150560 148560 262266
3462 262266 317590 221740 77536 28938 -52750 -246108 -73566 1617 182302 24753 -123768
3451 -123768 -2160 -18806 -11600 -144293 -61780 43037 49621 -19949 -18354 380 27012 -19411
3439 -19411 30511 86029 187070 62796 3743 115008 194910 129863 122883 -20906 -145345
3428 -145345 -244104 -126469 -13976 71389 109694 55638 -51300 -90551 -70144 45235 -10757
3417 -10757 -107882 -176464 -140493 137471 241293 120896 103214 130386 88867 -21433 -84629
3406 -84629 22012 182497 179609 194969 209042 268088 429867 406515 283725 218506 185397
3395 185397 157450 80666 -6675 -5618 -35153 13847 -19550 -83764 -168916 -213330 -110152 -135507
3383 -135507 -83352 -117109 2282 18009 -52658 40657 109032 -60775 7798 138728 154493
3372 154493 -169445 -295766 -190273 -114496 -77257 42388 52244 -25937 -158011 -5579 4367
3361 4367 99726 348493 326231 146836 96649 175252 154495 36833 -72909 -679 237837
3350 237837 463118 385354 187828 161072 79822 8865 -54283 67420 73361 38535 41603
3339 41603 47748 106390 193425 143985 -21968 47287 -9329 -58417 32540 -30213 -170229 -209005
3327 -209005 -241516 -253584 -68786 4425 -184290 -68622 -94479 -192644 -24757 24173 29690
3316 29690 11916 -14893 83911 48055 180016 202230 104850 23756 -45221 -105445 -33813 10898
3304 10898 139549 144588 77368 -80882 -73950 -3560 -57768 -74372 -86479 63006 121762 43210
3292 43210 -16042 82153 87024 149115 218646 245460 107026 -89396 -73572 84682 302083
3281 302083 229212 117840 215882 168732 26431 22401 -221 36200 -33008 -78611 -55984
3270 -55984 83155 18013 -59011 -20841 -137245 -201399 -124731 -193852 -235720 -192700 -188219 -74850
3258 -74850 83134 125167 140680 33595 -38590 137251 274216 402938 394963 272373 236492
3247 236492 80835 -45700 -2158 71217 57324 80868 14099 70233 -10180 -135427 -148958
3236 -148958 45300 157166 22281 96025 89456 -23834 35306 67928 -20084 -141312 -197854
3225 -197854 -84393 -73134 -101873 137577 51499 -59523 -41364 -36566 116185 135618 38499
3214 38499 -40159 42757 -9937 -150006 -73232 -119573 -181748 -13581 -54042 -220939 -128206
3203 -128206 79527 100313 6466 -166460 -198620 -291734 -310302 -194335 38314 91516 157768
3192 157768 239058 171829 117395 79364 185334 176957 137973 97639 -48251 -165516 -66682
3181 -66682 28568 33828 84853 164306 105985 100860 72302 -32944 188874 170859 118856 39265
3169 39265 -34713 -67253 -20514 -46004 -782 -25128 -189830 -264369 -194789 -327914 -198952
3158 -198952 -11396 -163970 -67210 -79572 -160243 -263828 -303879 -181207 -63133 -48033 2532
3147 2532 170620 158837 -67391 -179623 -214770 -145899 29023 243176 196303 127128 19381
3136 19381 44489 -2194 21752 -60433 -107658 -69737 -139182 -141224 -49223 56641 97632 16860
3124 16860 -124230 -194444 -60001 147937 250184 195697 162757 -13153 -214934 -21775
3114 -21775 105789 2739 -4684 -130082 -208917 -156096 -141344 -163324 -280800 -235257 -27285
3103 -27285 35669 -44430 -71996 -53462 -40138 49298 -16603 -186612 -171635 -83989 24066
3092 24066 69195 159642 35029 -26142 6261 252049 205928 167737 86582 -33929 -15717
3081 -15717 -11333 -137097 -37164 31144 100969 451 62684 70790 -13631 -27760 -266707 -238981
3069 -238981 -206630 -215358 -158975 -31858 -119016 -70129 102792 206969 223482 -82023 -192232
3058 -192232 -73670 4418 -77379 -111593 -66365 -184866 -85051 148684 248297 281063 174838
3047 174838 31630 -230878 -229858 -175142 52393 153922 216649 167403 40964 160200 194594
3036 194594 176656 92838 -37094 -54846 4275 267695 129773 -62205 -119873 7355 19705
3025 19705 -43420 -48226 7827 190108 119534 -16657 -128199 -24143 55144 -44123 -73608
3014 -73608 68503 99656 -70283 4072 99788 75406 -1922 83160 107711 20250 49505
3003 49505 16428 2511 -76279 -167359 -144425 -59013 97777 58696 -169299 -161982 -145279 -14704
2991 -14704 10216 -34910 199568 186630 171019 40335 -33115 25037 12353 62298 186641
2980 186641 209034 236378 178464 188499 43981 -176957 -172123 -61768 -117371 -2538 16395
2969 16395 -16320 63052 122975 15647 -152158 -198915 -163506 -253053 -152248 -152137 -166372 -88611
2957 -88611 -100432 74267 287460 269504 143294 34998 -22809 -168362 -206042 43051 214612
2946 214612 5018 -129552 -245374 -335601 -263251 -204610 -42364 149103 147059 44468 -35526
2935 -35526 -89523 -63475 -203814 -242665 -226690 -203778 -163431 -108945 84695 296042 343735
2924 343735 172362 -89050 -85672 -7631 219872 391084 483465 479204 352225 267064 204582
2913 204582 -55629 4495 87697 167229 41617 -157855 -197425 -6409 5004 -432 -94530
2902 -94530 -163325 -176212 -61473 -58628 -30408 -5593 195393 127743 77885 194656 228151
2891 228151 134396 185093 226097 18723 -68188 -163436 -27282 196281 299807 38009 -257317
2880 -257317 -215157 -10360 8466 174256 130288 55981 83588 148670 240405 270785 126000
2869 126000 109612 172759 316404 259731 103560 2727 11169 102020 153237 173269 301607
2858 301607 321207 235996 99737 217953 288400 414223 291666 161997 221413 144447 150754
2847 150754 144087 -50178 -49404 30469 -22947 -127972 -166521 -214067 -127884 35235 191931
2836 191931 33585 -128563 -84853 46976 174761 33930 -81884 -133983 -162840 -52219
2826 -52219 71039 106557 147235 54041 25097 244552 285794 257453 235607 241646 294839 253395
2814 253395 192343 11843 -102909 -76615 99352 117565 146291 188193 27737 27568 41588
2803 41588 -54197 -84074 187388 291663 162606 29824 6669 -22165 -41228 28503 -11228
2792 -11228 25790 25692 22904 170114 168849 98998 46298 -19469 96576 262754 74643 -37810
2780 -37810 11325 229281 226661 201772 138026 157806 141374 239602 260964 211604 86440 67744
2768 67744 83079 57922 173451 235528 288706 315716 161082 135193 188059 306760 256976
2757 256976 119332 8837 -165351 -186169 -185889 -223858 -340247 -318527 -65755 40219 32795
2746 32795 -90796 -160145 -234249 -96182 820 67659 83374 -57005 -109429 -235597 -17063
2735 -17063 -16564 18954 246028 291047 285859 263487 157076 -58051 -146678 -47988 5603 -18344
2723 -18344 -19505 203460 361120 239184 144218 -161263 -279662 -193840 -207659 -193318 -160212
2712 -160212 -236295 -226829 -97312 -103573 -111636 -112836 -190879 -452056 -319927 -60200 29337 196485
2700 196485 324060 154262 162157 101015 -93788 -8047 53171 149824 106558 103376 207701
2689 207701 139475 107272 23286 -98860 -264047 -142785 -24518 -31645 -7617 -11452 -171661
2678 -171661 -273620 -195195 -213211 -221668 1968 247027 303453 190189 29955 -157570 -60984
2667 -60984 72995 149124 152776 92908 36026 2648 -128799 -222275 -48670 -23017 -23341 -115751
2655 -115751 -169765 -93978 -68299 -301428 -345853 -318711 -194722 -169541 -54844 43580 39474
2644 39474 -73497 -232199 -260323 -112582 27178 -153335 -192635 -29088 -22782 -226394 -175189
2633 -175189 -182585 -183939 -42928 -86392 -92314 -73122 172819 296180 13004 -167675 -255484
2622 -255484 -251568 -211662 -229680 -341122 -282886 -337111 -180901 53684 -33320 -124073 -299579
2611 -299579 -368041 -216891 -75784 -60590 -185024 -301191 -135598 -87919 -214306 -214930 -180471
2600 -180471 -54409 -212421 -209917 -44708 -147010 -145723 -176104 -141633 -162980 -129350 -8501
2589 -8501 -29483 128476 126142 235412 230844 133777 114843 220523 231250 236793 198360 125627
2577 125627 42228 34039 141893 116507 -19375 -150090 -92187 -57317 -98831 -182855 -202902
2566 -202902 -115644 -50822 -50921 -87174 -32828 8792 86982 125237 -78849 -209010 -292753 -243577
2554 -243577 -279924 -435730 -388139 -344994 -237484 3659 173367 170395 66263 91615 54789
2543 54789 17614 -151757 -94265 -26285 43369 8259 -58734 -47262 43215 115841 149567 126107
2531 126107 23546 -91866 -129258 -147090 -79267 -234420 -51172 55106 -4092 -127340
2521 -127340 -204637 -196923 -159558 -91624 -151060 -125535 5146 16997 -60276 18814 -18991 -76587
2509 -76587 -99963 -108292 -124800 -38404 282293 273789 29506 -105467 -68957 -98426 -10350 207
2497 207 -40321 -52285 95637 312508 229135 183872 37688 -76742 -23982 -94793 3144
2486 3144 82278 73619 -16623 -137851 -76210 -85169 -8678 -21114 5385 140314 127596 -40590
2474 -40590 -26940 -51648 -69573 -183134 -88487 73332 60230 144882 269132 197597 114623
2463 114623 -47303 -92690 -19019 79078 74553 117370 17043 -214012 -106533 15845 2953
2452 2953 -65323 71538 98028 -85516 -56844 120523 -17670 -244506 -344054 -247935 -145010
2441 -145010 -311506 -252133 -177274 -47957 120917 -16955 68082 59397 -49236 -32624 1413
2430 1413 -18733 -139956 -229146 -248615 -185353 46245 151108 212395 45293 24564 129147
2419 129147 248284 382433 114865 70038 163232 234568 289143 349139 374464 440376 347566
2408 347566 142006 -33242 -68767 -68070 -9573 218266 106863 21709 72003 -15667 30753
2397 30753 144425 50916 -48829 -3872 12912 38251 -27957 14372 127581 133156 47609 -78040
2385 -78040 -79055 80009 131094 319193 444629 409142 378049 195165 4463 -11891 110825
2374 110825 68576 13362 71562 159476 126644 279130 149579 123030 107275 77907 91246
2363 91246 161380 131409 231118 212547 106905 631 61300 146214 292696 274814 117083
2352 117083 182704 283657 318301 118627 -24718 17219 173835 166888 88676 265730 152272
2341 152272 120795 -6674 -21275 -40368 -11885 2803 -57202 -195964 -284907 -264971 -387151
2330 -387151 -197059 -135454 -113076 56508 47975 94579 15968 -42350 66130 139743 161154
2319 161154 80681 -13300 5484 -26897 40722 173006 159266 -80166 -173261 -126179 5027
2308 5027 -203282 -371123 -249495 -2580 108461 97395 -67806 139401 327477 334983 131880
2297 131880 243722 314034 78628 34242 9146 -60267 34667 98351 23627 -199619 -355104
2286 -355104 -489516 -381708 -162798 127419 14472 51453 202205 198492 173633 190580 131518
2275 131518 -5606 103654 239722 204772 -1904 -36234 -41807 -72230 -58711 136148 197757
2264 197757 227867 205952 266091 229900 203724 61411 -90499 -68631 -19262 143379 227122
2253 227122 95575 -218833 -328484 -295862 -203689 -213124 -168960 16114 136784 274571 243643
2242 243643 42718 -151679 -139735 35421 170080 62856 118256 162135 -63519 -210427
2232 -210427 -316056 -168314 -118288 -97834 -172649 -354142 -457617 -179904 -3011 -229986
2222 -229986 -354228 -35297 222941 140600 -115 -13116 52779 9354 -851 53467 60279
2211 60279 71470 47668 -134073 -253892 -408616 -461851 -536008 -441713 -123796 -81174 -319435
2200 -319435 -385907 -344382 -356396 -345370 -176387 -109645 4233 -64699 -124958 17652 41741
2189 41741 46553 50388 -37129 141923 200005 145099 26873 74485 1449 -45843 54414 87173
2177 87173 133962 155504 128037 29691 -7189 -3129 -16565 -26869 151310 42430 79716 91473
2165 91473 33082 -105883 -64767 48990 70230 46816 -199956 -419005 -395102 -195385 66859
2154 66859 114254 23891 63788 41212 103389 77586 109445 198093 226538 301481 243214 176446
2142 176446 22463 -102246 -36713 16108 -52762 -51690 136662 -48331 -174144 -149058 -25767
2131 -25767 49234 214311 156793 55778 172342 43962 83381 127729 52215 122454 172402
2120 172402 238991 98451 79225 91425 225326 64011 -142644 37856 210006 191192
2110 191192 -14508 -76948 72171 200764 202175 -8891 -42827 68985 24531 92229 174806
2099 174806 110556 85197 126185 211548 78250 -160284 -210137 -162505 -33611 33023 16440
2088 16440 83348 91993 -66855 -87692 -109762 -84149 -15875 50303 31646 -38559 -127255 -283790
2076 -283790 -303171 -183326 -30117 -17458 -47842 16964 176707 365376 399528 377927 157796
2065 157796 14743 -58047 -21457 14855 105159 70363 -199451 -348162 -146800 -39693 -172099
2054 -172099 36559 126675 110775 19166 3349 95307 113335 97178 9622 -187199 -278264
2043 -278264 -143402 -84688 -241602 -330001 -196839 -127754 84113 160207 7550 -51017 35303
2032 35303 117628 154148 249861 137536 77001 79133 181025 155387 95404 2555 71253 168911
2020 168911 124601 75356 23564 -88216 17424 144823 214383 268175 398108 360394 308043
2009 308043 427576 403608 279430 324088 128635 -156754 -125798 -90371 -12901 -48532 27648
1998 27648 7613 -45853 -55455 -61550 96850 78176 -86183 -65850 126818 20586 25735 -40333
1986 -40333 -36271 2318 132796 113164 178296 196939 214384 151324 193147 21928 -144559
1975 -144559 -160504 23470 98685 188827 181499 132178 86592 98818 108833 27940 -50873 -139273
1963 -139273 -238828 -226628 -328162 -367198 -251251 -275601 -314664 -234680 -163099 -231429 -228705
1952 -228705 -7243 179624 155356 126630 16797 -23654 18777 -39433 -80797 -195628 -241233
1941 -241233 -196906 -99910 -161500 -239010 -272741 -171853 23752 -30541 -173366 -90377 157664
1930 157664 171081 120724 -94253 -87992 -137067 -40918 -77776 -80482 -68009 82881 171662 134147
1918 134147 126422 113517 208691 154885 70566 99615 42712 27288 -3387 54911 149690 73054
1906 73054 115454 61557 111723 123036 75091 38342 64075 -95511 -165646 -93857 45014
1895 45014 -31457 -106226 -122896 -66053 31775 123963 117786 134834 93109 102419 177026 298757
1883 298757 339992 120859 -75482 -535 9417 -180176 -105574 -62805 33113 -82881 -302638
1872 -302638 -270317 -169789 -111185 -90344 -242322 -330493 -245622 -246071 -142014 -116622 -270248
1861 -270248 -512030 -508473 -525636 -318718 -132956 -157890 -60318 107194 150260 51563 982
1850 982 88848 -41659 63710 62164 -4097 86598 95725 -74415 -76523 -137534 -157303 -306133
1838 -306133 -351673 -302311 -290707 -216624 -22717 -174376 -226095 -90999 -148400 -228126 -176393
1827 -176393 3075 108029 -22868 -126394 -188051 -289793 -129849 74142 158463 118365
1817 118365 -120424 -243642 -164988 -91724 -84064 62570 6129 -103036 14633 91838 190090
1806 190090 373914 210088 247321 343020 326195 298113 329935 231108 -70359 -173268 -52018
1795 -52018 -37247 26408 -2374 -40656 50267 33122 91402 151180 67430 -142898 -283613
1784 -283613 -164112 -160355 -117825 -72368 -10014 -11027 -146764 -34304 5823 36529 -699
1773 -699 -7093 55170 18724 -49388 -84129 -111605 -148348 -175925 -262958 -241942 -88153 -93712
1761 -93712 1807 -61531 -60172 68285 -20146 39965 138712 209383 4885 -187181 -294017
1750 -294017 -338340 -165807 -161374 -160531 -240679 -194747 -135156 -27180 -10880 -274371 -268728 -149836
1738 -149836 66787 -7473 -139149 -67070 -52235 -62201 -151242 -120275 -44141 -74051 61863
1727 61863 117284 23841 149907 180182 114942 -379 51984 69750 203267 289662 142346
1716 142346 216618 233044 191929 122508 207004 222864 288295 291748 174361 153054 126341 -46516
1704 -46516 -57128 1561 -14816 172106 297983 234741 49921 -201112 -432249 -237848 52102
1693 52102 39443 -23726 -20742 96088 155975 163006 157276 92048 95618 30412 45792 -24300
1681 -24300 -79821 -17610 53963 202335 365930 469030 376558 321299 302907 243128 92413
1670 92413 -48190 50090 70442 138812 235083 125554 -128744 -133472 -25995 -144529 -34235
1659 -34235 19399 154946 206098 117904 -4627 -62679 31607 78942 125674 99612 315932
1648 315932 327728 161506 41388 41405 -1795 35843 39396 -39832 -158126 -291825 -187712
1637 -187712 -59830 -77534 -156574 -245874 -215453 -259524 -320663 -260785 -51785 102853 131620
1626 131620 58329 -15798 -111373 -92016 -17308 133425 226203 199963 110765 51121 68089
1615 68089 161285 283983 224768 249859 169206 196345 251624 225425 131338 249754 270990
1604 270990 183235 76160 132022 257078 102514 -87442 -293301 -180622 -39572 118567
1594 118567 295297 155399 154947 165583 59556 43099 116853 -15942 -162291 -26855 91771
1583 91771 191382 293803 261302 110730 -17718 164903 217586 119753 157540 30897 46229
1572 46229 127271 93689 150545 240719 123198 37155 26948 97303 29965 46970 66956 94171
1560 94171 43677 38348 -3893 141663 240332 44090 -151585 -187286 -307600 -79134 231203
1549 231203 194201 156265 307233 265500 114632 -16033 18192 115295 107061 12085 486
1538 486 24738 49771 43199 -69997 -328615 -178557 125151 168739 253912 283725 194725 11777
1526 11777 -89666 -88383 16381 19741 163210 290780 142740 81634 4878 -179786 -142157
1515 -142157 -163605 -158226 -117264 -5868 89045 92795 -66786 -115211 -31939 86712 77983 74978
1503 74978 54226 29021 190458 206887 47652 -154651 -95985 92990 99834 12857 8446
1492 8446 -33944 -29015 -58957 121184 120960 -16863 -225347 -210481 -219340 -309872 -450679 -375276
1480 -375276 -165057 -116226 -196399 -63598 105929 84034 78524 185848 201359 204669 242153
1469 242153 307899 147953 69721 213846 223572 204692 119708 -104439 -24954 84328 -26187
1458 -26187 -105206 -61907 55792 13460 36570 46189 81028 42995 -62208 -105627 -146233 -75250
1446 -75250 -61027 -297784 -468988 -259421 -150297 -13824 -69695 35211 145530 199448
1436 199448 143465 -53556 -192731 -215313 -168600 -127455 7347 -14283 -50863 -103057 1123
1425 1123 135496 174856 121463 60870 87659 61464 -118152 -282859 -214153 65844 77403
1414 77403 -67655 -95824 83694 180977 186344 17026 -105764 -185635 -136519 22982 247151
1403 247151 303685 137466 68439 20001 -65372 -76142 2989 160575 -22015 -100255 1097
1392 1097 156193 164040 151186 31364 -11934 65864 116602 55327 111192 96840 47919 49025
1380 49025 203070 260757 199067 243210 358864 260371 124039 53907 20399 107690 193727
1369 193727 151416 -250876 -298237 -67584 -81931 -92184 89593 15100 86729 242285 147872
1358 147872 45204 -89493 -139855 45611 79238 24178 31117 165818 100880 18947 -9956
1347 -9956 -33297 -56064 42327 17270 42472 147584 307978 278739 192946 189424 161632 54584
1335 54584 142312 170071 12183 14449 107166 -11754 -15730 34728 10664 61181 -37849 -227765
1323 -227765 -193467 -144341 -76357 -47896 7544 -555 40227 -70926 -220132 -237444 -86293
1312 -86293 -83044 -66245 -32389 -179017 -272830 -146953 -42878 8905 -125861 -103476 -130730
1301 -130730 -105831 -67524 -117459 -199592 -177973 -31006 21783 6379 -97680 10577 48348
1290 48348 -24169 -164343 -118058 -30762 -36989 6992 -27366 -245728 -371698 -338632 -221420
1279 -221420 -235138 -135905 -27454 -6086 -72320 -81654 -141017 -171677 -329730 -384690 -388811 -237031
1267 -237031 13478 25016 -30662 15379 35961 -19586 -16861 -50031 47823 151560 245657
1256 245657 325759 330153 305993 207640 118884 62825 -106474 -97873 -144806 -46896 102544 15864
1244 15864 72517 114105 -36431 -161989 -30334 242772 362538 106478 72295 69989 29909
1233 29909 68393 -40128 -139012 -104518 -144241 -91394 21311 39806 -48388 -45068 -27846 3075
1221 3075 8761 13296 38359 -155744 -192331 -116437 -83204 26941 12069 -96763 -75189 -63034
1209 -63034 -117722 -36128 74720 22760 147450 224789 305788 225091 88303 -73527 -174925
1198 -174925 -131776 -332 22185 -124038 -120146 -147266 -26554 150581 162054 82352 -21937
1187 -21937 -351190 -540836 -330840 -140641 -61448 -43249 -79424 -91810 -195646 -303076 -347822
1176 -347822 -334683 -118084 -41901 136245 116605 -22987 2124 -103482 -46717 127229 342055
1165 342055 285403 95386 91180 94100 112317 14568 -109084 -103712 -64934 -145103 -168514 -277420
1153 -277420 -109815 -89805 -21057 223707 256601 207975 11380 -70339 -159847 -183327 -165358
1142 -165358 -173733 -89149 -221289 -317814 -320938 -216355 -185471 -119728 -161128 -90718 -33518 -61556
1130 -61556 -37814 -122135 -103153 46853 75802 -28606 -45723 -686 66435 205714 27351
1119 27351 11448 -62031 -157337 -11874 72320 33999 -38675 -51126 96007 810 -78556
1108 -78556 90149 161426 -11288 -93438 -74865 -77951 -168677 -190682 -250773 -345396 -223822
1097 -223822 -100765 -82194 -118829 92717 177012 87399 63295 61899 -39326 -137299 -172187
1086 -172187 -18848 46933 114723 169314 -17794 -271392 -202571 -132536 -213 -18995 -28475
1075 -28475 80013 169951 149102 154932 192360 101604 -55145 -125756 -131371 -223684 -202531 -89353
1063 -89353 55992 133262 139632 86954 -44759 -64211 -186272 -299993 -236035 -70894 51335
1052 51335 194434 109491 -81697 -146535 -76289 -12873 35661 -177329 -130248 183286 -31765
1041 -31765 -160693 -10731 133403 82797 135864 173746 185833 10509 -40798 -116990 -179421
1030 -179421 -229077 -171014 -16558 3957 -63616 46535 4184 -16956 -62216 -171826 -109709
1019 -109709 -59779 -89434 -89324 48744 188401 17658 -47542 -179727 -134174 -169920 -230197
1008 -230197 -140009 -94385 -170395 -132071 -249019 -405720 -358754 -63404 6455 141993 174899
$$ [...]
##END NTUPLES=NMR SPECTRUM
##END=
