##TITLE=Analysis number 321608
Compound Code sb 02020
Project Code adrs
Chemist Name andys
##JCAMPDX= 6.0         $$ Bruker NMR JCAMP-DX V2.0
##DATA TYPE= NMR SPECTRUM
##DATA CLASS= NTUPLES
##ORIGIN= Bruker BioSpin GmbH
##OWNER= nmr
$$ XWIN-NMR		Version 3.5
$$ Thu Aug 17 15:39:22 2006 GMT Daylight Time (UT+1h)  MAYBRIDGE\nmr@NMR_250MHZ
##.OBSERVE FREQUENCY= 250.131544655141
##.OBSERVE NUCLEUS= ^1H
##.ACQUISITION MODE= SIMULTANEOUS (DQD)
##.ACQUISITION SCHEME= undefined
##.AVERAGES= 16
##.DIGITISER RES= 18
##SPECTROMETER/DATA SYSTEM= dpx250
##.PULSE SEQUENCE= zg30
##.SOLVENT NAME= CDCl3
##.SHIFT REFERENCE= (INTERNAL, CDCl3, 0, 16.522)
##AUDIT TRAIL= $$ (NUMBER, WHEN, WHO, WHERE, WHAT)
$$ ##TITLE= Audit trail, XWIN-NMR		Version 3.5
$$ ##JCAMPDX= 5.01
$$ ##ORIGIN= Bruker BioSpin GmbH
$$ ##OWNER= nmr
$$ C:\u/data/dgb/nmr/ADRS/1160/pdata/1/auditp.txt
$$ ##AUDIT TRAIL=  $$ (NUMBER, WHEN, WHO, WHERE, WHAT)
(   1,<2006-08-17 15:38:51.26 +100>,<MAYBRIDGE\nmr>,<NMR_250MHZ>,
      <created by zg, POWCHK disabled, PULCHK disabled
       configuration hash MD5:
       E2 DF 36 D8 04 B2 41 60 5A D7 A3 38 5A 4B D0 FE
       data hash MD5: 64K
       83 EB A1 07 5B 4B A1 41 0F AC CD 1D C2 30 6C A1>)
(   2,<2006-08-17 15:39:06.21 +100>,<MAYBRIDGE\nmr>,<NMR_250MHZ>,
      <Start of raw data processing
       ef LB = 0.3 FT_mod = 6 PKNL = 1 SI = 32K 
       data hash MD5: 32K
       0F 75 ED B3 73 EE F3 7E B1 E6 89 A4 9B 9F BD 2E>)
(   3,<2006-08-17 15:39:11.33 +100>,<MAYBRIDGE\nmr>,<NMR_250MHZ>,
      <apk 
       data hash MD5: 32K
       CF 4E 39 04 5B 2C 58 F8 B4 C4 94 E1 D8 F6 23 28>)
(   4,<2006-08-17 15:39:12.85 +100>,<MAYBRIDGE\nmr>,<NMR_250MHZ>,
      <abs ABSG = 5 
       data hash MD5: 32K
       90 A5 D6 AB 40 82 5F 39 54 E6 EE 81 02 C8 E8 92>)
$$ ##END=
$$ 
$$ hash MD5
$$ E8 66 8B 8B 31 8F 7E DF 3C 3B BC 87 87 84 C8 5D
##$RELAX= 
##$RELAX= 
##$RELAX= 
##$RELAX= 
##$RELAX= 
##$RELAX= 
##$RELAX= 
$$ Bruker specific parameters
$$ --------------------------
##$DU= <C:\u>
##$EXPNO= 1160
##$NAME= <ADRS>
##$PROCNO= 1
##$TYPE= <nmr>
##$USER= <dgb>
##$AMP= (0..31)
100 100 100 100 100 100 100 100 100 100 100 100 100 100 100 100 100 100 
100 100 100 100 100 100 100 100 100 100 100 100 100 100 
##$AQSEQ= 0
##$AQ_mod= 3
##$AUNM= <au_zg>
##$AUTOPOS= <52 >
##$BF1= 250.13
##$BF2= 250.13
##$BF3= 250.13
##$BF4= 250.13
##$BF5= 500.13
##$BF6= 500.13
##$BF7= 500.13
##$BF8= 500.13
##$BYTORDA= 1
##$CFDGTYP= 0
##$CFRGTYP= 5
##$CHEMSTR= <none>
##$CNST= (0..31)
1 1 145 1 1 1 1 1 1 1 1 1 1 1 1 1 1 1 1 1 1 1 1 1 1 1 1 1 1 1 1 1 
##$CPDPRG= <>
##$CPDPRG1= <>
##$CPDPRG2= <>
##$CPDPRG3= <>
##$CPDPRG4= <mlev>
##$CPDPRG5= <mlev>
##$CPDPRG6= <mlev>
##$CPDPRG7= <mlev>
##$CPDPRG8= <mlev>
##$CPDPRGB= <>
##$CPDPRGT= <>
##$D= (0..31)
0 1 0 0 0 0 0 0 0 0.06 0 0 0 0 0 0 0.0002 0 0 0 0 0 0 0 0 0 0 0 0 0 0 
0 
##$DATE= 1155825529
##$DBL= (0..7)
120 120 120 120 120 120 120 120 
##$DBP= (0..7)
150 150 150 150 150 150 150 150 
##$DBP07= 0
##$DBPNAM0= <>
##$DBPNAM1= <>
##$DBPNAM2= <>
$$ [...]
##$SUBNAM7= <"">
##$SUBNAM8= <"">
##$SUBNAM9= <"">
##$SW= 20.6930455092707
##$SWIBOX= (0..15)
0 0 3 0 0 0 0 0 0 0 0 0 0 0 0 0 
##$SW_h= 5175.983436853
##$TD= 65536
##$TD0= 1
##$TE= 296.16
##$TE2= 300
##$TE3= 300
##$TEG= 300
##$TL= (0..7)
0 120 120 120 120 120 120 120 
##$TP= (0..7)
150 150 150 150 150 150 150 150 
##$TP07= 0
##$TPNAME0= <>
##$TPNAME1= <>
##$TPNAME2= <>
##$TPNAME3= <>
##$TPNAME4= <>
##$TPNAME5= <>
##$TPNAME6= <>
##$TPNAME7= <>
##$TPOAL= (0..7)
0.5 0.5 0.5 0.5 0.5 0.5 0.5 0.5 
##$TPOFFS= (0..7)
0 0 0 0 0 0 0 0 
##$TUNHIN= 0
##$TUNHOUT= 0
##$TUNXOUT= 0
##$USERA1= <user>
##$USERA2= <user>
##$USERA3= <user>
##$USERA4= <user>
##$USERA5= <user>
##$V9= 5
##$VALIST= <valist>
##$VCLIST= <CCCCCCCCCCCCCCC>
##$VD= 0
##$VDLIST= <DDDDDDDDDDDDDDD>
##$VPLIST= <PPPPPPPPPPPPPPP>
##$VTLIST= <TTTTTTTTTTTTTTT>
##$WBST= 1024
##$WBSW= 4
##$XGAIN= (0..3)
0 0 0 0 
##$XL= 0
##$YL= 0
##$YMAX_a= 470928
##$YMIN_a= -552344
##$ZGOPTNS= <>
##$ZL1= 120
##$ZL2= 120
##$ZL3= 120
##$ZL4= 120
##$ABSF1= 16.522
##$ABSF2= -4.171173
##$ABSG= 5
##$ABSL= 3
##$ALPHA= 0
##$AQORDER= 0
##$ASSFAC= 0
##$ASSFACI= 0
##$ASSFACX= 0
##$ASSWID= 0
##$AUNMP= <proc_1d>
##$AZFE= 0.1
##$AZFW= 0.1
##$BCFW= 0
##$BC_mod= 0
##$BYTORDP= 0
##$COROFFS= 0
##$CY= 12.5
##$DATMOD= 1
##$DC= 0
##$DFILT= <>
##$DTYPP= 0
##$F1P= 14.0000005364418
##$F2P= -0.99999901652339
##$FCOR= 0.5
##$FTSIZE= 32768
##$FT_mod= 6
##$GAMMA= 0
##$GB= 0
##$INTBC= 1
##$INTSCL= 1
##$ISEN= 128
##$LB= 0.3
##$LEV0= 0
##$LPBIN= 0
##$MAXI= 10000
##$MC2= 0
##$MEAN= 0
##$ME_mod= 0
##$MI= 0
##$NCOEF= 0
##$NC_proc= -5
##$NLEV= 6
##$NOISF1= 0
##$NOISF2= 0
##$NSP= 0
##$NTH_PI= 0
##$NZP= 0
##$OFFSET= 16.522
##$PC= 1
##$PHC0= 139.2913
##$PHC1= 19.61052
##$PH_mod= 1
##$PKNL= yes
##$PPARMOD= 0
##$PSCAL= 4
##$PSIGN= 0
##$REVERSE= no
##$SF= 250.13
##$SI= 32768
##$SIGF1= 0
##$SIGF2= 0
##$SINO= 400
##$SIOLD= 32768
##$SREGLST= <1H.CDCl3>
##$SSB= 0
##$STSI= 32768
##$STSR= 0
##$SW_p= 5175.98343685301
##$SYMM= 0
##$S_DEV= 0
##$TDeff= 65536
##$TDoff= 0
##$TI= <Analysis number 999999
Compound Code 99
Book Reference 9
Project Code 9>
##$TILT= no
##$TM1= 0
##$TM2= 0
##$TOPLEV= 0
##$USERP1= <user>
##$USERP2= <user>
##$USERP3= <user>
##$USERP4= <user>
##$USERP5= <user>
##$WDW= 1
##$XDIM= 32768
##$YMAX_p= 302283252
##$YMIN_p= -681415
$$ End of Bruker specific parameters
$$ ---------------------------------
##NTUPLES= NMR SPECTRUM
##VAR_NAME=  FREQUENCY,     SPECTRUM/REAL,   SPECTRUM/IMAG
##SYMBOL=    X,             R,               I
##VAR_TYPE=  INDEPENDENT,   DEPENDENT,       DEPENDENT
##VAR_FORM=  AFFN,          ASDF,            ASDF
##VAR_DIM=   32768,         32768,           32768
##UNITS=     HZ,            ARBITRARY UNITS, ARBITRARY UNITS
##FACTOR=    0.157963299565203, 1,           1
##FIRST=     4132.6476996994, 0,             0
##LAST=      -1043.33573715361, 0,           0
##MIN=       -1043.33573715361, -681415,     0
##MAX=       4132.6476996994, 302283252,     0
$$ Real data points
##PAGE= N=1
##DATA TABLE= (X++(R..R)), XYDATA
$$ [...]
16274a57992J8505L0885o867m56Q5943n3606M5234P7985L226O6337l9531j10498
$$ -157992 -139487 -108602 -115469 -115925 -29982 -83588 -38354 39631 42857 109194 69663 -40835
16262d0835j11018N9688q3994N0152r688j2030K5494M2551O4625K8499q1855j31227
$$ -40835 -151853 -92165 -176159 -126007 -135695 -147725 -122231 -79680 -15055 13444 -68411 -199638
16250a99638L9568R1286o3969j18540J00645N6617K6863J0494Q5436k2527o2280
$$ -199638 -160070 -68784 -132753 -251293 -150648 -94031 -67168 -56674 28762 6235 -56045
16239e6045j18286q7494J88016n578k9917l8735j9533J6544k4770L988P3193M3776
$$ -56045 -174331 -261825 -73809 -79387 -109304 -148039 -167572 -151028 -175798 -171810 -98617 -54841
16227e4841n3177l8147L1061K6966Q9726o0150k3233K0734M8437o3937L7879J74417
$$ -54841 -108018 -146165 -115104 -88138 1588 -58562 -81795 -61061 -12624 -76561 -38682 135735
16215A35735M8436j46298j43038J451n4889l4492L1489J12647L225N0168k3815
$$ 135735 184171 37873 -105165 -103714 -158603 -193095 -161606 -48959 -45734 4434 -19381
16204a9381k0975R1029q0430m1518J2368J22902l3301j0810j18164r0027J4011
$$ -19381 -40356 50673 -29757 -71275 -58907 63995 30694 19884 -98280 -188307 -174296
16193a74296O8573L2749j1902r0626o9368O2157Q560R0429M0402n333l8718n820
$$ -174296 -105723 -72974 -84876 -175502 -244870 -182713 -174153 -83724 -43322 -48655 -87373 -93193
16181i3193j3871L248N1963m2106Q1353K0353n2171l0167O9280j3266l0438J02405
$$ -93193 -107064 -103816 -51853 -93959 -12606 7747 -44424 -74591 -5311 -18577 -49015 53390
16169E3390J03644j24394j93110o1029P7369K09815R3489r9738j34180r0781J20193
$$ 53390 157034 32640 -160470 -221499 -144130 65685 159174 59436 -74744 -165525 -45332
16158d5332P9573J42806j1969j83310j3409O3277j4017k561n3482j9992n6956
$$ -45332 34241 177047 165078 -18232 -31641 31636 17619 15058 -38424 -58416 -115372
16147a15372j53405l3063Q2118J41881Q9966N2239N9622q4532L0327M2869O5027
$$ -115372 -268777 -301840 -219722 -77841 12125 64364 123986 39454 69781 112650 177677
16136A77677K9127j09076m9086m7401j9606J23981q0726Q124L101n7464P6387
$$ 177677 206804 97728 48642 1241 -18365 105616 24890 33014 36115 -21349 55038
16125E5038K19j8415j05837M2412l8743R2240L6390k9221j1695l6168o4984k5547
$$ 55038 55257 36842 -68995 -26583 -65326 26914 63304 34083 22388 -13780 -78764 -104311
16113a04311N5645N2862p9315l8801n6399Q9375J6664m2880O1329J86290J02468
$$ -104311 -48666 4196 -75119 -113920 -170319 -80944 -64280 -107160 -45831 140459 242927
16102B42927L2070j49183n8356j1103q3197n9462J2471N6746n9505n377J12425
$$ 242927 274997 125814 67458 56355 -26842 -86304 -73833 -17087 -76592 -81969 30456
16091C0456j00679k5223J07468r1070o7156J6662K6542N4175P0897L3321m3871
$$ 30456 -70223 -95446 12022 -79048 -146204 -129542 -103000 -48825 22072 55393 11522
16080A1522J12051M5567j2028J30621l6777j14977o37k8062J40768j5967m8888
$$ 11522 123573 169140 157112 287733 250956 135979 135342 107280 248048 232081 183193
16069A83193l9613n6098O6064K8677j04449K1882J3170K7432n6390J15226J24269
$$ 183193 143580 87482 153546 182223 77774 99656 112826 140258 83868 199094 323363
16058C23363o0340j30949j32266j2126q8486k819K21998Q4990M3724j41710j07904
$$ 323363 263023 132074 -192 -12318 -100804 -103623 118375 203365 247089 105379 -2525
16047b525K4629J10876P7830K9713K1953N3448K72k7484p9164N3987n9715o9366
$$ -2525 22104 132980 210810 240523 262476 315924 316196 288712 209548 263535 203820 134454
16035A34454R4810J9047j31044R4702M8296k396o1316n6878J036j18813M8856
$$ 134454 229264 248311 117267 211969 260265 257869 196553 139675 140711 21898 70754
16024G0754r081K7136L7671j9855o6552J0900k8759P3389n877k1353k7617J7900
$$ 70754 61673 88809 126480 106625 40073 50973 22214 95603 89726 68373 40756 58656
16012E8656l8737l8904R2791Q9562m1832j00200j1069j6321k0772j55314l2583
$$ 58656 19919 -18985 73806 163368 121536 21336 10267 -6054 -26826 -182140 -214723
16001b14723R0793J32337J99879j2185j02750O2168J73282K8135j81639q0543
$$ -214723 -123930 8407 208286 196101 93351 155519 328801 356936 175297 94754
15991I4754M1276O9394K9631m5826K6535Q7103l1995j39968l5335P2019R1606
$$ 94754 136030 205424 235055 189229 215764 302867 270872 130904 95569 167588 259194
15980B59194j21595j56015J4288k6829j960P9941J05303L4598j06101j04445R9273
$$ 259194 137599 -18416 -4128 -30957 -32917 47024 152327 186925 80824 -23621 75652
15969G5652M6756M7718k6834J25249R6850j5878n2145j34858N3860Q2324l7114
$$ 75652 122408 170126 143292 268541 365391 349513 297368 162510 216370 298694 261580
15958B61580q1449j09148O5048k9038l7415J3107j9756P2198O5799j32599l3823
$$ 261580 180131 70983 136031 106993 69578 82685 62929 135127 200926 68327 34504
15947C4504J11517M8987o6868j09064J3801O9328Q854J23046M4861l1549j53556
$$ 34504 146021 195008 128140 19076 32877 102205 111059 234105 278966 247417 93861
15936I3861r908p3759J12071M383k0983P7572Q8730M4266l9914m177j18193j74565
$$ 93861 83953 10194 122265 126648 105665 183237 271967 316233 276319 272142 153949 -20616
15924b0616J04475J5411J72830R981l4593P3787L0970j9496N7681k9965j45954
$$ -20616 83859 99270 272100 282081 247488 321275 352245 332749 390430 360465 214511
15913B14511l3480l6768Q142L1512P7129k3375j49177j5692N3610J38146Q3899
$$ 214511 181031 144263 152405 183917 261046 237671 88494 72802 126412 264558 348457
15902C48457r3857J3469q439j474K5692o144j9880P6492L6560L4422O8929p2965
$$ 348457 254600 268069 259630 258156 283848 277704 257824 334316 370876 405298 474227 401262
15890D01262j13451J3176m6829l8635M1456j3719L4057Q1766O9500m1802j8843
$$ 401262 287811 300987 254158 215523 256979 243260 277317 359083 428583 386781 367938
15879C67938L5898q3741q2513j25277M1640R2436q8176k3705R9692N4929L7345
$$ 367938 403836 320095 237582 112305 153945 246381 158205 134500 234192 289121 326466
15868C26466J1909j88405K0838j2893j2910P0876J9182J387n2950r738J00077
$$ 326466 338375 149970 170808 157915 145005 215881 235063 236450 183500 173762 273839
15857B73839K0342n4617j7816Q867j5356R7676O6140o442k4683o9695q9812Q8109
$$ 273839 294181 239564 221748 230615 215259 312935 379075 372633 347950 278255 188443 276552
15845B76552K0902Q150M2863j11810n6220l0455J00524P000n456l5043m4615L3631
$$ 276552 297454 305604 348467 236657 180437 149982 250506 257506 252050 217007 172392 206023
15833B06023K4357O1542Q1520J14991Q2244l5355p6660j21069O8019O7171J03507
$$ 206023 230380 291922 373442 488433 570677 535322 458662 337593 405612 472783 576290
15822E76290k1102j11031k989J43027J74333q618r7513J2088Q7245R0471k3633
$$ 576290 555188 444157 441168 584195 758528 749910 652397 664485 751730 842201 818568
15811H18568p311R0798R0068k5002J49270Q4310n4808j04969M9908j19003j49434
$$ 818568 811257 902055 992123 967121 1116391 1200701 1145893 1040924 1090832 971829 822395
15800H22395n1167R046n3299j3129o013p4635m1559m4341J1478n6401p2710K32574
$$ 822395 771228 780274 726975 713846 707833 633198 591639 547298 558776 502375 429665 662239
15788F62239J04706j2957k3755M3043o4163p2639J3043L7191M0259J8565l2710
$$ 662239 766945 753988 730233 773276 709113 636474 649517 686708 726967 745532 712822
15777G12822j2784q4740o1366M9356O6102P4839M8829l648j21770m1704M2051
$$ 712822 700038 615298 553932 603288 669390 744229 793058 789410 667640 625936 667987
15766F67987J36262J16522j51097j59895Q3022P2518k1453k3011K8205J57478
$$ 667987 804249 920771 769674 609779 692801 765319 743866 720855 749060 906538
15756I06538N555n372J3807o7429j1778n680O8853J70640m9383j42965j8897k2221
$$ 906538 912093 906721 920528 853099 841321 835641 904494 1075134 1025751 882786 863889 841668
15744H41668j00947j9159P7207j8104M6727Q1831R7353J6492l8766k1302N6789
$$ 841668 740721 721562 798769 780665 827392 909223 1006576 1023068 984302 963000 1019789
15733A019789m3300o8116P0472j8128M8723K4170p4772Q501O1986J74691P1199
$$ 1019789 976489 908373 978845 960717 1009440 1033610 958838 967339 1029325 1204016 1275215
15722A275215r1100k9546J33751Q8952j5470R309l8564l528L2231q727K0923p7339
$$ 1275215 1184115 1154569 1288320 1377272 1361802 1371111 1332547 1329019 1361250 1352523 1373446 1296107
15710A296107p2567M7771L3259O230j28296l5163l9377P4489J770p0010J95937
$$ 1296107 1223540 1271311 1304570 1310800 1182504 1147341 1107964 1182453 1184223 1114213 1310150
15699A310150J77853p626n5505j77649l2799Q0051M2938K01054J4669N4663R2
$$ 1310150 1488003 1480377 1424872 1247223 1214424 1294475 1337413 1538467 1553136 1607799 1607891
15688A607891J2372O42j31082O5749K04391Q245j67243m0665J24753M7621J7872
$$ 1607891 1620263 1620905 1489823 1555572 1759963 1768208 1600965 1560300 1685053 1732674 1750546
15677A750546n8339O2119Q9163J283j5347O5382R5233k354k4104J43643M4898
$$ 1750546 1692207 1754326 1843489 1844772 1829425 1894807 1990040 1987686 1963582 2107225 2152123
15666B152123N4657m9503N484p0375l0608J7809L2218l6517N3027J42532M1839
$$ 2152123 2206780 2157277 2162761 2092386 2061778 2079587 2111805 2075288 2128315 2270847 2312686
15655B312686J27115O4365l3198j820Q181N4930j4417q7159P5164P2773O174J27157
$$ 2312686 2439801 2504166 2470968 2469148 2477329 2532259 2517842 2430683 2505847 2578620 2584794 2711951
15643B711951k2447k2250M5426Q4505J04096L43J19742J1386M3040Q7778J48768
$$ 2711951 2689504 2667254 2712680 2797185 2901281 2901624 3021366 3032752 3075792 3163570 3312338
15632C312338J21637j1304p8341J1203k9903n334J52392J39284P2255J10920M5195
$$ 3312338 3433975 3422671 3344330 3355533 3325630 3320296 3472688 3611972 3684227 3795147 3840342
15621C840342k1689l8870L7704J56068N2734k4505N9328J40979J83632J09873
$$ 3840342 3818653 3779783 3817487 3973555 4026289 4001784 4061112 4202091 4385723 4495596
15611D495596J69461J37880k3058o4794J3527L3040R1807J72196J56707J72882
$$ 4495596 4665057 4802937 4779879 4715085 4728612 4761652 4853459 5025655 5182362 5355244
15601E355244J33486J02247J66828J01802R5672m447P2689J59173J10103J15301
$$ 5355244 5488730 5590977 5757805 5859607 5955279 5950832 6023521 6182694 6292797 6408098
15591F408098J46436K01691J96069K66370R8974k780L1906o289J72094J91456
$$ 6408098 6554534 6756225 6952294 7218664 7317638 7314858 7346764 7340475 7512569 7704025
15581G704025J55332K57513K22776J33774K16135K46813J95629J98503J64121
$$ 7704025 7859357 8116870 8339646 8473420 8689555 8936368 9131997 9330500 9494621
15572I494621J42540L73392L53650L12574K26031K47560L93732L08836L51581
$$ 9494621 9637161 10010553 10364203 10676777 10902808 11150368 11544100 11852936 12204517
15563A2204517K55487L14501L26871L14381K47334M19867M65961M51576M31220
$$ 12204517 12460004 12774505 13101376 13415757 13663091 14082958 14548919 15000495 15431715
15554A5431715L66120M52684M14904N10549N10692N13770N44967O76170N27091
$$ 15431715 15797835 16250519 16665423 17175972 17686664 18200434 18745401 19421571 19948662
15545A9948662N63211O20058P53063O05400P22118O88314Q81233Q38287Q14192
$$ 19948662 20511873 21131931 21884994 22490394 23212512 23900826 24782059 25620346 26434538
15536B6434538Q55133R09506Q74766Q60204J051759R41598J010546J114169J151776
$$ 26434538 27289671 28199177 29073943 29934147 30985906 31927504 32938050 34052219 35203995
15527C5203995J034417J082498J028489J111806J300361J073194J023108J148558
$$ 35203995 36238412 37320910 38349399 39461205 40761566 41834760 42857868 44006426
15519D4006426J176742J140139J071285J182406J200473J002820Q08134Q34308
$$ 44006426 45183168 46323307 47394592 48576998 49777471 50780291 51588425 52422733
15511E2422733Q06236R54603P54837O42474N54157L94032K58841K79266M1694
$$ 52422733 53228969 54183572 54938409 55580883 56135040 56529072 56787913 57067179 57108873
15502E7108873j04456j33009j97406j85458k28814m44439o65416n98133o28003
$$ 57108873 57004417 56871408 56674002 56488544 56259730 55815291 55149875 54551742 53923739
15493E3923739o62347o03091p97011r24361q75995q79407q77655r27355j018357
$$ 53923739 53261392 52658301 51861290 50936929 50060934 49181527 48303872 47376517 46358160
15484D6358160j051339r69298q29407q95536p70093p82248r92410r19005q96823
$$ 46358160 45306821 44337523 43508116 42612580 41842487 41060239 40067829 39148824 38252001
15475C8252001r54072q91145r48141q04248q03527q10152p58467p38301q00259
$$ 38252001 37297929 36406784 35458643 34654395 33850868 33040716 32282249 31543948 30743689
15466C0743689p78331o70046n07733o50614o57058n69474o78187o44395n26238
$$ 30743689 29965358 29295312 28787579 28136965 27479907 26910433 26232246 25587851 25061613
15457B5061613m33901m55996n63802n63513m92153n31694n68874l92525l69696
$$ 25061613 24627712 24171716 23607914 23044401 22552248 22020554 21451680 21059155 20689459
15448B0689459n02200m32385l06056l92969m69166k85032k63175l77500m56001
$$ 20689459 20187259 19754874 19448818 19055849 18586683 18301651 18038476 17660976 17204975
15439A7204975l82610m04151l50940l56989m03439l22538k40763l39136k81298
$$ 17204975 16822365 16418214 16067274 15710285 15306846 14984308 14743545 14404409 14123111
15430A4123111j89993l24118l21658k22359k99793j68210k64968k99807j81860
$$ 14123111 13933118 13609000 13287342 13064983 12765190 12596980 12332012 12032205 11850345
15421A1850345j65297k13678l21924k51855k58929j65232j17803j04981j59831
$$ 11850345 11685048 11471370 11149446 10897591 10638662 10473430 10355627 10250646 10090815
15412A0090815j95956j65454k43431j75339j19542j42343k24676k46871j34863
$$ 10090815 9894859 9729405 9485974 9310635 9191093 9048750 8824074 8577203 8442340
15403H442340j90348j80799j17807r2270j60770q9338p1433n4600p2093n4082
$$ 8442340 8251992 8071193 7953386 7861116 7700346 7611008 7539575 7484975 7412882 7358800
15393G358800N035o9165k95876j87194k89167j44703j84946r2840N5573n3097
$$ 7358800 7363835 7294670 6998794 6811600 6522433 6377730 6192784 6099944 6155517 6102420
15383F102420j93726j64904o8145j57008j42879R339R668j66474j02068m8342
$$ 6102420 5908694 5743790 5675645 5518637 5375758 5385097 5394765 5228291 5126223 5077881
15373E077881p0953m640q7328j04207j47579m3512n4414q8943j68641L0898l5387
$$ 5077881 5006928 5002288 4914960 4810753 4663174 4619662 4565248 4476305 4307664 4338562 4303175
15362D303175n2959j52248n7578p4373k5152k4680O321J9201j22248K0043j02388
$$ 4303175 4250216 4097968 4040390 3966017 3940865 3916185 3922506 3941707 3819459 3839502 3737114
15351C737114j03332O4169L1460o1799j07115r9521j1008q5253p0908o7836k519
$$ 3737114 3633782 3697951 3729411 3667612 3560497 3460976 3449968 3364715 3293807 3225971 3223452
15340C223452o2169j15410k852K4814j3791j27307p2899l6745q6790n6904M1804
$$ 3223452 3161283 3045873 3043021 3067835 3054044 2926737 2853838 2817093 2730303 2673399 2715203
15329B715203R3571o9847j34495n9669M4704j40606o4599K8865N0684O2945L5496
$$ 2715203 2808774 2738927 2604432 2544763 2589467 2448861 2384262 2413127 2463811 2526756 2562252
15318B562252j30668k33264L3727j4228p4829p3536r6543l2701l8665q9453J9982
$$ 2562252 2431584 2198320 2232047 2217819 2142990 2069454 1972911 1940210 1901545 1812092 1832074
15307A832074L7904O022l901j2418n6646j1655k2880J7634o70n2687j28777M7364
$$ 1832074 1869978 1876000 1872099 1859681 1803035 1791380 1768500 1786134 1785464 1732777 1604000 1651364
15295A651364j4635j7280n4822Q6131l1512r6241k1655k7117L0969N4300n2530
$$ 1651364 1636729 1619449 1564627 1650758 1619246 1523005 1501350 1474233 1505202 1559502 1506972
15284A506972m413L1027N2027r6422j48946L4124l6379R238M6979Q503k5898j20406
$$ 1506972 1502559 1533586 1585613 1489191 1340245 1374369 1337990 1347228 1394207 1402710 1376812 1256406
15272A256406m9057N2331n6937p7053j8349m4765l5069j8605Q6240P6514N3318
$$ 1256406 1207349 1259680 1202743 1125690 1107341 1062576 1027507 1008902 1095142 1171656 1224974
15261A224974k7278l4919K0736o1443o7424M5217N4846J05905j443k2529j08777
$$ 1224974 1197696 1162777 1183513 1122070 1054646 1099863 1154709 1260614 1259171 1236642 1127865
15250A127865m316k23137j39950N5238J6228m0637l9765P7974l3158Q2560M7935
$$ 1127865 1123549 900412 760462 815700 831928 791291 751526 829500 796342 878902 926837
15239I26837p3870l0214R2281q724K1719j6047j525p1424M3394O5738q5200j4992
$$ 926837 852967 822753 915034 906310 928029 911982 910457 839033 882427 948165 862965 847973
15227H47973m9688K724q439j45646j52386k5127J08472J35860O6498j5948k9308
$$ 847973 798285 801009 792570 646924 494538 469411 577883 713743 780241 764293 734985
15216G34985o903p176L8327J8773M1536J38819R0434N4860K0148J9601Q0883P2457
$$ 734985 728082 720906 759233 778006 819542 958361 1048795 1103655 1123803 1143404 1224287 1296744
15204A296744K9609r6152k39629K1475J519o2519m5919l7954o2570o6695q3508
$$ 1296744 1326353 1230201 990572 1012047 1013566 951047 905128 867174 804604 737909 654401
15193F54401j5894r3820j30625p503O8318J48325l1210Q3238o4908o2748j07291
$$ 654401 638507 544687 414062 406559 474877 623202 591992 675230 610322 547574 440283
15182D40283m6719J0035J61690N4846l8005m1365J083q8515j32644k0056J90416
$$ 440283 393564 403599 565289 620135 582130 540765 541848 453333 320689 300633 491049
15171D91049O9220o2938K6629n9593p8085J65927J37028j2473q9798j58634j35508
$$ 491049 560269 497331 523960 464367 386282 552209 689237 676764 586966 428332 292824
15160B92824m6054K5963O0623q9501m3578K3563P6889K8304l0485o6702N0820
$$ 292824 246770 272733 333356 243855 200277 223840 300729 329033 298548 231846 282666
15149B82666M6990N1682p2200N1995J0527J2370j4126R3000M7969k563n054m471
$$ 282666 329656 381338 309138 361133 371660 384030 369904 462904 510873 508310 503256 498785
15137D98785j23471j1081L0552r1909k7698j06099K9325O9844M2375K9001L6052
$$ 498785 375314 364233 394785 302876 275178 169079 198404 268248 310623 339624 375676
15126C75676o180q5630p2694P920L7014N8073m8144r1688J0000l2829j16228K469
$$ 375676 369496 283866 211172 219092 256106 314179 266035 174347 184347 151518 35290 37759
15114C7759O3461j9082R7012J22048Q9753J3710q0417k6291P846P2523p5372q0881
$$ 37759 101220 82138 179150 301198 390951 404661 324244 297953 305799 378322 302950 222069
15102B22069k4155l0475o1841J25141k3801l0074j23718O6449R8770j17436k9708
$$ 222069 197914 167439 105598 230739 206938 176864 53146 119595 218365 100929 71221
15091G1221P3340L1347O3569n9660m9398K9347N6999p9011O953R7233n992M1311
$$ 71221 144561 175908 239477 179817 130419 159766 216765 137754 144707 241940 235948 277259
15079B77259P5871j20190l0628L9526j3787j09831M8844J0752p637O4578o8932
$$ 277259 353130 232940 202312 241838 228051 118220 167064 177816 170179 234757 165825
15068A65825o0896m7304r2418P2347J00090l0830j38321j2962J05390M6489J1543
$$ 165825 104929 57625 -34793 37554 137644 106814 -31507 -44469 60921 107410 118953
15057A18953N7304O4211Q935j02597Q6730J086p7736J74536N0099o9028L4507
$$ 118953 176257 240468 249403 146806 233536 234622 156886 331422 381521 312493 347000
15046C47000r6998j08186M7600K5519k2413q0594o3675M7374m7555m0328J15982
$$ 347000 250002 141816 189416 214935 192522 111928 48253 95627 48072 7744 123726
15035A23726k7470q4297L8835M0635k7364J2655l3834R8632J0397K0677L7219
$$ 123726 96256 11959 50794 91429 64065 76720 42886 141518 151915 172592 209811
15024B09811J0554n5482o1631K5779P830N1509K3414k7004o6905k7559n0768O754
$$ 209811 220365 164883 103252 129031 136861 188370 211784 184780 117875 90316 39548 46302
15012D6302N5531R037Q1654R513o3830m7731P8966R3773l6256j6303L0096q9892
$$ 46302 101833 110870 192524 202037 138207 90476 169442 263215 226959 210656 240752 150860
15000A50860r1387K630J00208m3876m3683m433K5623J22911l7866m4209j37491
$$ 150860 59473 62103 162311 118435 74752 70319 95942 218853 180987 136778 -713
14989g13l9346N7070N0882J1037M5226K079j54769k8233l9168L4332P6686O0792
$$ -713 -40059 17011 67893 78930 124156 126235 -28534 -56767 -95935 -61603 15083 75875
14977G5875l9102L8968J31482J27749Q8208j10703j30556r3890q0793K5209j205
$$ 75875 36773 75741 207223 334972 423180 312477 181921 88031 7238 32447 31242
14966C1242O4903N3984o0702q3930J3691k081n3575R622L6237n3038p8285k3702
$$ 31242 96145 150129 89427 5497 19188 17107 -36468 -26846 9391 -43647 -121932 -145634
14954a45634r2574K9067J41154J67717O0215j8675j36791l8142J38779Q1491j01646
$$ -145634 -238208 -209141 -67987 99730 159945 141270 4479 -33663 105116 186607 84961
14943H4961P1360P2341n7712j00994R1146Q6563l8960q2164O2611N3486j05373
$$ 84961 156321 228662 170950 69956 161102 247665 208705 126541 189152 242638 137265
14932A37265r5566L528p081K5334j81636j11152M9429J3289J30266k2647r3381
$$ 137265 41699 45227 38146 63480 -118156 -229308 -179879 -166590 -36324 -58971 -152352
14921a52352R1083L1599l6760K6590K4804M4741q5024l4555P4628O067J6666N7184
$$ -152352 -61269 -29670 -66430 -39840 -15036 29705 -55319 -89874 -15246 -9179 7487 64671
14909F4671J9748N0188j42933j7737R8327l1540n1486l2548l0008j4230m8570
$$ 64671 84419 134607 -8326 -26063 72264 40724 -10762 -43310 -73318 -87548 -136118
14898a36118O7719J44642J4383l3562k06114j25572J07751O2564O0745q5k9755
$$ -136118 -68399 76243 90626 57064 -149050 -274622 -166871 -104307 -43562 -43647 -73402
14887g3402K7109r3289Q491N2138M5334R58l5693l2774j10504k7346K21653J53093
$$ -73402 -46293 -139582 -131091 -78953 -33619 -32661 -68354 -101128 -211632 -238978 -17325 135768
14875A35768n6468K5686k5972k5599o4663o0926P0099O0989j40852L1204P4571
$$ 135768 79300 104986 79014 53415 -11248 -72174 -2075 58914 -81938 -50734 23837
14864B3837j04438N128m897l1499O8709n5276K7262K0064n6925K6146M218M9880
$$ 23837 -80601 -75473 -80370 -111869 -43160 -98436 -71174 -51110 -108035 -81889 -77671 -27791
14852b7791J4381k5378k5370r6641j0162M4862l3351m8003L9700J8993M9443L4059
$$ -27791 -13410 -38788 -64158 -160799 -170961 -126099 -159450 -207453 -167753 -148760 -99317 -65258
14840f5258m125q0986n508J31978j7200n0316l728p2194K3329L8275J09748J41951
$$ -65258 -69383 -150369 -155877 -23899 -41099 -91415 -95143 -167337 -144008 -105733 4015 145966
14828A45966M380j4417R814L5716o7194j05101O4221l8440r9795R0921n627N148
$$ 145966 150346 135929 145743 181459 114265 9164 73385 34945 -64850 26071 20444 25592
14816B5592q5019m0750O3249L1602L5334L7202k2491p9500m646l3730M7687J3750
$$ 25592 -59427 -100177 -36928 -5326 30008 67210 44719 -34781 -39427 -73157 -25470 -11720
14804a1720r0843n9097P3397j8159L8915l6651Q7688J16742j6846m3319o1963
$$ -11720 -102563 -161660 -88263 -106422 -67507 -104158 -16470 100272 83426 40107 -21856
14793b1856q4552L7332K6831P8928M519o1902j4254M376J3696P8705l933o664
$$ -21856 -106408 -69076 -42245 36683 41202 -20700 -34954 -30578 -16882 61823 57890 51226
14781E1226J6450j9276o5693m2533p1310L8299P8388M6261l6359n5475j24709
$$ 51226 67676 48400 -17293 -59826 -131136 -92837 -14449 31812 -4547 -60022 -184731
14770a84731l8054O8409j5421m5933P5357Q1849o4998j2252L8072O2590L6211
$$ -184731 -222785 -154376 -169797 -215730 -140373 -58524 -123522 -135774 -97702 -35112 1099
14759A099j65514j4166J20687Q276M2737O3966j09684j16034l6437q146P0501
$$ 1099 -164415 -178581 -57894 -49618 -6881 57085 -52599 -168633 -205070 -213216 -142715
14748a42715R0074j8240O574j88870K7311J73368K3660j2051j5268M9010M9569
$$ -142715 -52641 -70881 -64307 -253177 -225866 -52498 -28838 -40889 -56157 -7147 42422
14737D2422k1653j16296J947N3469O551J4415J9594P7077o5240n3713j3462O0993
$$ 42422 20769 -95527 -93580 -40111 -33560 -19145 449 77526 12286 -41427 -54889 6104
14725F104K6355K9814j0044l107O6863P9875N8504l1403j94346Q281K7587L673
$$ 6104 32459 62273 52229 49122 115985 195860 254364 222961 28615 36896 64483 68156
14713F8156O9296K999q1978J60524k4394Q290K26372L0587j7628J08310q6492
$$ 68156 137452 140451 58473 218997 194603 202893 429265 459852 442224 550534 464042
14702D64042n5248J5333Q6290K0216J08045N6164L9112J46603J61988O8026l5537
$$ 464042 408794 424127 510417 530633 638678 694842 733954 880557 1042545 1110571 1075034
14691A075034N8472j39897j19917j5014j64753k4360J8451o8246m1769J8238m5095
$$ 1075034 1133506 993609 873692 858678 693925 669565 688016 619770 578001 596239 551144
14680E51144j9197L3940j2442j20599L2733j8489L8746L1654m4042q4356K5686
$$ 551144 531947 565887 553445 432846 465579 447090 485836 517490 473448 389092 414778
14669D14778J03818p1370p8830p144J6764J7380O7090k987Q386j30094p6081J14971
$$ 414778 518596 447226 368396 361252 378016 395396 462486 459499 467885 337791 261710 376681
14657C76681l5421L7746K5361J5274R1956O8341M1266J49880O6700R2821P0569
$$ 376681 341260 379006 404367 419641 511597 579938 621204 771084 837784 930605 1001174
14646A001174j01608J3884j03770r064Q4726q39r7260j14955M8701m6160L2209
$$ 1001174 899566 913450 809680 800616 885342 884503 787243 672288 720989 674829 707038
14635G07038m2681j09005q6729L9586J5724k9084n9885q1495k4565L1102j56470
$$ 707038 664357 555352 468623 508209 523933 494849 434964 353469 328904 360006 203536
14624B03536k11943j67878J04032M7111K788P8507M1919m0448M8722n0494J6859
$$ 203536 -8407 -176285 -72253 -25142 -22354 56153 98072 57624 106346 55852 72711
14613G2711j0394k2400K7948J38495Q9336j21871k9183L9691p450k6839L9783
$$ 72711 62317 39917 67865 206360 295696 173825 144642 184333 176883 150044 189827
14602A89827r3031p1657J9927l8180j17488n8632Q5968J74058k3740o9276O6514
$$ 189827 96796 25139 45066 6886 -110602 -169234 -83266 90792 67052 -2224 64290
14591F4290o1518j05405M1571P7874j126p9481J0029N3371j7188r2305p1754J2679
$$ 64290 2772 -102633 -61062 16812 15686 -63795 -53766 -395 -17583 -109888 -181642 -168963
14579a68963N7323P4200M0018N5644M3436J4499r3127o3862r159n9283l6333J06013
$$ -168963 -111640 -37440 2578 58222 101658 116157 23030 -40832 -49991 -109274 -145607 -39594
14567c9594N713N6158l9334L7768r7912j20252K3766K9994j7403j41262J5419
$$ -39594 -33881 22277 -17057 20711 -77201 -197453 -173687 -143693 -161096 -302358 -286939
14556b86939J30198J06507L6881j13389n8516J14012M5294r5238k4969K5364p3948
$$ -286939 -156741 -50234 -13353 -126742 -185258 -71246 -25952 -121190 -146159 -120795 -194743
14545a94743j50825n600J20564O9381j696J62723R4780j15970j8685J15137j5363
$$ -194743 -345568 -351168 -230604 -161223 -162919 -196 94584 -21386 -40071 75066 59703
14534E9703n1052M1804q0084j04038m0588P5710J92172n8824k0244q3606l592
$$ 59703 8651 50455 -29629 -133667 -174255 -98545 93627 34803 14559 -69047 -72639
14523g2639n1534l9436M4715Q6909l5989p1627k0857J8429J6492o186J31383L5353
$$ -72639 -124173 -163609 -118894 -31985 -67974 -139601 -160458 -142029 -125537 -131723 -340 35013
14511C5013m395q6711j04651m2226M852o726r1329o836r172J01623P9099J02903
$$ 35013 30618 -56093 -160744 -202970 -198118 -204844 -296173 -303009 -312181 -210558 -131459 -28556
14499b8556O3782j19255m6485n8660o0632j3853o9844j9293O5756Q7646K5788
$$ -28556 35226 -84029 -130514 -189174 -249806 -263659 -333503 -352796 -287040 -199394 -173606
14488a73606L2452L8294L5351M9922K4676J666o0897r932O650m7854O0153M9066
$$ -173606 -141154 -102860 -67509 -17587 7089 8755 -52142 -62074 -55424 -103278 -43125 5941
14476E941m7724J2002J89068R485j74932p4042L9675n5366n2404M8220j0872J6105
$$ 5941 -41783 -29781 159287 168772 -6160 -80202 -40527 -95893 -148297 -100077 -110949 -94844
14464i4844P2540L1688j3128j28886M1534J41821j5266J9700j52044N09O2330
$$ -94844 -22304 9384 -3744 -132630 -91096 50725 35459 55159 -96885 -96376 -34046
14453c4046k1047M998j10344Q649n1504O7219J19657L9358l3677p5316j54042
$$ -34046 -55093 -50095 -160439 -151790 -203294 -136075 -16418 22940 -10737 -86053 -240095
14442b40095q9614j5071J21501K3307J29839K164j34975l012n5495J026R731L6221
$$ -240095 -329709 -344780 -223279 -199972 -70133 -67969 -202944 -205956 -261451 -260425 -250694 -214473
14430b14473N106K482P3791K5197n9111m2026n8955R3213N9378K2971J9853j4369
$$ -214473 -209367 -206885 -133094 -107897 -167008 -209034 -267989 -174776 -115398 -92427 -72574 -86943
14418h6943k4149p158m7182q1893m7058Q0544n4329j79745N996J27574J33145
$$ -86943 -111092 -118250 -165432 -247325 -294383 -213839 -268168 -447913 -441917 -314343 -181198
14407a81198l5675L0004R9741L7037N2090j3597j42582l718J19731K1693K4516
$$ -181198 -216873 -186869 -87128 -50091 1999 -11598 -154180 -157898 -38167 -16474 8042
14396H042q4793J4164Q0264j25022j2485K6751j1437J02509J21580j09201j44571
$$ 8042 -76751 -62587 17677 -107345 -119830 -93079 -104516 -2007 119573 10372 -134199
14385a34199n919L972K7731N6375K8880j12431l3809J5561o8372J09011n6014
$$ -134199 -140118 -136146 -108415 -52040 -23160 -135591 -169400 -153839 -222211 -113200 -169214
14374a69214M4614k6924o6404q1474J02532o9544k9051M1174R0572P5709l223
$$ -169214 -124600 -151524 -217928 -299402 -196870 -266414 -295465 -254291 -163719 -88010 -91233
14363i1233k1400p5319J07359o6019j62454r6354J87424Q689J4925J04125J07785
$$ -91233 -112633 -187952 -80593 -146612 -309066 -405420 -217996 -209307 -194382 -90257 17528
14352A7528l6455p0845J05030R6763l4393j5502O030l1527j94179m7556p3025
$$ 17528 -18927 -89772 15258 112021 77628 62126 68156 36629 -157550 -205106 -278131
14341b78131L5688K914m0115Q823O9701O5520n9072K7043P4389K2731P3337O5089
$$ -278131 -242443 -239529 -279644 -270821 -201120 -135600 -194672 -167629 -93240 -70509 2828 67917
14329F7917j82104r7403L4488o3340k6548J52814J75643M8386m0643P5369k7064
$$ 67917 -114187 -211590 -177102 -240442 -266990 -114176 61467 109853 69210 144579 117515
14318A17515j46468R075J10203p4645k1195j6953M980l1948J48663r9505j42041
$$ 117515 -28953 -19878 90325 15680 -5515 -22468 -17488 -49436 99227 -278 -142319
14307a42319K020j4730l4894n2466L4153N8369R6410k0056j3736N5023K5293j10461
$$ -142319 -140299 -155029 -189923 -242389 -208236 -149867 -53457 -73513 -87249 -32226 -6933 -117394
14295a17394k6722m3762l2879L848J37393M448l4330l2513Q370L4378n3087o765
$$ -117394 -144116 -187878 -220757 -216909 -79516 -75068 -109398 -141911 -133541 -99163 -152250 -159015
14283a59015K3422m0370o0289O5351Q8740O5877j20513m199p8706o0125J51910
$$ -159015 -135593 -175963 -236252 -170901 -82161 -16284 -136797 -140996 -219702 -279827 -127917
14272a27917K5694J5795o774q8303m2436k3634P8170M2532k8726M7194n5713l5923
$$ -127917 -102223 -86428 -93202 -181505 -223941 -247575 -169405 -126873 -155599 -108405 -164118 -200041
14260b00041K9414j48658j18946m0226M1611N6436J4241L1912J43567J39040L9888
$$ -200041 -170627 -319285 -438231 -478457 -436846 -380410 -366169 -334257 -190690 -51650 -11762
14249a1762J9943l7579r6307N7672P5240K3740N5603j653k1022m7614l9048n6483
$$ -11762 8181 -29398 -125705 -68033 7207 30947 86550 84897 63875 16261 -22787 -79270
14237g9270J05298P8172n1322R686l5800K574j31849j17717m5038K7984K78K2230
$$ -79270 26028 104200 52878 62564 26764 29338 -102511 -220228 -265266 -237282 -237004 -214774
14225b14774l8890n0609m6058J28690M7690R620K05703l3670m2022j6803l1660
$$ -214774 -253664 -304273 -350331 -221641 -173951 -164331 41372 7702 -34320 -51123 -82783
14214h2783J4331l4201r6035J8156J51542k0355r9931k4504q0806N3527O6028
$$ -82783 -68452 -102653 -198688 -180532 -28990 -49345 -149276 -173780 -254586 -201059 -135031
14203a35031J22862K9351J45866J08619j60231j91009Q9840P9869J02791R8886
$$ -135031 -12169 17182 163048 271667 111436 -79573 10267 90136 192927 291813
14193B91813J14716K8488m872N0155k23897m4470K9159M8194k2489j36610j62039
$$ 291813 406529 435017 430145 480300 256403 211933 241092 289286 266797 130187 -31852
14182c1852p8054o3866N832J69285p959j04363j05914P2256M0178r1771J7706
$$ -31852 -109906 -173772 -167940 1345 -6614 -110977 -216891 -144635 -104457 -196228 -178522
14171a78522M4052p5248N0413O1149o6519p9436J04456J57184j46014l2983J30051
$$ -178522 -134470 -209718 -159305 -98156 -164675 -244111 -139655 17529 -128485 -161468 -31417
14160c1417K5317k1321j08307n8508o3246L8116J54373p9396j17252m7334O8158
$$ -31417 -6100 -27421 -135728 -194236 -257482 -219366 -64993 -144389 -261641 -308975 -240817
14149b40817L2840J00557R9740P6208P4307L7929R4584L8093J24323K95801J85567
$$ -240817 -207977 -107420 -7680 68528 142835 180764 275348 313441 437764 733565 919132
14138I19132J16490j52112j49466M9885j45792k85716j46328K0757j71604j7870
$$ 919132 1035622 883510 734044 783929 638137 352421 206093 226850 55246 37376
14128C7376J32175K0981Q9100K8936j69869l9272O274O5049q0286q4911j8575
$$ 37376 169551 190532 279632 308568 138699 99427 105701 170750 90464 5553 -13022
14117a3022q9155r0651k499P333j10677K1242R2785J33017l508j1573n8386J7217
$$ -13022 -102177 -192828 -195327 -187994 -298671 -277429 -184644 -51627 -55135 -66708 -125094 -107877
14105a07877J68220M1574m8782J9419J13701q7645q2485N358K6456M1597k8862
$$ -107877 60343 101917 53135 72554 186255 98610 16125 21483 47939 89536 60674
14094F0674j20574Q377J00957J11024P8907N0995K3839K3469k3794Q3743J97620
$$ 60674 -59900 -51523 49434 160458 239365 290360 314199 337668 313874 397617 595237
14083E95237J30939j50620k01316j66859j26142l5287o9535r8989J27829J06377
$$ 595237 726176 575556 374240 207381 81239 45952 -23583 -122572 5257 111634
14073A11634o762m8188M8957K3277J9275p3865p9098J1718n6026j26093j43764
$$ 111634 104872 56684 105641 128918 148193 74328 -4770 6948 -49078 -175171 -318935
14062c18935R0171J84375J16810k8741K9421M5362m6011j5660Q4525o7250j84583
$$ -318935 -228764 -44389 72421 43680 73101 118463 72452 56792 141317 74067 -110516
14051a10516k2954R9635L787J6840R730l6606M2998k8564j15369J20307L8610
$$ -110516 -133470 -33835 -30048 -13208 -3478 -40084 2914 -25650 -141019 -20712 17898
14040A7898n9123r4744R318k4094o0804M3305J49388M7922P722m5215K857L4448
$$ 17898 -41225 -135969 -126651 -150745 -211549 -168244 -18856 29066 36788 -8427 -5570 28878
14028B8878j14944j30375p8677J01921Q6137o4120n2206n0842M3430J73524K1026
$$ 28878 -86066 -216441 -295118 -193197 -107060 -171180 -223386 -274228 -230798 -57274 -36248
14017c6248m2376m9032n890O522L7330L8274L0019K6028O7470M261K0774L3465
$$ -36248 -78624 -127656 -133546 -127024 -89694 -51420 -21401 4627 72097 76358 97132 130597
14005A30597r6281o9362M6452j19475n1554R7684M325l60J00055m3334q3455q2560
$$ 130597 34316 -35046 11406 -108069 -159623 -61939 -57614 -57974 42081 -1253 -84708 -167268
13993a67268J01734j5312r6300J4349L8339m9867m7905q4800l9357P4276O5696
$$ -167268 -65534 -80846 -177146 -162797 -124458 -174325 -222230 -307030 -346387 -272111 -206415
13982b06415k9657l5016O3145K7142J00379l2139m6308j52000L543L6695J7619
$$ -206415 -236072 -271088 -207943 -180801 -80422 -112561 -158869 -310869 -307326 -270631 -253012
13971b53012n3684R445L4999Q8027M8196L2218O660N9007L2566K9428Q3184K2284
$$ -253012 -306696 -297251 -262252 -174225 -126029 -93811 -87151 -28144 4422 33850 117034 139318
13959A39318l9117j3168j06454l8349R9553Q1073k7756j51764o9262K6415P4092
$$ 139318 100201 87033 -19421 -57770 41783 122856 95100 -56664 -125926 -99511 -25419
13948b5419m1226j53155l49O2952N2242J49716Q0211l5239r5704j8307n2409j8600
$$ -25419 -66645 -219800 -220149 -157197 -104955 44761 124972 89733 -5971 -24278 -76687 -95287
13936i5287O6270j6009L5475m6690J13243j9659p9204j8323N386N0224J54542
$$ -95287 -29017 -45026 -9551 -56241 57002 37343 -41861 -60184 -54798 -4574 149968
13925A49968J15127l9761p5250K7337n0265k8414j62573n3806N5820k3340R031
$$ 149968 265095 225334 150084 177421 127156 98742 -63831 -117637 -61817 -85157 -76126
13914g6126P8883Q6822P7994O4772l7947r8309j47491J8663J7769P8134L290o9954
$$ -76126 2757 89579 167573 232345 194398 96089 -51402 -32739 -14970 63164 66454 -3500
13902c500j4990j7595J9763n6808p0877j6029Q8233N847R654J0124J5138l3959
$$ -3500 -18490 -36085 -16322 -73130 -144007 -160036 -71803 -65956 -56302 -46178 -31040 -64999
13890f4999k4092n8220k2302P6248M3320l0822L6321N6099J68044N922m3283o4968
$$ -64999 -89091 -147311 -169613 -93365 -50045 -80867 -44546 11553 179597 185519 142236 77268
13878G7268m969J61761L1835j31446q4941n5419m3626L5683L2353k6815r4442
$$ 77268 72299 234060 265895 134449 49508 -5911 -49537 -13854 18499 -8316 -102758
13867a02758j02886k5368Q3483Q8659J00216O7013j5649k2993K3799l8178N8671
$$ -102758 -205644 -231012 -147529 -58870 41346 108359 92710 69717 93516 55338 114009
13856A14009N506p2003n967k7417j9860J11493M4142n5831P28O4990q9109j29891
$$ 114009 119515 47512 41545 14128 -5732 105761 149903 94072 94800 159790 70681 -59210
13844e9210j2460j10550o2308N0998J42389R4576Q0488J4386K1533J4356L5978
$$ -59210 -71670 -182220 -244528 -193530 -51141 43435 123923 138309 159842 174198 210176
13833B10176K7979J9995J1304j37032j13874Q776J28126Q8173j25798r0538l5982
$$ 210176 238155 258150 269454 132422 18548 27324 155450 243623 117825 27287 -8695
13822h695Q8116J44665Q5192l8496m5775p0176Q536P9882p5814r0969L9498O3145
$$ -8695 79421 224086 309278 270782 225007 154831 163367 243249 167435 76466 115964 179109
13810A79109O8641j26799q6092j9329J7847J2145J36713P8387N7422o7930L359
$$ 179109 247750 120951 34859 15530 33377 45522 182235 260622 318044 250114 253473
13799B53473R0284m7391J7496J02170j31596o7847q064O4453q6360j59709J7930
$$ 253473 343757 296366 313862 416032 284436 216589 208525 272978 186618 26909 44839
13788D4839J61472J62302R958O895Q8100N8656L654k8041k0183P4684j5002k1303
$$ 44839 206311 368613 378571 385466 473566 532222 535876 507835 487652 562336 547334 526031
13776E26031L1397o4015j5198Q3358m9819j01904j25579R2168J97905J85942K4782
$$ 526031 557428 493413 478215 561573 511754 409850 284271 376439 574344 760286 785068
13765G85068n1683N687K71674J55691J78043K11130J75449J22125q5653j52748
$$ 785068 733385 739072 1010746 1166437 1344480 1555610 1731059 1853184 1767531 1614783
13755A614783k03988k15490o5059K6940o1402p9185J1563j6173M7770n0954n8164
$$ 1614783 1410795 1195305 1130246 1157186 1095784 1016599 1028162 1011989 1059759 1008805 950641
13744I50641L4432Q9598L3784L5789J01611P7157Q0964K00931J30074K13336M24389
$$ 950641 985073 1074671 1108455 1144244 1245855 1323012 1403976 1604907 1734981 1948317 2372706
13733B372706M92039O32943R38394J217930J389539J582672J126481J73564o39673
$$ 2372706 2864745 3497688 4436082 5654012 7043551 8626223 9752704 9926268 9286595
13724I286595q70665q12106n56541j51868J72334R1117M44146Q59072J139516
$$ 9286595 8415930 7603824 7047283 6895415 7067749 7158866 7603012 8462084 9601600
13715I601600J699338K389720L380537M957994P197386R636509J1443648J1064265
$$ 9601600 11300938 13690658 17071195 22029189 29226575 38863084 50306732 61370997
13707F1370997O802004L64908o725813j1656077j0842861p523721m841762k999797
$$ 61370997 68173001 68537909 61812096 50156019 39313158 31789437 26947675 23947878
13699B3947878j428644k07629N62453J061680Q07816k43481j778524k831595k816498
$$ 23947878 22519234 22311605 22874058 23935738 24743554 24500073 22721549 19889954 17073456
13690A7073456k123943j714596j209739q88658p58107n18492m25844k85606q3289
$$ 17073456 14949513 13234917 12025178 11136520 10378413 9859921 9434077 9148471 9065182
13681I065182r0894j04537O624J73093L38444M60382M10895N64663Q49772J178627
$$ 9065182 8974288 8869751 8876375 9049468 9387912 9848294 10259189 10823852 11673624 12852251
13671A2852251J156305J307784J605028J823228K300288K828145L831686N526811
$$ 12852251 14008556 15316340 16921368 18744596 21044884 23873029 27704715 33231526
13663C3231526Q077112J2475657J9250644K7381507L2804946L2728018K6268890
$$ 33231526 41308638 53784295 73034939 100416446 133221392 165949410 192218300
13656A92218300J0103619l549498r424148k1712630l4001208l1304096k2114312
$$ 192218300 202321919 198772421 189348273 167635643 133634435 102330339 80216027
13649H0216027j4826924j0294115p359513n355291m021436l392985k867599k339711
$$ 80216027 65389103 55094988 47735475 42380184 38358748 34965763 32098164 29758453
13641B9758453k005968j879835j601868j534563j436598j053376q31043p64016
$$ 29758453 27752485 25872650 24270782 22736219 21299621 20246245 19415202 18651186
13633A8651186o43355n54280m06029l24485k33889l7934K06523L31776O28132
$$ 18651186 18007831 17453551 17047522 16723037 16489148 16451214 16657737 16989513 17617645
13624A7617645Q47207J274235J800051K449939L174055L275512L170492K443046
$$ 17617645 18464852 19739087 21539138 23989077 27163132 30438644 33609136 36052182
13616C6052182J227785N08802j18156o9531J182322L279193O270247J0239825
$$ 36052182 37279967 37788769 37670613 37601082 38783404 42062597 48332844 58572669
13608E8572669J4541540J6705192J4917033P260549m781838j4430162j7653345
$$ 58572669 73114209 89819401 104736434 111996983 107215145 92784983 75131638
13601G5131638j5410898j1269847p978956n540868l896608k998109k206583j738446
$$ 75131638 59720740 48450893 40471937 34931069 31034461 28036352 25829769 24091323
13593B4091323j251755r08682n37705o7519L10751P18941J292417J427375Q04495
$$ 24091323 22839568 21930886 21393181 21325662 21636413 22355354 23647771 25075146 25879641
13584B5879641m25560j390325j999825k312568k219496j627121j208514q57834
$$ 25879641 25454081 24063756 22063931 19751363 17531867 15904746 14696232 13838398
13576A3838398o09422n08138n92012m79710k70864k35635l15694k86782j96942
$$ 13838398 13228976 12720838 12128826 11649116 11378252 11142617 10826923 10540141 10343199
13567A0343199k62588j48339j54189j91444q3793j74738q8250j3143J4877J44826
$$ 10343199 10080611 9932272 9778083 9586639 9502846 9328108 9239858 9226715 9241592 9386418
13557I386418J36164J49432K30031J05429k34738l21001l01128l41474m37257
$$ 9386418 9522582 9672014 9902045 10007474 9772736 9451735 9150607 8809133 8371876
13548H371876n32534m29053m15230n16867k89929k07248j42581o9366j81391j99303
$$ 8371876 7839342 7410289 6995059 6478192 6188263 5981015 5838434 5769068 5587677 5388374
13538E388374j24856j65945k74776k34703k21524q0167j09481k27915j19156j22399
$$ 5388374 5263518 5097573 4822797 4588094 4366570 4286403 4176922 3949007 3829851 3707452
13528C707452k8605O4691o0729j68878j59895o4486K1198l806L6114m1028r3361
$$ 3707452 3678847 3743538 3682809 3513931 3354036 3289550 3310748 3306942 3343056 3302028 3208667
13517C208667q7943k0466R0810J4440r5613n7292q8409j65030n5085k9425K0468
$$ 3208667 3120724 3100258 3191068 3205508 3109895 3052603 2964194 2799164 2744079 2714654 2735122
13506B735122M6460j26447j25338k7172r1749j39096r0872O5609m708j1241n1331
$$ 2735122 2781582 2655135 2529797 2502625 2410876 2271780 2180908 2246517 2241809 2230568 2179237
13495B179237p4928k20931p5093L5629n3978P4356j5096m6197q0258n2817r3898
$$ 2179237 2104309 1883378 1808285 1843914 1789936 1864292 1849196 1802999 1722741 1669924 1576026
13484A576026r7175j90637n5760j15317K4583J23378P4493j61695K760J9468M7107
$$ 1576026 1478851 1288214 1232454 1117137 1141720 1265098 1339591 1177896 1180656 1200124 1247231
13473A247231L0169J27061q994j91494j2981k610l0086l3214J8773l4405L9119
$$ 1247231 1277400 1404461 1395467 1203973 1190992 1188382 1158296 1125082 1143855 1109450 1148569
13462A148569k8363o2612l4077j332m8018n1040K4973p28j41372j0131J14515
$$ 1148569 1120206 1057594 1023517 1022185 974167 923127 948100 947372 806000 795869 910384
13451I10384O0081j03231m1777j4212L7881R4930M4896j77624n0190k4343j31863
$$ 910384 970465 867234 825457 811245 849126 944056 988952 811328 761138 736795 604932
13440F04932K1308Q7761q1876k8292p2960r603M8498L3300m1231l0114l0663k8680
$$ 604932 626240 714001 632125 603833 530873 521270 569768 603068 561837 531723 501060 472380
13428D72380n6299r5787o7689R8945J21273n0571m6502J05004p773j8535N1753
$$ 472380 416081 320294 252605 351550 472823 422252 375750 480754 472981 454446 506199
13417E06199m0933j30065M0937N9221o1402j60810l6857M7114K3263K4002P4781
$$ 506199 465266 335201 376138 435359 373957 213147 176290 223404 246667 270669 345450
13406C45450N6932P176K5509j6817j7622K0707j26022K5888m4320p0649J06054
$$ 345450 402382 409558 435067 418250 400628 421335 295313 321201 276881 206232 312286
13395C12286K5891l5989j96904j8512k1298M9262n0993Q147J11467N5269J23920
$$ 312286 338177 302188 105284 86772 65474 114736 63743 71890 183357 238626 362546
13384C62546K7885o2139o6271q2463m3545m9555J00479K7211q3051M985J09501
$$ 362546 390431 328292 262021 179558 136013 86458 186937 214148 131097 136082 245583
13373B45583k8146j477r047r0030R9748J26267L1777j51537k05027j44915O7467
$$ 245583 217437 215960 206913 116883 216631 342898 374675 223138 18111 -126804 -59337
13362e9337N4687L0419N5873K9623l3389J9338J89975J7769q7928O1712n3098
$$ -59337 -4650 25769 81642 111265 77876 97214 287189 304958 217030 278742 225644
13351B25644j46491J032O8417Q7484K5516m5038j07889L4112J90224k0707m4979
$$ 225644 79153 80185 148602 236086 261602 216564 108675 142787 333011 312304 267325
13340B67325K7660Q0399K6411j62891r555N6293L612k1260j2973n975o2903R7215
$$ 267325 294985 375384 401795 238904 229349 285642 289254 267994 255021 249046 186143 283358
13328B83358O7007P7431J3340l0813p8996o235m8832P9652J9316R1094q4348n6717
$$ 283358 350365 427796 441136 410323 331327 325092 276260 355912 375228 466322 381974 325257
13316C25257O2998L7919P702J12671M0681P4248N3051j39172k59313j7045P4770
$$ 325257 388255 426174 433876 546547 587228 661476 714527 575355 316042 298997 373767
13305C73767L6306o0185m7247J02969J10610J554l8685q6175M7926j8026M8529
$$ 373767 410073 349888 302641 405610 516220 517774 479089 392914 440840 422814 471343
13294D71343N3517Q1764L3431m3176j06750j3337L2274J03921o4039l3495R7251
$$ 471343 524860 606624 640055 596879 490129 476792 509066 612987 548948 515453 612704
13283F12704k991n5857K0885Q8O917N2711l269J49396Q9151M2875L1736m2212
$$ 612704 609713 553856 574741 574829 581746 634457 631188 780584 869735 912610 944346 902134
13271I02134l5895J2895K5359O0912K7548k9638Q2769J16655J26013k7951p3572
$$ 902134 866239 879134 904493 965405 992953 963315 1046084 1162739 1288752 1260801 1187229
13260A187229J5499J24164J18833J03380J79648K08402J13543J29245R4272Q8114
$$ 1187229 1202728 1326892 1445725 1549105 1728753 1937155 2050698 2179943 2274215 2362329
13250B362329J62962J49505J51833L61209L53462L06261K75159L65608N27333
$$ 2362329 2525291 2674796 2826629 3187838 3541300 3847561 4122720 4488328 5015661
13241E015661O31048P09008R47621J211044J317193J632987K640259M146331O098981
$$ 5015661 5646709 6355717 7303338 8514382 9831575 11464562 14104821 18251152 24350133
13232B4350133R311080J3349028J6755680J7704779J3624320L991457p450305
$$ 24350133 33661213 47010241 63765921 81470700 95095020 99086477 91636172
13225I1636172j5358607j7039200j3825958r386013o300634m468029l107874j871120
$$ 91636172 76277565 59238365 45412407 36026394 29725760 25257731 22149857 20278737
13217B0278737j489622j265425r96806p99201m56368k04547K7022P8863J23566
$$ 20278737 18789115 17523690 16526884 15727683 15271315 15066768 15093790 15172653 15296219
13208A5296219J50561K03871M25783P06275J152105J539337K069698K931900M235465
$$ 15296219 15446780 15650651 16076434 16782709 17934814 19474151 21543849 24475749 28711214
13199B8711214O338889R859024J4920248K1037077K6406820K7396428K0997106
$$ 28711214 35050103 44909127 59829375 80866452 107273272 134669700 155666806
13192A55666806N817013j1822753k3841188k6513494k1569338j5024420r941864
$$ 155666806 161483819 149661066 125819878 99306384 77737046 62712626 52770762
13185E2770762o789800m573651k869879j478880m85597O84682K072018L502267
$$ 52770762 45980962 41407311 38537432 37058552 36572955 37257637 39329655 42831922
13177D2831922M392200M010884K051604j165515m154716n888893n682336m196091
$$ 42831922 47224122 51235006 53286610 52121095 47966379 42077486 36395150 32199059
13169C2199059k879350j888207r90417l09776K51188N88352J050346J832338K780947
$$ 32199059 29319709 27431502 26441085 26131309 26382497 26970849 28021195 29853533 32634480
13160C2634480L902730N880997Q325517J0883331J2468270J2281943R887804O105440
$$ 32634480 36537210 42418207 50743724 61627055 74095325 86377268 96265072 102370512
13152A02370512K032325j642852m387171n923148o480114n613756j969738L787771
$$ 102370512 104402837 102759985 98372814 92449666 85969552 80355796 78386058 82173829
13144H2173829R987449J5446138J7932830J5003919M869625p160419j6573256
$$ 82173829 92161278 107607416 125540246 140544165 145413790 138253371 121680115
13137A21680115k0736420j8082347j2889718q419910n191472k702822m62142J725566
$$ 121680115 100943695 82861348 69971630 61551720 56360248 53657426 53195284 54920850
13129E4920850L998936O678849Q886318R087742P182604L143093J24108J470245
$$ 54920850 58919786 65598635 74484953 83572695 90755299 93898392 94022500 95492745
13121I5492745L752490L446908o66286p690736j1106562r301362o275423m677710
$$ 95492745 99245235 102692143 102025857 94335121 83228559 73927197 67651774 62974064
13113F2974064m667676n505901n603382m721530l624820k693004k153599j744651
$$ 62974064 58306388 52800487 47197105 42475575 38850755 36157751 34004152 32259501
13105C2259501j539464j250171r79043q17475n83731m22931k60499P6956L79249
$$ 32259501 30720037 29469866 28490823 27673348 27089617 26666686 26406187 26483143 26862392
13096B6862392P07183J065025J904187K814106L502747L896438L627480K979663
$$ 26862392 27569575 28634600 30538787 33352893 36855640 40752078 44379558 47359221
13088D7359221L058247M780292O455874O410093M468918R79538j265129Q3391
$$ 47359221 50417468 55197760 61653634 68063727 72532645 73512183 72247054 72330445
13080G2330445L236060N717765N618720K412629k585468o679190o531115l244196
$$ 72330445 75566505 81284270 86902990 89315619 86730151 80050961 73519846 70275650
13072G0275650r35267r86936l211730p218705q460082p128420n280672l759523
$$ 70275650 69340383 68353447 65141717 57923012 49462930 42334510 37053838 33294315
13064C3294315k735185k161665j739653j344426j009618q10495o48088m14673
$$ 33294315 30559130 28397465 26657812 25313386 24303768 23493273 22845185 22430512
13056B2430512k05250N3580N20781Q83375J531556K174187K384370K162568J740226
$$ 22430512 22225262 22278842 22799623 23682998 25214554 27388741 29773111 31935679 33675905
13047C3675905J240393J771250K883151M175853M328728K772561n198k065444
$$ 33675905 34916298 36687548 39570699 43746552 48075280 50847841 50842643 48777199
13039D8777199j703668M71463J977503K385372J411982q57831k509389l400484
$$ 48777199 47073531 47544994 49522497 51907869 53319851 52462020 49952631 46552147
13031D6552147l511855k368670j093945o55517j276646k719539m074737l836902
$$ 46552147 43040292 40671622 39577677 38922160 37645514 34925975 30851238 27014336
13023B7014336l171069k498794j878131j395114j151461r80319q13474o39346
$$ 27014336 23843267 21344473 19466342 18071228 16919767 15939448 15125974 14486628
13015A4486628n70295n21376m94064l11768j99307l10340r5946J17687J61643
$$ 14486628 13916333 13394957 12900893 12589125 12389818 12079478 11983532 12101219 12262862
13006A2262862J19839J40726M42842P54726J268811J603134J822336J807445J247229
$$ 12262862 12382701 12523427 12966269 13720995 14989806 16592940 18415276 20222721 21469950
12997B1469950L19446m45839k32896K55279L50045k24483j357150k123052k281481
$$ 21469950 21789396 21343557 21110661 21365940 21715985 21491502 20134352 18011300 15729819
12988A5729819j876755j367078j070144q04155o20825n72145n23770m25660l78257
$$ 15729819 13853064 12485986 11415842 10611687 9990862 9418717 8894947 8469287 8091030
12979H091030m14205m73530k93793k81505j69674n6437j58240k26866k52401j31681
$$ 8091030 7676825 7203295 6909502 6627997 6458323 6401886 6243646 6016780 5764379 5632698
12969E632698j00619j68145k21536n3585p7596r9603j85067j23661L0805J5149
$$ 5632698 5532079 5363934 5142398 5088813 5011217 4911614 4726547 4602886 4633691 4648840
12959D648840n0625q4331j82666j09365m0395O9131k0013j13470j43811j59283
$$ 4648840 4598215 4513884 4331218 4221853 4181458 4250589 4230576 4117106 3973295 3814012
12949C814012o6052k1075q4345j13054j83028j32534N6058q3363j24467j26743
$$ 3814012 3747960 3726885 3642540 3529486 3346458 3213924 3269982 3186619 3062152 2935409
12939B935409j9045k01769j85573O463K9203j1348P2888J4854j86252j49539k1514
$$ 2935409 2916364 2714595 2529022 2535485 2564688 2553340 2626228 2641082 2454830 2305291 2283777
12928B283777k3755K9844k7089k20134j50032J00262N172N2598r8444k00833p642
$$ 2283777 2260022 2289866 2262777 2042643 1892611 1992873 1998045 2050643 1952199 1751366 1743724
12917A743724N0646n2917j94186n5548J0976O2899q8720N1735O3637K2898o1584
$$ 1743724 1794370 1741453 1547267 1491719 1502695 1565594 1476874 1528609 1592246 1615144 1553560
12906A553560o0261j8036L0263r1822k2332p2724K1101J13713L3296j52855p1417
$$ 1553560 1493299 1475263 1505526 1413704 1391372 1318648 1339749 1453462 1486758 1333903 1262486
12895A262486K6504O4207o1563m537q8445p8454l5499q8273n4915j3271p8133
$$ 1262486 1288990 1353197 1291634 1287097 1198652 1120198 1084699 996426 941511 928240 850107
12884H50107M6666J42337M2441r5768j64015R99J03252J82408q936r4584M9748
$$ 850107 896773 1039110 1081551 985783 821768 822767 926019 1108427 1099491 1004907 1054655
12873A054655n2197k7969q4224P3906j8709l9391j27764L1868M9933n5757l9141
$$ 1054655 1002458 974489 890265 964171 945462 906071 778307 810175 860108 804351 765210
12862G65210L6949J25807o6395L4859o2948q7054m3211k5528M9356m4284k8050
$$ 765210 802159 927966 861571 896430 833482 746428 703217 677689 727045 682761 654711
12851F54711Q3877o3097j03169Q6434R0518J59665K0349j29734k4395k2178k8794
$$ 654711 738588 675491 572322 658756 749274 908939 929288 799554 775159 752981 724187
12840G24187M1026k7613j6746O4833M0416o3528j4778l1052k4080o0220j3684
$$ 724187 765213 737600 720854 785687 826103 762575 747797 716745 692665 632445 618761
12829F18761M2367J7716p4248j5271J7055Q2068M8129N245J42327K2758J5307
$$ 618761 661128 678844 604596 589325 606380 688448 736577 741822 884149 906907 922214
12818I22214r1905P220M0042N2785j55354p3797r4378l343l124q0092j08042L4975
$$ 922214 830309 837529 877571 930356 775002 701205 606827 603484 600360 520268 412226 447201
12806D47201R6886J01527M4569K992k6804J45132J7217j78972l6322J34037J2017
$$ 447201 544087 645614 690183 693175 666371 811503 828720 649748 613426 747463 759480
12795G59480Q7381O2082j15120j48103j9442k6806m6562M4050M7936L2316r3205
$$ 759480 846861 908943 793823 645720 626278 599472 552910 596960 644896 677212 584007
12784E84007L5830J01951r5486r3637Q320Q5816Q973O6858J44728M8153p6038
$$ 584007 619837 721788 626302 532665 540985 626801 635774 702632 847360 895513 819475
12773H19475k8288j7506J0653J10099P3044r5464j37483m1977N1762J1401q5946
$$ 819475 791187 773681 784334 894433 967477 872013 734530 692553 744315 755716 669770
12762F69770n0496m5564j58600L0463R6978J11603J40459l2457K4840l9233p8422
$$ 669770 619274 573710 415110 445573 542551 654154 794613 762156 786996 747763 669341
12751F69341o2299K2762P063j14644N5856l9420Q5994k6848M6860J1332p662J0505
$$ 669341 607042 629804 636867 522223 578079 538659 624653 597805 644665 655997 648335 658840
12739F58840k9372k1421L2147J56002N8082j57766L3353J0409M1778O7811J61662
$$ 658840 629468 608047 640194 796196 854278 696512 729865 740274 782052 849863 1011525
12728A011525J50322j51641j13820k635l9003k00007j07240J01577L9546J06785
$$ 1011525 1161847 1010206 896386 893751 854748 654741 547501 649078 688624 795409
12718G95409j24273j60359k4417Q9664j9050J32159L2922r803j5563L7623M0962
$$ 795409 671136 510777 486360 576024 556974 689133 722055 712252 696689 734312 775274
12707G75274N6222R1264N7574O7449K1906r5886l1940j36411l3250p5915j17736
$$ 775274 831496 922760 980334 1047783 1069689 973803 941863 805452 772202 696287 578551
12696E78551m9978o3126K5281L1276J14364R6049l7795j5412M0656J35793M0520
$$ 578551 528573 465447 490728 522004 636368 732417 694622 679210 719866 855659 896179
12685H96179M2162n333l3548r8263j7480k6701j43422l9085o86m2754m8548M1896
$$ 896179 938341 933008 899460 801197 783717 757016 613594 574509 573823 531069 482521 524417
12673E24417Q293n547j35705L7481L3951j1592J1975P0907J24412O7136K7980
$$ 524417 532710 527163 391458 428939 462890 451298 463273 534180 658592 725728 753708
12662G53708l839p9184K6143N2705j2859R6471j35344j0294j3838j13778j03394
$$ 753708 749869 670685 696828 749533 736674 833145 697801 687507 673669 559891 456497
12651D56497K1108o2442n7167m8622J5778J6937O2227J5597K6888J15205l9264
$$ 456497 477605 415163 357996 309374 325152 342089 404316 419913 446801 562006 522742
12640E22742l2375j36964q2119m418R9145J11499R110j06894n6237M7957L6951
$$ 522742 490367 353403 271284 266866 366011 477510 486620 379726 323489 371446 408397
12629D08397R1056N2747o1711m1754Q2576j02530k7755l0144l8473q6043K1738
$$ 408397 499453 552200 490489 448735 531311 428781 401026 370882 332409 246366 268104
12618B68104O6694Q4280j6L8067J66323J58823m6749p4927l3226m0820r3546l4059
$$ 268104 334798 419078 419062 457129 623452 782275 735526 660599 627373 586553 493007 458948
12606D58948l5495J5603r0681N5740m4279p0837j36154l9302J40383L0947m8517
$$ 458948 423453 439056 348375 404115 359836 288999 152845 113543 253926 284873 236356
12595B36356p0794L2191R0924k2707n3186k2300J5003j81187j11753J30281K34906
$$ 236356 165562 197753 288677 265970 212784 190484 205487 24300 -87453 42828 277734
12584B77734m8416R3762j4871j60877O6312O6124o2675L7363J8193J02486p814
$$ 277734 229318 323080 308209 147332 213644 279768 217093 254456 272649 375135 367321
12573C67321r2190r7615J0617P6933P3464k86j3774k7607q768R3571r554m7710
$$ 367321 275131 177516 188133 265066 338530 338244 324470 296863 288095 381666 372112 324402
12561C24402l0359o0532o3118o3209j75063M5530P0649l2412J50M0346K3816j13012
$$ 324402 294043 233511 170393 107184 -67879 -22349 48300 15888 16038 56384 80200 -32812
12549c2812o4010M7371k2825J7371q1586Q6820J11105Q106p3335J8541L548R436
$$ -32812 -96822 -49451 -72276 -54905 -136491 -49671 61434 69540 -3795 14746 18294 27730
12537B7730J07658R7343Q333q2918p8362K2105O3148Q9225p3891j33990l0062
$$ 27730 135388 232731 241064 158146 79784 101889 165037 254262 180371 46381 16319
12526A6319N0488p383M1751J6578k385l9530o554J01729k8055j39028p2540o8066
$$ 16319 66807 59424 101175 117753 115368 75838 69284 171013 142958 3930 -68610 -136676
12514a36676R327P7241J07502M146r8263k5924K7828l2443J3776O6218M1835N5914
$$ -136676 -127349 -50108 57394 61540 -36723 -62647 -34819 -67262 -53486 12732 54567 110481
12502A10481K372J41528K0199O4069J90n8427r0976j2010P7899O4139j23866p4736
$$ 110481 112853 254381 274580 338649 338839 280412 189436 177426 255325 319464 195598 120862
12490A20862L3460L8957R4737m2755r4180p7342n7094q433n9883n3838N8978q301
$$ 120862 154322 193279 288016 245261 151081 73739 16645 8212 -51671 -105509 -46531 -54832
12478e4832l9337P3586R4621P39j5031l9480q85J2295m1955k7116L8904l9486
$$ -54832 -94169 -20583 74038 74777 59746 20266 19381 31676 -10279 -37395 1509 -37977
12466c7977K1696P2048j55518L3270J30897L9107K7845l3148M9127j3668o7378
$$ -37977 -16281 55767 -99751 -66481 64416 103523 131368 98220 147347 133679 66301
12455F6301R6870M7974L103k7748r2257J69583L5011m9749j32144j39133J07496
$$ 66301 163171 211145 214248 186500 94243 263826 298837 249088 116944 -22189 85307
12444H5307O7217N3835o7401j40975n2601M5394P2511J2200k5050o5414l8817
$$ 85307 152524 206359 138958 -2017 -54618 -9224 63287 75487 50437 -14977 -53794
12433e3794q9690n5824J4696O0149J18201J59793O347k2548j18490r4525M3169
$$ -53794 -143484 -199308 -184612 -124463 -6262 153531 159878 137330 18840 -75685 -32516
12422c2516M4382O2933P3345n1717P0880n1769Q0956j01015o5982L0061J65064
$$ -32516 11866 74799 148144 96427 167307 115538 196494 95479 29497 59558 224622
12411B24622M5451j8036j7261M3848N9225l6828L5258q6773p6738R9513R3761
$$ 224622 270073 252037 234776 278624 337849 301021 336279 249506 172768 272281 366042
12400C66042j6983l0208j0701Q567J0232J43435N2144p6496o8169q9536P982M5368
$$ 366042 349059 318851 308150 316717 326949 470384 522528 446032 377863 288327 296309 341677
12388C41677J04033r304K042J0405Q0280M4209M8420m3224K490N3455n387j0512
$$ 341677 445710 436406 438448 448853 529133 573342 621762 578538 581028 634483 629096 618584
12376F18584l5510Q752r9546q6390m797J09419k3567j79199l8776l666N9775n4499
$$ 618584 583074 591826 492280 405890 401093 510512 486945 307746 268970 265304 325079 270580
12364B70580J37994k8996j41682j01101k1311m2190n2911N9923J42802o4499k0841
$$ 270580 408574 379578 237896 136795 115484 73294 20383 80306 223108 158609 137768
12353A37768J7412O0875m1622M9316P1784l7863O9804J06559m1255k8014L3730
$$ 137768 155180 216055 174433 223749 295533 257670 327474 434033 392778 364764 398494
12342C98494N2552N7288M8264P1508M4029M0058K8820K0060N8354l0240l015Q1873
$$ 398494 451046 508334 556598 628106 672135 712193 741013 761073 819427 789187 786172 868045
12330H68045J29449Rn5717r8868j5333M8834j3066m4061n0937o6061Q7159N0738
$$ 868045 997494 997503 941786 842918 827585 876419 863353 819292 768355 702294 789453 840191
12318H40191J22686%j15647r3492J67388N1291R4654l2727k06438o5675q6393
$$ 840191 962877 962877 847230 753738 921126 972417 1067071 1034344 827906 762231 675838
12307F75838j38333j51390n7231J06176J74239R1598K5067j42164j59733l3847
$$ 675838 537505 386115 328884 435060 609299 700897 725964 583800 424067 390220
12297C90220m5949j13549n7578j9934L2732J68661o691r9870j7324M7732l6519
$$ 390220 344271 230722 173144 153210 185942 354603 347912 248042 230718 278450 241931
12286B41931j17865J1341j8000K584L2770k4210j151P3084r7156q8869K9125q2807
$$ 241931 124066 135407 117407 119991 152761 128551 127400 200484 103328 14459 43584 -39223
12274c9223m9004K5003J00382L4245J22925L2456p4380N1190k7335j97580r874
$$ -39223 -88227 -63224 37158 71403 194328 226784 152404 203594 176259 -21321 -31195
12263c1195M2489q7267L6417J65880R8211K3010k7437n8991n6639k3300m6206
$$ -31195 11294 -75973 -39556 126324 224535 247545 220108 161117 104478 81178 34972
12252C4972J539J9931K4295j9884L5790R725p0041J5265J4999k7327j50260N6779
$$ 34972 36511 56442 80737 60853 96643 106368 36327 51592 66591 39264 -110996 -54217
12240e4217L3515p033r5627K8290m4317K4951K28165n2291l497O0476J9007l4116
$$ -54217 -20702 -27735 -123362 -95072 -139389 -114438 113727 61436 57939 118415 137422 103306
12228A03306R647o3294J65003r525k42539q8175P147P5737L8930K4352j6446j24450
$$ 103306 112953 49659 214662 205137 -37402 -125577 -118430 -42693 -3763 20589 4143 -120307
12216a20307K749l7144m5570J189J448J4120N0563N9200J4165K3664P7843p335
$$ -120307 -117558 -154702 -200272 -199083 -197635 -183515 -132952 -73752 -59587 -35923 41920 34585
12204C4585l4006N8207k4124j01989o2566M3307o3408P5767O4769m5026O569Q3505
$$ 34585 579 58786 34662 -67327 -129893 -86586 -149994 -74227 -9458 -54484 -47915 35590
12192C5590j3632n7575k6805m0963n3936N9779J4955P1879R1372M3175P6480O1214
$$ 35590 21958 -35617 -62422 -103385 -157321 -97542 -82587 -10708 80664 123839 200319 261533
12180B61533l8718p1822J8437n7255J07277K9896o4143K4023Q0694O7539Q4446
$$ 261533 222815 150993 169430 112175 219452 249348 185205 209228 289922 357461 441907
12169D41907J31969O8731O4827P9183q2615j63195k0495p2399L7805l1738j18611
$$ 441907 573876 642607 707434 786617 704002 540807 520312 447913 485718 453980 335369
12158C35369k0115J52801k7919o0448n7694J829J36168o8538j15800o1610o8225
$$ 335369 315254 468055 440136 379688 321994 323823 459991 391453 275653 214043 145818
12147A45818r6480N7194O3127P7517R9080j0493q2973O1423O0432l8468k8386
$$ 145818 49338 106532 169659 247176 346256 335763 252790 314213 374645 336177 307791
12136C07791O9922j3835j163l5111J6059o4983K44565J86893j0400K5222j1490
$$ 307791 377713 363878 362715 327604 343663 278680 523245 710138 699738 724960 713470
12125G13470p9511l9406L0743K0572r1464j48262j11967Q6787J20193K7216l0642
$$ 713470 633959 594553 625296 645868 554404 406142 294175 380962 501155 528371 497729
12114D97729l5923O1557k2345n1991J4580n6155j7770Q902P458l5329j42623r4541
$$ 497729 461806 523363 501018 449027 463607 407452 389682 398584 406042 370713 228090 133549
12102A33549J52718J61165k6053O9559J09535j21359k1840N5863J03297p3472
$$ 133549 286267 447432 421379 490938 600473 479114 457274 513137 616434 542962
12092E42962j09663m0610k2978j24410J247O0990N3306l8608j52529o7983R8941
$$ 542962 433299 392689 369711 245301 246548 307538 360844 322236 169707 101724 200665
12081B00665K40530P9861j012p4826k24107q5755q4742j734N3347K8560R8563
$$ 200665 441195 521056 520044 445218 221111 135356 50614 48880 102227 130787 229350
12070B29350P95k1898J06446J2990j22555o6925N9293N0984M8776o2370M2989
$$ 229350 230145 208247 314693 327683 205128 138203 197496 248480 297256 234886 277875
12059B77875m630J5535K4395o4125N9023r733r6830o0541p4024N5567J3391O5111
$$ 277875 273245 288780 313175 249050 308073 298340 201510 140969 66945 122512 135903 201014
12047B01014M9377Q8066K5856K9559j20751p9899M7222q540p7888r0606j96639
$$ 201014 250391 338457 364313 393872 273121 193222 240444 231904 154016 63410 -133229
12036a33229n003J20133n097m5551J7249L0063L3561P9735n6003M3793J45463
$$ -133229 -138232 -18099 -23196 -68747 -51498 -21435 12126 91861 35858 79651 225114
12025B25114K7689l1011j08166M9284q9886L8475Q871q535j8890Q327m7007m7427
$$ 225114 252803 221792 113626 162910 73024 111499 120370 111835 92945 101272 54265 6838
12013F838J695L0441R735n0979J9717n247j7067j5503L5047l8398P6734O0446
$$ 6838 8533 38974 48709 -2270 17447 12200 -4867 -20370 14677 -23721 53013 113459
12001A13459J1305R7421R6895l8438n9611q6680n5211p1920K6854J3301N327M9040
$$ 113459 124764 222185 319080 280642 221031 134351 79140 7220 34074 47375 52702 101742
11989A01742Q479j18053j4797P0292q159m6815P569O2045O3486P222q175J8858
$$ 101742 110221 -7832 -22629 47663 39504 -7311 258 62303 125789 133011 124836 143694
11977A43694o3292r2485L776n1726j11626j54889n3147J82044P1972j0415O1293
$$ 143694 80402 -12083 -8307 -60033 -171659 -326548 -379695 -197651 -125679 -136094 -74801
11966g4801N7449Q6279M4774j3855L8845k675L567k3856o4928k9211P028K841
$$ -74801 -17352 68927 113701 99846 138691 136016 139583 115727 50799 21588 28616 31457
11954C1457O1626O9976O054j9608j03037o4657n0383J1629K4338O2270n9563l2688
$$ 31457 93083 163059 169113 149505 46468 -18189 -68572 -56943 -32605 29665 -29898 -62586
11942f2586p4900J9869J3552l346P1357P2122j22131l3778K6292K8973P7534O5425
$$ -62586 -137486 -117617 -104065 -107411 -36054 36068 -86063 -119841 -93549 -64576 12958 78383
11930G8383L7852o1818n5733M0475J5469r6503O8524l5460l3137P7575n2215j9044
$$ 78383 116235 54417 -1316 39159 54628 -41875 26649 -8811 -41948 35627 -16588 -35632
11918c5632J097j28130l1474j5313P5567M4694p7769Q386J27084K0402k1758j05573
$$ -35632 -34535 -162665 -194139 -209452 -133885 -89191 -166960 -158574 -31490 -11088 -32846 -138419
11906a38419j9862o3035k5824o8189L716R5810M765J70090M9939R9077Q353l9473
$$ -138419 -158281 -221316 -247140 -315329 -311613 -215803 -211038 -40948 8991 108068 116421 76948
11894G6948p1061j6582q205M3n4370K3749R3419O3591j33045p6550P6645J0333
$$ 76948 5887 -10695 -18900 -18857 -73227 -49478 43941 107532 -25513 -102063 -25418 -15085
11882a5085j07870P7698J48596k1879j58722q0171l0423n547o7071M1064Q1883
$$ -15085 -122955 -45257 103339 81460 -77262 -157433 -187856 -193403 -260474 -219410 -137527
11871a37527K2535N7009K3866l2360L8356N4188J6784p055p8535o2234K571K1985
$$ -137527 -114992 -57983 -34117 -66477 -28121 26067 42851 35796 -42739 -104973 -102402 -80417
11859h0417M0813R4778r5585j09679P554M1398q3575o1295J82551K307N1678j340
$$ -80417 -39604 55174 -40411 -150090 -142536 -101138 -184713 -246008 -63457 -61150 -9472 -10812
11847a0812o9997j0188l0036n4797J05361Q0697j34138N7867L0162j19208j31733
$$ -10812 -80809 -90997 -121033 -175830 -70469 10228 -123910 -66043 -35881 -155089 -286822
11836b86822k9264O7934J5280J0226m6888J09580J27039J00379l2396K1113q742
$$ -286822 -316086 -248152 -232872 -222646 -269534 -159954 -32915 67464 35068 56181 47439
11825D7439q6109j44673l4595P2054K8409n5655k7222O5288Q3325R7957l3589
$$ 47439 -38670 -183343 -217938 -145884 -117475 -173130 -200352 -135064 -51739 46218 12629
11814A2629n2620M7972Q7070j4541J6291M516j70906p0864m9429K610P7878q455
$$ 12629 -39991 7981 95051 80510 96801 101317 -69589 -140453 -189882 -187272 -109394 -117849
11802a17849J2991J8963p0640o9086R0133Q7935M5021n0439j4659N722j9728j51438
$$ -117849 -104858 -85895 -156535 -225621 -135488 -47553 -2532 -52971 -67630 -61908 -81636 -233074
11790b33074k5342Q3748J39472M893o9402M7856j26779j4745M8689K3771L960
$$ -233074 -258416 -174668 -35196 -30303 -99705 -51849 -178628 -193373 -144684 -120913 -116953
11779a16953L7053J09376O9765K1328l2839o1690o6261l6443O0075J07708o5111
$$ -116953 -79900 29476 99241 120569 87730 26040 -40221 -76664 -16589 91119 26008
11768B6008n7216Q50K7358k4571m7419j45950L0841M1095Q8710m1349r1404N5882
$$ 26008 -31208 -30358 -3000 -27571 -74990 -220940 -190099 -149004 -60294 -101643 -193047 -137165
11756a37165J32670n2878p4355L9798J8389J33842j3160J0241j01081q1742J4094
$$ -137165 -4495 -57373 -131728 -91930 -73541 60301 47141 57382 -43699 -125441 -111347
11745a11347m6760n4277l7609q331J2703k5266Q4657n941m7967J33729M0105L1759
$$ -111347 -158107 -212384 -249993 -258324 -245621 -270887 -186230 -192171 -240138 -106409 -66304 -34545
11733c4545P0298j4377l0254k0218j7278R2088P24R050L29p3544l6601r9494M2938
$$ -34545 35753 21376 -8878 -29096 -46374 45714 46438 55488 55817 -17727 -54328 -153822 -110884
11720a10884R3992O6385l7079j5781j08532j16899L9356O3074K641j31031j4007
$$ -110884 -16892 49493 12414 -3367 -111899 -228798 -189442 -126368 -123727 -254758 -268765
11709b68765J0284L7729J17929J34814l3997j33605m2601L2052m5135k6388O9614
$$ -268765 -258481 -220752 -102823 31991 -2006 -135611 -178212 -146160 -191295 -217683 -148069
11698a48069N0548j5676l7889j6688O0004O5663N4232j102L3766J13545p5025
$$ -148069 -97521 -113197 -151086 -167774 -107770 -42107 12125 11023 44789 158334 83309
11687H3309q9292R5622M8773q4457j47199M1291J26762j4596n4651k9257n1466
$$ 83309 -5983 89639 138412 53955 -93244 -51953 74809 60213 5562 -23695 -75161
11676g5161L7790P1483j5433n1995L2588k5557j27427J4540K1460K2948M5339
$$ -75161 -37371 34112 18679 -33316 -728 -26285 -153712 -139172 -117712 -94764 -49425
11665d9425p8819k2382j4398N678L2217j87197L0219K38533O8558j10110L3151
$$ -49425 -128244 -150626 -165024 -159346 -127129 -314326 -284107 -45574 22984 -87126 -53975
11654e3975o8179l7913L8391L241J2519n5153M2360J5075P5243J7522o8339o8922
$$ -53975 -122154 -160067 -121676 -118435 -105916 -161069 -118709 -103634 -28391 -10869 -79208 -148130
11642a48130j0968P5664R1769N8158O8733m8033o9446o912l6592p7306J5077J09924
$$ -148130 -159098 -83434 8335 66493 135226 87193 17747 10835 -25757 -103063 -87986 21938
11630B1938J02207K2474o057j05467n1432n3584k3326m1410j0155M1025K1587
$$ 21938 124145 146619 140562 35095 -16337 -69921 -93247 -134657 -144812 -103787 -82200
11619h2200n0078j3120p260L1582k4885M3189K36198j1878j81683N7083P6423
$$ -82200 -132278 -145398 -152658 -121076 -145961 -102772 133426 121548 -60135 -3052 73371
11608G3371L4000J3740M2835o5901l2997N7661k7098J725P5387J204k1934o8863
$$ 73371 107371 121111 163946 98045 65048 122709 95611 97336 172723 173927 151993 83130
11596H3130J68729J98013Q9265K29784L22343J50684P6780L1320J27877J25605
$$ 83130 251859 449872 539137 768921 1091264 1241948 1318728 1350048 1477925 1603530
11586A603530M1754k1779r7940j18929k01024k29858J4269o2346o2126j24254
$$ 1603530 1645284 1623505 1525565 1406636 1205612 975754 990023 927677 865551 741297
11576G41297q2803j9448q1139k5853J0653j7998N315q4266n1032Q0226Q2871k5783
$$ 741297 658494 639046 557907 532054 542707 524709 530024 445758 394726 474952 557823 532040
11564E32040j00671Q7606R457j18711j7321L5916K22524L0929n1011P852J13982
$$ 532040 431369 518975 528432 409721 392400 428316 650840 681769 630758 638610 752592
11553G52592J13986L8264K05428J16215K38624J34329J12983J7909J27278M4010
$$ 752592 866578 904842 1110270 1226485 1465109 1599438 1712421 1730330 1857608 1901618
11543A901618M6390l2110j74389k19827k68500j34204j02512k23237j25841o092
$$ 1901618 1948008 1915898 1741509 1521682 1253182 1118978 1016466 793229 667388 661296
11533F61296l7981j26271j41903k6630J69184J10708K6565J3599K2758p2710j10434
$$ 661296 623315 497044 355141 328511 497695 608403 634968 648567 671325 598615 488181
11522D88181J31605o6201q5026q3138r7233M358P8519n0323m2767L9352J67154
$$ 488181 619786 553585 468559 385421 288188 292546 371065 320742 277975 317327 484481
11511D84481J3751L5304Q558O4341L3582q0272p7545L5406J6682P0293o9785o6241
$$ 484481 498232 533536 542094 606435 640017 559745 482200 517606 534288 604581 534796 468555
11499D68555L430m2652M2999Q9352J22278j48719j50070L812M8451Q659q7529
$$ 468555 471985 429333 472332 561684 683962 535243 385173 388985 437436 446095 358566
11488C58566k9385O2915j5145n3815M1770m7221m8889L4929m2163q0596q9133
$$ 358566 329181 392096 376951 323136 364906 317685 268796 303725 261562 180966 91833
11477I1833l9729O2954N0479J892J5457N6907M1127L9425p63r2255r820K0719
$$ 91833 52104 115058 165537 167429 182886 239793 280920 320345 319582 227327 217507 238226
11465B38226o232J8775m2089n3237J2330J5687l4055J14151m7985j9021J4473
$$ 238226 231994 250769 208680 155443 167773 183460 149405 263556 215571 196550 211023
11454B11023K8981K9425n5965J15646L1359l3628q8895l9588J18803j19465j07307
$$ 211023 240004 269429 213464 329110 360469 326841 237946 198358 317161 197696 90389
11443I0389K7997M8880j4298j4188L80j05598q071J36261J30301k8377j1706K9655
$$ 90389 118386 167266 152968 138780 139160 33562 25491 161752 292053 263676 251970 281625
11431B81625J9826j7414p1389j29930N1519L4284Q4913j8373l0996l2473j20909
$$ 281625 301451 284037 212648 82718 134237 168521 253434 235061 204065 171592 50683
11420E0683L9023N2011l4560R414j5611m1344n7224p8619q4116R5468j5415J8244
$$ 50683 89706 141717 107157 116571 100960 59616 2392 -76227 -160343 -64875 -80290 -62046
11408f2046O4846m0012l9496Q5884k7401k507J0544L9809K3758O3599L4228l9731
$$ -62046 2800 -37212 -76708 9176 -18225 -20732 -10188 29621 53379 116978 151206 111475
11396A11475m4839j39383m3852P3017J07161j07718J0913Q0774m8739r674m0577
$$ 111475 66636 -72747 -116599 -43582 63579 -44139 -33226 47548 -1191 -10865 -51442
11385e1442J5655J50217P3604o0293k643K772l3316L0435k2712M6322J4066M9448
$$ -51442 -35787 114430 188034 127741 125098 127870 94554 124989 102277 148599 162665 212113
11373B12113j15368K4615J76172l3290o0717k8684N6606j00311q198o7826q6183
$$ 212113 96745 121360 297532 264242 203525 174841 231447 131136 122938 55112 -31071
11362c1071k4204J33094O8909r5384K4910M7097p4671l9842k7307j24189k7317
$$ -31071 -55275 77819 146728 51344 76254 123351 48680 8838 -18469 -142658 -169975
11351a69975j10488Q0886O447L9053O0070J25605K4594q4723m7179j3067K1948
$$ -169975 -280463 -199577 -193130 -154077 -94007 31598 56192 -28531 -75710 -88777 -66829
11340f6829j04547P3025N3235O6221k0224J1567Q1553q3596k0314N8314M0295
$$ -66829 -171376 -98351 -45116 21105 881 12448 94001 10405 -9909 48405 88700
11329H8700m0771N9239m904o8956M3183j980J7067P3294l6647l4850j15187j17712
$$ 88700 47929 107168 102264 33308 76491 74511 91578 164872 128225 93375 -21812 -139524
11317a39524j6836N8187O6982J57948K0906O5033k5852O6047J16674r0543N7902
$$ -139524 -156360 -98173 -31191 126757 147663 212696 186844 252891 369565 279022 336924
11306C36924M8864J81709n5012r7234M4820n2744o036m0258m5083J8496K5397
$$ 336924 385788 567497 512485 415251 460071 407327 401291 361033 315950 334446 359843
11295C59843j73894l6170R6433N9776P5983J7642l5447o676N835r0525K6707J36472
$$ 359843 185949 149779 246212 305988 381971 399613 364166 357490 363325 272800 299507 435979
11283D35979O0763N3032P8277q5981J1811J2368j3825J22419K44444L28770K65221
$$ 435979 496742 549774 628051 542070 553881 566249 552424 674843 919287 1248057 1513278
11272A513278J99173K08087J58474J0110j36612l8646j45673j82181j29496j65571
$$ 1513278 1712451 1920538 2079012 2089122 1952510 1913864 1768191 1586010 1456514 1290943
11262A290943j91874r1443m3384N5554M779l4330N1181m7592j32496l5635O9907
$$ 1290943 1099069 1007626 964242 1019796 1024575 990245 1041426 993834 861338 825703 895610
11251H95610R461j6087J7637m8852R0161M9172j06N8398J04016L6328J73406J91639
$$ 895610 905071 888984 906621 857769 947930 997102 996996 1055394 1159410 1195738 1369144 1560783
11239A560783K03803J69372J04505J38606J14969J51171Q3797J08388K4296n824
$$ 1560783 1764586 1933958 2038463 2177069 2292038 2443209 2527006 2635394 2659690 2653866
11229B653866J79483N5834n2745O4460L5825R9050M9981O2763J95797K07088K98510
$$ 2653866 2833349 2889183 2836438 2900898 2936723 3035773 3085754 3148517 3344314 3551402 3849912
11218C849912L34036M88209M65028P51413Q66936Q88517J154379J325608J777196
$$ 3849912 4183948 4672157 5137185 5888598 6755534 7644051 8798430 10124038 11901234
11209A1901234J952758J831698J825007J738196J765286J592134J337316J064196
$$ 11901234 13853992 15685690 17510697 19248893 21014179 22606313 23943629 25007825
11201B5007825J103663J214073J201660J426371K024894K943752M298165O594629
$$ 25007825 26111488 27325561 28527221 29953592 31978486 34922238 39220403 45815032
11193D5815032R823651J4018928J9299217K5314530L1046827L4652035L5126865
$$ 45815032 55638683 69657611 88956828 114271358 145318185 179970220 215097085
11186B15097085L1659732K4468803J4161542K091001r522771j8793202k4484946
$$ 215097085 246756817 271225620 285387162 287478163 277955392 259162190 234677244
11179B34677244k6711458k5909817k2679118j8665863j4640827j1263755q902382
$$ 234677244 207965786 182055969 159376851 140710988 126070161 114806406 105904024
11172A05904024p395133o507646o189020n767200n229830m737435m084029l404585
$$ 105904024 98508891 92001245 85812225 80045025 74815195 70077760 65993731 62589146
11164F2589146k578614j602619o67955K95093J167630K090829L111216L971024
$$ 62589146 60010532 58407913 57739958 58035051 59202681 61293510 64404726 68375750
11156F8375750M292997M527647M778407M870888N124447O294773Q532822J2394591
$$ 68375750 72668747 77196394 81974801 86845689 91970136 98264909 106797731 119192322
11148A19192322J7506491K3343435K8491872L1384540L0970304K6478319J8169553
$$ 119192322 136698813 160042248 188534120 219918660 250888964 277367283 295536836
11141B95536836O746416n681201j7033368k5101431k9660792l0511599k8449113
$$ 295536836 302283252 296602051 279568683 254467252 224806460 194294861 165845748
11134A65845748k4680376j9946076j5467609j1573895q414958o337390m729379
$$ 165845748 141165372 121219296 105751687 94177792 85762834 79425444 74696065
11127G4696065l619322k870708k413636k066121j977747j988091k196172k337500
$$ 74696065 71076743 68206035 65792399 63726278 61748531 59760440 57564268 55226768
11119E5226768k589636k768708k748507k617783k517525k239355j860092j536284
$$ 55226768 52637132 49868424 47119917 44502134 41984609 39745254 37885162 36348878
11111C6348878j267104j058530q29009p24975o58592p45798n31257l68641k28695
$$ 36348878 35081774 34023244 33194235 32469260 31810668 31064870 30533613 30164972 29936277
11102B9936277k77892k65116k98894l17279l30813l49039m41339o24098p63688
$$ 29936277 29658385 29393269 29094375 28777096 28446283 28097244 27655905 27031807 26268119
11093B6268119o74612o87811q49734p56324q09537p71722q30765p56619o94358
$$ 26268119 25593507 24905696 24055962 23299638 22490101 21718379 20887614 20130995 19436637
11084A9436637n89800o51167o85802m26954m18025m76673l85722l98653l45718
$$ 19436637 18846837 18195670 17509868 17082914 16664889 16188216 15802494 15403841 15058123
11075A5058123m39798m23195m33396l62761k79313l21415k54756k52644l43928
$$ 15058123 14618325 14195130 13761734 13398973 13119660 12798245 12543489 12290845 11946917
11066A1946917k18598j50676l22086j75602j03179j49019k68865j49795j85775
$$ 11946917 11728319 11577643 11255557 11079955 10976776 10827757 10558892 10409097 10223322
11057A0223322k05526o9672j22571k88036k38589j93490k64243j94592k95712
$$ 10223322 10017796 9948124 9825553 9537517 9298928 9105438 8841195 8646603 8350891
11048H350891k35052j67806k03193k6791q5694j16792k2481j21496j92163j45093
$$ 8350891 8115839 7948033 7744840 7718049 7632355 7515563 7493082 7371586 7179423 7034330
11038G034330j50572l3113j03201m1309j26107r9087K002J1556n1536K4192J39993
$$ 7034330 6883758 6850645 6747444 6706135 6580028 6480941 6482943 6494499 6442963 6467155 6607148
11027F607148K08999J36632J71804K8367K58447K27425J33378N532j55888j66717
$$ 6607148 6816147 6952779 7124583 7152950 7411397 7638822 7772200 7777732 7621844 7455127
11017G455127l52452m02427k33564k62368l15197k62160k23343l46519k90737
$$ 7455127 7102675 6700248 6466684 6204316 5889119 5626959 5403616 5057097 4766360
11008D766360m7751p7280q0188k2200o2959j59014k2759K4191k18346k32223q8730
$$ 4766360 4718609 4641329 4561141 4538941 4475982 4316968 4294209 4318400 4100054 3867831 3779101
10997C779101J321n715l915j59523N5126n5155k0720J4548j44709j18725M9274
$$ 3779101 3780422 3774707 3770792 3611269 3666395 3611240 3590520 3605068 3460359 3341634 3390908
10986C390908J32091K27421L2376J30097J26628K9388K04202K38742L09776K06306
$$ 3390908 3522999 3750420 3782796 3912893 4039521 4068909 4273111 4511853 4821629 5027935
10976E027935J61426J56153K9094J0768p0043l46619k75720k46000k76875l68651
$$ 5027935 5189361 5345514 5374608 5385376 5315333 4968714 4692994 4446994 4170119 3801468
10966C801468l19176k23948n4464j54881j91303l2856Q894n6828j61701j40082
$$ 3801468 3482292 3258344 3203880 3048999 2857696 2824840 2833734 2776906 2615205 2475123
10956B475123p2503j0115j1883J7651q5438k08018j39845n3263l8742j06398k238
$$ 2475123 2402620 2392505 2380622 2398273 2312835 2104817 1964972 1911709 1872967 1766569 1764331
10945A764331J11930Q3800r0588j12068q9404Q8606M8922O4975j30258j43046
$$ 1764331 1876261 1960061 1869473 1757405 1668001 1756607 1805529 1870504 1740246 1597200
10935A597200r3874O0264R0069k4102j14983m5628n992k6731n0351j6408J45184
$$ 1597200 1503326 1563590 1653659 1629557 1514574 1468946 1462954 1436223 1385872 1369464 1514648
10924A514648O6369K5265j30172l3533K842j51345j44127m1377O8109P2020m1454
$$ 1514648 1581017 1606282 1476110 1442577 1445419 1294074 1149947 1108570 1176679 1248699 1207245
10913A207245p7476p6725m834K8291k032l9689M9430o1738j08554K0581K4735
$$ 1207245 1129769 1053044 1048210 1076501 1074469 1034780 1084210 1022472 913918 934499 959234
10902I59234j9067k7470M8031J41695K7019q4259n6982Q8949k9630r9281l5757
$$ 959234 940167 912697 960728 1102423 1129442 1045183 988201 1077150 1047520 948239 912482
10891I12482k0695r084k7802j904j28437J1908J44671r3135n9728M7539K4745
$$ 912482 891787 882703 854901 852997 724560 736468 881139 788004 728276 775815 800560
10880H00560K7068J11559p2560l0219M409j34026j03646J28049O5691j6834J4358
$$ 800560 827628 939187 866627 836408 840817 706791 603145 731194 796885 780051 794409
10869G94409J5872j0724l9406q6669l3858R0647k6344r2963P6564Q0757j53484
$$ 794409 810281 799557 760151 673482 639624 730271 703927 610964 687528 768285 614801
10858F14801p0958L8140K4747J33724o742O5308P2015j66458l6372k8111K2794
$$ 614801 543843 581983 606730 740454 733712 799020 871035 704577 668205 640094 662888
10847F62888J17638K5135k55237j58292M7697J2680K061L3242o4211P4956O4178
$$ 662888 780526 805661 550424 392132 439829 452509 454570 487812 423601 498557 562735
10836E62735J00572n4427j52859L9660N3339K9917P1588K7947q4447L6627r1403
$$ 562735 663307 608880 456021 495681 549020 578937 650525 678472 594025 630652 539249
10825E39249j76581m4674J18414J10608j48947j57533p088L3198J26420P3461
$$ 539249 362668 317994 436408 547016 398069 240536 233448 266646 393066 466527
10815D66527J01724p1382j05710k4042k4477Q4574m6157J20586Q4179J2648L6664
$$ 466527 568251 496869 391159 367117 342640 427214 381057 501643 585822 598470 635134
10804F35134N1766R0142n7837J5391j5447j62963r0924L7777R220J24347L2039
$$ 635134 686900 777042 719205 734596 719149 556186 465262 503039 512259 636606 668645
10793F68645r5076K4264k4025M3629J20949p6219j1291N7141Q9383k8182r540
$$ 668645 573569 597833 573808 617437 738386 662167 650876 708017 797400 769218 759678
10782G59678J07509K12490J74547J49062K32827J30018J16374J4569j0722J17605
$$ 759678 867187 1079677 1254224 1403286 1636113 1766131 1882505 1897074 1886352 2003957
10772B003957L6938j86737j03224j65968k35079k01727j24121r8419j13297l4131
$$ 2003957 2040895 1854158 1750934 1584966 1349887 1148160 1024039 925620 812323 778192
10762G78192J9021N0475j0377j5269N825Q8344L8358r6976M1261j3402P959n6919
$$ 778192 797213 847688 837311 822042 827867 916211 954569 857593 898854 885452 893411 836492
10750H36492k3555k8102j06108r2093O8140N9885J53683M6725J348N4639L0566
$$ 836492 812937 784835 678727 586634 654774 714659 868342 915067 916415 971054 1001620
10739A001620N1551Q7422Q6839J47068J81673J84407J78065L3434k6059J4499
$$ 1001620 1053171 1140593 1227432 1374500 1556173 1740580 1918645 1952079 1926020 1940519
10729A940519k27720k45890j87129j51677n2588r2847j44732J1610J42006n1316
$$ 1940519 1712799 1466909 1279780 1128103 1075515 982668 837936 849546 991552 940236
10719I40236j86456j09363p1545j58555K6188J79373Q5193N440n6187j01979n9352
$$ 940236 753780 644417 572872 414317 440505 619878 705071 710511 654324 552345 492993
10708D92993M577j24349N0907o0784L9209R896q9393m0792J30695N2120p9726
$$ 492993 497570 373221 424128 363344 402553 412449 323056 282264 412959 465079 385353
10697C85353j6138m7945j23831P1793J15170N8655N9n506J7573l8359l5187L0334
$$ 385353 369215 321270 197439 269232 384402 443057 443116 437610 455183 416824 381637 411971
10685D11971L6528m6971L1482J0915N7801o0780J0838L9877j89762q5240l7854
$$ 411971 448499 401528 433010 443925 501726 440946 451784 491661 301899 216659 178805
10674A78805J941L4176K1154j5855N5349L5664M9498M4336m3135N0290j6839M2534
$$ 178805 180746 214922 236076 220221 275570 311234 360732 405068 361933 412223 395384 437918
10662D37918L0801j29006M8112O6642K0688l8335R9723R460p2990k689n6216L1498
$$ 437918 468719 339713 387825 454467 475155 436820 536543 546003 473013 470324 414108 445606
10650D45606K6538J6477o8218r5286m6359l2815O2153M2120K0992N6665l6685
$$ 445606 472144 488621 420403 325117 278758 245943 308096 350216 371208 427873 391188
10639C91188r9291k3052P3643r7625j57848N5636l3606K0047K8474k8551L6744
$$ 391188 291897 268845 342488 244863 87015 142651 109045 129092 157566 129015 165759
10628A65759K8885k2893K5594m3683n5412J17538j2079j05091k4856J06872N5704
$$ 165759 194644 171751 197345 153662 98250 215788 203709 98618 73762 180634 236338
10617B36338j3985o8J7290q674O4822L9630K8945m5337k2564j13405j21360k080
$$ 236338 222353 222285 239575 230901 295723 335353 364298 318961 296397 182992 61632 59552
10605E9552N0868J07161J16613l4005n3982o4985P5288j4795J01422N2209K2630
$$ 59552 110420 217581 334194 300189 246207 181222 256510 241715 343137 395346 417976
10594D17976o7158j07885j3519N5053r894p4247k8904j5339L0839j0557R2427
$$ 417976 350818 242933 229414 284467 274573 200326 171422 156083 186922 176365 268792
10583B68792n379N3903R9752r2976j3416J46874j29905j47370L4383L5936r3877
$$ 268792 263413 317316 417068 324092 310676 457550 327645 180275 214658 250594 156717
10572A56717j1168M512J01028p4o8488N1780P3386j4541j8820m0933Q1664P753
$$ 156717 145549 150061 251089 251015 182527 234307 307693 293152 274332 233399 315063 322816
10560C22816l3449O936J9508j50989k5849O4044o1037r9556l2195R6726J21519
$$ 322816 289367 296303 315811 164822 138973 203017 141980 42424 10229 106955 228474
10549B28474l9263o4940P5666J12847N1369k6334N5864L2298r0332q8818j35460
$$ 228474 189211 124271 199937 312784 364153 337819 393683 425981 335649 246831 111371
10538A11371p2926p5031K4195N1730J24768k2135M5842P4792k1636k6935J8425
$$ 111371 38445 -36586 -12391 39339 164107 141972 187814 262606 240970 214035 232460
10527B32460l832m3511l8332Q3512m305j43842K4504Q180N5942P827Q913N8121
$$ 232460 228628 185117 146785 230297 225992 82150 106654 114834 170776 178603 187516 245637
10515B45637o55O3577P5512j22852J3405n7859o8958k7101o0777o309M9705L7790
$$ 245637 244982 308559 384071 261219 274624 216765 147807 120706 59929 53620 103325 141115
10503A41115k7111j35722L7495J93188L9931l7123P01L4340o4449p9119O6079
$$ 141115 114004 -21718 15777 208965 248896 211773 212474 246814 182365 103246 169325
10492A69325N7066p339n0412l3757L3036N443o2091J16387J14416j00388j12839
$$ 169325 226391 219052 168640 134883 167919 173362 111271 227658 342074 241686 128847
10481A28847O8831M4281l1073p2438o1421n2725j40977J2229Q2614L4360K6146
$$ 128847 197678 241959 210886 138448 77027 24302 -116675 -104446 -21832 12528 38674
10470C8674M3411Q7531K6626j4977j8049n9044k5683P0626o744o2897J31361M6238
$$ 38674 82085 169616 196242 181265 163216 104172 78489 149115 142371 79474 210835 257073
10458B57073P9833q9719j26334J11031J805o7796J02082l6765l4232J7141j364
$$ 257073 336906 247187 120853 231884 233689 165893 267975 231210 196978 214119 212755
10447B12755q8169n1970l468j43626o7599n1611M9832J06648R000l6649m8469
$$ 212755 124586 72616 69148 -74478 -142077 -193688 -143856 -37208 -28208 -64857 -113326
10436a13326J25826L2388Q7812m5478r085M6007j6454j6170r9581K2227O9542
$$ -113326 12500 44888 132700 87222 78137 124144 107690 91520 -8061 14166 83708
10425H3708M9900q3390L8906l6359l6669n0062m5371R2922P598M908J49186J6031
$$ 83708 133608 50218 89124 52765 16096 -33966 -79337 13585 21183 26091 175277 191308
10413A91308j3682j33090j17182J0162Q9997O7798p8529M2490Q7312L3784P4867
$$ 191308 177626 44536 -72646 -62484 27513 95311 16782 59272 146584 180368 255235
10402B55235n4281O931p8857q1955o7952Q2437K7289k2418L6644k0464K3000L4543
$$ 255235 200954 207885 129028 47073 -20879 61558 88847 66429 103073 82609 105609 140152
10390A40152r3656q9038j2020J32384J08634K5036k7758L1137P9022j3837j07611
$$ 140152 46496 -42542 -54562 77822 186456 211492 183734 214871 293893 280056 172445
10379A72445n3856N194j76739p9628N8704J00577J9396j15625p6797J4974n1798
$$ 172445 118589 123783 -52956 -132584 -73880 26697 46093 -69532 -146329 -131355 -183153
10368a83153R0406K45655M7576J8812k0430k7358K9245l5522J08497O1288l5220
$$ -183153 -92747 152908 200484 219296 198866 171508 200753 165231 273728 335016 299796
10357B99796j24121q521Q0291P8155o4498r3931p1976k6176K3162M1316Q3075
$$ 299796 175675 167154 247445 325600 261102 167171 95195 69019 92181 133497 216572
10346B16572j8917L6526P7125K18221K35573J30459J24646Q9647J39308M384k6191
$$ 216572 197655 234181 311306 529527 765100 895559 1020205 1109852 1249160 1253544 1227353
10335A227353L2629M7001k4176o6029l1430J5402p1262j58410j00931j21751k0062
$$ 1227353 1259982 1306983 1282807 1216778 1185348 1200750 1129488 971078 870147 748396 728334
10324G28334n5803l3438p3257n7433p6366n7174Q8883l0613k2160M7891p8227
$$ 728334 672531 639093 565836 508403 432037 374863 463746 433133 410973 458864 380637
10313C80637j10637M1001m6367q7842K8011J53954j10524j04110M8363J22845
$$ 380637 270000 311001 264634 176792 204803 358757 248233 144123 192486 315331
10303C15331M9452L5529L2352K7947k5511p7620n9788O4379M7118p7788j03444
$$ 315331 364783 400312 432664 460611 435100 357480 297692 362071 409189 331401 227957
10292B27957j2567J05929M3259p0363j26696o6984m7381p552j3141O8539N8142
$$ 227957 215390 321319 364578 294215 167519 100535 53154 45602 32461 101000 159142
10281A59142K61k7632L6418R2355J402j05604L118k0728O7217L4134l1210m4820
$$ 159142 159403 131771 168189 260544 261946 156342 159460 138732 205949 240083 208873 164053
10269A64053j10611j61408j2644M2731R951P5991J3363K5001j14670K2325J13334
$$ 164053 53442 -107966 -120610 -77879 -67928 8063 21426 46427 -68243 -45918 67416
10258F7416L657L8844L3694K5482N0397K4001m2859m4982L6767n1603l1448L7003
$$ 67416 71073 109917 143611 169093 219490 243491 200632 155650 192417 140814 109366 146369
10246A46369j218l2209j50618K3356K2940n34k169R0633L6814q975j27501j15523
$$ 146369 145151 112942 -37676 -14320 8620 8086 5917 96550 133364 124389 -3112 -118635
10234a18635m0426K15948J01367K6336L2251L3675p4982q017m4183j01570p7349
$$ -118635 -159061 56887 158254 184590 216841 250516 175534 167517 123334 21764 -55585
10223e5585Q1315J13260k15L8238M2481J16845m5790m4804l3355j15302j10311
$$ -55585 25730 138990 138775 177013 219494 336339 290549 245745 212390 97088 -13223
10212a3223M3488p5233n8580J26507O5185l9665j5231J61455M5234o5111r3740
$$ -13223 30265 -44968 -103548 22959 88144 48479 33248 194703 239937 174826 81086
10201H1086J2859p4793j7848L1579O7826J10633N2317L3245j25672j7356p8426
$$ 81086 93945 19152 1304 32883 100709 211342 263659 296904 171232 153876 75450
10190G5450m5656L8765n3541L5078R4483R7774N4815n2919q9931j66324m5231
$$ 75450 29794 68559 15018 50096 144579 242353 297168 244249 154318 -12006 -57237
10179e7237P9164Q0056P9223j3197K6742k720o0666J23433l8257j21361r9041
$$ -57237 21927 101983 181206 168009 194751 192031 131365 254798 216541 95180 -3861
10168c861L7635J07086J94218j22448j15980p8817P3188J8823p808Q0663r2158
$$ -3861 33774 140860 335078 212630 96650 17833 91021 109844 102036 182699 90541
10157I0541p8847M0140J5083m4979o2888K5251J02518M4622l4555O3131N868p8358
$$ 90541 11694 51834 66917 21938 -40950 -15699 86819 131441 96886 160017 165885 87527
10145H7527J29711k1057m6545L0228L6563L7424r3274j1280N1346K4475k6463
$$ 87527 217238 196181 149636 179864 216427 253851 160577 149297 200643 225118 198655
10134A98655q3946K1737j7793m8436k885m5616J1223J6310j01997K3343K4651
$$ 198655 114709 136446 118653 70217 67332 21716 32939 49249 -52748 -29405 -4754
10123d754J24635K3057l3616M030k4631o0183k6224k811N4339k1017n0335L5573
$$ -4754 119881 142938 109322 113352 88721 28538 2314 -497 53842 32825 -17510 18063
10111A8063o7475K3601P0114J620n3534N700P2287m9473p4215J4675O1421m7997
$$ 18063 -49412 -25811 44303 45923 -7611 -1911 70376 20903 -53312 -38637 22784 -25213
10099b5213K7010M1301l5340k5829M6206o0099j9382j309J47744p339K672J04289
$$ -25213 1797 43098 7758 -18071 28135 -31964 -51346 -52655 95089 87750 90422 194711
10087A94711Q2201k2880m4527q5608j42586q2006J57236R785O257L553K5970m1439
$$ 194711 276912 254032 209505 123897 -18689 -100695 56541 66326 72583 76136 102106 60667
10075F0667k7256j04338j60675M9865L4421J02890J07026P7506L8235R6036m2563
$$ 60667 33411 -70927 -231602 -181737 -147316 -44426 62600 140106 178341 274377 231814
10064B31814k9252O801M5853J0040k9490P3104j8741r4268o0646n8030K2195R4730
$$ 231814 202562 209363 255216 265256 235766 308870 290129 195861 135215 77185 99380 194110
10052A94110k2354N0325J81561J62928J08922L52918N61210P07912P53191N20532
$$ 194110 171756 222081 403642 566570 675492 1028410 1589620 2297532 3050723 3571255
10042C571255n23685j024618p09170l65832j83488l5813j28507k18349j9249p1325
$$ 3571255 3047570 2022952 1313782 947950 764462 728649 600142 381793 362544 291219
10032B91219K1996k6168j15277L3672P8321P615K3679q9191N665p767k8521M6107
$$ 291219 313215 287047 171770 205442 283763 291378 315057 225866 231531 223764 195243 241350
10020B41350N7174j45065j01769O0016L1869K7261k4377r3461J64878Q8751k503
$$ 241350 298524 153459 51690 111706 143575 170836 146459 52998 217876 306627 304124
10009C04124o8747l834j14335L5679o9912K0146M6405p9029j53256J02537J66143
$$ 304124 235377 231543 117208 152887 82975 103121 149526 70497 -82759 19778 185921
9998A85921R0680q3117K4727J1084o0199R081R610M9812J30749K043L0222j17466
$$ 185921 276601 193484 218211 229295 169096 178177 187787 237599 368348 370391 400613 283147
9986B83147j42534j27352J9023J15454l422k2282k1405m7406l9671o0960r861
$$ 283147 140613 13261 32284 147738 144316 122034 100629 53223 13552 -47408 -57269
9975e7269K2849Q3855J20445r49M8273O40j11072k19815o253J50361N8889l1866
$$ -57269 -34420 49435 169880 168931 217204 217844 106772 -113043 -119296 31065 89954 58088
9963E8088N173M3551j64553l0242k0450p94J28426Q1025O0243m0085k6290J57599
$$ 58088 63261 106812 -57741 -87983 -108433 -109227 19199 100224 160467 120382 94092 251691
9951B51691p4907j4492l0658m8606j15072O3557J84577j8245j50225j59051N4414
$$ 251691 176784 162292 131634 83028 -32044 31513 216090 197845 47620 -111431 -57017
9940e7017J00213K4931o1604M5185R0669o438j20059M3324P0793N347j2099l7934
$$ -57017 43196 68127 6523 51708 142377 135939 15880 59204 129997 135344 123245 85311
9928H5311Q02J480J7475j2339q6113Q1423L1021k1394r9618J4591Q069R754J17855
$$ 85311 86113 87593 105068 92729 6616 88039 119060 97666 -1952 12639 20708 30462 148317
9915A48317R867k8109j49188m8288O4783L0038L1538p7008l6786p4157J02178
$$ 148317 158184 130075 -19113 -67401 -2618 27420 58958 -18050 -54836 -128993 -26815
9904b6815J04047J06720J43175J08096r6611n9352r4861j8094j32322l6444O6114
$$ -26815 77232 183952 327127 435223 338612 279260 184399 166305 33983 -2461 63653
9893F3653P9173P4731M2930j1399M0535j26081j15767j0439m3291j2976J0498
$$ 63653 142826 217557 260487 249088 289623 163542 47775 37336 -5955 -18931 -8433
9882h433J271M0592M6086n5006m4548M396R7783M2508l3357P8024L127o8495o3068
$$ -8433 -7162 33430 79516 24510 -20038 -15642 82141 124649 91292 169316 172443 103948 40880
9869D0880k1083l1515K1654J3469m8194M219j09200k7563J02302K7464n9980J2440
$$ 40880 19797 -11718 9936 23405 -24789 -20570 -129770 -157333 -55031 -27567 -87547 -75107
9857g5107P4464R4704l4720J7909O333P3747J5538J7767K0691j07399l5846n0907
$$ -75107 -643 94061 59341 77250 83583 157330 172868 190635 211326 103927 68081 17174
9845A7174O6529L3702O1296n1304q9056j48284o460K4231M5418j2565k1521j508
$$ 17174 83703 117405 178701 127397 38341 -109943 -116403 -92172 -46754 -59319 -80840 -82348
9833h2348k018P5454J30051Q7530o4264p5099j22284p1114j18865q0098J50551
$$ -82348 -84366 -8912 121139 208669 144405 69306 -52978 -124092 -242957 -323055 -172504
9822a72504J45140k2446q077J6514j20448j92407Q9880J58749J22391l5702q7005
$$ -172504 -27364 -49810 -57887 -41373 -161821 -354228 -264348 -105599 16792 -18910 -105915
9811a05915J888k4622K9493R2433P7309K6490n9916M205l498j43295J41635R9743
$$ -105915 -104027 -128649 -99156 -6723 70586 97076 37160 41365 37867 -105428 36207 135950
9799A35950P1155J7759j02445m2569N387R5986j35608O529k9647M0429r2665k3877
$$ 135950 207105 224864 122419 79850 85237 181223 45615 52144 22497 62926 -29739 -53616
9787e3616k7181l5809K0447J11005J20165L7270k8954j37139M2567J714N5995
$$ -53616 -80797 -116606 -96159 14846 135011 172281 143327 6188 48755 50469 106464
9776A06464o0454J8025j390m0856m982j8854q2292m360P8386L8013j20334p8180
$$ 106464 46010 64035 62645 21789 16807 -2047 -84339 -88699 -10313 27700 -92634 -170814
9764a70814L734Q4068O9747J5319L3044O5632m5782l3520m7039J8138M9819q680
$$ -170814 -167080 -83012 -13265 2054 35098 100730 54948 21428 -25611 -7473 42346 33666
9752C3666j92134L5861M001j1801J11625n0674p0198J18680M316L7605J7030L599
$$ 33666 -158468 -122607 -118606 -130407 -18782 -69456 -139654 -20974 -16658 20947 37977 41576
9740D1576p584O0771J29144l4316j16185M3613N8607M4535m6850J9494m1357j30353
$$ 41576 33992 94763 223907 189591 73406 117019 175626 220161 173311 192805 151448 21095
9728B1095l5268J17646r6951j04867J6902J13016R5189K2766j6424M6518j29329
$$ 21095 -14173 103473 6522 -98345 -81443 31573 126762 149528 133104 179622 50293
9717E0293p2194j38758K8740J42782Q1474L861n2322l8125m2262r1013Q5416Q7027
$$ 50293 -21901 -160659 -131919 10863 92337 96198 43876 5751 -36511 -127524 -42108 44919
9705D4919K1253M8947o067j4895j42066l1247m394j659j0936J3526j8388l0849
$$ 44919 66172 115119 109052 94157 -47909 -79156 -83550 -85209 -96145 -82619 -101007 -131856
9693a31856J0448K1427J39335p773m1243M6555L1984L2141o053q2676q1014K62
$$ -131856 -121408 -99981 39354 31581 -9662 36893 68877 101018 94965 12289 -68725 -68463
9681f8463J96072J6384r2217p3576N2741K891k2425P6049J03873j2085k08205
$$ -68463 127609 143993 51776 -21800 30941 33832 11407 87456 191329 179244 -28961
9670b8961o0027J41835o4893R4757j705R096m9731r1847r6342L9608l6739N276
$$ -28961 -88988 52847 -12046 82711 81006 90102 40371 -51476 -147818 -108210 -144949 -139673
9658a39673R1662R9524J28264l2440j40948p3969P6464L4013l7143M376j5626
$$ -139673 -48011 51513 179777 147337 6389 -67580 8884 42897 5754 10130 -5496
9647e496o5614P6021l4731P4779P4961j1999j20289K9874j18151q8259J0980J58520
$$ -5496 -71110 4911 -29820 44959 119920 107921 -12368 17506 -100645 -188904 -177924 -19404
9635a9404J9364o516L2746J45747O1709K4332p0362q6372k2465R9344J7926p1717
$$ -19404 -40 -6556 26190 171937 233646 257978 187616 101244 78779 178123 196049 124332
9623A24332o8316k9963L5812J05242K2995k8226n1019l3998J0702l0K1032j26906
$$ 124332 56016 26053 61865 167107 190102 161876 110857 76859 87561 87531 108563 -18343
9611a8343j04900J04853L1093P1822M7891K5140m2517j3954q1816j9346j19562
$$ -18343 -123243 -18390 12703 84525 132416 157556 115039 101085 19269 -77 -119639
9600a19639P3605j2858J611K429q7374K0195P3426l066K5925O4041r1556j2408
$$ -119639 -46034 -58892 -57281 -54852 -142226 -122031 -48605 -51671 -25746 38295 -53261 -65669
9588f5669J40658N1419m3387j17572K9267L0550j30619Q5652J24604j2888r7386
$$ -65669 74989 126408 83021 -34551 -5284 25266 -105353 -19701 104903 92015 -5371
9577e371J0279J06618J8153O1725j22348m6246J06265m3109j05791K8663O8763
$$ -5371 4908 111526 129679 191404 69056 22810 129075 85966 -19825 8838 77601
9566G7601k9830k3804N7459Q0554N4447k7505l3463K4049P314j2662n2982r0531
$$ 77601 47771 23967 81426 161980 216427 188922 155459 179508 186822 174160 121178 30647
9554C0647k1037O539K220o087N9663J30772N9824j57016k88551p8275J05821J45981
$$ 30647 9610 16149 18369 12282 71945 202717 262541 105525 -183026 -261301 -155480 -9499
9542i499P7864n9203n718K1952N8862J42662K5q4908j19974q6423N7403M4210
$$ -9499 68365 9162 3444 25396 84258 226920 226945 142037 22063 -64360 -6957 37253
9530C7253K1778l331n774r4052J630k1142J8028M8843q1597L4439O0558P6996
$$ 37253 59031 55700 49926 -44126 -42496 -63638 -45610 3233 -78364 -43925 16633 93629
9518I3629K1569p5456r1341J14220J23064j142m8373q8532l4539P462j4933j36413
$$ 93629 115198 39742 -51599 62621 185685 184543 136170 47638 13099 20561 5628 -130785
9506a30785P5656l322n170j03069o6620p49K6863J86681O4385R331M0374J8664
$$ -130785 -55129 -58451 -63621 -166690 -233310 -234059 -207196 -20515 43870 53201 93575 112239
9494A12239L940j2924j27725O122m8733p7451P9545O4302O2634K8100n7380r5762
$$ 112239 116179 103255 -24470 -18348 -67081 -144532 -64987 -685 61949 90049 32669 -63093
9482f3093q0508L1880J54234N7423r0670k5651M3854j4061n5879j863Q5468J0176
$$ -63093 -143601 -111721 42513 99936 9266 -16385 27469 13408 -42471 -44334 41134 51310
9470E1310M3921o9609k5417O4531l8303O6521P3397q1005m5714n7469Q9861N7094
$$ 51310 95231 25622 205 64736 26433 92954 166351 85346 39632 -17837 72024 129118
9458A29118m8969J9051l6094j11317n8716R7822J26746m5124k9655J40339J6512
$$ 129118 80149 99200 63106 -48211 -106927 -9105 117641 72517 42862 183201 199713
9447A99713j18296j29686n8680J3303J9229m3542J8697k2300K327L7927Q3433
$$ 199713 81417 -48269 -106949 -93646 -74417 -117959 -99262 -121562 -119235 -81308 2125
9436B125J01885M7578j16959m3010p338J11458j7898o1733k2464k0968J9366P4060
$$ 2125 104010 151588 34629 -8381 -15719 95739 77841 16108 -6356 -27324 -7958 66102
9424F6102O9519J888j7250M1468K5588L003r8011j00358O7325J3655L6207O2693
$$ 66102 135621 137509 120259 161727 187315 190318 92307 -8051 59274 72929 109136 171829
9412A71829M4226j2074N1840j6741r2775n6099K7619J27185k6091k19877k9680
$$ 171829 216055 203981 255821 239080 146305 90206 117825 245010 218919 -958 -30638
9401c0638N6890k5276L9102L4445j0090Q4123J02860Q766p6248j3121n9561o6845
$$ -30638 26252 976 40078 74523 64433 148556 251416 260182 183934 170813 111252 44407
9389D4407p8780l4989L4363R1743J13028J07502l360P9556l145n4560m4497n7165
$$ 44407 -34373 -69362 -34999 56744 169772 277274 273914 353470 350325 295765 251268 194103
9377A94103q6716j70016P6275P0731n4417J8729p9581j12198J0069O6701J63121
$$ 194103 107387 -62629 13646 84377 29960 48689 -30892 -143090 -133021 -66320 96801
9366I6801M8186j0304L9164R7523J06848J0231Q307p3533o9684q7521j05455n8284
$$ 96801 144987 134683 173847 271370 378218 388449 396756 323223 253539 166018 60563 2279
9354B279O3440J12309Q4837J14367l9400l3630l844q4680m9391M2839R5764O9994
$$ 2279 65719 178028 262865 377232 337832 304202 300358 215678 166287 209126 304890 374884
9342C74884L1462M4642k0233k6381m913L7184p761l2243p2009m7939J83781N8575
$$ 374884 406346 450988 430755 404374 399461 436645 428884 396641 324632 276693 460474 519049
9330E19049m7972M294J13316K2042J1215j2386j14353J5157K8234N0373n3437
$$ 519049 471077 475371 588687 610729 621944 609558 495205 510362 538596 588969 535532
9319E35532N6906R0058J3692p3780k2177N7704J02707N3531N6547R3798J43973
$$ 535532 592438 682496 696188 622408 600231 657935 760642 814173 870720 964518 1108491
9308A108491J04332L3379o0733n6055P426J09459K1827R2783P279K390J47125
$$ 1108491 1212823 1246202 1185469 1129414 1136840 1246299 1268126 1360909 1368188 1370578 1517703
9297A517703Q9859O508O5005J00664K41480J58795Q6325J12520J62409L44350
$$ 1517703 1607562 1614070 1679075 1779739 2021219 2180014 2266339 2378859 2541268 2885618
9287B885618K33857K04142L05739J84110L32583M38628M03537K49507J21773K44119
$$ 2885618 3119475 3323617 3629356 3813466 4146049 4584677 4988214 5237721 5359494 5603613
9277E603613L50499P00516O47505N45310O33351P38206N90787M70764M66539O28554
$$ 5603613 5954112 6654628 7302133 7847443 8480794 9219000 9809787 10280551 10747090 11375644
9267A1375644L89492J85304K16872O0346n0678j95010l19644l21836k43801m57232
$$ 11375644 11765136 11950440 12167312 12227658 12176980 11981970 11662326 11340490 11096689 10639457
9257A0639457l87355k98501l83285m86426m24466m21888n18104n46432l89032
$$ 10639457 10252102 9953601 9570316 9083890 8659424 8237536 7719432 7173000 6783968
9248F783968l61627l61916k48531k67694j57512j22761j63238k10193l43494j93554
$$ 6783968 6422341 6060425 5811894 5544200 5386688 5263927 5100689 4890496 4547002 4353448
9238D353448j30375j59349k57822j14002o8491k7588j8402j87865j90174j28375
$$ 4353448 4223073 4063724 3805902 3691900 3623409 3595821 3577419 3389554 3199380 3071005
9228C071005j25894j09097o9185P7144K3040j10473p301p6740k88864r4592j1151
$$ 3071005 2945111 2836014 2766829 2843973 2867013 2756540 2749239 2672499 2383635 2289043 2277892
9217B277892O311j20790j20704n2218o2426L4489J52397n5198l1985j36412j05878
$$ 2277892 2284203 2163413 2042709 1990491 1928065 1962554 2114951 2059753 2027768 1891356 1785478
9206A785478r0783p5591j11905l8993q3798K8044l7966j28551J0860P0016J5169
$$ 1785478 1694695 1619104 1507199 1468206 1384408 1412452 1374486 1245935 1256795 1326811 1341980
9195A341980j20206l6438L6745L252J56167M2984p0845j60720m6539J05900j3979
$$ 1341980 1221774 1185336 1222081 1225333 1381500 1424484 1353639 1192919 1146380 1252280 1238301
9184A238301j39660J4994r557j20169Q0483J06629n1512k2396l930j30417r0429
$$ 1238301 1098641 1113635 1104078 983909 1064392 1171021 1119509 1097113 1093183 962766 872337
9173H72337N3046N5412o5368j00768j7432j9168o7402n1509K9634J64237R5910
$$ 872337 925383 980795 915427 814659 797227 778059 710657 659148 688782 853019 948929
9162I48929j84899j57183L0042J26482p8611J1899P2577l1653j54730j9964J07441
$$ 948929 764030 606847 636889 763371 684760 696659 769236 737583 582853 562889 670330
9151F70330k1988m9015P1565j00944L9037J07831j77502j16864Q354J10041k3933
$$ 670330 648342 599327 670892 569948 608985 716816 539314 422450 430804 540845 516912
9140E16912p3511L7178K3140m8994n3669l3236m7509M0840K8463M9399J24445
$$ 516912 443401 480579 503719 454725 401056 367820 320311 361151 389614 439013 563458
9129E63458J4093p1699L174l9419k0451L6840n4101J5626r6523n1387P6379o1594
$$ 563458 577551 505852 509026 469607 449156 485996 431895 447521 350998 299611 375990 314396
9117C14396l0857O4461M8534m0382N4317R364j10183k516J20647Q6984j867j91795
$$ 314396 283539 348000 396534 356152 410469 419833 309650 307134 427781 514765 512898 321103
9105C21103m0495L1400J3130J2999j3998M5367K1064o5804m7237R2521J5361p6328
$$ 321103 280608 312008 325138 338137 324139 369506 390570 324766 277529 370050 385411 309083
9093C09083k4881j1973K42j3591j97128j1017J58394K2467j961N6415P246p575
$$ 309083 284202 272229 272471 258880 61752 50735 209129 231596 229635 286050 293296 285721
9081B85721P9428J1212R114j12814J2447R1290M3056p6276j44181m3706M1184
$$ 285721 365149 376361 385475 272661 285108 376398 419454 343178 198997 155291 196475
9070A96475K0885o0597j2700Q165M393J0427j6588J9011j24916j4974r405j07960
$$ 196475 217360 156763 144063 152228 156621 167048 150460 169471 44555 29581 20176 -87784
9058h7784M3592Q7936o142p2512P5857J2120Q9454J26023M2404L7372p6318j00566
$$ -87784 -44192 43744 37602 -34910 40947 53067 142521 268544 310948 348320 272002 171436
9046A71436q2242N0142J7091J3512N1814l8891n1448o0625Q9055j6599J34178
$$ 171436 89194 139336 156427 169939 221753 182862 131414 70789 159844 143245 277423
9035B77423j11779j55621j01187N8987J22228R294o8514O5121Q8102o407q7669
$$ 277423 165644 10023 -91164 -32177 90051 99345 30831 95952 184054 177647 89978
9024H9978o622L6277j8082o9893l4890J01590O0786l4065k7601o1216N7482K9454
$$ 89978 83356 119633 101551 31658 -3232 98358 159144 125079 97478 36262 93744 123198
9012A23198p0885j04428m108M4391Q4446P6543M8281j4564m060j7249L351k0313
$$ 123198 52313 -52115 -56223 -11832 72614 149157 197438 182874 178814 161565 164916 144603
9000A44603l7855n1066n0239p529K6906J2183q1668K0759J0746r4557o5246P4820
$$ 144603 106748 55682 5443 -2086 24820 37003 -44665 -23906 -13160 -107717 -172963 -98143
8988i8143M862M2682j1112J79950P4459k2974N242m4422k08513l7897L972O5205
$$ -98143 -93281 -50599 -61711 118239 192698 169724 174966 130544 -77969 -115866 -111894 -46689
8976d6689J9635Q0172j5280J6392j41652p503o2274r4758R7840R6462K6744j0025
$$ -46689 -27054 53118 37838 54230 -87422 -94925 -157199 -251957 -154117 -57655 -30911 -40936
8964d0936j9703J2661N4578R9758N3327k4726l9659p8050r1817K7918M3843M8607
$$ -40936 -60639 -47978 6600 106358 159685 134959 95300 17250 -74567 -46649 -2806 45801
8952D5801P6163p829j00423k3394J74497p703m1397p9971J2966L0401M5932L0390
$$ 45801 121964 114135 13712 -9682 164815 157112 115715 35744 48710 79111 125043 155433
8940A55433P0757k1593N9046j1682j77050j24433R463M3642J4712n5242L393R0708
$$ 155433 226190 204597 263643 251961 74911 -49522 -40059 3583 18295 -36947 -33554 57154
8928E7154k864j00666M3302m3823M0097k2523j40839k5502Q6598O2500J22853
$$ 57154 54290 -46376 -3074 -46897 -6800 -29323 -170162 -195664 -109066 -46566 76287
8917G6287J05429l5339m5159O9567l7988j09782N3538m345j1049O437J41895m9020
$$ 76287 181716 146377 101218 170785 132797 23015 76553 72208 61159 67596 209491 160471
8905A60471r0978r7931k2541O4522J4907n9600K1488K5077K4519M07P5610L1818
$$ 160471 69493 -28438 -50979 13543 28450 -31150 -9662 15415 39934 40341 115951 147769
8893A47769p8417K0988l4516j44016J321K3520P0013Q3418J16035j26012n3690
$$ 147769 69352 90340 55824 -88192 -86871 -63351 6662 90080 206115 80103 26413
8882B6413J7598J02158K6850m2454j05232L9582J20307K4445J5835J12116j4635
$$ 26413 44011 146169 173019 130565 25333 64915 185222 209667 225502 337618 322983
8871C22983q3746j6795J2909o6425n2536j27932r2237j43162R6377J29011q9276
$$ 322983 239237 222442 235351 168926 116390 -11542 -103779 -246941 -150564 -21553 -110829
8860a10829K8938P7152Q5273O9050k8867j28076j13867Q2943J39229P8805O2148
$$ -110829 -81891 -4739 80534 149584 120717 -7359 -121226 -38283 100946 179751 241899
8849B41899j35873j46086M417l4859n1802L584K1087P5327n7071o7455P0575K4234
$$ 241899 106026 -40060 -35643 -70502 -122304 -118720 -97633 -22306 -79377 -146832 -76257 -52023
8837e2023j1563L4117O0485k6524J8954N9908P829k1110q2385J41383J24779r7980
$$ -52023 -63586 -29469 31016 4492 23446 83354 91183 70073 -12312 129071 253850 155870
8825A55870k9N3127l7233K3329J0328p4148M6439M0739Q9695q5484r4660k910
$$ 155870 155841 208968 171735 195064 205392 131244 177683 218422 308117 222633 127973 125063
8813A25063R055M3800j01613q0192O6645J08100j0768j88273m4882j4711K1621
$$ 125063 134118 177918 76305 -3887 62758 170858 160090 -28183 -73065 -87776 -66155
8802f6155J1648J2575M1790R7101j09115l8849L3671j02792p4911J01844J65729
$$ -66155 -54507 -41932 -142 96959 -12156 -51005 -17334 -120126 -195037 -93193 72536
8791G2536l6791M6984L1459p3012r2984Q0374J03914K0801M2273m3434O7992m8829
$$ 72536 35745 82729 114188 41176 -51808 28566 132480 153281 195554 152120 220112 171283
8779A71283j55230J7050Q6177K5958k3001P3523J65237Q848j70506k37272J5256
$$ 171283 16053 33103 119280 145238 122237 195760 360997 369845 199339 -37933 -22677
8768b2677k0669m8309n3385J30974J50549j64688m9708k3696L1240K3158Q381
$$ -22677 -43346 -91655 -145040 -14066 136483 -28205 -77913 -101609 -70369 -47211 -38830
8757c8830K604L2968L7246K1496k7934Q4882p858j94661J08318J40347L8576M2755
$$ -38830 -36226 -3258 33988 55484 27550 112432 104574 -90087 18231 158578 197154 239909
8745B39909r2074l6260k6253o7558o0781L591o273Q1622Q6000n0433m9969N4181
$$ 239909 147835 111575 85322 17764 -43017 -39426 -45699 35923 121923 71490 21521 75702
8733G5702P1913K1675R139k4643M4308m7985k0124j74908P2908O8456J21980j7327
$$ 75702 147615 169290 178429 153786 198094 150109 129985 -44923 27985 96441 218421 201094
8721B01094j45670q3537K2435R4886K1464Q8705M5879n6690L7593k0780l8030
$$ 201094 55424 -28113 -5678 89208 110672 199377 245256 188566 226159 205379 167349
8710A67349q5782j69729m0801N2564m3497m2811O7998M7821J34693M0507J6416
$$ 167349 81567 -88162 -128963 -76399 -119896 -162707 -94709 -46888 87805 128312 144728
8699A44728r0454j6069N9547J50282R8573j02076j1814K5094l6966k9481j34246
$$ 144728 54274 38205 97752 248034 346607 244531 232717 257811 220845 191364 57118
8688E7118K8062l6569m7956N206J8061K8397j8303K1733Q7293J3776m2831o4973
$$ 57118 85180 48611 655 5861 23922 52319 34016 55749 143042 156818 113987 49014
8676D9014m7855R1983k5747J2498Q6914m3164J5993M6828j33700j05403R6558
$$ 49014 1159 93142 67395 79893 166807 123643 139636 186464 52764 -52639 43919
8665D3919J11706K4736m8492q7402m86P1946k4357n2492K7944N665j1201L709
$$ 43919 155625 180361 131869 44467 43981 115927 91570 39078 67022 72687 61486 65195
8653F5195n286n6747M0026O5613n7087N1542K8482j14721j57263O0947J17467
$$ 65195 59909 3162 43188 108801 51714 103256 131738 17017 -140246 -79299 38168
8642C8168Q0872K8953n6459M3533R844K4426l0850k4214q3446m2374J4554j746
$$ 38168 119040 147993 91534 135067 144911 169337 138487 114273 30827 -11547 3007 1261
8630A261J8828m317K7351n0013j90675k7592J6774L0396J13431O9047k3484n2727
$$ 1261 20089 15772 43123 -6890 -197565 -225157 -208383 -177987 -64556 4491 -18993 -71720
8618g1720m3560N167j2110n840K4455J4143J20700J8526M2128J18681l9399l9535
$$ -71720 -115280 -110113 -122223 -128063 -103608 -89465 31235 49761 91889 210570 171171 131636
8606A31636J05411L7886k00464o8006m9377L2314J2709k0572M5412J24902K5193
$$ 131636 237047 274933 74469 6463 -42914 -10600 2109 -18463 26949 151851 177044
8595A77044n1836o5156Q8792J9433o5029m6922k3495O7931J2369N6195j56331
$$ 177044 125208 60052 148844 168277 103248 56326 32831 100762 113131 169326 12995
8584A2995q0821M5036J28824K2289m0055j04998L9326J82792m0551m8430j04636
$$ 12995 -67826 -22790 106034 128323 88268 -16730 22596 205388 164837 116407 11771
8573A1771R0615P629n9129Q4595J2624J718J590o7554l6067r882o2262o855J78189
$$ 11771 102386 110015 50886 135481 148105 149823 151413 83859 47792 37910 -24352 -31207 146982
8560A46982j2246J5599L3590j46732n7802j6027J217K6201l2294n7243j52836
$$ 146982 134736 150335 183925 37193 -20609 -36636 -35419 -9218 -41512 -98755 -251591
8549b51591j2653J12238J54063J18126J1831L1917p4055r5539o8867N7866m9743
$$ -251591 -264244 -152006 2057 120183 132014 163931 89876 -5663 -74530 -16664 -66407
8538f6407P9688P2664p4356j29708R8077J52351J70946q436j32979j07034l8757
$$ -66407 13281 85945 11589 -118119 -20042 132309 303255 294819 161840 54806 16049
8527A6049j15897N9844J66092J1749o3709m2945O0541O764J36326k457q2536L534
$$ 16049 -99848 -40004 126088 137837 74128 31183 91724 98488 234814 232357 149821 153355
8515A53355k4091q102k5984r9751k5761N0491N5243j05441j2716O7096N0742P6348
$$ 153355 129264 121162 95178 -4573 -30334 20157 75400 -30041 -42757 24339 75081 151429
8503A51429j9470k0681P5655l1326k39132j62447M0460J19562Q6245K0143j03942
$$ 151429 131959 111278 186933 155607 -83525 -245972 -205512 -85950 295 20438 -83504
8492h3504R5880j8609j44635J13998J18861N5433M9159P7j68133n576r213L8341
$$ -83504 12376 -6233 -150868 -36870 81991 137424 186583 186660 18527 12951 3738 42079
8480D2079Q7398J78399m7153q9144j0535q1879n1961J1986O5893R2994j3611m1825
$$ 42079 129477 307876 260723 171579 161044 79165 27204 39190 105083 198077 184466 142641
8468A42641r8866j3557P9778L8264J7980L6517j21339M826m345K0253J9383j0735
$$ 142641 43775 30218 109996 148260 166240 202757 81418 86244 81899 102152 121535 110800
8456A10800m8786L7301L3682o3169M380q4878O2566J74996k3838j985l3923n6382
$$ 110800 62014 99315 132997 69828 74208 -10670 51896 226892 203054 201069 167146 110764
8444A10764r8959j6108K9823j0164J48492j6561q3936J49220o9603j81172m754
$$ 110764 11805 -4303 25520 15356 163848 147287 63351 212571 142968 -38204 -42958
8433d2958O1620O0944K5735K03109L0212q1198r1585p2681j55169r5228J54376
$$ -42958 18662 79606 105341 308450 338662 257464 165879 93198 -61971 -157199 -2823
8422b823J24779K2575j21227k2292N1861J53257n9111m3258m1958j1395J6154
$$ -2823 121956 144531 23304 1012 52873 206130 147019 103761 61803 50408 66562
8411F6562R831N233m839L0427R0779o4284n9093N2987q8934m0511J10389R5389
$$ 66562 76393 81626 76787 107214 197993 133709 74616 127603 38669 -1842 108547 203936
8399B03936o305q0586m3125o3379r3160J8358L0858P5722m2896M1343j5461k6116
$$ 203936 197631 117045 73920 10541 -82619 -64261 -33403 42319 -577 40766 25305 -811
8387h11K111l9893Q2208L1809j32982Q0407J54349m2078j98012m8834O502j05739
$$ -811 1300 -38593 43615 75424 -57558 22849 177198 135120 -62892 -111726 -105224 -210963
8375b10963n20J66271J24445j47403m8744k9446K6443k9060J4387J12055l6520
$$ -210963 -211483 -45212 79233 -68170 -116914 -146360 -119917 -148977 -134590 -22535 -59055
8364e9055L833J3806L689J07506m4997m0900r5204l915m8556J24869J39960J0379
$$ -59055 -55222 -41416 -37727 69779 24782 -16118 -111322 -115237 -163793 -38924 101036 111415
8352A11415o3608r8424o4284K6685n8327L2266R7087k3748J0382l8892M5689Q2354
$$ 111415 47807 -50617 -114901 -88216 -146543 -114277 -17190 -40938 -30556 -69448 -23759 58595
8340E8595M5311j34672p4959M1699Q5381J14393M114k0799P451o3712n4376j6224
$$ 58595 103906 -30766 -105725 -64026 21355 135748 139862 119063 126514 62802 8426 -7798
8328g798m3309P5401k8757M5820l1251r2844N1077M8355l6955L8880j14315r67
$$ -7798 -51107 24294 -4463 41357 10106 -82738 -31661 16694 -20261 18619 -95696 -96663
8316i6663O0723l3804M3291J84933J1334q7519l7511j9239K188r2733k1620j1347
$$ -96663 -35940 -69744 -26453 158480 169814 82295 44784 25545 27733 -65000 -86620 -97967
8304i7967J36987J5652M3234J6852r1964n2954J39M7210o078m731J21436j07450
$$ -97967 39020 54672 97906 114758 22794 -30160 -30021 17189 11111 6380 127816 20366
8292B0366L4002k4423L2755m3812n2343n5043K5596P2402m848N3327Q1047j51253
$$ 20366 54368 29945 62700 18888 -33455 -88498 -62902 9500 4652 57979 139026 -12227
8280a2227Ql9179k8354n8482J3086P5447q6426j0753N4775J7756J3685N6001k7182
$$ -12227 -12219 -51398 -79752 -138234 -125148 -49701 -136127 -146880 -92105 -74349 -60664 -4663 -31845
8267c1845o7714O072J22341K0865p5480k4261l8414k4896m589M7161M0368L8654
$$ -31845 -99559 -93487 28854 49719 -25761 -50022 -88436 -113332 -117921 -70760 -30392 8262
8255H262j6833L6982n29k7053J3783k9656r473R8509l0191J1938N961q2105l007
$$ 8262 -8571 28411 27882 829 14612 -15044 -24517 73992 43801 55739 61700 -20405 -23412
8242b3412N5192J5695p3242j063N7500m6600q5569M1632m6229M8250M8788k9615
$$ -23412 31780 47475 -25767 -26830 30670 -15930 -101499 -59867 -106096 -57846 -9058 -38673
8230c8673N5030O5332j13723L469M2787O2861o9913L0592l2665N144m316j1721
$$ -38673 16357 81689 -32034 -28565 14222 77083 7170 37762 5097 10241 5925 -5796
8218e796J37268O2353Q7481M4384m9846p9745j19573k58088j21439N9259J12963
$$ -5796 131472 193825 281306 325690 275844 196099 76526 -181562 -303001 -243742 -130779
8207a30779J08820K7555l0610r550M6422K0793k2676j0090O794N4291j7960R4612
$$ -130779 -21959 5596 -25014 -34564 11858 32651 9975 -115 6679 60970 43010 137622
8195A37622j12735J7671J01009q476K1110M7392j04137o5369k5434P7300j770
$$ 137622 24887 42558 143567 135091 156201 203593 99456 34087 8653 85953 84183
8184H4183j5140k1366N0681M4512n7815k0437l0407l0348O4965j2612j14594q6304
$$ 84183 69043 47677 98358 142870 85055 64618 34211 3863 68828 56216 -58378 -144682
8172a44682m4611Q4414J41220q873l8675R557J20410O0874k663J7122l0736j42790
$$ -144682 -189293 -104879 36341 27468 -11207 -1650 118760 179634 176971 194093 163357 20567
8160B0567j28880K5124n7923j09928l5589O9909J12429p9688Q0423J93914N9775
$$ 20567 -108313 -83189 -141112 -251040 -286629 -216720 -104291 -183979 -103556 90358 150133
8149A50133K9649n8885m1349j68934J864K7343J5920j65889N8798N5352J11835
$$ 150133 179782 120897 79548 -89386 -87522 -60179 -44259 -210148 -151350 -95998 15837
8138A5837J41281j2881q1788j34811L3076p8441j8810J6451j4412Q8823P1223
$$ 15837 157118 144237 62449 -72362 -39286 -117727 -136537 -120086 -134498 -45675 25548
8127B5548O1248J9594o596j32726r1087j9300k4061Q7903L0417j1880J17221J4460
$$ 25548 86796 106390 99794 -32932 -124019 -143319 -167380 -79477 -49060 -60940 56281 70741
8115G0741j4747q9115M3140j7128O7578J14416j7431p4854j19252j15115J0527
$$ 70741 55994 -33121 10019 -7109 60469 174885 157454 82600 -36652 -151767 -141240
8104a41240P0969l599L0933J5647Q712q5667o8608o4253J7940M1135l2291M5216
$$ -141240 -70271 -73870 -42937 -27290 -18578 -104245 -172853 -237106 -219166 -178031 -210322 -165106
8092a65106j680O996M2433J39236K1900j22839l1459J5590N5431J06106j3608
$$ -165106 -166786 -159790 -117357 21879 43779 -79060 -110519 -94929 -39498 66608 53000
8081E3000j4644M3549k4035n2139q1354K737P8669m2213P1805P06N2739K8016
$$ 53000 38356 81905 57870 5731 -75623 -72886 5783 -36430 35375 36081 88820 116836
8069A16836r3174p7631J3923J83345j064j10817n9937J6556M4518k0133j5364
$$ 116836 23662 -53969 -40046 143299 142235 31418 -28519 -11963 32555 12422 -2942
8058b942N88M6276J5805n3794P2294k5307j3319o164J2134o2185R240P1949k9863
$$ -2942 -2354 43922 59727 5933 78227 52920 39601 33437 45571 -16614 -7374 64575 34712
8045C4712j50502j4299M6815R448J9150J35465M9421j9218j08995q9527j4270
$$ 34712 -115790 -130089 -83274 -73826 -54676 80789 130210 110992 1997 -87530 -101800
8034a01800P6799K9622k603J619l044K3181K4274r073J0089J7987N3821J16341
$$ -101800 -25001 4621 2018 3637 593 23774 48048 38975 49064 67051 120872 237213
8022B37213j16693j88044R7268l4711P801L7154L190r655p9127p3107R251M7629
$$ 237213 120520 -67524 29744 -4967 2834 39988 43178 33523 -45604 -118711 -109460 -61831
8010f1831R7861N0883p127n2287j53724j33222M3457N9956Q2807p0637p5424L8148
$$ -61831 36030 86913 79786 27499 -126225 -259447 -215990 -156034 -73227 -143864 -219288 -181140
7998a81140J62544M4802N4233j440q9265J2747M1599Q803o2621k1918O2638N9530
$$ -181140 -18596 26206 80439 78999 -10266 2481 44080 52883 -9738 -31656 30982 90512
7986I0512o0115j8437l8059N8842Q3907O08j0020j2609L7237k0582J8097q0792
$$ 90512 30397 11960 -26099 32743 116650 117258 107238 94629 131866 111284 129381 48589
7974D8589J3539J02875j05778O8706L3040j39295j68670K9501K6222k0324r5692
$$ 48589 62128 165003 59225 127931 160971 21676 -146994 -117493 -91271 -111595 -207287
7963b07287R6684N649J34195J50804L4003q8041p3882J1120J79638P0767r1291
$$ -207287 -110603 -104954 29241 180045 214048 126007 52125 63245 242883 313650 222359
7952B22359m7162R0006M3675j30682j27610p1364k9438J35930N2469n6635j28366
$$ 222359 175197 265203 308878 178196 50586 -20778 -50216 85714 138183 81548 -46818
7941d6818P9820O3540k7140k2169L8275J38553L6684k9617k6623j13026r1549
$$ -46818 33002 96542 69402 47233 85508 224061 260745 231128 204505 91479 -70
7930g0j27309j9524Q852K9099O5368l329J75096J64315j66947o3399p1755L6638
$$ -70 -127379 -146903 -138051 -108952 -43584 -46913 128183 292498 125551 62152 -9603 27035
7918B7035p8829j51499N3518J25242m4335M7633n8751J96968J27964j00800r1545
$$ 27035 -51794 -203293 -149775 -24533 -68868 -21235 -79986 116982 244946 144146 52601
7907E2601j50147l5613J33086R7480J4620j27669l4846N6525P2168O6462j19606
$$ 52601 -97546 -133159 -73 97407 112027 -15642 -50488 6037 78205 144667 25061
7896B5061j27383o3066p3158M5610J11356R3678o6841K8845M4162j7766O3933
$$ 25061 -102322 -165388 -238546 -192936 -81580 12098 -54743 -25898 18264 498 64431
7885F4431O4923m9797o8479J1584L2469l825q0603l1743j14913p765J61635J9172
$$ 64431 129354 79557 11078 22662 55131 51306 -29297 -61040 -175953 -183718 -22083 -2911
7873b911L059J35475q968j22354K6122K6752k2571m8096m7649p907L1831P5781
$$ -2911 148 135623 126655 4301 30423 57175 34604 -13492 -61141 -69048 -37217 38564
7861C8564k0152q5040n3729n6695Q6447N422n6180l8278K9834k8917k8318R1841
$$ 38564 18412 -66628 -120357 -177052 -90605 -85183 -141363 -179641 -149807 -178724 -207042 -115201
7849a15201J59941l0487k0030k2372j07206J9918Q6863Q2854k0971K5652P8196
$$ -115201 44740 14253 -5777 -28149 -135355 -115437 -28574 54280 33309 58961 137157
7838A37157p3997j35026l276Q2293J0868j35327P4826J34962Q1820n8209l9942
$$ 137157 63160 -71866 -75142 7151 18019 -117308 -42482 92480 174300 116091 76149
7827G6149M1274j8031q2787j11703l6596j20992Q2221J69429Q0753m0746o6556
$$ 76149 117423 99392 16605 -95098 -131694 -252686 -170465 -1036 79717 38971 -27585
7816b7585q0437j0178L4337O7656P2238O7086r4436j56715L5338J30482l4568
$$ -27585 -108022 -118200 -83863 -16207 56031 123117 28681 -128034 -92696 37786 3218
7805C218j58413N0902q830Q6848K4916N106q7582J4234p7322J30528P4296L7946
$$ 3218 -155195 -104293 -113123 -26275 -1359 3747 -83835 -69601 -146923 -16395 57901 95847
7793I5847r0557L7586n545Q401M2307k4983p6514K6460O9857j02315q6822m9052
$$ 95847 5290 42876 37331 45732 88039 63056 -13458 13002 82859 -19456 -106278 -155330
7781a55330k8465K4717J79706Q1291K463L3119p1382j5757n5169p9107j42391
$$ -155330 -183795 -159078 20628 101919 104382 137501 66119 50362 -4807 -83914 -226305
7770b26305J48077j1372N9842O6860m7033M1394O6408J07129m5343r5667k7242
$$ -226305 -78228 -89600 -29758 37102 -9931 31463 97871 205000 159657 63990 36748
7759C6748m6027m8062J47454j964q3611J1906n0867m4623m3183K6428J69445J46995
$$ 36748 -9279 -57341 90113 88149 4538 16444 -34423 -79046 -122229 -95801 73644 220639
7747B20639n2095k3002m6283K6332J6627r6801r3942l3147j2j20185k8455J7347
$$ 220639 168544 145542 99259 125591 142218 45417 -48525 -81672 -81684 -201869 -230324 -212977
7735b12977J25424Q4319P4937j968J2238K03085M2277q3530j73576j94874n2525
$$ -212977 -87553 -3234 71703 69735 81973 285058 327335 243805 70229 -124645 -177170
7724a77170J44392Q5856P091o8385o3124o380L9179J66185l0973r167O4229M3772
$$ -177170 -32778 53078 60169 -8216 -71340 -77720 -38541 127644 96671 87504 151733 195505
7712A95505k1031j04155j13710o3873L826K2121J30681L7719l7013j7315O685
$$ 195505 174474 70319 -43391 -107264 -103438 -81317 49364 87083 50070 32755 39440
7701C9440j18585q1344J2044J67931M3357L7028j8112j1577m2224q4987J941J8939
$$ 39440 -79145 -160489 -148445 19486 62843 99871 81759 70182 27958 -57029 -55088 -36149
7689c6149R0701J16989L4908j06368j35234r7009m6983N5663Q201J7642Q0653
$$ -36149 54552 171541 206449 100081 -35153 -132162 -179145 -123482 -115281 -97639 -16986
7678a6986j0370n1015M9533p268r4666k074K3344N9659J17458k2466m3222M6304
$$ -16986 -27356 -78371 -28838 -36106 -130772 -132846 -109502 -49843 67615 45149 1927 48231
7666D8231M0247j01024n6902J10953J03277p3077p8082J32067N6528o9734j16597
$$ 48231 88478 -12546 -69448 41505 144782 71705 -6377 125690 182218 112484 -4113
7655d113Q2664O525L6092J48883j48442j55726n8802J1294M0996O800J144J8324
$$ -4113 78551 85076 121168 270051 121609 -34117 -92919 -81625 -40629 -33829 -32685 -14361
7643a4361l2037q958Q282J4526m271j6940N2858K1887j1636o9376L954J05140
$$ -14361 -46398 -55356 -47074 -32548 -36819 -53759 -901 20986 9350 -60026 -56072 49068
7631D9068m4015M3780J796j51507L5201J3998P6566R6958O7544n8015J9468r2148
$$ 49068 5053 48833 50629 -100878 -65677 -51679 24887 121845 189389 131374 150842 58694
7619E8694N73M1384j46151j4193M302n5004K0183P1796m7218J6616R335j2059
$$ 58694 59267 100651 -45500 -59693 -55391 -110395 -90212 -18416 -65634 -49018 -39683 -51742
7607e1742p9112o1332J88098n9916r6602l8601L379r7102N0780N5540K5483P0992
$$ -51742 -130854 -192186 -4088 -64004 -160606 -199207 -195828 -292930 -242150 -186610 -161127 -90135
7595i0135k3847k8166J38176L4146j24829o7795p396R6618l3375j05610j03750
$$ -90135 -113982 -142148 -3972 30174 -94655 -162450 -169846 -73228 -106603 -212213 -315963
7584c15963J69711K9053J4494J31781q8494J5629M2224N916P021Q6955l8679J6899
$$ -315963 -146252 -117199 -102705 29076 -59418 -43789 -1565 4351 11372 98327 59648 76547
7572G6547M2443J02250l5821p6205l6436m1586M379n1334j07996j05666J25157
$$ 76547 118990 221240 185419 109214 72778 31192 35571 -15763 -123759 -229425 -104268
7561a04268Q2777M2650M3332M106m9151R58j8386j0042J49665l625M0667p0940
$$ -104268 -21491 21159 64491 68597 19446 20404 2018 -8024 141641 138016 178683 107743
7549A07743Q3795k4910r9187o693P7931Q0493m3674o9698j84591q5380M6265o8758
$$ 107743 191538 166628 67441 60748 138679 219172 175498 105800 -78791 -164171 -117906 -186664
7537a86664L7504O1579L3001q1319l3554K1857K5924J70363K6628r9023k8889
$$ -186664 -149160 -87581 -54580 -135899 -169453 -147596 -121672 48691 75319 -23704 -52593
7526e2593O5325J4322P8164J7354j09412r1857m956P6173J7264r3944J9947m2955
$$ -52593 12732 27054 105218 122572 13160 -78697 -83653 -7480 9784 -84160 -64213 -107168
7514a07168J02520m7242p4398n003J1976J3386O1153J00354Q1466p6954q6514
$$ -107168 -4648 -51890 -126288 -131291 -119315 -105929 -44776 55578 137044 60090 -26424
7503b6424k6749l4025K0644p823J31173m71j34556J03283n3406j38423p0449Q3406
$$ -26424 -53173 -87198 -66554 -74377 56796 56325 -78231 25052 -28354 -166777 -237226 -153820
7491a53820q1571P6037N6844J8991m3731n516O8471K2304O7570J7398q1949p7427
$$ -153820 -235391 -159354 -102510 -83519 -127250 -132766 -64295 -41991 25579 42977 -38972 -116399
7479a16399K0448K74L9369K1927P5357J88K5083O1609L5342m7656N113j42395
$$ -116399 -95951 -95677 -56308 -34381 40976 41164 66247 127856 163198 115542 120655 -21740
7467b1740L3229J3277J4427O5148n0587M0940j19830m3301N856J4412L7487K1961
$$ -21740 11489 24766 39193 104341 53754 94694 -25136 -68437 -62581 -48169 -10682 11279
7455A1279k7309K2419Q594r8909J2233J2839m4271R727M5779Q465J06545j9950
$$ 11279 -16030 6389 14983 -83926 -71693 -58854 -103125 -93398 -47619 -39154 67391 47441
7443D7441m4187k2643J04945J03622n9699n5573j96924q873J10232N7130p781
$$ 47441 3254 -19389 85556 189178 129479 73906 -123018 -131891 -21659 35471 27690
7432B7690m8944r0834R7652O5516l8370N2602j06620j7980o0932L8519J41389
$$ 27690 -21254 -112088 -14436 51080 12710 65312 -41308 -59288 -120220 -81701 59688
7421E9688M8431o7520n1672O034j3037R770K0084j8268N4115K3382Q7179N6514
$$ 59688 108119 40599 -11073 -5039 -18076 -8306 11778 -6490 47625 71007 158186 214700
7409B14700j4261j25746j08294n6279n649n0979N6815N6480N4075N1883J10949
$$ 214700 200439 74693 -33601 -89880 -95529 -146508 -89693 -33213 20862 72745 183694
7398A83694J01982r8900j69575k9925o2652K5339P2467J238J06158K1143p3967
$$ 183694 285676 186776 17201 -12724 -75376 -50037 22430 23668 129826 150969 77002
7387G7002J55625k5947r3826p3441K2015j0962m0052p2407l7596O2446J14278
$$ 77002 232627 206680 112854 39413 61428 50466 10414 -61993 -99589 -37143 77135
7376G7135l4573O4976l3182q5297L6784k5797j33898P1483J94825N1839P5181
$$ 77135 42562 107538 74356 -10941 25843 46 -133852 -62369 132456 184295 259476
7365B59476J88r5319n7155J363p5257j6449q7619j56489k2881K42735J58362k5366
$$ 259476 259664 164345 107190 108553 33296 16847 -70772 -227261 -250142 -7407 150955 125589
7353A25589m3602n184j5551j08533n009m4316O3056P3250L872q4035n0784P1001
$$ 125589 81987 76803 61252 -47281 -52290 -96606 -33550 39700 43572 -40463 -91247 -20246
7341b0246J51078N8923O1092j39443k4939O9399j4564J3793J3075o2273m5392
$$ -20246 130832 189755 250847 111404 86465 155864 141300 155093 168168 105895 60503
7330F0503M5007j7481q5467m2830k4363J6795j40226K0483J48014j9399j9013
$$ 60503 105510 88029 2562 -40268 -64631 -47836 -188062 -167579 -19565 -38964 -57977
7319e7977K9120l5870m0623P828J9558j9659l1271O1353J20009J08337m5352j08469
$$ -57977 -28857 -64727 -105350 -97522 -77964 -97623 -128894 -67541 52468 160805 115453 6984
7307F984r202k7556N7669O3724k4385q006o6316o3118J1458M0286o9711m2102
$$ 6984 -2218 -29774 27895 91619 67234 59228 -7088 -70206 -58748 -18462 -88173 -130275
7295a30275O1267R3490K3255K2787O802k739j9394k4948K8564k3669j00829J2575
$$ -130275 -69008 24482 47737 70524 77326 74587 55193 30245 58809 35140 -65689 -53114
7283e3114O341j32206k6142J161P0100J06240P2684k2948k2680r375J21453k1978
$$ -53114 -46773 -178979 -205121 -203960 -133860 -27620 45064 22116 -564 -9939 111514 89536
7271H9536n4712J7522n7615Q735m2148L8433N7015l304Q7197k8276q8638p500
$$ 89536 34824 52346 -5269 3466 -38682 -249 56766 53462 140659 112383 23745 16245
7259A6245o345j48573l8003K9326o8299J3185k8848M4318K7458p2580L1507P3624
$$ 16245 9900 -138673 -176676 -147350 -215649 -202464 -231312 -186994 -159536 -232116 -200609 -126985
7247a26985M1425r105Q8307r159k7021Q0654M2812q7004N02L4858j26809K4027
$$ -126985 -85560 -94665 -6358 -15517 -42538 38116 80928 -6076 -5574 29284 -97525 -73498
7235g3498l4796p2593O0907O1821K5350N3494r590o5276k1937k4378k3614J7161
$$ -73498 -108294 -180887 -119980 -58159 -32809 20685 11095 -54181 -76118 -100496 -124110 -106949
7223a06949j1154o3036l396J067L5063p193M7023L9927L4250n8056J32433R7220
$$ -106949 -118103 -181139 -184535 -183468 -148405 -155598 -108575 -68648 -34398 -92454 39979 137199
7211A37199o389j49082j4081j1688l2965j7981N2639J8142J09338j17217N4526
$$ 137199 130810 -18272 -32353 -44041 -77006 -94987 -42348 -24206 85132 -32085 22441
7200B2441R4998r0020j52215K18J0754L9005n0735k1318R836J29315R0095J34296
$$ 22441 117439 27419 -124796 -124578 -113824 -74819 -125554 -146872 -137036 -7721 82374 216670
7188B16670J8514k33886m5704J5066O2498l7537j36788j56752l985K676J33010
$$ 216670 235184 1298 -44406 -29340 33158 -4379 -141167 -297919 -301904 -299228 -166218
7177a66218J31672m7256k3132Q4388P451p2478j2020K8881M3340L826n1633N7247
$$ -166218 -34546 -81802 -104934 -20546 -13095 -85573 -97593 -68712 -25372 -21546 -73179 -15932
7165a5932J07322l3265l2757L4667J8592k1828K1997k658q6196K8604J3480j13506
$$ -15932 91390 58125 25368 60035 78627 56799 78796 76138 -10058 18546 32026 -81480
7153h1480p0229N220R1074J16845n7822o9018o2079O6088l4249L0470N410l3701
$$ -81480 -151709 -146489 -55415 61430 3608 -65410 -127489 -61401 -95650 -65180 -59770 -93471
7141i3471m6029l3950l8891P8033Q6108l8941K6943q6137l2398P4094j1590j59094
$$ -93471 -139500 -173450 -212341 -134308 -48200 -87141 -60198 -146335 -178733 -104639 -116229 -275323
7129b75323o760j0112j3483J10052M8341L3570J16030O7731l1080j03759r188
$$ -275323 -282083 -292195 -305678 -195626 -147285 -113715 2315 70046 38966 -64793 -73981
7118g3981M6373J7171J09008J32577j06773j15637j9029M6345r7621j812n8585
$$ -73981 -27608 -10437 98571 231148 124375 8738 -10291 36054 -61567 -63379 -121964
7107a21964M6424J18167k4583l964n4721q688M5114r1678m6422L3743j6209j02082
$$ -121964 -75540 42627 18044 14080 -40641 -49329 -4215 -95893 -142315 -108572 -124781 -226863
7095b26863o1071Q6056O7491p4101K1767L8911n4689O7417k2390j38826O6405
$$ -226863 -287934 -201878 -134387 -208488 -186721 -147810 -202499 -135082 -157472 -296298 -229893
7084b29893J84100P4404N209J21520o4168J5229o7086m5368K9932j15738j94354
$$ -229893 -45793 28611 33820 155340 91172 106401 39315 -6053 23879 -91859 -286213
7073b86213N3384K05965O3244Q157J4055o7358J3813m9060P600Q227J28380N5134
$$ -286213 -232829 -26864 36380 44537 58592 -8766 5047 -44013 -36413 -28186 100194 155328
7061A55328n4979k0685j32074q3692K4158l6912N7993O6184R066J0042N2287J05917
$$ 155328 100349 79664 -52410 -136102 -111944 -148856 -90863 -24679 -15613 -5571 46716 152633
7049A52633K0030N16m6180l6278n4367K107K5687R646Q264j26905n2336L5809
$$ 152633 172663 173179 126999 90721 36354 38461 64148 73794 82058 -44847 -97183 -61374
7037f1374M4178r811L9176J9173L0080J05639J90616j66026q0435q2076k7663
$$ -61374 -17196 -27007 12169 31342 61422 167061 357677 191651 111216 29140 1477
7026A477M1883O093J2080l9070l5911j01445K6679J09728p4446j56895J987K18162
$$ 1477 43360 49453 61533 22463 -13448 -114893 -88214 21514 -52932 -209827 -207840 10322
7014A0322K232j48705J96J03983L0175j2490j476m0708j9921q0998K1176L2168
$$ 10322 12554 -136151 -135955 -31972 -1797 -14287 -15763 -56471 -76392 -157390 -136214 -104046
7002a04046J0507k8328J14869J41625k6067j49040p7066M1827J47793O6992r1161
$$ -104046 -93539 -121867 -6998 134627 108560 -40480 -117546 -75719 72074 139066 47905
6991D7905K073L8844p2385k1747N8183p6151j15131O2426Q6410N3331k2952M9200
$$ 47905 49978 88822 16437 -5310 52873 -23278 -138409 -75983 10427 63758 40806 90006
6979I0006q181P0170K6687r9234j4891J2874O0863o4087j24579P2055q456m4227
$$ 90006 81825 151995 178682 79448 64557 77431 138294 74207 -50372 21683 13227 -31000
6967c1000j01887n8732l9520M2893J3582J3966N2710Q3138M6668P6468P6018M0930
$$ -31000 -132887 -191619 -231139 -188246 -174664 -160698 -107988 -24850 21818 98286 174304 215234
6955B15234o3301k3994n1713n0535o5953k1267P6382Q3121n2332m9428J16792
$$ 215234 151933 127939 76226 25691 -40262 -61529 14853 97974 45642 -3786 113006
6944A13006N9535k4083k0620l4594j30959r2343Q9817J00796L8139Q3255j03451
$$ 113006 172541 148458 127838 93244 -37715 -130058 -40241 60555 98694 181949 78498
6933G8498n7478L926P4679O0984p5561m4579o1856l2720q576j35116m7195J06291
$$ 78498 21020 24946 99625 160609 85048 40469 -21387 -54107 -62683 -197799 -244994 -138703
6921a38703Q2669N9492M8091q4001n6146j13081k16N4696L0839L8572J01799J33412
$$ -138703 -56034 3458 51549 -32452 -88598 -201679 -201895 -147199 -116360 -77788 24011 157423
6909A57423q5904l9986J5037o6303q0967O3941M1320L0012k9553o6091l1051p4166
$$ 157423 71519 31533 46570 -19733 -100700 -36759 4561 34573 5020 -61071 -92122 -166288
6897a66288j33610M8552J27845J08049M1097l8475p1508J9648K5560O4866L0376
$$ -166288 -299898 -251346 -123501 -15452 25645 -12830 -84338 -64690 -39130 25736 56112
6886E6112J0345n5568j0221l3008k6920P0053R2591l3017m5530J14308o5832k06628
$$ 56112 66457 10889 668 -32340 -59260 10793 103384 70367 24837 139145 73313 -133315
6874a33315R7060m5393j07035m7240M425L9199q6365K5028m388Q6494J29483K5386
$$ -133315 -36255 -81648 -188683 -235923 -231498 -192299 -278664 -253636 -258024 -171530 -42047 -16661
6862a6661p2542q3756k0968R08L5640K0844J34181k6812K8369m703l1702J4959
$$ -16661 -89203 -172959 -193927 -193019 -157379 -136535 -2354 -29166 -797 -5500 -37202 -22243
6850b2243K6769k2934N2565P2600k8713L6670K571j14844Q0152l0393o2108l4461
$$ -22243 4526 -18408 34157 106757 78044 114714 117285 2441 82593 52200 -9908 -44369
6838d4369R9898p3034r8090J22813K5883J6190r2176m5038n7027k4319J02388
$$ -44369 55529 -17505 -115595 7218 33101 49291 -42885 -87923 -144950 -169269 -66881
6827f6881J2252q6077N6418K2826L9961l198N4919j356l6089J27724n0240m5079
$$ -66881 -54629 -140706 -84288 -61462 -21501 -24699 30220 28864 -7225 120499 70259 25180
6815B5180p5594K3036O8250k7749m0116K5852O3021M845L0257J0529n7194J23420
$$ 25180 -50414 -27378 40872 13123 -26993 -1141 61880 66725 96982 107511 50317 173737
6803A73737k8724j37925j7421l2817j9280q292j35235r1510R2921J33114J05765
$$ 173737 145013 7088 -10333 -43150 -62430 -70722 -205957 -297467 -204546 -71432 34333
6792C4333o8119N2725P7003K2214p3540L0111L3326O118K9879j24056r1621O4596
$$ 34333 -33786 18939 95942 118156 44616 74727 108053 114171 144050 19994 -71627 -7031
6780g031P592j682k2287o1394p3537J08183R2072J6792o9574k9081Q733m5618
$$ -7031 561 -1121 -23408 -84802 -158339 -50156 41916 58708 -10866 -39947 -31214 -76832
6768g6832l5969p2273o8970R3154l597M3338k6127K8612M0549j4683Q6005M5843
$$ -76832 -112801 -185074 -254044 -160890 -164487 -121149 -147276 -118664 -78115 -92798 -6793 39050
6756C9050R4953j182o1588j753N222J2226p1455j75322n4101M5008k3825p5476
$$ 39050 134003 132821 71233 69480 74702 86928 15473 -159849 -213950 -168942 -192767 -268243
6744b68243j7186Q5678m9471O5562Q8613J24888J23083q784Q554j9680j00560
$$ -268243 -285429 -199751 -249222 -183660 -95047 29841 152924 144140 152694 133014 32454
6733C2454l0964o6652l7432k3208O1135l1630K6615o578l7192J589n068M4038
$$ 32454 1490 -65162 -102594 -125802 -64667 -96297 -69682 -76260 -113452 -111863 -116931 -72893
6721g2893R6733O6175r0434j2749k1350N3602n4128r34R640Q6924l0505l7568
$$ -72893 23840 90015 -419 -13168 -34518 19084 -35044 -35978 -26338 60586 30081 -7487
6709g487j51626J2353m4245j9489n0523j05086P3604J45253J15675P6634o0001
$$ -7487 -159113 -146760 -191005 -210494 -261017 -366103 -292499 -147246 -31571 45063 -14938
6698a4938m701m1664l0944l9473o4509N4118P2647j2414m6755o254J1697O1690
$$ -14938 -19639 -61303 -92247 -131720 -196229 -142111 -69464 -81878 -128633 -134887 -123190 -61500
6686f1500M9827j2840k5297l6002M3946L8217J00117P2364p5719j59014K0958
$$ -61500 -11673 -24513 -49810 -85812 -41866 -3649 96468 168832 93113 -65901 -44943
6675d4943N3820q087L8907j00870j41826k530J47360N0240o0469j01751J1447
$$ -44943 8877 790 39697 -61173 -202999 -205529 -58169 -7929 -68398 -170149 -158702
6664a58702L7639P028K5322K7023q9150O1531N9650q9057R33k1760n0560K2469
$$ -158702 -121063 -114035 -88713 -61690 -150840 -89309 -29659 -118716 -117783 -139543 -190103 -167634
6652a67634L0371K893l131M4357o413N0403O6649j6323j49059j32028R8638N6928
$$ -167634 -137263 -134370 -137501 -93144 -99557 -49154 17495 1172 -147887 -279915 -181277 -124349
6640a24349j6303J15436J48040Q559j29546j25968n4306O609M856P7628M9889
$$ -124349 -140652 -25216 122824 131383 1837 -124131 -178437 -171828 -166972 -89344 -39455
6629c9455j5213P4408l4698j44184J26774J48157q4534k8214J25396m0547l341
$$ -39455 -54668 19740 -14958 -159142 -32368 115789 31255 3041 128437 87890 84549
6618H4549j50268j7006J64249l3183p0559o4689p6670l0700O7675K0131J08908
$$ 84549 -65719 -82725 81524 48341 -22218 -86907 -163577 -194277 -126602 -106471 2437
6607B437J0449j57506O4506n0346j25267Q3567K01175L8566j02538n5720O9135
$$ 2437 12886 -144620 -80114 -130460 -255727 -172160 29015 67581 -34957 -90677 -21542
6596b1542p511m6830n9384N3401J09637n3078m0444N8482p023Q3554J21521r2527
$$ -21542 -29053 -75883 -135267 -81866 27771 -25307 -65751 -7269 -14292 69262 190783 98256
6584I8256r7673m7169L3693R1559M6672j13837j08693l6787L0105Q15k1900K3016
$$ 98256 583 -46586 -12893 78666 125338 11501 -97192 -133979 -103874 -103059 -124959 -101943
6572a01943K0648j0712L2889O2662M1160l993l9883n1386L6937L298j30135j5692
$$ -101943 -81295 -92007 -59118 3544 44704 40711 828 -50558 -13621 -10323 -140458 -156150
6560a56150J29351J21745l4593j06860j46684r570J02665K6859l6420O2918n4953
$$ -156150 -26799 94946 60353 -46507 -193191 -202761 -100096 -73237 -109657 -46739 -101692
6549a01692K5330n8169m8733J00367P2673m9579l2855j357m2584j334N8080j841
$$ -101692 -76362 -134531 -183264 -82897 -10224 -59803 -92658 -94015 -136599 -137933 -79853 -81694
6537h1694l5297n3329K9415J5131J4406L8139l9159k0567r4215J3066J06046O4578
$$ -81694 -116991 -170320 -140905 -125774 -111368 -73229 -112388 -132955 -227170 -214104 -108058 -43480
6525d3480q6412k9864M1591L9743j4885M5565L7471J23589o7861p3325r1650j47097
$$ -43480 -129892 -159756 -118165 -78422 -93307 -47742 -10271 113318 45457 -27868 -119518 -266615
6513b66615O5012J01218M7301l7867K4687q1015P0176J54048N1892J00446j41547
$$ -266615 -201603 -100385 -53084 -90951 -66264 -147279 -77103 76945 128837 229283 87736
6502H7736j38297P2138O518M5925p2001M301k3719k516N4222J4001q1623m0633
$$ 87736 -50561 21577 28095 74020 2019 6320 -17399 -19915 34307 48308 -33315 -73948
6490g3948m1929l0973o460O7077K5709K0647R6871p3709P1310P4631n3519K0945
$$ -73948 -115877 -146850 -153310 -86233 -60524 -39877 56994 -16715 54595 129226 75707 96652
6478I6652p3794l0742K4961R937r1396L0126m2906m956j243R753m891j2004J46577
$$ 96652 22858 -7884 17077 27014 -64382 -34256 -77162 -82118 -83361 -73608 -78499 -90503 56074
6465E6074L8527q5698j00410J361o8556O2742Q3325k0463R861K7272q4288O8340
$$ 56074 94601 8903 -91507 -90146 -158702 -95960 -12635 -33098 -23237 4035 -80253 -11913
6453a1913J24058j4170L4352M8334J8462j07648j32367J1670M197N2691j34575
$$ -11913 112145 97975 132327 180661 199123 91475 -40892 -29222 -25025 27666 -106909
6442a06909k2028R7098m9992q9605R6611j0752M8153m4845k1p782J2045o504j5719
$$ -106909 -128937 -31839 -81831 -171436 -74825 -85577 -37424 -82269 -82290 -90072 -78027 -84531 -100250
6429a00250J29749P1909m8395j15388r0008m942R1406O9617l3051m8600j414o5558
$$ -100250 29499 101408 53013 -62375 -152383 -157325 -65919 3698 -29353 -77953 -79367 -144925
6417a44925M1500N4048N6652K1103r0329N5536J75261o9608K4572K6725R883r0380
$$ -144925 -103425 -49377 7275 28378 -61951 -6415 168846 99238 123810 150535 160418 70038
6405G0038o8499N6069J07644n5389k25721j4770j5802P6397J43641M9691l0308
$$ 70038 1539 57608 165252 109863 -115858 -130628 -146430 -70033 73608 123299 92991
6394I2991j6183o5837r5395n643J03533Q1099k004K101j54127j9010J17335j6755
$$ 92991 76808 10971 -84424 -90067 13466 94565 92561 94662 -59465 -78475 38860 22105
6382B2105j173p451J2569L3732N3199m4499j38420j8233N9054q6214k6843Q6782
$$ 22105 20932 13481 26050 59782 112981 68482 -69938 -88171 -29117 -115331 -142174 -55392
6370e5392j02581o2873M9419m131J25094J30580K0077J51385l8643j58009p9132
$$ -55392 -157973 -220846 -171427 -175558 -50464 80116 100193 251578 212935 54926 -24206
6359b4206L8896k6948j17624M6761J4333O2549J12546M9460m6626j16826P1142
$$ -24206 14690 -12258 -129882 -83121 -68788 -6239 106307 155767 109141 -7685 63457
6348F3457J4055o2200K7865j7508J22245k6892n7457k1649n965n6372k4956J3120
$$ 63457 77512 15312 43177 25669 147914 121022 63565 41916 35951 -20421 -45377 -32257
6336c2257r0591j37576P9477M8211P35n7242L0643M5375P3940M694L2474R2287
$$ -32257 -122848 -260424 -180947 -132736 -132001 -189243 -158600 -113225 -39285 -34591 -2117 90170
6324I0170R5591L7485n2021o7452m5939l213l0618q1035J24389k4946j9056j02529
$$ 90170 185761 223246 171225 103773 57834 54621 24003 -57032 67357 42411 23355 -79174
6312g9174o1441k3526J15963N9668k5509K4260N6316J4894J1558Q196j02789n9656
$$ -79174 -140615 -164141 -48178 11490 -14019 10241 66557 81451 93009 101205 -1584 -61240
6300f1240R233K0580o3170O5917P6997J5509k7730l1749p4550J4880J09645j9696
$$ -61240 -52007 -31427 -94597 -28680 48317 63826 36096 4347 -70203 -55323 54322 34626
6288C4626r2032R315L7941L1938K3190l1295p7830o7363K1087K8211M5304O6520
$$ 34626 -57406 -48091 -10150 21788 44978 13683 -64147 -131510 -110423 -82212 -36908 29612
6276B9612q0411j12068p3625J15615M6720m9025K2575P8084o2362P7660M4014
$$ 29612 -50799 -162867 -236492 -120877 -74157 -123182 -100607 -22523 -84885 -7225 36789
6265C6789j21148m5352j1182J12505M3852L5325n9880O9170J01601q9364n5445
$$ 36789 -84359 -129711 -140893 -28388 15464 50789 -9091 60079 161680 72316 16871
6254A6871j10830j9780o281q2087R1062Q9199L4171J9479N5025J6324O8378M3573
$$ 16871 -93959 -113739 -120020 -202107 -111045 -21846 12325 31804 86829 103153 171531 215104
6242B15104j4601K714k1233J3440m5809q1389M7329l080q8447M4171N299m7821
$$ 215104 200503 203217 181984 195424 149615 68226 115555 112475 24028 68199 73498 25677
6230B5677k0536j40157p9456M3683M7994r821K2307J6924M6505o3483k407m1107
$$ 25677 5141 -135016 -214472 -170789 -122795 -132616 -110309 -93385 -46880 -110363 -112770 -153877
6218a53877m8072j4359K8801O4108r002j0464j06859M7459J78292k8379k4129
$$ -153877 -201949 -216308 -187507 -123399 -132401 -142865 -249724 -202265 -23973 -52352 -76481
6207g6481j1206J33276l847r6045j07362j996p6524p3086L6341N8334P4396j3043
$$ -76481 -87687 45589 41742 -54303 -161665 -163661 -240185 -313271 -276930 -218596 -144200 -157243
6195a57243M7477J67958J1902n6986o5780Q2480O5579k9786j0023m9584M4488
$$ -157243 -109766 58192 70094 13108 -52672 29808 95387 65601 55578 5994 50482
6184E0482L3935L9766M7870n7387j24936q7389Q082m467M7396J4980L9626k3693
$$ 50482 84417 124183 172053 114666 -10270 -97659 -89577 -94044 -46648 -31668 7958 -15735
6172a5735p9264n3831K9818n1670o301K8607l5547O3336m9605n96N2503Q9102
$$ -15735 -94999 -148830 -119012 -170682 -176983 -148376 -183923 -120587 -170192 -170788 -118285 -29183
6160b9183o1038j03725J19844J12644K5877p2675M1145n4514L0369K2935p2831
$$ -29183 -90221 -193946 -74102 38542 64419 -8256 32889 -21625 8744 31679 -41152
6149d1152j38663o1643K744K7258M4969J62061j1663q3822P015J59547R9991p3757
$$ -41152 -179815 -241458 -238714 -211456 -166487 -4426 -16089 -99911 -92896 66651 166642 92885
6137I2885k9938n2752r4504j4356J06897l1612j05401j77390L4168K06726K0307
$$ 92885 62947 10195 -84309 -98665 8232 -23380 -128781 -306171 -272003 -65277 -44970
6126d4970l6381p892K5850k404l3031N8022o9122L8774P0601L7855j3538J3745
$$ -44970 -81351 -89243 -63393 -65797 -98828 -40806 -109928 -71154 -553 37302 23764 37509
6114C7509l4654j18395l6073L0978J00390l6965o27J8318J17165N5577j22888
$$ 37509 2855 -115540 -151613 -120635 -20245 -57210 -57837 -39519 77646 133223 10335
6103A0335m0610k4749l0918j3738P8992N2663K6456j30983n3001R3641K0546n3147
$$ 10335 -30275 -55024 -85942 -99680 -20688 31975 58431 -72552 -125553 -31912 -11366 -64513
6091f4513M8948O3734M935J5998O4454M9676m6956p7640K7510j1110j5423l4257
$$ -64513 -15565 48169 53104 69102 133556 183232 136276 58636 86146 75036 59613 25356
6079B5356l1980j7987l3819O3266M5592O447K7616J7066n3903l79k3066N926L1473
$$ 25356 -6624 -24611 -58430 4836 50428 56875 84491 101557 47654 47275 24209 30135 61608
6066F1608K3139m3019o4021J05212l5581j05611J951J9733o2939M2419N0853J04514
$$ 61608 84747 41728 -22293 82919 47338 -58273 -56322 -36589 -99528 -57109 -6256 98258
6054I8258R3000j53903j16209p4992m5325O4629J16925M623k459Q2593O6902O806
$$ 98258 191258 37355 -78854 -153846 -199171 -134542 -17617 -12994 -15453 67140 134042 140848
6042A40848k0258o8829j47158j31717o136R8259O5459o9520P8883O3682O066Q544
$$ 140848 120590 51761 -95397 -227114 -233250 -134991 -69532 -139052 -60169 3513 9579 18123
6030A8123L8143K9445O852p9839J3443L2110q4246j2672P8654M4608j3316j38772
$$ 18123 56266 85711 92563 12724 26167 58277 -25969 -38641 40013 84621 71305 -67467
6018f7467q8369O8442p4490m521m8418p1091K6994n1497Q8837K29093L7291n3859
$$ -67467 -155836 -87394 -161884 -166405 -214823 -285914 -258920 -310417 -221580 7513 44804 -9055
6006i055l9154l1756M2715L4802N61Q9860p586j0135j00017K2988P4325r171o9077
$$ -9055 -48209 -79965 -37250 -2448 -1887 87973 80387 70252 -29765 -6777 67548 58377 -10700
5993a0700k4839O89o1009L709K635q6131j1767M7947M3053R2117q919l5271K3061
$$ -10700 -35539 -34850 -95859 -92150 -89515 -175646 -187413 -139466 -96413 -4296 -13215 -48486 -25425
5980b5425l5660N3471m2843L7931l1049m1447m1901K739o2856K4304J39966K9171
$$ -25425 -61085 -7614 -50457 -12526 -43575 -85022 -126923 -124184 -187040 -162736 -22770 6401
5968F401j68552q1065R7740J01312k8437p2753Q4923r514m1266m582m4023O3223
$$ 6401 -162151 -243216 -145476 -44164 -72601 -145354 -60431 -69945 -111211 -115793 -159816 -96593
5956i6593j11394p0191J45502J28650k9367j03957P6560L8053j3617j4084K1184
$$ -96593 -207987 -278178 -132676 -4026 -33393 -137350 -60790 -22737 -36354 -50438 -29254
5945b9254m2113l1297N5781O3679P786N5894Q6311r1197j07718J0853P3759L835
$$ -29254 -71367 -102664 -46883 16796 24582 80476 166787 75590 -32128 -21275 52484 56319
5933E6319m6009k3071j52256j10862J78068j0647k9700J07185n1166L4647P9648
$$ 56319 10310 -12761 -165017 -275879 -97811 -108458 -138158 -30973 -82139 -47492 32156
5922C2156j13393p0265J72874m754J34453R7448n3826k6018j25170j52431n3730
$$ 32156 -81237 -151502 21372 16618 151071 248519 194693 168675 43505 -108926 -162656
5911a62656L2579M5659N2854k4818j0522R7084p466r199N8131R6991j45752r8050
$$ -162656 -130077 -84418 -31564 -56382 -66904 30180 22714 13515 71646 168637 22885 -75165
5899g5165J20939o9328K0776J8375o9610J895M9906n208P555l7610o8081Q7648
$$ -75165 45774 -23554 -2778 15597 -54013 -52118 -2212 -7420 135 -37475 -105556 -17908
5887a7908o5460j2934N7644J8044M4668p7661j3423j5971n8647p9940P447J35406
$$ -17908 -83368 -96302 -38658 -20614 24054 -53607 -67030 -83001 -141648 -221588 -214141 -78735
5875g8735P0618k13643q5534K20089J17568p797m2170p5339j54344j1932N5170
$$ -78735 -8117 -221760 -307294 -87205 30363 22566 -19604 -94943 -249287 -261219 -206049
5864b06049Q0389O5932R862r6995k9026P787J6267K1444L407P366l4903J4635
$$ -206049 -125660 -59728 -49866 -146861 -175887 -168100 -151833 -130389 -126982 -119616 -154519 -139884
5852a39884J03280k8268r8985Q1038N9385P0022M8409m8199J3084j5478J05987
$$ -139884 -36604 -64872 -163857 -82819 -23434 46588 94997 46798 59882 44404 150391
5841A50391j7887L2336j39212Q042l9728o6427J24062j20306r3035P5950J13044
$$ 150391 132504 164840 25628 33670 -6058 -72485 51577 -68729 -161764 -85814 27230
5830B7230P4441k8195j2870K3510M5585o0521j12332O5089J55050j4123j50403
$$ 27230 101671 73476 60606 84116 129701 69180 -43152 21937 176987 162864 12461
5819A2461N3912r9979k0208j7520j73159K6644K3120R7706p1519n0965k0279j21903
$$ 12461 66373 -33606 -53814 -71334 -244493 -217849 -194729 -97023 -168542 -219507 -239786 -361689
5807c61689P0391J22972O184N7970M787q1745l1886J18053J33272R2743K8202
$$ -361689 -291298 -168326 -162142 -104172 -99385 -181130 -213016 -94963 38309 131052 159254
5796A59254r1735n2579q3066j4853J40825M0453k0370O0708J269j20214q8804
$$ 159254 67519 14940 -68126 -82979 57846 98299 77929 138637 139906 19692 -69112
5785f9112o2605N5446N1359K4988K5959O1827m5809j01076L9736K5493O5166K5244
$$ -69112 -131717 -76271 -24912 76 26035 87862 42053 -59023 -19287 6206 71372 96616
5773I6616n6718j06588j24074Q0693Q1236q5548M4890J28153o7178p7694r3195
$$ 96616 39898 -66690 -190764 -110071 -28835 -114383 -69493 58660 -8518 -86212 -179407
5762a79407J33401j2201N0691J21444M5940j328M4700j35314m3135m3854R913
$$ -179407 -46006 -58207 -7516 113928 159868 158540 203240 67926 24791 -19063 -9150
5751i150P5141J43507R9873j40598j15438Q171J31348n6537m1570o6697n2402
$$ -9150 65991 209498 309371 168773 53335 61506 192854 136317 94747 28050 -24352
5740b4352J5587o455l0139m1333j7525o1908Q6410J08848k3193O8626o4068k6620
$$ -24352 -8765 -15220 -45359 -86692 -104217 -166125 -79715 29133 5940 74566 10498 -16122
5728a6122p2439j34612K3565o8033J54402P8569N3307o6976j77926M7034K27712
$$ -16122 -88561 -223173 -199608 -267641 -113239 -34670 18637 -48339 -226265 -179231 48481
5717D8481N7798q7983J3361j1497j3068k3562Q1250j9075k9451j03965n1386M0986
$$ 48481 106279 18296 31657 20160 7092 -16470 64780 45705 16254 -87711 -139097 -98111
5705i8111M1562o2866J1193O0100J55415O0060n1078m0240j7504M0636L4292q8345
$$ -98111 -56549 -119415 -108222 -48122 107293 167353 116275 76035 58531 99167 133459 45114
5693D5114L7922r7138J4557K2073L4850n550p2862N6314m8925o9576o2684Q6834
$$ 45114 83036 -14102 455 22528 57378 51828 -21034 35280 -13645 -83221 -145905 -59071
5681e9071J14315P2968r0361j43505K3390K7205J49858o95m3680O311r8863q9434
$$ -59071 55244 128212 37851 -105654 -82264 -55059 94799 94104 50424 56735 -42128 -131562
$$ [...]
##END NTUPLES=NMR SPECTRUM
##END=
