##TITLE=Analysis number 321008
Compound Code sew 01633
Project Code adrs
Chemist Name fudan
##JCAMPDX= 6.0         $$ Bruker NMR JCAMP-DX V2.0
##DATA TYPE= NMR SPECTRUM
##DATA CLASS= NTUPLES
##ORIGIN= Bruker BioSpin GmbH
##OWNER= nmr
$$ XWIN-NMR		Version 3.5
$$ Thu Jul 20 10:44:41 2006 GMT Daylight Time (UT+1h)  MAYBRIDGE\nmr@NMR_250MHZ
##.OBSERVE FREQUENCY= 250.131544655141
##.OBSERVE NUCLEUS= ^1H
##.ACQUISITION MODE= SIMULTANEOUS (DQD)
##.ACQUISITION SCHEME= undefined
##.AVERAGES= 16
##.DIGITISER RES= 18
##SPECTROMETER/DATA SYSTEM= dpx250
##.PULSE SEQUENCE= zg30
##.SOLVENT NAME= DMSO
##.SHIFT REFERENCE= (INTERNAL, DMSO, 0, 16.522)
##AUDIT TRAIL= $$ (NUMBER, WHEN, WHO, WHERE, WHAT)
$$ ##TITLE= Audit trail, XWIN-NMR		Version 3.5
$$ ##JCAMPDX= 5.01
$$ ##ORIGIN= Bruker BioSpin GmbH
$$ ##OWNER= nmr
$$ C:\u/data/dgb/nmr/ADRS/3140/pdata/1/auditp.txt
$$ ##AUDIT TRAIL=  $$ (NUMBER, WHEN, WHO, WHERE, WHAT)
(   1,<2006-07-20 10:43:54.48 +100>,<MAYBRIDGE\nmr>,<NMR_250MHZ>,
      <created by zg, POWCHK disabled, PULCHK disabled
       configuration hash MD5:
       E2 DF 36 D8 04 B2 41 60 5A D7 A3 38 5A 4B D0 FE
       data hash MD5: 64K
       E3 9B 57 73 67 52 4E E6 96 88 DB A2 41 5B AD AB>)
(   2,<2006-07-20 10:44:15.34 +100>,<MAYBRIDGE\nmr>,<NMR_250MHZ>,
      <Start of raw data processing
       ef LB = 0.3 FT_mod = 6 PKNL = 1 SI = 32K 
       data hash MD5: 32K
       05 2A 45 DE 67 1B 0E 6E E8 3B 86 0D 01 BF 6D 31>)
(   3,<2006-07-20 10:44:19.78 +100>,<MAYBRIDGE\nmr>,<NMR_250MHZ>,
      <apk 
       data hash MD5: 32K
       39 71 97 40 4F A0 72 BE 8D 02 EE 57 FD E7 A2 52>)
(   4,<2006-07-20 10:44:21.20 +100>,<MAYBRIDGE\nmr>,<NMR_250MHZ>,
      <abs ABSG = 5 
       data hash MD5: 32K
       49 D2 97 6F B9 C5 30 51 21 BB 9C 9F 8C 6E 96 F3>)
$$ ##END=
$$ 
$$ hash MD5
$$ A2 90 04 B8 4E EA E0 77 F9 51 6E BD 05 35 45 FA
##$RELAX= 
##$RELAX= 
##$RELAX= 
##$RELAX= 
##$RELAX= 
##$RELAX= 
##$RELAX= 
$$ Bruker specific parameters
$$ --------------------------
##$DU= <C:\u>
##$EXPNO= 3140
##$NAME= <ADRS>
##$PROCNO= 1
##$TYPE= <nmr>
##$USER= <dgb>
##$AMP= (0..31)
100 100 100 100 100 100 100 100 100 100 100 100 100 100 100 100 100 100 
100 100 100 100 100 100 100 100 100 100 100 100 100 100 
##$AQSEQ= 0
##$AQ_mod= 3
##$AUNM= <au_zg>
##$AUTOPOS= <25 >
##$BF1= 250.13
##$BF2= 250.13
##$BF3= 250.13
##$BF4= 250.13
##$BF5= 500.13
##$BF6= 500.13
##$BF7= 500.13
##$BF8= 500.13
##$BYTORDA= 1
##$CFDGTYP= 0
##$CFRGTYP= 5
##$CHEMSTR= <none>
##$CNST= (0..31)
1 1 145 1 1 1 1 1 1 1 1 1 1 1 1 1 1 1 1 1 1 1 1 1 1 1 1 1 1 1 1 1 
##$CPDPRG= <>
##$CPDPRG1= <>
##$CPDPRG2= <>
##$CPDPRG3= <>
##$CPDPRG4= <mlev>
##$CPDPRG5= <mlev>
##$CPDPRG6= <mlev>
##$CPDPRG7= <mlev>
##$CPDPRG8= <mlev>
##$CPDPRGB= <>
##$CPDPRGT= <>
##$D= (0..31)
0 1 0 0 0 0 0 0 0 0.06 0 0 0 0 0 0 0.0002 0 0 0 0 0 0 0 0 0 0 0 0 0 0 
0 
##$DATE= 1153388631
##$DBL= (0..7)
120 120 120 120 120 120 120 120 
##$DBP= (0..7)
150 150 150 150 150 150 150 150 
##$DBP07= 0
##$DBPNAM0= <>
##$DBPNAM1= <>
##$DBPNAM2= <>
##$DBPNAM3= <>
$$ [...]
##$SUBNAM7= <"">
##$SUBNAM8= <"">
##$SUBNAM9= <"">
##$SW= 20.6930455092707
##$SWIBOX= (0..15)
0 0 3 0 0 0 0 0 0 0 0 0 0 0 0 0 
##$SW_h= 5175.983436853
##$TD= 65536
##$TD0= 1
##$TE= 295.16
##$TE2= 300
##$TE3= 300
##$TEG= 300
##$TL= (0..7)
0 120 120 120 120 120 120 120 
##$TP= (0..7)
150 150 150 150 150 150 150 150 
##$TP07= 0
##$TPNAME0= <>
##$TPNAME1= <>
##$TPNAME2= <>
##$TPNAME3= <>
##$TPNAME4= <>
##$TPNAME5= <>
##$TPNAME6= <>
##$TPNAME7= <>
##$TPOAL= (0..7)
0.5 0.5 0.5 0.5 0.5 0.5 0.5 0.5 
##$TPOFFS= (0..7)
0 0 0 0 0 0 0 0 
##$TUNHIN= 0
##$TUNHOUT= 0
##$TUNXOUT= 0
##$USERA1= <user>
##$USERA2= <user>
##$USERA3= <user>
##$USERA4= <user>
##$USERA5= <user>
##$V9= 5
##$VALIST= <valist>
##$VCLIST= <CCCCCCCCCCCCCCC>
##$VD= 0
##$VDLIST= <DDDDDDDDDDDDDDD>
##$VPLIST= <PPPPPPPPPPPPPPP>
##$VTLIST= <TTTTTTTTTTTTTTT>
##$WBST= 1024
##$WBSW= 4
##$XGAIN= (0..3)
0 0 0 0 
##$XL= 0
##$YL= 0
##$YMAX_a= 247616
##$YMIN_a= -341475
##$ZGOPTNS= <>
##$ZL1= 120
##$ZL2= 120
##$ZL3= 120
##$ZL4= 120
##$ABSF1= 16.522
##$ABSF2= -4.171173
##$ABSG= 5
##$ABSL= 3
##$ALPHA= 0
##$AQORDER= 0
##$ASSFAC= 0
##$ASSFACI= 0
##$ASSFACX= 0
##$ASSWID= 0
##$AUNMP= <proc_1d>
##$AZFE= 0.1
##$AZFW= 0.1
##$BCFW= 0
##$BC_mod= 0
##$BYTORDP= 0
##$COROFFS= 0
##$CY= 12.5
##$DATMOD= 1
##$DC= 0
##$DFILT= <>
##$DTYPP= 0
##$F1P= 14.0000005364418
##$F2P= -0.99999901652339
##$FCOR= 0.5
##$FTSIZE= 32768
##$FT_mod= 6
##$GAMMA= 0
##$GB= 0
##$INTBC= 1
##$INTSCL= 1
##$ISEN= 128
##$LB= 0.3
##$LEV0= 0
##$LPBIN= 0
##$MAXI= 10000
##$MC2= 0
##$MEAN= 0
##$ME_mod= 0
##$MI= 0
##$NCOEF= 0
##$NC_proc= -5
##$NLEV= 6
##$NOISF1= 0
##$NOISF2= 0
##$NSP= 0
##$NTH_PI= 0
##$NZP= 0
##$OFFSET= 16.522
##$PC= 1
##$PHC0= 163.5994
##$PHC1= 3.057699
##$PH_mod= 1
##$PKNL= yes
##$PPARMOD= 0
##$PSCAL= 4
##$PSIGN= 0
##$REVERSE= no
##$SF= 250.13
##$SI= 32768
##$SIGF1= 0
##$SIGF2= 0
##$SINO= 400
##$SIOLD= 32768
##$SREGLST= <1H.DMSO>
##$SSB= 0
##$STSI= 32768
##$STSR= 0
##$SW_p= 5175.98343685301
##$SYMM= 0
##$S_DEV= 0
##$TDeff= 65536
##$TDoff= 0
##$TI= <Analysis number 999999
Compound Code 99
Book Reference 9
Project Code 9>
##$TILT= no
##$TM1= 0
##$TM2= 0
##$TOPLEV= 0
##$USERP1= <user>
##$USERP2= <user>
##$USERP3= <user>
##$USERP4= <user>
##$USERP5= <user>
##$WDW= 1
##$XDIM= 32768
##$YMAX_p= 369529452
##$YMIN_p= -1023385
$$ End of Bruker specific parameters
$$ ---------------------------------
##NTUPLES= NMR SPECTRUM
##VAR_NAME=  FREQUENCY,     SPECTRUM/REAL,   SPECTRUM/IMAG
##SYMBOL=    X,             R,               I
##VAR_TYPE=  INDEPENDENT,   DEPENDENT,       DEPENDENT
##VAR_FORM=  AFFN,          ASDF,            ASDF
##VAR_DIM=   32768,         32768,           32768
##UNITS=     HZ,            ARBITRARY UNITS, ARBITRARY UNITS
##FACTOR=    0.157963299565203, 1,           1
##FIRST=     4132.6476996994, 0,             0
##LAST=      -1043.33573715361, 0,           0
##MIN=       -1043.33573715361, -1023385,    0
##MAX=       4132.6476996994, 369529452,     0
$$ Real data points
##PAGE= N=1
##DATA TABLE= (X++(R..R)), XYDATA
$$ [...]
15587c35708J16772O8617K17316J24052j45501k58019k43472k5894K46801j9157
$$ -335708 -218936 -150319 66997 191049 45548 -212471 -455943 -481837 -235036 -254193
15577b54193k94527J75130K69249j60917q8116R407J13651J65197l6522k70659
$$ -254193 -548720 -373590 -104341 -265258 -353374 -343967 -230316 -65119 -101641 -372300
15567c72300K18289K81308J15246m8516q5765j26244j88694k72804k13587J0490
$$ -372300 -154011 127297 242543 194027 108262 -17982 -206676 -479480 -693067 -682577
15557f82577J39888J3357Q0175L5685J24938K4476m7654L56284L26719k82068
$$ -682577 -542689 -529332 -449157 -413472 -288534 -264058 -311712 44572 371291 89223
15547H9223o4372j12068n3108L1539Q95j05626K6943j22559o6783K02294n5404
$$ 89223 24851 -87217 -140325 -108786 -107891 -213517 -186574 -309133 -375916 -173622 -229026
15536b29026K9712K5848J13276K8835j08649j67254K55424o8487l01215m8476
$$ -229026 -199314 -173466 -60190 -31355 -140004 -307258 -51834 -120321 -421536 -470012
15526d70012K41290M8655k6858K34859J67109j91346l74961k77268L11856K64387
$$ -470012 -228722 -180067 -206925 27934 195043 3697 -371264 -648532 -336676 -72289
15516g2289N5148J20019Q6657k01158k32676R4069K24991J47124j84905J7061
$$ -72289 -17141 102878 189535 -11623 -244299 -150230 74761 221885 36980 54041
15506E4041J45190k45498j19706M9993l4753Q7555L5461j51055J786J21435N1833
$$ 54041 199231 -46267 -165973 -115980 -150733 -63178 -27717 -178772 -176986 -55551 -3718
15495c718j69120l35843K27337K52411J76792J42072r8773r9679j83835k40294
$$ -3718 -172838 -508681 -281344 -28933 147859 289931 191158 91479 -92356 -332650
15485c32650j52378K12506J44528K19475K04104J28026k13805l73564j57824R4522
$$ -332650 -485028 -272522 -127994 91481 295585 423611 209806 -163758 -321582 -227060
15475b27060K06208K9251j56342p0270k38964J73522N7815R1706j26084j2320
$$ -227060 -20852 8399 -147943 -218213 -457177 -283655 -225840 -134134 -260218 -272538
15465b72538k4753r9021K75076Q5484k0874J18703m01491j00252K14558n9361
$$ -272538 -297291 -396312 -121236 -35752 -56626 62077 -339414 -439666 -225108 -284469
15455b84469k61110M0929j77036K00776L74142J05634j6666J19833k2932j98823
$$ -284469 -545579 -504650 -681686 -480910 -106768 -1134 -17800 102033 79101 -119722
15445a19722k06900j00798p7395K67562J5271J11943J01491j2842O2230k6338
$$ -119722 -326622 -427420 -504815 -237253 -221982 -110039 -8548 -21390 40840 14502
15435A4502K54845K04076N7754r050K63133j26638k78106J04185j61033j35009
$$ 14502 269347 473423 531177 522127 785260 658622 380516 484701 323668 188659
15425A88659p9364q8578J20773k43239m538J16484o3742k6909J94212p2138k56677
$$ 188659 109295 20717 141490 -101749 -106287 10197 -53545 -80454 113758 41620 -215057
15414b15057l7290l6535j99569j49700k51768J79473J14969R7344J28347N5676
$$ -215057 -252347 -288882 -488451 -638151 -889919 -710446 -595477 -498133 -369786 -314110
15404c14110k093J37645l0798K08106L96149k21832J87797k1457k37766P772o56
$$ -314110 -316203 -178558 -209356 -1250 394899 173067 360864 339407 101641 109413 108757
15393A08757j41563R3805J07225O4169L8575l4586k05157J07996o4220o9067n9422
$$ 108757 -32806 60999 168224 232393 270968 236382 31225 139221 75001 5934 -53488
15382e3488J62274J06152k18429j68247K69331J12129K33364J9757P6948l34367
$$ -53488 108786 214938 -3491 -171738 97593 209722 443086 462843 539791 205424
15372B05424j78174J75J7192J38468N1763o2349r2818l3729j3888k5344q7585
$$ 205424 27250 27425 44617 183085 234848 172499 79681 45952 32064 6720 -80865
15361h0865P0666L28078N88884j3542k95017l72251P0784J05773N451q0390j19678
$$ -80865 -10199 317879 906763 893221 598204 225953 296737 402510 407961 327571 207893
15350B07893l8553j31148j39803q6172l71838J38472K22507k35327k52554J72430
$$ 207893 169340 38192 -101611 -187783 -559621 -421149 -198642 -433969 -686523 -514093
15340e14093J23326P3026J02656n2137K6938k1858K58636M20173L3229k8287j64250
$$ -514093 -390767 -317741 -215085 -267222 -240284 -262142 -3506 416667 449896 421609 257359
15329B57359J12589j12665r7647j33936N530J6219O5002J54260j07634L463K78192
$$ 257359 369948 257283 159636 25700 31230 47449 112451 266711 159077 162540 440732
15318D40732j42250n0471o200j75430j53051n7094M8085M15380O8935j63628k02766
$$ 440732 298482 248011 241811 66381 -86670 -143764 -95679 319701 388636 225008 22242
15307B2242j06559l911j6989j9073j08982j68269r9098P4568M61784K87599l76810
$$ 22242 -84317 -88228 -105217 -124290 -233272 -401541 -500639 -426071 35713 323312 -53498
15296e3498j04860K15985L60541L0893j71723K6960j92197k2386n7775l00684
$$ -53498 -158358 57627 418168 449061 277338 304298 112101 89715 31940 -268744
15286b68744R8665Q022m3193J86776l052K5130n826O0522j68659l71709J44079
$$ -268744 -170079 -162057 -205250 -18474 -21526 3604 -2222 58300 -110359 -482068 -337989
15275c37989L12233k0170P6560M5898k783j75537J1102Q2123j00295j01326j363
$$ -337989 -25756 -45926 30634 76532 73749 -101788 -90686 -8563 -108858 -210184 -211547
15264b11547l8344j6541j51568j18348J74907J79570k4607L7466K66063M01733
$$ -211547 -249891 -266432 -418000 -536348 -361441 -181871 -206478 -169012 97051 498784
15254D98784J11185j79560l72242k72498l83226j31618K55850L77463j6993R0999
$$ 498784 609969 430409 58167 -214331 -597557 -729175 -473325 -95862 -112855 -21856
15244b1856k06904j82074J06463J23856J02694L0021k8840J88927J36121q0812
$$ -21856 -228760 -410834 -304371 -180515 -77821 -47800 -76640 112287 248408 167596
15234A67596j82431k2844n7029k2547L24074R8685P765o7632r6711j92183J50530
$$ 167596 -14835 -37679 -94708 -117255 206819 305504 313269 245637 148926 -43257 107273
15223A07273O2021K8538q519r6218j4012M4973l38239O3557M1903J0302L9965
$$ 107273 169294 197832 189313 93095 79083 124056 -214183 -150626 -108723 -98421 -58456
15212e8456j50677q6311j54835J06755L38594j83895j66077q2252p8306J34258
$$ -58456 -209133 -295444 -450279 -343524 -4930 -188825 -354902 -437154 -515460 -381202
15202c81202O0563J02906Q3117J30260k58376p6165J06143J41796J66523j0569
$$ -381202 -320639 -217733 -134616 -4356 -262732 -338897 -232754 -90958 75565 64996
15192F4996j38749k08507j9265O0583J18623j54567k64596J00352K87782K73458
$$ 64996 -73753 -282260 -301525 -240942 -122319 -276886 -541482 -441130 -153348 120110
15182A20110k41987l47488n2763L2261M3123K18967N2005J84908m7946J9393O5737
$$ 120110 -121877 -469365 -522128 -489867 -446744 -227777 -175772 9136 -38810 -19417 46320
15171D6320j91411q3576m7508K116N0878R799j32514J77696J64793J04000j5312
$$ 46320 -145091 -228667 -276175 -274059 -223181 -213382 -345896 -168200 -3407 100593 85281
15160H5281J97550L1325l46152j47222j69395j17321n3564K49356J92491P734
$$ 85281 282831 314156 -31996 -179218 -348613 -465934 -519498 -270142 -77651 -69917
15150f9917k173l1053N2053M0267L3708P3781q4676k03090J30490K1823n5429
$$ -69917 -72090 -103143 -51090 -10823 22885 96666 11990 -191100 -60610 -38787 -94216
15139i4216k45042j34640k8708k3110R1354k6948J43878l0474K9923K0925J35275
$$ -94216 -339258 -473898 -502606 -525716 -434362 -461310 -317432 -347906 -317983 -297058 -161783
15128a61783j58275l20241M0725J54675L76449k6782K2694J70954J095j50995
$$ -161783 -320058 -640299 -599574 -444899 -68450 -95232 -72538 98416 99511 -51484
15118e1484k07220N938J56302l4656l6251k8922k16786k04405M24097K73727R5316
$$ -51484 -258704 -252766 -96464 -131120 -167371 -196293 -413079 -617484 -193387 80340 175656
15107A75656k39569m4072j06822k02008J51339J19512J69759K31674r810k03085
$$ 175656 -63913 -107985 -214807 -416815 -265476 -145964 23795 255469 245659 42574
15097D2574k5006K29263P5909m5764K92696p8129k10878j87141J1967m1699k30169
$$ 42574 17568 246831 322740 276976 569672 491543 280665 93524 105491 63792 -166377
15086a66377j9917J54647M02409n3924k09961o9186k15817L63281L39344j05997
$$ -166377 -186294 -31647 370762 316838 106877 37691 -178126 185155 524499 418502
15076D18502k58473m04189M4823j68186J16000M02434K50839j21982k85660j09870
$$ 418502 160029 -244160 -199337 -367523 -251523 150911 401750 279768 -5892 -115762
15066a15762J71246j60986r5541K8986J8067Q1533n258p7060O1792q7861k0995
$$ -115762 55484 -105502 -201043 -172057 -153990 -72457 -77715 -154775 -92983 -180844 -201839
15055b01839P3499k04349k50593J1792K82278K52235L4146J3359l50320m5995
$$ -201839 -128340 -332689 -583282 -571490 -289212 -36977 -2831 10528 -339792 -385787
15045c85787q3653J59844K5706J4334J8986P1255k0874K80401j32483J73863J72954
$$ -385787 -469440 -309596 -283890 -269556 -250570 -179315 -200189 80212 -52271 121592 294546
15034B94546r0021L9103J75381q3373j28260o0060K1623l6764j54371l3570P4231
$$ 294546 204525 243628 419009 335636 207376 147316 168939 132175 -22196 -55766 18465
15023A8465j99785j14668j48862L54644L33776O6020p9884j39517j4004k18824
$$ 18465 -181320 -295988 -444850 -90206 243570 309590 229706 90189 76185 -142639
15013a42639j25301L4201j79036j06378L37955j48271j87249Q8809L52661Q8503
$$ -142639 -267940 -233739 -412775 -519153 -181198 -329469 -516718 -427909 -75248 13255
15003A3255p6414j52713J21573m5474j60889j28982O0365L62501M3431l63505
$$ 13255 -63159 -215872 -94299 -139773 -300662 -429644 -369279 -6778 36653 -326852
14993c26852j34951M6896K59504J05835J70510J95554o9567j77974j51047K3560
$$ -326852 -461803 -414907 -155403 -49568 120942 316496 246929 68955 -82092 -58532
14983e8532k41641k17374P0385k09075K76346J96473K29547j74853k43230P520
$$ -58532 -300173 -517547 -447162 -656237 -379891 -183418 46129 -128724 -371954 -364434
14973c64434k16368j10953K93599P8745L5811j86942R6407J17138L34867o2092
$$ -364434 -580802 -691755 -398156 -319411 -283600 -470542 -374135 -256997 77870 15778
14963A5778k67312r876J16906J38088J63428m6862p0166J63548j50449k73321
$$ 15778 -251534 -261410 -144504 -6416 157012 110150 39984 203532 53083 -220238
14953b20238N5475r5789J64957j14169p3768m9230K12438r3162K48296m7404k10604
$$ -220238 -164763 -260552 -95595 -209764 -283532 -332762 -120324 -213486 34810 -12594 -223198
14942b23198k09523n2163j9780P9284L29638K17296k76859J04044K29499K4069
$$ -223198 -432721 -484884 -504664 -425380 -95742 121554 -155305 -51261 178238 202307
14932B02307L3789M9186j76050j33651N3497K67971K70394l28433o47591J51979
$$ 202307 236096 285282 109232 -24419 29078 297049 567443 239010 -408581 -256602
14922b56602J11530K3376K7999M527n5578p9689j803j57236j75752N01397J37968
$$ -256602 -145072 -121696 -93697 -89170 -144748 -224437 -226240 -383476 -559228 -57831 80137
14911H0137o6513M3314j9481p9685r8725K15068K1671j51099q8674Q8912R1970
$$ 80137 13624 56938 37457 -42228 -140953 74115 95786 -55313 -143987 -55075 36895
14900C6895K23946K8632j93104n0411J53976p7636M5381j04109m2558o3270k55324
$$ 36895 260841 289473 96369 45958 199934 122298 167679 63570 21012 -42258 -297582
14889b97582o9344j79615K35061L37246k11805M8234j19098Q2035j2870j4484
$$ -297582 -366926 -546541 -311480 25766 -186039 -137805 -256903 -174868 -187738 -202222
14879b02222K81841K83396q5036k1946j25691j11359j04039K4053j14115J14844
$$ -202222 79619 363015 277979 256033 130342 18983 -85056 -61003 -175118 -60274
14869f0274q2110K07391J29144j53906j3533J23726m0119l911m2405Q8892R6017
$$ -60274 -142384 65007 194151 40245 26712 150438 110319 106408 64003 152895 248912
14858B48912l1933j06891j6967M4313k22477m04667l36487Q58L37007K86743O9306
$$ 248912 216979 110088 93121 137434 -85043 -489710 -826197 -825339 -488332 -201589 -132283
14847a32283k25145j87678K39290k72355j9967J83729n0588J98134R7221K24347
$$ -132283 -357428 -545106 -305816 -578171 -598138 -414409 -464997 -266863 -169642 54705
14837E4705J71222k25574m08974K1068J44917K21393K996K15637R0814l48964
$$ 54705 225927 353 -408621 -387553 -242636 -21243 -18247 197390 288204 -60760
14827f0760l3745p7528J7621J59188j8646j69944P4332J6025J34589L4980J9424
$$ -60760 -94505 -172033 -154412 4776 -13870 -183814 -109482 -93457 41132 76112 95536
14816I5536P2562m4277p0598J93349q6189m37544n3927j44364r4227k1994K57885
$$ 95536 168098 123821 53223 246572 160383 -277161 -331088 -475452 -569679 -591673 -333788
14805c33788L31704J6943J52842j55917k48561R8716L50294j2293k14379j53287
$$ -333788 -2084 14859 167701 11784 -236777 -138061 212233 199940 -14439 -167726
14795a67726L1248p8637k22084q5556P4211L82432J93383o1917j59152L308L6072
$$ -167726 -136478 -215115 -437199 -522755 -448544 -66112 127271 65354 -93798 -90490 -54418
14784e4418J63093j45317k76710j44837k20713M9463J37270j10676J23696M6939
$$ -54418 108675 -36642 -313352 -458189 -678902 -629439 -492169 -602845 -479149 -432210
14774d32210L60341J61042J55012J23890j80653k11314l69685r0085q8033K47051
$$ -432210 -71869 89173 244185 368075 187422 -23892 -393577 -483662 -571695 -324644
14764c24644J87660k55988j48250K8988j01246j36339K28899n1517j69875R0965
$$ -324644 -136984 -392972 -541222 -512234 -613480 -749819 -520920 -572437 -742312 -651347
14754f51347J79491j12394q8076j89284R5581J46930K1440p9188j13345P7606
$$ -651347 -471856 -584250 -672326 -861610 -766029 -619099 -597659 -676847 -790192 -712586
14744g12586L80712L18549o2460j9682k3959j12245j06465l19938j47590J15865
$$ -712586 -331874 -13325 -75785 -95467 -119426 -231671 -338136 -658074 -805664 -689799
14734f89799J25088K77201J40142J16798N8372j54020j62346J48873J30222Q7179
$$ -689799 -564711 -287510 -147368 -30570 27802 -126218 -288564 -139691 -9469 77710
14724G7710J97167j13331j69372K62274J69161j86217j85140j38195j0890p9059
$$ 77710 274877 161546 -7826 254448 423609 237392 52252 -85943 -96833 -175892
14714a75892j56741K44474l8487j71738j51212K818q3342J5466J05933J31651
$$ -175892 -332633 -88159 -126646 -298384 -449596 -446778 -530120 -514654 -408721 -277070
14704b77070r574m0541o8895K24677J85243L60671j26146l79988O0930R5550J7090
$$ -277070 -286644 -327185 -396080 -171403 13840 374511 248365 -131623 -70693 24857 41947
14693D1947R4519q5447K32338L9239l10016k31663m7020N746K21782j17821l8180
$$ 41947 136466 51019 283357 322596 12580 -219083 -266103 -260357 -38575 -156396 -194576
14682a94576J42911R2861j31461N6917J1844J17928P627m6095M6643n4025R1098
$$ -194576 -51665 41196 -90265 -33348 -21504 96424 104051 57956 104599 50574 141672
14671A41672j48536l06815j38730J6415R3530J87745O2370M5070J88861l58j67059
$$ 141672 -6864 -313679 -452409 -435994 -342464 -154719 -92349 -47279 141582 141224 -25835
14660b5835j28056P7246J29543k6783o1095q6276O9798n7598O0357j3784L7713
$$ -25835 -153891 -76645 52898 26115 -34980 -121256 -51458 -109056 -48699 -62483 -24770
14649b4770N1617j25103k42522P1309J29715M66754o9637j49189K05586J02040
$$ -24770 26847 -98256 -340778 -269469 -139754 327000 257363 108174 313760 415800
14639D15800Q07j89855l54154j39381K51042M9147J34023L5362P5898J02765O8673
$$ 415800 416607 226752 -127402 -266783 -15741 33406 167429 202791 278689 381454 450127
14628D50127k34194j14056k43932k3992q0556J55907J24599J99332k97416l13782
$$ 450127 215933 101877 -142055 -166047 -246603 -90696 33903 233235 -64181 -377963
14618c77963l8758K49045K77484q1727k0107K06143r233j52543k20445k19585
$$ -377963 -416721 -167676 109808 28081 7974 214117 204884 52341 -168104 -387689
14608c87689N8596L50485K72222L4287L1057q495k9230j65403j80781l44750Q196
$$ -387689 -329093 21392 293614 327901 358958 350463 321233 155830 -24951 -369701 -361505
14597c61505L8634J65844M71983K38708m6740j42881j91798q1407Q2919P3945
$$ -361505 -322871 -157027 314956 553664 506924 364043 172245 90838 173757 247702
14587B47702K24654P5537l25634j87283J36036K08031j23822j36176J54655k30506
$$ 247702 472356 547893 222259 34976 171012 379043 255221 119045 273700 43194
14577D3194J3099L86441L6600k45324o9935j28788K6089J06383L2015k02988j55264
$$ 43194 56293 442734 479334 234010 164075 35287 61376 167759 199774 -3214 -158478
14566a58478L6277L16250l03676j61477j4821K36690J33901k72568k67345K39833
$$ -158478 -122201 194049 -109627 -271104 -285925 -49235 84666 -187902 -455247 -215414
14556b15414J35871j83523j64337m0901O5507k2097K70522K85777l8757k45263
$$ -215414 -79543 -263066 -427403 -468304 -402797 -424894 -154372 131405 92648 -152615
14546a52615R3504L96183J76179k53617j56139L5100k64618m97384m49L79091
$$ -152615 -59111 337072 513251 259634 103495 138595 -126023 -623407 -623856 -244765
14536b44765r5858M6337M7590N8620p595R927j27089j11456K70677l6141J2024
$$ -244765 -340623 -294286 -246696 -188076 -195671 -185744 -312833 -424289 -153612 -189753 -177729
14525a77729J6168k71502k25976J82701L54845P9206J53235L9842M3893j97173
$$ -177729 -161561 -433063 -659039 -476338 -121493 -42287 110948 150790 194683 -2490
14515b490j75469L29881J1050J18843J73601n6178j47168l5705l33838k1569J50050
$$ -2490 -177959 151922 162972 281815 455416 399238 252070 216365 -117473 -139042 11008
14504A1008q7183j87249o0791L8132J25975k2294j04157j20362J5854J37463K42529
$$ 11008 -76175 -263424 -324215 -286083 -160108 -182402 -286559 -406921 -391067 -253604 -11075
14493a1075n2533J40209J38n7910j14281j58357l4881J72299K92961m10932r2880
$$ -11075 -63608 76601 76739 18829 -95452 -253809 -288690 -116391 176570 -234362 -327242
14482c27242L58184J20238j03115P305N1639J88616o8666J96261K3835k03362
$$ -327242 30942 151180 48065 55370 107009 295625 226959 423220 447055 243693
14472B43693l10081j92994j27559J20559L77928J68770O2513Q6690J28084j03829
$$ 243693 -66388 -259382 -386941 -266382 111546 280316 342829 429519 557603 453774
14462D53774m1358l48393n72375L608L65848K96753p2002R3783k4418j39963k9866
$$ 453774 412416 64023 -508352 -504744 -138896 157857 85855 179638 155220 15257 -14609
14451a4609O9223N8201K1817k54033k76701K29422O94795p7933l87557p7046j13139
$$ -14609 54614 112815 134632 -119401 -396102 -166680 528115 450182 62625 -14421 -127560
14440a27560j04310J64352j41426J44149n2419n1419J6063k53625k9858L55411
$$ -127560 -231870 -67518 -208944 -64795 -117214 -168633 -152570 -406195 -436053 -80642
14430h0642K68083k9196n8910k73264K37457K31478n2058q2550J49248n9808j07525
$$ -80642 187441 158245 99335 -173929 63528 295006 242948 160398 309646 249838 142313
14419A42313j06008J1815J79231o8320l5680L7136p6573J30258p1340j40679j89000
$$ 142313 36305 48120 227351 159031 123351 160487 83914 214172 142832 2153 -186847
14408a86847j27414L72705L59156K13380N289m00049j25447M5622K2124j01863
$$ -186847 -314261 58444 417600 630980 636269 236220 110773 156395 178519 76656
14398G6656J8273o3211j41309k02610K86827M92952j51717j9476j65557q3611
$$ 76656 94929 31718 -109591 -312201 -25374 467578 315861 296385 130828 47217
14388D7217K46844K940J10596k52635j75901K31845M54410j04173m58492l9093
$$ 47217 294061 297001 407597 154962 -20939 210906 665316 561143 102651 63558
14378F3558k7180l7240K55734N7080j41403j31163j38960K9964l7907Q7841k24397
$$ 63558 36378 -862 254872 311952 170549 39386 -99574 -69610 -107517 -19676 -244073
14367b44073m8255l7910K44349J89504l72591J2249J26004L8791J47876J57071
$$ -244073 -292328 -330238 -85889 103615 -268976 -256727 -130723 -91932 55944 213015
14357B13015M3368j40478k40909K72304j01264o345J42688K21937l59909k96772
$$ 213015 256383 115905 -125004 147300 46036 39691 182379 404316 44407 -252365
14347b52365J06020N8308K2576M4667j2716q3221J16893m7324J49471R2354K3624
$$ -252365 -146345 -88037 -65461 -20794 -33510 -116731 162 -47162 102309 194663 218287
14336B18287m7973j48056l03776n3821j87883k3164J09490o907j46190J12275
$$ 218287 170314 22258 -281518 -335339 -523222 -546386 -436896 -443803 -589993 -477718
14326d77718R9937r7861j19452K42488Q8416n347k5255Q4780L7764J32272J51580
$$ -477718 -377781 -475642 -595094 -352606 -264190 -269537 -294792 -210012 -172248 -39976 111604
14315A11604p1490l00898q1282J13600L49035L49668J88806j86760j42763R3563
$$ 111604 40114 -260784 -342066 -228466 120569 470237 659043 472283 329520 423083
14305D23083k55285j37701J94216j69629M7286j0941j71158k97375k59423O8039
$$ 423083 167798 30097 224313 54684 101970 91029 -80129 -377504 -636927 -568888
14295e68888J21602K04599J67975n4120j0872J22721P2156K03869j52979q7487
$$ -568888 -447286 -242687 -74712 -128832 -139704 -16983 55173 259042 106063 18576
14285A8576J64105j50323j52341M7627k50857P095L64924K14009k04278k8078
$$ 18576 182681 32358 -119983 -72356 -323213 -316118 48806 262815 58537 30459
14275C0459J82863K07046J50559J79003k12705j68570R2027K7232k95929N6840
$$ 30459 213322 420368 570927 749930 537225 368655 460682 487914 191985 248825
14265B48825j31064k31487l2596K57511j35436J27502J44931n1671q4675j70112
$$ 248825 117761 -113726 -146322 111189 -24247 103255 248186 196515 111840 -58272
14255e8272L663p5150k02086J99440K03066K52988p5972o8694p0704O1740L8225
$$ -58272 -54609 -129759 -331845 -132405 70661 323649 247677 178983 108279 170019 208244
14244B08244j6109M3025k25685J6336J35036L1431l23038Q0597R0589n6396l0105
$$ 208244 192135 235160 9475 25811 160847 192278 -130760 -50163 40426 -15970 -46075
14233d6075O7959N2249n4345q404q8738J78321M4409k23210p4017J64324J38040
$$ -46075 21884 74133 19788 11384 -77354 100967 145376 -77834 -151851 12473 150513
14222A50513J33427r9010k23720J73218M5610l6635K29851k26728q7486P8914
$$ 150513 283940 184930 -38790 134428 180038 143403 373254 146526 59040 137954
14212A37954K4561j1981N7823j10431j25563J69822J91841P6686j95197m70530
$$ 137954 162515 150534 208357 97926 -27637 142185 334026 410712 215515 -255015
14202b55015J06405K09649P0452o0981n0240j9205q0360J14102J45574l05181
$$ -255015 -148610 61039 131491 70510 20270 1065 -79295 34807 180381 -124800
14192a24800O016k8305j01539j53887M5917J55823J07055q9672L4301P6831j10271
$$ -124800 -118784 -147089 -248628 -402515 -356598 -200775 -93720 -183392 -149091 -72260 -182531
14181a82531K65240p6094K09883l9243j7625k59083l10805K00448J60475J80942
$$ -182531 82709 6615 216498 177255 159630 -99453 -410258 -209810 -49335 131607
14171A31607r9677M4746j4057k04841j83429J57769K56550M55860m04902j48594
$$ 131607 31930 76676 62619 -142222 -325651 -167882 88668 544528 139626 -8968
14161h968j29608j23731k19702q7684Q1217K6015L2843L35207P2153o192J00034
$$ -8968 -138576 -262307 -482009 -569693 -488476 -462461 -429618 -94411 -22258 -28450 71584
14150G1584j72275l05806N6729K17274L8588j53616J30706P6888L7230P8444q2339
$$ 71584 -100691 -406497 -349768 -132494 -93906 -247522 -116816 -39928 -2698 75746 -6593
14139f593j12264k190J85395m8687k00026M9479j54515P6666p7201K3082L67087
$$ -6593 -118857 -121047 64348 15661 -184365 -134886 -289401 -212735 -289936 -266854 100233
14128A00233L60926j29776k24519m43325o4317o7096j47980K4070K09338K22909
$$ 100233 461159 331383 106864 -336461 -400778 -467874 -615854 -591784 -382446 -159537
14118a59537O22L784m5002j92113j56672J49339J418K31103l0051p0668K15828
$$ -159537 -158915 -155131 -200133 -392246 -548918 -399579 -398161 -167058 -197109 -267777 -51949
14107e1949Q4820Q933l7384J56832j56515J74919Q005k18226q8865l20612K48207
$$ -51949 32871 41804 4420 161252 4737 179656 187661 -30565 -119430 -440042 -191835
14096a91835K02631r655O3666N3453l10074N7777Q7694J56395k15160k02681n5557
$$ -191835 10796 1141 64807 118260 -191814 -134037 -46343 110052 -105108 -307789 -363346
14085c63346O4885M1425N7618K3717J16783L1108j78236J1138M2837l97786n7872
$$ -363346 -298461 -257036 -199418 -175701 -58918 -27810 -206046 -194908 -152071 -549857 -607729
14074f07729J6852J38976K12885N0767N4728n0733l38446k75937J63116K55527
$$ -607729 -590877 -451901 -239016 -188249 -133521 -184254 -522700 -798637 -635521 -379994
14064c79994j4585r3210o1399O9019M05059J71616K1881K3185k6446L6373Q3791
$$ -379994 -394579 -487789 -549188 -480169 -75110 96506 118387 141572 115126 151499 235290
14053B35290L4586k53646j17721P4432j48915j9869k01279M9914r087L3541k0022
$$ 235290 269876 16230 -101491 -27059 -175974 -195843 -397122 -347208 -356295 -322754 -342776
14042c42776n7723j56829k265K3814q0527J09050J73267M43689J89484k00430
$$ -342776 -400499 -557328 -559593 -535779 -616306 -507256 -333989 109700 299184 98754
14032I8754j85192O8429P3788J30894K09690l07121k35743m4496l687J0418J64563
$$ 98754 -86438 -18009 55779 186673 396363 89242 -146501 -190997 -194684 -184266 -19703
14021a9703K76166K45158j00724k46256L3219R134J39803j6280k52828N8314k9499
$$ -19703 256463 501621 400897 154641 187860 196994 336797 320517 67689 126003 96504
14010I6504k91442j54445J50492N4528j02028P2153J5864n8586M8254J10608q631
$$ 96504 -194938 -349383 -198891 -144363 -246391 -174238 -158374 -216960 -168706 -58098 -66729
13999f6729K54653j33757R486j15041r9015j60804O9373J54890M1112J05478j53760
$$ -66729 187924 54167 63653 -51388 -150403 -311207 -241834 -86944 -45832 59646 -94114
13988i4114j78296L9545J03512L50364P4812K6605j13213r8100j97608K14919
$$ -94114 -272410 -232865 -129353 221011 295823 322428 209215 111115 -86493 128426
13978A28426N3661j04069J33786l40130K3819L57161J10131j95495r3463O2542
$$ 128426 182087 78018 211804 -128326 -104507 252654 362785 167290 73827 136369
13968A36369Q6449J62697n1135j50172P0926P1135k15641p4289o9855o8873K5318
$$ 136369 222818 385515 334380 184208 255134 326269 110628 36339 -33516 -102389 -77071
13957g7071l1348K00802j60091N5583K54699O5613l4583R0754j89534l87090P8138
$$ -77071 -108419 92383 -67708 -12125 242574 308187 273604 364358 174824 -212266 -134128
13946a34128J35434J11828J33361L7887R1902O1014l6799j43326j68330m0668
$$ -134128 1306 113134 246495 284382 376284 437298 400499 257173 88843 48175
13936D8175J6130K71175M288j35009j32177k2598J80297N2521p3858p1994k03139
$$ 48175 64305 335480 339768 204759 72582 49984 230281 282802 208944 136950 -66189
13925f6189q9038P3640N5242J1848K53041q8639m8394J88976j89733n1697J27406
$$ -66189 -155227 -81587 -26345 -14497 238544 149905 101511 290487 100754 49057 176463
13914A76463O6833J189j79915q8088l86760J7808L62207Q1193J69987L2514m37630
$$ 176463 243296 244485 64570 -23518 -410278 -392470 -30263 50930 220917 253431 -184199
13903a84199j46318J58317Q1677L76411n5133j78959J66531n594J53306q3717
$$ -184199 -330517 -172200 -90523 285888 230755 51796 218327 212733 366039 282322
13893B82322J00611j83298j77251K18197Q8124j05625O1435J83906p3050j62662
$$ 282322 382933 199635 22384 240581 328705 223080 284515 468421 395371 232709
13883B32709k32604j77929j71625K51838J97303O1393J47684M6570k42877j11900
$$ 232709 105 -177824 -349449 -97611 99692 161085 308769 355339 112462 562
13873E62R7656J23977J28507k52262j96116K07848m3376k53964R3566q9323J81866
$$ 562 98218 222195 350702 98440 -97676 110172 66796 -187168 -93602 -182925 -1059
13862a059K58770J8216Q4271O2030n9741m2639J56442L5151K7117J73915L20091
$$ -1059 257711 275927 360198 422228 362487 319848 476290 511441 538558 712473 1032564
13851A032564Q6458J18707P787R2769K08364l3346J00872J36990l1669M8009K46263
$$ 1032564 1119022 1237729 1245516 1338285 1546649 1513303 1614175 1751165 1719496 1767505 2013768
13840B013768K98760j6014P1568j99155Q2125K75931j19298k22615k06449j63740
$$ 2013768 2312528 2296514 2368082 2168927 2251052 2526983 2407685 2185070 1978621 1814881
13830A814881p7770k26735j61806k20603l57270P8872j0491j19131j88563l53340
$$ 1814881 1737111 1510376 1348570 1127967 770697 849569 839078 719947 531384 178044
13820A78044J63844o1352j00436J42741M7106k2226n9397J060Q0250L0585l51328
$$ 178044 341888 280536 180100 322841 369947 347721 288324 289384 369634 400219 48891
13809D8891p3698Q2898j8976L38597O3460J35611Q9859m0361j38085l20983J22669
$$ 48891 -24807 58091 39115 377712 441172 576783 666642 626281 488196 167213 289882
13798B89882J34634j86492l3743M3351J35894P0717p3962k95693j23443K77159
$$ 289882 424516 238024 204281 247632 383526 454243 380281 84588 -38855 238304
13788B38304K7944j03648n4030k04681j07284j6719O1881K724j357J51407Q6174
$$ 238304 266248 162600 108570 -96111 -203395 -220114 -158233 -155509 -156866 -5459 80715
13777H0715Q9893j65775J13129l7753O5174K78474K4513k07562k13640J37310
$$ 80715 170608 4833 117962 80209 145383 423857 448370 240808 27168 164478
13767A64478M41113K10828O1578j78481k08175l07858l32196k39856J66559J90607
$$ 164478 605591 816419 877997 699516 491341 183483 -148713 -388569 -222010 -31403
13757c1403J76979J78227Q2011j47175k97881K83818J30929j58251Q1548K46614
$$ -31403 145576 323803 405814 258639 -39242 244576 375505 217254 298802 545416
13747E45416p9287n1410M6040j20093n14935j48527J43711l24755k50076M32124
$$ 545416 466129 414719 460759 340666 -174269 -322796 -179085 -503840 -753916 -321792
13737c21792M74824J86329J98786n0113q4979j31329r1545j03273k72206j01506
$$ -321792 153032 339361 538147 488034 403055 271726 180181 76908 -195298 -296804
13727b96804K05828K91354M75328l9150l95707j21819k02576L38188K45895J56109
$$ -296804 -90976 200378 675706 636556 240849 119030 -83546 254642 500537 656646
13717F56646O2129m5741k37911k32110j87165m842J31968J45906L06837K86858
$$ 656646 718775 673034 435123 203013 15848 11006 142974 288880 595717 882575
13707H82575l00139m04107j04791j36003m3037l8131k0292L27627L68195N8525
$$ 882575 582436 178329 73538 -62465 -105502 -143633 -163925 163702 531897 590422
13697E90422j11400j48481J05458J31869l6694k13480k46974J4918J50504O5765
$$ 590422 479022 330541 435999 567868 531174 317694 70720 85638 236142 301907
13687C01907J3251P1113K4897q3525j64090k35334q7163J55026K82379j8256l5614
$$ 301907 315158 386271 411168 327643 163553 -71781 -158944 -3918 278461 260205 224591
13676B24591J70926l4890o2446J6008L33557K44097J85897j19241n04681Q5918
$$ 224591 395517 360627 298181 314189 647746 891843 1077740 958499 453818 539736
13666E39736J47332R7374j59882m46723K19148n9671P1508J8980k38402j44647
$$ 539736 687068 784442 624560 177837 396985 337314 408822 427802 189400 44753
13656D4753j78484k18769J3137R0114M3647K34036K30526K04816k38524k39543
$$ 44753 -133731 -352500 -339363 -249249 -205602 28434 258960 463776 225252 -14291
13646a4291J34536m3871j45453J1458l3746K53594j05569k9066J97655L08675
$$ -14291 120245 76374 -69079 -57621 -91367 162227 56658 27592 225247 533922
13636E33922n4100j80494k18660j02407j824L5474R0805Q1224M1041K710k7067
$$ 533922 479822 299328 80668 -21739 -23563 11911 102716 183940 224981 227691 200624
13625B00624P5878p4531j11205j9815k23023m5149j18931J48027N5696o9255K81415
$$ 200624 276502 201971 90766 70951 -152072 -197221 -316152 -168125 -112429 -181684 99731
13614I9731M00471L14638K00133j17283j06760j83059o2196j5729J665Q836k07457
$$ 99731 500202 814840 1014973 897690 790930 607871 545675 529946 531611 540447 332990
13603C32990l97187m2550q828O7372J10247k88391k99504J69401L00830N57745
$$ 332990 -64197 -106747 -115575 -48203 62044 -226347 -525851 -356450 -55620 502125
13593E02125J87534L8359l76837j06974J91383J19940j39665k00515j88105J91344
$$ 502125 689659 728018 351181 244207 435590 555530 415865 215350 27245 218589
13583B18589J2422J7631o661k48786J25185K5021r8876j26220j69775J4450n6508
$$ 218589 231011 248642 241981 -6805 118380 143401 44525 -81695 -251470 -237020 -293528
13572b93528O8571J71779K25096M9651N5567R895j9925J02096Q1997k96683j95056
$$ -293528 -224957 -53178 171918 221569 277136 287031 267106 369202 451199 154516 -40540
13561d0540Q8628p1119j15800P6804K45047K18155O6572n2859k91026Q0465K38692
$$ -40540 48088 -23031 -138831 -62027 183020 401175 467747 414888 123862 204327 443019
13550D43019J37134j18535m5728k27914k02065J69104N990M5750o3715j4459J12339
$$ 443019 580153 461618 415890 187976 -14089 155015 161005 206755 143040 128581 240920
13539B40920k14395Q0268J30089m1578O8890J3695K5814M9282J71712p9056k40995
$$ 240920 26525 106793 236882 195304 264194 277889 303703 352985 524697 445641 204646
13528B04646l717J49559n2408p5252N5567Q3646m21055m8326J95734M8208N3492
$$ 204646 200929 350488 298080 222828 278395 362041 -59014 -107340 88394 136602 190094
13517A90094k487K16836n7938j95455p0264L03357K03399M3972j16241l81264
$$ 190094 187607 404443 346505 151050 80786 384143 587542 631514 515273 134009
13507A34009k25520K15055J97901j93061j0750L7587J5141k4234l9984j3170j08219
$$ 134009 -91511 123544 321445 128384 117634 155221 170362 146128 106144 92974 -15245
13496a5245O6357J80070n0218p3359Q772J52275j4993k0662J46576j2247K49048
$$ -15245 51112 231182 180964 107605 116377 268652 253659 232997 379573 367326 616374
13485F16374m30617o8322N0087J96668L6635R6718K1168j29024j92430j39424
$$ 616374 185757 117435 167522 364190 400825 497543 518711 389687 197257 57833
13475E7833J36904l0107Q958Q2040P6464l1681k6795j56946J05245k3729p7330
$$ 57833 194737 164630 173588 255628 332092 300411 273616 116670 221915 198186 120856
13464A20856J67463j20326j79192J03845k6380K13326J12448j41754K667J55307
$$ 120856 288319 167993 -11199 92646 66266 279592 392040 250286 252953 408260
13454D08260M43682n8106l89019k04806K521J71182j0529Q8824n6473p4813J18377
$$ 408260 851942 793836 404817 200011 202532 373714 363185 452009 395536 320723 439100
13443D39100q7096J5723J49717K18402j42690k28535l15804j84390J81845J34329
$$ 439100 352004 367727 517444 735846 593156 364621 48817 -135573 46272 180601
13433A80601N6661l9322j02164o835L4315L61306N8855j80303k08720O1040k6989
$$ 180601 237262 197940 95776 88941 123256 484562 543417 363114 154394 215434 188445
13422A88445K3191l6990p4393k13345l07781j32475J88251o6467j20292J47547
$$ 188445 211636 174646 100253 -113092 -420873 -553348 -365097 -431564 -551856 -404309
13412d04309K28717P2847J64272P1226K73056o0436j0442J99274J3598J01782
$$ -404309 -175592 -102745 61527 132753 405809 345373 334931 534205 547803 649585
13402F49585j55264n1559j53567m32540k59469K09552Q8165r1519j48546K58839
$$ 649585 494321 442762 289195 -143345 -402814 -193262 -105097 -196616 -345162 -86323
13392h6323J71976J22203j82967k12919j70950J91681L86298M0121M0788J60302
$$ -86323 85653 207856 24889 -188030 -358980 -167299 218999 259120 299908 460210
13382D60210K03411P6103k26713n29345m14990K7932K71838K81419j26192j77136
$$ 460210 663621 739724 513011 -16334 -431324 -403392 -131554 149865 23673 -153463
13372a53463q593j59675j09320L6800J36491J97299J38915K00018j34264p9015
$$ -153463 -162056 -321731 -431051 -394251 -257760 -60461 78454 278472 144208 65193
13362F5193n2086J4990k84272J63068L00751J29619k1938O5809l17529k78735
$$ 65193 13107 28097 -256175 -93107 207644 337263 315325 381134 63605 -215130
13352b15130J17961K92393N1783j27985M806j74171p1728Q4349J9785j01869P0466
$$ -215130 -97169 195224 247007 119022 123828 -50343 -122071 -37722 -17937 -119806 -49340
13341d9340j23389N0877M674j24741P8461q0763j49064j73417J97450R3072J04301
$$ -49340 -172729 -121852 -117178 -241919 -163458 -244221 -393285 -566702 -369252 -276180 -171879
13330a71879o8559R1551r3188M9689R5291P1999j18187m1914J51130K82894k33746
$$ -171879 -240438 -148887 -242075 -192386 -97095 -25096 -143283 -185197 -34067 248827 15081
13319A5081o8018J77009j46651l9667O5079K27752J00022K14571P8213m9420p3515
$$ 15081 -52937 124072 -22579 -62246 2833 230585 330607 545178 623391 573971 500456
13308E00456j42178l5690j88849j18520N3314j27660k34259J08566J45352J36365
$$ 500456 358278 322588 133739 15219 68533 -59127 -293386 -184820 -39468 96897
13298I6897k22441j68489J80293J35816m1731K681J38148M4022M510J86338k33581
$$ 96897 -125544 -294033 -113740 22076 -19655 -16974 121174 165196 169706 356044 122463
13287A22463J72395p4813j99521m63984R0644K66441J13589k30184J40455K58637
$$ 122463 294858 220045 20524 -443460 -352816 -86375 27214 -202970 -62515 196122
13277A96122J48547q4497M138m34100J1803M22495K82005O8450L9786l3932j36022
$$ 196122 344669 260172 264310 -169790 -157987 264508 546513 614963 654749 620817 484795
13266D84795j01195L5672J3606n5048m61147k34305r7049j1653J65340L63573
$$ 484795 383600 419272 432878 377830 -83317 -317622 -414671 -426324 -260984 102589
13256A02589j27718j56996o613p6479J75454j5053O7141J90587K86516q6351k76291
$$ 102589 -25129 -182125 -188738 -265217 -89763 -104816 -37675 152912 439428 353077 76786
13245G6786j29032P1555j49370j9386j29014m2491R1246O5172L53369J16181M4342
$$ 76786 -52246 19309 -130061 -149447 -278461 -320952 -229706 -164534 188835 305016 349358
13234C49358j89696N4263n8641o8461R0987k2898j30786k45732k6422N2908P2074
$$ 349358 159662 213925 155284 86823 177810 154912 24126 -221606 -248028 -195120 -123046
13223a23046j81738N4199J68359J07074j19602o8785K07896K67977J26159j00317
$$ -123046 -304784 -250585 -82226 24848 -94754 -163539 44357 312334 438493 338176
13213C38176j85704o9994k688N4046l7673k73458J35212J4534N1154J65487J53325
$$ 338176 152472 82478 79790 133836 96163 -177295 -42083 -27549 23605 189092 342417
13202C42417j08304J2100J43696p0016K08894l14727n1703l22944j33876K07742
$$ 342417 234113 246213 389909 319893 528787 214060 162357 -160587 -294463 -86721
13192h6721K20650J90002p6179j37483J04230J19066j87082P7457j35282j18447
$$ -86721 133929 323931 247752 110269 214499 333565 146483 223940 88658 -29789
13182b9789J59144M9367j76643o131L6361J35848J61851P727j48446n2181j8954
$$ -29789 129355 178722 2079 -4052 32309 168157 330008 337735 189289 137108 118154
13171A18154J8012M02269k06538j82941M8062j5724K08798J39822j54857k3307
$$ 118154 136166 538435 331897 148956 197018 181294 390092 529914 375057 351750
13161C51750k90101J8573o9282P2004j98312k0170L37232O7168k47710j39719
$$ 351750 61649 80222 10940 82944 -115368 -135538 201694 268862 21152 -118567
13151a18567L09435M500j15677p5168J9326P9551J16637M6314J4293K4638j55332
$$ -118567 190868 195368 79691 4523 23849 103400 220037 266351 280644 305282 149950
13140A49950P569O1448J85018J13929k46308L3144J870K1966j38441R4249K75363
$$ 149950 157519 218967 403985 517914 271606 304750 306620 328586 190145 284394 559757
13129E59757L9258j38716k82077k66014Q3236K923P2974J20625n2027P6418M72378
$$ 559757 599015 460299 178222 -87792 -4556 -1633 71341 191966 139939 216357 688735
13118F88735n1642k94432j83077l89692k27277J88564N1050j51524L99641R1660
$$ 688735 637093 342661 159584 -230108 -457385 -268821 -217771 -369295 30346 122006
13108A22006j46565p3609r6355m9078N8195K98103K21991Q4380J04194K56688
$$ 122006 -24559 -98168 -194523 -243601 -185406 112697 334688 419068 523262 779950
13098G79950M1394k28264j92631K4740L321j27475M7075j13649l5327O0062r1869
$$ 779950 821344 593080 400449 425189 428510 301035 348110 234461 199134 259196 167327
13087A67327J65284k08891R731M6658J60168M9601q6167o9982N7624r0835j1083
$$ 167327 332611 123720 133451 180109 340277 389878 303711 233729 291353 200518 189435
13076A89435J33184P0625j85623O4676J64721j83395K11932J95912k02416l48439
$$ 189435 322619 393244 207621 272297 437018 253623 465555 661467 459051 110612
13066A10612J66151K17052M7224k08059l34939k41458K98683Q4832l23901r2235
$$ 110612 276763 493815 541039 332980 -1959 -243417 55266 140098 -183803 -276038
13056b76038K17956j42600L3628K53406L06223j97734k95606j23599J01720L06953
$$ -276038 -58082 -200682 -167054 86352 392575 194841 -100765 -224364 -122644 184309
13046A84309p96k15446K23173R4604j99016J42661j09205K017K07566J6897k2851
$$ 184309 183513 -31933 191240 285844 86828 229489 120284 122301 329867 346764 323913
13035C23913K7755M7762M22234k26024k93731J43713K07344L23307j54290j54871
$$ 323913 351668 399430 821664 595640 301909 445622 652966 976273 821983 667112
13025F67112j87635n09972N0445J58744p9269J74512J60225l59856m44865l43807
$$ 667112 479477 -30495 19950 178694 99425 273937 434162 74306 -370559 -714366
13015g14366M3976K84268O748j08328M5482O6746K00293R7000J23928J92094l47635
$$ -714366 -670390 -386122 -379374 -487702 -442220 -375474 -175181 -78181 45747 237841 -109794
13004a09794l4920l6671M0952j20997O3514Q3598j60975l5756K54248R907j77829
$$ -109794 -144714 -181385 -140433 -261430 -197916 -114318 -275293 -311049 -56801 -46894 -224723
12993b24723L04070k22181k18434M37277K45883j72084R8939J56210L3747r4285
$$ -224723 79347 -142834 -361268 76009 321892 149808 248747 404957 438704 344419
12983C44419P0442J57555J5839k1428O3852L5467n49039j98050J7910J50772K66063
$$ 344419 414861 572416 588255 566827 630679 666146 117107 -80943 -63033 87739 353802
12972C53802K25014J34696j4986J25015k29703j87196K38475J65210j51481j31229
$$ 353802 578816 713512 698526 823541 593838 406642 645117 810327 658846 527617
12962E27617l72475R932J76565k26120L9848N52010m6161l89067j45676J51718
$$ 527617 155142 165074 341639 115519 155367 707377 661216 272149 126473 278191
12952B78191K45342l03252k97217J02470J05545K51891R053j72220J70491J06432
$$ 278191 523533 220281 -76936 25534 131079 382970 392023 219803 390294 496726
12942D96726m60384q2324N7449j28608O8002M2810q5823J53543K47495m2935j28860
$$ 496726 36342 -45982 11467 -117141 -49139 -6329 -92152 61391 308886 265951 137091
12931A37091k03137k1819M3693k03269j82514J40660L27869L23537J32411q4718
$$ 137091 -66046 -87865 -44172 -247441 -429955 -289295 38574 362111 494522 409804
12921D09804J21196K00759j3572k39060k42199K30996j29683p3027Q006j51774
$$ 409804 531000 731759 718187 479127 236928 467924 338241 265214 273220 121446
12911A21446r5832J93591m6905p3931K58431o6475k83406j5198l18386k36867
$$ 121446 25614 219205 172300 98369 356800 290325 6919 -8279 -326665 -563532
12901e63532J49978J74871L09327K83858N6715m7875o5006j53111j00333n7259
$$ -563532 -413554 -238683 70644 354502 411217 363342 298336 145225 44892 -12367
12891a2367R7468L77J34970j5040j19269K92878P0934O8466J5236K40437j02179
$$ -12367 85101 85478 220448 205408 86139 379017 449951 518417 533653 774090 671911
12880F71911l05272J37839q1766J3896N7797l05689o3662r334M6307J10163l1646
$$ 671911 366639 504478 422712 436608 494405 188716 125054 115720 162027 272190 240544
12869B40544J16122p9833l8802r9059R0121q8165j49859R7772o2036q2666J40374
$$ 240544 356666 276833 238031 138972 229093 140928 -8931 88841 26805 -55861 84513
12858H4513L3681J7222k33702j32352P4745P3900K25325J39341P003R8781p2520
$$ 84513 118194 135416 -98286 -230638 -155893 -81993 143332 282673 289676 388457 315937
12847C15937k5105J16361K27351j0427k11581j59294o6355k05864L0316j72868
$$ 315937 290832 407193 634544 624117 412536 253242 186887 -18977 11339 -161529
12837a61529O4598K81799R6205J86046k9637k43343k45315M48R249j68498m0767
$$ -161529 -96931 184868 281073 467119 437482 194139 -51176 -50728 -41479 -209977 -250744
12826b50744J89730L9252k8116L82167j64179l49025k40426M9869K72215R735
$$ -250744 -61014 -21762 -49878 332289 168110 -180915 -421341 -371472 -99257 -89522
12816h9522r3843k7900J54215M726q2781K13344K36299p1786o966j48862j87754
$$ -89522 -183365 -211265 -57050 -52324 -135105 78239 314538 242752 235786 86924 -100830
12805a00830m4792j91616K19646P4105q0465J62890Q7091q7177o208r1877R8665
$$ -100830 -145622 -337238 -117592 -43487 -123952 38938 126029 38852 32644 -59233 39432
12794C9432Q5274j6684k5210r26J71727N9718L7575j09561J74211j31857j47147
$$ 39432 124706 108022 82812 81886 253613 313331 350906 241345 415556 283699 136552
12783A36552Q9857o8125K76833p0397l96603k00035J41745K86094J18230J18923
$$ 136552 226409 158284 435117 364720 -31883 -231918 -90173 195921 314151 433074
12773D33074P6213J35922m1378r4283j87474k30907K8003J06549J70111j53667
$$ 433074 509287 645209 603831 509548 322074 91167 119170 225719 395830 242163
12763B42163j64565o966p5427J47875J87788P7896P4465j1291r2955j33305j19530
$$ 242163 77598 70632 -4795 143080 330868 408764 483229 471938 378983 245678 126148
12752A26148M5023k3352p2319J46539K19323m4034M3386R0308k3679k01890o1288
$$ 126148 171171 147819 75500 222039 441362 397328 440714 531022 507343 305453 244165
12741B44165j08155j38499Q1261O718L7317l7237k5181j26902J984L27096N8571
$$ 244165 136010 -2489 78772 85490 122807 85570 60389 -66513 -64529 262567 321138
12730C21138N1372k6603j36662k80774K7644N69885N731j97239Q746k92451m8448
$$ 321138 372510 345907 209245 -71529 -43885 526000 531731 334492 343238 50787 2339
12719B339p5623K55340K10764p8966j60177n654j80419K6206p0179m68774J23792
$$ 2339 -73284 182056 392820 313854 153677 148023 -32396 -6190 -76369 -545143 -421351
12708d21351L96193L89418n7455k28090O7315R7414j3822j25606j86553K05287
$$ -421351 -25158 364260 306805 78715 146030 243444 229622 104016 -82537 122750
12698A22750j08069n8940o0189J23233N41293J35376P6624J34700m88433l80369
$$ 122750 14681 -44259 -104448 18785 560078 695454 772078 906778 418345 37976
12688C7976O7647K17331K6034P7472J7007j30788j5294Q1954O381j27689O5288
$$ 37976 105623 322954 348988 426460 443467 312679 297385 379339 385720 258031 323319
12677C23319p0599k43287r5460J0197K3054P1884J49749o5968j06040K84233k1060
$$ 323319 252720 9433 -86027 -75830 -52776 19108 168857 102889 -3151 281082 260022
12666B60022j89812J269n0495p5705K0685L63497j9290k31801m0416J78909K31602
$$ 260022 70210 71479 20984 -54721 -34036 329461 310171 78370 37954 216863 448465
12655D48465J58298q0526k77625P3226J30011m5928q4833k0333R1370j28494k08099
$$ 448465 606763 526237 248612 321838 451849 405921 321088 300755 392125 263631 55532
12644E5532J77153J72128Q4028Q7411m4891k67860J15866n0578K99499J76094
$$ 55532 232685 404813 488841 576252 531361 263501 379367 328789 628288 804382
12634H04382j04376l70218j94784n1528l10474n0061J93932J64482r0136J45665
$$ 804382 700006 329788 135004 83476 -226998 -277059 -83127 81355 -8781 136884
12624A36884J12513M2455k5389r9581J76077K33084J4706j50408j41844R0760
$$ 136884 249397 291852 266463 166882 342959 576043 590749 440341 298497 389257
12614C89257q91Q5469k1078j37655m4731K08057j19671J9088L04081j36797j96000
$$ 389257 388366 473835 452757 315102 270371 478428 358757 377845 681926 545129 349129
12603C49129J1547j68516j02058J56282M0789J34841O749J31453K12748P3647
$$ 349129 360676 192160 90102 246384 287173 422014 428763 560216 772964 846611
12593H46611L2334o980O5186j60934j46898q6776J0738j12582J02333O5023j68781
$$ 846611 878945 871965 937151 776217 629319 542543 553281 440699 543032 608055 439274
12582D39274j32522P2989K11564k77941Q1458j11584l80094J55565K22863p8029
$$ 439274 306752 379741 591305 313364 394822 283238 -96856 58709 281572 203543
12572B03543M2743m3362p9926j10304K12473m4569J10719p2107O3147O6896o9763
$$ 203543 246286 202924 122998 12694 225167 180598 291317 219210 282357 349253 279490
12561B79490J28318r8967j09971P3386n1563j82339K34555O6572P4536K5961M8862
$$ 279490 407808 308841 198870 272256 220693 38354 272909 339481 414017 439978 488840
12550D88840K29210j37989L5890P0448j36670j53272o9043o0893L4416l0942J06658
$$ 488840 718050 580061 615951 686399 549729 396457 327414 266521 300937 269995 376653
12539C76653j5821j10256M82707K37160J22787j40579j27689P084j32809j19018
$$ 376653 360832 250576 733283 970443 1093230 952651 824962 832046 699237 580219
12529E80219m4290q6351j11665k78466j50481K95931Q4722k36186K63448M37256
$$ 580219 535929 449578 337913 59447 -91034 204897 289619 53433 316881 754137
12519G54137K0730k07929Q1110k4714l61704k72445O9303J26099l3689j64399
$$ 754137 774867 566938 648048 623334 261630 -10815 58488 184587 150898 -13501
12509a3501j60220k4590K42604q0948M3952L80274J5884j9717R8781R9581R0705
$$ -13501 -173721 -198311 44293 -36655 7297 387571 403455 383738 482519 582100 672805
12498F72805K69262J91675j59661q7091K24189P6945j64925j57485j6766j52255
$$ 672805 942067 1133742 974081 886990 1111179 1188124 1023199 865714 848948 696693
12488F96693q8853m7070m7008j30399J19580J34708p6073N8470J28479J94421
$$ 696693 607840 560770 513762 383363 502943 637651 561578 620048 748527 942948
12478I42948K47081k77286j58056J36119k26805r5644J09566K24548j30061j01923
$$ 942948 1190029 912743 754687 890806 664001 568357 677923 902471 772410 670487
12468F70487J0496N8789J7285J26739k88634k09982J84182J18848o9404k1098
$$ 670487 680983 739772 757057 883796 595162 385180 569362 688210 618806 597708
12458E97708q3994K02353o957J2979r1529m82912J60608N73484L45533j12938
$$ 597708 513714 716067 709110 722089 630560 147648 308256 881740 1227273 1114335
12448A114335j8775l3736R4686m9798J7564q4943k4744P9577o6104j71304K68287
$$ 1114335 1095560 1061824 1156510 1106712 1124276 1039333 1014589 1094166 1028062 856758 1125045
12437A125045J52050J18365k81269k22865L32233K69851J1264J17812Q2186k52910
$$ 1125045 1277095 1395460 1114191 891326 1223559 1493410 1504674 1622486 1704672 1451762
12427A451762o3213K18959k25878k32333M2319P9894j87134j67800P1793o774
$$ 1451762 1388549 1607508 1381630 1149297 1191616 1271510 1084376 916576 988369 981595
12417I81595k11973J19207r1812L86110N28326J86081l73292k45243j85966q552
$$ 981595 769622 888829 797017 1183127 1711453 1897534 1524242 1278999 1093033 1084481
12407A084481P4543M1132J01030K05592Q1701o6825n15267J12995L40812o8664
$$ 1084481 1159024 1200156 1301186 1506778 1588479 1521654 1006387 1119382 1460194 1391530
12397A391530N9175p9752l6769p7086k80335R2585L68927J9639M707j96085K77054
$$ 1391530 1450705 1370953 1334184 1257098 976763 1069348 1438275 1457914 1462621 1266536 1543590
12386A543590L51576k01058o25032k06026O8813o8125j10466j77242j21324J72976
$$ 1543590 1895166 1694108 1069076 863050 931863 863738 753272 576030 454706 627682
12376F27682J41215O3739K4051r8268L59282j0276p0820M0472k0056l24450J7057
$$ 627682 768897 832636 856687 758419 1117701 1107425 1036605 1077077 1057021 732571 749628
12365G49628J85315L41775r5780j11309m5409K45615j9786k42091j33238K20949
$$ 749628 934943 1276718 1180938 1069629 1024220 1269835 1250049 1007958 874720 1095669
12355A095669N9233j46753j80084Q6154K95353l77790j67672J54366O7981k74107
$$ 1095669 1154902 1008149 828065 914219 1209572 831782 664110 818476 886457 612350
12345F12350j9050L30942K73695M0633k15190P1233K56710o1440l24151l58112
$$ 612350 593300 924242 1197937 1238570 1023380 1094613 1351323 1289883 965732 607620
12335F07620K7573J26663J84114K05197J99785k990K1754J7095j97025k61029
$$ 607620 635193 761856 945970 1151167 1350952 1347962 1369716 1386811 1189786 928757
12325I28757R2270j1867k10003K36789J97509J33086m8844J51235r5042j76383
$$ 928757 1021027 1009160 799157 1035946 1233455 1366541 1317697 1468932 1373890 1197507
12315A197507j28998J40452J18846l35958j39528M150J56476K11628k43787o5729
$$ 1197507 1068509 1208961 1327807 991849 852321 856471 1012947 1224575 980788 915059
12305I15059p6403r8895K79454P4449l0215Q0190j77882k20760p9387J78569M0379
$$ 915059 838656 739761 1019215 1093664 1063449 1143639 965757 744997 665610 844179 884558
12294H84558J99963K39561O2263j30164k26866P3001j10119Q4801m4317j19584
$$ 884558 1084521 1324082 1386345 1256181 1029315 1102316 992197 1076998 1032681 913097
12284I13097Q4932J35302K9550L26851j85877n4596K89557L26685k29102l80792
$$ 913097 998029 1133331 1162881 1489732 1303855 1249259 1538816 1865501 1636399 1255607
12274A255607l52407k71752J28439K29202J01673L54885k1291q6979k20221l49626
$$ 1255607 903200 631448 759887 989089 1090762 1445647 1424356 1337377 1117156 767530
12264G67530k34597J21769K04983K83777K78493j71995k27317J23097J49222J18976
$$ 767530 532933 654702 859685 1143462 1421955 1249960 1022643 1145740 1294962 1413938
12254A413938j74098j28159k7587J89184K64263J3087o2354m7945J92108j45209
$$ 1413938 1239840 1111681 1084094 1273278 1537541 1550628 1488274 1440329 1632437 1487228
12244A487228L8061J57969j31754j23386J90801J85338j28953K2407q7720R0619
$$ 1487228 1525289 1683258 1551504 1428118 1618919 1804257 1675304 1697711 1609991 1700610
12234A700610J93477J60594k21770j50605k81601J16060J48871N5742j07999J21130
$$ 1700610 1894087 2054681 1832911 1682306 1400705 1516765 1665636 1721378 1613379 1734509
12224A734509J56697k89651j61400k10561J07516j4537J88394O4126N303K30694
$$ 1734509 1891206 1601555 1440155 1229594 1337110 1322573 1510967 1575093 1580396 1811090
12214A811090L95812m2514k49822m35228k89261J99541K16631J88709j49437O4804
$$ 1811090 2206902 2164388 1914566 1479338 1190077 1389618 1606249 1794958 1645521 1710325
12204A710325K41456j21641j14369K49242L08470Q7828p0968Q3682l10874l28295
$$ 1710325 1951781 1830140 1715771 1965013 2273483 2361311 2290343 2374025 2063151 1734856
12194A734856N8288J52406M8474J05607K2919K51393k13405l09185J19267K22338
$$ 1734856 1793144 1945550 1994024 2099631 2122550 2373943 2160538 1851353 1970620 2192958
12184B192958K06823J37077q6338M1144L1746l24783Q91k8073j14369n0284K81894
$$ 2192958 2399781 2536858 2450520 2491664 2523410 2198627 2199518 2171445 2057076 2006792 2288686
12173B288686J53656j03481K02639p4431l2660K39561M96j99278l4149L57997
$$ 2288686 2442342 2338861 2541500 2467069 2434409 2673970 2674466 2475188 2441039 2799036
12163B799036J2440l46903P4211J61841l04102L0295J55152M6589J66115K32592
$$ 2799036 2811476 2464573 2538784 2700625 2396523 2426818 2581970 2628559 2794674 3027266
12153C027266J92140o3439P4284j33001j06394m31407n3817N30694K0152J3667
$$ 3027266 3219406 3155967 3230251 3097250 2990856 2559449 2505632 3036326 3056478 3070145
12143C070145j38807r5739J63627K54739N0155J20308l265N3477r6394N6811J00217
$$ 3070145 2931338 2835599 2999226 3253965 3304120 3424428 3421163 3474640 3378246 3435057 3535274
12132C535274L595M2428K36436J89600m03683k08410m3961j00069o5540M45J32345
$$ 3535274 3538869 3581297 3817733 4007333 3603650 3395240 3351279 3251210 3185670 3186115 3318460
12121C318460K20138J70057P7681J04379l84691L756k91018J01216j00489m6675
$$ 3318460 3538598 3708655 3786336 3890715 3506024 3509780 3218762 3319978 3219489 3172814
12111C172814K34626M5755J16476K73808N9243K8538r6653m4717K16323K76750
$$ 3172814 3407440 3453195 3569671 3843479 3902722 3931260 3834607 3789890 4006213 4282963
12101D282963j00934q0719J74355K24528j67230O1779n3602L316l9116q0810L71934
$$ 4282963 4182029 4101310 4275665 4500193 4332963 4394742 4341140 4344456 4305340 4224530 4596464
12090D596464J81053J49222o5325k88698k07875l33752J48182L19761L57439K2222
$$ 4596464 4777517 4926739 4861414 4572716 4364841 4031089 4179271 4499032 4856471 4878693
12080D878693j1265L57046P0839k63389Q6241K7503K16356J44096j15187J03160
$$ 4878693 4867428 5224474 5295313 5031924 5118165 5145668 5362024 5506120 5390933 5494093
12070E494093K35187q0857k87514r7901J00184L15334L30752K85355K17237J28926
$$ 5494093 5729280 5648423 5360909 5263008 5363192 5678526 6009278 6294633 6511870 6640796
12060F640796K63603k24453j31658Q9280J97784p5562k7781K23068n1456n868
$$ 6640796 6904399 6679946 6548288 6637568 6835352 6759790 6732009 6955077 6903621 6897753
12050F897753J77694J70819k00835L21136N55817M66654o2435k51604P0891k8903
$$ 6897753 7075447 7246266 7045431 7366567 7922384 8389038 8326603 8074999 8145890 8116987
12040H116987j34215K79424Q2707J50616L4505J83077J15816K4766K21361J5485
$$ 8116987 7982772 8262196 8344903 8495519 8530024 8713101 8828917 8853683 9075044 9090529
12030I090529k02K13459N34315L94454j7748Q2047K65813L24680M52428J88535
$$ 9090529 9090327 9303786 9838101 10232555 10214807 10296854 10562667 10887347 11339775 11528310
12020A1528310q3122J89087O0872K14784o0201l0713J85189L39669O6735j35185
$$ 11528310 11445188 11634275 11695147 11909931 11849730 11819017 12004206 12343875 12410610 12275425
12010A2275425L78093L10889J93624L11418L95741M40806M01835K54304K86021
$$ 12275425 12653518 12964407 13158031 13469449 13865190 14305996 14707831 14962135 15248156
12001A5248156J04089J10653K93908M94624M84520M46463M4672K73600L16196
$$ 15248156 15352245 15462898 15756806 16251430 16735950 17182413 17227085 17500685 17816881
11992A7816881N14380K93956K95129M08357P71715P20289K66762M40322N93597
$$ 17816881 18331261 18625217 18920346 19328703 20100418 20820707 21087469 21527791 22121388
11983B2121388M35286L08672M25948P99222O32442N88211N00388R63331Q02786
$$ 22121388 22556674 22865346 23291294 24090516 24722958 25311169 25811557 26774888 27577674
11974B7577674O40523R42804J092527P91136R61657N63222P42198O43401R04616
$$ 27577674 28218197 29161001 30253528 31044664 32006321 32569543 33311741 33955142 34859758
11965C4859758J186048R20235Q29400J032992O15607R43926J378493J500394J122121
$$ 34859758 36045806 36966041 37795441 38828433 39444040 40387966 41766459 43266853 44388974
11956D4388974J012501Q77159J490277J486964J378795J197673J357783J336724
$$ 44388974 45401475 46278634 47768911 49255875 50634670 51832343 53190126 54526850
11948E4526850J345329J401729J619286J598936J489512J275615J105872J558192
$$ 54526850 55872179 57273908 58893194 60492130 61981642 63257257 64363129 65921321
11940F5921321J831462J444415J116118J203265J248524J113995J285241J426154
$$ 65921321 67752783 69197198 70313316 71516581 72765105 73879100 75164341 76590495
11932G6590495Q19646P00585Q71165J211018J072258O99754M98077K30042K25004
$$ 76590495 77410141 78110726 78981891 80192909 81265167 81964921 82462998 82693040 82918044
11923H2918044J75166J48265Q2499P7599j92287k02621m88927o4267j71681p90492
$$ 82918044 83093210 83241475 83323974 83401573 83209286 83006665 82517738 82453471 82281790 81491298
11913H1491298q86320j007673j250423r19360r78619j012059j224238j226450
$$ 81491298 80604978 79597305 78346882 77427522 76448903 75436844 74212606 72986156
11905G2986156j222570j171582j083061j367558j581457j272418j134356j141961
$$ 72986156 71763586 70592004 69508943 68141385 66559928 65287510 64153154 63011193
11897F3011193j187622j239109j199753j319487j476733j013076j081901j288131
$$ 63011193 61823571 60584462 59384709 58065222 56588489 55575413 54493512 53205381
11889E3205381j237851j283459j037900j032223r90873j132082j435908j192120
$$ 53205381 51967530 50684071 49646171 48613948 47623075 46490993 45055085 43862965
11881D3862965r56340j002272r79868q78463q78692p45991q17235j256577q67388
$$ 43862965 42906625 41904353 40924485 40046022 39167330 38421339 37604104 36347527 35480139
11872C5480139o23858r44757p33420o38613n66703l88360n44817o83093o79729
$$ 35480139 34856281 33911524 33178104 32539491 31972788 31584428 31039611 30356518 29676789
11863B9676789q08299o71888n59730n47907o27702q67205l43160l23457k99589
$$ 29676789 28868490 28196602 27636872 27088965 26461263 25594058 25250898 24927441 24627852
11854B4627852n35002o61833l38915m06097n49136n38239l27230j4381m59166
$$ 24627852 24092850 23431017 23092102 22686005 22136869 21598630 21271400 21257019 20797853
11845B0797853m20188o38042q09003p03843l64879j33201j12430k12632k12845
$$ 20797853 20377665 19739623 18930620 18226777 17861898 17728697 17616267 17403635 17190790
11836A7190790k93741m34782j81593l89575m28164j98915j91361k99887l45195
$$ 17190790 16897049 16462267 16280674 15891099 15462935 15264020 15072659 14772772 14427577
11827A4427577j93127m94551m05225j29109n0204k23378J3343p0463n93326k02661
$$ 14427577 14234450 13739899 13334674 13205565 13155361 12931983 12945326 12874863 12281537 12078876
11817A2078876k18917m25400L31j80117m41696j30084k14593k84299N282j1661
$$ 12078876 11859959 11434559 11434890 11254773 10813077 10682993 10468400 10184101 10189383 10177722
11807A0177722j90305n0120k67698j93186l55026J10504J76825P1055M2537q0281
$$ 10177722 9987417 9937297 9669599 9476413 9121387 9231891 9408716 9479771 9522308 9442027
11797I442027l87449k75443k78043k59245l54661j8961K1093k07849J25632j88041
$$ 9442027 9054578 8779135 8501092 8241847 7887186 7868225 7889318 7681469 7807101 7619060
11787G619060j42812O7355l09941m16743j03544j12866j61272j98677J72513k2686
$$ 7619060 7476248 7543603 7233662 6816919 6713375 6600509 6439237 6240560 6413073 6390387
11777F390387l07751j18512J53937J51519l26270k02838l04456j18879M5592k670
$$ 6390387 6082636 5964124 6118061 6269580 5943310 5740472 5436016 5317137 5362729 5360059
11767E360059j64151J38242j34701k2281K11360q4070k73099L14000K31229j54153
$$ 5360059 5195908 5334150 5199449 5177168 5388528 5304458 5031359 5345359 5576588 5422435
11757E422435j46596o174j82552j46218J8551j17288j20645m03497J87365j97001
$$ 5422435 5275839 5269665 5087113 4940895 4959446 4842158 4721513 4318016 4505381 4308380
11747D308380p8678j68798r1628O0753K86190K92885k03810L0741O1223M7003
$$ 4308380 4229702 4060904 3969276 4030029 4316219 4609104 4405294 4436035 4497258 4544261
11737D544261k56898k49247j08539j57008J12577o6531r5565k91591j01557J1086
$$ 4544261 4287363 4038116 3929577 3772569 3885146 3818615 3723050 3431459 3329902 3340988
11727C340988L38753r1830k96451R8614r2431k18155j90840j93919K98795L45447
$$ 3340988 3679741 3587911 3291460 3390074 3297643 3079488 2888648 2694729 2993524 3338971
11717C338971J71325k23058j52971q4767j12381l20497j27450k27278J40018K683
$$ 3338971 3510296 3287238 3134267 3049500 2937119 2616622 2489172 2261894 2401912 2404595
11707B404595r6837k31426L6331J61378J21519J8155L1491L15315j0220L5824
$$ 2404595 2307758 2076332 2112663 2274041 2395560 2413715 2445206 2760521 2750301 2786125
11697B786125O8424r0464k68163j46475M9867j26020k7978J65388J63866J91516
$$ 2786125 2854549 2764085 2495922 2349447 2399314 2273294 2245316 2410704 2574570 2766086
11687B766086J33825P5822j62803o3013j6836n3204k6802k20336k60579l9119
$$ 2766086 2899911 2975733 2812930 2749917 2733081 2679877 2653075 2432739 2172160 2133041
11677B133041J32612R2682k85356k54720j24937O4618O6532k20213O4887q912
$$ 2133041 2265653 2358335 2072979 1818259 1693322 1757940 1824472 1604259 1669146 1660234
11667A660234j64239K82309j29102m93604M211M14062L28728o8401j29970N0736
$$ 1660234 1495995 1778304 1649202 1155598 1159809 1573871 1902599 1834198 1704228 1754964
11657A754964L5565r9554L1824R6134l21839J06077L4115l6279m6940n3238K62612
$$ 1754964 1790529 1690975 1722799 1818933 1497094 1603171 1637286 1601007 1554067 1500829 1763441
11646A763441J1179j76513J41738r2546k26085k95935K1450k7294q6380l5869
$$ 1763441 1774620 1598107 1739845 1647299 1421214 1125279 1146729 1119435 1033055 997186
11636I97186K6157J92138J29095N7872j94348k03526l01816q6497J87712J97554
$$ 997186 1023343 1215481 1344576 1402448 1208100 1004574 702758 616261 803973 1001527
11626A001527L06530j29277j36342j15794m0285K51745K5408j88726j28097j10323
$$ 1001527 1308057 1178780 1042438 926644 886359 1138104 1163512 974786 846689 736366
11616G36366k6560j36579j4957K2656k0388R5969L55145l7251j36638J67607K22918
$$ 736366 709806 573227 558270 580926 560538 656507 1011652 974401 837763 1005370 1228288
11605A228288j63139m83019r279M30512r2567l145J00614j93585k44557J25074
$$ 1228288 1065149 582130 572851 1003363 910796 907651 1008265 814680 570123 695197
11595F95197M8337k97083K4082J20064M9492K36918l7476j02235j26853K85778
$$ 695197 743534 446451 470533 590597 640089 877007 839531 737296 610443 896221
11585H96221L0849m6713J12041P4376j10404q8225j29522J72131K29290m994j28994
$$ 896221 927070 880357 992398 1066774 956370 868145 738623 910754 1140044 1135050 1006056
11574A006056Q8100R8375j08309k29141M653J7368J07717o4818M6021k1463k28627
$$ 1006056 1094156 1192531 1084222 855081 859734 877102 984819 920001 966022 944559 715932
11563G15932j64455k00248j33842K19879K77816K30299Q7527J84452l00496m67378
$$ 715932 551477 351229 217387 437266 715082 945381 1032908 1217360 916864 449486
11553D49486Q5596J67245J67053j31341k0015M5836l2671Q9750J01145l3063J0645
$$ 449486 535082 702327 869380 738039 718024 763860 731189 820939 922084 889021 899666
11542H99666j50072K1286K06582k05223l92060J71281Q6582N4373J19534j46512
$$ 899666 749594 770880 977462 772239 380179 551460 638042 692415 811949 665437
11532F65437J37770J6375k12687J41557q1447J96629j77683q8616q4738J9959
$$ 665437 803207 819582 606895 748452 667005 863634 685951 597335 512597 532556
11522E32556J26087j6797m81204O2660K36192M6985O5115J36279o2024j61203
$$ 532556 658643 641846 160642 223302 459494 506479 571594 707873 645849 484646
11512D84646j57824L16996J49038M3116j39312p4313J02929K38494J52421k08177
$$ 484646 326822 643818 792856 835972 696660 622347 725276 963770 1116191 908014
11502I08014j46728J6921R912J81340M2051j4520m4013k16830l59703P8985N6176
$$ 908014 761286 778207 788119 969459 1011510 996990 952977 736147 376444 455429 511605
11491E11605J06054j7545k8836j27597o9793j33868J82235K10773j08175j35113
$$ 511605 617659 600114 571278 443681 373888 240020 422255 633028 524853 389740
11481C89740l4043J55704J50659j70974j41768J76607j17665l4193j90108K08735
$$ 389740 355697 511401 662060 491086 349318 525925 408260 374067 183959 392694
11471C92694K27088R0067j85917m6209P1914J41245L0586k54109j01939l383J6799
$$ 392694 619782 709849 523932 477723 549637 690882 721468 467359 365420 362037 378836
11460C78836K47410p5027n2855o5783L8499N6457j60599J42522J20664O1693P1839
$$ 378836 626246 551219 498364 432581 471080 527537 366938 509460 630124 691817 763656
11449G63656l5008J30993j0525j57538o5366J16134K85884M7814j16249l44058
$$ 763656 728648 859641 849116 691578 626212 742346 1028230 1076044 959795 615737
11439F15737l32512J49854n8942J87282p2709J5755M1562N6186m6023k24392m3721
$$ 615737 283225 433079 374137 561419 488710 504465 546027 602213 556190 331798 288077
11428B88077j251o126l5571J00284P4756k81004J00831J32786j14397r3375j20277
$$ 288077 286826 280700 245129 345413 420169 139165 239996 372782 258385 165010 44733
11417D4733L3894o7248k22300J24457K45541j9853j341L8678j9699j78658J56337
$$ 44733 78627 11379 -210921 -86464 159077 139224 137883 176561 156862 -21796 134541
11406A34541J59215J11078J48562k87903o3360j213J18604J62753j0695J67917
$$ 134541 293756 404834 553396 265493 202133 200920 319524 482277 471582 639499
11396F39499k14632J07055Q9142K34102k117R0303r2664k03765j4447l59903r9303
$$ 639499 424867 531922 621064 855166 853049 943352 850688 646923 632476 272573 173270
11385A73270J22377l2838M9926j0246j5011L2586l55047J3592P5281M25372K10712
$$ 173270 295647 262809 312735 302489 287478 320064 -34983 -21391 53890 479262 689974
11374F89974J74713j50734j01277J6554J12914p737M3347J41898m7290j3966j0698
$$ 689974 864687 713953 612676 629230 742144 734407 777754 919652 872362 858396 847698
11363H47698K01807q1945o5258j51035k82106M2591R1785R682L0409j87971J61390
$$ 847698 1049505 967560 902302 751267 469161 511752 603537 613219 643628 455657 617047
11352F17047P6853j8537R7331j54709O9311N1546m4532j06843j26303l9389l6329
$$ 617047 693900 675363 772694 617985 687296 738842 694310 587467 461164 421775 385446
11341C85446j9442p6376o2539M8874j8004J4498P0165r684j13745n4316J23309
$$ 385446 366004 289628 227089 275963 257959 272457 342622 332938 219193 164877 288186
11330B88186j16012n0386P4954l9998L5002K81097M0536j68639J0919N5569r225
$$ 288186 172174 121788 196742 156744 191746 472843 513379 344740 355659 411228 402003
11319D02003J55441l7560j26187j63666q2032j04591K15153q3080Q0307J72140
$$ 402003 557444 519884 393697 230031 147999 43408 258561 175481 255788 427928
11309D27928M4986k12819J69669J51767j45238k10310j79062m1477J29484J09627
$$ 427928 472914 260095 429764 581531 436293 225983 46921 5444 134928 244555
11299B44555q6344Q5703J7140J88647k3438j99385Q1293O185k9275n4248l22273
$$ 244555 158211 243914 261054 449701 426263 226878 308171 314356 285081 230833 -91440
11288i1440l9306j56177N1088J08690Q8151J77151J18231J18365p0540O6291N7389
$$ -91440 -130746 -286923 -235835 -127145 -38994 138157 256388 374753 304213 370504 427893
11277D27893J066k82641k57196J16168J39235K39858M2861j32807k56059n3599
$$ 427893 428959 146318 -110878 5290 144525 384383 427244 294437 38378 -15221
11267a5221p4006K78848K33609k13593P5084l3339O2033K55144k00121q4433M4510
$$ -15221 -89227 189621 423230 209637 284721 251382 313415 568559 368438 284005 328515
11256C28515r9059q4901Q7188k62971j71596L67687L70131J01757l27999j96065
$$ 328515 229456 144555 231743 -31228 -202824 164863 534994 636751 308752 112687
11246A12687q401l2971P9664O9438o425Q5804R1168r6883n0490j21674n2076k5039
$$ 112687 104286 71315 150979 220417 213992 299796 390964 294081 243591 121917 69841 44802
11234D4802J50221K13576l06473j34177M0100o4666J5190R381K22616N811k23413
$$ 44802 195023 408599 102126 -32051 8049 -56617 -41427 -32046 190570 196381 -27032
11223b7032L5202L036J92777o2192j55003j82346j28333J12958J37301K80048
$$ -27032 8170 11206 203983 141791 -13212 -195558 -323891 -210933 -73632 206416
11213B06416m8329j85509l90100K4753M66864L7260j12204J10629J23121K45115
$$ 206416 158087 -27422 -417522 -392769 74095 111355 -849 109780 232901 478016
11203D78016j0240J75811k03787j95002j47423l56869J2052M45161L0834k16756
$$ 478016 467776 643587 439800 244798 97375 -259494 -247442 197719 228553 11797
11193A1797q1871K93055J24705K3931j27375j87181P9737q877q5233q375l4340
$$ 11797 -70074 222981 347686 371617 244242 57061 136798 127921 42688 34313 -27
11182b7p19K19769o5765M4558J93908n018r6945j46546J6750J41739k71291j36047
$$ -27 -746 219023 153258 197816 391724 386706 289761 143215 159965 301704 30413 -105634
11170a05634J37660K47574k51820N3128r7956j32676J12233N5929J53173N2144
$$ -105634 32026 279600 27780 80908 -17048 -149724 -37491 18438 171611 223755
11160B23755j34806K08820J28949k12930j47240J90671K8673J77410j108j99206
$$ 223755 88949 297769 426718 213788 66548 257219 285892 463302 462194 262988
11150B62988j7410N2766J7425j50756j03971O590J21010j66099l33450j3972J57950
$$ 262988 245578 298344 315769 165013 61042 67632 188642 22543 -310907 -324879 -166929
11139a66929J93849r5598K33900K46461p2761N995q3301j16246k55543k39621
$$ -166929 26920 -68678 165222 411683 338922 344917 261616 145370 -110173 -349794
11129c49794K73630L72245j42354L1714q0348l9658J73299j22247j01951O0774
$$ -349794 -76164 296081 153727 185441 105093 65435 238734 116487 14536 75310
11119G5310L5199j38478O7090L3614K83381j42247k04133J08037K43398j75772
$$ 75310 110509 -27969 39121 72735 356116 213869 9736 117773 361171 185399
11109A85399k75882j4057K55544O6622J66440J28611j09263l8933N6183k1370
$$ 185399 -90483 -104540 151004 217626 384066 512677 403414 364481 420664 399294
11099C99294j14423k71180l5746J34192r3897k78454K1931k65978j67004J86428
$$ 399294 284871 13691 -22055 112137 18240 -260214 -238283 -504261 -671265 -484837
11089d84837M06879K71658R0203k15589j42132L97981k032J039J13756j6182O3008
$$ -484837 -77958 193700 283903 68314 -73818 324163 322131 323170 436926 420744 483752
11078D83752k5609P1161j85942j19713J72053o8426l5277K3033r2454j13782n0126
$$ 483752 458143 529304 343362 223649 395702 327276 291999 315032 222578 108796 58670
11067E8670J16429K66555j13819j60406O1052m4313j19764K7582K66704l8578
$$ 58670 175099 441654 327835 167429 228481 184168 64404 91986 358690 320112
11057C20112k98078q279n8615j88676L47972K07161J94480M1016l00909j05759
$$ 320112 22034 13755 -44860 -233536 114436 321597 516077 557093 256184 150425
11047A50425L1924K55699K92222J77258J86750K38745J4059m3719j19778K51329
$$ 150425 182349 438048 730270 907528 1094278 1333023 1347082 1303363 1183585 1434914
11037A434914K271N5135J6264n7754K8046R3243K52183O1115Q3987J9024j790
$$ 1434914 1437185 1492320 1508584 1450830 1478876 1572119 1824302 1885417 1969404 1988428 1986638
11026A986638J01663k9315k66294R2135j05763j20996R0385j58150P5612K26660
$$ 1986638 2088301 2058986 1792692 1884827 1779064 1658068 1748453 1590303 1665915 1892575
11016A892575l3937k5863N9596k37987q4791R1639J4705L9165Q8678l13559J9859
$$ 1892575 1858638 1832775 1892371 1654384 1569593 1661232 1675937 1715102 1803780 1490221 1510080
11005A510080K86421J00870n56385k13248k15549J06398K85933q7311k96859k64262
$$ 1510080 1796501 1897371 1340986 1127738 912189 1018587 1304520 1217209 920350 656088
10995F56088j01613k022N9791M8473j57521j32480n5711J14151J29055j42083
$$ 656088 554475 552453 612244 660717 503196 370716 315005 429156 558211 416128
10985D16128k21126J31538L895q7705J79806K00532K8396l4122j02259r2667J0444
$$ 416128 195002 326540 330435 242730 422536 623068 651464 617342 515083 422416 432860
10974D32860J4041q7405p9935j25900p4675J07844j45031j4446K40276R2360j05830
$$ 432860 446901 359496 279561 153661 78986 186830 41799 27353 267629 359989 254159
10963B54159l76867K10631K91369j53304Q6301k7284j59659J18021J73456P5269
$$ 254159 -122708 87923 379292 225988 312289 285005 125346 243367 416823 492092
10953D92092K2505j95590q7933n3727r827R1214j18665N2788j0890j67437Q4842
$$ 492092 514597 319007 231074 177347 167520 258734 140069 192857 181967 14530 99372
10942I9372o4073M0928J86296K72516j04961j45316N2614k57983J0705j9749J85298
$$ 99372 35299 76227 262523 535039 430078 284762 337376 79393 90098 70349 255647
10931B55647L34811N2319l21990l50254l18579m8870J22386K70152L10779J02373
$$ 255647 590458 642777 320787 -29467 -348046 -396916 -274530 -4378 306401 408774
10921D08774j19580o6901K28683k48237J50837j03360k29478j02115N5925J65776
$$ 408774 289194 222293 450976 202739 353576 250216 20738 -81377 -25452 140324
10911A40324N9294m2161q5077Q3864j1256J29129Q2476J24918J36243q5355m0119
$$ 140324 199618 157457 72380 156244 144988 274117 356593 481511 617754 532399 492280
10900D92280l10709k57005J05327J11593M8950J06508R7670q3935q6089J50984
$$ 492280 181571 -75434 29893 141486 190436 296944 394614 310679 224590 375574
10890C75574R7507J35352k02194l0034J5572M9420l70853q6866k6803J44736J0793
$$ 375574 473081 608433 406239 376205 391777 441197 70344 -16522 -43325 101411 112204
10879A12204R3973m6958L13326o2912j40495Q8263k05973R668J26651J42780M2305
$$ 112204 206177 159219 472545 409633 269138 357401 151428 161096 287747 430527 472832
10868D72832K6234J72356l37777k08782Q330K97936L28046R2256k90377K16214
$$ 472832 499066 671422 333645 124863 133193 431129 759175 851431 561054 777268
10858G77268j22018m7232R6206J20989P7931j64615J47371q2373j45722O2479
$$ 777268 655250 608018 704224 825213 903144 738529 885900 803527 657805 720284
10848G20284J41623Q1j51273k74881o2283k48554J14469K09572L9693J4782M4669
$$ 720284 861907 861988 710715 435834 373551 124997 239466 449038 488731 503513 548182
10837E48182k47577K9281K88781J06492j68619m9034k33813l3334J063L94M3416
$$ 548182 300605 329886 618667 725159 556540 507506 273693 240359 241422 241816 285232
10826B85232k40596p5796L5910O7086N5183K11966K08745J70312j37457k62398
$$ 285232 44636 -31160 4750 71836 127019 338985 547730 718042 580585 318187
10816C18187j44646l9869K22894K69686K81677q9227K1317j07475j68919j16404
$$ 318187 173541 133672 356566 626252 907929 818702 840019 732544 563625 447221
10806D47221k14553j601L19415Q0994l35354p7139L10752j90672j21983o0115
$$ 447221 232668 231067 550482 631476 296122 218983 529735 339063 217080 156965
10796A56965P1070L7390N4153L1370j5463K2991J52781p7922k34130q3876J5733
$$ 156965 228035 265425 319578 350948 335485 358476 511257 433335 199205 115329 131062
10785A31062M6737N2338K13610o7771j29491M365j14808J02102J51923j52429
$$ 131062 177799 230137 443747 375976 246485 250850 136042 238144 390067 237638
10775B37638r1653J31531j1964K4178k10588j62273l1020K22831M45831j07304
$$ 237638 145985 277516 265552 289730 79142 -83131 -114151 108680 554511 447207
10765D47207j23967J45810R3421j26556j90110j4053J93568p5063Q7541J81780
$$ 447207 323240 469050 562471 435915 245805 231752 425320 350257 437798 619578
10755F19578n3911k74589q8119J68145K58105j53585P1261L3066P6725J61274
$$ 619578 565667 291078 202959 371104 629209 475624 546885 579951 656676 817950
10745H17950J8572k5784O2974l54370j56670K62571K26245J26734K82748P7422
$$ 817950 836522 810738 873712 519342 362672 625243 851488 978222 1260970 1338392
10735A338392j1155R5204O2595k75156p5404j5703J29732J07887J37486L03796
$$ 1338392 1327237 1422441 1485036 1209880 1134476 1118773 1248505 1356392 1493878 1797674
10725A797674J71695k60974l25835j08133q9403K06287O554J62773r4850J5873
$$ 1797674 1969369 1708395 1382560 1274427 1185024 1391311 1397865 1560638 1465788 1481661
10715A481661K6821J36796K72781j36911l80819M7394J65527j0980p8325j17852
$$ 1481661 1508482 1645278 1918059 1781148 1400329 1447723 1613250 1602270 1523945 1406093
10705A406093j22805K06939J66589R0141j90561j53672j74447l22623K76120O52461
$$ 1406093 1283288 1490227 1656816 1746957 1556396 1402724 1228277 905654 1181774 1834235
10695A834235j15132k03137p0315L22813q5607r4428K7177J54062N403k15628
$$ 1834235 1719103 1515966 1445651 1768464 1682857 1588429 1615606 1769668 1775071 1559443
10685A559443j19839k26384L3332K0531K55588K82366r1958j24714j4757K50278
$$ 1559443 1439604 1213220 1246552 1267083 1522671 1805037 1713079 1588365 1573608 1823886
10675A823886P1802L37026K00992k30747j20015J58599K00229k90755r6465J11681
$$ 1823886 1895688 2232714 2433706 2202959 2082944 2241543 2441772 2151017 2054552 2166233
10665B166233j11546p6413Q19m9070K58579N64349J3719l2046P0666K92138M7932
$$ 2166233 2054687 1978274 1979093 1930023 2188602 2752951 2766670 2734624 2805290 3097428 3145360
10654C145360J81928M05779K50655L5599q9087J0859L94234K98779K59521K40792
$$ 3145360 3327288 3733067 3983722 4019321 3930234 3941093 4335327 4634106 4893627 5134419
10644E134419M38303L28837Q40497J044076J159948Q36407J091014J091744R87517
$$ 5134419 5572722 5901559 6742056 7786132 8946080 9782487 10873501 11965245 12952762
10635A2952762Q89916Q92429J182759J839256J984530J912582K425880L406155
$$ 12952762 13842678 14735107 15917866 17757122 19741652 21654234 24080114 27486269
10627B7486269M454181O165446P934948R695621J1394478J2807529J2251955J1174892
$$ 27486269 31940450 38105896 46040844 55736465 67130943 79938472 92190427 103365319
10619A03365319R404239Q270602Q111002Q918433R269915Q715801Q886292J1366876
$$ 103365319 112769558 121040160 129151162 138069595 147339510 156055311 164941603 176308479
10611A76308479J5348735J8147345J7120011J4165742J1136626R230804R225980
$$ 176308479 191657214 209804559 226924570 241090312 252226938 261457742 270683722
10604B70683722J0077039R212126N357707K249529M509213J0883370J5957230
$$ 270683722 280760761 289972887 295330594 297580123 302089336 312972706 328929936
10597C28929936J5264353J0994825O399738L520065K650271J770264k015626j0620360
$$ 328929936 344194289 355189114 361588852 365108917 367759188 369529452 367513826 356893466
10589C56893466j8645370j8059358j0942095m670964k788665l511188m940864
$$ 356893466 338248096 320188738 309246643 304575679 301787014 298275826 293334962
10582B93334962n561126n477775o184581r644676j5533354k0764992j9794233
$$ 293334962 287773836 282296061 276111480 266466804 250933450 230168458 210374225
10575B10374225j5261016j0487064p696695o596774p256209p427322p210752p700489
$$ 210374225 195113209 184626145 176929450 170332676 163076467 155649145 148438393 140737904
10567A40737904r476459j2067175j4010325j3800661j1909806r276307o987199
$$ 140737904 131261445 119194270 105183945 91383284 79473478 70197171 63209972
10560F3209972n416230m385509l619878k964124k634119k457438k232544k066697
$$ 63209972 57793742 53408233 49788355 46824231 44190112 41732674 39500130 37433433
10552C7433433j948340j579457j517109j452963j093150r10589j098880j277565
$$ 37433433 35485093 33905636 32388527 30935564 29842414 28931825 27832945 26555380
10544B6555380j167724r92429q72602p23959j248478o80532l63028p48700j062157
$$ 26555380 25387656 24395227 23522625 22798666 21550188 20869656 20506628 19757928 18695771
10535A8695771q09730k75539j33694l54487n80836n66461n14920n44477n10780
$$ 18695771 17886041 17610502 17476808 17122321 16541485 15975024 15460104 14915627 14404847
10526A4404847n87971n22167m71729l26343m51420k94490j95753k37747l47439
$$ 14404847 13816876 13294709 12822980 12496637 12045217 11750727 11554974 11317227 10969788
10517A0969788k67678k83971m66909l24128k59370l54876j50987j34842k60683
$$ 10969788 10702110 10418139 9951230 9627102 9367732 9012856 8861869 8727027 8466344
10508H466344k98770l04545l35052m1547j40358l07654j95177j67782o0284j52284
$$ 8466344 8167574 7863029 7527977 7486430 7346072 7038418 6843241 6675459 6615175 6462891
10498F462891k77350P6178Q2105j23397N9725m17642k33456j84369j15736l63123
$$ 6462891 6185541 6261719 6343824 6220427 6280152 5862510 5629054 5444685 5328949 4965826
10488D965826j33519j22778j08565p2726l07369k84631J84996K78002l5381j18066
$$ 4965826 4832307 4709529 4600964 4528238 4220869 3936238 4121234 4399236 4363855 4245789
10478D245789m21632k75742J29617q3932k1898n8390j51154n38532N318N4884
$$ 4245789 3824157 3548415 3678032 3594100 3572202 3513812 3362658 2824126 2829444 2884328
10468B884328l23164m86493n1999K52185J37014k18184k33689k88851l14351M090
$$ 2884328 2561164 2074671 2022672 2274857 2411871 2193687 1959998 1671147 1356796 1360886
10458A360886j2682K10535K2257j81379o1040j85085J0751q2252N8442M1428m6943
$$ 1360886 1348204 1558739 1580996 1399617 1338577 1153492 1164243 1081991 1140433 1181861 1134918
10447A134918k25137J07608M7104j54791l54498j94182J11700K41171L7566q0261
$$ 1134918 909781 1017389 1064493 909702 555204 361022 472722 713893 751459 671198
10437F71198J73801M7942k58763j10207K03976M13628P838l77847l81359j64477
$$ 671198 844999 892941 634178 523971 727947 1141575 1149413 771566 390207 225730
10427B25730j86973r2169M31018K66967N227k90855r3271K09187O7756o9306N3476
$$ 225730 38757 -53412 377606 644573 649800 358945 265674 474861 542617 473311 526787
10416E26787k7573J78039K94564q374j36199j63186o5444Q9719j96080J33890
$$ 526787 499214 677253 971817 963443 827244 664058 598614 688333 492253 626143
10406F26143K52722k12831l48876j07406k9891O9277L36489J25314q0154j08445
$$ 626143 878865 666034 317158 209752 179861 249138 585627 710941 630787 522342
10396E22342K347j03292j3360J13862j01558l6668j17217K53819J06881J41083
$$ 522342 524689 421397 408037 521899 420341 383673 266456 520275 627156 768239
10386G68239R9748j56615L4740J4097j80124j15872r2506K8629M0944M3882n6818
$$ 768239 867987 711372 746112 760209 580085 464213 371707 400336 441280 485162 428344
10375D28344K34977r712j25392J22619K03079o2974J95939K716l53326j94571
$$ 428344 663321 653609 528217 650836 853915 790941 986880 989596 636270 441699
10365D41699N4015K57546L4449j81482J76981k6230m23951k13117j79706J54905
$$ 441699 495714 753260 787709 606227 783208 756978 333027 119910 -59796 95109
10355I5109r5163l2603M41090K50720k70969o0680o2517J24337r6362k48364K47233
$$ 95109 -54 -32657 408433 659153 388184 327504 264987 389324 292962 44598 291831
10344B91831L70785K2655r0749j42761m07051M8488K38032M8150J11118K12362
$$ 291831 662616 685271 594522 451761 44710 93198 331230 379380 490498 702860
10334G02860J54163j83327j00210j3216j90062n20763q396K07400l9919j10735
$$ 702860 857023 673696 573486 560270 370208 -150555 -158951 48449 8530 -102205
10324a02205J97890M21879K85025Q9930l81104l45559j53023L2763J5691J45064
$$ -102205 95685 517564 802589 892519 511415 165856 12833 45596 61287 206351
10314B06351K14581p3998p6504p1872q5758j65034l165q4558P7834L1213k17236
$$ 206351 420932 346934 270430 198558 112800 -52234 -55399 -139957 -62123 -30910 -248146
10303b48146k88752J00695K43684J67266J36478o9198J27016p8981k9612O7343
$$ -248146 -536898 -436203 -192519 -25253 111225 42027 169043 90062 60450 127793
10293A27793J20764J27699k84960N2785n726j58622P3013J95738p8119p3796j83114
$$ 127793 248557 376256 91296 144081 138355 -20267 52746 248484 170365 96569 -86545
10282h6545q8837n3670J34030J52560Q0766K76833l69830j26725L70802K48025
$$ -86545 -175382 -229052 -95022 57538 138304 415137 45307 -81418 289384 537409
10272E37409j90080k87212m5278k34933M9272L16284J12611k3371J62896J8178
$$ 537409 347329 60117 14839 -220094 -170822 145462 258073 234702 397598 415776
10262D15776j38785j74273k4073m3204r1542j70343j53248J23411L9675P2195
$$ 415776 276991 102718 78645 35441 -56101 -226444 -379692 -256281 -216606 -144411
10252a44411l3773K39267K72256J13283j20417l38778k45567J83833J58014j40325
$$ -144411 -178184 61083 333339 446622 326205 -12573 -258140 -74307 83707 -56618
10242e6618k23004K0390k42055R2640M26794J4986j97229q1750j58360Q2725O0439
$$ -56618 -279622 -259232 -501287 -408647 18147 33133 -164096 -245846 -404206 -321481 -261042
10231b61042l5766r6244J51678N0507j60354j47432j4577K04681J62336O2384
$$ -261042 -296808 -393052 -241374 -190867 -351221 -498653 -513230 -308549 -146213 -83829
10221h3829J21024k00898J2353J45420o9581K18890n862K5808J784k5679J56494
$$ -83829 37195 -163703 -151350 -5930 -75511 143379 137517 163325 165109 139430 295924
10210B95924k2610J01553k02862j36832q8772k5175K19705J25220K01698l16003
$$ 295924 273314 374867 172005 35173 -53599 -78774 140931 266151 467849 151846
10200A51846j68037M559R1382K35277K80900q6187n71116l16627K745L57199J25366
$$ 151846 -16191 -11632 79750 315027 595927 509740 -61376 -378003 -375258 -18059 107307
10189A07307J84226o3948J50499K16778K92535K23722j72062o1306j26231N2947
$$ 107307 291533 227585 378084 594862 887397 1111119 939057 877751 751520 804467
10179H04467r0358Q3526r2518K99390R4453K13561K50903q3887J8895K03739N6633
$$ 804467 714109 797635 705117 1004507 1098960 1312521 1563424 1479537 1498432 1702171 1758804
10168A758804o271k39415l13840l8224J17864K4117M88698J86264P7519J30398
$$ 1758804 1752533 1513118 1199278 1161054 1278918 1303035 1791733 1977997 2055516 2185914
10158B185914Q6086j66502k25252P0595j05070O8418R6268j64144j95122k94721
$$ 2185914 2272000 2105498 1880246 1950841 1845771 1914189 2010457 1846313 1651191 1356470
10148A356470l8547L123L14004J12523J11747k22407k57927k80011N4856J3394
$$ 1356470 1317923 1321046 1635050 1747573 1859320 1636913 1378986 1098975 1153831 1167225
10138A167225O89j97582j35053K4197M0762k27309j11492J9440k7842j15682L6034
$$ 1167225 1167914 970332 835279 859476 900238 672929 561437 580877 553035 437353 473387
10127D73387Q7079j74027l34486K17107k38516j18421K41700k4136Q9829r2190
$$ 473387 560466 386439 51953 269060 30544 -87877 153823 129687 219516 127326
10117A27326k10786L2737m0174N7848J44782k3555m4858r6016k83984j57817K7660
$$ 127326 -83460 -50723 -90897 -33049 111733 88178 43320 -52696 -336680 -494497 -466837
10106d66837K55014J30892q111K18392J30479k26177j36515o6673J15762K13516
$$ -466837 -211823 -80931 -89042 129350 259829 33652 -102863 -169536 -53774 159742
10096A59742J05512J46746j28404j0664k5172j3967p9077J38288m9530k09982
$$ 159742 265254 412000 283596 272932 247760 233793 154716 293004 243474 33492
10086C3492P8863k08449m14464L4686Q9522R38K74760J297Q604K38557j04263
$$ 33492 112355 -96094 -510558 -475872 -386350 -385412 -110652 -109355 -100751 137806 33543
10075C3543K7688L7463q7623k554J345m52290K80083R3294P7796L50977J33071
$$ 33543 61231 98694 11071 8517 9862 -442428 -162345 -69051 8745 359722 492793
10064D92793l39048k33218K24716L01714k52935k54539l5305p632J53865N3597
$$ 492793 153745 -79473 145243 446957 194022 -60517 -95822 -103454 50411 104008
10054A04008j89328p421K12944P7776J12319r0011l24374r4748J76704N9984j44028
$$ 104008 -85320 -92741 120203 197979 310298 220287 -104087 -198835 -22131 37853 -106175
10043a06175J59356J304r8089j96170m09999M8801L18153J08898k07221m4584
$$ -106175 53181 54485 -43604 -239774 -649773 -600972 -282819 -173921 -381142 -425726
10033d25726K75553J40741j86347K10068J48444p1662K8025k05786J95526L2139
$$ -425726 -150173 -9432 -195779 14289 162733 91071 119096 -86690 108836 140975
10023A40975k10408J36057M4888j44251R3305J97477J98682N5436p9545l06392
$$ 140975 -69433 66624 111512 -32739 60566 258043 456725 512161 432616 126224
10013A26224K5332J20086j7590K48203K22024j60040k53349k51572j62720Q061
$$ 126224 151556 271642 254052 502255 724279 564239 310890 59318 -103402 -95341
10003i5341P9106Q7985k27346k49815M5119K13927K0528J21751J90600j04392
$$ -95341 -16235 71750 -155596 -405411 -360292 -146365 -125837 -4086 186514 82122
9993H2122j29955k06715j53500K15972L23631k24445j33750N7340J42286K97491
$$ 82122 -47833 -254548 -408048 -192076 131555 -92890 -226640 -169300 -27014 270477
9983B70477N2057j83575J21638J21819k41315k72149m1544J39095k76283l7026
$$ 270477 322534 138959 260597 382416 141101 -131048 -172592 -33497 -309780 -346806
9973c46806M00950j22498J224M27064o4179l65407r5471K74847K71738l0140J08326
$$ -346806 54144 -68354 -67130 359934 295755 -69652 -165123 109724 381462 351322 459648
9962D59648N1998j03801j87234Q9410K07924L0293j49036P063k4818j28800P8605
$$ 459648 511646 407845 220611 310021 517945 548238 399202 406265 381447 252647 331252
9951C31252M28769M20428L34328J66607j79960m4415N02422N98653N82706P90262
$$ 331252 760021 1180449 1514777 1681384 1501424 1457009 1959431 2558084 3140790 3931052
9941C931052J380954J967414L304032M958677M508089K100996P88925j14461o83001
$$ 3931052 5312006 7279420 10583452 15542129 20050218 22151214 22940139 22825678 22142677
9932B2142677J03409J092420R24843n530174p029130l898019k078665j372817
$$ 22142677 22246086 23338506 24263349 18733175 11704045 7806026 5727361 4354544
9924D354544q60025l32646j13894k20358m62297l84351j59151k04138J89787J99412
$$ 4354544 3494519 3161873 3047979 2827621 2365324 1980973 1821822 1617684 1807471 2006883
9914B006883N316J21836j13382l57736l23625l1181j78285q8365N9825j41239
$$ 2006883 2012199 2134035 2020653 1662917 1339292 1308111 1129826 1041461 1101286 960047
9904I60047k4653j14966r6566l8106m0430q7818p2003j10755m5454p0352N5217
$$ 960047 935394 820428 723862 685756 645326 557508 485505 374750 329296 258944 314161
9893C14161K78452J77699r6958q8923j95490L9120K20861m9346k2248P8956q7080
$$ 314161 592613 770312 673354 584431 388941 428061 648922 599576 577328 656284 569204
9882E69204k8115o0777q2068J11024J57945k35970q8519k32846R9503p0917L91563
$$ 569204 541089 480312 398244 509268 667213 431243 342724 109878 209381 138464 530027
9871E30027p6395k03009j02904K00327L80113k36193J7790J18703j1610l69248
$$ 530027 453632 250623 147719 348046 728159 491966 509756 628459 616849 247601
9861B47601J56857K20779k00658p2j9864p6911O9197k36456j26750j61340M9937
$$ 247601 404458 625237 424579 424507 404643 327732 396929 160473 33723 -127617 -77680
9850g7680j5072J82202L20121J96270k58747J16096j91013j46914j24071P6565
$$ -77680 -92752 89450 409571 605841 347094 463190 272177 125263 1192 77757
9840G7757M59075Q1561j0661L08756L85263j50876k00881l13349j84357K13071
$$ 77757 536832 618393 607732 916488 1301751 1150875 949994 636645 452288 665359
9830F65359K21846N0794O768j08471j69664j38608j74674M983J73158j01892j67489
$$ 665359 887205 937999 944767 836296 666632 528024 353350 358333 531491 429599 262110
9819B62110J6658l1472j03924m7248K16486j22574j29287r3292l0J79250l60K3630
$$ 262110 278768 247296 143372 96124 312610 190036 60749 -32543 -32573 146677 146317 169947
9807A69947K44722j67733k38115J62261j3696k20129n7879R6055j15983j0330
$$ 169947 414669 246936 8821 171082 157386 -62743 -120622 -24567 -140550 -150880
9797a50880K8533J27486k24587M1665J99957J19470k30341J43262R0934J68401
$$ -150880 -122347 5139 -219448 -177783 22174 141644 -88697 54565 145499 313900
9787C13900J71084J94684P1776K60777j06407L4936J72354R7836K28L24625p1633
$$ 313900 484984 679668 751444 1012221 905814 940750 1113104 1210940 1211168 1535793 1464160
9776A464160m07631k19332n4001j09714j23349k82944J00919J66492j63293l31206
$$ 1464160 1056529 837197 783196 673482 550133 267189 368108 534600 371307 40101
9766D0101K47976Q2650J952m8183n1240Q3090j9345M2057j74316M4536k9967j65565
$$ 40101 288077 370727 372679 324496 273256 356346 337001 379058 204742 249278 219311 53746
9754E3746r3064K9404K72371p7837J19390J61337n223K31208k8025k70254j66463
$$ 53746 -39318 -9914 262457 184620 304010 465347 460124 691332 663307 393053 226590
9743B26590l5256R433K05690K03238O2169K5131j19518j90760r1982J60149Q1736
$$ 226590 191334 200767 406457 609695 671864 696995 577477 386717 294735 454884 536620
9732E36620k49203M2809j3441n5464O3889o6203K2065p4117o3600k19545j92831
$$ 536620 287417 330226 316785 261321 325210 259007 281072 206955 143355 -76190 -269021
9721b69021N5362L09257K57879K23958k80913m83371l34809K45813M64590M12682
$$ -269021 -213659 95598 353477 577435 296522 -186849 -521658 -275845 188745 601427
9711F01427l378j82281l00210p1415N6103K9710k33069L9333J11687J52619M2391
$$ 601427 598049 415768 115558 44143 100246 129956 -103113 -63780 47907 200526 242917
9700B42917L03005l1002k73627L0575J91240j32255Q4287J07593k06977k18212
$$ 242917 545922 514920 241293 271868 463108 330853 415140 522733 315756 97544
9690I7544N5411M20150J64589j54530m6428K08794K8017J1270L9871r1881K76831
$$ 97544 152955 573105 737694 583164 536736 745530 773547 784817 824688 732807 1009638
9679A009638K95201J86454K49334L28790k23497j52265K55134L75028P9415M48388
$$ 1009638 1304839 1491293 1740627 2069417 1845920 1693655 1948789 2323817 2403232 2851620
9669B851620N26293O20669M27597Q60876J465079J975386K629392M285557P160604
$$ 2851620 3377913 3998582 4426179 5287055 6752134 8727520 11356912 15642469 22803073
9660B2803073J0779232J1004433N659281J852462K57906o0624Q31854K683902
$$ 22803073 33582305 44586738 50246019 52098481 52356387 52295763 53127617 55811519
9652E5811519K844232p506812j6403703j1737820o531533l582969k213980j722913
$$ 55811519 58655751 51148939 34745236 23007416 16475883 12892914 10678934 8956021
9644H956021j393917p24374o19160n21489l40158k38500j45600j67224m17464
$$ 8956021 7562104 6837730 6218570 5697081 5356923 5118423 4972823 4805599 4388135
9635D388135m2580L41891k54591n73137j25677k4602k98261l88716k42289n66518
$$ 4388135 4345555 4687446 4432855 3859718 3734041 3709439 3411178 3022462 2780173 2213655
9625B213655l3859J58944k2325j68567q9070k65501P2465M4123q6211J139r6580
$$ 2213655 2179796 2338740 2316415 2147848 2058778 1793277 1865742 1909865 1823654 1824793 1728213
9614A728213J39086l16422j48716l38983j29984L36151K01707L6739j15664m390
$$ 1728213 1867299 1550877 1402161 1063178 933194 1269345 1471052 1507791 1392127 1387737
9604A387737l2839j17246j85098k20001J26117J33200k48195l31580k4942Q7556
$$ 1387737 1354898 1237652 1052554 832553 958670 1091870 843675 512095 487153 574709
9594E74709k37686K15715K65818j92232n7282J47443o4295l91323k7621m9970
$$ 574709 337023 552738 818556 626324 569042 716485 652190 260867 233246 183276
9584A83276R5761Q450J23471P7402k09740K29875L90l12439l71393M4117J91725
$$ 183276 279037 287487 410958 488360 278620 508495 508885 196446 -174947 -130830 60895
9573F0895J2445q3946L4203j92793m0146J62571L33231J74511J65688j2323J19802
$$ 60895 73340 -10606 23597 -169196 -209342 -46771 286460 460971 626659 614336 734138
9562G34138J46530m6492l25038l02520L27422K60999j19522k73592K9743n6851
$$ 734138 880668 834176 509138 206618 534040 795039 675517 401925 431668 374817
9552C74817j43320l829r599J44087j37525k20555L7070K16876N2199j27364K05294
$$ 374817 231497 227668 218069 362156 224631 4076 41146 258022 310221 182857 388151
9541C88151K30702J85371J17664k26360o9634k81333j52517K0162j75260l37324
$$ 388151 618853 804224 921888 695528 625894 344561 192044 212206 36946 -300378
9531c00378j8936L31514K44692L50518j73757j52092K46187l9576l79667k76963
$$ -300378 -319314 12200 256892 607410 433653 281561 527748 488172 108505 -168458
9521a68458j22338M8045j08985n8741J67358K8387K4925K1528K56647R8118j33600
$$ -168458 -290796 -242751 -351736 -410477 -243119 -214732 -189807 -168279 88368 186486 52886
9510E2886L4722j87739j00678J521Q9684R2591L65624J00653k0004k5212o9125
$$ 52886 87608 -100131 -200809 -199288 -109604 -17013 348611 449264 429260 404048 334923
9499C34923p0044l00542m127K15787j20100J93093j58153k1434M5421J04090j83624
$$ 334923 264879 -35663 -39790 175997 55897 248990 90837 69403 114824 218914 35290
9488C5290k22494j01234J81883J44245r2010N9164N0969l65624k46819K98348
$$ 35290 -187204 -288438 -106555 37690 -54320 4844 55813 -309811 -556630 -258282
9478b58282L65698j8934O2434k446l76391p1308J60251L11738k69608j55938j07679
$$ -258282 107416 88482 150916 148470 -227921 -299229 -138978 172760 -96848 -252786 -360465
9467c60465N5849J66377L0627p6893q0421k3606J42437J5066J50005N6201p9922
$$ -360465 -304616 -138239 -107612 -184505 -264926 -288532 -146095 -131029 18976 75177 -4745
9456d745q7258j21948j22223K23750K22977O2400L43683n8751n01812k946J71209
$$ -4745 -92003 -213951 -336174 -112424 110553 172953 516636 457885 -43927 -46873 124336
9445A24336m6848K5814R3182q2628r0829O8575J17228L7768j48532j76841Q930
$$ 124336 77488 103302 196484 113856 23027 91602 208830 246598 98066 -78775 -69845
9434f9845K18892L85635P1197K368r3127l74752k74906K93562J41983o0997k17236
$$ -69845 149047 534682 605879 608247 515120 140368 -134538 159024 301007 240010 22774
9423B2774R0472j24053j36851L59209J22114k45464l35812J18123L29891m0597
$$ 22774 113246 -10807 -147658 211551 333665 88201 -247611 -129488 200403 159806
9413A59806J97678K43615j62533j80845J56041j1759k6857l9069K8829L8499k35006
$$ 159806 357484 601099 438566 257721 413762 402003 375146 336077 364906 403405 168399
9402A68399m12529J11269L92340J28531j0872m40133J08449L56170P3973k59251
$$ 168399 -244130 -132861 259479 388010 377138 -62995 45454 401624 475597 216346
9392B16346k89440m7978j0780J48031K74317k66494k46536m822J11151p6648r894
$$ 216346 -73094 -121072 -131852 16179 290496 24002 -222534 -227356 -116205 -192853 -202747
9381b02747k29232p9167j86583R0637J38442K56253J51938q9079k45412j09380
$$ -202747 -431979 -511146 -697729 -607092 -468650 -212397 -60459 -149538 -394950 -504330
9371e04330K68614L39587J90075R0681r8893l8448k21642L3617k50114k32663
$$ -504330 -235716 103871 293946 384627 285734 247286 25644 59261 -190853 -423516
9361d23516M8835K88282K37692M8788J16685k14731l22173p4086K23698J97533
$$ -423516 -374681 -86399 151293 200081 316766 102035 -220138 -294224 -70526 127007
9351A27007K35570k0988j5665j6675o6008O2124P8072J30332J75433j65141q9670
$$ 127007 362577 341589 325924 309249 243241 305365 383437 513769 689202 524061 434391
9340D34391j02293k0741Q717j7655k04001j23774M3298O0482J64427J44367k28788
$$ 434391 332098 311357 320074 302419 98418 -25356 17942 78424 242851 387218 158430
9329A58430q5430K981j02996O7178r4307N243o063M8989p9987r8097Q9393P2716
$$ 158430 73000 75981 -27015 40163 -54144 -48901 -54964 -5975 -85962 -184059 -94666 -21950
9317b1950k6808K20137Q4298Q5869l14525k97247K35834k6605L6486M6969Q1219
$$ -21950 -48758 171379 255677 341546 27021 -270226 -34392 -60997 -24511 22458 103677
9306A03677K30968N1696j47718j56384K8597J91927j37431l39488k7874k0086
$$ 103677 334645 386341 238623 82239 110836 302763 165332 -174156 -202030 -222116
9296b22116j9782j40723q4367r4269K7019L10482K30264j12415n8906K45014J14070
$$ -222116 -241898 -382621 -466988 -561257 -534238 -223756 6508 -105907 -164813 80201 194271
9285A94271j65415m8746l9961j6696r1700j21210j68542j17913J45992j201n8174
$$ 194271 28856 -19890 -59851 -76547 -168247 -289457 -457999 -575912 -429920 -431121 -489295
9274d89295o7811J81940J95712k28466k59203J10756K18963L37123p7182l48396
$$ -489295 -557106 -375166 -179454 -407920 -667123 -556367 -337404 -281 -77463 -425859
9264d25859L7015K13725K91359J05032N2261k52501J08977k81671J1845J96779
$$ -425859 -388844 -175119 116240 221272 273533 21032 130009 -151662 -139817 56962
9254E6962j6158J79280k60577j38322P8615K75155R3547R0626m1988N4096L77541
$$ 56962 40804 220084 -40493 -178815 -100200 174955 268502 359128 317140 371236 748777
9243G48777j12875n02256j21493O3100m9712l20777M2205K21087o0611l86123
$$ 748777 635902 133646 12153 75253 25541 -295236 -253031 -31944 -92555 -478678
9233d78678P0689L07531k3628N5402n2137K4030r6035j16818R6776K25276j65924
$$ -478678 -407989 -100458 -124086 -68684 -120821 -96791 -192826 -309644 -212868 12408 -153516
9222a53516l1209J31809n3781q1559j0122J27841J43419j20580l76899r6365J33497
$$ -153516 -184725 -52916 -106697 -188256 -198378 -70537 72882 -47698 -424597 -520962 -387465
9211c87465Q6331Q2924K79442K09219n3030L9834Q9026K8389J77512k3572m19675
$$ -387465 -301134 -218210 61232 270451 217421 257255 346281 374670 552182 528610 108935
9200A08935L3912O1117j35398K58848R7620k88206l49235j07138L67001J4759
$$ 108935 142847 203964 68566 327414 425034 136828 -212407 -319545 47456 62215
9190F2215P0226q5747k33682j84198J31063J95485l3712P6188Q7496K01557L87745
$$ 62215 132441 46694 -186988 -371186 -240123 -44638 -78350 -2162 85334 286891 674636
9179F74636O2839l13862k52157l40913q9329O7278J32655K13508k86369O6132
$$ 674636 737475 423613 171456 -169457 -258786 -191508 -58853 154655 -131714 -65582
9169f5582O7020j37265L6877p04n0321j47162K1785K02445J2055k08038q6100
$$ -65582 1438 -135827 -98950 -99654 -149975 -297137 -275352 -72907 -60852 -268890 -354990
9158c54990k11876m6072N41241L66192M2845m6062K58098l3206m25764j31241
$$ -354990 -566866 -612938 -71697 294495 337340 291278 549376 516170 90406 -40835
9148d0835l1293K5378j29490J86762j29887j5624O5473L348L4552K0186M6092
$$ -40835 -72128 -46750 -176240 10522 -119365 -134989 -69516 -66168 -31616 -11430 34662
9137C4662O8804J47472j14166j07514j26209j452K10756J14688j58344j39120
$$ 34662 103466 250938 136772 29258 -96951 -98403 112353 227041 68697 -70423
9127g0423n7080J98974j59690J54257J70374l8609r86j71123J95460Q1212k2053
$$ -70423 -127503 71471 -88219 66038 236412 197803 196817 25694 221154 302366 280313
9116B80313k15785k70132o4089J56997q3611o4636J13677O9297r3899j82967r329
$$ 280313 64528 -205604 -269693 -112696 -196307 -260943 -147266 -77969 -171868 -354835 -364164
9105c64164J05517O7929L22203l6646j00393R1072j0781r7518o267j50134l7712
$$ -364164 -258647 -190718 131485 94839 -5554 85518 74737 -22781 -29048 -179182 -216894
9094b16894J65992J04901K5875J04548J83645k17262j43070Q0592j57340l5519
$$ -216894 -50902 53999 79874 184422 368067 150805 7735 88327 -69013 -104532
9084a04532M09049L38m61171j97482p7165K5074J04559K93102J62619q8604k70310
$$ -104532 304517 304855 -156316 -353798 -430963 -405889 -301330 -8228 154391 65787 -204523
9073b04523O6480K99906J89368p4078o8580p8473k49641k99467q7616L2569K51798
$$ -204523 -138043 161863 351231 277153 208573 130100 -119541 -419008 -506624 -474055 -222257
9062b22257J71683k50670j86183L09802L50998j4505l4688r0791l36164r3859
$$ -222257 -50574 -301244 -487427 -177625 173373 158868 124180 33389 -302775 -396634
9052c96634M0124L8126K06140r5016J62097L12928n4317p6868k20743k46860P7409
$$ -396634 -356510 -318384 -112244 -207260 -45163 267765 213448 136580 -84163 -331023 -253614
9041b53614J48656L06255K35877P385l48954k45050J79169J26957j48965j47087
$$ -253614 -104958 201297 437174 444559 95605 -149445 29724 156681 7716 -139371
9031a39371m9072j77109J07334n5574o483K7595O2484p4288p6778p7707P7910
$$ -139371 -188443 -365552 -258218 -313792 -320275 -292680 -230196 -304484 -381262 -458969 -381059
9020c81059J70244k0030r482L09910o1642R827n2435r1336k72489j24872J89965
$$ -381059 -210815 -230845 -240327 69583 7941 17768 -34667 -126003 -398492 -523364 -333399
9009c33399j42228P5467J50878J55756n829o3052J68782l5584O1997Q9851K75124
$$ -333399 -475627 -400160 -249282 -93526 -99355 -162407 6375 -29209 32788 122639 397763
8998C97763K223q2706J82452j9841k51957l77295M6464n2716k41898M3864J00143
$$ 397763 399986 317280 499732 479891 227934 -149361 -102897 -155613 -397511 -353647 -253504
8987b53504K64751J33786r7253R6857O9952m3577J5216R5346L24382k39383j96335
$$ -253504 11247 145033 47780 144637 214589 171012 186228 281574 605956 366573 170238
8976A70238j24124m1547m4667K3560O660J28362P7413J07113p7976L7623r5124
$$ 170238 46114 4567 -40100 -16540 -9880 118482 195895 303008 225032 262655 167531
8965A67531k12045k3615k25191K0059K03408J63403j57459M03014J56986k01002
$$ 167531 -44514 -68129 -293320 -273261 -69853 93550 -63909 339105 496091 295089
8955B95089k18533p3635j59710j35997K27351K36043m1358m6251l2899m2046P6877
$$ 295089 76556 2921 -156789 -292786 -65435 170608 129250 82999 50100 8054 84931
8944H4931p0388M8912L9439k23792m2378l06969o6186J87005L31933K3629j66767
$$ 84931 14543 63455 102894 -120898 -163276 -470245 -536431 -349426 -17493 6136 -160631
8933a60631J17873k56825l36875K72072K37712P079J46526K64881j58522j56683
$$ -160631 -42758 -299583 -636458 -364386 -126674 -119595 26931 291812 133290 -23393
8923b3393K26361J89406n1507J05331j72716k68289j63824j21044P5808P0279
$$ -23393 202968 392374 340867 446198 273482 5193 -158631 -279675 -203867 -133588
8913a33588K61200L9057l42308m3242K01840j20356K03009J6335j86941k89792
$$ -133588 127612 166669 -175639 -218881 -17041 -137397 65612 81947 -104994 -394786
8903c94786K1873O4842k07945J83876R5146K25135L09198j62770n6136J18367
$$ -394786 -372913 -308071 -516016 -332140 -236994 -11859 297339 134569 78433 196800
8893A96800P4760K56994O6319k33896j96044j00695j04069j62169m1774J53460
$$ 196800 271560 528554 594873 360977 164933 64238 -39831 -202000 -243774 -90314
8883i0314J47418J5359Q8396j57718j43241j71013m9916L33718K65264q0041m50636
$$ -90314 57104 72463 160859 3141 -140100 -311113 -361029 -27311 237953 157912 -292724
8872b92724l69231K26048K30087L9994j17756K2988q1406j249K95422K29150j18797
$$ -292724 -661955 -435907 -205820 -165826 -283582 -260594 -342000 -343249 -47827 181323 62526
8861F2526J85338n3162O4571j3029l65057j8467j6151k673j37664N3135m6361
$$ 62526 247864 194702 259273 246244 -118813 -137280 -153431 -156104 -293768 -240633 -286994
8850b86994R3342J84085k77307j02022J7026K67067m6497k95918J42155j01800
$$ -286994 -193652 -9567 -286874 -388896 -371870 -104803 -151300 -447218 -305063 -406863
8840d06863Q877N10791M6271j67536O2096L369n6959l963O4378P6789r1453l1553
$$ -406863 -397986 112805 159076 -8460 53636 57005 46 -3917 60461 137250 45797 14244
8828A4244K18141K01852j39700j4601J31654l3221j18244J79803J01084l32248
$$ 14244 232385 434237 294537 279936 411590 378369 260125 439928 541012 208764
8818B08764k25865K98174J14098r3290j9191j9738J15640j10486j57384k9092
$$ 208764 -17101 281073 395171 301881 282690 262952 378592 268106 110722 81630
8808H1630q0759j73718K2912r7328K49581J40370r5665n1836j02877L15235J05127
$$ 81630 871 -172847 -149935 -247263 2318 142688 47023 -4813 -107690 207545 312672
8797C12672p8427n8178k06562k06043K2857l11767o8467N24750M3097j74000K29634
$$ 312672 234245 176067 -30495 -236538 -213681 -525448 -593915 -69165 -26068 -200068 29566
8786B9566J27725q6964j20196k19511K87735J23055r3355J02493j20690j35141
$$ 29566 157291 70327 -49869 -269380 18355 141410 48055 150548 29858 -105283
8776a05283J28815J43253j78968P0973R1968j96113K578K75601P6721K52679M8602
$$ -105283 23532 166785 -12183 58790 150758 -45355 -42777 232824 309545 562224 610826
8765F10826j44126k79292L8152k3569o1550j53793K478l13062j7202J00089j5839
$$ 610826 466700 187408 225560 201991 140441 -13352 -10874 -323936 -341138 -241049 -256888
8754b56888R3586J07283Q1637j15028J74624j18842J6593J43436J19845Q8475
$$ -256888 -163302 -56019 25618 -89410 85214 -33628 -17035 126401 246246 334721
8744C34721K6857j89608j61913K33748J62759J54463m54785j02161O1863L0300
$$ 334721 361578 171970 10057 243805 406564 561027 106242 4081 65944 96244
8734I6244R5973r9229J5515L53854R8468l70867q144O4502r4096m2224M321J7231
$$ 96244 192217 92988 108503 462357 560825 189958 181814 246316 152220 109996 114317 131548
8722A31548l54874j77603j4983K47737K21459O7772K637O8157m08130l21880K42109
$$ 131548 -223326 -400929 -415912 -168175 53284 121056 123693 191850 -216280 -538160 -296051
8711b96051K59674J12196q4456J14725J19993J67345j42127M8563J69691k53818
$$ -296051 -36377 75819 -8637 106088 226081 393426 251299 299862 469553 215735
8701B15735J24412j09862j50720j52350k77785K8216j33087J18357q344N361N37989
$$ 215735 340147 230285 79565 -72785 -350570 -322354 -455441 -337084 -345428 -340067 197922
8690A97922K73138J6212J46468O4035l5615j36050j69803k45741k49014O5984
$$ 197922 471060 487272 633740 697775 662160 526110 356307 110566 -138448 -72464
8680g2464K25188J62220j8977J27703L22094K73242j11940m59930j21654R3247
$$ -72464 152724 314944 295967 423670 745764 1019006 907066 447136 325482 418729
8670D18729k0330K3799J00668J25620l8942J49119n4114j23799j17604j97616
$$ 418729 398399 422198 522866 648486 609544 758663 704549 580750 463146 265530
8660B65530P920L01770k26522j48674K45905K4772r3173r2840R8672Q6484k1645
$$ 265530 273450 575220 348698 200024 445929 470701 377528 284688 383360 469844 448199
8649D48199J6251J4068k04914k49761J42315J29929J8863k8391J74903K55069
$$ 448199 464450 478518 273604 23843 166158 296087 314950 286559 461462 716531
8639G16531m1915j47520j89754J0965k960K30283L77754J41418l2341L7625k11090
$$ 716531 674616 527096 337342 348307 345347 575630 953384 1094802 1062461 1100086 888996
8628H88996j42937o5340K1507L22246K57401J67244P6516P7570j31321o2362m26919
$$ 888996 746059 680719 702226 1024472 1281873 1449117 1525633 1603203 1471882 1409520 982601
8617I82601J41967j54612j79885J72504K0076J88863J65832j54021k12831P7755
$$ 982601 1124568 969956 790071 962575 982651 1171514 1337346 1183325 970494 1048249
8607A048249K40307K52970J9695j49700J43565J17260Q6875Rk92231O1841K03081
$$ 1048249 1288556 1541526 1561221 1411521 1555086 1672346 1759221 1759230 1466999 1528840 1731921
8596A731921K60456j0826J7979J42760M83726K97089M9822N5026L18942K96050
$$ 1731921 1992377 1981551 1999530 2142290 2626016 2923105 2972927 3027953 3346895 3642945
8586C642945L96307L68503L62294q2306M45645N77883J13887M969K86178M69859
$$ 3642945 4039252 4407755 4770049 4687743 5133388 5711271 5825158 5830127 6116305 6586164
8576F586164k92655m39191k20637l25164n84116m01817j95941k82960m90394k55169
$$ 6586164 6293509 5854318 5633681 5308517 4724401 4322584 4126643 3843683 3353289 3098120
8566C098120k65275k90455j10792n0572m88898n9520j25898M3640L1807J33878
$$ 3098120 2832845 2542390 2431598 2381026 1892128 1832608 1706710 1750350 1782157 1916035
8556A916035q8479j81773j56988J87749j14374j30438k7003J83805J02255P166
$$ 1916035 1827556 1645783 1488795 1676544 1562170 1431732 1404729 1588534 1690789 1697955
8546A697955M7050j21532k23724p749P2381n1423L9951j69401j31770q8700n9275
$$ 1697955 1745005 1623473 1399749 1392000 1464381 1412958 1452909 1283508 1151738 1063038 1003763
8535A003763K2746l4978j07972K5299m7013j92190n433K43988J33092j67985k17266
$$ 1003763 1026509 991531 883559 908858 861845 669655 664222 908210 1041302 873317 656051
8524F56051O2435K12739l1831J2029j28661K1903J4327N9729j09741J5721k2771
$$ 656051 718486 931225 899394 911423 782762 804665 818992 878721 768980 784701 761930
8513G61930Q0024j55130L7815J10952r9756J04699j02717p2349J51229K3744o2721
$$ 761930 841954 686824 724639 835591 735835 840534 737817 665468 816697 840441 777720
8502G77720K74179j15830j47020L2663M82766K62460N7802O2765Q6754l9248m01050
$$ 777720 1051899 936069 789049 821712 1304478 1566938 1624740 1687505 1774259 1735011 1333961
8491A333961j68234J28328L03966j3395q3642j39022l78548j13942q8876j34112
$$ 1333961 1165727 1294055 1598021 1584626 1500984 1361962 983414 869472 780596 646484
8481F46484n7429p3463J29657M1251K1416n1516j25344j39948p0991J98220K33099
$$ 646484 589055 515592 645249 686500 707916 656400 531056 391108 320117 518337 751436
8470G51436k40056l81191J82828K3615k7329Q6564r9968R0722J20846K52060K34502
$$ 751436 511380 130189 313017 336632 309303 395867 295899 386621 507467 759527 994029
8459I94029q4148p7323j85413m4736J28963J96296j17877J14050J73676P8772
$$ 994029 909881 832558 647145 602409 731372 927668 809791 923841 1097517 1176289
8449A176289k1446J0437J24100j88725k56471J46842j33520J3826j68021o3136
$$ 1176289 1154843 1165280 1289380 1100655 844184 991026 857506 871332 703311 640175
8439F40175J14075j31172j18176j72872K62793J47794n6034j73807j48736j93604
$$ 640175 754250 623078 504902 332030 594823 742617 686583 512776 364040 170436
8429A70436J17900K41810M5413q63k06242o2218n5315M6584K433j43176m465o3855
$$ 170436 288336 530146 575559 574696 368454 306236 250921 297505 299938 156762 152297 88442
8417H8442J03999m4789R1607O9493K02955k12146J11735n0918j64840j99733J51604
$$ 88442 192441 147652 239259 308752 511707 299561 411296 360378 195538 -4195 147409
8406A47409j04384P7557L6135J28693j1555k46375J71549L71571R3363m77248
$$ 147409 43025 120582 156717 285410 273855 27480 199029 570600 663963 186715
8396A86715j95752l1113Q4904k4129K51936J24240J46197k45308j9153J78972
$$ 186715 -9037 -40150 44754 20625 272561 396801 542998 297690 278537 457509
8386D57509Q2488k93512k4006J53798K11401j97129j35357m9312l56680k98505
$$ 457509 539997 246485 222479 376277 587678 390549 255192 205880 -150800 -449305
8376d49305N5489L68716K70681j7637m9307J7217R9901l5177J4910l41681l19376
$$ -449305 -393816 -25100 245581 227944 178637 195854 295755 260578 275488 -66193 -385569
8365c85569l2581j5400k964K09352K59098K48329k50085K8524j2827J89408J15740
$$ -385569 -418150 -433550 -436514 -227162 31936 280265 30180 58704 45877 235285 351025
8354C51025q6379j6346p644k7393j10440l9700L17365j14688J1640R6566K58920
$$ 351025 264646 248300 240656 213263 102823 63123 380488 265800 277440 374006 632926
8343F32926k4078j52555M5339K28665o8788k92607l53362p5198o693r8065L75598
$$ 632926 608848 456293 501632 730297 661509 368902 15540 -59658 -66351 -164416 211182
8332B11182k05813q8209J35653L5680q9425j19262K4241k7564Q5278K52086L591
$$ 211182 5369 -82840 52813 88493 -932 -120194 -95953 -123517 -38239 213847 217438
8321B17438j35778k80145k07209O7465K11610n3676Q6737P815J62392J33281j63013
$$ 217438 81660 -198485 -405694 -338229 -126619 -180295 -93558 -85743 76649 209930 46917
8310D6917J82262J30493n8529K6488K31801Q3891k85740L0290J40632K62196J3467
$$ 46917 229179 359672 301143 327631 559432 643323 357583 387873 528505 790701 804168
8299H04168R0129m0900k98631j62286j96308k4051m6309K02794O6497j88131m68057
$$ 804168 894297 853397 554766 392480 196172 172121 125812 328606 395103 206972 -261085
8288b61085j07492K293k00419K18149K87254j40658l03611O4147K36361P1751
$$ -261085 -368577 -366284 -566703 -348554 -61300 -201958 -505569 -441422 -205061 -133310
8278a33310K46305L2312Q6551J31042k47147j87230K11389q9555j5883j37247
$$ -133310 112995 145307 231858 362900 115753 -71477 139912 50357 34474 -102773
8268a02773n3961J85086q816l27037m4659K40579K30254J53570L8951j82373J06981
$$ -102773 -156734 28352 19536 -307501 -352160 -111581 118673 272243 311194 128821 235802
8257B35802P6469m6694l08471J54207p1692K6398J06832j30725M6531N349p7027
$$ 235802 312271 265577 -42894 111313 39621 66019 172851 42126 88657 94006 16979
8246A6979l38218j98236L31781L88095r2190l08779k61910K62152J69029P2708
$$ 16979 -321239 -519475 -187694 200401 108211 -200568 -462478 -200326 -31297 41411
8236D1411J13312J36052m20463j93584J9729R077p284L00800K75552K449q1792
$$ 41411 154723 290775 -129688 -323272 -303543 -294466 -301750 -950 274602 277051 195259
8225A95259K51829j48339j32508l0984P0168j30894R695M3986M8228n3831k15372
$$ 195259 447088 298749 166241 135257 205425 74531 84226 128212 176440 122609 -92763
8214i2763L8062K49760J33167j59683p5799M5760j06540j09641J79000J67545
$$ -92763 -54701 195059 328226 168543 92744 138504 31964 -77677 101323 268868
8204B68868j21254j63567J79396J11092k51888m7294J34071K6938J83551j15308
$$ 268868 147614 -15953 163443 274535 22647 -24647 109424 136362 319913 204605
8194B04605K04847J78483M3265m08757k50878N4188m9762j33248k1834K56182
$$ 204605 409452 587935 631200 222443 -28435 25753 -24009 -157257 -179091 77091
8184G7091J47384O5530N4856O5091K1679k44018j21722J32234Q155J6036j87799
$$ 77091 224475 290005 344861 409952 431631 187613 65891 198125 206280 222316 34517
8173C4517p0431M1635m0688Q9607n1584k3011R1047M7968k35462k58020N2719
$$ 34517 -35914 5721 -34967 54640 3056 -19955 71092 119060 -116402 -374422 -321703
8162c21703l7534L1314K41390Q456J12891J94495r5066j78099P5127J82603L9142
$$ -321703 -359237 -327923 -86533 -78077 34814 229309 134243 -43856 31271 213874 253016
8151B53016J57301p5830l75405j48181K39073P1636P1952J353j74547n0925L62737
$$ 253016 410317 334487 -40918 -189099 49974 121610 193562 194915 20368 -30557 332180
8140C32180K40553j62419l26459l32707l8830K00566q3355N7073R4695J51434
$$ 332180 572733 410314 83855 -248852 -287682 -87116 -170471 -113398 -18703 132731
8130A32731K06800L47596k46285j57082n467M4241J4812Q8959K846L8219j21290
$$ 132731 339531 687127 440842 283760 278293 322534 337346 426305 429151 467370 346080
8119C46080l590K0771J11219j53891Q2922k82384j6864q5573k72770J04749k643
$$ 346080 342490 363261 474480 320589 403511 121127 104263 18690 -254080 -149331 -151974
8108a51974J8689J20092j98414q7621M0787K10127L6896j40731p1387J48539j18643
$$ -151974 -133285 -13193 -211607 -299228 -258441 -48314 -11418 -152149 -223536 -74997 -193640
8097a93640K3892K87692K20204J69892K3559n36894k4526n2113J72429M813J05379
$$ -193640 -169748 117944 338148 508040 531599 -5295 -29821 -81934 90495 95308 200687
8086B00687Q8619l6164L24442P4294O6339K29542k83419k24433j38832j41019
$$ 200687 289306 253142 577584 651878 718217 947759 664340 439907 301075 160056
8076A60056o5297k86297k14523k5932K33519M49452J26395j39653k37495O1504
$$ 160056 94759 -191538 -406061 -431993 -198474 250978 377373 237720 225 61729
8066F1729J70594Q0478l67845k09331L37775L3994j29604n0310Q8383J3551j15128
$$ 61729 232323 312801 -55044 -264375 73400 107394 -22210 -72520 15863 29414 -85714
8055h5714j19589q7081j2445J76671p272N8382O2249K26549J17361o866l07946
$$ -85714 -205303 -292384 -304829 -128158 -135430 -77048 -14799 211750 329111 322245 14299
8044A4299j09510n0990J436J87655j15673k94459j02914n2756K36554M03864L53870
$$ 14299 -95211 -146201 -144765 42890 -72783 -367242 -470156 -522912 -286358 117506 471376
8033D71376J01111j70820l0573j44285J26674j16698L344m2764k06439j35434
$$ 471376 572487 401667 371094 226809 353483 236785 240129 197365 -9074 -144508
8023a44508J71178J74735P5124Q8522k9068k8758P1855j84247r54N7559R4130
$$ -144508 26670 201405 276529 365051 335983 307225 379080 194833 193879 251438 345568
8012C45568o6076J53616J40032M4105l33954l77793K8857L41434J15537p8980
$$ 345568 279492 433108 573140 617245 283291 -94502 -65645 275789 391326 312346
8002C12346J62810j24622k07729O6380K12603J04313O8577l10318R5742K09023
$$ 312346 475156 350534 142805 209185 421788 526101 594678 284360 380102 589125
7992E89125L93738J20327j53411l12909k1705J23953O1242n5049J69969N93141
$$ 589125 982863 1103190 949779 636870 615165 739118 800360 745311 915280 1508421
7982A508421n8940j02546M9792O0317K8213m8926J0887j74370k64546k76033Q1037
$$ 1508421 1449481 1346935 1396727 1457044 1485257 1436331 1447218 1272848 1008302 732269 813306
7971H13306R5830J30004j09612j48742j76052R9802L04682k88857m02672K40623
$$ 813306 909136 1039140 929528 780786 604734 704536 1009218 720361 317689 558312
7961E58312K22594K53576r2402l09068j581O6611q2161j20249o0286j07772P0163
$$ 558312 780906 1034482 942080 633012 631431 698042 615881 495632 435346 327574 397737
7950C97737k2780J97526L99776K37858m9852j39745j11932l21564k01519J41423
$$ 397737 374957 572483 972259 1210117 1160265 1020520 908588 587024 385505 526928
7940E26928R3657J39923m719r663J1768N8397j03375L0377k18397k06647p2578
$$ 526928 620585 760508 755789 746126 757894 816291 712916 743293 524896 318249 245671
7929B45671J05074k18997j39304L10948J12185j4345J06847J21688j48737j93157
$$ 245671 350745 131748 -7556 303392 415577 401232 508079 629767 481030 287873
7919B87873M1149L99671K53690k0561m05080m05762l4167K32853J52170R7879
$$ 287873 329022 728693 982383 961822 556742 150980 116813 349666 501836 599715
7909E99715n290k17379M2191L105k62980R9764P9319l18253k87043L1913K13085
$$ 599715 594425 377046 419237 422342 159362 259126 338445 20192 -266851 -234938 -21853
7898b1853L05751Q5048m7222Q8259K9571k03133j73231N5629o3678M3279L07J29773
$$ -21853 283898 368946 321724 409983 439554 236421 63190 118819 55141 98420 98727 228500
7886B28500p2329j29857o99J43550k80090L3831K50047J22002K0266J84995p7365
$$ 228500 156171 26314 25615 169165 -110925 -77094 172953 294955 315221 500216 422851
7875D22851n9482k4918k89350j06162L2851k01195J34833P9110J20504Q6985K6633
$$ 422851 363369 338451 49101 -57061 -24210 -225405 -90572 -11462 109042 196027 222660
7864B22660J13854j46803k35276p8883L2376R7830m1713j98528P4409l623k61859
$$ 222660 336514 189711 -45565 -124448 -92072 5758 -35955 -234483 -160074 -163697 -425556
7853d25556j01637N7092J85772J58320K06422J84271r2647K6480j43946M3269
$$ -425556 -527193 -470101 -284329 -126009 80413 264684 172037 198517 54571 97840
7843I7840j99283J9397J75028o1730J26060j7166k5166J21273j59047m3649L233
$$ 97840 -101443 -82046 92982 31252 157312 140146 114980 236253 77206 33557 36790
7832C6790k08784N2794j29992L0315J51780j412p9322L23885J8024j73181k35793
$$ 36790 -171994 -119200 -249192 -218877 -67097 -68509 -147831 176054 194078 20897 -214896
7821b14896l9844L1545j4411J10731N1717K68856j34366J51590j50325k75107
$$ -214896 -254740 -223195 -237606 -126875 -75158 193698 59332 210922 60597 -214510
7811b14510J02394M0393j93797j33685n6798L52399j88985p8948j59041m0252
$$ -214510 -112116 -71723 -265520 -399205 -456003 -103604 -292589 -371537 -530578 -570830
7801e70830R7175k7223M0956k31536M8035O6408J88874K15640j39073k92833m3717
$$ -570830 -473655 -500878 -459922 -691458 -643423 -577015 -388141 -172501 -311574 -604407 -648124
7790f48124O1169K76214L91269J68593K6436j64655j11893l7675p0018o3728R0329
$$ -648124 -586955 -310741 80528 249121 275557 110902 -991 -38666 -108684 -172412 -82083
7779h2083j72996J03915l1939j20351L8499Q8649K1864P9072j4870l3255j24666
$$ -82083 -255079 -151164 -183103 -303454 -264955 -176306 -154442 -75370 -90240 -123495 -248161
7768b48161j4905P2099M3449K06458L2593q275j60780o8619K03640Q2388p1907
$$ -248161 -263066 -190967 -147518 58940 91533 83258 -77522 -146141 57499 139887 67980
7757F7980j13262K1892m3879J10676k07059q6374j86904l15134m263o0515K63689
$$ 67980 -45282 -23390 -67269 43407 -163652 -250026 -436930 -752064 -756327 -816842 -553153
7746e53153K10321J23519J0229j70881k4675K47640l05069O3641R8861J86449
$$ -553153 -342832 -219313 -209084 -379965 -404640 -157000 -462069 -398428 -299567 -113118
7736a13118N3539q6490L236J9793k19902r9776J2820r3240J85853L55688J46510
$$ -113118 -59579 -146069 -142833 -123040 -342942 -442718 -429898 -523138 -337285 18403 164913
7725A64913J73186J28202R6391j49493l28806l5962Q2436m1858m86947J28581
$$ 164913 338099 466301 562692 413199 84393 48431 130867 89009 -397938 -269357
7715b69357K09416k04300l7161J3505N2347Q5163l883O8606J18594r6491L3480
$$ -269357 -59941 -264241 -301402 -287897 -235550 -150387 -154270 -85664 32930 -63561 -30081
7704c0081l36442J34257P1502M3903l11284k80957k4025K43901K5141j47459L51275
$$ -30081 -366523 -232266 -160764 -116861 -428145 -709102 -733127 -489226 -464085 -611544 -260269
7693b60269L51343l1388j20208n0717o1294J15785K77998J10000k19251k90456
$$ -260269 91074 59686 -60522 -111239 -172533 -56748 221250 331250 111999 -178457
7683a78457J19097J09419k91739l14966m6819L70406K10408j48574k13413K59696
$$ -178457 -59360 50059 -241680 -556646 -603465 -233059 -22651 -171225 -384638 -124942
7673a24942J7344J6233j16945j80409k36049k25947R9598L12838L39045m2314
$$ -124942 -107598 -91365 -208310 -388719 -624768 -850715 -751117 -438279 -99234 -141548
7663a41548k31504K17324L42602K7991j57287j68635O340j51366N0597J14929
$$ -141548 -373052 -155728 186874 214865 57578 -111057 -104717 -256083 -205486 -90557
7653i0557Q0685J26820l6597k3599K09200M2653k46306k99625j01336j87183k91019
$$ -90557 -9872 116948 80351 56752 265952 308605 62299 -237326 -338662 -525845 -816864
7642h16864L74359K80421m8806j05185K17384l4330j11681q7371L14j57178J4788
$$ -816864 -442505 -162084 -210890 -316075 -98691 -133021 -244702 -332073 -331759 -488937 -474149
7631d74149K20533K58717j08168K02277L8054j73745n4982J05709j965J67717
$$ -474149 -253616 5101 -103067 99210 137264 -36481 -91463 14246 12281 179998
7621A79998n2554k28646k44763j70028J43407L66040L6830j6178N2907j21172
$$ 179998 127444 -101202 -345965 -515993 -372586 -6546 30284 14106 67013 -54159
7611e4159L9036j00992k46018O4986J45932K11067k3566J6247J56107R9377p5933
$$ -54159 -15123 -116115 -362133 -297147 -151215 59852 36286 52533 208640 308017 232084
7600B32084l93633m39332M0276r640J45529l8433M9383k46865q7080J45588P3282
$$ 232084 -161549 -600881 -560605 -570245 -424716 -463149 -413766 -660631 -747711 -602123 -528841
7589e28841J51873J08801p8177j40895J68072k0762K81867J00336o9781j0619
$$ -528841 -376968 -268167 -346344 -487239 -319167 -339929 -58062 42274 -27507 -38126
7579c8126Q6472l4005P965p7542k02324j55496J6454K71366J44376k29221r9502
$$ -38126 48346 14341 22306 -55236 -257560 -413056 -396602 -125236 19140 -210081 -309583
7568c09583O3864m8271l7176j0199Q8234J04182o7767j80567n6875q7155M6821
$$ -309583 -245719 -293990 -331166 -341365 -253131 -148949 -216716 -397283 -454158 -541313 -494492
7557d94492K58017L08150k56546k06743n6114J38587J62945j12715k79974k1572
$$ -494492 -236475 71675 -184871 -391614 -447728 -309141 -146196 -258911 -538885 -560457
7547e60457N6340K24082j23940j35326L0626J97172j5452J34580J97639n6727
$$ -560457 -504117 -280035 -403975 -539301 -508675 -311503 -326955 -192375 5264 -51463
7537e1463j67621k1054J0900j30449j74254j50263r2886J15094L07792K38238
$$ -51463 -219084 -240138 -229238 -359687 -533941 -684204 -777090 -661996 -354204 -115966
7527a15966R432L6666j08333k11074O6397P1792k88663k7591J47670o46o6755
$$ -115966 -106534 -69868 -178201 -389275 -322878 -251086 -539749 -567340 -419670 -420316 -487071
7516d87071L4542p7202j89592N8792K84218L39918l27365R4949m3998r0367J19690
$$ -487071 -452529 -529731 -719323 -660531 -376313 -36395 -363760 -268811 -312809 -403176 -283486
7505b83486P6462j39692j76393L3951M5230n4371R4501J712j2242K46133K07749
$$ -283486 -207024 -346716 -523109 -489158 -443928 -498299 -403798 -402086 -414328 -168195 39554
7494C9554J63128k16369l95184q6564N16256J21822K3000l7271P9522j94354M7907
$$ 39554 202682 -13687 -408871 -495435 20821 142643 165643 128372 207894 13540 61447
7483F1447J28782m1031l22516m65554j50348L08238K14044J95591Q906k13626
$$ 61447 190229 149198 -173318 -638872 -789220 -480982 -266938 -71347 -62441 -276067
7473b76067N3921K14494l2559J36230k85301j77313j00897r5796K2018q1459o2078
$$ -276067 -222146 -7652 -40211 96019 -189282 -366595 -467492 -563288 -541270 -622729 -684807
7462f84807o1919J80561K65719M08882K05395l21720m50281k17236o2066J73331
$$ -684807 -746726 -566165 -300446 108436 313831 -7889 -458170 -675406 -737472 -564141
7452e64141R9190m4672j14692j12365K07117J38505J05648j41913j20835L06493
$$ -564141 -464951 -509623 -624315 -736680 -529563 -391058 -285410 -427323 -548158 -241665
7442b41665K11366K24761k0123l28988J3725L6447K9616K65008J08449k63385
$$ -241665 -30299 194462 174339 -154649 -140924 -104477 -74861 190147 298596 35211
7432C5211m6702K84992j94493m2410q4020j5639K5121k25698K35620L3696j11927
$$ 35211 -11491 273501 79008 36598 -47422 -63061 -37940 -263638 -28018 5678 -106249
7421a06249J28918j95250j05950K3070K4243m3451O5101o3592K26495M91893k6306
$$ -106249 22669 -172581 -278531 -255461 -231218 -274669 -209568 -273160 -46665 445228 418922
7410D18922k82098r9348K0723R3829O7856o550k50258j62042J4276K45106m547
$$ 418922 136824 37476 58199 152028 219884 213334 -36924 -198966 -184690 60416 55869
7399E5869n7300k32351j05274n9575K62457L2912j17936l5675K23442j43118N1353
$$ 55869 -1431 -233782 -339056 -398631 -136174 -103262 -221198 -256873 -33431 -176549 -125196
7388a25196R8634j784j26014l14738j32021l8108K14083j36506J66872J74831
$$ -125196 -26562 -28346 -154360 -469098 -601119 -639227 -425144 -561650 -394778 -219947
7378b19947m1502j2829J35994j38237R5412j56325k10933j53256j83947J79589
$$ -219947 -261449 -274278 -138284 -276521 -181109 -337434 -548367 -701623 -885570 -705981
7368g05981l9209J15912J96181J18614k84635q2113K29277J81735J34381k33159
$$ -705981 -745190 -629278 -433097 -314483 -599118 -681231 -451954 -270219 -135838 -368997
7358c68997j48341J40168J04873J32531J24617k71294R7562L83616R0612r7546
$$ -368997 -517338 -377170 -272297 -139766 -15149 -286443 -188881 194735 285347 187801
7348A87801l06938l88409J82245L1982j89718R4309K78219K5938L4816q4724k35325
$$ 187801 -119137 -507546 -325301 -293319 -483037 -388728 -110509 -84571 -49755 -134479 -369804
7337c69804j13143J87587O6754J11632R3799j20396J44766m7983p9101j02732
$$ -369804 -482947 -295360 -228606 -116974 -23175 -143571 1195 -46788 -125889 -228621
7327b28621n1195j22863k6818J35263n8680k0330J724j43571R5997L42535K68066
$$ -228621 -279816 -402679 -429497 -294234 -352914 -373244 -371520 -515091 -419094 -76559 191507
7316A91507l9649o8884o7253k95598m3020j71681j86517J98065J03915J77201
$$ 191507 151858 82974 15721 -279877 -322897 -494578 -681095 -483030 -379115 -201914
7306b01914J29407N7717n5780j58863j14366J599J54443Q7309k85581p8181J95253
$$ -201914 -72507 -14790 -70570 -229433 -343799 -342200 -187757 -100448 -386029 -464210 -268957
7295b68957J34962K18998M9382j49884L3474Q8915k86892J99533O3548K79094
$$ -268957 -133995 85003 134385 -15499 17975 106890 -180002 19531 83079 362173
7285C62173m7076j66520p8952k1703K04048K22917k47838l54494p4241p0695J21518
$$ 362173 315097 148577 69625 47922 251970 474887 227049 -127445 -201686 -272381 -150863
7274a50863P252j72337J39346j41047K25598m7468M3060J21207k30245l18939
$$ -150863 -143611 -315948 -176602 -317649 -92051 -139519 -96459 24748 -205497 -524436
7264e24436k6796K05489K99889K26414R3024k65491p1577O4384j17845m11849
$$ -524436 -551232 -345743 -45854 180560 273584 8093 -63484 900 -116945 -528794
7254e28794j12857O0451N1687J0599K73841O2729M8819J32484L5944n5495r7493
$$ -528794 -641651 -581200 -529513 -518914 -245073 -182344 -133525 -1041 34903 -20592 -118085
7243a18085j31672Q6891k9571k4476j03307N8185q9050J14021N4046r5841J4356
$$ -118085 -249757 -162866 -192437 -216913 -320220 -262035 -351085 -237064 -183018 -278859 -264503
7232b64503p6053N5504N3561j71314k2083L6055K12158K53918j02649j72154J1779
$$ -264503 -340556 -285052 -231491 -402805 -424888 -388833 -176675 77243 -25406 -197560 -185781
7221a85781M9103l46231p9366n2519R7850Q9130J49356N4516J73671k55161k35768
$$ -185781 -136678 -482909 -562275 -614794 -516944 -427814 -278458 -223942 -50271 -305432 -541200
7210e41200K94579M72012K58293j13204j31699J43038j4561k65255k54620k1844
$$ -541200 -246621 225391 483684 370480 238781 381819 367258 102003 -152617 -174461
7200a74461L646K83144M8440j84273m20497m6465L94125L8761O1384l66607P8811
$$ -174461 -170815 112329 160769 -23504 -444001 -490466 -96341 -57580 3804 -362803 -283992
7189b83992o5245L8590L28820J95270L49737j72412o05313o0544J83188K22645
$$ -283992 -349237 -310647 18173 213443 563180 390768 -214545 -275089 -91901 130744
7179A30744p3940j18107J9578N7560J41149l7809J19717q7417n9331j08584J94662
$$ 130744 56804 -61303 -41725 15835 156984 119175 238892 151475 92144 -16440 178222
7168A78222J0180k34677j94038M6800J44207R4764k6631j39876n2054K2080L995
$$ 178222 188402 -46275 -240313 -193513 -49306 45458 18827 -121049 -173103 -151023 -147028
7157a47028l0920r6855N9708J60061k51495k54260j82030J0868K53466o7065J9825
$$ -147028 -177948 -274803 -215095 -55034 -306529 -560789 -742819 -731951 -478485 -545550 -525725
7146e25725J98190J18182q824k85295J08451J66639M17697j88778k22395P981
$$ -525725 -327535 -209353 -218177 -503472 -395021 -228382 189315 537 -221858 -213877
7136b13877J81208K3926k13290l2315J51605q0048R6261k43678k40597K64282
$$ -213877 -32669 -8743 -222033 -254348 -102743 -182791 -86530 -330208 -570805 -306523
7126c06523J98465J95968P7689r6038j08534j00523m28082N9948J60333Q3843
$$ -306523 -108058 87910 165599 69561 -38973 -139496 -567578 -507630 -347297 -263454
7116b63454J60548J67106J93868J97285k95656L3705k34859J9165J06534p8256
$$ -263454 -102906 64200 258068 455353 159697 193402 -41457 -22292 84242 5986
7106E986j2156O8837J889k48569N534j99729j13352L92881K92624J2535j84414
$$ 5986 -6170 62667 64556 -184013 -178479 -378208 -491560 -98679 193945 206480 22066
7095B2066n53097j2204J82843J01904Q3010L33430j94803k24415M6176Q1687K56736
$$ 22066 -531031 -543235 -360392 -258488 -175478 157952 -36851 -261266 -215090 -133403 123333
7084A23333j45166k28146k6682M60n214J12264O61o3110J15649J23065k58820
$$ 123333 -21833 -249979 -276661 -276201 -281415 -169151 -168490 -231600 -115951 7114 -251706
7073b51706p5550q1033p2442j05150L0816K17273K76711P3793j62462K15124n8556
$$ -251706 -327256 -408289 -480731 -585881 -555065 -337792 -61081 12712 -149750 65374 6818
7062F818m42061m21492L05157L63373Q1709k0949K5822o8081J8430K55623j28093
$$ 6818 -435243 -856735 -551578 -188205 -106496 -127445 -101623 -169704 -151274 104349 -23744
7051b3744j06651L01980N0280j86153l73851K9831K22088K58984m8549j16413
$$ -23744 -130395 171585 221865 35712 -338139 -308308 -86220 172764 124215 7802
7041G802j32993j55929r7168R6999O1030k01493K03123j00495k35846N7433J40813
$$ 7802 -125191 -281120 -378288 -281289 -220259 -421752 -218629 -319124 -554970 -497537 -356724
7030c56724J38266N6488K80030r4539k25840Q8186J89868Q8240l7065j37823j63374
$$ -356724 -218458 -161970 118060 23521 -202319 -114133 75735 163975 126910 -10913 -174287
7019a74287M396J03001j06913J69125j32331j50919q9109o359N9638O625J22978
$$ -174287 -169891 -66890 -173803 -4678 -137009 -287928 -377037 -383396 -323758 -317133 -194155
7008a94155P3664n12059k50768N3960J44101K8961J56876Q9774R3136J02258k85472
$$ -194155 -120491 -632550 -883318 -829358 -685257 -656296 -499420 -409646 -316510 -214252 -499724
6997d99724Q3167K72890R5865K41779k46760m86009l67266K39647J42763L04355
$$ -499724 -416557 -143667 -47802 193977 -52783 -538792 -906058 -666411 -523648 -219293
6987b19293k2754K51166J24642k81377r5389j53200m5499J41708P0906K5962p6634
$$ -219293 -242047 9119 133761 -147616 -243005 -396205 -441704 -299996 -229090 -203128 -279762
6976b79762K63272q0705k10677j51289M0437o590k8968P2425K00241j10154j58551
$$ -279762 -16490 -97195 -307872 -459161 -418724 -425314 -454282 -381857 -181616 -291770 -450321
6965d50321J58528J24692o3215R2272j45746j7720J99945M6955r0456N21J76954
$$ -450321 -291793 -167101 -230316 -138044 -283790 -301510 -101565 -54610 -145066 -144545 32409
6954C2409J65267p6895l87272j93890N9045j55060q5282L17156N1331k34325J08663
$$ 32409 197676 120781 -266491 -460381 -401336 -556396 -641678 -324522 -273191 -507516 -398853
6943c98853o0420K21765J204j03168k12775O913K32030J69658K23315r0988j43251
$$ -398853 -459273 -237508 -236304 -339472 -552247 -545334 -313304 -143646 79669 -11319 -154570
6932a54570j8172n9684J37215K39324M3902K7302j32908k01853k93196J15424
$$ -154570 -172742 -232426 -95211 144113 188015 215317 82409 -119444 -412640 -297216
6922b97216l8923J31552K51557p5130o203L04576k5442j12890j16563l68509k21680
$$ -297216 -336139 -204587 46970 -28160 -34363 270213 244771 131881 15318 -353191 -574871
6911e74871Q9405O7016J09568K36574K78287O877O6342K72084k57543k76375l15926
$$ -574871 -485466 -418450 -308882 -72308 205979 212856 279198 551282 293739 17364 -298562
6900b98562j21952J62362M5579K43130R2620j63361q14K42241r649j63004j94209
$$ -298562 -420514 -258152 -212573 30557 123177 -40184 -40998 201243 191594 28590 -165619
6889a65619r4782N7087m1942N8444K0704k36979n3287J25267p3588k59J41945
$$ -165619 -260401 -203314 -245256 -186812 -166108 -403087 -456374 -331107 -404695 -404954 -263009
6878b63009k2862L1341J46811L42644j39101j98110J58599j3935J507n7109Q8163
$$ -263009 -285871 -254530 -107719 234925 95824 -102286 56313 42378 43885 -13224 74939
6867G4939K77159Q3264l37070m88801K16666j6442n5183j76971j64991J51629
$$ 74939 352098 435362 98292 -390509 -173843 -190285 -245468 -422439 -587430 -435801
6857d35801M779q1802J27515K44463K87317K0971j96524j08593R1636q1601k07376
$$ -435801 -431022 -512824 -385309 -140846 146471 167442 -29082 -137675 -46039 -127640 -335016
6846c35016J16526R4866L9157L5510j75866l291j88395k1192K51760J68775J36788
$$ -335016 -218490 -123624 -84467 -48957 -224823 -228114 -416509 -437701 -185941 -17166 119622
6835A19622K60216l50994l57627J88057J6098j13126J51929r994k57619N3971
$$ 119622 379838 28844 -328783 -140726 -124628 -237754 -85825 -95819 -353438 -299467
6825b99467L99662k1898k76255j39393R300L92261K34588j58718J17856J42353
$$ -299467 100195 78297 -197958 -337351 -328051 64210 298798 140080 257936 400289
6815D00289q6594j18914j33732p7951o027q5806j29415r122p9275l10689R368
$$ 400289 313695 194781 61049 -16902 -22929 -108735 -238150 -247272 -326547 -637236 -627868
6804f27868L32651L4735n4245n349J2432o9121M1089J51661m07073l4466L06379
$$ -627868 -295217 -260482 -314727 -320076 -307644 -376765 -335676 -184015 -591088 -625554 -319175
6793c19175K14017n5396k07858J12902K58871J63131m3085p0446j31183n9215
$$ -319175 -105158 -160554 -368412 -255510 3361 166492 123407 52961 -78222 -137437
6783a37437J73400J3494J9198p1441P8526k429l22814k67353N480m1916J28948
$$ -137437 35963 49457 68655 -2786 75740 73311 -249503 -516856 -511376 -553292 -424344
6772d24344R8788L31279K55986j40334l51861K1489J1679J9067J05825J63793
$$ -424344 -325556 5723 261709 121375 -230486 -208997 -197318 -178251 -72426 91367
6762I1367r471j19152j42178J76712P0468j3K7877p2466j43552r0732J35039J22047
$$ 91367 81896 -37256 -179434 -2722 67746 67733 95610 23144 -120408 -211140 -76101 45946
6750D5946q4671L2033L68501m8146J19124L438j34987p3546j43404j21224j09353
$$ 45946 -38725 -6692 361809 313663 432787 436225 301238 227692 84288 -36936 -146289
6739a46289q9607j58851M6062q3009o6667R0197K23621r3459k9394J01667k23654
$$ -146289 -235896 -394747 -348685 -431694 -498361 -408164 -184543 -278002 -307396 -205729 -429383
6728d29383j13743j7958J22695K41012R657K88645J23632M6185j73902Q9287K9122
$$ -429383 -543126 -561084 -438389 -197377 -187720 100925 224557 270742 96840 186127 215249
6717B15249q9354J84025j50923k00114K10433p371k7296M7119J9235J2043j09738
$$ 215249 125895 309920 158997 -41117 169316 161945 134649 181768 201003 213046 103308
6706A03308N9396j74770j12152q8332J27938R9202k49741l5291K16737O2506m0534
$$ 103308 162704 -12066 -124218 -212550 -84612 14590 -235151 -270442 -53705 8801 -31733
6695c1733J183j3913k16500j35862L42851R7097n7991Q4609K634q6015m33712
$$ -31733 -30550 -44463 -260963 -396825 -53974 43123 -14868 69741 72375 -13640 -447352
6684d47352p9011K63753J75066K40035o6566q4212p0799L0525K78212R3021j62116
$$ -447352 -526363 -262610 -87544 152491 85925 1713 -69086 -38561 239651 332672 170556
6673A70556k11410N4152L99529J18605k50438m9621j4898p6333j18134j28641
$$ 170556 -40854 13298 412827 531432 280994 231373 216475 140142 22008 -106633
6663a06633J3847K82667l5508k22361k27848j13386K53209K34868n791k22014
$$ -106633 -92786 189881 154373 -67988 -295836 -409222 -156013 78855 73064 -148950
6653a48950j59368M44728L34647j45976r4498k16327k6620K013K1878J77143l9223
$$ -148950 -308318 136410 471057 325081 230583 14256 -12364 -10351 11527 188670 149447
6642A49447j36047J23264j59383k01363J47966J71212O63q8474J48621K41039
$$ 149447 13400 136664 -22719 -224082 -76116 95096 95759 7285 155906 396945
6632C96945J95711j06385K4076k75553j50032j73814J68132K9746J39022K21330
$$ 396945 592656 486271 510347 234794 84762 -89052 79080 108826 247848 469178
6622D69178j56419j78803k22951O8575p8597M7227Q9832p1679k54272j62932J64120
$$ 469178 312759 133956 -88995 -20420 -99017 -51790 38042 -33637 -287909 -450841 -286721
6611b86721L56277R1419N2724J66350K26518j89034m8335q6950j90116j97402
$$ -286721 69556 160975 213699 380049 606567 417533 369198 282248 92132 -105270
6601a05270J40900n91N8995J83830j08861j00289O7273L8274J40482L5626j26719
$$ -105270 35630 35039 94034 277864 169003 68714 135987 174261 314743 350369 223650
6590B23650O1325r834J16413j18524l27080J35591L90866M6231K2706j068k88337
$$ 223650 284975 275141 391554 273030 -54050 81541 472407 518638 541344 540276 251939
6579B51939R329J9846M1288j2950j66919O2556J57665m6719K2983J22680O4906
$$ 251939 261268 281114 322402 309452 142533 205089 362754 316035 339018 461698 526604
6568E26604L4147J28772j081j84904n4458P2512j60120J54589J77374J51956k55632
$$ 526604 560751 689523 688442 503538 449080 521592 361472 516061 693435 845391 589759
6557E89759j17300L3886j06829k21564J3242L3239j5622J89554K21782k71933
$$ 589759 472459 506345 399516 177952 191194 224433 208811 398365 620147 348214
6547C48214l34318o3877K40301K47788j16648l19043j375O7741q3959k36350l5681
$$ 348214 13896 -49981 190320 438108 321460 2417 1042 68783 -15176 -251526 -287207
6536b87207r0238J58972k35422j76887K16029L05398M1808j4931K0280j49231
$$ -287207 -377445 -218473 -453895 -630782 -414753 -109355 -67547 -82478 -62198 -211429
6526b11429Q50J17204J59637L2287O8012L4446L18727j99555j46757K65097K04599
$$ -211429 -210579 -93375 66262 98549 166561 201007 519734 320179 173422 438519 643118
6515F43118k44697l16680j08153L17114L98448l26030l38086j08582p333q319
$$ 643118 398421 81741 -26412 290702 689150 363120 25034 -83548 -90881 -99200
6505i9200O7036J39604r739J56730j46947j20577K160j05756o9717R0573J5180
$$ -99200 -32164 107440 97701 254431 107484 -13093 -10933 -116689 -186406 -95833 -80653
6494h0653K0421Q5356O1525j62726o0634R0970r6911J76420J52982J93630J36548
$$ -80653 -60232 25124 86649 -76077 -136711 -45741 -142652 33768 186750 380380 516928
6483E16928k75386m42773j38588M1225J14185K1097k74473K75288J71070p718
$$ 516928 241542 -201231 -339819 -298594 -184409 -163312 -437785 -162497 8573 855
6473H55K8536O0354K06655L7106k81910n1771P8557N48430N891r7578j6023l6004
$$ 855 29391 89745 296400 333506 51596 -175 78382 626812 632703 535125 519102 483098
6461D83098P3979k55900k11831n0614j16011J6192O8810J3227m019j22005r9174
$$ 483098 557077 301177 89346 38732 -77279 -61087 7723 20950 16931 -105074 -204248
6450b04248j43026n5710K92514K13785j89569J6504L11296K92992r240J75428
$$ -204248 -347274 -402984 -110470 103315 -86254 -69750 241546 534538 525298 700726
6440G00726k8679l42530o5093J91274L4437q9889k15825k08940k28416p9728K17740
$$ 700726 672047 329517 264424 455698 490135 400246 184421 -24519 -252935 -332663 -114923
6429a14923J13975r104K57116j00962j22051l06669m2454M7585J2689p3792q9078
$$ -114923 -948 -10052 247064 146102 24051 -282618 -325072 -277487 -264798 -338590 -427668
6418d27668j40330o3918J75164M01028o2971l9526j23283j23800J1333L68892
$$ -427668 -567998 -631916 -456752 -55724 -118695 -158221 -281504 -405304 -393971 -25079
6408b5079L8756m00816R725K81258N901k62619L79030k7819j06112m9007l2842
$$ -25079 13677 -387139 -377414 -96156 -90255 -352874 26156 -1663 -107775 -156782 -189624
6397a89624J43573o3781l7552j98465J09401K12617M7718O109K3716P1470j81164
$$ -189624 -46051 -109832 -147384 -345849 -236448 -23831 23887 29996 53712 125182 -55982
6386e5982j15046R3816k79043k61871N4959J35363L35593O8039k1327k38769q6531
$$ -55982 -171028 -77212 -356255 -618126 -563167 -427804 -92211 -24172 -45499 -284268 -370799
6375c70799J4443K95444j27468k34633K31430K66395j37642o3265O6194j40282
$$ -370799 -356356 -60912 -188380 -423013 -191583 74812 -62830 -126095 -59901 -200183
6365b00183k08031K0833K5178O3798Q8308J80812q6930J37045J31913K3431O6653
$$ -200183 -408214 -387381 -362203 -298405 -210097 -29285 -116215 20830 152743 176174 242827
6354B42827l07886R7079m0736m75027K25094J95002n3339j16891R2597O6772k29435
$$ 242827 -65059 32020 -8716 -483743 -258649 -63647 -116986 -233877 -141280 -74508 -303943
6343c03943q8794K37791K7325O2321M481k7594m0140j65423k94215k0177R1326
$$ -303943 -392737 -154946 -127621 -65300 -60819 -88413 -128553 -293976 -588191 -608368 -517042
6332e17042J92622J71329J63437j57385k1429L56730j0206m37552k35070l1461
$$ -517042 -324420 -153091 10346 -147039 -168468 188262 178056 -259496 -494566 -526027
6322e26027J51182L50428J57690n7944j3438j49863J17954J34023J91516K9532
$$ -526027 -374845 -24417 133273 75329 61891 -87972 29982 164005 355521 385053
6312C85053j46153k10639j17271j42670N3906Q3270j9242L4890n7080j74568Q2654
$$ 385053 238900 28261 -89010 -231680 -177774 -94504 -113746 -78856 -135936 -310504 -227850
6301b27850q9149j3499J79983l9770j8762l7570L20728L15781n2943j70480J3625
$$ -227850 -316999 -330498 -150515 -190285 -209047 -246617 74111 389892 336949 166469 180094
6290A80094q0123K1510K9951O1093Q8273j12549K59453K39305l93259k62905J84992
$$ 180094 99971 121481 151432 212525 300798 188249 447702 687007 293748 30843 215835
6279B15835N598M73820N5867K0774k01422k69571n3546k01245r5216j23899r3641
$$ 215835 221433 695253 751120 771894 570472 300901 247355 46110 -49106 -173005 -266646
6268b66646N8778q8663l2909K98613K68221l0281j29661j11364J06334p8877j80898
$$ -266646 -207868 -296531 -329440 -30827 237394 207113 77452 -33912 72422 -6455 -187353
6257a87353l3689j49998q6179L51977K48538O5326j56363j00526M6063l61536
$$ -187353 -221042 -371040 -457219 -105242 143296 208622 52259 -48267 -2204 -363740
6247c63740l08539J34068K46087J34813j1785M2564n5449n5217k39633J27958
$$ -363740 -672279 -538211 -292124 -157311 -169096 -126532 -181981 -237198 -476831 -348873
6237c48873m8217o5321L28248P6673k38191j36998p6901J89915J80752k20014
$$ -348873 -397090 -462411 -134163 -57490 -295681 -432679 -509580 -319665 -138913 -358927
6227c58927O1876K3936J22298L70574l2917K4587m67170J04937J46325L0590N5324
$$ -358927 -297051 -273115 -150817 219757 186840 211427 -255743 -150806 -4481 26109 81433
6216H1433K54129j94710k9965o6994L9467J29941k6900J589p8739q9357k60149
$$ 81433 335562 140852 110887 43893 83360 213301 186401 187990 109251 19894 -240255
6205b40255J71891J23139K13898K25767q1962k56245k27000k6940J93648n5460
$$ -240255 -68364 54775 268673 494440 412478 156233 -70767 -97707 95941 40481
6195D0481j1362K09391j41743J63888J17044J02988k07993m32500j14982k3910
$$ 40481 29119 238510 96767 260655 377699 480687 272694 -159806 -274788 -298698
6185b98698n5779J16447l32K83346J49699j02772K65979J37925J5977k80776k64717
$$ -298698 -354477 -238030 -238362 44984 194683 91911 357890 495815 511792 231016 -33701
6174c3701m40244k38271J07132K02316R4088k54107K65673J22759k15005j18557
$$ -33701 -473945 -712216 -605084 -402768 -308680 -562787 -297114 -174355 -389360 -507917
6164e07917j23004K49766R1809j08567L04170j5060n58314o6064M09399Q42k59026
$$ -507917 -630921 -381155 -289346 -397913 -93743 -108803 -667117 -733181 -323782 -322940 -581966
6153e81966O5260J9814K7650L09534K03603J18912j05685J9129Q6751j1761l12818
$$ -581966 -516706 -496892 -469242 -159708 43895 162807 57122 76251 163002 151241 -161577
6142a61577k4970j99075j00934k27300J98974K67172J19423j90437o733K41580
$$ -161577 -186547 -385622 -486556 -713856 -514882 -247710 -128287 -318724 -325457 -83877
6132h3877j05037J39098n6010J14544K23010J10285k91935l56101m9330J95996
$$ -83877 -188914 -49816 -105826 8718 231728 342013 50078 -306023 -355353 -159357
6122a59357m3283J05430J05193J31081k60719l36014J9094J11697J63728j33239
$$ -159357 -202640 -97210 7983 139064 -121655 -457669 -438575 -326878 -163150 -296389
6112b96389j09113J65696K20792J83106j30353j43742K22503J03774J7191K56475
$$ -296389 -405502 -239806 -19014 164092 33739 -110003 112500 216274 233465 489940
6102D89940j77401k56346l87724k81797O5902K26336J87494n8536k99403M3967
$$ 489940 312539 56193 -331531 -613328 -547426 -321090 -133596 -192132 -491535 -447568
6092d47568N8640l8023L9949J27134l2561R7705J02685N6489L7709j10046L7283
$$ -447568 -388928 -426951 -387002 -259868 -292429 -194724 -92039 -35550 2159 -107887 -70604
6081g0604K43330l3524m8813k11102O8094L03582Q3546j34640j28669J79600J72676
$$ -70604 172726 139202 90389 -120713 -52619 250963 334509 199869 71200 250800 423476
6070D23476j91143l13607J0140k2908j49758j57791J21370L6239j79264K11389
$$ 423476 232333 -81274 -71134 -94042 -243800 -401591 -280221 -243982 -423246 -211857
6060b11857J49038J40235q3587j14747q6928O3141Q7589J11692J32413J3561k18448
$$ -211857 -62819 77416 -6171 -120918 -207846 -144705 -57116 54576 186989 200550 -17898
6049a7898n5202k7573K05638P2053j80939k17242O1255L10079k83887k41649J69757
$$ -17898 -73100 -100673 104965 177018 -3921 -221163 -159908 150171 -133716 -375365 -205608
6038b05608K71823J974J84614j40363M2842j75242L6586m7359j25445j39811J9711
$$ -205608 66215 68189 252803 112440 155282 -19960 16626 -30733 -156178 -295989 -276278
6027b76278L4178l0187N8267J2347N1214Q3157k64193l54435J49125K13175P6893
$$ -276278 -242100 -272287 -214020 -201673 -150459 -67302 -331495 -685930 -536805 -323630 -246737
6016b46737Q88K00539J80177p4124j88422l55720P286l27113N8004O1009l7338
$$ -246737 -245849 -45310 134867 60743 -127679 -483399 -476113 -803226 -745222 -684213 -721551
6005g21551p1748K50208J86032k3260n2993j81411k25469J06408J87555O2029
$$ -721551 -793299 -543091 -357059 -380319 -433312 -614723 -840192 -733784 -546229 -484200
5995d84200J97918p1980J29821l7642O8868j43656q2248O2320j12976P2084M00405
$$ -484200 -286282 -358262 -228441 -266083 -197215 -340871 -423119 -360799 -473775 -401691 -1286
5984a286L2250l67362n5811J81914j5461j50643J54622L92698n5458l9101K3745
$$ -1286 30964 -336398 -392209 -210295 -225756 -376399 -221777 170921 115463 76362 100107
5973A00107K28601k97154j10143K0943j053K58167J94928j98956j69337l06768
$$ 100107 328708 31554 -78589 -57646 -58699 199468 394396 195440 26103 -280665
5963b80665J40072R8594j04513j42456k59351j49726M93941J80270n6630n3947
$$ -280665 -140593 -41999 -146512 -288968 -548319 -698045 -204104 -23834 -80464 -134411
5953a34411M28673K68204l7226j04751l69982L4546R5683l3767j02215l00110
$$ -134411 294262 562466 525240 420489 50507 85053 180736 146969 44754 -255356
5943b55356p1540J27032M2222q2461L5228o0738j77381m6791j54833K75761K99488
$$ -255356 -326896 -199864 -157642 -240103 -204875 -265613 -442994 -489785 -644618 -368857 -69369
5932f9369J47747M2926k42167k2774K05627K9302m00455l72137K17553J11437
$$ -69369 78378 121304 -120863 -143637 61990 91292 -309163 -681300 -463747 -352310
5922c52310o17j86047j58505J00834K34140K40959L69595k7111k22785N8121o197
$$ -352310 -352927 -538974 -697479 -596645 -362505 -121546 248049 220938 -1847 56274 50077
5911E0077l16573M3900J4112r6298k32867J48400j00605j09171j34003K76512
$$ 50077 -266496 -222596 -208484 -304782 -537649 -389249 -489854 -599025 -733028 -456516
5901d56516J97073j033k5500J88963J4243m2185n4305J47205J46509j46512j49497
$$ -456516 -259443 -260476 -285976 -97013 -82770 -124955 -179260 -32055 114454 -32058 -181555
5890a81555M6927M1117N8401K62914K909k58829R172q8266p8955m2424k7028J2922
$$ -181555 -134628 -93511 -35110 227804 230713 -28116 -18944 -107210 -186165 -228589 -255617 -242695
5878b42695q3593j68207K2281p8927J7534K5873J24004K28638n8459k69983q4273
$$ -242695 -326288 -494495 -472214 -551141 -533607 -507734 -383730 -155092 -213551 -483534 -567807
5867e67807j98557K51797L19703m8876n6917K9683q5103K60328K89667l659n4431
$$ -567807 -766364 -514567 -194864 -243740 -300657 -270974 -356077 -95749 193918 190259 135828
5856A35828L1411o4032M9488o5517J51742K92k86461j12968k00321k08633O5317
$$ 135828 167239 103207 152695 87178 238920 239212 -47249 -160217 -360538 -569171 -503854
5845e03854J31504P4268l16683n8255K40144N9193K15743J72936K57893K02764
$$ -503854 -372350 -298082 -614765 -673020 -432876 -373683 -157940 14996 272889 475653
5835D75653j66351j50734J00713l24150m09629r2420J22485m4802K2965J6438
$$ 475653 309302 158568 259281 -64869 -474498 -566918 -444433 -489235 -466270 -449832
5825d49832K61178k98315j34826k20221O6868R3562K80212L38051J46261j27017
$$ -449832 -188654 -486969 -621795 -842016 -775148 -681586 -401374 -63323 82938 -44079
5815d4079p4277m9254j35228j54282p4304J25455J27189J22811k9141k19400M6780
$$ -44079 -118356 -167610 -302838 -457120 -531424 -405969 -278780 -155969 -185110 -404510 -357730
5804c57730o2961J73636K8351K11429K25677l4132k44568p3086j08932q1476l45930
$$ -357730 -420691 -247055 -218704 -7275 218402 184270 -60298 -133384 -242316 -323792 -669722
5793f69722l8720J28407Q9316J81273J82301L21159j70967j39641J81832m8658
$$ -669722 -708442 -580035 -490719 -309446 -127145 194014 23047 -116594 65238 16580
5783A6580k63100O453J49248J84313j76828p6544L185K00766J15006l02828k98839
$$ 16580 -246520 -240067 -90819 93494 -83334 -159878 -156693 44073 159079 -143749 -442588
5772d42588N9297K52626K25262K18362j30374p0511M3665r2765p7793j46842m214
$$ -442588 -383291 -130665 94597 312959 182585 112074 155739 62974 -14819 -161661 -165875
5761a65875L5343Q3139J46829j26727k3166J86321k7729m4795K0411k0657p3686
$$ -165875 -130532 -47393 99436 -27291 -50457 135864 108135 63340 83751 63094 -10592
5750a0592k37321J0537J64573r7301J24492j07472p761j25767O9912J38774p8944
$$ -10592 -247913 -237376 -72803 -170104 -45612 -153084 -160845 -286612 -216700 -77926 -156870
5739a56870l00470j78413N6938J50458J74559J29913j38668J33707K81986m7364
$$ -156870 -457340 -635753 -578815 -428357 -253798 -123885 -262553 -128846 153140 105776
5729A05776m6054k25272J11821n4102q3108j14812n6854o8549J22394K78864R8936
$$ 105776 59722 -165550 -53729 -107831 -190939 -305751 -362605 -431154 -308760 -29896 69040
5718F9040M567K56M5495n0303p1492r455q444j80626r3593L23995J38366k96199
$$ 69040 73607 73863 119358 69055 -2437 -11892 -20336 -200962 -294555 29440 167806 -128393
5706a28393o5499j3130o1458J35855o3014j30156J43420O0440k10153j66866J82426
$$ -128393 -193892 -207022 -268480 -132625 -195639 -325795 -182375 -121935 -332088 -498954 -316528
5695c16528J39878o6509J31123J8445j50889n8705j27728J62914K4017j23165
$$ -316528 -176650 -243159 -112036 -93591 -244480 -303185 -430913 -267999 -243982 -367147
5685c67147Q9365L49676P3932l03130j06477k20037O2401m7132J10838k78504
$$ -367147 -277782 71894 145826 -157304 -263781 -483818 -421417 -468549 -357711 -636215
5675f36215n3433M6348J23428K54695P2285m8457M131l3392o2829J24704O3945
$$ -636215 -689648 -643300 -519872 -265177 -192892 -241349 -237218 -270610 -333439 -208735 -144790
5664a44790L0964K39046k69297k91110K6834M99601j79538q9455m1015J26318
$$ -144790 -113826 125220 -144077 -435187 -408353 91248 -88290 -177745 -218760 -92442
5654i2442R1318j36083M9183o0448K4791J42265O7511k96487l56525l32770K91246
$$ -92442 -1124 -137207 -88024 -148472 -123681 18584 86095 -210392 -566917 -899687 -608441
5643f08441J95975P2203J59295M24977K23568j94069k99380j27705Q5924N3432
$$ -608441 -412466 -340263 -180968 244009 467577 273508 -25872 -153577 -67653 -14221
5633a4221q5346q8827M7962M4172l57165o1123K76688P3151Q0823q1310m8907
$$ -14221 -99567 -188394 -140432 -96260 -453425 -514548 -237860 -164709 -83886 -165196 -214103
5622b14103J99157k8411j89261j23174j85150O7528K45067l00395j83987K06282
$$ -214103 -14946 -43357 -232618 -355792 -540942 -473414 -228347 -528742 -712729 -506447
5612e06447K49213L34003J82955q9731k5059l31789l28343l3104J7379K98524
$$ -506447 -257234 76769 259724 169993 144934 -186855 -515198 -548302 -530923 -232399
5602b32399Q9265j29843k35482j67147P3214L32874L07139j57222l3117K97746
$$ -232399 -143134 -272977 -508459 -675606 -602392 -269518 37621 -119601 -152718 145028
5592A45028k84866O841O7936j67175Q2641K24783J80095q2971l3149j93898O8492
$$ 145028 -139838 -132997 -65061 -232236 -149595 75188 255283 172312 139163 -54735 13757
5581A3757K07979j02249j16730q0679Q2841O11865J87814j23557k68705k34152
$$ 13757 221736 119487 2757 -77922 4919 616784 804598 681041 412336 178184
5571A78184l63926j54688R501J64727K19143L55406J25085l10018j89417k32271
$$ 178184 -185742 -340430 -330929 -166202 52941 408347 533432 223414 33997 -198274
5561a98274k08386j3697p8548j32289J7896m2425J26889K34443J22339O6447K13624
$$ -198274 -406660 -420357 -498905 -631194 -613298 -655723 -528834 -294391 -172052 -105605 108019
5550A08019P5305R357j0579j08008J58852m6125m8081J70227J06891L440k43509
$$ 108019 183324 192681 182102 74094 232946 186821 138740 308967 415858 419298 175789
5539A75789l09407j94227J18190P0856k4361p9022J18591K2906l7096j77135R6018
$$ 175789 -133618 -327845 -209655 -138799 -163160 -242182 -123591 -100685 -137781 -314916 -218898
5528b18898l4087J26612J66487m2098J34282J74546J14054J12028k35391r3073
$$ -218898 -252985 -126373 40114 -1984 132298 306844 420898 532926 297535 204462
5518B04462j85189P4323j78506p7761j285O9415J01954K12236j36230P068J20896
$$ 204462 19273 93596 -84910 -162671 -163956 -94541 7413 219649 83419 90487 211383
5507B11383q1009K00553j83800q1903Q15P9061J00258r9699l31380k48469l6241
$$ 211383 130374 330927 147127 65224 66039 145100 245358 145659 -185721 -434190 -470431
5496d70431J45743J62843R1802k35363J68084l2659j95719p1579L057K31058k87956
$$ -470431 -324688 -161845 -70043 -305406 -137322 -169981 -365700 -437279 -434222 -203164 -491120
5485d91120r2863M68500q0565n84077K5162Q7658L79886K04786n7154j18992L1065
$$ -491120 -583983 -115483 -196048 -780125 -754963 -667305 -287419 -82633 -139787 -258779 -227714
$$ [...]
##END NTUPLES=NMR SPECTRUM
##END=
