##TITLE=317009
sew 02030
adrs
endeavour
##JCAMPDX= 6.0         $$ Bruker NMR JCAMP-DX V2.0
##DATA TYPE= NMR SPECTRUM
##DATA CLASS= NTUPLES
##ORIGIN= Bruker BioSpin GmbH
##OWNER= nmr
$$ XWIN-NMR		Version 3.5
$$ Wed Jul 12 08:54:25 2006 GMT Daylight Time (UT+1h)  MAYBRIDGE\nmr@NMR_250MHZ
##.OBSERVE FREQUENCY= 250.131544655141
##.OBSERVE NUCLEUS= ^1H
##.ACQUISITION MODE= SIMULTANEOUS (DQD)
##.ACQUISITION SCHEME= undefined
##.AVERAGES= 8
##.DIGITISER RES= 18
##SPECTROMETER/DATA SYSTEM= dpx250
##.PULSE SEQUENCE= zg30
##.SOLVENT NAME= CDCl3
##.SHIFT REFERENCE= (INTERNAL, CDCl3, 0, 16.522)
##AUDIT TRAIL= $$ (NUMBER, WHEN, WHO, WHERE, WHAT)
$$ ##TITLE= Audit trail, XWIN-NMR		Version 3.5
$$ ##JCAMPDX= 5.01
$$ ##ORIGIN= Bruker BioSpin GmbH
$$ ##OWNER= nmr
$$ C:/u/data/dgb/nmr/ADRS/15631/pdata/1/auditp.txt
$$ ##AUDIT TRAIL=  $$ (NUMBER, WHEN, WHO, WHERE, WHAT)
(   1,<2006-02-03 12:18:08.20 +000>,<MAYBRIDGE\nmr>,<NMR_250MHZ>,
      <created by zg, POWCHK disabled, PULCHK disabled
       terminated by command 'halt'
       configuration hash MD5:
       84 BC 41 DB A1 6E 1D 46 DA 25 12 A5 C1 ED C5 3A
       data hash MD5: 64K
       70 CF 7D 0D 5F 40 5B DF F9 5C 23 8B 40 49 B2 19>)
(   2,<2006-02-03 12:18:15.96 +000>,<MAYBRIDGE\nmr>,<NMR_250MHZ>,
      <Start of raw data processing
       ef LB = 0.3 FT_mod = 6 PKNL = 1 SI = 32K 
       data hash MD5: 32K
       AC 2E 60 25 18 E0 96 92 35 2A 21 38 2A E1 73 72>)
(   3,<2006-02-03 12:18:18.05 +000>,<MAYBRIDGE\nmr>,<NMR_250MHZ>,
      <apk 
       data hash MD5: 32K
       7E 5F CC C2 F9 3F 6D CD 1E 3C 4A C0 FB 5A 75 55>)
(   4,<2006-02-03 12:18:18.85 +000>,<MAYBRIDGE\nmr>,<NMR_250MHZ>,
      <abs ABSG = 5 
       data hash MD5: 32K
       ED DD 99 E0 92 F9 47 71 75 AC 97 8D 34 A4 D0 79>)
$$ ##END=
$$ 
$$ hash MD5
$$ 2D 0F 74 45 1F 98 01 70 5F E0 29 A8 66 05 45 9A
##$RELAX= 
##$RELAX= 
##$RELAX= 
##$RELAX= 
##$RELAX= 
##$RELAX= 
##$RELAX= 
$$ Bruker specific parameters
$$ --------------------------
##$DU= <C:\Restored>
##$EXPNO= 15631
##$NAME= <ADRS>
##$PROCNO= 1
##$TYPE= <nmr>
##$USER= <dgb>
##$AMP= (0..31)
100 100 100 100 100 100 100 100 100 100 100 100 100 100 100 100 100 100 
100 100 100 100 100 100 100 100 100 100 100 100 100 100 
##$AQSEQ= 0
##$AQ_mod= 3
##$AUNM= <au_zg>
##$AUTOPOS= <9 >
##$BF1= 250.13
##$BF2= 250.13
##$BF3= 250.13
##$BF4= 250.13
##$BF5= 500.13
##$BF6= 500.13
##$BF7= 500.13
##$BF8= 500.13
##$BYTORDA= 1
##$CFDGTYP= 0
##$CFRGTYP= 5
##$CHEMSTR= <none>
##$CNST= (0..31)
1 1 145 1 1 1 1 1 1 1 1 1 1 1 1 1 1 1 1 1 1 1 1 1 1 1 1 1 1 1 1 1 
##$CPDPRG= <>
##$CPDPRG1= <>
##$CPDPRG2= <>
##$CPDPRG3= <>
##$CPDPRG4= <mlev>
##$CPDPRG5= <mlev>
##$CPDPRG6= <mlev>
##$CPDPRG7= <mlev>
##$CPDPRG8= <mlev>
##$CPDPRGB= <>
##$CPDPRGT= <>
##$D= (0..31)
0 1 0 0 0 0 0 0 0 0.06 0 0 0 0 0 0 0.0002 0 0 0 0 0 0 0 0 0 0 0 0 0 0 
0 
##$DATE= 1138969086
##$DBL= (0..7)
120 120 120 120 120 120 120 120 
##$DBP= (0..7)
150 150 150 150 150 150 150 150 
##$DBP07= 0
##$DBPNAM0= <>
##$DBPNAM1= <>
##$DBPNAM2= <>
##$DBPNAM3= <>
$$ [...]
##$SUBNAM7= <"">
##$SUBNAM8= <"">
##$SUBNAM9= <"">
##$SW= 20.6930455092707
##$SWIBOX= (0..15)
0 0 3 0 0 0 0 0 0 0 0 0 0 0 0 0 
##$SW_h= 5175.983436853
##$TD= 65536
##$TD0= 1
##$TE= 293.16
##$TE2= 300
##$TE3= 300
##$TEG= 300
##$TL= (0..7)
0 120 120 120 120 120 120 120 
##$TP= (0..7)
150 150 150 150 150 150 150 150 
##$TP07= 0
##$TPNAME0= <>
##$TPNAME1= <>
##$TPNAME2= <>
##$TPNAME3= <>
##$TPNAME4= <>
##$TPNAME5= <>
##$TPNAME6= <>
##$TPNAME7= <>
##$TPOAL= (0..7)
0.5 0.5 0.5 0.5 0.5 0.5 0.5 0.5 
##$TPOFFS= (0..7)
0 0 0 0 0 0 0 0 
##$TUNHIN= 0
##$TUNHOUT= 0
##$TUNXOUT= 0
##$USERA1= <user>
##$USERA2= <user>
##$USERA3= <user>
##$USERA4= <user>
##$USERA5= <user>
##$V9= 5
##$VALIST= <valist>
##$VCLIST= <CCCCCCCCCCCCCCC>
##$VD= 0
##$VDLIST= <DDDDDDDDDDDDDDD>
##$VPLIST= <PPPPPPPPPPPPPPP>
##$VTLIST= <TTTTTTTTTTTTTTT>
##$WBST= 1024
##$WBSW= 4
##$XGAIN= (0..3)
0 0 0 0 
##$XL= 0
##$YL= 0
##$YMAX_a= 105922
##$YMIN_a= -123318
##$ZGOPTNS= <>
##$ZL1= 120
##$ZL2= 120
##$ZL3= 120
##$ZL4= 120
##$ABSF1= 16.522
##$ABSF2= -4.171173
##$ABSG= 5
##$ABSL= 3
##$ALPHA= 0
##$AQORDER= 0
##$ASSFAC= 0
##$ASSFACI= 0
##$ASSFACX= 0
##$ASSWID= 0
##$AUNMP= <proc_1d>
##$AZFE= 0.1
##$AZFW= 0.1
##$BCFW= 0
##$BC_mod= 0
##$BYTORDP= 0
##$COROFFS= 0
##$CY= 12.5
##$DATMOD= 1
##$DC= 0
##$DFILT= <>
##$DTYPP= 0
##$F1P= 14.0000005364418
##$F2P= -0.99999901652339
##$FCOR= 0.5
##$FTSIZE= 32768
##$FT_mod= 6
##$GAMMA= 0
##$GB= 0
##$INTBC= 1
##$INTSCL= 1
##$ISEN= 128
##$LB= 0.3
##$LEV0= 0
##$LPBIN= 0
##$MAXI= 10000
##$MC2= 0
##$MEAN= 0
##$ME_mod= 0
##$MI= 0
##$NCOEF= 0
##$NC_proc= -4
##$NLEV= 6
##$NOISF1= 0
##$NOISF2= 0
##$NSP= 0
##$NTH_PI= 0
##$NZP= 0
##$OFFSET= 16.522
##$PC= 1
##$PHC0= 105.8175
##$PHC1= 8.742098
##$PH_mod= 1
##$PKNL= yes
##$PPARMOD= 0
##$PSCAL= 4
##$PSIGN= 0
##$REVERSE= no
##$SF= 250.13
##$SI= 32768
##$SIGF1= 0
##$SIGF2= 0
##$SINO= 400
##$SIOLD= 32768
##$SREGLST= <1H.CDCl3>
##$SSB= 0
##$STSI= 32768
##$STSR= 0
##$SW_p= 5175.98343685301
##$SYMM= 0
##$S_DEV= 0
##$TDeff= 65536
##$TDoff= 0
##$TI= <Analysis number 999999
Compound Code 99
Book Reference 9
Project Code 9>
##$TILT= no
##$TM1= 0
##$TM2= 0
##$TOPLEV= 0
##$USERP1= <user>
##$USERP2= <user>
##$USERP3= <user>
##$USERP4= <user>
##$USERP5= <user>
##$WDW= 1
##$XDIM= 32768
##$YMAX_p= 316280278
##$YMIN_p= -322917
$$ End of Bruker specific parameters
$$ ---------------------------------
##NTUPLES= NMR SPECTRUM
##VAR_NAME=  FREQUENCY,     SPECTRUM/REAL,   SPECTRUM/IMAG
##SYMBOL=    X,             R,               I
##VAR_TYPE=  INDEPENDENT,   DEPENDENT,       DEPENDENT
##VAR_FORM=  AFFN,          ASDF,            ASDF
##VAR_DIM=   32768,         32768,           32768
##UNITS=     HZ,            ARBITRARY UNITS, ARBITRARY UNITS
##FACTOR=    0.157963299565203, 1,           1
##FIRST=     4132.6476996994, 0,             0
##LAST=      -1043.33573715361, 0,           0
##MIN=       -1043.33573715361, -322917,     0
##MAX=       4132.6476996994, 316280278,     0
$$ Real data points
##PAGE= N=1
##DATA TABLE= (X++(R..R)), XYDATA
$$ [...]
23809 64274 75191 -25297 -22218 23500 29828 99493 53717 5680 -57731 -96207 -212334 -89114
23797 -89114 -4452 1906 34423 62544 106458 78150 107947 47007 -57750 -163064 -137203
23786 -137203 -107627 -38930 -20701 -10090 26038 -51755 -137030 -182288 -220474 -164151 -130916
23775 -130916 -24670 35880 -1014 -28090 -45336 -121459 -110388 -128722 -127385 -38979 72737
23764 72737 109251 56676 25097 -8951 19771 16125 71098 85244 23062 4069 19581 -31435
23752 -31435 -48849 11426 -11112 -77233 -66799 -110199 -64459 -3891 7954 1439 63292 104426
23740 104426 48131 35237 27244 15607 99750 128323 135907 138564 91953 43532 6105 18226
23728 18226 -24226 -73465 -58998 -23940 -63461 -118647 -113029 -11903 23054 50616 36036 2933
23716 2933 -47709 -91958 -62432 11465 26169 -1409 34382 -44739 -135073 -85294 -45046 -12241
23704 -12241 -19386 -135483 -103880 -3902 59212 45980 -7192 -15850 -60343 -81343 -63373 13017
23692 13017 -2605 -63352 -99017 -40751 46376 182700 227301 224779 149003 40175 -102794
23681 -102794 -188049 -178099 -145358 -81290 -150 12611 36603 8520 64761 15587 -61263 -25454
23669 -25454 54151 71045 63871 69440 16661 13880 81625 146636 200139 133217 9225 -53361
23657 -53361 -5719 1695 -27509 -53122 -19060 -7824 -55690 -74299 -15421 -44311 -34397 20485
23645 20485 27423 1855 -34645 -57779 -140797 -88796 48537 33360 -13092 -54365 -34208 -47020
23633 -47020 -105227 -47209 -10021 23635 -24018 -10529 -26148 33979 38598 -27419 27116 68915
23621 68915 51658 -59087 -16911 5906 12122 -53036 -72989 68275 130245 -5098 6760
23610 6760 32221 53988 42927 -2840 -81078 -63672 -116856 -142488 -177209 -97143 71174 95358
23598 95358 5627 -30598 -2803 24792 53469 -17520 -54240 -22867 -77902 -52129 -20497 11391
23586 11391 -6164 7739 -46785 -42312 58736 13438 -60130 -28903 -52744 -21403 -2107 -21489
23574 -21489 39225 28116 -19107 -63038 -5911 78322 114461 -3621 -79090 24788 56900
23563 56900 31264 64470 25303 97306 87850 83384 84557 19140 38456 23437 -15476 3052
23551 3052 -75042 -20702 61825 132362 102077 21009 -65457 -123026 -157517 -110880 -5203 44314
23539 44314 15818 12504 24496 138459 71273 -16383 -83391 -186817 -166615 -130773 -7654
23528 -7654 44457 -44215 29414 38452 -100077 -93750 22307 42682 22884 42166 115785 64785
23516 64785 -15147 -49792 -39275 -73174 -103875 -87035 -89342 -127034 -132270 -74919 -24478 -20739
23504 -20739 -68877 -104823 -93127 -164973 -149405 -150100 -114755 -138134 -218655 -234853 -169458 -53227
23492 -53227 39161 2690 -26189 -27059 -45861 -132917 -136933 -111571 -36588 -29865 -108194 -42598
23480 -42598 -35868 -97055 -119221 -138835 -95839 -119047 -52168 40155 72682 -25630 -48160 -82937
23468 -82937 -55746 35860 92244 91567 133671 163165 52564 -42936 -141998 -166344 -129651 -180283
23456 -180283 -46469 56133 105441 32151 45154 81235 27511 -7262 36664 -10192 10549
23445 10549 8091 21289 -6234 -71019 -55300 -17908 -67555 -136987 -170942 -134577 -98689 4610
23433 4610 85737 34034 45027 78754 105521 20727 2501 74493 85069 -8800 -56864 -12948
23421 -12948 58116 83222 1836 -96408 -66773 -5478 -57011 -26948 -2515 56816 110711 120025
23409 120025 80227 123888 115922 42515 -5452 -60151 -104314 -72530 -54318 -93917 -112901 -150871
23397 -150871 -94602 18239 28 -79211 -69409 119 -65727 -60108 -7226 7707 -16984 -86598
23385 -86598 -61898 -25840 2429 20202 -16213 -19626 8618 84473 157098 157195 72681 12547
23373 12547 -2862 38131 21153 20019 7754 12006 502 66801 85452 58232 101289 43974
23361 43974 -58034 -27761 5213 -9558 5024 -63303 -88193 9080 69210 59428 19989 -31974
23349 -31974 -59225 -57238 -36182 -4387 -72384 -58006 23310 24404 25827 96639 42722 75727
23337 75727 28856 46141 90824 139678 125270 130285 118225 58300 -3553 45619 4279 -148093
23325 -148093 -209776 -216708 -171925 -170171 -166122 -80611 -22814 -74593 -15305 25184 34319 26327
23313 26327 44310 41419 46540 -100494 -256884 -289414 -201494 -168138 -179444 -103856 -2921
23302 -2921 32481 18965 47874 42781 -57269 15924 126589 78779 -29579 -18516 -5706
23291 -5706 33062 -41475 -86112 -76332 -44150 -58014 -51980 44592 63775 102332 75153 -39341
23279 -39341 -113681 -103813 -64104 -49969 -129740 -128883 -141078 -175574 -206157 -214091 -147312 -21934
23267 -21934 12036 385 -96546 -124358 -172702 -92697 54450 6403 -125 2481 -6820 88973
23255 88973 163055 223764 248876 304808 245904 168036 119311 143353 130781 47630 19766 -16349
23243 -16349 -59059 -33731 -54643 -71076 13057 96412 185235 169531 164675 37538 -28235 -88932
23231 -88932 -81404 -19440 -79429 -127674 -136451 -57056 86392 122333 67126 9166 24755 83117
23219 83117 56094 25675 47468 173211 198134 169034 110825 48843 58916 115226 77067
23208 77067 6845 48115 93748 13799 -1583 -73517 -91633 45666 48349 123335 125237 15795
23196 15795 -23850 -71647 -84784 -27843 32742 76072 51582 19964 -16634 43802 81172 5452
23184 5452 -44996 -37389 -50451 -110012 -129647 -117658 -99194 -36851 -13205 -33940 -24827 -44926
23172 -44926 -60795 -118409 -154383 -156510 -111598 -97640 -61493 -85510 -81453 55730 57590 -30899
23160 -30899 -112770 -118625 -92122 -99915 -148455 -127479 -104567 -56867 -47290 29943 130447 141810
23148 141810 22479 -121879 -108021 -62994 -70368 -117322 -53345 2081 -9201 -34869 28881
23137 28881 39746 19881 -26614 -17937 7332 -45544 -58130 113 28367 22728 9486 68057
23125 68057 45452 64031 21857 2857 -62463 -53875 -31343 -67504 8683 96935 263 49576
23113 49576 102684 98674 35073 -102895 -96855 -50104 -63009 -74589 -50281 -112936 -106702 -1242
23101 -1242 30081 39832 34129 -2279 8510 -18838 -39926 -17041 68231 48841 21429 -28651
23089 -28651 -131436 -103637 57736 57556 -3308 -5622 -34129 27316 11265 21603 43400 24585
23077 24585 -43372 -55243 -139415 -163720 -139359 -203230 -129151 -96221 -68591 48349 116070
23066 116070 47021 -77649 -128631 -104479 -113046 -81703 -50319 -97809 -149754 -107805 -29092
23055 -29092 11682 10456 60573 76186 -5015 -133625 -54697 31038 67418 100776 15912 -8319
23043 -8319 -31074 -88821 -161248 -167462 -88154 101289 149861 109055 2659 27231 32617 39815
23031 39815 -17747 -19492 -21683 13036 75919 73515 71773 64519 63269 43441 106981 218258 241642
23018 241642 244366 276109 244074 154423 48680 75418 86007 -25677 -83914 -17377 -66149
23007 -66149 -83317 -58878 -74140 -39155 -76380 -9474 49955 47312 46042 7625 4655 17400
22995 17400 55940 73735 110417 100917 38756 -16688 736 17218 -16616 -8286 -5405 -45746
22983 -45746 -70796 -102589 -165430 -149955 -146678 -185896 -98138 -3374 17275 63612 87954 50489
22971 50489 85758 33483 -37411 -46388 -125074 -75200 -46145 -22421 50822 135638 149669 145213
22959 145213 88547 85440 71086 29158 -29488 -9490 18017 6845 17610 89281 174918 168650
22947 168650 123320 63767 63667 141456 67281 70116 132722 121925 103538 87871 122927 83211
22935 83211 40014 11159 7094 41024 21377 -65720 -68527 -8616 3652 -15912 -42346 -112953
22923 -112953 -36203 31828 5761 -3117 -52692 -31876 58058 100537 116495 142214 117382 69910
22911 69910 -12210 -42455 -10974 -43776 14180 24949 59109 94630 118789 40918 50068 47112
22899 47112 86834 75174 139493 136268 87476 71595 9609 -74414 -71968 -7003 3541 14613
22887 14613 11949 96969 52997 32498 -8610 41164 70354 69316 113199 106413 90866 46108
22875 46108 17543 79803 129956 185366 104432 42265 9898 8890 28250 20447 -7789 -75206
22863 -75206 -67525 36771 -12454 -32932 -52398 -147196 -213125 -227230 -122673 -28740 -21859 -98756
22851 -98756 -125843 -61601 1030 20571 -6470 -4274 1980 139754 116510 56256 -5477 -47808
22839 -47808 -21216 -65803 -72278 -47886 -20608 -5984 8400 -22128 -6195 -62757 -72071 -52406
22827 -52406 -10403 13535 -22332 -52786 -83442 -71036 -68824 -32659 -9508 58638 37712 -39220
22815 -39220 -70532 -39753 -17068 -150659 -151013 -44517 48692 -2475 -55577 -67847 -58853 -95222
22803 -95222 -103215 -69190 -44221 -135854 -185481 -174313 -111769 -31140 -85560 -79778 -158958 -270916
22791 -270916 -190721 -76653 -48502 -105986 -174775 -175666 -114971 25038 65320 60303 24963 90348
22779 90348 67838 -8433 -10632 35412 55314 57751 76247 45086 62103 -39639 -172708 -192962
22767 -192962 -81501 -43171 973 44410 26012 -26666 -52278 7530 -28226 -48553 -26652
22756 -26652 -33469 -27708 37858 5922 -21566 -104425 -155486 -81851 -166865 -123871 -70216 -61443
22744 -61443 -11433 44478 60575 56422 17889 -80149 -136464 -120030 -117758 -107245 -93348 -9145
22732 -9145 -32774 -95244 -89147 -70522 -72448 -64261 -4051 -32788 -43555 -63780 48634 202969
22720 202969 231565 102923 46230 -34982 -5143 -4956 -42023 -27756 113229 166794 119741
22709 119741 86765 63745 38294 99883 37538 -17230 -9353 -87121 -88051 -45214 -29350 -28320
22697 -28320 58637 89927 117978 91165 102665 99275 80392 -964 -41115 16458 38665 71468
22685 71468 28630 50803 79487 73433 77516 10630 11093 26632 -12947 -23511 -1445 36662
22673 36662 -24211 -117754 -114815 -36172 6662 -27732 -118750 -133539 -63235 54488 98683 57636
22661 57636 77986 58228 27107 -34317 -77789 -14536 91899 118998 89499 56915 46157
22650 46157 -9678 -82512 -103951 37606 145712 38130 -17279 71520 10188 -33461 -17130
22639 -17130 -49466 -89973 -5780 63209 131682 160662 124443 83997 44707 5180 -19035 20856
22627 20856 75818 94628 163605 112326 31653 10029 -23107 -93059 -82657 3017 55341 22723
22615 22723 67042 21416 -52694 -69163 -29796 -4466 -31576 -36530 -25185 -37030 -36798 -12199
22603 -12199 -5139 -38974 7205 9453 -66845 -109621 -116057 -72714 -50010 -65874 -83384 -100661
22591 -100661 -43684 2504 18379 -18569 -48679 -23051 2719 -14493 -2124 22675 88189
22580 88189 76693 2578 -657 45550 32870 -85579 -134016 -78311 -48610 766 89157 61443
22568 61443 11030 -113531 -97255 -75052 -74113 -5795 -26935 -46389 -13935 4266 -30684 -85105
22556 -85105 -98009 -106537 -111397 -151379 -64923 -3980 37592 71040 59607 14906 -26364 -96509
22544 -96509 -79693 -60309 -169616 -125902 -1737 106205 118152 3227 -35696 -103238 -72917
22533 -72917 -58825 -63480 -751 -14431 -53706 36147 62655 4986 -52335 -63773 -14081 54309
22521 54309 182952 195634 161681 140262 60245 -53178 -5910 -53412 -43908 -54718 -24593
22510 -24593 2369 46966 44681 21567 23501 -8493 -28702 -28583 -42987 8133 17219 -96864
22498 -96864 -150650 -68324 -26342 11311 14784 21739 -73716 -156072 -132714 -92695 -80607 -95379
22486 -95379 -152897 -74241 22117 46538 5739 23934 -96119 -150948 -19660 35685 51996
22475 51996 138238 145391 204624 197914 135785 105005 57656 78139 81087 49457 -750 -17920
22463 -17920 -16405 -36132 -10227 17795 -17345 -49736 33103 140866 46618 -25693 -87315 -91319
22451 -91319 -62707 -5820 -3783 -4953 -55900 -113620 -151115 -107277 -16382 46171 38914 21247
22439 21247 33490 -24307 -74210 -25192 15860 68383 42046 -86472 -135394 -109598 -77982
22428 -77982 -17934 -40944 -2514 37415 178699 180396 104196 21647 -14700 -1180 -53771 -56321
22416 -56321 -463 37601 -6826 -82187 -103313 -51092 26741 79546 39300 10889 -1333 -55011
22404 -55011 -55124 -12670 36220 2307 -14541 -27000 20988 -29659 17177 41165 75168 127334
22392 127334 82792 41949 6416 -44406 58964 74413 112036 157997 112698 61463 -2078
22381 -2078 16132 48744 35244 54224 46654 16244 -97193 -156758 -103212 -2831 53833 10168
22369 10168 -19041 -28698 -47391 -17274 10461 -22629 -6106 17091 -10241 -35753 -46790 -76389
22357 -76389 -41471 -27431 -35048 -61821 -13330 71737 127173 81067 94353 45001 56935 53825
22345 53825 -43690 -151098 -92673 -15229 -3926 82689 134118 69960 75501 98245 99119 61339
22333 61339 67699 107271 157765 83203 37653 -14424 27027 97658 77590 62751 7650 57168
22321 57168 3707 -122707 -168500 -128622 -132323 -52785 16904 87292 38424 -30749 -77130 -159419
22309 -159419 -168245 -53102 39910 68588 69105 71792 76044 25513 -42553 -101446 -97179 -77736
22297 -77736 -19329 -18352 -62347 -117396 -179735 -185411 -143376 -120849 -17467 60555 32038 11835
22285 11835 -18802 -43131 -460 -6232 39034 -12215 15241 15564 -29218 49526 58724 -9257
22273 -9257 -50068 -61880 -43741 -156900 -224157 -106555 -25775 1468 62794 51980 -11541
22262 -11541 -51896 -66352 -9949 77713 36526 -69226 -78348 2120 29294 18944 -79157 -96850
22250 -96850 -61653 -77449 -58180 -18088 14856 110427 119645 15671 -83310 -31087 -43658 15295
22238 15295 38143 9637 23023 -39458 -63640 1015 108512 65261 15540 -31229 -90154
22227 -90154 -91242 -6 -6528 -12728 -33764 31666 34087 -26300 28161 12896 -47471 -35253
22215 -35253 -13326 45093 54100 -29629 -62582 -94285 -32719 35453 -22573 -42580 -5995 -29139
22203 -29139 -67749 -70259 3507 -33933 -62113 48057 89601 66543 15743 -53575 -17302 -71652
22191 -71652 -132475 -154031 -146447 -69485 96667 89598 116372 41977 -19906 -18565 -12570 13869
22179 13869 46155 117841 108235 98143 71215 -23513 -95471 -2348 -35255 -91594 -122662 -171773
22167 -171773 -166089 -158037 -94992 -2120 -56851 -166430 -161878 -116839 -40390 -1002 36942 46782
22155 46782 64262 54584 -5884 -109545 -82212 27208 19303 13524 -20933 -36783 -58050 -113795
22143 -113795 -168845 -106616 44943 109206 122769 71103 7546 -36925 -28025 -21806 -21158 -53474
22131 -53474 -77233 8222 79635 -12252 -12681 -376 -18500 -4936 -36415 -68391 -70930 -63893
22119 -63893 7960 66090 -17412 -32338 -60444 29703 126937 88961 96028 174729 242198 178605
22107 178605 77348 -14348 22512 9319 -21399 75234 70186 -25619 -44662 -27013 -42908
22096 -42908 -6581 35400 12002 18042 -9397 -76559 -56380 -99131 -60307 506 9389 57578
22084 57578 104402 119101 95351 107679 54057 -952 -10319 -3010 -58787 -58900 63022 151326
22072 151326 166309 177786 112898 62999 68160 125285 175553 125696 99707 22794 -85802
22061 -85802 -96263 -74646 -59314 -22418 107563 66479 8622 44324 91100 -2012 -7623 56692
22049 56692 78219 54559 63498 -52757 -134668 -44380 -1672 -42145 -54196 -6640 -1017 -30005
22037 -30005 -59172 -145011 -158918 -118003 -8404 -101885 -159848 -168402 -59779 -35966 -61913
22026 -61913 -78627 -35021 -71761 -45221 -25515 -74944 -105968 -64017 -80202 -119481 -29252 36287
22014 36287 -6300 -24710 -11447 -11053 47339 126660 137872 31135 -44962 -54463 -5367 -28383
22002 -28383 -17542 -31418 -54323 -35348 -33720 -15266 -31312 -40559 -60873 -40025 -60723 -23721
21990 -23721 -45137 -66037 -69459 27656 47188 22272 -62774 -41048 8467 -7535 37653 63712
21978 63712 14742 -19011 -32251 -30745 -91337 -74108 -21039 6984 -33201 -74764 -59466 7323
21966 7323 19838 89552 76723 81420 128793 139954 69353 18113 58967 134568 91590 33527
21954 33527 1880 -15856 -86094 -59473 -11369 -41963 -56248 -28987 21615 -24550 -86136 -203699
21942 -203699 -274603 -157695 -28021 -55882 -46607 -60451 -45139 -65173 -108775 -77484 -37984
21931 -37984 -62430 -35122 25777 -1141 7868 -17048 -105732 -123185 -90502 -11654 55655 28303
21919 28303 41633 45602 11941 74403 111011 77280 587 -71790 -15140 -2648 -84971 -118957
21907 -118957 -84702 -124581 -89645 -117475 -121951 -66388 -31320 -164 -48116 -80646 -54150 -54232
21895 -54232 -19944 -92902 -100893 -96818 -123807 -143545 -62136 53306 44909 -17664 -6186 -80030
21883 -80030 -225829 -171034 -81675 -11857 -64382 -68805 -11268 -64713 -64188 -79657 -125955 -169807
21871 -169807 -119403 -118854 -85541 -40991 100202 78848 7209 -52730 21608 97975 121501 63134
21859 63134 43746 15518 -16398 42406 31164 -57545 -58960 -48585 17484 10557 -77893 -68228
21847 -68228 -57298 37151 44832 27879 34920 40661 98097 149694 -7552 -66028 -30797 575
21835 575 47056 524 -86603 -39877 -5735 -4442 -97710 -91395 -78107 15287 -41592 -12274
21823 -12274 -48458 -84636 -62027 -19478 -41194 -84472 -70807 -47928 -139 -42436 -71766 7703
21811 7703 58039 -8749 -56395 -1647 -77461 -126313 -113141 -81434 -37798 106776 109268 165215
21799 165215 87107 -30460 -45385 -44082 -31345 -17776 7548 4731 -40849 -82252 -68600 -4131
21787 -4131 23613 82848 82211 76671 38952 79864 3532 -151456 -122054 -3490 117547 99642
21775 99642 25772 93174 156968 216735 188887 63817 64273 92766 125039 116388 -22586 3260
21763 3260 -50281 -54519 -57990 -10819 34050 21550 -17869 16858 142934 176623 94947 -1117
21751 -1117 -3911 12433 -16407 -107731 -163277 -114402 -16546 111367 123997 -3459 -73926 -85595
21739 -85595 -110580 -115766 -12150 -13196 -85320 -88884 -6234 -22965 -38837 -14672 -96635 -73020
21727 -73020 -47975 -41144 -81015 -60026 -40693 -438 5069 46897 80480 49103 92079 130657
21715 130657 83131 -23876 -73805 -28038 20314 68974 15291 -51136 -127868 -81858 39500
21704 39500 109116 116762 93131 23359 20087 -9387 24718 25304 -73076 -110762 -162847 -137573
21692 -137573 -43689 -30291 -95201 -57207 -38298 10048 -25131 -56023 -102837 -150971 -142835 -53796
21680 -53796 -3421 59311 136030 57436 53157 -15271 -16367 11444 -26194 -1714 -33216 -4306
21668 -4306 13936 38108 74594 33608 46230 19115 35969 68798 33140 2661 38872 25468
21656 25468 24640 -1221 -31972 -41275 11563 1339 -61050 -107334 -59736 82454 94785 86112
21644 86112 5949 -77580 -110918 -103440 -82849 -90310 -90282 -10513 -8996 -23653 282 49697 72184
21631 72184 156039 130007 147214 117777 49705 -937 -86581 -100851 -78360 -62774 -84663 -157271
21619 -157271 -122293 -58958 -2064 -93475 -138619 -158786 -76561 -28402 -80826 -103825 -141344
21608 -141344 -55353 -26743 33768 14256 -638 734 19703 18962 30400 14942 30421 156870
21596 156870 215706 107649 37517 15517 64858 -4600 -28934 60697 82433 49491 -23230
21585 -23230 -103345 -43927 61036 84743 60624 -55894 -60574 81124 22554 33072 37846
21574 37846 24814 81649 116190 -3463 -51670 -11572 -29221 57878 26837 -41733 -120622
21563 -120622 -115079 -55162 35852 -33401 -95101 -87402 -48349 -925 80653 159512 139794 78776
21551 78776 41552 67252 67687 30999 -132744 -206511 -136751 -122368 -123356 -72754 14307 -6843
21539 -6843 -15639 -26370 -10161 82152 67634 19928 6693 47684 -28341 -107014 -100473 -3408
21527 -3408 -9048 1604 86503 172814 222771 147109 48315 30380 -2690 -16413 -12636 1965
21515 1965 55652 42197 77762 -31851 -78282 -40588 -108209 -133780 -71615 -59528 -115539 -142167
21503 -142167 -122668 -78491 -13348 -90934 -90661 -137006 -60117 -32293 52849 167781 209175 121741
21491 121741 34347 -2207 -11689 -9619 -18776 -4879 25899 47577 80950 116610 126242 34232
21479 34232 61719 16280 -30460 -68253 -84036 -74125 -35773 -22657 -84796 -38298 21879 12134
21467 12134 -75420 -71801 -51735 18133 -48415 -163856 -89146 -119719 -135563 -112206 -133318 -121342
21455 -121342 -64115 -87363 -67165 -98756 -117818 -20920 -1707 15998 8148 -42766 -15687 -31489
21443 -31489 -43151 -105085 -86590 -63856 6608 122573 178480 140440 75320 40503 45594 44167
21431 44167 56266 85796 100067 51467 99897 -15834 -107695 -38254 -13320 -3792 -49069 -55631
21419 -55631 15342 30371 33148 66130 120906 87800 12450 -112646 -98576 -61193 9882 39312
21407 39312 29545 18109 7074 -18829 39680 92348 83265 18677 -9269 -28675 -57737 -108055
21395 -108055 -92779 -65375 -53051 -41410 -49233 7189 118380 88521 -8348 -677 57287 65366
21383 65366 -9797 -67734 -16142 -20921 27 53907 45063 -13135 -52207 -9080 93678 97002
21371 97002 110443 73156 18260 -81922 -127657 -81041 -67911 -117861 -176435 -152838 -124698
21360 -124698 -95300 -172304 -77133 9058 -77831 -114353 -66053 -43231 -7355 57596 65539 49968
21348 49968 -10458 -75195 -116365 -113697 -52947 -92827 -14868 52652 27008 49955 50987 55673
21336 55673 19596 8814 -18665 3467 -30916 -124705 -100209 -87636 -111533 -99809 -16913 59202
21324 59202 -53180 -9735 48224 97417 39762 39120 142597 156699 135871 85367 11418 -74268
21312 -74268 -83285 -106370 -110404 -112463 -137464 -148053 -93575 -101752 -100602 -140514 -148929 -36375 -32347
21299 -32347 -82126 -146152 -98787 -100047 -138805 -68875 26543 106944 65423 9241 92893 99801
21287 99801 22928 -39155 -128944 -118772 -95763 -34978 -38642 28045 106090 75888 97601 72319
21275 72319 23431 -6060 -42460 -76611 -26792 -41877 -99018 -107795 -115176 -124483 -122062 -99108
21263 -99108 -48482 33247 89380 54918 -21754 1284 -44294 -150612 -192693 -40214 58555
21252 58555 69050 28542 -6342 -49743 -41346 -142257 -196232 -118019 -107984 -93872 9903
21241 9903 43405 4817 -131306 -156062 -108267 -107804 -110433 -137327 -185128 -92391 -115278 -109539
21229 -109539 -74969 -121376 -65522 17169 -34299 -49418 -24175 -56891 -63734 -70553 -15474 32858
21217 32858 -27632 -7034 -8579 -18056 -126766 -173078 -121921 -38149 -3567 11962 27422 -28158
21205 -28158 -58182 -8769 65049 84240 67087 -35395 -66777 28072 -41787 -134694 -197410
21194 -197410 -113955 -44782 -13210 -24290 63863 85138 83009 6733 -19066 -115016 -76311 -1858
21182 -1858 -46752 -176756 -232938 -210150 -136358 -66367 -36252 -43531 -78606 -47799 -25947 68066
21170 68066 78426 145154 118872 78554 -24843 -31148 -28073 -29459 10104 22331 31562 5064
21158 5064 -10722 -60491 -51142 -65761 -58952 -7928 -107125 -169488 -137303 -114650 -109559 -89353
21146 -89353 -41470 -42053 26591 32173 18598 -21466 -132470 -200849 -232857 -179847 -113301 -118543
21134 -118543 -123504 -71550 -69921 -47789 -30789 -47569 -53255 34116 114065 96482 94626 -15045
21122 -15045 -42212 -128029 -201249 -198772 -87275 -73820 -75091 -38032 41536 20138 44848 114041
21110 114041 5378 -11227 8046 -23545 -10888 54783 91518 94112 73186 60439 53175 53039
21098 53039 27656 68095 37420 -8902 8507 60428 51576 18947 12677 8135 32385 26709
21086 26709 16386 103195 108288 65372 -6210 -22523 17665 -23157 -85652 -36860 -36074 -59128
21074 -59128 -1251 -21375 -3727 -40478 -49220 -89366 -53229 18498 73762 80974 132644 123847
21062 123847 46461 33827 46097 11960 -47117 -26598 46137 76704 61080 63397 35362 11925
21050 11925 -218 18174 16175 61762 12962 6845 -55515 -154435 -181020 -79066 -79670 -102087
21038 -102087 -101604 -102593 -15233 28134 -58918 -174305 -165288 -158035 -44570 92934 41297 33636
21026 33636 -17323 79323 169381 289313 250513 103524 9504 -4751 -19408 -71404 -16914
21015 -16914 161 -15877 49149 103208 140677 153655 199407 172781 85688 96820 114021 37152
21003 37152 -18543 -9350 43310 64633 7767 24739 36145 -4817 -24718 -4415 40644 16728
20991 16728 -84553 -66121 -27973 -66611 -86098 -60322 -41629 -66927 -53165 -18489 8203
20980 8203 -69690 -65763 11427 14979 27879 -62907 -158052 -151433 -59016 1349 50514 114707
20968 114707 79915 2158 -16499 27543 4083 39840 18163 -35533 -38699 -48895 -43897 -9396
20956 -9396 302 3568 57480 117388 119923 2118 27769 66181 97290 95438 137640 91924
20944 91924 9027 7914 33875 23906 -2939 -61494 -44896 -74153 -87961 -119880 -104649 8715
20932 8715 54653 -5431 64046 117186 95396 79039 6785 3243 23514 -55809 -49812 24406
20920 24406 35054 45528 16807 74391 66949 56193 113107 133485 98614 64174 38181 -25869
20908 -25869 -137058 -130138 -126057 -73576 -83313 -117118 -70053 45 17972 45107 106582 110960
20896 110960 68615 10629 -45014 -53589 73562 33531 -22871 -83430 -44535 -130908 -176117
20885 -176117 -171184 -46376 16678 -31833 -105130 -79085 -41041 -91156 -121243 -56168 6718
20874 6718 -3121 50943 135375 185946 131390 96881 85170 -20748 -68073 -90136 -52849 -10543
20862 -10543 43250 86957 46527 9967 -63595 -99683 34010 43270 54878 -1232 -20098 -96614
20850 -96614 -126946 -135317 -78679 -32904 -35923 -56060 25086 42861 -65841 -108197 -84941 -51248
20838 -51248 -100479 -144761 -160697 -98267 -43260 53555 123267 41565 12086 -83938 -79693 -85448
20826 -85448 -29016 -46436 10389 43638 90474 4723 -50252 -49787 -61325 -112667 -139638 -128106
20814 -128106 -89512 -81711 -81107 -58921 -13922 -77981 -61397 4399 53361 28455 20813 54985
20802 54985 70888 27207 -19149 -125043 -153965 -116945 -62490 -75772 -46780 30074 1298
20791 1298 40750 83554 35557 66964 145424 181143 152035 120275 126616 70522 35583 11205
20779 11205 -38349 -668 -4145 -88924 -93247 24927 -558 -109664 -59540 -59176 -84748 5570
20767 5570 3344 -96108 -20130 24785 21551 65418 70330 153441 140400 41872 6675 -12419
20755 -12419 -69533 -77708 -103971 -28391 65360 11373 -22583 39788 112040 87770 73616 25218
20743 25218 -8773 -43678 -23787 -76532 -108293 -102753 -82617 -40004 -111428 -166594 -190327 -239014
20731 -239014 -162442 -91126 -80753 -37240 6032 -12512 -15471 8679 67395 53916 89703 19539
20719 19539 -5546 -46209 -68622 -31671 -44958 -75850 -4111 39362 46927 -14927 -66893 -71362
20707 -71362 -32562 34235 58651 42030 57632 75234 120454 69531 75637 45732 -27679 10935
20695 10935 14781 7478 -56899 -118420 -69105 11366 98917 113684 146042 111056 33416 10246
20683 10246 -6317 21185 -10587 -53239 -106941 -84306 -108724 -137900 -125502 -4258 116664
20672 116664 113426 33982 -108736 -247546 -322917 -179186 -116523 -62834 11299 38219 -28620
20661 -28620 7774 42691 167078 151021 58173 -36452 -76065 -73288 6917 11703 -35924 -95430
20649 -95430 -154998 -50255 -46879 15473 48456 -20613 18650 120623 75354 85610 47695
20638 47695 -45684 -183998 -179089 -82123 -28159 -9558 7028 36392 -19053 -40997 -85399 -45806
20626 -45806 -3259 -57932 -15988 107337 208235 169944 144796 173416 99820 87116 37427
20615 37427 35771 -24852 -143348 -167046 -96436 -26710 -55045 -54645 -53615 -35957 -68485 -74292
20603 -74292 -34803 37489 116584 79866 -39858 -213337 -231787 -63207 -29153 -14580 34108
20592 34108 44191 -56150 -79470 -4888 38448 58695 18541 31829 26823 -38729 -5979 132904
20580 132904 119412 -58 -78908 36801 72407 98273 118309 56656 45360 -8797 -123432
20569 -123432 -50272 45211 8124 -91992 -34022 -56370 -79100 -74324 -75959 12625 -105 -156413
20557 -156413 -266579 -164121 -84079 -7563 -24411 -152144 -152794 -16241 52580 48580 5113
20546 5113 -38104 -27771 -23600 -24868 -19583 -146617 -187841 -70936 9400 27553 93748 126217
20534 126217 118323 80018 -3782 -21596 -9752 -37541 51913 106944 43172 46416 105821 61206
20522 61206 68960 134637 135608 59975 67825 157748 256371 209048 117325 61796 49920 59179 108073
20509 108073 153280 120550 56537 -11800 -47359 -11145 11462 -20949 46461 82804 90508 91184
20497 91184 50719 -16177 -71580 -134502 -195594 -131135 -75213 -46716 -9545 2736 -72737 -39253
20485 -39253 -49150 -102155 -72622 -33103 -69602 -45472 -72296 -77105 119 7472 106487 97367
20473 97367 104024 141636 41363 -19823 -7513 43242 1351 -33429 -28404 -49965 25234 13387
20461 13387 35211 67845 58093 -53774 -98263 -16138 11712 110088 96889 74845 23273 35859
20449 35859 -29993 -97825 18504 64287 51545 43679 58609 22612 -24949 -35107 52524 76273
20437 76273 61989 55766 12550 -32367 4043 -3817 -20015 9726 56951 77860 53491 73753
20425 73753 11608 -17603 -23126 -107440 -81690 -1166 24607 49642 42908 54686 39909 -37320
20413 -37320 -98506 -201001 -118519 37339 76177 35665 14086 -6812 25868 40173 59452
20402 59452 35575 61028 66130 -40152 -83198 -8261 -8058 55601 104506 54169 -71196 -71858
20390 -71858 -30422 -5520 82738 129366 38769 28780 47153 13039 44678 61628 6830 -52877
20378 -52877 -10548 -13315 -2134 38295 130107 169804 156209 141267 95955 -15530 -132422
20367 -132422 -131374 -130500 -120452 -49764 32219 64509 39386 67750 45473 2130 -24356 -55128
20355 -55128 -29174 -29285 -22401 -38444 -117191 -85576 -102261 -27229 -18842 -57339 7351 34053
20343 34053 117053 151847 65552 30097 31821 12090 -64988 55041 133792 -28317 -146976
20332 -146976 -145358 -84294 35980 22678 -17651 -8072 31496 119848 86141 45395 -20488 -92017
20320 -92017 -70481 -18844 13345 52850 78014 68981 83843 100236 196377 194954 124183 104635
20308 104635 49100 -18287 -25649 -39867 -91740 -135722 -87875 36740 60712 84351 26795
20297 26795 -57433 -26669 -2061 311 -39035 -93854 -94298 10443 44547 14148 51473 48682
20285 48682 -61354 -70579 -52922 -30859 -24684 2698 4617 -55000 -80843 -21051 -33089 -23380
20273 -23380 -32225 -120471 -130181 -133045 -33329 -42933 -96705 -177102 -199127 -177859 -21244 31543
20261 31543 -37697 -90298 -57296 -36966 653 89924 142 -62876 -38596 22207 41733 107342
20249 107342 81300 110068 126370 89023 91425 63604 78721 29979 -15829 -67556 -58710 -52434
20237 -52434 -55163 -36100 18487 28908 47931 -13296 -44539 -88091 -86908 -82050 -58800 40730
20225 40730 103140 122384 158968 109024 98671 112244 41924 9162 -11950 -64142 -50896 -38574
20213 -38574 -86555 -166117 -135901 -52864 -33389 -70985 -60080 -26215 -4639 -97210 -111574 -32799
20201 -32799 11611 13515 -12819 -19888 19912 104403 63702 76065 168716 55892 -67129 -103314
20189 -103314 -125926 -78306 -6750 136548 157818 137018 67234 -88456 -215348 -176870 -127357
20178 -127357 -47871 8644 -40908 -28348 -30145 -53277 -87176 -30218 19847 83342 56540 -9352
20166 -9352 -101579 -89684 -37180 -10472 37347 70314 76263 -23761 -50071 -36873 -52867 -51323
20154 -51323 -55105 -79995 -54760 -35591 -53166 -72062 5943 -36092 -38120 29683 11012 -36239
20142 -36239 -61273 -86312 -46407 28511 32327 -25490 -95016 -164338 -154216 -83755 19287 12083
20130 12083 -56614 -109666 -22481 11436 9136 7288 -101196 -128050 12777 99062 67574 3631
20118 3631 51632 79738 27579 -21898 -92414 -123676 -63197 27405 36371 33946 -35488 7966
20106 7966 -30600 -96734 -128871 -133777 -224092 -144238 -15957 9858 40243 33221 -38592 -16610
20094 -16610 12338 -61774 -43667 1705 57784 99312 128534 147913 187496 101345 -21160
20083 -21160 -29947 -35968 33185 78442 82857 118061 217317 251078 267347 345980 328855 320829
20071 320829 376988 316133 101071 58759 164985 257109 248060 200257 183480 144302 156421
20060 156421 81667 -39325 -91616 24725 113504 93544 46002 36210 83088 117798 124215
20049 124215 157864 176783 163899 93541 71416 48152 22857 -8736 -86748 -25813 21973
20038 21973 3095 118715 134329 71355 150643 183106 168077 140073 159779 244462 220813
20027 220813 196384 256062 291722 288309 276103 343294 309057 221095 188549 201360 245225 202427
20015 202427 248258 209107 141860 154304 221450 105337 36439 -15024 -30021 -65248 -10833
20004 -10833 4032 51274 105687 85446 19764 -75028 -47878 -713 -9131 -82403 -62143 -100038
19992 -100038 -104926 -131418 -138773 -42488 -12933 -48288 -79652 -70386 -40228 -16043 -39722 -18749
19980 -18749 -34580 -41882 -27437 -19722 47408 80018 141903 97782 -11252 -62773 -13235 2036
19968 2036 59052 85223 65286 17142 54541 29497 2790 10532 -17117 -27047 14398 52657
19956 52657 85596 98903 7685 -42671 -17239 88873 75345 25250 57978 123428 81157
19945 81157 62590 -17768 -81184 -23474 34678 25902 55988 57387 -11656 -11753 -46955 -73567 -62691
19932 -62691 -12351 -57969 -76150 72020 131673 174630 105703 -18620 4953 -34595 3654
19921 3654 -42890 -94407 -38087 32522 -35725 -103969 -107400 -111637 -47399 47961 65653 104791
19909 104791 30993 -77730 -78737 7142 46451 -40416 -113382 -99474 -93850 -24367 55217 84172
19897 84172 89924 82258 48822 91844 147442 148090 22086 -20480 26705 142976 101935 39203
19885 39203 21983 -16791 6859 -48511 -128476 -158309 -115378 -103402 -122326 -118605 -101891 -47551
19873 -47551 -34340 11550 53315 43256 -29601 -30124 34918 54438 128774 159790 166680 116196
19861 116196 37793 60313 58070 -11506 -69649 22106 39188 79013 74349 13060 38717 20793
19849 20793 -70226 -139323 -137788 -9618 160365 179180 78091 -21219 -63458 -87010 -99896
19838 -99896 -63256 -77775 -73766 -9777 -66943 -175462 -120735 -122231 -135377 -129135 -160646 -186984
19826 -186984 -114769 -51654 -39664 -11533 61864 66123 57905 87770 28263 -33959 -24133 -34227
19814 -34227 -1428 -8300 -114224 -49595 -43954 -70282 -21616 3039 37196 -75553 -148616 -37442
19802 -37442 -8572 -15184 -40777 56634 -53035 -141278 -122577 -38442 85804 151148 109012
19791 109012 44228 50993 8753 23963 29991 -13423 -17548 97998 133059 115566 46724 25454
19779 25454 -21571 -73800 25437 73156 -7414 -12776 45177 9667 10000 53453 69781 101171
19767 101171 68122 8770 -12251 -1348 4504 -96897 -31152 98776 115811 69590 82595
19756 82595 99925 159536 113047 20813 38492 120143 99624 93498 117126 160525 136934 109735
19744 109735 121586 80839 80873 114234 101097 72504 101589 144746 50983 -14133 41324 -40972
19732 -40972 -22633 107174 189785 181746 67813 44913 124386 155002 84116 61340 109610
19721 109610 127575 98032 11418 23559 35259 28226 26428 66552 119017 100766 94557 60478
19709 60478 -9569 -80825 -80311 -57757 -84867 -37205 -56000 -56922 -118002 -119617 -137303 -104014 -77927
19696 -77927 -42657 70770 31691 -6403 8800 56760 33443 83625 90183 55395 -6873 45438
19684 45438 77082 30762 -17456 -94635 -49516 3979 -4921 25276 36617 -66997 -117503 -39476
19672 -39476 102201 39794 -26093 -12951 45693 88998 73162 31733 122177 187975 84749
19661 84749 72886 82649 100643 116649 162936 172732 191632 205665 158018 190504 216370 205314
19649 205314 160417 34244 -21920 97426 202888 204543 145860 45701 51593 70612 68245
19638 68245 112541 110056 187341 342388 347085 247309 194108 132642 127584 210233 297425 293912
19626 293912 216983 170500 195541 149194 138165 120779 114591 192404 218576 190302 276187 291420
19614 291420 240140 280293 235955 265748 275135 259631 248288 199675 164596 228144 303691 342691
19602 342691 330979 446442 530938 491682 525805 641803 652251 590668 588794 670254 740595
19591 740595 771259 870226 1084191 1179340 1172956 1247612 1410401 1784503 2245356 2936146 4004238
19580 4004238 5248938 5741363 5404082 4567134 4002055 3831368 3917480 4193558 4844097
19571 4844097 5951377 7581904 10200429 14647100 22729682 34238225 42177450 42024754
19563 42024754 36447084 32035605 30775229 32337087 36109885 41932004 50864297 56195018
19555 56195018 51783482 40535876 32179474 28322086 25259914 21944118 19818777 20620123
19547 20620123 24301598 27513799 26005024 20321880 14416171 10670121 8496462 7140369
19539 7140369 6234487 5637575 5232929 4980503 4917928 5066737 5452427 5977200 6654449 7949077
19529 7949077 10403014 13782182 16472540 16569972 14253422 11798936 10400145 10287126 11312506
19520 11312506 13630651 17760724 23249739 28750481 35599051 46655566 59886704 65802585
19512 65802585 60498831 49019534 38097430 29705524 24338385 22831919 25142833 32404087
19504 32404087 43883388 51857250 50834373 43054208 35175159 27702927 20443417 14446624
19496 14446624 10505903 8156393 6578631 5492015 4680236 4207801 3788397 3541894 3252919
19487 3252919 3029456 2756848 2419203 2217308 2052433 1977624 1826690 1771970 1791953 1693000
19477 1693000 1567631 1338348 1175604 1000996 903075 906854 882072 818780 706376 728419
19467 728419 727445 700607 763065 780081 780787 854683 944710 1065866 1057629 1003983 1075309 1088198
19455 1088198 1090814 1133320 1260751 1329004 1174649 1007170 909290 834257 813529 780561 758348
19444 758348 788326 871125 866101 751880 611123 457336 437440 422875 458592 456214 384033
19433 384033 349169 305359 203685 221241 287719 273639 223575 286649 344134 344152 309076 314668
19421 314668 327663 271462 275885 224125 274176 387586 413318 554888 658832 669672 670678
19410 670678 853388 1035341 1177286 1279946 1088200 906487 842797 722089 639169 657146
19400 657146 863079 1028036 997804 967409 802216 644632 471329 441927 433791 346916 168296
19389 168296 126959 246520 303541 225287 187833 218309 189742 260481 249764 214294 136380
19378 136380 138270 102102 86183 71921 37476 41506 233 -9522 115348 240444 232792 173353
19366 173353 182498 99832 63956 56750 69027 100289 103240 82755 101502 112797 84627 101215
19354 101215 133948 76880 98219 82851 88343 116695 178143 166530 93545 68815 105121 142345
19342 142345 179800 169259 133977 185989 87693 78199 79808 64941 -15852 -1842 111251 89810
19330 89810 115664 106071 121196 144903 181683 184950 71423 104103 150535 107597 46605 48651
19318 48651 99750 163484 135622 103840 23611 2815 14975 32498 31379 306 -21235 -82963
19306 -82963 -38426 1420 -62111 -4286 12971 -174 3408 -27514 -85147 -132669 -87236 150
19294 150 22689 13063 37293 52902 34017 30051 -801 47195 120230 88395 93606 116296 127353
19281 127353 134434 197659 206423 165145 99548 -38188 -50119 57967 135053 102311 27679
19270 27679 39067 18667 1413 -37471 6103 54574 -79996 -164388 -46314 82432 41150
19259 41150 38205 61419 72475 11824 69334 147407 71280 -3247 48103 90442 189762 255472
19247 255472 266351 249977 166850 121020 143093 44037 108295 153560 211542 198601 111522
19236 111522 33375 97293 193359 186174 95886 37799 76734 129989 129350 66840 18226 12921
19224 12921 -7202 -1946 101900 130255 133490 144021 107183 24221 -27406 12369 -74985 -72763
19212 -72763 35499 74752 11650 -101164 -60798 -151372 -193992 -76333 -11964 32712 78416
19201 78416 165259 150639 131911 191408 202663 172540 211414 257082 320533 391740 380421 258422
19189 258422 170829 114841 144442 117066 92440 65965 33470 80293 85797 172022 166030 206652
19177 206652 163673 216966 235524 193243 239647 173564 131106 124993 144750 143858 99588 80831
19165 80831 58390 -4073 32955 -28057 -12156 -2118 -86185 -15107 55218 38526 87737 195431
19153 195431 201087 132143 83200 49419 26788 54703 77635 129510 155083 146495 89430 28653
19141 28653 44282 -17610 -39861 -14310 -22218 11686 48220 88654 136260 215466 239002 332363
19129 332363 375410 299682 205890 131175 134147 156648 99022 77333 103522 98241 151541 212046
19117 212046 172688 72758 -57522 -18352 150567 106375 60158 125353 97336 -1494 -18212
19106 -18212 30430 57868 14389 -7728 -30302 -61891 -83777 -108710 -104384 -40511 -7742 23016
19094 23016 -36244 -31901 -50954 -4362 6599 -33504 -30764 -47956 80071 204281 257855 260172
19082 260172 172116 116448 83529 47349 104319 115496 124617 265672 318901 291810 249966
19071 249966 198891 122395 121975 266262 320772 307120 229998 201394 157297 100277 5610 -16178
19059 -16178 26007 76920 126821 213172 151989 74252 -39828 -31530 28836 46525 4288 64533
19047 64533 85080 48556 105325 178197 273106 361081 256249 246765 219078 172484 155727 200150
19035 200150 277127 333320 309808 292245 405862 545688 578163 496941 444565 483985 416578
19024 416578 369930 383873 417892 363963 333497 367811 304663 281160 330188 287784 176751
19013 176751 116622 96911 191728 307399 309565 236019 226333 152884 87475 64763 108727 133090
19001 133090 80415 116070 194132 207648 164096 256809 299489 283813 244270 255763 293451
18990 293451 378671 437371 495907 412561 397435 371642 217296 137323 248722 371828 386699
18979 386699 338251 344929 279258 248973 201790 302313 364026 248432 83381 36212 62321
18968 62321 130667 196530 333204 343051 278818 169683 102102 112244 74282 43795 90113
18957 90113 -18242 -43731 42196 42482 40764 10009 -15663 -38435 -48565 -6251 20514 -30841
18945 -30841 28011 84117 50779 58600 20394 44046 99237 137773 149804 164719 156067 64162
18933 64162 29802 106141 85696 81589 93166 126159 135825 60838 13607 28481 86081 166839
18921 166839 126802 138130 173812 87700 12912 12472 76103 -41336 -71307 -21687 -45663 -168202
18909 -168202 -199267 -156572 -82952 45280 59277 20566 -2654 -27759 -102346 -55087 -2158
18898 -2158 18979 75945 78241 -70945 -159177 -73906 19053 13607 -53915 -21905 20322 -4831
18886 -4831 15390 21084 -28067 -72382 -44632 28067 -27357 40563 66915 115290 94290 18293
18874 18293 -65279 -45489 35393 111682 140926 120477 123983 175993 125255 61405 -27560 14460
18862 14460 53499 100646 160605 85434 64355 82231 169376 166359 65414 59519 99898 86776
18850 86776 29258 -13732 -56814 -178482 -141676 -14671 8796 37576 41274 77233 63741
18839 63741 69191 111730 127689 138355 181681 119004 91744 130554 211696 259691 250167 139990
18827 139990 98279 80889 109542 93169 113894 61717 14272 -72847 -76644 22219 105128 120243
18815 120243 96096 -2586 -128410 -52977 75465 154404 127505 94033 54717 62692 160711
18804 160711 230618 77081 50193 68165 179899 208229 97358 27831 -15773 1296 38127
18793 38127 90284 89215 101772 192778 246750 265915 235805 163408 26270 26978 113548 118898
18781 118898 125475 160516 185312 216687 187311 210318 289526 207888 190244 342951 413053
18770 413053 507155 594974 673805 880742 948834 858500 711549 618621 570546 512047 371491
18759 371491 322562 358895 393073 429948 458281 658748 851216 1040042 1353398 1984804
18749 1984804 2968324 3887224 4077675 3498357 2730247 2415249 2663049 3331207 4572667
18740 4572667 6721776 8558941 8539301 6761597 4772915 3561847 3016527 2930701 3349828
18731 3349828 4320364 5366703 5419708 4397353 3140252 2332691 1760125 1410587 1290628
18722 1290628 1233457 1302902 1422081 1671093 1912523 2254045 2805702 3558024 4727068 5753577
18712 5753577 5712335 4626259 3464558 2755139 2382340 2196728 2093120 2126579 2225481 2415781
18702 2415781 2733740 3311617 4146528 5408682 7299722 9769159 12317700 15394973 20114619
18693 20114619 26180219 31051851 31746958 28769869 23962510 18751842 13759387 9892059
18685 9892059 7521986 6117244 5217214 4692432 4463457 4489782 4799496 5551799 7096095
18676 7096095 9341286 10718334 9971689 7593349 5703267 4652858 4039556 3611109 3362470
18667 3362470 3160995 2993497 3013235 3202849 3551261 4007613 4898230 6438893 8915205
18658 8915205 13096081 18483496 21192983 19406608 15140639 11921554 10674717 11162193
18650 11162193 13419122 18270396 26579649 35022903 36670703 30505907 21719798 15461527
18642 15461527 11819902 10181507 10040737 11312987 14280775 17807547 18635278 15912860
18634 15912860 11659339 8415402 6465693 5280236 4608884 4318966 4256159 4327755 4352753
18625 4352753 4456177 4620566 4949967 5596891 6727759 8414502 9826324 9884909 9089039
18616 9089039 8583193 8960872 10330264 12898964 17444364 24834709 33279699 38061498
18608 38061498 38361014 38744636 44228244 52425778 56010485 49689743 37777248 27092197
18600 27092197 20914859 18336635 18659399 21177366 23972592 23722735 19854924 14773361
18592 14773361 10956321 8615309 7136957 6132509 5317200 4789971 4444870 4314133 4246304
18583 4246304 4245571 4234781 4143344 4203788 4333307 4524771 4738533 5161425 5892537 7245306
18573 7245306 9489855 13107844 18834167 25064813 28282283 28617368 28170329 26779526
18565 26779526 23732593 20452929 19276293 21022547 26456934 36888460 50765415 60839336
18557 60839336 61029018 53618552 47184586 45946650 44471161 37758604 27736687 19836418
18549 19836418 15339126 13227650 12732994 13076518 13265839 13023637 12045313 10403650 8311756
18540 8311756 6488140 5274756 4551020 4128331 3843959 3593370 3411098 3301109 3342406
18531 3342406 3387892 3491826 3724105 4297456 5363279 6952863 8997655 9992678 9315784
18522 9315784 7636428 6325716 5744755 5896639 6804185 8700136 12427296 17469692 21202770
18513 21202770 22453407 20543386 16762616 12172854 8907637 7261552 6700469 6999595
18505 6999595 8444562 11214900 14203090 15350150 14008123 11112811 8251173 5990443
18497 5990443 4439977 3361375 2681535 2219676 1941611 1801973 1688432 1600880 1581090
18488 1581090 1613394 1615917 1426518 1080997 954672 896019 849821 801119 812554 813593 819522
18477 819522 828906 852716 717229 657895 630760 666782 707748 587846 461684 372667 383497
18466 383497 425071 548476 566163 556386 610094 690156 745288 795218 813619 769991 688302
18455 688302 658294 712597 840419 1111001 1279214 1296707 1240623 1158527 1061598 870339 683432
18444 683432 674411 572109 443658 378497 453867 454356 485011 412068 240349 216791 215416 187885
18432 187885 156372 87956 168809 258271 276262 347627 476008 484239 470599 524467 480166
18421 480166 407448 333130 322293 315333 281106 290107 350347 344282 304670 369340 320519 327539
18409 327539 296338 341049 389381 422435 582742 635417 590662 490777 477342 507947 544026
18398 544026 475939 425762 403771 396950 326618 254531 273056 226823 135884 128672 90091 43370
18386 43370 58820 197235 212680 234983 313896 314992 257237 246901 280762 207690 173705 157000
18374 157000 198201 187964 183975 178284 253886 326417 338839 257964 215341 132028 152595 264817
18362 264817 252656 207347 213030 99666 112149 79124 -21475 -95154 -84877 -94356 -91098 -61217
18350 -61217 9003 116135 182906 204748 186003 138563 98077 56588 11138 -52629 -87346
18339 -87346 -67782 -104631 765 164133 124218 -1447 -1333 103927 66429 -22803 1221
18328 1221 72594 41038 116497 103130 171815 165315 71238 -2264 -15624 -56183 -68163 -91271
18316 -91271 -133094 -60928 84372 72413 53542 66141 -9944 -101730 -43259 5586 -19249
18305 -19249 7173 49248 77378 133879 222067 130051 12497 -64394 -24734 24387 5486
18294 5486 -66956 11718 35435 63417 14788 -28810 -31912 -35330 -32984 40362 53422 11122
18282 11122 -59195 -68227 -7320 23162 45837 51035 -18440 -58097 -23382 26335 55614 25253
18270 25253 67533 71089 823 -6441 8250 -39405 -102425 -79582 3839 115244 148884 197033
18258 197033 154529 32415 17840 41773 50849 -4353 17208 64786 99662 107492 105357 70146
18246 70146 -12211 58496 110494 67262 39487 -3873 -50949 -37924 19591 55905 97733 117917
18234 117917 124097 8337 6251 96126 129936 151043 151389 141946 65044 64800 35874 61867 34439
18221 34439 74671 109624 113548 145468 211905 228771 313100 422534 338868 231267 195661
18210 195661 212085 267385 177445 20885 3190 72017 133441 186221 210576 57329 1895
18199 1895 80157 89114 92223 108479 96700 64842 34559 86859 81386 62454 67962 176922
18187 176922 169707 143553 116171 186369 180935 132414 162230 202249 227100 179248 79927 39468
18175 39468 120766 136852 145385 188101 204711 142710 213231 251370 317845 246156 217326 291097
18163 291097 244764 225750 254586 262427 184840 188163 227429 295727 258205 215751 228623 195171
18151 195171 145554 87782 153436 167911 188051 174274 130852 260965 369844 417010 453303
18140 453303 539614 528082 503794 541234 542922 499806 441273 470887 607261 676208 763784
18129 763784 883623 1079646 1184903 1349078 1492054 1750016 2018904 2246832 2564725 3045309
18119 3045309 3728740 4618471 5706603 7107117 9281620 13037667 19581422 31354101
18111 31354101 54362753 95640393 129509957 122835731 83512204 47865862 28970534
18104 28970534 18990251 13433771 10196184 8034089 6552511 5467530 4626974 3910519
18096 3910519 3413662 3052126 2706748 2475206 2265543 2067005 1954153 1817304 1612637
18087 1612637 1420047 1258187 1188585 1176817 1107891 1015819 1029535 966096 975890 957803 881216
18076 881216 776186 666246 600657 586146 570772 564132 548598 502353 465330 391643 289124
18065 289124 164518 103809 90663 100946 141089 148525 200168 143619 160129 189288 287769
18054 287769 368188 451102 487515 394624 290697 257223 303169 312961 356304 415491 421955 420950
18042 420950 404553 318516 217977 202498 263241 312384 297463 236525 106227 127010 185286
18031 185286 113541 96575 10323 45454 96012 -7874 -27806 50208 10500 69815 136497
18020 136497 140598 144760 181809 169101 2696 -93283 -16962 144932 223703 167857 208726
18009 208726 144685 113858 45234 120120 174391 212977 193489 159404 116667 64447 104075
17998 104075 156134 166047 246491 236776 221994 240336 204165 154840 149680 220151 248878 212879
17986 212879 157464 36144 7128 65066 75747 -33428 -7218 39064 -5289 6859 58193
17975 58193 60138 135235 195392 226889 110389 38888 11566 -45921 -20489 -14372 32515 25792
17963 25792 118339 81805 -147703 -220415 -125485 -6129 94965 39686 36807 55641 59026
17952 59026 17680 20762 74883 125234 64732 -24095 -16309 30359 56309 17451 -31413 -9394
17940 -9394 -83571 -91624 -17340 1183 36569 -20290 -45270 59444 130564 41861 1508 -15566
17928 -15566 9081 76336 62969 50716 81468 105876 -941 -14670 16620 102674 213959
17917 213959 235720 207596 85367 7668 35958 102845 87456 1691 -59104 -91695 -128460
17906 -128460 -92610 -58760 -43983 -16306 8181 58660 79292 -6405 39202 48730 38953 8631
17894 8631 -117116 -187200 -264064 -160330 -30973 29464 28151 6954 -44392 -25321 -21809 -21040
17882 -21040 -22681 -65424 25799 93682 64085 105543 31952 75470 82398 13733 44690 25589
17870 25589 87507 128312 167994 165163 161286 78401 38210 106684 90621 140155 235824 198918
17858 198918 216440 157192 9362 -20994 -10410 33737 67174 41638 28036 14171 33471
17847 33471 66401 62458 9714 -31536 -3748 8370 -49351 -108594 -93416 -64438 13852 22122
17835 22122 126711 175672 149820 104427 67969 -1012 -379 32973 6258 -4964 -5765 47771
17823 47771 93617 43460 -52087 -101808 -113914 -66605 47539 76099 40638 143841 93817
17812 93817 50114 -77758 -160501 -193122 -177043 -120760 -26752 22879 24890 -35033 -62410 14308
17800 14308 72165 33432 478 -29539 -130240 -162008 -65881 61135 59774 33376 16429
17789 16429 12877 -35880 -85600 -88114 -22126 -96650 -202674 -185840 -92348 -108032 -181645 -192956
17777 -192956 -100855 -76778 -134059 -114054 54120 121085 134311 54377 -43694 -66087 -99286
17766 -99286 -50250 -34055 -40673 -84612 -74730 -59205 4335 -44865 -121573 -139744 -96569 -11079
17754 -11079 65966 20722 -62548 -89686 -17217 6460 -45744 -51778 -7595 15019 46730 -23853
17742 -23853 -109865 -115325 -34221 48911 42801 -42888 -45171 52403 -47318 -3860 66934 75401
17730 75401 49672 27891 -14904 -13434 -6487 -113132 -76204 39630 83164 111069 45092 -22226
17718 -22226 -83345 -145593 -145108 -35376 -2669 -57162 -20766 95297 74983 49257 49905 73246
17706 73246 120389 144203 101920 58623 3639 -33072 16236 63023 36479 41347 30504 35788
17694 35788 -31771 -114994 -85235 -12727 100148 123770 -34161 -115890 -152883 -71513 -56476
17683 -56476 -13588 -11872 -75385 -107860 -54221 25331 39139 -2203 13526 -24041 -47641 -89443
17671 -89443 9982 32788 -12994 -13543 6177 23308 -61218 -52193 -2158 15956 -50165 -157599
17659 -157599 -119814 -69215 4722 -19490 72732 139580 62473 12557 -25279 5795 -4291
17648 -4291 -59605 -164275 -132940 -81698 -82811 -56714 -49088 -15794 -15076 -17247 -3189 -26005 -21171
17635 -21171 37588 61700 42290 -27475 -53451 14571 122133 214117 152060 68145 107755
17624 107755 140884 119112 22371 -4059 -60212 -15863 54081 42465 -103132 -129091 -31200
17613 -31200 15614 76476 92636 -10280 -154728 -102257 3832 -20908 -70150 -102761 -89100
17602 -89100 -95916 -67747 -9653 65617 73875 147911 107506 64556 77097 30219 -704 -25144
17590 -25144 -41378 -14135 46278 91012 76773 -11075 -5809 57297 51987 93403 107856 79279
17578 79279 -8192 -53500 -91633 -181526 -207832 -233581 -250806 -184379 -166368 -132773 -101127 -79022
17566 -79022 -104165 -113844 -105577 -117907 -106016 -87820 -64930 -90746 -80888 -75878 -69396 -64478 -4510
17553 -4510 -39989 -60188 45810 30103 -9380 -79642 -106547 -141342 -117039 -60078 -41659 -74317
17541 -74317 -43886 -82384 -102162 -93191 -154483 -216757 -136020 -97752 -150720 -79047 42963 40833
17529 40833 67182 135716 98285 75761 5602 -1477 29178 -13843 5708 -58036 -130017 -193957
17517 -193957 -209968 -180651 -145110 17293 53056 91213 -8455 -28352 37818 35775 59816
17506 59816 70235 -7669 -73805 -36321 -8514 15554 117266 95900 154523 180540 117073
17495 117073 55632 86610 102876 73446 76281 94745 101643 43038 50721 14169 -28457 12547
17483 12547 -7016 -107855 -105383 -1319 28689 -37333 -48789 -42137 -1398 65940 130169 25256
17471 25256 -83178 -88577 -18862 -133768 -134078 -278 89405 127924 133798 126858 27750 -15468
17459 -15468 22299 16127 -56302 -29671 68999 98715 -4892 -19588 55269 132480 106939 53000
17447 53000 74731 81643 85259 302150 597238 639149 519854 396464 257773 131811 23651
17436 23651 72852 90839 15580 -101311 -87427 15110 66284 101919 84978 79394 -41616
17425 -41616 -111262 -74435 -59198 -43372 39121 19751 -44406 -8806 -36571 -40658 -123755 -140164
17413 -140164 -110336 -110955 -78717 -93104 -151303 -62861 22669 48080 26826 5834 -15239 -36012
17401 -36012 33901 119050 141962 91094 75562 166459 196466 67402 -18071 38289 106870
17390 106870 13073 -25291 6558 -43851 -101045 -160315 -153774 -180625 -150103 -120194 -92586 -16695
17378 -16695 -6364 26927 49758 77315 36661 -29435 -88777 -82670 -83332 -57445 -52199 24480
17366 24480 59718 14144 3987 14380 33908 -9184 10891 78946 43746 23295 83874 49857
17354 49857 -8393 -83159 -40103 63667 26333 16650 12179 -31926 -162966 -85697 -39307 -87304
17342 -87304 -20884 145614 188616 119809 32143 -80112 -100900 7041 68707 54027 -15805
17331 -15805 -64267 -38482 36210 20149 -33599 -42511 -56898 -45759 -68005 -55537 -553 29825
17319 29825 -65406 387 6069 -43213 -87478 -92736 -39200 6340 17018 -65877 -100319 -39691
17307 -39691 -87683 -144505 -110309 -37376 41754 -14914 -60145 7231 -7788 -13434 99908 76569
17295 76569 38641 44369 32317 60439 36523 34940 -4603 10746 48028 96695 157792 136832
17283 136832 62466 37932 56600 91774 83735 58625 -20332 17142 90491 166837 229789 170112
17271 170112 141844 170992 112256 57943 53251 -2872 -34503 3678 7343 5231 122728 126411
17259 126411 94063 131838 90334 71734 -17854 -93190 5439 51649 32392 76041 107769
17248 107769 79084 121412 190662 154831 68543 82640 127573 176410 171611 27883 -17878
17237 -17878 5149 120131 182991 223302 124688 66741 19463 -55067 -26832 -55559 -69463
17226 -69463 -36896 18371 2602 12669 3141 114011 157290 41313 -25601 22700 -14153
17215 -14153 -99114 -136683 -182891 -118725 -47107 -43596 -85500 -34392 -15714 -71561 44156 40138
17203 40138 103716 108280 24326 -24134 -53640 -59545 -24655 10910 -6526 -1321 8904 45065
17191 45065 54583 32402 -65834 -117849 -105085 -154106 -112832 -36769 29378 62686 70493 66580
17179 66580 23152 14595 23870 59191 140919 81693 110787 159567 116707 102629 34974 -105543
17167 -105543 -153790 -107419 -94954 -44272 -35119 -19209 -49513 -119401 -201243 -243822 -300438 -228749
17155 -228749 -138917 -39722 24215 124140 177684 183462 204951 258115 219621 177829 116535 60025
17143 60025 3110 -32559 -6806 70798 123447 30809 -61861 49925 97548 68145 29327
17132 29327 40211 72087 108250 54837 -19718 19408 -21677 -46790 -68306 -103065 -73565 -58543
17120 -58543 -58521 -43528 8752 -680 33348 10567 17410 121419 123127 94639 120573 91167 89705
17107 89705 128329 59024 -44215 -117805 -132544 -136086 -79450 -20080 -94151 -98863 -9935 -35133
17095 -35133 -41426 -2889 68460 57598 77899 30187 2448 22250 -13111 -91179 -109219 -103798
17083 -103798 -34454 43590 47780 -74513 -60591 -62125 -70489 -164155 -146543 -38187 30959 107763
17071 107763 101387 153004 157389 136167 159955 133727 163730 174142 105612 96820 24923 -21405
17059 -21405 69701 127219 40596 20563 47013 -5184 29289 33737 31628 41211 -6757 63329
17047 63329 96422 13779 -21918 -48015 -40696 3365 49427 11668 -89633 -149985 -197214 -191239
17035 -191239 -115496 -66147 -95477 -63179 -45358 -83807 -91495 -112107 -155072 -117846 -25903 6426
17023 6426 -28043 -24120 -16603 10127 3397 -123487 -78941 16061 46581 -21311 -49151 -41382
17011 -41382 6780 13269 47901 84390 -9527 -37707 -40727 -47658 -30979 -32028 -41508 8886 84392
16998 84392 43829 -27380 42677 92921 33487 -22947 63641 79255 91411 99565 48644 125104
16986 125104 115660 107887 142530 124601 45782 53662 -90181 -97182 -72703 -82728 -49127 15937
16974 15937 61660 55760 111872 121974 155850 163194 96181 23965 -26023 -77101 -119559 -153567
16962 -153567 -108397 -153660 -194961 -146738 -82502 -93987 -55157 -27965 45512 100187 71572
16951 71572 9398 -8314 8481 9413 -15888 39967 57584 44566 84752 110063 82217 -32174
16939 -32174 -74218 -12326 -20458 -43061 -16795 -42687 -29954 -20572 -22050 86030 35976 7525
16927 7525 -16388 -95035 -102600 -21448 -33070 -69430 23186 108123 -11998 -103082 -110020 -47621
16915 -47621 -72049 2390 16719 73 6666 -21162 80010 50607 -23729 -35562 -125514 -252297
16903 -252297 -277623 -264051 -142051 -106527 -68294 -55030 -97902 -48999 -42659 -111389 -185927
16892 -185927 -234966 -227426 -187006 -152889 -168446 -165319 -144527 -124308 -68828 -42195 -36970 -15971
16880 -15971 23144 17122 -3013 -26093 -32889 897 60667 52717 -9919 -114098 -157784 -168835
16868 -168835 -97197 29734 19423 -1839 -6554 -52654 -100618 -87028 -12953 47773 20810
16857 20810 -27018 -60998 -153669 -187806 -152639 -51124 -1018 -121986 -113806 -73667 -22737
16846 -22737 59858 118822 178940 127921 146539 68643 22655 35968 -24374 -79690 -41878 76723
16834 76723 175819 113072 37871 -32391 -189564 -222230 -13105 13204 -14627 12078 2300
16823 2300 2947 -10036 3080 62004 123882 127714 102581 29798 -29450 -9720 45458 58231
16811 58231 70098 122799 59467 -23433 16327 85631 -17701 -71796 -84596 80111 49901
16800 49901 -6790 53272 76224 123125 57555 -46894 -30260 -81059 -81271 -80646 -56117 -51197
16788 -51197 13937 -4736 -70244 -102701 -120717 -160501 -156191 -163280 -150097 -98658 -29656 -88912
16776 -88912 -127398 -78016 -11815 87102 48271 -4073 37320 -20165 -92447 -91099 -44877 15012
16764 15012 -71859 -155920 -113854 -69717 -38781 -25308 -23861 -28056 37298 21330 33858 18118
16752 18118 24339 66041 122076 73775 69183 56756 50004 60163 39936 -67270 -13189 26729
16740 26729 10981 2895 -13370 28636 -54167 -83405 -20750 75837 43219 35245 31242 13080
16728 13080 34200 7517 14267 89634 143389 149558 204683 212115 161907 133923 61462 16427
16716 16427 1432 68103 75960 73846 60010 78523 96302 -2817 -62285 -8188 57141 54992
16704 54992 30482 -14912 -96463 -99898 -121688 -28819 43399 121483 137348 115235 96688 62983
16692 62983 -34025 -72088 -40726 43617 43197 53161 103498 109292 48351 3774 -30736 -64065
16680 -64065 -85918 23983 58863 9514 -30277 -88967 -92061 2022 105106 123011 49263
16669 49263 26233 -9684 -15915 -74148 -91569 -126336 -197852 -279494 -160799 -10378 8299
16658 8299 32792 62173 30922 -53540 -121498 -197256 -156603 -169364 -121293 -78944 -96725 -45635
16646 -45635 22668 14843 1228 36132 37465 56330 -56586 -161036 -187635 -157846 -136823 -88942
16634 -88942 -65217 -35394 -69953 -102543 -35257 34255 -66192 -107192 -104428 -94128 10494
16623 10494 6508 -14080 -127293 -167906 -99355 29806 122498 167313 54827 41937 130576
16612 130576 17516 -138341 -101748 -80080 -69822 -82851 -118313 -99017 -41373 -9864 70932
16601 70932 89606 121051 89459 12181 24916 -12407 -2451 -26329 -51244 -5760 -37122 6854
16589 6854 -4818 -46097 -43685 -64366 -38200 115070 132417 77410 61936 29005 -2484 -8029
16577 -8029 33366 -45261 -117844 -127520 -157518 -175454 -168426 -142248 -133728 -62198 30004 5736
16565 5736 10137 17597 24038 -15532 -92358 -46832 -22466 20308 21339 41480 -12279 -87757 -158304
16552 -158304 -145089 -100504 -127337 -219422 -205737 -144930 -20202 25184 -2867 18623 71905
16541 71905 65328 48291 2642 42228 52356 84334 174104 102820 21875 49949 -24829 21874
16529 21874 -4357 4165 -52865 -71620 -95496 -43475 -59931 -128377 -10269 38475 18988 5908
16517 5908 26185 45987 -25477 -86718 -90257 -115250 -89460 -114417 -93074 -97697 -105337 -5073
16505 -5073 16035 54540 86505 78744 -27860 -129031 -68231 20446 19464 -9354 -161 -8036
16493 -8036 -29437 -75359 -134832 -86402 25349 69198 124874 127633 140192 173666 221813 183844
16481 183844 203128 111211 80530 64554 72044 107205 116366 36282 -122143 -132172 -92218 -79704
16469 -79704 -68076 -58715 -122947 -144425 -170257 -101247 -55955 -20920 -18946 55195 35288 27595
16457 27595 19209 22642 108639 105234 -27892 -76549 -100328 -57102 -14564 26265 28492 -6674
16445 -6674 -66511 -54774 -69533 -13157 -105301 -139192 -63732 -58078 -19044 -110633 -187393 -157235
16433 -157235 -107114 -142293 -149539 -98565 -53563 -95364 -168939 -104831 -42084 -27430 41083 -10518
16421 -10518 -39674 -2354 -13374 -31964 -31997 92685 73688 -22826 -58020 3182 18008 8160
16409 8160 34763 24728 35548 33925 -45779 -32749 -5081 -51978 -91837 -260812 -206634 -213822
16397 -213822 -283781 -280034 -150998 -119359 -92654 -117241 -246742 -170946 -130134 -130984 -58988 -47485
16385 -47485 -40105 -25840 -32718 -43142 -60110 -85916 -41552 17005 106322 107853 39762 -77105
16373 -77105 -61351 -37890 1291 41276 -59 -46196 -98643 -169873 -101484 -62299 10100 36874
16361 36874 18188 -38135 -10731 57919 47162 29759 32660 8656 -70759 -86635 -60621 -4896
16349 -4896 1025 -18668 -7775 33196 14586 35838 14823 77684 -19513 -98875 -69748 -48479
16337 -48479 -146605 -215215 -137553 -47533 -23531 -7551 36623 28200 24097 -44596 -35140 -44785
16325 -44785 -116661 -162067 -114018 -8288 9895 -94776 -90590 -118344 -113869 -74896 -53608 -37486
16313 -37486 -3759 88459 182612 157740 160044 111195 81801 4921 -73707 -104354 -15086 20007
16301 20007 66542 81503 33703 8722 -5044 -39822 2655 10875 51619 33583 -73614 -126237
16289 -126237 -36712 -65246 -80660 25606 66578 6240 -24534 4901 24722 44673 58354
16278 58354 29800 27303 -3407 -6107 33817 2177 -25721 -17442 72107 48508 -1987 11130
16266 11130 42251 -11039 -64089 -45760 2860 4319 -51028 -43722 -50321 -102972 -74960 -135203
16254 -135203 -67379 -31975 15774 147283 146394 103752 930 33129 69669 50743 17562
16243 17562 -37363 -90829 -81606 -88756 -9268 95087 91148 -55619 6725 76194 89762 25519
16231 25519 38732 28499 -15614 -8770 -15950 64325 141761 114770 69252 140475 127901 148019
16219 148019 72260 -32907 -28534 15823 53492 10537 -58992 -91044 8434 9401 -31610 -60929
16207 -60929 -152101 -148630 -146408 -48602 -13645 -50129 33332 -24368 -68119 -58947 -25347 6422
16195 6422 1282 35766 48702 73443 50817 6114 41852 12523 -7042 -54760 -74062 -110696
16183 -110696 -80874 -56529 -64002 -35394 15550 67767 119709 84626 18078 11106 7576 -73717
16171 -73717 -134128 -146651 -183539 -196669 -154559 -138408 -114937 -52963 28010 108031 147511 84454
16159 84454 75043 65356 74562 21652 77332 97821 89330 115825 72958 10439 53917 29851
16147 29851 -71984 -101579 -2119 59207 87169 93001 74391 25463 17224 -105429 -107310 -54464
16135 -54464 -152557 -179727 -250847 -193728 -134936 -46587 -48350 -82880 -83904 -77245 -112097 -68980
16123 -68980 -38536 -27058 38011 62000 41713 45127 31820 -26636 -33181 23502 49498 26841
16111 26841 29836 -11687 -45891 -7148 20836 -58739 -83297 -12858 27862 10061 -12439 -31089
16099 -31089 -46396 -51125 -25573 -29628 -113652 -118325 -55055 -131608 -78175 -47151 -30377 -41181
16087 -41181 -86741 -21552 -24252 31600 88718 -139 -96084 -68125 22957 21914 24765 34245
16075 34245 78753 136483 158167 173484 141471 54412 8429 32311 29010 -2731 -30685 -109331
16063 -109331 -158370 -89715 -5178 31710 -23844 -38854 -76936 -186083 -194574 -124776 -65772
16052 -65772 -22065 20632 12904 10417 -16887 -68649 -23610 13297 51254 72413 30596 -11329
16040 -11329 -55312 -48510 73842 135653 188518 235555 165289 36036 -139710 -127966 -98114
16029 -98114 -90568 17241 30656 18892 -76466 -84740 27971 7394 -1747 46709 96330 110965
16017 110965 116860 157191 99546 88772 80201 63435 36929 59524 47372 -2378 -123197 -188564
16005 -188564 -92333 -102819 -149755 -76564 2150 -15192 7315 87837 186021 223582 195598
15994 195598 116441 155625 192607 127093 11611 -26378 -12605 -39437 -99181 -50551 -79652
15983 -79652 -110206 -59014 31180 95366 126287 142031 135934 120648 35844 30714 74473 157103
15971 157103 167506 112645 70637 17591 -14324 15475 15068 -50208 31687 32505 18041 76394
15959 76394 106790 35674 26087 77000 46986 4585 7758 -51820 -109638 -66405 -13826 -11531
15947 -11531 -5349 21449 23761 -12896 -62616 -16521 20036 -1586 -13280 -76494 -52387 -47369
15935 -47369 -104422 17637 63369 112584 169419 178641 72998 -4040 -5500 -76594 -101059 -80915
15923 -80915 -73457 20877 55089 63909 71359 79757 94255 125908 133711 140799 126896 102788 -7713
15910 -7713 -97543 -124486 -3583 -53850 -129991 -104976 -62525 -13355 -25196 177 17788 75003
15898 75003 150244 202625 236365 151263 87477 28716 -18236 37301 -24914 -29950 -46269 -71563
15886 -71563 -54454 14183 90505 89321 90855 30008 64319 146282 190422 129884 94553 147316
15874 147316 105332 80342 43417 -52549 -18711 55227 36879 26694 -63790 -118769 -73704
15863 -73704 -81313 -139981 -178286 -152402 -79677 440 138483 114499 28697 17042 2355 -73296
15851 -73296 -234186 -212213 -201437 -135134 -80942 -94039 -81406 -93711 -102944 -100629 -111541 -64181
15839 -64181 -82678 -73300 -57481 35125 77761 40906 23930 3693 -14814 -42261 -116362 -103960
15827 -103960 -8202 28637 -57129 -55895 -22602 -63636 -75960 -36603 60483 169497 118866
15816 118866 86969 39990 -31676 -73035 -112688 -65321 -72788 -64220 -17117 -20736 -69898 -10231
15804 -10231 27180 -58 835 -10304 -41203 8041 -372 -77353 -13600 67149 82862 9903
15792 9903 -82312 -104932 -47319 45805 109807 58358 16315 -3132 32024 34100 24725 50160
15780 50160 45513 80337 67922 77023 32917 6296 16224 -22320 -12050 -25788 80876 105807
15768 105807 52299 -13069 -61521 -30605 42768 105445 126993 73312 39682 1855 -33473
15757 -33473 12649 41321 -16477 -3302 58359 84322 56815 131804 162686 107629 4122
15746 4122 -60277 -66486 -85489 -27142 -29936 -53686 -127181 -190305 -217448 -138735 -15875 77006
15734 77006 109894 82863 66323 34196 10966 -12799 -53771 -43527 2115 -21041 -10081 11041
15722 11041 82672 180819 270233 183878 44533 30625 17542 45339 -104827 -255473 -195900
15711 -195900 -38111 35480 26149 57847 44739 -38524 -44406 -96213 -111087 -110596 -114293 -119828
15699 -119828 -103154 17103 48654 72391 191695 258756 204766 109423 107376 130263 124599
15688 124599 132172 62547 88748 71115 18923 -548 9921 50523 94177 27626 5635 -19458
15676 -19458 -69032 -88174 -112541 -52078 -61902 -114550 -153242 -98296 -9955 -58102 -34802 -92745
15664 -92745 -141767 -31060 21450 -6881 32787 90358 49151 25322 45726 -58528 -73629
15653 -73629 -18057 58981 113916 69218 35888 33159 -52434 10500 111007 180926 148444 31155
15641 31155 -56929 -76546 -142939 -166494 -95053 -70606 -141158 -203643 -165580 14912 47509
15630 47509 61579 136602 158471 121267 55312 77728 43182 -33071 67517 84165 89861 27684
15618 27684 -29393 6140 34308 47465 32433 117693 60000 53482 -19558 -50629 -26013 -133896
15606 -133896 -119870 -32101 -19902 -25859 39175 61219 114426 116174 130863 56827 61353 65248
15594 65248 19484 -60289 -116841 -116959 -131013 -207522 -269907 -249839 -140545 -43938 -59739 -10246
15582 -10246 92126 77192 -26744 -97164 -108700 -101420 -47868 36668 20064 8834 35462
15571 35462 19741 46247 -23113 -34253 -9731 -40786 -182435 -285956 -284340 -277824 -188138 -192020
15559 -192020 -109628 62126 161951 179327 169959 31407 -48350 -19248 17316 -45694 -111309
15548 -111309 -114524 -61853 34202 25384 -17370 6608 -15502 -19077 -5789 51152 2733 26840
15536 26840 117633 129175 107907 100132 59731 65632 10731 7650 19110 32548 28437 68895
15524 68895 41451 37564 94629 -15888 -103160 -145885 -171837 -185556 -66920 17116 33143
15513 33143 33153 -11822 -50657 -112207 -79301 49445 29953 16778 33496 92900 164171 93144
15501 93144 86297 146436 108772 78463 36899 71764 99866 52806 -12818 -118029 -20089 81134
15489 81134 -5554 -21348 -1474 -4609 -44774 -32946 -42124 18870 143552 176800 85642 -15532
15477 -15532 -24062 -66477 -8396 118 -86672 -73591 -28928 -72753 -47982 99 -13166 -4522
15465 -4522 61861 75191 -18425 30181 59412 67621 -6662 -92751 -75956 -27210 -58661 -80345
15453 -80345 31010 -20251 -34010 -15050 22748 -22781 -103875 -160139 -229760 -207294 -122395
15442 -122395 -136227 -67925 -77771 -60778 9096 24709 -26973 20082 8831 -106454 -67017
15431 -67017 92478 149407 177480 156616 127045 138521 120845 95823 96303 52153 -10136 16884
15419 16884 32250 -8399 -33646 -27770 -32271 -41210 -88610 -20494 42840 -6814 -47756 108519
15407 108519 134081 114671 84945 101412 71756 52785 -38059 -54276 -37461 -30896 -36736 -71500
15395 -71500 -95249 -97381 -84329 -49933 -76199 -38147 -74735 -45464 -31105 16461 -12171 -61490
15383 -61490 11608 75797 128569 87989 115647 104330 56273 100619 133470 231828 263985 343380
15371 343380 332950 284402 203990 129321 64593 1082 17567 76792 76910 92497 16016 -54706
15359 -54706 -133697 -128442 -21738 56574 112592 128519 -22789 -85675 -123409 -73053 72631
15348 72631 171384 155341 135451 100258 36474 61311 43473 10093 -46445 -54486 -20632 -23893
15336 -23893 -34488 -57930 -58711 -66677 -145337 -176724 -48982 -3607 -33261 -20781 -10703 106761
15324 106761 123418 123341 21066 -146278 -175861 -104739 7658 38788 -65957 -91352 -76297
15313 -76297 -18436 -36772 -55017 -87207 -20677 -1148 6515 21925 50791 81694 37068 48609
15301 48609 14632 3031 10001 -41478 -16125 50850 78466 141236 215122 167034 59018 -35116
15289 -35116 -12964 50117 127278 139463 130569 40101 -16588 -16368 -67300 -79368 26102 52638
15277 52638 954 64887 29220 -18932 -2629 5358 16586 -87527 -55296 -47447 -101374 -138713
15265 -138713 -90707 -81584 -135776 -123384 -34658 91833 75632 34026 9408 -38383 19042
15254 19042 40058 -19050 -87090 -71448 33286 51891 92853 96900 11176 37430 115407 42787
15242 42787 6992 -36821 4581 -32757 -114423 -66130 -96887 -112140 -91364 -58744 -65756 8430
15230 8430 69617 54056 41364 72236 44508 48331 159334 228913 145671 100987 27205 -6691
15218 -6691 -50692 -101905 -19317 28903 14055 77427 60724 42684 18112 -84035 -152060 -157574
15206 -157574 -82345 -74449 1251 12117 20634 -40980 -18595 -21873 -81518 -64932 -57090 -69407
15194 -69407 -94466 7118 54327 71912 11425 -18802 -15200 28949 19884 -108889 -134820 -84279
15182 -84279 -63584 -48788 -56742 -71623 -65859 -51417 -100470 -146193 -22840 127847 164636 5422
15170 5422 -66787 -74395 25115 101242 67592 35817 -903 -55891 -56483 -49770 16008 87895 62241
15157 62241 50587 112296 97231 54861 -11087 -96357 -156303 -64253 -70523 -51419 -54022 -108832
15145 -108832 -210508 -156646 -73878 -109194 -66414 -30679 -75209 -162001 -173765 -129198 -44605
15134 -44605 -4616 -18753 487 -27435 -47233 -54989 13872 33786 36644 -91863 -119195 -105405
15122 -105405 -106365 -109607 -118788 -145154 -135912 -79718 -26783 -11323 -98610 -94304 -40632 46764 106873
15109 106873 86049 -2053 -116483 -85361 -96391 -72413 -19904 -52472 -18400 -51496 -59206
15098 -59206 -13887 -6201 24555 143471 111584 84144 106719 129090 43483 6504 -15981 -91691
15086 -91691 -49790 -51341 -52547 74568 109454 65675 -12586 -49348 -78581 -64135 -43592 -26167
15074 -26167 -22057 18174 34499 36796 -47699 -55438 -11817 30487 15600 28162 53990 36302
15062 36302 19370 16310 26841 24866 20579 78267 96171 11934 -74807 -52849 23252 114572
15050 114572 164490 145458 183237 162893 153199 204684 206705 126513 46210 46957 -22288 -58449
15038 -58449 -73528 -131558 -60316 35532 100507 71748 -6348 -42372 -17081 26520 -13983 -65913
15026 -65913 -63193 -41066 -19768 18941 42081 -67073 -118562 -33902 12457 -82017 -59054 -24247
15014 -24247 -125816 -184736 -189338 -165040 -91532 -45970 -93491 -10234 43063 37619 116460 104418
15002 104418 159522 219226 150513 67978 70368 54369 122983 78613 21395 -14474 -46028 -85370
14990 -85370 -81387 23319 2706 -41027 -68539 -120397 -129815 -70339 -89040 -140343 -126759 -72713
14978 -72713 -75213 -90890 -1519 82299 115771 96215 49179 -31917 -99744 -38744 -61148 -49667
14966 -49667 6166 7714 -69832 -114362 -40093 -44108 -80322 -60237 -11033 -47318 4386 -46571
14954 -46571 5197 78421 27450 41574 45285 17238 13845 47680 94461 79579 79904 71366 109055
14941 109055 88313 74769 156363 89528 20114 -9521 -44105 -21920 -22311 -22076 -36905 39614
14929 39614 84040 43183 -81131 -91097 -103812 246 94051 69450 24985 42128 21623
14918 21623 -22571 -56240 -11095 7938 -65635 -55360 -49064 -33638 -70100 -29766 12233 49051
14906 49051 18898 -15417 -91494 -98935 -22829 45989 78365 73205 117525 135694 87883 36247
14894 36247 10258 -1799 -29619 -32866 -47452 10144 35127 -32174 -49481 -130182 -196825 -160671
14882 -160671 -155391 -85556 -44253 -11243 29748 -21212 1864 17545 16226 -52998 -63009 -31274
14870 -31274 5122 -59054 -134844 -123156 -6730 -65287 -167604 -108014 -79629 -76615 -71647 -67355
14858 -67355 -96954 -101751 -134315 -120587 -169436 -133367 -119240 -46646 5171 49208 97668 20401
14846 20401 -40428 -70564 -47990 -34054 25487 55547 -25323 -30350 -16301 58117 69538 42201
14834 42201 74919 67829 62034 77468 48392 -13158 3366 32092 3007 20304 70060 43076
14822 43076 29921 51380 -28620 -66240 10329 130360 142025 222352 200669 122000 11988
14811 11988 -41699 16128 148335 242589 283737 169747 61290 54722 27654 31832 113719
14800 113719 58640 -39943 59207 60517 75954 158015 123052 95626 61569 45696 95198 111897
14788 111897 39688 -42245 -40595 10211 23060 49621 67152 137383 63517 4217 7205 -8672
14776 -8672 -28487 -36832 -75875 -147430 -119201 -86086 -67767 -61548 -48351 -42528 -8940 -142548
14764 -142548 -161854 -133055 -111078 -103187 -119206 -67221 -41892 -59590 -92933 -77109 -63482 -97494
14752 -97494 -112575 -148155 -168698 -103173 -15035 -7311 8853 -60457 -36239 21966 93333 97399
14740 97399 88562 58466 1431 -14273 -8329 46685 121077 198796 143679 71343 -1968 -29097
14728 -29097 -88725 -121293 -113450 -74809 -1025 -83986 -93654 -64784 -99625 -58179 -94811 -179873
14716 -179873 -222513 -121996 -62924 -40896 -27744 -58069 -71452 -39146 3756 -115333 -138644
14705 -138644 -62592 19822 31001 80707 -33855 -99096 -44538 -8204 -24909 -42123 -33606
14694 -33606 -1196 27672 57754 -26205 -11913 -3145 -106269 -77467 -48816 -159303 -129355
14683 -129355 -60864 -6490 -134503 -184086 -69685 -29959 -85615 -41449 -9611 -14049 4313
14672 4313 -18846 -16479 -111010 -129180 -36542 -10605 28958 14881 9249 24448 -80386 -69648
14660 -69648 -40204 32330 -30888 -64333 -92526 -55959 -61416 -46917 -53720 -22791 4598 -32564
14648 -32564 -14315 -6083 -25490 -37141 -357 36666 -63760 10294 57506 83952 89297 71553
14636 71553 474 13137 15619 72630 193546 225401 137879 60803 107699 88886 86810 71203
14624 71203 66156 111174 141532 96264 -15276 -75791 -71181 -73690 -53971 -31669 -3154 24631
14612 24631 19568 -4129 7682 39170 -46105 -111777 -67817 15900 39703 103059 87405 11343
14600 11343 -5066 12868 12263 -1494 -1355 34204 69170 71698 77273 151160 182284 147094 177271
14587 177271 -32703 -73243 -22756 -27279 -70097 -10199 35598 -71337 -64745 -62267 -118721 -68216
14575 -68216 -64651 -78244 -37707 -74825 -876 102637 76186 87769 24807 -8200 25780 4110
14563 4110 -53837 -52332 -58107 -96797 -8952 52737 53114 104689 142724 162073 140021 171979 140802
14550 140802 176683 43969 -70987 -89070 -50368 21594 6828 14380 9678 58109 24060
14539 24060 12546 33039 40473 5353 23885 21107 -50325 -92746 23474 14664 -104052 -272893
14527 -272893 -235037 -130479 -74357 -93210 5697 10765 -43324 -13913 -32894 -20760 -110578
14516 -110578 -114367 -32142 -18750 14396 58911 85520 254930 479367 832356 1345502 1658598
14505 1658598 1469070 1004603 611978 322275 152527 90751 121847 176380 167272 131669
14495 131669 152559 56299 17228 58425 70217 128270 200642 205664 164124 126114 131022 161413
14483 161413 78933 28684 68591 78684 80960 91653 11595 -29971 -80136 -37862 4032 17385
14471 17385 25000 -32943 -117971 -71607 -54320 -74579 -21355 56893 92574 74377 133129 89743
14459 89743 43711 4661 4507 1684 18485 17505 78190 32492 -34 32744 31487 53027 47778
14446 47778 52326 90760 100964 71644 70591 25488 36447 123358 117130 5564 -33334 -47514
14434 -47514 8865 54225 -46247 -82818 14575 124969 48626 -90740 -62881 40346 16965
14423 16965 98337 114471 12800 -86618 -99398 -76921 -57286 -75597 -55107 43128 -4901
14412 -4901 86347 75359 -2302 -12379 -32904 -35174 -17406 -24824 -66089 -41144 5483 -62454
14400 -62454 -133561 -97997 -11217 40701 95165 59293 2063 8901 49699 66164 29729 -7651
14388 -7651 21609 117195 146845 136337 101478 55898 21393 72461 92913 6927 39253 -46878
14376 -46878 -129908 -181538 -192113 -182968 -166623 -68585 -10463 43650 132608 169956 27380 -19934
14364 -19934 13942 12175 -113724 -137017 -35057 -21838 -8428 -32640 33632 53825 -22327
14353 -22327 -78972 -100820 -107080 -45427 34048 74661 23179 -19498 -58136 -70734 -67292 -52776
14341 -52776 18554 34170 -9862 -56631 -101406 -71836 -13185 -551 42420 -41648 -115611 -73975
14329 -73975 -36489 -77479 -12944 48890 7630 -57612 -34586 4584 46534 4033 59791 29351
14317 29351 -47353 -144617 -210117 -161038 -151872 -27824 130224 180101 115775 75299 36148
14306 36148 60720 33243 54719 119824 115275 95063 36137 12968 11620 27132 155417 121798
14294 121798 25052 -21100 65744 78625 79700 58621 115866 152617 147107 158957 94038 83209
14282 83209 13652 -9398 58329 122420 144325 115744 67053 81389 11464 9201 97252 136580
14270 136580 162665 79331 122346 135862 177587 167893 126625 89163 171450 187183 147625 132773
14258 132773 63310 -28732 14163 101830 92832 46789 12691 -22020 -100846 -140757 -108217 -127447
14246 -127447 -60928 -32239 -1695 38089 84969 74608 35430 -48022 -109486 -37874 42350
14235 42350 51330 81000 127411 82948 9509 57638 100682 101555 81861 8924 8781 14563 -7889
14222 -7889 -89465 -200977 -131265 -102642 -94416 -167752 -162609 -101590 -61255 15089 -52820 -52106
14210 -52106 -2115 -13896 -17010 8918 -24403 -25452 -106343 -114005 -83751 -59469 -35283 -56239
14198 -56239 35159 42101 -33669 -103943 -117592 -54751 -27745 24788 60669 86173 82464 16003
14186 16003 -20721 -41342 -104437 -139410 -211320 -280234 -235388 -220607 -159365 -67799 32119 144529
14174 144529 216676 280168 273929 193116 210678 156670 144898 37941 31376 92961 121206 134433
14162 134433 59618 19185 62285 70405 131430 259746 264177 196601 283671 230009 198315 224377
14150 224377 331211 347871 172759 30109 296 26892 100263 132459 85468 72622 -28336
14139 -28336 -49641 15508 -72969 -107960 -5867 80377 35735 88343 77574 23245 -6498
14128 -6498 -35614 -31511 -118209 -132778 -110734 -98360 -76570 -30984 64185 167646 87456 46051
14116 46051 69182 138878 199668 102612 101155 85714 14410 87127 98243 120481 122499 148815
14104 148815 207123 153631 78307 28714 68754 128560 50054 -85025 -162212 -96881 52370
14093 52370 93284 105717 129785 127539 158182 131790 110856 55447 130778 142040 147582 169542
14081 169542 214396 256029 290793 359002 429019 518068 480833 412401 371407 369902 395488 359845
14069 359845 385536 431388 467235 457678 475621 453909 392059 412718 462890 584388 727468
14058 727468 808312 829495 890171 852262 896076 1017396 1179364 1209800 1248208 1360851 1472095
14047 1472095 1610939 1728209 1883043 2196087 2577257 3172427 3957110 5034054 5814137
14038 5814137 6193822 6384090 6825861 7876988 9625470 11847096 14636314 18375780 23468815
14029 23468815 31263050 44721044 68438262 112276001 192692652 289285047 316280278
14022 316280278 256141972 161245795 98238117 63547449 44533315 33401045 26110725
14015 26110725 20940063 17148682 14359968 12389358 10875121 9655479 8717677 8037136
14007 8037136 7783064 7580421 6957855 6043556 5191845 4647715 4262256 3934653 3618046
13998 3618046 3331350 3071134 2870511 2779041 2640648 2451270 2291128 2158884 2079417 1934191
13988 1934191 1751503 1547604 1512769 1511363 1436927 1309394 1191878 1047373 966263 955721
13978 955721 894327 882367 853968 802707 786785 729024 711807 628834 537426 520973 569958
13967 569958 600389 577520 496200 427698 452923 475872 496506 513090 466564 495436 486003 407466
13955 407466 327088 331544 341510 354115 340867 314512 260654 265190 307019 312799 246866 239743
13943 239743 209564 147596 163960 190679 242490 310294 358632 230137 270402 276605 259201
13932 259201 223681 260559 309625 326800 335919 315891 278856 202072 165957 104899 65632 99345
13920 99345 178198 210537 264290 246012 174390 164301 177049 181041 273158 288273 215211 168578
13908 168578 140473 183939 248584 240022 262830 287732 331672 237871 30086 -67026 -85703
13897 -85703 -8540 9137 -38993 -118387 -153620 -112667 -39828 -2465 -38489 29545 104695 141028
13885 141028 111229 90983 146827 91229 85853 99261 63042 -6130 -85629 -158218 -228828 -138359
13873 -138359 36175 84957 126656 195455 152829 120392 131866 143122 59363 -6005 48349
13862 48349 57632 -7673 -46660 -39600 -17494 -7751 53206 116518 100449 -41400 28857 107974
13850 107974 82335 93136 80884 42099 51950 79316 159147 206261 142364 85242 167286 178945
13838 178945 109294 75076 141644 205776 253974 309294 221259 167752 211223 244986 242961 185809
13826 185809 97894 42488 -66594 -38532 1169 -41871 -6945 27162 12790 64058 73073
13815 73073 81772 49006 58018 25689 4150 50163 159274 143471 111723 176683 194180 86907
13803 86907 34973 4672 45078 27263 -34435 -24873 9011 -25880 -16348 -16822 24817 58524
13791 58524 -2336 -42770 63885 101983 73817 60051 13088 50236 64510 69223 74103 159193
13779 159193 90310 -36764 -19766 -9634 -79141 -83622 -30975 -2040 62007 41540 174737
13768 174737 177689 178686 197093 147956 62492 73471 84936 25460 -103641 -19043 112400 107940
13756 107940 138517 80853 56229 104468 118087 122112 132876 143580 77221 -21978 77870 118807
13744 118807 108640 51204 -38599 -118548 -32839 65768 117185 27657 75 1824 71327 147565
13732 147565 112398 72512 1169 -27212 -27141 38691 21768 -23554 5981 -409 -8501 43087
13720 43087 22995 52469 73435 120338 183180 215171 143600 114783 131481 123654 150124 61633
13708 61633 43541 -43842 -124709 -81975 -91557 -36868 -50476 -55663 31391 14100 -35842 -19678
13696 -19678 38057 145502 184858 81750 -74284 -98413 -61734 -35871 13681 4736 18980
13685 18980 44084 54109 20605 -13400 89130 87891 39680 1415 -18797 -7828 22612 122408
13673 122408 72827 -5068 7559 72562 57245 8488 7609 -25464 -54550 -52712 -42352 279
13661 279 47323 51045 60899 -23107 -72537 -94310 -141803 -84516 -51684 51080 44191 17789
13649 17789 -26053 -55709 -29406 -19479 13163 -25843 -17775 84593 146649 107014 149095 49712
13637 49712 93320 145954 97002 70866 85461 74024 29302 28192 -34182 -77829 -20612 -51238
13625 -51238 -61939 4262 13800 -10752 -56353 -70321 13126 40221 -25878 -40177 3818 6812
13613 6812 -52618 -66407 -117009 -136109 -70618 -31759 -44813 -133052 -112029 -169308 -103434 -37737
13601 -37737 -15840 35868 64320 11663 28230 -759 -126353 -165504 -77252 65754 10232
13590 10232 -49508 -88012 -57575 -66188 -47284 -98088 -181397 -126691 -134166 -183056 -174698 -97899
13578 -97899 -69980 -96871 -64255 -47340 -9251 41379 -9665 -64731 -127188 -189805 -199996 -214604
13566 -214604 -163143 -132058 -67683 -31051 -33534 -67773 -95462 -165580 -242405 -214593 -110179
13555 -110179 -75258 -55134 -12778 21580 -3312 18512 26090 -31107 -10720 26509 -38050 -74549
13543 -74549 -57863 -20001 76675 174281 271014 293403 440045 845903 1331058 1652293 1617428
13532 1617428 1277194 856578 622668 502462 435131 320057 177976 44602 17344 36910
13522 36910 73264 24024 -38708 48251 83753 96327 38750 -11994 -42373 -15529 -43700 -44589
13510 -44589 8315 33760 -72406 -59842 109714 179241 201721 170847 60391 63688 61767
13499 61767 57301 23818 -22526 -76212 -101845 -25402 22948 7218 -76102 -155600 -132067 -18950
13487 -18950 18965 -21389 44093 -3251 19601 18466 18458 -26217 40056 57538 14861 -41402 53532
13474 53532 40084 -141286 -87700 59265 115982 54445 56300 17614 -120084 -140354 -91824
13463 -91824 -49773 -44924 16152 217660 228889 91299 167744 182970 60772 13221 -32024
13452 -32024 -37597 40728 85436 41590 52063 110063 7836 -22271 46460 110023 124553 86186
13440 86186 -25934 -10174 42604 87061 75508 94602 22748 67218 86588 132427 150928
13429 150928 124994 71090 92901 87559 28296 44299 32750 -1523 15821 82680 179648 132959
13417 132959 134663 129901 140501 78985 38209 8813 -36805 -20909 -65328 -17380 -18023 -30642
13405 -30642 18580 92995 106850 75949 17919 -8088 -17598 6877 53061 136157 126471 107789
13393 107789 84958 36972 56585 98017 114517 42572 -9476 -29629 -15371 -15290 51015 137885
13381 137885 127878 101484 76933 93362 71094 82660 78370 56130 96430 155865 172129 175812
13369 175812 111050 105983 77637 114175 102211 122397 105675 -23485 -78468 31660 65466
13358 65466 77869 20864 -2597 -41054 -9768 74389 146539 162738 78585 32126 -9113 -103336
13346 -103336 -82618 61741 79268 22541 -29052 -46538 30140 87683 200034 217144 96508
13335 96508 3206 57381 65341 33769 104289 37566 -52817 -69100 -62241 -45298 9075 4957
13323 4957 4772 112667 139496 117408 79347 4065 -18013 -10915 -138311 -75370 51147 65129
13311 65129 129320 150583 105120 134968 83283 -41292 -89128 -94380 -40993 16047 611 26013
13299 26013 2080 -45289 -55940 -36223 32544 36101 -37590 -112076 -41735 51118 43235 21129
13287 21129 43257 -14694 -56135 -82121 -38648 -343 33823 22153 70875 72409 27619 27775
13275 27775 26571 64304 97916 113017 40304 -33449 -8853 -4893 86427 32548 -44460 10537
13263 10537 8243 -134241 -212099 -175188 -67798 -33222 -61140 -113292 -35518 64141 129640
13252 129640 155628 138072 -1053 -41104 -13274 17793 -16929 -33220 -41225 -20397 -59109
13241 -59109 -75544 -22136 65860 25741 -12005 -10441 4425 -24576 -62502 31935 47063 -21469
13229 -21469 -94621 -39283 23519 32266 -1124 56125 14705 -35574 -38566 -60278 -23693 2980
13217 2980 20612 -8925 -61663 -9437 3053 80282 135858 39673 -9780 -97138 -70215 -69808
13205 -69808 -76732 -35725 -18832 46636 104296 85155 154382 133994 75769 10056 73167 34969
13193 34969 -14558 -18192 31328 52697 55330 100670 123519 43535 35221 23406 47722 77687
13181 77687 99305 69599 -20343 31275 -24962 -124149 -91508 13657 45562 7703 -4991
13170 -4991 -44480 -85389 -53066 37748 64022 127457 97228 49764 3337 -49982 -62922 -69211
13158 -69211 -82987 -106702 -32768 58061 56360 40303 149395 192148 193598 206312 171388 61496
13146 61496 -53114 -25932 -36714 -39703 14187 -30284 38965 131650 95394 109941 158125 110266
13134 110266 84553 38212 113020 137032 83440 79844 32221 9134 49608 28272 60732 60826
13122 60826 55179 -25501 -61466 -69576 34211 94467 94888 90796 94079 17904 -65842 -87191 -27214
13109 -27214 -2796 -2383 -16127 -30007 19046 27591 47325 119935 59459 40821 21856 20459
13097 20459 63087 -8544 -35043 -91049 22233 67372 59311 68852 90945 48186 26018 -26712
13085 -26712 -80133 -162076 -162278 -208309 -264057 -230374 -207781 -178080 -186229 -141129 -123720 -128843
13073 -128843 -70435 -127625 -92131 -16029 38129 50276 -12900 -30232 -71320 -131465 -199257
13062 -199257 -172517 -37470 58122 -19493 -78124 -37904 -48266 -67142 -25138 -13063 -28601
13051 -28601 -90373 -87897 -95402 -2682 75941 106248 126870 98646 111995 84650 23042 -15402
13039 -15402 6932 -67897 -103641 -98057 -92071 -4150 30784 49457 13666 35236 16963 -17249
13027 -17249 4528 8091 3754 9702 -33701 -52793 -130717 -205448 -105022 -49024 41709 78672
13015 78672 -27619 -27447 289 -6408 47693 107257 -21977 -212146 -165844 -82603 -46704 -51030
13003 -51030 -77489 -51310 26226 62953 58689 38528 78034 151924 126015 41539 16357 -15477
12991 -15477 -27145 -50873 -7074 78544 35133 14530 84468 51016 28009 -5626 -9112 73631
12979 73631 105849 17254 -61740 -87366 -36222 37861 38460 2135 44402 48842 21524 11419
12967 11419 22780 19795 27829 71194 69687 48034 14865 -55087 -49058 20199 22401 44798 94562
12954 94562 65067 2028 41517 86840 19618 12668 101821 36438 62641 89157 133547 98135
12942 98135 79618 152442 151997 139958 55480 20047 15141 -36366 -101993 -83205 -27110 29605
12930 29605 104967 95031 32968 -1433 -50064 -17615 38334 51493 55335 58085 54762 19884
12918 19884 -70823 -79779 -21636 8821 -95130 -138797 -10024 27993 56175 53780 157803
12907 157803 179922 144665 107363 121655 -13693 -116673 -103004 -106391 -172253 -125775 -43844
12896 -43844 -14233 -59137 -7579 32796 -8445 37355 29344 -124722 -179598 -78742 -101918
12885 -101918 -147725 -115096 -55817 -46815 -54375 69012 156294 124527 79315 58152 68992 -8257
12873 -8257 -3643 55275 25486 -70919 -51496 -31190 42086 -3587 47886 89013 75717 72535
12861 72535 80330 78225 69696 43043 6366 17996 -91609 -137702 -62413 11602 101392 109100
12849 109100 45666 -58342 -34983 45131 79752 81063 125664 183119 175575 223797 149943 54493
12837 54493 5243 3656 -73845 -8344 53244 -5265 -39188 -48626 -152147 -122373 -27770 19806
12825 19806 -3449 -49146 47365 41143 -49081 -65223 -64550 -22958 -48811 -107286 -121538 -195797
12813 -195797 -157552 -69208 -15025 -55758 -120826 -100419 -138486 -112342 -54303 -18645 -50941
12802 -50941 -116426 -97504 -50300 -17484 31058 70788 1657 -3380 359 -25203 -49299 25369
12790 25369 14332 -980 -23466 -55535 -85904 -93781 -127476 -84469 46934 5129 -2375 3974
12778 3974 58162 42989 35433 49731 -712 -18062 -835 -29615 -80753 -6409 75004 174484
12766 174484 202482 60543 -16832 67263 -44856 -34154 21859 49281 31990 81301 36151
12755 36151 -3514 -9605 -20929 -39123 34862 52745 23055 49789 26769 -42839 -52816 56698
12743 56698 31438 -67480 -28867 -77451 -153906 -56977 79830 89687 109131 42802 -4731 9229
12731 9229 -47645 -49969 -78849 -101256 -37630 24396 18167 -40895 -93472 -52960 -101621 -28467
12719 -28467 76178 978 20329 61331 30150 37510 -30235 20497 26930 18247 11175 62334
12707 62334 141749 131899 48850 47455 -26798 22415 66272 -17546 41595 67384 70580 58218
12695 58218 29903 7451 37275 120872 135458 89669 14431 36315 95642 23676 -9152 18303
12683 18303 -16874 -26385 43082 101744 58817 29387 -22833 -61346 -58756 -10975 44147 6769
12671 6769 101655 149355 76078 22763 -21886 -83169 -65163 52442 17361 -15707 -4073 48944
12659 48944 40887 1037 -36305 10802 93241 73106 74234 65984 82702 93551 113585 108776
12647 108776 61163 -591 -62920 415 85547 79562 -116315 -158269 -106391 -128404 -147388
12636 -147388 -81173 -37442 51418 26668 26032 145066 177700 39751 59481 142868 163060
12625 163060 119157 153247 173790 252423 270343 230339 100477 39235 -29085 -31340 58426
12614 58426 130034 116207 115883 73747 121743 105287 96638 46538 34067 10472 -97907 -94329
12602 -94329 -129459 -140004 -119996 -78146 -56179 -97463 -168896 -151759 -141550 -45868 -8425 -19776
12590 -19776 -97822 -135332 -64896 -48110 -77294 57471 124387 83038 13103 -3183 -3143 11338
12578 11338 -79783 -90803 -59315 -52036 27860 131928 172678 127051 22802 22905 115492 155636
12566 155636 133433 27992 -71116 -83220 -10394 3573 -77092 -76988 -124384 -42460 -42654 -5293
12554 -5293 -40230 -20462 -6146 -11486 15765 81079 68961 84869 189838 108126 17195 -44126
12542 -44126 -99671 -136371 -108496 -83451 -30077 32401 -7204 -88906 -40518 84481 159157
12531 159157 143142 41900 7479 4591 -9367 -24849 -60427 -106070 -55454 -35467 -66846
12520 -66846 10475 21618 -11461 -823 -41053 -69132 -134553 -97656 -43304 -58798 -29661 17107
12508 17107 -7081 -23182 -32874 3059 26781 44373 41635 5835 -17556 13776 -52375 -73218
12496 -73218 -31253 29130 -2194 -30133 21250 7314 41486 2551 -39025 -48158 53910 118332
12484 118332 83226 20761 77585 51124 -60734 -54782 -27299 -42665 -83006 -79481 -50376 -14285
12472 -14285 41159 82086 123424 209496 140523 107157 57625 -29868 -68724 -70299 -93933 -185445
12460 -185445 -137270 -91743 -79167 -41339 -82142 -121022 -100828 -153281 -76700 -33372 -44289
12449 -44289 -94317 -172877 -135028 -198395 -74963 3247 6270 -80487 -121292 -132149 -151436 -150327
12437 -150327 -187829 -216039 -124628 -118606 -27248 18554 -29139 -39943 -56749 -72657 -15600 -616
12425 -616 90886 99681 -31729 -71931 2576 -4436 -24287 -98652 -93622 -44470 -70199 -68994 -88231
12412 -88231 -74795 -82749 -157463 -126033 -43165 -57317 -96877 -44029 18248 74052 85790 60420
12400 60420 -124440 -249491 -185933 -95542 -87893 -19058 22915 101618 153091 155215 108981 1642
12388 1642 -74903 -65639 -64190 -15736 -3783 -24998 -21671 3234 21923 137 33379 85572
12376 85572 142604 104160 82301 93171 55484 17316 8810 -36092 3094 48607 75382 18539
12364 18539 -1141 -8191 -37699 -7362 -25521 -66975 -76869 -37617 -69845 -51352 -108443 -58574
12352 -58574 -43166 -34087 -28120 12017 -3243 -7874 -9261 -27485 -65590 -60741 -62527 -19971 84821
12339 84821 163 24772 96001 74804 90805 97668 41396 -3318 31459 61728 80039 52778
12327 52778 30168 44299 33864 49063 -16906 -88099 -51136 3657 33533 38180 35139 79834
12315 79834 78385 2316 -56665 -92661 -49442 -48907 -81076 -79264 -61685 -90755 -47478 -38313 -10943
12302 -10943 25526 2205 11248 50752 59200 16234 14175 -19303 -81435 -58887 30970 81570
12290 81570 48748 100186 210398 225106 104099 4446 -22407 39196 19705 -648 -8317
12279 -8317 43350 103970 75280 86872 99144 90860 48048 38358 38676 14404 -27418 -1515 -59739
12266 -59739 -27298 -29874 7629 73955 68662 -30932 -36439 -35535 -28570 59088 4815 -5763 -61448
12253 -61448 -96322 -61915 -66483 -77578 -155138 -78677 -12233 39489 93916 91000 87750 25473
12241 25473 -15162 -32146 -84773 -105781 -96691 -65425 -37886 -33851 -24479 30038 63874 21237
12229 21237 -34215 -32744 50200 50524 35826 -27868 -45757 -2941 100986 36285 -21636 -51194
12217 -51194 -93097 -74866 -25839 -32883 -38911 9343 38886 2720 -40214 -38832 -29488 -58997
12205 -58997 -93735 -32045 -12841 -58471 -24733 25381 67490 35606 27824 -26326 -38182 -73229
12193 -73229 -74153 41414 85700 -1192 -82300 -97229 -77966 -60690 -98720 -92760 -54178 -77334
12181 -77334 -24789 -61970 -48674 -19864 -1048 14825 -56805 -45513 -38481 -1926 42722 4556
12169 4556 -33440 -95488 -210598 -113572 -33135 11760 6461 -30124 -90923 -131891 -109168 -36356
12157 -36356 -1135 -36956 -14233 28993 40256 17274 -8064 -41270 -20375 67980 110688 130498
12145 130498 106463 -7731 -13826 -66378 -67041 -3734 7835 31662 51005 108745 106514 -9910
12133 -9910 -64127 20155 162780 214586 147760 47569 -9643 43210 38677 -25885 28245 78623
12121 78623 10556 -92525 -51800 27058 -33032 -11750 -57100 -97483 -87962 -48668 -95794 -129959
12109 -129959 -141114 -167744 -234819 -196529 -137797 -24046 24557 -52487 -90116 -48891 -69828
12098 -69828 -103699 -136929 61950 122874 40186 -26772 -81116 -24800 6863 14037 -63178 -147364
12086 -147364 -184033 -155162 -78114 17619 63227 108130 128181 124859 126753 62097 58718 93361
12074 93361 37315 47016 73515 19526 -52193 -50487 1575 17126 2210 53365 47189 -50968
12062 -50968 -72269 -30807 -304 -19682 62156 111281 83624 -10418 -65344 -68751 -28525 -4258
12050 -4258 -46051 8230 8637 -34198 -49300 -35468 13514 34311 -7447 -55576 -93897 -135490
12038 -135490 -119964 -71531 -36617 -29163 -52486 -39310 -39016 -7059 -584 -56458 -166983 -112206
12026 -112206 -34517 -63553 -63317 43830 79424 -17484 -32238 -18073 1546 24587 13103 40533
12014 40533 28551 -37444 -152120 -175478 -101268 -126480 -109399 -65915 -44573 -51066 -58002 4430
12002 4430 -18021 -4813 -6776 60601 105375 114098 61388 52883 -63386 -108171 -86144 -177549
11990 -177549 -219221 -196301 -123290 -115328 -73533 -96683 -95206 -142418 -74764 17196 8558 -1868
11978 -1868 26683 81496 87774 29511 112958 110483 46660 29478 -4494 -67127 11032 47839
11966 47839 -23463 -59087 -52200 -27104 2261 -45174 -14610 49745 56363 5392 -12632 -27995
11954 -27995 -100541 -77634 -89180 -5548 27736 1787 42223 36448 -44334 -61678 22862 -28208
11942 -28208 -49890 -89583 -63426 -62098 -78635 -72717 -141986 -169002 -140259 -164661 -199648 -229238
11930 -229238 -178244 -90946 -17813 -4151 48164 1506 -32875 -40521 -27599 7441 17813 -9077
11918 -9077 -21093 -37615 9767 -46032 -81967 -40674 7980 55115 42030 94249 131592 80164
11906 80164 77343 101063 110056 75347 72718 113883 97662 94763 113368 45312 18098 20135 30210
11893 30210 -14645 -60666 -57084 -765 100636 72107 2916 -116758 -62355 -25836 -62012
11882 -62012 -90705 -64292 -52458 -37098 35735 77003 53348 96281 129047 68186 -58773
11871 -58773 -71240 -62912 -70818 -64660 -41884 47098 16731 -47462 -50045 -44356 -68504 -55483 -938
11858 -938 -40472 -79531 5339 22411 -44428 -126342 -89786 -53998 -23144 -98202 -57854 29300
11846 29300 142502 170254 148261 262 -3814 -9456 -113499 -92152 -51455 -4150 37636
11835 37636 -11181 -8949 5762 -8225 108999 153588 124211 80712 102500 83871 64733 18927
11823 18927 9821 -12211 -27541 -56650 -51708 -30142 11986 102939 173257 70931 62279 94730
11811 94730 99032 75904 103517 16788 -85801 -115385 -98195 -56626 69046 51953 -26963
11800 -26963 60715 105898 106959 125870 36463 5011 -14967 79322 47383 -56068 -31636 21816
11788 21816 126958 152665 61795 8664 4364 69748 84853 14580 29719 75691 69725 120753
11776 120753 145479 -2668 -128369 -99312 -32568 97893 63557 63184 114764 78532 997
11765 997 -22466 -15180 12123 5702 -58751 -45307 -46230 -41788 76152 184499 225849 133479 -47011
11752 -47011 -79309 -47037 -58050 -27279 -70416 -28114 -32191 -54245 -11041 -29727 5352 -5308
11740 -5308 -41245 -34861 16005 15188 54944 115706 203339 164273 46760 -123631 -158476 -158877
11728 -158877 -69117 -128835 -72664 -14717 -69996 -69732 -14074 -5098 66587 135438 115608 125677
11716 125677 123801 105956 114664 148428 118005 45304 12014 -6782 -47559 -45922 20432 -55464
11704 -55464 -83092 -83763 -49277 -58698 -68804 -61835 -23557 48287 68681 69019 16222 1855 108516
11691 108516 119301 104598 94730 136330 132214 87496 96704 47581 -43944 -105032 -68547 -46013
11679 -46013 4040 -64482 -94570 -124222 -156501 -144815 -97843 -76394 -48619 -91508 -136710 -147035
11667 -147035 -76609 -20593 -38859 -9558 -63995 -96464 -81835 7539 86134 38894 12267
11656 12267 -68453 -188636 -151630 -57107 -55411 -124601 -112504 -117585 -86602 31537 56960 57135
11644 57135 22369 6161 -58939 -57039 -54707 -105351 -63480 -34179 -99053 -54699 -14078 39972
11632 39972 98471 100357 44927 27201 -12422 18750 -11075 -14274 -46838 -138908 -150384 -115643
11620 -115643 -103004 -164527 -153089 -55399 -26466 -9219 30386 24097 31700 28737 58923 16818
11608 16818 115 91759 170807 90251 22800 5994 358 -52729 -35144 -22156 41922 49359
11596 49359 71637 57201 -35121 1710 59946 92193 45238 26869 18731 38027 -4845 -27339
11584 -27339 4845 -29232 -59103 -80234 -90385 3901 86873 88766 8203 -32775 -93585 -88178
11572 -88178 -15846 -17280 -40767 -135634 -142838 -101316 -50363 -31199 -96905 -108689 -41554 -41513 85821
11559 85821 208145 219481 90471 -72042 -92567 7639 -6174 -42007 -62040 -20872 83779
11548 83779 52670 -7846 -61491 -134219 -100472 -47811 -78354 -30859 25018 -24817 -41145 26334
11536 26334 -134509 -107918 -74254 -80686 -74757 -83545 -51457 -72347 -82025 -61360 -3267 7644
11524 7644 39351 49979 -27236 -42089 20811 27701 21733 -712 39796 49526 29 102181
11512 102181 116955 23809 11694 49787 49488 9770 43715 65091 -16143 -8512 12911 17654
11500 17654 53245 46427 62351 66396 48782 -40426 -120043 -123762 -96633 -86802 -37406 -34764 -33802
11487 -33802 -56353 -101798 -105248 -80790 2524 69288 128700 114051 124978 91621 23610 21607
11475 21607 9311 -24669 -95231 -190070 -237415 -119366 -41194 -60470 -45324 -24005 31140
11464 31140 27935 97019 106434 48542 17774 -29049 -77925 -82399 -91496 -60336 18626 53012
11452 53012 20742 -37802 -115724 -49950 -5456 21956 -12462 50211 108693 124917 89916 74044
11440 74044 43922 38953 61863 -29031 -66963 -29363 54423 187278 192476 123618 112272 65170
11428 65170 72090 98258 -30585 -73817 -46175 -4578 9549 29643 114191 102665 82615 29380
11416 29380 56932 32004 -62398 -427 59569 56240 61713 -32767 -102860 -117925 -156979 -86924
11404 -86924 6377 28966 23727 9365 5156 -39440 -119243 -161591 -244909 -188041 -117997 -71549
11392 -71549 -93170 -180350 -253161 -217522 -182233 -213232 -175919 -112203 -94183 -175906 -120822 -54887
11380 -54887 -89726 -43344 26531 48587 38056 32678 67446 72262 56057 74845 29489 -82832
11368 -82832 -149504 -169411 -72187 -18536 -101772 -112419 -18518 48308 105502 82676 124213 131655
11356 131655 86107 88312 86579 70803 -62720 -36184 88745 102741 139810 60666 -90372
11345 -90372 -132489 -107246 -147878 -126261 -67289 -50698 -10445 17351 -11695 -13025 25757 28971
11333 28971 -24374 -136165 -205328 -196690 -196989 -178108 -153058 -93177 -124099 -108475 32213 11531
11321 11531 -63627 -132107 -131208 -166845 -123404 -85117 -155107 -219368 -140476 -26914 90599 106148
11309 106148 -43488 -95742 -41615 -118766 -70282 236 12862 -25777 -60646 -138808 -191010
11298 -191010 -210388 -185045 -114852 -65755 -127976 -135695 -135670 -120053 -74374 -65036 -34186 -43929 -30804
11285 -30804 38160 -15841 -63437 -89174 -69824 46781 31239 -2257 33126 7383 59566
11274 59566 61315 37609 20852 43263 50842 104016 58243 22908 -84499 -104530 -43036 38877
11262 38877 11434 4735 82541 75353 6229 -20620 -95321 -127485 -102189 -40357 -79006 -126913
11250 -126913 -63688 -27460 40925 31841 -64264 -101439 23629 34978 1015 -240 12675 12869
11238 12869 -10405 81952 61926 -76144 -117233 -47061 53689 175578 178682 130977 34552
11227 34552 36913 73926 39693 -5523 -17647 -59260 -48969 -72454 -108875 -23214 8624 -44242
11215 -44242 -68994 -122135 -48655 -18374 -33956 -44965 -15266 30459 -41547 -90308 -91202 -9996
11203 -9996 660 26446 21281 -54558 -31041 25416 47849 64784 111089 194701 229688 179552
11191 179552 109170 33278 -18573 -83917 -147463 -82224 -3636 98481 137585 91377 23147
11180 23147 -12273 -34490 -48656 24091 131458 98302 22992 -31633 38005 -34870 -4651
11169 -4651 113309 70811 -20037 41830 55240 24451 22139 -13761 -35114 -28811 -12907 -13219
11157 -13219 -24489 -92866 -86192 -84084 -101231 -57931 79710 110795 141314 148832 90565 36832
11145 36832 36577 79968 132606 49298 -37773 -53604 -8734 -5553 -42834 -41687 36314 49757
11133 49757 -22077 -48113 787 18337 -2011 -59285 -44067 25708 101795 -19203 -15891 43895
11121 43895 75785 8020 -88743 -167639 -138122 -10100 93608 118300 48734 -75719 -88100
11110 -88100 -65796 16294 63164 17190 11420 31485 -15878 -108427 -110949 -106553 -102031 -84422
11098 -84422 -50097 61592 58753 32110 32223 -6118 -44617 -34898 -120620 -100345 -89230 -192124
11086 -192124 -221036 -188796 -175795 -60866 11436 37486 133359 206460 196532 96405 -26271
11075 -26271 56071 52771 -5318 10135 23861 -9149 23664 -12676 12367 -44639 -97548 -182981
11063 -182981 -85842 26832 27367 19813 37549 8377 -2309 -28125 -16977 -22125 -34216 -44485
11051 -44485 -13332 64287 144259 32299 -62748 -116120 -93120 -53467 -1547 -6620 19707 64678
11039 64678 76200 1114 -38411 -85997 -146216 -181492 -126513 -97627 -49866 -30151 15016 -2148
11027 -2148 24054 51429 -24650 9815 101994 110009 43622 -36055 -103482 -131072 -142420 -142624
11015 -142624 -115514 -55369 -53901 -142319 -168226 -82952 208 25163 7222 60170 3056 -69202
11003 -69202 -24967 -125886 -163865 -58422 -43374 -41635 -37378 -72792 -24358 -24283 -46242 -2192
10991 -2192 31016 46857 15442 -61085 -52593 -33346 -59056 -40320 -34017 12822 38792 163527
10979 163527 128927 -12520 -218 5351 -88665 14842 81618 29702 -36091 52573 68142
10968 68142 87565 70324 52721 18338 -40163 11011 -1351 -112891 -129151 -147393 -116607
10957 -116607 -144918 -122721 -159150 -133217 -63272 -90060 -48512 -56124 -100166 -52936 -32437 -78937
10945 -78937 -24454 22866 18522 -31306 -55638 -18968 -10684 -42637 -53797 -106678 -113833 -49994
10933 -49994 7655 -13944 -42526 -58851 -64933 -108261 -137868 -60136 -14377 -21093 -59676 -159148
10921 -159148 -168272 -96583 -23508 -47105 -48785 744 -24176 -62221 34938 33888 1509 15057
10909 15057 -69158 -96830 -44565 -19377 -56653 -8547 35267 27126 -57885 8323 122185 79984
10897 79984 -103974 -144670 -77625 -19974 34004 33249 51191 58808 -10445 -48358 9560 91521
10885 91521 87872 129365 83115 16185 -12933 -6105 20750 61350 -45310 -114773 -84664 -70886
10873 -70886 -89370 -95667 -113334 -45611 -105936 -53802 10955 31609 27482 -76356 -144132 -134174
10861 -134174 -69445 -91743 -92508 -141066 -93967 -70583 -52990 -16608 248 713 4294 43136
10849 43136 -36773 16553 68160 54999 -24572 23720 -16848 -26261 38370 38874 -14003 37680
10837 37680 81516 67075 -6812 -73668 -68440 -28903 -29020 -79577 -164629 -149032 -99264 -88908
10825 -88908 -103734 -7219 43094 1894 -82414 -62386 -92098 -69528 -42089 -85743 -85162 -44302
10813 -44302 12994 79400 76928 28886 -9921 10827 -18171 -40823 -10542 41493 -14472 -28523
10801 -28523 -80115 -144740 -56777 -13303 -18977 -37812 -52627 -108598 -72186 51938 133441 26477
10789 26477 -61155 -76002 -70031 -82033 -110266 -48692 -14816 -362 28519 36592 23808 1381
10777 1381 17339 -34105 -5969 38082 102658 167654 82306 21538 68734 20200 -2061 18431
10765 18431 -1789 -15712 12263 24729 -5508 18956 7209 -14656 -32386 -41296 -21357 -27602
10753 -27602 580 -37453 -53683 11681 -5380 44621 36985 46844 31921 26275 35920 -45854
10741 -45854 -82611 -100932 -132945 -31214 -387 16561 -89644 -63750 8605 15202 -8343
10730 -8343 -51111 6035 32975 118665 144773 109938 19110 16943 96428 135677 138671 67588
10718 67588 79211 50021 61014 106842 112039 62832 122088 132117 24619 65781 73248 -23368
10706 -23368 -64541 -4212 119065 74448 15684 10405 -38362 -59076 -71294 8761 55760 1666
10694 1666 -92684 -124972 -47137 21202 26047 50389 2032 -45112 -56967 54337 101359 87897
10682 87897 62462 14141 6327 -4705 -95358 -43154 -39341 -145305 -149348 -61574 36085 172541
10670 172541 241976 177874 84412 52154 71715 123311 130166 93729 38532 -23611 -83624 -1124
10658 -1124 92956 153563 78133 59447 28589 -57050 -130515 -118497 -33402 -7849 23018 -5005
10646 -5005 9443 29913 67565 177923 177747 94659 -2693 62321 69054 67353 61031 12670 4789
10633 4789 44726 75091 174441 217979 129118 27062 59968 35775 -5823 -24912 52118 75001
10621 75001 -9405 -37812 -17093 -64994 19300 56405 82570 60753 11377 -48456 27035 98878
10609 98878 88188 -43675 -108107 -94543 -67293 -85491 -54821 -25843 -115518 -15207 41981
10598 41981 -24151 -148966 -111133 -73462 -62030 49442 122913 -2797 -54097 -78873 -101156
10587 -101156 -7404 29161 -51205 -80726 -89454 -110826 -99345 -20109 -945 57234 87489 32699
10575 32699 -60744 -127060 -76116 -39659 -43758 42165 79848 -48949 -13982 24805 2896 48913
10563 48913 107850 53174 94457 88682 81945 15429 31620 84751 91021 130648 165740 75208
10551 75208 597 -68923 -144163 -85325 28028 133105 163139 121592 101192 84800 134909
10540 134909 148477 144680 124293 124116 109300 60590 7461 8864 -93 -40373 -36695 -70307 -11961
10527 -11961 53344 62499 143806 76347 49873 116902 131719 146963 162031 193256 127128 103553
10515 103553 71218 -7178 -16180 -19734 -67437 3559 39683 36765 76536 121632 86007 1440
10503 1440 -17382 -42857 -89564 -17352 16597 -86176 -173829 -128540 -19999 47441 102423
10492 102423 77686 20079 -15084 7497 20229 -17651 -42419 -28653 -48437 -78754 -27
10481 -27 53564 -5632 34075 16905 -28818 13702 79596 82717 44205 -5699 -69352 -72674 3730
10468 3730 105552 115637 77550 137006 179655 159772 94011 73172 4962 11423 51140 54401
10456 54401 69652 43419 57315 30008 35019 -1767 -134390 -133579 -55819 -34676 43538 71432
10444 71432 35306 54897 50619 143444 78170 -72881 -113113 -73034 -83852 -74763 -19458 8126
10432 8126 15127 -32219 -64363 -23495 18400 67573 56589 70026 90095 36504 -47925 7086
10420 7086 50391 33830 -3316 -553 -6226 -25873 -29463 14167 -67228 -35890 -88615 -118031
10408 -118031 -35074 -76343 -28369 60050 83890 59296 -6920 36880 59049 18251 -19242
10397 -19242 8283 31877 23739 14839 129012 81024 -3187 46002 124264 103498 51470 99818
10385 99818 41348 -52129 -45082 -11717 -75803 -93924 -49441 -76584 -68468 -71830 -56653 -85614
10373 -85614 -96251 -33037 44102 61843 -3465 -46846 -58376 -85140 -38942 -40073 -49848 -103263
10361 -103263 -87286 -132398 -100488 -66065 27909 73665 43711 -8668 -13636 -66559 -153080 -145348
10349 -145348 -90893 -70151 -56076 -34071 -42167 -54629 -9605 -81607 -74280 -63494 -90905 -33143
10337 -33143 -59929 -148925 -117969 -116228 -90279 -32853 11532 22832 -44379 -142269 -124733 -103668
10325 -103668 -18032 25184 -92257 -222601 -245312 -121441 -110065 -128165 -77089 -12698 4028
10314 4028 -31817 -40214 -47508 1146 62444 49313 -82860 -87743 -56549 -77573 -92256 10547
10302 10547 -216 -105931 -181157 -110438 -35749 2003 26857 13474 -1033 -96255 -140279
10291 -140279 -57686 -20404 24593 9699 -50048 -66880 22469 69991 32441 45739 119031
10280 119031 132855 89264 95679 70387 11441 -4888 -34470 8331 -39551 -93216 -65647 -80234
10268 -80234 -38579 -53902 -32498 -63483 -44775 -15202 23187 40783 26448 -11788 -8339 51654
10256 51654 57686 7158 98460 150113 40630 -16764 10752 61473 85547 79616 55932 107974
10244 107974 178153 175831 151093 18909 -86985 -73057 1101 -44217 -157148 -157355 -82203
10233 -82203 -35476 -101270 -148998 -168906 -177534 -105058 -20732 53466 116941 116181 61733 2372
10221 2372 45770 26881 -110239 -187197 -161846 -81712 -57671 -24107 -56974 -55473 -67000 -209317
10209 -209317 -249591 -195386 -124059 -120584 -168483 -137561 -97695 2816 66014 33454 117507
10198 117507 140865 101251 -22217 -73262 -25667 39572 10764 -10494 -60998 -58561 -75743
10187 -75743 -49610 -149473 -217570 -178765 -169514 -73519 23947 65726 266 -54200 34521 23142
10175 23142 -56605 -13358 43236 -55928 -156713 -64686 -52242 8911 55559 37270 -15283
10164 -15283 -15986 462 39636 8206 -11277 57877 109294 107461 122675 65441 -60774 -127747
10152 -127747 -78399 -50463 -12326 -24142 -22775 3246 6411 -17962 -56847 -12439 -80953 -74051
10140 -74051 -47065 -5201 -8778 -24181 -32417 1116 -33869 -40033 11257 6208 -55784 -79156
10128 -79156 31101 29465 21443 -12287 21968 77391 112668 121518 -14527 -131473 -82316 -69717
10116 -69717 -148193 -183026 -185089 -113436 -113289 -168381 -179684 -132248 -34788 -3114 15901 44823
10104 44823 -20751 -90893 17325 45424 48587 70010 106224 128672 105999 98820 60813 99155
10092 99155 79081 83715 115399 168002 272428 293341 237078 250646 231565 161126 93618 13036
10080 13036 46883 -19315 -1949 6324 -35345 -21468 12089 23748 141 9362 -2839 17508
10068 17508 51347 31346 -50 -12242 49254 27765 -43090 -106705 -21636 -26085 -39229 -68315
10056 -68315 -57897 -48998 -22326 -60514 -96163 -132780 -103756 -90759 -98808 -97792 -34625 -71059
10044 -71059 -68264 -89219 -80128 -46271 -88019 -111405 -91335 -50593 -65596 -85818 -68387 10765
10032 10765 44679 32258 -15303 -118316 -36710 65166 -26912 -46720 61083 81799 80764
10021 80764 31098 7390 13670 43131 -6470 58200 92251 -20758 -9467 73744 44287 2419
10009 2419 -23554 12766 52616 37563 22988 69109 55936 107223 151217 161890 125435 53252
9997 53252 24915 -54954 -16122 4891 19665 59164 16439 33063 98431 113863 -3810 -126709
9985 -126709 -57669 45340 -56610 -74308 -36472 45057 11382 29706 49547 -9425 -9797 3878
9973 3878 -93055 -94187 -115251 -89531 -23948 8521 -7419 -13838 -10962 61974 86194 66032 27407
9960 27407 14955 -12183 -65666 -81329 23037 15685 -67098 -100418 -35533 13558 93626 88095
9948 88095 53925 6747 5460 21334 22695 114871 159180 90035 72760 80181 65897 35043
9936 35043 -26200 -25518 42261 125745 59566 -10199 -58097 -27855 -2842 19166 74218 105268
9924 105268 57215 1081 -55166 -128496 -125271 -120419 -14868 126470 172018 159999 131829 -12426
9912 -12426 -10064 83001 79414 20853 -22515 -34308 -106610 -104987 24452 59264 22083 23852
9900 23852 -9385 -19705 16482 58329 62876 85311 31041 20575 63027 132145 180539 96766
9888 96766 7700 -31185 -8672 -41275 -13761 16888 1335 33909 -1737 -61823 -66471 -47916
9876 -47916 -32798 -18357 -30864 -1775 10655 68104 129099 148019 142149 127824 118365 117901 96011
9863 96011 153445 223066 179785 114315 67680 49281 19198 52430 86335 14405 -44481 -1619
9851 -1619 43025 89978 134212 92186 -57627 -2617 89401 -14741 18645 77656 127341 152233
9839 152233 168624 145632 79861 79871 63084 4532 -37057 -29142 -43888 -20879 70984 62736 61795
9826 61795 167610 127405 22803 15799 -12293 -21962 -10076 -39079 -71421 -11041 76595 79387
9814 79387 75401 68250 16345 9830 34222 7943 -29726 -40943 -77154 -103804 -116458 -70036
9802 -70036 -91329 -22589 129262 226608 187366 226627 273638 224328 107922 91264 94865 23502
9790 23502 -15275 -777 -5788 -51469 -80023 -127067 -106129 -126878 -161268 -130204 -74295 -37210
9778 -37210 -44820 30578 9744 54471 75525 95721 97730 79300 91952 57590 34646 22328
9766 22328 36335 15054 6981 -25583 28013 60100 45314 5301 -71528 -48402 -3901 4353
9754 4353 -27371 -44459 -73754 -100330 -75273 12112 42983 8214 -40287 -51358 -24191 4499
9742 4499 6025 60722 -45423 -97034 -117087 -135227 -98453 -18527 93335 88330 49011 37778
9730 37778 102789 88918 -33016 -98885 -88796 6855 105255 42659 16704 -15211 -73577 -128695
9718 -128695 -130190 -34207 -67065 -75227 -62757 14753 -17710 11833 47389 -493 27282 47071
9706 47071 33816 -17251 -17180 3728 14158 20022 16476 29459 -48786 -115753 -56247 -70102 -53444
9693 -53444 -2258 83171 101393 95668 -21931 -75664 30522 32103 14983 54359 46083 24336
9681 24336 6899 -26481 -104754 -30255 20743 -22160 -8096 62857 90283 31547 -5634 -28385
9669 -28385 -16641 -9010 58313 76136 1053 6335 -2235 -84 2143 73797 21555 -65175 -64641
9656 -64641 -39899 69563 122478 120945 40264 3151 -36032 -51524 -91628 -72089 -95394 -85025
9644 -85025 -91285 -50316 -29220 3054 -51000 -69513 -27843 -18122 53267 -23174 -130289 -129971
9632 -129971 -90714 -43891 -97946 -114937 -136059 -92669 -100521 -102257 -43702 -69899 -40504 66838
9620 66838 772 -51707 -113211 -130408 -59087 46747 38111 89334 100193 63711 14019 -7651
9608 -7651 -114130 -111685 -31981 24485 -50265 -38066 31274 -30811 -15316 -28183 -15306 -27026
9596 -27026 -120501 -141675 -57486 55610 40006 -24714 -18095 -40380 -68157 13106 15427 -55430
9584 -55430 -164624 -115377 15817 -66080 -111248 -35516 16804 4838 40698 -54171 -88792
9573 -88792 -110134 -132208 -93995 -77214 -71610 92082 221262 239979 157786 117935 116541 163688
9561 163688 162781 172370 95400 12022 -10489 -37595 -46797 105315 174097 75040 -14328 28784
9549 28784 28578 10954 5966 87150 70458 69050 123261 95398 -1258 7538 -9763 -23678 -4058
9536 -4058 -94730 -125738 -5193 104031 110414 45883 -2444 -301 9570 2324 19990 155046
9524 155046 189558 78242 18585 -61718 -141795 -81638 -69082 -96888 -119664 -83428 -118130
9513 -118130 -119388 -58430 32890 91902 93928 59712 -23294 -2981 21438 44853 67736 41942
9501 41942 40367 77618 57576 32051 95840 105879 103388 118938 114214 24588 -8940 24568
9489 24568 70380 91702 104961 39862 -109406 -95094 -23260 28032 24337 26024 -17230 -1236
9477 -1236 -2757 15406 4611 -17760 2751 37342 43066 139966 132429 31245 79796 228606
9465 228606 296858 199077 97912 14457 53519 -70923 -97173 -68470 -44487 -6866 80210
9454 80210 130531 109332 122759 82961 103360 93917 82299 31947 -49875 -81791 -83904 -41966
9442 -41966 23673 3554 35233 118541 160135 82664 49818 20027 60097 100199 31545 49943
9430 49943 58732 1118 -5234 -91220 -88915 -1343 23477 129652 237464 161638 49269 31413
9418 31413 -15084 -85684 -92559 -50173 -16043 -11749 18106 5442 -17744 -1633 22827 61500
9406 61500 98735 88619 -12158 -38764 -72355 -45450 46667 15839 21803 39596 64394 68527
9394 68527 94173 95392 40472 -59417 -47769 21690 10909 61419 102460 84941 59893 53801
9382 53801 140637 151647 132636 105868 148436 135813 35078 39697 77606 79265 25784 -19238
9370 -19238 -80277 -94484 -81072 -83375 -151563 -180547 -75001 -36338 -20772 -42351 -43305 10848
9358 10848 57757 78694 59440 19252 89106 118825 148117 78799 66011 89481 129913 69528
9346 69528 -27082 23125 84032 114368 141851 158904 121865 63703 30815 81512 91825 90247
9334 90247 138134 215679 225696 205318 159590 76712 101007 43777 41431 76269 48599 -5179
9322 -5179 19331 2423 -55322 -74437 -22181 11597 15107 31811 1538 -43626 16538 153810
9310 153810 217061 209335 190471 195513 215592 178537 153374 137849 109556 136057 143711 131080
9298 131080 75615 -8035 13143 21998 97103 74984 -10865 11292 74966 180475 177473 176325
9286 176325 252421 256282 241914 262015 213638 155914 159677 150535 78517 118754 203882 167305
9274 167305 143470 223766 297848 364461 355247 204592 145459 209321 294882 316775 244940 156729
9262 156729 146569 131151 48842 33769 21614 -4676 62888 122271 119813 243700 294841 229403
9250 229403 227001 142304 98805 63123 50820 93728 106185 111780 123041 144048 136798 110043
9238 110043 31799 79370 190245 237603 246251 223114 141702 208399 303711 248695 41540
9227 41540 -91005 -48217 24376 113874 167805 190300 186911 114082 85849 97709 164286 144083
9215 144083 131426 193725 256824 360902 271334 242588 324754 327021 235401 240450 227304 214962
9203 214962 247239 251083 210775 269916 284034 279802 270264 229230 237325 297107 220506 232091
9191 232091 253774 288723 291206 302587 337957 328625 345421 305964 241568 210592 209081 317353
9179 317353 405413 370687 383024 391227 382013 381056 454239 467808 428906 391712 410999 342325
9167 342325 378566 444737 486223 443139 386593 365338 361070 400342 467085 416899 391136 409432
9155 409432 423575 388192 382731 435582 505837 560727 553291 640684 603454 584680 652916 676927
9143 676927 689285 727191 681292 678776 696269 725803 755186 730873 670760 664322 723235 774127
9131 774127 843160 831347 889816 913014 843313 779267 838035 815622 797956 817851 864690 846468
9119 846468 801934 856727 912794 977603 1033254 1089110 1119545 1087407 1107643 1168420 1088490 989665
9107 989665 1094270 1118180 1078111 1025205 1024024 1002938 1038086 1088971 1104630 1181979 1207334 1142456
9095 1142456 1089783 1144549 1185474 1125246 1138305 1092374 1085342 1064554 1067504 1043482 1096846 1085639
9083 1085639 1006259 992270 1036044 978602 946490 1002650 997133 969119 935977 965102 883020 874475
9071 874475 899903 848137 850014 861658 838916 858693 819836 778095 834052 905402 871407 775775
9059 775775 734737 777449 742396 772519 779366 756635 811611 854359 745168 628899 642714
9048 642714 671257 627407 534699 464832 419366 532303 599786 644323 609563 606137 632534 534700
9036 534700 405563 482657 537277 563197 520027 501978 414526 440974 443057 391093 407086 428010
9024 428010 485959 557667 555552 518696 550362 469033 460501 451314 427390 349100 265226 308739
9012 308739 293425 256604 308499 325092 373829 345055 308079 381297 297659 221534 324719
9001 324719 325045 280230 255599 232070 150868 168741 147337 169364 196452 224382 163480 152200
8989 152200 102665 111648 104974 107161 139693 173554 187698 225595 268310 251640 279064 299366
8977 299366 294915 333365 296356 237519 198955 309311 260580 202037 196580 129645 72445 57996
8965 57996 85849 146637 139708 98132 200362 192175 197144 141807 97727 107991 89986 34552
8953 34552 20413 104840 182783 210653 143894 139994 135371 169411 246281 169634 89217 104715
8941 104715 47091 24654 38704 23193 8181 140853 168044 175049 66386 106546 148270
8930 148270 169484 193709 199402 211417 240819 244390 167197 -5905 -72564 -95432 34853 143682
8918 143682 143857 34209 8922 73601 64214 86557 108993 -5359 94115 137443 113623 92168
8906 92168 102701 111523 112664 149404 117907 95841 176336 221816 193826 190501 147974 102940
8894 102940 46853 -30138 -54051 -35700 -25984 34672 83550 133333 167713 143108 168130 78544
8882 78544 8627 131037 117579 -9176 -9840 49834 108457 95032 126929 138200 77432 30419
8870 30419 -40113 6259 88622 87944 69313 22374 2457 -27352 11106 27811 125912 207759
8858 207759 139207 73423 11514 47659 -68996 -136601 -103361 -111167 -121687 -104234 45142
8847 45142 93272 53702 26462 -20937 -14473 -1485 88578 180665 151760 143864 233263 120611
8835 120611 24253 48464 152798 103631 -30988 -33366 26230 95887 123920 90210 -25985
8824 -25985 -27125 92134 99257 -61259 -103131 -98456 -130500 -53785 -35835 -41548 43472 44565
8812 44565 29893 -32985 1645 90391 119107 158672 136473 209579 258686 181696 108515 122556
8800 122556 202290 169599 22723 14257 75767 85874 34076 -71731 -108627 -17750 73191
8789 73191 120821 130974 94668 53711 17450 10899 55460 95286 107341 42068 60229 48291
8777 48291 146782 178518 129901 42353 -20792 -68875 -31119 6229 -8631 11530 25244 63498
8765 63498 55659 43955 27774 -71632 -148529 -85264 -44320 -2242 -68407 -171869 -142260 -66316
8753 -66316 -98445 -52516 -21103 -47971 -81536 -38268 81144 96939 133522 142859 36597 -37106
8741 -37106 -136288 -153931 -99056 -40687 -39766 18329 -5856 11677 28956 -5223 -46216 -15934
8729 -15934 57047 148617 181292 128929 69888 71357 167602 149662 75984 23906 43248 21898
8717 21898 -51518 -101772 -35890 -22523 -13388 3854 23046 -23458 -23183 -6449 -17333 -82547
8705 -82547 -91594 -64098 -92921 -38887 -32488 -81212 107474 188848 150484 72569 -44047 -69072
8693 -69072 -55482 -31763 -7773 -60444 -45211 -32213 -45888 -53024 70563 115174 76970 112749
8681 112749 111737 100729 57242 -71838 -105550 -50966 -48361 -18438 31720 65876 62013 -291
8669 -291 -93794 -20534 1132 72693 120379 119066 135935 125657 106093 68141 -50216 2796
8657 2796 7136 -36023 11044 -58927 -113775 -122543 -27527 -33779 -24042 -28176 -25280 -94537 -44891
8644 -44891 75647 126888 95487 46874 155521 199825 161842 104017 57209 8515 -25254
8633 -25254 -23111 -19353 -44212 -57487 -9304 -32311 -38207 -23252 14277 -55100 -146481 -4915
8621 -4915 5314 -3658 5754 -5564 11014 -29648 1117 3368 -21990 -31493 -6522 -29732 7903
8608 7903 28844 13405 -42028 -22900 36603 69934 86828 31227 6668 42843 22704 66603
8596 66603 124961 166716 90661 27741 47095 38101 109083 146567 156392 72298 40375 110624
8584 110624 137687 200299 200985 175646 94300 16504 -8366 29303 1579 74549 86189 68661
8572 68661 117834 158156 114271 64982 89572 37975 -65678 -22126 38590 41364 -35134 -59046
8560 -59046 -23357 -31723 -24157 32549 102501 74303 -15773 -23111 -71123 -67706 -13634 -10880 -84809
8547 -84809 -102580 -59735 -134855 -189533 -132676 38597 105259 137229 159975 96955 44563 -495
8535 -495 -71523 -18572 -16831 -67596 -63358 -71704 -83905 -73662 -104255 -151041 -127816 -94714 -62024
8522 -62024 45984 52148 -10433 150935 153613 165156 214315 113992 33554 -3984 54093 72391
8510 72391 22036 -34939 -36501 72350 201717 191058 76769 315 13383 9370 -24916 -42865
8498 -42865 -35967 -6684 12364 3860 -81456 -87826 41975 58238 -732 -27648 1630 -39814
8486 -39814 -69318 -30133 47052 -1858 -9380 -34195 -48646 -4041 55818 -32767 -12994 56301
8474 56301 88168 23350 -41727 -19827 -16830 18601 66098 70528 75291 69017 91972 76190 112660
8461 112660 171476 122739 70476 110879 135980 39468 -44999 -85184 -44216 58392 158062
8450 158062 133152 27147 -17867 -9971 35196 145021 165628 103711 120366 109188 116776 36098
8438 36098 3400 14912 13366 -72874 -93214 -73518 -57742 -12451 -50772 20763 -13725 -65177
8426 -65177 -34088 66299 70221 62491 33859 -2676 -97892 -53148 -49753 -40752 9190 411 -20523
8413 -20523 -58625 -18903 28413 9287 -29267 -51714 20308 66428 25533 -23055 -202478 -257083
8401 -257083 -255369 -199825 -90083 -43324 49355 57516 -11743 12139 12024 -80353 -132244 -95016
8389 -95016 6558 45630 49484 664 -59787 -39155 4221 70882 74343 19734 -13802 59903
8377 59903 30937 -38935 -15310 39383 81914 79698 6585 -38619 -38091 -55702 -61501 -124468 -175379
8364 -175379 -207170 -174744 -112605 -57955 -28319 -5339 51708 25817 74373 61817 56212 81113
8352 81113 85917 73056 25501 -42768 -78289 -6437 12660 -10085 -19467 -20826 -38140 -54843
8340 -54843 -71734 50452 151592 85200 99922 124554 73984 128736 116910 93895 11355
8329 11355 26831 5505 -4691 9175 63483 109974 75058 39582 84045 83556 8570 62104
8317 62104 37078 14314 -12407 41495 172547 222101 162072 99735 100955 70497 64179 127077
8305 127077 120870 68680 -54356 -56291 -71839 -38352 -2831 48312 79950 18282 39993 24207
8293 24207 -30992 -62639 -117596 -71656 -27511 25371 36464 20728 64790 121671 159129 127802
8281 127802 197941 231232 125973 46750 29392 87394 65359 61526 74916 84396 71201 126013
8269 126013 47778 34018 3657 -23253 -13600 6541 42770 94662 142950 222318 167822 53154
8257 53154 19604 -42469 -23349 -71901 -136682 -108186 -67363 -60684 18878 80862 -2023 -38974
8245 -38974 -60698 -13540 42713 -24008 -87444 -58734 -9084 -60712 28672 1485 -63488 -30147
8233 -30147 34620 62962 36069 10856 -5523 18479 18763 -69327 -140932 -110822 -108442 -96124
8221 -96124 -65188 -80338 -56346 -111900 -117937 -85470 -85274 -64573 -58471 -48287 35358 59007 36057
8208 36057 41880 32628 -35000 -41288 -34339 -25927 2658 -528 -1897 -16634 -21548 16086 -41316
8195 -41316 -104753 -105135 -125662 -95545 -57150 -20588 31961 -4656 -7629 -30309 -50081 -46224 30572
8182 30572 70873 42458 43690 46297 18991 226 -31145 -82593 -109095 -44231 98988 32663
8170 32663 -743 -32485 2900 68968 92794 68221 -11433 -9314 39327 -12922 -38663 33787
8158 33787 92791 20592 -64274 -105212 -179700 -148328 -115116 -90118 -104366 -143839 -210066 -160801
8146 -160801 -71944 41279 -38794 -180259 -216757 -287146 -265606 -120503 -73770 -67731 1219
8135 1219 48256 20908 -104812 -120836 -53626 -74286 -52585 -80437 -145695 -110518 -83558 -84906
8123 -84906 -98582 -118227 -148631 -192673 -93558 -28527 -80461 -88466 -2922 -19271 30307 23613
8111 23613 15549 -44924 -44605 -33145 -23345 -66192 -83079 -98326 -127554 -70374 -88667 -146331 -133622
8098 -133622 -91947 -16812 4098 29826 -14189 -29716 -106857 -179477 -186444 -111819 -123441 -156224
8086 -156224 -172772 -145925 -74666 -44147 -6447 27673 61067 109600 91801 88171 36057 -64044
8074 -64044 -45666 16355 55274 20030 -51870 -57035 -39292 -60103 -3208 -29882 -11390 70188
8062 70188 110618 -2424 -38862 -134655 -188183 -146218 -112596 -33132 -81871 -142416 -111420 -80225
8050 -80225 49095 175047 116616 96022 44472 108950 139950 91417 24975 63079 31957
8039 31957 -38450 11288 146140 127668 93903 175 -43908 -33718 14873 61103 74947 22009
8027 22009 -1356 -21878 -62963 -57548 7358 52194 105434 218363 143706 141878 132861 153339
8015 153339 200564 123946 68502 75664 76587 105168 92715 201516 169977 104807 84200 43271
8003 43271 3998 85716 44620 -24842 86234 135937 111608 29615 45569 61147 -7704 -22037
7991 -22037 2942 52885 56751 56501 76464 158789 151420 57581 -8569 30 41427 4259 -27485
7978 -27485 -33606 -100945 -45659 51256 106090 128952 48141 16608 -13805 40213 98141 145627
7966 145627 160078 94479 -12944 15994 61633 117708 102164 82245 66245 7135 6566 22559
7954 22559 42802 59429 52258 36261 -1885 50376 92836 69771 35447 72344 107362 69770
7942 69770 6224 56465 116093 115061 87424 -14491 -161313 -176612 -97146 -21115 -31652 -35373
7930 -35373 48734 82369 103665 140101 74840 74350 72233 -46186 -10626 20692 57426 -1555
7918 -1555 50944 98569 76484 -6100 -84830 -103199 -50616 6684 -12044 -70060 -98409 -50324
7906 -50324 -24050 -16988 -74903 -84992 -45193 -154166 -171197 -206151 -105043 -30831 61618 80217
7894 80217 75861 103226 169071 15150 -159417 -15442 74122 42464 -13511 -90819 -53866
7883 -53866 -56174 -70602 -1108 21670 27794 53785 68263 76862 79705 85527 86859 35108 4018
7870 4018 -22164 -40907 53232 110714 104149 -37513 -51279 32585 13908 -29968 -31262 4569
7858 4569 98675 199549 194226 153593 -3340 -83114 -83231 -92360 -76818 -94835 -51358 65300
7846 65300 166620 164969 105028 -46797 -116443 -123462 -91675 44818 133093 152493 140891 88769
7834 88769 16256 3513 21039 108140 128463 95163 101367 64937 -29175 6064 75339 56092
7822 56092 17934 -59077 -101489 -142353 -192676 -190073 -147332 -76443 -26788 -33109 -81244 -95795
7810 -95795 -79833 -25405 13926 20472 31154 34051 53151 141505 127554 146610 77478 32536
7798 32536 -32890 -29996 -5110 -29145 -20885 14088 55809 39295 47907 -26916 -132371 -127591
7786 -127591 -52887 22413 7613 100223 102715 -653 -48002 -11667 3218 19968 -21178 -29011
7774 -29011 19853 58816 97860 112599 157411 209874 82763 -35781 -105342 -51871 -30066
7763 -30066 -39230 -97744 -128503 -119648 -134898 -133448 -103463 -16774 10368 14365 -45866 -38662 73774
7750 73774 128539 108847 -29936 -68016 -95161 -60900 -34910 -17965 1 44847 79261 6389
7738 6389 -23289 21451 67799 112532 66069 52290 5278 81784 149628 128674 54925 29304
7726 29304 -43772 -67852 41020 31269 113390 197599 138577 -65183 -109382 -97474 -83141 -4883
7714 -4883 66259 -24364 -62917 -23739 76907 126329 112602 82120 -2754 -73033 -96825 -35107
7702 -35107 42897 15817 69100 41968 32208 -7719 25016 95161 175975 189343 232223 130089
7690 130089 -10580 -1421 12410 -58854 -143413 -139062 -137189 -95545 -23793 -36282 -3138 84513
7678 84513 36622 42106 67747 54868 59484 72593 32660 46173 66243 98542 92808 11801
7666 11801 -20191 16539 60717 70946 30903 53763 56458 61185 117934 43173 -72252 -124859
7654 -124859 -136611 -114767 -97608 -42918 -10572 36751 100807 33314 -31659 -74714 -142005 -75708
7642 -75708 74439 148159 160322 203483 226277 163600 97064 50469 41336 57125 106341 47060
7630 47060 33158 75236 58929 73048 37202 39458 76951 -2622 -16236 -91762 -138199 -34690
7618 -34690 6559 37035 -11286 -73558 -117531 -130825 -69268 -55981 -40210 -79767 -132674 -77325
7606 -77325 -46491 -104106 -131917 -147910 -110563 -44135 -29124 -57025 -45294 -20788 9997 54364
7594 54364 78342 100398 58179 76547 49277 32693 13877 -69198 -143807 -170497 -158510 -127445
7582 -127445 -115419 -127982 -141808 -199577 -192500 -110886 -117534 -84919 -61479 -79389 -99529 -109362
7570 -109362 -58455 -19397 -27634 -57687 -62861 -69646 -132639 -82657 -25804 -24799 -79524 -20008
7558 -20008 34701 -54105 -105969 -59266 -3645 -2773 -110270 -86281 10639 -7754 -56038 -76117
7546 -76117 -88974 -29294 49220 39546 17446 46314 16609 -18049 -18796 5186 41507 -10020
7534 -10020 -86839 -34234 43988 24689 15279 -36213 -103639 -108240 -38073 690 21920 -13600
7522 -13600 17251 13898 66216 115595 65034 106453 61437 -51569 -12158 -74460 -79089 -78556
7510 -78556 -97780 -100535 -23987 2949 -3416 43158 66388 -19353 -126589 -80994 -31700 -38561
7498 -38561 -81277 -59464 12622 45286 49087 46907 18597 37077 104916 175380 175851 55942
7486 55942 -73319 -90831 -66226 -32041 2989 74937 128615 108758 21107 49710 54606 63241
7474 63241 75245 28713 -63933 -27862 50875 98466 68251 -32492 -6259 20474 11126 -56862
7462 -56862 -118582 -120122 -40382 16073 88168 169710 198449 170153 73018 24467 69719 22530
7450 22530 -15757 37029 40523 6815 41250 12563 30147 -64511 -98538 -32907 88105 159705
7438 159705 125111 60588 9571 -33485 -65910 -60925 -70642 -14351 -50691 -92095 -82243 -81131
7426 -81131 -54162 -27826 -72872 -104311 -97856 -71530 -88891 -89023 -51526 -36103 -85060 -101035
7414 -101035 -104373 -37865 46784 60018 31193 11833 4018 -38627 -53126 -82738 -50773 -50984
7402 -50984 -44157 17070 17131 13200 -773 -80228 -192928 -212690 -239777 -100896 -9311 19128
7390 19128 -16715 -5766 -42384 -54826 -12709 75145 126339 52203 -1468 -56026 -68394 -95126
7378 -95126 -62416 -34498 -6530 -43718 21558 43222 36243 -30169 -75487 -6606 23352 34171
7366 34171 13064 6183 -10490 -31564 -6331 63911 80931 1226 40513 95159 26675 -35429
7354 -35429 -30060 23559 -36833 -6551 64759 117695 49460 -24886 -40246 -95542 -107654 -126016
7342 -126016 -158151 -165659 -91719 35066 126985 65698 70212 102872 73584 12352 -28386 -63937
7330 -63937 -146615 -146313 -47202 9413 -19825 -73905 -12139 -16631 17055 -5468 -4149 8211 3938
7317 3938 32146 45053 24444 -4527 -30229 46319 23701 -20746 -20791 -40034 -40335 -26115 -11449
7304 -11449 -70585 -8995 -10972 10586 -26888 6998 -24638 -7775 17176 4836 -81922 -121707
7292 -121707 -112811 -106728 -156596 -119646 -34718 54365 124799 167068 118988 121 -27114 27826
7280 27826 3112 -121501 -134016 -64342 12248 -2854 -58214 -67824 -28899 17877 -24378 24592
7268 24592 27574 48739 44179 28002 55515 28318 21941 47311 -39505 -119055 -112796 -104034 -112555
7255 -112555 -59275 9086 -43232 -90600 -87043 -44608 -55571 -58965 -120566 -139414 -78148 -26213
7243 -26213 45256 45302 19547 9951 28425 4498 12556 29597 1220 -540 63289 155326 84357
7230 84357 74235 29411 -118071 -126695 -88434 -147153 -117631 -141332 -188540 -198895 -157136 -156935
7218 -156935 -187703 -74844 -29555 46725 41206 -68995 -51903 -79200 -43076 26096 -19298
7207 -19298 -93620 -97913 -85792 -56076 -52580 -33918 -42601 -49111 -105526 -73139 -70128 -39850 -102759
7194 -102759 -138987 -64562 -56921 -71334 -23845 -7760 21263 -121704 -106775 -36375 -23615 -52860
7182 -52860 -109941 -119513 -141693 -96399 -123101 -136680 -9974 67077 23535 -4235 -10936 -26060
7170 -26060 -114954 -66174 -14636 38936 41248 -63280 -134161 -39218 -27834 17507 64371 35913
7158 35913 -121499 -159076 -154840 -120419 -116235 -129012 -13544 -9270 -66911 -53812 -44839 23121
7146 23121 70171 1644 29815 61503 -20916 -61304 -23965 9887 -64823 -36164 45776 36775
7134 36775 -2346 38248 -18998 -83486 -152476 -185524 -184354 -106475 3822 3475 -20994 11579
7122 11579 -13504 40846 168832 122902 54830 -79565 -166998 -142318 -159571 -169368 -166389 -110911
7110 -110911 -118687 -120055 -53874 35349 10826 15215 33483 67861 -18083 -58598 -42906 -94810
7098 -94810 -113815 -18064 26330 135256 142213 15181 -40461 -58582 -71661 -75848 -15321 -4744
7086 -4744 5992 33811 68186 131691 108055 61069 -6403 -76138 7713 97192 103882 74263
7074 74263 -31582 -63892 13152 101536 43094 -34775 -86357 -12650 12464 8934 46148 110767
7062 110767 85637 22430 -33880 -54236 22807 -994 -23367 24259 121474 92443 40714 31510
7050 31510 59352 51889 -23538 -71678 -100302 -78756 -141167 -164878 -72444 -13091 -28834 -47888
7038 -47888 2675 -38696 -48107 20657 69507 96048 60725 20644 21457 41310 -3656 3993 22569
7025 22569 61368 132032 155522 86936 74436 67991 37939 95350 91122 67610 6235 -1377
7013 -1377 3423 -34481 -72577 -36563 35002 34575 73216 -22069 -128614 -39494 85188 58012
7001 58012 67839 13130 -43738 -58559 -91167 -53812 -4788 51514 21957 -34788 -79258 -35432
6989 -35432 -48363 58393 80929 31853 -2999 13193 7564 -51622 -113008 -87467 -33193 -60031
6977 -60031 -115881 -43748 16493 -123333 -133086 -127156 -106455 -148034 -64668 25528 84362 105500
6965 105500 26843 -52789 -15653 121807 132971 67377 47558 39830 -39716 9938 78340 140942
6953 140942 74588 -75383 -44402 -17723 9722 16139 116001 139906 42171 -38101 -13516 56004
6941 56004 58241 73538 48669 26869 43399 27571 10373 497 62110 120399 94059 19834
6929 19834 -8054 -15097 18528 61394 55867 31753 -629 2018 61401 47526 37040 -1521
6917 -1521 -25565 -32923 -36372 -21941 44460 33662 38104 -25518 -51657 -64453 -30748 64680 99643
6904 99643 97243 -32476 -39460 -63763 -114232 -106496 -92466 65114 134621 27284 -4744 -1894
6892 -1894 29912 56693 -14719 -85266 -161374 -137025 -136117 -117251 -104365 -169822 -69015 59434
6880 59434 -72338 -176853 -198092 -159649 21879 37654 4310 27166 -42705 -88195 -58784
6869 -58784 -46887 -140984 -191272 -202701 -97137 -63503 -93727 -159601 -97802 -40919 -34294 -78124
6857 -78124 -88097 -109620 -75072 6963 31935 -3977 -49558 -48435 -122133 -167462 -196333 507
6845 507 116997 146148 162121 157455 104660 21168 1264 -19363 -45567 -26411 -69298 -114338
6833 -114338 -27911 -35239 -60790 -36890 -56244 -102917 -71293 53164 99879 6116 3694 73882
6821 73882 191227 198815 104399 82410 -2864 92994 152499 109000 11748 39815 29464 -21848
6809 -21848 -13847 -53180 2873 32856 35538 43090 43710 7108 -52245 20282 -5481 -21826 -69196
6796 -69196 -50180 -19619 -7793 40496 54832 82690 104607 91756 -17000 -39283 -54091 -8563
6784 -8563 49502 84643 81423 45333 -25288 -84144 -53008 -55182 -25194 -17118 42343 16615 -14726
6771 -14726 -19470 10079 -1174 -11620 -9987 -26461 5704 68793 139052 103588 118445 89970
6759 89970 86368 4941 -42728 -8942 29525 50286 -42284 -37999 41063 89392 25259 7074
6747 7074 -113847 -138665 -151571 -81113 -54641 -121489 -159324 -212905 -208769 -180538 -43496 19841
6735 19841 -34835 -59034 -135306 -155842 -202258 -130049 -160989 -114449 -91582 -67592 -99406 -95734
6723 -95734 -11247 15123 26749 86718 136138 164123 114918 -32922 -105769 -158627 -165944 -95743
6711 -95743 52157 82664 41221 -11768 -80621 -14040 -39053 -143438 -178725 -110824 -20090
6700 -20090 25825 34927 82520 131151 55945 27508 -16269 8407 -31157 -61957 -87732 -156240
6688 -156240 -69369 43359 124074 122260 152649 204295 128069 84340 13534 10735 -13960 -3953
6676 -3953 -10582 -98182 -105657 -67257 -24133 20211 44288 85060 108651 25794 -51261 -63039
6664 -63039 -91935 -104344 -75807 -146618 -89161 7858 26252 -35814 -4047 62080 58880 48329
6652 48329 63996 69721 35753 101734 156072 235154 147658 171334 110341 32022 -64736 -128010
6640 -128010 -68483 -54625 -33774 -57387 3042 55254 38112 37048 73340 61315 -61705 -75083
6628 -75083 -48875 -12857 43346 89714 95408 90600 82248 86168 93129 2814 61436 17175 -77497
6615 -77497 -212202 -183680 -91177 -63257 -121562 -110055 -66539 -68847 -44003 -113487 -160238 -105854
6603 -105854 -121846 -173352 -166594 -95051 53866 -4358 -15308 4984 -27236 -52171 -36355 -85209
6591 -85209 -99258 -57810 2879 29409 82259 37912 18502 -11234 27223 28551 33230 44265
6579 44265 -4067 -21242 18915 79716 72987 66258 -6557 -62604 -29475 -8177 14714 -31738
6567 -31738 -26168 5545 -1845 -48058 -140540 -126749 -51850 -5038 -40974 20468 63230 -7935
6555 -7935 -26466 24152 12913 38889 91034 32611 4090 39189 48476 4215 -83925 -160966
6543 -160966 -120032 -95345 -87118 -96032 -131434 -176758 -135617 -102104 -82035 7503 104156 108418
6531 108418 27826 -6039 -33694 -101978 -161344 -136638 -90977 -56156 51685 54860 29313 -13791
6519 -13791 18060 96281 155991 109247 48895 86443 -29760 -90295 -94674 -135032 -140184 -112877
6507 -112877 -63879 -31566 84449 65249 39915 39227 -42401 -8370 38825 152825 251789 245164
6495 245164 145443 164527 143884 122558 73947 -28331 -99194 -113400 -61393 3619 14417
6484 14417 694 -11740 -30297 15148 64923 57340 101513 79067 49727 42249 80995 24729
6472 24729 67669 18367 -59556 -70037 -22769 -33473 -103726 -53683 -56407 -42110 19920 28390
6460 28390 -14818 -47144 -21483 -6325 -41487 -75421 -43821 -50163 -49871 -34703 12538 -40745
6448 -40745 -69270 -99013 -99880 -152628 -78631 -61440 -25126 23237 6966 -63379 -80726 -60274
6436 -60274 -28934 -781 72312 84951 78915 41736 26260 -177 24940 -29589 -9594 7726
6424 7726 -37115 21563 106846 64651 -18928 -58072 -79028 -95415 -85018 -162696 -107979 -148599
6412 -148599 -115712 -71279 11273 67560 39852 15023 -6727 54813 13908 5205 5317 -37920
6400 -37920 -85837 -121243 -182189 -210235 -167993 -153196 -125572 -180254 -184978 -123371 -112261 -38715
6388 -38715 -5402 9545 45810 63242 50010 51079 62500 111059 161480 81655 94193 44066
6376 44066 3244 5055 -40256 -101890 -99000 -50640 -18058 -54407 -165983 -165091 -34053 -60521
6364 -60521 -108082 -134501 -137133 -82812 3659 149685 111211 46584 87022 50673 4268 2256
6352 2256 117014 186264 207385 189305 175299 76271 116194 184431 115628 23776 96704 68573
6340 68573 -30224 -16489 -108015 -1149 136319 13804 -120211 -120896 -99033 -147471 -201390
6329 -201390 -153814 -170598 -169700 -192690 -186628 -123995 -126545 -93488 -139173 -163137 -151525 -141113
6317 -141113 -130366 -104050 -61835 -29536 -526 94735 129189 84601 28807 -20818 -12989 86367
6305 86367 71465 66607 28977 70902 139042 116579 52074 20680 93961 96264 -17030 -55333
6293 -55333 -43730 -8825 -8195 -39952 -122328 -123857 -70479 -41471 -37497 -53227 -49623 -59103 -52431
6280 -52431 -92195 -126597 -78825 -39221 -15381 -91122 -122109 -34412 -123420 -177844 -125238 -40973
6268 -40973 -37974 42050 98776 55010 9143 26062 76255 57089 -5371 22351 43321 42565
6256 42565 93466 71827 36255 108365 157533 113168 44281 -4446 5177 -28155 -51420 -45700
6244 -45700 -104866 -119522 -292 79436 60052 37646 13951 34117 39204 -37540 -68493 -93005
6232 -93005 -47071 19380 79172 54200 -73267 -126125 -103931 56297 17976 -38479 -33433 35898
6220 35898 151337 93532 24827 -33502 -30944 -35415 -50424 -99283 -75050 -55220 19378 -50352
6208 -50352 -90071 -81767 -64303 21208 102121 47502 -38869 -103099 -91464 -31914 -43708 -46113
6196 -46113 -54622 -11543 -80266 -64878 -56715 -22822 22960 -25744 -24405 53856 145049 110616
6184 110616 58036 20052 -87331 -76934 -9634 10365 -151 -31201 -97405 -69739 -76624 -70637
6172 -70637 -55112 -54700 -69071 -18654 5652 -93494 -147607 -151420 -156627 -169310 -80196 -59015 -43143
6159 -43143 31615 57314 -1221 7221 3395 -45709 -60835 -10764 -66161 -27866 -48852 -65235
6147 -65235 -55571 -54851 -42562 -37912 -9621 -32150 -39383 -10612 7406 -47274 -87830 -56546 -115535
6134 -115535 -119220 -64808 1896 -19534 -40208 -53736 -9870 29803 5328 -29237 18753 94976
6122 94976 58589 52885 136325 63576 63985 94563 93768 78409 -32156 -40124 -38695 -32237 -83548
6109 -83548 -77273 56776 27249 109097 103918 40147 -28884 -69423 -21362 4757 -47255 -10667
6097 -10667 -42967 -91853 -32904 -33127 22635 80693 -17517 9491 38754 -86891 -106553 -47308
6085 -47308 -83532 -155053 -162955 -11910 46173 -22921 -9500 79302 96621 -48138 -75761 -82386
6073 -82386 -58516 -43759 62023 178733 172253 153851 162450 82983 42372 20972 -16542 3759
6061 3759 33749 84065 -2043 -49425 -30912 -3988 -49233 -39468 -15009 -78014 -67026 -19955
6049 -19955 -31570 -7790 -10893 -114057 -114018 -160253 -135294 -49770 -85532 -48704 -29289 29201
6037 29201 111371 50972 -23794 -25415 62140 -20009 -61750 -24619 25668 122246 134631 94337
6025 94337 69257 20288 -1136 20900 10240 -64060 -10561 -30553 -113986 -184630 -195525 -207124
6013 -207124 -158137 -208631 -190120 -72550 2767 33301 -157031 -191804 -139402 -161199 -141268
6002 -141268 -127165 -48902 -14662 -45948 -39848 -14457 15426 -24274 -22401 -55006 -99345 -103858
5990 -103858 -86678 -29668 13024 3019 -16106 -38008 -85267 -66199 -78848 -58783 -54378 -42471
5978 -42471 57460 82434 134527 88187 238 28841 146176 71699 -2114 39893 9010 -92928
5966 -92928 -72923 27802 117980 51665 59806 63989 51351 98434 97830 57158 65431 103239 169510
5953 169510 174034 160143 146872 120188 78762 71298 63995 12362 52145 42707 -52418 -60709 -50806
5940 -50806 -73760 -100428 -6737 -5400 -22878 -32921 27724 28499 65422 20065 -10090 -1170 95363
5927 95363 78564 18428 -13963 -36475 -20661 -76568 -43124 15238 10412 2084 18298 20512
5915 20512 14580 11103 34281 90392 87231 60781 130802 134147 76547 23813 82135 95350 133347
5902 133347 83174 15895 -17013 -50432 -29652 28635 62682 -16598 -70836 -17549 -16698 -10877
5890 -10877 11169 80392 50371 -83723 -118791 -72889 -40299 -7639 -8943 -1923 53948 85849
5878 85849 25072 -1466 -43737 -39109 -14289 30984 101146 59767 85444 37612 55713 -3179
5866 -3179 -8071 105451 6623 -45905 -78508 -31511 -42652 -81055 -57613 -5850 -71419 -80771
5854 -80771 -117265 -133482 -104902 -47065 -32301 -48908 -20094 -55563 -43028 -26995 -79042 -38976
5842 -38976 -16714 41778 51854 63269 101594 14479 -81923 -163801 -132315 -98991 -63057 -85840
5830 -85840 -103602 -52725 -45774 -61434 7786 -8287 -70677 -66952 -11339 -45742 -8515 37859
5818 37859 115381 88218 6443 26450 61938 -21773 -49404 -14005 -1349 -50439 -23378 93253
5806 93253 167809 147966 131830 129347 92791 127078 127561 62044 54237 61935 44158 45022 31983
5793 31983 64594 47637 23118 24148 92830 33825 -36868 429 65882 25996 25323 -10902
5781 -10902 -18205 -32455 15112 20313 3726 5912 45538 79718 6248 -91816 -37300 5996
5769 5996 6036 -513 -36562 10448 59731 144967 121527 94078 115136 79645 41521 47166 64122
5756 64122 24620 -57711 -99968 -117079 -22359 37172 1127 -45684 -39859 -59001 -10781 3042
5744 3042 9663 69442 40049 109908 107927 50923 37729 46965 24226 37014 42678 100146 87323
5731 87323 3722 29017 952 -5019 -19211 -51319 -27760 47992 11236 -45417 -45821 -62058
5719 -62058 -9534 -46300 -88672 774 19643 1377 -36524 -86246 -150511 -98780 -109098 -78027
5707 -78027 -150650 -155965 -53307 1663 35660 65067 74196 31659 40157 79398 -13243 -6483
5695 -6483 -29900 -71384 -91209 -88795 -82561 -74781 -58207 -20524 -2280 14222 27288 -31754 -65686
5682 -65686 -170351 -166517 -40362 -80208 -66378 52886 23472 -2240 33198 40291 13582 65349
5670 65349 764 -52544 14507 57494 76596 -41278 -77975 -146886 -167566 -104310 -88246 -4398
5658 -4398 21779 15726 -5684 45408 105660 32406 7948 61336 89876 82466 73541 81068 27128
5645 27128 32838 40370 67997 47529 62675 52341 -29602 -57692 -80408 -74926 -50559 -65274
5633 -65274 -12321 40142 70611 147501 160484 43667 -17475 -43996 -11909 15365 57325 73871
5621 73871 66349 29587 -56106 -117355 -133433 -94314 -35274 -11275 -5068 -2405 -48043 -48488 60213
5608 60213 43218 36521 47470 81137 157539 209982 238865 164723 89709 65518 -1646 -13202
5596 -13202 50464 123480 38842 -22247 -20376 9384 52647 46557 -8313 33887 137278 46507
5584 46507 2108 29186 89265 51197 -51486 -75792 -58568 -32805 -45494 -69476 -98148 -87168
5572 -87168 -20264 -47763 -75509 -28099 -36229 -72027 -20960 1369 -8167 54730 69575 29015
5560 29015 88153 146551 15750 -49945 -10128 24370 60506 33988 14021 -15887 -45808 -3734
5548 -3734 22870 -8400 -30503 -62918 -27102 66885 29543 -5868 24457 69440 14223 -54043
5536 -54043 -126246 -47666 -74649 -90545 -23977 -8659 -29324 -43927 -11218 -14795 -42931 -81994
5524 -81994 -86486 -127756 -128273 18690 146886 100197 38229 100545 177651 100725 66729 50487
5512 50487 81228 47478 83895 45345 -18362 -146401 -109006 29346 -918 -60090 -37478
5501 -37478 29012 104274 170223 108160 53167 83415 53865 32354 7070 -20572 19240 -20689
5489 -20689 -49164 -89385 -49660 2065 39802 -57414 -146076 -114445 -62909 -7109 17602 50110
5477 50110 72211 -6119 -503 -8915 -47664 -4986 61915 66969 98795 140844 165238 141464
5465 141464 24286 -45052 14736 131735 131451 109986 104895 69901 10753 6809 105 -62155
5453 -62155 -50798 36442 80714 65890 86579 58396 -69598 -51029 -105750 -129864 -147342 -54660
5441 -54660 -22858 -22129 -63119 -111990 -5819 69058 17683 -47566 -51134 -69188 16554 -258
5429 -258 34389 61790 67238 104008 71820 25931 60617 80856 118843 106404 108880 97850 104266
5416 104266 100631 -5371 -97111 -92100 -61988 21350 143563 122858 74026 -3369 -29907 -39450
5404 -39450 -26505 -7123 57086 4756 24251 62937 2284 41857 116051 139740 81010 -38282
5392 -38282 -33646 -8228 -12439 31953 32030 57770 62337 12559 -6341 23217 59444 84318 41845
5379 41845 200372 259274 207705 219327 183665 110811 68061 37894 87515 123701 53710 7375
5367 7375 -93579 -110661 20048 71461 25066 39093 76348 -31385 -116099 -17844 -18599 -64318
5355 -64318 -146666 -69517 -90833 -91713 -100100 -112451 -124553 -140609 -84592 -40981 -14367 66674
5343 66674 31909 8542 -67189 -27929 80581 85911 115981 64550 18315 17676 -59885 -126837
5331 -126837 -98852 -155249 -155812 -98485 22408 68250 44837 131141 105503 30774 13208 -7227
5319 -7227 -32408 -73474 -55566 34779 126836 169762 174188 134453 58419 -13712 -8652 99541
5307 99541 105478 -6147 -26129 52768 43760 -10084 -26240 -67290 -41386 -26263 15921 29125
5295 29125 -44532 -103283 -61227 -17953 -9766 20015 18687 -33481 20042 65304 66829 52915
5283 52915 -6348 -22915 -5447 -91900 -158383 -154339 -229555 -291595 -269725 -165787 -10894 32211
5271 32211 77359 84650 63631 7920 -2909 -31097 -85113 -83672 -4402 -85849 -94672 -52078
5259 -52078 35127 -20924 -86089 -183316 -189770 -186190 -114771 -113065 -95807 -35134 18096 -33012
5247 -33012 -8163 -58580 -160354 -80353 -72482 -70436 -74125 -165429 -87470 -42316 -43952 -47930 -19680
5234 -19680 -14700 35782 51449 -14108 1244 23159 65677 165152 137848 70493 77967 56464
5222 56464 -15041 -133145 -117488 -60637 15532 -14488 -33867 -36472 -14541 94187 49781 -60318
5210 -60318 -9578 28412 -8829 3801 16875 57718 81203 106530 44617 39164 49199 24934
5198 24934 16991 61238 -51789 -113397 -42458 -34130 -55496 -108152 -93929 -31285 -38262 -124408
5186 -124408 -115264 -60267 -10559 -34238 -13663 -39519 -22279 -36165 -8972 -81800 -78134 -88724
5174 -88724 -51275 -2088 27542 -10386 -11333 -19216 -19452 -24967 -53618 -40281 -7994 -73504 -22538
5161 -22538 6358 65191 18362 -1593 53677 100197 -45515 -124778 -142388 -171711 -177196 -171457
5149 -171457 -103345 -87187 -95206 -43622 -120358 -147233 -102241 -20007 -56222 -146642 -116204 -55542
5137 -55542 4391 46932 3049 -46454 -84233 -97046 -164187 -136419 -17080 2774 19574 75826
5125 75826 68107 34770 49998 40300 136705 170405 124438 -20202 -40506 -12088 -22360 29144
5113 29144 -17712 -87769 -82963 -64722 37166 92632 54841 26226 -22803 -57270 -110710 -124392
5101 -124392 -71024 95 -16076 50472 6093 -3840 40751 4206 289 -47437 7882 -3150
5089 -3150 28551 45930 -26216 -62309 -53539 -42553 25062 86262 98169 96327 4815 -15487
5077 -15487 69476 124017 114836 -940 -65305 -37709 44840 56488 18168 51467 122816 119343
5065 119343 145444 74518 13792 -43253 -28687 -67570 -49277 21849 65938 2959 -17736 -26928
5053 -26928 -1819 72038 86732 -11754 9101 51517 6433 -56305 -50242 3701 -76595 -59045
5041 -59045 -130681 -158786 -110772 -92963 -39968 36712 63458 -33540 -121359 -122973 -167047 -224524
5029 -224524 -116762 2523 108396 105318 -16667 -81106 -54041 -18392 6107 -20433 -24703
5018 -24703 -9503 -35385 -60539 -38893 -50991 -47825 -15160 91169 136015 149010 155714 75424
5006 75424 -8796 8950 70792 158187 136796 -9180 -35760 84924 88495 40254 -19945 -109585
4994 -109585 -100399 -68223 -8526 43716 -36877 9333 123043 157261 162800 109180 116570 72052
4982 72052 7374 39888 82014 54631 53128 138923 185606 174325 123566 67943 93561 170019
4970 170019 121923 10308 -80056 -59487 -101407 -32145 89153 132310 81503 -45101 -91656
4959 -91656 -38936 -48561 -136658 -80135 797 25297 119265 16740 -96519 -118027 -147477 -172444
4947 -172444 -160336 -127501 -135875 -109545 -110817 -31004 -40220 -53590 -74979 -62535 -67708 -46404
4935 -46404 33087 84792 75632 86709 50892 58213 14504 -60395 -123691 -119882 3041 53215
4923 53215 97183 132014 145606 141161 100973 47178 -18304 10860 62447 -11966 -46239 -66182
4911 -66182 -49914 20742 37991 -28655 -34735 59356 14632 10374 32483 -32519 -57170 -43817
4899 -43817 -80714 -114819 -49110 11207 -10596 17031 14468 -37520 -79955 -118645 -50989 -98159
4887 -98159 -20110 -32470 -133605 -104212 4442 80414 62249 17793 -37959 -75871 -124560
4876 -124560 -63318 43491 76264 -6765 -130306 -211844 -107848 37102 96652 -15639 -36636
4865 -36636 66436 33821 -62261 -50789 -19451 -31677 -44302 -113875 -144033 -49296 -49762 -74849
4853 -74849 -31406 59657 76912 20568 -3604 -2499 -43915 -58166 -33266 12762 23678 -14887
4841 -14887 -75858 -137031 -129533 -191242 -202372 -152233 -89819 -21607 -33883 -40689 -14831 -29103
4829 -29103 4011 -6275 -21914 -47656 -97202 -70943 -77485 -46236 -42806 -26805 2676 71112
4817 71112 92203 43590 8001 2295 -78342 -38406 44815 61472 18378 -3335 -3785 121496
4805 121496 225546 171449 113499 112297 89015 13760 31330 79098 102584 188610 142520 92683
4793 92683 121252 104730 68624 73469 30688 38233 30523 35668 14807 -10374 73747 77349 28176
4780 28176 -44319 -24354 -26457 66539 27067 -12064 22053 -5988 -67249 -71978 -181965 -250812
4768 -250812 -211582 -99410 -72511 -104608 -142017 -135848 -163297 -160160 -116676 -76494 -15679 -160
4756 -160 -1662 113382 130634 32259 26065 95066 97161 8987 103773 136225 9349 -96027
4744 -96027 -67962 25151 -2335 -25225 12243 12074 44822 3784 -90718 -98970 -36413 65891
4732 65891 77141 -5100 29443 16833 -36325 -9751 -11281 -101286 -76315 -17211 54417 516
4720 516 45425 75115 13664 -62113 -76027 -34003 -34705 41041 87778 114728 109555 41137 -33862
4707 -33862 58130 44491 60164 73085 64981 5003 -42529 -86737 85207 102506 89752 111090
4695 111090 37031 -40669 -58397 -53761 -33831 -86801 -114084 -31505 -18078 -61428 -109331 -159939
4683 -159939 -181897 -155536 -83634 -8173 -2401 -43158 -103311 -86815 -47747 -64216 -105501 -63763
4671 -63763 -4814 47082 -3986 -60620 -93151 -63287 -70973 -134064 -52285 12239 43980 33741
4659 33741 64556 85251 175183 140870 140068 163007 80076 948 12319 23792 74567 127056
4647 127056 145785 97388 56101 -64527 -104249 -74074 20959 -46712 -163166 -47375 91095
4636 91095 28497 12501 8419 -27352 27344 1749 -19025 24953 94334 93788 78139 43859
4624 43859 74438 94832 54397 8797 -109768 -110463 -106969 -137826 -61298 -13497 15376 -22285
4612 -22285 -80077 -116488 -65311 35494 -13612 -47643 -69380 -39994 15280 46536 49884 -15025
4600 -15025 -41862 21429 16705 60658 57754 38485 82681 103476 9222 -81509 -145926 -126916
4588 -126916 -36915 -79085 -169151 -119875 -30489 1254 -6 15168 -30919 -90706 -36230 -40658
4576 -40658 -96524 -18256 35246 14889 -15464 88096 149801 181284 109956 14354 32179 85735
4564 85735 100441 14404 -21432 29096 22202 99289 209533 105171 51832 50682 -27956 -42434
4552 -42434 78784 41979 4233 -32312 24211 -13123 -28927 88068 84250 37066 19002 38013
4540 38013 66329 51782 -16637 -69995 -33600 22564 -6532 -2606 64302 5686 -52233 -47463
4528 -47463 1834 3465 -39485 -80069 -82479 -100881 -67945 -87413 -73648 -36767 -14644 -25566
4516 -25566 79067 119045 107780 99283 10844 -36245 -73809 -56139 -26187 56440 25316 -78742
4504 -78742 -88496 -68154 -36769 -48527 29490 37139 81254 65864 11533 -31272 -33282 -27633 54061
4491 54061 -12135 -39317 -21546 8875 -21714 67625 64454 42892 46850 83673 101529 62945
4479 62945 66364 99330 133641 151114 86654 30054 -3646 -38991 -88921 -144732 -177945 -161886
4467 -161886 -135929 -109318 -66499 6922 53049 2973 -72812 -38778 -8894 -15292 10359 64588
4455 64588 73377 5803 -18952 -53007 25261 43289 60597 94820 63473 78321 96635 196788
4443 196788 191799 127307 245276 184631 46527 -47196 -11632 27427 -42914 -85883 -53299
4432 -53299 -16230 -1269 69316 -47158 -115683 -64227 -30861 -82495 -14718 21085 -13572 21189
4420 21189 55948 70101 19059 17432 101374 114978 153734 98742 -14795 -55754 -35105 44640
4408 44640 93008 67762 61585 71584 8692 -21472 -37260 -23715 -47132 -17624 -22491 -136249
4396 -136249 -117377 -100218 -19264 -479 69257 70978 20820 34056 112127 165687 29433 -22533
4384 -22533 -7047 60673 49614 52827 50982 34379 -41034 -29285 22140 94274 57988 -11254
4372 -11254 -24428 -117124 -226617 -173102 -61950 23777 -6409 -16418 739 -113117 -148061
4361 -148061 -111813 -104114 -106658 -87988 2023 67835 87069 111269 182692 141531 107532 31946
4349 31946 24024 88770 169105 164788 125477 37341 41738 68739 349 38324 95243 77285
4337 77285 -77493 -80726 11184 99417 63182 -50865 -36613 -23718 60430 114550 80285 35125
4325 35125 24694 -26665 -10930 -14477 -7440 -61655 -34245 -32962 -48291 -1546 34030 -46971
4313 -46971 -69048 -124193 -110708 -102859 -67654 -152416 -176305 -97594 -53381 -6562 31147 2281
4301 2281 -65761 -35156 -29334 -4246 10580 -21021 1076 -11458 41831 114232 118466 97549
4289 97549 136604 83538 125143 80376 8411 -85802 -121350 -124618 -143996 -108534 11613 54615
4277 54615 50017 12199 21010 -57043 -72573 22052 37510 1692 28589 -14450 3921 -37019
4265 -37019 13663 -8785 -13497 309 -32215 -30286 -86222 -6739 65418 26940 82099 -14561
4253 -14561 -76821 -103517 -41926 -67265 -107547 -89309 -46424 -39849 -97865 -102024 -64694 -8252
4241 -8252 -78008 -93747 -94545 -87820 -126158 -68827 -34382 30231 20594 37751 63693 -2498 -59320
4228 -59320 -60576 -120436 -197716 -192208 -278513 -262161 -164444 -61989 -5934 -13707 -20828 -62382
4216 -62382 -84236 -64564 -40824 -77435 -134091 -118453 -79941 -26320 7702 -83165 -51787 60695
4204 60695 87493 78862 90889 122682 60186 -9772 -21122 -77346 -96889 -117079 -142752 -56691
4192 -56691 33382 -1549 -35757 43606 77410 23229 -68605 -17341 46150 60603 -82374 -112935
4180 -112935 -32503 -35130 -31393 52416 85360 120869 109078 25744 -14616 -73633 -23787 21297
4168 21297 34245 -6227 46451 23098 68199 75458 -7696 -11500 13858 -6875 -5860 -35383
4156 -35383 -45947 -32026 -701 3008 -48840 -115113 -73029 -48672 -72417 -102501 -154572 -136916
4144 -136916 1568 63510 15562 -1696 -74794 -67410 -27548 33949 47038 47116 -30918 -86807
4132 -86807 -79743 -65372 -40391 -2480 -23235 13730 -12726 -97754 -104881 -47583 64670 35120
4120 35120 -7396 5643 -101377 -20596 58177 126955 136322 126112 131218 110915 81918 141479
4108 141479 169241 107301 70233 62568 14888 46913 55205 20978 -10816 39948 -39740 -112905
4096 -112905 -41117 28504 5458 7906 -4131 -55979 -22166 -16829 -66650 -29836 73925 98730
4084 98730 20237 10801 40731 69939 96182 128992 200711 127855 66671 24701 -4191 -24790
4072 -24790 -18765 24007 -58630 -57793 -62407 -4240 -21791 741 53133 47482 54282 120694 132816
4059 132816 122671 25614 -13728 -8433 50700 39180 -54682 -49650 12633 127583 79190 97150
4047 97150 134670 112645 29390 -21079 -12787 -96911 -70152 91183 118558 -40166 -153648
4036 -153648 -134066 -66676 37214 52909 96277 99595 131860 135807 107346 69868 50149 62377
4024 62377 -10010 -61953 -83313 -107988 -162527 -170780 -236843 -164623 -57599 -7774 29754 31532
4012 31532 -5997 -58500 -110989 -95992 -19263 -4254 -83137 -55437 -93980 -76714 -60764 -37717
4000 -37717 -66882 -99099 -77965 -114187 -104432 -26701 2611 48700 113009 25218 5511 28422
3988 28422 27889 -109782 -117685 -130726 -6270 34239 -36338 -104363 -66335 -68890 -49599 -108175
3976 -108175 -108759 -64914 -90435 -60588 -35876 -5370 4928 10276 -9575 -76992 -163053 -78457
3964 -78457 -15651 -40084 -3794 20078 89756 88998 27762 18637 -15576 70506 149049 74245
3952 74245 81632 115362 55596 -4520 -18902 8413 34440 -9789 -34108 28678 67160 56904
3940 56904 -14979 -18627 -9375 52290 -45863 24769 38052 -15887 -61662 -59584 -58900 -21151 -31831
3927 -31831 -78335 -103447 -111054 -75704 -26151 -45204 -40492 -45893 -20244 -6808 -21213 -47420
$$ [...]
##END NTUPLES=NMR SPECTRUM
##END=
