##TITLE=317010
tl 00177
adrs
endeavour
##JCAMPDX= 6.0         $$ Bruker NMR JCAMP-DX V2.0
##DATA TYPE= NMR SPECTRUM
##DATA CLASS= NTUPLES
##ORIGIN= Bruker BioSpin GmbH
##OWNER= nmr
$$ XWIN-NMR		Version 3.5
$$ Wed Jul 12 08:55:41 2006 GMT Daylight Time (UT+1h)  MAYBRIDGE\nmr@NMR_250MHZ
##.OBSERVE FREQUENCY= 250.131544655141
##.OBSERVE NUCLEUS= ^1H
##.ACQUISITION MODE= SIMULTANEOUS (DQD)
##.ACQUISITION SCHEME= undefined
##.AVERAGES= 3
##.DIGITISER RES= 18
##SPECTROMETER/DATA SYSTEM= dpx250
##.PULSE SEQUENCE= zg30
##.SOLVENT NAME= CDCl3
##.SHIFT REFERENCE= (INTERNAL, CDCl3, 0, 16.522)
##AUDIT TRAIL= $$ (NUMBER, WHEN, WHO, WHERE, WHAT)
$$ ##TITLE= Audit trail, XWIN-NMR		Version 3.5
$$ ##JCAMPDX= 5.01
$$ ##ORIGIN= Bruker BioSpin GmbH
$$ ##OWNER= nmr
$$ C:/u/data/dgb/nmr/ADRS/15641/pdata/1/auditp.txt
$$ ##AUDIT TRAIL=  $$ (NUMBER, WHEN, WHO, WHERE, WHAT)
(   1,<2006-02-03 12:24:32.12 +000>,<MAYBRIDGE\nmr>,<NMR_250MHZ>,
      <created by zg, POWCHK disabled, PULCHK disabled
       terminated by command 'halt'
       configuration hash MD5:
       84 BC 41 DB A1 6E 1D 46 DA 25 12 A5 C1 ED C5 3A
       data hash MD5: 64K
       D5 EF 4A A7 9D 9D B7 96 C2 15 81 26 82 0A 0D 99>)
(   2,<2006-02-03 12:24:41.76 +000>,<MAYBRIDGE\nmr>,<NMR_250MHZ>,
      <Start of raw data processing
       ef LB = 0.3 FT_mod = 6 PKNL = 1 SI = 32K 
       data hash MD5: 32K
       A4 7D E3 53 44 B5 E2 1E AC 0A 8E 4E CF 36 63 1C>)
(   3,<2006-02-03 12:24:43.99 +000>,<MAYBRIDGE\nmr>,<NMR_250MHZ>,
      <apk 
       data hash MD5: 32K
       B8 52 71 79 41 66 9F 2D 94 A5 B2 7E 93 BB 19 08>)
(   4,<2006-02-03 12:24:45.01 +000>,<MAYBRIDGE\nmr>,<NMR_250MHZ>,
      <abs ABSG = 5 
       data hash MD5: 32K
       A2 BB A2 2A F9 93 86 4A 6E 81 17 2E 33 00 92 05>)
$$ ##END=
$$ 
$$ hash MD5
$$ BC 2B 71 F4 9E 77 F2 2B 3B 85 DC 50 09 AC BD C8
##$RELAX= 
##$RELAX= 
##$RELAX= 
##$RELAX= 
##$RELAX= 
##$RELAX= 
##$RELAX= 
$$ Bruker specific parameters
$$ --------------------------
##$DU= <C:\Restored>
##$EXPNO= 15641
##$NAME= <ADRS>
##$PROCNO= 1
##$TYPE= <nmr>
##$USER= <dgb>
##$AMP= (0..31)
100 100 100 100 100 100 100 100 100 100 100 100 100 100 100 100 100 100 
100 100 100 100 100 100 100 100 100 100 100 100 100 100 
##$AQSEQ= 0
##$AQ_mod= 3
##$AUNM= <au_zg>
##$AUTOPOS= <9 >
##$BF1= 250.13
##$BF2= 250.13
##$BF3= 250.13
##$BF4= 250.13
##$BF5= 500.13
##$BF6= 500.13
##$BF7= 500.13
##$BF8= 500.13
##$BYTORDA= 1
##$CFDGTYP= 0
##$CFRGTYP= 5
##$CHEMSTR= <none>
##$CNST= (0..31)
1 1 145 1 1 1 1 1 1 1 1 1 1 1 1 1 1 1 1 1 1 1 1 1 1 1 1 1 1 1 1 1 
##$CPDPRG= <>
##$CPDPRG1= <>
##$CPDPRG2= <>
##$CPDPRG3= <>
##$CPDPRG4= <mlev>
##$CPDPRG5= <mlev>
##$CPDPRG6= <mlev>
##$CPDPRG7= <mlev>
##$CPDPRG8= <mlev>
##$CPDPRGB= <>
##$CPDPRGT= <>
##$D= (0..31)
0 1 0 0 0 0 0 0 0 0.06 0 0 0 0 0 0 0.0002 0 0 0 0 0 0 0 0 0 0 0 0 0 0 
0 
##$DATE= 1138969470
##$DBL= (0..7)
120 120 120 120 120 120 120 120 
##$DBP= (0..7)
150 150 150 150 150 150 150 150 
##$DBP07= 0
##$DBPNAM0= <>
##$DBPNAM1= <>
##$DBPNAM2= <>
##$DBPNAM3= <>
$$ [...]
##$SUBNAM7= <"">
##$SUBNAM8= <"">
##$SUBNAM9= <"">
##$SW= 20.6930455092707
##$SWIBOX= (0..15)
0 0 3 0 0 0 0 0 0 0 0 0 0 0 0 0 
##$SW_h= 5175.983436853
##$TD= 65536
##$TD0= 1
##$TE= 293.16
##$TE2= 300
##$TE3= 300
##$TEG= 300
##$TL= (0..7)
0 120 120 120 120 120 120 120 
##$TP= (0..7)
150 150 150 150 150 150 150 150 
##$TP07= 0
##$TPNAME0= <>
##$TPNAME1= <>
##$TPNAME2= <>
##$TPNAME3= <>
##$TPNAME4= <>
##$TPNAME5= <>
##$TPNAME6= <>
##$TPNAME7= <>
##$TPOAL= (0..7)
0.5 0.5 0.5 0.5 0.5 0.5 0.5 0.5 
##$TPOFFS= (0..7)
0 0 0 0 0 0 0 0 
##$TUNHIN= 0
##$TUNHOUT= 0
##$TUNXOUT= 0
##$USERA1= <user>
##$USERA2= <user>
##$USERA3= <user>
##$USERA4= <user>
##$USERA5= <user>
##$V9= 5
##$VALIST= <valist>
##$VCLIST= <CCCCCCCCCCCCCCC>
##$VD= 0
##$VDLIST= <DDDDDDDDDDDDDDD>
##$VPLIST= <PPPPPPPPPPPPPPP>
##$VTLIST= <TTTTTTTTTTTTTTT>
##$WBST= 1024
##$WBSW= 4
##$XGAIN= (0..3)
0 0 0 0 
##$XL= 0
##$YL= 0
##$YMAX_a= 144145
##$YMIN_a= -137656
##$ZGOPTNS= <>
##$ZL1= 120
##$ZL2= 120
##$ZL3= 120
##$ZL4= 120
##$ABSF1= 16.522
##$ABSF2= -4.171173
##$ABSG= 5
##$ABSL= 3
##$ALPHA= 0
##$AQORDER= 0
##$ASSFAC= 0
##$ASSFACI= 0
##$ASSFACX= 0
##$ASSWID= 0
##$AUNMP= <proc_1d>
##$AZFE= 0.1
##$AZFW= 0.1
##$BCFW= 0
##$BC_mod= 0
##$BYTORDP= 0
##$COROFFS= 0
##$CY= 12.5
##$DATMOD= 1
##$DC= 0
##$DFILT= <>
##$DTYPP= 0
##$F1P= 14.0000005364418
##$F2P= -0.99999901652339
##$FCOR= 0.5
##$FTSIZE= 32768
##$FT_mod= 6
##$GAMMA= 0
##$GB= 0
##$INTBC= 1
##$INTSCL= 1
##$ISEN= 128
##$LB= 0.3
##$LEV0= 0
##$LPBIN= 0
##$MAXI= 10000
##$MC2= 0
##$MEAN= 0
##$ME_mod= 0
##$MI= 0
##$NCOEF= 0
##$NC_proc= -5
##$NLEV= 6
##$NOISF1= 0
##$NOISF2= 0
##$NSP= 0
##$NTH_PI= 0
##$NZP= 0
##$OFFSET= 16.522
##$PC= 1
##$PHC0= 99.90963
##$PHC1= 5.60899
##$PH_mod= 1
##$PKNL= yes
##$PPARMOD= 0
##$PSCAL= 4
##$PSIGN= 0
##$REVERSE= no
##$SF= 250.13
##$SI= 32768
##$SIGF1= 0
##$SIGF2= 0
##$SINO= 400
##$SIOLD= 32768
##$SREGLST= <1H.CDCl3>
##$SSB= 0
##$STSI= 32768
##$STSR= 0
##$SW_p= 5175.98343685301
##$SYMM= 0
##$S_DEV= 0
##$TDeff= 65536
##$TDoff= 0
##$TI= <Analysis number 999999
Compound Code 99
Book Reference 9
Project Code 9>
##$TILT= no
##$TM1= 0
##$TM2= 0
##$TOPLEV= 0
##$USERP1= <user>
##$USERP2= <user>
##$USERP3= <user>
##$USERP4= <user>
##$USERP5= <user>
##$WDW= 1
##$XDIM= 32768
##$YMAX_p= 330235287
##$YMIN_p= -320550
$$ End of Bruker specific parameters
$$ ---------------------------------
##NTUPLES= NMR SPECTRUM
##VAR_NAME=  FREQUENCY,     SPECTRUM/REAL,   SPECTRUM/IMAG
##SYMBOL=    X,             R,               I
##VAR_TYPE=  INDEPENDENT,   DEPENDENT,       DEPENDENT
##VAR_FORM=  AFFN,          ASDF,            ASDF
##VAR_DIM=   32768,         32768,           32768
##UNITS=     HZ,            ARBITRARY UNITS, ARBITRARY UNITS
##FACTOR=    0.157963299565203, 1,           1
##FIRST=     4132.6476996994, 0,             0
##LAST=      -1043.33573715361, 0,           0
##MIN=       -1043.33573715361, -320550,     0
##MAX=       4132.6476996994, 330235287,     0
$$ Real data points
##PAGE= N=1
##DATA TABLE= (X++(R..R)), XYDATA
$$ [...]
18468B54402L330o086j5981j0660r248j0866n675j1340J5603q443J1519M476J4501
18455B25532n324L6599K5839r232m17k6598k6452j8006j1176P389L3058n588n736
18442B19888J5348J3802K4360O3367j451o711j9054j0425K6679J8972j0745p078
18430C26952m44L5384K460m1262k2223M997o204p573j8651o393R991R390m353
18417B82071L158q153J5998Q147r499k4640j8355k9433q235j5418l9667J0175
18405A66149K7111L0697J3976J1456L6674K1184k388k2681j5740J023n051J3008
18393B75418R27l7076L4281L9870P73J8638M4534J695l9181j9762k4041j7079
18381B78997k8669j0264k5706k699j5346k5495N92J154N565p492k055O504O665
$$ plain form
18468 254402 257732 251646 235665 225005 215757 204891 199216 187876 203479 195036 206555 211031 225532
18455 225532 220208 256807 282646 273414 272997 246399 219947 201941 190765 198154 231212 225624 219888
18442 219888 235236 249038 273398 336765 335314 328603 309549 299124 325803 344775 334030 326952
18430 326952 326508 361892 364352 323090 300867 305864 299660 292087 273436 267043 277034 286424 282071
18417 282071 285229 277076 293074 301221 291722 267082 248727 219294 211059 195641 155974 166149
18405 166149 193260 223957 237933 249389 286063 307247 304859 282178 266438 267461 262410 275418
18393 275418 276345 239269 273550 313420 314193 332831 377365 379060 339879 320117 296076 278997
18381 278997 250328 240064 214358 211659 196313 170818 171410 172564 178129 170637 168582 175086 181751
18368A81751j4877Q367L7847O3454O9480O2959M2116r615l0513p3353q2478j9137
18356B36001k3161k9787K2262L0887n419n369M00m08l1458k8206k651L7118K8237
18343B28446j4857K2378J9048m165k4300k0128L0956M097N393O769J6274J9572
18331B89483J861M999K2198j343l9191l7458j1054Q433J7948K4490K9108J932
18319C11406k492L5062O2313M1579L576N7475Q8562J09189J47520J86433J81457
18308A222080J49574J26228O1213M0258j5760k8086o342O139R633N905M8067O6693
18296A685602R6907J03334J59715K31069K61181L03369L99125M85890N68095O76164
18286D970451Q81981J334357K092312L370004N208219O375325N763080N446124
$$ plain form
18368 181751 166874 175241 213088 276542 346022 408981 451097 441482 410969 337616 255138 236001
18356 236001 212840 183053 205315 236202 230783 225414 225814 225406 193948 165742 163091 200209 228446
18343 228446 213589 235967 255015 250850 226550 206422 237378 241475 246868 253637 269911 289483
18331 289483 291344 296343 318541 317198 278007 240549 229495 237928 255876 280366 309474 311406
18319 311406 308914 343976 406289 447868 451444 508919 597481 706670 854190 1040623 1222080
18308 1222080 1371654 1497882 1559095 1599353 1583593 1555507 1549165 1555304 1564937 1570842 1618909 1685602
18296 1685602 1782509 1885843 2045558 2276627 2537808 2841177 3240302 3726192 4294287 4970451
18286 4970451 5852432 7186789 9279101 12649105 17857324 24232649 29995729 35441853
18278C5441853N975060O510746M322564J513220n54344l355071m265494l438693
18270D2149841k144858j180385N33194K100387K802253M091878N476877N006329
18262E8835516J448117m98444l182291n957114o591520n941603n907768o642167
18254B5562726n847678l987516k520342j639736j162507q68925o25050m24999
18246H485973k77884j34694k0595J34778L49904O67956J173810K053703L446893
18237A5879844N368555O424813N693618N207497N582855O331948M170445J092252
18229E5751827j861139m201590m111915l217026k505109j690763O67619K653438
18221D1485342L103659L857241N193620N371918J963397r67695m162282o176871
$$ plain form
18278 35441853 41416913 47927659 52250223 53763443 53209099 49854028 45588534 42149841
18270 42149841 40004983 38824598 39357792 41458179 44260432 48352310 53829187 58835516
18262 58835516 60283633 59785189 56602898 50645784 44054264 38112661 32204893 25562726
18254 25562726 19715048 15727532 13207190 11567454 10404947 9536022 8910972 8485973
18246 8485973 8208089 8073395 8052800 8187578 8537482 9205438 10379248 12432951 15879844
18237 15879844 21248399 27673212 33366830 38574327 44157182 50489130 54659575 55751827
18229 55751827 53890688 49689098 45577183 42360157 39855048 38164285 38831904 41485342
18221 41485342 44589001 48446242 53639862 59011780 60975177 60007482 55845200 49668329
18213D9668329o276526n970823o385546p019873n961245m037116k591092j721777
18205I704331j198548r20272p75097o71541n81984n43120n14083m25424l30626
18196C743636k38780k39300j76593j09028r8359j03772j29391j66904j65602j71554
18186B144353j50023j11323r9413p9699m7608L8007L4226L3207P1400J27814O7857
18175B028798j6976j8488N8312L4590m5760k9735J0115Q2208J56595R9616O8688
18164B427963Q2966J43275J04770k8843n7714j3402o3894j44393j20867P780k5968
18153B311673j31839j98994r8604R778n4511k24440k39995j23274n7258n6367
18143A136169m7558k7618Q015N6473O6157N076l8477m1003l4508p0238m5529l9387
$$ plain form
18213 49668329 43391803 37420980 31035434 24015561 18054316 14017200 11426108 9704331
18205 9704331 8505783 7585511 6810414 6138873 5556889 5013769 4499686 4074262 3743636
18196 3743636 3504856 3265556 3088963 2979935 2881576 2777804 2648413 2481509 2315907 2144353
18186 2144353 1994330 1883007 1783594 1703895 1656287 1694294 1728520 1761727 1833127 1960941 2028798
18175 2028798 2011822 1993334 2051646 2086236 2040476 2010741 2020856 2103064 2259659 2359275 2427963
18164 2427963 2510929 2654204 2758974 2730131 2672417 2659015 2595121 2450728 2329861 2337641 2311673
18153 2311673 2179834 1980840 1882236 1892014 1837503 1613063 1373068 1249794 1192536 1136169
18143 1136169 1088611 1060993 1069008 1125481 1191638 1196714 1158237 1117234 1082726 1012488 966959 927572
18131I27572k8557j5790J3826K5393N950K1353J03496J32633O8625L0163J7279
18120A301943L2087O1100J08841K08161K96585L58044N72520J064176J970299
18111E973756L914157O994784N459937l368527o944999m393606k210754j227305
18103D197443p08165l25690n3293l9939j26945k17928l01066l41605l00765j61379
18093A620668n8217l3559l1867m8199q9430m8741J8241n626L2883J05193J20024
18082A581370J05327N4262j072l6604j4156R5666J60513J85371J97255J14396
18072B442328J5116p728L931j75365l32467l38938k26912j63179j68461j38695
18062I09630j17190n7108n3070k3089R509J585m867O1266Q0208O4867J9707j9182
$$ plain form
18131 927572 899015 883225 897051 922444 928394 949747 1053243 1185876 1254501 1284664 1301943
18120 1301943 1334030 1395130 1503971 1712132 2008717 2366761 2939281 4003457 5973756
18111 5973756 9887913 16882697 22342634 18974107 12029108 7635502 5424748 4197443
18103 4197443 3489278 3163588 3110295 3070356 2943411 2725483 2424417 2082812 1782047 1620668
18093 1620668 1562451 1528892 1497025 1448826 1359396 1310655 1328896 1323270 1356153 1461346 1581370
18082 1581370 1686697 1740959 1739887 1703283 1689127 1784793 1945306 2130677 2327932 2442328
18072 2442328 2457444 2449716 2453647 2278282 1945815 1606877 1379965 1216786 1048325 909630
18062 909630 792440 735332 682262 659173 668682 670267 665400 726666 806874 871741 891448 872266
18050H72266L9320O6039K134q0834p0543o17q10R530M3106N6256L7699m2826m2702
18037H88018J1810Q1341J17705K28916M37787O94312N50315J00k83146m9788K72027
18026B949397J38425k91674m68528l47837j90676j35898n3322o6810q6621l9645
18016A406811L850J00804J47641K50071L49112L71135L63996K12939j06721k91497
18006B808141l54788l36446k43926r0735M6282J57708K34040K71194K48241J73459
17996B913170O454j01489j22623j28961m0008J51367L49965N47395Q58744J341702
17986E775716K054931L031998L054602J581802J296337K925980K873708p72143
17978B1822931k755650j446730m41004j328694j832997q40058N49379J586229
$$ plain form
18050 872266 911586 977625 979759 898925 828382 827765 826955 836485 879591 935847 973546 930720 888018
18037 888018 899828 981169 1098874 1327790 1765577 2459889 3010204 3010304 2727158 2677370 2949397
18026 2949397 3087822 2796148 2327620 1979783 1789107 1653209 1599887 1533077 1446456 1406811
18016 1406811 1410661 1511465 1659106 1909177 2258289 2629424 2993420 3206359 3099638 2808141
18006 2808141 2453353 2116907 1872981 1782246 1828528 1986236 2220276 2491470 2739711 2913170
17996 2913170 2919624 2818135 2695512 2566551 2526543 2677910 3027875 3575270 4434014 5775716
17986 5775716 7830647 10862645 13917247 15499049 16795386 19721366 22595074 21822931
17978 21822931 19067281 17620551 17179547 15850853 14017856 13177798 13727177 15313406
17970A5313406J207015L64689J087175K362655O85790k207640k256645q71494
17962A5684951r74244j939136j932878j096123k38223O27760J635780K708070
17954A4475957K501475J124942J366645L305411K946256j207702l148053j559631
17946A9805300n53603j585980k211734j100511P42981K054458J609593P31478
17938A9491982J727296L459271K061894j045154p18385K143642M152819L915630
17930C5188995J704163Q54893L860970O478835J237895n397252m846161j690674
17922C7391664k356975m485992l511097n2726L290603L819414J775414K164773
17914C8035078N484553M599230k788782o091522l412898k238747m605962n606828
$$ plain form
17970 15313406 16520421 16885110 17972285 20334940 21020730 18813090 16556445 15684951
17962 15684951 14710707 12771571 10838693 9742570 9504347 10132107 11767887 14475957
17954 14475957 16977432 18102374 19469019 22774430 25720686 24512984 21364931 19805300
17946 19805300 19251697 17665717 15453983 14353472 15096453 17150911 18760504 19491982
17938 19491982 21219278 24678549 26740443 25695289 24976904 27120546 31273365 35188995
17930 35188995 36893158 37748051 41609021 48087856 49325751 43928499 39082338 37391664
17922 37391664 35034689 30548697 27037600 26984874 30275477 34094891 35870305 38035078
17914 38035078 43519631 48118861 45330079 39238557 35825659 33586912 28980950 23374122
17906B3374122l925364j723625J71583K076811M185630N094105L100265J965747
17898C4319274M542267O456455R30534n223085m478127j472172k175262m233662
17890B8666222l319459j59405K859573L384455J466347J717848M840091M613567
17882D4069239k197150o087184l929606k239768m257990n910972m890777l186662
17874A1369130j999890j382424r98451p34142n56850m63803l70502k58103j45203
17865D459762m3878M0320N0643N892m6887q5680j41672j54627j35560l2583J12487
17854D028217K31409L20071L91055N11119O81405R57063J311467J831438K622437
17845A2885681L906324O266161J0462510J6402001K1097256K0904109J3205449
$$ plain form
17906 23374122 19448758 17725133 17896716 19973527 24159157 29253262 32353527 34319274
17898 34319274 38861541 45317996 46248530 41025445 36547318 35075146 32899884 28666222
17890 28666222 25346763 25187358 28046931 31431386 32897733 34615581 39455672 44069239
17882 44069239 41872089 35784905 31855299 29615531 25357541 19446569 14555792 11369130
17874 11369130 9369240 7986816 6988365 6254223 5697373 5233570 4863068 4604965 4459762
17865 4459762 4415884 4456204 4506847 4512739 4465852 4380172 4238500 4083873 3948313 3915730 4028217
17854 4028217 4259626 4579697 4970752 5481871 6163276 7120339 8431806 10263244 12885681
17845 12885681 16792005 23058166 33520676 49922677 71019933 91924042 105129491
17838A05129491J326948j1395186j9895645k1012967j6638864j1035501o844768
17831A9633508m315960k754670j855870j342635j050343q47258p15231n60153
17823F191388m41174l83790l61597k97765k24160j57640p6728o9101r2768q7363
17813C999302j01944q9845l6096O405Q4442R8786N5901L2400l1260n9229l0904
17802C927958k024P6865K33194M05485N38032O51964Q27076J081781J432494J996433
17792A1169258K847450M228916O534521J0344667J5449350K0807518K4179858
17785I5561538K3118718J6193577K786068j1005705k1856318k5732080k2850901
17778E6214897j6759175j0835294o794416m354306k900982k010745j502102j233687
$$ plain form
17838 105129491 106456439 95061253 75165608 54152641 37513777 26478276 19633508
17831 19633508 15317548 12562878 10707008 9364373 8314030 7466772 6751541 6191388
17823 6191388 5750214 5366424 5004827 4707062 4482902 4325262 4248534 4179433 4086665 3999302
17813 3999302 3897358 3807513 3771417 3777822 3862264 3961050 4016951 4049351 4018091 3958862 3927958
17802 3927958 3925934 4002799 4235993 4641478 5179510 5831474 6658550 7740331 9172825 11169258
17792 11169258 14016708 18245624 24780145 35124812 50574162 71381680 95561538
17785 95561538 118680256 134873833 137659901 126654196 104797878 79065798 56214897
17778 56214897 39455722 28620428 21826012 17471706 14570724 12559979 11057877 9824190
17770I824190j007858p95271o36896n47727m65017m04376l63314k76940k02291
17761E124500j61667j42755j33919j76521k09298k19216k15766k31567k18987
17752C414804k11609j72951j30937j15865m9393q237N4918J06318J45878J84265
17742C217191J77950K41062M01959O18358Q66157J178236J669911K645499M471111
17733A5487434P308865J0006515J0837312P660293J729610m939519r531166j0383405
17725B8175939q498502n818579l663380k311727j502247j007167p31312n37709
17717D105316m09893l05686k11153j29070j12495j31009j30336j51717j33019
17708B390938r9602p8573r7841r3801j03570j14205j35336j38392j23325q3019
$$ plain form
17770 9824190 8816332 8021061 7384165 6836438 6371421 5967045 5603731 5326791 5124500
17761 5124500 4962833 4820078 4686159 4509638 4300340 4081124 3865358 3633791 3414804
17752 3414804 3203195 3030244 2899307 2783442 2734049 2725812 2780730 2887048 3032926 3217191
17742 3217191 3395141 3636203 4038162 4656520 5522677 6700913 8370824 11016323 15487434
17733 15487434 22796299 32802814 43640126 51300419 53030029 48090510 38559344 28175939
17725 28175939 19677437 13858858 10195478 7883751 6381504 5374337 4643025 4105316
17717 4105316 3695423 3389737 3178584 3049514 2937019 2806010 2675674 2523957 2390938
17708 2390938 2291336 2212763 2114922 2021121 1917551 1803346 1668010 1529618 1406293 1323274
17698A323274n6580n4058l5634k9882k3395l7063n1520r455m3065n2442n2457
17687H77723n4476k6764l6221p5789p1218q3027m1763j8474n441J0208O9966Q8175
17675F32899J19561J77535K06058K10219J64376J2534j70120k12211k17544j87544
17665G35763j13051p5467q5807o4633l5508L995N3825M2439M9251O294j8413m5609
17653D53079q522J97k7312l2173J204q680n028o236r583n218K311Q383J0634J1493
17639C84549K8969M0769N3496O3147L9383J5245j4433p528J4406j9385o2061r6819
17627D39738n5748n6393n1051q232M899p626J5405O5608Q1209P2157R4380O5739
17615F60085L8988o2662j13426r7438q5695r1416l1984k7787o405l0553J8023
$$ plain form
17698 1323274 1266694 1212636 1177002 1147120 1123725 1086662 1035142 1025687 982622 930180 877723
17687 877723 823247 796483 760262 684473 613255 530228 488465 469991 464550 474758 544724 632899
17675 632899 752460 929995 1136053 1346272 1510648 1523182 1353062 1140851 923307 735763
17665 735763 622712 547245 461438 396805 361297 365292 419117 461556 510807 517101 498688 453079
17653 453079 444557 444754 417442 385269 386473 377793 372765 366529 356946 351728 354039 362422 373056 384549
17639 384549 413518 454287 507783 570930 610313 625558 611125 603597 618003 598618 536557 439738
17627 439738 383990 327597 276546 268314 273213 265587 280992 346600 427809 499966 594346 660085
17615 660085 699073 636411 522985 425547 339852 248436 216452 188665 182260 151707 169730
17604A69730K5352J658n941l0933k4576J0334p388j038j252K4848K2738L235M93
17591A87260q665j457k2064m9918l5894j3249m138L3590L9023Q667j4271J4175
17579A33059J2421n47k8430k8273k9140k8356j0218J7809J2741J2842J2329P315
17567H3552m657m010o329K251q195J0601n525J5052k677k7525j272q962J0657
17554E2961J7696P18K834r466j1120j549K9573m252k2495p648Q780j1971o586
17541C7475K859K9861k132L8477K6158L634R158m130k0833j1594j8274l6943k2521
17528C1195J2277k335J0316L0066j4115j9390n350q33K0608p50q662L741k0263
17515C6505P218N853P983K4472J6014J338j3020l2295j4086m769N256n23N319
$$ plain form
17604 169730 195082 196740 190799 159866 135290 145624 138236 137198 135946 160794 183532 186767 187260
17591 187260 178595 177138 155074 105156 69262 56013 51875 85465 124488 133155 118884 133059
17579 133059 145480 144933 116503 88230 59090 30734 20516 38325 51066 63908 76237 83552
17567 83552 78895 74885 68556 70807 62612 73213 67688 82740 80063 52538 51266 42304 52961
17554 52961 70657 71375 74209 64743 53623 52074 81647 77395 54900 47252 56032 44061 37475
17541 37475 40334 70195 68063 106540 132698 136332 145490 141360 120527 108933 90659 53716 31195
17528 31195 43472 41137 51453 81519 67404 48014 42664 41831 62439 61689 53027 56768 36505
17515 36505 43723 49576 57559 82031 98045 99383 86363 54068 39982 35213 40469 39946 45265
17502D5265m321J4045k1852l189J4741o697k1987p168P737m571N597J0547r984
17489A8163j3449j438J5909Q381P741K2355J1019K5061M0890K4747K499q743Q09
17476A53944j7095j4932l2227j3112k7502l069P140m073L0306M2657L8285K9509
17464A89831Q346K7287M2775K4383J7194l6851o2622k3385j6789r660k4862J0823
17452A46470K6534N1068n552L3201K3859J3622j8797l2153l148L2102L8483k4412
17440B81277m4183q937j8317M677M2542o775q404K2449K5673o44k5430K776K700
17427B69404p880j1301r239N06l351j3419N009J7831q178L609L616m2350k3376
17414A80881l651P867J8058j9574j5462q12J4293J8570M643q111l8120k3140q394
$$ plain form
17502 45265 40944 54989 33137 29948 44689 37992 16005 8837 16574 12003 17600 28147 18163
17489 18163 4714 3276 19185 27566 35307 57662 68681 93742 134632 159379 161878 153135 153944
17476 153944 136849 121917 89690 76578 49076 46007 53147 49074 79380 122037 160322 189831
17464 189831 198177 225464 268239 292622 309816 272965 210343 186958 170169 160509 135647 146470
17452 146470 173004 224072 218520 251721 275580 289202 270405 238252 235104 267206 305689 281277
17440 281277 237094 228157 209840 214517 257059 250284 241880 264329 290002 289358 263928 266704 269404
17427 269404 261524 250223 240984 241490 238139 224720 229729 247560 239382 242991 246607 204257 180881
17414 180881 177230 185097 203155 183581 168119 167307 181600 200170 204813 196702 158582 135442 127048
17401A27048O885k167O726P43K2954K3715p988J8039K3910j1795l3011j8506J548
17388A58101k8823r764j6513j5841K0009K4682J2447K6050K4430L3708L1848k5425
17376B34909l3294L207m939j8658k7364j6947r845J2385K3924N592P64K8m618
17363A65144k9454l4370N239K5839j7815o3883m7423K0938J0766K666j8199o075
17351A3373q795K787M3810J6959k640q826j3349j31n62j3176j227R31l412j0025
17337A5717N693K3795J0147l770k655L894R318k48K317K0887Q738K0768P7638
17324A92239J07713J13262Q4229L7064n8268j15785j13767p2172o1100l1717r806
17313G1892l0152j2392K176Q704j8058j1750n228Q197l4816l5014O954J1652R579
$$ plain form
17401 127048 133933 131766 138492 139235 162189 185904 177916 195955 219865 208070 175059 156553 158101
17388 158101 129278 119514 103001 87160 107169 131851 144298 170348 194778 228486 260334 234909
17376 234909 201615 204822 199883 181225 153861 136914 127069 139454 163378 168970 169734 169762 165144
17363 165144 135690 101320 106559 132398 114583 50700 3277 24215 34981 37647 19448 13373
17351 13373 4578 7365 51175 68134 65494 56668 43319 43188 42626 29450 28223 29154 25742 15717
17337 15717 21410 45205 55352 51582 48927 52821 62139 61891 64208 85095 93833 114601 192239
17324 192239 299952 413214 497443 534507 476239 360454 246687 174515 113415 81698 71892
17313 71892 41740 29348 31524 40228 22170 10420 5192 13389 -21427 -56441 -49487 -37835 -28256
17300b8256K6317O625L89Q02o558Q760j5075r634K4892K593j1128J7745N054J3674
17286C6200K2304J1912N949J815j6166l8245j2409m119K9731N004K5199J6185
17274H3360J2761M6950Q1209R6062J12372J21796Q3636Q1686L5773m2568r4267
17263F18770j17161j12729j06105o5535n3370o6099l2270Q962l314j7823J500
17252E4826L870j3743k1409J0840J0999J0299j8222J3302Q211j2723k8504J4985
17240C2731J4455j3224l668r545Q717K2299O044J7608J2478j1823k0263j3353
17228D2456P493p925k460K3631N05N656J677j4552j1420p22K3035J4011L5905
17215A17290N3286N9666P5959P4904K0822l1468q8442p9853n3990l2584l1119
$$ plain form
17300 -28256 -1939 4686 5075 5877 -681 8079 -6996 -16630 8262 10855 -273 17472 22526 36200
17286 36200 58504 70416 76365 78180 62014 23769 11360 7241 36972 41976 67175 83360
17274 83360 96121 143071 224280 320342 432714 554510 638146 719832 755605 713037 618770
17263 618770 501609 388880 282775 217240 163870 97771 65501 74463 71149 53326 54826
17252 54826 58696 44953 23544 34384 45383 55682 37460 50762 58973 46250 17746 32731
17240 32731 47186 33962 30294 20749 29466 51765 57809 75417 87895 76072 55809 42456
17228 42456 49949 42024 39564 63195 63700 69356 71033 56481 45061 44339 67374 81385 117290
17215 117290 170576 230242 306201 381105 401927 370459 282017 202164 148174 115590 84471
17204H4471l5134J9472M965p345l4495m1244p030J9461J148K8746j3744N046K0470
17191D4787J9987l1217k5196j5604J2234k395J1897L037J1496m140j9954j2784
17179g852J4700j1855K9294Q714j6131j9399k0626P264J2999L9134n912o412k2057
17166A861j6565J784L433J0639J4717n480n685J0295Q647j3389J4101K1985n963
17153D0380l465p296pN733n697J910M30j4980j7119L79l854p536K337J1071J8687
17138B0973K6473J1786k3536l0029O393J280l047j5528j445L358KK863J0199J6382
17124B6124M02k2177k5407k3311J980R714L2055q199p684J3774j125j013K0209
17111A5342J2045j3603k7887J3079J0869k6863J9493r915P359L811j5093j143
$$ plain form
17204 84471 49337 68809 73774 66429 31934 -9310 -16340 3121 4269 33015 19271 24317 44787
17191 44787 64774 33557 8361 -7243 4991 2596 14493 17530 29026 24886 4932 -7852
17179 -7852 6848 -5007 24287 33001 16870 -2529 -23155 -15891 -2892 36242 30330 23918 1861
17166 1861 -14704 -12920 -9487 1152 15869 10389 4704 14999 23646 10257 24358 46343 40380
17153 40380 36915 29619 29612 35345 29648 31558 31988 17008 -111 268 -3586 -11122 -8785 2286 20973
17138 20973 47446 59232 35696 5667 12060 13340 10293 -5235 -6680 -3322 -3320 -457 9742 26124
17124 26124 26526 4349 -21058 -44369 -42389 -32675 -620 -8819 -16503 -2729 -3854 -4867 15342
17111 15342 27387 13784 -14103 -1024 9845 -17018 2475 -7440 -81 3730 -11363 -12506
17099a2506j1803Q65K3597n14r330j3551k0248K4280K313j2625j0575j0079L284
17086d6892J3555J0357J7745N314o277L892l159j9685k726J2950J8006l813k8460
17073b9193J224K5384n355j5559J1032N248j891r024l0460K1009K5547K575p602
17060g065m254k820M3762j1868j1521q266j1301p495k862j1818J2684M457N175
17047a3192J9828K1348J3847k153K1549J0803j5559k4317p250l997o303J6557
17035C1161r509j4063k0539N63j956k524K254O225j848K2848K0529J3052k7727
17022A8466j9425j3761l370K7183j6143m699J9662K4452K2388n060J375N588j4508
17009D2148j1520n495n389P63k417l496k2323k4836J1160J4990K487O364j9665
$$ plain form
17099 -12506 -24309 -23444 153 -361 -9691 -23242 -43490 -19210 -16897 -29522 -40097 -50176 -46892
17086 -46892 -33337 -22980 -5235 79 -6198 -2306 -5465 -25150 -27876 -14926 3080 -733 -29193
17073 -29193 -27969 -2585 -7940 -23499 -12467 -7219 -9110 -18134 -48594 -27585 -2038 537 -7065
17060 -7065 -11319 -14139 29623 17755 6234 -2032 -13333 -20828 -23690 -35508 -22824 -18367 -13192
17047 -13192 6636 27984 41831 39678 61227 72030 56471 32154 24904 20907 14604 31161
17035 31161 21652 7589 -12950 -12387 -14343 -16867 -14613 -8388 -10236 12612 33141 46193 18466
17022 18466 -959 -14720 -18090 9093 -7050 -11749 7913 32365 54753 49693 51068 56656 42148
17009 42148 30628 25133 19744 20507 18090 14594 -7729 -32565 -21405 -6415 -3928 2436 -17229
16996a7229k2666j0956m632L387J2408K8703M0667O17j7397k468m928q974k7417
16983c0885J7796R362p070n694l601J915l600Q655K1605N321O86j8871k3085K94
16969b7172O355j8259J592K7753p333J9133J9093L77O425Q080k7860j2669j444
16956e929j391K5375Q351K473j924j8948r449o532L969Q550r483K0105J1451k9890
16942c272k6408n610m14R790J7912j3348l752q3L8245p595j5333J6690K8618J2017
16928D7457p507p499k0984k032k4090K819K6064Q832m14m188k4443j7841J892
16915b1934K3063p228k4619K2743O287N547o619j3124j5008O751K0630L6110j2549
16902B0050m007L455J277k993r900L187J8338O846m0655j3835M873L875k3716
$$ plain form
16996 -17229 -39895 -50851 -55483 -52096 -39688 -10985 29682 30299 12902 10434 5506 -3468 -30885
16983 -30885 -13089 -3727 -10797 -16491 -20092 -18177 -21777 -13122 8483 13804 14490 -4381 -27466 -27172
16969 -27172 -20817 -39076 -37484 -9731 -17064 2069 21162 21539 27964 36044 8184 -4485 -5929
16956 -5929 -7320 18055 26406 28879 26955 8007 -1442 -7974 -4005 4545 -4938 15167 26618 -3272
16942 -3272 -29680 -35290 -35704 -25914 -8002 -21350 -25102 -25185 13060 5465 -9868 6822 35440 47457
16928 47457 39950 32451 11467 9435 -14655 -11836 14228 23060 22646 18458 -5985 -23826 -21934
16915 -21934 1129 -6099 -30718 -7975 -1688 3859 -2760 -15884 -30892 -24141 -3511 32599 20050
16902 20050 16043 19498 20775 17782 7882 11069 29407 36253 -4402 -18237 -13364 -9489 -33205
16889c3205J7668J6672K828N299L7j6850O83o474j2234p167R438Q979J9511J8683
16875B3868J053j7097q532P11m661p112k972k067p216R367L331k2291O04K6327
16861f687J3179n275J0281j7996k5875L483J2168K480K3759j6693k0358L1629
16849D095J5770N12n492k245q026j116J4991l576p543J4403M550k4127l724j0235
16835a1763M954R749J65O337p735k1353q521J1656n118k1092k0805O683J8028
16822c8815P368k85J8M783J9295Q041o137K343J460j0904J1062k9566k378J8375
16808a5340K7783J0525p770J1061r247k0496r17J3491J4173Q505n713Q48j1809
16795A5094k6699j7532j70P637J3273k4096l361J4191q145j5154K5021L6394k2504
$$ plain form
16889 -33205 -15537 1135 3963 9262 9299 -7551 -6868 -13342 -25576 -32743 -23305 -14326 5185 23868
16875 23868 24921 7824 -708 3 -4658 -11770 -14742 -16809 -24025 -14658 -11327 -33618 -33014 -6687
16861 -6687 6492 1217 11498 -6498 -32373 -28890 -16722 -14242 9517 -7176 -27534 4095
16849 4095 19865 20377 14885 12640 4614 3498 18489 14913 7370 21773 26323 2196 -1528 -11763
16835 -11763 -6809 2940 3105 9442 1707 -19646 -28167 -16511 -21629 -42721 -63526 -56843 -38815
16822 -38815 -31447 -31732 -31714 -26931 -7636 405 -5732 -3389 -1929 -12833 -1771 -31337 -33715 -15340
16808 -15340 12443 22968 15198 26259 17012 -3484 -4401 9090 23263 31768 26055 26903 15094
16795 15094 -11605 -29137 -29307 -21670 -8397 -32493 -35854 -21663 -29808 -44962 -19941 16453 -6051
16782f051k1196J682N289R589o399Q068k1164n404K349k9706R449J0480K2282
16769b0732K0372J4394j7165k0082J8770q788R218L7196J9568m273l3021j4609
16757H48K2773K6275j4666q262j2096J0286J0384L79j1047k4874n412l155r213
16744a7780N688L083M791Q216l719j0142q482K1102O087m20r972O448L793m2654
16730c3961r718O894L489M396L881K4751J2675j4503J1523j0833j1488K5609J7843
16717C0558k947j7957p832j3332J2991l461J0699O843j0135J6542K803j2720P474
16704A9526P803K589j7950m4854Q46K1791J7767m306m754m961o663r972K455P853
16690a2830j6393P446n938Q507J6208l098O442j9043l5787J4511K2539J6799O415
$$ plain form
16782 -6051 -27247 -25565 -20276 -10687 -17086 -9018 -30182 -35586 -33237 -62943 -53494 -43014 -20732
16769 -20732 -360 14034 -3131 -23213 -4443 -13231 -4013 33183 52751 48478 15457 848
16757 848 23621 49896 35230 26968 14872 25158 35542 35921 24874 0 -5412 -8567 -17780
16744 -17780 -12092 -9009 -4218 3998 279 -9863 -18345 2757 8844 8424 -1548 4900 8693 -33961
16730 -33961 -43679 -36785 -33296 -28900 -25019 -268 12407 -2096 9427 -1406 -12894 12715 30558
16717 30558 27611 9654 1822 -11510 1481 -1980 8719 15562 5427 21969 24772 12052 19526
16704 19526 27329 29918 11968 -32886 -32040 -10249 7518 3212 -1542 -6503 -13166 -23138 -20683 -12830
16690 -12830 -29223 -21777 -27715 -19208 -3000 -6098 344 -18699 -54486 -39975 -17436 -637 5778
16677E778J8345j8598j9124M245K3049J6305j134k2662j6945k0859l385K702J5259
16664a7024K1252n62K038j0815j777L553j5711J6088P394J0282k854k1335K030
16651g441j5142J137J3208J2641R878J4775p289k4851q168K1516n828J9124k5883
16638b323P343K1003O701j8393j0160M535K8341J272l4107j0046O744K3354j2828
16625A1436l9602p128L032J2325J1706P490J3175L1018j0517j7824J129j30j7941
16612a831k3259m296K3173J5250o459l4233L664J9897J0240L945R611J562N293
16599B2557j6522l7486j0790N672J6227K802m671p577K1349j6100j4574K22j3928
16586e2819j0996o930L0093K9796M859k5642j068K9039k038k6946L306J2309p883
$$ plain form
16677 5778 24123 5525 -13599 -9354 13695 30000 28866 6204 -10741 -31600 -34985 -32283 -17024
16664 -17024 4228 3666 5704 -5111 -6888 -3335 -19046 -2958 4436 14718 11864 -9471 -7441
16651 -7441 -22583 -21446 -8238 4403 14281 29056 21767 -3084 -11252 10264 4436 23560 -2323
16638 -2323 5020 26023 32724 14331 4171 8706 37047 38319 4212 -5834 910 24264 11436
16625 11436 -28166 -35294 -32262 -19937 -8231 -741 12434 43452 32935 15111 16240 16110 -1831
16612 -1831 -25090 -29386 -6213 9037 2578 -31655 -27991 -8094 2146 6091 15702 17264 22557
16599 22557 6035 -31451 -42241 -36569 -20342 -17540 -22211 -29788 -8439 -24539 -39113 -38891 -52819
16586 -52819 -63815 -70745 -40652 -10856 -5997 -31639 -32707 -3668 -5706 -32652 -29346 -17037 -24920
16573b4920o228L9804K3940o154n174j3267l160n629Q086P060r608j5069j7119
16560b7438m73J4742j5579n264J128K7368o748J9820o433p967J1185j8246k4680
16547c8585Q975J3507J5118j3858j4202n359J1437J4448o70k988o732k7521L780
16534d2650q380k668J4991O727J7129L7766J7814m0988k607L0897M004N770j2671
16521B5134k6132j1476R319j3581j9214O002j3267l4913j2159K2372J0637o664
16509f3942p565j7069M3K7271K6369Q225R302Q942j209L985k1561P317L099K314
16495a4479j2339N565j2829j1033J1234J7723P965k943j7863J7352R807n137l6070
16482d3047j9071K3726M4081o34l9778L459K0045K0773k711j0621j1464m473m503
$$ plain form
16573 -24920 -31148 8656 32596 26442 21268 8001 4841 -788 7298 14358 4750 -10319 -27438
16560 -27438 -27911 -13169 -28748 -34012 -32884 -5516 -12264 7556 1123 -6844 4341 -13905 -38585
16547 -38585 -29610 -16103 -985 -14843 -29045 -34404 -22967 -8519 -9189 -12177 -18909 -46430 -42650
16534 -42650 -51030 -53698 -38707 -31980 -14851 22915 40729 -259 -2866 28031 32035 37805 25134
16521 25134 -998 -12474 -3155 -16736 -35950 -29948 -43215 -78128 -90287 -67915 -57278 -63942
16509 -63942 -71507 -88576 -88533 -61262 -34893 -26668 -17366 -8424 -9633 -5648 -27209 -19892 -16793 -14479
16495 -14479 -26818 -21253 -34082 -45115 -33881 -16158 -8193 -11136 -28999 -11647 -1840 -6977 -43047
16482 -43047 -62118 -38392 5689 5055 -34723 -31264 -11219 9554 6843 -3778 -15242 -19715 -24218
16469b4218k3208j9757r78o06K0452m812M728K5454J8657l54k5637j4684P727
16456c7236m41J1988J5333j6539j5924j2851J2186K3138L1037J1492k638l670
16444A5875J6933j1282j4713J8409k3222m1497j7223j497m821J6382K9103j4834
16432c2387k1055K3847L8043K8092l4068j9037N541M532Q724K839k1266L776n641
16419a8060j0630J8553K8142j4848j4699q44P255K4455K2605o409n857j3308l1299
16406a4944l2363J4138P670N24l617J1340j279N31J031L0775P232j4373n877K1790
16392B2578K0440J138j4360k6350r674p156q354j8118K4398o87q416J337p579
16379c0803N098j904j7177R022L2129Q726j7421j6798J851l853J0944p61K1791
$$ plain form
16469 -24218 -47426 -67183 -68161 -68767 -48315 -53127 -48399 -22945 -4288 -4642 -30279 -44963 -37236
16456 -37236 -37677 -25689 -10356 -26895 -42819 -55670 -43484 -20346 10691 22183 19545 15875
16444 15875 32808 21526 6813 25222 2000 -39497 -56720 -58217 -63038 -46656 -17553 -32387
16432 -32387 -53442 -29595 8448 36540 2472 -16565 -11024 -6492 2232 5071 -16195 -12419 -18060
16419 -18060 -28690 -10137 18005 3157 -11542 -12386 -5131 19324 41929 35520 29663 16355 -14944
16406 -14944 -47307 -33169 -25499 -24975 -28592 -17252 -18531 -18000 -16969 13806 21038 6665 788 22578
16392 22578 43018 44156 29796 3446 -6228 -13384 -21738 -39856 -15458 -16145 -24561 -23224 -30803
16379 -30803 -25705 -27609 -44786 -35764 -3635 5091 -12330 -29128 -27277 -31130 -20186 -20947 844
16366H44J9046l0361L743K4829r925n171j5178j2662J4107L3599L390j4411k4664
16353a2814k9376l716J3394K876L698K5301J4366j7843j7705Q021J0766k5606
16341b8638j9466L3534R794j3133R541Q059J1976N855J3807l1064j0607J6398
16329F056K2399j8373k8099m069P805l363j2989J4721L2847J8307J285j5634k8904
16316h011K867lK4132L026j8829L849K0829J0291k6883j8215N61R743N481j1127
16302b289J9805L8079J7167k1381n1750j5498J4883j6576j5377K947J6678q12
16290a4124n259M801j7442p658L5345J1157K6610j7261j0686N491J5528Q169K645
16277C7316j6352j1934l893l033R383J2647k1914j945P696j665k1739M440k284
$$ plain form
16366 844 19890 -10471 -6728 18101 8176 3005 -12173 -24835 -10728 22871 26261 11850 -12814
16353 -12814 -42190 -45906 -32512 -29636 -25938 -637 13729 -4114 -21819 -13798 -3032 -28638
16341 -28638 -48104 -14570 -4776 -17909 -8368 -309 11667 17522 31329 265 -10342 6056
16329 6056 28455 10082 -18017 -22086 -14281 -17644 -30633 -15912 16935 35242 36527 20893 -8011
16316 -8011 -5144 -5147 18985 22011 3182 7031 27860 38151 11268 -6947 -6386 3357 8838 -2289
16302 -2289 17516 55595 72762 51381 -369 -15867 -984 -17560 -32937 -29990 -13312 -14124
16290 -14124 -19383 -14582 -32024 -39682 -4337 6820 33430 16169 5483 10974 26502 34671 37316
16277 37316 20964 9030 5137 2104 11487 24134 2220 275 7971 6306 -15433 -10993 -13277
16264a3277k979K6806r317j0701N725m533J3337o071k1629j9819n446K4485K3528
16251A09N185j3325j0654l936P715J7307P380O647q191l5867j0805k115K1327
16238a9223J455k3155R095r963K6042K2263l0489k3500O251P211m500j9923J3174
16225d5262O423K8897J1070R004J7430m0133j5958J1434K060j13Q27J3784r614
16212a0151k356O00j0807j5612o65L990r866l659J7925Q056n179J9976l670k708
16198a4126P692j059j0263k4169j4504K4023J5481K8116J3629J078L0105p841
16186D8162l4151k4197n009J127r732j7703J3864J810L514L3336J981k1657j0733
16173a9388j0116J2152o299k7895p649K3984r766M388J3433J3303J3449j8184
$$ plain form
16264 -13277 -16256 10550 1233 -9468 -3743 -8276 5061 -1010 -22639 -42458 -47904 -23419 109
16251 109 5294 -8031 -18685 -22621 -14906 2401 9781 16428 8237 -27630 -38435 -40550 -19223
16238 -19223 -17768 -40923 -31828 -41791 -15749 6514 -23975 -47475 -41224 -34013 -38513 -58436 -45262
16225 -45262 -38839 -9942 1128 10132 27562 -12571 -28529 -17095 -15035 -15148 -14321 -537 -10151
16212 -10151 -12507 -11907 -22714 -38326 -38991 -35001 -44867 -48526 -30601 -22545 -27724 -7748 -11418 -14126
16198 -14126 -6434 -7493 -17756 -41925 -56429 -32406 -16925 11191 24820 25898 56003 48162
16186 48162 14011 -10186 -15195 -14068 -23800 -41503 -27639 -25829 -22315 11021 13002 -8655 -19388
16173 -19388 -29504 -17352 -23651 -51546 -59195 -35211 -44977 -40589 -27156 -13853 -404 -18588
16161a8588p134J8584q898O817M527J8895k252j4790j080k9929k1396M701j0312
16148f0855n935K8174K2405L348j83P728j8430L406J6499M963k2448j9565J4446
16135b6447J1700j6605q562J9961J385K2356K7641q259K272j4497n833K0623q697
16122A7038k1820q561k7677J4771J7766J380l7909j4185K2227J2262j1627j514
16110c7849J3602P354j6549l878K5878K0908R507K1502l911k4161n1399j1062
16098e0058Q078J7149J1594j009Q613L667j1480J393j2596M252r422l2812j1855
16085g4486J4897L5360l369q38j7132N591k955L677j9119Q950L3774L3496K2637
16072D0483j0099k6385L897K579j7117j0355J6435J3644k37l1900p273J2038j645
$$ plain form
16161 -18588 -25722 -7138 -16036 -9219 -4692 14203 11951 -2839 -3919 -33848 -55244 -50543 -60855
16148 -60855 -66790 -38616 -16211 -12863 -13046 -5318 -23748 -20342 -3843 1120 -21328 -40893 -26447
16135 -26447 -14747 -31352 -39914 -19953 -18568 3788 31429 23170 25442 10945 5112 25735 17038
16122 17038 -4782 -13343 -41020 -26249 -8483 -7103 -45012 -59197 -36970 -24708 -36335 -37849
16110 -37849 -24247 -16893 -33442 -37320 -11442 9466 18973 40475 36564 12403 -38996 -50058
16098 -50058 -41980 -24831 -13237 -14246 -5633 -1966 -13446 -12053 -24649 -20397 -29819 -62631 -74486
16085 -74486 -59589 -24229 -27598 -28436 -45568 -39977 -42932 -39255 -58374 -49424 -15650 17846 40483
16072 40483 30384 3999 7896 10475 -6642 -16997 -562 13082 12845 -19055 -26328 -14290 -15935
16059a5935l470K377J3047K0443N530l815m482q51k9359j5431J6123k489l56O257
16045a2411J7444q63k2859O448J005j7263j6628L4974J7088M17P884q679k9116
16032b2559j2179K1773K0234O109q358J1744j5171k6279k1566Q35K2117l07q05
16019b4412K1035j1732j6161j803p234J6097R497k063j4898j0593J2029J6705
16007a3533p100L961K3644J4017q941j2159J1424P517k4678J0610K9194k423m4302
15994a2769j2195L3370L958L162k2450j4123l212N938j8066L236n240j5996J4742
15981c9645L0143p269N80q283P472K5327m63r197n440j3495p820J9046Q080O731
15967E767K233o846k175q88J76k8561m618j0166o37K6059l665J797r002J0942
$$ plain form
16059 -15935 -19405 -17028 -3981 16462 21992 18177 13695 12844 -16515 -31946 -15823 -18312 -18668 -12411
16045 -12411 5033 4170 -18689 -12241 -11236 -28499 -45127 -10153 6935 7352 15236 6557 -22559
16032 -22559 -34738 -12965 7269 13378 5020 16764 1593 -24686 -46252 -45417 -23300 -23607 -24412
16019 -24412 -3377 -15109 -31270 -33073 -40307 -24210 -14713 -16776 -31674 -42267 -30238 -13533
16007 -13533 -20633 -16672 6972 20989 12048 -111 11313 18830 -5848 4762 33956 31533 -12769
15994 -12769 -24964 8406 12364 15526 -6924 -21047 -24259 -18321 -36387 -33151 -38391 -54387 -39645
15981 -39645 -9502 -16771 -16191 -24474 -17002 8325 7862 -1335 -6775 -20270 -28090 -9044 -964 5767
15967 5767 8000 1154 -1021 -1909 -1733 -30294 -34912 -45078 -45715 -19656 -23321 -21524 -30526 -19584
15953a9584N3390P843l2941o75r422j5072j1212j529q217m162N772J4161J1560
15940a0088J6245K0334j010m879j3763J629J9037j1834o144l241J5260K4814j9452
15927B6908k4893j7340j4665J1477l084L6L9071K4028j0610k6859J069j594j4329
15914a0785N085o276l886j32j2877q168J8164J7148l731l7170j0378J3750M700
15901c4556K4223l526j1844Q762J1352n637O898J1517K4892K798j6704j7465L308
15888D018q557k4830k0315P801O398L6102Q051l141J071O02o246j3809K0052q729
15874a532l0365M782L761Q612L4754O781j0922l818p460j0553K385q771q624J1893
15860i077P683J3363o263k1360J4127K6302L332k0109j4423K884p432J2909k339
$$ plain form
15953 -19584 33806 41649 8708 8033 -1389 -16461 -27673 -29202 -37419 -41581 -35809 -21648 -10088
15940 -10088 6157 26491 25481 20602 6839 8468 27505 15671 9527 6286 21546 46360 26908
15927 26908 2015 -15325 -29990 -18513 -21597 -21561 17510 41538 30928 4069 5138 3544 -10785
15914 -10785 -5700 -11976 -15862 -15994 -28871 -37039 -18875 -1727 -5458 -42628 -53006 -39256 -34556
15901 -34556 -10333 -13859 -25703 -16941 -5589 -11226 -4328 7189 32081 34879 18175 710 4018
15888 4018 -4539 -29369 -49684 -41883 -35485 617 8668 5527 6598 7200 954 -12855 7197 -1532
15874 -1532 -31897 -27115 -23354 -14742 20012 26793 15871 12053 4593 -5960 -3575 -12346 -20970 -9077
15860 -9077 -1394 11969 5706 -15654 -1527 24775 28107 7998 -6425 -3541 -10973 1936 -403
15847d03k3113l1380J353R650N95J6423L4678O027L009K279M192j4166k9331m195
15833b4382L8704L2842k3330k6386r963J4987K4768j1163J2486m751p396J4569
15821C0985p896j585L628L228k6658o616O808j3840J3390J0711p537J0509J1536
15808B6663k4413K542K1183n911l0407n866Q716k0088j9230N476K4534K778k086
15795a6109R970j8414p464K4879O637l43J9495K214j9454N538J2162n627k2934
15782i450k9788j4567q623L0167K4410J6637p40k5436k404k982M655N084R726
15769c311j4041J1762J7988K705p564J7890R609j6573k6868N841o91j0216J2978
15756d91J2129K3042P904k1342k4007p171j1105j7990l563K2146K3879p402m223
$$ plain form
15847 -403 -23516 -54896 -53543 -43893 -43298 -26875 7803 13830 16839 19118 23310 9144 -20187 -24382
15833 -24382 14322 47164 23834 -2552 -12515 2472 27240 16077 28563 23812 16416 30985
15821 30985 23089 21504 25132 28360 1702 -4914 1894 -11946 1444 12155 4618 15127 26663
15808 26663 2250 4792 25975 20064 -10343 -16209 -7493 -27581 -46811 -41335 -16801 -14023 -16109
15795 -16109 -6139 -24553 -32017 -7138 -501 -844 18651 20865 1411 6949 19111 13484 -9450
15782 -9450 -39238 -53805 -62428 -32261 -7851 8786 8046 -17390 -19794 -22776 -18121 -13037 -3311
15769 -3311 -17352 -5590 12398 15103 7539 25429 35038 18465 -8403 -2562 -3253 -13469 -491
15756 -491 11638 34680 42584 21242 -2765 -9936 -21041 -39031 -42594 -20448 3431 -3971 -8194
15743h194Q467J9687k429j6975k4219j0270K2148K3498k0207k0127o024L565J6770
15730a4310o162J6283Q90J5028K2220m857k0064l7666j6674J5484J999J8506L8101
15717B8778N511j6434j7385K343j1571k2871O503J6619J2310K4723K205l455p407
15704A9869L926j6884l3349J8911k534J2454p776n436n178J2091J3366R504l1174
15691a2210q212J1091J7417J3188K388j2240j8600j3101J4145K0770k450r947
15679B239k9965J752L1516J6323R518j8287J3464J7116j9567l6799J798K509k2897
15666c1280Q466J9830L646j8695j038J6687m360J2627j0079j4259j6220J8074
15654a6601L2993Q905m001M094J7344N878j2987k506N339l435j328Q47O338j966
$$ plain form
15743 -8194 273 19960 17531 556 -23663 -33933 -11785 11713 -8494 -28621 -34645 -31080 -14310
15730 -14310 -20472 -4189 -3299 11729 33949 29092 9028 -28638 -45312 -29828 -27829 -9323 28778
15717 28778 34289 17855 470 2813 -8758 -31629 -25126 -8507 3803 28526 30731 27276 19869
15704 19869 23795 6911 -26438 -7527 -10061 2393 -5383 -10819 -15997 -3906 9460 18964 -12210
15691 -12210 -20422 -9331 8086 21274 23662 11422 -7178 -20279 -6134 14636 12186 2239
15679 2239 -27726 -25974 5542 21865 31383 13096 26560 43676 24109 -12690 -10892 -8383 -31280
15666 -31280 -22814 -2984 662 -18033 -19071 -2384 -6744 5883 -4196 -18455 -34675 -16601
15654 -16601 16392 25297 21296 25390 42734 48612 35625 33119 38458 35023 33695 34542 40880 38914
15640C8914k2124j7627q629J155J2425J6551J5484j7786O170k069j4170j4812
15628f518j0698j9626P682m885N374J1487K0107j2334j0419J6544J1975j032J1430
15615A9087R257p706j3562j5880L594J3227P325k131L445j9160j0458R742K0604
15602A7384m275j7153k944P333K0584J8043j5316k5335j9689J3125L13j9455L
15589b7382J2096J9601P398m974k2507J0118m365Q705J8383M304l1699n1344J94
15576f1472J1554J8095j1473k2941j479K3763j1470k4018J9072m585J5264K2175
15564b7515l656R559q033p427P424J0628J6976J4319k3062j8435k111J9722R339
15551b272Q957K6267k7725k1702j7875O295L0505L48J2892K021q583j2993r391
$$ plain form
15640 38914 16790 -837 -9466 -8311 4114 20665 36149 18363 24533 22464 8294 -6518
15628 -6518 -17216 -36842 -29160 -34045 -28671 -17184 2923 -9411 -19830 -3286 8689 7657 19087
15615 19087 28344 20638 7076 -8804 -5210 8017 15342 13211 16656 -2504 -12962 -3220 17384
15602 17384 13109 -4044 -6988 345 20929 38972 23656 -1679 -21368 -8243 -7930 -27385 -27382
15589 -27382 -15286 4315 11713 6739 -15768 -5650 -10015 -1310 17073 21377 -10322 -61666 -61472
15576 -61472 -49918 -31823 -43296 -66237 -67716 -43953 -55423 -79441 -60369 -64954 -49690 -27515
15564 -27515 -31171 -21612 -29645 -37072 -29648 -19020 -2044 12275 -10787 -29222 -31333 -11611 -2272
15551 -2272 6685 32952 5227 -16475 -34350 -28055 2450 2798 15690 17711 9128 -3865 -13256
15538a3256j729j0323q712m051j1470j1280L8718J7828p163l3815m607k805J3436
15525c9229J2462J4696j7999m745M131K0261K5582m911Q858K0208k0837l9361
15513b0884m471L268j026J4336J0639K8300k192j6047l3835j0958J0209j3748
15501c6409j4942K3460K0021k385K939m236j9589N969Q833O4j4615Q031K3786
15488I27l65J1097k5977j3470j57K1461j6969k2436J2847K8436Q475l1940q952
15475c7023j5385n83M3699M0507L813j410j6298j4675j2977K335R852O404k1556
15462a3297r858J0815j77j5395P76N989J8123K4079k1552L322N791Q789k0400
15449b995j2728O534k4993p352K2735J4683O94p27J126j9792n780L582J430r572
$$ plain form
15538 -13256 -14985 -25308 -34020 -38071 -49541 -60821 -22103 -4275 -11438 -45253 -49860 -52665 -39229
15525 -39229 -26767 -12071 -30070 -34815 -30684 -10423 15159 10248 19106 39314 18477 -20884
15513 -20884 -25355 -22087 -23113 -8777 1862 30162 27970 11923 -21912 -32870 -22661 -36409
15501 -36409 -51351 -27891 -7870 -10255 -7316 -11552 -31141 -25172 -16339 -16275 -30890 -22859 927
15488 927 562 11659 -14318 -27788 -27945 -6484 -23453 -45889 -33042 -4606 3869 -28071 -37023
15475 -37023 -52408 -52991 -9292 31215 35028 33618 17320 2645 -10332 -7997 1855 8259 -13297
15462 -13297 -23155 -12340 -12517 -27912 -27136 -21147 -3024 21055 -497 2825 8616 17405 -2995
15449 -2995 -15723 -9189 -34182 -41534 -18799 -4116 -3422 -4149 -3023 -22815 -28595 -25013 -23583 -33155
15435c3155m518J3823O008K8880n159k7027L016Q47K4518L206L193n245M529m553
15421H363J0527K769j6142l342P825M928J10n474k830q118j992Q963R18J1017
15407A7522M637L87l83j0348j8449j9745O742J8001l0466l7037N884J8228J704
15394d3323m065J799J148R355K6002J0872Q459p399R91l341j5878O218J7825K71
15380H934L464J0956K877O022j0311l1053j0438l654J954J5407j2758r978r67
15367b9545O436p91Q679O257K933L125j3928k3158J2511j852j0116N992N344J2054
15353a6059J1482j048J0957j6556j9238l873L2081K1723n235p930m672j0321J0007
15340A318J6241J2096m17n096l805k8283m489j0065O24J3406J8494K6171j8793
$$ plain form
15435 -33155 -37673 -23850 -17842 11038 5879 -21148 -18132 -17285 7233 10439 13632 8387 12916 8363
15421 8363 18890 21659 5517 2175 10000 14928 15038 9564 6734 -1384 -3376 5587 6505 17522
15407 17522 22159 22546 22163 11815 -6634 -26379 -19637 -1636 -32102 -69139 -63255 -45027 -43323
15394 -43323 -47388 -45589 -44441 -35086 -9084 1788 10247 2848 3839 498 -15380 -9162 8663 8934
15380 8934 12398 23354 26231 32253 21942 -9111 -19549 -23203 -21249 -5842 -18600 -28578 -29545
15367 -29545 -23109 -23900 -15221 -8964 -6031 -2906 -16834 -39992 -27481 -29333 -39449 -33457 -28113 -16059
15353 -16059 -4577 -5625 5332 -11224 -30462 -34335 -2254 19469 14234 6304 1632 -8689 1318
15340 1318 17559 29655 29238 24142 20337 -7946 -12435 -22500 -21876 -8470 10024 36195 17402
15327A7402l1265R120J3204j3066j5470J1719K962J8208J690K3005j4044j4310
15315I155l115j2220l4400j404L7660L9507Q00j5223k8879k368L4691p156j2305
15302D743L653J1598k2976K02q69m508q965J1895J1198j388J614j3640k5098J4810
15288a7731l257j4879j0458o279J1633J6735R849j0641R324L39j0505M847q358
15275b9381K969o118J604K1555R198j4290P795J0444J2953R017r788k9470J2003
15262a509L3058n630j4261o916m524K1908R426o786j7569l2655q118P994j8657
15249d4239J592K4190K244j4789P823O157J2304M278J7915K9225j5213k4762L31
15236G056j3390O191K2856r989l631M337j999k5592k5250p389R50R515m941R767
$$ plain form
15327 17402 -13863 -4743 8461 -4605 -20075 -8356 -5394 12814 14504 37509 23465 9155
15315 9155 6040 -6180 -40580 -41984 -4324 35183 35983 20760 -8119 -10487 24204 17048 4743
15302 4743 8396 19994 -2982 -2780 -3649 -8157 -17122 -5227 5971 4583 6197 -7443 -32541 -17731
15288 -17731 -20988 -35867 -46325 -52604 -40971 -24236 -14387 -25028 -15704 -15365 -25870 -21023 -29381
15275 -29381 -26412 -32530 -30926 -9371 -173 -14463 -6668 3776 16729 25746 15958 -13512 -1509
15262 -1509 31549 25919 11658 4742 218 22126 31552 24766 7197 -25458 -33576 -25582 -44239
15249 -44239 -42647 -18457 -16213 -31002 -23179 -17022 -4718 -440 17475 46700 31487 6725 7056
15236 7056 -6334 -143 22713 12724 9093 13430 11431 -14161 -39411 -46800 -45850 -36335 -41276 -31509
15222c1509J1169M035K450k0794J2918N926J4485K5364l171o549j9605J4878P430
15209A7027q316k3678N398J1057O641L33l99k4143k1418J1202K1977J3063k3925
15196a5181j1732Q751J4112P834p209L590k3448r403K0040J6005j282J6536j846
15183A6767j3505J0113l4796j0904l011K2743K2256J483j8787k324j6103j898
15171b7966k557n768J5048Q287p372l016m198l932J4712J5109R492k2881k5110
15158d0152J8653K3505J6848o045k952r048K3319O833k0367P21o358M121N039
15145A4117j0119k2674J3051K970m329k13k187R706j077j0402L517J3992N56J4042
15131B0950J3437l874p321j8047o314l018j1735J4711j0263N562L3844k0132j0498
$$ plain form
15222 -31509 -20340 -16305 -13855 -34649 -21731 -15805 -1320 24044 20873 14324 -5281 9597 17027
15209 17027 8711 -14967 -9569 1488 8129 8462 8063 -16080 -37498 -26296 -4319 8744 -15181
15196 -15181 -26913 -18162 -4050 3784 -3425 165 -23283 -32686 -12646 3359 2077 18613 16767
15183 16767 3262 13375 -21421 -32325 -35336 -12593 9663 11146 -7641 -9965 -26068 -27966
15171 -27966 -30523 -36291 -21243 -12956 -20328 -23344 -27542 -31474 -16762 -1653 7839 -15042 -40152
15158 -40152 -21499 2006 18854 12809 9857 809 24128 30961 10594 11315 4957 9078 14117
15145 14117 3998 -18676 -5625 -2655 -6984 -7197 -9384 322 -755 -11157 -7640 6352 6908 20950
15131 20950 34387 30513 23192 5145 -1169 -4187 -15922 -1211 -11474 -5912 27932 7800 -2698
15118b698j5595L857R687J965j8469k2900K1490M41n343J9875L4895l0242r709
15105a2746p3M663J0400J0768R978j2032J8218N270O103k7947k569L3061N700
15092D8794j7877k6628j7342k0728o681n79k6505R890j181L0923M5535K3772k529
15079C8864r350k3208J885K314k809P943n729j6357k3735M93J7647J0029J8580
15066A6567J6220k0249n798k7226O950L061J3460K0604j1549k840l427k0092j3576
15053b7895K3285j472J3406l2397m1570L3126K1962k574m411j2737K5387m17k0856
15040b7163J7460K6477n545k2978p811J1618J7335J0358o40j1177j8051k2164
15028c2281K7891L357J7773q169j1350J961J8731p41k4143j0567o938M0583P426
$$ plain form
15118 -2698 -18293 -14436 -4749 -2784 -21253 -44153 -22663 -22222 -27565 -7690 27205 -3037 -12746
15105 -12746 -12819 -8156 2244 13012 22990 10958 29176 34446 40549 12602 10033 43094 48794
15092 48794 30917 4289 -13053 -33781 -40462 -41041 -67546 -57656 -58837 -27914 17621 41393 38864
15079 38864 29514 6306 8191 10505 7696 15639 9910 -6447 -30182 -29689 -12042 -2013 16567
15066 16567 32787 12538 6740 -20486 -13536 -10475 2985 23589 12040 9200 5773 -14319 -27895
15053 -27895 -4610 -6082 7324 -25073 -66643 -33517 -11555 -14129 -18540 -31277 -5890 -6307 -27163
15040 -27163 -9703 16774 11229 -11749 -19560 -7942 9393 19751 19111 7934 -10117 -32281
15028 -32281 -4390 -1033 16740 8571 -2779 -818 17913 17172 -6971 -17538 -24476 16107 23533
15015B3533q778M339n856J2459q566k9407m662q866j839k5376R841K6081O37j5973
15001c2433J3569M986J642N699J14J1430J2552j5718j4065K5076J2024j9023o527
14988f74J3003O416J4879K29q972M090q649J317n054l3357l1828j1356J3543M787
14974d1626O180J2865R202K1282o941j1458r464q986l674J6803J711K1058K214
14961I166j6496k1646j539r581J7751K0370j4287k069J7251J6500L053l36k1514
14948c377k2150n295j2405j5002N224J0226K1333o611J6187J5680K4649J7012
14936D5471j6962k1047k1581j3610K3221J8137j2255q189j4866j014R069P915
14924e711R859R48O062N680k1751J7472K632O681j9876j4874J0146n449k417k820
$$ plain form
15015 23533 14755 19094 13238 25697 17131 -12276 -16938 -25804 -27643 -53019 -43178 -17097 -16460 -32433
15001 -32433 -18864 -13878 -12236 -6537 -6423 5007 17559 1841 -12224 12852 24876 5853 -674
14988 -674 12329 18745 33624 33853 24881 28971 20322 21639 16585 -16772 -48600 -59956 -46413 -41626
14974 -41626 -35446 -22581 -13379 7903 962 -10496 -19960 -28946 -32620 -15817 -14106 6952 9166
14961 9166 -7330 -28976 -30515 -40096 -22345 -1975 -16262 -18331 -1080 15420 18473 18137 -3377
14948 -3377 -25527 -30822 -43227 -58229 -53005 -42779 -21446 -28057 -11870 3810 28459 45471
14936 45471 28509 7462 -14119 -27729 -4508 13629 1374 -6815 -21681 -22695 -13626 -5711
14924 -5711 4148 5096 11158 16838 -4913 12559 15191 21872 1996 -12878 -2732 -8181 -10598 -13418
14910a3418k6956J6509L4083J3133j3649O558p72m975r580p696R309p823j3975
14897a9252J0905j271M731J8409K1729r845k7989q676k76J4728M905j0111l584
14884e597K7283N677r647j816l0410L282k115J4000M052n540p207j2568J3363
14871g243J3485M655p192j7229M1763Q742k643N065p760j6p300p812m7068k0617
14857e1170K0611K6626J5179l684j5473o262L063M939j607l270P653J5723K9804
14844D2132j5675j8383R463m30j0781J0741J502j6725Q531K474N591k4590p907
14831a4057K1553r477k333L652p745J2387q322k0112J1044L368o311J5451L7604
14818C6702J1791j2802r153l9921k418M8311Q531k7168J0700m008j2480j0121
$$ plain form
14910 -13418 -40374 -23865 10218 23351 9702 16260 15488 10513 933 -6763 2546 -5277 -19252
14897 -19252 -8347 -9618 -4887 13522 35251 25406 -2583 -11259 -11535 3193 8098 -2013 -5597
14884 -5597 21686 27363 17716 15900 -14510 -11228 -13343 657 4709 -831 -8038 -20606 -7243
14871 -7243 6242 10897 3705 -13524 28239 36981 34338 39403 31643 31627 24327 16515 -30553 -51170
14857 -51170 -30559 -3933 11246 7562 -7911 -14173 -11110 -6171 -7778 -11048 -3395 12328 42132
14844 42132 26457 8074 17537 17107 6326 17067 18569 1844 10375 12849 18440 -6150 -14057
14831 -14057 7496 -1981 -4314 -662 -8407 3980 -4342 -24454 -13410 -10042 -16353 -902 36702
14818 36702 48493 35691 26538 -13383 -15801 32510 41041 13873 24573 20565 8085 -2036
14806b036k512Q041j7852m869J3014R202k9939J7859J9519k0786o919O993J3599
14793C314P074K0936L120K522K593j8840n910N102j333l2139j4488Q26J1922j001
14779a6302L049J2069m293j1812J8504K8983k9158m1553M88N1058K086j6148j8204
14766b1233J1240j3963j3005R804J7732m819o987j9688r072R636r393k036L723
14753d8061K9034k2813Q844j0019M620K1661L4656L723l2093j8202L34K2379K0042
14740A4105m718m542O664N2L831o28k6847k1371N751M0696Q074J5816j0197l9213
14726a2527m426J6446M220p154k5680k93K0177J5842J8978j7787j9444j1148R215
14713a3581O888Q92p493J1939P096K4090K0689k47j633k3469l970J2699O861n022
$$ plain form
14806 -2036 -4548 3493 -14359 -19228 -6214 2988 -26951 -9092 10427 -10359 -17278 -10285 3314
14793 3314 10388 31324 34444 36966 39559 20719 14809 19911 18578 -13561 -28049 -27223 -15301 -16302
14779 -16302 -13253 -1184 -5477 -17289 1215 30198 1040 -40513 -40025 11033 13119 -3029 -21233
14766 -21233 -9993 -23956 -36961 -27157 -9425 -14244 -21231 -40919 -49991 -40355 -49748 -51784 -48061
14753 -48061 -19027 -41840 -32996 -43015 -38395 -16734 17922 21645 -10448 -28650 -28316 -5937 14105
14740 14105 9387 4845 11509 11561 15392 14764 -12083 -33454 -27703 12993 21067 36883 26686 -12527
14726 -12527 -16953 -507 3713 -3441 -29121 -29414 -9237 6605 25583 7796 -11648 -22796 -13581
14713 -13581 -6693 -5801 -13294 -1355 5741 29831 50520 50273 48640 25171 21201 33900 40761 35739
14699C5739j0178n675M185J4750j1096j6357k7063j1426J3699Q548Q131p820n398
14686i961J613J1132q944M4449K6500k3246j0110l7192K043L886k21J1912n450
14673F411r27k685N675L5054O937j1439L91j0288p536K6863N066r203j4190k8541
14659A588p934J4019j3793j3102J364k6348p070J8533J9052L722K1779K305N631
14646A9746J6308N161j0042p512O521q673j9595k1508j8006K6522K3325l145j2921
14633c819q323m439R981L0813r877j865M582j368j2691Q215J9747K6646k4022
14620C3580k4886j030m653r749j3868J3941K1004j405j6606j12K3418K2065q43
14607D0856j535p034k7509j1999K0851K8404o610m1410j6660K9619O957k745q772
$$ plain form
14699 35739 25561 19886 24071 38821 27725 11368 -15695 -27121 -13422 -4874 3257 -4563 -9961
14686 -9961 -8348 2784 -6160 38289 64789 41543 31433 -5759 -3716 170 -51 11861 6411
14673 6411 5484 2799 8474 43528 50465 39026 39417 29129 21593 48456 53522 44319 30129 1588
14659 1588 -6346 7673 -6120 -19222 -17858 -44206 -51276 -32743 -13691 -9969 11810 14115 19746
14646 19746 36054 41215 31173 23661 30182 21509 1914 -19594 -37600 -11078 12247 9102 -3819
14633 -3819 -12142 -16581 -6600 24213 14336 12471 17053 15685 2994 11209 30956 57602 33580
14620 33580 8694 7664 3011 -6738 -20606 -6665 14339 12934 -3672 -3784 19634 41699 40856
14607 40856 39321 32287 4778 -7221 13630 42034 35424 -5986 -22646 6973 13930 11185 2413
14594B413j7981k5459k1462R759m330J8094J9029J2462J8752k107j9788L4185
14582B3567L0962l7378l5778J1708J0277J2937l217j3927J6188K1050M35k1745
14570A5079k5845j6913R938j1419j3076N133J4105J9534J6747q843J2521L0086
14558D7047j408k3930k6995m011J1520r068j0139r177l1020J7368K7180k2j234
14545a3889o62J9234K2340j4284m776P392j3217K495Q89L5857j448k5157j3730
14532A044M808j3852k4112J7777j2782N215J333L1081J1322r619l5952n4J2482
14519a1309j9641l096K1394j6440r982j2510J671j809J9181J6693K2724K3470
14507C0346r162Q716k7678m3079j1752K2349L2248k723J7584j67o481m425r672
$$ plain form
14594 2413 -15568 -41027 -62489 -52730 -57060 -38966 -19937 -7475 11277 9170 -10618 23567
14582 23567 54529 17151 -18627 -6919 3358 16295 13078 -849 15339 36389 36824 15079
14570 15079 -10766 -27679 -17741 -29160 -42236 -37103 -22998 -3464 13283 4440 16961 47047
14558 47047 45639 21709 -5286 -9297 2223 -6845 -16984 -26161 -57181 -39813 -12633 -12655 -13889
14545 -13889 -14551 4683 27023 12739 7963 15355 2138 4633 5522 41379 39931 14774 1044
14532 1044 5852 -8000 -32112 -14335 -27117 -21902 -20569 10512 21834 12215 -23737 -23791 -11309
14519 -11309 -30950 -34046 -12652 -29092 -39074 -51584 -49913 -51722 -32541 -15848 6876 30346
14507 30346 21184 29900 2222 -40857 -52609 -30260 1988 -735 16849 16682 10201 5776 -3896
14494c896M560j3863m648K6279j0750K143K1066o375j9500p145Q798K1872j466
14481A7075p798j7692j573O318o513J7565j5564l0865J2195j531K702K6652J5728
14468A6699q466k2299j0568j7912J2287J7971K1257O845k1241l5311n854m391
14456e0983p461K1719J3805K6468J3330k1429K1784K124j4838j4502n968J5561
14444c90l798O186j6828O543l093L1556J4007l582k3690m3202Q761K7832q001
14431g699j5741j4943j1982m712P559L7382J778m576k1142n254L4445J0203P929
14418A3247K6968J3216j5411k7515k2705m2963J0501L2521K4062k1320j2186L061
14406a8524K1726M7105j8225k7960j1525O709K8230n503l722k3086K160M284j056
$$ plain form
14494 -3896 664 -13199 -17847 8432 -2318 -175 20891 14516 -4984 -12129 -3331 18541 17075
14481 17075 9277 -8415 -9988 -3670 -10183 7382 -8182 -39047 -26852 -28383 -25681 971 16699
14468 16699 8233 -14066 -24634 -42546 -30259 -12288 8969 15814 -5427 -40738 -46592 -50983
14456 -50983 -58444 -36725 -22920 3548 16878 -4551 17233 19357 4519 -9983 -15951 -390
14444 -390 -4188 1998 -14830 -8287 -11380 20176 34183 30601 6911 -36291 -27530 302 -7699
14431 -7699 -23440 -38383 -50365 -55077 -47518 -10136 -8358 -12934 -34076 -39330 -4885 5318 13247
14418 13247 40215 53431 38020 10505 -12200 -55163 -44662 -12141 11921 -9399 -21585 -18524
14406 -18524 3202 50307 32082 4122 -7403 -694 27536 22033 18311 -4775 -2615 1669 613
14393F13J995J2965j302j9577j7159P891k159j5195K4503P42j1397L558J0802
14380c720M689Q212k2126J2223j960m727J753k887q35j6919L789l065m711K6476
14366c808K8218p00l493J1108J3926j3733k7043k4136l113N078o104K2339p365
14353h826r841m763j4038K0855P284k4960N009L1447K6899M800j9991k7777l9555
14340e3457J1564K9018J1332J7422j4798j8278K875n47K116Q421Q826j9092J5543
14327I45J9789q240j4317J4749r04k7154m867O226o169J9801J3958K2160l0932
14314E045j052P926K346J636r491n512J2571K345k666j0188j6467j5603m055O87
14300c2478P048Q148P743l44L4847R413r43n855j0643k7883q903j0437K4591L4477
$$ plain form
14393 613 2608 15573 14271 -5306 -22465 -14574 -16733 -31928 -7425 -6683 -18080 -14522 -3720
14380 -3720 969 9181 -12945 -722 -2682 -7409 -5656 -8543 -9378 -26297 -22508 -25573 -30284 -3808
14366 -3808 24410 23710 20217 31325 45251 31518 4475 -19661 -22774 -17696 -23800 -1461 -8826
14353 -8826 -18667 -23430 -37468 -16613 -9329 -34289 -29280 2167 29066 33866 13875 -13902 -53457
14340 -53457 -41893 -12875 -1543 15879 1081 -17197 -14322 -14869 -12753 -4332 4494 -14598 945
14327 945 20734 12494 -1823 12926 12022 -15132 -19999 -13773 -19942 -141 13817 35977 5045
14314 5045 3993 11919 14265 15901 6410 898 13469 15814 13148 2960 -13507 -29110 -33165 -32478
14300 -32478 -25430 -17282 -9539 -9883 24964 34377 33434 27579 16936 -10947 -19850 -30287 -5696 28781
14286B8781p239j2564j5303J0827O091j4085N980J2516O14k2140m787k385J1081
14273b613J7239k4163l215L184J4166J3215k764j2880j0469J6059L583k2226j5805
14260b6689R853R195K7271k919m10J1339k7269l0905r59L333R113l943j1938M2984
14246H056J8678L061l624N629R211k4120j9135j5806q794K2051K3578j2236K018
14233H567K5312m516L820j5259o31j1772j4371m822k4541k8282j3444J4168n481
14220g1252J5197J1421r063R442K8800J7090n511j9357P03J1210J3852K0804j0640
14207A2696j0541p084j1695p320L756k925Q197M882J9750m182r942N365R834J0701
14193B1492P037j9737k492k3208q410K0122L043q299l2791K8870K0537l839r885
$$ plain form
14286 28781 21542 8978 -6325 4502 10593 -3492 2488 15004 15618 -6522 -11309 -13694 -2613
14273 -2613 14626 -9537 -12752 -9568 4598 17813 15049 2169 -8300 7759 11342 -10884 -26689
14260 -26689 -16836 -7641 19630 16711 16301 27640 371 -30534 -31493 -28160 -19047 -22990 -34928 8056
14246 8056 26734 29795 26171 31800 41011 16891 -2244 -18050 -26844 -4793 18785 6549 8567
14233 8567 33879 29363 33183 17924 17293 5521 -8850 -13672 -38213 -66495 -79939 -65771 -71252
14220 -71252 -56055 -44634 -53697 -44255 -15455 1635 -3876 -23233 -22530 -11320 2532 23336 12696
14207 12696 2155 -4929 -16624 -23944 -20188 -23113 -14916 -10034 9716 5534 -4408 957 10791 21492
14193 21492 28529 8792 6300 -16908 -25318 -5196 -2153 -10452 -43243 -14373 6164 2325 -7560
14180g560k4461k661M481R724P244k6200Q513K0580n54M040J8777J679j2468P558
14166H692j5653k3507Q667M616K413k827j3764J517M341k354l94n674J7525J5014
14152a388J2834Q557k3459k5614o910j1978M324J2362n920J1161K5264n100p689
14139a3556J7905j4311O743Q292j617P961q604j8897m733o624j3868J1162j729
14126c1876R005M163l933K9538J8583k9698j1602J7873K8323k5426j7465K2558
14114A0043R324j8263J6715Q259j4227j9311j8748j1449N287P636M717n66K524
14101a8059P022j8528l826J0747Q362k4606n079m058m330J2345Q072J0220k196
14088b3914L2275K2922l978L614o020j3913j8373N717r032l648p06K908m189J2322
$$ plain form
14180 -7560 -32021 -34682 -30201 -20477 -13233 -39433 -30920 -10340 -10894 -6854 11923 13602 1134 8692
14166 8692 -6961 -30468 -21801 -17185 -14772 -17599 -31363 -29846 -25505 -27859 -28253 -33927 -16402 -1388
14152 -1388 11446 20003 -3456 -29070 -35980 -47958 -43634 -31272 -37192 -26031 -767 -5867 -13556
14139 -13556 4349 -9962 -3219 5073 3456 11417 2813 -16084 -20817 -27441 -41309 -30147 -31876
14126 -31876 -22871 -18708 -22641 6897 25480 -4218 -15820 2053 30376 4950 -12515 10043
14114 10043 19367 1104 17819 26078 11851 -7460 -26208 -37657 -32370 -24734 -20017 -20583 -18059
14101 -18059 -11037 -29565 -33391 -22644 -14282 -38888 -43967 -48025 -52355 -40010 -31938 -21718 -23914
14088 -23914 8361 31283 27305 30919 24899 10986 -7387 -1670 -10702 -14350 -15056 -12148 -16337 -4015
14074d015J162J0931J6492q612J5593r579j0537J6146j391J0660j1349J3631k0957
14061A8175l17J9207j7833j3253J6355r839k4214j0818J3809r886J5108P651p829
14048c684k3173J393n916K322J6903K1038J0285k811j8976j0831j4213j0524J6506
14035b1681K7283j7243j1200m269M166L057J715k0503J538N932j8756K511J3941
14022c3509L0898q142k1293j5157j2276J5459J6784K3082r03k6038l497m055J3653
14009b4994J6921j236j5506N211Q660J5478R690j4357p230N702k4854k6552Q720
13996d4347K7434K1094q57j7411q507J3447L645p896j0662j821L125J1990l934
13983a4700l67J9749J0976l330J0186k6541j8322j9960j4716J718J9024J2564
$$ plain form
14074 -4015 -2853 8078 24570 15958 31551 21972 11435 27581 26190 36850 25501 39132 18175
14061 18175 17858 37065 19232 5979 22334 12495 -11719 -22537 -8728 -18614 -3506 4145 -3684
14048 -3684 -26857 -25464 -31380 -29058 -12155 8883 19168 16357 -2619 -13450 -27663 -38187 -21681
14035 -21681 5602 -11641 -22841 -27110 -22944 -19887 -18172 -38675 -37137 -31205 -49961 -47450 -33509
14022 -33509 -2611 -10753 -32046 -47203 -59479 -44020 -27236 -4154 -5057 -31095 -34592 -38647 -24994
14009 -24994 -8073 -9309 -24815 -19604 -10944 4534 14224 -133 -7363 -1661 -26515 -53067 -44347
13996 -44347 -16913 4181 3324 -14087 -22594 -9147 -5502 -13398 -24060 -25881 -22756 -10766 -14700
13983 -14700 -15067 4682 15658 12328 22514 -4027 -22349 -42309 -57025 -55307 -36283 -23719
13971b3719L76l319q292N566J9677J9514k2033j9687J2129n52J6533m177q891
13958a6875K1814J5960J9814q7j3193j2471k0769j5883J1569J667j3856j4946
13946c7256l846o634O567K0521J9678q503P793Q643K1286J194K6k699j0316j7813
13932a359q296K1946o475J252j0513O285J2263o462j5459k590j7560j475K4275
13919d168N12o600m953K0701K135j9859o461N061J1237K2924k30J284k4737J2114
13905H960k5976L098K2509j6206j4283q684J6157O799J4543J8617J598k6366j3997
13892a3231J113J1186J4444J2418r628O330P846j0742J1203J5346k4248P33J3649
13879C6419j2474l240J3386j2161p855j0677l8909j5820K718J869M7889K1164
$$ plain form
13971 -23719 -23343 -26662 -34954 -29388 -9711 9803 -12230 -31917 -19788 -20340 -3807 -7984 -16875
13958 -16875 4939 20899 40713 40626 27433 14962 -5807 -21690 -10121 -8454 -22310 -37256
13946 -37256 -41102 -47736 -41169 -20648 -970 -9473 -1680 6963 28249 29443 29469 26770 16454 -1359
13932 -1359 -9655 12291 5816 7068 -3445 2840 15103 8641 -6818 -9408 -26968 -28443 -4168
13919 -4168 -3656 -10256 -15209 5492 7627 -12232 -18693 -13632 -2395 20529 20299 21583 -3154 8960
13905 8960 -17016 -13918 8591 -7615 -21898 -30582 -14425 -7626 6917 25534 27132 766 -13231
13892 -13231 -12118 -932 13512 25930 16302 22632 30478 19736 30939 46285 22037 22770 36419
13879 36419 23945 20705 34091 21930 14075 3398 -35511 -51331 -48613 -46744 1145 22309
13867B2309j4680n8118j9404K2029K881Q27J3352K4286N269n038p7K1171J248
13854A6055j8370j6108p061L847J1734J1232j5787q360n813n233L8166Q381L937
13841A6620q844l316J3905n874q989o861k3956l406n024k1698O764L4828K5340
13828I489M359j1697J334Q020J6614k4880j6486J566J5204Q935q96j1738L257
13815C081N503m957q015l795J7318L1936j1880l6918j3841J1045R860N548m230
13802F55K9689J9577j0340l3283j1118J0459p28R972J4966J2445J9889k0112J935
13789D4006p077j4129j7442n468J0224j3725j5511J9690J0584j2014l650J1408
13777F896J5066K11J0970p266j8662j2090k2963J8678R921l135J044J1111k451
$$ plain form
13867 22309 7629 -50489 -69893 -47864 -44983 -44156 -30804 -6518 -1249 -6287 -6364 14807 16055
13854 16055 -2315 -18423 -25484 -21637 -9903 1329 -14458 -22818 -28631 -33864 4302 12683 16620
13841 16620 7776 4460 18365 12491 3502 -3359 -27315 -30721 -35745 -57443 -50679 -15851 9489
13828 9489 13848 2151 3485 11505 28119 3239 -13247 -11681 3523 12458 11562 -176 3081
13815 3081 8584 3627 -4388 -8183 9135 41071 29191 -7727 -21568 -10523 -663 4885 655
13802 655 30344 49921 39581 6298 -4820 5639 4911 14883 29849 42294 62183 42071 44006
13789 44006 36929 22800 5358 -110 10114 -3611 -19122 568 11152 -862 -4512 6896
13777 6896 21962 22173 33143 25877 7215 -4875 -27838 -9160 761 -2374 -1330 9781 7330
13764G330K891j7597P178j365Q372J4820J0774j7869j6897l5926j2816K0556P111
13751b3438J5725J9809j1297J1458J9361q702j8568l2053m745L8155K5174j0914
13739A9965k5019q069J5753j4021l118L9848Q061k6033k6555K547M223J0586m773
13726f605j1311j8308J8717J7533k963P911j1158J5562N807j2210r842J4470J5147
13713B2750k865J7170N899O258N373k3193j9931k6634N361j3002N671J3632J1370
13700G859j0169R617j2895k7084o734J9241M954N128K608p213J68J3192J6211
13687A4883n422J7234L1782j2589m3726K588J204l226M295q045N876q099j550
13674d795J1020K4413Q767j6140j0395o115p090k0016j7486m785m558K3162L6109
$$ plain form
13764 7330 10221 -7376 -198 -1563 6809 21629 32403 14534 -2363 -38289 -51105 -30549 -23438
13751 -23438 -7713 12096 799 12257 31618 22916 4348 -27705 -32450 5705 30879 19965
13739 19965 -5054 -13123 2630 -11391 -14509 25339 33400 7367 -19188 -16641 -12418 -1832 -6605
13726 -6605 -17916 -36224 -17507 26 -2937 4974 -6184 9378 15185 2975 -6867 7603 22750
13713 22750 19885 37055 42954 49212 54585 31392 11461 -15173 -9812 -22814 -17143 -3511 7859
13700 7859 -2310 7307 -5588 -32672 -39406 -20165 -15211 -10083 -7475 -14688 -14520 -1328 14883
13687 14883 9461 26695 58477 45888 2162 4750 5954 2728 7023 -1022 4854 -3245 -4795
13674 -4795 6225 30638 39405 23265 12870 6755 -335 -20351 -37837 -42622 -47180 -24018 12091
13661A2091K2792O185j6318k8601n662M183K524j1029p200J6895K2289r162p915
13648A072l622o676K0230O281L44J3902m518k620j2791J3084j2810o756O77n71
13634E226M831j0749k718N45l306M548J7933n192j3623J098L324Q96j3488M970
13620e705J1881j7261m092J3711P649k696j6692q815O259k176J2078N607j3432
13607a3684L375K7506n807m873j3549n635l743J2016n086j3149r332l436J107
13594c4290j9709J882J3828J0948L272P827K0502j496N6j6378l1797O650L6224
13581b481J4261l325o323P745j5483j0115k63j5926j2674J5471m37l541K5789
13568g302k836j1984k178M448J4889r162k1382o87J6488L065R948q643o377R961
$$ plain form
13661 12091 34883 41068 24750 -3851 -9513 -5330 -2806 -13835 -21035 -4140 18149 8987 1072
13648 1072 -2550 -9226 11004 17285 17629 31531 27013 24393 11602 24686 11876 5120 5797 5226
13634 5226 10057 -692 -3410 -2865 -6171 -1623 16310 11118 -2505 -1407 1917 2813 -10675 -5705
13620 -5705 6176 -11085 -15177 -1466 6183 3487 -13205 -22020 -15761 -17937 -5859 -252 -13684
13607 -13684 -10309 17197 11390 6517 -7032 -12667 -16410 -4394 -9480 -22629 -31961 -35397 -34290
13594 -34290 -53999 -52117 -38289 -27341 -24069 -16242 4260 2764 2820 -13558 -45355 -38705 -2481
13581 -2481 11780 8455 2132 9877 -5606 -15721 -15984 -31910 -44584 -29113 -29550 -33091 -7302
13568 -7302 -10138 -22122 -24300 -19852 -4963 -14125 -35507 -36194 -19706 -16641 -6693 -15336 -21713 -11752
13554a1752J6733P713J1123K9622j5118j2741R669K067o091p669J831j426j8759
13541E202N597q895K3720N502r523k2805K681O795l290j6586k0814k4710Q554
13528d8572K6723J1230j8579j889q128L2926N4484j7509l8382R388J7565M541
13516B3798J1208m162n17J6524J535K03q538j9156m107P456j1229j5960N19K0282
13502A7856L692M549J1788k2594R624k6614o936J8698k9444m0542O765K5252K9976
13489B070j5335j5091J4437P362j1260m414l600p740J9576M400r380l7596n631
13476f2202J8730K6349K1666j6270k0678o936K1046M676k897k902J209J9986J258
13463C035Q896J8192k813n638j6429R214m580n589k938M27J184r302l0463Q871
$$ plain form
13554 -11752 4981 12694 23817 53439 38321 25580 35249 37316 31225 23556 25387 23961 5202
13541 5202 10799 1904 25624 31126 21603 -1202 1479 8274 4984 -11602 -32416 -57126 -48572
13528 -48572 -21849 -10619 -29198 -31087 -39215 -6289 48195 30686 -7696 1692 19257 23798
13516 23798 35006 30844 30327 46851 48386 48589 40051 20895 16788 24244 13015 -2945 -2426 17856
13502 17856 21548 26097 37885 15291 24915 -1699 -8635 10063 -19381 -59923 -53158 -27906 2070
13489 2070 -13265 -28356 -13919 -6557 -17817 -22231 -25831 -33571 -13995 -9595 -18975 -56571 -62202
13476 -62202 -43472 -17123 4543 -11727 -32405 -39341 -18295 -13619 -16516 -19418 -18209 1777 3035
13463 3035 11931 30123 27310 21672 5243 14457 9877 4288 1350 1777 2961 -6341 -36804 -27933
13449b7933L704K939J6139J2069l172l447l567J0232J1646K443J9086n349j1792
13436B2998k9176q127n201o1L1923L49j1466j2738n401J408P377P254K472j7657
13422a6046j2280n40P582J5491J4124l904J2915J7834R224k752l9748q199n823
13409a2122L631K0076l279n94Q744P056L5583R930j3492K0899o850m1745k8777
13396i40J0620P761k2409K835j019K5275R62R399J921r043j0310m075O382J2497
13382B9856Q971O715k585n568J7816q414O172j4143J79O265j5115n940R140q729
13368B4620j9550J1805K6395n501n650J2852j0445k0843n094K8561M788j3907
13356B8031j6370l0747R405J1071j6259K3282O074l298L676J1367J3176j0837
$$ plain form
13449 -27933 -24229 -21290 -5151 6918 3746 299 -3268 6964 18610 21053 40139 34790 22998
13436 22998 -6178 -14305 -19506 -19567 12356 12705 1239 -11499 -16900 -15492 -8115 -861 1611 -16046
13422 -16046 -28326 -28866 -21284 -5793 8331 4427 17342 35176 44400 41648 1900 -6299 -12122
13409 -12122 -8491 11585 8306 7712 16456 23512 59095 69025 55533 76432 69582 27837 -940
13396 -940 9680 17441 -4968 -2133 -3152 22123 23085 32484 34405 25362 15052 10977 17359 29856
13382 29856 38827 45542 42957 37389 55205 46791 52963 38820 38999 45264 30149 24209 33349 24620
13368 24620 5070 16875 43270 37769 32119 44971 34526 13683 8589 37150 41938 28031
13356 28031 11661 -19086 -9681 1390 -14869 8413 14487 11189 14865 26232 39408 28571
13344B8571P909k096l503K388R424J8047j0181K8264k896k6716j1787p695P163
13331C6892K0731m346J698k2245j2508j3801K1760M45k4015p317Q117J1514K0012
13318C6937J6625l5969j9454K5075R756M496k1674l349K5230O234L401M265j7554
13305C4019k6855L931n986K834k0394j4154o36m90J1745j2720k3456J6893J6480
13292a8789P708K0911j4826k1636j368R284R572m002K3796P373j6671K247m34
13279C165N687J1740K3600k0076k974K6035l774j5645p758J9884J2416l3123k189
13266A6988K5492j8272k1962J4581J9206j1633q404j7135Q713r211n471J428J3107
13253G427j284K0971K9056j3854n652n182k5300k2269L426J2938J594J964J6426
$$ plain form
13344 28571 36480 34384 30881 33269 42693 60740 50559 78823 75927 49211 37424 29729 36892
13331 36892 57623 53277 54975 32730 20222 6421 28181 28626 4611 -2706 5411 16925 36937
13318 36937 53562 17593 -1861 23214 32970 37466 15792 12443 37673 43907 47308 51573 34019
13305 34019 7164 11095 5109 7943 -12451 -26605 -27241 -27731 -15986 -28706 -52162 -35269 -18789
13292 -18789 -11081 9830 -4996 -26632 -28000 -18716 -9144 -13146 10650 18023 1352 3599 3165
13279 3165 8852 20592 44192 24116 21142 47177 43403 27758 20000 39884 52300 19177 16988
13266 16988 42480 24208 2246 16827 36033 24400 15996 -1139 7574 -1637 -7108 -5680 7427
13253 7427 6143 27114 56170 42316 36664 31482 6182 -16087 -12661 277 1871 3835 20261
13240B0261q69k1214j1450J3823p39o745J1130r853K919m445j8379M54J1511J6897
13226C301Q211P606k1241j9993Q703O415K3720j958k011j0430j4990P36J9315
13213G384j1032j4169m885Q093j4787M025N697L346J7442J4572L546j2330p18
13200F184p512j091j310p037j8741R428L9260K0942k6370k0972o865j0089J0367
13187a3806P28O506q716m848k539Q622K3511p533P827N991o9R655R980O827k136
13172D0000j2058R523N47p642O490O824k0168k9667j0184K5589J0239R567J4369
13159D3429M900l7512K176J9887k726p416k054J9265J8702k964j520p062M594
13146E1699n352P981J7353o313l0839j8101K1292R692J6149K785R109l7412R615
$$ plain form
13240 20261 19392 -1822 -13272 551 -188 -6933 4197 -5656 -2737 -7182 -25561 -25107 -13596 3301
13226 3301 11512 19118 -2123 -22116 -13413 -6998 16722 14764 12753 2323 -12667 -11931 7384
13213 7384 -3648 -17817 -22702 -14609 -29396 -25371 -19674 -16328 1114 15686 19232 6902 6184
13200 6184 -1328 -2419 -3729 -10766 -29507 -20079 19181 40123 13753 -7219 -14084 -24173 -13806
13187 -13806 -13078 -6572 -15288 -20136 -22675 -14053 9458 1925 9752 15743 15674 25329 35309 42136 40000
13172 40000 27942 37465 38012 30370 36860 43684 23516 -6151 -16335 9254 19493 29060 43429
13159 43429 48329 10817 12993 32880 30154 22738 20684 39949 58651 55687 54167 47105 51699
13146 51699 46347 54328 71681 65368 34529 16428 37720 47412 63561 66346 75455 38043 47658
13133D7658M695j6978k0010J0250J3839m608O626J7046k7587l2400K0238O0404
13121G9173L1458j9134j0994m022O93K799j3191l9467O188J1080l6759k2514J6318
13108A628K84l51k2505j3413K037Q13l780j386J954J6054j645k2883J560L7485
13094d148k930j6727J0772K0956K5789J3450L310J1181J8724K5387L5247K4166
13082A65177J7201J2056k483L0291M5886Q9069J18647J44489J69021J45508J31141
13071A066003J67189K25106K24016R8494R661j8805L142L3881m4067j42898k15146
13060A406576j81385j28780j59688j67016j82070j22807r8296n7513k2584l6197
13050B50240l1962k1304j8250k9873l9819l8148l6269n157K8864P625R639j444
$$ plain form
13133 47658 52353 35375 15365 25615 39454 34846 41472 58518 30931 -1469 18769 79173
13121 79173 110631 91497 80503 76481 77174 79973 66782 27315 33503 44583 7824 -14690 1628
13108 1628 1912 1561 -20944 -34357 -32320 -31507 -35287 -36673 -34719 -18665 -20310 -43193 -41633 -4148
13094 -4148 -7078 -23805 -13033 7923 33712 47162 50472 61653 80377 105764 141011 165177
13082 165177 182378 194434 191951 222242 268128 357197 475844 620333 789354 934862 1066003
13071 1066003 1233192 1458298 1682314 1780808 1790469 1771664 1774806 1808687 1764620 1621722 1406576
13060 1406576 1225191 1096411 936723 769707 587637 464830 366534 309021 286437 250240
13050 250240 218278 196974 178724 148851 109032 70884 34615 29458 58322 65947 75586 74142
13038G4142r745j0696N173J068n124l0722j3990p339N221j62k698j6574J499K5667
13024A5720p71J7605O321j3306K2798M1248r476k1368J6766J1354O54L477l379
13011H7643j0655l3463j6479k932o14J4744k4139L672K8470j2885J0574p70J997
12998D5163j3282j668q806k191J5786k838o968k7923q859l529K342K9088K2081
12985C8396O199j6213m887M731K2096J6991l820m644l7473J1290K5860J5751k4871
12972D9406k6083k4118J051J8948Q484l226p277k233J933J9173J3844O722k0276
12959C6348j3285k277J151O967j1570k4052j9542j4351k487p179J6427j4531j2159
12946f0540K817M0618L4681j3457J5977K5951J6407M3061K2037Q121K6607q508
$$ plain form
13038 74142 64397 53701 58874 59942 54818 24096 10106 2767 7988 7826 5128 -11446 -9947 15720
13024 15720 14949 32554 38875 25569 48367 89615 80139 58771 75537 86891 87545 91022 87643
13011 87643 76988 43525 27046 24114 23500 38244 14105 17777 46247 33362 43936 43166 45163
12998 45163 31881 30213 21407 19216 35002 32164 25196 -2727 -11586 -15115 -12773 16315 38396
12985 38396 44595 28382 23495 28226 50322 67313 63493 58849 21376 32666 58526 74277 49406
12972 49406 23323 -795 256 19204 27688 24462 17185 14952 16885 36058 49902 56624 36348
12959 36348 23063 20786 21937 28904 17334 -6718 -26260 -40611 -43098 -50277 -33850 -48381 -60540
12946 -60540 -57723 -17105 17576 4119 20096 46047 62454 105515 127552 135673 162280 153772
12934A53772k8975K775K486q5L345R157K443J590j4403l2586l1328K6103k34N634
12920I9694R560l194j0145l4247k1665J6559o66r941J9900q401q479k6635l0379
12907h039J722q84L2664K2125k3095J902L6373K7362M1469K4566J6166K8863L4949
12894B36143J0031n354m292Q610r866l5481j5822n0229k0154J6359N40k1407k1306
12881H7772J5740L9120m766p673N47N734J817J7215J0479m972j0976J388o281
12868A45144k5777l813M890k1438j5335l616j0548J472N924k0715L900K7720K7051
12855A14859J8369r123l0628o13L4979K0074J78P852J2275q53J8387J5085k4496
12842A76345L0659K9440j9565J4492K04K505K4256J3552K884k8941l0184K834
$$ plain form
12934 153772 124797 127572 130058 129973 133318 142475 144918 146508 132105 99519 68191 94294 94060 99694
12920 99694 109254 106060 95915 61668 40003 56562 55896 45955 65855 57454 48975 22340 -8039
12907 -8039 -6317 -7201 25463 47588 24493 26395 62768 90130 131599 156165 172331 201194 236143
12894 236143 246174 240820 236528 245138 235272 199791 183969 133740 113586 129945 130485 109078 87772
12881 87772 103512 142632 137866 130193 130740 136474 138291 155506 165985 161013 150037 151425 145144
12868 145144 119367 115554 120444 99006 83671 80055 69507 70979 76903 56188 60088 87808 114859
12855 114859 133228 124105 93477 92864 127843 147917 148095 155947 168222 167369 185756 200841 176345
12842 176345 207004 236444 216879 231371 231575 234080 258336 271888 274772 245831 215647 218481
12830B18481K898n72j2634J8510K4030K3759K7433J0510q76K4508J9998J1405
12818C67450J5902K3029k5004j7808m969J6844L311j0052K949K4132J0869M3051
12806D49704L5158M3936K1146r620J0612L4831L6272J0370k7783l2579j1636j9098
12794E41313k3571q2105p1458o2155p4028n5659n9460o1199l1702k6748k5299
12783c2071j0264j1086J8600J7101J3623M271k5059o449J4021l754K4953L1980
12771C5866L5226K0207J2154K8309P0095J5382n851N873J1387M7242M3457K338
12759C21685k6130r580L140k0519l702L6251K2156k7724j5893Q057q185l8940
12747B40616P028J4435k551J9786j0094O06n780J6891j8047r891K466p438j8004
$$ plain form
12830 218481 221379 220807 208173 226683 250713 274472 301905 312415 311539 336047 356045 367450
12818 367450 383352 406381 381377 363569 358600 375444 378755 368703 371652 395784 406653 449704
12806 449704 484862 528798 549944 540324 550936 585767 622039 632409 604626 572047 560411 541313
12794 541313 517742 435637 364179 302024 227996 172337 112877 51678 19976 -6772 -32071
12783 -32071 -42335 -53421 -34821 -17720 -4097 174 -24885 -31334 -17313 -21067 3886 35866
12771 35866 71092 91299 103453 131762 201857 217239 211388 217261 228648 275890 319347 321685
12759 321685 295555 285975 289115 268596 264894 301145 323301 295577 279684 287741 279556 240616
12747 240616 247644 262079 259528 279314 269220 269826 264046 280937 262890 252999 255465 248027 230023
12734B30023j8164j6945o403l7693J0478N6380L1977J8045K8474K4860L1519K0423
12722C72974J8113N0978M1769K0859N0531O2464M2965N7133M3666J2192J4076
12711G87720L4415L2823J8479k0289l0521o218Q278J4298J3507L3912L9276J7247
12699I42927J8996O3274P3338K6974M0884N8801P8797P4022P1456R6481J18170
12688A664120J75046K03808K41931L79701O53108R76055J125959J045119J083526
12679G548373J189348R94308N61148K59887R8999l47328q49675q68519n67539
12670H019002m79290m75365k61285Q0443M61862Q27012J193682J463992J571895
12661A2401948J617071J820828K259273K605236K783354L037005L612820M969505
$$ plain form
12734 230023 211859 194914 188511 150818 161296 217676 249653 267698 296172 321032 352551 372974
12722 372974 391087 442065 483834 504693 555224 617688 660653 717786 761452 773644 787720
12711 787720 822135 854958 873437 853148 822627 816409 824687 838985 852492 886404 925680 942927
12699 942927 961923 1025197 1098535 1125509 1166393 1225194 1303991 1378013 1449469 1545950 1664120
12688 1664120 1839166 2042974 2284905 2664606 3317714 4293769 5419728 6464847 7548373
12679 7548373 8737721 9732029 10293177 10553064 10652063 10304735 9455060 8586541 8019002
12670 8019002 7539712 7064347 6803062 6883505 7345367 8172379 9366061 10830053 12401948
12661 12401948 14019019 15839847 18099120 20704356 23487710 26524715 30137535 35107040
12653C5107040P425516J1187557J7118480K5912484L2730306L0296714K4842811
12646A84620908K7818440L9842383M0746821K5743354N531331j698378J959323
12639C24564182N671105k932883k2298076l7376885l7321038k6768856k3160663
12632A80376886k8355176l2319638k7979757j9625909j3252739r304759o778841
12625D2760067n146366m152654l552132l194988k838424k458896k152075j960107
12617A7304425j798411j531987j283190j091391r41298q33531p12074o48153n70361
12608G894029m91828m48238m09313l46590l23948k87791k60171k49293k34470
12599D842387k27572k01664j99153k35770k24021k28152k12752j72024j70919
$$ plain form
12653 35107040 42532556 53720113 70838593 96751077 129481383 159778097 184620908
12646 184620908 212439348 252281731 293028552 318771906 324303237 322604859 324564182
12639 324564182 330235287 327302404 305004328 267627443 230306405 203537549 180376886
12632 180376886 152021710 119702072 91722315 72096406 58843667 49538908 42760067
12625 42760067 37613701 33461047 29908915 26713927 23875503 21416607 19264532 17304425
12617 17304425 15506014 13974027 12690837 11599446 10658148 9824617 9112543 8464390 7894029
12608 7894029 7402201 6953963 6544650 6198060 5874112 5586321 5326150 5076857 4842387
12599 4842387 4614815 4413151 4213998 3978228 3754207 3526055 3313303 3141279 2970360
12590B970360j63861j55149j65142j41525j22403j09980j18579r7000r9210j08256
12580A689255r1779q8701j20535r6099p3846n3599n7573p3241p8479l2302k9609
12569H93492m3348l3750m4073N897j9872q70j1456k178R510L581j74J3599l589
12556G66769J8370J9274J3423k7029k8030o733q09P444P910r941l3000l6998m1081
12543F49569m4355k0442j5525k3583m9711k7918p272J936L422l3785m213j9146
12531D08977p273l684n434j0714J4826r451l6481j5318M181j7970k6776Q686M2195
12518C45764K4173L3250J4974J7735J0203k285L0683L4571j0012O920K527o893
12506E01610j9124J5816k8682J7695P101J455k755K929J441j2318l8878l3818
$$ plain form
12590 2970360 2806499 2651350 2486208 2344683 2222280 2112300 1993721 1896721 1797511 1689255
12580 1689255 1597476 1508775 1388240 1292141 1218295 1164696 1107123 1033882 955403 923101 893492
12569 893492 850144 816394 772321 778218 758346 757476 746020 743842 753352 756933 756759 770358 766769
12556 766769 785139 804413 817836 790807 762777 756044 755235 762679 770589 760648 727648 690650 649569
12543 649569 605214 584772 569247 545664 495953 468035 460763 462699 466121 432336 428123 408977
12531 408977 401704 398020 392586 381872 396698 387247 350766 335448 339629 321659 294883 303569 345764
12518 345764 369937 403187 418161 435896 446099 443814 474497 509068 499056 505976 508503 501610
12506 501610 482486 498302 469620 487315 494416 495871 493116 496045 497486 485168 446290 412472
12494D12472j3776n6421n7705o2415l2834n3589r3543r4817m8736m0569j3990
12483a55923o0798q5085j8744M2993O0198L0012J4113P663L620L9682l947o782
12471a32998p017K5286J3956j0764k8241Q538J9985J1739r677j5394m899L158
12459a26328K4031K8511N205R687J6464m940J4394R702R737k512P624J1885j1268
12446g808j666K5463K5839j4005k4306o882K0157M628q636n241J0825P172q268
12433A7272K4927P262k7062P559L0442J191j5049K4023M091m036K0160J6956N838
12420A13574N240P251J4261R06m466p349l0319k4299p636j4349J221Q145k138
12407F0042k0766J6399J3331n240K9671K5089o97j0295q325j5322J2568N093k223
$$ plain form
12494 412472 398696 342275 284570 222155 189321 135732 42189 -52628 -101364 -141933 -155923
12483 -155923 -216721 -301806 -320550 -277557 -217359 -187347 -173234 -165571 -161951 -122269 -126216 -132998
12471 -132998 -140015 -114729 -100773 -111537 -139778 -131240 -111255 -99516 -109193 -124587 -129486 -126328
12459 -126328 -102297 -73786 -68581 -58894 -42430 -47370 -32976 -23274 -13537 -16049 -8425 3460 -7808
12446 -7808 -9474 15989 41828 27823 3517 -3365 16792 21420 12784 7543 18368 25540 17272
12433 17272 42199 49461 22399 29958 60400 61591 46542 70565 74656 70620 90780 107736 113574
12420 113574 118814 126065 140326 141232 136766 129417 99098 74799 67163 52814 54035 62180 60042
12407 60042 39276 55675 69006 63766 93437 118526 117829 107534 99209 83887 96455 101548 99325
12394I9325K4863R70Q686K257K746j5659j6862P712j967p154j8907J5988K3889
12381A25887n096J7804J0359K3479J2558l646k926J083M444m902l934o842r927
12368A58341j0070l6237j7674j5891j1418m7880j4631L8510N076k4064l6928j1460
12356b4326N0017L0994j5824k328j257j7793l0487k0780O551J3063J0746m006
12344e430k11K3388K6275O8384N5583M2656M3769K3811J5059l1004k2552m994
12332B34734j1564M665j3714l1828l2070o100j7763m113j8097j6814r827j0417
12320F7092j7700n15L2360j2855J922J4386J6331p939l1399n979J8399J6427J3663
12307A04193m940j287O062j6157j4065J215J2705q868l966M885q42R18J7112j8497
$$ plain form
12394 99325 124188 125158 133844 136101 138847 123188 106326 114038 112071 104917 86010 101998 125887
12381 125887 120791 138595 148954 172433 184991 181345 178419 179502 183946 179044 175110 168268 158341
12368 158341 148271 112034 94360 78469 67051 19171 4540 43050 48126 24062 -12866 -24326
12356 -24326 25691 56685 40861 38533 37276 19483 -11004 -31784 -25233 -12170 -1424 -5430
12344 -5430 -5641 17747 44022 112406 167989 210645 254414 278225 293284 262280 239728 234734
12332 234734 223170 227835 214121 182293 150223 144123 126360 122247 104150 87336 77509 67092
12320 67092 49392 48877 81237 68382 70304 84690 101021 93082 61683 55704 74103 90530 104193
12307 104193 99253 97966 104028 87871 73806 75021 87726 78858 74892 79777 78935 79853 96965 78468
12293G8468j8900K3239J9326o970k7165j4260J5081J1969K8061l4278k7340Q789
12281E6020J0004j2074R269o43n378O49K3248K853j4862j0023j9180k4716J1497
12268B6664J4856j7991o797N439J4868j4523J4329J7002r124j6293K867L4446
12256F5743L0895J6274J4696K1918K0093j8344k223j3149r014j3190r90O471n87
12243A18593N085j1872N158J596R123j5758l3393n663J3406J9223J4338O930K300
12230A29066m74L2887l745k0237L0843J393N112J7995L5646M8443N7697J10815
12218D45441J40174J74932J67751J28569J90205K58689K05291O9643m798k3848
12208A752049K7859K0161m6756j70977k17671j95012j45613j44213j88362j71901
$$ plain form
12293 78468 59568 82807 102133 95163 67998 53738 68819 80788 108849 74571 47231 56020
12281 56020 66024 53950 63219 62576 57198 57847 81095 83948 69086 59063 39883 15167 26664
12268 26664 41520 23529 16732 22171 37039 22516 36845 53847 44723 28430 31297 65743
12256 65743 96638 112912 127608 149526 169619 151275 149052 135903 126889 113699 112709 119180 118593
12243 118593 123678 111806 116964 118560 127683 111925 78532 72869 86275 105498 119836 126766 129066
12230 129066 128592 161479 157734 137497 168340 169733 174845 192840 228486 276929 334626 445441
12218 445441 585615 760547 928298 1056867 1247072 1505761 1711052 1780695 1775897 1752049
12208 1752049 1779908 1800069 1753313 1582336 1364665 1169653 1024040 879827 691465 519564
12198E19564j01302r1575n1971p788m9333j1847K679J87j4167L09p448k9720k4981
12185A32607j3879J0083K2952J0226J9586m454k1187j6837j8115k1360j1421k713
12173H5488o889k4096j704r359k6402R479K984J7915J9840j3962k6930k5439K724
12160C649l443M494K9040l915j6098L180j9319k0468K8602J0473n878n342O080
12147A1055Q03J2357R335j5029l229J2270k0432j2878j8109J8470O347J2060q762
12134D258R424q135l6298m065j6303j4705R698K7975l555L700l382J9964P965
12121c459m250k2679J504J2011k0062j9006l741L2109M0727K7009J846M6k561
12108C9494R191j378l239j3840j5088k863P658J3897K071K725j5367n744j1229
$$ plain form
12198 519564 418262 326687 274716 266928 217595 205748 208427 208614 194447 194756 187308 157588 132607
12185 132607 118728 128811 151763 161989 181575 177121 155934 139097 120982 99622 88201 85488
12173 85488 78599 54503 52799 43440 17038 26517 29501 47416 67256 53294 26364 925 3649
12160 3649 206 4700 33740 29825 13727 16907 -2412 -22880 5722 16195 10317 4975 11055
12147 11055 11858 24215 33550 18521 15292 27562 7130 -5748 -23857 -5387 960 13020 4258
12134 4258 13682 5547 -30751 -34816 -51119 -65824 -56126 -28151 -31706 -28006 -31388 -11424 -3459
12121 -3459 -7709 -30388 -28884 -16873 -36935 -55941 -59682 -27573 13154 40163 42009 42055 39494
12108 39494 48685 47307 44068 30228 15140 12277 19935 33832 35903 38628 23261 17517 6288
12095F288R81K2572r768L021R898N448j7073r261J1205J1476j858K792r434R003
12081C5290R29p041j136J4989J2814j1618J4724j9117o875R834n761j5623o67
12068B0742R375j5867q664j0477k286O916Q360J7733L1267J0711j3162k0236j9549
12055A4863j5166J578J3408L010J811Q805q348k3768j2503j5168N506Q756J1109
12042f107J7474O696J555j3636j5880j2655M754L1273J159n367K974Q036j3642
12029F634j8665j7994m0K6515k415p718J3108q226q292J5467O399J6697K9247
12016E0717J2295k3261k821m529J2777N575k8560k0678p506J614p840n945p888
12003b6050n359J7177J6281j0104O218r486k66L068p93q647m206p011j696J5773
$$ plain form
12095 6288 7269 29841 20073 23094 32992 38440 21367 12106 23311 34787 32929 35721 26287 35290
12081 35290 36219 29178 28042 43031 55845 44227 58951 39834 32959 42793 37032 21409 20742
12068 20742 30117 14250 5586 -4891 -7177 -261 8099 25832 57099 67810 54648 34412 14863
12055 14863 -303 1275 14683 17693 19504 28309 19961 -3807 -16310 -31478 -25972 -17216 -6107
12042 -6107 11367 18063 19618 5982 -9898 -22553 -17799 13474 14633 9266 12240 20276 6634
12029 6634 -12031 -30025 -30065 -3550 -5965 -13683 -575 -8801 -17093 -1626 4773 21470 50717
12016 50717 63012 39751 36930 32401 45178 50753 22193 1515 -5991 -4377 -12217 -18162 -26050
12003 -26050 -31409 -14232 2049 -8055 -1837 -11323 -11589 -8521 -9314 -17961 -22167 -29178 -30874 -15101
11989a5101N039J786m737o857R980J2822K2803J4633l6774j2801J1310J408j0506
11976f995j2187n869K674n820j2897j5933J5266K2366K4960K096J962J4353r776
11963A4200j0659k5945R457P124q077l88K1285L5106J4436j2109j2698j9158j4463
11950a889p258Q185J3685j0470o888p890P540N408p882l1116J943J0069l448N981
11936b4030N230P263n748l0332J8036J589q627J5924K792j6673j0753Q860J953
11923c4516k6392N617J9844L7076K9669J6148k4474L12j0860j1488K6797L0018
11911E7751j1017J1312J8770j282j8597k6982o535j0093o484j9442k0611k3859
11899e7069O810L1066K4389R1P199q785k8967k641K4334j208M842k933m632j6557
$$ plain form
11989 -15101 -10062 -8276 -13013 -19870 -9890 2932 25735 40368 3594 -9207 2103 3511 -6995
11976 -6995 -19182 -25051 -22377 -28197 -41094 -57027 -41761 -19395 5565 7661 9623 23976 14200
11963 14200 3541 -22404 -12947 -5823 -13900 -14288 6997 42103 56539 44430 31732 12574 -1889
11950 -1889 -9147 -962 12723 2253 -4635 -12525 -4985 423 -7459 -38575 -36632 -26563 -30011 -24030
11936 -24030 -18800 -11537 -17285 -47617 -29581 -27992 -36619 -20695 -17903 -34576 -45329 -36469 -34516
11923 -34516 -60908 -55291 -35447 1629 31298 47446 22972 23284 12424 936 27733 57751
11911 57751 46734 58046 76816 75534 56937 29955 23420 13327 6843 -12599 -33210 -57069
11899 -57069 -50259 -19193 5196 5287 12486 3701 -25266 -27907 -3573 -4781 61 -2872 -7504 -24061
11885b4061M673L187o838R793J0420r31J1240J1902j2440k0628J1554o931J6212
11872G152O032l87l430j4653Q313J2231l0490j0322N174O375k396L0j5670K0442
11858a1599K8416J3572k6819k228K2016P614l6824k5253J5489K6572J5788L2065
11846E8809k0361m6588r799m068J2149J5282J5363N463j1504j5668j3241n389
11834a9552q063J943J3764J6750M278n816L763r524j8006j7125n800R374J5922
11821a8092K7538J3579j584j9089r483J1766k566Q66j5191q563j9894K797M2861
11808D945K5302o179j1381Q157J7178r674j3607j3460k436J5434o216n996K3259
11795B5326j466p212m3101j1989J4489j9745m017M843K7834K0687J0575R24l391
$$ plain form
11885 -24061 -19388 -16201 -23039 -13246 -2826 -3757 7483 19385 6945 -13683 -2129 -9060 7152
11872 7152 13184 12797 9367 -5286 3027 15258 -15232 -25554 -20380 -14005 -16401 -16371 -32041 -11599
11858 -11599 16817 30389 3570 1342 23358 30972 -5852 -31105 -15616 10956 26744 58809
11846 58809 38448 -8140 -17939 -22007 -9858 5424 20787 26250 14746 -922 -14163 -19552
11834 -19552 -27615 -25672 -11908 4842 9120 3304 7067 -2457 -20463 -37588 -43388 -34014 -18092
11821 -18092 9446 23025 21441 2352 -7131 4635 2069 2935 -12256 -20819 -40713 -37916 4945
11808 4945 30247 24068 12687 20844 38022 28348 14741 1281 -1155 14279 8063 2067 25326
11795 25326 23860 16648 -26453 -38442 -23953 -43698 -47715 -42872 -15038 5649 16224 17148 13757
11782A3757j0659k1413l549R871k138N436J6151n806K4849K0474R505j6926n2208
11769a2656k1115K6843K6871k0918l3504J1300K0444j2775j1605J5414L9810K1342
11757D9451j1566k1701r976j7652k334J246l702J3696r476M350J993J0927K0068
11744B5324R493k699j2475n208k0753j1498J7521J9134J2108K297k090r626o352
11731A5176j8486q951j6426p539p225J5858L048k56O460K0819j1196j9039j1872
11718c9629J1291J4080k321j1947N565q35J9063N82p224P202l358J6951O216L167
11704A8803L551j1992m223p731k3729j779K0904J8954J142n516J6990J9535j3961
11691C0948p322j0267J6754p115J3446p577q908k555P755J4090K3005j109k8801
$$ plain form
11782 13757 3098 -18315 -21864 -11993 -14131 -8695 7456 1650 26499 46973 56478 39552 -12656
11769 -12656 -33771 -6928 19943 -975 -34479 -23179 -2735 -15510 -27115 -11701 28109 49451
11757 49451 37885 16184 6208 -11444 -13778 -12532 -16234 -2538 -12014 -7664 -5671 5256 25324
11744 25324 34817 32118 19643 14435 -6318 -17816 -295 18839 30947 33244 31154 21528 15176
11731 15176 -3310 -12261 -28687 -36226 -43451 -27593 -24545 -24801 -18341 2478 -8718 -27757 -39629
11718 -39629 -28338 -14258 -16579 -28526 -22961 -23796 -4733 -4151 -11375 -4173 -7531 9420 15636 18803
11704 18803 22354 10362 6139 -1592 -25321 -27100 -6196 12758 13900 8384 25374 44909 30948
11691 30948 23626 13359 30113 22998 36444 28867 19959 17404 25159 39249 62254 61145 32344
11678C2344r35J4262N816l062j4032K163K488n22J5048m25k7069k6828j1728K0102
11664G622r238j7522l796L2207J2686k8560q812J4644J0525l764j1430j4125R074
11651a0489j269q852l971k0428j010O607k747J1897M0539J6386n881p549l014
11638A0219j7864l483j2011j4801K7105L4272N83Q704J2325l0168l827P029p529
11625A0554r584K2574m526M902j5605M553j2515l7753R65J9399J0342l451j9245
11612b9390P713J946q52k5113k636J04K4314K002j2082j3674J3886J9269J7615
11599C102Q9p583J0610K776j0246j0852j6506J3084K0420n739R130R799M582l841
11585A8825J8317k7596l2238l694J3038j9034r181r550k002K1786J9739j0854
$$ plain form
11678 32344 31409 45671 51487 48425 34393 36556 39044 38522 53570 53145 26076 -752 -12480 7622
11664 7622 -1616 -19138 -22934 9273 21959 -6601 -15413 -769 9756 5992 -5438 -19563 -10489
11651 -10489 -11758 -20610 -24581 -45009 -46019 -39412 -42159 -30262 10277 26663 20782 13233 10219
11638 10219 -7645 -11128 -23139 -37940 -10835 23437 24020 32724 45049 14881 11054 18083 10554
11625 10554 970 23544 19018 23920 8315 12868 353 -37400 -36435 -17036 -6694 -10145 -29390
11612 -29390 -21677 -19731 -20583 -45696 -48332 -48228 -23914 -21912 -33994 -47668 -33782 -14513 3102
11599 3102 3191 -4392 6218 8994 -1252 -12104 -28610 -15526 4894 -845 8285 18084 22666 18825
11585 18825 37142 9546 -22692 -26386 -13348 -32382 -41563 -51113 -53115 -31329 -11590 -22444
11573b2444J4345L8433r809l6284j8982J7330K340j6163n4N732L12M512J2104
11560h628J7242j6008n346J0483J3146j1659k0679p712P039J9795j1975K870J3617
11547B185n244r492r834J6772K035k6758j6666K0317J2101J1423j2566k784Q42
11534a7669R057n337K0031K1349k5952k1904j0990p987m463K412J9363N568K273
11521a4249J2490k2341j164P771m142J5614J6502q844r618O55J1602J891k2573
11508a6406j8427Q409J1137k459k2833n764J955J9109L6582K1261l306m985l7900
11495a3627K0018K3207K514J862l493j2466o810j5926j4468J1776J2512j046o631
11482b578q853k932R530j4591J0710P680L740P320J5647J370K321n516k292j5804
$$ plain form
11573 -22444 -8099 30334 20525 -15759 -34741 -17411 -15071 -31234 -31288 -25556 -25244 -20732 -8628
11560 -8628 8614 -7394 -12740 -2257 10889 -770 -21449 -29161 -22122 -2327 -14302 -11432 2185
11547 2185 -3059 -12551 -22385 -5613 -3578 -30336 -47002 -26685 -14584 -3161 -15727 -18511 -17669
11534 -17669 -8612 -13949 6082 27431 1479 -20425 -31415 -39402 -43865 -41453 -22090 -16522 -14249
11521 -14249 -1759 -24100 -25264 -17493 -21635 -6021 10481 1637 -7981 -7326 4276 6167 -16406
11508 -16406 -34833 -26424 -15287 -17746 -40579 -46343 -44388 -25279 11303 32564 29258 24273 -13627
11495 -13627 6391 29598 32112 33974 30481 18015 11205 -4721 -19189 -7413 5099 4053 -2578
11482 -2578 -11431 -14363 -4833 -19424 -8714 -1034 2706 10026 25673 27043 29364 23848 21556 5752
11468E752j3382j6764l323n593r214K6823P687K609j578l848l642N725P244p401
11454h905M265N473j9425K398N805M2j2090Q523L3863m165j3833j7285j1757m315
11440c1406J4317L047j3241k0486J6039J9608N180j0686M149k728k367K624R970
11427e980J9737j885R280J0450j3250j0001j2719O462Q188j2827k952P359L547
11414E409k1580l3719J7047K7036L125l5471J1220J1998p379j7122j0321J6257
11402c3500K8109j2360j3746Q897K0947R806k208j0526k33J6332K4001O599R48
11389D3066Q225j9982l0237j9402K2230R416L378r228L329K5152J1478J849k8526
11376B0748J282M447j4871j9425j4990P605K3523J9656k3883J6756L4950k6371
$$ plain form
11468 5752 -7630 -24394 -27717 -33310 -42524 -15701 -8014 -5405 -6983 -10831 -14473 -8748 -1504 -8905
11454 -8905 -4640 833 -18592 -16194 -10389 -10347 -22437 -13914 19949 15784 1951 -15334 -27091 -31406
11440 -31406 -17089 -14042 -27283 -47769 -31730 -12122 -6942 -17628 -13479 -16207 -18574 -15950 -5980
11427 -5980 13757 11872 21152 31602 18352 8351 -4368 2094 10282 -2545 -5497 1862 5409
11414 5409 -16171 -49890 -32843 -5807 -2682 -38153 -26933 -14935 -22314 -39436 -49757 -33500
11402 -33500 -5391 -17751 -31497 -22600 -1653 8153 5945 -4581 -4814 11518 35519 42118 43066
11389 43066 51291 31309 1072 -18330 3900 13316 16694 7466 10795 35947 47425 49274 20748
11376 20748 22030 26477 11606 -7819 -22809 -15204 8319 27975 4092 20848 55798 29427
11364B9427k6667k6115P526L1823J1679L194l493l663k4739J224J1516k7798O685
11351i401K0430J2221P755N205L775j1938R479k71l928j7529j8901p656r88J6791
11337E044J1358K629O872M356J092o009K143j3754r615J1945j1410N912K969n944
11323G588J3571Q099J9079J3263M790K138K160L252k0882m506P556j557P500j0326
11309E1725N736k5115j9789J5441r046L1554M778k444j3776p907J669o813o399
11296A9614j846J1768o632k1198l079J7405j083J000J614K397J2734K0667k2010
11283C1351j1774p063J5278r504l1421J444J1198M329M372l3768k511J1944k038
11270a8163K0094J9651Q525o291K409q127L551P601J1414j8318j8788j4578J768
$$ plain form
11364 29427 2760 -23355 -15829 15994 27673 30867 27374 23711 -1028 196 11712 -16086 -9401
11351 -9401 11029 23250 31005 36210 39985 28047 37526 37255 33327 15798 -3103 -10759 -11747 5044
11337 5044 16402 19031 25903 30259 31351 25342 27485 13731 4116 16061 4651 10563 13532 7588
11323 7588 21159 29258 48337 61600 66390 68528 70688 73940 53058 48552 56108 54551 62051 51725
11309 51725 57461 32346 12557 27998 18952 50506 55284 52840 39064 31157 32826 26013 19614
11296 19614 17768 29536 22904 1706 -1373 16032 14949 15949 17563 19960 32694 53361 31351
11283 31351 19577 12514 27792 18288 -13133 -11689 -491 3838 8210 -25558 -28069 -16125 -18163
11270 -18163 1931 21582 30107 23816 26225 18098 21649 29250 40664 22346 3558 -11020 -9252
11257i252J622O3q921j4522k455J433J1317J0296n795k0190j582M582K3228J1068
11243H92J5493M62j0157M791q348k927K443K2076o607j2102J439j2076j4650L541
11229a5730k2572n149J6847L935J403J7562Q902J4262k1170J2190j9943j0709
11217b0172P674j1395j2738P183J0738N167k7633n349J8501M783j5274j0202K5481
11204b3236K7507O462q733j066P269k0899j7718L7245J1526j6364o837L944j5195
11191a6095p000j2594o585n651J7513R871O679n324J9938Q268l818j3037k199
11178a0034j3373j1519J0398M598J978K0207M024j7054n017Q168j834L095O255
11165a08R313j6069j4195L770K3383K1638J7464j4308k9316p280J0152J4331J4365
$$ plain form
11257 -9252 -7630 -7567 -16488 -31010 -33465 -32032 -20715 -10419 -16214 -36404 -37986 -33404 -10176 892
11243 892 16385 16847 6690 11481 3133 206 2649 24725 18118 6016 7455 -4621 -19271 -15730
11229 -15730 -38302 -43451 -26604 -22669 -21266 -3704 5198 19460 -1710 10480 -9463 -20172
11217 -20172 -12498 -23893 -36631 -29448 -18710 -13543 -41176 -46525 -28024 -23241 -38515 -48717 -23236
11204 -23236 4271 10733 2000 934 8203 -12696 -30414 6831 18357 1993 -4844 -900 -16095
11191 -16095 -23095 -35689 -42274 -47925 -30412 -20541 -13862 -19186 752 9020 5202 -7835 -10034
11178 -10034 -23407 -34926 -24528 -19930 -17952 2255 6279 -10775 -15792 -7624 -9458 -6363 -108
11165 -108 9205 -6864 -21059 -17289 6094 27732 45196 30888 1572 -5708 4444 18775 33140
11152C3140k000O94l9697o17k38r157o313R918j117o629L1992j2164l2303k552
11138c7043J2514J0293Q387J8684j9974n427O44N355j531J7381K0391O890Q749
11125D5313l7422P280N385k8528j3084J8289K1873J6951j330l4058k9734j0497
11113c9562J0742L102m835k246j3315o671M935M0965J2333r807p13p044K030j5763
11099b5849j1640K0870J6620L363j024k0530n788J1681P141r267l902j4241J4163
11086a8403J0161J3185J0121j9049j2615j9931k781K9199K3156O599N924O142
11074C1708m242k8265k5542j8676J3978K969N885k082J3446M2468L8m899j1534
11061A5252j3530J4152m684j3326q328l529R861J2281k1817J1712R370L660N813
$$ plain form
11152 33140 31140 31834 -7863 -8480 -8718 -17875 -24188 -14270 -15387 -22016 9976 -2188 -34491 -37043
11138 -37043 -24529 -14236 -5849 12835 -7139 -12566 -11922 -6567 -8098 9283 29674 36564 45313
11125 45313 7891 15171 20556 -7972 -21056 -2767 19106 36057 34727 669 -29065 -39562
11113 -39562 -28820 -25718 -30553 -32799 -46114 -52785 -47850 -6885 5448 -4359 -5072 -12116 -10086 -25849
11099 -25849 -37489 -16619 1 3364 2340 -18190 -23978 -12297 -5156 -14423 -18325 -32566 -18403
11086 -18403 -8242 4943 15064 -3985 -16600 -36531 -39312 -10113 13043 19642 25566 31708
11074 31708 27466 -799 -26341 -45017 -31039 -28070 -22185 -24267 -10821 31647 31685 26786 15252
11061 15252 1722 15874 11190 -2136 -10464 -13993 -4132 8149 -13668 -1956 7414 11074 16887
11048A6887l192r747j8878k4692M281J5098K1487J8726K5260j2225k1615j1629
11036b39n004j2329M278P965K1399j9459j2631j4016m667n045J9036K3579m811
11023a944k1424j0598j0678K1207J7006j888r197o284j8006J3538K6215J3069
11011A1016J1203J9472o84Q19r97O402J6302k5249k0479j2815n182r133j6212
10998b5537j7066L3606K878k115j7660l112P894K089q159j7427R424M846O205
10985b4134J4178p230j1257M736J6404Q018O187K404j8621j9745K9300k539j3391
10972a5690R087J6848M525j1404m636J5528J4813P307l4866k233P096N61r063
10959b127O57j772l082q643k9124k479j3667J2690Q820J3899J4560J3321J2305
$$ plain form
11048 16887 13695 3948 -14930 -39622 -35341 -20243 1244 19970 45230 33005 11390 -239
11036 -239 -5243 -17572 -13294 -5329 16070 -3389 -16020 -30036 -34703 -39748 -20712 2867 -1944
11023 -1944 -23368 -33966 -44644 -23437 -6431 -8319 -17516 -23800 -41806 -28268 -2053 11016
11011 11016 22219 41691 41007 41826 40829 47231 63533 38284 17805 4990 -192 -9325 -25537
10998 -25537 -42603 -8997 -6119 -8234 -25894 -29006 -21112 -19023 -27182 -44609 -35185 -30339 -24134
10985 -24134 -9956 -17186 -28443 -23707 -7303 715 6902 9306 -9315 -29060 240 -2299 -15690
10972 -15690 -6603 10245 14770 3366 -1270 14258 29071 36378 1512 -721 6375 6936 -2127
10959 -2127 -1470 -3242 -6324 -14967 -44091 -46570 -60237 -47547 -38727 -24828 -10268 3053 15358
10946A5358n536j7875j5566K346J3009j8693l127K3294j5130q671K8435J7343
10934A5187j0415N086J9597p918j7753R577K0500M465l8692k7839p961J463j2062
10921d6765J1672J4727J0302O392J0444m979n583j5854l006j3001J0294J5077
10909a0280j1412k172n012q184K4597n360Q668O654o521J3626l674j1202j442
10896a1714m97L579j923q309r839J3836K9061j5302j3200l690q58j54J9308J0805
10882A1103j2581j0441m888r846n421J7292K5788J5566N560j00J4516k587k7200
10869A6761k2272M31l817j1947K4958r534k176n6J9246J8593l5494l3162j3102
10856e1571O922l614M33L7796k0033k2049K1025K8084r205k1097J2512j985k74
$$ plain form
10946 15358 9822 -8053 -23619 -21273 -8264 -26957 -30084 -6790 -21920 -30591 -2156 15187
10934 15187 4772 9858 29455 21537 3784 13361 33861 38326 -366 -28205 -36166 -34703 -46765
10921 -46765 -35093 -20366 -10064 -3672 6772 1793 -3790 -19644 -22650 -35651 -25357 -10280
10909 -10280 -21692 -23864 -28876 -37060 -12463 -17823 -9155 -2501 -9022 4604 930 -10272 -11714
10896 -11714 -12211 -8632 -10555 -18864 -28703 -14867 14194 -1108 -14308 -17998 -18856 -19010 298 11103
10882 11103 -1478 -11919 -16807 -26653 -32074 -14782 11006 26572 32132 32032 46548 43961 16761
10869 16761 -5511 -5080 -8897 -20844 4114 -5420 -7596 -7652 11594 30187 -5307 -38469 -51571
10856 -51571 -44649 -48263 -47830 -10034 -30067 -52116 -31091 -3007 -12212 -33309 -20797 -22782 -23056
10843b3056O316K2573J8834k9327k5139M478J0559K3981J4789j7428n780j006
10831b06q934M147K0678j2201n556j1455j3845k205R970J0486rk0089J4395J8742
10817C918k0877J014J8256k317r780k624J4833J435r376M511M870k0328n896K1753
10803f08Q169j2481m588K1260j1384j0356L301K9825m779j8531j5134j071J1864
10790d513p07J222n555p853J3317o522P955Q370j1247M248J109r363p199J4311
10776b427n078J6032j3283r146R752M132K0476K141J0545N963j3234o785n861
10763A3227j6371n431M390j2401r785N132J549K2936R013p326m098r295J0784
10750B324J71j7794j0779K2330J1253J5534R81j9685J9431o729r762j0515r59
$$ plain form
10843 -23056 -16740 5833 24667 -4660 -29799 -25321 -14762 9219 24008 6580 800 -206
10831 -206 -9140 -4993 15685 3484 -2072 -13527 -27372 -29577 -19607 -9121 -9130 -29219 -14824 3918
10817 3918 -16959 -15945 2311 -6 -9786 -12410 2423 3858 -5518 -1007 3863 -16465 -22361 -608
10803 -608 7561 -4920 -9508 11752 368 -9988 -6687 23138 18359 -172 -15306 -16377 -4513
10790 -4513 -5220 -3998 -9553 -17406 -4089 -10611 -2656 5714 -5533 -1285 -176 -9539 -16738 -2427
10776 -2427 -7505 8527 -4756 -13902 -4150 -18 20458 22599 33144 39107 25873 19088 13227
10763 13227 -3144 -8575 -4185 -16586 -26371 -21239 -19690 3246 12259 4933 835 -8460 2324
10750 2324 2495 -15299 -26078 -3748 7505 23039 24020 4335 23766 17037 7275 -3240 -4199
10737d199o296M910O70p533m993J5150N093j6717l4807l807P908J9123K0200n468
10723a0766k511p372l026L2553R474q014j2342j0540p708K5459K8864J0450K214
10710D6735J0361J3456l5269m0077k3605j1340O340j6464Q350L095J3276M671
10698b0471N930k3328k396m466K425k543P722L5320j944p385J3044q449P13R319
10684C491n739J3567j0719j6815n977J3248K2111m697k2954j3841K3557j983L918
10671b833J1002l1674k5746J1789J7569J9862L059j8951k4640K2827K1973K3595
10659B7832j2077l006j3806L170J3j1556j447O885Q065J5646k0257q307J0070
10646A225k672j6834L707R571j9242o203p333M4J0980j0146K6938K0393j2762
$$ plain form
10737 -4199 -10495 -5585 -4915 -12448 -17441 -2291 2802 -13915 -48722 -52529 -44621 -25498 -5298 -10766
10723 -10766 -13277 -20649 -23675 8878 18352 10338 -2004 -12544 -20252 5207 34071 44521 46735
10710 46735 57096 70552 35283 -4794 -28399 -39739 -33399 -49863 -41513 -38418 -25142 -20471
10698 -20471 -14541 -37869 -40265 -44731 -42306 -44849 -37127 -1807 -3751 -11136 1908 -6541 -5828 3491
10684 3491 -2248 11319 600 -16215 -22192 -8944 13167 8470 -14484 -28325 -4768 -6751 -2833
10671 -2833 8169 -23505 -49251 -37462 -19893 -31 3028 -15923 -40563 -17736 4237 27832
10659 27832 15755 12749 -1057 2113 2126 -9430 -10877 -3992 4073 19719 -538 -8845 1225
10646 1225 -1447 -18281 -14574 -5003 -24245 -30448 -37781 -37737 -26757 -36903 -9965 10428 -2334
10633b334j7739r812J8542M70l5443j8519L442J9476L3727j8212j8773J0040K0568
10620a4567M799O038L634j8239r039q029M304J6942j7752p011K1601L299j538
10607a5558J7567J2313J6211n997j0461o358j1248R7O445l425J627J1541O430
10594A9184j2411J4173l962j1768o190K042j6176q121N753j2533k338P883j41
10581b4605l304K2882K1779m693o9r887J4906j294j2389l7664j4218K3394l099
10568b8261O459O602m325P201K899k954J5003Q353o60k886o857R670p993p217
10554d966j244j7981J2693K1875j1522j9604J7448l070J8514j0036m64K0192L0963
10541E2798j7139j5651j3098j0957k3103J0195R503K798K5266k1782j2409K7156
$$ plain form
10633 -2334 -20073 -29885 -11343 -10873 -46316 -64835 -61393 -41917 -8190 -26402 -45175 -35135 -14567
10620 -14567 -9768 -3730 -96 -18335 -27374 -35403 -31099 -14157 -31909 -38920 -17319 -14020 -15558
10607 -15558 2009 14322 30533 24536 14075 7717 -3531 -3434 3011 -414 1213 12754 19184
10594 19184 6773 20946 16984 5216 -974 1068 -15108 -23229 -17476 -30009 -32347 -24464 -24605
10581 -24605 -27909 -5027 16752 12059 11990 2103 17009 15715 3326 -34338 -48556 -25162 -28261
10568 -28261 -21802 -15200 -19525 -12324 -9425 -12379 2624 10977 10317 7431 574 10244 2251 -4966
10554 -4966 -6210 -24191 -11498 10377 -1145 -20749 -3301 -6371 12143 2107 1643 21835 52798
10541 52798 35659 20008 6910 -4047 -27150 -16955 -7452 -4654 20612 -1170 -13579 13577
10529A3577j4486k4650Q627K4766k376L906j2255L960l166o278J8120J736j994
10516I487n73l0249l2621m414M702K6941L894J1896J2316r528j9498J0302J2195
10503e150j2275j7990K0026M565o538Q677N756L983k9027J0125k5706Q135K9284
10490f135K1093M699l1534k4248L078J7026K2836j153m625R829K0179j7509n712
10477G824j6567k2259k51P868J1187J7834J4377J5405k677R4j1113J779j6159
10464G342m5470M343K2378J3842j0342L4733l304k9784P322K715O099l137j0087
10451c350j8057k599R183R245q44P800J1549p253j7238J2335P955m970q530j1964
10437a6738m281o515J1406L1426J1595j0255j986n329l549N370K6721L1791L1384
$$ plain form
10529 13577 -909 -25559 -16932 7834 5458 9364 -2891 1069 -2097 -8375 9745 11481 9487
10516 9487 8914 -21335 -53956 -58370 -53668 -26727 -22833 -10937 1379 -8149 -27647 -17345 -5150
10503 -5150 -17425 -35415 -15389 -10824 -17362 -8685 -2929 1054 -27973 -17848 -43554 -35419 -6135
10490 -6135 14958 19657 -11877 -36125 -33047 -16021 6815 5662 1037 10866 31045 13536 7824
10477 7824 -8743 -31002 -31253 -23385 -12198 5636 20013 35418 32741 32835 21722 23501 7342
10464 7342 -38128 -33785 -11407 2435 -7907 26826 23522 -6262 1060 3775 9874 6737 -3350
10451 -3350 -21407 -24006 -14823 -5578 -6422 1378 12927 5674 -11564 771 8726 3756 -4774 -16738
10437 -16738 -21019 -27534 -16128 15298 26893 16638 14652 9323 5774 11144 37865 69656 101040
10424A01040L43k1281n007n614k8055K164K108j7248j3006N816R318k4115j7838
10411a1375q742j8507j2323J5633J3096J6913N011k2270o618l40J217k721j718
10398c2744J9740J5095J7810j4776l218R87l0227k109O283L8098p953k4176j0142
10385b7332n790j5475K0105K8048J5926j2147k0340j668J698Q109J2557J9785
10373B3476j3656j2570R349J4218P675j6298J1019l0820J607K1020J898K63J5295
10360C2476q752j3332R61j6330r148Q91k2049J0565n870K1805R544j2136l422
10347a4797J2655j108k7978J0447N711L1026P243j1099j0620O578j290K415N896
10334A5079j0507k6915j0938L8314j2329j6318J0772j770p078K965j7705j0287
$$ plain form
10424 101040 101383 80102 75095 69481 41426 43590 45698 28450 15444 21260 30578 6463 -11375
10411 -11375 -20117 -38624 -50947 -35314 -22218 -5305 -294 -22564 -29182 -29522 -28305 -31026 -32744
10398 -32744 -13004 2091 19901 5125 1907 2894 -27333 -29442 -23159 14939 6986 -17190 -27332
10385 -27332 -33122 -48597 -28492 -444 15482 3335 -17005 -18673 -16975 -8866 3691 23476
10373 23476 9820 -2750 6599 20817 28492 12194 23213 -7607 -6000 15020 16918 17181 32476
10360 32476 23724 10392 11353 -4977 -14125 -13234 -35283 -24718 -30588 -8783 761 -11375 -14797
10347 -14797 -2142 -3250 -31228 -20781 -15070 15956 23199 12100 1480 8058 6768 9183 15079
10334 15079 4572 -22343 -33281 5033 -7296 -23614 -12842 -14612 -21690 -18725 -36430 -46717
10322d6717N174O811K6754K2459J797R393J3419R11k544j3718j8680j1865J1336
10309D530P53j3036k0821K152m350J6154J8701J836R960j9027M983K850n421j74
10295i10j5763j6541J5837N870J0379J31k0635j2321J4267J0007N970J0919m319
10282B891k4603j6517M653K2937j4897M04l623j2277J3540J4948J0006q653j5071
10269b6262R296K3927r980L87j2199j1570j8357J4353J3662K134o349J3806k0020
10256b7172j315Q447O928j407k208k699l2425M524L7392K0382P865m527O84n758
10242H711k2394j1440J980J9781r369j3900r496N751J2192N161j1691L334k1529
10229d2909m991J3750J304P161J3146J2896J0736j534r427p386P177K1319l568
$$ plain form
10322 -46717 -41543 -34732 -7978 14481 16278 25671 39090 40001 37457 23739 5059 -6806 4530
10309 4530 5283 -7753 -28574 -26422 -30772 -14618 4083 5919 15879 -3148 1835 4685 -736 -910
10295 -910 -16673 -33214 -17377 -11507 -1128 -997 -21632 -33953 -19686 -9679 -3709 7210 2891
10282 2891 -21712 -38229 -33576 -10639 -25536 -25132 -28755 -41032 -27492 -12544 -2538 -11191 -26262
10269 -26262 -16966 6961 -3019 -2632 -14831 -26401 -44758 -30405 -16743 -14609 -20958 -7152 -27172
10256 -27172 -28487 -20040 -13112 -14519 -16727 -19426 -51851 -47327 -9935 10447 18312 13785 14469 8711
10242 8711 -13683 -25123 -23143 -3362 -12731 -26631 -36127 -30376 -18184 -13023 -24714 -21380 -42909
10229 -42909 -47900 -34150 -32846 -25685 -12539 357 11093 9559 132 -7254 -77 21242 17674
10216A7674j1427J4543j010j0717K4266n789j3334j2547P465n190j8457l129J7300
10203c52q463L297k71K0214Q282q910k6850P463J3121K5869O292k2845k2263M80
10189d936R875J4081M562j0684o244P243L4438J8148O057J409N0015Q0913J09765
10176C14642R3415M9338M4609P7622Q5720J4041q1823q7456m8687p0013q1385
10165C10023o8592o7499o2399m0032J6192M486l0251j0780m238J9335j4627l8704
10153A2914J029K38J1342O248p655J390K848K1534o99J3955q756q392j1089n835
10139B9072j8617M702l216j5474J1344J3486j595k1113j045J0755J6101M003l131
10126B5272p789j6364k2372J3893N938Q558J3651k460R448l3026k6870K3935K0731
$$ plain form
10216 17674 6247 20790 19780 9063 33329 27540 14206 1659 9124 3934 -14523 -17652 -352
10203 -352 -8815 -5518 -5789 14425 22707 13797 -13053 -5590 7531 33400 39692 16847 -5416 -4936
10189 -4936 4939 19020 23582 12898 6654 13897 48335 66483 72540 73949 123964 204877 314642
10176 314642 408057 457395 502004 579626 665346 679387 597564 510108 461421 391408 310023
10165 310023 241431 173932 111533 71501 87693 92179 61928 51148 46910 66245 51618 12914
10153 12914 13943 14181 25523 31771 24116 25506 28354 49888 49189 63144 54388 45996 34907 29072
10139 29072 10455 15157 11941 -3533 7811 21297 19702 -1411 -2456 8299 24400 28403 25272
10126 25272 17483 1119 -21253 -7360 -1422 7136 20787 18327 27775 -5251 -32121 -8186 12545
10113A2545J1339j3542j6378o78j6113J0324p590J3031L3677K1317J4975N256
10101F8163n0976m6882j6705J9956K8234p505j5405p670J1048o421N269J9359
10089D65p229L669P009N8j5183K888L6534J9120j1880o383k9069l189n518J656
10075g052J1207j0281O77J6804O792n067p697o173j9715q454K7318J5481k1328
10062g488J0q782m089J2902R45q203k1263k9363Q438Q682J3356M577J2113P28
10048a7437o831J1336K3776J4408j4981k6357j430J4633J7735n620j7411j5865
10036b4044J6291r589m038Q570k7578j1811J7731k93J8216K6385l069j5506n548
10023a4283j6867j0244n97P440K8442J1362J6216j6050K1437M659o439k0358O076
$$ plain form
10113 12545 23884 10342 -6036 -6714 -22827 -12503 -20093 -7062 26615 47932 62907 68163
10101 68163 17187 -29695 -46400 -26444 1790 -5715 -21120 -28790 -17742 -24163 -18894 465
10089 465 -6764 -3095 3914 3972 -11211 -8323 28211 47331 35451 29068 -1 -3190 -8708 -7052
10075 -7052 4155 -6126 -5449 11355 18147 13080 5383 -790 -20505 -28959 -1641 13840 -7488
10062 -7488 -7478 -16260 -20349 -7447 -6502 -14705 -35968 -65331 -56893 -48211 -34855 -30278 -18165 -17437
10048 -17437 -24268 -12932 10844 25252 10271 -16086 -17516 -2883 14852 9232 -8179 -24044
10036 -24044 -7753 -17342 -21380 -12810 -40388 -52199 -34468 -34761 -16545 9840 6771 -8735 -14283
10023 -14283 -31150 -41394 -41991 -34551 -6109 5253 21469 5419 26856 31515 25076 4718 10794
10010A0794K0899k0154j8537K0499l811K6560J2499l172j6032r318j5305K0061
9998B4983M739l3337j7703K094j0861n598K925L169K1329l324o924K3993J1802
9985A7287M549Q042j5503J755m962k5659k210J1302J5516j8649n988J7560K0460
9972B3500J665k169j3168J962m335J0562K174p233j7177K6438K3496p424j1548
9959B6743k1338m403M852J549R965j5824j1926j8276j2632J2358J2352J2302n719
9946i997k083J1207P514O349J8633n372l8883j0984R576J6290Q017p207k629k432
9932b001j3632P497J5090J0116J3896j7259j7623N132r761k13j0969R862J7591
9919G726N82l796K147J3878K2192k3465m608j9080Q003L053k2418N063J164Q512
$$ plain form
10010 10794 31693 11539 -6998 13501 9690 36250 48749 45577 29545 20227 4922 24983
9998 24983 29722 -3615 -21318 -19224 -30085 -35683 -32758 -29589 -8260 -11584 -18508 5485 17287
9985 17287 21836 29878 14375 16130 11168 -14491 -16701 -5399 10117 -8532 -14520 3040 23500
9972 23500 25165 22996 9828 11790 7455 18017 20191 12958 -4219 22219 45715 38291 26743
9959 26743 5405 1002 5854 7403 17368 1544 -10382 -28658 -41290 -28932 -16580 -4278 -9997
9946 -9997 -12080 -873 6641 12990 31623 26251 -12632 -23616 -14040 2250 10267 3060 431 -2001
9932 -2001 -15633 -8136 6954 17070 30966 13707 -3916 1216 -8545 -8758 -19727 -9865 7726
9919 7726 8308 4512 6659 20537 42729 19264 14656 -4424 3579 6632 -15786 -10723 -9559 -1047
9905a047J8472J5298L37L550P006j8937O228j3349J8630J6796r679j1434k548
9892B9323L882J7265J2536o063r585J497M427j2656j6758L586J441l451J1798
9879C7242k3754l864M324j2239j3016j0194M948K8705J9156l925k9198r886J8758
9866G057j4907J4174J8032N552k3859Q04r68N973J984j192K038J3919j4289m679
9852I639O194K1185j2562k784J3544o21O715j0743k1286p38j0533K0889p171J247
9838A2975J9141p69m8139J4748K4801L545K29M873j7877k1221J5468m313J5573
9825A9034J9353Q677j5422k1250k2599J870Q298O141j987L20L492m56j0057K6856
9811B2270M632j6783J0020N1015J3463l5899k3784O728j5293k0300r413J8379
$$ plain form
9905 -1047 17425 32723 33060 36610 43616 24679 30907 17558 36188 52984 43305 31871 29323
9892 29323 33205 50470 63006 56943 47358 48855 53282 40626 23868 27454 28895 25444 37242
9879 37242 13488 9624 13948 1709 -11307 -21501 -16553 12152 31308 27383 -1815 -11701 7057
9866 7057 -7850 6324 24356 29908 6049 6853 5885 11858 13842 12650 14688 28607 14318 9639
9852 9639 15833 37018 24456 21672 35216 34595 41310 30567 9281 8543 -1990 18899 11728 12975
9838 12975 32116 31347 -16792 -2044 22757 26302 26531 31404 13527 -7694 7774 3461 19034
9825 19034 38387 47064 31642 10392 -12207 -10337 -2039 4102 2115 2435 5927 5471 -4586 22270
9811 22270 26902 10119 20139 71154 84617 48718 24934 31662 16369 -3931 -13344 5035
9799E035k538j4769N240R182j6141J4430L6236M330j7836j6606l3959j3494M528
9786c6362J5653K3596J5073P982L284m946P755P286j3000k7343j3719K8116K1736
9773C5111j6827J7176Q424k230j8702k3883k2546O924J4821j4174K89J1652R203
9760E238K899R353n719J9217R292K481n598j0491j3399Q065P039j4909j0284l695
9746e11j1849k2731J5085K6063K6664O910J5519j9864j7708L046k585j0436J2578
9733B0181J308j2352k6553j1674R785K2139O899l880k313J8247L434N993p378
9720B3836m684j331q357J856L513K774j3354q524o005N380N169o426K5644J1786
9706C1277J4951J003n564j9949J319J2034Q525Q926l949j4869R532n971l7809
$$ plain form
9799 5035 2497 -12272 -7032 2150 -13991 439 36675 41005 23169 6563 -27396 -40890 -36362
9786 -36362 -20709 2887 17960 25942 29226 24280 32035 39321 26321 -1022 -14741 13375 35111
9773 35111 18284 35460 43884 41654 22952 -931 -23477 -16553 -1732 -15906 -15617 -3965 5238
9760 5238 8137 17490 11771 30988 40280 42761 37163 26672 13273 21338 28377 13468 3184 -511
9746 -511 -12360 -35091 -20006 6057 32721 39631 55150 35286 17578 20624 18039 7603 20181
9733 20181 21489 9137 -17416 -29090 -19305 2834 9733 5853 3540 21787 25221 31214 23836
9720 23836 19152 17821 9464 11320 14833 17607 4253 -4271 -10276 -4896 273 -6153 19491 31277
9706 31277 46228 47231 41667 21718 23037 35071 43596 52522 48573 33704 43236 37265 -544
9693e44J5522J2196p670j1240J5524J5275j2401R637Q057K5154R783J2472j8050
9680G3715j8506l431o631j3913K2965k090k6139k3365n914o584K9784Q167M271
9667C2329r413Q001j105j7780O797J5520k0062k2084j0556K073L4189L6187J0333
9654F4429J8120J685j0643l4518r181J4830L1447j726n464O557J2842j7751M561
9641G5188J4305j7766o833j2696o268J0997j8810M883q98j0262N046o205o194
9628B4487N632L326n219O467r81o94M34j52j2305k130K0718q839j1928M004k5790
9613b970K9670p16j5992K7213J5300j9720M157J2181l0300J1941K6393J45q003
9600D9299r919j1622K5408K0228l1869k1082j2165n243K2353J7204Q27k5563j8371
$$ plain form
9693 -544 14978 27174 19504 8264 23788 39063 26662 36299 44356 69510 79293 91765 73715
9680 73715 55209 51778 45147 31234 54199 52109 25970 2605 -3309 -9893 19891 28058 32329
9667 32329 22916 30917 29812 12032 18829 34349 14287 -7797 -18353 -16280 17909 54096 64429
9654 64429 82549 84234 73591 39073 29892 44722 76169 74443 68979 75536 88378 70627 75188
9641 75188 89493 71727 64894 52198 45930 56927 38117 43000 42102 31840 36886 30681 24487
9628 24487 30119 33445 28226 34693 33712 33018 33452 33300 20995 18865 39583 30744 18816 22820 -2970
9613 -2970 26700 25984 9992 37205 52505 32785 36942 49123 18823 30764 57157 57302 49299
9600 49299 39380 27758 53166 73394 41525 20443 8278 3035 25388 42592 43419 17856 -515
9587e15j7353K2520J3770m491r090K379J1475R475p50L498j1105r797j4032q08
9573d824Q792o933J3691N1256J3752k2706j7338K51Q2p236k841J261J2563J2670
9559E2440J0990j1244j4628J1161k5660J217J3129J613J5567J0959j4754n133
9547D5657J4582J0079N228j9300r03l411m105K0351L069k9874M592O9j399O531
9533E1166J3194l917j5273J0959j2729J0572P657n093p565K1875L265l40m690
9520F9081j009l3201j0739J3909L0703l159j6743j8425N182K301k925K519J0374
9507D7868N553K3794M488j1062j3459k0630j0042O463j0963o955j0122J7103J3576
9494C5612r178R647Q370j3597R07J8607m293j9708q137L784J5072P306j558J8949
$$ plain form
9587 -515 -17868 4652 18422 13931 4841 7220 18695 28170 27420 30918 19813 10016 -4016 -4824
9573 -4824 3968 -2965 10726 61982 75734 53028 35690 35941 36023 28787 25946 27207 39770 52440
9559 52440 63430 52186 37558 48719 23059 24276 37405 39018 54585 65544 50790 45657
9547 45657 60239 70318 75546 56246 55343 51932 47827 68178 71247 41373 45965 46034 44635 51166
9533 51166 64360 60443 45170 56129 43400 53972 61629 56536 48971 70846 74111 73771 69081
9520 69081 68072 34871 24132 38041 68744 65585 48842 30417 35599 37900 34975 37494 47868
9507 47868 53421 77215 81703 70641 57182 36552 26510 32973 22010 15055 4933 22036 35612
9494 35612 26434 36081 44451 30854 31761 50368 46075 26367 18230 22014 37086 44392 42834 61783
9480F1783P238j4742k0959N146J6017j8411j6499J5600M835Q251q1j0808j951
9467C5419j7100m202Q124j3374j4126J928p02K7647J0600j9769j2318J9743K6025
9454D7895P47k1007j7001J7702K524j8617k497K3747O778M178K81j136j3790m418
9440B5386L125J7040K1291N90j5060j5148j410j6199Q305J366J557J4472Q461
9427E3776M571L949J5386j3681k9135j8060P017n690J1439J7405K890J9225K0509
9414H9601m459n706j7933j8051M121K5626K9739K1622l0756l4056j6344K255j2011
9401C3648l114r677M692j6803J2323J2821k1J0330J447j8184j6838j418J5720
9388B4926K0666J7042P635M032K76j8760R51j5743N911r6N422Q415J6601m022
$$ plain form
9480 61783 69021 54279 33320 38466 54483 36072 19573 35173 40008 48259 48178 37370 35419
9467 35419 18319 14117 22241 8867 -5259 -3331 -4033 23614 34214 14445 2127 21870 47895
9454 47895 48642 27635 10634 28336 30860 12243 9746 33493 40271 44449 44730 43594 29804 25386
9440 25386 28511 45551 66842 67432 52372 37224 35814 19615 27920 29286 30843 45315 53776
9427 53776 58347 62296 77682 64001 34866 16806 23823 18133 29572 46977 49867 69092 89601
9414 89601 85142 79436 61503 43452 47573 73199 102938 124560 93804 59748 43404 45659 33648
9401 33648 30534 20857 25549 8746 21069 33890 33869 44199 45646 27462 10624 9206 24926
9388 24926 45592 62634 70269 74301 74577 55817 56768 41025 46936 46840 52262 60677 77278 73256
9374G3256k0436r507J1571q187K677K036o295L153n557k4467k549K5992J3449
9361E5136n649j3494o926J7228K9581J269J1308q607j6713m679j5868j1595j1910
9348A9081J8182J2197k6652M587L9634K6640j736l0702k0221J7085J0568j949
9336F6714J5585M993o374J0562J7596m773k376j7198j1894n309J9612J7211j1919
9323I2430j0331R330p713j4475j6433J3733K2003O392p376j5152J4992L1557N564
9310A24521q056j0591m958p504M585j0308n345J8335K1472N152k580j4706r98
9297A09019p678q689J8295J4003P60J926j1476j9661K69J2163L332J633J5745
9284A29641q564P574n945j2729J8514k4112k7915K9053R062j9527Q447j8081q915
$$ plain form
9374 73256 52820 43313 54884 46697 49374 51410 45115 48268 42711 18244 15695 41687 55136
9361 55136 49487 35993 29067 46295 75876 77145 88453 79846 63133 58454 42586 30991 19081
9348 19081 37263 49460 22808 27395 67029 93669 91933 61231 41010 58095 68663 66714
9336 66714 82299 87292 80918 91480 109076 104303 101927 84729 72835 67526 87138 104349 92430
9323 92430 82099 91429 83716 69241 52808 66541 88544 94936 87560 72408 87400 118957 124521
9310 124521 116465 105874 100916 93412 97997 87689 82344 100679 122151 127303 124723 110017 109019
9297 109019 101341 92652 110947 124950 125710 127636 116160 96499 96768 108931 112263 113896 129641
9284 129641 121077 128651 122706 109977 128491 104379 76464 105517 114579 95052 103499 85418 76503
9271G6503k3312Q748L5745J3284o379j5244p546M264N691j3909r836j324Q095
9258G4780r947m402j3123r750p518L2522K5252J0236J665j5817J5649K6881k06
9245A26222n800q02j7504R455M957p122Q287J8195K306K2461m321K863L048p336
9231A54909j1052J0042K2190J0241O561k5669l1206J1641J067p771J1424p610
9219A44767j1192J563m737K729j3226j7170j373K9787P608p359J7632L8502K8064
9206B15595l930j1839l7753j1118J8n7J473J0180K903k227O441Q436k0411J519
9192A59230p693r407k049L129n111j8781J9697m15n291N642o433k7245k0842p011
9178G7420P157J2387K0350k3796M516K6334L2364J0150K5583N376j0758L202J5254
$$ plain form
9271 76503 53191 61939 97684 110968 104589 89345 81799 86063 91754 77845 68009 66685 74780
9258 74780 64833 60431 47308 37558 30040 62562 87814 98050 99715 83898 99547 126428 126222
9245 126222 120422 119620 102116 111571 116528 109406 117693 135888 138194 160655 156334 159197 162245 154909
9231 154909 143857 153899 176089 186330 192891 167222 136016 147657 148724 140953 152377 144767
9219 144767 133575 135138 130401 133130 119904 102734 101361 131148 138756 131397 149029 187531 215595
9206 215595 211665 199826 162073 150955 150973 150916 152389 162569 165472 163245 169686 178122 157711 159230
9192 159230 151537 142130 140081 143210 138099 119318 139015 138600 133309 138951 132518 105273 84431 77420
9178 77420 84577 96964 117314 93518 98034 124368 156732 166882 192465 197841 187083 190285 205539
9165B05539j5579q078J1927j4732j7219j544J5155q415o377o570J595J653p592
9152A49763Q441q958J2995O235r585k275k044m036q327m28J8024J3960q235j8239
9138A47291j0706R590K5409Q44o84j9507j6671J5645J346j4729J2714J8477j783
9125A67236o673j3060j4158Q54L1683J9474k981o878P498j8419j772j0301n082
9112A47421J9531L3266L874j169p599j0415j6140j6211J1173O33L960j7174q29
9099A50321m25r749J952M827J5323J4844L5798K3106Q522j2705j0384K8051J5254
9086B64735l479k77K6666J1254J7679p871j9658p217o576Q184N993j0024j9425
9073B59984P934J7163k4561j3066K2317J6551m380o041P580j617k760j2360Q419
$$ plain form
9165 205539 189960 181882 193809 179077 161858 160314 175469 167054 160677 154107 155702 157355 149763
9152 149763 158204 149246 162241 168476 158891 156616 154572 150536 142209 141781 159805 173765 165530 147291
9138 147291 136585 146175 171584 172428 171744 152237 135566 151211 152557 137828 150542 169019 167236
9125 167236 160563 147503 133345 134199 165882 185356 182375 175497 182995 164576 162804 152503 147421
9112 147421 166952 200218 204092 202923 195324 184909 168769 152558 163731 164364 168324 151150 150321
9099 150321 149896 140147 142099 146926 162249 177093 212891 235997 244519 231814 221430 249481 264735
9086 264735 261256 260979 287645 298899 316578 308707 289049 281832 275256 283440 289433 279409 259984
9073 259984 267918 285081 260520 247454 269771 286322 281942 275901 283481 281864 279104 266744 275163
9060B75163L46K6525j041j7808J3304n545K2314J0194J266J0996J9716J1572J1786
9047C78788M674K3151O530J9396j1265j9427j434P288k1672k3133M155K2085Q343
9034C97479j826l295l2724Q176j895J8370K1363R321o255R265J9381k2600r516
9021D05244R754J293K0153J754j7583m002L4613K71k5333m96J3996K933K8280
9008D70877N232P848J5472P155l557j155N763o264K9293J6473n338O799J6433
8995E65031L0214q710L366l748j1369l975k161K0575J7526p133J7899L6492J8272
8982F72279R27J0750J7157K3998L1905m862L164Q639q326J9944K991o491j1037
8969G61038K6905O3785J7345o818j0087j2678J9489L4127L5779J6429K0606J5527
$$ plain form
9060 275163 275509 302034 300993 283185 296489 290944 313258 323452 324718 335714 355430 367002 378788
9047 378788 383462 406613 413143 432539 421274 401847 400413 407701 386029 362896 367051 389136 397479
9034 397479 395653 392358 359634 367810 365915 384285 405648 414969 408714 417979 437360 414760 405244
9021 405244 414998 416291 436444 438198 420615 416613 451226 451497 426164 425668 439664 442597 470877
9008 470877 476109 483957 499429 506584 503027 501872 507635 501371 530664 547137 541799 548598 565031
8995 565031 595245 586535 589901 586153 574784 570809 568648 589223 606749 599616 617515 654007 672279
8982 672279 673206 683956 701113 725111 757016 752154 755318 763957 755631 775575 778566 772075 761038
8969 761038 787943 851728 869073 862255 852168 839490 858979 893106 928885 945314 965920 981447
8957I81447Q286k0408p612L3882j3279Q013J3230J7548K157L1675M617k5631l3588
8944A000337j0916j8105l0716k0160j2965j4533Q89K4677L91j9752k519n678j9787
8931H71163J2553Q802L0614J9264j1082K472K891K9396L9090M1507L5667J0559
8919A092896L9364O545J4723K4683L8687M2590L2860J0731L8299K3456P252L1419
8907A403505k194k0275M3380M2081L8377J3636K6103Q064K385L4337N0056K0739
8895A660194j209L6204L5727M4749L9209L4562j850K6649M0929N5870L5428L9540
8883B046002O4220P3555M4915M4211N7699P2802N5156O1165N4956P2289R3042
8872B740012O6360O0043P2092Q0636J28510J06658J00419R3305J15710R5363R5068
$$ plain form
8957 981447 989733 969325 961713 995595 982316 990329 1003559 1021107 1023264 1054939 1059556 1033925 1000337
8944 1000337 989421 971316 940600 920440 907475 892942 893831 918508 918899 899147 896628 890950 871163
8931 871163 883716 892518 923132 942396 931314 933786 936677 966073 1005163 1046670 1082337 1092896
8919 1092896 1132260 1138805 1153528 1178211 1216898 1259488 1292348 1303079 1341378 1364834 1372086 1403505
8907 1403505 1401311 1381036 1424416 1466497 1504874 1518510 1544613 1552677 1555062 1589399 1639455 1660194
8895 1660194 1658985 1695189 1730916 1775665 1814874 1849436 1847586 1874235 1915164 1971034 2006462 2046002
8883 2046002 2110222 2183777 2228692 2272903 2330602 2403404 2458560 2519725 2574681 2646970 2740012
8872 2740012 2806372 2866415 2938507 3019143 3147653 3254311 3354730 3448035 3563745 3659108 3754176
8861C754176R8433J08379J13568J18676J38533J33314J44215J23435J60638J74008
8851E067375J95167K13214J91578K05698K41887L01655L51080L74233M71359O09670
8841H222916Q70106J238326J786595J834040N92189q23705j111878o92005k40574
8832A1676010L5885K03123L77618M81012N49497O13975O85273P50707Q21753R02630
8822A7097483R68213J053085J176796J283876J409497J541018J723701J928700
8814B8182369K181097K429804K689587K997001L324580L741252M214805M735256
8806E4495751N369063O067076O840363P749389Q666877R624828J0625402J1567395
8798A21006144J2364989J2838627J2876609J2250010J0771816Q430311N309638
$$ plain form
8861 3754176 3852609 3960988 4074556 4193232 4331765 4465079 4609294 4732729 4893367 5067375
8851 5067375 5262542 5475756 5667334 5873032 6114919 6416574 6767654 7141887 7613246 8222916
8841 8222916 9093022 10331348 12117943 13951983 14544172 13720467 12608589 11916584 11676010
8832 11676010 11711895 11915018 12292636 12773648 13323145 13937120 14622393 15373100 16194853 17097483
8822 17097483 18065696 19118781 20295577 21579453 22988950 24529968 26253669 28182369
8814 28182369 30363466 32793270 35482857 38479858 41804438 45545690 49760495 54495751
8806 54495751 59864814 65931890 72772253 80521642 89188519 98813347 109438749 121006144
8798 121006144 133371133 146209760 159086369 171336379 182108195 190538506 195848144
8791A95848144J669047k124758n622285q479133j0503641j1685165j2140890j2013021
8783A34948298j1497758j0759468r888122q987237q132567p332467o594740n916038
8775F5839901n338818m761413m263445l864007l502536l143444k834365k561072
8767C5570801k318937k100988j940852j785541j634464j486318j367838j275596
8759B1660267j202467j083401r76937r09262q68822q11766p39614o83520o31160
8750A3753318n90107n50952n61925n26024n01917m58718m55415m26903m06343
8741I275014l77062l55338l38306l11602l02349k93868k70213k88333k33821k26418
8731F277704k28221k09756k14226k13526j69341j70302j83874j81839j55323j52631
$$ plain form
8791 195848144 197517191 195392433 189770148 181291015 170787374 159102209 146961319 134948298
8783 134948298 123450540 112691072 102802950 93815713 85683146 78350679 71755939 65839901
8775 65839901 60501083 55739670 51476225 47612218 44109682 40966238 38131873 35570801
8767 35570801 33251864 31150876 29210024 27424483 25790019 24303701 22935863 21660267
8759 21660267 20457800 19374399 18397462 17488200 16619378 15807612 15067998 14384478 13753318
8750 13753318 13163211 12612259 12050334 11524310 11022393 10563675 10108260 9681357 9275014
8741 9275014 8897952 8542614 8204308 7892706 7590357 7296489 7026276 6737943 6504122 6277704
8731 6277704 6049483 5839727 5625501 5411975 5242634 5072332 4888458 4706619 4551296 4398665
8721D398665j36929j36126j04013j06634j16924j11152p8842o7145o9327p5004
8711C396569p7678n8281n7231p4385o7000o4820n9364o0514p6062o1533o2563
8700B677138m9493m9265m3070o1648m7456n3640p9272k0426k4681l2614n5510
8689B160063n2645q5406m8691m8943m9010k8447j5225n2278l5654j465p081k5224
8677A709994m0295m6308l8046m2058l9040r258m851j3386k1846j479j2760K719
8665A443386K3452j3180k3073k1303k4257l0368l4634j3679o485j6832j6811J8935
8653A285151m4386j7390l4615l2525j9519l0895l9112j9688l4474k0734k1116
8642I70697m2349o0262n7435l8095k7715k3497o1327m3289j5169j6356k3655n697
$$ plain form
8721 4398665 4261736 4125610 4021597 3914963 3798039 3686887 3608045 3540900 3471573 3396569
8711 3396569 3318891 3260610 3203379 3128994 3061994 2997174 2937810 2877296 2801234 2739701 2677138
8700 2677138 2627645 2578380 2535310 2473662 2426206 2372566 2293294 2272868 2248187 2215573 2160063
8689 2160063 2107418 2022012 1973321 1924378 1875368 1846921 1831696 1779418 1743764 1742299 1735218 1709994
8677 1709994 1669699 1623391 1585345 1543287 1504247 1494989 1490138 1476752 1454906 1453427 1440667 1443386
8665 1443386 1466838 1453658 1430585 1409282 1385025 1354657 1320023 1306344 1299859 1283027 1266216 1285151
8653 1285151 1240765 1223375 1188760 1156235 1136716 1105821 1066709 1047021 1012547 991813 970697
8642 970697 928348 868086 810651 772556 744841 721344 660017 616728 601559 585203 561548 555851
8630E55851P242o767N471o012k4924j7647J1028J3896n226q305q607K638n724
8617E12914k0630l451k738M139l6758Q187L652j0330j7089N477J2868j9992R656
8604D45905J6276l104N517j0108l678J6860j4666j9709N38R417j6730m99q335
8591D17684j6735K306J1077K2860J4131q101n2901M432K4386l3l315P442O189
8578D29422R661M276J949Q295o549j0876M475j3445l6963j4834J4578J5542P25
8565D06256O845n508J0791K6314J027j205j7160J2899k9382J924l392k2201k4506
8552C62702M284J7433J5034k796J8931j159q148k043n168l863j7946J8590k246
8539C93605n1601r544J5082L4903l056q386n152R648p518l7560j449P645j521
$$ plain form
8630 555851 563093 556326 561797 555785 530861 513214 524242 538138 532912 524607 516000 518638 512914
8617 512914 492284 488833 486095 490234 453476 461663 465315 454985 437896 443373 456241 436249 445905
8604 445905 462181 459077 464594 454486 450808 467668 453002 433293 433831 443248 426518 426019 417684
8591 417684 400949 403255 414332 437192 451323 443222 390321 394753 419139 419106 415791 423233 429422
8578 429422 439083 443359 445308 453603 447054 436178 440653 427208 390245 375411 389989 405531 406256
8565 406256 413101 407593 418384 444698 445725 444520 427360 440259 410877 412801 409409 387208 362702
8552 362702 366986 384419 399453 396657 415588 414429 406281 404238 399070 395207 377261 395851 393605
8539 393605 342004 332460 347542 382445 379389 371003 365851 375499 367981 330421 328972 336617 335096
8526C35096q139q155j1460o605n301j4180M451J6359K0661m909m955n043k6772
8513B81048k288k7081j1792O813l106K818j5673J151J7739o54k4462p343P912
8500B25082J982O760K65j7377k5397k1959p076J8470M8973j987Q610J0868q716
8487B38498K2817N329Q205J482q986k8725K068L935j0632l4422r301r673L032
8474A83627K2965J3795J8528j366j3970J590J3113K0966j719p335J148j266j207
8461B48869P68k3441k0829J921J033p670K6063K6701j1465l6452l2228O92r18
8448A73044L8666J3327k9191q671J1730J962P947j2831q652l150o47K0129n122
8435A98541k812m963j1769J4785M75l116J0101J5675j6189j6499l849k8035j9809
$$ plain form
8526 335096 326957 318802 307342 300737 295436 281256 285707 302066 322727 317818 312863 307820 281048
8513 281048 278760 251679 239887 246700 243594 246412 230739 231890 249629 248975 224513 217170 225082
8500 225082 227064 233824 234089 216712 191315 169356 162280 180750 229723 227736 236346 247214 238498
8487 238498 261315 266644 274849 276331 267345 238620 240688 244623 233991 199569 190268 180595 183627
8474 183627 206592 220387 238915 237549 223579 225169 238282 259248 257529 250194 251342 250076 248869
8461 248869 249637 226196 205367 207288 208321 200651 226714 253415 241950 205498 173270 173962 173044
8448 173044 211710 225037 195846 187175 198905 200867 208814 195983 187331 184181 183534 203663 198541
8435 198541 195729 190766 178997 193782 194257 191141 201242 216917 200728 184229 180380 152345 132536
8422A32536n553j5221k149J5710J8012J812J1097J2001j9795L776J3908J7856
8410A83990k596k055K133J2842j38Q518J4218j9297k6924p278j9519o648J0515
8397A47761K1205o844P609J823l468M881r737m433P847J8265l1910m0674l046
8384A09279J9219o305L05j9582j305K3335j222o540p194j0698J3420R699J0640
8371A33051j501J8151n850l9332k7650K0488k208p253P975K5227j2425j8895Q834
8358I8612Q166o761p391Q195N579q329j2919M0746J5011q539J339J532l976O270
8344A37535k056K676J5959j9368l2220R742J6218Q269J3221n380j7113l3828R185
8331A02840J4270k0589k3154K6122K9577M453K46j7988k8562j803o025m330L9774
$$ plain form
8422 132536 126983 111762 109613 125323 143335 145147 156244 168245 148450 152226 166134 183990
8410 183990 181394 179339 181472 194314 194176 202694 216912 197615 170691 163413 143894 137246 147761
8397 147761 168966 162122 169731 171554 168086 172967 163230 158797 166644 184909 152999 112325 109279
8384 109279 128498 122193 122498 102916 101611 124946 123724 117184 109990 99292 112712 122411 133051
8371 133051 131550 149701 143851 104519 76869 97357 95149 87896 95871 121098 108673 89778 98612
8358 98612 106778 100017 92626 100821 106400 98071 85152 125898 140909 132370 133709 135241 131265 137535
8344 137535 135479 138155 154114 134746 102526 112268 128486 136755 149976 144596 127483 93655 102840
8331 102840 117110 96521 73367 99489 129066 133519 133765 115777 87215 85412 79387 75057 114831
8318A14831J4985j4526j3158k5483l1174Q981K7377j567j3420j7099M329J4812
8306F8888J7648n629k6453j43J3520P663p284L400k0689l0896p70r761K7038J9993
8292E6525j759J4526J5593K0687j2836j1734k2510j4531Q093k3977j5978K7806
8280C9905l744r165j957N623K912j3157q785J8197K620l570J2763j0459j2447
8267A8736j8224o410L0784J7804j5370p815Q20R754J4384O635N729n733p529k805
8253D0760k820J0152L91Q131J6874K625j3457k0094J5041M172K215J601l678q458
8239E3455j5603N638L0455K7160l980j0632k5294j9424n127J354L546K4262k092
8226F3718P652k1128n656J4993r669m289p00j3034J1679Q621J8199L3155j817
$$ plain form
8318 114831 129816 115290 102132 76649 45475 54456 81833 80266 66846 49747 54076 68888
8306 68888 86536 80907 54454 54311 67831 75494 68210 71610 50921 20025 19255 9494 36532 56525
8292 56525 54766 69292 84885 105572 92736 81002 58492 43961 52054 28077 12099 39905
8280 39905 36161 26996 25039 30662 33574 20417 11632 29829 32449 28879 41642 31183 18736
8267 18736 512 -5898 24886 42690 27320 19505 20325 30079 44463 51098 56827 51094 43565 40760
8253 40760 37940 48092 48483 56614 73488 76113 62656 42562 57603 61775 63990 65591 61913 53455
8239 53455 37852 43490 73945 101105 97125 86493 61199 41775 36648 38002 41548 65810 63718
8226 63718 71370 50242 44586 59579 49910 45621 44921 31887 43566 52187 70386 103541 101724
8213A01724k5220k3052K90j5746j6469J6623n560P066L5200k540k2056J3817P238
8200G1315R472j4112p156K0356M532j8366r133m399r240k3791j927j2340k0412
8187a5201k3213K219J920J5958K4750J544k981J0994K2401k962o356J5954j9049
8174B5978j5223l580K2284J8805j0763o041j9476j708J197K2175K3230K294N40
8161E9712j3434r905J1634j6512k0839J8465K8098j2029k9720j1670k742o989
8149e931P201Q917n553j1098O187J0861l7653k4048K6808L1105k307j447j4858
8136a1816P055R248J6133R877K0928n470k0707P502J3315k762j2159k5633m198
8123A313j0381L537R204J4179L5L0752P087l271j9779r674N028J4153N561J2753
$$ plain form
8213 101724 76504 53452 53742 37996 21527 38150 32590 39656 74856 72316 50260 64077 71315
8200 71315 80787 66675 59519 79875 84407 66041 56908 52509 43269 19478 17551 5211 -15201
8187 -15201 -38414 -36195 -34275 -18317 6433 7977 4996 15990 38391 35429 29073 45027 25978
8174 25978 10755 7175 29459 48264 37501 31460 11984 10276 11473 33648 56878 59172 59712
8161 59712 46278 36373 48007 31495 10656 29121 57219 45190 15470 3800 1058 -5931
8149 -5931 1270 10187 4634 -6464 -277 10584 -27069 -51117 -24309 6796 4489 3042 -11816
8136 -11816 -4761 4487 20620 30497 51425 45955 25248 32750 46065 43303 31144 5511 1313
8123 1313 -9068 -5531 3673 17852 17887 48639 55726 52455 32676 23002 28030 42183 47744 60497
8109F0497m159P58l456K163M298p309m261P98J434j6778k271M867P456N707k9429
8094B0315l5985r008L9269L1439M965j5257m567K980J3533P291M427m2275j1886
8081E241L8164o648N859k850k39O98k801j3763l700J0949M786j0155Q319L3613
8067F7473L1981K365k3103K685p136J1070j5968k6794J892Q673L434l958J0750
8054F3364n227j3499L872p817p620J4811P042Q117m2j9237j6728N662l429p965
8040B1304P52J8918j1513j7173J5899j3275n903K688j1118r945p337q44j934J5838
8026c643L8191K1524j0677J102O626J1389l0968j0277m828k378q437l683M810
8013H751M71j1144K0186K2861J2914m688p716j3374R11m472j5406o448j0684L963
$$ plain form
8109 60497 56338 57096 53640 55803 60101 52792 48531 49329 50763 33985 31714 36581 44037 49744 20315
8094 20315 -15670 -24678 14591 46030 50995 35738 31171 34151 47684 54975 59402 17127 5241
8081 5241 43405 36757 42616 39766 39527 40225 37424 23661 19961 30910 35696 25541 33860 67473
8067 67473 99454 101819 78716 81401 74265 85335 69367 42573 44465 53138 56572 52614 63364
8054 63364 58137 44638 48510 40693 33073 47884 54926 63043 63001 43764 27036 32698 29269 21304
8040 21304 22056 40974 29461 12288 28187 14912 9009 11697 579 -9366 -16703 -17547 -19481 -3643
8026 -3643 34548 56072 45395 46497 53123 64512 33544 23267 18439 16061 7624 3941 8751
8013 8751 9222 -1922 18264 41125 54039 49351 41635 28261 29172 24700 9294 2846 -7838 -3875
7999c875J3674k9881k1152j9112N957K1735J3537K1262J2359R223o146N98K4238
7986D2417J6195p979o672m825L244o033j215J145j9562q00p530j3758O328M4947
7972D5902K3582l971r399j4814q565k2476O974j2664m63N87J0582M7850N552j0603
7958E8074l607k314k1567j3326l179J0962L048l016l9183J6623L3945m717m0371
7945h628P310j998O640J1106P290K647R961r338q333l147K2561j098J2741J446
7931D9160j684j5721j4512j3313m525J2722J9594j4010j0162j8427j1111J5786
7919f203J2397o486l232J5077Q213R35j2844l020J2947K4458j9185r520J3535
7906B7072O242j0402q136m039O910K1332J0344o100L793j6958R795J4220j1523
$$ plain form
7999 -3875 9799 -20082 -41234 -60346 -54389 -32654 -19117 2145 14504 23727 17581 18179 42417
7986 42417 58612 50633 43961 39136 42380 36347 35132 36277 16715 15915 8385 -5373 955 45902
7972 45902 69484 65513 56114 41300 32735 10259 17233 4569 4106 4693 15275 63125 68677 58074
7958 58074 54467 52153 30586 17260 14081 25043 28091 25075 -14108 2515 36460 31743 -8628
7945 -8628 -1318 -3316 3324 14430 21720 24367 34328 24990 16657 13510 36071 34973 47714 49160
7931 49160 47476 31755 17243 3930 -595 12127 31721 17711 7549 -10878 -21989 -6203
7919 -6203 6194 -292 -3524 11553 19766 20701 7857 4837 17784 42242 23057 13537 27072
7906 27072 33314 22912 14776 10737 17647 38979 49323 43223 47016 30058 39853 54073 42550
7893D2550j4123L98j6162J2194K1287P964j6472R492Q748j2494j1035j4103q041
7880A0203m836k1502k60p23L559J1694M377j0473J9685J9109J1482j5922j1275
7867A5118l371k3874j5340Q375K8189O074j0630l511N786m902J5288J9737J3862
7854E0801j6997n030l666j6837k5077O632N760r609J8764j3440p348K839J3331
7841A23L7861j0372k5016k2650J3945J7860O326k4883J0600J4454M496j7399k020
7828C325J3523R573p59R212k0414K793J4077j5263q14l0818j4668j3872J6998
7815b7107R773l39J6408j277L084O064J7813J0472J3673k1660j9059K2625J0507
7802D0977k5890j3925L103j0989n218j321J009J5373J0883J1637k8578k1331r210
$$ plain form
7893 42550 28427 28825 12663 24857 46144 54108 37636 47128 55876 43382 32347 18244 10203
7880 10203 5367 -16135 -16395 -17118 -13559 -1865 2512 -7961 11724 30833 42315 26393 15118
7867 15118 11747 -12127 -27467 -19092 9097 15171 4541 1030 6816 1914 17202 36939 50801
7854 50801 33804 28774 25108 8271 -16806 -10174 -4414 -14023 4741 -8699 -16047 -13208 123
7841 123 37984 27612 2596 -20054 -6109 11751 18077 -6806 3794 18248 22744 5345 3325
7828 3325 16848 26421 25662 34874 14460 17253 31330 16067 15253 -15565 -30233 -44105 -27107
7815 -27107 -17334 -17673 -1265 -2542 542 6606 24419 34891 48564 26904 7845 30470 40977
7802 40977 15087 1162 4265 -6724 -11942 -13263 -12254 3119 14002 25639 -2939 -24270 -33480
7789c3480J5256L0872J7921J7831q144j134r012n469o774l6967N452K6154M147
7776A6653N082k009k3194k568J3491r026m72j935k8361j8417K5170J8751j305
7763h140j959p011M179k0198l939K0013J5653M973J2627P188J520M44K732J8921
7749D7003p393l0342m945p920n334L1083J0778k5340m684j2348J716J9349J0035
7736B1658l8778j5509K4402K0435j3997m436O506J8043J7035k2645k1468o163
7724a4917p001r960R26J2623K5553L0066j6019j5799j1987k0590K234J0655Q849
7711e367Q412J0620j2867P613J5711J4961r563k4087k4751k450K3291J1301n553
7698G271q362l149q417J685L390J0154L373l764L401J3967m318j0470j6811P792
$$ plain form
7789 -33480 -18224 12648 30569 48400 40256 39122 30110 24641 17867 -19100 -13648 12506 16653
7776 16653 21735 19726 -3468 -6036 7455 -1571 -2043 -3978 -32339 -50756 -25586 -6835 -8140
7763 -8140 -10099 -17110 -12931 -33129 -37068 -17055 -1402 3571 16198 23386 24906 25350 28082 47003
7749 47003 39610 9268 4323 -3597 -8931 22152 32930 7590 2906 -9442 -7726 11623 21658
7736 21658 -17120 -32629 -8227 12208 -1789 -6225 281 18324 35359 12714 -8754 -14917
7724 -14917 -21918 -31878 -30952 -18329 7224 37290 21271 5472 -6515 -27105 -24871 -14216 -5367
7711 -5367 3045 13665 798 8411 24122 39083 29520 5433 -19318 -21768 1523 12824 7271
7698 7271 -1091 -4240 -12657 -10972 -7582 2572 5945 2181 5582 19549 15231 4761 -12050 -4258
7684d258L995M019J021K725L3j0484M434J2975n81n069p519M812J793q933j6313
7669a7350Q900J8737J3397q416l3520l604J481J3075j9991J1768K2137K7588J210
7656C5412k3048j4041j0269J6761J8983k475r909q887J0129k398l425J8163M083
7643B9079k5216j9749q140J2406J5455N99k29k702p618j422n387k0501J0121J1861
7629a1443M912J7598J377K2287K0417j2175k1588j1852k2117k7499J1002J9925
7617i156O79O329J568O787R623k361j3275j4675J234J3389R308m846p7j0065L024
7602b514J1519l419l345l335P944M338m259J086N473m043N567q792o032J241j9556
7587a8127K4556K435k533k8007k7469L5155R197n529J0597K600J0017k1969m781
$$ plain form
7684 -4258 -263 3756 4777 7502 7535 -2949 1485 14460 13879 8810 1291 6103 7896 -1037 -17350
7669 -17350 -8450 10287 23684 15268 -18252 -21856 -20375 -7300 -27291 -15523 6614 34202 35412
7656 35412 12364 -1677 -11946 4815 23798 21323 11414 2527 12656 10258 6833 24996 29079
7643 29079 3863 -15886 -24026 -11620 3835 4434 4205 1503 -6115 -7537 -12924 -33425 -23304 -11443
7629 -11443 -6531 11067 12444 34731 55148 42973 21385 9533 -12584 -40083 -29081 -9156
7617 -9156 -8477 -2148 -580 6207 15830 13469 194 -14481 -13247 142 9450 4604 4527 -5538 -2514
7602 -2514 9005 5586 2241 -1094 6850 11188 6929 8015 13488 9445 15012 6220 188 1429 -18127
7587 -18127 6429 8864 6331 -21676 -49145 -13990 -4793 -10322 275 2875 12892 -9077 -13858
7574a3858K6855J1666k1490M38j2894Q370J7877k878J0784J4518l323j4543K495
7561B4017p287J173n845J4298J034j2064K0987j48n786k3672l1257r07L5025k602
7547F966J3680M602l237M639J4774l4000k4967J11J9019j0772k140o396J384J3252
7533c085J2056k1316l7836j1472N0946j0591p506P790j7068k615J3660L0308l505
7520b34K6326j9159j0220j2402O691r586J1333J7387k725o23N183j1437j3104
7507a2570k2540p059J4114O130q117Q748J5802K6286J1032K28J42J053j2548j2755
7493G946o392k616J2411j798l292q199O859m596N96j060k8258j6163J0547m963
7479c8978o632J7426K1606N22m22K859j0362J5281J8632J7961k043l179l5869
$$ plain form
7574 -13858 12997 24663 3173 3611 -9283 -913 16964 14086 24870 39388 36065 21522 24017
7561 24017 16730 17903 12058 26356 27390 15326 36313 36165 30379 6707 -24550 -25457 9568 6966
7547 6966 20646 25248 22011 26650 41424 7424 -17543 -17432 1587 -9185 -11325 -17721 -16337 -3085
7533 -3085 8971 -12345 -50181 -61653 -10707 -21298 -28804 -21014 -38082 -40697 -27037 3271 -234
7520 -234 26092 6933 -3287 -15689 -8998 -18584 -7251 10136 7411 6788 11971 534 -12570
7507 -12570 -35110 -42169 -28055 -21925 -30042 -21294 -5492 20794 31826 32054 32196 33249 20701 7946
7493 7946 1554 -1062 11349 9551 6259 -1940 4919 323 919 -141 -28399 -44562 -34015 -38978
7479 -38978 -45610 -28184 -6578 -6056 -6478 -3619 -13981 1300 19932 37893 35850 32671 -3198
7466c198l1555j272L2182J5413j9103n961p811m047J7718q288j4290J1604J4639
7453c969R994l182j0668R622j6421k1570p548K1268K2009L843l615J494J6958
7440A8215n076j5494j3278M334r262N682o952Q242J902l5658J981J1479J0386
7427b3499J1345J630K292J8932r456K9392J9881j1944j0247Q303o280n244j4289
7414A0816j3031j1177o457J3765j4666l042M9883J2656l7481J2022l100j5957
7402e769j121n877j2844J3115n277j114J6745N065j1827J8682M0996j366k4602
7389B4806k3866J6125k763j1649J1237O644j3029j3160M167K598M110P612j3581
7376g49j3138J4972q661r583M230O103J1958o925j3016j1397K9305R594l982J5299
$$ plain form
7466 -3198 -34753 -36025 -3843 11570 -7533 -13494 -21305 -25352 -7634 -15922 -30212 -18608 -3969
7453 -3969 6025 2843 -7825 1797 -14624 -36194 -43742 -22474 -465 3378 -237 1257 18215
7440 18215 13139 -2355 -15633 -11299 -20561 -14879 -21831 -13589 -11687 -47345 -45364 -33885 -23499
7427 -23499 -12154 -10524 -8232 10700 1244 30636 50517 38573 28326 36629 30349 25105 10816
7414 10816 -2215 -13392 -19849 -6084 -20750 -23792 26091 38747 1266 13288 10188 -5769
7402 -5769 -6890 -12767 -25611 -12496 -17773 -18887 -2142 2923 -8904 9778 50774 49408 24806
7389 24806 940 17065 14302 2653 13890 20534 7505 -5655 -1488 1110 5220 12832 -749
7376 -749 -13887 1085 -7576 -17159 -12929 -6826 5132 -1793 -14809 -26206 3099 12693 8711 24010
7362B4010o348k3352L6901q841k4222o917j567K754p614M309O708J843L690m915
7348c561p359j9532K112J1440o654Q57Q013N829J7924q218l2178k7439K7684L9221
7334H139r894n928R913J3525k249k181j4723N845O798R034k2283l3694q178J8515
7320b7361J3756J3475j407p406L0510K3491j244r364p512j224n720k1694j6008
7307a7708K1355L8696Q493j0515r595j2558J2136J9177k349o290j4360j6162j0073
7294B47P775K0275j0995j2856L138q301j3454N879j0728j0715J0910K0273K400
7281C848k4872Q46O973k984J7852M161j8740m039j6060M204k027M746j762l865
7267c1719J5864J6265J166J0186R033j7961P866p431K023j3016j0009L43k698
$$ plain form
7362 24010 17662 -5690 31211 22370 -1852 -8769 -10336 -7582 -15196 -10887 -4179 -2336 1354 -3561
7348 -3561 -10920 -30452 -28340 -16900 -23554 -22697 -14684 -8855 9069 851 -31327 -58766 -31082 8139
7334 8139 -1755 -7683 2230 15755 13506 11325 -3398 2447 9245 18279 -4004 -37698 -45876 -27361
7320 -27361 -13605 -130 -1537 -8943 21567 45058 43814 34450 26938 25714 19994 -1700 -17708
7307 -17708 3647 42343 50836 40321 30726 18168 30304 49481 47132 40842 26482 10320 247
7294 247 8022 28297 17302 4446 7584 -717 -14171 -8292 -19020 -29735 -18825 1448 3848
7281 3848 -21024 -20178 -13205 -16189 1663 5824 -12916 -16955 -33015 -28811 -30838 -26092 -27854 -31719
7267 -31719 -15855 410 1576 11762 20795 2834 10700 3269 5292 -7724 -17733 -17390 -20088
7254b0088l44K2366n69j059l488j182j846o058L843J2809J6115P197P969r709
7240B5956j4080K6847k2751j0508m763M505J2775k059k510K0376M153j9876j0476
7227G589J3422L801k3238p413q101j0709j7617J1660L1587K3839j7309j7411l257
7214a3157J3967q376j2064k462K6450J2596j2700J3062J3645J2263J5607q357
7202E0474k7088p699r811L650J1241l851j9529j0999K651n971r078N568K5587
7189E145j1632J9523o674j2478j1898k062j4121J2810k258J5730K0694Q237j4157
7176F859R038N607O191m3079P268K3174n398J3717J5574j778m4799l2558K017
7163c8167K3615K8292M518j0583K211j1236q650p542j062P02j7413O449J7178
$$ plain form
7254 -20088 -20432 1934 1365 306 -3182 -4364 -6210 -12268 -8425 4384 20499 27696 35665 25956
7240 25956 11876 38723 15972 5464 701 5206 17981 15922 13412 33788 37941 18065 7589
7227 7589 21011 24812 1574 -5839 -13940 -24649 -42266 -30606 981 24820 7511 -9900 -13157
7214 -13157 810 -7566 -19630 -22092 4358 16954 4254 17316 30961 43224 58831 50474
7202 50474 23386 15687 5876 9526 20767 16916 -2613 -13612 -10961 -16932 -26010 -20442 5145
7189 5145 -6487 13036 6362 -6116 -18014 -20076 -34197 -21387 -23645 -7915 12779 21016 6859
7176 6859 15897 21504 27695 -15384 -8116 15058 9660 23377 38951 37173 -7626 -40184 -38167
7163 -38167 -14552 13740 18258 7675 9886 -1350 -10000 -17542 -18604 -17902 -35315 -28866 -11688
7150a1688m196n872K832J43Q163L218o504J0881R455J5354j5475k0687O861R091
7136A576r23j5356k4070j2159p693J6586J1160M932Q195L362p227J3931R64j4525
7122b1247j6604J4986J8363Q495k623l057j5468q149O989K934J496R264O640K1207
7108B3226J0833o070J3021K9631j2506j7593j2665j2994j7240j8153j048J9115
7096b443J7447J122J2592J3368q016p723o958j7163j1419J0630K4823j359l2042
7083g141r068O885j4594R632R237j3757J8123m01q535j31K653O133l86K0229N249
7068B4128j5025J6461j6552o816J2988k5549j707M214J8763j2985k4650j5051
7056d1781J3976J4892k889K606J0684J3018j475j2505k48K9019O036J8608q98
$$ plain form
7150 -11688 -15884 -21756 -18924 -18781 -10618 -7400 -13904 -3023 6432 21786 6311 -14376 -7515 1576
7136 1576 653 -14703 -38773 -50932 -58625 -42039 -30879 -25947 -17752 -14390 -21617 -7686 -6722 -21247
7122 -21247 -37851 -22865 -4502 3993 1370 -1687 -17155 -25304 -18315 -15381 -13885 -4621 2019 23226
7108 23226 34059 27989 41010 70641 58135 40542 27877 14883 -2357 -20510 -21558 -2443
7096 -2443 15004 16126 28718 42086 34070 26347 19389 2226 -9193 1437 26260 24901 -7141
7083 -7141 -16209 -9324 -23918 -14286 -5049 -18806 -683 -1084 -9619 -9750 -7097 -964 -1350 18879 24128
7068 24128 9103 25564 9012 2196 15184 -10365 -12072 -7858 10905 -2080 -26730 -41781
7056 -41781 -27805 -12913 -15802 -13196 -2512 10506 9031 -3474 -3722 25297 31333 49941 49043
7043D9043n76M816n54l206j3064J3587n790j6978k0663p556L13P522L169N073
7029A5136j0243R723j4824L306L285j1238r68J726J4811m5356j0702K0496K471
7016b2377Q779m746j4508P894n751j3011L682R971K4631J0586j0084j5928j4814
7003c5676j6896L9498N813Q665O477J0572j014n398k6073l5865j2127J0325J4016
6990c7683N602n091q344J3356J1298p256Q783Q240R17r683k972K4384P030K9505
6976C8086L155k5537j1584m1243P973R85j2087j3323L828J155K2964K1381j0042
6963a4289j6031m309P48K0519K4028r432k651j6207n247J1693n36M68J2073p754
6949f927j9563j937K1195R308j9598j3446m722r600M624Q178K484k60P292l454
$$ plain form
7043 49043 48467 53283 52729 49523 36459 50046 44256 27278 6615 -941 -628 6894 10063 15136
7029 15136 4893 14616 -208 3098 6383 -4855 -5823 -4097 10714 -34642 -45344 -24848 -22377
7016 -22377 -13598 -18344 -32852 -24958 -30709 -43720 -40038 -30067 -5436 5150 -4934 -20862 -35676
7003 -35676 -52572 -13074 -7261 1404 7881 18453 17439 12041 -14032 -49897 -62024 -51699 -37683
6990 -37683 -32081 -37172 -45516 -32160 -20862 -28118 -19335 -11095 -10178 -19861 -22833 1551 8581 38086
6976 38086 41241 15704 4120 -37123 -29150 -28165 -40252 -53575 -49747 -48592 -25628 -4247 -14289
6963 -14289 -30320 -34629 -33881 -13362 10666 1234 -1417 -17624 -22871 -11178 -11714 -11246 827 -6927
6949 -6927 -26490 -28427 -7232 2076 -17522 -30968 -35690 -45290 -40666 -32488 -30004 -30264 -22972 -26426
6935b6426j7288r328M222m28J3089L7322P880Q419r97k7691j3303R793j0135j131
6921b6002N608k035j9425M669L0094l82j907Q266R24j390J5898Q795J6303K090
6907D1506k942k2057m290j1179k5980j6524L238k670J1940J7020O197J0875J9230
6894B4364j3744j3036K1008O357k2202m92j0467j5514Q005K1050Q449J5488l1100
6881a834q285R889o505O965J1584K965k354j1301k098m335o415P593R986q241
6867b386l88J7915o800k7829j2506n291J2375K5503J6495M336j6453j3209j437
6854i675Q655n921J606Q021j3128J1550Q699J835m345m9845K205L0542K0240K4312
6840C4751q555l3306j6818n455M372j84J925J92J5462K8802J9084k260n227k311
$$ plain form
6935 -26426 -43714 -53042 -48820 -49248 -36159 1163 9043 17462 16465 -11226 -24529 -14736 -24871 -26002
6921 -26002 -20394 -22429 -41854 -37185 -7091 -7473 -9380 -1114 -190 -1580 14318 23113 39416 41506
6907 41506 38564 16507 12217 1038 -24942 -41466 -38228 -40898 -28958 -11938 -5741 5134 24364
6894 24364 10620 -2416 18592 24949 2747 2255 -8212 -23726 -15721 5329 13778 29266 -1834
6881 -1834 -10119 -230 -6735 230 11814 14779 12425 1124 -974 -5309 -11724 -4131 5855 -2386
6867 -2386 -2774 15141 8341 -19488 -31994 -37285 -24910 593 17088 21424 4971 -8238 -9675
6854 -9675 -1020 -6941 -5335 2686 -10442 1108 9807 11642 7297 -42548 -40343 -9801 10439 34751
6840 34751 26196 -7110 -23928 -29383 -25011 -25195 -23270 -23078 -7616 21186 40270 38010 32783 30472
6826C0472k1599R653o535r02o984j5522o978J6125L7033k427j6312j1399j9771
6813a5146o686R664J0764o00J3815k055k6735j5747M2350N2051j8241k1388k4806
6800b760K058J3780p134M933J3280j166K6822L2781p093l5457q843n932m064j4752
6786F453k2323l759J2781L5750k4392o0091J3395L5852J128J5990p774j5120P110
6773e000L492j5507J2288K7551l517k293J0764K159K9685j2748j4435k2039o692
6760C708k1243J83J9954l313j8169J170K9717O618q507n097J0408J7325k2754
6747A0000K782J1615o694j9065j5605k1046R078J5021J7634K4866j6927j6688
6735e029J0387j7624j3724j3067J7766K776j2310j676J7183k122l230L8749K2842
$$ plain form
6826 30472 8873 18526 11991 11089 4105 -11417 -18395 -2270 34763 32336 16024 4625 -15146
6813 -15146 -21832 -12168 -1404 -2004 11811 9756 -16979 -32726 9624 61675 43434 22046 -2760
6800 -2760 -702 13078 5944 10877 24157 22991 49813 82594 75501 40044 31201 25269 21205 6453
6786 6453 -15870 -19629 -6848 28902 4510 -55581 -42186 -6334 -5206 10784 3010 -12110 -5000
6773 -5000 -1508 -17015 -4727 22824 19307 17014 27778 29937 59622 46874 32439 10400 3708
6760 3708 -17535 -17352 2602 -711 -18880 -17710 12007 18625 10118 5021 15429 32754 10000
6747 10000 12782 24397 17703 -1362 -16967 -38013 -28935 -13914 3720 28586 11659 -5029
6735 -5029 5358 -12266 -25990 -39057 -21291 -18515 -30825 -32501 -15318 -17440 -20670 18079 40921
6722D0921j2944l1248m168J2017J8682j4205j5576k0829P202J9746M372l49j6450
6709a2829p643K595J8623K6258m950q290o31k8245r292k2438o72K6392K0532O71
6695H1j0382j8753p325J062J8413J218j2612j8586k318L045J1814P451K0944R827
6681C879m1372J152J2061O264k575J1020J3269J0842J4005j7088k4683J4226P331
6668H331j0286j4492Q978j4915j1739j1543J5082K6760j9404P788J8321K854j6995
6655a1260r673P28q119Q270K1253j6138j2584J2220L1219l07j7263j6095O308
6642a1441J85k2961K421j0008k9116N718K1049O766J5758K8869M473O284K2688
6629D0685k2830k1859J9870J8128J567j5736j0959O74j0753O4n311O188j299j0401
$$ plain form
6722 40921 27977 -3271 -7439 4578 23260 9055 -6521 -27350 -20148 -402 3970 3621 -12829
6709 -12829 -20472 -17877 746 27004 22054 13764 13133 -15112 -24404 -46842 -47514 -21122 -590 81
6695 81 -10301 -29054 -36379 -35317 -16904 -15686 -28298 -46884 -49202 -46157 -34343 -26892 -5948 3879
6681 3879 -37493 -36341 -24280 -18016 -20591 -9571 3698 14540 28545 11457 -13226 1000 8331
6668 8331 -1955 -16447 -7469 -22384 -34123 -45666 -30584 -3824 -23228 -15440 2881 5735 -11260
6655 -11260 -20933 -20205 -28324 -20054 1199 -14939 -27523 -15303 15916 15609 -1654 -17749 -11441
6642 -11441 -11256 -34217 -31796 -41804 -70920 -65202 -44153 -37387 -21629 7240 11713 17997 40685
6629 40685 17855 -4004 15866 33994 35561 19825 8866 9540 -1213 -1149 -6460 -272 -1571 -11972
6615a1972j7856p431Q551J3181J2299j3680j0482o764J7416j5412m908L6939R771
6602I652k3466K1264J7475k1198j2161m763O982j3104j7544R936Q024P709L39
6589a0855K851Q49p057Q695J0376J3968k3527j9285r159J9700J938J7494o996
6576a008j9614K451J1566j5699j8992o747J5502M932P616J9840j1027k4642J1102
6563b4720J4217k978k775J6226J7829j6648j3952p182l399l730l411j9452k844
$$ plain form
6615 -11972 -29828 -37259 -28708 -15527 -3228 -16908 -27390 -34154 -16738 -32150 -37058 -119 9652
6602 9652 -13814 7450 24925 3727 -8434 -13197 -6215 -19319 -36863 -26927 -18903 -11194 -10855
6589 -10855 -8004 -7155 -14212 -5517 4859 18827 -4700 -23985 -33144 -13444 -11506 5988 -1008
6576 -1008 -20622 -18171 -6605 -22304 -41296 -48043 -32541 -27609 -19993 -153 -11180 -35822 -24720
6563 -24720 -10503 -13481 -16256 -30 17799 1151 -12801 -19983 -23382 -27112 -30523 -49975 -52819
$$ [...]
##END NTUPLES=NMR SPECTRUM
##END=
