##TITLE=Analysis number 320885
Compound Code tl 00770
Project Code adrs
Chemist Name fudan
##JCAMPDX= 6.0         $$ Bruker NMR JCAMP-DX V2.0
##DATA TYPE= NMR SPECTRUM
##DATA CLASS= NTUPLES
##ORIGIN= Bruker BioSpin GmbH
##OWNER= nmr
$$ XWIN-NMR		Version 3.5
$$ Mon Jul 17 09:54:42 2006 GMT Daylight Time (UT+1h)  MAYBRIDGE\nmr@NMR_250MHZ
##.OBSERVE FREQUENCY= 250.131544655141
##.OBSERVE NUCLEUS= ^1H
##.ACQUISITION MODE= SIMULTANEOUS (DQD)
##.ACQUISITION SCHEME= undefined
##.AVERAGES= 16
##.DIGITISER RES= 18
##SPECTROMETER/DATA SYSTEM= dpx250
##.PULSE SEQUENCE= zg30
##.SOLVENT NAME= DMSO
##.SHIFT REFERENCE= (INTERNAL, DMSO, 0, 16.522)
##AUDIT TRAIL= $$ (NUMBER, WHEN, WHO, WHERE, WHAT)
$$ ##TITLE= Audit trail, XWIN-NMR		Version 3.5
$$ ##JCAMPDX= 5.01
$$ ##ORIGIN= Bruker BioSpin GmbH
$$ ##OWNER= nmr
$$ C:\u/data/dgb/nmr/ADRS/2810/pdata/1/auditp.txt
$$ ##AUDIT TRAIL=  $$ (NUMBER, WHEN, WHO, WHERE, WHAT)
(   1,<2006-07-17 09:54:19.57 +100>,<MAYBRIDGE\nmr>,<NMR_250MHZ>,
      <created by zg, POWCHK disabled, PULCHK disabled
       configuration hash MD5:
       E2 DF 36 D8 04 B2 41 60 5A D7 A3 38 5A 4B D0 FE
       data hash MD5: 64K
       DF 5C EB BA 9A 53 C0 EE 24 EA B1 12 45 BC F1 8E>)
(   2,<2006-07-17 09:54:31.82 +100>,<MAYBRIDGE\nmr>,<NMR_250MHZ>,
      <Start of raw data processing
       ef LB = 0.3 FT_mod = 6 PKNL = 1 SI = 32K 
       data hash MD5: 32K
       AE 26 72 D0 2B 69 A6 AF 1E BA F8 7E F9 54 B1 C4>)
(   3,<2006-07-17 09:54:33.54 +100>,<MAYBRIDGE\nmr>,<NMR_250MHZ>,
      <apk 
       data hash MD5: 32K
       92 25 8A F3 22 92 5B A0 0B 8F 68 8D DB 9A 78 CA>)
(   4,<2006-07-17 09:54:34.29 +100>,<MAYBRIDGE\nmr>,<NMR_250MHZ>,
      <abs ABSG = 5 
       data hash MD5: 32K
       FF 0A 90 4F 43 50 D5 73 CE 27 DC 4C 91 98 46 63>)
$$ ##END=
$$ 
$$ hash MD5
$$ B7 A9 21 F0 6F FE 98 E8 1D A9 52 20 F5 9D 3F CD
##$RELAX= 
##$RELAX= 
##$RELAX= 
##$RELAX= 
##$RELAX= 
##$RELAX= 
##$RELAX= 
$$ Bruker specific parameters
$$ --------------------------
##$DU= <C:\u>
##$EXPNO= 2810
##$NAME= <ADRS>
##$PROCNO= 1
##$TYPE= <nmr>
##$USER= <dgb>
##$AMP= (0..31)
100 100 100 100 100 100 100 100 100 100 100 100 100 100 100 100 100 100 
100 100 100 100 100 100 100 100 100 100 100 100 100 100 
##$AQSEQ= 0
##$AQ_mod= 3
##$AUNM= <au_zg>
##$AUTOPOS= <8 >
##$BF1= 250.13
##$BF2= 250.13
##$BF3= 250.13
##$BF4= 250.13
##$BF5= 500.13
##$BF6= 500.13
##$BF7= 500.13
##$BF8= 500.13
##$BYTORDA= 1
##$CFDGTYP= 0
##$CFRGTYP= 5
##$CHEMSTR= <none>
##$CNST= (0..31)
1 1 145 1 1 1 1 1 1 1 1 1 1 1 1 1 1 1 1 1 1 1 1 1 1 1 1 1 1 1 1 1 
##$CPDPRG= <>
##$CPDPRG1= <>
##$CPDPRG2= <>
##$CPDPRG3= <>
##$CPDPRG4= <mlev>
##$CPDPRG5= <mlev>
##$CPDPRG6= <mlev>
##$CPDPRG7= <mlev>
##$CPDPRG8= <mlev>
##$CPDPRGB= <>
##$CPDPRGT= <>
##$D= (0..31)
0 1 0 0 0 0 0 0 0 0.06 0 0 0 0 0 0 0.0002 0 0 0 0 0 0 0 0 0 0 0 0 0 0 
0 
##$DATE= 1153126458
##$DBL= (0..7)
120 120 120 120 120 120 120 120 
##$DBP= (0..7)
150 150 150 150 150 150 150 150 
##$DBP07= 0
##$DBPNAM0= <>
##$DBPNAM1= <>
##$DBPNAM2= <>
##$DBPNAM3= <>
$$ [...]
##$SUBNAM7= <"">
##$SUBNAM8= <"">
##$SUBNAM9= <"">
##$SW= 20.6930455092707
##$SWIBOX= (0..15)
0 0 3 0 0 0 0 0 0 0 0 0 0 0 0 0 
##$SW_h= 5175.983436853
##$TD= 65536
##$TD0= 1
##$TE= 297.16
##$TE2= 300
##$TE3= 300
##$TEG= 300
##$TL= (0..7)
0 120 120 120 120 120 120 120 
##$TP= (0..7)
150 150 150 150 150 150 150 150 
##$TP07= 0
##$TPNAME0= <>
##$TPNAME1= <>
##$TPNAME2= <>
##$TPNAME3= <>
##$TPNAME4= <>
##$TPNAME5= <>
##$TPNAME6= <>
##$TPNAME7= <>
##$TPOAL= (0..7)
0.5 0.5 0.5 0.5 0.5 0.5 0.5 0.5 
##$TPOFFS= (0..7)
0 0 0 0 0 0 0 0 
##$TUNHIN= 0
##$TUNHOUT= 0
##$TUNXOUT= 0
##$USERA1= <user>
##$USERA2= <user>
##$USERA3= <user>
##$USERA4= <user>
##$USERA5= <user>
##$V9= 5
##$VALIST= <valist>
##$VCLIST= <CCCCCCCCCCCCCCC>
##$VD= 0
##$VDLIST= <DDDDDDDDDDDDDDD>
##$VPLIST= <PPPPPPPPPPPPPPP>
##$VTLIST= <TTTTTTTTTTTTTTT>
##$WBST= 1024
##$WBSW= 4
##$XGAIN= (0..3)
0 0 0 0 
##$XL= 0
##$YL= 0
##$YMAX_a= 367050
##$YMIN_a= -531798
##$ZGOPTNS= <>
##$ZL1= 120
##$ZL2= 120
##$ZL3= 120
##$ZL4= 120
##$ABSF1= 16.522
##$ABSF2= -4.171173
##$ABSG= 5
##$ABSL= 3
##$ALPHA= 0
##$AQORDER= 0
##$ASSFAC= 0
##$ASSFACI= 0
##$ASSFACX= 0
##$ASSWID= 0
##$AUNMP= <proc_1d>
##$AZFE= 0.1
##$AZFW= 0.1
##$BCFW= 0
##$BC_mod= 0
##$BYTORDP= 0
##$COROFFS= 0
##$CY= 12.5
##$DATMOD= 1
##$DC= 0
##$DFILT= <>
##$DTYPP= 0
##$F1P= 14.0000005364418
##$F2P= -0.99999901652339
##$FCOR= 0.5
##$FTSIZE= 32768
##$FT_mod= 6
##$GAMMA= 0
##$GB= 0
##$INTBC= 1
##$INTSCL= 1
##$ISEN= 128
##$LB= 0.3
##$LEV0= 0
##$LPBIN= 0
##$MAXI= 10000
##$MC2= 0
##$MEAN= 0
##$ME_mod= 0
##$MI= 0
##$NCOEF= 0
##$NC_proc= -4
##$NLEV= 6
##$NOISF1= 0
##$NOISF2= 0
##$NSP= 0
##$NTH_PI= 0
##$NZP= 0
##$OFFSET= 16.522
##$PC= 1
##$PHC0= 158.2225
##$PHC1= 10.41205
##$PH_mod= 1
##$PKNL= yes
##$PPARMOD= 0
##$PSCAL= 4
##$PSIGN= 0
##$REVERSE= no
##$SF= 250.13
##$SI= 32768
##$SIGF1= 0
##$SIGF2= 0
##$SINO= 400
##$SIOLD= 32768
##$SREGLST= <1H.DMSO>
##$SSB= 0
##$STSI= 32768
##$STSR= 0
##$SW_p= 5175.98343685301
##$SYMM= 0
##$S_DEV= 0
##$TDeff= 65536
##$TDoff= 0
##$TI= <Analysis number 999999
Compound Code 99
Book Reference 9
Project Code 9>
##$TILT= no
##$TM1= 0
##$TM2= 0
##$TOPLEV= 0
##$USERP1= <user>
##$USERP2= <user>
##$USERP3= <user>
##$USERP4= <user>
##$USERP5= <user>
##$WDW= 1
##$XDIM= 32768
##$YMAX_p= 439238900
##$YMIN_p= -472266
$$ End of Bruker specific parameters
$$ ---------------------------------
##NTUPLES= NMR SPECTRUM
##VAR_NAME=  FREQUENCY,     SPECTRUM/REAL,   SPECTRUM/IMAG
##SYMBOL=    X,             R,               I
##VAR_TYPE=  INDEPENDENT,   DEPENDENT,       DEPENDENT
##VAR_FORM=  AFFN,          ASDF,            ASDF
##VAR_DIM=   32768,         32768,           32768
##UNITS=     HZ,            ARBITRARY UNITS, ARBITRARY UNITS
##FACTOR=    0.157963299565203, 1,           1
##FIRST=     4132.6476996994, 0,             0
##LAST=      -1043.33573715361, 0,           0
##MIN=       -1043.33573715361, -472266,     0
##MAX=       4132.6476996994, 439238900,     0
$$ Real data points
##PAGE= N=1
##DATA TABLE= (X++(R..R)), XYDATA
$$ [...]
15128G8736L7921N2129k2706j578p443N7932l3818P1825j21992j65295k9760P7793
$$ 78736 116657 168786 146080 144502 137059 194991 161173 232998 111006 -54289 -84049 -6256
15116f256j2911J9965N4178J9108K0178j06058m6965L2990L4329j52058O8135
$$ -6256 -19167 798 54976 74084 94262 -11796 -58761 -25771 8558 -143500 -75365
15105g5365J12926J27058l2818l5145m9069k4357K8310N8045o7753j9854r225
$$ -75365 37561 164619 131801 96656 47587 23230 51540 109585 41832 21978 12753
15094A2753p4998M1790J0028J3332j5999p4885k647Q1557R663L2109p8284l0169
$$ 12753 -62245 -20455 -10427 2905 -13094 -87979 -90626 -9069 594 32703 -45581 -75750
15082g5750P6312N8847k1046K0837j254j07638J15381R0908J9363k4864p0949
$$ -75750 562 59409 38363 59200 57946 -49692 65689 156597 175960 151096 80147
15071H0147l2965n90o6631q823r205N9574q0916m3529O3854M8759j33191m0062
$$ 80147 47182 46592 -20039 -28862 -38067 21507 -59409 -102938 -39084 9675 -123516 -163578
15059a63578M4751k8411J6084N2062K5649O8479P9526j7408r8251m4794L8330
$$ -163578 -118827 -147238 -131154 -79092 -53443 15036 94562 77154 -21097 -65891 -27561
15048b7561O6742O4767p2726j14107J431J18371q1016k9510J41400N4370K1316
$$ -27561 39181 103948 31222 -82885 -81454 36917 -44099 -73609 67791 122161 143477
15037A43477q8174L0330l9929J0339N0491l9568K125n2567j84697k5419Q682O3218
$$ 143477 55303 85633 45704 56043 106534 66966 69091 16524 -168173 -193592 -184910 -121692
15025a21692M2035M9226N4167o4477N0357k5520j7500L6533k10192n1266R7593
$$ -121692 -79657 -30431 23736 -40741 9616 -15904 -33404 3129 -207063 -258329 -160736
15014a60736P1641J73147J73796n5007j61513j00230Q7771R3234j59412m5957
$$ -160736 -89095 84052 257848 202841 41328 -58902 28869 122103 -37309 -83266
15004h3266m4870j18674j6502J39522O5156r3640J9309N3213k7651o8414N7434
$$ -83266 -128136 -246810 -263312 -123790 -58634 -152274 -132965 -79752 -107403 -175817 -118383
14993a18383J29401j765M847q712j23173j70442m4517K06177Q9116l8124p6757
$$ -118383 11018 9253 14100 5388 -117785 -288227 -332744 -126567 -37451 -75575 -152332
14982a52332L1558J32940j00326o4562J01427L0519J31884m5772j63862j16321
$$ -152332 -120774 12166 -88160 -152722 -51295 -20776 111108 65336 -98526 -214847
14972b14847p306R3741R3838P0039l4243k7007Q0595m7843o5401O8444p0654Q877
$$ -214847 -222153 -128412 -34574 35465 1222 -25785 54810 6967 -58434 10010 -60644 -51767
14960e1767N7197K3267l2016m3270n1953J5561J10496N3606j57500J6985n128
$$ -51767 5430 28697 -3319 -46589 -98542 -82981 27515 81121 -76379 -59394 -64522
14949f4522q4624Q638R1888P5973M0852l6708j08026O8400j64818o7198M0056
$$ -64522 -149146 -140508 -48620 27353 68205 31497 -76529 -8129 -172947 -240145 -200089
14938b00089N410n9713o4706O8099M7425p8663R4451J74541P7545K5813J77845
$$ -200089 -194679 -254392 -319098 -250999 -203574 -282237 -187786 -13245 64300 90113 267958
14927B67958N3685m0866l6146j22766j37390k9531l2507L237P040O6302L8612
$$ 267958 321643 280777 244631 121865 -15525 -45056 -77563 -74326 -67286 -984 37628
14916C7628J3616k4942p6919J07737Q6488P2901j23359j04028J9344Q810O5865
$$ 37628 51244 26302 -50617 57120 143608 216509 93150 -10878 8466 17276 83141
14905H3141k4656m9739Q82j5004p2072P4439r693p9889q0736J0196L3131n5431
$$ 83141 58485 8746 9628 -5376 -77448 -3009 -12702 -92591 -173327 -163131 -130000 -185431
14893a85431J2423l0719K9764L6050Q6408J10712j4946k3756q4874r3339o9821
$$ -185431 -173008 -203727 -173963 -137913 -51505 59207 44261 20505 -64369 -157708 -227529
14882b27529J14287J08553p4442o4843M3494o8954k3833J1774O5585J9928j8888
$$ -227529 -113242 -4689 -79131 -143974 -100480 -169434 -193267 -181493 -115908 -95980 -114868
14871a14868N0949K8580J6736m953r1781R7246j5719o4110r7830P4836K20664
$$ -114868 -63919 -35339 -18603 -23556 -115337 -18091 -33810 -97920 -195750 -120914 99750
14860I9750k1569j42117J31231k4414n0640k8348j2691M258l1642K7849O3930
$$ 99750 78181 -63936 67295 42881 -7759 -36107 -48798 -44540 -76182 -48333 15597
14849A5597k5627p5187m9132R3997N2248m5816J6117L2392j05244L0837j7763
$$ 15597 -10030 -85217 -134349 -40352 11896 -33920 -17803 14589 -90655 -59818 -77581
14838g7581j2403L0183K7143K246l0485n1658J7615J22984j32475j57276J55527
$$ -77581 -89984 -59801 -32658 -30412 -60897 -112555 -94940 28044 -104431 -261707 -106180
14827a06180J88154R4237r680j02519q7232j17742L3003O1447Q1923l8090j9275
$$ -106180 81974 176211 166531 64012 -23220 -140962 -107959 -46512 35411 -2679 -21954
14816b1954p9377m6978j6308L6491J03194M3299k1885l3878j4691L379Q8025K3373
$$ -21954 -101331 -148309 -164617 -128126 -24932 18367 -3518 -37396 -52087 -48708 39317 62690
14804F2690m1122k6443O221j3274q3701k6451P1845L9828m0145q6462j4163M270
$$ 62690 21568 -4875 1346 -11928 -95629 -122080 -50235 -10407 -50552 -137014 -151177 -146907
14792a46907K0707M7616j05269j2080J34406M2040j51046k5366M7859k7191Q640
$$ -146907 -126200 -78584 -183853 -195933 -61527 -19487 -170533 -195899 -148040 -175231 -166591
14781a66591K64326J14900Q126j6313j12654l7137Q0404P8927n9399j17114L3717
$$ -166591 97735 212635 220761 204448 91794 54657 135061 213988 154589 37475 71192
14770G1192j04394j32879R1226M3032N2979J33255R7943j88835k00927m5002P3191
$$ 71192 -33202 -166081 -74855 -31823 21156 154411 252354 63519 -137408 -182410 -109219
14759a09219J31183P5944n8778l8012L1919k043M2134j06052k3192K2782L9957
$$ -109219 21964 97908 39130 1118 33037 30994 73128 -32924 -56116 -33334 6623
14748F623J04338N1587R4194M1231j29830j78164p6862P8546J2833R365k8267
$$ 6623 110961 162548 256742 297973 168143 -10021 -86883 -8337 4496 13861 -14406
14737a4406L2002M7494K3913P4699O7183Q432j44281l3819M9153R2634l3939j00399
$$ -14406 17596 65090 89003 163702 230885 239317 95036 61217 110370 203004 169065 68666
14725F8666j00194K5193O7789J03481r5668j06689n1485N3709J8650n9834k7029
$$ 68666 -31528 -6335 61454 164935 69267 -37422 -88907 -35198 -16548 -76382 -103411
14714a03411J46373P8678j2564Q9O4935l9781k2664J6944N1848M2999N7111p825
$$ -103411 42962 121640 109076 109165 174100 134319 111655 128599 180447 223446 280557 272732
14702B72732K3057j23555n8657n8758L6698L1256j37343j30645Q6289J25667J06006
$$ 272732 295789 172234 113577 54819 91517 122773 -14570 -145215 -58926 66741 172747
14691A72747n4418j08296N883o8174O6167O7187J2969k12502q5991J11196R2832
$$ 172747 118329 10033 15916 -52258 13909 81096 94065 -118437 -204428 -93232 -400
14680d00K4717j07513o6766J06368O8197J0147m4559o4114l4503m910J40463J31554
$$ -400 24317 -83196 -149962 -43594 24603 34750 -9809 -73923 -108426 -113336 27127 158681
14668A58681j00313r5230j42997n1429J25900Q9684l1015p721L7494j9511l1361
$$ 158681 58368 -36862 -179859 -231288 -105388 -15704 -46719 -54440 -16946 -36457 -67818
14657f7818o6727k0781J7717n4413k5508J9022m4593N5907K31837M4729l3041
$$ -67818 -134545 -155326 -137609 -192022 -217530 -198508 -243101 -187194 44643 89372 56331
14646E6331J4861L3243o0741N2688N4281Q5454N9546q8221j06351q8432k5461
$$ 56331 71192 104435 43694 96382 150663 236117 295663 207442 101091 12659 -12802
14635a2802m1633j1887j01600m4495L1296J41980M1790J05653j3630r5118J78438
$$ -12802 -54435 -66322 -167922 -212417 -181121 -39141 2649 108302 94672 -446 177992
14624A77992R8638J103k0338Q2810l9132r5736p4025l0963j35230j00894l231
$$ 177992 276630 277733 257395 340205 301073 205337 131312 100349 -34881 -135775 -139006
14613a39006J7111n0467J26397L0762r80j03335O4865O3161K5702J38966R548
$$ -139006 -121895 -172362 -45965 -15203 -16183 -119518 -54653 8508 34210 173176 182724
14602A82724r2685o4597n772o2661q519l4502p095j2534J41172J00893o7033j52330
$$ 182724 90039 25442 19670 -42991 -51510 -86012 -93107 -105641 35531 136424 69391 -82939
14590h2939P3899J04845J05569n5938j25848p9728m5082j8237P8144J667M9670
$$ -82939 -9040 95805 201374 145436 19588 -60140 -105222 -123459 -45315 -43648 6022
14579F022o7212j0148M4272N3541j15428M5070Q7223K1993m7982K1523m1753o7577
$$ 6022 -61190 -71338 -27066 26475 -88953 -43883 43340 65333 17351 38874 -2879 -70456
14567g0456m4638M0109P627p921j6849n164n7730j24198L0684K47283J44334q2886
$$ -70456 -115094 -74985 -67358 -75279 -92128 -97292 -155022 -279220 -248536 -1253 143081 60195
14555F0195l0473j5050P1449K4091m2680n4539j42872K2879L4665Q885R8361K8386
$$ 60195 29722 14672 86121 110212 67532 12993 -129879 -107000 -72335 -63450 34911 63297
14543F3297r292L4086j28925k5625N950K1315m6387K4719J02089l7705L1521N576
$$ 63297 54005 88091 -40834 -66459 -60509 -39194 -85581 -60862 41227 3522 35043 40619
14531D0619J4847j9335j08577J390O2863j3462k9636k9454q3241J14205J8868
$$ 40619 55466 36131 -72446 -71056 -8193 -21655 -51291 -80745 -163986 -49781 -30913
14520c0913l4117L3679Q8156j44402q85J3126J20071n4387m9387Q8466M2029o8719
$$ -30913 -65030 -31351 56805 -87597 -88482 -75356 44715 -9672 -59059 29407 71436 2717
14508B717j1009P5634q113m0170Q1851J38438q1673q19L0626k4566k9714k4858
$$ 2717 -8292 67342 59229 19059 100910 239348 157675 156856 187482 162916 133202 108344
14496A08344m9425J1351P9427M4678J10348m6103k2148k9312j13027j18921l6099
$$ 108344 58919 70270 149697 194375 304723 258620 236472 207160 94133 -24788 -60887
14485f0887N632O203J00492R376n8414j9929J2205L4003O0119l7967j15304j15627
$$ -60887 -55255 -49052 51440 60816 2402 -17527 -5322 28681 88800 50833 -64471 -180098
14473a80098J64518J17036K9322L7883o0886r3820n1693J36430Q0120j01911K3797
$$ -180098 -15580 101456 130778 168661 107775 13955 -37738 98692 178812 76901 100698
14462A00698J19127K2721l7894K1168j24754l6988O1764k8407O9475N5566M302
$$ 100698 219825 242546 204652 225820 101066 64078 125842 97435 166910 222476 226778
14451B26778j31971j28712N8577j619J01564p105r1045k5143Q1212j31517m341
$$ 226778 94807 -33905 24672 23053 124617 117512 26467 1324 82536 -48981 -53322
14440e3322P0726M3117l9877J03679J58492j5965q245q7287j41918k8810L0488
$$ -53322 17404 60521 20644 124323 282815 266850 258605 171318 29400 590 31078
14429C1078L4886o9379k7372q156M0028J67523n282n6430j05374j50443k7541
$$ 31078 65964 -3415 -30787 -38943 1085 168608 163326 106896 1522 -148921 -176462
14418a76462Q6570L4430L9906Q4973J64936r3096j82317L1936k1817m7729o9126
$$ -176462 -89892 -55462 -15556 69417 234353 141257 -41060 -9124 -30941 -78670 -147796
14407a47796K5287j8178j18854J05253J21062q2117M2978L4269p958J462J47930
$$ -147796 -122509 -140687 -259541 -154288 -33226 -115343 -72365 -38096 -46054 -44592 103338
14396A03338Q2550k4136n6590j61120j50242Q4914R0648l2015J8933N8182j32318
$$ 103338 185888 161752 105162 -55958 -206200 -121286 -30638 -62653 -43720 14462 -117856
14385a17856l4169o0434J6737N8897J0377O8511Q1143P6771m0113M6258J34579
$$ -117856 -152025 -212459 -195722 -136825 -126448 -57937 23206 99977 59864 106122 240701
14374B40701R50j17897j73220Q340O178O4659k5962q7550j09577P8707P6975N3893
$$ 240701 241651 123754 -49466 -41126 -34948 29711 3749 -83801 -193378 -114671 -37696 16197
14362A6197J01176Q2291K997K4826j237l7867m7686N55N0542p5842O673J9712
$$ 16197 117373 199664 202661 227487 226250 188383 140697 141252 191794 115952 122625 142337
14350A42337N9980K7896q1246o7039R216R7046N7170K9291o2172p5850p4721j1268
$$ 142337 202317 230213 148967 81928 91144 188190 245360 274651 212479 136629 61908 50640
14338E0640j0606J45111P6825n5620J4224j9054j01635j2234j9913Q1767p3667
$$ 50640 40034 185145 261970 206350 220574 201520 99885 87651 67738 149505 75838
14327G5838j26250j7072M0518l932L389m9153j06873O9909J02392J9243k7684
$$ 75838 -50412 -67484 -26966 -30898 -27509 -76662 -183535 -113626 -11234 8009 -19675
14316a9675L6662l5502R8382k34N8874j6737j42345q5018R4093J20037p13j7679
$$ -19675 16987 -18515 79867 79633 138507 121770 -20575 -105593 -11500 108537 107824 90145
14304I0145j4855N8846K4578P605j28574j19611q7285r2735o527J12643J42695
$$ 90145 75290 134136 158714 166319 37745 -81866 -169151 -261886 -268413 -155770 -13075
14293a3075P5053M820Q3623J70105k7512j59027p6683M5722l2601K3532N5355
$$ -13075 61978 66798 150421 320526 293014 133987 57304 103026 70425 93957 149312
14282A49312P5463m2363n2679j4984l3304K224J14497J32662q6061j14856p270
$$ 149312 224775 182412 129733 114749 81445 83669 198166 330828 244767 129911 122641
14271A22641J34319L7857K4610n8134r4333j3457L2719m9033o6405K4416M1041
$$ 122641 256960 294817 319427 261293 166960 153503 186222 137189 70784 95200 136241
14260A36241J2122n1949o138J02699k8530r5390m8839k2519M5643J6335r3085
$$ 136241 148363 96414 90276 192975 164445 69055 20216 -2303 43340 59675 -33410
14249c3410l8918m7184j8039J16391J40341N0477K8253j3605j0637R8456j0220
$$ -33410 -72328 -119512 -137551 -21160 119181 169658 197911 184306 173669 272125 261905
14238B61905r5266q6520p9442n6962L201N7594l4155j6416O3685M4575m2995Q0704
$$ 261905 166639 80119 677 -56285 -53084 4510 -29645 -46061 17624 62199 19204 99908
14226I9908J38750O56J7717p4042n6185r0161o0960O9400n0915o7880P5600L6445
$$ 99908 238658 239314 257031 182989 126804 36643 -24317 45083 -5832 -73712 1888 38333
14214C8333o56m0154j61818K5011J13445N8762j5554L0100Q0988n115K9338J04976
$$ 38333 37677 -2477 -164295 -139284 -25839 32923 17369 47469 128457 123342 152680 257656
14202B57656N9216j25845m2376J0021j07934L3056j2279p179M4328L7653K9203
$$ 257656 316872 191027 148651 158672 50738 83794 71515 64336 108664 146317 175520
14191A75520Q5614L9485j5431K3720k4899Q7447J737l4994M2539k2398q3609l6446
$$ 175520 261134 300619 285188 308908 284009 371456 373193 338199 380738 358340 274731 238285
14179B38285L4853J4044j07303j92431O387o415J05844J21141o5089q4046J67785
$$ 238285 273138 287182 179879 -12552 -6165 -12580 93264 214405 149316 65270 233055
14168B33055k5322j03030J2164N50m4387k1377J38824Q8346K0938J4671j10108
$$ 233055 207733 104703 116867 117417 73030 51653 190477 278823 299761 314432 204324
14157B04324l3051J6527P8088o2688j7284k3766N2875Q9622R2388l8952r6875
$$ 204324 171273 187800 265888 203200 185916 162150 215025 304647 397035 358083 261208
14146B61208q1458j00343k3797J4221l4796Q2897m7017o5795K3513j1231L9807
$$ 261208 179750 79407 55610 69831 35035 117932 70915 5120 28633 17402 57209
14135E7209N6020P0100P6667k906q5531R4608q8053m1397M0614n6906J2063j4351
$$ 57209 113229 183329 259996 257090 171559 266167 178114 136717 177331 120425 132488 118137
14123A18137P1465J14241K1476K7670m0208j6409k7955J49232M9328N680l0623
$$ 118137 189602 303843 325319 352989 312781 296372 268417 417649 466977 472657 442034
14112D42034j21401j55010j67028J07699P2190N6328N8427r1886j7721p190N3931
$$ 442034 320633 165623 -1405 106294 178484 234812 293239 201353 183632 176442 230373
14101B30373K1102j06406K3788L3524m2572J1351L9855o986L9113l6945J318J09691
$$ 230373 251475 145069 168857 202381 159809 171160 211015 204029 243142 206197 207515 317206
14089C17206J30655Q282j47540p9749J72k4690K1297P7758L6288k5609L2567l0468
$$ 317206 447861 456143 308603 228854 229026 204336 225633 303391 339679 314070 346637 316169
14077C16169J5527k1018o5783R8587O4769m1536Q6531J3746j17789J5179L5309
$$ 316169 331696 310678 244895 343482 408251 366715 453246 466992 349203 364382 399691
14066C99691J28800O616m3567j1609l6815n068o6400K9936J26268L8291m5497
$$ 399691 528491 535107 491540 479931 443116 438048 371648 401584 527852 566143 520646
14055E20646L4490n6314j69862M6224P758m6477L5321l4205k5095O7261N9122
$$ 520646 555136 498822 328960 375184 382942 336465 371786 337581 312486 379747 438869
14044D38869J6929j3971q707k2890r6667J314n8290K4476m8301K11818N0646m816
$$ 438869 455798 441827 433120 410230 313563 314877 256587 281063 232762 444580 495226 490410
14032D90410Q812j5617M8162P4827o459k4930k000J61962J00810p0227m8261p9847
$$ 490410 499222 483605 531767 606594 600135 575205 573205 735167 835977 765750 717489 637642
14020F37642q0424n2295M9411j2675K1961N9055p613J761L643J06981N4100j04375
$$ 637642 557218 504923 554334 541659 563620 622675 615062 616823 620466 727447 781547 677172
14008F77172K5021K2997N8809q138m5029J908j0613j7478Q0134k1848p6764k0348
$$ 677172 702193 725190 783999 775861 730832 732740 722127 704649 784783 762935 686171 665823
13996F65823J48548P6407q7590l7961n9992j07718K0296N3990J5150N2852J36743
$$ 665823 814371 890778 803188 765227 705235 597517 617813 671803 686953 739805 876548
13985H76548J11829P269O7847N5173K9680j38462r9370r9927R494M2425M3534
$$ 876548 988377 995646 1063493 1118666 1148346 1009884 910514 810587 820081 862506 906040
13974I06040J07639p1332o0628j663N305R363M5825P3156J03433P8213j1527p6101
$$ 906040 1013679 942347 881719 880056 885361 894724 940549 1013705 1117138 1195351 1183824 1107723
13962A107723j3917n2897Q1914K6208N1219J7426J8133J8142j0234n6513M4411
$$ 1107723 1093806 1040909 1122823 1149031 1200250 1217676 1235809 1253951 1243717 1187204 1231615
13951A231615J00655M3335l2135r6462m3390M5192Q1581O3542o3571J56606J75742
$$ 1231615 1332270 1375605 1343470 1247008 1203618 1248810 1330391 1393933 1330362 1486968 1662710
13940A662710Q0664m2686k0362K1079M9951J23223l638r0194l4572J25248M8164
$$ 1662710 1743374 1700688 1680326 1701405 1751356 1874579 1870941 1780747 1746175 1871423 1919587
13929A919587N3398N100R1653M9371m5337k7406L332J03241N5142O3397J00251
$$ 1919587 1972985 1978085 2069738 2119109 2073772 2046366 2049698 2152939 2208081 2271478 2371729
13918B371729P3427j15Q2499J64628L1512k2097J48206J28840J34356R4660J3241
$$ 2371729 2445156 2445041 2527540 2692168 2723680 2701583 2849789 2978629 3112985 3207645 3220886
13907C220886N9938P1817p4364j205k3386k6577N9001J89321O3741j21320j7675
$$ 3220886 3280824 3352641 3278277 3277072 3253686 3227109 3286110 3475431 3539172 3417852 3400177
13896C400177L9204K4260M9481M4571j1776P4337M583m5164m813P8502L8203J9979
$$ 3400177 3439381 3463641 3513122 3557693 3545917 3620254 3624837 3579673 3574860 3653362 3691565 3711544
13884C711544l9948j815K2364j8151R0715J08865N9360p3637N5262N8991o9125
$$ 3711544 3671596 3669781 3692145 3673994 3764709 3873574 3932934 3859297 3914559 3973550 3904425
13873C904425O2478J84780Q8986l3051k802J85975J63696k6206L3733J57448N6052
$$ 3904425 3966903 4151683 4240669 4207618 4204816 4390791 4554487 4528281 4562014 4719462 4775514
13862D775514Q9575J13632P6647P6807l2977o5982K3829N0067K00810K42397P6048
$$ 4775514 4865089 4978721 5055368 5132175 5099198 5033216 5057045 5107112 5307922 5550319 5626367
13851E626367J74765K42914L2260P0002J66535K04384J33723J42203J12007R7746
$$ 5626367 5801132 6044046 6076306 6146308 6312843 6517227 6650950 6793153 6905160 7002906
13841G002906Q0846J81849K50399J09525K24822J94944K01237K48612K49883L88016
$$ 7002906 7083752 7265601 7516000 7625525 7850347 8045291 8246528 8495140 8745023 9133039
13831I133039L81548J12870J63712K72191L55428K98182K64238K44505M22509
$$ 9133039 9514587 9627457 9791169 10063360 10418788 10716970 10981208 11225713 11648222
13822A1648222L44312K63825M05600M75148L89122M80259N55104M47070N35276
$$ 11648222 11992534 12256359 12661959 13137107 13526229 14006488 14561592 15008662 15543938
13813A5543938M41771N02082O63343Q00878O97920O37582Q18441Q36975Q88909
$$ 15543938 15985709 16487791 17151134 17952012 18649932 19287514 20105955 20942930 21831839
13804B1831839Q73216Q57196J054731J075494J103873J100145J301698J343560
$$ 21831839 22705055 23562251 24616982 25692476 26796349 27896494 29198192 30541752
13796C0541752J483411J401634J608440J746795J764156J960443K064255K145995
$$ 30541752 32025163 33426797 35035237 36782032 38546188 40506631 42570886 44716881
13788D4716881K165587K253819K562283K793929K912500L071967L183608L313761
$$ 44716881 46882468 49136287 51698570 54492499 57404999 60476966 63660574 66974335
13780F6974335L464362L843122L918411L993387M256410M409750M597408M600292
$$ 66974335 70438697 74281819 78200230 82193617 86450027 90859777 95457185 100057477
13772A00057477M706403M797659M798878M790879M614648M339450M150237L853914
$$ 100057477 104763880 109561539 114360417 119151296 123765944 128105394 132255631 136109545
13764A36109545L616139L104308K663384K004730J497866R02428L16226l29911
$$ 136109545 139725684 142829992 145493376 147498106 148995972 149898400 150214626 149884715
13756A49884715r12441j436407j810436k242793k773179l148840l299255l689840
$$ 149884715 148972274 147535867 145725431 143482638 140709459 137560619 134261364 130571524
13748A30571524l820591l751652l940543l836846l891126l743256l737310l788718
$$ 130571524 126750933 122999281 119058738 115221892 111330766 107587510 103850200 100061482
13740A00061482l638849l494807l360988l441464l208011l067511k880750k684926
$$ 100061482 96422633 92927826 89566838 86125374 82917363 79849852 76969102 74284176
13732G4284176k696531k441982k446357k421351k216259k187538j956091k034255
$$ 74284176 71587645 69145663 66699306 64277955 62061696 59874158 57918067 55883812
13724E5883812j957339j723918j747260j638038j420783j464968j400523j331555
$$ 55883812 53926473 52202555 50455295 48817257 47396474 45931506 44530983 43199428
13716D3199428j258511j425863j224331j257819j202221j113992j033273j016279
$$ 43199428 41940917 40515054 39290723 38032904 36830683 35716691 34683418 33667139
13708C3667139j076123r51506q23433p96109q25523r26876p55067p76411o42227
$$ 33667139 32591016 31639510 30816077 30019968 29194445 28267569 27512502 26736091 26093864
13699B6093864o78783p54782o89195o34152m59896m69963m75139n06371o20582
$$ 26093864 25415081 24660299 23971104 23336952 22877056 22407093 21931954 21425583 20805001
13690B0805001n66975m12516m27467m42300m87485m64024m52609l40238k77405
$$ 20805001 20238026 19825510 19398043 18955743 18468258 18004234 17551625 17211387 16933982
13681A6933982l89673l76980m13272k14154k25689m38351l63880l08848k97589
$$ 16933982 16544309 16167329 15754057 15539903 15314214 14875863 14511983 14203135 13905546
13672A3905546m84791l08102k67434l11576j84573j98391r9404k15237m40955
$$ 13905546 13420755 13112653 12845219 12533643 12349070 12150679 12051275 11836038 11395083
13663A1395083j90170q0209k72453j56846l08485l51805j91219m5876j62405l15098
$$ 11395083 11204913 11124704 10852251 10695405 10386920 10035115 9843896 9798020 9635615 9320517
13653I320517j81286k69651k28414j32771m0748j35857l08590k97901p7817j85348
$$ 9320517 9139231 8869580 8641166 8508395 8467647 8331790 8023200 7725299 7647482 7462134
13643G462134j24032N341q8724j38364q4819j16903k15258j32196r870m9810k03020
$$ 7462134 7338102 7343443 7254719 7116355 7031536 6914633 6699375 6567179 6557309 6507499 6304479
13632F304479j04870j07874q8427j17769j33890j01087n0277j15222q4877M3162
$$ 6304479 6199609 6091735 6003308 5885539 5751649 5650562 5600285 5485063 5400186 5443348
13622E443348L2069j08172j01801j26635j42319r1726k111j12378k56668j12007
$$ 5443348 5475417 5367245 5265444 5138809 4996490 4904764 4902653 4790275 4533607 4421600
13612D421600j24409J36742K9789o0445M917j50143k62423k12083L2375J03835
$$ 4421600 4297191 4433933 4463722 4403277 4408194 4258051 3995628 3783545 3815920 3919755
13602C919755n290j87046j03588L3418L9449j45734l3012O9340k6477k29370p0922
$$ 3919755 3914465 3727419 3623831 3657249 3696698 3550964 3517952 3587292 3560815 3331445 3260523
13591C260523J3961j18733k4752L423p219n3503n6307k033j26238j15011K5873
$$ 3260523 3274484 3155751 3130999 3134422 3127203 3073700 3017393 3015360 2889122 2774111 2799984
13580B799984M9307l5862r0220j0159J48814j06036k38029o0923Q9094j1033J199
$$ 2799984 2849291 2813429 2723209 2713050 2861864 2755828 2517799 2456876 2545970 2534937 2536136
13569B536136k8436m6990m2949r5399q7170j6045M4184J39644n0177j15387r8149
$$ 2536136 2507700 2460710 2417761 2322362 2235192 2219147 2263331 2402975 2352798 2237411 2139262
13558B139262K1259j8572o7013N2502N163r9545j02409j3037J4124R5602k8404
$$ 2139262 2160521 2141949 2074936 2127438 2132601 2033056 1930647 1917610 1931734 2027336 1998932
13547A998932l5951m9920M5966p7852j68585r1294K46874K20765p4512m5516k14395
$$ 1998932 1962981 1913061 1959027 1881175 1712590 1621296 1868170 2088935 2014423 1968907 1754512
13536A754512p9119L6013j3398j13680N255P2879K4485m0253P0866l2328j3108
$$ 1754512 1675393 1711406 1698008 1584328 1589583 1662462 1686947 1646694 1717560 1685232 1672124
13525A672124o0488o0573Q1811l2033j21532m4303M2674k462N1251K1896q0878
$$ 1672124 1611636 1551063 1632874 1600841 1479309 1435006 1477680 1475218 1526469 1548365 1467487
13514A467487p2710l7898K8969J5229J0758M864O3523j6461K4476j56455n8877
$$ 1467487 1394777 1356879 1385848 1401077 1411835 1416699 1480222 1463761 1488237 1331782 1272905
13503A272905p9055j04924N8736J52360J90537P8274q1809m8412l5270r7134q5824
$$ 1272905 1193850 1088926 1147662 1300022 1490559 1568833 1487024 1438612 1403342 1306208 1220384
13492A220384p9733l8281N4893k951k8259l4721p2028K7451L9098M8181o0075
$$ 1220384 1140651 1102370 1157263 1154312 1126053 1091332 1019304 1046755 1085853 1134034 1073959
13481A073959j73340L9824J13623P557q0542j40799J08085L6199q3601N4975N8645
$$ 1073959 900619 940443 1054066 1061623 981081 840282 948367 984566 900965 955940 1014585
13470A014585o0186M6067N3492N0359m7236J9019l2888Q371K9106n688q4265j11670
$$ 1014585 954399 1000466 1053958 1104317 1057081 1076100 1043212 1051583 1080689 1075001 990736 879066
13458H79066P0873K2862K4961m9710m7660j21960o7617m8217M2587N8881N6493
$$ 879066 949939 972801 997762 948052 900392 778432 710815 662598 705185 764066 820559
13447H20559K8539J18709o1039p7364J6147M3675j01846N7646P048j60064K2096
$$ 820559 849098 967807 906768 829404 845551 889226 787380 845026 852074 692010 714106
13436G14106l0891l4834J1498q2034k7195P5021q425J28374L3789q2259J17736
$$ 714106 683215 648381 659879 577845 550650 625671 617246 745620 779409 697150 814886
13425H14886N5517L1243q3295j29502q0913k4787L497O733k7088N642n5766j25997
$$ 814886 870403 901646 818351 688849 607936 583149 586646 593379 566291 571933 516167 390170
13413C90170n6020k1296m1139O8196J89023J548n3593R3744Q927J056n0451L2895
$$ 390170 334150 312854 271715 339911 528934 530482 476889 570633 579560 580616 530165 563060
13401E63060N3693p5315Q995k407O1231J2765m3850j84990j20963r4502J19929
$$ 563060 616753 541438 550433 548026 609257 622022 578172 393182 272219 177717 297646
13390B97646P4517K2443m2241M444J23753J5641m551q9192J59287R7960r1304
$$ 297646 372163 394606 352365 356809 480562 496203 491652 402460 561747 659707 568403
13379E68403j10364L7849O0201k7497K1644J1113N031N6384J5802k4424m9413
$$ 568403 458039 495888 556089 528592 550236 561349 566380 622764 638566 614142 564729
13368E64729K6887q4969q9640L1164n6013J04438l7690j16680J9121M7410N7194
$$ 564729 591616 506647 417007 448171 392158 496596 458906 342226 361347 408757 465951
13357D65951k3140P679o5732r447M324m5242o4802P3880l7997J3516N9913L2103
$$ 465951 442811 450490 384758 375311 379635 334393 269591 343471 305474 318990 378903 411006
13345D11006O8126n2214l3742j33131N2617j5732Q3602m7971K5949J19348J16163
$$ 411006 479132 426918 393176 260045 312662 296930 380532 332561 358510 477858 594021
13334E94021j24682j40072q2698o100O670N4810M6487M0405L9597j23089J487
$$ 594021 469339 329267 246569 240469 247139 301949 348436 388841 428438 305349 306836
13323C06836J99449J0557p5840l1927m0514l4068J24991j35473n0214l0915k262
$$ 306836 506285 516842 441002 409075 368561 334493 459484 324011 273797 242882 240620
13312B40620L9503P881J4790J5062K2569l4129m960O5690J45261J9573l7315j41760
$$ 240620 280123 288004 302794 317856 340425 306296 301336 367026 512287 531860 494545 352785
13300C52785J877R95m2332J9345J2361m9634N0101L5575K5596M9082m8514p4366
$$ 352785 354662 355657 313325 332670 345031 295397 345498 381073 406669 455751 407237 332871
13288C32871j48639p1042K0706R9514L3347N8234j6748o6058m427j1875K9204
$$ 332871 184232 113190 133896 233410 266757 324991 308243 242185 237758 225883 255087
13277B55087k3492n2295J929K8155P2212L4187r5589o6382N9681M0144M8817R128
$$ 255087 231595 179300 181229 209384 281596 315783 220194 153812 213493 253637 302454 311582
13265C11582N7034J04893n8145r0651Q691k8276j0183M12p225n2127l055J82540
$$ 311582 368616 473509 415364 324713 333404 305128 294945 295357 288132 236005 232950 415490
13253D15490O5143j47059j17632l1140M181L1509O8878J2379n2048R2215k5146
$$ 415490 480633 333574 215942 184802 188983 220492 289370 301749 249701 341916 316770
13242C16770J0747P2514K5615M3705j6216k1743L164j30196j44146M7043J60488
$$ 316770 327517 400031 425646 469351 453135 431392 434556 304360 160214 207257 367745
13231C67745r917L4073m1402l0531M6194O866P1414k0931m9272k3697q5269J817
$$ 367745 357828 391901 350499 319968 366162 373028 444442 423511 374239 350542 265273 267090
13219B67090L6929Q9904k2504j11484q4581j7851n1236j490N8770L6769l3223
$$ 267090 304019 393923 371419 259935 175354 157503 106267 104777 163547 200316 167093
13208A67093k9003l0370R8572J04638P7114l8853j30874p7150k058M244j1904
$$ 167093 138090 107720 206292 310930 388044 349191 218317 141167 139109 143353 131449
13197A31449m4821L563Q1980Q1741j5890r5510k6751o0217j020o988L636J3703
$$ 131449 86628 90191 172171 253912 238022 142512 115761 55544 54524 47536 51172 64875
13185F4875J15687O5485l2274O2325L130q6880r4015j54939m0507P5149J54146
$$ 64875 180562 246047 213773 276098 279228 192348 98333 -56606 -97113 -21964 132182
13174A32182Q1133j6142P8904O7754p722n6900L2523k5661P8745N0498k30463
$$ 132182 213315 197173 276077 343831 336109 279209 311732 286071 364816 415314 184851
13163A84851n0470L5124K2079n8203P914L9932J34547j20616j31439K5018O1514
$$ 184851 134381 169505 191584 133381 141295 181227 315774 195158 63719 88737 150251
13152A50251o6065j1571j13038m140J79163J49882K9454m07j02199j19127j6622
$$ 150251 84186 72615 -40423 -44563 134600 284482 313936 313529 211330 92203 75581
13141G5581q3156L5276Q3473m9164O5002R8607m7635j9212J42388J8505p4679
$$ 75581 -7575 27701 111174 62010 127012 225619 177984 158772 301160 319665 244986
13130B44986k5483J03429p7861j16581j23197p3493M4256K2692Q462O1872K2022
$$ 244986 219503 322932 245071 128490 5293 -68200 -23944 -1252 7210 69082 91104
13119I1104K0703K2053L1025k0394J1443K843l1655j0743Q644O0926J60997j7501
$$ 91104 111807 133860 164885 144491 155934 158777 127122 116379 125023 185949 346946 329445
13107C29445m3493O3113K7379q1632j35839o4903n1918J27697Q4125K9208P020
$$ 329445 285952 349065 376444 294812 158973 94070 42152 169849 253974 283182 290202
13096B90202L4558r8039j24337m1874O7333M3859P871n2186p4862M3280O514Q9329
$$ 290202 324760 226721 102384 60510 127843 171702 179573 127387 52525 95805 102319 191648
13084A91648P4299j0441l7390r8008p2395J04874J27183j9224l5134J33554m3251
$$ 191648 265947 255506 218116 120108 47713 152587 279770 260546 225412 358966 315715
13073C15715j5600m9192j05611l1542j363N9871M0851N8602P2274Q8857k9255
$$ 315715 300115 250923 145312 113770 112407 172278 213129 271731 344005 432862 403607
13062D03607p4665l7776m8005K2266j46266M4495L0909j31M2545N3672q9412O5035
$$ 403607 328942 291166 243161 265427 119161 163656 194565 194434 236979 290651 201239 266274
13050B66274J04705k6099P8113J9597m5263l6790L4143n0833l6711N1399m5945
$$ 266274 370979 344880 422993 442590 397327 360537 394680 343847 307136 358535 312590
13039C12590o3169J9767K01529P7372j70705r0668j14025j0828k5499J43735K6651
$$ 312590 249421 269188 470717 548089 377384 286716 172691 161863 136364 280099 306750
13028C06750l6420o1755J7576k6454k8800N3196L4208p4998J371Q3528N1943J3121
$$ 306750 270330 208575 226151 199697 170897 224093 258301 183303 184674 268202 320145 333266
13016C33266j901M3065J00086K5917n9592k6001p0768L9652p7597L8370j5295
$$ 333266 331365 374430 474516 500433 440841 414840 344072 383724 306127 344497 329202
13005C29202j08253j59954l4210N034O280J9114N5328N0233N3562J275m03n5421
$$ 329202 220949 60995 26785 31819 38099 57213 112541 162774 216336 217611 217208 161787
12993A61787K2115k0559k7519M4088J10923l9797K9312k2218j59268j145O0308
$$ 161787 183902 163343 135824 179912 290835 251038 280350 258132 98864 97719 158027
12982A58027J02276m7836n5723q5820l3705l9496J0574m8550L827J40129J5309
$$ 158027 260303 212467 156744 70924 37219 -2277 8297 -40253 -36426 103703 119012
12971A19012Q9443R5163j19751n3252j05090J190K9140N3239J19813p951m8499
$$ 119012 208455 303618 183867 130615 25525 26715 55855 109094 228907 220956 172457
12960A72457j06903j01305N0312L9450R5028P1962o2951j16585N4178N5598l4703
$$ 172457 65554 -35751 14561 54011 149039 221001 158050 41465 95643 151241 116538
12949A16538K9362J60216K3104j13687m6561k5934o4926l264L7533Q504l081N8131
$$ 116538 145900 306116 329220 215533 168972 143038 78112 74848 112381 120885 117804 175935
12937A75935j4462l979J9627Q0888Q8207j67027j5155K2583J14072N5992n7795
$$ 175935 161473 157494 177121 258009 346216 179189 164034 186617 300689 356681 298886
12926B98886q9878j69522k0134J35171N3671P6523j01520j29307Q6694n352q48
$$ 298886 209008 39486 19352 154523 208194 284717 183197 53890 140584 135232 134384
12915A34384j13852q9433o5873j48972R0524K06510L7890j89994l2840O7724N6208
$$ 134384 20532 -68901 -134774 -283746 -193222 13288 51178 -138816 -171656 -103932 -47724
12904d7724L0559K9292Q5760K4822j06209R6249k1443j49266r4326J4699J20133
$$ -47724 -17165 12127 97887 122709 16500 112749 91306 -57960 -152286 -137587 -17454
12893a7454Q2624k969J9368N812j28868n4603j7756L1995L4861n182o97M007L1575
$$ -17454 65170 62201 81569 87381 -41487 -96090 -113846 -81851 -46990 -52172 -52869 -48862 -17287
12880a7287M5379r0973L6265N871O6128J4716K3981r7671j23600m2523Q6675J23702
$$ -17287 28092 -62881 -26616 -20745 45383 60099 84080 -13591 -137191 -179714 -93039 30663
12868C0663n080o6265J3382K7311n6535J6628R9483R3702o2392o9878J8677j7198
$$ 30663 25583 -40682 -27300 11 -56524 -39896 59587 153289 90897 21019 39696 22498
12856B2498Q3851J13052j45125l5370m2902j7896J34692k0276O0981p6466p1890
$$ 22498 106349 219401 74276 38906 -3996 -21892 112800 92524 153505 77039 5149
12845E149o9417n0468P2435k5256q4277Q3656J06805J24186R1959M8144j19780
$$ 5149 -64268 -114736 -42301 -67557 -151834 -68178 38627 162813 254772 302916 183136
12834A83136k9391j21243m0571j344J8970P8305N8719K3618o1075j13555K2213
$$ 183136 153745 32502 -8069 -9413 9557 87862 146581 170199 109124 -4431 17782
12823A7782L7650n8397Q735K4839p6897r7641N6500K4635p4906P382M0779N6912
$$ 17782 55432 -2965 5770 30609 -46288 -143929 -87429 -62794 -137700 -130318 -89539 -32627
12811c2627O9732k5893N7147J06540k0205j17472n8096n8575O052n5449L1179
$$ -32627 37105 11212 68359 174899 154694 37222 -20874 -79449 -73397 -128846 -97667
12800i7667R8624K7406N022N8871m0718J61371O7970j21344l1807Q666j0221r4430
$$ -97667 957 28363 33385 92256 51538 212909 280879 159535 127728 136394 126173 31743
12788C1743J0747J24926j3788R8953N343m0976m662p5042j11562K3983K6698P6773
$$ 31743 42490 167416 153628 252581 257924 216948 212286 137244 25682 49665 76363 153136
12776A53136J06050L1781q0050l4763m3367l3802K0232O3247M6015K9251o8687
$$ 153136 259186 290967 210917 176154 132787 98985 119217 182464 228479 257730 189043
12765A89043l1329Q7882J9562l7772j753r6448n9839J42877P37j89072k5881P9486
$$ 189043 157714 245596 265158 227386 225633 129185 69346 212223 212960 23888 -1993 77493
12753G7493J2677r4180j01645N1608J02358Q2015J19953n1376q6384L8209L9154
$$ 77493 90170 -4010 -105655 -54047 48311 130326 250279 198903 112519 150728 189882
12742A89882j09832j03366q770J14789Q4076o5337j39635m8845J26383R4833q565
$$ 189882 80050 -23316 -32086 82703 166779 101442 -38193 -87038 39345 134178 125613
12731A25613j3300k935O5905J1257r6500m7128m5383j2958N4953L2026O5240p935
$$ 125613 112313 109378 175283 186540 90040 42912 -2471 -15429 39524 71550 136790 128855
12719A28855L0211J6006j32891L3965J60450J33901K4843K8463J26739Q7983J02022
$$ 128855 159066 175072 42181 76146 236596 370497 395340 423803 550542 638525 740547
12708G40547K329J12110P8471J7886L2044j25474j26640o6128o7309R610k2123
$$ 740547 742876 854986 933457 951343 983387 857913 731273 665145 597836 607446 585323
12697E85323r2305j8287n5097j3936N459l3214p9079q6441M3940o2637l8479R708
$$ 585323 493018 474731 419634 405698 411157 377943 298864 212423 256363 193726 155247 164955
12685A64955P4270N067l1926P3978n5227J2212q8009p9468J41698l3860j24285
$$ 164955 239225 244292 212366 286344 231117 243329 155320 75852 217550 183690 59405
12674E9405m0855L7553K8130J35667j03781l589n5540J18445Q04N4900N3145j01588
$$ 59405 18550 56103 84233 219900 116119 112530 56990 175435 176239 231139 284284 182696
12662A82696j90805l7988J11660J07796J4730j00657L304j79658k7166O754J75171
$$ 182696 -8109 -46097 65563 173359 188089 87432 90736 -88922 -116088 -109334 65837
12651F5837J02470L325J8684q3002Q9870r2088n5094o1857l8970J57553r717j41332
$$ 65837 168307 171632 190316 107314 197184 105096 50002 -11855 -50825 106728 97011 -44321
12639d4321j458J09115J12770n9873j44277O3860J0385o8024K3215m5381m0827
$$ -44321 -45779 63336 176106 116233 -28044 35816 46201 -21823 1392 -43989 -84816
12628h4816R6737L1047O5973q8929p3904K3665p555J888K8293Q320j9924j8614
$$ -84816 11921 42968 108941 20012 -53892 -30227 -37782 -35894 -7601 719 -19205 -37819
12616c7819J6732o677L788j5835p3475M7310J43367M2082O7099j8981p1508j10427
$$ -37819 -21087 -27764 -23976 -39811 -113286 -65976 77391 119473 186572 167591 96083 -14344
12604a4344p8258O3706J01014O3097l4076P5951o6935j00098j04442J88108l9208
$$ -14344 -92602 -28896 72118 135215 101139 177090 110155 10057 -94385 93723 54515
12593E4515j53553K9086R996j7794n0304p6459j2171K5586J23107L2599k0291
$$ 54515 -99038 -69952 -59956 -77750 -128054 -204513 -216684 -191098 -67991 -35392 -55683
12582e5683P493L7546M6568j68926o7387Q1307Q9617J24105n5985P1611M4340
$$ -55683 -48190 -10644 35924 -133002 -200389 -119082 -29465 94640 38655 110266 154606
12571A54606n1755m7586P578P477o2023l2934J6137m7195N8994M6179m8072k6093
$$ 154606 102851 55265 62843 70320 8297 -24637 -8500 -55695 3299 49478 1406 -24687
12559b4687k1614j7554J05910R5069j2114j33080n3787l0080R0353R0504K5128
$$ -24687 -46301 -63855 42055 137124 125010 -8070 -61857 -91937 -1584 88920 114048
12548A14048M5892m5378q6631j38069p195R0822K18588K7798j69839j12241M1934
$$ 114048 159940 114562 27931 -110138 -117333 -26511 192077 219875 50036 -62205 -20271
12537b0271J82488J9731m0570k9503J6693J25265m8434j01140m5206J0361o5817
$$ -20271 162217 181948 141378 111875 128568 253833 205399 104259 59053 69414 3597
12526C597n0127p9763n6414m5062o96J94178P2287j9086m3403l9942j01330q91
$$ 3597 -46530 -126293 -182707 -227769 -228465 -34287 38000 18914 -24489 -64431 -165761 -166652
12514a66652O0980P0533O3584m5949Q5287R3366m9061n9928n9494O618K4763j63854
$$ -166652 -105672 -35139 28445 -17504 67783 161149 112088 52160 -7334 -716 24047 -139807
12502a39807K6838J14724L0764j04659o7436j69882N5601O6440J19898M2726l7101
$$ -139807 -112969 1755 32519 -72140 -139576 -309458 -253857 -187417 -67519 -24793 -61894
12491f1894M4579m3090M4152q7815p3908J75413L1257J8469M4493O1110k3071
$$ -61894 -17315 -60405 -16253 -104068 -177976 -2563 28694 47163 91656 152766 129695
12480A29695k5604j9610Q5084j3872o5064j72723l2650L0680n6905J18270j2224
$$ 129695 104091 84481 169565 155693 90629 -82094 -114744 -84064 -140969 -22699 -34923
12469c4923R883p7025p7735J22545P2124J340N9880k57181j12909K5444O7609
$$ -34923 -25040 -102065 -179800 -57255 14869 16209 76089 -181092 -294001 -268557 -200948
12458b00948Q1769L0852n5585j8843P217J80210Q87n8263m3494N0406J23008k4214
$$ -200948 -119179 -88327 -143912 -162755 -155538 24672 25559 -32704 -76198 -25792 97216 73002
12446G3002j07486Q1611J25643r6987q1782q9166j13551j8834J08143P7771N4909
$$ 73002 -34484 47127 172770 75783 -5999 -95165 -208716 -227550 -119407 -41636 13273
12435A3273q6149m4881j5540N6658o6360j0791K7644N8048j242j26496M029P5693
$$ 13273 -72876 -117757 -133297 -76639 -142999 -153790 -126146 -68098 -69340 -195836 -191807 -116114
12423a16114l5659j10274R1007O1346L8143j32699n6801J04991J7892J0261n558
$$ -116114 -151773 -262047 -171040 -109694 -71551 -204250 -261051 -156060 -138168 -127907 -133465
12412a33465L8902J08308O2365J7213q5735O5865k7061j42185k2324Q1048O2643
$$ -133465 -94563 13745 76110 93323 7588 73453 46392 -95793 -118117 -37069 25574
12401B5574n0193j9475q4311r142M3518J15184O2180n7332m4542R740k2877p8503
$$ 25574 -24619 -44094 -128405 -137547 -94029 21155 83335 26003 -18539 -8799 -31676 -110179
12389a10179O7556J04647m8518m6470K3257m321l4235N3l4320J16783L2534p204
$$ -110179 -42623 62024 13506 -32964 -9707 -14028 -48263 -48210 -82530 34253 66787 59583
12377E9583r2468j6548O7713q3564j45459L6252K1522M2429O6992O5085p9107
$$ 59583 -32885 -49433 18280 -65284 -210743 -174491 -152969 -110540 -43548 21537 -57570
12366e7570q462K4429L0942O7730j07172l472J0586M6966M5929J4837l2051o4185
$$ -57570 -66032 -41603 -10661 57069 -50103 -53575 -42989 3977 49906 64743 32692 -31493
12354c1493O3752j9688j3267K6536n0372P7626o0515J2234r1863J11638K6351
$$ -31493 32259 12571 -696 25840 -24532 53094 -7421 4813 -87050 24588 50939
12343E0939r3302m2524j2472M228m1679k01K9942N7911O4849j178r7946n9463
$$ 50939 -42363 -84887 -97359 -93131 -134810 -135011 -105069 -47158 17691 16513 -81433 -140896
12331a40896L4599K4575O9430K1100l7842l672j62069l0066m0696Q3499P2494
$$ -140896 -106297 -81722 -12292 8808 -29034 -32706 -194775 -224841 -265537 -182038 -109544
12320a09544P4715m1399Nj2516M7949o1181J20950j0067q9848m1582L6081j4946
$$ -109544 -34829 -76228 -76223 -88739 -40790 -101971 18979 8912 -80936 -122518 -86437 -101383
12308a01383O6824Q3829l7193m494o0697o2982N0751J26684O8945k7923k3012
$$ -101383 -34559 49270 12077 7583 -53114 -116096 -65345 61339 130284 102361 79349
12297G9349q4160m1509n5589O1658M8126R23O4783n3308M7864K1976q6261R6566
$$ 79349 -4811 -46320 -101909 -40251 7875 8798 73581 20273 68137 90113 3852 100418
12285A00418o2023J641R3351L4173j08395j36875n5207N8374M9637j06586l8638
$$ 100418 38395 40036 133387 167560 59165 -77710 -132917 -74543 -24906 -131492 -170130
12274a70130M2570L8473k9944J7995j01030j2768k3422J41258R4654J1231M5538
$$ -170130 -127560 -89087 -119031 -101036 -202066 -214834 -238256 -96998 -2344 8887 54425
12263E4425J02909r2381j86465k4600J53131K0281J0075j54864j43865O247O3409
$$ 54425 157334 64953 -121512 -146112 7019 27300 37375 -117489 -261354 -255107 -191698
12252a91698m0167k5334J1251Q2465J00511o9328n6543L9456J7323J0893P2777
$$ -191698 -231865 -257199 -245948 -163483 -62972 -132300 -188843 -149387 -132064 -121171 -48394
12241d8394k3263J97804j6440j7565L1387O5557q4657j89513J49830O7497K7977
$$ -48394 -71657 126147 109707 92142 123529 189086 104429 -85084 64746 132243 160220
12230A60220L6779k9407n7995L4667n107n3166p9361m6129o2902L8094L219R3339
$$ 160220 196999 167592 109597 144264 139157 85991 6630 -39499 -102401 -64307 -61088 32251
12218C2251k4771L3007M4594M130K1063J5636q6038l1544L8425P2790j67933k18923
$$ 32251 7480 40487 85081 89211 110274 125910 39872 8328 46753 119543 -48390 -267313
12206b67313r9063q662P2054J56418N3704M3091L4433K2532P3348j31781j56501
$$ -267313 -366376 -375038 -302984 -146566 -92862 -49771 -15338 7194 80542 -51239 -207740
12195b07740j39540j5731J06199J38127M7413m6860j12653j39440N9337J11996
$$ -207740 -347280 -363011 -256812 -118685 -71272 -118132 -230785 -370225 -310888 -198892
12185a98892J05791J2371J14424M4226j12239k02165j5317R2738P03L2477j7898
$$ -198892 -93101 -80730 33694 77920 -34319 -236484 -251801 -159063 -158360 -125883 -143781
12174a43781l7858n8420M0847k5326J827Q673O3999O1652R5020Q128p7831L535
$$ -143781 -181639 -240059 -199212 -224538 -222711 -214038 -150039 -88387 6633 14761 -63070 -59535
12162e9535j16693L8357P0576P7102O3447N4665j2829q6280j05716o5210l8991
$$ -59535 -176228 -137871 -67295 9807 73254 127919 115090 28810 -76906 -142116 -181107
12151a81107n5212R6210J49468j1145o472j21763p8331j3515J80921O8734R1707
$$ -181107 -236319 -140109 9359 -1786 -8258 -130021 -208352 -221867 -40946 27788 119495
12140A19495r804k14468j31328j2828O6720K3750n93n4099L5834P5264l1787o361
$$ 119495 109691 -104777 -236105 -248933 -182213 -158463 -159056 -213155 -177321 -102057 -133844 -140205
12128a40205L2708J5016O4274J0793m2528k3892q9817L6512q4411j01947J8925
$$ -140205 -107497 -92481 -28207 -17414 -59942 -83834 -173651 -137139 -221550 -323497 -304572
12117c04572J58847L7107n5992j30276j55247N2685J6561K1354J19927J83434
$$ -304572 -145725 -108618 -164610 -294886 -450133 -397448 -380887 -359533 -239606 -56172
12107e6172N7708k6594j42228q5736p990N0841O4183Q1164J292j13610Q5849R310
$$ -56172 1536 -25058 -167286 -253022 -261012 -210171 -145988 -64824 -63532 -177142 -91293 -81983
12095h1983J5963O699n2324K3631J14207L7798j08407O1221l2201r1733l228J51424
$$ -81983 -66020 -59321 -111645 -88014 26193 63991 -44416 16805 -15396 -107129 -110357 41067
12083D1067J17805r8764j33135k0786j2120n0077J22993P1874j01602l9590N6625
$$ 41067 158872 60108 -73027 -93813 -105933 -156010 -33017 38857 -62745 -102335 -45710
12072d5710j5397l8086o3761K5388J8967m7709o7022j59988o3205L9548R3620
$$ -45710 -61107 -99193 -162954 -137566 -118599 -166308 -233330 -393318 -456523 -416975 -323355
12061c23355J02853R2653L6983J13220O8202l8138j04365p2751r0525o5679N5740
$$ -323355 -220502 -127849 -90866 22354 90556 52418 -51947 -124698 -215223 -280902 -225162
12050b25162M2314O1598M2259n0411J27384J22022J32668l9948L5495L7702j7502
$$ -225162 -182848 -121250 -78991 -129402 -2018 120004 252672 212724 248219 285921 268419
12039B68419L2691L35j27251j08448J8867J8746O8418Q6298M0083j10742m1559
$$ 268419 301110 301445 174194 65746 84613 103359 171777 258075 298158 187416 145857
12028A45857n4418j46195j27146o465P3418k6577Q8770P2463j068N4326q747j09236
$$ 145857 91439 -54756 -181902 -188367 -114949 -141526 -52756 19707 18639 72965 64218 -45018
12016d5018q6292m855J25291j0058o4052k7324j33278N960K62233J45860j5097
$$ -45018 -131310 -136165 -10874 -20932 -84984 -112308 -245586 -239626 22607 168467 153370
12005A53370l6507j9443K6064k3400k05759p7349R9285Q7016K7572P3452O0460
$$ 153370 116863 97420 123484 100084 -105675 -183024 -83739 3277 30849 104301 164761
11994A64761j40090o9309M0161Q1445l4029J4187P858M4207N0929o9408l8835
$$ 164761 24671 -44638 -4477 76968 42939 57126 64984 109191 160120 90712 51877
11983E1877K20559R4723j22933r8928k6842L420K8077J00286j1090p9997K5824
$$ 51877 272436 367159 244226 145298 118456 121876 149953 250239 239149 159152 184976
11972A84976J77574n848j04641P7535Q6343K0654k7049r58P5940p1536o1869l4085
$$ 184976 362550 356702 252061 329596 415939 436593 409544 408586 484526 412990 351121 317036
11960C17036m4958j5938P1488J26232J38787N7543Q7639J04777L2194k9766N5452
$$ 317036 272078 256140 327628 453860 592647 650190 737829 842606 874800 845034 900486
11949I00486J06238M9694L6333J36201K03203J28518J62052J61336K77773J20946
$$ 900486 1006724 1056418 1092751 1228952 1432155 1560673 1722725 1884061 2161834 2282780
11939B282780O3736K77172L26244L81002L25590L66528M06660N46451O56128O66709
$$ 2282780 2346516 2623688 2949932 3330934 3656524 4023052 4429712 4976163 5632291 6299000
11929F299000Q19608R41601J189084J472497J784673K173840K807076L672896
$$ 6299000 7118608 8060209 9249293 10721790 12506463 14680303 17487379 21160275
11921B1160275M880005O634252R523884J4367952K1842686L2071560M0579786
$$ 21160275 26040280 32674532 42198416 56566368 78409054 110480614 151060400
11914A51060400L8342941K7172036K0042314J8572735J3089468l929672l1563644
$$ 151060400 189403341 216575377 236617691 255190426 268279894 264350222 232786578
11907B32786578n0239019m5840311l2440067k1522267j4351091r934383p249562
$$ 232786578 182547559 136707248 104267181 82744914 68393823 58459440 51209878
11900E1209878n393679m251897l359295k612723k191029j982228j808312j477762
$$ 51209878 45816199 41564302 38205007 35592284 33401255 31419027 29610715 28132953
11892B8132953j356817j349297j202337j115703j099766r62085r86345q96564
$$ 28132953 26776136 25426839 24224502 23108799 22009033 21046948 20060603 19164039
11884A9164039p55871o98284o69411p14239o60568n07702n15734m69510m48969
$$ 19164039 18408168 17709884 17040473 16326234 15665666 15157964 14642230 14172720 13723751
11875A3723751n27437m81706n26813l92549l59611m32915m13524m88023m67206
$$ 13723751 13196314 12714608 12187795 11795246 11435635 11002720 10589196 10101173 9633967
11866I633967j94204l2374k38585m55803l16534k40449l65309l37907k36449j01416
$$ 9633967 9439763 9407389 9168804 8713001 8396467 8156018 7790709 7452802 7216353 7114937
11856G114937k23123l01628l56721k86948k09332j37738m364J03704j40426k44398
$$ 7114937 6891814 6590186 6233465 5946517 5737185 5599447 5595083 5698787 5558361 5313963
11846E313963k18079p3025j06353j72690j96139k0712k8821l794j11322j85874
$$ 5313963 5095884 5022859 4916506 4743816 4547677 4526965 4498144 4494350 4383028 4197154
11836D197154j07612n329l6999j51795j8678o344j16694k24792k04144j13603
$$ 4197154 4089542 4084213 4047214 3895419 3876741 3870397 3753703 3528911 3324767 3211164
11826C211164p7483o5589j05232q7178L229Q7524l0140j62486r8818q0870n8731
$$ 3211164 3133681 3068092 2962860 2875682 2878911 2966435 2936295 2773809 2674991 2594121 2535390
11815B535390r2153m8264k4616K114k4967L4303j17207j71968r2418P758p3843
$$ 2535390 2443237 2394973 2370357 2372471 2347504 2381807 2264600 2092632 2000214 2007972 1934129
11804A934129m7557l743o86n0292r2232r1825j8021q6410o3944o7538p0207p8571
$$ 1934129 1886572 1882829 1882143 1831851 1739619 1647794 1629773 1543363 1479419 1411881 1341674 1263103
11792A263103R5508J5687o6970j0700j69338j07596Q6461q585j36798o0682P6060
$$ 1263103 1358611 1374298 1307328 1296628 1127290 1019694 1106155 1097570 960772 900090 976150
11781I76150R8365j37141N5763R2905p2297j44912R1485M4215k0930j8764J40778
$$ 976150 1074515 937374 993137 1086042 1013745 868833 960318 1004533 983603 964839 1105617
11770A105617n2520m5017J73878R2107l9289p9448n0211j47939L8847J22278j2368
$$ 1105617 1053097 1008080 1181958 1274065 1234776 1155328 1105117 957178 996025 1118303 1105935
11759A105935j57696k9991k7891q0078K4884J13098O0457J3139j45904j57728
$$ 1105935 948239 918248 890357 810279 835163 948261 1008718 1021857 875953 718225
11749G18225o2164L4778j8578p4965J44628N1441j22305l8494q413k03629q3205
$$ 718225 656061 690839 672261 597296 741924 793365 671060 632566 624153 420524 337319
11738C37319j5839L4326Q0754Q6799r6814k2538o965r0779j17298N5246k1646
$$ 337319 321480 355806 436560 523359 426545 404007 397042 306263 188965 244211 222565
11727B22565K3325K6019L2795J18170m1166q2381q4776M8351n5510o2975J79883
$$ 222565 245890 271909 304704 422874 381708 299327 214551 262902 207392 144417 324300
11716C24300J51175L4243n6614r7924o8817k1207J3392J03636J5216o0227k2535
$$ 324300 475475 509718 453104 355180 286363 265156 278548 382184 397400 337173 314638
11705C14638m2904p6450L4515O2104J05035P4093l1957o854m6010J3525j8470
$$ 314638 271734 195284 229799 291903 396938 471031 439074 432220 386210 399735 381265
11694C81265N6118m7522j56330j64392p3520J15805O7181j08057n8827J07591
$$ 381265 437383 389861 233531 69139 -4381 111424 178605 70548 11721 119312
11684A19312k4839n565P3296M2078K2192n2484k8178r7451o5815o5283j1394J11966
$$ 119312 94473 88908 162204 204282 226474 173990 145812 48361 -17454 -82737 -94131 17835
11672A7835N4895J52419J09428L6969p4127l8038l223P7282j25505o1039K9306
$$ 17835 72730 225149 334577 371546 297419 259381 256158 333440 207935 146896 176202
11661A76202n3966p0105j0707O8727N7713J24395p1883o2564k9334m5428l6808
$$ 176202 122236 52131 41424 110151 167864 292259 220376 157812 128478 83050 46242
11650D6242R3996L4264K0980r771K1325j5381k7642m9964j2279R2838J52451R07
$$ 46242 140238 174502 195482 185711 207036 191655 164013 114049 101770 194608 347059 347966
11638C47966q0325M0707P0307L9672m3834k8086q641K8985R875j26508j38400
$$ 347966 267641 308348 378655 418327 374493 346407 337766 366751 376626 250118 111718
11627A11718L1782K7222L3899J5661R6928J3468M2025n6148k004n6065O4292r9032
$$ 111718 143500 170722 204621 220282 317210 330678 372703 316555 314551 258486 322778 223746
11615B23746n7858j00707j08352N7316J03375L4426j49404O0992K9310N3232J7647
$$ 223746 165888 65181 -43171 14145 117520 151946 2542 63534 92844 146076 163723
11604A63723L3174J27242o527r4565j2708k10322o2919L284q2177k0884m6574
$$ 163723 196897 324139 317612 223047 210339 17 -62902 -59618 -141795 -162679 -209253
11593b09253N7897J24869O2814L0663m1707k09238j19997M170K48397J41844M6574
$$ -209253 -151356 -26487 36327 66990 25283 -183955 -303952 -299782 -51385 90459 137033
11582A37033n354o9862l0890j140p174l5914p5645O7973Q7844J01944M3575M4420
$$ 137033 131679 61817 30927 29787 22613 -13301 -88946 -20973 66871 168815 212390 256810
11570B56810J1184n3173M0780q4192m1046k2396L5452m2334j24182L4294q050
$$ 256810 267994 214821 255601 171409 130363 107967 143419 101085 -23097 11197 3147
11559C147R5538n750q9976J2995K482L5399p9656n9761R7521q4774l7394N113
$$ 3147 98685 92935 2959 15954 18436 53835 -25821 -85582 11939 -72835 -110229 -105116
11547a05116M3253R4452L6042j18998j09266j022j4291P7443J10708o8517r1141
$$ -105116 -61863 32589 68631 -50367 -159633 -160655 -174946 -97503 13205 -55312 -146453
11536a46453N0505J20897n4275P1929N9845L6469j02675n2978L9598q86J38165
$$ -146453 -95948 24949 -29326 42603 102448 138917 36242 -16736 22862 21976 160141
11525A60141n1502j54173K5177K9740j16932k3500J45069K0019l8143M1577o8053
$$ 160141 108639 -45534 -20357 9383 -107549 -131049 14020 34039 -4104 37473 -30580
11514c0580J620M2699P8690J8502m0591j6139n8660N6440m2291l9602L8278J32412
$$ -30580 -28960 13739 92429 110931 70340 54201 -4459 51981 9690 -29912 8366 140778
11502A40778o4502R256j5097k1760Q5832l4509k3192O1297k9473q6755P1415j118
$$ 140778 76276 85532 70435 48675 134507 99998 76806 138103 108630 21875 93290 92172
11490I2172p6728O4751L6403N4513k1890o6699O6893L7485N3176n4778N950o2298
$$ 92172 15444 80195 116598 171111 149221 82522 149415 186900 240076 185298 191248 128950
11478A28950r880j01725q85O6194O0372j64376n6844p6560L580K24879L1433r7526
$$ 128950 119070 17345 16460 82654 143026 -21350 -78194 -154754 -151174 73705 105138 7612
11466G612M8643r4462j2021k8285O721J6941n0658K0861R3932r20q330J1108J26109
$$ 7612 56255 -38207 -50228 -78513 -71792 -54851 -105509 -84648 9284 8364 34 11142 137251
11453A37251N6071m3713r2400n6223l8026j09422l2234J2988k1852Q5523J49736
$$ 137251 193322 149609 57209 986 -37040 -146462 -178696 -165708 -187560 -102037 47699
11442D7699P0927m5686k3922j8520M8872P9146p0270j51994l4670r2086j9517
$$ 47699 118626 72940 49018 30498 79370 158516 88246 -63748 -98418 -190504 -210021
11431b10021O4256J2219l2182K1198J49268N6643o3731N2194p5277K8439O8137
$$ -210021 -145765 -133546 -165728 -144530 4738 61381 -2350 49844 -25433 3006 71143
11420G1143j1828n419j88651L6963J47149l6471l9202K900j1195j2714o881J2680
$$ 71143 59315 53896 -134755 -97792 49357 12886 -26316 -23416 -34611 -47325 -54206 -41526
11408d1526J72003q100j47573o7839O555K2078j17227j84330M6773j4661J75081
$$ -41526 130477 122377 -25196 -93035 -86480 -64402 -181629 -365959 -319186 -333847 -158766
11397a58766J21329l1459J46247R8638K9272j1743j31993j37285N1742k8525o200
$$ -158766 -37437 -68896 77351 175989 205261 193518 61525 -75760 -24018 -52543 -58743
11386e8743J8400K7600R819M1579J81658r518q7425K1853J1611P9104j24734j29631
$$ -58743 -40343 -12743 -2924 38655 220313 210795 123370 145223 156834 235938 111204 -18427
11374a8427j05372J17039M8405r6040n4093n763J1809L7295L2614L0960K5746
$$ -18427 -123799 -6760 41645 -54395 -108488 -114251 -102442 -65147 -32533 -1573 24173
11363B4173J11713O9296j44375j01224n8607j3041M7589O5740k6117q2205O274
$$ 24173 135886 205182 60807 -40417 -99024 -112065 -64476 1264 -24853 -107058 -100784
11352a00784K6276J40096P6798j16347j121K861L9294L2442m7667L9691L517J6688
$$ -100784 -74508 65588 142386 26039 24918 27779 67073 99515 51848 91539 95056 111744
11340A11744l4062m6866O4094J23113K810m5783j38171l3055p0364P5076j5993
$$ 111744 77682 30816 94910 218023 220833 175050 36879 3824 -66540 8536 -7457
11329g457m3778J38924K5251j05200r4676k2521K5099L5819q4952P2533O5537
$$ -7457 -51235 87689 112940 7740 -86936 -109457 -84358 -48539 -133491 -60958 4579
11318D579o3371l0184M7304M2248m3349l3831p8601O9868J52089P0828l8034j43578
$$ 4579 -58792 -88976 -41672 576 -42773 -76604 -155205 -85337 66752 137580 99546 -44032
11306d4032j62916j6762M608J26448J75684m7693j40620o8010O1228L4933m198
$$ -44032 -206948 -223710 -219102 -92654 83030 35337 -105283 -173293 -112065 -77132 -81330
11295h1330l9979P7292K5808k7182o920p1503O3730N8096l7610J13283O5655j18451
$$ -81330 -121309 -44017 -18209 -45391 -52311 -123814 -60084 -1988 -39598 73685 139340 20889
11283B0889q5201j4255P25L5083K6165K0646m0227m0803O5436J35078n3889j17921
$$ 20889 -64312 -78567 -77842 -42759 -16594 4052 -36175 -76978 -11542 123536 69647 -48274
11271d8274o7421L1974O7613M4156K9774k7564j52349q3813J22257R2134J6113
$$ -48274 -115695 -83721 -16108 28048 57822 30258 -122091 -205904 -83647 8487 24600
11260B4600r721P5651K5004j51959L668P9173P7087j7583j9679J7364P9041k9468
$$ 24600 14879 90530 115534 -36425 -32757 46416 123503 105920 86241 103605 182646 153178
11248A53178q8827m2870o184L2157J03164j3786K147n3370o9462Q3870Q3313j03908
$$ 153178 64351 21481 15297 47454 150618 136832 138979 85609 16147 100017 183330 79422
11236G9422j30607l6859j1209j03675N4871r9223Q7731J99386O9067m5985n1282
$$ 79422 -51185 -88044 -99253 -202928 -148057 -247280 -159549 39837 108904 62919 11637
11225A1637k0017J798L0880K8293M684j5806j07591j28970J31689J59239k0835
$$ 11637 -8380 -6582 24298 52591 57275 41469 -66122 -195092 -63403 95836 75001
11214G5001j07564n0063K3626M4168L9471o8076r7084o4219M1719J55260M227
$$ 75001 -32563 -82626 -59000 -14832 24639 -43437 -140521 -204740 -163021 -7761 -3534
11203c534j20173m9727L6636M6234N606L7450J16714R0743k3320m0095q74j00880
$$ -3534 -123707 -173434 -136798 -90564 -84958 -47508 69206 159949 136629 96534 95660 -5220
11191e220P1809R8486L3426j86490j16227M8634l4671l93M3557r2426J8472P8768
$$ -5220 66589 165075 198501 12011 -104216 -55582 -90253 -90646 -47089 -139515 -121043 -42275
11179d2275M5295k1410l936K2131n6825q1380N7637J7918P1538J05705q7729j00403
$$ -42275 3020 -18390 -22326 -195 -57020 -138400 -80763 -62845 8693 114398 26669 -73734
11167g3734M2075J57787J06685m7760k1116j16751r1646r0206J6380Q5843m1644
$$ -73734 -31659 126128 232813 185053 163937 47186 -44460 -134666 -118286 -32443 -74087
11156g4087K3106L9953O7311K2083k4045j17565j59229M7744n8168K6372L8005
$$ -74087 -50981 -11028 56283 78366 54321 -63244 -222473 -174729 -232897 -206525 -168520
11145a68520P5761N31J8646N9337J37556m2968L4999L1774J578j23203M2572J42519
$$ -168520 -92759 -92228 -73582 -14245 123311 80343 115342 147116 148694 25491 68063 210582
11133B10582K11046J60871J32396J76163J28729O5470J04029j14420j38681j56256
$$ 210582 421628 582499 714895 891058 1019787 1085257 1189286 1074866 936185 779929
11123G79929j27948j58017j55643j1435r64k7969L358M2665r7216L2131L9280
$$ 779929 651981 493964 338321 326886 325922 297953 301311 343976 246760 278891 318171
11112C18171k2175j79785p370Q4997j30202r1739Q1259Q984m9641M56J62038l5941
$$ 318171 295996 116211 108841 193838 63636 -28103 53156 62140 12499 12955 174993 139052
11100A39052N7580N1249q8000n0748N7275M6333K532k4581l406l9784m4010j4720
$$ 139052 196632 247881 159881 109133 166408 212741 215273 190692 187286 147502 103492 88772
11088H8772q1513j745R5754L9326O9591l9098j67861l286L3223j22576m8281J5846
$$ 88772 7259 5514 101268 140594 210185 171087 3226 -60 33163 -89413 -137694 -121848
11076a21848K9046J14326Q2045o5684o2666L4711j2692q7832n6113L4698P6691
$$ -121848 -92802 21524 103569 37885 -24781 9930 -2762 -90594 -146707 -112009 -35318
11065c5318K3972K7967p7501M6907N3469o7436l7032L5662l6470m592J5894j3175
$$ -35318 -11346 16621 -60880 -13973 39496 -27940 -64972 -29310 -65780 -70372 -54478 -67653
11053f7653P1654Q2554N3508j8911r6357q027M5518O3141L7655J7251n5581j0801
$$ -67653 4001 86555 140063 121152 24795 16768 62286 125427 163082 180333 124752 113951
11041A13951J4068J53407K0712O9649J0530R0825m6286L7563L886n0423l2290
$$ 113951 128019 281426 302138 371787 382317 473142 426856 464419 468305 417882 385592
11030C85592k086M4968J99866J7572J0787P2674k5945N1637L1719n4334j51020
$$ 385592 383506 428474 628340 645912 656699 729373 703428 755065 786784 732450 581430
11019E81430M0632J28869j6236k5503o6487j24596j1252K3956M1629P8203j25024
$$ 581430 622062 750931 734695 709192 642705 518109 506857 530813 572442 650645 525621
11008E25621j31916J0499J7278Q66j27373n3431k7583M095K3271R0754J3020p4638
$$ 525621 393705 404204 421482 422348 294975 241544 213961 218056 241327 332081 345101 270463
10996B70463J0284M5729m0404l8347k6309j68323l7055K7479o8555M6751j2142
$$ 270463 280747 326476 286072 247725 221416 53093 16038 43517 -25038 21713 9571
10985I571l8028k2153L4580k1328K5729J24482N4861o7036p7361j20077j00567
$$ 9571 -28457 -50610 -16030 -37358 -11629 112853 167714 100678 23317 -96760 -197327
10974a97327l9578L2713N008l4992J30243L9350Q9062K7877r7460j04857J11177
$$ -197327 -236905 -204192 -199184 -234176 -103933 -64583 24479 52356 -45104 -149961 -38784
10963c8784n320M3925L3956P8119N4178p9728N3426K2631j37739j5580K3446J4368
$$ -38784 -44104 -179 33777 111896 166074 86346 139772 162403 24664 9084 32530 46898
10951D6898j10508K6233r085l0084M2343P018q6581l5953J13552J15953m3207
$$ 46898 -63610 -37377 -46462 -76546 -34203 -27185 -113766 -149719 -36167 79786 36579
10940C6579q999n3453j08198K9728O3258r9314o745L8897k8443L29J7323L5276
$$ 36579 27580 -25873 -134071 -104343 -41085 -140399 -147144 -108247 -136690 -136361 -119038 -83762
10928h3762J26011J9747k0868q2565n0298O4394k3662L599n5044j6102M6748J3560
$$ -83762 42249 61996 41128 -41437 -91735 -27341 -51003 -47404 -102448 -118550 -71802 -58242
10916e8242l898N8351O0999n9843j3618q7611K9465J47911q023j32264m5718O7274
$$ -58242 -62140 -3789 57210 -2633 -16251 -103862 -74397 73514 65491 -66773 -112491 -45217
10904d5217n900k7633J68952j9576q5847j7848M4017L3205p2914n0734p1406L7530
$$ -45217 -51117 -78750 90202 70626 -15221 -33069 10948 44153 -28761 -79495 -150901 -113371
10892a13371K11592N6759r5917q9394q440K549J10411n565r4515j20792K2782
$$ -113371 98221 154980 59063 -30331 -38771 -36222 74189 68624 -25891 -146683 -123901
10881a23901j1723M9360J2509J03362n887l5134m9205r6237J05665P8465k6104
$$ -123901 -135624 -86264 -73755 29607 23720 -11414 -60619 -156856 -51191 27274 1170
10870A170l5233K9870j7762j1626k0182j11339K2508L6671M5268J7682m4643j7174
$$ 1170 -34063 -4193 -21955 -33581 -53763 -165102 -142594 -105923 -60655 -42973 -87616 -104790
10858a04790J84239k4629l6420M655P4303N1321J1227r4915Q065K0012j0049m5072
$$ -104790 79449 54820 18400 23055 97358 148679 159906 64991 73056 93068 83019 37947
10846C7947P727q4779n9650N7896Q0970O0585L3020o6706q8013j50054P6812K9043
$$ 37947 45674 -39105 -98755 -40859 40111 100696 133716 67010 -21003 -171057 -94245 -65202
10834f5202P040J9441j96812J69Q5796K4053K5967Q6660o400L0751O6945m3722
$$ -65202 -58162 -38721 -235533 -235364 -149568 -125515 -99548 -12888 -19288 11463 78408 34686
10822C4686l096P3374j09798K1021R053j1169j30094n0726P42Q0466R1437L3121
$$ 34686 31590 104964 -4834 16187 25240 14071 -116023 -166749 -166007 -85541 5896 39017
10810C9017n8366Q816L9832J09500K5197n0356p2248o5358n1761j28406j488l3421
$$ 39017 -19349 -10533 29299 138799 163996 113640 41392 -23966 -75727 -204133 -205621 -239042
10798b39042m5925O5547J22517P6575n7161m7501J08228o5438R8445Q3699k9605
$$ -239042 -284967 -219420 -96903 -20328 -77489 -124990 -16762 -82200 16245 99944 70339
10787G0339n045M307q0850O5972N3107q550o9957M6380J13512m5188j10175m3690
$$ 70339 65294 69601 -11249 54723 107830 99280 29323 75703 189215 144027 33852 -9838
10775i838J01016j1322j00308j951J05731p1153l6883J69837M9594j31438j00663
$$ -9838 91178 79856 -20452 -22403 83328 12175 -24708 145129 194723 63285 -37378
10764c7378N807j37594M2085J3073o782J7637N7669K3164k2878O6222P9827J332
$$ -37378 -31571 -169165 -127080 -114007 -120789 -103152 -45483 -22319 -45197 21025 100852 102184
10752A02184n5185J01109l927j27360M4984O0242P9217l1767q3896j31367n8892
$$ 102184 46999 148108 144181 16821 61805 122047 201264 169497 85601 -45766 -104658
10741a04658N8752K0925L4059n4277M7931M0030M3793J02651m0052r6450k6674
$$ -104658 -45906 -24981 9078 -45199 2732 42762 86555 189206 149154 52704 26030
10730B6030l5515R3950Q2978l412o5898P4603M3460M1132J515r4207R376O2102
$$ 26030 -9485 84465 167443 164031 98133 172736 216196 257328 258843 164636 174012 236114
10718B36114M0162m7900j8998M615l8344q9178q6685J3949O4231j38675p9483
$$ 236114 276276 228376 209378 213993 175649 86471 -214 13735 77966 -60709 -140192
10707a40192N634P5993J34167P6584k02p4791L5347K053r9657j76977L5153J21337
$$ -140192 -134558 -58565 75602 152186 151984 77193 112540 114593 14936 -162041 -126888 -5551
10695e551j8154p1739k2394N9984M4161j8137n7930K1987N9839r4755N2892J9204
$$ -5551 -23705 -95444 -117838 -57854 -13693 -31830 -89760 -67773 -7934 -102689 -49797 -30593
10683c0593r0706J07347n7510l4195P1829L0899J1701J20927M9019r9436n9635
$$ -30593 -121299 -13952 -71462 -105657 -33828 -2929 8772 129699 178718 79282 19647
10672A9647N5194r1683L2356O6803K5696q545j3150J8320o7458N6880L5206J7851
$$ 19647 74841 -16842 15514 82317 108013 99468 86318 104638 37180 94060 129266 147117
10660A47117J7207q4589J6036N4942J68256o3717j17723m0377O1570r36J66244
$$ 147117 164324 79735 95771 150713 318969 255252 137529 97152 158722 157786 324030
10649C24030J31231o8823J144O4168q3764J07138J29591J85585J21219R6834M6694
$$ 324030 455261 386438 387582 451750 367986 475124 604715 790300 911519 1008353 1055047
10638A055047J76632J83345K50732L95908L76783L75959K14998M34323N02975
$$ 1055047 1231679 1415024 1665756 2061664 2438447 2814406 3029404 3463727 3966702
10629C966702P81644R91920J243586J886410K671618L560421M653490N666040
$$ 3966702 4748346 5740266 6983852 8870262 11541880 15102301 19755791 25421831
10621B5421831N950117N466641N011390M512845L637477K292003O81876j28825
$$ 25421831 31371948 36838589 41849979 46362824 50000301 52292304 52974180 52845355
10613E2845355J133828L716821O939428R520634J0232514R231825Q094651P075076
$$ 52845355 53979183 57696004 64635432 74156066 84388580 93620405 101715056 108790132
10605A08790132N041522J189782l368620n461113l481846J522294P019515J0962066
$$ 108790132 113831654 115021436 111652816 106191703 102709857 104232151 111251666 122213732
10597A22213732J1650220R967609Q032197O324096K619985l888427j0847731j4126384
$$ 122213732 133863952 143831561 151863758 158187854 160807839 156919412 146071681 131945297
10589A31945297j1759326o456238p63327K993701L880821L101451K269011J091541
$$ 131945297 120185971 113729733 112966406 115960107 119840928 122942379 125211390 126302931
10581A26302931j611981o099731j0529492j2236054j0237589o566441l428278
$$ 126302931 124690950 118591219 108061727 95825673 85588084 79021643 75593365
10574G5593365j362361m94304m96984j038225j658839k883174m740073o402194
$$ 75593365 74231004 73736700 73239716 72201491 70542652 67659478 62919405 56517211
10566E6517211p124191o346388n114161l932210l092257k266007j838694j529522
$$ 56517211 49393020 43046632 37932471 34000261 30908004 28641997 26803303 25273781
10558B5273781j328271j201605j040559r37636q72926o42561q03723q14610o42441
$$ 25273781 23945510 22743905 21703346 20765710 19892784 19250223 18446500 17631890 16989449
10549A6989449n70718n87486o14552o07428m15617m24472m78130m66159m63927
$$ 16989449 16418731 15831245 15216693 14609265 14193648 13769176 13291046 12824887 12360960
10540A2360960m64666k76913l15981k12347l06014l31364k57948k97924k50892
$$ 12360960 11896294 11619381 11303400 11091053 10785039 10453675 10195727 9897803 9646911
10531I646911k38816l17170l74399k48935j92955p6669j34450k99429j60355j3072
$$ 9646911 9408095 9090925 8716526 8467591 8274636 8197967 8063517 7764088 7603733 7590661
10521G590661j24786k15115k90345k58530k11287j63705l5009j03639j07718j61934
$$ 7590661 7465875 7250760 6960415 6701885 6490598 6326893 6291884 6188245 6080527 5918593
10511E918593j44640j29336p0176j09875j55878m7133n4468j03007j83977k65380
$$ 5918593 5773953 5644617 5574441 5464566 5308688 5261555 5207087 5104080 4920103 4654723
10501D654723j99792p0818j1933K5971n9941j37000j05623k8483j16679j32443
$$ 4654723 4454931 4384113 4372180 4398151 4338210 4201210 4095587 4067104 3950425 3817982
10491C817982n4029j65179k88553j85950n3992O5987n3100o9949j24867p43K8001
$$ 3817982 3763953 3598774 3310221 3124271 3070279 3136266 3083166 3013217 2888350 2887607 2915608
10480B915608N792p5654j03134j36806l3906O9634Q1412o6370j97365j49610q5830
$$ 2915608 2921400 2845746 2742612 2605806 2571900 2641534 2722946 2656576 2459211 2309601 2223771
10469B223771o2764j08312J3664j612K077o2351Q8321J7403M1464m6452r8397
$$ 2223771 2161007 2052695 2066359 2064747 2066824 2004473 2092794 2110197 2151661 2105209 2006812
10458B006812q7344k0529P810q7463o2035R579J9145J1056o3431p4579r3178j21060
$$ 2006812 1919468 1898939 1906749 1819286 1757251 1766830 1785975 1797031 1733600 1659021 1565843 1444783
10446A444783m0821Q1194J50315N514r9651R0861N9972L4366N932k02424n8794
$$ 1444783 1403962 1485156 1635471 1640985 1541334 1632195 1692167 1726533 1732465 1530041 1471247
10435A471247n1850n0674r2975L2928M0152N7773k6638l6197j6941j11825j06176
$$ 1471247 1419397 1368723 1275748 1308676 1348828 1406601 1379963 1343766 1326825 1215000 1108824
10424A108824q2151p9780J20973J770q8296l1990o096q3721l2088j3084p5862
$$ 1108824 1026673 946893 1067866 1069636 981340 949350 943254 859533 827445 814361 738499
10413G38499M22J85320O5393r7266j8426M3862j00307K2842j8219l6131M0627
$$ 738499 738921 924241 989634 892368 873942 917804 817497 840339 822120 785989 826616
10402H26616q2034l2629J0291k9625Q0546j719l5759M6442J8172o2512n9242r0232
$$ 826616 744582 711953 722244 692619 773165 771446 735687 782129 800301 737789 678547 588315
10390E88315j2070m3147M404j3941q6736J47232Q1478k4928R0099Q2299j24648
$$ 588315 576245 533098 537502 523561 436825 584057 665535 640607 730706 813005 688357
10379F88357r2215L3353j3128r7982P23O1976J18794q2435l4085k1095o2614o0590
$$ 688357 596142 629495 616367 518385 519108 581084 699878 617443 583358 562263 499649 439059
10367D39059j0095J56722J6559k7065J43077l7360k1221m4162K8822n9733m6484
$$ 439059 428964 585686 602245 575180 718257 680897 659676 615514 644336 584603 538119
10356E38119O1139o359o7578m7080j03601J16472l0853o4845l2565o8816j708
$$ 538119 599258 592899 525321 478241 374640 491112 460259 395414 362849 294033 292325
10345B92325Q2654j8422R7464o3931J01369J09074j6568j75061l985k3966L5363
$$ 292325 374979 356557 454021 390090 491459 600533 583965 408904 404919 380953 416316
10334D16316J61465O0612R8475K0810q1826j12800n7424M1593k0150n3297m1982
$$ 416316 577781 638393 736868 757678 675852 563052 505628 547221 527071 473774 431792
10323D31792M232J5670m3140n2421M3509p2916r802q7093K4706N8025J50176J04114
$$ 431792 436024 451694 408554 356133 399642 326726 316924 229831 254537 312562 462738 566852
10311E66852L4645q0818l0616N3010O7444n4057J6806R2541P6151K9685R626J81281
$$ 566852 601497 520679 490063 543073 610517 556460 573266 665807 741958 771643 781269 962550
10299I62550J97101K13845K71883M02560L60396J63838K02446J40218k749j19866
$$ 962550 1159651 1373496 1645379 2047939 2408335 2572173 2774619 2914837 2912088 2792222
10289B792222j46853k76229k54339k47736j53896O0823K63100K87477K89745M00547
$$ 2792222 2645369 2369140 2114801 1867065 1713169 1773992 2037092 2324569 2614314 3014861
10279C014861N10874M25695L02881L82400K72168o7054j24249j37328k29049l52682
$$ 3014861 3525735 3951430 4254311 4636711 4908879 4841825 4717576 4580248 4351199 3998517
10269C998517m05687m52371n31694l89190l62328j74419k03637k29722j50885
$$ 3998517 3592830 3140459 2608765 2219575 1857247 1682828 1479191 1249469 1098584
10260A098584j66568j32500k3712l3126m5950K11711Q1721n4002j17282p432J04695
$$ 1098584 932016 799516 775804 742678 696728 908439 990160 936158 818876 811444 916139
10249I16139J993n709n1533J7137o5324j50648J0278j2079J86628R5323o9127
$$ 916139 918132 912423 860890 878027 812703 662055 672333 660254 846882 942205 873078
10238H73078j92220k9484n3358K2812o7900o6402j2210o1220k8540Q8963N7520
$$ 873078 680858 651374 598016 620828 552928 486526 474316 413096 384556 473519 531039
10227E31039Q1339j2287j33333N7378q702k09445N4263Q8971l9725j17765j54530
$$ 531039 612378 600091 466758 524136 515434 305989 360252 449223 409498 291733 137203
10216A37203O7438J24508K9699L8384P6090J3852M2250K4418j63242j45174M8510
$$ 137203 204641 329149 358848 397232 473322 487174 529424 553842 390600 245426 293936
10205B93936J16049Q1882J4181n1487N2379m5229k8329n2680Q294m1317K6606
$$ 293936 409985 491867 506048 454561 506940 461711 433382 380702 388996 347679 374285
10194C74285N2937J07803m1278j25557j52286J5541L039K4640J02701J12177L9833
$$ 374285 427222 535025 493747 368190 215904 231445 234484 259124 361825 474002 513835
10183E13835M5272J69301k9860r0382J0084L5915p9640O7218J16633J86287Q7820
$$ 513835 559107 728408 698548 608166 618250 654165 574525 641743 758376 944663 1032483
10172A032483k2113O7568J6371M8694K7875p6009j49369m7079P9474m117k9592
$$ 1032483 1010370 1077938 1094309 1143003 1170878 1094869 945500 898421 977895 973778 944186
10161I44186J12210J67278l6738q0665O8893J20990j27656J7331K6108n7093m4626
$$ 944186 1056396 1223674 1186936 1106271 1175164 1296154 1168498 1185829 1211937 1154844 1110218
10150A110218R2536R3242P5323R1060R6983J75407Q3485O0400P654n7240r625
$$ 1110218 1202754 1295996 1371319 1462379 1559362 1734769 1818254 1878654 1886308 1829068 1819443
10139A819443j8554r2974r7115j53504k22568k30564l8517o9349r8590p9409j5266
$$ 1819443 1800889 1707915 1610800 1457296 1234728 1004164 965647 896298 797708 718299 703033
10128G03033l259j1801k8953j14025n8895l7323M9308n2832j04914l2232O96n7098
$$ 703033 699774 687973 659020 544995 486100 448777 498085 445253 340339 308107 308803 251705
10116B51705Q802J30994N813n335o4982n0712o1362J9290m3055j22645r0543l4700
$$ 251705 260507 391501 397314 391979 326997 276285 214923 234213 191158 68513 -22030 -56730
10104e6730j4736J33406P8265M5080k2407J25557k4258j04712p0836j56093k570
$$ -56730 -71466 61940 140205 185285 162878 288435 264177 159465 88629 -67464 -70034
10093g0034P1711L4593J42628N9498M9852l1281k3909K2543M7953N7758l1971
$$ -70034 1677 36270 178898 238396 288248 256967 233058 255601 303554 361312 329341
10082C29341o4277m6355K9282j2826P5156R6015m9545N7905m5043K394l1938r236
$$ 329341 265064 218709 247991 235165 310321 406336 356791 414696 369653 372047 340109 330873
10070C30873q07l0989j14222M1870L9907r8879k8325l0269Q7401J71451N5401
$$ 330873 330066 299077 184855 226725 266632 167753 139428 109159 196560 368011 423412
10059D23412R0356P7854J40537J45189N4330j169J39419J16735R102m8684r2487
$$ 423412 513768 591622 732159 877348 931678 930509 1069928 1186663 1195765 1147081 1054594
10048A054594j88891p2211j25219j32782j27044L3867q040m5441n1954m8496M3359
$$ 1054594 865703 793492 668273 535491 408447 442314 434274 388833 336879 288383 331742
10037C31742K7006k075o5971Q2212J27328o102q606J22764J52761J05778J46517
$$ 331742 358748 356673 290702 372914 500242 494140 485534 608298 761059 866837 1013354
10026A013354K58176J95075K6831J59667K71554J54493K24099L87587N29257M67468
$$ 1013354 1271530 1466605 1493436 1653103 1924657 2079150 2303249 2690836 3220093 3687561
10016C687561O10635P89036P38007N25448M31184N32920M25845j42090n10047
$$ 3687561 4298196 5087232 5825239 6350687 6781871 7314791 7740636 7598546 7088499
10007G088499o27679n74934n89093p80097o73746n91446l45056k50181k09679
$$ 7088499 6460820 5885886 5296793 4516696 3842950 3251504 2906448 2656267 2446588
9998B446588j61616j04675j57425r8802j18259k18945n0334j36922j23296j00194
$$ 2446588 2284972 2180297 2022872 1924070 1805811 1586866 1536532 1399610 1276314 1176120
9988A176120M9457N3304n325L4815p226n3460k8777j50236k49940p2317j3176
$$ 1176120 1225577 1278881 1273556 1308371 1301145 1247685 1218908 1068672 818732 746415 733239
9977G33239Q0426K9149l6045N9386m7278j22122j6406j1245N5948k1114p872M3617
$$ 733239 813665 842814 806769 866155 818877 696755 680349 669104 725052 703938 696066 739683
9965G39683j18149p8125j51029n3970J55163k2441m5997J46405J80884J24639
$$ 739683 621534 543409 392380 338410 493573 471132 425135 571540 752424 877063
9955H77063O2387j3931r1277o0521q2714n2662J12072P0829j01281P242J66667
$$ 877063 939450 925519 834242 773721 691007 638345 750417 821246 719965 727207 893874
9944H93874J89117J87722K11588N7979J92790K70947J28423J4751J49764O8646
$$ 893874 1082991 1270713 1482301 1540280 1733070 2004017 2132440 2147191 2296955 2365601
9934B365601J65015J07772k99808j40081k4412O1289J59423K95917K48889K61778
$$ 2365601 2530616 2638388 2338580 2198499 2174087 2235376 2394799 2690716 2939605 3201383
9924C201383K80041K74448K62815O03621O04189P98810R41091J013120J321926
$$ 3201383 3481424 3755872 4018687 4622308 5226497 6025307 6966398 7979518 9301444
9915I301444J585189J733722J788834J949555J997316K087739K172936K500530
$$ 9301444 10886633 12620355 14409189 16358744 18356060 20443799 22616735 25117265
9907B5117265L192181M139041N817453Q479573J2796819J9902003K9999814M0372615
$$ 25117265 28309446 32448487 38265940 46745513 59542332 79444335 109444149 149816764
9899A49816764M6815047M9888470N1979093N3256371M8682421L2394944O405790
$$ 149816764 196631811 246520281 298499374 351755745 400438166 432833110 439238900
9892D39238900j6000000l0258205l8893925m8065757n4239394n3699171m3767717
$$ 439238900 423238900 392980695 354086770 306021013 251781619 198082448 154314731
9885A54314731k9973985j9812348j3361416r280589o663051m973989l818306l205891
$$ 154314731 124340746 104528398 91166982 81886393 75223342 70249353 66431047 63225156
9877F3225156k876118k633033k631834k684658k825880k814874k729661k556698
$$ 63225156 60349038 57716005 55084171 52399513 49573633 46758759 44029098 41472400
9869D1472400k368596k179543j845429j663326j442568j406013j271379j096039
$$ 41472400 39103804 36924261 35078832 33415506 31972938 30566925 29295546 28199507
9861B8199507j099867j071554j162879j076154q84657r03472o99966p00195p86174
$$ 28199507 27099640 26028086 24865207 23789053 22904396 22000924 21300958 20600763 19814589
9852A9814589n26977m93286n67120m68002n85327n61930n90932m22504m82750
$$ 19814589 19287612 18794326 18227206 17759204 17173877 16611947 16021015 15598511 15115761
9843A5115761l96888k68891m33591m51720l90871l86566l30338l61615m36931
$$ 15115761 14718873 14449982 14016391 13564671 13173800 12787234 12456896 12095281 11658350
9834A1658350l67109j97539k56413k81030k69883k61007l20640l90033l08344
$$ 11658350 11291241 11093702 10837289 10556259 10286376 10025369 9704729 9314696 9006352
9825I006352j86971k52499j48003j23958j50416j63100j78092l4517j71107j40944
$$ 9006352 8819381 8566882 8418879 8294921 8144505 7981405 7803313 7768796 7597689 7456745
9815G456745j62547k32408n0601j72758l03052j23560M2810j7868O747m04372
$$ 7456745 7294198 7061790 7011189 6838431 6535379 6411819 6454629 6436761 6443508 6039136
9805F039136l36217k09927j8870l3594r7078j63895m108q2364n3716M60j58876
$$ 6039136 5702919 5492992 5474122 5440528 5343450 5179555 5175447 5093083 5039367 5039827 4880951
9794D880951o7563k00986j89272k96046r0471k6402p6515J0285k8369q1943j49711
$$ 4880951 4813388 4612402 4423130 4127084 4036613 4010211 3933696 3943981 3915612 3833669 3683958
9783C683958p2951p5739j76502N3037o3276k80472k14955r0902k4968k6378r2270
$$ 3683958 3611007 3535268 3358766 3411803 3348527 3068055 2853100 2762198 2737230 2710852 2618582
9772B618582m7089j80398J9993J5428l3352n1952K0730l2779L1439j5054j17976
$$ 2618582 2571493 2391095 2411088 2426516 2393164 2341212 2361942 2329163 2360602 2345548 2227572
9761B227572l9702L9519P3817n2090m2607j23923n4950p9030J6416J09920J10871
$$ 2227572 2187870 2227389 2301206 2249116 2206509 2082586 2027636 1948606 1965022 2074942 2185813
9750B185813j7130K7033o353K890p061k8087k51L8071L4380j41702j23731l3417
$$ 2185813 2168683 2195716 2189363 2192253 2185192 2157105 2156854 2194925 2229305 2087603 1963872 1930455
9738A930455J3952l172m9069j71412l7840p5081r6034J8462k280k982q3865l0178
$$ 1930455 1944407 1941235 1892166 1720754 1682914 1607833 1511799 1530261 1527981 1524999 1441134 1410956
9726A410956P6379L5807M9833m0958j06452k7309J6441P209r9627j25029j19090
$$ 1410956 1487335 1523142 1572975 1532017 1425565 1398256 1414697 1421906 1322279 1197250 1078160
9715A078160j52515P4421k5052j5149M4042k1146j7886m2645j1758l7202L9411
$$ 1078160 925645 1000066 975014 959865 1003907 982761 964875 922230 910472 873270 912681
9704I12681o3463n4800j05223N516J77958K46680R1126j22564j03941n9053n5292
$$ 912681 849218 794418 689195 694711 872669 1119349 1210475 1087911 983970 924917 869625
9693H69625n7581J75341R3327j13718j01545J95983P2266k1116j08687M5970n2851
$$ 869625 812044 987385 1080712 966994 865449 1061432 1133698 1112582 1003895 1049865 997014
9682I97014o5998j28852o3581Q7680R620p9716n0756j11847J02515J12745l1799
$$ 997014 931016 802164 738583 826263 835883 756167 705411 593564 696079 808824 777025
9671G77025q7454r2490q2746J0960L6062m0260L7798N5322K7078k4219M2441N5115
$$ 777025 689571 597081 514335 525295 561357 521097 558895 614217 641295 617076 659517 714632
9659G14632n8406j21228P084q484o4328l3141R5199K40779J19867p3137q0838
$$ 714632 656226 534998 542082 533598 469270 436129 531328 772107 891974 818837 737999
9648G37999k4345N2893P3264r7484l4192j0519o257n4800o9281m5091L8433k0662
$$ 737999 713654 766547 839811 742327 708135 697616 691359 636559 567278 522187 560620 539958
9636E39958J2921N1813j5351p4789Q7081r430n5620k578j1444m564q6669M9868
$$ 539958 552879 604692 589341 514552 601633 592203 536583 534005 522561 517997 431328 481196
9624D81196J58603N1207L7819K5322j39825j75607R739R2176R2253n4677o9593
$$ 481196 639799 691006 728825 754147 614322 438715 448454 540630 632883 578206 508613
9613E08613q849N2729l773J34100O6955k2443K9456j07127l8043O2997k7646L0876
$$ 508613 499764 552493 548720 682820 749775 727332 756788 649661 611618 674615 646969 677845
9601F77845R9715o0760j10607l1919q8817o8215j6389P3486j7122p6947L6764
$$ 677845 777560 716800 606193 574274 485457 417242 400853 474339 457217 380270 417034
9590D17034K8017P5347j72j76468q4486o8166N3353K00885M5502L313J4568l2053
$$ 417034 445051 520398 520226 343758 259272 191106 244459 445344 490846 494159 508727 476674
9578D76674K2235o5136r5376j03026n9449M9735J49426M0475j7265R2224K6076
$$ 476674 498909 433773 338397 235371 175922 225657 375083 415558 398293 490517 516593
9567E16593j02751l3418r4157j78327Q4612R6468n6377j6202J7370n0392M7360
$$ 516593 413842 380424 286267 107940 192552 289020 232643 216441 233811 183419 230779
9556B30779J87800m7180q3481J0499l4090J3317n0394j28396m1841J21993j0107
$$ 230779 418579 371399 287918 298417 264327 277644 227250 98854 57013 179006 168899
9545A68899m4355K4253L7373Q321O31n2673m0142N1362J8347L8068O8654J3759
$$ 168899 124544 148797 186170 194491 195122 142449 102307 153669 172016 210084 278738 292497
9533B92497Q1632k268n0668M1579q934l6015q2266p0653R830J7050J04291P1490
$$ 292497 374129 371861 321193 362772 353838 317823 235557 164904 174734 191784 296075 367565
9521C67565k404K018K5613L1037J37043K7078j03776q7142p4100j17048J67983
$$ 367565 365161 367179 392792 423829 560872 587950 484174 397032 322932 205884 373867
9510C73867J03017r799l0614N6030N2974L0610Q0578p1367Q4351Q6889k1202r7024
$$ 373867 476884 467085 436471 492501 545475 576085 656663 585296 669647 756536 735334 638310
9498F38310K4347K05997K43855K65741K43662K84152K14564J64530J38641j036
$$ 638310 662657 868654 1112509 1378250 1621912 1906064 2120628 2285158 2423799 2422763
9488B422763j6736m5111r6560k55882l82828l94591j89160r0049M743K7701j71954
$$ 2422763 2406027 2360916 2264356 2008474 1625646 1231055 1041895 951846 956589 984290 812336
9477H12336j73156j39083j5646Q0747j40124k7809J9258j1704P2181j29721N396
$$ 812336 639180 500097 484451 565198 425074 397265 416523 404819 477000 347279 352675
9466C52675n3011M5964N8609n3328K3116N1709K2942L3055p2979J0262R432k2696
$$ 352675 299664 345628 404237 350909 374025 425734 448676 481731 408752 419014 428446 405750
9454D05750j6006o6779p5041L3659O1053P43J7600o5034m4045q2147m9332k1901
$$ 405750 389744 322965 247924 281583 342636 343379 360979 295945 251900 169753 120421 98520
9442I8520o340Q1880J2626N7055J60142n0653j3794K5705l1905l4997o8908O9399
$$ 98520 92180 174060 186686 243741 403883 353230 339436 365141 333236 298239 229331 298730
9430B98730R9732J8198p7276l2053k6712q8731j28317k1996J50700J43607M7192
$$ 298730 398462 416660 339384 307331 280619 191888 63571 41575 192275 335882 383074
9419C83074j3513L5796m9529l9987M0472q6622l5193K7634j7974l1814k7792R0608
$$ 383074 369561 405357 355828 315841 356313 269691 234498 262132 244158 212344 184552 275160
9407B75160Q7325m8046n1176r839l1640m9882m8099r3141n2643N2271K8239P7732
$$ 275160 362485 314439 263263 253424 221784 171902 123803 30662 -21981 30290 58529 136261
9395A36261K7060J8137M0438N277R7313j2001m5945m5546p4030k2586j27696m3352
$$ 136261 163321 181458 221896 227173 324486 312485 266540 220994 146964 124378 -3318 -46670
9383d6670j79Q5996R9672J24336j04884j50760o0536N8054O2290n0699j859r772
$$ -46670 -46849 39147 138819 263155 158271 7511 -53025 5029 67319 16620 14761 4989
9371D989J74818J33684j1910j56961q3731N3830j24424m6811O3888o4074p0551
$$ 4989 179807 313491 301581 144620 60889 114719 -9705 -56516 7372 -56702 -127253
9360a27253L8654N4526L392r2497m5121K3869J45859J01931m380m460n1200k062
$$ -127253 -88599 -34073 -30681 -123178 -168299 -144430 1429 103360 98980 94520 43320 41258
9348D1258K13J15020R967l8614l0043j3355L1930k958L9090P4P2467M7350q0836
$$ 41258 41471 156491 166458 127844 97801 84446 116376 113418 152508 152582 225049 272399 191563
9335A91563j04297q4831k0692q791m7090P8256P0300M5765j04290j2510O1936
$$ 191563 87266 2435 -18257 -27048 -74138 4118 74418 120183 15893 3383 65319
9324F5319Q9429P281o2830O8834N3947o6763l9824J7234n8540q7230L4790K4019
$$ 65319 154748 162029 99199 168033 221980 155217 115393 132627 74087 -13143 21647 45666
9312D5666j53264r2043J56636R3557O5204N8448J2873M3521l5282P6823p1859
$$ 45666 -107598 -199641 -43005 50552 115756 174204 187077 230598 195316 272139 200280
9301B00280k23976o3516n5360l0401K2965K2077J91148R9729k238k8793j79487
$$ 200280 -23696 -87212 -142572 -172973 -150008 -127931 63217 162946 160708 131915 -47572
9290d7572P7995P7629J13473l8749j24207j02001J35581M2666k9373o8098q9011
$$ -47572 30423 108052 221525 182776 58569 -43432 92149 134815 105442 37344 -51667
9279e1667J40618J23071l6625o3082L6740Q0658n2789m1664l008o7566k5374J00592
$$ -51667 88951 212022 175397 112315 149055 229713 176924 135260 132252 64686 39312 139904
9267A39904J20777M8743q5258m0764o4880L9902L0687j39064M550Q9663Q1732
$$ 139904 260681 309424 224166 183402 118522 158424 189111 50047 54597 144260 225992
9256B25992k5906q2102J8958J3931n0388m8998q8503l3029M69N704J446K2418
$$ 225992 200086 117984 136942 150873 100485 51487 -37016 -70045 -69576 -63872 -62426 -40008
9244d0008O8480J40494O4775l1197k2896L6677J182l2387J3661L0464n0016k0536
$$ -40008 28472 168966 233741 202544 179648 216325 217507 185120 198781 229245 179229 158693
9232A58693q4260p5715Q307J03496P4556o9629k6444J00439k083l2915J12839
$$ 158693 74433 -1282 7025 110521 185077 115448 89004 189443 187360 154445 267284
9221B67284L8586l9945j9207l8134k7789P179j7243r5545K9073J15444j4110Q292
$$ 267284 305870 265925 246718 208584 180795 187974 170731 75186 104259 219703 205593 213885
9209B13885k5626p6744j46379n8825N65O130L819k3274J21997R2328j9463k2921
$$ 213885 188259 111515 -34864 -93689 -93124 -86994 -83175 -106449 15548 107876 88413 65492
9197F5492P0959m18m8815k0297J7052O4133l1581l4293M0975O290J23341N4937
$$ 65492 136451 136033 87218 66921 83973 148106 116525 82232 123207 129497 252838 307775
9185C07775j84738q4395J4960L3841M6589j1585Q6850N4563M7471m0963P1882
$$ 307775 123037 38642 53602 87443 134032 122447 209297 263860 311331 270368 342250
9174C42250l9638k9478k3051p5243L3721J09550q1279r2909j00047L3323J33510
$$ 342250 302612 273134 250083 174840 208561 318111 236832 143923 43876 77199 210709
9163B10709Q0219r1422p7637n6052R802q1413k4943K4718M483q452R171J07656
$$ 210709 290928 199506 121869 65817 75619 -5794 -30737 -6019 -1536 -9988 -817 106839
9151A06839J65618P7248p7478o8457j2269L0722K7807n3057o6197j3999n8318
$$ 106839 272457 349705 272227 203770 191501 222223 250030 196973 130776 116777 58459
9140E8459j2208k8858j2934J17499J72185L631k2458j13607j00673r8207P6246
$$ 58459 46251 17393 4459 121958 294143 297774 275316 161709 61036 -37171 39075
9129C9075J25474J07903j4535j20080k2487L8639J8044n4992r794K202k2854l3275
$$ 39075 164549 272452 257917 137837 115350 153989 172033 117041 107247 109449 86595 53320
9117E3320J45998n3351q0842O1667j35653m7718O6842R1630M6665N3132l3184
$$ 53320 199318 145967 65125 126792 -8861 -56579 10263 101893 148558 201690 168506
9106A68506j35470o6126M1501Q1428j17798j00584O3482J39941J41701L9248O4217
$$ 168506 33036 -33090 8411 89839 -27959 -128543 -65061 74880 216581 255829 320046
9095C20046k4148j39243L2502P9331K6237m9620L5614p2930q085J2307P119k7634
$$ 320046 295898 156655 189157 268488 294725 245105 280719 207789 199704 212011 219130 191496
9083A91496N3467j09434p6667m6806K1463j8589K7151l413n6964R266P4868j80
$$ 191496 244963 135529 58862 12056 33519 14930 42081 38668 -18296 -9030 65838 65658
9071F5658O4639J8125q6358K1610n7172j03876j5786K8921M787N2632n0008j17437
$$ 65658 130297 148422 62064 83674 26502 -77374 -93160 -64239 -59452 -6820 -56828 -174265
9059a74265O7070O1631M6087j2216m055K3356J06838N3611P7454J6609j072k33261
$$ -174265 -107195 -45564 523 -11693 -15748 7608 114446 168057 245511 262120 261048 27787
9047B7787p0747L7456k9516j09946Q4581K4162J6429Q7900p863k7203Q8366O3390
$$ 27787 -42960 -5504 -35020 -144966 -60385 -36223 -19794 68106 60243 33040 121406 184796
9035A84796j1431Q7993q418j7378k5027k5168M1410j01928j20425M4946Q6463
$$ 184796 173365 261358 252940 235562 210535 185367 226777 124849 4424 49370 135833
9024A35833l9339P8241N6357j46190j11430J4004M076m1784N2582R1366M6058
$$ 135833 96494 174735 231092 84902 -26528 -12524 -8448 -50232 2350 93716 139774
9013A39774M8317J7002j13016n5404o2610m6124O8732O2462q237m0489l4584l5048
$$ 139774 188091 205093 92077 36673 -25937 -72061 -3329 59133 50896 10407 -24177 -59225
9001e9225n8509M1860J04580J46520O9257j13354r5796P4490K3275k4601K7984
$$ -59225 -117734 -75874 28706 175226 244483 131129 35333 109823 133098 108497 136481
8990A36481O475k8132l0622L0329N8556m5183q0146n3415m5606O3418J06010j1398
$$ 136481 142956 114824 84202 114531 173087 127904 47758 -5657 -51263 12155 118165 106767
8978A06767k1128l487K0169Q8346P0999j32259j72717J3250R4113j0813J0732
$$ 106767 85639 82152 102321 190667 261666 129407 -43310 -30060 64053 53240 63972
8967F3972j4097O7010K1808M7497O9274N6316n1350n3171J9842K3130o0807m021
$$ 63972 49875 116885 138693 186190 255464 311780 260430 207259 227101 250231 189424 185403
8955A85403k8809k9698N9637O4196n6753o0409q0461q7832q9143K3570R0909J26673
$$ 185403 156594 126896 186533 250729 193976 133567 53106 -34726 -123869 -100299 -9390 117283
8943A17283n8777o1296m1044o4374Q4788J13343k5953p8783l8199m196J15216
$$ 117283 58506 -2790 -43834 -108208 -23420 89923 63970 -14813 -53012 -57208 58008
8932E8008k8568o4844P987L6785m2550l035J4917Q100m1018L9661P4775P0821
$$ 58008 29440 -35404 -27417 9368 -33182 -36217 -21300 -13200 -54218 -14557 60218 131039
8920A31039p088r891j00904p8340m9623J17544P2958j1710J3958K0366K8908R301
$$ 131039 123951 114060 13156 -65184 -114807 2737 75695 63985 77943 98309 127217 136518
8908A36518m9681J45985O8094j42001m4875O6339j25275k9088M4692L4170J00496
$$ 136518 86837 232822 300916 158915 114040 180379 55104 26016 70708 104878 205374
8897B05374l2506P0508K358j43084q7575k6918J10393M6402r3768O6715N6735
$$ 205374 172868 243376 245734 102650 15075 -11843 98550 144952 51184 117899 174634
8886A74634n1709m3633q4108L1430j04192l8046M2912Q1121J05860l0597q7125
$$ 174634 122925 79292 -4816 26614 -77578 -115624 -72712 8409 114269 83672 -3453
8875c453n8634N554Q2007P2525o275j05593J60080O8961j61704n5488J09707O3102
$$ -3453 -62087 -56533 25474 97999 91724 -13869 146211 215172 53468 -2020 107687 170789
8863A70789O5459L164K834p7376M3743O4778J0206k7667o7322p4044j40081L1114
$$ 170789 236248 239412 242246 164870 208613 273391 283597 255930 188608 114564 -25517 5597
8851E597J1295P8607O6074l1862J4205L1542M7694k7728p6386j8629J505o0632
$$ 5597 16892 95499 161573 129711 143916 175458 223152 195424 119038 100409 101914 41282
8839D1282k3509K9754l819O504K2256r3210q966R8414J20698K9585j02126m9943
$$ 41282 17773 47527 43708 50212 72468 -20742 -29708 68706 189404 218989 116863 66920
8827F6920q840n8716n5941J5923N3957J09633q9081q5730P6360J15877k9918p7631
$$ 66920 58080 -636 -56577 -40654 13303 122936 33855 -51875 24485 140362 110444 32813
8815C2813m1794L3172j520l3638M9390R1274J0872L2535L3604L5431k5085n5295
$$ 32813 -8981 24191 22671 -10967 38423 129697 140569 173104 206708 242139 217054 161759
8803A61759N6686j01490L0565O8557r1149o5550o704K9554n0144J0823l7514l7790
$$ 161759 218445 116955 147520 216077 124928 59378 52674 82228 32084 42907 5393 -32397
8791c2397L8095O3313n8551K160q9989l9568L9000O6951P9458J13144j4957j7608
$$ -32397 5698 69011 10460 12620 -77369 -116937 -77937 -10986 68472 181616 166659 149051
8779A49051O448M0003L7850r0170k1463K4183N4257o6612k05738r6753J75455
$$ 149051 155499 195502 233352 143182 121719 145902 200159 133547 -72191 -168944 6511
8768F511Q5375K0871q0595r4482k2706J18227O01l3759J08911M7867l2081p2937
$$ 6511 91886 112757 32162 -62320 -85026 33201 33802 43 108954 156821 124740 51803
8756E1803M39j58390j38519J67524J64152l268L7092n1397n288L525J9143q6471
$$ 51803 52242 -106148 -244667 -77143 87009 83741 120833 69436 64148 67673 86816 345
8744C45k5405P8218K7340K4801n6981L4805N3360m5454q8216J12135J40621M595
$$ 345 -25060 53158 80498 105299 48318 83123 136483 91029 2813 114948 255569 260164
8732B60164j53850o056L2743p447m8963M1670K2684m4660m4961o6587r320K3195
$$ 260164 106314 100258 133001 125554 76591 118261 140945 96285 51324 -15263 -24583 -1388
8720a388j2936l1960J19431J49212n5639m7547K6391O1611O103q0971q1188J3097
$$ -1388 -14324 -46284 73147 222359 166720 119173 145564 207175 213278 132307 51119 64216
8708F4216L9466J35902K0909p6423l2977o0504m6265j41526o3526J80355M1012
$$ 64216 103682 239584 260493 184070 151093 90589 44324 -97202 -160728 19627 60639
8697F0639p9766Q1159n2456L9596j9110n0595J2890M9437l5239q5167o731N7044
$$ 60639 -19127 62032 9576 49172 30062 -20533 -7643 41794 6555 -78612 -85343 -28299
8685b8299O46Q6442j20656J3537J06136J06739o8335k7907l8716l4134J39199
$$ -28299 -27653 58789 -61867 -48330 57806 164545 96210 68303 29587 -4547 134652
8674A34652n225J0724J64869n4231q6756P346M0592Q6917k05171j79352l4340
$$ 134652 129427 140151 305020 250789 164033 171379 211971 298888 93717 -85635 -119975
8663a19975J28437L7739Q2472o1284p3265K8296k8455o4163j21617L5739J03932
$$ -119975 8462 46201 128673 67389 -5876 22420 -6035 -70198 -191815 -156076 -52144
8652e2144l1593K2819M4332L1761J66262o7345j05529k2550l2898N3900R0928
$$ -52144 -83737 -60918 -16586 15175 181437 114092 8563 -13987 -46885 7015 97943
8641I7943J9834M5533j46047o0368r236R7865O1911n3095L2759J7010l7914n3834
$$ 97943 117777 163310 17263 -43105 -52341 45524 107435 54340 87099 104109 66195 12361
8629A2361l4690J49867Q8557L501N756n8739k0137R1628n0974j61981j3642J06603
$$ 12361 -22329 127538 216095 219596 225352 166613 146476 238104 187130 25149 11507 118110
8617A18110J00537r280k09773Q0112k3202J6646k8029L108j7671N5959M7517J48705
$$ 118110 218647 209367 -406 79706 56504 73150 45121 48229 30558 86517 134034 282739
8605B82739j8635j09528R9086R1427j01376p6589r637q917J31001O5533q4455
$$ 282739 264104 154576 253662 345089 243713 167124 157487 148570 279571 345104 260649
8594B60649l2064J2903O5229L7292Q6810N9413m2847k2598n9733o1878r8542r7806
$$ 260649 228585 241488 306717 344009 430819 490232 447385 424787 365054 303176 204634 106828
8582A06828J53967O7761J1969Q5812o7602p9705M46m4571k4404O3058j5012j13037
$$ 106828 260795 328556 340525 426337 358735 279030 279476 234905 210501 273559 258547 145510
8570A45510j11233L0539J6008k5756M3225O3369N6777r7543j64986M304Q5327
$$ 145510 34277 64816 80824 55068 98293 161662 218439 120896 -44090 -39786 45541
8559D5541k4793k6369N1269J8851J8020j3838p1448J36143L3493P0506l5335o2625
$$ 45541 20748 -5621 45648 64499 82519 68681 -2767 133376 166869 237375 202040 139415
8547A39415r6714R661l9768l0147J6770Q4745K3891m5068O839M6970o3705l2589
$$ 139415 42701 52362 12594 -17553 -783 83962 107853 62785 69624 116594 52889 20300
8535B0300P216j055n1608j14320L1898M9087K1279j0479L2364N6590L6706m0062
$$ 20300 27516 26461 -25147 -139467 -107569 -58482 -37203 -47682 -15318 41272 77978 37916
8523C7916M0202J3143n1973q4989J37144J27624K429q5973m9044p9401M8396P1919
$$ 37916 78118 91261 39288 -45701 91443 219067 221496 135523 86479 7078 55474 127393
8511A27393q5063m0175L1410O9917m8185n5012R4066R3573l3688n5525k8034k7957
$$ 127393 42330 2155 33565 103482 55297 285 94351 187924 154236 98711 70677 42720
8499D2720j4755M0012k4060j16826j0116J33334L8713l6469M0300M5330N2181
$$ 42720 27965 67977 43917 -72909 -83025 50309 89022 52553 92853 138183 190364
8488A90364m5613n8162K5711k1880j28836K7783O3204k4206j0968r5932o4948
$$ 190364 144751 86589 112300 90420 -38416 -10633 52571 28365 17397 -78535 -143483
8477a43483j9659J58391O2135o4619j1378j8046K6133K0550J32647r429m4003
$$ -143483 -163142 -4751 57384 -7235 -18613 -36659 -10526 10024 142671 133242 89239
8466H9239n1655P4799P126m5461k3236j0937j09008K4989J69185L2206n3946m6783
$$ 89239 37584 112383 119509 74048 50812 39875 -69133 -44144 125041 157247 103301 56518
8454E6518M5723K0029p7922J24879J92959L9958n7199k4148L8490m1947n5439
$$ 56518 102241 122270 44348 169227 362186 402144 344945 320797 359287 317340 261901
8443B61901l100M2817m4958j17424j12362j28743k8798R1638O5006j1640n10J27225
$$ 261901 258801 301618 256660 139236 26874 -101869 -130667 -39029 25977 14337 13827 141052
8431A41052p1491M3430o1021K7415k1774n9812N0575M19k7118K4666L7725l3174
$$ 141052 69561 112991 51970 79385 57611 -2201 48374 48793 21675 46341 84066 50892
8419E0892m0154j4735J63287K9854J9789o7309j35650j08393j20264p5155J92756
$$ 50892 10738 -3997 159290 189144 208933 141624 5974 -102419 -222683 -297838 -105082
8408a05082J11949p654j41110J35863J43480l2330o2356R4782L8151P8181m4905
$$ -105082 6867 -787 -141897 -6034 137446 105116 42760 137542 175693 253874 208969
8397B08969j13650n5848J8196O2028j21618k2687j9287J5322P1893l8292P508
$$ 208969 95319 39471 57667 119695 -1923 -24610 -43897 -28575 43318 5026 12534
8386A2534j40856O1969J52620J36888k8527m180Q1453j32770j07903J2046J13855
$$ 12534 -128322 -66353 86267 223155 194628 190448 271901 139131 31228 43274 157129
8375A57129q4976J9679o2401r1000j1289j3219p3125J14123J21921J04192L9357
$$ 157129 72153 91832 29431 -61569 -72858 -86077 -159202 -45079 76842 181034 220391
8364B20391r0728r0689j19430r752P8018J7680O5240p4712J8500L6665m258m2034
$$ 220391 129663 38974 -80456 -90208 -12190 5490 70730 -3982 14518 51183 46925 4891
8352D891j07070N2702J39943o1972J04532J25706L3622k1283j45777o6424O012
$$ 4891 -102179 -49477 90466 28494 133026 258732 292354 271071 125294 58870 64882
8341F4882N4170n7721r3312n9783m3869k4077M2836J04663J0457K4564N798J47356
$$ 64882 119052 61331 -31981 -91764 -135633 -159710 -116874 -12211 -1754 22810 28608 175964
8329A75964o1429r1201r0232K4141J20567O4088o1624r0687k8331m9407R6729
$$ 175964 114535 23334 -66898 -42757 77810 141898 80274 -10413 -38744 -88151 8578
8318H578m9182m3237l1455L0115k9439l5900M6035J72976n219m4324m8185k8688
$$ 8578 -40604 -83841 -115296 -85181 -114620 -150520 -104485 68491 63272 18948 -29237 -57925
8306e7925n532R2231N4951L9841O7855j6423k7276R4362r3028j78377J2889J94298
$$ -57925 -63457 28774 83725 123566 191421 174998 147722 242084 149056 -29321 -16432 177866
8294A77866L8505q6740L599n5857k6845k8044r016j7588r1623J7261J01617K1720
$$ 177866 216371 129631 133230 77373 50528 22484 13468 -4120 -95743 -78482 23135 44855
8282D4855M1548k02801m7651J75306M8995j12164n0902k4744j32054Q1189Q2370
$$ 44855 86403 -116398 -164049 11257 60252 -51912 -102814 -127558 -259612 -178423 -96053
8271i6053j30878K729L4021R0121Q3150N7614m7031o3275j8051J13845J35309
$$ -96053 -226931 -224202 -190181 -100060 -16910 40704 -6327 -69602 -87653 26192 161501
8260A61501Q107j51363O6184M0909O595m5491o252l5120M1206p6108N572J52232
$$ 161501 169608 18245 84429 125338 131933 86442 80190 45070 86276 10168 15740 167972
8248A67972p7064j37317j9583l9357N3703q0243K5962Q5384Q6997J17370K3256
$$ 167972 90908 -46409 -65992 -105349 -51646 -131889 -105927 -20543 66454 183824 207080
8237B07080j82495n446q1053M7467Q4450K819q8711J62584q1154j23217n3442
$$ 207080 24585 19139 -61914 -14447 70003 72822 -15889 146695 65541 -57676 -111118
8226a11118m515Q3249L9230P0577k8493o1524n7573r7306Q573M2676L909R3370
$$ -111118 -115633 -32384 6846 77423 48930 -12594 -70167 -167473 -158900 -116224 -112315 -18945
8214a8945j18740J0901k2412j9102K9088K6964j641O1461K3261J15012q4234j05211
$$ -18945 -137685 -126784 -149196 -168298 -139210 -112246 -113887 -52426 -29165 85847 1613 -103598
8202a03598l5150K4164J23486K1633K7506J20698J1275n2938m7017p3945k2015
$$ -103598 -138748 -114584 8902 30535 58041 178739 190014 137076 90059 16114 -5901
8191e901P74N0687j18186o3046J9985J29334r151K6180Q259k7858q4914L7864
$$ -5901 -5127 45560 -72626 -135672 -115687 13647 4496 30676 38935 11077 -73837 -35973
8179c5973K7265n4584o1329p2532N3308R9822l1853j42311K1921J07983M0672
$$ -35973 -8708 -63292 -124621 -197153 -143845 -44023 -75876 -218187 -196266 -88283 -47611
8168d7611P7668L5374l2002k1869J4005m9720K0940O0251Q1208J6966q6032j21782
$$ -47611 30057 65431 33429 11560 25565 -24155 -3215 57036 138244 155210 69178 -52604
8156e2604r331M1324o0287k9650k9760m7666m5270r1858Q554J61809J28268N7121
$$ -52604 -61935 -20611 -80898 -110548 -140308 -187974 -233244 -325102 -316548 -154739 -26471 30650
8144C0650O8518N4605l0672m8429K3777j47671l9385L1359j5352N0051j8984J0722
$$ 30650 99168 153773 123101 74672 98449 -49222 -88607 -57248 -72600 -22549 -41533 -30811
8132c0811Q074Q211m1342K5183M3176J02709j7025l3758P0855l5368n0048p9648
$$ -30811 -22737 -14526 -55868 -30685 12491 115200 98175 64417 135272 99904 49856 -29792
8120b9792j8569K3082N7971Q7571o4274M7499P9625K9214L3446j19868j1001J26274
$$ -29792 -48361 -25279 32692 120263 55989 103488 183113 212327 245773 125905 114904 241178
8108B41178k5423p3877r491J01730o7023j34979j30670j01289N6412J46307j0963
$$ 241178 215755 141878 132387 234117 167094 32115 -98555 -199844 -143432 2875 -8088
8097h088r416l2981k7366J43283P6243j07955l6686P2508k3492n7273n9738O54
$$ -8088 -17504 -50485 -77851 65432 141675 33720 -2966 69542 46050 -11223 -70961 -70307
8085g0307p7720J4183P4070P1984q735o3613L8577L1354k4205j52114l7435N9186
$$ -70307 -148027 -133844 -59774 12210 3475 -60138 -21561 9793 -14412 -166526 -203961 -144775
8073a44775M7138j8631J94777J24001m2324j03786j25099k6198p7953N8180m991
$$ -144775 -97637 -116268 78509 202510 160186 56400 -68699 -94897 -172850 -114670 -119661
8062a19661p1185J4896R6016j013O8393J21443J15307k5071j08100j27050m1165
$$ -119661 -190846 -175950 -79934 -80947 -12554 108889 224196 199125 91025 -36025 -77190
8051g7190J04001j5241L0753J7798O606k9044k7322O9797l4642K1308j01797K4302
$$ -77190 26811 11570 42323 60121 66727 37683 10361 80158 45516 66824 -34973 -10671
8039a0671K09050J5559j18858q4994J00608Q0305j55014N6180J04758n2732q5420
$$ -10671 198379 213938 95080 10086 110694 190999 35985 92165 196923 144191 58771
8028E8771p9713R0412l0387r0104n1230j3966P5228L2822J8757k3276q040p9197
$$ 58771 -20942 69470 39083 -51021 -102251 -116217 -40989 -8167 10590 -12686 -20726 -99923
8016i9923K681m0973J03571j16055q634J25205L7825R435Q180Q1480o2039r674
$$ -99923 -97242 -138215 -34644 -150699 -159333 -34128 3697 13132 21312 102792 40753 31079
8004C1079n8693n2897l8576K6826J33885K7446l9135j14307k8973L3791N3770
$$ 31079 -27614 -80511 -119087 -92261 41624 69070 29935 -84372 -113345 -79554 -25784
7993b5784L8251l963J39313o2970k217M1208L890j14337j07934Q6175J66381K9621
$$ -25784 12467 8504 147817 84847 82630 123838 127728 13391 -94543 -8368 158013 187634
7981A87634m9661n4451q334q3946j23700J52025J82321L2740n1319j65493j52210
$$ 187634 137973 83522 75188 -8758 -132458 19567 201888 234628 183309 17816 -134394
7970a34394j4085P572M7295J2817K4319P4629m1952K5896k9231N1015P8505m3341
$$ -134394 -148479 -140907 -93612 -80795 -56476 18153 -23799 2097 -27134 23881 102386 59045
7958E9045J5447M6811k7673m0416M8363K6321j9273q7292q9244J9659J6562J37539
$$ 59045 74492 121303 93630 53214 101577 127898 108625 21333 -67911 -48252 -31690 105849
7946A05849k1063P52L7148J02862r8309j78480L1687l0400j3354L5801o961n1988
$$ 105849 84786 85538 122686 225548 127239 -51241 -19554 -49954 -63308 -27507 -34468 -86456
7934h6456k9279L9874J90299k3956m4484J32300O6310J153p1962J1265M9913l244
$$ -86456 -115735 -75861 114438 90482 45998 178298 244608 245761 173799 185064 234977 231733
7922B31733j68267q4198j2337K7317P1281N6487p7479j53936O509N9252l8178
$$ 231733 63466 -20732 -33069 -5752 65529 122016 44537 -109399 -102890 -43638 -81816
7911h1816J62158K6074J7211k8313M8576K4931m2753j2903M703q217M5742j34961
$$ -81816 80342 106416 123627 95314 143890 168821 126068 113165 117868 109651 155393 20432
7899B0432j02201O1661n7123k0391Q9525J28959J28194n3320j59191j29341N9223
$$ 20432 -81769 -20108 -77231 -97622 -8097 120862 249056 195736 36545 -92796 -33573
7888c3573J02207k8739l2165J24636M3288j7646L5074R6370J0878m7825r3202
$$ -33573 68634 39895 7730 132366 175654 158008 193082 289452 300330 252505 159303
7877A59303k0370K02l3892J09410n9860m4592j1651O4725j28359j00404J56254
$$ 159303 138933 139135 105243 214653 154793 110201 98550 163275 34916 -65488 90766
7866I0766p1728j22067l0090M9865N7091J1682j8298O3704k484L7060J80160m9031
$$ 90766 19038 -103029 -133119 -83254 -26163 -14481 -32779 30925 28441 65501 245661 196630
7854A96630o4914L723J0468o6196l9146j6802o2843l5611J34152J44392o8906
$$ 196630 131716 135439 145907 79711 40565 23763 -39080 -74691 59461 203853 134947
7843A34947n8296r4389r1173r0036P151J17713O1142J6769n4745L8841K5643l7253
$$ 134947 76651 -17738 -108911 -198947 -191796 -74083 -12941 3828 -50917 -12076 13567 -23686
7831b3686K5198P4895m5269K6499q161j8545m7660J29661N3367K011K7491n867
$$ -23686 1512 76407 31138 57637 49476 30931 -16729 112932 166299 168310 195801 189934
7819A89934M4255l0656J672L460k8175j59692p8910L166Q4287J9119L3103N9995
$$ 189934 234189 203533 205205 208665 180490 20798 -58112 -54946 29341 48460 81563 141558
7807A41558N6943l5925J0238r5849j72510J4555J15533N4268L1320j50637r7082
$$ 141558 198501 162576 172814 76965 -95545 -80990 34543 88811 120131 -30506 -127588
7796a27588J054o3911k5193O380j34130j07856J84233O9764n581P4455O5304j8788
$$ -127588 -126534 -190445 -215638 -209258 -343388 -451244 -267011 -197247 -202828 -128373 -63069 -81857
7784h1857K9648o1217p3651J00517L5952N5628Q0681r869r5964o4248L8790K7170
$$ -81857 -52209 -113426 -187077 -86560 -50608 5020 85701 75832 -20132 -84380 -45590 -18420
7772a8420j35631j4954j6524J3567J25385r021N436J04593L9354n008j557N1429
$$ -18420 -154051 -169005 -185529 -171962 -46577 -55598 -50162 54431 93785 88777 87220 138649
7760A38649R4542m0802r9839j19567k5700j9901k121k445J3283J26787J53076
$$ 138649 233191 192389 92550 -27017 -52717 -72618 -74739 -77184 -63901 62886 215962
7749B15962n3399o9566p4603j5782o9112k2086k9683R7382l4061k29979K5719
$$ 215962 162563 92997 18394 2612 -66500 -88586 -118269 -20887 -54948 -284927 -259208
7738b59208Q6014K4038M89p3500J65337N3854L0157o4007o2296k812N171j28138
$$ -259208 -173194 -149156 -148667 -222167 -56830 -2976 27181 -36826 -99122 -101934 -96763 -224901
7726b24901k2572R0181J10391L6551k6664Q4849j7959n0473k0093K3780r9413
$$ -224901 -247473 -157292 -46901 -10350 -37014 47835 29876 -20597 -40690 -16910 -116323
7715a16323q4688Q6617L7504P9378J69177O0364j8544r510j13796j61250j43668
$$ -116323 -201011 -114394 -76890 2488 171665 232029 213485 203975 90179 -71071 -214739
7704b14739k9514O8652O0791J927K2205J63765j72357N9770J45751k0094r7690
$$ -214739 -244253 -175601 -114810 -112883 -90678 73087 -99270 -39500 106251 86157 -11533
7693a1533p4855r3382N9356M8834R695k0372Q5076P7536O36j6829l473l8193O4760
$$ -11533 -86388 -179770 -120414 -71580 -61885 -82257 2819 80355 80991 64162 60689 22496 87256
7680H7256N9491k290L0102o4784M02m3157L6645p8898q1681K9446R0240n8373
$$ 87256 146747 144457 174559 109775 110177 67020 103665 24767 -56914 -27468 62772 4399
7668D399L3534j07642p5300p519O9507j4186j1721N7148q1524J1424J19699L6966
$$ 4399 37933 -69709 -145009 -152528 -83021 -97207 -108928 -51780 -133304 -121880 -2181 34785
7656C4785J4351Q9486M2345O2295k5942m3881k15767j49019K7765M4993n800r8893
$$ 34785 49136 138622 180967 243262 217320 173439 -42328 -191347 -163582 -118589 -124389 -223282
7644b23282p1708J36732J27410J28988r8661j11827o220k1128M2075Q98P9103
$$ -223282 -294990 -158258 -30848 98140 -521 -112348 -118568 -139696 -97621 -96723 -17620
7633a7620Q3179l534j1288j29692o6976N0790J69548k844j7916M5209o815Q4719
$$ -17620 65559 62025 50737 -78955 -145931 -95141 74407 71563 53647 98856 92041 176760
7621A76760q1246q1611j25810m4877K25909J18785n9017p9561M5593j38731q4725
$$ 176760 95514 13903 -111907 -156784 69125 187910 128893 49332 94925 -43806 -128531
7610a28531M870K7532P3345L5682j5873p6906k1795J32730Q6413L131J0933m5223
$$ -128531 -123661 -96129 -22784 12898 -2975 -79881 -101676 31054 117467 120598 131531 86308
7598H6308J3560Q3172N2226o1955j2265k6113m0705m1930n676j33802J37606J12816
$$ 86308 99868 183040 235266 173311 161046 134933 94228 52298 46622 -87180 50426 163242
7586A63242O4558r7586n5945j8102K7864J2593l7297p0034O8640K6950j35684
$$ 163242 227800 130214 74269 56167 84031 96624 59327 -10707 57933 84883 -50801
7575e0801m5965r2109Q8880N8509n0415q4116J09997K31743L7189n132o4712n7698
$$ -50801 -96766 -188875 -99995 -41486 -91901 -176017 -66020 165723 202912 197780 133068 75370
7563G5370j45843r1918R4160J41834R4742j9552M0752o6154j14985j10089L6065
$$ 75370 -70473 -162391 -68231 73603 168345 148793 189545 123391 8406 -101683 -65618
7552f5618N8765J9638j39296M6621L5951j23470l1547M8026K6837J07132P8307
$$ -65618 -6853 12785 -126511 -79890 -43939 -167409 -198956 -150930 -124093 -16961 61346
7541F1346J194K7049m6738r4555K2590n8845M627L844J3528r7726j4561N6628
$$ 61346 62540 89589 42851 -51704 -29114 -87959 -83332 -79488 -65960 -163686 -178247 -121619
7529a21619M8284m8603r0594J19861M7782L5491l5434j85998M8893N0983o5049
$$ -121619 -73335 -121938 -212532 -92671 -44889 -9398 -44832 -230830 -181937 -130954 -196003
7518a96003L5959K2063j10782J23196M060R2404J27448J5677m6142K03220M9997
$$ -196003 -160044 -137981 -248763 -125567 -121507 -29103 98345 114022 67880 271100 321097
7507C21097q821m2726j32708p5346K326Q093p8618l5309l7055k799J79263J1966
$$ 321097 312276 269550 136842 61496 63822 71915 -6703 -42012 -79067 -81866 97397 109363
7495A09363O1065Q2281l5376o7161r111l9358n3003r9417p6787J1073J00344P2769
$$ 109363 170428 252709 217333 150172 141061 101703 48700 -50717 -127504 -116431 -16087 56682
7483E6682J1885L024O1099j2453L9798k0272J26646O5700r0005j20412r7954J2439
$$ 56682 68567 71591 132690 120237 160035 139763 266409 332109 242104 121692 23738 36177
7471C6177m0113R0856J77980n6323m0439l3792q1606j04666P5992M8480J5450
$$ 36177 -3936 86920 264900 208577 168138 134346 52740 -51926 24066 72546 87996
7460H7996m046J23575J7233m7123Q0343o5756m3957k9212q8317o2494R055O5944
$$ 87996 83950 207525 224758 177635 257978 192222 148265 119053 30736 -31758 -22703 43241
7448D3241o3276L2884J05966O297k4752j20693p7595K3006K7297N2169N4086j01213
$$ 43241 -20035 12849 118815 125112 100360 -20333 -97928 -74922 -47625 4544 58630 -42583
7436d2583J4266m1075J6488O0220m1081m4888L8395Q5881q4607p7595j6673l1743
$$ -42583 -28317 -69392 -52904 7316 -33765 -78653 -40258 45623 -38984 -116579 -133252 -164995
7424a64995K4783R8965J15870O6246j88518m6989M7647Q875j13447J7466L9328
$$ -164995 -140212 -41247 74623 140869 -47649 -94638 -46991 -38116 -151563 -134097 -94769
7413i4769l0679q005J67451R0348j65689j64254j8129J22771J43011N0741j0555
$$ -94769 -125448 -133453 33998 124346 -41343 -205597 -223726 -100955 42056 92797 82242
7402H2242N9813k9756l2768n3750J12668p0971j11972l6943J33k9373K37299j8662
$$ 82242 142055 112299 79531 25781 138449 67478 -44494 -81437 -81304 -110677 126622 107960
7390A07960j38392n7273l2676J16643O0247O8295r6809J4826P0876r7769j02435
$$ 107960 -30432 -87705 -120381 -3738 56509 124804 27995 42821 113697 15928 -86507
7379h6507R8367J12394L6723J7124j0374j48340O0741k875n593P9790m5649k6823
$$ -86507 11860 124254 160977 178101 167727 19387 80128 77253 71660 151450 105801 78978
7367G8978m7383k0978l631J8690Q4324p4496j01190j12013r0713K090O4583m187
$$ 78978 31595 10617 6986 25676 110000 35504 -65686 -177699 -268412 -266322 -201739 -205926
7355b05926L786N8614Q1365J06168l1090k9453M5464j1504M8427P873k8129J6220
$$ -205926 -202140 -143526 -62161 44007 12917 -16536 28928 17424 65851 73724 45595 61815
7343F1815P9876K141O2308P200J4750l537j11963j49963j3891J0610l2233K0151
$$ 61815 141691 143832 206140 213340 228090 224553 112590 -37373 -51264 -40654 -72887 -52736
7331e2736q199k8695r3444l2578Q0140L9703l1558n915j09261q7679K2353J19983
$$ -52736 -60935 -89630 -183074 -215652 -135512 -95809 -127367 -133282 -242543 -330222 -307869 -187886
7319a87886R1103Q7991N024j40325o9951K1215J48749R5896l2639k2284r4737
$$ -187886 -96783 -8792 -3768 -144093 -214044 -192829 -44080 51816 19177 -3107 -97844
7308i7844j7059L593j1408L645m9440M7980N5683R5973J3580n1796j49091j12077
$$ -97844 -114903 -111310 -122718 -119073 -168513 -120533 -64850 31123 44703 -7093 -156184 -268261
7296b68261m1423j01410j5280m5892Q0970J70181J49003J95521M2030j00495n5402
$$ -268261 -309684 -411094 -426374 -472266 -391296 -221115 -72112 123409 165439 64944 9542
7285I542p7033N0570J7144k6768o5657p0513n981Q9374N1565O4120L318O9054
$$ 9542 -67491 -16921 223 -26545 -92202 -162715 -168696 -79322 -27757 36363 39681 108735
7273A08735l2223j20822N861j2397k5868r2597O5093J35997j9173M2458j08197
$$ 108735 76512 -44310 -38449 -50846 -76714 -169311 -104218 31779 12606 55064 -53133
7262e3133r1021p7254q1926K3025P0014J9675K0519J1363Q9381n9771r054J67720
$$ -53133 -144154 -221408 -303334 -280309 -210295 -190620 -170101 -158738 -69357 -129128 -138182 29538
7250B9538k2241n2135N5850P4122K2567m9077o7770j0422k288K5656M6542l3398
$$ 29538 7297 -44838 11012 85134 107701 58624 -9146 -19568 -21856 3800 50342 16944
7238A6944j7951J00998O4971l9832k7315o1054j57576p2258J33991P9246M9155
$$ 16944 -1007 99991 164962 125130 97815 36761 -120815 -193073 -59082 20164 69319
7227F9319o224j6152k4636k4872p1041J23848J09601L1567q2221j47176q9075
$$ 69319 63095 46943 22307 -2565 -73606 50242 159843 191410 109189 -37987 -127062
7216a27062R0680M5446l9695j1892J36170k3580j1977K5171q2928o7677Q8978
$$ -127062 -36382 9064 -30631 -42523 93647 70067 58090 83261 333 -67344 21634
7205B1634Q1109o4222j26319M5118O7949j6600q314L7625j21101k0294R3327N1507
$$ 21634 102743 38521 -87798 -42680 25269 8669 355 37980 -83121 -103415 -10088 41419
7193D1419r4556m8302n5276j22697j3184P1196Q1588j1897J2548J4758M8876Q8379
$$ 41419 -53137 -101439 -156715 -279412 -292596 -221400 -139812 -151709 -139161 -124403 -75527 12852
7181A2852j17712p0370l8245L2562N4413m8733N6529Q2233j107k1955R2585J40143
$$ 12852 -104860 -175230 -213475 -180913 -126500 -175233 -118704 -36471 -37578 -59533 33052 173195
7169A73195K1610N2518m1903j00887N1329J21917n9264k0489m4495q357N3609
$$ 173195 194805 247323 205420 104533 155862 277779 218515 198026 153531 145174 198783
7158A98783n1845q3214r0078k015M5858J48643L5970j24888j07421L309R6349
$$ 198783 146938 63724 -26354 -28369 17489 166132 202102 77214 -30207 -26898 69451
7147F9451P3460L6080N669o8226j39434l4127K7531J00647n701p5328q6343L3772
$$ 69451 142911 178991 184660 116434 -23000 -57127 -29596 71051 65350 -9978 -96321 -62549
7135f2549j61250J2649P9637N0999J3051p6365r5554K920N0237M7454q8718J905
$$ -62549 -223799 -211150 -131513 -80514 -67463 -143828 -239382 -236462 -186225 -138771 -227489 -225584
7123b25584M1593k0409Q6739l7868l8325O160J59198O6815m9115j675q6447m4809
$$ -225584 -183991 -204400 -117661 -155529 -193854 -187694 -28496 38319 -10796 -12471 -98918 -143727
7111a43727M5405J9598k4429Q2494P0158l0073q2624n92J2426n2184j07808O8501
$$ -143727 -98322 -78724 -103153 -20659 49499 19426 -63198 -63790 -51364 -103548 -211356 -142855
7099a42855R4255k6567P8787J08077P5555j37112q6356M1145P5594j2093j44088
$$ -142855 -48600 -75167 3620 111697 187252 50140 -36216 4929 80523 68430 -75658
7088g5658q5653L8078J46902J21410n0652q4875j85007j14723n2644M2267M6739
$$ -75658 -161311 -123233 23669 145079 94427 9552 -175455 -290178 -342822 -300555 -253816
7077b53816n933R3301N1011N4819Q5573J17778q6142j17929m6416L2293k6294
$$ -253816 -259749 -166448 -115437 -60618 24955 142733 56591 -61338 -107754 -75461 -101755
7066a01755l2333M2964M372J1861N255O8489J5616J5808j55779j45482j0707j5226
$$ -101755 -134088 -91124 -86752 -74891 -69636 -1147 14469 30277 -125502 -270984 -281691 -296917
7054b96917J2875J29121J7438Q0931M6206m3159j23920P0984Q3716J8162l7399
$$ -296917 -284042 -154921 -137483 -56552 -10346 -53505 -177425 -106441 -22725 -4563 -41962
7043d1962K0388n2670R8129J28856j30257k3078j0548K7038L4443n1404l9385
$$ -41962 -21574 -74244 23885 152741 22484 -594 -11142 15896 50339 -1065 -40450
7032d0450J3699j59569k4143J04193j5302k4056M9093K498l1067j9623R1969l8866
$$ -40450 -26751 -186320 -210463 -106270 -121572 -145628 -96535 -94037 -125104 -144727 -52758 -91624
7020i1624l1396J06137J608n0367M0202M2909m0296M6255P2691N8743l5698j11877
$$ -91624 -123020 -16883 -15275 -65642 -25440 17469 -22827 23428 96119 154862 119164 7287
7008G287K4100m5702j63626q7806j3541P9953K7885J53552O909j91275K0133P7928
$$ 7287 31387 -14315 -177941 -265747 -279288 -199335 -171450 -17898 -10989 -202264 -182131 -104203
6996a04203N5149l8312m3252J91242J00340K0824n9663j34850o016l6533J10479
$$ -104203 -49054 -87366 -130618 60624 160964 181788 122125 -12725 -18741 -55274 55205
6985E5205K9716j41039j085J17587M6023p713l2492m3315L6270J779p0467k6308
$$ 55205 84921 -56118 -57203 60384 106407 98694 66202 22887 59157 60936 -9531 -35839
6973c5839j09773j24832k1506N3346J42865O252M6639Q9396K2551n0628o8079
$$ -35839 -145612 -270444 -291950 -238604 -95739 -89487 -42848 46548 69099 18471 -49608
6962d9608j29671O3443J93176J11244j09635n4569o4614j1821j2204J7048j4919
$$ -49608 -179279 -115836 77340 188584 78949 24380 -40234 -52055 -64259 -47211 -62130
6951f2130r3652J1538p4800O6831Q5731R5917j5170L5320l0267k2339q102M7860
$$ -62130 -155782 -144244 -219044 -152213 -66482 29435 14265 49585 19318 -3021 -11123 36737
6939C6737M8354m262M749Q3868m1927k1740o701M4580l2677r8872r6999l647K3298
$$ 36737 85091 80829 85578 169446 127519 105779 99078 143658 110981 12109 -84890 -88537 -65239
6926f5239P0780J25912n1813j17658j17809k6147K1633L9513P748O0166K0827
$$ -65239 5541 131453 79640 -38018 -155827 -181974 -160341 -120828 -113080 -52914 -32087
6915c2087J18092J2049j9984L5248K1607M4957M6360n5158L8640l3582j95034
$$ -32087 86005 98054 78070 113318 134925 179882 226242 171084 209724 176142 -18892
6904a8892j28660J9867J46661J5328o6014l7048j4735K9789o822k671J24385O184
$$ -18892 -147552 -127685 18976 34304 -31710 -68758 -83493 -53704 -60526 -63197 61188 67372
6892F7372j9830l5303M8011l1900j59L0445q5745m3018L8450p6M7543L34L5073
$$ 67372 47542 12239 60250 28350 28191 58636 -27109 -70127 -31677 -31753 15790 16124 51197
6879E1197L9483o2721k1179J43578k1877p6482j05377j21242j32188J3414J58274
$$ 51197 90680 27959 6780 150358 128481 51999 -53378 -174620 -306808 -293394 -135120
6868a35120j3782j0407K4394K10855J40664j5069j40985p3405R9859J1765o6869
$$ -135120 -148902 -159309 -134915 75940 216604 201535 60550 -12855 87004 98769 31900
6857C1900q770P1583L3537o3169L9460L6668j05417j58769l7171M8917Q8848J05301
$$ 31900 23130 94713 128250 65081 104541 141209 35792 -122977 -160148 -111231 -22383 82918
6845H2918P1925J6231L642n9104q9414N055j3345q9230m6775P2747m3346K1579
$$ 82918 154843 171074 174716 115612 26198 31253 17908 -71322 -118097 -45350 -88696 -67117
6833f7117M1800n238O8430L455p137P8573J69629p6179j31772o1454Q5715L068
$$ -67117 -25317 -30555 37875 41330 34193 112766 282395 206216 74444 12990 98705 101773
6821A01773o0868r212J4315L2562J40197N65j15990o1380R3014k1193N2050j6238
$$ 101773 40905 31693 46008 78570 218767 219332 103342 41962 134976 113783 165833 149595
6809A49595M118j3619j18435J6036Q3636P5238p8619o44M6775j26274q5493p7287
$$ 149595 153713 140094 21659 37695 121331 196569 117950 117306 164081 37807 -47686 -124973
6797a24973J0745J40732K314j58271n8555k4286l8737M7915P1213K6399n3870
$$ -124973 -114228 26504 28818 -129453 -188008 -212294 -251031 -203116 -131903 -105504 -159374
6786a59374n9595L0569N6890J90302N4359o1751n9036n004k420q847l3669P2264
$$ -159374 -218969 -188400 -131510 58792 113151 51400 -7636 -12640 -15060 -23907 -57576 14688
6774A4688K8411L8787N6086J5519j16560n9422Q9333R2544n1345j58314j80682
$$ 14688 43099 81886 137972 153491 36931 -22491 66842 159386 108041 -50273 -230955
6763b30955k8122P0532n5195N0539P1761J08021L7754P545q786J06671Q122q4715
$$ -230955 -259077 -188545 -243740 -193201 -121440 -13419 24335 31880 23094 129765 137887 53172
6751E3172j55503L9417N53L7938J55352R4012j19119p339o8686l88j5302o8816
$$ 53172 -102331 -62914 -62361 -24423 130929 224941 105822 98483 29797 29409 14107 -54709
6739e4709p0887Q5055J28924l8042m0769K1004N680J5741Q4831j00309N863J6358
$$ -54709 -125596 -40541 88383 50341 9572 30576 36256 51997 136828 36519 42382 58740
6727E8740L9772K0620J0777n3238N2805j13843n6974N1196K5696k46n566p2610
$$ 58740 98512 119132 129909 76671 129476 15633 -41341 9855 35551 35305 29739 -42871
6715d2871n795P5668P9278J10254l367m6800j10130m9166M6824P2085l0700p6374
$$ -42871 -48666 27002 106280 216534 213167 166367 56237 7071 53895 125980 95280 18906
6703A8906Q124O0562r9486m6562p4235J55J59348k6725Q3096k401m8422l0693
$$ 18906 27030 87592 -11894 -58456 -132691 -132536 26812 87 83183 80782 32360 1667
6691A667p7987l2778K8501P9336j1209n2799l4562K6599O03k4983m2397J0062
$$ 1667 -76320 -109098 -80597 -1261 -12470 -65269 -99831 -73232 -72629 -97612 -140009 -129947
6679a29947O2616P5948N223O5662q3484p2201o9187j7663J47816P1909J4188o1642
$$ -129947 -67331 8617 13840 79502 -3982 -76183 -145370 -163033 -15217 56692 70880 9238
6667I238l8915j2604r7151j10832P9962M5206L2534q5736k6257R3348M7800J14576
$$ 9238 -29677 -42281 -139432 -250264 -170302 -125096 -92562 -178298 -204555 -111207 -63407 51169
6655E1169L0738J5544j46908j10651J21849J32886l9820n9067R2744L4906M67
$$ 51169 81907 97451 -49457 -160108 -38259 94627 54807 -4260 88484 123390 123857
6644A23857j3027p8367j09513r3854j81081j7493L2551N1275L9804Q4553K1072
$$ 123857 110830 32463 -77050 -170904 -351985 -369478 -336927 -285652 -245848 -161295 -140223
6633a40223L7689J05609O039k7602Q277P8923J03243k3233M7222o732n8750K344
$$ -140223 -102534 3075 9114 -18488 -10211 68712 171955 148722 195944 189212 130462 132806
6621A32806K5391R034j26997j38383p2357o8625P9222M2106M7652L379L5695m3899
$$ 132806 158197 167231 40234 -98149 -170506 -239131 -159909 -117803 -70151 -66772 -31077 -74976
6609g4976m5656n9906r8325P4002n0155k1931N7929M3630R2694l2113o7550J54930
$$ -74976 -120632 -180538 -278863 -204861 -255016 -276947 -219018 -175388 -82694 -114807 -182357 -27427
6597b7427K4579n3583k3293j18209l1686K3524J8318J32140J81141j98795q6288
$$ -27427 -2848 -56431 -79724 -197933 -229619 -206095 -187777 -55637 125504 -73291 -159579
6586a59579n978o5333M3163O7186n8627j5726J44759M3131j44803n1036R8664
$$ -159579 -165557 -230890 -187727 -120541 -179168 -194894 -50135 -7004 -151807 -202843 -104179
6575a04179l9829k0296M8247m6649P3953J09939O3150O7565j8798k2140r0395
$$ -104179 -144008 -164304 -116057 -162706 -88753 21186 84336 151901 133103 110963 20568
6564B0568M7408K5705K5477l3447m7383n5562r8527O7392k0705O4571O0381k8517
$$ 20568 67976 93681 119158 85711 38328 -17234 -115761 -48369 -69074 -4503 55878 27361
6552B7361n2656R767n6342J15633o757l444M5948n6031j06725J3176J7680L8961
$$ 27361 -25295 -15528 -71870 43763 37006 33562 79510 23479 -83246 -70070 -52390 -13429
6540a3429J09184l2499o610q9395k3635k6907O3093N5200Q5731K3230q3230q8047
$$ -13429 95755 63256 56646 -32749 -56384 -83291 -20198 35002 120733 143963 60733 -27314
6528b7314l369J1337j8858N442m9849R62P6218J05568R6432L3954o7286k12329
$$ -27314 -30683 -19346 -38204 -32762 -82611 -81649 -5431 100137 196569 230523 163237 -49092
6516d9092m2268P5405k2650R1991N0880p1611q098k0958p2898p3793L4973K3474
$$ -49092 -91360 -15955 -38605 53386 104266 32655 24557 3599 -69299 -143092 -108119 -84645
6504h4645n5345K5897O288j3067N0234N6194L463j2557j1776p2538l5678r4774
$$ -84645 -139990 -114093 -107805 -120872 -70638 -14444 -10981 -23538 -35314 -107852 -143530 -238304
6492b38304N8452J39174m1466o5350P726K2741M1607J06118O9274J5181m8551
$$ -238304 -179852 -40678 -82144 -147494 -139768 -117027 -75420 30698 99972 115153 66602
6481F6602o8564M6746O9570L419k0755n3557K809n4271l9435P8956J20799L5686
$$ 66602 -1962 44784 114354 117773 97018 43461 46270 -8001 -47436 31520 152319 188005
6469A88005R117l4355p869q9811n6542J4637j3097j08868J3570j499q4893m640
$$ 188005 197122 162767 154898 65087 8545 23182 10085 -98783 -85213 -86712 -171605 -176245
6457a76245L7389n1703o1244K7152J42622Q8057J4556j15755q1478M319l5318
$$ -176245 -138856 -190559 -251803 -224651 -82029 6028 20584 -95171 -176649 -172330 -207648
6446b07648j20221P4586J04725K3153j9213p1416N488J15173l0591J5147J26444
$$ -207648 -327869 -253283 -148558 -125405 -144618 -216034 -210546 -95373 -125964 -110817 15627
6435A5627o354k4464j05019j02381o7966M1216J02646r4151M5057j8596q9457
$$ 15627 9273 -15191 -120210 -222591 -290557 -249341 -146695 -240846 -195789 -214385 -303842
6424c03842N0210J36745m4071O3568J9997M7062l1319o7488r1004R2829J15868
$$ -303842 -253632 -116887 -160958 -97390 -77393 -30331 -61650 -129138 -220142 -127313 -11445
6413a1445q3893j03250j22572J7791J09230L8482M8386Q1081L4740j6804Q2099
$$ -11445 -95338 -198588 -321160 -303369 -194139 -155657 -107271 -26190 8550 -8254 73845
6402G3845j26713o4587m2986R4446J058o1692L9291j5764j3883K2296J5048K0183
$$ 73845 -52868 -117455 -160441 -65995 -64937 -126629 -87338 -103102 -116985 -94689 -79641 -59458
6390e9458m7976M4568k7098r791L3846l3217l4973l9093R971J75092O1529K9364
$$ -59458 -107434 -62866 -89964 -99755 -65909 -99126 -134099 -173192 -163221 11871 73400 102764
6378A02764j12260L4925K1665m8867J4672M3320N0973K2034L0709n5999j08092
$$ 102764 -9496 25429 47094 -1773 12899 56219 107192 129226 159935 103936 -4156
6367d156j01359j2283Q23k7443P5492P1488K6515m6853r2564k1393J02679K5400
$$ -4156 -105515 -117798 -116975 -144418 -68926 2562 29077 -17776 -110340 -131733 -29054 -3654
6355c654M152j12796Q776J02837O3353l1826R2991O9846m5791q756r0574p0061
$$ -3654 498 -112298 -103522 -685 62668 30842 123833 193679 147888 139132 48558 -21503
6343b1503N7307L7877j58612k4111k6082j3254O0866J08795O4106N8320n7482
$$ -21503 35804 73681 -84931 -109042 -135124 -148378 -87512 21283 85389 143709 86227
6332H6227j6744L2610j3133j6064k2566j3934q917o8016J42839L2827j10823L4001
$$ 86227 69483 102093 88960 72896 50330 36396 27479 -40537 102302 135129 24306 58307
6320E8307k6805o9081J3439N0631l3591J28913J2586j61410L0141l3925O7528
$$ 58307 31502 -37579 -24140 26491 -7100 121813 134399 -27011 3130 -30795 36733
6309C6733l4594J1402j20791k4441M6508K9884L4286Q4454j72976k8534Q6850
$$ 36733 2139 13541 -107250 -131691 -85183 -55299 -21013 63441 -109535 -138069 -51219
6298e1219K1481R0613N3408j30838l7864j25766J1551P0150M5942N5040P8185
$$ -51219 -29738 60875 114283 -16555 -54419 -180185 -168634 -98484 -52542 2498 80683
6287H0683Q6096j09945p2474Q20K0177K6259j00304j10812L7152j9570r6603l853
$$ 80683 166779 56834 -15640 -14820 5357 31616 -68688 -179500 -142348 -161918 -258521 -262374
6275b62374J17841Q4250r4234q5514k5993l9074P6670K20870K03815q115p035
$$ -262374 -144533 -60283 -154517 -240031 -266024 -305098 -228428 -7558 196257 188142 181107
6264A81107n6695p760j040N9653j08123o9694j007M1874k6125j12058M8853j904
$$ 181107 124412 116652 115612 175265 67142 -2552 -3559 38315 12190 -99868 -51015 -52919
6252e2919R3174M4284n893P2599o2226j73658n8409n8376K7543K3034N3366j926
$$ -52919 40255 84539 78646 151245 89019 -84639 -143048 -201424 -173881 -150847 -97481 -99407
6240i9407p918L9884p1095n7014J32664Q6289l9608O3294o7812J3223m2351K7217
$$ -99407 -107325 -67441 -138536 -195550 -62886 23403 -16205 47089 -20723 -7500 -49851 -22634
6228b2634O0862n457j5757M8585R9361l6508k07786j31051m0783J12527j61L70
$$ -22634 38228 32771 17014 65599 164960 128452 -79334 -210385 -251168 -138641 -138802 -138432
6216a38432q408J57003J09336j09474j4057j16503r2414L109J21576J33386M005
$$ -138432 -146840 10163 119499 10025 -4032 -120535 -212949 -209840 -88264 45122 49127
6205D9127k2480k4310q4827N3854J39047l3784j44436q1949L7446J44220J08585
$$ 49127 26647 2337 -82490 -28636 110411 76627 -67809 -149758 -112312 31908 140493
6194A40493M3588n8180q1432o7941j1885m553O6685K9699q811l9133Q824L7262
$$ 140493 184081 125901 44469 -23472 -35357 -39910 26775 56474 47663 8530 17354 54616
6182E4616J4903k943p3978j21387j2347J03554M8371o2228J3577M4479q9579n6147
$$ 54616 69519 66576 -7402 -128789 -141136 -37582 10789 -51439 -37862 6617 -82962 -139109
6170a39109J01485O2790m2919j10671k5193O3892J44043J3824n9023J6363M6523
$$ -139109 -37624 25166 -17753 -128424 -153617 -89725 54318 68142 9119 25482 72005
6159G2005l345l0455j3331N660k3717J15096n8661j17486K8139j3103o586o4078
$$ 72005 68660 38205 24874 30534 6817 121913 63252 -54234 -26095 -39198 -45784 -109862
6147a09862K4240R7723k19144J1743R8289N3050n4046q902P2236L4105J00352
$$ -109862 -85622 12101 -207043 -195300 -97011 -43961 -98007 -106909 -34673 -568 99784
6136I9784N7373r3961j09198k7967n721Q4830m3924Q5473J07632o8494O731m7751
$$ 99784 157157 63196 -46002 -73969 -79690 5140 -38784 46689 154321 85827 92558 44807
6124D4807k7408q297R6529M6835o0202o5734j6150J24191l2077p9304m0251N6415
$$ 44807 17399 9102 105631 152466 92264 26530 10380 134571 102494 23190 -17061 39354
6112C9354J07419j09833l9202L1782M3770M2728m2757J58675J08684j24485p5156
$$ 39354 146773 36940 -2262 29520 73290 116018 73261 231936 340620 216135 140979
6101A40979j6734m1553j41015K4879Q3253N6769m2114R6136l6643p3759o2603
$$ 140979 124245 82692 -58323 -33444 49809 106578 64464 160600 123957 50198 -12405
6090a2405p236o7331k5599L487N597J48895k325j34523k9405m6185K5995J15276
$$ -12405 -19641 -86972 -112571 -109084 -103487 45408 43083 -91440 -120845 -167030 -141035 -25759
6078b5759J73060q5305j42915q5012L0457J09491M5913k1458k5478q2461l1841
$$ -25759 147301 61996 -80919 -165931 -135474 -25983 19930 -1528 -27006 -109467 -141308
6067a41308M9209P5775J28494R310q0060P749L5694o4473o8228j37182J0335M9978
$$ -141308 -92099 -16324 112170 121480 41420 49169 84863 20390 -47838 -185020 -174685 -124707
6055a24707J1086q1948K0662R2687J16912M7046o6683J7822j7777j16616J1831
$$ -124707 -113621 -195569 -174907 -82220 34692 81738 15055 32877 15100 -101516 -89685
6044h9685J30441R4367p0845o2090P4506k7118j25553j24284P2716J24978J76364
$$ -89685 40756 135123 64278 2188 76694 49576 -75977 -200261 -127545 -2567 173797
6033A73797L368m4800J4457o2240J7271l3395p7379r1903P034J37447r3802J9826
$$ 173797 177165 132365 146822 84582 101853 68458 -8921 -100824 -93790 43657 -50145 -30319
6021c0319M3127L5971p4942J1842O899k5472P7639J5698j48770k0320N5867O4053
$$ -30319 12808 48779 -26163 -14321 -7422 -32894 44745 60443 -88327 -108647 -52780 11273
6009A1273K2342K7104m2075q1133n8863J46185R1467m4768j08662o7951j0572
$$ 11273 33615 60719 18644 -62489 -121352 24833 116300 71532 -37130 -105081 -115653
5998a15653N447n474P7313K7320j41820q0750L632K4761J46698J08980L4q0300
$$ -115653 -110206 -115680 -38367 -11047 -152867 -233617 -229985 -205224 -58526 50454 50488 -29812
5986b9812n3869k1904O9842P9563l4127o1011m8466P623l6986m7023J14559K7023
$$ -29812 -83681 -105585 -35743 43820 9693 -51318 -99784 -92161 -129147 -176170 -61611 -34588
5974c4588q1707q8339J08995J66974o2970l0607Q940p3440j2484J8455J2656l0594
$$ -34588 -116295 -204634 -95639 71335 8365 -22242 -13302 -86742 -99226 -80771 -68115 -98709
5962i8709J6263j8527j9495r858K0894m2964m2665P6062P8036J00069Q2065m5854
$$ -98709 -82446 -100973 -120468 -130326 -109432 -152396 -195061 -118999 -40963 59106 141171 95317
5950I5317J6466j35650o4808O5481J01605j06143l1226j2123j09650Q9437P1372
$$ 95317 111783 -23867 -88675 -23194 78411 -27732 -58958 -71081 -180731 -91294 -19922
5939a9922j0007l4055J01062m2843j13055k8516q1494n5571J1052M4496K9318
$$ -19922 -29929 -63984 37078 -5765 -118820 -147336 -228830 -284401 -273349 -228853 -199535
5928a99535J23580J81756j12586p9999J3634j2918O6037L7304j09924J430J30832
$$ -199535 -75955 105801 -6785 -86784 -73150 -86068 -20031 17273 -92651 -91221 39611
5917C9611J13119o8660K324L0028L7461N273o2592o3715Q5275L4979m1489j66604
$$ 39611 152730 84070 86394 116422 153883 159156 96564 32849 118124 153103 111614 -54990
5905e4990r6405N5514K5860q117j21850J2895L239K2926J08254M4259r945P8106
$$ -54990 -151395 -95881 -70021 -78138 -199988 -187093 -183854 -160928 -52674 -8415 -18360 59746
5893E9746L8457l7420j03505L3174O9058p1562K6403Q4003q6790j29937m7918
$$ 59746 98203 60783 -42722 -9548 59510 -12052 14351 98354 11564 -118373 -166291
5882a66291l5071p700m11J40514J42420j3346m3051R317n4173J3535k6925p3736
$$ -166291 -201362 -209062 -209473 -68959 73461 60115 17064 26381 -27792 -14257 -41182 -114918
5870a14918o2398J03986J77054L1734j7742n413P576j21052J3078L7484j39279
$$ -114918 -177316 -73330 103724 135458 117716 112303 119879 -1173 11905 49389 -89890
5859h9890q8636K4734M4762R5733m4412j6741N5677P0098J8534o7778j18949m986
$$ -89890 -178526 -153792 -109030 -13297 -57709 -74450 -18773 51325 69859 2081 -116868 -121854
5847a21854M9067J6666j09048m1111J65038J06077O42o377Q3627r8299p3847K7935
$$ -121854 -72787 -56121 -165169 -206280 -41242 64835 65477 59100 142727 44428 -29419 -1484
5835a484J87167j54099M4566k906j40355j24113j6602N9384J47515J92517p3089
$$ -1484 185683 31584 76150 73244 -67111 -191224 -207826 -148442 -927 191590 118501
5824A18501n0852R5259j11353p2251j33419j6877O0245J55781Q2832m6323p1796
$$ 118501 67649 162908 51555 -20696 -154115 -170992 -110747 45034 127866 81543 9747
5813I747k4023M0720O9579R5696p5577j13084j21933L0533q3878J19596o4336
$$ 9747 -14276 26444 96023 191719 116142 3058 -118875 -88342 -172220 -52624 -116960
5802a16960q0971j19603n0784k0515M7996R5479J13698K3159p1377P6609M7134
$$ -116960 -197931 -317534 -368318 -388833 -340837 -245358 -131660 -108501 -179878 -103269 -56135
5791e6135N8305m2642m6699K8290K1760k4842J2135l7309j576j0793l4553J63659
$$ -56135 2170 -40472 -87171 -58881 -37121 -61963 -49828 -87137 -88713 -99506 -134059 29600
5779B9600R312j6149N2011n6353q177m5550K0437O8073O3203J03264o6594j06019
$$ 29600 38912 22763 74774 18421 10244 -35306 -14869 53204 116407 219671 153077 47058
5767D7058m998P3595o2274q5226J2402k4179q5436j0527P6141J40137N4248j04994
$$ 47058 42060 115655 53381 -31845 -19443 -43622 -129058 -139585 -63444 76693 130941 25947
5755B5947p9639K3561R9713M1109r325j3667J417j8352k8213n359n1923J0984
$$ 25947 -53692 -30131 69582 110691 101366 87699 89116 70764 42551 37192 -14731 -3747
5743c747J4715k5336q3050j5633O8145m3282j8581J08811J18078k0888k1022O9157
$$ -3747 10968 -14368 -97418 -113051 -44906 -88188 -106769 2042 120120 99232 78210 147367
5731A47367J24038m377r1855k05078K439j6559n1478j2435r007k3538O2896j05758
$$ 147367 271405 267028 175173 -29905 -27466 -44025 -95503 -107938 -116945 -140483 -77587 -183345
5719a83345R2266P9119J5500j2290N2706n3545j05075J3509n6674J418O159J92774
$$ -183345 -91079 -11960 3540 -8750 43956 -9589 -114664 -101155 -157829 -156411 -150252 42522
5707D2522J26936q4352j26757l4620O3838p8693l0859J4785O2246R3120N6320
$$ 42522 169458 85106 -41651 -76271 -12433 -91126 -121985 -107200 -44954 48166 104486
5696A04486Q4172o8104n4967J26266P8621m4298k5419p4816j79724p4064Q2834
$$ 104486 188658 120554 65587 191853 270474 226176 200757 125941 -53783 -127847 -45013
5685d5013N7253L7063p3296O5057J3737j83365k787N8608N386o1202L5473J2309
$$ -45013 12240 49303 -23993 41064 54801 -128564 -131351 -72743 -67357 -128559 -93086 -80777
5673h0777P2672J08794k7795j46730q5189M5571Q5209O561J8763m5958j13044
$$ -80777 -8105 100689 72894 -73836 -159025 -113454 -28245 -21684 -2921 -48879 -161923
5662a61923n7300K0202J13744J03419o4519j05878N8293M7801k3164N03n0492
$$ -161923 -219223 -199021 -85277 18142 -46377 -152255 -93962 -46161 -69325 -68822 -119314
5651a19314K4090R1584L0691K2011r9404n349N6168P5348P55p2954p8440K4055
$$ -119314 -95224 -3640 27051 49062 -50342 -55691 477 75825 76580 3626 -74814 -50759
5639e0759M6018J24020n5912j15087q0538J17426J22069j9896n6834o2745j1483
$$ -50759 -4741 119279 63367 -51720 -132258 -14832 107237 87341 30507 -32238 -43721
5628d3721M2630K683m2081O3505Q5853k5619m4720o0603N8361M3740j15448n675
$$ -43721 -1091 1592 -40489 23016 108869 83250 38530 -22073 36288 80028 -35420 -41095
5616d1095k5006L1722q045M9984O9990Q5829K2681j118J0657k9057L8899l8339
$$ -41095 -66101 -34379 -42424 7560 77550 163379 186060 184942 195599 166542 205441 167102
5604A67102j3520j9547L7849m6690l3735j04462K6400O8962l753m1170j1480L5617
$$ 167102 153582 134035 171884 125194 91459 -13003 13397 82359 78606 37436 25956 61573
5592F1573L9585p5084j54597O5903J47227k353l5431k0522l7751K1743M4657L8023
$$ 61573 101158 26074 -128523 -62620 84607 82254 46823 26301 -11450 10293 54950 92973
5580I2973J4477p858N4874q0688j10397j08257l1180Q2607P91Q390r095k1950
$$ 92973 107450 99592 154466 73778 -36619 -144876 -176056 -93449 -92658 -84268 -93363 -115313
5568a15313J7813J40455J10648n8187j69363j16095j5602k1353N6937O2472l1680
$$ -115313 -97500 42955 153603 95416 -73947 -190042 -205644 -226997 -170060 -107588 -139268
5557a39268L487L5054m875K9137m2844j0933Q557P4802K6267K6160O1429l6082
$$ -139268 -135781 -100727 -105602 -76465 -119309 -130242 -121685 -46883 -20616 5544 66973 30891
5545C0891j37629N107l0033k4638j44931l277J44890O1780J5929j6067j53753
$$ 30891 -106738 -101631 -131664 -156302 -301233 -304510 -159620 -97840 -81911 -97978 -251731
5534b51731R2593M5538o2561N8503l065L5349J03508P7642Q398m3688R031o2278
$$ -251731 -159138 -113600 -176161 -117658 -120723 -85374 18134 95776 104174 60486 69517 7239
5522G239j24711K0699j0136l7606j6610m0886k4289P3006J20507J7446N031j9179
$$ 7239 -117472 -96773 -106909 -144515 -161125 -202011 -226300 -153294 -32787 -15341 -10310 -29489
5510b9489n6306j609m3964Q231j6083j9756Q5717J15590o2531k22526q987M4801
$$ -29489 -85795 -87404 -131368 -123137 -139220 -158976 -73259 42331 -20200 -242726 -251713 -206912
5498b06912J01383J82468P4643N2352j39397l4205L4163O4967L9081Q1047m1641
$$ -206912 -105529 76939 151582 203934 64537 30332 64495 129462 168543 249590 207949
5487B07949j09193r4687k6924q9109j50041J04613R1429O3898J54127o6576l9626
$$ 207949 98756 4069 -22855 -111964 -262005 -157392 -65963 -2065 152062 85486 45860
5476D5860J16600M5604L8288J0180q674l7896j47268j38830k045l0501M4316M0784
$$ 45860 162460 208064 246352 256532 247858 209962 62694 -76136 -78181 -108682 -64366 -23582
5464b3582p0806L6200m5975P8689J38938q5694r3081r1770k0201Q1161n3096q436
$$ -23582 -94388 -58188 -104163 -25474 113464 27770 -65311 -157081 -177282 -96121 -149217 -157653
5452a57653J10741M5231l8154o569n0661J9736P9155J45158J0169k06337n157
$$ -157653 -46912 -1681 -39835 -46404 -97065 -77329 1826 146984 157153 -49184 -54341
5441e4341k7786m7223J28127L5632M2199k5562J0536j05639l7497o360M2641J01118
$$ -54341 -82127 -129350 -1223 34409 76608 51046 61582 -44057 -81554 -87914 -45273 55845
5429E5845N6750l2352l4413J0995O8877L29N198q8255o704P8976q7729j60264
$$ 55845 112595 80243 45830 56825 125702 126031 131229 42974 36270 115246 27517 -132747
5417a32747L7834N4708o2079o5k7899r7740j7603P9971K0593j9760J37034Q736
$$ -132747 -94913 -40205 -102284 -102349 -130248 -227988 -245591 -165620 -145027 -164787 -27753 -19017
5405a9017J1736p5913l7412o372J0372K4835k5145j70804J4007p231M1229J28464
$$ -19017 -7281 -83194 -120606 -126978 -116606 -91771 -116916 -287720 -273713 -280944 -239715 -111251
5393a11251J20441K9348m9642l2308J2735o6553N7566J2829q6801j7860J36360
$$ -111251 9190 38538 -11104 -43412 -30677 -97230 -39664 -26835 -113636 -131496 4864
5382D864J19610K2809o7680m1312Q749N0652P8491L3902j13047j09631k1728n2331
$$ 4864 124474 147283 79603 38291 47040 97692 176183 210085 97038 -12593 -34321 -86652
5370h6652j7716n9156j171J01009J94320J1059l3910j12557r729M8707K177k6842
$$ -86652 -104368 -163524 -164695 -63686 130634 141693 107783 -4774 -14503 34204 36381 9539
5358I539j51089o6796k772k061k5826l46M9258R16J7773J90135M8010q0665J60637
$$ 9539 -141550 -208346 -211118 -213179 -239005 -239351 -190093 -189177 -171404 18731 66741 -13924 146713
5345A46713L550m7986j05756j52530J3219n3445Q1120J46723l5751n9925p8805
$$ 146713 150263 102277 -3479 -156009 -142790 -196235 -115115 31608 -4143 -64068 -142873
5334a42873j00724M4632J21173J58314o7449K1071J9906l5660r8836j5359P5179
$$ -142873 -243597 -198965 -77792 80522 13073 34144 54050 18390 -80446 -95805 -20626
5323b0626p1701r5717P3824K7696M0584R6386K7071k0338r5395P973o824L924
$$ -20626 -92327 -188044 -114220 -86524 -45940 50446 77517 57179 -38216 -30243 -37067 -33143
5311c3143p3421q5742N6354J04821M5197l0128J1755j5501R2429L3893l2256l6646
$$ -33143 -106564 -192306 -135952 -31131 14066 -16062 -4307 -19808 72621 106514 74258 37612
5299C7612j58515P583J6491J81193Q9705j32992j31291o1358m1503J47284p906
$$ 37612 -120903 -113320 -96829 84364 174069 41077 -90214 -151572 -193075 -45791 -53697
5288e3697n1036N2907k6944m7138L7823o3020n2337o637l6399Q5131M8398P8009
$$ -53697 -104733 -51826 -78770 -125908 -88085 -151105 -203442 -210079 -246478 -161347 -112949 -34940
5276c4940N4754j29235j21367n8965q125L8310J25678M6253L1660M9438k3862
$$ -34940 19814 -109421 -230788 -289753 -297878 -259568 -133890 -87637 -55977 -6539 -30401
5265c0401j00673Q5119J00387p9308p5029m0507N6558N3197R2389n119n1046Q5018
$$ -30401 -131074 -45955 54432 -24876 -99905 -140412 -83854 -30657 61732 56613 5567 90585
5253I0585K3161r0120q5895N974Q8290o3098p7173N15n143k5127P3362j6905O3476
$$ 90585 113746 23626 -62269 -56295 31995 -31103 -108276 -107761 -112904 -138031 -64669 -81574 -18098
5240a8098J30577j16765Q898Q2571P684P0159n6336j84970l0982M4269p3213L5290
$$ -18098 112479 -4286 4612 87183 94867 165026 108690 -76280 -107262 -62993 -136206 -100916
5228a00916O5076o5279j8770l3219L6832P5606J492j3424L4048n500l2010j1502
$$ -100916 -35840 -101119 -119889 -153108 -116276 -40670 -39178 -52602 -18554 -24054 -56064 -67566
5216f7566J15993j3235O6761J6231k1890j41218j1918L8366o5635K5858P7290
$$ -67566 48427 35192 101953 118184 96294 -44924 -56842 -18476 -84111 -58253 19037
5205A9037Q0049j23665r750J3093j05479J3636K8296l045p5476l1149L9295L9661
$$ 19037 99086 -24579 -34329 -21236 -126715 -113079 -84783 -87828 -163304 -194453 -155158 -115497
5193a15497p2848j04242J3801M0423O6283j7135J39889K3880P4564P071M7058
$$ -115497 -188345 -292587 -278786 -238363 -172080 -189215 -49326 -25446 49118 56189 103247
5182A03247K9438j06048o3094K9750K7727R4442J9228j3884J43251j10078l5158
$$ 103247 132685 26637 -36457 -6707 21020 115462 134690 120806 264057 153979 118821
5171A18821N8298N1618o9733j19967j32986Q3650r569J6506N0442j3681j39877
$$ 118821 177119 228737 159004 39037 -93949 -10299 -19868 -3362 47080 33399 -106478
5160a06478p1863K3316Q6544l2275l0152m1495j04499m9332n1449Q9220N0933
$$ -106478 -178341 -155025 -68481 -100756 -130908 -172403 -276902 -326234 -377683 -288463 -237530
5149b37530O5067J19379O8225K3201r1432J6040P1978r1325r4566q7234q9082
$$ -237530 -172463 -53084 15141 38342 -53090 -37050 34928 -56397 -150963 -238197 -327279
5138c27279N1898M2276J22146Q2681O593j4904L1865m7482j7768P6595k812p7081
$$ -327279 -275381 -233105 -110959 -28278 -21685 -36589 -4724 -52206 -69974 6621 3809 -73272
5126g3272N7753R2308p0203R9882O6170j3602m1364j69618k8957o1439m680P2071
$$ -73272 -15519 76789 6586 106468 172638 159036 117672 -51946 -80903 -142342 -147022 -74951
5114g4951Q2903k6987l422j7868M2942m6553O6501O116j1937L510M7754N3115
$$ -74951 7952 -19035 -22457 -40325 2617 -43936 22565 28681 16744 20254 68008 121123
5102A21123n0612l5749o4503j03329j56232k4676R761J3170R2099N1489j1887
$$ 121123 70511 34762 -29741 -133070 -289302 -313978 -304217 -291047 -198948 -147459 -159346
5091a59346n6n7058o0017O8973J18431P3978J5986j27419P8464L2920l7112J0188
$$ -159346 -159402 -216460 -276477 -207504 -89073 -15095 891 -126528 -48064 -15144 -52256 -42068
5079d2068M7384k8518p260N103q174p5038p9427O1892N6547k5432M0778R4459
$$ -42068 5316 -23202 -30462 -25359 -33533 -108571 -187998 -126106 -69559 -94991 -54213 40246
5067D0246R6942j08556j74351j09193j30366N5715L1300O0082J64318l4195l3800
$$ 40246 137188 28632 -145719 -254912 -385278 -329563 -298263 -238181 -73863 -108058 -141858
5056a41858j0393o822N3266J60984M3992o9700J5323R3932j983p5180m5647j10297
$$ -141858 -152251 -159073 -105807 55177 99169 29469 44792 138724 136741 61561 15914 -94383
5044i4383j23050o393R9908K8551O5653K6872N2099k6687j14301m9634J48019
$$ -94383 -217433 -223826 -123918 -95367 -29714 -2842 49257 22570 -91731 -141365 6654
5033F654J4062N143n7517q1429j64067R142k2368L3666M2159J18812l486j05882
$$ 6654 20716 25859 -31658 -113087 -277154 -268012 -290380 -256714 -214555 -95743 -99229 -205111
5021b05111L377N5392K7212J02859N9139j1447p4609p356j2289l5160K9250n6197
$$ -205111 -201734 -146342 -119130 -16271 42868 31421 -43188 -50544 -62833 -97993 -68743 -124940
5009a24940N6123J161o0507m5504N1764L7988M9422J90740M6266n5785q6240L804
$$ -124940 -68817 -67656 -128163 -173667 -121903 -83915 -34493 156247 202513 146728 60488 64292
4997F4292j2579P738m8708n1075K5624J2875k2895P6910n8216p3127q9292k2071
$$ 64292 51713 59451 10743 -40332 -14708 -1833 -24728 52182 -6034 -79161 -168453 -190524
4985a90524K4239P0962J16936L7261P19M684K9058m9407M2105l1767n6686q2017
$$ -190524 -166285 -95323 21613 58874 59593 64277 93335 43928 86033 54266 -2420 -84437
4973h4437n2508P6364k2644J9687M9860O6486q8738R1563m4502m4765k8529N4197
$$ -84437 -136945 -60581 -83225 -63538 -13678 52808 -35930 55633 11131 -33634 -62163 -7966
4961g966M6563q0769r5223k227Q3574N3632l1248j9657P7396N7620k4091j0807
$$ -7966 38597 -42172 -137395 -139622 -56048 -2416 -33664 -53321 24075 81695 57604 46797
4949D6797j46162p8232J50319J24843J13486j26918k28290J2927P3026N6994N4462
$$ 46797 -99365 -177597 -27278 97565 211051 84133 -144157 -131230 -58204 -1210 53252
4938E3252l9129m8362J7717o8476o4457n7253O8091Q2986P234O2028o4348q3479
$$ 53252 14123 -34239 -16522 -84998 -149455 -206708 -138617 -55631 -48397 13631 -50717 -134196
4926a34196l2817J62013N0400n6944M2938k6981R7330Q5316J916J4838q335j0620
$$ -134196 -167013 -5000 45400 -11544 31394 4413 101743 187059 188975 203813 195478 184858
4914A84858L726L4817j01453j02364p1257J4022k1661q3585k52K9115j8891K8954
$$ 184858 188584 223401 121948 19584 -51673 -37651 -59312 -142897 -143149 -114034 -132925 -103971
4902a03971P9790p645J6364j3805j00845Q5486J31980l1184J5863K6821q9155
$$ -103971 -24181 -31826 -15462 -29267 -130112 -44626 87354 56170 72033 98854 9699
4891I699j35562L2243N2208J63335J09368j09836r9813N4196J11818m3048j42101
$$ 9699 -125863 -93620 -41412 121923 231291 121455 21642 75838 187656 144608 2507
4880B507K179L6237M9167q717K3073j96100l4820J04009M672m7055k189k1584
$$ 2507 4686 40923 90090 81373 104446 -91654 -126474 -22465 -17793 -64848 -67037 -88621
4868h8621M8780N6676q8124Q1258o2437o100N5670R8499q1370J297M0808k46351
$$ -88621 -39841 16835 -71289 9969 -52468 -58568 -2898 95601 14231 15528 56336 -190015
4856a90015p3892j0511m174J24501O8297k3082K5010M015L2035Q051m9236m1160
$$ -190015 -263907 -274418 -278592 -154091 -85794 -108876 -83866 -79851 -47816 -39765 -89001 -130161
4844a30161J7169P7785N483J83899K6966j45271j27203L3202J96200N6644q3534
$$ -130161 -112992 -35207 -29724 154175 181141 35870 -91333 -58131 138069 194713 111179
4833A11179m0785r4051k00106n8321M7428M8364M5485N4343r6599n9492O9870
$$ 111179 70394 -23657 -223763 -282084 -234656 -186292 -140807 -86464 -183063 -242555 -172685
4822a72685L8213L0433K9375J30223O717n7354j00219j06982N0098J11007P7249
$$ -172685 -134472 -104039 -74664 55559 62276 4922 -95297 -202279 -152181 -41174 36075
4811C6075q0921j43008J2755O5144J60380M5495L8154O5164O859l9049j28117
$$ 36075 -44846 -187854 -175099 -109955 50425 95920 134074 199238 206097 167048 38931
4800C8931j2528j09939L8087J42811p9814o5339J1797J7152o4810J9372p5205
$$ 38931 26403 -83536 -45449 97362 17548 -47791 -35994 -18842 -83652 -64280 -139485
4789a39485L1227M3091N1693P7348K5831q8705j3149O8628j16196J7202P8802
$$ -139485 -108258 -65167 -13474 63874 89705 1000 -12149 56479 -59717 -42515 36287
4778C6287j7374K170q9092j8700L8291N6301j210r1339k1260Q7492L1093k5356
$$ 36287 18913 21083 -68009 -86709 -48418 7883 6673 -84666 -105926 -18434 12659 -12697
4766a2697p5618q358k0318o3679n5973M9800O6149m7967j3363O1031J30380Q1087
$$ -12697 -88315 -96673 -116991 -180670 -236643 -186843 -120694 -168661 -182024 -120993 9387 90474
4754I0474J26391k2132l2390j0004o4546j8209J361k7240J02760n2992r9635K4322
$$ 90474 216865 194733 162343 152339 87793 69584 70945 43705 146465 93473 -6162 18160
4742A8160l1787k6276j13065j0909M7449j10222q3430L6168N8104m1452J07274
$$ 18160 -13627 -39903 -152968 -163877 -116428 -226650 -310080 -273912 -215808 -257260 -149986
4731a49986l8584K2127L7769J14752L2276M7400j2449j04865J2928q9571o2490
$$ -149986 -188570 -166443 -128674 -13922 18354 65754 53305 -51560 -38632 -128203 -190693
4720a90693N0842q572L2000Q2634K00905m7812p520o3114j96535o5550J821J41271
$$ -190693 -139851 -148423 -116423 -33789 167116 119304 111784 48670 -147865 -213415 -211594 -70323
4708g0323J30083r4982j03318O8273J00747K1800o0932o4476K7485o4282j08070
$$ -70323 59760 -35222 -138540 -70267 30480 52280 -8652 -73128 -45643 -109925 -217995
4697b17995p8531N6191J98907L1428j07060j4977K1415l0130n9182n6634J3252
$$ -217995 -296526 -240335 -41428 -10000 -117060 -132037 -110622 -140752 -199934 -256568 -243316
4686b43316Q2449J7913L3663J145O1690m5800P4584J12106K2279J9649p5348r9592
$$ -243316 -160867 -142954 -109291 -108146 -46456 -92256 -17672 94434 116713 136362 61014 -38578
4674c8578k835J9771L2034l6080l7845L854l3085O8377n1144M291N1890p4973
$$ -38578 -41413 -21642 10392 -25688 -63533 -59679 -92764 -24387 -75531 -71240 -19350 -94323
4662i4323J88270n152j76431P575O4168q5776o4549Q9722j2826J7869l0594p7846
$$ -94323 93947 88795 -87636 -80061 -15893 -101669 -166218 -76496 -89322 -71453 -102047 -179893
4650a79893M0177L6738m2504m2617M4025Q2343N7254j47549K4871R9973N9220
$$ -179893 -139716 -102978 -145482 -188099 -144074 -61731 -4477 -152026 -127155 -27182 32038
4639C2038p4541n5951R384J27134K31631l878j82654O5369R254p2923j7821q1212
$$ 32038 -42503 -98454 -89070 38064 269695 265817 83163 148532 157786 84863 67042 -14170
4627a4170j9549k113n7440j3537M1378M2714Q773j41844k6277J00796N1777M2588
$$ -14170 -33719 -35832 -93272 -106809 -65431 -22717 -13944 -155788 -182065 -81269 -29492 13096
4615A3096J20527m2502K5600k8820n6672j61771J8066J17381Q806J2493l4852
$$ 13096 133623 91121 116721 87901 31229 -130542 -112476 4905 13711 26204 -8648
4604h648o3027o7671L4021N2722j511P7339J11254R555q9114P4844j06828o3641
$$ -8648 -71675 -139346 -105325 -52603 -54114 23225 134479 144034 54920 129764 22936 -40705
4592d0705J42188M9093r1107r7672L8952J5096j3669R288l758l6476q8145K3982
$$ -40705 101483 150576 59469 -38203 749 15845 2176 11464 7706 -28770 -116915 -92933
4580i2933P7654L5522K5493j9477q9724L1064J8115j5890J31066Q735K8404j22949
$$ -92933 -15279 20243 45736 26259 -63465 -32401 -14286 -30176 100890 109625 138029 15080
4568A5080j27872j8836J8027r623l0539K9229O3013R0193J3177o2330j11092K3547
$$ 15080 -112792 -131628 -113601 -123224 -153763 -124534 -61521 28672 41849 -20481 -131573 -108026
4556a08026M9535L333j040O388O8211O1073m9462k2784M0624n2889k4815k9167
$$ -108026 -58491 -55158 -56198 -49810 18401 79474 30012 7228 47852 -5037 -29852 -59019
4544e9019l6941J2433l3955m999o2552q4625O6465J42876m6737j4650R9347J3200
$$ -59019 -95960 -83527 -117482 -122481 -185033 -269658 -203193 -60317 -107054 -121704 -22357 -9157
4532i157o7191j9178K4820n5013j4934J5761J13797P1891k233q6171l5234N4376
$$ -9157 -76348 -95526 -70706 -125719 -140653 -124892 -11095 60796 58563 -27608 -62842 -8466
4520h466p7068k2114r2718Q711J4660o5777M5041J07027J04241o5914n9685J8192
$$ -8466 -85534 -107648 -200366 -191655 -176995 -242772 -197731 -90704 13537 -52377 -112062 -93870
4508i3870J14556l6685j50209p9473p439J27714L7766P8706M6200R8311p273j85217
$$ -93870 20686 -15999 -166208 -245681 -253120 -125406 -87640 -8934 37266 135577 128304 -56913
4496e6913q2477L4315M5024L5473j8270L1768m7774j8505M6116J30488k5809Q391
$$ -56913 -139390 -105075 -60051 -24578 -42848 -11080 -58854 -77359 -31243 99245 73436 81827
4484H1827n1058J9220p2067l3979p1944o1348J48338K5014o6774m2072P7496L7470
$$ 81827 30769 49989 -22078 -56057 -128001 -189349 -41011 -15997 -82771 -124843 -47347 -9877
4472i877J27377K145n3308K831K247m2156n5230J3372R0674L7902n7159O70N208
$$ -9877 117500 119645 66337 69168 71415 29259 -25971 -12599 78075 115977 58818 59488 64696
4459F4696r2556p60j3391J5195j27702o2404K13169N3961N3405j01596j18771
$$ 64696 -27860 -28620 -42011 -26816 -154518 -216922 -3753 50208 103613 2017 -116754
4448a16754Q9205J5348p2907m2678J06786R8094M5055O3012n3142p4920K7625
$$ -116754 -27549 -12201 -85108 -127786 -21000 77094 122149 185161 132019 57099 84724
4437H4724L1544j24108k0180m3778j3514J04165J41383J0338p9314j6694L4238
$$ 84724 116268 -7840 -28020 -71798 -85312 18853 160236 170574 91260 74566 108804
4426A08804j0491p0561j09437N2703K5030l0215j14256j8648m5457L1899Q9288
$$ 108804 98313 27752 -81685 -28982 -3952 -34167 -148423 -167071 -212528 -180629 -91341
4415i1341p7056M2439N8917N5177q507j1786L3012K2415l6590M7029J22312j4905
$$ -91341 -168397 -125958 -67041 -11864 -20371 -32157 855 23270 -13320 33709 156021 141116
4403A41116n3289L0229j18984o13l8666j05421N9860L7740P6735P5218n5950j2942
$$ 141116 87827 118056 -928 -1541 -40207 -145628 -85768 -48028 28707 103925 47975 35033
4391C5033n4624m4112l45M2988K0782O7662l1269K5380r3632j38979O8132Q7552
$$ 35033 -19591 -63703 -64048 -21060 -278 67384 36115 61495 -32137 -171116 -102984 -15432
4379a5432m8750r6095p4811o8459l5052Q2247J05442J53359J30906j9631k3837
$$ -15432 -64182 -160277 -235088 -303547 -338599 -256352 -150910 2449 133355 113724 89887
$$ [...]
##END NTUPLES=NMR SPECTRUM
##END=
