##TITLE=Analysis number 325719
Compound Code ac 12704
Project Code adrs
Chemist Name 3b med
##JCAMPDX= 6.0         $$ Bruker NMR JCAMP-DX V2.0
##DATA TYPE= NMR SPECTRUM
##DATA CLASS= NTUPLES
##ORIGIN= Bruker BioSpin GmbH
##OWNER= nmr
$$ XWIN-NMR		Version 3.5
$$ Thu Jan 11 08:58:33 2007 GMT Standard Time (UT+0h)  MAYBRIDGE\nmr@NMR_250MHZ
##.OBSERVE FREQUENCY= 250.131544655141
##.OBSERVE NUCLEUS= ^1H
##.ACQUISITION MODE= SIMULTANEOUS (DQD)
##.ACQUISITION SCHEME= undefined
##.AVERAGES= 16
##.DIGITISER RES= 18
##SPECTROMETER/DATA SYSTEM= dpx250
##.PULSE SEQUENCE= zg30
##.SOLVENT NAME= DMSO
##.SHIFT REFERENCE= (INTERNAL, DMSO, 0, 16.522)
##AUDIT TRAIL= $$ (NUMBER, WHEN, WHO, WHERE, WHAT)
$$ ##TITLE= Audit trail, XWIN-NMR		Version 3.5
$$ ##JCAMPDX= 5.01
$$ ##ORIGIN= Bruker BioSpin GmbH
$$ ##OWNER= nmr
$$ C:\u/data/dgb/nmr/ADRS/830/pdata/1/auditp.txt
$$ ##AUDIT TRAIL=  $$ (NUMBER, WHEN, WHO, WHERE, WHAT)
(   1,<2007-01-11 08:58:06.74 +000>,<MAYBRIDGE\nmr>,<NMR_250MHZ>,
      <created by zg, POWCHK disabled, PULCHK disabled
       configuration hash MD5:
       49 4B E0 1D 92 C2 6B 37 9F E6 65 BC 52 41 86 1D
       data hash MD5: 64K
       93 BF A0 DB 8E 6A 82 CF FD 5D 38 88 F0 1D 32 9A>)
(   2,<2007-01-11 08:58:21.77 +000>,<MAYBRIDGE\nmr>,<NMR_250MHZ>,
      <Start of raw data processing
       ef LB = 0.3 FT_mod = 6 PKNL = 1 SI = 32K 
       data hash MD5: 32K
       E1 20 A3 01 D2 C2 E8 15 E5 9A EF D1 F0 16 7E E2>)
(   3,<2007-01-11 08:58:23.47 +000>,<MAYBRIDGE\nmr>,<NMR_250MHZ>,
      <apk 
       data hash MD5: 32K
       BE 54 B9 9E 05 97 89 0D 29 ED B0 2E 90 49 1B 0E>)
(   4,<2007-01-11 08:58:24.19 +000>,<MAYBRIDGE\nmr>,<NMR_250MHZ>,
      <abs ABSG = 5 
       data hash MD5: 32K
       D4 48 6F F0 22 2F F4 F5 97 EE F2 1D E5 67 8F E0>)
$$ ##END=
$$ 
$$ hash MD5
$$ A4 A3 0E 65 1A 16 C6 29 A2 1E 15 85 EF 8F D0 C6
##$RELAX= 
##$RELAX= 
##$RELAX= 
##$RELAX= 
##$RELAX= 
##$RELAX= 
##$RELAX= 
$$ Bruker specific parameters
$$ --------------------------
##$DU= <C:\u>
##$EXPNO= 830
##$NAME= <ADRS>
##$PROCNO= 1
##$TYPE= <nmr>
##$USER= <dgb>
##$AMP= (0..31)
100 100 100 100 100 100 100 100 100 100 100 100 100 100 100 100 100 100 
100 100 100 100 100 100 100 100 100 100 100 100 100 100 
##$AQSEQ= 0
##$AQ_mod= 3
##$AUNM= <au_zg>
##$AUTOPOS= <43 >
##$BF1= 250.13
##$BF2= 250.13
##$BF3= 250.13
##$BF4= 250.13
##$BF5= 500.13
##$BF6= 500.13
##$BF7= 500.13
##$BF8= 500.13
##$BYTORDA= 1
##$CFDGTYP= 0
##$CFRGTYP= 5
##$CHEMSTR= <none>
##$CNST= (0..31)
1 1 145 1 1 1 1 1 1 1 1 1 1 1 1 1 1 1 1 1 1 1 1 1 1 1 1 1 1 1 1 1 
##$CPDPRG= <>
##$CPDPRG1= <>
##$CPDPRG2= <>
##$CPDPRG3= <>
##$CPDPRG4= <mlev>
##$CPDPRG5= <mlev>
##$CPDPRG6= <mlev>
##$CPDPRG7= <mlev>
##$CPDPRG8= <mlev>
##$CPDPRGB= <>
##$CPDPRGT= <>
##$D= (0..31)
0 1 0 0 0 0 0 0 0 0.06 0 0 0 0 0 0 0.0002 0 0 0 0 0 0 0 0 0 0 0 0 0 0 
0 
##$DATE= 1168505885
##$DBL= (0..7)
120 120 120 120 120 120 120 120 
##$DBP= (0..7)
150 150 150 150 150 150 150 150 
##$DBP07= 0
##$DBPNAM0= <>
##$DBPNAM1= <>
##$DBPNAM2= <>
##$DBPNAM3= <>
$$ [...]
##$SUBNAM6= <"">
##$SUBNAM7= <"">
##$SUBNAM8= <"">
##$SUBNAM9= <"">
##$SW= 20.6930455092707
##$SWIBOX= (0..15)
0 0 3 0 0 0 0 0 0 0 0 0 0 0 0 0 
##$SW_h= 5175.983436853
##$TD= 65536
##$TD0= 1
##$TE= 293.16
##$TE2= 300
##$TE3= 300
##$TEG= 300
##$TL= (0..7)
0 120 120 120 120 120 120 120 
##$TP= (0..7)
150 150 150 150 150 150 150 150 
##$TP07= 0
##$TPNAME0= <>
##$TPNAME1= <>
##$TPNAME2= <>
##$TPNAME3= <>
##$TPNAME4= <>
##$TPNAME5= <>
##$TPNAME6= <>
##$TPNAME7= <>
##$TPOAL= (0..7)
0.5 0.5 0.5 0.5 0.5 0.5 0.5 0.5 
##$TPOFFS= (0..7)
0 0 0 0 0 0 0 0 
##$TUNHIN= 0
##$TUNHOUT= 0
##$TUNXOUT= 0
##$USERA1= <user>
##$USERA2= <user>
##$USERA3= <user>
##$USERA4= <user>
##$USERA5= <user>
##$V9= 5
##$VALIST= <valist>
##$VCLIST= <CCCCCCCCCCCCCCC>
##$VD= 0
##$VDLIST= <DDDDDDDDDDDDDDD>
##$VPLIST= <PPPPPPPPPPPPPPP>
##$VTLIST= <TTTTTTTTTTTTTTT>
##$WBST= 1024
##$WBSW= 4
##$XGAIN= (0..3)
0 0 0 0 
##$XL= 0
##$YL= 0
##$YMAX_a= 348555
##$YMIN_a= -344740
##$ZGOPTNS= <>
##$ZL1= 120
##$ZL2= 120
##$ZL3= 120
##$ZL4= 120
##$ABSF1= 16.522
##$ABSF2= -4.171173
##$ABSG= 5
##$ABSL= 3
##$ALPHA= 0
##$AQORDER= 0
##$ASSFAC= 0
##$ASSFACI= 0
##$ASSFACX= 0
##$ASSWID= 0
##$AUNMP= <proc_1d>
##$AZFE= 0.1
##$AZFW= 0.1
##$BCFW= 0
##$BC_mod= 0
##$BYTORDP= 0
##$COROFFS= 0
##$CY= 12.5
##$DATMOD= 1
##$DC= 0
##$DFILT= <>
##$DTYPP= 0
##$F1P= 14.0000005364418
##$F2P= -0.99999901652339
##$FCOR= 0.5
##$FTSIZE= 32768
##$FT_mod= 6
##$GAMMA= 0
##$GB= 0
##$INTBC= 1
##$INTSCL= 1
##$ISEN= 128
##$LB= 0.3
##$LEV0= 0
##$LPBIN= 0
##$MAXI= 10000
##$MC2= 0
##$MEAN= 0
##$ME_mod= 0
##$MI= 0
##$NCOEF= 0
##$NC_proc= -3
##$NLEV= 6
##$NOISF1= 0
##$NOISF2= 0
##$NSP= 0
##$NTH_PI= 0
##$NZP= 0
##$OFFSET= 16.522
##$PC= 1
##$PHC0= 215.4174
##$PHC1= 6.942547
##$PH_mod= 1
##$PKNL= yes
##$PPARMOD= 0
##$PSCAL= 4
##$PSIGN= 0
##$REVERSE= no
##$SF= 250.13
##$SI= 32768
##$SIGF1= 0
##$SIGF2= 0
##$SINO= 400
##$SIOLD= 32768
##$SREGLST= <1H.DMSO>
##$SSB= 0
##$STSI= 32768
##$STSR= 0
##$SW_p= 5175.98343685301
##$SYMM= 0
##$S_DEV= 0
##$TDeff= 65536
##$TDoff= 0
##$TI= <Analysis number 999999
Compound Code 99
Book Reference 9
Project Code 9>
##$TILT= no
##$TM1= 0
##$TM2= 0
##$TOPLEV= 0
##$USERP1= <user>
##$USERP2= <user>
##$USERP3= <user>
##$USERP4= <user>
##$USERP5= <user>
##$WDW= 1
##$XDIM= 32768
##$YMAX_p= 343624406
##$YMIN_p= -52409
$$ End of Bruker specific parameters
$$ ---------------------------------
##NTUPLES= NMR SPECTRUM
##VAR_NAME=  FREQUENCY,     SPECTRUM/REAL,   SPECTRUM/IMAG
##SYMBOL=    X,             R,               I
##VAR_TYPE=  INDEPENDENT,   DEPENDENT,       DEPENDENT
##VAR_FORM=  AFFN,          ASDF,            ASDF
##VAR_DIM=   32768,         32768,           32768
##UNITS=     HZ,            ARBITRARY UNITS, ARBITRARY UNITS
##FACTOR=    0.157963299565203, 1,           1
##FIRST=     4132.6476996994, 0,             0
##LAST=      -1043.33573715361, 0,           0
##MIN=       -1043.33573715361, -52409,      0
##MAX=       4132.6476996994, 343624406,     0
$$ Real data points
##PAGE= N=1
##DATA TABLE= (X++(R..R)), XYDATA
$$ [...]
16899F1450L090P155O753n211J270L842p557p315K747P341M460L600l148J7420
$$ 61450 64540 71695 78448 73237 74507 78349 70792 63477 66224 73565 78025 81625 78477 95897
16885I5897J0230l888L807r349p602L598J017L73R37J4843J2938l022M49O195
$$ 95897 106127 102239 106046 96697 89095 92693 93710 94083 95020 109863 122801 119779 120228 126423
16871A26423j4398R907J639q0R149p196l893j069K6740O783p43K405N782R420
$$ 126423 112025 121932 123571 123491 132640 125444 121551 120482 147222 154005 153262 155667 161449 170869
16857A70869L645J6575Q434O087J1173R110l553J1605J1703J9595J7399o948O166
$$ 170869 174514 191089 199523 205610 216783 225893 222340 233945 245648 265243 282642 275694 281860
16844B81860K1402L8256K3506K1577L8500M7849K7822N0842N4175N6871P6765
$$ 281860 303262 341518 365024 386601 425101 472950 500772 551614 605789 662660 739425
16833G39425Q3819Q3644O1774Q8611R6183O3211N4565J07946J83400K09024K00208
$$ 739425 823244 906888 968662 1057273 1153456 1216667 1271232 1379178 1562578 1771602 1971810
16822A971810J65829J72962K47598L61513N60830P82633J103835J644170K580980
$$ 1971810 2137639 2310601 2558199 2919712 3480542 4263175 5367010 7011180 9592160
16813I592160M155730O536013R514654J0719699O210145k679618r349482r474265
$$ 9592160 13747890 20283903 29798557 40518256 46728401 44048783 34699301 25225036
16805B5225036n947101k846929p26750J047567K936489N303320Q378070J0519772
$$ 25225036 19277935 16431006 15704256 16751823 19688312 24991632 33369702 43889474
16797D3889474P329857j158297q245567q157908k725795L281824P782015P540707
$$ 43889474 51219331 50061034 41815467 33657559 30931764 34213588 41995603 49536310
16789D9536310O32280p880873j1179413q492308m690331k023816p5228J671308
$$ 49536310 50168590 42287717 31108304 22615996 17925665 15901849 15826621 17497929
16781A7497929L616841O087131Q651964Q289622K020152o654689j1152938r450146
$$ 17497929 21114770 27201901 35853865 44143487 46163639 39508950 28356012 18905866
16773A8905866n890554l494318k168704j437058j016885p54200n85077m68880
$$ 18905866 13015312 9520994 7352290 5915232 4898347 4144147 3559070 3090190
16765C090190l60036k64818j88292j32711j13433j25104j54856j53967j73656
$$ 3090190 2730154 2465336 2277044 2144333 2030900 1905796 1750940 1596973 1423317
16756A423317j88220j61133j21248p6194m7456m3739j6655q650k6022n8478p5322
$$ 1423317 1235097 1073964 952716 876522 829066 785327 768672 760022 734000 675522 600200
16745F00200o4863m9498k5843j8109m2608k5764k5237j7367j8326L804M918j2671
$$ 600200 535337 485839 459996 441887 399279 373515 348278 330911 312585 316389 321307 308636
16733C08636k0225l5306j0260k383j1134m172P08j2015l41l591j9190n884P0O659
$$ 308636 288411 253105 242845 240462 229328 225156 225864 213849 213508 209917 190727 184843 184913 191572
16719A91572r756j003J969j2921j5380l278j1778j1836j215O37n829m794O492
$$ 191572 181816 180813 182782 169861 154481 151203 139425 127589 126374 127011 121182 116388 122880
16706A22880J0119l081q517n820l332p859m26j900q264K194l370R73j575M707
$$ 122880 132999 129918 121401 115581 112249 104390 103964 102064 93800 95994 92624 93597 92022 96729
16692I6729R185r651j7701O446l599k106J7675K441m789J312P190J2767N760p336
$$ 96729 105914 96263 78562 85008 81409 79303 96978 99419 94630 95942 103132 115899 121659 114323
16678A14323M517r003k1984j5154R417m60j595o649Q557Q728J440j1779p493J1035
$$ 114323 118840 109837 87853 72699 82116 81656 80061 73412 81969 90697 92137 80358 72865 83900
16664H3900l490j9224p99q087p492n145L803P404Q274K791J6887Q106k0286l595
$$ 83900 80410 61186 60387 52300 44808 39663 43466 50870 59144 61935 78822 86928 66642 63047
16650F3047m536j7058j5606J0278J9315N549J47L53q644m347j1j1435J0542K3047
$$ 63047 58511 41453 25847 36125 55440 60989 61136 61489 52845 48498 48487 37052 47594 70641
16636G0641J1917O47m184J268k998j8938j7286n633j795J073J9381Q830J4546
$$ 70641 82558 83205 79021 80289 77291 58353 41067 35434 33639 34712 54093 62923 77469
16623G7469R093j5641j3907j1675j0349r000J0995J6766K510k437O751j3002p50
$$ 77469 86562 70921 57014 45339 34990 25990 36985 53751 56261 53824 60575 47573 46823
16610D6823O619n90J2420P257K221j8608j512j2941k652j1642l81P018J4138l51
$$ 46823 53442 52852 65272 72529 74750 56142 54630 41689 39037 27395 27014 34032 48170 47819
16596D7819n64n209n410L99k80j0512o210q080J3291K321n897R924J620k632R976
$$ 47819 47255 42046 36636 37035 36755 26243 20033 11953 25244 27565 21668 31592 33212 30580 40556
16581D0556k847p500p029r59j3369m980N238P974j507n186L715M348l030J087
$$ 40556 37709 30209 23180 22221 8852 3872 9110 17084 15577 10391 14106 18454 15424 16511
16567A6511j4808K43o259P53l355M620O965L822l119R581j758j5j3084p259Q999
$$ 16511 1703 1946 -4313 -3560 -6915 -2295 4670 8492 5373 14954 13196 13181 97 -7162 1837
16552A837l470P832N007q231k906r327J630O548J5044K080j9292p175l00M067
$$ 1837 -1633 6199 11206 2975 69 -9258 -7628 -1080 13964 16044 -3248 -10423 -10723 -6656
16538f656J0270J6893R201Q14n321o981j507o54q33M643j312N397M103k231j7003
$$ -6656 3614 20507 29708 30522 25201 18220 16713 16059 15226 19869 18557 23954 28057 25826 8823
16523H823q325R673R779P410L123j1777L603J412K557L383N816o679j0462M963
$$ 8823 498 10171 19950 27360 30483 18706 22309 23721 26278 29661 35477 28798 18336 23299
16509B3299L737l220l538m630l972r560m953J9112K2501j299j2547K766L560J258
$$ 23299 27036 23816 20278 15648 11676 2116 -2837 16275 38776 37477 24930 27696 31256 32514
16495C2514k083q308j872n941M744J3373n076J564k697p249j0807j3719n08J1248
$$ 32514 30431 22123 20251 14310 19054 32427 27351 28915 26218 18969 8162 -5557 -6065 5183
16481E183J4211j865l115N884J368m546j2904p054M425K132r885P831R1l090N003
$$ 5183 19394 17529 14414 20298 21666 17120 4216 -2838 1587 3719 -6166 1665 1756 -1334 3669
16466C669J9859j2039j3922m062Q605O033J4181m373j6841J0884k715j0700M953
$$ 3669 23528 11489 -2433 -6495 2110 8143 22324 17951 1110 11994 9279 -1421 3532
16453C532J4081L545p193k86O244p185k763q000m621J9339R794k757j2004j080
$$ 3532 17613 21158 13965 13679 19923 12738 9975 1975 -2646 16693 26487 23730 11726 10646
16439A0646l429n746j817K6700l83n325J257M978J0650N386j0478p184q108L628
$$ 10646 7217 1471 -346 26354 25971 20646 21903 26881 37531 42917 32439 25255 17147 20775
16425B0775K946m767r317r650P864K6184p250k1010K450M19O622j324O958K801
$$ 20775 23721 18954 9637 -13 7851 34035 26785 5775 8225 8644 15266 13942 20900 23701
16411B3701j0685j3877j885J6669M631r668l587J2002J822J097Q708R454p69L95
$$ 23701 13016 -861 -2746 13923 18554 8886 5299 17301 19123 20220 28928 38382 37613 38008
16397C8008j4925j2803M270J3269R751o753q191j68j3688k965J792J086J5127
$$ 38008 23083 10280 14550 27819 37570 30817 22626 22458 8770 5805 7597 8683 23810
16384B3810N42k1365k1592N793R840N400q064J47R05K117o648n536N748k989K413
$$ 23810 24352 2987 -18605 -12812 -2972 2428 -5636 -5489 -4584 -2467 -9115 -14651 -8903 -11892 -9479
16369i479L952o871q475O807R821L693M721P06N713L30q583j9964l458J7526P152
$$ -9479 -5527 -12398 -20873 -14066 -4245 -552 4169 4875 10588 10918 2335 -17629 -21087 -3561 3591
16354C591o672n337J067J6060n069r106L330m235P758N170M669K849K553Q909
$$ 3591 -3081 -8418 -7351 8709 3640 -5466 -2136 -6371 1387 6557 11226 14075 16628 25537
16340B5537J924L699m939p199o346J342r59o919l845o53K940J4458o739j999J503
$$ 25537 27461 31160 26221 19022 12676 14018 13059 6140 2295 1642 4582 19040 12301 10302 11805
16325A1805j1144L461J5041o177l143Q800r5p808m9o470l209J1037n717P921k19
$$ 11805 661 4122 19163 12986 9843 18643 18548 10740 10691 4221 1012 12049 6332 14253 14034
16310A4034j8961j2810o795k039J4673K0345q646j1521J968J1559K07l918k506
$$ 14034 -4927 -17737 -24532 -26571 -11898 8447 -199 -11720 -9752 1807 2014 -1904 -4410
16297d410K321R475j713j6339o328Q484J9198Q012K89J811k268j8620p676J840
$$ -4410 -2089 7386 5673 -10666 -16994 -8510 10688 18700 18989 20800 18532 -88 -7764 -5924
16283e924J2212L264n155q095R293J6437Q183N946k074q155k932J757O375J6867
$$ -5924 6288 9552 4397 -3698 5595 22032 30215 36161 34087 25932 23000 24757 31132 47999
16269D7999L9750J3190J2220K3584M3895M0230l209l7265l3951j2150j6141M085
$$ 47999 87749 100939 113159 136743 180638 220868 217659 180394 146443 134293 118152 122237
16257A22237j955n061J9725N0520L3992K8424k865j8294l3600k1365J2441K9515
$$ 122237 120282 115221 134946 185466 219458 247882 245017 226723 193123 171758 184199 213714
16245B13714K3730l37l6236l6493l2890j2510k4293j747r95J5004M5046N2631
$$ 213714 237444 237107 200871 164378 131488 118978 94685 92938 91943 106947 151993 204624
16233B04624K0755J700k0382l6770m1527l8040k8698k0312j6626o990j115P130
$$ 204624 225379 227079 206697 169927 128400 90360 61662 41350 24724 17734 16619 23749
16221B3749K326n080l77n463j3994k378J1665R568K678n554M942N212j6593q626
$$ 23749 26075 20995 20618 15155 1161 -1217 10448 20016 22694 17140 22082 27294 10701 2075
16207B075M39r383j7221O255J1990J9467m263n198Q798J5516J310r627l182p543
$$ 2075 2514 -6869 -24090 -17835 -5845 13622 9359 4161 12959 28475 29785 20158 16976 9433
16193I433j4229m774N811M441N557n739K833M394M802n674k8247k562m030Q762
$$ 9433 -4796 -9570 -3759 682 6239 500 3333 7727 12529 6855 -21392 -23954 -27984 -19222
16179a9222k235k468j0066J756O685L27J7382K1707Q877q010k112O005k129j0986
$$ -19222 -21457 -23925 -33991 -32235 -25550 -25223 -7841 13866 22743 14733 12621 18626 16497 5511
16165E511l70o431K049J658Q120j0771J670j032L238K499r239k873N245j7688
$$ 5511 5141 -1290 759 2417 10537 -234 1436 404 3642 6141 -3098 -5971 -726 -18414
16151a8414q25O010L20J0734J5724N758L59l181n953R632j559m582l890J222L382
$$ -18414 -19239 -13229 -12909 -2175 13549 19307 19666 16485 10532 20164 18605 14023 10133 11355 14737
16136A4737j0185j7822J4394K0372j3521m570o425K751k384j855n405P33J4892
$$ 14737 4552 -13270 1124 21496 7975 3405 -3020 -269 -2653 -4508 -9913 -9180 5712
16123E712K701j9883o436J3601J356q300k77K358l554M993k796M708R231o791
$$ 5712 8413 -11470 -17906 -4305 -2949 -11249 -11526 -9168 -12722 -7729 -10525 -5817 3414 -3377
16109c377N29p731q531N891j4419m631J5779J4579M910q934o777L034J844J5319
$$ -3377 -2848 -10579 -19110 -13219 -27638 -32269 -16490 -1911 2999 -5935 -12712 -9678 -7834 7485
16095G485L494p100K999m135j2118p885N92L845R066n583J3739J5749j0676j941
$$ 7485 10979 3879 6878 2743 -9375 -17260 -16668 -12823 -3757 -9340 4399 20148 9472 7531
16081G531J0409r258k6657j2162O746J3124L762N589J0699M308P748P40p196j1053
$$ 7531 17940 8682 -17975 -30137 -23391 -10267 -6505 -916 9783 14091 21839 22579 15383 4330
16067D330j0484J7428J2010O160k641j2025o559p853o69P834J350q068r412j1944
$$ 4330 -6154 11274 23284 29444 26803 14778 8219 366 -303 7531 8881 813 -8599 -20543
16053b0543M631J1177K829K78O349n718l891J6065P411q588N459l774j7239j0621
$$ -20543 -15912 -4735 -1906 -1628 4721 -997 -4888 11177 18588 10000 15459 11685 -5554 -16175
16039a6175N552n433r644o493O19R629J5474n792O46L637O306k034Q570l958n121
$$ -16175 -10623 -16056 -25700 -32193 -31574 -21945 -6471 -12263 -11617 -7980 -1674 -3708 4862 904 -4217
16024d217k025R758p236R652J5547j2374R34j683n016L30j1449J286j458o79K366
$$ -4217 -6242 3516 -3720 5932 21479 9105 10039 8356 3340 3670 -7779 -6493 -7951 -8630 -6264
16009f264K86n232j825n726o969P434R714J7841J286p414l647L058K4926K542
$$ -6264 -5978 -11210 -13035 -18761 -25730 -18296 -8582 9259 10545 3131 -516 2542 27468 30010
15995C0010r292r550r770M019r032L340Q624n329o481J209n69M480o82M365J1755
$$ 30010 20718 11168 1398 5417 -3615 -275 8349 3020 -3461 -2252 -2821 1659 977 5342 17097
15980A7097N18J086M937k374j607j1109j3932J65N48R068p743Q690p835j6347
$$ 17097 17615 18701 23638 21264 19657 8548 -5384 -5219 -4671 4397 -3346 5344 -2491 -18838
15966a8838Q125L265n147J3586P890O672k3315o168k929K148L569L813l021P218
$$ -18838 -10713 -7448 -12595 991 8881 15553 -7762 -13930 -16859 -14711 -11142 -7329 -10350 -3132
15952c132o387m378P754R555O279J079O060M596j969k536o401L288J7445j453
$$ -3132 -9519 -13897 -6143 3412 9691 10770 16830 21426 19457 16921 10520 13808 31253 29800
15938B9800j2814j1384o56r663j1123J632Q990K232K777L824p194N65j38j4164
$$ 29800 16986 5602 4946 -4717 -15840 -14208 -5218 -2986 -209 3615 -3579 -3014 -3152 -17316
15924a7316j3056L132J6755J2624J3023k715p354m028l724K740M418j3605m560
$$ -17316 -30372 -27240 -10485 2139 15162 12447 5093 1065 -2659 81 4499 -9106 -13666
15911a3666M89r529r022J087M648N401O151L656o426l278n89O308q711p101J4583
$$ -13666 -13177 -22706 -31728 -30641 -25993 -20592 -14441 -10785 -17211 -20489 -21078 -14770 -23481 -30582 -15999
15896a5999J983j4088M573q42j2802R585J0405Q123K052k949l116K082o047P129
$$ -15999 -14016 -28104 -23531 -24373 -37175 -27590 -17185 -9062 -7010 -9959 -13075 -10993 -17040 -9911
15882i911l900O01k79m509K682J5022K1k210n100k974p887j0116K1590J4102N423
$$ -9911 -13811 -13210 -13489 -17998 -15316 -294 -273 -2483 -7583 -10557 -18444 -28560 -6970 7132 12555
15867A2555J1232L545q264j7008q788N67R697K405p566J0720n67o193j059P627
$$ 12555 23787 27332 19068 2060 -6728 -6161 3536 5941 -1625 9095 8528 2335 1276 8903
15853H903K150j714j107P141k630p368l096J1584J519o947r054N362N496j5422
$$ 8903 11053 9339 8232 15373 12743 5375 2279 13863 15382 8435 -619 4743 10239 -5183
15839e183N09J5387L893j3905o287l425r277K916j38r72j341J2549j117o670j184
$$ -5183 -4674 10713 14606 701 -5586 -9011 -18288 -15372 -15510 -16482 -17823 -5274 -6391 -13061 -14245
15824a4245m498k3883J50K2929r933L560J1234J1732J2308J4569L687q438j6041
$$ -14245 -18743 -42626 -42476 -19547 -29480 -25920 -14686 -2954 9354 23923 27610 19172 3131
15811C131p952k331L561j0170p307R347J8535K71m732l92N171m95L462Q211k2290
$$ 3131 -4821 -7152 -3591 -13761 -21068 -11721 6814 7085 2353 1961 7132 6637 10099 18310 -3980
15796c980k5443K342O814L806J0982K1262r0o663j1768j8570k345L130n752N987
$$ -3980 -29423 -27081 -20267 -16461 -5479 15783 15693 9030 -2738 -21308 -23653 -20523 -26275 -20288
15782b0288J281k393J8713L278p832Q514j0101l857Q672O96j167P917N66Q133
$$ -20288 -19007 -21400 -2687 591 -7241 1273 -8828 -12685 -4013 -3317 -4484 3433 3999 12132
15768A2132M064j0296m75p390q478n380M131o248j646J1996l895L999O232L02
$$ 12132 16196 5900 5425 -1965 -10443 -15823 -11692 -17940 -19586 -7590 -11485 -7486 -1254 -952
15754i52O983j2865k118j551j0304q844J145p087P920J0087j1225O707J6665N154
$$ -952 6031 -6834 -8952 -10503 -20807 -29651 -28506 -35593 -27673 -17586 -28811 -22104 -5439 -285
15740b85N505j5017l586N568o343j978M076J2270O841r459k0339q18K698J6024
$$ -285 5220 -9797 -13383 -7815 -14158 -16136 -12060 210 7051 -2408 -22747 -23565 -20867 -4843
15726d843J309K300P320j3263o011O814n910m484L927q559J819J6998M455J507
$$ -4843 -3534 -1234 6086 -7177 -13188 -6374 -12284 -16768 -12841 -21400 -19581 -2583 1872 3379
15712C379K627P898q774j123o543j1848j1022N086J5968J4250O008j584q865j7705
$$ 3379 6006 13904 5130 4007 -2536 -14384 -25406 -20320 -4352 9898 15906 14322 5457 -12248
15698a2248j201J3019j028r830L187N354p089L958J5212J1687K249j0284l168
$$ -12248 -13449 -430 -1458 -11288 -8101 -2747 -9836 -5878 9334 21021 23270 12986 9818
15685I818j0318K362r71m996L282N156J531j0693K772j1276J372q858j600Q320
$$ 9818 -500 1862 891 -4105 -823 4333 5864 -4829 -2057 -13333 -11961 -20819 -22419 -14099
15671a4099N858m600q387Q99K933K76m082j554M759P850N019J0877J1895j2945
$$ -14099 -8241 -12841 -21228 -20329 -17396 -17120 -21202 -22756 -17997 -10147 -5128 5749 17644 4699
15657D699j1146O021K446L194R445j6270j2770L588p56J2499J6664n046r654J597
$$ 4699 -6447 -426 2020 5214 14659 -1611 -14381 -10793 -11549 950 17614 12568 2914 4511
15643D511k980o092j193J3022m66m738q467j2837l295K348n672P522J2320P703
$$ 4511 1531 -4561 -5754 7268 6802 2064 -6403 -19240 -22535 -20187 -25859 -18337 -6017 1686
15629A686R314K616q293p597J7042O220j0891j2896r665J902J863k087o225n602
$$ 1686 11000 13616 5323 -2274 14768 20988 10097 -2799 -12464 -10562 -8699 -10786 -17011 -22613
15615b2613P103O113k116L891L227R835J881j6719M816O111j2187p43L416n938
$$ -22613 -15510 -9397 -11513 -7622 -4395 5440 7321 -9398 -4582 1529 -10658 -11401 -7985 -13923
15601a3923o273L136J3491Q037O245J097k362j812N349J817p767j2670m620M761
$$ -13923 -20196 -17060 -3569 4468 10713 11810 9448 7636 12985 14802 7035 -5635 -10255 -5494
15587e494Q277J1336l936o627k575M241j9544p3O082j1q215J0207L886L69Q12
$$ -5494 2783 14119 10183 3556 981 5222 -14322 -14395 -8313 -8324 -16539 -6332 -2446 -2077 -1265
15572a265m588l277L413P00j1059l488R472N490N857k897m225J4663J0298m091
$$ -1265 -5853 -9130 -5717 -5017 -16076 -19564 -10092 -4602 1255 -1642 -5867 8796 19094 15003
15558A5003q106R44j1610J500L470q053J707J5491N567q729j372M645O339m115
$$ 15003 6897 7841 -3769 -2269 1201 -6852 -5145 10346 15913 7184 5812 10457 16796 12681
15544A2681o346m471L733Q095o620K737q288l922O142j5072j773n99J1372N245
$$ 12681 6335 1864 5597 13692 7072 9809 1521 -2401 3741 -11331 -13104 -13703 -2331 2914
15530B914j0140N780j001j6527n550k971J155N728L574o39J2698Q26m685p314
$$ 2914 -7226 -1446 -2447 -18974 -24524 -27495 -26340 -20612 -17038 -17677 -4979 -4153 -8838 -16152
15516a6152K920K536l535n74p47l397r322P485P276M345K610P669Q93j1602J922
$$ -16152 -13232 -10696 -14231 -14805 -15552 -18949 -28271 -20786 -13510 -9165 -6555 1114 2007 -9595 -7673
15501g673l818P31J0199J9125R934N188m280k3534j060M859q839m79L186M318
$$ -7673 -11491 -10760 -561 18564 28498 33686 29406 5872 4812 9671 832 353 3539 7857
15487G857p262n872N527Q772R713p316r698r221N421l086j161j152O185P792n085
$$ 7857 595 -5277 250 9022 18735 11419 1721 -7500 -2079 -5165 -6326 -7478 -1293 6499 1414
15472A414j0345K010K417J5479j735o325K267L24Q3P842m219J064O780j5315o839
$$ 1414 -8931 -6921 -4504 10975 9240 2915 5182 5506 5589 13431 9212 10276 17056 1741 -5098
15457e098M111k312L599q944k871n852J3528R271J033j3603j2404j0103R60J7434
$$ -5098 -987 -3299 300 -8644 -11515 -17367 -3839 5432 6465 -7138 -19542 -29645 -28685 -11251
15443a1251J3006p915p442J1799M462p858o123o257N739J4690m456q937l80M140
$$ -11251 1755 -6160 -13602 -1803 2659 -5199 -11322 -17579 -11840 2850 -1606 -10543 -10923 -6783
15429f783p265R726j190j1697K881J4184n686j1677J3485P896j1272j8785l211
$$ -6783 -14048 -4322 -5512 -17209 -14328 -144 -5830 -17507 -4022 3874 -7398 -26183 -29394
15416b9394p958J1341K4508J3275n613L755L64j1807j767M523K813q61j2002J338
$$ -29394 -37352 -26011 -1503 11772 6159 9914 10278 -1529 -3296 1227 4040 3179 -8823 -7485
15402g485K1731m442n558j1855q399q415p499J3553O248j0012K5669J0084j328
$$ -7485 14246 9804 4246 -7609 -16008 -24423 -31922 -18369 -12121 -22133 3536 13620 12292
15389A2292n985p552K893j1259J600J6148O481n65j4524k86p996j9334m2J4437
$$ 12292 6307 -1245 1648 -9611 -8011 8137 14618 14053 -471 -757 -8753 -28087 -28129 -13692
15375a3692O34m401J0988K349R630J855l673l35n313q467N810J9045j124j5272
$$ -13692 -13058 -17459 -6471 -4122 5508 7363 3690 3355 -1958 -10425 -4615 14430 13306 -1966
15361a966p865L99q302N572R603M497j1046j8021P251J8088M260L032P612j168
$$ -1966 -9831 -9432 -17734 -12162 -2559 1938 -9108 -27129 -19878 -1790 2470 5502 13114 11946
15347A1946j2554q844k906j3064P448k461n138m318M336J6096J1482J250j0287
$$ 11946 -608 -9452 -12358 -25422 -17974 -20435 -25573 -29891 -25555 -9459 2023 3273 -7014
15334g014k942O767P223P357N70l645J273N2m424N415j6488o633J790m839p924
$$ -7014 -9956 -3189 4034 11391 11961 8316 9589 9641 5217 10632 -5856 -12489 -10699 -15538 -23462
15319b3462J732J472J0903k898K541m965P241L987P305j155R71O02P589L919j2458
$$ -23462 -21730 -20258 -9355 -12253 -9712 -14677 -7436 -3449 3856 2701 3672 4274 11863 15782 3324
15304C324m136M662l056j6487p657N569J7957K876k811j946j5027Q292L125n829
$$ 3324 -812 3850 794 -15693 -23350 -17781 176 3052 241 -1705 -16732 -8440 -5315 -11144
15290a1144j2953k73J4120J0375j1199j1436N243J1148P390J3536r525j1216K673
$$ -11144 -24097 -24370 -10250 125 -11074 -22510 -17267 -6119 1271 14807 5282 -5934 -3261
15277c261O003j567N598j707O666K4130n740j2485L746k359j0234j0842j6601
$$ -3261 2742 1175 6773 5066 11732 35862 30122 17637 21383 19024 8790 -2052 -18653
15264a8653M183J1288M036J855J1010n266j3452Q236J906o594k19k868p053L382
$$ -18653 -14470 -3182 854 2709 13719 8453 -4999 3237 5143 -1451 -1670 -4538 -11591 -8209
15250h209N261M040K726Q020n936l848k916N758l618p677N427R791N622j534M936
$$ -8209 -2948 1092 3818 11838 5902 2054 -862 4896 1278 -6399 -972 8819 14441 12907 17843
15235A7843K011m09o449O99M118j5741o354j363Q490R105Q320k844M05O893J4148
$$ 17843 19854 19445 12996 13695 17813 2072 -4282 -5645 2845 11950 20270 17426 17831 24724 38872
15220C8872k4909k450J1130k840o770j5384J135m452p242n716o403l085N702J1910
$$ 38872 13963 11513 22643 19803 13033 -2351 -1216 -5668 -12910 -18626 -25029 -28114 -22412 -10502
15206a0502J1500l43j2167j793M101M841K042j956P629J287Q727n267o504j5418
$$ -10502 998 655 -11512 -13305 -9204 -4363 -2321 -4277 3352 4639 13366 8099 1595 -13823
15192a3823m250O951J0572j3392j7968k263J8227J1529J832M95J0587n224k2664
$$ -13823 -18073 -11122 -550 -13942 -31910 -34173 -15946 -4417 -2585 -2090 8497 3273 -19391
15179a9391j6704Q219R272J0467P167P33L452L826J133o267r544o792q285j7984
$$ -19391 -36095 -27876 -18604 -8137 -970 -237 3215 7041 8174 1907 -7637 -14429 -22714 -40698
15165d0698O328J3769N678K288J1852l470L239M453J1556K686l554q771Q743J3647
$$ -40698 -34370 -20601 -14923 -12635 -783 -4253 -1014 3439 14995 17681 14127 5356 14099 27746
15151B7746J2r768j4294n630k630j765j576P870K117n9m88J5746o082k86m081
$$ 27746 27758 17990 3696 -1934 -4564 -6329 -7905 -35 2082 2023 1535 17281 11199 10913 6832
15136F832l016P810J9743j014q513q466R911l459j1806j615J0654r0k460j1120
$$ 6832 3816 11626 31369 30355 21842 13376 23287 19828 8022 6407 17061 16971 14511 3391
15122C391j0884O112P889K428K342q577j596n999p56l271p521P616J0510l014
$$ 3391 -7493 -1381 6508 8936 11278 2701 1105 -4894 -5650 -8921 -16442 -8826 1684 -1330
15108a330k590N374J734j9751j7977j990J1095J0656K716J470P280K1865J267
$$ -1330 -3920 1454 3188 -16563 -34540 -36530 -25435 -14779 -12063 -10593 -3313 18552 19819
15095A9819j4073j5527l717k672N447N189R659P253m045m834P667n008L170J1318
$$ 19819 5746 -9781 -13498 -16170 -10723 -5534 4125 11378 7333 2499 10166 5158 8328 19646
15081A9646P916j2013k0512k3253l438J4008N019J841L076o858l864K856P248
$$ 19646 27562 15549 -4963 -28216 -31654 -17646 -12627 -10786 -7710 -14568 -18432 -15576 -8328
15068h328O647J3297J1784N872m469j3460p3k207j1744j586J4642R049L143P582
$$ -8328 -1681 11616 23400 29272 24803 11343 11270 9063 -2681 -4267 10375 19424 22567 30149
15054C0149j2129r135o594J1957Q490K174j6202k439n716n352j4191Q022L467
$$ 30149 18020 8885 2291 14248 22738 24912 8710 6271 555 -4797 -18988 -10966 -7499
15041g499M362M594N118L693n081j0418K78J3661M870R898J485n914o126j5364
$$ -7499 -3137 1457 6575 10268 5187 -5231 -4953 8708 13578 23476 24961 19047 12921 -2443
15027b443k003M47n10o56j0722N194M559l570j0672O303Q846q8M191q920j485
$$ -2443 -4446 -3999 -4509 -5165 -15887 -10693 -6134 -9704 -20376 -14073 -5227 -5315 -1124 -10044 -11529
15012a1529M73L859K807J6414J1367j1151n279j00j2389J629m254l242k146L474
$$ -11529 -11056 -7197 -4390 12024 23391 12240 6961 6861 -5528 -3899 -8153 -11395 -13541 -10067
14998a0067K830P040j3390o578J911J1410O586l304Q104n499k834k659q863m783
$$ -10067 -7237 -197 -13587 -20165 -18254 -6844 -258 -3562 4542 -957 -3791 -6450 -15313 -20096
14984b0096N70k611l693J4323O147j1830o331j0174J4108M682N438j502l121l19
$$ -20096 -19526 -22137 -25830 -11507 -5360 -17190 -23521 -33695 -19587 -14905 -9467 -10969 -14090 -14409
14970a4409K522m032n17k39j1144N369R228J1251j391j343o80P767j078j0571
$$ -14409 -11887 -15919 -16436 -16675 -27819 -22450 -13222 -1971 -3362 -4705 -5385 2382 1304 -9267
14956i267J818P458j1659N490L985M382l943P126L705n5j6605l027j1272L45J4730
$$ -9267 -7449 9 -11650 -6160 -2175 2207 -1736 5390 9095 9040 -7565 -10592 -21864 -21519 -6789
14941f789P787J697q153r013K234l470l789J1439M010o567O085Q340j5514j192
$$ -6789 998 2695 -5458 -14471 -12237 -15707 -19496 -8057 -4047 -10614 -4529 3811 -11703 -12895
14927a2895J8376O77r603K202J4565k871k0743n288k043j1895L043K0565J0284
$$ -12895 5481 6158 -3445 -1243 13322 10451 -10292 -15580 -17623 -29518 -26475 -5910 4374
14914D374N453m150o941j3186Q553J1568L713J252m617K489M26l154Q025J749
$$ 4374 9827 5677 -1264 -14450 -5897 5671 9384 10636 6019 8508 8934 5780 13805 15554
14900A5554r842l702R99l764J1635K405p494j1419J745K414j810Q187L690o881
$$ 15554 5712 2010 3009 -755 10880 13285 5791 -5628 -3883 -1469 -3279 4908 8598 1717
14886A717N49o90m622p884J3227R648N929K745k210mr857n360R848N625l833j0513
$$ 1717 2266 1576 -3046 -10930 2297 11945 17874 20619 18409 18405 8548 3188 13036 18661 14828 4315
14870D315j4192P35L407Q464m80Q634J1324j7640j2251n475l31j205m926J0539
$$ 4315 -9877 -9142 -5735 2729 2249 10883 22207 4567 -7684 -13159 -13490 -14695 -19621 -9082
14856i082o321M455N836n365M306J0319L659m320q30n734j357J979K086K42J2762
$$ -9082 -15403 -10948 -5112 -10477 -6171 4148 7807 3487 2657 -3077 -4434 -2455 -369 -127 12635
14841A2635L166p486N41M559Q080j4072L039j563j9300j3644M802L920l057N706
$$ 12635 15801 8315 8856 13415 21495 7423 10462 8899 -10401 -24045 -19243 -15323 -18380 -12674
14827a2674J1961m2J086M018J3388j587n880m146k153p159n057j1970N459K1095
$$ -12674 -713 -755 331 4349 17737 16150 10270 6124 3971 -3188 -8245 -20215 -14756 6339
14813F339j894j0120n950l712N349P201j3798n214J1801l314p429J0491k374j0088
$$ 6339 4445 -5675 -11625 -15337 -9988 -2787 -16585 -21799 -9998 -13312 -20741 -10250 -12624 -22712
14799b2712j876o349R183K7931Q130k573N643j2959N129N542L316j8605j5448
$$ -22712 -24588 -30937 -21754 6177 14307 11734 17377 4418 9547 15089 18405 -200 -15648
14786a5648R60J4704J833n765K14n369J8381Q08j0468j408j918n686j5404n800
$$ -15648 -14688 16 1849 -3916 -3702 -9071 9310 10118 -350 -1758 -3676 -9362 -24766 -30566
14772c0566J4477R932Q058j0881P055p490O237Q76k683M44j2141k873j524P472
$$ -30566 -16089 -6157 1901 -8980 -1925 -9415 -3178 -2302 -4985 -4541 -16682 -19555 -21079 -13607
14758a3607K5219J114j1913k100J766M250O444j694r760j8001j749J0861J0396
$$ -13607 11612 12726 813 -1287 479 4729 11173 9479 -281 -18282 -20031 -9170 1226
14745A226l678r443J099J3911L283j2079P868N936L792J395l482m20j104p193
$$ 1226 -2452 -11895 -10796 3115 6398 -5681 2187 8123 11915 13310 9828 9408 8304 1111
14731A111n702m428J4344J385J523q29M703q30j9315j0822m454n817Q642r774
$$ 1111 -4591 -9019 5325 6710 8233 7404 12107 11277 -8038 -18860 -23314 -29131 -20489 -30263
14717c0263J4161P486P423j04M915N911J646r446k850Q712P222o688n686Q184
$$ -30263 -16102 -8616 -1193 -1297 3618 9529 11175 1729 -1121 7591 14813 8125 2439 10623
14703A0623j0402k415M81o382m069J1756N602k334j2854J268J2678O005L675l732
$$ 10623 221 -2194 -1713 -8095 -12164 -408 5194 2860 -9994 -8726 3952 9957 13632 9900
14689I900m553O778n319m779k515L355K777J5315j190K100O232n918Q705j677
$$ 9900 5347 12125 6806 2027 -488 2867 5644 20959 19769 21869 28101 22183 30888 29211
14675B9211l972j855k417n229J14k83O886k741m784r691p818Q204Q241l814L415
$$ 29211 25239 23384 20967 15738 15852 15569 22455 19714 14930 5239 -2579 5625 13866 10052 13467
14660A3467n185L921o504K305q503O134O16j155l822J6397k763j9698j3235L593
$$ 13467 8282 12203 5699 8004 -499 5635 6251 5096 1274 17671 14908 -4790 -18025 -14432
14646a4432Q669J1754j1262k3627O827R06O596J3088N043J1206J9252n955j7564
$$ -14432 -5763 5991 -5271 -28898 -22071 -21165 -14569 -1481 3562 14768 34020 28065 10501
14633A0501j7730o603J193N05J5677M898p51L022K8O339P65j2993o237l238n562
$$ 10501 -7229 -13832 -12639 -12134 3543 8441 7690 10712 10740 17079 17844 4851 -1386 -4624 -10186
14618a0186L856m749k1383J2548K3803o403r397n117N671Q95Q357l98j2298j8005
$$ -10186 -6330 -11079 -32462 -19914 3889 -2514 -11911 -17028 -11357 -10462 -2105 -2503 -14801 -32806
14604c2806P540J3346K926J4112K588P17m107m071P24k958q011K48M729j7554
$$ -32806 -25266 -11920 -8994 5118 7706 8423 4316 245 969 -1989 -10000 -9752 -5023 -22577
14590b2577K687J5006p225l172p406O075K307J552J3761J5210j3692j6814O304
$$ -22577 -19890 -4884 -12109 -15281 -22687 -16612 -14305 -12753 1008 16218 2526 -14288 -7984
14577g984J1862p293N69k67r658l446L920L454l028p973n60m472Q645K811J82
$$ -7984 3878 -3415 -2846 -3113 -12771 -16217 -12297 -8843 -11871 -19844 -20404 -24876 -16231 -13420 -13238
14562a3238P753j3036M496K364p301m866K1494N723n633N152J3953q720j4266
$$ -13238 -5485 -18521 -14025 -11661 -18962 -23828 -2334 3389 -2244 2908 16861 8141 -6125
14549f125o012j980P121M694j2542N190N671k507r535J1206J0000j2051p062l594
$$ -6125 -12137 -14117 -6996 -2302 -14844 -9654 -3983 -6490 -16025 -4819 5181 -6870 -13932 -17526
14535a7526P494l504j6347p70J1601P480N070Q3O38o124M47J2640O370q716r405
$$ -17526 -10032 -13536 -29883 -30653 -19052 -11572 -6502 -6419 -5781 -11905 -11458 1182 7552 -1164 -10569
14520a0569o222N690j8355j000J2959O676j0772K624Q812J2971Q102k77j2720
$$ -10569 -16791 -11101 -29456 -30456 -17497 -10821 -21593 -18969 -10157 2814 10916 10639 -2081
14507b081m383l816J357Q105J2049K442J617l099j2332j3797r13Q53N863L019
$$ -2081 -6464 -10280 -8923 -818 11231 13673 15290 12191 -141 -13938 -14851 -13998 -8135 -5116
14493e116L162o173J531J1976J1491l526O94l979l036n592J786n683m441L106
$$ -5116 -1954 -8127 -6596 5380 16871 13345 14039 10060 7024 1432 3218 -2465 -6906 -3800
14479c800p092p644K554P39p378J2175k684M455O59L653R135q049p799o722O684
$$ -3800 -10892 -18536 -15982 -15243 -22621 -10446 -13130 -8675 -8016 -4363 4772 -3277 -11076 -17798 -11114
14464a1114R385Q76M33P433J8K329n042j0919J1607m696p215M959k217j8204j406
$$ -11114 -1729 -853 -420 7013 7031 9360 4318 -6601 5006 310 -6905 -1946 -4163 -22367 -23773
14449b3773J7997J9259m168Q176O899M893j4478q54K772j0154j854m84J2601l779
$$ -23773 -5776 13483 9315 17491 24390 29283 14805 13951 16723 6569 4715 4231 16832 13053
14435A3053j9541J826o420q87Q450J3954K691j4997p948R005M478j173O015q351
$$ 13053 -6488 -4662 -11082 -11969 -3519 10435 13126 -1871 -9819 -814 3664 2491 8506 155
14421A55j3356P086J1843k938k384o001K913l964q318J1857J9170M494M996o068
$$ 155 -13201 -6115 5728 2790 406 -5595 -2682 -6646 -14964 -3107 16063 20557 25553 19485
14407A9485m550o315m679K765j1815p125l69L250J1456M113k344n783M470o070
$$ 19485 14935 8620 3941 6706 -5109 -12234 -12603 -9353 2103 6216 3872 -1911 2559 -3511
14393c511Q618o617j2672j439p332Q82J1932J1415k922m592M997j0359M330P082
$$ -3511 5107 -1510 -14182 -15621 -22953 -22071 -10139 1276 -1646 -6238 -1241 -11600 -7270 -188
14379a88J1989N010k560q640j6832R772O837m379j1025Q965J0604j083p21o595
$$ -188 11801 16811 14251 5611 -11221 -1449 5388 1009 -10016 -1051 9553 8470 7749 1154
14365A154K418N069j8340M857J3710J849L636m605p534k581o531P93P031l851
$$ 1154 3572 8641 -9699 -4842 8868 10717 14353 9748 2214 -367 -6898 -6105 926 -2925
14351b925n389K169j428j0970K162Q479r603o866J1963J0503K550r426M64Q057
$$ -2925 -8314 -6145 -7573 -18543 -16381 -7902 -17505 -24371 -12408 -1905 645 -8781 -8317 -260
14337b60M32j2489P805K259o226J1809O254k246q623o988R033j945j380l639n47
$$ -260 172 -12317 -4512 -2253 -8479 3330 9584 7338 -1285 -8273 760 -1185 -2565 -6204 -6751
14322f751r58L134l127M532R070N315L970q95j3703K436J2939r181j4763J1630
$$ -6751 -7709 -4575 -7702 -3170 5900 11215 15185 14290 587 3023 15962 6781 -7982 3648
14308C648P138q649m589m577p671Q259K611j715J020P850P460O071k677J534p075
$$ 3648 10786 2137 -2452 -7029 -14700 -6441 -3830 -5545 -4525 3325 10785 16856 14179 15713 8638
14293H638o393j5198r47J3581J3779j677K135j2834j3813j517O408O302K920l524
$$ 8638 2245 -12953 -13900 -319 13460 11783 13918 1084 -12729 -14246 -7838 -1536 1384 -2140
14279b140r972J18m05k568j971m314R928m878j178J2784k482r31k161Q007l500
$$ -2140 -12112 -11994 -12399 -14967 -16938 -21252 -11324 -16202 -17380 -4596 -7078 -8009 -10170 -2163 -5663
14264e663j2268J1040J2617J3791k784q481j0579J929J1981n794o065o252p79
$$ -5663 -17931 -6891 5726 19517 16733 8252 -2327 -398 11583 5789 -276 -6528 -7307
14251g307N249R917J568J854j85m485R449J3885j1779K227L560l232p965j2412
$$ -7307 -2058 7859 9427 11281 11096 6611 16060 29945 18166 20393 23953 20721 12756 344
14237C44k0119j895J4832K19L297K976P839R70k125R741p224j2132l154J167P92
$$ 344 -19775 -21670 -6838 -6619 -3322 -346 7493 8463 6338 16079 8855 -3277 -6431 -5264 -4472
14222d472J3670m110k409Q235J866l083j4790j73J870M946o258j0655J372R986
$$ -4472 9198 5088 2679 10914 12780 9697 -5093 -5266 -3396 1550 -4708 -15363 -13991 -4005
14208d005J492l027j3021P697R637k247N50K134J427M851l749n210L308q293j6314
$$ -4005 -2513 -5540 -18561 -10864 -1227 -3474 -2924 -790 637 5488 1739 -3471 -163 -8456 -24770
14193b4770j1193k638k244O323J6173l297J2665J3935n550j1580p927j1054l943
$$ -24770 -35963 -38601 -40845 -34522 -18349 -21646 -8981 4954 -596 -12176 -20103 -31157 -35100
14180c5100Q683J7960k587L20L022j316O67K2890R782m476L138O773j100j5814
$$ -35100 -26417 -8457 -11044 -10724 -7702 -9018 -8351 14539 24321 19845 22983 29756 28656 12842
14166A2842j2109j337O360k3O270O609j2724o902J2685J2807M883m683j0571J454
$$ 12842 733 -604 5756 5733 12003 18612 5888 -1014 11671 24478 29361 24678 14107 15561
14152A5561J7912j8733J0762Q984q422j1731m673k20J0590k485r429j1161J575
$$ 15561 33473 14740 25502 34486 26064 14333 9660 9440 20030 17545 8116 -3045 -1470
14139a470M141N568m405j3897p682R330J0142n750r676k3878J5130K1447O557
$$ -1470 2671 8239 3834 -10063 -17745 -8415 1727 -4023 -13699 -37577 -22447 -1000 5557
14126E557M670J1292R58j0625O874N371l075k6023k5347J224J8570N474l277J863
$$ 5557 10227 21519 22477 11852 18726 24097 21022 -5001 -30348 -29124 -10554 -5080 -8357 -6494
14112f494p467r959P05J7022j722p504k896Q544m25N995J36J939K267N37l558
$$ -6494 -13961 -23920 -23215 -6193 -7915 -15419 -18315 -9771 -10196 -4201 -4065 -2126 141 678 -2880
14097b880J671L121j330l960J593J147J0411K326k017j2292k807J416J911J0516
$$ -2880 -1209 1912 582 -3378 -1785 -638 9773 12099 10082 -2210 -5017 -3601 -1690 8826
14083H826j046k472p181m468q198J104J560K995m404N85o941o551o424J205O985
$$ 8826 7780 5308 -1873 -6341 -14539 -13435 -11875 -8880 -13284 -12699 -19640 -26191 -32615 -31410 -24425
14068b4425O598J3208N331k901j1421Q81J0723R704J2968n665j4328M18l006n411
$$ -24425 -17827 -4619 712 -2189 -13610 -12729 -2006 7698 20666 15001 673 1091 -1915 -7326
14054g326J4931o663n122m49J5214m062q158q567O551P674l794R521J0422j8566
$$ -7326 7605 942 -4180 -4629 10585 6523 -1635 -10202 -3651 4023 229 9750 20172 1606
14040A606j835l240o920q581M733l465N283R664k228J2288J3583m296j5113j974
$$ 1606 -229 -3469 -10389 -18970 -14237 -17702 -12419 -2755 -4983 7305 20888 16592 1479 -495
14026d95Q973M636R987l510r898p441Q100j129r298K546o939l919R938N207M764
$$ -495 8478 13114 23101 19591 9693 2252 10352 9223 -75 2471 -4468 -8387 1551 6758 11522
14011A1522J4362j5241j6291j2437n791J1982J393J0381J2539K150j371O86J857
$$ 11522 25884 10643 -5648 -18085 -23876 -11894 -10501 -120 12419 14569 13198 13884 15741
13998A5741J2278k740m842o08j1429l430P683K99j0968j397N620p203k1283Q28
$$ 15741 28019 25279 20437 19829 8400 4970 12653 12952 1984 587 6207 -996 -22279 -21451
13984b1451K4816J3448l53n977r049L27J4675L809l814O25p599P272o286k1346
$$ -21451 3365 16813 16460 10483 1434 1761 16436 20245 16431 17056 9457 16729 10443 -10903
13970a0903J0419K3686M207R343p310l809n67j0497j1625R795R482r373r089n571
$$ -10903 -484 23202 27409 36752 29442 25633 25066 14569 2944 12739 22221 12848 3759 -1812
13956a812N672K433j0340J488M580j1416n814Q019j763m14J0883Q034r189p936
$$ -1812 3860 6293 -4047 -2559 2021 -9395 -15209 -7190 -8953 -9367 1516 9550 361 -7575
13942g575O441k276m345Q967J5310J3508M690j0624n371j3609j194O470L737q185
$$ -7575 -1134 -3410 -7755 1212 16522 30030 34720 24096 18725 5116 3922 10392 14129 5944
13928E944q114j6525O799O185j782L79P309J2258P461J890n095o360K549M803
$$ 5944 -2170 -18695 -11896 -5711 -7493 -7114 195 12453 19914 21804 16709 10349 12898 17701
13914A7701p630m465J8118O099k731m669j4469p024P387R104o79j2330k1815q73
$$ 17701 10071 5606 23724 29823 27092 22423 7954 930 8317 17421 16742 4412 -17403 -18276
13900a8276J1887K086m813p11P348J6390j42j2121M205n199p53k3025n411J5759
$$ -18276 -6389 -4303 -9116 -9827 -2479 13911 13769 1648 5853 654 -99 -23124 -28535 -12776
13886a2776P962J2128R905K857J908j0169j7968p146N742P93J6971K0204k831
$$ -12776 -4814 7314 17219 20076 21984 11815 -6153 -13299 -7557 -6764 10207 30411 27580
13873B7580m944q05k0126j2084J1696J3735j147J585n479n803Q816N296o361j5631
$$ 27580 22636 21831 1705 -10379 1317 15052 13905 15490 10011 4208 13024 18320 11959 -3672
13859c672j2318O227Q234P108j3406n404j1023q848K2399K0362M179j284k495
$$ -3672 -15990 -9763 -1529 5579 -7827 -13231 -24254 -33102 -10703 9659 13838 12554 10059
13846A0059O453n729j1577j223L291J316P710l762j5471j4039j0958k925K4912
$$ 10059 16512 10783 -794 -2017 1274 2590 10300 6538 -8933 -22972 -33930 -36855 -11943
13833a1943J6675j3091j3124N707J8771P507j607O016R563p961o037n388j119
$$ -11943 4732 -8359 -21483 -15776 2995 10502 8895 14911 24474 16513 10476 5088 3969
13820C969r382j153n665p029K121j80n384l950K088Q890J8991N050j5423o249
$$ 3969 -5413 -6566 -12231 -19260 -17139 -17319 -22703 -26653 -24565 -15675 3316 8366 -7057 -13306
13806a3306J5805O968q609q396j3118m564J5586J7189M171l509q389j7060j1560
$$ -13306 2499 9467 858 -7538 -20656 -25220 -9634 7555 11726 8217 -172 -17232 -28792
13793b8792o924J9551R150K980k157m870n166j616J9409J9426L507j3759k3261
$$ -28792 -35716 -16165 -7015 -4035 -6192 -11062 -16228 -17844 1565 20991 24498 10739 -12522
13780a2522m942J8801Q892M237p27r701p765J2762k508l538K273j2336k3524J2639
$$ -12522 -17464 1337 10229 14466 13739 4038 -3727 9035 6527 2989 5262 -7074 -30598 -17959
13766a7959J9080m383j2677o397J136P042J8216M25m444j2150l36j4287J42P723
$$ -17959 1121 -3262 -15939 -22336 -21200 -14158 4058 4483 39 -12111 -12447 -26734 -26592 -18869
13752a8869L279R04m624j2885J0033J1718J634k669M738J5855J1139J0r789p294
$$ -18869 -15590 -14686 -19310 -32195 -22162 -10444 -8810 -11479 -6741 9114 20253 20263 10474 3180
13738C180K375n264O565K0177N853q065r503K228P957j88p764j266k036l852K967
$$ 3180 5555 291 6856 27033 32886 24821 15318 17546 25503 25315 17551 16285 14249 10397 13364
13723A3364m207r935n101j921j186K0867Q606K955j5966o684K876l898j7312J839
$$ 13364 9157 -778 -5879 -7800 -8986 11881 20487 23442 7476 792 3668 -230 -17542 -15703
13709a5703J869k373m681Q304J2275J8765J6796q797j0107M29n661j2864n181
$$ -15703 -13834 -16207 -20888 -12584 -309 18456 35252 26455 16348 16777 11116 -1748 -6929
13696f929j2704k697K2868j501j268R349N433n784J024m604r732n5N257J0405
$$ -6929 -19633 -22330 538 -963 -2231 7118 12551 6767 7791 3187 -6545 -6600 -1343 9062
13682I062l214m523k668J0470J826j1300j2265l954K756J1341N578j971l045P326
$$ 9062 5848 1325 -1343 9127 10953 -347 -12612 -16566 -13810 -2469 3109 1138 -1907 5419
13668E419k710m641o468M229K793m027K78L205k925j2430P176J9958M91J1944
$$ 5419 2709 -1932 -8400 -4171 -1378 -5405 -5127 -1922 -4847 -17277 -10101 9857 10348 22292
13654B2292m078j6775k0233k482M487J0269M942k898r380L964M230r705K3352
$$ 22292 18214 1439 -18794 -21276 -16789 -6520 -1578 -4476 -13856 -9892 -5662 -15367 7985
13641G985J0336o076o681O442K4359k706k2161k4549O76J9729O708r720l032J2053
$$ 7985 18321 12245 5564 12006 36365 33659 11498 -13051 -12375 7354 14062 4342 1310 13363
13627A3363p906j4367n035P665R023J8694K260p717j8006r140l28j5211n562J1471
$$ 13363 5457 -8910 -13945 -6280 2743 21437 23697 15980 -2026 -11166 -11494 -26705 -32267 -20796
13613b0796j502J1016q342m906Q122K594K538K37J501j274L110J7850n741j0452
$$ -20796 -22298 -11282 -19624 -24530 -16408 -13814 -11276 -11039 -9538 -10812 -7702 10148 4407 -6045
13599f045l649n546Q76k470J1713J1294j6496J15L881P17N928J1637j991q141
$$ -6045 -9694 -15240 -14364 -16834 -5121 6173 -10323 -10208 -6327 -5610 318 11955 9964 1823
13585A823N023J9768j4210r359R634J2095K595j3139j3628l000l503m904P041
$$ 1823 6846 26614 12404 3045 12679 24774 27369 14230 602 -2398 -5901 -10805 -3764
13572c764N121K346o182J526o695q793J8443J1164j277j5566j627m569q019L217
$$ -3764 1357 3703 -2479 -953 -7648 -16441 2002 13166 11889 -3677 -5304 -9873 -17892 -14675
13558a4675J6530n603j0860O33N702L098k391p532l275l079J2531J1491o32j860
$$ -14675 1855 -3748 -14608 -13975 -8273 -5175 -7566 -15098 -18373 -21452 -8921 2570 1938 78
13544G8o628K589p22N885n777j2546J4323N219j1407j0283n25K625k86J3194L423
$$ 78 -6550 -3961 -4683 1202 -4575 -17121 -2798 2421 -8986 -19269 -19794 -17169 -17455 -4261 -838
13529h38R519j3712l853P068N648q076k0480L608O303L020l253J205O76q704j3594
$$ -838 8681 -5031 -8884 -1816 3832 -4244 -24724 -21116 -14813 -11793 -15046 -13841 -13165 -21869 -35463
13514c5463M761N529O132M609N626m932m050J7729J4926M777j2267R904K711j5968
$$ -35463 -30702 -25173 -19041 -14432 -8806 -13738 -17788 -59 14867 19644 7377 17281 19992 4024
13500D024k205K100o750q023n193M379l97k335J9617J6452O13j4597j2768M065
$$ 4024 1819 3919 -2831 -10854 -16047 -11668 -12065 -14400 5217 21669 22282 7685 -5083 -1018
13486a018J6701O921r352q917o155N605N381j0421j0099J527k317K759m481M950
$$ -1018 15683 22604 13252 4335 -1820 3785 9166 -1255 -11354 -9827 -12144 -9385 -13866 -8916
13472h916J869o267L972J3315K782j8796N019R931J864q216l608N021o571p856
$$ -8916 -7047 -13314 -9342 3973 6755 -12041 -7022 2909 4773 -3443 -7051 -2030 -8601 -16457
13458a6457J2111M957m508J1764k534j2255J3908J7380k869n427j8317k057Q06
$$ -16457 -4346 611 -3897 7867 5333 -6922 6986 24366 21497 16070 -2247 -4304 -3498
13445c498N22Q432l206p610o55p266J5672P91r909j661j442J4595p032j0928K276
$$ -3498 -2976 5456 2250 -5360 -6015 -13281 2391 3182 -6727 -8388 -9830 4765 -2267 -13195 -10919
13430a0919o468q24J2857o405M624J4927L074r865p370k720J81J998j118j0457
$$ -10919 -17387 -18211 -5354 -11759 -7135 7792 10866 1001 -6369 -9089 -8908 -6910 -8028 -18485
13416a8485P76o375L846J5212J4646m655K032j2259r005m524j370O667Q785o287
$$ -18485 -17709 -24084 -20238 -5026 9620 4965 6997 -5262 -14267 -18791 -20161 -13494 -4709 -10996
13402a0996n768Q751k13j1304j0304N342J304K113L268Q570J4508l929j221M303
$$ -10996 -16764 -8013 -8226 -19530 -29834 -24492 -23188 -21075 -17807 -9237 5271 1342 121 4424
13388D424R2q88o141R72p21j244p945p047K596l471R085L637Q889j004j0355r119
$$ 4424 4516 3628 -2513 -1541 -2262 -3506 -11451 -18498 -15902 -19373 -10288 -6651 2238 1234 -9121 -18240
13372a8240j106L507j464j772m40l4k753L68n298J937J7041N269J5891l303n400
$$ -18240 -19346 -15839 -17303 -19075 -19515 -19549 -22302 -21934 -27232 -25295 -8254 -2985 12906 9603 4203
13357D203J612l399o035P969k819l77m693M784k739l141Q22M505l222j5312K254
$$ 4203 5815 2416 -3619 4350 1531 1154 -3539 1245 -1494 -4635 -3813 692 -2530 -17842 -15588
13342a5588K4000J2612m648j3356j4366N430J0079n40j1769M645R542O544o611
$$ -15588 8412 21024 16376 3020 -11346 -5916 4163 3623 -8146 -3501 6041 12585 5974
13329E974j3053L938J2448o009M511Q799j0253j1145M806M299K668k312j0424
$$ 5974 -7079 -3141 9307 3298 7809 16608 6355 -4790 16 4315 6983 4671 -5753
13316e753n005K990M328o538p656K526R597j0712K650J1653J4415l151p127p543
$$ -5753 -10758 -7768 -3440 -9978 -17634 -15108 -5511 -16223 -13573 -1920 12495 9344 2217 -5326
13302e326L375r703n396j318J5458P496j5699j883J2901J294j122j725j042L880
$$ -5326 -1951 -11654 -17050 -18368 -2910 4586 -11113 -12996 -95 1199 77 -1648 -2690 1190
13288A190J8424l6j2689M483O765j4295l635L414k697j4442o104R060N442J4607
$$ 1190 19614 19578 6889 11372 18137 3842 207 3621 924 -13518 -19622 -10562 -5120 9487
13274I487J1015n575r26k375j8811j9403P946K2058J1089k545l607q628k281Q673
$$ 9487 20502 14927 14001 11626 -7185 -26588 -18642 3416 14505 11960 8353 -275 -2556 6117
13260F117J0818n937n528k868N437J8060J040k5537j1750P829J683k410P416N411
$$ 6117 16935 10998 5470 2602 8039 26099 27139 1602 -10148 -2319 -636 -3046 4370 9781
13246I781r2N168P20l182J882m584q254L387J979j671q241j1745L296K1643J6490
$$ 9781 9689 14857 15577 12395 14277 9693 1439 4826 6805 5134 -3107 -14852 -11556 10087 26577
13231B6577n501K503n307k1295j1335M796r90P501L515n925k338L075j260K335
$$ 26577 21076 23579 18272 -3023 -14358 -9562 -10552 -3051 464 -5461 -7799 -4724 -5984 -3649
13217c649P271k074P361J5615l339m87p798M799Q667j711j5288j6104L430N733
$$ -3649 3622 1548 8909 24524 21185 20698 12900 17699 26366 24655 9367 -6737 -3307 2426
13203B426P65q772l340O341l416r100J79p538Q688R359n40nJ3432J3197l160m679
$$ 2426 3191 -5581 -8921 -2580 -5996 -15096 -14917 -22455 -13767 -4408 -4948 -4953 8479 21676 18516 13837
13187A3837j0136K302J2453p963n966N116j8863r267M692J5392Q333j565O341
$$ 13837 3701 6003 18456 10493 4527 9643 -9220 -18487 -13795 1597 9930 8365 14706
13174A4706J0537r849j0907j7066L82O74N950q315M741J955r65O533N224P625
$$ 14706 25243 15394 4487 -12579 -12197 -11523 -5573 -13888 -9147 -7192 -8157 -1624 3600 11225
13160A1225j0146l220L904K970k2717m529J64O470J5132M099N690J6461m830q498
$$ 11225 1079 -2141 1763 4733 -17984 -22513 -22349 -15879 -747 3352 9042 25503 20673 12175
13146A2175j3605L174P022j949J3181J119k0006j5517K905j391P943J7454J2449
$$ 12175 -1430 1744 8766 6817 19998 21117 1111 -14406 -11501 -12892 -4949 12505 24954
13133B4954L877j1004j0717k4o833o953l10R295O165L515L93M153l68K530J484
$$ 24954 28831 17827 7110 7086 253 -6700 -7010 2285 8450 11965 12358 16511 16143 18673 20157
13118B0157o779j1990j1682m551l323J5572J0684J7155l372l960j0984q008J0258
$$ 20157 13378 1388 -10294 -14845 -18168 -2596 8088 25243 21871 17911 6927 -1081 9177
13105I177K343P718J2397r330j9565P30K3k651m087K122m029N653m796N052q73
$$ 9177 11520 19238 31635 22305 2740 3470 3493 842 -3245 -1123 -5152 501 -4295 757 -116
13090a16k654q736J34M919p006n50r8J0214O209j676P636O346k688Q27m202l670
$$ -116 -2770 -11506 -11372 -6453 -13459 -14009 -14107 -3893 2316 640 8276 14622 11934 12761 8559 4889
13074D889q184o905j0687J0368J3797O27P548r779M75n28j810m83P148J1555j1963
$$ 4889 -3295 -10200 -20887 -10519 3278 3905 11453 1674 2149 1621 -189 -672 6476 18031 6068
13059F068L92J1290q37k3140j025N228O413J0544K285O51l065j1250M669J5704
$$ 6068 6460 17750 16913 -6227 -7252 -2024 4389 14933 17218 17869 14804 3554 8223 23927
13045B3927j525N906M603j2556q357R000k17Q985k775j1699j5018l137m935r75
$$ 23927 22402 28308 32911 20355 11998 20998 20781 29766 26991 15292 274 -2863 -7798 -8773
13031h773R078L771K302O957K459k436l57q137m63m736J1444m31P001m395Q542
$$ -8773 305 4076 6378 13335 15794 13358 13001 4864 4401 -335 11109 10678 17679 13284 21826
13016B1826m822K702p260j7087l0L651k645Q772J2529p357j6928j1466M892R566
$$ 21826 17004 19706 12446 -4641 -4671 -1020 -3665 5107 17636 10279 -6649 -18115 -13223 -3657
13002c657J0372M604J406P063Q554N063j3025j2301k051o553M246J1940j5990
$$ -3657 6715 11319 12725 19788 28342 33405 20380 8079 6028 -525 3721 15661 -329
12989c29j6526O380m33q419R82J3253J2643K3994m349k1369j6880j89k201M472
$$ -329 -16855 -10475 -10908 -19327 -18345 -5092 7551 31545 27196 5827 -11053 -11242 -13443 -8971
12975h971j346k333j415p17m531R800O373q868L906K2640j001L191P270j6289
$$ -8971 -10317 -12650 -14065 -14782 -19313 -9513 -3140 -12008 -8102 14538 13537 16728 23998 7709
12961G709K55N54J531j5j471l010j3347l431j463j0596L524J0418Q323n131R898
$$ 7709 7964 8518 10049 10034 8563 5553 -7794 -11225 -12688 -23284 -19760 -9342 -1019 -6150 3748
12946C748K20k601K15q18j6369j2065N854R749m81J896j946J1092p475L925N965
$$ 3748 3968 1367 1582 764 -15605 -27670 -21816 -12067 -12548 -10652 -12598 -1506 -8981 -5056 909
12931I09Q703O582j7096m399R837j004l120m160N688P855k82M843R184J852o404
$$ 909 9612 16194 -902 -5301 4536 3532 412 -3748 1940 9795 9513 14356 23540 25392 18988
12916A8988p699j4631j038p812J401O232J8155L017l87n012j0365n480K134R909
$$ 18988 11289 -3342 -4380 -12192 -10791 -4559 13596 16613 16226 11214 849 -4631 -2497 7412
12902G412J655K292m428J2822J9997n318k1643j3452j3629M413J0636n573j2065
$$ 7412 9067 11359 6931 19753 39750 34432 12789 -663 -14292 -9879 757 -4816 -16881
12889a6881N107j793Q173O895n110p328K840j5114l447J2947m091p194J534q386
$$ -16881 -11774 -13567 -5394 1501 -3609 -10937 -8097 -23211 -26658 -13711 -17802 -24996 -23462 -31848
12875c1848J140n368q567J394K1007J5562N492N491m314q197O526l35L472M710
$$ -31848 -30708 -36076 -44643 -43249 -22242 -6680 -1188 4303 -11 -8208 -1682 -2017 1455 6165
12861F165M211q045K336l809l07L285k74J646M768M242n136K712j2917j8127Q4
$$ 6165 10376 2331 4667 858 551 3836 3562 5208 9976 14218 9082 11794 -1123 -19250 -19166
12846a9166O456J7925K801K334N158K405k660j408p343j71j181j2399j0014n48
$$ -19166 -12710 5215 8016 10350 15508 17913 15253 13845 6502 6331 5150 -7249 -17263 -17811
12832a7811j5138j9117J4049K0100J0566J5122o827r944o64M900O78l839m299
$$ -17811 -32949 -52066 -38017 -17917 -7351 7771 944 -9000 -9664 -4764 -4086 -7925 -12224
12819a2224J0399J8143J0261r547J072k7056j7744L347j782o712R449J5904J1591
$$ -12224 -1825 16318 26579 17032 18104 -8952 -26696 -23349 -25131 -31843 -22394 -6490 5101
12806E101l81J4942N405j7837R0j2569p257J1895m167m083n805K372K0343l081
$$ 5101 4720 19662 25067 7230 7320 -5249 -12506 -611 -4778 -8861 -14666 -12294 8049 4968
12792D968j3788J219P484J243L462O93N098j2791k167P38J448J2065r477k4508
$$ 4968 -8820 -7601 -117 1126 4588 5281 10379 -2412 -4579 -3841 -2393 9672 195 -24313
12778b4313M243P508j796R518J721p159J987R396K269P17p334J029N195n422q978
$$ -24313 -20070 -12562 -14358 -4840 -3119 -10278 -8291 1105 3374 4091 -3243 -2214 2981 -2441 -11419
12763a1419l598o907k982K8619J5432k797m720n823k125O61j2503m244N445M673
$$ -11419 -15017 -21924 -24906 3713 19145 16348 11628 5805 3680 4341 -8162 -12406 -6961 -2288
12749b288n813R863o841J274J3775l983j8455n458N404j09P381l805q793m457
$$ -2288 -8101 1762 -5079 -3805 9970 5987 -12468 -17926 -12522 -12631 -5250 -9055 -17848 -22305
12735b2305J25N319J4990J8694J6048j2430k0669j2574j0608j3658J9161J5122
$$ -22305 -22180 -16861 -1871 16823 32871 20441 -228 -12802 -23410 -37068 -17907 -2785
12723b785j0223q711L195K1923k71j2183j0506J1081J0748J8052m169j4960q130
$$ -2785 -13008 -21719 -18524 3399 3128 -9055 -19561 -8480 2268 20320 16151 1191 -6939
12710f939o088l98J0545j0036k507J2339K829l278J0674J738j1922o527M605J0626
$$ -6939 -13027 -13425 -2880 -12916 -15423 -3084 -255 -3533 7141 8879 -3043 -9570 -4965 5661
12696E661Q7k643j8436j2378q102k779O55J0754M053R776J1816N831k104Q23Q82
$$ 5661 5748 3105 -15331 -27709 -35811 -38590 -37935 -27181 -23128 -13352 -1536 4295 2191 3014 3896
12681C896j1506j2264J078R409O882R435M658j3297k5593j3526N80J3856J3576
$$ 3896 -7610 -19874 -18796 -9387 -2505 6930 11588 -1709 -27302 -40828 -40248 -26392 -12816
12668a2816K499Q744M499K1996l544j4969p319M003r84j4671j2900k131O695J6638
$$ -12816 -10317 -1573 2926 24922 21378 6409 -910 3093 2109 -12562 -25462 -27593 -20898 -4260
12654d260J1464p63J580J782J894o785j0045k457q591j753J4906J6521p327j1685
$$ -4260 7204 6441 8021 9803 11697 4912 -5133 -7590 -16181 -17934 -3028 13493 6166 -5519
12640e519o398L938n963m317p655p43O148J1124P449M172l585j1932J065l26J778
$$ -5519 -11917 -7979 -13942 -18259 -25914 -26657 -20509 -9385 -1936 2236 -1349 -13281 -12216 -12542 -10764
12625a0764k309m570K476J8o759k942P928P402o739J4063M381p29l643L544q628
$$ -10764 -13073 -17643 -15167 -15149 -21908 -24850 -16922 -9520 -16259 -2196 2185 1456 -2187 1357 -7271
12610g271k314n359j1948N712M420R084J554p632l714n072M005J1334J0301J0583
$$ -7271 -9585 -14944 -26892 -21180 -16760 -7676 -6122 -13754 -17468 -22540 -18535 -7201 3100 13683
12596A3683j002l875j7979q988J1133Q066o061l805k46R207J7389j90j7771q223
$$ 13683 12681 8806 -9173 -18161 -7028 1038 -5023 -8828 -9074 133 17522 17332 -439 -8662
12582h662P977L098J2078j1767J202j824n726N239K362m375j3991L307J1043K017
$$ -8662 -685 2413 14491 2724 3926 2102 -3624 1615 3977 -398 -14389 -11082 -39 1978
12568A978k945o590L999N026Q712P726p082p762R0K454Q352O597o291j0916J940
$$ 1978 -967 -7557 -3558 1468 10180 17906 10824 3062 3152 5606 13958 20555 14264 3348 5288
12553E288N057J155K709P259o519o109j5588j830P959N007n324P087O392j0661
$$ 5288 10345 11500 14209 21468 14949 8840 -6748 -8578 -619 4388 -936 6151 12543 1882
12539A882l204o07J774L400l518j9873o471J274M382J6211O682j0953q162J2154
$$ 1882 -1322 -1929 -155 3245 -273 -20146 -26617 -25343 -20961 -4750 1932 -9021 -17183 -5029
12525e029J1977n203o143J903R960n174r429j0348M138m526r93J786J0836P412
$$ -5029 6948 1745 -4398 -2495 7465 2291 -7138 -17486 -13348 -17874 -18867 -17081 -6245 1167
12511A167L227q84k888O059P323j4572p864J63K887j2022J0593N688r300K0647
$$ 1167 4394 3510 622 6681 14004 -568 -8432 -8269 -5382 -17404 -6811 -1123 -10423 10224
12497A0224J730L738K179J497j1854j4626L32N785j0476k539N42O89l538J900
$$ 10224 11954 15692 17871 19368 7514 -7112 -6780 -995 -11471 -14010 -13468 -12779 -16317 -14417
12483a4417M03L107J0819j876p604j1136k534M593J4228J1976P255l249m805m99
$$ -14417 -14014 -10907 -88 -1964 -9568 -20704 -23238 -18645 -4417 7559 14814 11565 6760 6261
12469F261o497r456r46j54k011N423k816N101J73p622o247K873R873K428P625
$$ 6261 -236 -9692 -10638 -10792 -12803 -7380 -10196 -5095 -4922 -12544 -18791 -15918 -6045 -3617 4008
12454D008m908R75j73K793N067j4384M865J3905Q078k0714j5663p296P807J1265
$$ 4008 -900 75 -98 2695 7762 -6622 -1757 12148 20226 -488 -16151 -23447 -15640 -4375
12440d375O255o560o708L344M35p548q70j465k599K158L045p767o167l622j3220
$$ -4375 1880 -4680 -11388 -8044 -7609 -15157 -16027 -17492 -20091 -17933 -14888 -22655 -28822 -32444 -45664
12425d5664j770J0474Q983J2828n83K534J0551r516j5309N857J676l988J3027
$$ -45664 -47434 -36960 -27977 -15149 -15732 -13198 -2647 -12163 -27472 -21615 -19939 -23927 -10900
12412a0900J2164k793Q264J0637K435j7728k897r314j0041O484q773k506R430
$$ -10900 1264 -1529 6735 17372 19807 2079 -818 -10132 -20173 -13689 -22462 -24968 -15538
12399a5538K671k445k028J4241J3245j15j2250k95O436n113J966n616l506M196
$$ -15538 -12867 -15312 -17340 -3099 10146 10031 -2219 -2514 3922 -1191 775 -4841 -8347 -4151
12385d151O570P800k778j7890j01J1498q468l941J3081J7210P702j0513j3204
$$ -4151 2419 10219 7441 -10449 -10550 948 -7520 -11461 1620 18830 26532 16019 2815
12372B815j1047r578K751Q230N281J0357j6466p160J0169L507j5292N63J1736
$$ 2815 -8232 -17810 -15059 -6829 -1548 8809 -7657 -14817 -4648 -1141 -16433 -15870 -4134
12359d134J0851m000l954N060p545m552K967Q103J6576K380j0275j2369K699j782
$$ -4134 6717 2717 -1237 3823 -3722 -8274 -5307 2796 19372 21752 11477 -892 1807 25
12345B5J425m17J529l428M84l575j386Q167o106O604J8404j157j6298o945L679
$$ 25 1450 1033 2562 -866 -382 -3957 -5343 2824 -3282 3322 21726 20569 4271 -2674 1005
12330A005L190P75m854n892k684J0391J0637J575k407j3980P440j201k1735j4848
$$ 1005 4195 4970 116 -5776 -8460 1931 12568 14143 11736 -2244 5196 3995 -17740 -32588
12316c2588j231J1342J8792J4081j0153j1817j438l777o885j223N720J5288R329
$$ -32588 -33819 -22477 -3685 10396 243 -11574 -13012 -16789 -23674 -24897 -19177 -3889 5440
12303E440m629j3204m882L029m549p105J5918J2666R38j655q052Q033O668M499
$$ 5440 811 -12393 -17275 -14246 -18795 -25900 -9982 2684 3622 1967 -6085 1948 8616 13115
12289A3115o318J43k960J0160K663o373M81n017O425q41J967q553k10m652P559
$$ 13115 6797 6940 3980 14140 16803 10430 10911 5894 12319 11478 13445 4892 4682 30 7589
12274G589R901J0649l265j0325q824j3006J496l111j1794p789J7050O921k372
$$ 7589 17490 28139 24874 14549 5725 -7281 -5785 -8896 -20690 -28479 -11429 -4508 -6880
12261f880l525O848J1882p822j6852m974M549P677M692O011k763k508Q364N317
$$ -6880 -10405 -3557 8325 503 -16349 -21323 -16774 -9097 -4405 1606 -1157 -3665 4699 10016
12247A0016K93o270j273m010l474n974j676o191n184P480M338M515j0655J3826
$$ 10016 10309 4039 2766 -1244 -4718 -10692 -12368 -18559 -23743 -16263 -11925 -7410 -18065 -4239
12233d239K5355N031p731j0400J6808L791j161j7179K905J2838J4910K739K0647
$$ -4239 21116 26147 18416 8016 24824 28615 27454 10275 13180 26018 40928 43667 64314
12220F4314N040K825J3882j8123k1168j5539N986O918k2549l510n700k267P748
$$ 64314 69354 72179 86061 67938 46770 31231 37217 44135 21586 18076 12376 10109 17857
12207A7857J0452M226q223r511M325R033O238n455q196J0748P248N318j5460Q231
$$ 17857 28309 32535 24312 14801 19126 28159 34397 28942 20746 31494 38742 44060 28600 36831
12193C6831N251j7430o968n091k014n451m321M636N46R375K20J713k515q974L461
$$ 36831 42082 24652 17684 12593 10579 5128 807 5443 5989 15364 15584 17297 14782 5808 9269
12178I269K3012J48J009q750J0869J1842k839j3196k253q568q520n54k901M986
$$ 9269 32281 32429 33438 24688 35557 47399 44560 31364 29111 20543 12023 11469 8568 13554
12164A3554O832j1731j0656Q076N150N469j590k4431j3527k03o164J4698K3301
$$ 13554 20386 8655 -2001 6075 11225 16694 15104 -9327 -22854 -23057 -29221 -14523 8778
12151H778K967Q171J0054O492O723L296q634j127j2904q139j3178J408K5730K5601
$$ 8778 11745 19916 29970 36462 43185 46481 37847 36720 23816 15677 2499 3907 29637 55238
12137E5238M190J193P536R356P54J8440M1290L5531M4769M0852N4496O3130M3798
$$ 55238 59428 60621 68157 77513 78267 96707 137997 173528 218297 259149 313645 376775 420573
12124D20573M0465K8475L4733K7816J9085o696J002O70m1k0146n2495n5276o2241
$$ 420573 461038 489513 524246 552062 571147 564451 565453 566123 566082 545936 493441 438165 375924
12111C75924n9656l9623m5904l7469j7084j8919k8876k1983j3950P646j9351m993
$$ 375924 316268 276645 230741 193272 176188 157269 128393 106410 92460 100106 80755 75762
12099G5762O366p402j0344P887J0742J2295P19p544p360j8960n060m332M631n452
$$ 75762 82128 74726 64382 72269 83011 95306 96025 88481 81121 62161 57101 52769 57400 51948
12085E1948J955J191n994m463Q745k903Q699J8440j2847j7269k564n3R798o055
$$ 51948 53903 55094 49100 44637 53382 50479 59178 77618 64771 47502 44938 44885 54683 48628
12071D8628J393o989p058j716J5470J1179N132m902j786k955L838Q269J1387M456
$$ 48628 50021 43032 35974 34258 49728 60907 66039 61137 59351 56396 60234 68503 79890 84346
12057H4346r151k483P557M63m672k664K598O801K516K460J0151l727q107K0012
$$ 84346 75195 72712 80269 80732 76060 73396 75994 82795 85311 87771 97922 94195 86088 106100
12043A06100O532K282J92j2359M793K04j1458k618P221P787Q044k080q664k460
$$ 106100 112632 114914 115106 102747 107540 107744 96286 93668 100889 108676 116720 114640 105976 103516
12029A03516Q141J8239J1035o003P249P757j606R034J4398O907J1372L224N166
$$ 103516 111657 129896 140931 134928 142177 149934 148328 157362 171760 178667 190039 193263 198429
12016A98429k396K43M472K878k050M809J3016J6850K8650L6204K6453J3669J5420
$$ 198429 196033 196276 200748 203626 201576 206385 219401 236251 264901 301105 327558 341227 356647
12003C56647K7536K4101L1662M2656L6464K4262L2225L2253K5877N0385N1969
$$ 356647 384183 408284 439946 482602 519066 543328 575553 607806 633683 684068 736037
11992G36037N7615P5620P2354O7805P6619J13479J21769J41410J53377K10971
$$ 736037 793652 869272 941626 1009431 1086050 1199529 1321298 1462708 1616085 1827056
11982A827056K69100L30503L78916M51138N65124P16613R28286J244473J750582
$$ 1827056 2096156 2426659 2805575 3256713 3821837 4538450 5466736 6711209 8461791
11973H461791K514725L759133N847138R285835J4684475K2173598K8081903K0947216
$$ 8461791 10976516 14735649 20582787 29868622 44553097 66726695 94808598 115755814
11965A15755814k069302k4102070k9232889k0519973j2316287p536868m824575
$$ 115755814 113686512 89584442 60351553 39831580 27515293 19978425 15153850
11958A5153850l254446k291791j670631j274485r93205p99087o59393n41985m38287
$$ 15153850 11899404 9607613 7936982 6662497 5669292 4870205 4210812 3668827 3230540
11949C230540l68528k90115k50415k26613k09871j83114j59973j40803j05617
$$ 3230540 2862012 2571897 2321482 2094869 1884998 1701884 1541911 1401108 1295491
11940A295491q8147o8160p0527m7741j3824k200J0709P385K0900K9775L4530K6464
$$ 1295491 1207344 1139184 1068657 1020916 1007092 1004892 1015601 1022986 1043886 1073661 1108191 1134655
11928A134655q784n4824q2029o9343o6951p2026q1088p7270n4422n2793n2056
$$ 1134655 1125871 1071047 989018 919675 852724 780698 699610 622340 567918 515125 463069
11917D63069l5938l9819j4964j6807l6131j7706j9438j5532j8655k2491j1283
$$ 463069 427131 387312 372348 355541 319410 301704 282266 266734 248079 225588 214305
11906B14305O961n86M364L184j3049j6206j1802j8979k0698p41L087l938j8845
$$ 214305 221266 220680 225044 228228 215179 198973 187171 168192 147494 146753 149840 145902 127057
11893A27057k199K4829o078j7630q929J0467j926j2578Q110o023q915O980J1205
$$ 127057 124858 149687 143609 125979 117050 127517 125591 113013 121123 115100 106185 113165 124370
11880A24370n3j8276j3241M952L634j6957j9537j895P926J3183N851N59R7p377
$$ 124370 124317 106041 92800 97752 101386 84429 64892 62997 70923 84106 89957 90516 90613 83236
11866H3236j6725q668m182m902J5390P440J2048n748Q827R406o855q824J249o26
$$ 83236 66511 57843 53661 48759 64149 71589 83637 77889 86716 96122 89267 80443 81692 81066
11852H1066r008j2948l842k068p973m520J4146K3978m682r443j0206J4231K7370
$$ 81066 72058 59110 55268 53200 45227 40707 54853 78831 74149 64706 54500 68731 96101
11839I6101P837j837n524j812q83p371j0933m419R036m817j8417o991o834o436
$$ 96101 103938 102101 96577 94765 93882 86511 75578 71159 80195 75378 56961 49970 43136 36700
11825C6700J5823n91q148m024r370j0515j3610k5916j1813O743J4095L2608K1579
$$ 36700 52523 51932 43784 39760 30390 19875 6265 -19651 -31464 -24721 -10626 21982 43561
11812D3561K3808Q585p355q20o294M299K727J212K595o788j6754j0823p272L302
$$ 43561 67369 75954 68599 67779 61485 65784 68511 69723 72318 65530 48776 37953 30681 33983
11798C3983J6067Q676J6981P36p640o574O106K742N323j3041j1950l0272j9731
$$ 33983 50050 58726 75707 76443 68803 62229 68335 71077 76400 63359 51409 21137 1406
11785A406N091J4080J5275Q600J2659J408n026n454L73K169L303M998J5405l98
$$ 1406 6497 20577 35852 44452 57111 58519 53493 48039 48412 50581 53884 58882 74287 73889
11771G3889K936R043n69k7769j2777p718j6205l322J0329j755l420J496J2052
$$ 73889 76825 85868 85299 57530 44753 37035 20830 17508 27837 26082 22662 24158 36210
11758C6210L639m164M488j496j0875r21j3700k852N774J0887o736j5521K468m859
$$ 36210 39849 35685 40173 38677 27802 26881 13181 10329 16103 26990 20254 4733 7201 2342
11744B342L363k13k71J1593K380l579m377q507P784m797n630M360k935K296Q797
$$ 2342 5705 5492 5221 16814 19194 15615 11238 2731 10515 5718 88 4448 1513 3809 12606
11729A2606m037L067k310N287O152J221J105l230o810R720l785P132J86r94Q037
$$ 12606 8569 11636 9326 14613 20765 21986 23091 19861 13051 22771 18986 26118 26304 25310 33347
11714C3347K388j0070r189R134J5441j5419n079R788J3449j240j2306R83O399
$$ 33347 35735 25665 16476 25610 41051 25632 20553 30341 43790 42550 30244 31227 37626
11701C7626k145M033j6103m670j9735n353K461J056O890l053P581J2982N124J700
$$ 37626 35481 39514 23411 18741 -994 -6347 -3886 -2830 4060 1007 8588 21570 26694 28394
11687B8394p234j0526j358o394J15M286l63r36j842R802p017j5251k33j3188J1815
$$ 28394 21160 10634 9276 2882 2997 7283 6920 5984 4142 13944 6927 -8324 -8557 -21745 -9930
11672i930J8344J2829o136K035J8696J0357R461P354j1571j2098j6459j9954j1770
$$ -9930 8414 21243 15107 17142 35838 46195 55656 63010 51439 39341 22882 2928 -8842
11659h842j2799O669J1268Q706O144K1790M669k720j3081r203M900J636q123j2396
$$ -8842 -21641 -14972 -3704 5002 11146 32936 37605 34885 21804 12601 17501 19137 11014 -1382
11645a382L479l93l038J300n858J2069J0146R725N35j4462J58J973M901k173j2590
$$ -1382 2097 1704 -1334 -34 -5892 6177 16323 26048 26583 12121 12279 14252 19153 16980 4390
11630D390j0406N851J8175K226r135J736Q475q485p940j2608o060J3105R720K308
$$ 4390 -6016 -165 18010 20236 11101 12837 21312 12827 4887 -7721 -13781 -676 9044 11352
11616A1352q535n498l186k780k316L2414R326M478p800q765n042N303Q684M139
$$ 11352 2817 -2681 -5867 -8647 -10963 21451 30777 35255 27455 18690 13648 18951 27635 31774
11602C1774l505k270R826J403p419O51N307j5261l1289j9689J1139M944K187J5579
$$ 31774 28269 25999 35825 37228 29809 30460 35767 20506 -10783 -30472 -19333 -14389 -12202 3377
11588C377R142M287N477j3160j7340K147J1502N449J1120M70j4423o125L871n923
$$ 3377 12519 16806 22283 9123 -8217 -6070 5432 10881 22001 22471 8048 1923 5794 -129
11574a29k891N560l878J4231j551Q437K001j7665j5519K777R749J9182j643J558
$$ -129 -3020 2540 -1338 12893 11342 19779 21780 4115 -11404 -8627 1122 20304 18661 20219
11560B0219O506P091p997k2137N88l518K653j063q597M029Q006m720J730J171
$$ 20219 26725 33816 25819 3682 4270 752 3405 2342 -6255 -2226 5780 1060 2790 3961
11546C961q462k737j0413m205J9892J3624J444l379q538N179j6436j3038J1090
$$ 3961 -4501 -7238 -17651 -21856 -1964 11660 13104 9725 1187 6366 -10070 -23108 -12018
11533a2018M562L89P283J1757p61k677j5o155O646K112N464J1004M299j2418k3991
$$ -12018 -7456 -7067 216 11973 11212 8535 8520 2365 9011 11123 16587 27591 31890 19472 -4519
11518d519o612M017J0008O516M110o142j5076n738K7046P838l620j1427j3418
$$ -4519 -11131 -7114 2894 9410 13520 7378 -7698 -13436 13610 21448 17828 6401 -7017
11505g017m682J7051J6237o307j1206K684R099J1800m12l474m647j617L611o62
$$ -7017 -11699 5352 21589 15282 4076 6760 15859 27659 27247 23773 19126 17509 21120 20458
11491B0458p635j2037K284j556q946j1000N603J0569j218J536j2648p37L196J0420
$$ 20458 12823 786 3070 1514 -7432 -18432 -12829 -2260 -3478 -1942 -14590 -15327 -12131 -1711
11477a711n071N085R647O609O62k88N447P080l364m424j7025j091J2242J3941
$$ -1711 -6782 -1697 7950 14559 15221 14933 20380 27460 24096 19672 2647 1556 13798 27739
11463B7739q677k0464k917o745j549J446R758K748j0264j0480l55J0644R847Q234
$$ 27739 19062 -1402 -4319 -11064 -12613 -11167 -1409 1339 -8925 -19405 -19760 -9116 731 8965
11449H965Q054J40n24r868r477k971k445R668J173J283J0560J3942R258j2689
$$ 8965 17019 17159 16635 6767 -2710 -5681 -8126 1542 2715 3998 14558 28500 37758 25069
11435B5069j8491j0408J113o038O816p523o191n142j1531Q996J4698J4046m281
$$ 25069 6578 -3830 -2717 -8755 -1939 -9462 -15653 -20795 -32326 -23330 -8632 5414 1133
11422A133J1193J0122m863P647q297r609n782j912J2915n272k875p745J028q252
$$ 1133 12326 22448 17585 25232 16935 7326 1544 -368 12547 7275 4400 -3345 -2317 -10569
11408a0569k370K065o006K1055j638n493M189p084j1502P861K4181R357m388p239
$$ -10569 -12939 -10874 -16880 4175 2537 -2956 1233 -5851 -17353 -9492 14689 24046 19658 12419
11394A2419J134o561k704j7040P711J1543l03j6435N846j977q164J1168l173J1946
$$ 12419 13553 6992 4288 -12752 -5041 6502 6199 -10236 -4390 -6367 -14531 -3363 -6536 5410
11380E410K840r126J520K732Q492J1338L218p164p081k1268l863O198J009m968
$$ 5410 8250 -876 644 3376 11868 23206 26424 19260 12179 -9089 -12952 -6754 -5745 -10713
11366a0713q622r576K266O294R526J5001P740o114n61j538M206j2283j5813M407
$$ -10713 -19335 -28911 -26645 -20351 -10825 4176 11916 5802 5241 3703 7909 -4374 -20187 -15780
11352a5780J688J164J3072K2374j4151q557M549l38j2925J2972N935k609k769
$$ -15780 -14092 -12928 144 22518 8367 -190 4359 4021 -8904 4068 10003 7394 4625
11339D625J0754n613j207n919l202j1073j1065J1067J1427L658J992J0718M715
$$ 4625 15379 9766 8559 2640 -562 -11635 -22700 -11633 -206 3452 5444 16162 20877
11326B0877r737q448Q445j156K308R689N62k42l309K291o333m61j0240l081n95
$$ 20877 11140 2692 11137 9981 12289 21978 22540 22298 18989 21280 14947 14486 4246 1165 570
11311E70N027n952l630L141n184l631M177J1780l266j0361R704J093j469j056
$$ 570 5597 -355 -3985 -844 -6028 -9659 -5482 6298 3032 -7329 2375 3468 1999 943
11297I43K204O60q086J2081K1305p287q596j076k53l709Q591R359r332p688M910
$$ 943 3147 3807 -4279 7802 29107 21820 13224 12148 11895 8186 16777 26136 16804 9116 14026
11282A4026J482K082L525L522j797q341J081J2163M368j774j4533q285P833m520
$$ 14026 15508 17590 21115 24637 22840 14499 15580 27743 32111 30337 15804 7519 15352 10832
11268A0832n202L443J247j035r752j900l931j9313O338J3006Q55o775M965J1645
$$ 10832 5630 9073 10320 9285 -467 -2367 -6298 -25611 -19273 -6267 -5412 -12187 -7222 4423
11254D423J47R474o094q857k019P366l454K318K1602J3780l021j5776p987j3005
$$ 4423 4570 14044 7950 -907 -2926 4440 986 3304 24906 38686 35665 19889 11902 -1103
11240a103m538p829p082Q9Q98N840K2371N257m418l628j0306j0143n19J4881J4462
$$ -1103 -5641 -13470 -20552 -20463 -19565 -13725 8646 13903 9485 5857 -4449 -14592 -15111 -230 14232
11225A4232k355n316j0540J0096J2898p828j7067q93L564K803k325J3078j1148
$$ 14232 11877 6561 -3979 6117 19015 11187 -5880 -6773 -3209 -406 -2731 10347 -801
11212h01j4445M828J8988R33J5856J04o551R233j640r557o686R762j7868o444
$$ -801 -15246 -10418 8570 9503 25359 25463 18912 28145 26505 16948 10262 20024 2156 -4288
11198d288K857j128O377O3n943r991k569Q443O3R250J6697l412j1935j8644o594
$$ -4288 -1431 -2559 3818 3881 -2062 -12053 -14622 -6179 -6116 3134 19831 16419 4484 -14160 -20754
11183b0754J1517J1182J8450J709j0318j933l570j8913R2K6472o953l2027l357
$$ -20754 -9237 1945 20395 22104 11786 9853 6283 -12630 -12538 13934 6981 -25046 -28403
11170b8403J6929K539k978L095J317P976J3170Q42q726m834L781j1904J5868J0997
$$ -28403 -11474 -8935 -11913 -8818 -7501 475 13645 14487 5761 927 4708 -7196 8672 19669
11156A9669j1579q103R668J4311j358n120q418M037j0169n628r251m171M041J0924
$$ 19669 8090 -13 9655 23966 22608 17488 9070 13107 2938 -2690 -11941 -16112 -12071 -1147
11142a147J6686O143j047m906r622o752j459J116m782O40o391k382J3663O49k1
$$ -1147 15539 21682 20635 15729 6107 -645 -2104 -988 -5770 -5130 -11521 -13903 -240 409 388
11127C88j1351j1989L159R732J0512J2578L022N584n928j4278l210L420Q482R961
$$ 388 -10963 -22952 -19793 -10061 451 13029 16051 21635 15707 1429 -1781 1639 10121 20082
11113B0082q807O867m681o123K354J59j0571k216J1928J1326Q7k286p57q862K132
$$ 20082 11275 18142 13461 7338 9692 9851 -720 -2936 8992 20318 20405 18119 17362 8500 10632
11098A0632n290N85j0761N771R99N914J2094m42Q445j634p961n837j0271j0821
$$ 10632 5342 5927 -4834 937 1936 7850 19944 19502 27947 26313 18352 12515 2244 -8577
11084h577j655P1q918K521J2105N627O173J0108o293m398J0118o147q469Q817
$$ -8577 -10232 -10161 -19079 -16558 -4453 1174 7347 17455 11162 6764 16882 10735 2266 11083
11070A1083J1065l491j2456o577o873j1825J541O732M786q404j98J3253J4275
$$ 11083 22148 18657 6201 -376 -7249 -19074 -17533 -10801 -6015 -14419 -14617 -1364 12911
11057A2911K500K220J867m326n403J300n348L686O532J2410N010Q785J3781P123
$$ 12911 15411 17631 19498 15172 9769 11069 5721 9407 15939 28349 33359 42144 55925 63048
11043F3048p096j2023l09J0584P606J1392J5211J8639j731q280P818l429O16p676
$$ 63048 55952 43929 43620 54204 61810 73202 88413 107052 105321 97041 104859 101430 102046 94370
11029I4370L615N570K556L343Q203K0361K3922J4491Q268O73j9015k8454k6641
$$ 94370 97985 103555 106111 109454 117657 138018 161940 176431 184699 185372 166357 137903 111262
11016A11262N95p528k3419o158Q680K1534K882j6134L204R583j5797k3279q459
$$ 111262 111857 104329 80910 74752 83432 104966 107848 91714 94918 104501 88704 65425 56966
11003E6966j0370q089k707l657Q350J2451j5075P372J0842j3235j923K147K0030
$$ 56966 46596 38507 35800 32143 40493 52944 37869 45241 56083 42848 40925 43072 63102
10990F3102j2030l204Q013p335o527p68m193k729j820k555q8P244Q95k581N337
$$ 63102 51072 47868 55881 48546 42019 41251 37058 34329 32509 29954 29866 37110 38005 35424 40761
10975D0761j1228j5614o738q567N508J1948K56R977J6873q125N873J515N294Q088
$$ 40761 29533 13919 7181 -1386 4122 16070 16326 26303 43176 35051 40924 42439 47733 55821
10961E5821Q099J45j5506p896L899J8232M747P409m187o65J6176K3656J0967J4190
$$ 55821 63920 64065 48559 40663 44562 62794 67541 74950 70763 70098 86274 109930 120897 135087
10947A35087K5586K6131M0337M4886P0030J15383J75548K39449K94903L27642
$$ 135087 160673 186804 227141 272027 342057 457440 632988 872437 1167340 1494982
10937A494982K72077J24559o3360j92429k13194j58215j44158j87530k04480j91111
$$ 1494982 1767059 1891618 1828258 1635829 1422635 1264420 1120262 932732 728252 537141
10927E37141j43094j07149p4499m6204l8402r395j3130p061N97J487j4827k3244
$$ 537141 394047 286898 212399 166195 127793 118398 105268 98207 98804 100291 85464 62220
10915F2220l210M45k727j2938j4480Q948J0887m118r058r364j0458o531l281J3359
$$ 62220 59010 59455 56728 43790 29310 38258 49145 45027 35969 26605 16147 9616 6335 19694
10901A9694L173o343k6932j3367M158J4879Q390N718J6406Q911m327j4808n186
$$ 19694 22867 16524 -10408 -23775 -19617 -4738 3652 9370 25776 34687 30360 15552 10366
10888A0366N534P49P917J685N552P998k213j0964j2838o972Q607J7069J739K095
$$ 10366 15900 16649 24566 26251 31803 39801 37588 26624 13786 6814 15421 32490 34229 36324
10874C6324q833k54k7307p39K471P515J2817j7367J0659K057K801j702j806l252
$$ 36324 27491 27237 -70 -809 1662 9177 21994 4627 15286 17343 20144 18442 16636 13384
10860A3384k121K911L329j0945k307p004P408o73o892M371N580J4856O262K8733
$$ 13384 11263 14174 17503 6558 4251 -2753 4655 3982 -2910 1461 7041 21897 28159 56892
10846E6892K5212L769n759k806k5072k2704k0960r108p151q856j4979N937M185
$$ 56892 82104 85873 80114 77308 52236 29532 8572 -536 -7687 -16543 -31522 -25585 -21400
10833b1400R360k872J2168K2645O804M377n834p332l623K862N982J2225m085K14
$$ -21400 -12040 -14912 -2744 19901 26705 31082 25248 17916 14293 17155 23137 35362 31277 31491
10819C1491J463j171l756n393J337J1044n901Q309L793l026K688Q272J1192K84
$$ 31491 32954 31783 28027 22634 23971 35015 29114 37423 41216 38190 40878 49150 60342 60626
10805F0626L662K963j0976J906J2549K227M755J8896L5455L4593K8424K6753K8006
$$ 60626 64288 67251 56275 58181 70730 72957 77712 96608 132063 166656 195080 221833 249839
10792B49839J8631J781K141k0529k3533k8455r168p312j7351k4008l6204j7305
$$ 249839 268470 270251 272392 251863 228330 199875 190707 183395 166044 142036 105832 88527
10780H8527j4113j4037j8851L48J8466J5096j0464j0191k979p065J0653R932q804
$$ 88527 74414 60377 41526 41874 60340 75436 64972 54781 51802 44737 55390 65322 56518
10767E6518O751R555j5320k1332L740J1899j273p438J3456J3930m302o665R824
$$ 56518 63269 72824 57504 36172 39912 51811 50538 43100 56556 70486 66184 59519 69343
10754F9343L323M795J2447l876j7950j660q048M980k910q421m197J3396P614k1515
$$ 69343 72666 77461 89908 86032 68082 66422 58374 63354 60444 52023 47826 61222 68836 47321
10740D7321j9799K836J927k913L469j6164j8874j4897k6785q530J2029J4841K2514
$$ 47321 27522 30358 32285 29372 32841 16677 -2197 -17094 -43879 -52409 -40380 -25539 -3025
10727c025J3568N735J0175J2251K6116K7443N566O38p603j8395j5456j6914j7211
$$ -3025 10543 16278 26453 38704 64820 92263 97829 98467 90864 72469 57013 40099 22888
10714B2888j3645n173p81k1964k3786K1394J2430J0708N530q016j4633j3377j1463
$$ 22888 9243 4070 3289 -18675 -42461 -21067 -8637 2071 7601 -415 -15048 -28425 -39888
10701c9888Q681O977O802P985K232l020J9086K5054L1570L4513K3368N2961N1928
$$ -39888 -31207 -24230 -17428 -9443 -7211 -10231 8855 33909 65479 99992 123360 176321 228249
10688B28249J8733Q30p324M911k683j2819j3743j3851j2913j2897l146l382P592
$$ 228249 246982 247812 240488 245399 242716 229897 216154 202303 189390 176493 173347 169965 177557
10675A77557J7240K965J985M286L5676K2581Q086J0447J0652J1311k484o422l683
$$ 177557 194797 197762 199747 204033 239709 262290 270376 280823 291475 302786 300302 293880 290197
10662B90197J3131J4591q265j8492j7321P308J6930J3880J1617o01j2574k162
$$ 290197 303328 317919 309654 291162 273841 281149 298079 311959 323576 322975 310401 308239
10650C08239J6138K1698Q509n801K770R859Q780O566P006J3884K2404K3882K7417
$$ 308239 324377 346075 354584 348783 351553 361412 370192 376758 383764 397648 420052 443934 471351
10637D71351N3367O4735O7448Q0082J08466J21261J08710O9227L9019J9004M4699
$$ 471351 524718 589453 656901 736983 845449 966710 1075420 1144647 1183666 1202670 1247369
10626A247369Q2710J24380J67801K38150L54773M79255O41287Q53265J052084
$$ 1247369 1330079 1454459 1622260 1860410 2215183 2694438 3335725 4188990 5241074
10617E241074J252684J395676J298622Q46883J95033l27528m82460k81601J28203
$$ 5241074 6493758 7889434 9188056 10034939 10229972 9902444 9419984 9138383 9266586
10608I266586O45875J237260J871665K512721K904506K515385J166499n60651
$$ 9266586 9912461 11149721 13021386 15534107 18438613 20953998 22120497 21559846
10600B1559846j752539j943573j372103n06560M56802J428836K476424L366905
$$ 21559846 19807307 17863734 16491631 15985071 16441873 17870709 20347133 23714038
10592B3714038L691897K835913O39887j933982l486191l544047k713805j676236
$$ 23714038 27405935 30241848 30881735 28947753 25461562 21917515 19203710 17527474
10584A7527474o97254K40986J107123J766642J912573J196514l56129k013936
$$ 17527474 16830220 17071206 18178329 19944971 21857544 23054058 22697929 20683993
10576B0683993k855350k704638k010146j225311n76533l7399L60554O12142O32996
$$ 20683993 17828643 15124005 13113859 11888548 11312015 11274616 11635170 12247312 12880308
10567A2880308K80661k95669q54715j053650q73739m67734m998L72273O10759
$$ 12880308 13160969 12865300 12010585 10956935 10083196 9615462 9610464 9982737 10593496
10558A0593496P71067Q96543R87652J113530J311186J566819J877457K296333
$$ 10593496 11364563 12261106 13248758 14362288 15673474 17240293 19117750 21414083
10550B1414083K934831M008587N823861Q667324J3111327K0089253L0692132M4598898
$$ 21414083 24348914 28357501 34181362 42848686 55960013 76049266 106741398 151340296
10542A51340296N6635610N7945795M8269985K9305444J27276l0770280m4509246
$$ 151340296 207975906 265921701 314191686 343497130 343624406 312854126 268344880
10535B68344880l4919484k2329464k3311839l2969326l7323528l1708827k1788146
$$ 268344880 233425396 211095932 187784093 154814767 117491239 85782412 63994266
10528F3994266j4195087r493928o594707m743092l584167k807311k280595j890428
$$ 63994266 49799179 40305251 33710544 28967452 25383285 22575974 20295379 18404951
10520A8404951j645213j523625j479232j479608j386132j209015j044320r38730
$$ 18404951 16759738 15236113 13756881 12277273 10891141 9682126 8637806 7699076
10512G699076q67148p67356o47703n05542m04277l43605l14130k70043k29028
$$ 7699076 6831928 6064572 5416869 4911327 4507050 4163445 3849315 3579272 3350244
10503C350244j95620j71159j49641j33277q2090o1402n7238n7361m5322k8842
$$ 3350244 3154624 2983465 2833824 2700547 2618457 2557055 2499817 2442456 2397134 2368292
10493B368292n4550r7615j18222j10133j25985j15407q8564p3617q9774q6140
$$ 2368292 2313742 2216127 2097905 1987772 1861787 1746380 1657816 1584199 1494425 1408285
10483A408285o4149l8218l6340m4024l3264m4376m1663l4491l3123l1095k5623
$$ 1408285 1344136 1305918 1269578 1225554 1192290 1147914 1106251 1071760 1038637 1007542 981919
10472I81919j1223k0346l5004j4939j2925j7947k0562k7917k5759k7738l3452
$$ 981919 970696 950350 915346 900407 887482 869535 848973 821056 795297 767559 734107
10461G34107o824j8641k4024k5383p631M776k0093j7479j5455k5414k2727j9434
$$ 734107 727283 708642 684618 659235 651604 656380 636287 618808 603353 577939 555212 535778
10449E35778j5900o725r858k0689j0733j091q196n373j3236j1286N059o456l986
$$ 535778 519878 513153 503295 482606 471873 470782 462586 457213 443977 432691 437750 431294 427308
10436D27308K564P781L237j9545j0715R042J631n937J054K169o505j5943k1105
$$ 427308 429872 437653 440890 421345 410630 419672 421303 415366 416420 418589 412084 396141 375036
10423C75036j9993J997O809Q556J0975m117P676L2738J8186J0101L4437J3909
$$ 375036 355043 357040 363849 372405 383380 379263 386939 419677 437863 447964 482401 496310
10411D96310J432k3102j6206J970r111j6943j9515p619j1461k2116j7718l3992
$$ 496310 497742 474640 458434 460404 451293 434350 414835 407216 395755 373639 355921 321929
10399C21929m1620j5227j1021j3492p111k86m3943l6772k3825k9849j5244K2933
$$ 321929 280309 265082 254061 240569 233458 233172 189229 152457 128632 98783 83539 106472
10387A06472M8923M5145L6620K4728P276M277J7584N831J3970O198J522j201n600
$$ 106472 155395 200540 237160 261888 269164 273441 291025 296856 310826 317024 318546 317345 311745
10374C11745k815q295j2204r504J3380J0431q693p025J2011K2369O042j8237j9906
$$ 311745 308930 300635 288431 278927 292307 302738 294045 287020 299031 321400 327442 309205 289299
10361B89299k6668m2284k3293j1503j3051m221J477k99N636K5742J2222k472J2878
$$ 289299 262631 220347 197054 185551 172500 168279 169756 169457 175093 200835 213057 210585 223463
10348B23463J0873J0587K603J264k331j4585p585j3342p741j8921j7418r253J0354
$$ 223463 234336 244923 247526 248790 246459 231874 224289 210947 203206 184285 166867 157614 167968
10335A67968J2034j1081j0717n153k8619k8837j1723m653k466k546J3834K0154
$$ 167968 180002 168921 158204 153051 124432 95595 83872 79219 76753 74207 88041 108195
10323A08195N4m225J281k348j1617q827O974K081p098k529j287L240j0430j0619
$$ 108195 108249 104024 105305 102957 91340 82513 89487 91568 84470 81941 80654 83894 73464 62845
10309F2845l211r37J0402Q200J2063J4937k579p961M631J0587N241j9811k2645
$$ 62845 59634 58697 69099 77299 89362 104299 101720 93759 98390 108977 114218 94407 71762
10296G1762o652j7016K4306L1516J2771j7784j0865K1624J6114k471j6247j501
$$ 71762 65110 48094 72400 103916 116687 98903 88038 109662 125776 123305 107058 105557
10284A05557J0833r614P062P614J75Q033L086q85q11k2602k6014j2845O362J9159
$$ 105557 116390 106776 113838 121452 121627 129660 132746 131861 131050 108448 82434 69589 75951 95110
10270I5110J4834q193m679L016o481k50j177j1482K435r800o471O114R503J4371
$$ 95110 109944 101751 97072 100088 93607 93357 92180 80698 83133 73333 66862 72976 82479 96850
10256I6850P479M78k831n414N028l446j2471m592L328j06J852J9899J0595Q376
$$ 96850 104329 104807 101976 96562 101590 98144 85673 81081 84409 84303 86155 106054 116649 125025
10242A25025P041O247J2433k296R033j3827l6654m3505o844q327K424P74N060
$$ 125025 132066 138313 150746 148450 157483 143656 107002 63497 56653 48326 50750 51524 56584
10229E6584N893K4002L2711J433o302k473J3093l827j889r962k0812r376J759
$$ 56584 62477 86479 119190 120623 114321 111848 124941 121114 119225 109263 88451 79075 80834
10216H0834K874k350Q988L902M068j6822m377J0840M001L576J05j0737J671J3227
$$ 80834 83708 81358 90346 94248 98316 81494 77117 87957 91958 95534 95639 84902 86573 99800
10202I9800K650r017p561p636k3551j1190M306q58j0512J0322J3819J1661P751
$$ 99800 102450 93433 85872 78236 54685 43495 47801 46943 36431 46753 60572 72233 79984
10189G9984m121J730J4198J1797O586j4640j4672N257K8056R622M042J1810n130
$$ 79984 75863 77593 91791 103588 110174 95534 80862 86119 114175 123797 127839 139649 134519
10176A34519k2047m467L923M573K601K03k698J2039J8391K5778N971L528r755
$$ 134519 112472 108005 111928 116501 119102 119305 116607 128646 147037 172815 178786 182314 172559
10163A72559j999L48j538j8194Q630L7179K9634J6804J6403J6908J1988j2321
$$ 172559 170560 170908 169370 151176 159806 196985 226619 243423 259826 276734 288722 276401
10151B76401L534l184K683Q882Q813K4903L6871P2393R3407J30727J88146K45734
$$ 276401 279935 276751 279434 288316 297129 322032 358903 431296 524703 655430 843576 1089310
10139A089310K47182K08096J51899J12231K5938j05722j90526j71728j36647j42878
$$ 1089310 1336492 1544588 1696487 1808718 1834656 1728934 1538408 1366680 1230033 1087155
10129A087155j72132j95678j73566j27029q1829n9165l7255j7561o875j4855k3791
$$ 1087155 915023 719345 545779 418750 336921 277756 240501 222940 216065 201210 177419
10118A77419k2599k2445P803K2108O181O639O61K2971M6748O7140P2183R1505
$$ 177419 154820 132375 140178 162286 168467 175106 175767 198738 245486 312626 384809 476314
10106D76314J13137J28148J37010J33755J13645P4536L1038k9449o3065r2549
$$ 476314 589451 717599 854609 988364 1102009 1176545 1207583 1178134 1115069 1022520
10096A022520j25820j24188j40946j36356j11123p0116o3308m6215k2568k1268
$$ 1022520 896700 772512 631566 495210 384087 313971 250663 204448 181880 160612
10086A60612l7774j5363p43K949P731L309j8525j8242r727j1846J0366K4287n884
$$ 160612 122838 107475 106732 109681 117412 120721 102196 83954 74227 62381 72747 97034 91150
10073I1150k589p242j0475l974j566O495o86j5514r153k960J1524o969p658n615
$$ 91150 88561 81319 70844 66870 65304 71799 71113 55599 46446 43486 55010 48041 40383 34768
10059C4768n153q124M597K017n230L780k651j0324K382J0533K137k054l954n755
$$ 34768 29615 21491 26088 28105 22875 26655 24004 13680 16062 26595 28732 26678 22724 16969
10045A6969N019R246m391J1483o499l814M258N81N319n949K793J2068r210j7999
$$ 16969 21988 31234 26843 38326 31827 28013 32271 32852 38171 32222 35015 47083 37873 19874
10031A9874r236p945Q396N346J3607N323R002o324O847k40q956J1158J1589O092
$$ 19874 10638 2693 11089 16435 30042 35365 44367 38043 44890 44650 35694 46852 58441 64533
10017F4533o453k2768p470R950k412L127O241J807P99o530k556l610n128n079
$$ 64533 58080 35312 27842 37792 35380 38507 44748 46555 47354 40824 38268 34658 29530 24451
10003B4451J554j517j7962q486N143J0088K4358J0300j8621p757j5582m225J6388
$$ 24451 26005 24488 6526 -1960 3183 13271 37629 47929 29308 21551 5969 1744 18132
9990A8132J8667J2486k696r446L538R118m330p998r970J639L290J3543L023j7735
$$ 18132 36799 49285 46589 37143 40681 49799 45469 37471 27501 29140 32430 45973 48996 31261
9976C1261n610j0509p401J4757J6459P880l291j781j0302M330o90m552O249j6068
$$ 31261 25651 15142 7741 22498 38957 46837 43546 41765 31463 35793 35103 30551 36800 20732
9962B0732o416J0700N278J435k053l426l189N336j2071q038P803n469j5597M265
$$ 20732 14316 25016 30294 31729 29676 26250 23061 28397 16326 8288 16091 10622 -4975 -710
9948g10J2372R514O187J3542p266j254j934L202p906L793l012l750l104o769N033
$$ -710 11662 21176 27363 40905 33639 32385 30451 33653 25747 29540 26528 22778 19674 12905 17938
9933A7938J5538J156R789J105J163l318r5m081k1028M350J5686L342j3482n013
$$ 17938 33476 34632 44421 45526 46689 43371 43276 39195 18167 22517 38203 41545 28063 23050
9919B3050P623P716J1670J5891K3312J196K3613J5481Q837n854P346J2105k880
$$ 23050 30673 38389 50059 65950 89262 90458 114071 129552 138389 132535 139881 151986 149106
9906A49106j1789j6455L494j1808k8034l540k667j4803j5076p16k203n975n910
$$ 149106 137317 120862 124356 112548 84514 80974 78307 63504 48428 47712 45509 39534 33624
9893C3624q627J0278J629n646m563k56j467M121Q438J663k1829n750L171J0118
$$ 33624 24997 35275 36904 31258 26695 26439 24972 29093 37531 39194 17365 11615 14786 24904
9879B4904K37n218j240J972J135p896n166J0232J1129j209J0034o544n286n650
$$ 24904 25141 19923 18683 20655 21790 13894 8728 18960 30089 28880 38914 32370 27084 21434
9865B1434J915j752l176J84J3054o379k127J5387l284o461j4397k773R384O145
$$ 21434 23349 21597 18421 18605 31659 25280 23153 38540 35256 28795 14398 11625 21009 27154
9851B7154K976Q122j5461o741R581n571k915k96p666L313q00Q588J2147j807k664
$$ 27154 30130 38252 22791 16050 25631 20060 17145 16849 9183 12496 11696 20284 32431 30624 27960
9836B7960k0750M107K2140l4j9486j3319L591Q742L665q983o616N774Q283m101
$$ 27960 7210 11317 33457 33423 13937 618 4209 12951 16616 7633 1017 6791 15074 10973
9822A0973p672n863n169J6268R010j1932K074J1859J2987j0779j0370m623J605
$$ 10973 3301 -2562 -7731 8537 17547 5615 7689 19548 32535 21756 11386 6763 8368
9809H368P508M002P843J0557K881o767q168p742j3127p442O093J3206J3815m5
$$ 8368 15876 19878 27721 38278 41159 34392 26224 18482 5355 -2087 4006 17212 31027 30982
9795C0982l339j1843r88m159q602o32P926R177L369l230P343j1427j0820m766
$$ 30982 27643 15800 14812 10653 2051 1419 9345 18522 21891 18661 26004 14577 3757 -1009
9781a009o05l955J4633Q018P577J910k142j0259M451K556k234j281J5480M601
$$ -1009 -1614 -5569 9064 17082 24659 26569 24427 14168 18619 21175 18941 17660 33140 37741
9767C7741j5700n54J1530n669q327r468K378Q25r538p560q652j34J7725J2865
$$ 37741 22041 21487 33017 27348 19021 9553 11931 12756 3218 -4342 -12994 -13128 4597 17462
9753A7462Q514J2053k400n114n80j1573K166R11r464l104o911j2820R958J5273
$$ 17462 25976 38029 35629 30515 29935 18362 20528 21439 11975 8871 1960 -10860 -902 14371
9739A4371J7606J7930N997q461j0415k0034n582J7065j627L58o592J54N226m024
$$ 14371 31977 49907 55904 47443 37028 16994 11412 28477 26850 27208 20616 20770 25996 21972
9725B1972K55l052r244j6479M183J1537r298n353P154j5423o843J0172P146M123
$$ 21972 22227 19175 9931 -6548 -2365 9172 -126 -5479 1675 -13748 -20591 -10419 -3273 850
9711H50k220o936L818l955k266Q360Q480J08j5131L346J0856J1950P722j2468
$$ 850 -1370 -8306 -4488 -8443 -10709 -2349 6131 6239 -8892 -5546 5310 17260 24982 12514
9697A2514p010o421Q231O663j2626m07O323J1027O352j781J043j9533j568J1545
$$ 12514 5504 -917 7314 13977 1351 944 7267 18294 24646 22865 23908 4375 2807 14352
9683A4352Q656r037o698R35n793n892J9890n181j5867K936l723o681K544O432
$$ 14352 23008 13971 7273 8208 2415 -3477 16413 11232 -4635 -1699 -5422 -12103 -9559 -3127
9669c127j4412Q639J194J964L162L418l407J7379K683J495M618l918j5196r192
$$ -3127 -17539 -8900 -7706 -5742 -2580 838 -2569 14810 17493 18988 23606 19688 4492 -4700
9655d700q82R365J1248O017r507K611n772j1760K538O147j0711j2279l768N420
$$ -4700 -5582 3783 15031 21048 11541 14152 8380 -3380 -842 5305 -5406 -17685 -21453 -16033
9641a6033n413M031J1835J306j447R820J3949J076j60j819q894J058j2016p084
$$ -16033 -21446 -17415 -5580 -4274 -5721 4099 18048 19124 18964 17145 8251 9309 -2707 -9791
9627i791J0817J0230o675j6868l886J1559J0286j7321j4781J1032J6641p899o089
$$ -9791 1026 11256 4581 -12287 -16173 -4614 5672 -11649 -26430 -15398 1243 -6656 -12745
9614a2745J1336P843J0478j2851Q302m90j4057M622N544L361j1735J276J7524
$$ -12745 -1409 6434 16912 4061 12363 11873 -2184 2438 7982 11343 -392 884 18408
9601A8408k632j1015m67L950n978j01R993L677J791j8348O265N329o198m035Q070
$$ 18408 15776 4761 4294 8244 2266 2165 12158 15835 17626 -722 5543 10872 4674 639 8709
9586H709J2736L582k0256j7735J1365M110L022r70k2532j0185R292J2708K2428
$$ 8709 21445 25027 4771 -12964 -1599 2511 5533 4563 -17969 -28154 -18862 -6154 16274
9573A6274L962K785l222o362q34j8738p700K281K338J8832P937r970o352M332
$$ 16274 20236 23021 19799 13437 12603 -6135 -13835 -11554 -9216 9616 17553 7583 1231 5563
9559E563R752J557j1688p245O821J5699J222K673j0222k805J5617n995k0860o886
$$ 5563 15315 16872 5184 -2061 4760 20459 21681 24354 14132 11327 26944 20949 89 -6797
9545f797J1119nk0073J841O429L539K1027J6746p227n846r376M639M663j5034
$$ -6797 4322 4317 -15756 -13915 -7486 -3947 17080 33826 26599 20753 11377 16016 20679 5645
9531E645l742J0203n311J402n038J3672p620P20M079M601l375J0158j081j6207
$$ 5645 1903 12106 6795 8197 3159 16831 9211 9931 14010 18611 15236 25394 24313 8106
9517H106J0135Q485k525M83P567j1151j2309j0292n06J7406K170m750J0133n515
$$ 8106 18241 26726 24201 24684 32251 21100 8791 -1501 -2007 15399 17569 12819 22952 17437
9503A7437J0921n924q512p561m50J633N627J1085q440q04K290O45o920N810L732
$$ 17437 28358 22434 13922 6361 5911 7544 13171 24256 15816 15012 17302 17947 11027 16837 20569
9488B0569N717l925j121q353r401n524j1533J415K2660J7242P245p651o505R42
$$ 20569 26286 22361 21240 12887 3486 -2038 -13571 -12156 10504 27746 34991 27340 20835 21777
9474B1777q446j8244Q415K1887J4680k063j9226n294m738N517k550p886r612m045
$$ 21777 13331 -4913 3502 25389 40069 38006 18780 13486 8748 14265 11715 3829 -5783 -9828
9460i828j353m395J255J0544J0973K712k280l076j735p923L831M135q868P455
$$ -9828 -11181 -15576 -14321 -3777 7196 9908 7628 4552 2817 -5106 -1275 2860 -6008 1447
9446A447Q67J0260J1960J0205m878j0698O939J050K959j5318Q136K400j906j1954
$$ 1447 2314 12574 24534 34739 29861 19163 26102 27152 30111 14793 22929 25329 23423 11469
9432A1469l873L662k124q329j1844j244J415O607J0582N950O142M078J548m565
$$ 11469 7596 11258 9134 805 -11039 -12283 -10868 -4261 6321 12271 18413 22491 24039 19474
9418A9474j4941j2108o025J8505K328r643R652N292N629R042n371n417j2604j1340
$$ 19474 4533 -7575 -13600 4905 7233 -2410 7242 12534 18163 27205 21834 16417 3813 -7527
9404g527k197q237r715J7254J2375p74l835M561K260K918m239m682n771J242k286
$$ -7527 -9724 -17961 -27676 -10422 1953 1179 -2656 1905 4165 7083 2844 -1838 -7609 -6367 -8653
9389h653J529Q684J1049k673q111l468L349J7597j579O752r281o508J584n472
$$ -8653 -7124 1560 12609 9936 1825 -1643 1706 19303 17724 24476 15195 8687 10271 4799
9375D799m31L282j488j3338k394L374q243L963J0745Q175j6308j0117N591K656
$$ 4799 4368 7650 6162 -7176 -9570 -6196 -14439 -10476 269 8444 -7864 -17981 -12390 -9734
9361i734k040M523L334M905M809m796J0333J0053q609j677l698L527L9L236m780
$$ -9734 -11774 -7251 -3917 988 5797 1001 11334 21387 12778 11101 7403 10930 10969 14205 9425
9346I425j1102J6261P202r407J0220m39J629O085L568O16r628j0274k47l67j6411
$$ 9425 -1677 14584 21786 12379 22599 22160 23789 29874 33442 34058 24430 14156 13909 13542 -2869
9331b869r615L46R459K566Q043Q782J1519R77k0800o344J549M191K679r902j2216
$$ -2869 -12484 -12138 -2679 -113 7930 16712 28231 29208 8408 2064 3613 7804 10483 581 -11635
9316a1635j162L944n211P26O38N172L617P577L754l194j7703m07q61J803O104
$$ -11635 -12797 -8853 -14064 -13338 -12700 -7528 -3911 3666 7420 4226 -13477 -13884 -14745 -12942 -6838
9301f838l026Q110o825j351J1375J456jq447m499K856N149J756J892k276o469
$$ -6838 -9864 -1754 -8579 -9930 1445 2901 2900 -5547 -10046 -7190 -2041 -285 1607 -669 -7138
9286g138O967J0442j0131m659j5380j2839M950K5054J7436K084l420q682j743
$$ -7138 -171 10271 140 -4519 -19899 -32738 -27788 -2734 14702 16786 13366 4684 2941
9273B941n282r461K046r33L023J2604K0756l470k2083J257l742L579j623Q987
$$ 2941 -2341 -11802 -9756 -10689 -7666 4938 25694 22224 141 1398 -2344 1235 -388 8599
9259H599J89r616l10p497m820J9176Q066P002O105p205m0q817M600M217o211l486
$$ 8599 8788 -828 -1138 -8635 -13455 5721 13787 20789 26894 19689 19649 10832 15432 19649 13438 9952
9243I952J2583M73j0295j1419r46R582m686j943j541J38p255L167M904N20n537
$$ 9952 22535 23008 12713 1294 348 9930 5244 3301 1760 1898 -5357 -2190 2714 3234 -2303
9228b303p077Q735N213L712q269j6652Q12J0471J4675j097j679J057j2612p726
$$ -2303 -9380 -645 4568 8280 11 -16641 -15829 -5358 9317 8220 6541 7598 -5014 -12740
9214a2740m48J4237Q368j1291K027N941J20P698Q73k0132J839J3363j5132J027
$$ -12740 -13188 1049 9417 -1874 153 6094 6214 13912 14785 -5347 -3508 9855 -5277 -4250
9200d250K0247M030j889l769j1178l182M293q239P91P405N383k910o386R667K846
$$ -4250 15997 20027 18138 14369 3191 9 4302 -3937 -3146 4259 9642 6732 346 10013 12859
9185A2859r748L858J369L607p274j6408j3009N331J7977O222J086K05p367M574
$$ 12859 3111 6969 8338 11945 4671 -11737 -24746 -19415 -1438 4784 5870 6075 -1292 3282
9171C282P860j5358p480r16Q447K482J6808J712j8008j1793L152J3467M246l1117
$$ 3282 11142 -4216 -11696 -12612 -4165 -1683 15125 16837 -1171 -12964 -9812 3655 7901 -23216
9157b3216j2055M158O38M677O530J2273J7985l34j2029Q963J3416o072m52k780
$$ -23216 -35271 -31113 -30475 -25798 -19268 -6995 10990 10656 -1373 7590 21006 14934 14482 11702
9143A1702m283J7117P20p535n988l570n757p790o969r859l492J036M108L526P158
$$ 11702 7419 24536 25256 17721 11733 8163 2406 -5384 -12353 -22212 -25704 -24668 -20560 -17034 -9876
9128i876J2228K472j3111J3805j671j0327j1058J3913J2527J0476K181q469q467
$$ -9876 2352 4824 -8287 5518 3847 -6480 -17538 -3625 8902 19378 21559 13090 4623
9115D623O683K0017J3287Q17m685q00J4115n478k7043j4402J9204J8171M636j4437
$$ 4623 11306 31323 44610 45427 40742 39942 54057 48579 21536 7134 26338 44509 49145 34708
9101C4708j6458j1177K118M273j0841j4928q17J3069J750j3047o029J6414J3830
$$ 34708 18250 7073 9191 13464 2623 -12305 -13122 -53 1697 -11350 -17379 -965 12865
9088A2865r526m634J7026J250j9658J571j099O735M986k823R419l311n750j356
$$ 12865 3339 -1295 15731 16981 -2677 -1106 -2205 4530 9516 6693 16112 12801 7051 5695
9074E695O887K003J2423N01j3977K113J2990l202r832j1945J994m824j284q661
$$ 5695 12582 14585 27008 27509 13532 15645 28635 25433 15601 3656 5650 826 -458 -9119
9060i119m941J4808J3680O73l034P914k988o661j1715r568K702Q269j122n70J4136
$$ -9119 -14060 748 14428 15101 12067 19981 16993 10332 -1383 -10951 -8249 20 -1102 -1672 12464
9045A2464m019L230J0584q648l219M717l549P64k38K632r305j1812Q153K041M017
$$ 12464 8445 11675 22259 13611 10392 15109 11560 12324 12086 14718 5413 -6399 1754 3795 7812
9030G812j5211j037J4076m19j0279J080K252k911M034J1007k158p148J124n868
$$ 7812 -7399 -8436 5640 5221 -5058 -3978 -1726 -4637 -603 10404 8246 1098 2222 -3646
9016c646m644O397N297j163q528q478j5576M520q51K858J3876M67R743J1635J2352
$$ -3646 -8290 -1893 3404 2241 -6287 -14765 -30341 -25821 -26672 -23814 -9938 -9471 272 11907 24259
9001B4259L239j0401O421r809p952j364J003m713L004J4699j0556L581R529p250
$$ 24259 27498 17097 23518 13709 5757 4393 5396 683 3687 18386 7830 11411 20940 13690
8987A3690k0009N663K0691n541j3341j3083R310J0752n316P453J0474l186j488
$$ 13690 -6319 -656 20035 14494 1153 -11930 -2620 8132 2816 10269 20743 17557 16069
8974A6069j3612o508N723j054q033j0789R341J2130N365J5n361p454j786L425
$$ 16069 2457 -4051 1672 618 -7415 -18204 -8863 3267 8632 8647 3286 -4168 -5954 -2529
8960b529m87n772L295N804n050q149R256Q649M061N400r703j0514p627J8951K0374
$$ -2529 -3016 -8788 -5493 311 -4739 -12888 -3632 5017 9078 14478 4775 -5739 -13366 5585 25959
8945B5959J2938j7510j7259k983J7596P192j1474r156N064M181J2143m004j5514
$$ 25959 38897 21387 4128 1145 18741 25933 14459 5303 10367 14548 26691 22687 7173
8932G173r830L166j94P823J2029L635j6665R206O973p315p262N61j4046j8919
$$ 7173 -2657 509 315 8138 20167 23802 7137 16343 23316 16001 8739 9300 -4746 -23665
8918b3665N413J1086N403k173O154O784p186N959O696k184M068j4460N387K366
$$ -23665 -18252 -7166 -1763 -3936 2218 9002 1816 7775 14471 12287 16355 1895 7282 9648
8904I648J662q915r472K67j6377J0784J4085Q811L612L482M015R47k3804K75L631
$$ 9648 11310 2395 -7077 -6810 -23187 -12403 1682 10493 14105 17587 21602 22549 -1255 -980 2651
8889B651N537J1919m699q837p073M401J825q071m740L235J3765J064j2167p467
$$ 2651 8188 20107 15408 6571 -502 3899 5724 -2347 -7087 -3852 9913 10977 -1190 -8657
8875h657o10L318J023k355J0854Q180k0278k641J4811L829L34p570j508q944j1142
$$ -8657 -9267 -5949 -4926 -7281 3573 11753 -8525 -11166 3645 7474 7808 238 -1270 -10214 -21356
8860b1356q385J3105Q077Q841M244j979N523J1488m084p473j470L472J199n753
$$ -21356 -29741 -16636 -8559 282 4526 2547 8070 19558 15474 8001 6531 10003 11202 5449
8846E449O586P412N125n060r032N335K195p088p732J5807j1383j4103P948O336
$$ 5449 12035 19447 24572 19512 10480 15815 18010 10922 3190 18997 7614 -6489 1459 7795
8832G795M735K666j594n362J0987K327o437L909J0943J4641l839k5102j1485K826
$$ 7795 12530 15196 13602 8240 19227 21554 15117 19026 29969 44610 40771 15669 4184 7010
8818G010n250k706K046N49m887J567o367k942N688M603Q522j4791K47R78R411
$$ 7010 1760 -946 1100 1649 -3238 -1671 -8038 -10980 -5292 -689 7833 -6958 -6711 -5733 3678
8803C678J5714q710m013L642q210o222J453n383P195Q112o254R924O948N90j039
$$ 3678 19392 10682 6669 10311 2101 -4121 -2668 -8051 -856 7256 1002 10926 17874 18464 17425
8788A7425p259l995j958j686L545K713n901j3306o135P487N530Q608n751J918
$$ 17425 10166 6171 4213 2527 6072 8785 2884 -10422 -16557 -9070 -3540 5068 -683 1235
8774A235k584K13Q929J752j0525m606O894m815k735J0625R166o83l675k617m041
$$ 1235 -1349 -1136 7793 9545 -980 -5586 1308 -3507 -6242 4383 13549 12866 9191 6574 2533
8759B533R29N968o278j0688k403q030m696J0979J44N303R243L118j2142m612K3444
$$ 2533 3462 9430 3152 -7536 -9939 -17969 -22665 -11686 -11542 -6239 3004 6122 -6020 -10632 12812
8744A2812M638j9356j4223J8865J5979o563p333L713n99P874J44n035J911N496
$$ 12812 17450 -1906 -16129 2736 18715 12152 4819 8532 7933 15807 15951 10916 12827 18323
8730A8323o975p926K341J0054J1306j2467j0842j72m947Q42Q492n309J730N94
$$ 18323 11348 3422 5763 15817 27123 14656 3814 3642 -1305 -463 8029 2720 4450 5044
8716E044O671P432j1875M880J1677J465j3838j1778l869k986N599Q118J1993M101
$$ 5044 11715 19147 7272 12152 23829 25294 11456 -322 -4191 -7177 -1578 6540 18533 22634
8702B2634j5625q710K579J912q29J711J2182j388k3104j005K4212P581r720m97
$$ 22634 7009 -1701 878 2790 1961 3672 15854 14466 -8638 -9643 14569 22150 12430 11933
8688A1933k827k050m452l529P059J7944R297k240j300l587j8821O2J089j961n96
$$ 11933 9106 7056 2604 -925 6134 24078 33375 31135 29835 26248 7427 7489 8578 6617 6021
8673F021j2896l721l397M756k51J0893p346N449M741J0730j205k087n218l102
$$ 6021 -6875 -10596 -13993 -9237 -9488 1405 -5941 -492 4249 14979 13774 11687 6469 3367
8659C367n709P529P172m707p474n531n497P494O685M008K782l881L692l966j209
$$ 3367 -2342 5187 12359 7652 178 -5353 -10850 -3356 3329 7337 10119 6238 9930 5964 4755
8644D755J3752O764l266n703n012p43J2268j4176J670J2684m412q741J851r306
$$ 4755 18507 25271 22005 16302 11290 10547 22815 8639 10309 22993 18581 9840 11691 2385
8630B385p208J5023k997k186J266O078K171J0398L307n061L731L845J319p824
$$ 2385 -4823 10200 7203 5017 6283 12361 14532 24930 28237 23176 26907 30752 32071 24247
8616B4247m223K400J459j1226P10r179p692l225j020M645N664J2281K481k40O345
$$ 24247 20024 22424 23883 12657 13367 4188 -3504 -6729 -7749 -3104 2560 14841 17322 17082 23427
8601B3427J395O551Q141M083j2993j2393J0803l883j0738Q421O86j202J172N827
$$ 23427 24822 31373 39514 43597 30604 18211 29014 25131 14393 22814 23500 22298 23470 29297
8587B9297q037j931m578j286J1134l755j837k41L224r350J2364J3141o640n220
$$ 29297 21260 19329 14751 13465 24599 20844 19007 18766 21990 12640 25004 38145 31505 26285
8573B6285j5405j8366M064Q712K349M116J530q44m151P337r727q761J346p90J1070
$$ 26285 10880 -7486 -3422 5290 7639 11755 13285 12441 8290 15627 5900 -2861 -1515 -2305 8765
8558H765o981o850N228J0455K0313p696p133k969j5684k970K316L807M932J781
$$ 8765 1784 -5066 162 10617 30930 23234 16101 13132 -2552 -5522 -3206 601 5533 7314
8544G314j1053P44J9452k241J568P970q493j1377J754n302R31n594N632J337q881
$$ 7314 -3739 -2995 16457 14216 15784 23754 15261 3884 5638 336 1267 -4327 1305 2642 -6239
8529f239m875K619M621O49R43L58k623k719j8369O528K1598M262J1456p503k0132
$$ -6239 -11114 -8495 -3874 -3225 -2282 -1924 -4547 -7266 -25635 -19107 2491 6753 18209 10706 -9426
8514i426N945j611J4086J0883Q332R54n557m791q010j1596M514l334j0383J0210
$$ -9426 -3481 -5092 8994 19877 28209 29163 23606 18815 10805 -791 3723 389 -9994 216
8500B16L760l026k928P647n308n295J3218J2371N3k058j7862j3189N786Q901M106
$$ 216 3976 950 -1978 5669 361 -4934 8284 20655 20708 18650 788 -12401 -6615 2286 6392
8485F392J1121r729l772M274J6314M548Q799m903q762l424k0994j0469L211n147
$$ 6392 17513 7784 4012 8286 24600 29148 37947 33044 24282 20858 -136 -10605 -7394 -12541
8471a2541j5445R457J3571j1581k486R836N148M163n04J500L528p624N964N543
$$ -12541 -27986 -18529 -4958 -16539 -19025 -9189 -4041 122 -382 1118 4646 -2978 2986 8529
8457H529p553n431N271Q893l18P731l546j438R741J461j2523r615l46K374K755
$$ 8529 976 -4455 816 9709 9391 17122 13576 12138 21879 23340 10817 1202 856 3230 5985
8442E985R15m454p036L858J2797l773o265p295p685o912J1584L885P22l9M271
$$ 5985 6900 2446 -4590 -732 12065 8292 2027 -5268 -12953 -19865 -8281 -4396 -3674 -3713 558
8427E58k38n509n200o835l397N171J899K938O535p12M274R929P641J745j5239
$$ 558 320 -5189 -10389 -17224 -20621 -15450 -13551 -10613 -4078 -4790 -516 9413 17054 18799 3560
8412C560k5539j3448J5037J4407M819K493j777Q760J3356n843k0203%O978j768
$$ 3560 -21979 -35427 -20390 -5983 -1164 1329 -448 8312 21668 15825 -4378 -4378 2600 832
8398H32P027P523P489J655M592l346k181l443j3015l255o94p517m057L984j061
$$ 832 7859 15382 22871 24526 29118 25772 23591 20148 7133 3878 3184 -4333 -8390 -4406 -5467
8383e467o893j179m256N975J4498j1402M126J270m96J1914k996M013p376m44L218
$$ -5467 -12360 -13539 -17795 -11820 2678 -8724 -4598 -3328 -3824 8090 5094 9107 1731 1287 4505
8368D505l577P71j7791r091L620j529l285J2120K6779N638j6781j1865q675o64
$$ 4505 928 1699 -16092 -25183 -21563 -23092 -26377 -14257 12522 18160 1379 -10486 -19161 -19825
8354a9825n837Q82M382K331P136K698j7903J0274J9216J0664J691j3335m038j737
$$ -19825 -25662 -24780 -20398 -18067 -10931 -8233 -26136 -15862 3354 14018 15709 2374 -1664 -3401
8340c401j2720J5262P479j6916j9894R500J9336J6278Q49L939Q037q004j6097
$$ -3401 -16121 -859 6620 -10296 -30190 -20690 -1354 14924 15773 19712 27749 19745 3648
8327C648l342k605K65J055P881J888Q171J13l472n207k900l220n073q608r52R410
$$ 3648 306 -2299 -2034 -979 6902 8790 16961 17074 13602 8395 5495 2275 -2798 -11406 -12358 -2948
8311b948q74n13Q718m480q339n838p168K429J4856Q923R659L71k522m344J2127
$$ -2948 -3822 -4335 4383 -97 -8436 -14274 -21442 -19013 -4157 4766 14425 14796 12274 7930 20057
8296B0057o915L175l451j2854O271J6719j1381j470k779L014q544O42N815P876
$$ 20057 13142 16317 12866 12 6283 23002 11621 10151 7372 10386 1842 2484 8299 16175
8282A6175Q665p057j1924j4987O206q60l254n062M39J2981O467j342R162M505
$$ 16175 24840 17783 5859 -9128 -2922 -3782 -7036 -12098 -11659 1322 7789 6447 15609 20114
8268B0114j7753q462K669n53R9o208o87J8055R359j0270j8452j429n831l013q49
$$ 20114 2361 -6101 -3432 -3985 -3886 -10094 -10781 7274 16633 6363 -12089 -13518 -19349 -22362 -23211
8253b3211O892J4000J5433O297o861l328J841K064N737n80j6420r100n874J704
$$ -23211 -16319 -2319 13114 19411 12550 9222 11063 13127 18864 18284 1864 -7236 -13110 -11406
8239a1406P241j2913o716r76L332J3037L724j386N546p694j3337l786J1875J372
$$ -11406 -4165 -17078 -23794 -24770 -21438 -8401 -4677 -6063 -517 -8211 -21548 -25334 -13459 -12087
8225a2087m803o784P935l727q739J4581J2054J2348J8616k200j2642n235L337
$$ -12087 -16890 -23674 -15739 -19466 -28205 -13624 -1570 10778 29394 27194 14552 9317 12654
8212A2654j8462r007o65n867j4020P186R746J037L435M14j523L391j3692r378
$$ 12654 -5808 -14815 -15480 -21347 -35367 -28181 -18435 -17398 -13963 -13549 -15072 -11681 -25373 -34751
8198c4751m084J3406J2782N129l749q286M9L023L362q966R943n990M635K0555
$$ -34751 -38835 -25429 -12647 -7518 -11267 -19553 -19504 -16481 -13119 -22085 -12142 -18132 -13497 7058
8184G058K293j2757n20Q616Q95J511k067K686j1545j2300J1401J1496l572j0307
$$ 7058 9351 -3406 -3926 4690 5585 7096 5029 7715 -3830 -16130 -4729 6767 3195 -7112
8170g112j5943L990K986q734l741j198O624L165J5986K3964K0299m677j8201j3112
$$ -7112 -23055 -19065 -16079 -24813 -28554 -29752 -23128 -19963 -3977 19987 40286 35609 17408 4296
8156D296m031l128N910R301N822n357R095L607r469p855K784p847n621O521n401
$$ 4296 265 -2863 3047 12348 18170 12813 21908 25515 16046 8191 10975 3128 -2493 4028 -1373
8141a373M076J205P162J577q616L042K018J596k907j0184j9m449n60J4927o710
$$ -1373 2703 3908 11070 12647 4031 7073 9091 10687 7780 -2404 -2423 -6872 -7432 7495 785
8126G85J7586K1216j0505j1466j3920l711p030K989R089p450J216R40Q277j24
$$ 785 18371 39587 29082 17616 3696 -15 -7045 -4056 5033 -2417 -1201 -261 8016 7892
8112G892L466J2063l929j0244j1070O428K2084Q337j7961k3552j0539Q702J5371
$$ 7892 11358 23421 19492 9248 -1822 4606 26690 35027 17066 -6486 -17025 -8323 7048
8099G048J2216O171k624j672j15N007J7j3670L714J2489j040n389n491j387l944
$$ 7048 19264 25435 22811 21139 21024 26031 26048 12378 16092 28581 27541 22152 16661 15274 11330
8084A1330J488l368l101k0672r846R463J3251J714j612k911o94R024J2618N878
$$ 11330 12818 9450 6349 -14323 -24169 -14706 -1455 259 -1353 -4264 -4958 4066 16684 22562
8070B2562l354K930J3208j4697j6606j061J8381L009j0686p780R997J0592j0252
$$ 22562 19208 22138 35346 20649 4043 2982 21363 24372 13686 5906 15903 26495 16243
8057A6243j0282q963L163m627K764N584j17N47l378p834r854k670M574R604j138
$$ 16243 5961 -3002 161 -4466 -1702 3882 3765 4312 934 -6900 -16754 -19424 -14850 -5246 -6384
8042f384J3822J2515n88P63R451P679k15j4688j6675r381k014R778Q322P357m075
$$ -6384 7438 19953 19365 20128 29579 37258 37043 22355 5680 -3701 -5715 4063 12385 19742 15667
8027A5667K315J2134m667j0421L17K181M108o723l361k932K438p359r28J2276
$$ 15667 17982 30116 25449 15028 15345 17526 21634 14911 11550 8618 11056 3697 2769 15045
8013A5045N509j1042k229J0327J372j0987m916r206J7142M269K947N142q992k0424
$$ 15045 20554 9512 7283 17610 18982 7995 3079 -6127 11015 15284 18231 23373 14381 -6043
7999f043J2932J6658J1868J7210J1228p070k4114P652J5192j2938j4771o370J6596
$$ -6043 6889 23547 35415 52625 63853 56783 32669 40321 55513 42575 27804 21434 38030
7986C8030j927j1256O801N588k938j2549j2367q54l747N970K842j2195n503P481
$$ 38030 36103 24847 31648 37236 34298 21749 9382 8528 4781 10751 13593 1398 -4105 3376
7972C376k781o557O605k199Q772p950j0574r143O257J4842Q386o434p783o08l635
$$ 3376 595 -5962 643 -1556 7216 -734 -11308 -20451 -14194 648 9034 2600 -5183 -5791 -9426
7957i426J1321N867J8473p752r535l132K882L955k652L519Q525L962N436r124
$$ -9426 1895 7762 26235 18483 8948 5816 8698 12653 10001 13520 22045 26007 31443 22319
7943B2319m067L091j9732j2555J3352l424O984J887j525m743m231Q670J4673J5503
$$ 22319 18252 21343 1611 -10944 2408 -1016 5968 7855 6330 1587 -2644 6026 20699 36202
7929C6202P639k863m605o675m385n396l739j8715O723J9452m203l617J033j2571
$$ 36202 43841 40978 36373 29698 25313 19917 16178 -2537 4186 23638 19435 15818 16851 4280
7915D280j5681O825J7021M456m026j0267n707J942j029J1978J2255L1L759J273
$$ 4280 -11401 -4576 12445 16901 12875 2608 -3099 -1157 -2186 9792 22047 22078 25837 27110
7901B7110q256K415J1763M234j9941k024O921J4471K300k0847j0104n510m735
$$ 27110 18854 21269 33032 37266 17325 15301 22222 36693 38993 18146 8042 2532 -2203
7888b203M090l147N995r88q809m455M509N0P120n567n570N098J373j0154k065
$$ -2203 1887 -1260 4735 3747 -5062 -9517 -5008 -4958 2162 -3405 -8975 -3877 -2504 -12658 -14723
7873a4723P26J710K882K496o106j282r775M951J2503K833K929J3966j895n443
$$ -14723 -13997 -12287 -9405 -6909 -13015 -14297 -24072 -19121 -6618 -3785 -856 13110 11215 5772
7859E772o580o749M165k377J576J6787R501K587j8261j3580J0800l649j094R089
$$ 5772 -808 -7557 -3392 -5769 -4193 12594 22095 24682 6421 -7159 3641 -8 -1102 7987
7845G987N832M46J0357k651r242k0273q805J7658O995O242o408K545N679j404
$$ 7987 13819 14265 24622 21971 12729 -7544 -16349 1309 8304 14546 8138 10683 16362 14958
7831A4958l761K366j051k121n384J701Q977r936J512L607J6065n121o674N0K0
$$ 14958 11197 13563 12512 10391 5007 6708 15685 5749 7261 10868 26933 21812 15138 15188 15208
7816A5208o225j899K689J0257m327P060l801k428Q366q654Q455l28m291j3033
$$ 15208 8983 7084 9773 20030 15703 22763 18962 16534 24900 16246 24701 24373 20082 7049
7802G049m067j989J716J5567L857m664m244O290p158q903J0077r939j0060Q871
$$ 7049 2982 993 2709 18276 22133 17469 13225 19515 12357 3454 13531 3592 -6468 2403
7788B403M74N497k96o319J3258M593j8990j2293P790Q592L646J040m031n262r890
$$ 2403 2877 8374 8078 1759 15017 19610 620 -11673 -3883 4709 8355 9395 5364 102 -9788
7773i788n196l928J714n97p662N977O985K0147j202J012p707N905N050Q70m213
$$ -9788 -14984 -18912 -17198 -17795 -25457 -19480 -12495 7652 6450 7462 -245 5660 10710 11580 7367
7758G367J877l640N360J808K320O59j6953p063J0267k907J3726N248j1063l866
$$ 7367 9244 5604 10964 12772 15092 15751 -1202 -8265 2002 -905 12821 18069 7006 3140
7744C140j5461N378J0n496Q115k498j0184N791k927o141J3135P259N373p056R688
$$ 3140 -12321 -6943 -6933 -12429 -4314 -6812 -16996 -11205 -14132 -20273 -7138 121 5494 -1562 8126
7729H126J3508q273L752L45j3104n643j1753O307R822J0137R307n659j7661J042
$$ 8126 21634 13361 17113 17458 4354 -1289 -13042 -6735 3087 13224 22531 16872 -789 253
7715B53N275L675j054M910k462K870m490k5906K514Q497J653M923J3952N016k470
$$ 253 5528 9203 8149 13059 10597 13467 8977 -16929 -14415 -5918 -4265 658 14610 19626 17156
7700A7156n553k30J0089N068j136k600o238j0173j039J1230m743n764j3805k852
$$ 17156 11603 11373 21462 26530 25394 22794 16556 6383 5344 16574 11831 6067 -7738 -10590
7686a0590N264N819n13n103K382k517j0640P393M333l143K645J9234K1405p584
$$ -10590 -5326 493 -20 -5123 -2741 -5258 -15898 -8505 -4172 -7315 -4670 14564 35969 28385
7672B8385j7723j0488q430J2226M900o182l330Q990P866j3386j2047R038o0q99
$$ 28385 10662 174 -8256 3970 8870 2688 -642 8348 16214 2828 -9219 -181 -241 -1140
7658a140J4523o544q609j1221Q977J0651k788k25j606j4347r893L557P311M077
$$ -1140 13383 6839 -1770 -12991 -4014 6637 3849 3624 2018 -12329 -22222 -18665 -11354 -7277
7644g277p141P511Q827O057k34m624O887p097o484j2461R974Q729N752M558q432
$$ -7277 -14418 -6907 1920 7977 7743 3119 10006 2909 -3575 -16036 -6062 2667 8419 12977 4545
7629D545j520M459k221j718o968l455O306j216P907l566J461l127n157j2062J849
$$ 4545 3025 7484 5263 3545 -3423 -6878 -572 -1788 6119 2553 4014 887 -4270 -16332 -14483
7614a4483J2411o918k605K215P240P674k786L262R973o819j4203q26K578Q415
$$ -14483 -2072 -8990 -11595 -9380 -2140 5534 2748 6010 15983 9164 -5039 -5865 -3287 5128
7600E128m658r209j053j3412J4128J1184N285O66n078n003K475m19k1843n593
$$ 5128 470 -8739 -9792 -23204 -9076 2108 7393 8059 2981 -2022 453 34 -21809 -27402
7586b7402K0091M890l556p05P28J165N879J8573K108P038o432j5847q894O628
$$ -27402 -7311 -2421 -5977 -6682 -5954 -4789 1090 19663 21771 28809 22377 6530 -2364 4264
7572D264m575k452j2085j443O154K1489j1251o353q865M361J0336J2608l4l344
$$ 4264 -311 -2763 -14848 -16291 -10137 11352 101 -6252 -15117 -10756 -420 12188 12154 8810
7558H810m872N543J596m615R249j2860L243N884j0811O392J0401r047P438R058
$$ 8810 3938 9481 11077 6462 15711 2851 6094 11978 1167 7559 17960 8913 16351 25409
7544B5409J163j4422r351q071L418r14J9770k008r528l433j2272p785K442M258
$$ 25409 26572 12150 2799 -5272 -1854 -2768 17002 14994 5466 2033 -10239 -18024 -15582 -11324
7530a1324O020n73l472o391J0251O952k513j352p21n196Q147j1998j8113Q873
$$ -11324 -5304 -5877 -9349 -15740 -5489 1463 -1050 -2402 -3123 -8319 -172 -12170 -30283 -21410
7516b1410J1273Q401Q210L670M472k593O691Q695Q8R42j5159r352J673j5o068
$$ -21410 -10137 -1736 6474 10144 14616 12023 18714 27409 27497 28439 13280 3928 5601 5586 -482
7501d82m691Q406R689Q385p475j694N75q906o352L359J7892R07j3796j1095O770
$$ -482 -5173 3233 12922 21307 13832 12138 12713 3807 -2545 814 18706 19613 5817 -5278 1492
7486A492J6796j016j0587j0255m136o771J2821Q112P43r419j8049j4758Q45J3436
$$ 1492 18288 17272 6685 -3570 -7706 -14477 -1656 6456 7199 -2220 -20269 -35027 -34182 -20746
7472b0746O915n70o834K400j4755P833J5394o52o61J3852O158J0017J3098p227
$$ -20746 -13831 -14401 -21235 -18835 -33590 -25757 -10363 -11015 -11676 2176 8334 18351 31449 24222
7458B4222k2142j4017J805J8319J7718l552j3917m696j565r953r13p269j2852
$$ 24222 2080 -11937 -10132 8187 25905 22353 8436 3740 2175 -7778 -8691 -15960 -28812
7445b8812J744J6581J6733j0429r536R80o040q45Q311O729j3390j7341J2076K1926
$$ -28812 -27068 -10487 6246 -4183 -13719 -12739 -18779 -19624 -11313 -4584 -17974 -35315 -23239 -1313
7431a313q74k1180q032N215N546j1452j5149O571K4109l72P371m372m858P372
$$ -1313 -2187 -23367 -31399 -26184 -20638 -32090 -47239 -40668 -16559 -16931 -9560 -13932 -18790 -11418
7417a1418j903p867J0111J789o716k378L356J5699O280p46j0440N857K763M175
$$ -11418 -13321 -21188 -11077 -9288 -16004 -18382 -15026 673 6953 6207 -4233 1624 4387 8562
7403H562J2606q323j8830j40R325Q784j1461r609O481M018j507J747k395R470
$$ 8562 21168 12845 -5985 -6125 3200 11984 523 -9086 -2605 1413 -94 1653 -742 8728
7389H728M233p748n297j7524L48J3203J958l895J243P874J6376l842j3746j396
$$ 8728 12961 5213 -84 -17608 -17260 -4057 -2099 -5994 -4751 3123 19499 15657 1911 515
7375E15J2824k858J434r154k972l216K495n661J226N182q767l906m408J0773J4792
$$ 515 13339 10481 11915 2761 -211 -3427 -932 -6593 -5367 -185 -8952 -12858 -17266 -6493 8299
7360H299N746Q395j3401m665j816r248j4714M909J167O11P963p61o71J534J0435
$$ 8299 14045 22440 9039 4374 2558 -6690 -21404 -16495 -15328 -14717 -6754 -7515 -8186 -6652 3783
7345C783j1647j3472J8316J4654O854o340L464O120j0135j2922l51l374r479R198
$$ 3783 -7864 -21336 -3020 11634 18488 12148 15612 21732 11597 -1325 -1676 -5050 -14529 -5331
7331e331J0397L397k215j0021r584j2872J3799o957O262R756O546l335N57J3621
$$ -5331 5066 8463 6248 -3773 -13357 -26229 -12430 -19387 -13125 -3369 3177 -158 399 14020
7317A4020Q101l411j6598L472M063o816j3629R968p225r019J6531J839j687L190
$$ 14020 22121 18710 2112 5584 9647 2831 -10798 -830 -8055 -17074 -543 1296 -391 2799
7303B799o160n593P459L110o187o205M914J0098J2816m982j654m467j1038l87
$$ 2799 -3361 -8954 -1495 1615 -4572 -10777 -5863 4235 17051 12069 10415 5948 -5090 -5477
7289e477O562K20R686K125o091K517J2678J889M038N307j4046r227M57k547q651
$$ -5477 1085 1305 10991 13116 7025 9542 22220 24109 28147 33454 19408 10181 10638 8091 -560
7274e60J450n543p44p956j129K62N474p847P129J4193p103n783j3428j1397J6923
$$ -560 890 -4653 -5397 -13353 -14482 -14220 -8746 -16593 -9464 4729 -2374 -8157 -21585 -32982 -16059
7259a6059R589O153M21J4917P808p630r27p959r497K682l423l899N566K982j0663
$$ -16059 -6470 -317 104 15021 22829 15199 14272 6313 -3184 -502 -3925 -7824 -2258 724 -9939
7244i939m824p048l070J1700J7302K715L13J0973k206j6971q013L313Q230k1140
$$ -9939 -14763 -21811 -24881 -13181 4121 6836 7149 18122 15916 -1055 -9068 -5755 2475 -18665
7230a8665m020m282q41K388j0650K033J4418l210M990N373K96O979p128r71p401
$$ -18665 -22685 -26967 -27808 -25420 -36070 -34037 -19619 -22829 -17839 -12466 -12170 -5191 -12319 -13290 -20691
7215b0691J0595N198j324j0768r726K0828J4668l508Q163K669P903j7553m601
$$ -20691 -10096 -4898 -6222 -16990 -26716 -5888 8780 5272 13435 16104 24007 6454 1853
7202A853M932J865m538j784M227r983M16q078J4131L79o18q615l791R879J0234
$$ 1853 6785 8650 4112 2328 6555 -3428 -3012 -11090 3041 3420 2802 -5813 -9604 275 10509
7187A0509j990j3225P51O61N496o454j0130o770J0930n589j2194j2353J2806K0383
$$ 10509 8519 -4706 -3955 -3294 2202 -4252 -14382 -21152 -10222 -15811 -28005 -40358 -27552 -7169
7173g169N318O03M778K53r129P47N339N026m632M371L911m723j6226o983m145
$$ -7169 -1851 -1248 3530 3783 -5346 -4599 740 5766 1134 5505 9416 4693 -11533 -18516 -22661
7158b2661J850M373P486J405M854k193r036o324j2880J3047O051n224r32j857
$$ -22661 -20811 -16438 -8952 -7547 -2693 -4886 -13922 -20246 -33126 -20079 -14028 -19252 -20184 -22041
7144b2041O970J1181Q16j1333R235j07p992J0812J9506m965j787q422l540N282
$$ -22041 -15071 -3890 -3074 -14407 -5172 -5279 -13271 -2459 17047 12082 10295 1873 -1667 3615
7130C615R410n696o92j1868K073j074j1740l714k462m05J944J5802J1773p863
$$ 3615 13025 7329 6637 -5231 -3158 -4232 -15972 -19686 -22148 -22553 -20609 -4807 6966 -897
7116h97j4057j3317j77J8335J2551J6764k2416k7090l665R035k21J282J1774K211
$$ -897 -14954 -28271 -28448 -10113 2438 19202 -3214 -30304 -33969 -24934 -25155 -23873 -12099 -9888
7102i888K256r263M725N947M173O091J558L166m955j6106n136J6142J4011m304
$$ -9888 -7632 -16895 -12170 -6223 -2050 4041 5599 8765 3810 -12296 -17432 -1290 12721 8417
7088H417K132r859l190M380k069p665q52J3368L852j2604K240M409n343j0293
$$ 8417 10549 690 -2500 1880 -189 -7854 -8706 4662 8514 -4090 -1850 2559 -2784 -13077
7074a3077j77K046N057J3994L73P345J323j7970j3771J6904K2433l275k031j0985
$$ -13077 -13254 -11208 -6151 7843 8216 15561 16884 -1086 -14857 2047 24480 21205 19174 8189
7060H189r276j63p00L259k737N994O688o73Q298n754j078p374O672J1533j1644
$$ 8189 -1087 -1250 -1950 1309 -1428 4566 11254 10581 18879 13125 12047 4673 11345 22878 11234
7045A1234j1225j006j5956j4104L159N985J4553m671L63o262J5637O681k808j789
$$ 11234 9 -997 -16953 -31057 -27898 -21913 -7360 -12031 -11668 -17930 -2293 4388 1580 -209
7031b09j1760o572J8704M108p651j840J1377q569N551R57p810q608n391k3r71
$$ -209 -11969 -18541 163 4271 -3380 -5220 6157 -2412 3139 4096 -3714 -12322 -17713 -17736 -18707
7016a8707O354J0121n516K360p269q373j379P949J5281J0005p936N315p05j2955
$$ -18707 -12353 -2232 -7748 -5388 -12657 -21030 -22409 -14460 821 10826 2890 8205 7500 -5455
7002e455j054L74Q242lm966l961K005Q923p682p891Q70j497O514J361m92q751
$$ -5455 -6509 -6135 2107 2104 -2862 -6823 -4818 4105 -3577 -11468 -10598 -12095 -5581 -4220 -4712 -13463
6986a3463j469J9443r7P16M861j2666p928N051P021l016M479r135q639J0399Q762
$$ -13463 -14932 4511 4414 5130 9991 -2675 -10603 -5552 1469 -1547 2932 -6203 -14842 -4443 4319
6971D319n4K654j2253m399q00j076J8108P981l615M485m179k922j414M94Q055
$$ 4319 4265 6919 -5334 -9733 -10533 -11609 6499 14480 10865 15350 11171 8249 6835 7329 15384
6956A5384L527j2963k0951J35K053l870pO263K0462J8429O54j3903j5215o008
$$ 15384 18911 5948 -15003 -14868 -12815 -16685 -16692 -10429 10033 28462 29116 15213 -2 -6010
6942f010K929J3474r943j0811j0283M650r8j374K1896J3089j8644j7628m101r66
$$ -6010 -3081 10393 450 -10361 -20644 -15994 -16092 -17466 4430 17519 -1125 -18753 -22854 -23820
6928b3820J1878R598j3656m859O996K2720N992N476Q647p649q803j0403n181O368
$$ -23820 -11942 -2344 -16000 -20859 -13863 8857 14849 20325 28972 21323 12520 2117 -3064 3304
6914C304N814J4985l789p643n43j2266j5494J805N699J292o300O23k419k77q049
$$ 3304 9118 24103 20314 12671 12128 -138 -15632 -13827 -8128 -6836 -13136 -12513 -14932 -15209 -23258
6899b3258P04J0480R930K85K333j2132k815O689k359J456P011M777m188r316M270
$$ -23258 -22554 -12074 -2144 -1859 474 -11658 -14473 -7784 -10143 -8687 -1676 3101 -1087 -10403 -6133
6884f133J5270k921o44K041L159L503J258k017j4540o708O669N079K581J966j2171
$$ -6133 9137 6216 5572 7613 10772 14275 15533 13516 -1024 -7732 -1063 4016 6597 8563 -3608
6869c608J572p229O186J8717K601j148K006l738O079j1660o472R014M346O059
$$ -3608 -2036 -9265 -3079 15638 18239 17091 19097 15359 21438 9778 3306 12320 16666 22725
6855B2725k863j2535p494j1582p082Q616M710R5j0863k018M570M394j9353k482
$$ 22725 19862 7327 -167 -11749 -18831 -10215 -5505 -5410 -16273 -18291 -13721 -9327 -28680 -31162
6841c1162J7946K0102J476r164k4349j9458Q953J0900M898P435L444j0040n283
$$ -31162 -13216 6886 8362 -802 -25151 -44609 -35656 -24756 -19858 -12423 -8979 -19019 -24302
6828b4302n70J1226Q270O460m263r695J6771R623R926j2436q784j6451l739j802
$$ -24302 -24872 -13646 -5376 1084 -3179 -12874 3897 13520 23446 11010 2226 -14225 -17964 -19766
6814a9766O14j21O20M768j093l446k426J943J4844q06o867k4237q565K4247J2880
$$ -19766 -19152 -19273 -18653 -13885 -14978 -18424 -20850 -18907 -4063 -4869 -11736 -35973 -44538 -20291 -7411
6799g411k360k596p324k248m367J1105R106Q18N795j120p687J1884J650M612m729
$$ -7411 -9771 -12367 -19691 -21939 -26306 -15201 -6095 -5277 518 -602 -8289 3595 5245 9857 5128
6784E128L149J2014n849j1173Q89o926o085J2790l014J779O906j8465J2060O863
$$ 5128 8277 20291 14442 3269 4158 -2768 -8853 3937 923 2702 9608 -8857 3203 10066
6770A0066j7302j0017N358N204N948j928q979k852M823m068j3034N142M96Q470
$$ 10066 -7236 -17253 -11895 -6691 -743 -2671 -11650 -14502 -9679 -13747 -26781 -21639 -21143 -12673
6756a2673j4130l47J3707J6583r55j6352o09n064L196j825K856l813M600K64l156
$$ -12673 -26803 -27150 -13443 3140 2185 -14167 -14776 -19840 -16644 -18469 -15613 -19426 -14826 -14562 -17718
6741a7718P559r09n734K0J0398P295j243L106O567J790Q80k763p939j3052Q272
$$ -17718 -10159 -11068 -16802 -16782 -6384 911 -332 2774 9341 11131 12011 9248 1309 -11743 -3471
6726c471R673j1957k523J13l169P31P521J2557j949P086R805j5893j2734l811
$$ -3471 6202 -5755 -8278 -8165 -11334 -10603 -3082 9475 7526 14612 24417 8524 -4210 -8021
6712h021K686L865N220O14j931J3363k378p988N200j4713j020J3658P592q634
$$ -8021 -5335 -1470 3750 4364 2433 15796 13418 5430 10630 -4083 -5103 8555 16147 7513
6698G513q893J0178K504p733j3521j893J2252L215N043J3337m579k1110j0760
$$ 7513 -1380 8798 11302 3569 -9952 -11845 407 3622 8665 22002 17423 -3687 -14447
6685a4447n000M224M185n672O661R910N26M42o587M862J3767L037o871j1794j6061
$$ -14447 -19447 -15223 -11038 -16710 -10049 -139 387 829 -5758 -896 12871 15908 9037 -2757 -18818
6670a8818k2348m320J0818Q109R815r735R103J5744j1489m457J2144l781M847
$$ -18818 -41166 -45486 -34668 -26559 -16744 -26479 -17376 -1632 -13121 -17578 -5434 -9215 -4368
6657d368q155k799L478N775N907N140l723q606j0093l034J1603J1487j2593j6480
$$ -4368 -12523 -15322 -11844 -6069 -162 4978 1255 -7351 -17444 -20478 -8875 2612 -9981 -26461
6643b6461J5645O202N1q315J141L629m263Q323j867P926Q760q494J773j1150J0488
$$ -26461 -10816 -4614 -4563 -12878 -11737 -8108 -12371 -4048 -5915 2011 10771 2277 4050 -7100 3388
6628C388k053J293N518j433j1426m031M755j29j1546M953j84L866J0655J1235
$$ 3388 1335 2628 8146 6713 -4713 -8744 -3989 -4118 -15664 -10711 -10895 -7029 3626 14861
6614A4861q919j4628J937J270L055m907P24J531J778K297K140M068l989O798r866
$$ 14861 5942 -8686 -6749 -5479 -2424 -7331 -6607 -5076 -3298 -1001 1139 5207 1218 8016 -1850
6599a850j4961L875R017M727m299o909j1110l92L682O910l73j390L352J8883P449
$$ -1850 -16811 -12936 -3919 808 -3491 -10400 -21510 -21902 -18220 -11310 -11683 -13073 -9721 9162 16611
6584A6611k0357j4650M20N681J1715M446q398L498L708p994m555M117n888J7847
$$ 16611 -3746 -18396 -17976 -12295 -580 3866 -4532 -1034 2674 -5320 -9875 -5758 -11646 6201
6570F201M645j205K0382k486o825j2023j7567N413J2397j432p453r692l582P994
$$ 6201 10846 9641 30023 27537 20712 8689 -8878 -3465 8932 7500 47 -9645 -13227 -5233
6556e233Q307p273r102l270n009R358k843l634M882n965O864Q901r090n443J2180
$$ -5233 3074 -4199 -13301 -16571 -21580 -12222 -15065 -18699 -13817 -19782 -12918 -4017 -13107 -18550 -6370
6541f370Q032l928j732m31J3740O904j8782k1274O054J1547K203Q587P033R249
$$ -6370 1662 -2266 -3998 -4429 9311 16215 -2567 -23841 -17787 -6240 -4037 4550 11583 20832
6527B0832m746j0319o46J979j2846P39J1562K01O60r732Q484p212N353K979O927
$$ 20832 16086 5767 5121 7100 -5746 -5007 6555 6756 7416 -2316 6168 -1044 4309 7288 14215
6512A4215k614j0989k194k48o744M225J2857J044M829J2312J461n926N22j7052
$$ 14215 11601 612 -1582 -1830 -8574 -4349 8508 9552 14381 26693 28154 22228 22750 5698
6498E698j5720j376P09P026l380j5532m819J757J2672N995L450k617j2852K280
$$ 5698 -10022 -11398 -10689 -3663 -7043 -22575 -27394 -25637 -12965 -6970 -3520 -6137 -18989 -16709
6484a6709K0550J1835L851q162j9316J5681j174p096j4674o941P342Q368r917
$$ -16709 3841 15676 19527 11365 -7951 7730 6556 -540 -15214 -22155 -14813 -6445 -16362
6471a6362R112J320k766p950j2503l056J3750J4152N520N294j1832j4434o54j0350
$$ -16362 -7250 -5930 -8696 -16646 -29149 -32205 -18455 -4303 1217 6511 -5321 -19755 -20409 -30759
6457c0759j6376J5446Q685K683J2309Q835O833L407r59n800q745k815q836N436
$$ -30759 -47135 -31689 -23004 -20321 -8012 823 7656 11063 10104 4304 -4441 -7256 -16092 -10656
6443a0656j2642K397R233m485r489R456J1618Q366J3404j0866j8575m27O784q771
$$ -10656 -23298 -20901 -11668 -16153 -25642 -16186 -4568 3798 17202 6336 -12239 -12666 -5882 -14653
6429a4653j470Q721L914j0K338J4239P3j3488J545J638L55J766n831J448O153
$$ -14653 -16123 -7402 -3488 -3498 -1160 13079 13152 -336 1209 2847 3202 4968 -863 585 6738
6414F738L200O663j0812j3216m736P554K564K258P060N646M093k445j0071j812
$$ 6738 9938 16601 5789 -7427 -12163 -4609 -2045 213 7273 12919 17012 14567 4496 2684
6400B684O214P754K217r507j3180J585m250N87k102o609k598k239M540M930o311
$$ 2684 8898 16652 18869 9362 -3818 -2233 -6483 -5896 -7998 -14607 -17205 -19444 -14904 -9974 -16285
6385a6285Q784R136p774L318J1263j26k2585j406N908O737k149K19L643o826l61
$$ -16285 -7501 1635 -6139 -2821 8442 8316 -14269 -15675 -9767 -3030 -5179 -4960 -1317 -8143 -8504
6370h504J0030L244j122J397q093J265J2183j4631k3110L799J4011J325r630M965
$$ -8504 1526 4770 3648 5045 -3048 -1783 10400 -4231 -27341 -23542 -9531 -8206 -17836 -12871
6356a2871M974j1281k168J4218K2337j0196j5137n760k621K1315J0226n606o197
$$ -12871 -7897 -19178 -21346 -7128 15209 5013 -10124 -15884 -18505 2810 13036 7430 1233
6343A233O221j8087K424J2253R372j417r035k4189M499J3662j8154l678M622l744
$$ 1233 7454 -10633 -8209 4044 13416 11999 2964 -21225 -16726 -3064 -21218 -24896 -20274 -24018
6329b4018n034n76J2628O398n54J9918P785j1506l998P747L798l01j473p405j5032
$$ -24018 -29052 -29628 -17000 -10602 -11156 8762 16547 5041 1043 8790 12588 12287 10814 3409 -11623
6314a1623K508N027k123J1680L74r500j5670K13J667O24Q969K064N563J3416l840
$$ -11623 -9115 -4088 -6211 5469 5843 -3657 -19327 -19114 -17447 -16823 -7854 -5790 -227 13189 9349
6299I349M782j432m544n452J3169p775M303R241j5310j3376P353J1943L440m975
$$ 9349 14131 12699 8155 2703 15872 8097 12400 21641 6331 -7045 308 12251 15691 10716
6285A0716n090j4197p936J950J7655P453q356r521n29j07k603J1249R349k037
$$ 10716 5626 -8571 -16507 -14557 3098 10551 2195 -7326 -7855 -7962 -10565 684 10033 7996
6271G996q055q819k238J3154J0737p086q431J179j982j3676k06N734K690n646
$$ 7996 -59 -8878 -11116 2038 12775 5689 -2742 -1563 -3545 -17221 -17427 -11693 -9003 -14649
6257a4649M044J0150M441n586p811K732j0940l104L037o118k237M478M739J1269
$$ -14649 -10605 -455 3986 -1600 -9411 -6679 -17619 -20723 -17686 -23804 -26041 -21563 -16824 -5555
6243e555n666k328J969l530M757p700p526J070N585J4588L129k696p272J1574
$$ -5555 -11221 -13549 -11580 -15110 -10353 -18053 -25579 -24509 -18924 -4336 -1207 -3903 -11175 399
6229C99k461O130N915J116p594j5613o249K371M718J0805N818R517l084n830Q80
$$ 399 -2062 4068 9983 11099 3505 -12108 -18357 -15986 -11268 -463 5355 14872 11788 5958 6838
6214F838J457q417o462m44R479l699r998J267l049Q103J0167M410L19P819m157
$$ 6838 8295 -122 -6584 -7028 2451 -1248 -11246 -9979 -13028 -4925 5242 9652 9971 17790 13633
6199A3633O24P356J3493j417j4290n804Q184O839p275k430j0660O82k356J295
$$ 13633 14257 21613 35106 33689 19399 13595 21779 28618 21343 18913 8253 8935 6579 7874
6185G874O931Q802J213o675j571k603j2374p897r432M067Q851j4528j662R232
$$ 7874 14805 23607 24820 18145 16574 13971 1597 -6300 -15732 -11665 -2814 -17342 -19004 -9772
6171i772R400L970j4130j2629k587L19n735J983K2264Q610q036m660j225Q185
$$ -9772 -372 3598 -10532 -23161 -25748 -25429 -31164 -29181 -6917 1693 -6343 -11003 -12228 -4043
6157d043J7595j612r507k565k387j1484q746J2568R561j2452L018m059Q978J6984
$$ -4043 13552 11940 2433 -132 -2519 -14003 -22749 -10181 -620 -13072 -10054 -14113 -5135 11849
6143A1849p39J507k88K771n127q337j5539J758p526n68J3595Q588J0762M389J851
$$ 11849 11110 12617 12329 15100 9973 1636 -13903 -12145 -19671 -20239 -6644 1944 12706 17095 18946
6128A8946j1484k4286R941J2287M041K656J989K128R63o878r460Nm315M837L365
$$ 18946 7462 -16824 -6883 5404 9445 12101 14090 16218 17181 10303 843 848 -3467 1370 4735
6113D735r508r697r621j509Q320n689J0389k371j3409L590l733j2532J4279J1228
$$ 4735 -4773 -14470 -24091 -25600 -17280 -22969 -12580 -14951 -28360 -24770 -28503 -41035 -26756 -15528
6099a5528O384Q919P307J26j97q647j506j6056m427K691N254Q324J3514K0553
$$ -15528 -9144 -225 7082 7208 7011 -1636 -3142 -19198 -23625 -20934 -15680 -7356 6158 26711
6085B6711P994n047m48j0765j7595q865o049M884j692n705R127J0155N630l261
$$ 26711 34705 29658 29210 18445 850 -8015 -14064 -9180 -10872 -16577 -7450 2705 8335 5074
6071E074P193L018K499k0146j4950M673J1516n675j9393L483J7932J3869l284
$$ 5074 12267 15285 17784 -2362 -17312 -12639 -1123 -6798 -26191 -22708 -4776 9093 5809
6058E809P37l256j1783r044j277N626N310J0528J0804j3825j5988L395j03N412
$$ 5809 6546 3290 -8493 -17537 -18814 -13188 -7878 2650 13454 -371 -16359 -12964 -13067 -7655
6044g655O289l89p933r515L643J1352j069M726j0005m761j1737J1231L0474K862
$$ -7655 -1366 -1755 -9688 -19203 -15560 -4208 -5277 -551 -10556 -15317 -27054 -15823 14651 17513
6030A7513j9135J382J1457J767p19p085p017J0526j6449L001R977m888j4143K253
$$ 17513 -1622 -240 11217 12984 12265 5180 -1837 8689 -7760 -4759 5218 330 -13813 -11560
6016a1560r336p52J3347M318j531n094q46P556J2310K381P20j5977j1643P236
$$ -11560 -20896 -21648 -8301 -3983 -5514 -10608 -11454 -3898 8412 10793 11513 -4464 -16107 -8871
6002h871q575j0470N052K440j09J6245r379j549N880q975n623N878J1563j0158
$$ -8871 -17446 -27916 -22864 -20424 -20533 -4288 -13667 -15216 -9336 -18311 -23934 -18056 -6493 -16651
5988a6651Q69m616N486J5225J1643r411P638J2785j0906j3312O701L346j2586
$$ -16651 -15782 -20398 -14912 313 11956 2545 10183 22968 12062 -1250 5451 8797 -3789
5975c789j7534o598L632P225j007l087m189N559J1866M358q054o081j222j0491
$$ -3789 -21323 -27921 -24289 -17064 -18071 -21158 -25347 -19788 -7922 -3564 -11618 -17699 -18921 -29412
5961b9412J2327K0415K973r269o255N497K183J2517R025n826p186o369l930P325
$$ -29412 -17085 3330 6303 -2966 -9221 -3724 -1541 10976 20001 14175 6989 620 -3310 4015
5947D015J0780p564o916J0690R140N154j5310o422j5093j3354P902J1373J3804
$$ 4015 14795 7231 315 11005 20145 25299 9989 3567 -11526 -24880 -16978 -5605 8199
5934H199k292j4216p231J723K758L953L109Q00J489j548j2733j2641J215J5498
$$ 8199 5907 -8309 -15540 -13817 -11059 -7106 -3997 -3197 -1708 -3256 -15989 -28630 -27415 -11917
5920a1917O286O963K698j0279m9j204L547P323o969J47M253n137m00J283r695
$$ -11917 -5631 1332 4030 -6249 -6298 -7502 -3955 3368 -3601 -3454 799 -4338 -4738 -3455 -13150
5905a3150K460q615r407J4886Q663j2149j1174J1166J3334J0427o805j1532r034
$$ -13150 -10690 -19305 -28712 -13826 -5163 -17312 -28486 -17320 -3986 6441 -364 -11896 -20930
5892b0930N870K942M209J5021J2736q369j0302p4L850n266j485m067L737O603
$$ -20930 -15060 -12118 -7909 7112 19848 11479 1177 1103 4953 -313 -1798 -5865 -2128 4475
5878D475j898N467j452k680o384j4185M864n254N835l55j067J5307k67n20l320
$$ 4475 2577 8044 6592 3912 -2472 -16657 -11793 -17047 -11212 -11567 -12634 2673 2406 1886 -1434
5863a434M549o48p014k529j1884K17p121J1342Q521p08K109P694K916j7149n379
$$ -1434 3115 2467 -4547 -7076 -18960 -18743 -25864 -14522 -6001 -6709 -4600 3094 6010 -11139 -16518
5848a6518J0799p748j1028J661L867j203m408n609M380O156J8636m347j3420j0080
$$ -16518 -5719 -13467 -24495 -22834 -18967 -20170 -24578 -30187 -25807 -19651 -1015 -5362 -18782 -28862
5834b8862P453O643q692m50Q73N465O589n795K945J5112J5227j631J771k54j254
$$ -28862 -21409 -14766 -23458 -23908 -23035 -17570 -10981 -16776 -13831 1281 16508 14877 16648 16394 15140
5819A5140k624K273j7440q868n768j2844K503J0143J7240p89p870L946l162o15
$$ 15140 12516 14789 -2651 -11519 -17287 -30131 -27628 -17485 -245 -1034 -8904 -4958 -8120 -8735
5805h735O420q322r508k515R563Q848R453N748n968l594n481l183l533k784k708
$$ -8735 -2315 -10637 -20145 -22660 -13097 -4249 5204 10952 4984 1390 -4091 -7274 -10807 -13591 -16299
5790a6299M422K088j6704M253J1582l46n437k727m328L732k881k661J415J791
$$ -16299 -11877 -9789 -26493 -22240 -10658 -11004 -16441 -19168 -23496 -19764 -22645 -25306 -23891 -22100
5776b2100K422P780J797m416o890K3343J3310o165o1n353j327m848r268m104L438
$$ -22100 -19678 -11898 -10101 -14517 -21407 1936 15246 9081 9020 3667 2340 -2508 -11776 -15880 -12442
5761a2442k139P935J4408O098m470L153N328J3292m929j0720n718p925n43l70
$$ -12442 -14581 -6646 7762 13860 9390 12543 17871 31163 26234 15514 9796 1871 1328 958
5747I58K102R985J258O74j2127k0090j5859j362R251K545M03P900M727Q732J838
$$ 958 3060 13045 14303 14977 2850 -17240 -33099 -34461 -25210 -22665 -22262 -14362 -9635 -903 935
5732I35O166R388m682N761Q489l71n611o725j5454K937r175j610O651J1260J0545
$$ 935 7101 16489 11807 17568 26057 25686 20075 13350 -2104 833 -8342 -9952 -3301 7959 18504
5717A8504m132O6l021j3171J654M156m851m344o339r648P16J7448n334O91r144
$$ 18504 14372 14438 11417 -1754 -100 4056 -795 -5139 -11478 -21126 -20410 -2962 -8296 -7605 -16749
5702a6749n779J481J0389J0002O595K452R814j822j2572j6947j2441K962J1894
$$ -16749 -22528 -21047 -10658 -656 5939 8391 18205 16383 3811 -13136 -25577 -22615 -10721
5689a0721J201M540Q610l851J755O098M537k953r065L22k204R902k249O921n102
$$ -10721 -9520 -4980 3630 -221 1534 7632 12169 9216 151 473 -1731 8171 5922 12843 7741
5674G741j5478k783J778j0479O699j75M872O016k300L2q854r911N225J2312J8148
$$ 7741 -7737 -10520 -8742 -19221 -12522 -12697 -7825 -1809 -4109 -4077 -12931 -22842 -17617 -5305 12843
5659A2843J653k3148k1175M220J741n513K344J0717Q356K686j820%O420M731J39
$$ 12843 14496 -8652 -29827 -25607 -23866 -29379 -27035 -16318 -7962 -5276 -7096 -7096 -676 4055 4194
5644D194N28J71j2882Q180r405J1778Q957L963N90k1308k0595J370O151Q387Q577
$$ 4194 4722 4893 -7989 191 -9214 2564 11521 15484 16074 -5234 -25829 -24459 -18308 -9921 -1344
5629a344M14K025n350K773j3831N043N729O525K043q545J208J1308k664J798o164
$$ -1344 -930 1095 -4255 -1482 -15313 -10270 -4541 1984 4027 -4518 -3310 7998 5334 7132 968
5614I68p257m811p436P661J2049l148N170n391J338k710P081p819m383K901j4280
$$ 968 -6289 -11100 -18536 -10875 1174 -1974 3196 -2195 -857 -3567 3514 -4305 -8688 -5787 -20067
5599b0067M632P331J7397J2256J5458Q016j7586j1169j5714N276M34k657n355
$$ -20067 -15435 -8104 9293 21549 37007 45023 27437 16268 554 5830 6264 3607 -1748
5586a748N46J3314p452j7240q327P947P079M78J4101J1571j1022j886N722N971
$$ -1748 -1202 12112 4660 -12580 -20907 -12960 -5881 -5403 8698 20269 9247 7361 13083 19054
5572A9054q444k546n322n210l199j988J9801l748j0374L87N175L459q324m426
$$ 19054 10610 8064 2742 -2468 -5667 -7655 12146 8398 -1976 -1589 3586 7045 -1279 -5705
5558e705p12l637J1393L883O323j1823o599P144p118n602p618q320N216K0799
$$ -5705 -6417 -10054 1339 5222 11545 -278 -6877 267 -6851 -12453 -20071 -28391 -23175 -2376
5544b376o74n24O872n221q990o709k715Q255J5879M942P33m183M480l416k386
$$ -2376 -3050 -3574 3298 -1923 -10913 -17622 -20337 -12082 3797 8739 9472 5289 9769 6353 3967
5529C967o133K163J061k8r157k808J0594K687j1177K656j2516j592N625k353N559
$$ 3967 -2166 -3 1058 1030 -8127 -10935 -341 2346 -8831 -6175 -18691 -20283 -14658 -17011 -11452
5514a1452O855N79L151r270j578M11r88J137K782L355j400o06R551k91o493K23
$$ -11452 -4597 -4018 -867 -10137 -11715 -11304 -12292 -11155 -8373 -5018 -6418 -7024 2527 2236 -4257 -4034
5498d034N864j430M80J213J678m163q080Q304J5490p728j3406j0648N128j0136
$$ -4034 1830 400 880 2093 3771 -392 -8472 -168 15322 7594 -5812 -16460 -11332 -21468
5484b1468n78j171J043K170o403J9698K5874n052j9801j9343O151J4557P400J5610
$$ -21468 -22046 -23217 -22174 -20004 -26407 -6709 19165 14113 -5688 -25031 -18880 -4323 3077 18687
5470A8687J851j1263j0499m762l607O282Q695K101M301n214o653M588o55P40P344
$$ 18687 20538 9275 -1224 -5986 -9593 -3311 5384 7485 11786 6572 -81 4507 3852 4592 11936
5455A1936M199j6083j4942r208q682j779Q403J3477M512n438J568J490N888J9119
$$ 11936 16135 52 -14890 -24098 -32780 -34559 -26156 -12679 -8167 -13605 -12037 -10547 -4659 14460
5441A4460J3142n520j2869k1223N028J4343j7215J030l688k482J2866k71o675
$$ 14460 27602 22082 9213 -12010 -6982 7361 -9854 -8824 -12512 -14994 -2128 -2399 -9074
5428i074J2996O263n364L392J6827K105j2936l322L332j0449J4322m753l915m844
$$ -9074 3922 10185 4821 8213 25040 27145 14209 10887 14219 3770 18092 13339 9424 4580
5414D580Q422M239k895J547L128P073j3089k5097m049J0756j850L066Q667M904
$$ 4580 13002 17241 14346 15893 19021 26094 13005 -12092 -16141 -5385 -7235 -4169 4498 9402
5400I402m667l374M08l209p037M449k070J04j811L383k0988N990P25J396J2011
$$ 9402 4735 1361 1769 -1440 -8477 -4028 -6098 -5994 -7805 -4422 -25410 -19420 -18695 -17299 -5288
5385e288M824q00k419k69m259n95J0643P529K682j0272j1057K176J0586P680j615
$$ -5288 -464 -1264 -3683 -3952 -8211 -8806 1837 9366 12048 1776 -9281 -7105 3481 11161 9546
5370I546k70J238p36p115J654k942k5759j6506J181J4081O319J2701K50Q62m654
$$ 9546 9276 10514 9778 2663 4317 1375 -24384 -40890 -39709 -25628 -19309 -6608 -6358 -5496 -10150
5355a0150R004N682J8020r891r481N948n103j2689k303P546p802J725M135M692
$$ -10150 -1146 4536 22556 12665 3184 9132 4029 -8660 -10963 -3417 -11219 -9494 -5359 -667
5341f67q66P056R153J7554p48j344n30k2167j7603l833J4082p862j966J3584J1860
$$ -667 -1533 5523 14676 32230 31482 30138 29608 7441 -10162 -13995 87 -7775 -9741 3843 15703
5326A5703O51o694n063m372J1977K127j4058j5129j83K118J414j1185O553J207
$$ 15703 16354 9660 4597 225 12202 14329 271 -14858 -15041 -12923 -11509 -22694 -16141 -14934
5312a4934M421R704R93j1349n672l656l2m288p579P228o687n401k102M206L705
$$ -14934 -10513 -809 184 -11165 -16837 -20493 -20525 -24813 -32392 -25164 -31851 -37252 -39354 -35148 -31443
5297c1443J4929n250o490j1914l375J3242J3880J9172o981Q116K4807k993q306
$$ -31443 -16514 -21764 -28254 -40168 -43543 -30301 -16421 2751 -4230 3886 28693 25700 17394
5284A7394J711p521o323K577j0940J134n719j5248K988J1271m483Q594n940L659
$$ 17394 19105 11584 5261 7838 -3102 -1968 -7687 -22935 -19947 -8676 -13159 -4565 -10505 -6846
5270f846Q985k588J182j930R067m691L723j635q269P872p943r727p608n983J888
$$ -6846 2139 -449 733 -1197 7870 3179 6902 5267 -3002 4870 -3073 -12800 -20408 -26391 -24503
5255b4503J191R062K905J4689J228j5055j0626R462N996j5257p526P828M833O555
$$ -24503 -23312 -14250 -11345 3344 4572 -10483 -21109 -11647 -5651 -20908 -28434 -20606 -15773 -9218
5241i218j542O357j996J919l098R918j6356j3161R070Q775J4153l717j23o434
$$ -9218 -10760 -4403 -6399 -4480 -7578 2340 -14016 -27177 -18107 -9332 4821 1104 981 -5453
5227e453m415N668J0684O525N623N802j9492p188j1568j412J013q09Q469K356
$$ -5453 -9868 -4200 6484 13009 18632 24434 4942 -2246 -13814 -15226 -14213 -15022 -6553 -4197
5213d197l219J1673M434k13l596j0189q237l035K427p90m85P204Q904j105M681
$$ -4197 -7416 4257 8691 8478 4882 -5307 -13544 -16579 -14152 -14942 -15427 -8223 681 -424 4257
5198D257J8608k460K723j3785j638K554j4133q545p876O127j360l729J1225L676
$$ 4257 22865 20405 23128 9343 7705 10259 -3874 -12419 -20295 -14168 -15528 -19257 -8032 -4356
5184d356J6922M239N378r909j5151j0189M278l683J064k43R536N152J1907p728
$$ -4356 12566 16805 22183 12274 -2877 -13066 -8788 -12471 -11407 -11650 -2114 3038 14945 7217
5170G217k487O264L280j1229o717r123l344M254q979j382L018O152J562j2311
$$ 7217 4730 10994 14274 3045 -3672 -12795 -16139 -11885 -20864 -22246 -19228 -13076 -11514 -23825
5156b3825O84J3581P25J5827j553j8940J524R720J0057k046J250L768O515j4467
$$ -23825 -23141 -9560 -8835 6992 5439 -13501 -11977 -2257 7800 5754 7004 10772 17287 2820
5142B820r878j2118l71l78L01L12J0316J5265J692J0049j2889N339J1323p142
$$ 2820 -7058 -19176 -19547 -19925 -19624 -19312 -8996 6269 7961 18010 5121 10460 21783 14641
5128A4641j123k192j1830J899l209J4759j489M63L332m232o521j0130j1058P280
$$ 14641 13518 11326 -504 1395 -1814 12945 11456 11919 15251 11019 4498 -5632 -16690 -9410
5114i410O781P870J0520m937k2907K317l603r838L13j2303j149Q078L040J6857
$$ -9410 -2629 5241 15761 10824 -12083 -9766 -13369 -23207 -22894 -35197 -36346 -28268 -25228 -8371
5100h371J1991p261k4098r84P90j084J987J5285J0780J2070L237m135J804q456
$$ -8371 3620 -3641 -27739 -28723 -27933 -29017 -27030 -11745 -965 11105 14342 10207 12011 3555
5086C555L018J1170j3021l974j5812l126J2084P682L027j0101q266J1062J8843
$$ 3555 6573 17743 4722 748 -15064 -18190 -6106 1576 4603 -5498 -13764 -2702 16141
5073A6141o335n242j4923j6390q235J1199J4829J8233j2958k5391l170j966o244
$$ 16141 9806 4564 -10359 -26749 -34984 -23785 -8956 9277 -3681 -29072 -32242 -34208 -40452
5060d0452J3078J7621l509j0186P609N717k085P600K95l539j611L875q356Q84
$$ -40452 -27374 -9753 -13262 -23448 -15839 -10122 -12207 -4607 -4312 -7851 -9462 -5587 -13943 -13059
5046a3059q072m503J6274J3724M16j2550K384n298L593R478j6930m422Q177L099
$$ -13059 -21131 -25634 -9360 4364 4780 -7770 -5386 -10684 -7091 2387 -14543 -18965 -10788 -7689
5032g689M428m857L177J6770q549k517J2756Q10j0146p072n293o432l61J2440
$$ -7689 -3261 -8118 -4941 11829 3280 763 13519 14329 4183 -2889 -8182 -14614 -14975 -2535
5018b535R373l136K419M29o17J03l654j170m763j1725L226M508M658j901Q545
$$ -2535 6838 3702 6121 6550 5933 6036 2382 1212 -3551 -15276 -12050 -7542 -2884 -4785 3760
5003C760k263j4247L077N131j273j644Q825J2264p976J662o133j2279r504q968
$$ 3760 1497 -12750 -9673 -4542 -5815 -7459 1366 13630 5654 7316 1183 -11096 -20600 -29568
4989b9568L93j979K2357L1840q814L13k734r153j135R208N380l983j0258j4065
$$ -29568 -29175 -31154 -8797 23043 14229 14542 11808 2655 1520 10728 16108 12125 1867 -12198
4975a2198n312l911k63p136J4123j264o463q743K199K4394J8446P235r906r657
$$ -12198 -17510 -21421 -21684 -28820 -14697 -15961 -22424 -31167 -28968 -4574 13872 21107 11201 1544
4961A544P676Q835j499j1119J2R598O339o571n1J8181J1804J802j3271k895J035
$$ 1544 9220 18055 16556 5437 5449 15047 21386 14815 14764 32945 44749 46551 33280 30385 31420
4946C1420j0662j3149q096k2168o699J2427N348J831j366J9830O397j2421p241
$$ 31420 20758 7609 -487 -22655 -29354 -16927 -11579 -9748 -11114 8716 15113 2692 -4549
4933d549j4009q41J0380R314O83j0142o747o64K360J2379Q62K310J5046m226j0927
$$ -4549 -18558 -19399 -9019 295 978 -9164 -15911 -16575 -14215 -1836 -974 1336 16382 12156 1229
4918A229L698J6063M69l200j721p279j0278j681M76K782P387J64r077n682R173
$$ 1229 4927 20990 21459 18259 16538 9259 -1019 -2700 -2224 558 7945 8109 -968 -6650 2523
4903B523k481j4144J2098J3934J2472N486o692j3160k1423K826K909l43q029K102
$$ 2523 42 -14102 -2004 11930 24402 29888 23196 10036 -11387 -8561 -5652 -5995 -14024 -11922
4889a1922Q898M155n026p647n633N716J0565n936l561O822p865k047M167K171
$$ -11922 -3024 1131 -3895 -11542 -17175 -11459 -894 -6830 -10391 -3569 -11434 -13481 -9314 -7143
4875g143R69j729N399m819L13N640q701J590P065R154o295O120P63J1055p610
$$ -7143 -6174 -7903 -2504 -7323 -7010 -1370 -10071 -8481 -1416 7738 1443 7563 8326 19381 11771
4860A1771r316K981k239r783J345q491J642J4724P218l902j21p698K209R947N745
$$ 11771 2455 5436 3197 -6586 -5241 -13732 -12090 2634 9852 5950 5829 -1869 340 10287 16032
4845A6032l64j1217J2198J1492j3691j3752j858J418j773P63J866o232O37o515
$$ 16032 15668 4451 16649 28141 14450 698 -1160 258 -1515 -752 1114 -5118 -4481 -10996
4831a0996l296L42j1500m794R19J551M17L678l477J5025K0180M682k6322j6746
$$ -10996 -14292 -13950 -25450 -30244 -29325 -27774 -27357 -23679 -27156 -12131 8049 12731 -13591 -30337
4817c0337J0217J0059j0073R4P639M793J2331J1011q287q374J200m646K004p342
$$ -30337 -20120 -10061 -20134 -20040 -12401 -7608 4723 15734 7447 -927 273 -4373 -2369 -9711
4803i711J1171J3325N906L934q535m239J803J200J0047m373j5723l096J2977o383
$$ -9711 1460 14785 20691 24625 16090 11851 13654 14854 24901 20528 4805 1709 14686 8303
4789H303r382j2084N973K6082L705j3498r239J629L74p254j0395J5646J6799k653
$$ 8303 -1079 -13163 -7190 18892 22597 9099 -140 1489 1863 -5391 -15786 -140 16659 14006
4775A4006j3659j3308M642J158J0398R657m400j2480J143K231k677j642J711o506
$$ 14006 347 -12961 -8319 -7161 3237 12894 8494 -3986 -2843 -612 -3289 -4931 -3220 -9726
4761i726n0O122J482j0496J1028L519L759k091m504p05J567K538j5996m086J2946
$$ -9726 -9776 -3654 -2172 -12668 -1640 1879 5638 3547 -957 -1662 -95 2443 -13553 -17639 -4693
4746d693N082k226J945o125J0065j67r693M743P430K484m401r098j9863J5147
$$ -4693 389 -1837 108 -6017 4048 3881 -5812 -1069 6361 8845 4444 -4654 -24517 -9370
4732i370K5556r92k646j0680m026K1158J498r534J095j0759j0079m398j736l803
$$ -9370 16186 15194 12548 1868 -2158 19000 20498 10964 12059 1300 -8779 -13177 -14913 -18716
4718a8716O162L265l896k600k282r927N627M308J1655l095l078M615L44J3382
$$ -18716 -12554 -9289 -13185 -15785 -18067 -27994 -22367 -18059 -6404 -9499 -12577 -7962 -7618 5764
4704E764j046q999j218O324R84n272j965O387J4089K576j0309q003L944P411j022
$$ 5764 4718 -4281 -5499 825 1809 -3463 -5428 959 15048 17624 7315 -688 3256 10667 9645
4689I645k4144j1374p028K3997N92j8284k649O53J3128K757n722J1142J2094N492
$$ 9645 -14499 -25873 -32901 -8904 -8312 -26596 -29245 -28592 -15464 -12707 -18429 -7287 4807 10299
4675A0299P291M555Q741q783n773l732j1434k8300j0784J4122K1873J019J0508
$$ 10299 17590 22145 30886 22103 16330 12598 1164 -27136 -37920 -23798 -1925 -906 9602
4662I602J677m492M1j795j4502j5996J616J0629J6610j38r186J361j3546Q101
$$ 9602 11279 6787 6828 5033 -9469 -25465 -23849 -13220 3390 3252 -5934 -4573 -18119 -10018
4648a0018R901O918q223p407J0760L648M524R12J555M991J4140n103j4378q822
$$ -10018 -117 6801 -1422 -8829 1931 5579 10103 11015 12570 17561 31701 26598 12220 3398
4634C398N254N392m993j2755j0031j2194J159K627l307J0609J5944R735K860j8029
$$ 3398 8652 14044 9051 -3704 -13735 -25929 -24770 -22143 -25450 -14841 1103 10838 13698 -4331
4620d331o058M627J2478l488J3377l126n922p286P22k941P356j2385J3100Q950
$$ -4331 -10389 -5762 6716 3228 16605 13479 7557 271 993 -1948 5408 -6977 6123 15073
4606A5073K46j648q755m829p49n798M050l66P902K000q204j0845p608J5727m583
$$ 15073 15319 13671 4916 87 -662 -6460 -2410 -2776 5126 7126 -1078 -11923 -19531 -3804 -8387
4591h387n610J3048l032q144j2912q26J0995j522J1086J3429O664Q436o158j1183
$$ -8387 -13997 -949 -3981 -12125 -25037 -25863 -14868 -16390 -5304 8125 14789 23225 17067 5884
4577E884j0645J939K0428j33j3871L775j3211L09Q986P82L837J0350N580j161
$$ 5884 -4761 -2822 17606 17473 3602 7377 -5834 -5525 3461 4243 8080 18430 24010 22849
4563B2849n525j0141j8209n650J8533N357j346P200J2179r028n79k9561j579J4566
$$ 22849 17324 7183 -11026 -16676 1857 7214 5868 13068 25247 16219 15640 -13921 -15500 -934
4549i34Q320j0788j033L481k132j1003j1371L636O046K891q737Q750L924n863
$$ -934 7386 -3402 -4435 -954 -3086 -14089 -25460 -21824 -15778 -12887 -21624 -12874 -8950 -14813
4535a4813n233j1239N314L093k209r915O924J7582N630n800r063P183J9227P019
$$ -14813 -20046 -31285 -25971 -22878 -25087 -35002 -28078 -10496 -4866 -10666 -19729 -12546 6681 13700
4521A3700j50l448J878j2307j0725r479Q799o613K395J8373R563L275M438q722
$$ 13700 13550 10102 11980 -327 -11052 -20531 -11732 -18345 -15950 2423 11986 15261 19699 10977
4507A0977l974K2j3917j5117J2057J7521P375M627j0347j3171r187O823J0421
$$ 10977 7003 7025 -6892 -22009 -9952 7569 14944 19571 9224 -3947 -13134 -6311 4110
4494D110K235n083l280J4182J3292q22O905n193j2463K06K688O512Q715P450k156
$$ 4110 6345 1262 -2018 12164 25456 24634 31539 26346 13883 14089 16777 23289 32004 39454 37298
4479C7298j3866l2030j3340O782J3314J0197j2417k2616O994P232J780K290r5
$$ 37298 23432 -8598 -21938 -15156 -1842 8355 -4062 -26678 -19684 -12452 -10672 -8382 -8477
4466h477j1379J234Ml663J2344o067m480J1157J1122n736k052Q736M816j391j4391
$$ -8477 -19856 -18622 -18618 -22281 -9937 -16004 -20484 -9327 1795 -3941 -5993 2743 7559 6168 -8223
4451h223n638q60N624j828j456K980R433K935O076j1796j6548m420R08Q677k588
$$ -8223 -13861 -14721 -9097 -10925 -12381 -9401 32 2967 9043 -2753 -19301 -23721 -22813 -14136 -16724
4436a6724o301J8991j465M985J2000o338j6163J553m869m48J4837P45Q276l971
$$ -16724 -23025 -4034 -5499 -514 11486 5148 -11015 -9462 -14331 -14779 58 803 9079 5108
4422E108m34l65K776m513P937J668p015M375n146q308o502L078o280j031J2479
$$ 5108 4674 4309 7085 2572 10509 12177 5162 9537 4391 -3917 -10419 -7341 -13621 -14652 -2173
4407b173O296j550M235k383l776M308P523M757q320o252R454p539K787K1785Q140
$$ -2173 4123 2573 6808 4425 649 4957 12480 17237 8917 2665 12119 4580 7367 29152 37292
4392C7292k3757k0718l681N232Q278j0105j750P703J660q908J1199J049j2276
$$ 37292 13535 -7183 -10864 -5632 2646 -7459 -9209 -1506 154 -8754 2445 3494 -8782
4379h782M241J1176N633k711l977o2l829j481M274K388M617L479L581j6836L377
$$ -8782 -4541 6635 12268 9557 5580 5518 1689 208 4482 6870 11487 14966 18547 1711 5088
4364E088K920p472j0083N703k291n31K769P412O044J0622M494j549m208k033p493
$$ 5088 8008 536 -9547 -3844 -6135 -6666 -3897 3515 9559 20181 24675 23126 18918 16885 9392
4349I392j4265j055j540j028M061n839J1756J902M264J0988l343l221J70p04m112
$$ 9392 -4873 -5928 -7468 -8496 -4435 -10274 1482 3384 7648 18636 15293 12072 12242 11538 7426
4334G426r64p217o648k822l878R857l675k205L646q737K177R042O811m334l481
$$ 7426 6462 -755 -7403 -10225 -14103 -4246 -7921 -10126 -6480 -15217 -13040 -3998 2813 -1521 -5002
4319e002M500K271o521m321j1445l258J2395L300O42p258k852K263J3833K569
$$ -5002 -502 1769 -4752 -9073 -20518 -23776 -11381 -8081 -7439 -14697 -17549 -15286 -1453 1116
4305A116J085r914q88Q300j691j5024O185J8012p378M867O59j6310n219O919L497
$$ 1116 2201 -7713 -8601 -301 -1992 -17016 -10831 7181 -197 4670 5329 -10981 -16200 -9281 -5784
4290e784J3688J6398Q363l525j8411j3815O83M167k778k939j970n82M998J364
$$ -5784 7904 24302 32665 29140 10729 -3086 -2403 1764 -1014 -3953 -5923 -6505 -1507 -143
4276a43k917L625j0349P320J7042J778J651l476P15j3987p598R138J036J294Q26
$$ -143 -3060 565 -9784 -2464 14578 16356 18007 14531 15246 1259 -6339 2799 3835 5129 5955
4261E955K670P674n914k1631J7459P590o747K517J0560m485j0984l407J6406J2637
$$ 5955 8625 16299 10385 -11246 6213 13803 7056 9573 20133 15648 4664 1257 17663 30300
4247C0300k3952j898M853o744j0726n272j709J0675J5366L385k731q589n662o23
$$ 30300 6348 4450 9303 2559 -8167 -13439 -15148 -4473 10893 14278 11547 2958 -2704 -3327
4233c327L430N388M315k26ll746K49O153k156P527o896q28K534Q380J938o248
$$ -3327 103 5491 9806 9580 9577 5831 6080 12233 10077 17604 10708 9880 12414 20794 22732 16484
4217A6484o082j8098L595K455O289p319j5186k393M080m489J7219J592o866J203
$$ 16484 10402 -7696 -4101 -1646 4643 -2676 -17862 -20255 -16175 -20664 -3445 -1853 -8719 -7516
4203g516m421p755j2630R111K694m820J19j0977L772J4475O511l017J3514O148
$$ -7516 -11937 -19692 -32322 -23211 -20517 -25337 -25218 -36195 -32423 -17948 -11437 -14454 -940 5208
4189E208Q427J03q557q28k215l119O612J1063j0789p580j7852m19J7260M182n242
$$ 5208 13635 13738 5181 4353 2138 -981 5631 16694 5905 -1675 -19527 -19946 -2686 1496 -3746
4174c746n535J013R727j2697o976p248O808J1907J0945Q456k665j0547k777l614
$$ -3746 -9281 -8268 1459 -11238 -18214 -25462 -18654 -6747 4198 12654 9989 -558 -3335 -6949
4160f949K651L536m08j5530N303l880o679N746j50M894j2938L109J6681P092j093
$$ -6949 -4298 -762 -1170 -16700 -11397 -15277 -21956 -16210 -16360 -11466 -24404 -21295 -4614 2478 1385
4145A385J614j837m890k491P086n108k2988j0206M978Q05Q325q35L693J0586O543
$$ 1385 2999 1162 -3728 -6219 867 -4241 -27229 -37435 -32457 -31652 -23327 -24162 -20469 -9883 -3340
4130c340L321J934K509o200j0120n93R473Q935P13J113J202j0053j0372j852N076
$$ -3340 -19 1915 4424 -1776 -11896 -12489 -3016 5919 6632 7745 8947 -1106 -11478 -13330 -8254
4115h254N746n684L346k344j3052P489L563m819N197M69O161m672L025j2582l177
$$ -8254 -2508 -8192 -4846 -7190 -20242 -12753 -9190 -14009 -8812 -8343 -2182 -6854 -3829 -16411 -19588
4100a9588J304n377J4372R444N285j646L350j76j761N71o665o16J895j1786k960
$$ -19588 -18284 -23661 -9289 155 5440 3794 7144 6968 5207 5778 -887 -1503 392 -11394 -14354
4085a4354P170J20R280Q115m582n279r410Q577n189l351J991Q495J998j215l139
$$ -14354 -7184 -7064 2216 10331 5749 470 -8940 -363 -5552 -8903 -6912 1583 3581 2366 -773
4070g73n996J3067j079J406l057j2041n784L222L091N327Q763n513Q022J8123
$$ -773 -6769 6298 5219 6625 3568 -8473 -14257 -11035 -7944 -2617 6146 633 8655 26778
4056B6778j0090j2925k958J7662j0704L548J066k257q487L638r423r240R095J799
$$ 26778 16688 3763 805 18467 7763 11311 12377 10120 1633 5271 -4152 -13392 -4297 -2498
4042b498J251r161j946Q850r832p782L886k403J9778J0139l73K310k477j1239
$$ -2498 -1247 -10408 -12354 -3504 -13336 -21118 -17232 -19635 143 10282 9909 12219 9742 -1497
4028a497R143K857j4864N905j755M416l727o55K3613O768k3119j3309k633n615
$$ -1497 7646 10503 -4361 1544 -211 4205 478 -177 23436 30204 7085 -6224 -8857 -14472
4014a4472K660J1520R247P192j558m153l455j014P963m773k369R235j846J0778
$$ -14472 -11812 -292 8955 16147 14589 10436 6981 5967 13930 9157 6788 16023 14177 24955
4000B4955R272j5223j3503j845j1447r305J2331J2225N276L913K745n568j6455
$$ 24955 34227 19004 5501 3656 -7791 -17096 -4765 7460 12736 16649 19394 13826 -2629
3987b629j2842n536J97j05j1098p497J6906K1144n80M110p524m20L608L563M915
$$ -2629 -15471 -21007 -20810 -20915 -32013 -39510 -22604 -1460 -2040 2070 -5454 -5874 -2266 1297 6212
3972F212j0807m585N701K240J2348o391p453q932J2066O041j0786N975L925J711
$$ 6212 -4595 -9180 -3479 -1239 11109 4718 -2735 -11667 399 6440 -4346 1629 5554 7265
3958G265l732r78N369P134L301j3980M288q746L762l209j758k58J7060k268j9876
$$ 7265 3533 2555 7924 15058 18359 4379 8667 -79 3683 474 -1284 -1542 15518 13250 -6626
3943f626k445L810K0203M47j8200k093L384p28J2746L300R709l434n240n308j4483
$$ -6626 -9071 -5261 14942 15389 -2811 -4904 -1520 -2248 10498 13798 23507 20073 14833 9525 -4958
3928d958p502j600Q259o171K528O482p800r404l819m713j965J3175J80p673K595
$$ -4958 -12460 -14060 -5801 -11972 -9444 -2962 -10762 -20166 -23985 -28698 -30663 -17488 -17308 -24981 -22386
$$ [...]
##END NTUPLES=NMR SPECTRUM
##END=
