##TITLE=Analysis number 325386
Compound Code btb 07063
Project Code adrs
Chemist Name melford
##JCAMPDX= 6.0         $$ Bruker NMR JCAMP-DX V2.0
##DATA TYPE= NMR SPECTRUM
##DATA CLASS= NTUPLES
##ORIGIN= Bruker BioSpin GmbH
##OWNER= nmr
$$ XWIN-NMR		Version 3.5
$$ Tue Jan  2 10:07:25 2007 GMT Standard Time (UT+0h)  MAYBRIDGE\nmr@NMR_250MHZ
##.OBSERVE FREQUENCY= 250.131544655141
##.OBSERVE NUCLEUS= ^1H
##.ACQUISITION MODE= SIMULTANEOUS (DQD)
##.ACQUISITION SCHEME= undefined
##.AVERAGES= 16
##.DIGITISER RES= 18
##SPECTROMETER/DATA SYSTEM= dpx250
##.PULSE SEQUENCE= zg30
##.SOLVENT NAME= DMSO
##.SHIFT REFERENCE= (INTERNAL, DMSO, 0, 16.522)
##AUDIT TRAIL= $$ (NUMBER, WHEN, WHO, WHERE, WHAT)
$$ ##TITLE= Audit trail, XWIN-NMR		Version 3.5
$$ ##JCAMPDX= 5.01
$$ ##ORIGIN= Bruker BioSpin GmbH
$$ ##OWNER= nmr
$$ C:\u/data/dgb/nmr/ADRS/20/pdata/1/auditp.txt
$$ ##AUDIT TRAIL=  $$ (NUMBER, WHEN, WHO, WHERE, WHAT)
(   1,<2007-01-02 10:07:01.88 +000>,<MAYBRIDGE\nmr>,<NMR_250MHZ>,
      <created by zg, POWCHK disabled, PULCHK disabled
       configuration hash MD5:
       49 4B E0 1D 92 C2 6B 37 9F E6 65 BC 52 41 86 1D
       data hash MD5: 64K
       9A DC BE 27 BE CE 75 56 55 39 45 0C 3A AA 1E D9>)
(   2,<2007-01-02 10:07:14.55 +000>,<MAYBRIDGE\nmr>,<NMR_250MHZ>,
      <Start of raw data processing
       ef LB = 0.3 FT_mod = 6 PKNL = 1 SI = 32K 
       data hash MD5: 32K
       84 8A 34 0A F7 5A B4 66 8A AA 76 D8 5E 04 27 8D>)
(   3,<2007-01-02 10:07:16.27 +000>,<MAYBRIDGE\nmr>,<NMR_250MHZ>,
      <apk 
       data hash MD5: 32K
       20 5E 87 88 3C 4A C4 98 5E DA F6 7D AD 9A 66 FC>)
(   4,<2007-01-02 10:07:17.05 +000>,<MAYBRIDGE\nmr>,<NMR_250MHZ>,
      <abs ABSG = 5 
       data hash MD5: 32K
       8B 9C 44 21 5F 3B D9 D1 3F 8C AD D8 E9 4F 71 F0>)
$$ ##END=
$$ 
$$ hash MD5
$$ BE 5C 1F 08 99 A6 23 9D CC 86 EC 69 A9 8E D0 BD
##$RELAX= 
##$RELAX= 
##$RELAX= 
##$RELAX= 
##$RELAX= 
##$RELAX= 
##$RELAX= 
$$ Bruker specific parameters
$$ --------------------------
##$DU= <C:\u>
##$EXPNO= 20
##$NAME= <ADRS>
##$PROCNO= 1
##$TYPE= <nmr>
##$USER= <dgb>
##$AMP= (0..31)
100 100 100 100 100 100 100 100 100 100 100 100 100 100 100 100 100 100 
100 100 100 100 100 100 100 100 100 100 100 100 100 100 
##$AQSEQ= 0
##$AQ_mod= 3
##$AUNM= <au_zg>
##$AUTOPOS= <4 >
##$BF1= 250.13
##$BF2= 250.13
##$BF3= 250.13
##$BF4= 250.13
##$BF5= 500.13
##$BF6= 500.13
##$BF7= 500.13
##$BF8= 500.13
##$BYTORDA= 1
##$CFDGTYP= 0
##$CFRGTYP= 5
##$CHEMSTR= <none>
##$CNST= (0..31)
1 1 145 1 1 1 1 1 1 1 1 1 1 1 1 1 1 1 1 1 1 1 1 1 1 1 1 1 1 1 1 1 
##$CPDPRG= <>
##$CPDPRG1= <>
##$CPDPRG2= <>
##$CPDPRG3= <>
##$CPDPRG4= <mlev>
##$CPDPRG5= <mlev>
##$CPDPRG6= <mlev>
##$CPDPRG7= <mlev>
##$CPDPRG8= <mlev>
##$CPDPRGB= <>
##$CPDPRGT= <>
##$D= (0..31)
0 1 0 0 0 0 0 0 0 0.06 0 0 0 0 0 0 0.0002 0 0 0 0 0 0 0 0 0 0 0 0 0 0 
0 
##$DATE= 1167732420
##$DBL= (0..7)
120 120 120 120 120 120 120 120 
##$DBP= (0..7)
150 150 150 150 150 150 150 150 
##$DBP07= 0
##$DBPNAM0= <>
##$DBPNAM1= <>
##$DBPNAM2= <>
##$DBPNAM3= <>
$$ [...]
##$SUBNAM7= <"">
##$SUBNAM8= <"">
##$SUBNAM9= <"">
##$SW= 20.6930455092707
##$SWIBOX= (0..15)
0 0 3 0 0 0 0 0 0 0 0 0 0 0 0 0 
##$SW_h= 5175.983436853
##$TD= 65536
##$TD0= 1
##$TE= 294.16
##$TE2= 300
##$TE3= 300
##$TEG= 300
##$TL= (0..7)
0 120 120 120 120 120 120 120 
##$TP= (0..7)
150 150 150 150 150 150 150 150 
##$TP07= 0
##$TPNAME0= <>
##$TPNAME1= <>
##$TPNAME2= <>
##$TPNAME3= <>
##$TPNAME4= <>
##$TPNAME5= <>
##$TPNAME6= <>
##$TPNAME7= <>
##$TPOAL= (0..7)
0.5 0.5 0.5 0.5 0.5 0.5 0.5 0.5 
##$TPOFFS= (0..7)
0 0 0 0 0 0 0 0 
##$TUNHIN= 0
##$TUNHOUT= 0
##$TUNXOUT= 0
##$USERA1= <user>
##$USERA2= <user>
##$USERA3= <user>
##$USERA4= <user>
##$USERA5= <user>
##$V9= 5
##$VALIST= <valist>
##$VCLIST= <CCCCCCCCCCCCCCC>
##$VD= 0
##$VDLIST= <DDDDDDDDDDDDDDD>
##$VPLIST= <PPPPPPPPPPPPPPP>
##$VTLIST= <TTTTTTTTTTTTTTT>
##$WBST= 1024
##$WBSW= 4
##$XGAIN= (0..3)
0 0 0 0 
##$XL= 0
##$YL= 0
##$YMAX_a= 328524
##$YMIN_a= -308232
##$ZGOPTNS= <>
##$ZL1= 120
##$ZL2= 120
##$ZL3= 120
##$ZL4= 120
##$ABSF1= 16.522
##$ABSF2= -4.171173
##$ABSG= 5
##$ABSL= 3
##$ALPHA= 0
##$AQORDER= 0
##$ASSFAC= 0
##$ASSFACI= 0
##$ASSFACX= 0
##$ASSWID= 0
##$AUNMP= <proc_1d>
##$AZFE= 0.1
##$AZFW= 0.1
##$BCFW= 0
##$BC_mod= 0
##$BYTORDP= 0
##$COROFFS= 0
##$CY= 12.5
##$DATMOD= 1
##$DC= 0
##$DFILT= <>
##$DTYPP= 0
##$F1P= 14.0000005364418
##$F2P= -0.99999901652339
##$FCOR= 0.5
##$FTSIZE= 32768
##$FT_mod= 6
##$GAMMA= 0
##$GB= 0
##$INTBC= 1
##$INTSCL= 1
##$ISEN= 128
##$LB= 0.3
##$LEV0= 0
##$LPBIN= 0
##$MAXI= 10000
##$MC2= 0
##$MEAN= 0
##$ME_mod= 0
##$MI= 0
##$NCOEF= 0
##$NC_proc= -4
##$NLEV= 6
##$NOISF1= 0
##$NOISF2= 0
##$NSP= 0
##$NTH_PI= 0
##$NZP= 0
##$OFFSET= 16.522
##$PC= 1
##$PHC0= 209.9864
##$PHC1= 19.97563
##$PH_mod= 1
##$PKNL= yes
##$PPARMOD= 0
##$PSCAL= 4
##$PSIGN= 0
##$REVERSE= no
##$SF= 250.13
##$SI= 32768
##$SIGF1= 0
##$SIGF2= 0
##$SINO= 400
##$SIOLD= 32768
##$SREGLST= <1H.DMSO>
##$SSB= 0
##$STSI= 32768
##$STSR= 0
##$SW_p= 5175.98343685301
##$SYMM= 0
##$S_DEV= 0
##$TDeff= 65536
##$TDoff= 0
##$TI= <Analysis number 999999
Compound Code 99
Book Reference 9
Project Code 9>
##$TILT= no
##$TM1= 0
##$TM2= 0
##$TOPLEV= 0
##$USERP1= <user>
##$USERP2= <user>
##$USERP3= <user>
##$USERP4= <user>
##$USERP5= <user>
##$WDW= 1
##$XDIM= 32768
##$YMAX_p= 316993626
##$YMIN_p= -209204
$$ End of Bruker specific parameters
$$ ---------------------------------
##NTUPLES= NMR SPECTRUM
##VAR_NAME=  FREQUENCY,     SPECTRUM/REAL,   SPECTRUM/IMAG
##SYMBOL=    X,             R,               I
##VAR_TYPE=  INDEPENDENT,   DEPENDENT,       DEPENDENT
##VAR_FORM=  AFFN,          ASDF,            ASDF
##VAR_DIM=   32768,         32768,           32768
##UNITS=     HZ,            ARBITRARY UNITS, ARBITRARY UNITS
##FACTOR=    0.157963299565203, 1,           1
##FIRST=     4132.6476996994, 0,             0
##LAST=      -1043.33573715361, 0,           0
##MIN=       -1043.33573715361, -209204,     0
##MAX=       4132.6476996994, 316993626,     0
$$ Real data points
##PAGE= N=1
##DATA TABLE= (X++(R..R)), XYDATA
$$ [...]
24862G3303K9052l8004n6245N4540O2817j1721k0325j5164m4170j6319J9662K580
24850D0006l7897n9469K6562K9315K0597L3586k9406k1416l8477Q374K5527L1494
24838B8796R184j4080l3539N4Q953M056J6498k8242m2807J9012j2947j0989j5610
24825g1661k9678j5290O4764N0766M1831J1141k0829L116j4833K0707R592O6730
24813A16356k9523k6045J9579n0748n4053j5866K0153M0001J1755R520q107K2055
24801E5077k81r437N834r017J8791R651m8608m0603L917k678N2280j8237J6569
24788C3258K801k6506J4944L0969M1061j8439l4476k651P676k8332m813k2776
24776g284K3504J2923j1281N274j7971n733P834N583L0406l3626l8327J8493M3716
$$ y = [73303, 102355, 64351, 8106, 62646, 125463, 113742, 93417, 78253, 34083, 17764, 37426, 40006, 2109, -57360, -30798, -1483, 19114, 52700, 23294, 1878, -36599, -28225, -2698, 28796, 37980, 23900, -9639, -9585, -632, 3424, 19922, -8320, -51127, -32115, -45062, -56051, -71661, -101339, -116629, -51865, -1099, 40732, 51873, 31044, 34160, 19327, 40034, 49626, 116356, 86833, 60788, 80367, 29619, -24434, -40300, -20147, 19854, 31609, 41129, 33022, 55077, 54796, 45359, 51193, 42176, 60967, 70618, 22010, -18593, -14676, -17354, 34926, 16689, 33258, 36059, 9553, 24497, 55466, 96527, 78088, 43612, 40961, 48637, 20305, 15492, -7284, 16220, 29143, 17862, 23136, 5165, -568, 7266, 12849, 43255, 9629, -28698, -10205, 33511]
24763C3511q92L3630j3121r037k8107j8032K4511J7285r452j5050L109m5551q269
24750c5465N0526K0765n8153j5744L8704M8633l654q807k546N5736K0605k6011
24738H4589n4153m4852k23r596k3656N790R775K2138L7440o132k7076L265k9924
24725c2615K5577K0317L1595k4532m3620j0872j6825L287K0807k1049l5687J9781
24713f3836J0253J0731L9016j9850j016K6848K5241L447l6479K2970L2841N240
24701E5406J2220o1904p085L3007K1687j8552k9571J9101k412J414K0242l5885
24689G668j5722k9708j9420M2313J6366L7633K7807l4695k0542K9679k3828j8510
24677i59K955j3328J9543R846k5297o1791L814M3867O3717J8966K984r37j5989
$$ y = [33511, 32619, 66249, 53128, 44091, 15984, -2048, 22463, 39748, 30296, 15246, 18355, -27196, -35465, 15061, 35826, -22327, -38071, 633, 49266, 45612, 36805, 34259, 89995, 110600, 84589, 30436, -14416, -14639, -24235, -47891, -42101, -32326, -10188, 27252, 21120, -5956, -2691, -32615, -7038, 13279, 44874, 20342, -23278, -34150, -50975, -47688, -26881, -47930, -83617, -63836, -53583, -42852, -3836, -23686, -24702, 2146, 27387, 30834, -5645, 17325, 50166, 55406, 67626, 5722, -1363, 31644, 53331, 34779, 5208, 24309, 21897, 23311, 43553, 7668, -8054, -37762, -57182, -14869, 1497, 39130, 66937, 32242, 11700, 41379, 17551, -959, 1996, -11332, 8211, 18057, -7240, -69031, -65217, -21350, 42367, 61333, 64317, 63380, 47391]
24664D7391m702j8483Q721j4883m1696M9587M2821J6454K3276n4327q8404O1891
24652B7646L0038j2477o3721r083j1521N4204O9791k2641j2839l1678m8201N3252
24640B2770j063P1987J8472j686l6730l0364J0951k6051k0141j4459j3919O891
24628a3342J882L5507M4880k5482l6288K1490j2753J8008m2320m0182k513O0751
24616I638K9293l0032m6132M1384J1284k5162O037k4021M5672J6634Q612L817
24604D7024J1040j0482J0341j6909m3694j0382J7399J6279k3002l7914q05L765
24592c7340N1520J7590N9966K3626m2193j5897j3517j9458K2929R546j998n416
24580D9358j0351j3780l1308K2754K4405J5p91R634n960k1919J5062m7446k0524
$$ y = [47391, 42689, 24206, 32927, 18044, -23652, 25935, 68756, 85210, 108486, 54159, -34245, 27646, 57684, 45207, -18514, -27597, -39118, 15086, 84877, 62236, 49397, 17719, -30482, 22770, 21707, 93694, 112166, 110480, 73750, 43386, 54337, 28286, 8145, -6314, -20233, -13342, -11460, 24047, 68927, 43445, 7157, 28647, 15894, 33902, -8418, -48600, -51113, 9638, 38931, 8899, -37233, 4151, 15435, -9727, -3690, -27711, 17961, 34595, 43207, 47024, 58064, 47582, 57923, 41014, -2680, -13062, 4337, 20616, -2386, -40300, -41105, -37340, 14180, 31770, 91736, 115362, 73169, 57272, 43755, 24297, 47226, 56772, 54774, 49358, 39007, 25227, -6081, 16673, 41078, 41093, 40302, 49936, 43976, 22057, 37119, -10327, -30851]
24567c0851J8430O2047n5371m4399l2923L8763L8718J8725M402J2671J099j748
24555B9563m8168j1562K3392k7800P545K220k9247j0067L4188L0418j3806J1192
24543b132O9741q331n990j6549m2610m8187o792p194K4337M9535O247j1814J8946
24530A9207L7860k5998j5774o514L4356N964k0972k1714j9313K1994L0373r63
24518C8506j340r688m509p229j5567j6386L976M792p110n7762q887N8836J3491
24505h877L7017M8003l3136o094R209J7366k8069l6627k4457m6941K6431k151
24493d8326K5111M0388j6619J3512R518k137l9603l1529J2916M2945j580N666
24481A0262k4680J7070L5688j2166n5499J751J5211J4373r003M3421O4441N492
$$ y = [-30851, -12421, 49626, -5745, -50144, -83067, -44304, -5586, 13139, 17541, 30212, 31311, 29563, -18605, -30167, -6775, -34575, -27030, -24810, -54057, -64124, -29936, 482, -13324, -2132, 67609, 59278, 53288, 36739, -5871, -54058, -60850, -68044, -43707, 5828, 12075, 261, 19207, 57067, 31069, 15295, 8781, 43137, 49101, 28129, 6415, -12898, 9096, 39469, 38506, 37166, 27478, 22969, 15740, 173, -16213, -12237, -7445, -14555, -72317, -81204, -22368, -8877, 28140, 76143, 43007, 36913, 46122, 63488, 35419, -1208, -25665, -72606, -46175, -48326, -23215, 17173, 554, 14066, 23584, 21447, -18156, -49685, -36769, 6176, 4596, 10262, -14418, 2652, 38340, 26174, -29325, -27574, -12363, 2010, -6993, 36428, 100869, 106361]
24469A06361o5817r113L3272k9460n1133K5839L098k3706o5874q024O5130K5193
24457E766N667K762j0575m5935M5458J0679l4262K7812R210n0049o1969K6551
24445f8885L4934k7414L1887N4550J0214J743k7755J0484K4685K5841o7399j3106
24433a0221M3053j8803P931k70M790k1868J6751K3971J478J9634J9870j7809l6630
24420C1877r324J3617K1584q9192p6L5881l486n031l4341K449K736j0748L9002
24407e052K246m249r352K471J423K3215O637K9697N7784K8943r333q1905m2583
24394e8N8791J8841l6282K0695L2975j2800l6789n481p294J0189r428J8789N2325
24381A04473K58K4497l6285K3815L0821L0422j2562L2615Q776J1196k2183L0061
$$ y = [106361, 40544, 31431, 64703, 35243, -15890, 9949, 13047, -10659, -76533, -84557, -19427, 5766, 11433, 14195, 3620, -42315, 3143, 13822, -20440, 7372, 16582, -33467, -95436, -68885, -33951, -61365, -29478, 25072, 35286, 37029, 9274, 19758, 44443, 70284, 2885, -10221, 32832, 14029, 21960, 21690, 26480, 4612, 21363, 45334, 46812, 66446, 86316, 68507, 31877, 22553, 36170, 57754, -31438, -31514, 4367, 881, -4150, -38491, -36042, -33306, -44054, -5052, -2806, -7055, -16407, -13936, -12513, 10702, 17339, 47036, 104820, 133763, 124430, 42525, -58, 58733, 77574, 41292, 61987, 94962, 82162, 45373, 39892, 32598, 42787, 33359, 52148, 104473, 104731, 129228, 92943, 116758, 147579, 178001, 165439, 198054, 206830, 218026, 195843, 225904]
24369B25904l937m5880j4476n98j0636m537k7097L7005O901J3940L3075N1309
24357B60973J8070M5060M0561J8766L6960k264J1099M6716L7912N4037R5260P5604
24345G38754K1059R8155J24507J29103J91708J46665R8666J88381K20015K58597
24335B215610K48650L28948L56252K79637J38333J07315l092j34219k05828k45761
24325C085845l24175l06345k68962k99723k71917j55779j48039j69564j38796
24316A002545j11837j59906r9183R75j2565m1374p0596k0648n4080o2301m6340
24305C24690m5442o6175j1554J3337l0468p574L960L1911o4430o5907o166M807
24293H0989k2264m0921N9863O8412k2349n0124L2650P098J6007k5496m9532m6216
$$ y = [225904, 221967, 176087, 161611, 161013, 150377, 145840, 118743, 155748, 162649, 176589, 209664, 260973, 279043, 324103, 364664, 383430, 420390, 418126, 429225, 475941, 513853, 567890, 663150, 738754, 759813, 857968, 982475, 1111578, 1303286, 1449951, 1548617, 1736998, 1957013, 2215610, 2464260, 2793208, 3149460, 3429097, 3567430, 3674745, 3671653, 3537434, 3331606, 3085845, 2761670, 2455325, 2186363, 1886640, 1614723, 1458944, 1310905, 1141341, 1002545, 890708, 730802, 631619, 632594, 620029, 578655, 508059, 487411, 433331, 371030, 324690, 279248, 213073, 201519, 214856, 184388, 176814, 180774, 212685, 148255, 82348, 76182, 80989, 58725, 17804, 77667, 146079, 123730, 73606, 106256, 113354, 129361, 103865, 54333, 8117]
24281H117L4449O1967j9865k1433j2919k1362l9373j0897J7670N1647k9378j3889
24269D734J5867K6375J9281J8003o9998n2750L3760P007n201p165l9908R005J9896
24256b1094k8787L228j3985J5871K1169N9479J9729p076m8777j7652K0546m780
24244b129j5978K4018K8724P933M0099k7991m6882j8698k2316m4470l8707J733
24232a14664O629K7112N2068J9918K0757m2513p4651J2852N0950K0526k492l1886
24220e5394k1604K5899J0154M9988P3628j7978j2269o356p4142o0799L3710N8520
24208C357k8640k4266M9650N7355K8849l5228n7553n487O695m891m4620j7834
24196g2613L150L2458J6028J6932q263l3664o445M1677M1368m3879j3140J5733
$$ y = [8117, 42566, 104533, 84668, 63235, 50316, 28954, -10419, -21316, -3646, 48001, 18623, 4734, 20601, 46976, 66257, 84260, 14262, -38488, -4728, 2279, -2922, -10087, -49995, -40990, -21094, -49881, -46653, -60638, -44767, -23598, 35881, 55610, 48534, -243, -17895, 2651, -2129, -18107, 5911, 34635, 42568, 82667, 54676, 7794, -10904, -33220, -77690, -116397, -114664, -108035, -80923, -28855, -8937, 11820, -30693, -105344, -92492, -41542, -21016, -23508, -55394, -76998, -51099, -40945, 9043, 82671, 64693, 52424, 46068, -28074, -88873, -55163, 3357, -25283, -49549, 101, 57456, 86305, 51077, -6476, -11963, -5268, -10159, -54779, -72613, -69463, -37005, -20977, -4045, -12308, -45972, -52417, -10740, 30628, -13251, -26391, -10658]
24184a0658m35K8480M50l521M9618o673o872l4887j3632L4090l50k513j6204K4381
24170D1274k8381j9554K086J5853l7760J1993q23L8194N3704J4716o2192k7939
24158A171J4865R90L835P699n505j0227k3739l984j4371j4678k178l8278l6688
24145a21088K2214L3080J436m943n10P15J9399L2315J6241N756q750p237j7086
24132b8458k7733l64J0893M47j7384m2420L5707L9718m220l5268N408L9631k3758
24119d7801j8046N6742L0227r130J5241J5126j7953m3495m4782j8062J4612M5784
24107b1537N049j0484R379J351j8661J670K8170l5200k0938M7439K8202p090J3918
24094B1268N4942j7p728l2885k8133K1902r412l7563o756L1079J6708l4280j2248
$$ y = [-10658, -11093, 17387, 17837, 14316, 63934, 57261, 50389, 15502, 1870, 35960, 35610, 33097, 16893, 41274, 12893, -6661, -4575, 11278, -26482, -14489, -15312, 22882, 76586, 91302, 29110, 1171, 16036, 17026, 20861, 28560, 23055, 12828, -10911, -14895, -29266, -43944, -46122, -84400, -121088, -98874, -65794, -64358, -69301, -69811, -69096, -49697, -17382, -1141, 4615, -4135, -11372, -28458, -56191, -56555, -45662, -45215, -62599, -105019, -69312, -29594, -33814, -69082, -63674, -24043, -47801, -65847, -9105, 21122, 11992, 27233, 42359, 24406, -19089, -63871, -81933, -67321, -21537, -16488, -26972, -17593, -16242, -34903, -33233, -5063, -40263, -61201, -13762, 14440, 7350, 21268, 76210, 76193, 68465, 35580, 7447, 29349, 19937, -17626, -24382, 6697, 23405, -10875, -23123]
24081b3123L035j3985O078L3849k8569r017M0551J6947o2764j9608J9672K2416
24069a4518J0561O10J9261J2232K0430J7178n3779k1789L835N5941J5285o0325
24057D922m4677K9834K2872k6310K8066O0393J761o4360q7352l4748q35Q1378
24045b9056L3702J8948J4698l2807l5878O303j6838J0220K8997k876m8967M0775
24033a2779N3571m4112m3132K961Q494j1341j9242K8317J3665O047p955o8327
24021i3833N329L8796R552J9311j5979m5701o20L8284L2202n0062j2296K4997
24009e0020K4422q990k0081Q872N3322M787m1590l1683o508N7877L3402k3923
23997a13J6225M1315n1068m3998m0267J1381M7055j4949k0384l139J4633M0163
$$ y = [-23123, -20088, -34073, -27995, 5854, -22715, -31732, 8819, 25766, -36998, -56606, -36934, -14518, -3957, -3347, 15914, 28146, 48576, 65754, 11975, -9814, -5979, 49962, 65247, 4922, -39755, -9921, 12951, -13359, 14707, 75100, 76861, 12501, -74851, -109599, -110434, -29056, 4646, 23594, 38292, 5485, -30393, -24090, -40928, -30708, -1711, -4587, -53554, -12779, 40792, -3320, -46452, -43491, -34997, -46338, -65580, -37263, -23598, -17551, -25506, -93833, -88504, -49708, -40156, -20845, -36824, -82525, -83145, -44861, -12659, -62721, -75017, -50020, -25598, -34588, -54669, -45797, 7525, 12312, -29278, -60961, -67469, -9592, 23810, -113, 16112, 57427, 6359, -37639, -77906, -66525, -19470, -34419, -54803, -57942, -43309, -3146]
23985c146J5296J2170J4400K940o5963j3582P815p7536k0176K8182N3074k1900
23973f8426L0184K2832L3578L1114j2362j9882l8461j8916K8127o484J3536J3304
23961H144j9891k1961M6393k2813m5059r142p195L2081K8719j3659L6478k400
23949I695j8232n8111k579M3463O6304l278J0708o0914k3618L5481J2314M82p666
23936D049K397j0334o2363l6320J2700J4499K7224K2957l5500j5147P0577M3014
23924C7753k5028j7198l3526j593j7715J2018r384j0069M397L6354M3171k8326
23912i146l203j6574J4382l224k645J4389M361K4644o637J5740j3080o681j0441
23899A885N0900Q007r7687o2032j9917L8251K1471K6107k2569l8208N188K7772
$$ y = [-3146, 12150, 24320, 38720, 41660, -24303, -37885, -30070, -107606, -127782, -99600, -46526, -68426, -38242, -15410, 18168, 49282, 36920, 17038, -21423, -40339, -12212, -18696, -5160, 8144, -11747, -33708, 12685, -10128, -55187, -64329, -71524, -39443, -10724, -24383, 12095, 9695, -8537, -66648, -69227, -25764, 40540, 37262, 47970, -12944, -36562, -1081, 11233, 11715, 4049, 6446, -3888, -66251, -102571, -89871, -75372, -48148, -25191, -60691, -75838, -5261, 37753, 12725, -4473, -37999, -39592, -57307, -45289, -54673, -64742, -60345, -23991, 19180, -9146, -12349, -28923, -14541, -17765, -20410, -6021, -1660, 22984, 16347, 32087, 19007, 12326, 1885, 52785, 60792, -36895, -98927, -118844, -80593, -59122, -33015, -55584, -93792, -88604, -60832]
23887f0832O7871l3611o4540L833k7781L9411M9146K1663K6417j1265K2488j7993
23875A4807n0709n839o409k2375L9322M1732k2711l5368j5868j3324P66P7664
23863A688L6214l1301j2207M104Q488M1748K9522k6601n6976l4908k0745J0079
23851e0895O3443M662j07938l0255M3686M3585L1417P995o267r527M759k175L0953
23838B3443J0205J4893m8718k5691k4502m2295o762Q0389q970j8228m2112K191
23826h6157L818K7332J4396K1756L9161K2422j9594l0996M1960J4060l1698j0713
23814E747j329R039j7765K1728K410q795k2019o6916q338J954J267N548O313j3240
23800h4396L3092P469P5136L7629o0256m8753Q331L3920J3766k340o6548N6917
$$ y = [-60832, 7039, -26572, -91112, -87279, -115060, -75649, -26503, -4840, 21577, 10312, 32800, 14807, -35902, -41741, -48150, -70525, -31203, 10529, -12182, -47550, -63418, -76742, -75976, 1688, 37902, 6601, -5606, -1502, 6986, 48734, 78256, 51655, -5321, -40229, -60974, -50895, 12548, 17210, -90728, -120983, -77297, -33712, -2295, 5700, -567, -10094, -5335, -7510, 23443, 33648, 48541, -177, -25868, -50370, -92665, -99427, -19038, -28008, -46236, -88348, -86157, -82339, -55007, -40611, -18855, 20306, 42728, 23134, -7862, 34098, 48158, 16460, 5747, 4418, 13457, -4308, 17420, 19830, 11035, -10984, -77900, -86238, -84284, -83017, -77469, -71156, -84396, -51304, -43835, 31301, 68930, 8674, -40079, -31748, 2172, 15938, 13598, -52950, 3967]
23788C967p087m8037k0072j6740j7396P3772M1975J2787k2634j8711M2586M8615
23776G3025Q331m9531l3238r98J431l8151k7306k0971m348R097k2106K0728J5090
23763f8947M951L0667M5467l1509l3669N080M3447k4908l1631L6986O5587l0894
23751A0627n8531K8353R855j8226p064L9331M761K1775n610j3304m7319n0662
23739h6014K0851J8829L7909K2240r128J0986k4965K4046J3939M6068l4888l6183
23727C690J9888P466q002j5373R580m472j3043L2795J5842J481n3577n1806n007
23714f0538L2392K419k3851m1545L7486J5083K7503N561m6331L229K5784L0151
23702G343o9595k0937N5345J9830o6390l3933k489L2716M9019M3689j1302k0246
$$ y = [3967, -3120, -51157, -71229, -87969, -105365, -31593, 10382, 23169, 535, -18176, 24410, 73025, 81356, 31825, -1413, -2411, -980, -39131, -66437, -87408, -91756, -82659, -104765, -84037, -68947, -63996, -33329, 12138, -19371, -53040, -47960, -4513, -29421, -61052, -24066, 41521, 10627, -47904, -19551, -9696, -27922, -34986, 4345, 9106, 30881, 25271, 11967, -35352, -86014, -65163, -46334, -8425, 13815, 4687, 15673, -9292, 14754, 28693, 74761, 39873, 3690, 23578, 31044, 23042, 7669, 17249, 12777, -266, 32529, 48371, 49852, -3725, -55531, -60538, -28146, -25727, -49578, -91123, -53637, -38554, -11051, -5490, -51821, -48592, -22808, 7343, -62252, -83189, -27844, -8014, -74404, -108337, -110826, -78110, -29091, 14598, 3296, -16950]
23690a6950k3555J7645J6769O998m635n4308m0778J5035K5899J4340J922K7917
23678a3701l4187J6142J3590l7419k7912P5397M0203k7276m1353k1382J2112N055
23666d0731J5919j2903o589k5169q230P1360J8924J7127R075K3162M090k2321
23654D3714m5180N261K2969n884K1098R279m478R676l6544l8234j8140n1023j9457
23641a06943J3390j6525J3644M9496j308J8328L423J3983J1373j1094l2886K715
23629d2404J2126k8373J3198L8866m7312m9651M0943O0556R707r824l617N4900
23617D9115K8025n4177k265O757k5998l746O041k7756m1995n476L850L3648P032
23604b6945o5938J6332M5785l0957M1579K0830J426k2113m8336L576M3344l2665
$$ y = [-16950, -40505, -22860, -6091, 907, -3728, -58036, -98814, -83779, -57880, -43540, -41618, -13701, -47888, -31746, -18156, -55575, -83487, -8090, 32113, 4837, -36516, -57898, -45786, -40731, -24812, -37715, -44304, -69473, -77703, -6343, 12581, 29708, 38783, 61945, 66035, 43714, -1466, 3795, 26764, 20880, 41978, 51257, 46779, 56455, 19911, -18323, -36463, -87486, -106943, -93553, -110078, -96434, -46938, -48246, -29918, -26495, -12512, -1139, -12233, -45119, -42404, -30278, -58651, -45453, -6587, -53899, -103550, -62607, -2051, 7656, -2168, -5785, 49115, 77140, 22963, 20698, 27455, 1457, -2289, 3752, -24004, -65999, -71475, -67625, -33977, -26945, -92883, -76551, -30766, -61723, -20144, 686, 2112, -20001, -68337, -64761, -21417, -54082]
23592e4082j6509N455J3558m7079L4148L7600k0978K022L540k2765K4797L841
23580c6452J4714M2328K2205p896n056Q623J8469o272m9527m9005l2856j9660
23568a00385P414J8500K9283L9187L1425o6185l6431j8352j9769k512O9744Q6169
23556C8088N243k0595J1125m834l8300M3581N1084N928l2419l0999m495J7251
23544D0658K0655q067l6073n4589M893M9884K1039N368l257J0859j2322K619N118
23531D6785J6757l7094m7311j3581j594k4618j0523M6260K2242k7332N6452J6848
23519D3291m2855j7601k1385N2695J4106k9499n6805L3544P315J7602p470j2359
23507a9421k9933k8421j8018k572L7827K5757L554K4476J6213O33L114M0708M831
$$ y = [-54082, -70591, -65136, -51578, -98657, -64509, -26909, -47887, -45865, -42325, -65090, -40293, -36452, -21738, 20590, 42795, 34899, 29843, 38466, 56935, 50663, 1136, -47869, -80725, -100385, -92971, -74471, -45188, -6001, 25424, -40761, -77192, -95544, -115313, -117825, -48081, 38088, 43331, 22736, 33861, 29027, -9273, 34308, 85392, 91320, 58901, 27902, 23407, 40658, 61313, 53246, 17173, -37416, -32523, 17361, 38400, 43768, 40511, 51370, 39048, 41667, 46785, 63542, 26448, -20863, -34444, -36038, -60656, -71179, -24919, -2677, -30009, 26443, 43291, 436, -17165, -38550, 14145, 28251, -1248, -58053, -24509, -17194, 408, -7062, -19421, -49354, -77775, -95793, -98365, -60538, -34781, -31227, -6751, 9462, 10095, 13209, 53917, 58748]
23494E8748l9180m2174m1241R894J7418n889J773K3434J7122P576m8130J7608
23482b3041L9233J2166j1603n8358l419K9715M1983J3794m4387j4149K1003J9992
23470B2929j5475P982m0426p2712J5104O1013N3707K1017j9056K4516o2206m0409
23458d4016K5561j0212o159K3673R841P4778K1903l7917k9803n4610m7055m4176
23446a18192J396Q5844P3831j2851n0957k8735N3393M5326O4392P817j3448l2214
23434G5602j3401k8395j2680L8783m2382l5395j2094m2376j254O1061K4139j2641
23422a033l6664J2308K444l5132p297n0908l2071K0905L4975R992J972L2914L8133
23409i462Q735l3873K4402K1905j5190R500p241p444m3124n373J9217l2528K0048
$$ y = [58748, 19568, -22606, -63847, -53953, -36535, -42424, -40651, -17217, -95, 7481, -40649, -23041, 16192, 28358, 16755, -41603, -45022, -15307, 26676, 40470, -3917, -18066, 2937, 22929, 7454, 15436, -24990, -97702, -82598, -21585, 32122, 53139, 34083, 58599, -3607, -44016, -18455, -28667, -34826, -11153, -1312, 73466, 95369, 57452, 27649, -26961, -74016, -118192, -116796, -30952, 42879, 30028, -20929, -49664, 3729, 49055, 113447, 121264, 107816, 75602, 62201, 33806, 21126, 59909, 17527, -17868, -29962, -72338, -73592, -12531, 11608, -1033, -37697, -25389, -22945, -58077, -65374, -116282, -148353, -127448, -92473, -82481, -80509, -47595, -9462, -727, -34600, -10198, 11707, -3483, 6017, -1224, -8668, -51792, -57165, -37948, -70476, -50428]
23396e0428j525l101k6687Q013M6123J2552K2360o557l9717J0726j3993l056p859
23383e3149j4357J4660J8414K7287l1483m2398J2180L5281R135M4784j5874l5192
23371c0712J0025j1648l38L1403M5810O757j395k9973k3676k5952M303K8336J4714
23358A7654n2361o9286r666L7410L2304Q311l7170k1581L4691R8547J7457j9363
23346C6947k7464k1571k4615K9554K27j1527k9284M560Q469k9651N366M5113j4995
23333b8871L7547M7540L255R339j411k7666k7148j5756k2903K8091l2457j5310
23321d5750J3477Q267k0667k9603M0439K0155j8721K0550o3738m9391k6824L4776
23309a17030O0300N0299m377n510Q2195N8681J2796q4320o6490m081J3670P864
$$ y = [-50428, -51953, -55054, -81741, -73728, -27605, -15053, 7307, 750, -38967, -28241, -42234, -45290, -53149, -67506, -52846, -34432, -7145, -38628, -81026, -68846, -33565, -24430, 20354, 4480, -30712, -20687, -32335, -32673, -1270, 44540, 51297, 49902, 19929, -3747, -29699, -25396, 2940, 17654, -34707, -103993, -113659, -76249, -43945, -35634, -72804, -94385, -59694, 38853, 56310, 36947, 9483, -12088, -36703, -7149, -6922, -18449, -47733, -43173, -34704, -64355, -58989, -13876, -28871, 8676, 56216, 59471, 68810, 67399, 39733, 12585, -3171, -26074, 2017, -30440, -45750, -32273, -24006, -44673, -74276, -33837, -13682, -32403, -11853, -75591, -124982, -151806, -117030, -56730, -6431, -10808, -16318, 65877, 124558, 137354, 53034, -13456, -17537, -3867, 3997]
23297C997J2233k6267n285o716K0602N141k0487p841L414J8625L1308N863N324
23284C9911k8275k3516J2644l4389l9174J8311p120L370J8505L3313O573J6629
23272A6782L3545q062n099n267j6132j8187K4108j6444k2774j2394L7193l1825
23260b4556j534N1260N0387l4149j00538M881R0378L6313Q808j4643J021l6416
23248C1212k8402J754p336m93j4585N9538L5246N706n2023k5188J4004K2909o442
23235C5900k5663L2787l6588m4964j1464k176J4319j3135J2130J4216O743l1078
23223d8973n4786K5779J6508K2122K4259L4010P108O419J3754M169r64m3411o2332
23210e6338q295L1590K7224p746j4229k1629J0561j9264k356L0407J3820K8126
$$ y = [3997, 16230, -10037, -15322, -22038, -1436, 3705, -16782, -24623, -21209, -2584, 28724, 34587, 39911, 11636, -11880, 764, -33625, -72799, -54488, -61608, -58238, -39733, -6420, 153, 16782, 50327, 42265, 37166, 31899, 15767, -2420, 21688, 5244, -17530, -29924, 7269, -24556, -26090, 25170, 75557, 41408, -59130, -54249, 36129, 72442, 81250, 66607, 67628, 31212, 2810, 4564, -2772, -3265, -17850, 41688, 76934, 82640, 30617, 5429, 19433, 42342, 35900, 10237, 43024, 6436, -38528, -49992, -52168, -37849, -50984, -38854, -24638, -17895, -48973, -103759, -77980, -61472, -39350, -15091, 18919, 26027, 32446, 46200, 50369, 49405, 5994, -56338, -64633, -33043, -5819, -13565, -27794, -49423, -38862, -58126, -60482, -30075, -16255, 11871]
23198A1871J6750l642R865k3072k2950m484n348K7861M4565K3147m6807k5923
23186A833J2760K8028r824J1609p423l0447n1948k0024j3013K4438R956L968J4241
23173b5846l5988l4333K791K0475L1666m767m8542J0020L1273N1554p569n1661
23161f0927J0722N0420J4493l7315p2218N79J0540k4534o666K4862j4712N4034
23149e0722J3843m4041m4943K3805N7257q814M3052K6975o0715m2424M875R042
23137g2810J5775n768Q068M22L5578K461L2426o158p749m4191J0799k0000l5980
23124h7127k1823Q329J0820j3632J8723K8135K5048l2777k2623J0013O3776l3419
23112d6557J6427j8699M801m1193n3694L1739M9893J0287j6841j6672N7337L4309
$$ y = [11871, 28621, 24979, 34844, 11772, -11178, -15662, -21010, 6851, 51416, 74563, 27756, 1833, 14593, 42621, 32797, 44406, 36983, 6536, -45412, -65436, -78449, -54011, -44055, -40087, -25846, -61834, -96167, -93376, -72901, -41235, -46002, -94544, -84524, -53251, -1697, -9266, -60927, -50205, 215, 14708, -22607, -94825, -94246, -83706, -108240, -114906, -90044, -104756, -50722, -36879, -80920, -125863, -102058, -44801, -53615, -10563, 16412, -44303, -86727, -81852, -72810, -57035, -62803, -54735, -54313, -18735, -16274, 16152, 9994, 2245, -41946, -31147, -51147, -87127, -108950, -100621, -89801, -103433, -84710, -56575, -31527, -64304, -86927, -76914, -13138, -46557, -30130, -48829, -44028, -85221, -138915, -107176, -57283, -46996, -63837, -80509, -23172, 11137]
23100A1137q972q889j5016Q547K4K5441J5177J7952l2410k5770l6486k5984o40
23087g5889J1137j7966n164M1413m323O049o391K2322L9342k2158n9920K3338
23075d8210j369j0510M776L1671L141k054j8204j257m8015j0948N8436K3908m8556
23062f7191K91J5497j064j3147p098K6839L1549O986n1248m5038L1857J618L3153
23049c6996L003K7627J9836k1928K4896o4526o884K0640K3768j3020p274j7181
23037d8039J5728K0930L8278k3441k9157K8579j9489o638j2149j5087l297o966
23025f0748M318q601M677L6759j9251o0885M3114N0765l091j1061j2481O091m090
23012c4484M82K2535k0066N382J6603o561o5258K507O9539l9118j3311l0797J6913
$$ y = [11137, 2165, -6724, -21740, -13193, -13169, 12272, 27449, 45401, 12991, -12779, -49265, -75249, -75889, -64752, -82718, -87882, -46469, -50792, -44743, -51134, -28812, 10530, -11628, -71548, -48210, -49579, -60089, -55313, -23642, -20501, -22555, -40759, -42016, -90031, -100979, -42543, -18635, -67191, -66900, -51403, -52467, -65614, -72712, -45873, -14324, -7338, -58586, -103624, -71767, -70149, -36996, -33993, -6366, 13470, -8458, 16438, -48088, -54972, -34332, -10564, -23584, -30858, -48039, -32311, -11381, 26897, 3456, -25701, 2878, -16611, -23249, -35398, -50485, -53782, -60748, -56430, -65031, -60354, -23595, -42846, -103731, -60617, -9852, -12943, -24004, -36485, -30394, -34484, -34002, -11467, -31533, -26151, -9548, -16109, -81367, -78860, -9321, -48439, -61750, -92547, -75634]
22999g5634O4182N114J2286J7608J3228j8015J2807j7124k4223j9150k6373N7637
22987B343K4482Q425r154r62j4714J6627k5016m6471l5336L7096M3147k4839k1372
22974d5744K1351L2284j7053n1866l7116Q910J5219K305Q933J142k4109K9798
22962e5946k5668m1656N068M6028L8448L6721J3208j3921j8965N839K5215R472
22950B3843q013P229R747l36k2331m9385k8444l693N0356M8565o530m6779l985
22937b9756j0539P897L7298m2472l1248j4926q463l744p752L0665J7505R009j1684
22924e8210J8359J3934k4166k4382L9272J383M9287K9829l0954n2935j3224J3325
22912c8482j442J3681M4912j204r3519k7648L423j2395K182p930K9717m0038M877
$$ y = [-75634, -11452, -6338, 5948, 23556, 36784, 18769, 31576, 14452, -9771, -28921, -55294, 2343, 26825, 35250, 26096, 25134, 10420, 27047, 2031, -44440, -79776, -42680, 467, -24372, -45744, -24393, 7891, -9162, -61028, -98144, -89234, -74015, -71710, -62777, -61635, -85744, -55946, -81614, -123270, -118202, -72174, -33726, 2995, 16203, 2282, -16683, -10844, 14371, 23843, 15830, 23059, 32806, 32470, 10139, -39246, -67690, -71383, -21027, 27538, 21008, -25771, -29756, -40295, -32398, 4900, -37572, -68820, -83746, -92209, -95953, -103705, -73040, -55535, -46526, -58210, -39851, -25917, -50083, -74465, -35193, -33810, 15477, 45306, 14352, -38583, -51807, -38482, -39924, -26243, 18669, 17465, -76054, -103702, -100279, -112674, -110492, -118422, -88705, -128743, -123866]
22899a23866K9174L7228M023M2662J2397Q902j7560J0656l9557k2984l0069K0679
22887f8315J1056m376L0081j8082j8518L7125j2783l6688J6069J968k5970m2652
22875a31085Q281k090L5842N0429j3344K5123L0692J2023J306j9659k777m0408
22863d5667k8078o536j8053Q815M9693L5644O4752k963k9629K7344Q819m8860
22851A5281J2088K8435r838k1608m5566m6556J4518K4653J0440J0740L0494q4734
22839f1653l9338O7868J6644J0837l2760j582L6842k6060l9224L3193J6990K1997
22827C754Q413l0197J4936k2872m8170K792L3497K098p109k2578K6100N0638j0819
22814D83j2058M434J879K0214N089k6166k0072L1959j4981j9924m3165j026N6909
$$ y = [-123866, -94692, -57464, -53441, -10779, 1618, 10520, -7040, 3616, -35941, -58925, -88994, -68315, -57259, -61635, -31554, -49636, -68154, -31029, -43812, -80500, -64431, -62463, -88433, -131085, -122804, -124894, -89052, -38623, -51967, -26844, 3848, 15871, 17177, -2482, -5259, -45667, -73745, -80281, -98334, -89519, -39826, -4182, 60570, 57607, 27978, 55322, 64141, 15281, 27369, 55804, 45966, 24358, -21208, -67764, -53246, -28593, -18153, -7413, 23081, -61653, -100991, -33123, -16479, -5642, -38402, -39984, -3142, -29202, -68426, -35233, -18243, 3754, 12167, -18030, -3094, -25966, -74136, -71344, -37847, -35749, -42858, -65436, -39336, 11302, 483, -11575, -7141, -5262, 14952, 20041, -6125, -26197, 5762, -9219, -29143, -72308, -73334, -16425]
22801a6425L6960k622k1613M9376l2895j5280K9364J2317j3105J9936K1749k6105
22789D1657k7912r912J238R005o8951k2988j2257k1586N3291M9578L653j6723
22777b1907N120l0311l0966j7601l3874J9491K9579l305J1217L39N0521P625l1471
22764d5543m5322J7354J4863n5689k1138M2642J3538L2522L3485J4719l6078p9781
22752a14428k7657J7610K3703L3648q177k8118m644J8466K3033J1918N204M0812
22740h630k8332L2132K3117l0859q276n1439k8683L6640J0510M359j6278K9239
22728c6500K6976j5298J4546J1566K8888k3833m6797j189J735L9692p717p836
22716a5767o2379j2700N890j0541k5983p442L3486N6448J2704N497m377p370K4643
$$ y = [-16425, 20535, 17913, -3700, 45676, 12781, -2499, 26865, 39182, 26077, 46013, 67762, 41657, 13745, 3833, 5071, 14076, -54875, -77863, -90120, -111706, -58415, -8837, -5184, -21907, -16787, -47098, -78064, -95665, -129539, -110048, -80469, -83774, -72557, -72218, -21697, -14072, -45543, -90865, -73511, -58648, -114337, -135475, -92833, -79295, -46773, -13288, 1431, -34647, -114428, -142085, -124475, -100772, -67124, -75301, -103419, -108063, -89597, -66564, -54646, -49442, -8630, -36962, -4830, 18287, -12572, -20848, -72287, -100970, -64330, -53820, -49461, -65739, -36500, -9524, -24822, -10276, 1290, 30178, 6345, -40452, -41641, -39906, -214, -7931, -15767, -78146, -90846, -84956, -95497, -121480, -128922, -95436, -38988, -26284, -20787, -25164, -32534, -7891]
22703g891q046K3826J6615J2068l1437j9767J9698j0414l9633J410K753J0343
22691c0475L3636N4652L0061m2376m6693n0698J6741K3705J5922l0070o493k63
22679c2351J3871r41l4409M313q523j3293K4612L8608O4013j4966k6939N879k4574
22666d700l5628k2327L615N2603L4452L1334l2353k6760K8813L3354l2819j4022
22654A5562J9189l5155L1243L5574l0674p3401P052J6869R103k1215j2478l6076
22642g4407m253j305O4161L8814L5470k1308m0063l0359k6943Q9878k1105o4636
22630e6056m9233M5291L1291N506j50N153m530J6467K0056r740n0151j0311K465
22617e3942N313M5745K2166l563L6772k1097j7220O3855Q981Q455K3917m3825
$$ y = [-7891, -15937, 7889, 24504, 36572, 5135, -14632, 5066, -5348, -44981, -43571, -40818, -30475, 3161, 57813, 87874, 45498, -1195, -51893, -35152, -11447, 4475, -25595, -32088, -32351, -18480, -19421, -53830, -49517, -58040, -71333, -46721, -8113, 55900, 40934, 13995, 19874, -4700, -40328, -62655, -59040, -6437, 28015, 59349, 26996, 236, 29049, 62403, 29584, 15562, 34751, -404, 30839, 66413, 35739, -37662, -30610, -13741, -4638, -25853, -38331, -74407, -78660, -79965, -15804, 23010, 58480, 37172, -2891, -33250, -60193, 29685, 8580, -56056, -105289, -59998, -28707, -23201, -23351, -18198, -22728, -6261, 13795, 4055, -46096, -56407, -53942, -48629, -2884, 19282, 15719, 52491, 31394, 14174, 78029, 87010, 95465, 119382, 75557]
22605G5557q7155k1147N4246k1632J8192J8256K8683K4265l3694l2016l9835r13
22593a7193k9078j02L3920K8872L90K801K6582K3476l8123l6705j7760k3376p415
22580e3711J8673n2646J0184k5811l8828j2311J02318N2439M7796j55n2387l9798
22568d4237k4397k891k0954J9859l0624J2785M02L7089N5728N0689j1978n6225
22556a4754n590o4446j357M0517j3779O0778J5993K694J4549j908m263K1068n8243
22543h741l6068k1459K2531k7972J9274N7150j0768k2691K9183K6818N22m4796
22531a7017k5362j385k9868j9381J9732O0546M7715k5233k4088m5313j0064K1095
22519d8623L8517M7960k7508k3617j2206m5443j8562k0577M6643M6761K5931M09
$$ y = [75557, -11598, -32745, 21501, -131, 18061, 36317, 65000, 89265, 55571, 23555, -16280, -17193, -46271, -46373, -12453, 16419, 16809, 19610, 46192, 69668, 31545, -5160, -22920, -46296, -53711, -35038, -87684, -77500, -103311, -142139, -154450, -52132, 307, 48103, 47948, -4439, -44237, -68634, -71525, -92479, -72620, -103244, -90459, -90057, -52968, 2760, 53449, 41471, -14754, -20344, -84790, -86147, -45630, -59409, 1369, 17362, 20056, 34605, 32697, 28434, 49502, -8741, -44809, -66268, -43737, -71709, -52435, 4715, -6053, -28744, 439, 27257, 27779, -17017, -42379, -43764, -73632, -93013, -73281, -12735, 34980, 9747, -14341, -59654, -69718, -48623, -10106, 37854, 10346, -13271, -25477, -70920, -89482, -110059, -63416, -16655, 9276, 9685]
22507I685M8481J9014l0731l1723J9524l2430m0293m3942P233M9325k406l3713
22495f1976k1782J1580M6362M941J2083Q356N16K2924M0406l5582m8734n6366
22483g7272J16L0492k4230q178k972j740J8421J2566L9626M1414l8709k4565K6578
22470h453O0397J3305l5743j0218N895k8840k8905j6843k8737J3216K2743j4630
22458e6813l35L2843j6041j2195O8300J5302m8515m7628L5036O784K474j0992
22446c1780j5560L698l9433L4331M0039k7609L1110K569J5895r394l2768j8414
22434d7316m990m411l1461M6215O3891J232l0993L0932K5273p8222n7209Q497
22422g8562K3547o676J7915L506K6633J8199Q584l4396k6108N030q911l3886j6398
$$ y = [9685, 58166, 77180, 46449, 14726, 34250, 1820, -38473, -82415, -75182, -25857, -28263, -61976, -83758, -72178, -25816, -20875, -8792, -436, 80, 23004, 63410, 27828, -20906, -77272, -77156, -46664, -70894, -79072, -82044, -83784, -65363, -52797, -13171, 28243, -10466, -35031, -8453, 51944, 65249, 29506, 19288, 25183, -3657, -32562, -49405, -78142, -64926, -42183, -56813, -57148, -24305, -40346, -52541, 15759, 31061, -17454, -65082, -30046, -23262, -20788, -31780, -47340, -43642, -83075, -48744, -8705, -36314, -5204, -2635, 13260, 3866, -28902, -47316, -52306, -56717, -88178, -41963, 21928, 23160, -7833, 23099, 48372, -29850, -87059, -78562, -55015, -61691, -43776, -40270, -13637, 4562, 13146, -21250, -47358, -42328, -51239, -85125, -101523]
22409a01523L0354L3861K7681k031l12K5142M969k6898J7913R261l4471k6720
22397d2774J1500J2786j8299K9861K4077l247j6928O627O085l7358L1069k0563
22385a7164p744M986J8412o232j9977n736L8342J5707q659J6774p050l7605J2799
22372c147j4119J6011Q608l7214q980k116P073k0236j567j1532K1165J4073j9162
22359e1143K969r961O656l3750o644K7172M441O002k1942k9653j2832N1362K0987
22346d6336J1991j2693k02r907l4772K9521j9725r742M0243P937J6646q754K7453
22333h340L0238N6118l4519o5166Q690M0666q909J4594l3979j4525N198O967l5644
22320c8611j5384o789L237L0813j3495j6597L7846J010J7223m56k1922j7568J5932
$$ y = [-101523, -71169, -37308, -9627, -11658, -11970, 13172, 18141, -8757, 9156, 18417, -16054, -42774, -31274, -18488, -36787, -6926, 17151, 13904, -3024, 3603, 9688, -27670, 3399, -17164, -24908, -19922, -1510, -7742, -27719, -33455, 4887, 20594, 11935, 28709, 21659, -15946, -3147, -17266, -1255, 7353, -29861, -38841, -40957, -33884, -54120, -55687, -67219, -46054, -31981, -51143, -48174, -58135, -51479, -85229, -91873, -64701, -60260, -54258, -76200, -105853, -118685, -67323, -46336, -34345, -47038, -47240, -57147, -91919, -62398, -82123, -91865, -51622, -43685, -27039, -35793, -8340, 21898, 78016, 43497, -21669, -12979, 27687, 18778, 33372, -607, -15132, -9934, -2967, -38611, -53995, -60784, -57547, -26734, -40229, -56826, -18980, -17970, -747, -1203, -23125, -40693, -24761]
22307b4761J7965P078K5455m0030m2172k1446k727J1178o675k1001J1225J5191
22295g0720M1055P2635o622k9711J0348n896k3236K5794j8863j1127K7203l070
22283G790L465L4782l8078K1884p892K1835r316k2614l005n761K705K7087k2685
22270A0197p5369K2338m06k3552j9832l2712r532O2971O0794n05O370k144J6239
22257A4857l089J766J1805l1381m1131j6393r013j4980M472l2413m007N0816M1071
22244b7620m3815l6986J1013N511M0009L272L2248L4575l5452k5153l068O2545
22232A7079J4458p2008r690Q110L5960K8735J430k2389r050J3414k3270K3038
22220E817J4805j441p815k7372J673L5157J456Q29k0340n8060k0490n027j1010
$$ y = [-24761, -6796, 282, 25737, -14293, -56465, -77911, -80638, -69460, -76135, -97136, -85911, -70720, -29665, 42970, 36348, 6637, 16985, 11089, -12147, 13647, -5216, -16343, 10860, 7790, 11255, 46037, 7959, 29843, 21951, 43786, 34470, 11856, 8851, 3090, 5795, 32882, 10197, -65172, -42834, -43240, -66792, -86624, -119336, -128868, -65897, -5103, -5608, 762, -1382, 14857, 11768, 13534, 25339, -6042, -47173, -63566, -72579, -87559, -83087, -115500, -119507, -68691, -27620, -71435, -108421, -97408, -91897, -51888, -48616, -16368, 18207, -17245, -42398, -45466, 17079, 31537, -40471, -50161, -42051, -6091, 22644, 24074, 1685, -7365, 6049, -17221, 5817, 20622, 19181, 11366, -16006, -14333, 20824, 22280, 23109, 2769, -55291, -75781, -80808, -91818]
22207i1818Q529L1886p87K2010J3539n340j2137O3084K7327k8543R070r790k3504
22194C526l597R978J7523K2554p726j7881J7686L5679N608n0379p5804k4964O53
22181f7144M8727j6167n0523j8970M2418L420k259k9818j0697O4051N4862l7869
22169a9969j0919J5630J4863M9221J6486J4131l8799m9273L2601R233k4301l7373
22157b8469J1380K540n7140l7717K5194J0956L7578Q4396p569j9132K5837L201
22145E1055m3721o8514L8974P1503M954p3207n0514k2516J5282M5030K0649j3331
22133b4356j1859l1698K3392K8098k5324R182O8430Q554j4826J029n4269m6881
22121g0528j3584L8237J0355j1476k773M4687L059K3265K0515j7825j6492l0978
$$ y = [-91818, -83289, -51403, -52190, -30180, -16641, -21981, -34118, 28966, 56293, 27750, 36820, 27030, 3526, -71, 9907, 27430, 49984, 42258, 24377, 42063, 77742, 83350, 32971, -42833, -67797, -67144, -18417, -34584, -85107, -104077, -61659, -58239, -60498, -90316, -101013, -36962, 17900, -19969, -30888, -15258, -395, 48826, 65312, 79443, 40644, -8629, 23972, 33205, 8904, -28469, -17089, -14549, -71689, -109406, -84212, -73256, -35678, 48718, 41149, 22017, 47854, 51055, 7334, -61180, -22206, 49297, 54251, -18956, -69470, -91986, -76704, -31674, -11025, -24356, -36215, -67913, -44521, -16423, -41747, -32565, 35865, 44419, 29593, 30622, -23647, -70528, -84112, -45875, -35520, -46996, -49769, -5082, -2023, 21242, 41757, 23932, 7440, -23538]
22109b3538l7446L8007L1681j4554j3288K9522k3288l5479L7454J0650k7354o0209
22097h7842J4036N5057K3395m2789q927j9646k7101J3381K5073K8938n638M275
22085b7788l4699J5723J0705k6910J47N329k06K4459K3462K2714K6699N0623J6988
22072A07246Q921k3143o3896k3879J6168j6458k8552m2420m4350r155N5707M6000
22060a7811j2004l5427j3557K9399j3248L56K3920J1092N772R857j9590m1003
22048g2244k8810k8079J749L2185j5684n876K2198J2799J3717l7487L1960J6473
22036e7099l1316j9382J5575J4359J2079R196j5031L6878j8992P588J2665k669
22024c6149L1868J2928o4478p422K2886n1041N022M1908L2860j5154j9627L167
$$ y = [-23538, -60984, -22977, 8704, -5850, -19138, 10384, -12904, -48383, -10929, -279, -27633, -87842, -73806, -18749, 4646, -38143, -47070, -66716, -93817, -80436, -55363, -26425, -32063, -27788, -62487, -46764, -36059, -62969, -62822, -57493, -57699, -33240, -9778, 12936, 39635, 90258, 107246, 116167, 93024, 29128, 5249, 21417, 4959, -23593, -66013, -110363, -119518, -63811, -17811, -29815, -65242, -78799, -49400, -62648, -62292, -38372, -27280, -21508, -11651, -31241, -72244, -101054, -129133, -127384, -95199, -110883, -116759, -94561, -81762, -68045, -105532, -73572, -57099, -88415, -107797, -92222, -77863, -65784, -56588, -71619, -34741, -53733, -46145, -33480, -36149, -4281, 8647, -55831, -63253, -40367, -91408, -86386, -44478, -11618, -26772, -46399, -43232]
22012d3232K6528K7905J109j5581k1440k8897p759M3784L2969k9617l040m0863
22000e8134J1639m552J2566k4240M8125L2493l7093r867l8491J0215K8379L0724
21988A764K7024j7116k8348p101l1412j686L2729L3200J7377O628k6683r963j7611
21975b1198M8904Q1302Q110k7235l4370j0135J0675k6673n409l7085O578j4310
21963b0846l3447Q803K9277p0295K8951L4092m0312m101P0280J0995P671j469
21951A9599o6694j3518K4269j2543K7813p572L552R743k5092K3981J1291r74p240
21938a3385j7124j2636M6710p975k0697j2669j4023J2670K5322j9280J3258n4938
21926g4767r450K0323l453R116J6840M86K5054J5350n1239m1369j1338n263N5555
$$ y = [-43232, -16704, 11201, 12310, -3271, -24711, -53608, -61367, -17583, 15386, -14231, -17271, -58134, -46495, -51047, -38481, -62721, -14596, 17897, -19196, -29063, -67554, -57339, -28960, 1764, 28788, 11672, -16676, -23777, -55189, -56875, -24146, 9054, 26431, 33059, 6376, -3587, -21198, 27706, 109008, 117118, 89883, 55513, 45378, 56053, 29380, 23971, -13114, -6536, -20846, -54293, -45490, -16213, -86508, -57557, -23465, -63777, -67878, 2402, 13397, 21068, 19599, -47095, -60613, -36344, -48887, -21074, -28646, -25094, -15351, -40443, -16462, -5171, -6145, -13385, -30509, -43145, 3565, -4410, -25107, -37776, -51799, -39129, -13807, -33087, -19829, -74767, -84217, -63894, -67347, -58231, -41391, -40905, -15851, -501, -51740, -93109, -104447, -109710, -54155]
21913e4155Q979n294L2906L9133o899k2657j693j4380l2016o125M314l0128R284
21900g8731L9388J7755l2602K788n058k3779p80l7578K419K0910J0712m948K5901
21887f3603j0649p70m974j4351M2506O794l6470l9019R220K0629J3721q105p996
21874i3067J2769J3527m022J9K8257L0152k6213m6484O4799M1661O970K4543L920
21861E6831m2640l6839m6440l7061M6505J5511J5041q735l4818J2145K7096N6675
21849B3271J5554l9695l618K7416k1133k7862l6414K7105L5846J9671k1505k3374
21837b4738N197Q138L5912R965q817o7142m8199J3636M7790j1272o4352j9294
21825a23176M4856L3162J5328k8664J4138K5653l2377l5441K0052P293j960j1975
$$ y = [-54155, -45176, -50470, -17564, 21569, 14670, -7987, -9680, -24060, -56076, -62201, -57887, -88015, -78731, -39343, -21588, -54190, -51402, -56460, -80239, -81019, -118597, -116178, -95268, -84556, -89504, -63603, -74252, -75022, -79996, -94347, -51841, -45047, -81517, -120536, -111316, -90687, -76966, -85071, -93067, -80298, -66771, -70793, -70774, -42517, -12365, -38578, -85062, -20263, 21398, 28368, 52911, 56831, 14191, -22648, -69088, -106149, -59644, -44133, -29092, -37827, -72645, -60500, -33404, 23271, 38825, -870, -4488, 22928, 1795, -26067, -62481, -35376, 470, 20141, -1364, -24738, -19541, -11403, 24509, 34474, 25657, -41485, -89684, -76048, -28258, -39530, -103882, -123176, -78320, -45158, -29830, -58494, -44356, -18703, -51080, -86521, -66469, -59176, -61136, -73111]
21813g3111k2587K54M7261K9329j9512L7367Q1540k054m4071k9946l3579j6685
21801d5794N121O681m217k0835J5143R286l0381n306M647R398L3432K9027K3924
21788C0126N24k9454o4160K4215M6783j5390k6017j4671k272j068J0332l1687
21776g2739l3007O2905Q8893k0716j08093k198K2328j9324l5212r766J6859J0087
21764i9983r636R657J0287p930J3433K570j3586N6230K1162m1541q482j4592L5310
21751d7101J0791Q768J1616M762k3056j1347J2925j0150K6663L0807L1880K7716
21739G4274m6886k2548j9492M184J5196l7790m6779K4172J1067r723Q012l6431
21727h2744O6269J6678M492K4531l1842k740K6826L140k674m6162k0359K3449
$$ y = [-73111, -95698, -95444, -48183, -18854, -38366, -999, 80541, 78487, 34416, 4470, -29109, -45794, -40673, -33992, -38209, -59044, -43901, -34615, -64996, -70302, -65655, -56257, -22825, 6202, 30126, 30650, 1196, -62964, -38749, 8034, -7356, -33373, -48044, -50316, -51384, -41052, -72739, -105746, -42841, 46052, 25336, -82757, -84955, -62627, -81951, -117163, -126929, -110070, -99983, -109619, -99962, -89675, -97605, -84172, -81602, -95188, -38958, -17796, -59337, -67819, -82411, -47101, -36310, -27542, -15926, -11164, -34220, -45567, -32642, -42792, -16129, 14678, 46558, 74274, 27388, 4840, -14652, -10468, 4728, -33062, -79841, -55669, -44602, -54325, -46313, -82744, -16475, 203, 4695, 29226, -2616, -5356, 21470, 24610, 21936, -24226, -44585, -21136]
21715b1136J3381K9831Q810J037l9651l6293j1499j3269M0196P7304J160J527
21703E1398j1487k4215l9449L025J9801J1358j8014k2779K3346k5755n0192j3780
21691i6743L537K8663K6477J5060j1851J7998J348k7811o3696k0134j7884K8522
21679a16514P6075K618L9532M0979n3720m4271J747K4571j2333j3301K8768l648
21667b9497K1639M6033R432l0585j7236o7971k8340K6550M8030N4798l1543n6827
21655e5517K682L103L843K1453l1174m444q343R17M2445K3167n913o8600j0051
21642h6432M2532J6585j5714R230k2297N3642M5937m6605j5882K4451L9877k7603
21630A7721o217m0957m752k5726j613L361P057L7426j6621j4880O860J3816M869
$$ y = [-21136, -7755, 22076, 30886, 31923, -7728, -44021, -55520, -68789, -28593, 48711, 49871, 51398, 39911, 15696, -23753, -20728, -927, 10431, -7583, -30362, -7016, -32771, -82963, -96743, -93206, -64543, -38066, -23006, -34857, -16859, -15511, -43322, -107018, -127152, -145036, -116514, -40439, -37821, 1711, 42690, -11030, -55301, -53554, -28983, -41316, -54617, -25849, -29497, -7858, 38175, 47607, 17022, -214, -68185, -96525, -69975, -21945, 32853, 1310, -55517, -52835, -49732, -45889, -24436, -55610, -60054, -68397, -67480, -25035, -1868, -7781, -76381, -86432, -43900, -27315, -43029, -33799, -56096, -2454, 43483, -3122, -19004, 5447, 45324, 17721, 11504, -29453, -34205, -59931, -61544, -58183, -51126, -13700, -30321, -45201, -38341, -24525, -19656]
21617a9656K6215k966j3284m6918J3243J2483k3461j4713k8118l253J5553J8113
21605f6762L779K2019K9764J2033j3723l0247n3474O771J3360L1673K4157k8262
21593d8912m9431K6426K2766L2565L0230p405o418N215j442J8562k4044j9002
21581b0890n603M090K8068P026j2748j8429j9712j1347M925k4390k3159m216J4748
21568h1637J7113l037p596j1673J2540j861J5523k102m5887L6348M6085q315m7258
21555h1757J2890L9949j5170J0140K593k3067j3088k1849N2182M987l60M1034
21543H484K3438l8316k2762l483J5527m929m788k829J4209q185l4133M182L6288
21530a7297K396n9206k0004P0869K157j3820J0599J1564m865m0051K5324M6123
$$ y = [-19656, 6559, 3593, -9691, -56609, -43366, -30883, -54344, -69057, -97175, -100428, -84875, -66762, -62983, -40964, -11200, 833, -12890, -43137, -96611, -89840, -76480, -44807, -20650, -48912, -98343, -71917, -49151, -16586, 13644, 6239, -179, 5036, 3594, 22156, -1888, -20890, -26493, -22403, 5665, 12691, -57, -18486, -38198, -49545, -44620, -69010, -92169, -96385, -81637, -64524, -67561, -75157, -86830, -74290, -76151, -60628, -62730, -108617, -72269, -26184, -34499, -81757, -68867, -28918, -44088, -33948, -31355, -54422, -67510, -89359, -37177, -32190, -32550, 8484, 31922, -6394, -29156, -32639, -17112, -22041, -26829, -29658, -15449, -23634, -57767, -53585, -17297, -14901, -74107, -94111, -23242, -21085, -34905, -24306, -12742, -17607, -57658, -32334, 13789]
21518A3789m898Q282K5183k7993m1865l8361K3976L3710l3761M698j2346R143
21506d0443k8370j0149L302J4715K8834m765n27K9698q716l9398k252j3894j3082
21493h5047K5055J8137Q7321J4457m1520K104j2643k0805K2265l553j7128Q729
21481b628k7710k4679K690k3904L711M6721K2478j6009j4550p414J3891J2814
21469a4589p832k8078o170J2217r333K6446J305j1070K2170j5117m772j7129m951
21456e6903J6902j8891q428R610m610k4977j0689J3985M2441L1187l0731j0605
21444e1709M4869l1922l1446J368L7958N2912K4306m2345j3341k0538n983k5786
21432f1657l595O1631J5135M096l3765Q51M678k4971j4843O247P971J4126k4421
$$ y = [13789, 8891, 17173, 42356, 14363, -27502, -65863, -41887, -8177, -41938, -37240, -49586, -40443, -68813, -78962, -75660, -60945, -32111, -36876, -37403, -7705, -16421, -55819, -58071, -71965, -85047, -59992, -41855, 45466, 59923, 18403, 20507, 7864, -12941, 9324, 5771, -11357, -2628, -30338, -55017, -52327, -76231, -72520, -25799, -3321, -19330, -33880, -41294, -27403, -14589, -22421, -50499, -56669, -44452, -53785, -27339, -26034, -37104, -14934, -30051, -34823, -51952, -56903, -40001, -58892, -67320, -57710, -62320, -87297, -97986, -84001, -41560, -10373, -41104, -51709, -6840, -38762, -70208, -68840, -30882, 22030, 46336, 3991, -9350, -29888, -35871, -61657, -65252, -3621, 11514, 15610, -18155, -17304, -12626, -37597, -52440, -46193, -38222, -24096, -48517]
21419d8517J6211j596r729o098m1239k667L9629M2312k8537m6410M0262M1710
21407d669K8956N396j8619M01j5438j1107O896l3958L1183M9815J4894R670k2567
21394D0853n7580l1749q569O917M4963L6360l0520k9248l2206N6255L0189q636
21382A7029m4730K441K958K3340K8703p931j9059N467K0370k3268j3025k4301
21370c2006k2534j8677j7567M820N3677J9976k7218N3609n541j8924K4765j6587
21358b207j5674K9600J1282l639K1847m0942m8446L463L8031j2737k2958j9104
21346f1484J2516Q352k8618m394O8227M2154j0994j6666R728K4179j0209j13541
21334h0750o8784J213O9013M6175M0396M2285j4892L48J9098O1307j2799n9136
$$ y = [-48517, -32306, -33902, -43631, -49729, -90968, -93635, -54006, -11694, -40231, -86641, -46379, -4669, 24287, 29683, 11064, 11465, -3973, -15080, -8184, -42142, -10959, 38856, 53750, 63420, 40853, -16727, -48476, -57045, -50128, -5165, 31195, 675, -28573, -60779, -4524, 25665, 17029, -27701, -25260, -22302, 1038, 29741, 21810, 2751, 8218, 28588, 5320, -7705, -32006, -54540, -73217, -90784, -85964, -32287, -12311, -39529, 14080, 8539, -10385, 14380, -2207, -17881, 11719, 23001, 19362, 41209, 267, -48179, -44716, -6685, -19422, -42380, -61484, -48968, -40616, -69234, -73628, -5401, 36753, 25759, 9093, 18821, 43000, 32791, -80750, -149534, -148321, -79308, -33133, 7263, 49548, 34656, 35004, 54102, 115409, 102610, 43474]
21322D3474o0990r026j5948K3651J3119J8239J2938m0082p955P950j8596P708
21310b5518j6610N246K1733J751l942r810m8443J2939k903k8180J5738J0501l9805
21297a07303R236N389J2552J5986k0857J3426L2043N0333m5451m2678L1583O6048
21285B0307K6798J8899l4371j06478M8218J8686m7731j82j1497j1385J9117L6353
21273b3266K6664r900k3840r09k5305j1887P866L6240R082k9971L2074J5142k2516
21260b0526k7497N164O6614j4724R567J1055j8077n265J5743m4796J2321Q440
21248a981m0642k8474K6390J8007j0968M4536J4522k0328L2546J883K9552L0134
21236I5177q5337q536K0366k74R726J5402L451K2191k4602o4014p533j4213N899
$$ y = [43474, -17516, -26542, -42490, -18839, -5720, 12519, 25457, -14625, -22580, -14630, -33226, -25518, -42128, -36882, -15149, -13398, -17340, -27150, -75593, -62654, -65557, -93737, -77999, -67498, -107303, -98067, -92678, -80126, -64140, -84997, -71571, -39528, 10805, -34646, -77324, -45741, 20307, 47105, 66004, 31633, -74845, -26627, -7941, -55672, -55854, -67351, -78736, -59619, -23266, 3398, -6502, -30342, -31251, -56556, -68443, -60577, -24337, -15255, -45226, -13152, 1990, -20526, -48023, -42859, 23755, 9031, 18598, 29653, 11576, 6311, 22054, -22742, -10421, -1981, -42623, -71097, -44707, -26700, -37668, 6868, 21390, 1062, 33608, 35491, 65043, 95177, 9840, 1304, 21670, 21396, 31122, 46524, 49975, 72166, 47564, -16450, -23983, -38196, -32297]
21223c2297N1719M6083k4211m0470o3386k6956L7906k5940O042J725L5574K2923
21211a1288N1003M9412K6035k394l4295r949j2332o3050l198J7683k7339m2503
21199f2215J6771L2919L7940K7062l1854k2668J0501M085m4259p458P603L391
21187b8182K9130l3895l087J1920L7510K577J2223L2707j559k0312p663L5836
21175F7205n3106q523n098l4521j8476K6550L999j3215r768Q746o18K7557j4151
21162b3419k6973j109R138M1084J3552j6795J7591j3294J473j4494m8003k7485
21150h8734M0048K7359J288j5112n0345k2122N2142M7822K869m3455k7807K7168
21138d8879m170k1095K5989Q692M6257K2075k0878m6035j3533J1305O9292K1603
$$ y = [-32297, 19422, 65505, 41294, 824, -62562, -89518, -51612, -77552, -71510, -69785, -34211, -11288, 39715, 89127, 115162, 112768, 78473, 68524, 56192, -6858, -10056, 7627, -19712, -62215, -45444, -12525, 25415, 52477, 20623, -2045, 8456, 12541, -31718, -39176, -31573, -28182, 948, -32947, -36034, -24114, 13396, 15973, 28196, 60903, 59344, 39032, 31369, 67205, 14099, 5576, 478, -34043, -52519, -25969, -21970, -35185, -44953, -36207, -36825, -9268, -23419, -50392, -51501, -42363, -1279, 12273, -4522, 13069, -225, 1248, -13246, -61249, -88734, -48686, -21327, -20039, -35151, -85496, -107618, -55476, -7654, -4785, -48240, -76047, -48879, -53049, -74144, -48155, -39463, 6794, 28869, 7991, -38044, -51577, -40272, 29020, 50623]
21126E0623R628j1615k1510j8795K7331n1267j7063L3605J403k8243J7485q622
21114a7040q277K7465K3261J0970J8780l2815k5114j2252o4379m0580K6599L9957
21102e3425J5268J6107M069K1253m772l952k1070k9596P834O0991L1p869N6675
21089F1544j0210k4561k1842J7117r551k5884j4084m2103K7674M0559P0503o796
21077F2366l8905l1797l045J8853K0345J997p4861p4945J2032Q439L5531K1599
21065d2391m072j5864p725K9857p342Q290J7679K6611M465q686J3949J554O588
21052B2913k3545P533j0614j1192J5334m227j2849J7819L691j6773l4901m6378
21040i3189K5624K7955Q968J6558K5057r485m7132n336J1065j5838m9119l4031
$$ y = [50623, 60251, 48636, 27126, 8331, 35662, -15605, -32668, 937, 2340, -25903, -8418, -17040, -25317, 2148, 25409, 36379, 55159, 22344, -2770, -15022, -79401, -119981, -93382, -53425, -38157, -22050, -17981, 3272, -1500, -5452, -26522, -56118, -48284, 12707, 12738, 4869, 61544, 51334, 26773, 4931, 22048, 12497, -13387, -27471, -69574, -41900, -1341, 69162, 62366, 23461, -8336, -11381, 7472, 27817, 29814, -45047, -119992, -107960, -99521, -63990, -42391, -46463, -62327, -70052, -40195, -47537, -39247, -21568, 5043, 9508, 822, 14771, 16325, 22913, -632, 6901, -3713, -14905, 429, -3798, -16647, 1172, 4863, -11910, -46811, -93189, -67565, -39610, -30642, -14084, 10973, 1488, -45644, -50980, -39915, -55753, -104872, -138903]
21028a38903L7245O8055J6939j0402j4420l0519Q423N2549M0890j8346k8254J5224
21016a519J3955L186n789n0670q04m340k6952L2249Q205K1853n322J9339l0334
21003b6943l1939O0677K4675o0987j9728R560N7773j2807k3456j2674j9901J2894
20991d2856J9039J9019P776L1134K1573j9611P619k3146l3102o300J6808M1266
20979C9219k348K101N1361j9102k6359j0063M048J6288m962n5412m6911J3355
20967c8785L5426J40M5550K6995o0044k6174K9228P181m512j0874n2585l7088
20955h5542K0258K0774L8261l9554q254J3710O955R211j0730L763j0566n122l6508
20942h3344M8331R831m0315j5688j8774L760j5339J6002K6879l377j1821o233
$$ y = [-138903, -101658, -33603, -16664, -27066, -41486, -72005, -63582, -11033, 29857, 11511, -16743, -1519, 12436, 15622, 9833, -40837, -41641, -45981, -72933, -40684, -32479, -10626, -15948, 3391, -26943, -58882, 1795, 26470, -34517, -54245, -44685, 13088, 281, -23175, -35849, -55750, -42856, -23817, -4798, 2978, 34112, 55685, 36074, 43693, 20547, -12555, -18855, -2047, 39219, 36871, 38972, 90333, 71231, 44872, 34809, 38857, 55145, 50183, -5229, -52140, -38785, -3359, -3219, 42331, 69326, 9282, -16892, 12336, 19517, 15005, 4131, -48454, -85542, -65284, -44510, -6249, -45803, -54057, -40347, -33392, -24181, -34911, -31148, -41714, -46836, -83344, -35013, -25182, -65497, -81185, -99959, -96199, -111538, -95536, -68657, -72034, -83855, -90088]
20930i0088J7559K2048j2794K247K5050O2083o953O244q649p0791l1186M0663
20918d4567K4742M7992M0411m5003j1839J0874j845j4900l8187j0682n562N1962
20906C396Q187l8317p9013l4447L6046L8239o561l9100K2850K0213Q922M8827
20894a0758J1154o855j4975K0560m3413N479K6866q898J7444L5383J847m2119
20882h285R722K0822j3987l1931Q037j291k2951J8720k8306L6692J040j0704j0898
20869c3320M2684K6576j2162m1043j9443k5958M531P937k192n1076r750o993L3211
20856h6998l911m882k3498k3573K7816p811m87J4191J6106K9832L0179L881j3261
20843d2416L0977O63J9235j3502r968J6289k603l3113m1156n660l190L1191J9035
$$ y = [-90088, -72529, -50481, -63275, -61028, -35978, 26105, 19152, 25396, 16747, -54044, -85230, -44567, -19825, 28167, 68578, 23575, 11736, 22610, 20765, 5865, -32322, -43004, -48566, 3396, 11583, -26734, -105747, -140194, -104148, -65909, -72470, -111570, -88720, -68507, -59585, -10758, 396, -6459, -21434, -874, -44287, -38808, -11942, -20840, -3396, 31987, 33834, -8285, 1437, 22259, 8272, -23659, -15622, -16913, -39864, -21144, -49450, -12758, -11718, -22422, -33320, 9364, 35940, 23778, -17265, -36708, -62666, -58135, -50198, -52390, -103466, -113216, -120209, -86998, -90909, -95791, -119289, -142862, -115046, -122857, -123344, -109153, -93047, -63215, -33036, -29155, -42416, -11439, -10776, 8459, -5043, -15011, 1278, -1325, -34438, -75594, -81254, -84444, -53253, -34218]
20830c4218l351K7371O920j5657O628k2017k6594K8917M6155r706J8029q492k2136
20817h151l6806j7719P6272M3619o6044n9054k0932J1979L825L0580M38J2132
20805b9861r816j2306K128J2755J4078n754J089k1772K1373m4839P98N4251J7658
20792b18K1730K3106k6233J3929k5434n1772L312j267j1529O6884J090k8265j0551
20779b5218o5786k8545J5717L3175M4216K0599j0089J2878k97l4527j7127K9558
20767b5446j2055l2876j1975M6525K7260n3939j0744O007K1892m3482L2446L8703
20755a7684K5535p603j4310l9135j2588J1839J4781k8549K1832j7788l363O3997
20743c036J3842l1827j8778j3797k2815j500J2306K785l1984N2806K533l394K7154
$$ y = [-34218, -37569, -10198, -3278, -18935, -12307, -34324, -60918, -32001, 14154, 4448, 22477, 13985, -8151, -44957, -62676, 13596, 57215, -8829, -67883, -88815, -76836, -73011, -42431, -41993, -29861, -39677, -51983, -49855, -37100, -23022, -28776, -27687, -49459, -28086, -72925, -72127, -17876, -218, 21512, 44618, 18385, 32314, 6880, -44892, -41580, -42847, -54376, 12508, 13598, -14667, -25218, -91004, -119549, -103832, -70657, -26441, -5842, -15931, -3053, -3350, -37877, -55004, -25446, -37501, -70377, -82352, -35827, -8567, -62506, -73250, -67243, -45351, -88833, -56387, -17684, 7851, 248, -14062, -53197, -65785, -53946, -39165, -67714, -45882, -63670, -67033, -3036, 10806, -21021, -39799, -53596, -76411, -77911, -65605, -62820, -94804, -41998, -39465, -42859, -15705]
20730a5705k19J1694J3901j0445j2327J1384L617R171M601j3381n0193q7495q399
20717a43796O982M179J7344L9701N3639j1684j5525R645L9654j3256l8086K6649
20705b4554J7820o9472L7218P962k6218J8597j2457k6950J7377R747o3n326j6277
20692g2596K7414M1787K9856o5942P133L3711K2165l3833K454K852J405r799M103
20679i290K2448P09K7996J870l8875k9245J179q1M031l0083M81L2179q994j3618
20665c9293k0170K755m717K379N5540k9549k6054j4246L1261J3472l1549L3911
20653b6260L1360L0076j5409m7878n88j2158P779p608q4288k215p659L6701Q1668
20640a6479k9535l1571j7220L0153j751j2048j1921l2520R754L1825L4328L6162
$$ y = [-15705, -15924, -4230, 9671, -774, -13101, -1717, 1900, 11071, 15672, 2291, -47902, -135397, -143796, -136814, -132635, -115291, -75590, -21951, -33635, -49160, -39515, 139, -13117, -51203, -24554, -6734, -76206, -38988, -31026, -57244, -38647, -51104, -78054, -60677, -50930, -50993, -56319, -72596, -45182, -3395, 26461, -39481, -32348, 1363, 23528, -10305, -7851, -4999, -3594, -13393, -9290, 13158, 13867, 41863, 43733, 4858, -24387, -23208, -23289, -19258, -49341, -48860, -16681, -25675, -39293, -59463, -56708, -61425, -59046, -3506, -33055, -59109, -73355, -42094, -28622, -60171, -26260, 5100, 35176, 19767, -28111, -28699, -40857, -33078, -40686, -124974, -127189, -134848, -98147, -16479, -46014, -77585, -94805, -64652, -66403, -78451, -90372, -122892, -113138, -81313, -46985, -10823]
20628a0823J6463k749m5799k6006M2779L183l1348r671J5670j1944j7274k066
20616g9585N4505M4206q771r626k2322K382r520K7512p364J8079O375K2300K1121
20603E9292n2451m0479L00O3549M6083o751n4758l8078J512M727k9479Q920k2352
20590e9965j6793J65M9080P1005m7473m5365L4377P379Q091L631l3013k1123P646
20577d2358K8700J3799k8479k928J1434k0994j0050L6414j2402J0151L8987P9
20565B2353j6225j1352j8823m4934M409L2302L5077L3175j9455l0465k0187l2198
20553f6323k9317k393K3203J2477O2591j0128k9923L3094l5815j8333j9648L4425
20541d6090K7097J7686K740l7902j8852L086J3278K1852j9875O709J0574j783
$$ y = [-10823, 5640, 2891, -42908, -68914, -26135, -22952, -54300, -63971, -48301, -60245, -77519, -79585, -25080, 19126, 10355, 729, -21593, -19211, -28731, -1219, -8583, 9496, 15871, 38171, 59292, 6841, -33638, -33338, 30211, 76294, 69543, 14785, -23293, -21781, -17054, -46533, -37613, -59965, -76758, -76593, -27513, 43492, -3981, -49346, -14969, -7590, 501, 4132, -28881, -50004, -42358, -13658, 141, -28338, -31266, -19832, -40826, -50876, -14462, -26864, -16713, 22274, 22353, 6128, -5224, -24047, -68981, -64572, -32270, 2807, 35982, 16527, -13938, -34125, -66323, -95640, -98033, -74830, -62353, 238, -9890, -39813, -6719, -42534, -60867, -80515, -46090, -18993, -1307, 1433, -36469, -55321, -52235, -38957, -17105, -36980, -30271, -19697, -21480]
20529b1480N875r554l3426K4049l1898j9013N1798o905o724K1053K550j0529K5574
20516h630K0985J3021J216m538q452L5984R27o4016j6029N2613p486j3119r775
20503g299k8575J5781j6765n2223R172%k7461M812N3830J8136M685O8139k8839
20490A3393m3981J4743m607n3595L2025K068j7505j1474K4439j9235M1879L9761
20478A7911J8379Q728l5363q030J2644o915K053n528l2939M3371J2148r569J1713
20465B8603l0926j7192r248l9501o885J0057K0529J8895L4186P551R5j9362p502
20452a0700K6243m587p04m3868j3881P152L6556L6247J9058l827O312l1548o1133
20439c8680j1307M1769k1381m7430j229k7488O9182O6412N6191j3969k1950J5367
$$ y = [-21480, -15605, -25159, -58585, -34536, -66434, -85447, -33649, -40554, -47278, -26225, -23675, -34204, -8630, 12355, 25376, 26592, 22054, 13602, 49586, 50513, -13503, -29532, 23081, 15595, 2476, -7299, -35874, -20093, -36858, -89081, -79909, -79909, -107370, -102558, -48728, -30592, -25907, 42232, 13393, -30588, -15845, -20452, -74047, -42022, -39954, -57459, -68933, -44494, -63729, -21850, 17911, 36290, 45018, 9655, 1625, 14269, 7354, 9407, 3879, -29060, 14311, 26459, 16890, 28603, -2323, -19515, -28763, -68264, -75149, -65092, -44563, -25668, 8518, 16069, 16164, -3198, -10700, 15543, 10956, 10252, -33616, -47497, -40345, -3789, 32458, 51516, 47689, 54001, 22453, -38680, -49987, -8218, -29599, -77029, -78258, -105746, -36564, 29848, 86039, 72070, 50120, 65487]
20427F5487K1419k1131p4278l2674j0691O672J1793L716O737j4282j0310k962
20415e0504O503M1779P451m93K6245m527l4295l9396k1310J6568L3479O960J5
20402a1525N1105N4137k5712o0380k5275N791J2941l9956m151J8413J4104O335
20390d173j0171j8044o7278L3376N1344K5324J389m3283M0917K3726m4183k7489
20378c8545j6183L9366K7826R025K1284N028p2943k5213L1125N4264L8658o194
20366F7498O5046p36m3930n6782n8451q0696j7600N4697j2469m2820K5453M8705
20354e2085m4448J458M2660J5920k7617m1785m055M2709L6097j2216L3705j8593
20342b8250l6439l3493M7889N277q005j5188j1606K0867J5215J6899N1615J3565
$$ y = [65487, 86906, 65775, -8503, -41177, -51868, -45196, -33403, -29687, -22950, -37232, -47542, -50504, -44001, -2222, 5229, 4736, 30981, 26454, -7841, -47237, -68547, -51979, -18500, -11540, -11525, 39580, 93717, 68005, 7625, -17650, -11859, 1082, -38874, -43025, -24612, -10508, -4173, -14344, -32388, -99666, -66290, -14946, 10378, 11767, -31516, 9401, 33127, -11056, -38545, -54728, -15362, 12464, 21489, 42773, 47801, -25142, -50355, -19230, 35034, 73692, 67498, 132544, 131808, 87878, 31096, -27355, -108051, -125651, -70954, -83423, -126243, -100790, -52085, -96533, -95075, -52415, -36495, -64112, -105897, -109952, -67243, -31146, -43362, -9657, -28250, -64689, -98182, -50293, -45016, -53021, -68209, -79815, -58948, -43733, -26834, 24781, 38346]
20330C8346o2744m3184k560K9738j0653M625j2704j3178k6563O3504L8435k922
20318A40l705j4329p1887K3610L9205r510J9289J9650j8140q2426j1970N5646
20306e4427K2318N4733j0677j8571l1332l6320K3459M9636K8151l2183R460n695
20294a448l4494m479o534M3952K0019l3558L3264K7257o4877J222L1824k8106
20282a5958j4306q687k703J8174J8575K2339m343R525j3447K735n2928j6055K1460
20269c5619K521J2736K3719k8597l976N365n6067R204O6609K0335n3244j1282
20257d8296J3552L813L483O7438M9881j9050o7205n8619K2310M2833n8226o168
20245e4254l5281m5956k342M7987J9942J328k5197k161N5467L3805p166K256J3984
$$ y = [38346, -24398, -67582, -70142, -40404, -51057, -46432, -59136, -72314, -98877, -35373, 3062, 140, -3565, -17894, -89781, -66171, -26966, -36476, -17187, 2463, -15677, -98103, -110073, -54427, -32109, 22624, 11947, -6624, -37956, -74276, -50817, -1181, 26970, -5213, 4247, -1448, -35942, -40421, -46955, -3003, 17016, -16542, 16722, 43979, -20898, -19676, 12148, -15958, -30264, -38951, -41654, -23480, -4905, 17434, 13091, 22616, 9169, 11904, -41024, -57079, -35619, -33098, -20362, 3357, -25240, -29216, -23851, -79918, -70714, -4105, 16230, -37014, -48296, -34744, -30931, -27448, 39990, 89871, 70821, 3616, -55003, -32693, 10140, -48086, -54254, -89535, -135491, -137833, -89846, -69904, -68576, -93773, -95934, -40467, -6662, -13828, -11572, 2412]
20232B412J029J3101K6781K5231k5026j8907m96Q711k4592k5184P6899n987L597
20219E7569k8737k5379k9939m0307R204P455n054J4246K5911Q847N1442j5943
20207B9315j8377j786m1287k188k8659K3723o4N1940K7425n6319L4122M1554J0067
20194F9466m5490k9176L9849k0958k4843P489J1822M5899O015k6375k2483j778
20182I437K6844j5815o3579r805N1930L3582J642K7087K6980o1916j5660Q048
20170A8775k1270l1618N195K2065L7051l3084p4397j2507L5351L5030l794k6677
20158d9880J7308N7534j2184J6835K8669l4602k0790l0991l4762N7400L6207J0311
20146D1055l0320l7425j1072L5416J1201J1126l2920l7883p49N3750J771j0394
$$ y = [2412, 3441, 16542, 43323, 68554, 43528, 24621, 24125, 32836, 8244, -16940, 59959, 53972, 57569, 28832, 3453, -26486, -66793, -57589, -50134, -55188, -40942, -15031, -6184, 45258, 29315, 10938, 9152, -32135, -34323, -62982, -39259, -39323, 12617, 40042, -16277, 17845, 59399, 69466, 23976, -5200, 34649, 13691, -11152, -3663, 8159, 54058, 60073, 33698, 11215, 9437, 36281, 20466, -43113, -52918, -988, 32594, 34236, 61323, 88303, 26387, 10727, 18775, -2495, -34113, -28918, -6853, 30198, -2886, -77283, -89790, -54439, -19409, -23203, -49880, -32572, 24962, 12778, 29613, 58282, 23680, 2890, -28101, -62863, -5463, 30744, 41055, 10735, -26690, -37762, -2346, 8855, 19981, -12939, -50822, -51571, 2179, 3950, -6444]
20134f444J5248l8410r274L7907j5351o6851n2400L3675L4825q889M137M1954
20122b9873N1179j2758n3679j7996l0984m3462j9562N8650P5833K4868j1598k6535
20110c5917K266J0517K0659j6593L2146J0236l6665Q832k5969J155L1142k6947
20098b5138m5541J1526K7130K3491l6609L0697L5427J6492n2901o1938K2285J8054
20086c7025l8721l1793M7780J8792j2062J0478J8980K6041J5601q961k4781K0155
20074D484k3583L6341K3518l3142K7881K655M23n225J5438L3817n658r7131n8339
20061g8521k809L5186O4300k272K0046k6648J0185K4634k0041k1230K7748j4497
20049A6081k9957o53K6240k6457j3027K7807J9198j203k9820k859Q459K2777J20
$$ y = [-6444, 8804, -29606, -38880, -973, -16324, -83175, -135575, -101900, -67075, -75964, -71827, -29873, 21306, 8548, -45131, -63127, -94111, -137573, -157135, -98485, -22652, 2216, -9382, -35917, -33651, -23134, -2475, -19068, 13078, 23314, -13351, -4519, -30488, -29333, 1809, -25138, -70679, -59153, -32023, -8532, -45141, -14444, 20983, 37475, -15426, -77364, -55079, -37025, -75746, -107539, -59759, -40967, -53029, -42551, -23571, 2470, 18071, 9110, -15671, 4484, -19099, 17242, 40760, 7618, 35499, 38154, 38577, 33352, 48790, 82607, 76949, -20182, -78521, -81330, -46144, 18156, 15884, 35930, 9282, 19467, 44101, 24060, 2830, 30578, 16081, -13876, -14529, 11711, -14746, -27773, 34, 19232, 18029, -11791, -14650, -6191, 16586, 16706]
20036A6706l5569M777q243l6571r3270J5766O6764M5432J8963K2474k3971J9300
20024A2558j2675l558k6064M9643P470m1845l0443L5500K2868j5711J516k9896
20012c0637q147L4013J9536n4052o517K0950J7947k5606k9322k5033k76K0537
20000f6607L894k0129K4181O9663N4454m628m1232o206J6659k2788j7652K0456
19988A0065L5462l200m3413k9290m117K7876P624m7138j5065N3415J9868k2166
19976a0079m0893p02P0897j9833k4048J66l7524l4497O935J689K4020N760o095
19963f4204q023J1594J1029k0983l0576M2580L0679K2343J6070j6312J2744k8525
19951b1584m6463L7828L9223l7261k4942J9234L5163O539K06p4321M769L7865
$$ y = [16706, -18863, -14086, -22329, -58900, -152170, -136404, -69640, -24208, -5245, 17229, -6742, 12558, -117, -3675, -29739, 19904, 27374, -14471, -44914, -9414, 13454, -2257, -741, -30637, -38784, -4771, 14765, -39287, -45804, -24854, -6907, -32513, -61835, -86868, -87144, -66607, -62713, -82842, -58661, 11002, 65456, 60828, 19596, 13390, 30049, 7261, -10391, 10065, 45527, 42327, -1086, -30376, -34493, -6617, 1007, -46131, -61196, -7781, 12087, -10079, -50972, -51674, 19223, -610, -24658, -24492, -62016, -96513, -89578, -87889, -63869, -58109, -64204, -72227, -60633, -49604, -70587, -101163, -58583, -27904, -5561, 10509, -5803, 6941, -21584, -68047, -30219, 9004, -28257, -53199, -33965, 1198, 7737, 7943, -66378, -61609, -23744]
19939b3744k3121j4477M2813k984k8666l5110o9127m0791O0338R6935K3859k049
19927a6124L3284j4030j1912K1110j3687j1774l6300q559M8974j4465o2525R754
19915g6254M9747k9760k4364O904N5915k6894M0205J2802j4493j0M7578k6287
19903A5089l2321r550K9435K7345k7743r901o943L414R943l4622k771M0761J0363
19890A2499l8882Q645M1265l808Q455J9657L383n376L0071n6981m4816l8599M386
19877f0101M8341k4732J4934n2853K1309O1221J3012R610r247k1162m978j3292
19865a7938k4617J0248J2610k397L0615p138n4766k5574N2481N8464K3906q246
19853D7648L5858j3893n86n6152o566Q511L5267K0943k0114l9316j5043J2208
$$ y = [-23744, -46865, -61342, -18529, -21513, -50179, -85289, -154416, -195207, -134869, -37934, -14075, -16124, 17160, 3130, -8782, 12328, -1359, -13133, -49433, -57992, -9018, -23483, -86008, -76254, -26507, -56267, -80631, -73727, -17812, -44706, -4501, 8301, -6192, -6202, 41376, 15089, -17232, -26782, 2653, 29998, 2255, -7646, -14589, -11175, -1232, -35854, -38625, 2136, 12499, -26383, -17738, 23527, 19719, 28174, 47831, 51214, 45838, 75909, 18928, -25888, -64487, -60101, -11760, -36492, -21558, -74411, -53102, 8119, 21131, 30741, 21494, 332, -4646, -17938, -42555, -32307, -19697, -22094, 8521, 1383, -53383, -78957, -26476, 31988, 55894, 47648, 83506, 69613, 69027, 12875, 6309, 14820, 50087, 71030, 50916, 11600, -3443, 8765]
19841H765P226n693n2233j2442M0628K4496m0261m2249J6945j3391Q304R3685
19829C3780J993k8480k1840p928M189j458o693P016N791k316k8035l7528m106
19816h5615K4359j0870K3795J1343j1017L4984L7041j4260K0778K1862j1498l6410
19804D492Q726K195L1542L7967R997Q992k8409j0305P202l4637k5778m836k4251
19791a7103j9609O329k3304K5047O1294J9403M2468j3843J1140l5214p8752K5823
19779C679P4676L176o8389J580J7615k0143J4184m9308m7947J6892J7284N5460
19767A8759j0188j3783K3490L1925K4348J1143l1372k8477l66L8434j4714n4253
19755e054N115K7368n30j6266l5310q847l0258l9475k2478M4159L3844m1586K9943
$$ y = [8765, 15991, 10298, -41935, -54377, -13749, 10747, -29514, -71763, -54818, -68209, -59905, 33780, 35773, 7293, -14547, -22475, -18286, -19744, -26437, -19421, -13630, -15946, -43981, -81509, -85615, -61256, -72126, -48331, -36988, -48005, -13021, 24020, 9760, 30538, 52400, 40902, 4492, 13218, 15413, 46955, 84922, 94919, 103911, 75502, 65197, 72399, 37762, 11984, 7148, -17103, -36712, -30383, -53687, -28640, 32654, 52057, 94525, 80682, 91822, 56608, -22144, 3679, 78355, 81531, 13142, 14722, 32337, 12194, 26378, -22930, -70877, -53985, -36701, 18759, 8571, -5212, 18278, 50203, 74551, 85694, 54322, 25845, 25479, 63913, 49199, -5054, 61, 27429, 26899, 10633, -24677, -33524, -63782, -103257, -125735, -81576, -47732, -89318, -59375]
19742e9375L7514M5054P585k3155n6344N957n695j933L0100j1540k4875j562k5892
19729h4161r512K2591N1027O233j3827J2490o3840n871N2042N7923K3193K4970
19717G3258m712k8751k0403o148k7245l4172L1409O0777K7798m2670R15q190J1484
19704C3350N310m2732p5350m1587K8144M5821L7414m803J0O202O2290q751j9462
19691B5856n980N319K8032L6253K850K288j2072M593m2915r4333j8743O269J3052
19678d9531P3419N3216J8075l5253L6052m6272n6831P417L5110m8099n4167p112
19666g3976K2645o385J075j78L6812K4246N3415l6924l6337P3545L6541l9884
19654E4595n0003n317L147L0314j3951j4990j6081J8693J2800j2375L965P072
$$ y = [-59375, -21861, 23193, 30778, 7623, -48721, -42764, -48459, -50392, -20292, -31832, -56707, -58269, -84161, -93673, -71082, -20055, -13822, -27649, -15159, -78999, -84870, -32828, 25095, 48288, 73258, 68546, 39795, 19392, 13244, -14001, -48173, -16764, 44013, 71811, 29141, 30056, 21866, 33350, 38660, -4072, -79422, -121009, -92865, -47044, -9630, -14433, -14423, -8221, 54069, 45318, 25856, 19876, 25195, 53227, 89480, 92330, 94618, 82546, 87139, 44224, -50109, -68852, -62583, -49531, 23888, 77104, 95179, 59926, 95978, 49706, -7125, 292, 35402, -12697, -66864, -73976, -51331, -57716, -56641, -56819, -20007, 4239, 57654, 20730, -15607, 57938, 94479, 54595, 4592, -725, 2422, 32736, 18785, 3795, -12286, 6407, 19207, 6832, 10797, 17869]
19642A7869M7019n7536J4118L9666k7226j9111l6178k0416O410j4005K3729L603
19630b2058N656n04L946J1947N4393J4115k2514l3280q602q731O822J3471j1558
19617C103R843j1731j7268L6200j7823P60J5114L2474K6512j6585k3826j5440
19605B1333L1298M1557k8799o4896k3099K4039J7424K6305N3742k4493n1459K8280
19593E1232O5l45M570j055p66K0508L261J9710L1397J3109m5742l3692M620J2983
19579G9855J5202N146O6058R777l2491N5682P2092R9834J06867J25952J28177
19568G32151J52153J10159O965j01877j74616j57398j39455r6832q7489m6086
19558A97675N440l4394j4438l8241r531k7354l2125o450K3164K7984N6456L1908
$$ y = [17869, 64888, 7352, 21470, 61136, 33910, 14799, -21379, -41795, -35385, -49390, -25661, -22058, -16402, -16906, -12960, -1013, 53380, 67495, 44981, 11701, 3099, -5632, 1190, 14661, 3103, 12946, 1215, -16053, 20147, 2324, 3084, 18198, 50672, 77184, 60599, 36773, 21333, 52631, 94188, 65389, 493, -22606, 1433, 18857, 45162, 98904, 74411, 22952, 51232, 51297, 50952, 55522, 54467, 53701, 74209, 77470, 97180, 128577, 141686, 95944, 62252, 66872, 79855, 95057, 100203, 166261, 176038, 143547, 199229, 271321, 371155, 478022, 603974, 732151, 884304, 994463, 1001428, 899551, 724935, 567537, 428082, 331250, 243761, 197675, 203115, 168721, 154283, 116042, 106511, 79157, 47032, 40582, 63746, 91730, 148186, 180094]
19546A80094j4750q7496o9772L5685K3821p158R239J0832J5619k2806o8611n2793
19534d8096K8632J0804R375M0531L4419P5145j8355j3110m4378m8988J731K5720
19522E3430J6392K9466l9494J7801J4528n6741K6833M4098Q985O5991L3450Q468
19510B23207N4995J28689J39473J42787J54225J36729J03924p1046j61019j79578
19500F72386j50866j35138j11919m9927L7318j2626j3604l8791m0177o7707k7400
19489F1549J8397J5566j6735j1483M8694J2738j3318k5386j1453J5907j7002r565
19477F7909m075j7362J98j6270J6693P748O177l3015o4483L8740P4838M2032J5410
19464A34540k0761j6600k4620K5411O4613k2696l8357N0222O0030m6006o3382
$$ y = [180094, 165344, 77848, 8076, 43761, 67582, 60424, 69663, 80495, 96114, 73308, 4697, -48096, -19464, -8660, 715, 41246, 75665, 150810, 132455, 119345, 74967, 25979, 27710, 53430, 69822, 99288, 59794, 77595, 92123, 35382, 62215, 106313, 115298, 181289, 214739, 223207, 278202, 406891, 546364, 689151, 843376, 980105, 1084029, 1012983, 851964, 672386, 521520, 386382, 274463, 224536, 261854, 249228, 235624, 196833, 156656, 88949, 61549, 79946, 95512, 78777, 67294, 115988, 128726, 115408, 90022, 78569, 94476, 77474, 67909, 63834, 46472, 46670, 30400, 47093, 54841, 61018, 28003, -36480, 2260, 77098, 119130, 134540, 113779, 97179, 72559, 97970, 162583, 139887, 101530, 151752, 211782, 165776, 102394]
19453A02394p4936l584L1360p376k4177r433Q528O48J3788k9384j8346L0519J8641
19440C8642m7252l426K854M1164N1897o662l4138m176L96j9696r6L6792M9691
19427A05990k5776l9644j8096N8028j8575j9340P264l2026J8978L0132L614M618
19415G5167j9797R552J206L2154K6344o3053m6823k8465O1616K8497q456l3783
19403C4159P050J6702N285k8474N823M9253J6721n6031l1727n990J7183j1475
19391A8479K0333q952j4143l487k4247K2689N2181R331L1406K6371J4850j08734
19379C6077o4114m4405K7075O4233Q11J3647M386O034O740N2976R670J00k4849
19366H8381k3013K0940j1459n7936M2053j192p0041l101J1775J6054k827m793
$$ y = [102394, 27458, 23874, 55234, 47858, 23681, 14248, 22776, 23424, 37212, 7828, -10518, 20001, 38642, -8610, -12036, -9182, 31982, 83879, 77217, 43079, 38903, 39299, 19603, 19507, 56299, 105990, 80214, 40570, 22474, 80502, 61927, 42587, 49851, 17825, 36803, 66935, 70549, 75167, 55370, 64922, 66128, 98282, 124626, 61573, 14750, -13715, 47901, 76398, 67942, 34159, 41209, 57911, 63196, 34722, 40545, 89798, 106519, 50488, 18761, 12771, 29954, 18479, 38812, 29860, 15717, 12230, -12017, 10672, 62853, 72184, 103590, 129961, 144811, 36077, -28037, -72442, -45367, 18866, 19677, 33324, 37710, 43744, 50484, 103460, 113130, 113230, 88381, 65368, 86308, 74849, 16913, 58966, 57774, -12267, -15368, -3593, 12461, 9634, 4841]
19354D841q872M086L6598j7712L267O9762P128M783q277l9296j7612L9739o098
19341G2337m6686j4985M888K7406j456K3856J3522j2442k1474l6872L3207j3142
19329B8159J3218k6027j2152K3412r86M8501J897k7434P417M700J0913p32j0091
19316F0795M836n968j7828L2083K8150J1340j0066k5670O815L795o674l3394p662
19303D0552j0011N0651M1303K2291l0589k8111l716J4354l4830J1283L7678M8953
19291A59808K4445j4095l4429K1147O476m6761k0654K072J8565r559J7031K1664
19279A45710P7062M1258q886k9733m1696j6134J8832j5724J9328N637J1416l1514
19267A75556m2559J9238L2125l7678j3409J0202J2358L9653L707l4489j6883j2018
$$ y = [4841, -4031, 55, 36653, 18941, 22208, 91970, 99098, 103881, 95604, 56308, 38696, 78435, 72337, 25651, 10666, 15554, 42960, 41504, 65360, 78882, 66440, 44966, 8094, 41301, 28159, 41377, 15350, 3198, 26610, 25624, 74125, 76022, 48588, 56005, 60705, 71618, 70886, 60795, 65631, 59663, 41835, 73918, 102068, 113408, 103342, 77672, 84487, 88282, 81608, 48214, 40552, 30541, 81192, 122495, 144786, 114197, 86086, 82370, 96724, 61894, 73177, 110855, 159808, 184253, 170158, 135729, 156876, 163352, 116591, 95937, 98009, 116574, 107015, 124046, 145710, 222772, 264030, 255144, 225411, 183715, 167581, 186413, 170689, 190017, 195654, 207070, 175556, 132997, 152235, 184360, 146682, 133273, 143475, 155833, 195486, 199193, 164704, 147821, 135803]
19255A35803j1695o2791J7405N5345Q779O5281p226n0890j0796O092J4929M519
19243A64755l1817m8970k7045l302L7996L9243o2012j4107n447j5303P5004O0551
19231A69546N0097K69k6864l4445p915N7542N1050j5624k7908j4324K2356m4148
19219A79632l9131K4900O8612L9575k8910m4972l3286J0550J2477J4731J7809
19208B21987j4314k1052j4293O140j9157J0049k3194M8410K5898l4377L955N541
19196A95593l778L6487k4263l5911Q855L4725m10M2963J00237J6653p2970j00858
19184A97323n8200n420L0395K5006J5194k0284L5954K2585J1500l009l9756m6432
19172A64856k3541L6997O012l2650P132J5619j7892J0198K9234K3074J6740k4070
$$ y = [135803, 124108, 61317, 78722, 134067, 142846, 208127, 200901, 150011, 139215, 145307, 160236, 164755, 132938, 83968, 56923, 53621, 91617, 130860, 68848, 54741, 49294, 33991, 108995, 169546, 219643, 219912, 193048, 158603, 150688, 208230, 259280, 243656, 215748, 201424, 223780, 179632, 140501, 165401, 234013, 273588, 244678, 199706, 166420, 176970, 189447, 204178, 221987, 207673, 186621, 172328, 178468, 159311, 169360, 146166, 194576, 220474, 186097, 190052, 195593, 191815, 228302, 204039, 168128, 176983, 211708, 211298, 254261, 354498, 371151, 298181, 197323, 139123, 133703, 164098, 189104, 204298, 184014, 219968, 242553, 254053, 251044, 211288, 164856, 141315, 178312, 184324, 151674, 158806, 174425, 156533, 166731, 195965, 219039, 235779, 211709]
19160B11709j4024J9638L6555p199R694K2080Q205O571K4137j8609j3821o6543
19148B18393n868N6889K6855j5428N733o3955r797J8544M0597M0534j5671k4297
19136B72529j3037J7383O1674L5687L1932j087J3365m647J8172J7155K9859k9779
19124D49206n8012j1903J1106J2465M8088n347p0631l490j6925q883k71J3258
19112C58661N154K4514J2770M2817k1111J5865M1448R224M660K0341k5068K9425
19100E18700O8863Q2228R4472M9084K4491L9456P1734j1100j33844j06290p010
19089F90784j801M9992L4473O1055j6110K0179p102J8090K0010r80J4245M4089
19077I26924M2923M6707M4422N1405R2349J00264P3293L3316Q3604J59112J87289
$$ y = [211709, 197685, 217323, 253878, 246679, 256373, 278453, 286658, 293229, 317366, 298757, 284936, 218393, 212525, 269414, 296269, 280841, 286574, 222619, 212822, 231366, 271963, 312497, 296826, 272529, 259492, 276875, 338549, 374236, 406168, 405081, 418446, 413799, 431971, 449126, 478985, 449206, 391194, 379291, 390397, 402862, 450950, 445603, 374972, 371482, 354557, 345674, 345403, 358661, 363815, 388329, 401099, 443916, 422805, 438670, 480118, 489342, 494002, 514343, 489275, 518700, 587563, 669791, 764263, 813347, 837838, 877294, 949028, 937928, 804084, 697794, 690784, 688983, 738975, 773448, 834503, 818393, 838572, 831470, 849560, 869570, 868590, 882835, 926924, 969847, 1016554, 1060976, 1112381, 1204730, 1304994, 1378287, 1411603, 1495207, 1654319, 1841608]
19066A841608K22449K88967L90536M84419M66283J16848j59200k09555j33206
19057C309149L9575J28600J63800K43590K95577L64554M42395N14584N92447Q05272
19047F899543R38233J127328J458752J894901K512976L465087M869967P139572
19039C0306359J0628440J6026887K4496584L6596086N2079078O7059201N0506639
19032B87699274j9347743o5687965o8377204m5359885k6597299j6503954j0809269
19025C5015955p406698n294602l846448k844204k166176j708077j419986j126183
19017I203581r23365p66605o12977m96614l38776l53103l19907k49699j33063
19008E009472j3502J11022K16821K94054M8984j95643j41688J20557K72448J35955
$$ y = [1841608, 2064057, 2353024, 2743560, 3227979, 3694262, 3811110, 3651910, 3442355, 3309149, 3348724, 3477324, 3641124, 3884714, 4180291, 4544845, 4987240, 5501824, 6094271, 6899543, 7837776, 8965104, 10423856, 12318757, 14831733, 18296820, 23166787, 30306359, 40934799, 56961686, 81458270, 118054356, 170133434, 237192635, 287699274, 268351531, 202663566, 134286362, 88926477, 62329178, 45825224, 35015955, 27609257, 22314655, 18468207, 15624003, 13457827, 11749750, 10329764, 9203581, 8280216, 7513611, 6900634, 6404020, 6065244, 5712141, 5392234, 5142535, 5009472, 4995970, 5106992, 5323813, 5617867, 5666851, 5471208, 5329520, 5450077, 5722525, 5858480]
18998E858480k23478m37805l68877j40414j19781K2435J37291J82895L06173L71055
18988E587974M31019N66612O95520Q30737J107065J341968J667893K313419L070748
18979A7612955M318877O267369R233540J3846084K1065239L2196747M7378739
18972A51919550O5974731P4466791K4632554n1814765p9715475o4916021l8898688
18965H1648677k3212665j4935211r991348o965677m980510l667980k767583k108256
18957A3019447j705632j349205j080116q65762p96863o79204n93227n00541m05017
18948E043880l58700k79234k02825j04123J16863J90651O1947l33513n77813n15085
18938C042048l83033l68603k80864j55864j07576j12495j45780j24100p4346p3032
$$ y = [5858480, 5635002, 5197197, 4828320, 4687906, 4568125, 4590560, 4727851, 4910746, 5216919, 5587974, 6018993, 6585605, 7281125, 8111862, 9218927, 10560895, 12228788, 14542207, 17612955, 21931832, 28199201, 37432741, 51278825, 72344064, 104540811, 151919550, 217894281, 292361072, 316993626, 265178861, 185463386, 120547365, 81648677, 58436012, 43500801, 33509453, 26543776, 21563266, 17895286, 15127703, 13019447, 11313815, 9964610, 8884494, 8018732, 7221869, 6542665, 5949438, 5448897, 5043880, 4685180, 4405946, 4203121, 4098998, 4215861, 4406512, 4468459, 4134946, 3557133, 3042048, 2659015, 2290412, 2009548, 1853684, 1746108, 1633613, 1487833, 1363733, 1289387, 1216355]
18928A216355q9441j12125n5323j2940k8662o9143j20020o3647l3103m4049l4510
18917E53392k1798l3802o3114n4652j8202J5615O4410L6020N458K9595O3875q0897
18905D95900j35028m6180k6811q85L2109P029l5157k0079j3485k969K777o259
18893B50962l2654l5626Q468K3008k7721o6769R06l7093n4715L7198L6656L1668
18881A34288p8009o1895o4958J2816N0549L2144K2274P869l2601O076K5120J5492
18869F9165L2092M0586r722o606K3268o191p8792l5671o776J3383M1770N3307
18857A29813J8897L0485k3114l3271k4283O293k997j4339l5927m5697J8647P5481
18845I9988L6667l1089l6076O820k5028O0557O964L4416m573l7029o7912r196
$$ y = [1216355, 1126914, 1014789, 959466, 946526, 917864, 848721, 728701, 665054, 631951, 587902, 553392, 531594, 497792, 434678, 380026, 361824, 377439, 441849, 477869, 483327, 512922, 576797, 495900, 360872, 314692, 287881, 286996, 319105, 326134, 290977, 270898, 257413, 254444, 257221, 250962, 218308, 182682, 191150, 214158, 186437, 119668, 120574, 83481, 28766, 65964, 102620, 134288, 56279, -5616, -70574, -57758, -7209, 24935, 47209, 55078, 22477, 28553, 53673, 69165, 101257, 141843, 132121, 125515, 148783, 142592, 63800, 28129, 21353, 34736, 76506, 129813, 148710, 179195, 156081, 122810, 98527, 104820, 101823, 87484, 51557, 5860, 24507, 99988, 136655, 105566, 69490, 76310, 51282, 111839, 118803, 153219, 148646, 111617, 43705, 34509]
18833C4509K3403L6151J778l4471k8860k844r188k0657n0090o807L4862N0186
18821B7972R145K499L0119K4462o0593q3199q9752k7799J3283Q8154L1366l2208
18809f6551j4363K7147M6007j0390l1116J3497J2289q831J868j8938l026M7963
18797d444K0790M9978J4746k6974p8099o047j4402j1206R90M2388j9238Q043L1999
18784H524J3538P3L4741l2781J133j4098m0476m2173m0613O32P420K0420k785
18771h6445m066j9062J0819J0427P069k4188M2622Q1728M6407j2565n0004k775
18759c3Q351n7729L126M2549j6217l5204k227N356m5511l3111K1904L0478R971
18746f8297k1281o108n437m7975p283k8118J8481M4359N5208L3766K1221k6838
$$ y = [34509, 57912, 94063, 95841, 61370, 32510, 29666, 20478, -179, -50269, -57076, -22214, 27972, 37117, 39616, 69735, 94197, 33604, -49595, -139347, -167146, -153863, -65709, -34343, -66551, -80914, -53767, -7760, -18150, -49266, -35769, -23480, -32311, -30443, -49381, -52407, -4444, 16346, 66324, 81070, 54096, -24003, -30050, -44452, -55658, -54668, -12280, -31518, -23475, 8524, 22062, 22135, 56876, 24095, 25228, 11130, -29346, -71519, -112132, -111500, -104080, -83660, -86445, -90511, -109573, -98754, -88327, -81258, -105446, -62824, 18904, 65311, 52746, 2742, -33, 8318, -49411, -46285, -3736, -19953, -55157, -57384, -52028, -97539, -130650, -108746, -78268, -68297, -89578, -95686, -101123, -149098, -156381, -184499, -166018, -121659, -66451, -32685, -11464, -38302]
18734c8302m6015l7576J2187L516K0321L3205K2775m1856m6500j8639K7309m128
18722a13703j8794K2944J9070l2272m659N6595K7647n4438j736L0999j3012j0319
18710i1678N711j6403L7435K229J9938L8977n53n9071o4617K737L4223L408l368
18697i1032j692j0660P949O7953J1675l8239m876L3414K5978l7389k2988M2278
18685a7629M9477j4362n4533n8558k833N542K8970k2550l3811K050M6851M5578
18673b5808J1129J43K3730J4441l8625m1133k8175j9362k0112j6068K4421K6997
18661h8422q756K4873L1114k230j0163N9152j6183j8262K3646o457K110l423n7885
18648g0886N177L2589l3562L1430M183m7032p723Q81Q288M5468K0793m6174k9810
$$ y = [-38302, -84317, -121893, -109706, -106190, -85869, -52664, -29889, -71745, -118245, -136884, -109575, -113703, -132497, -109553, -90483, -122755, -127414, -70819, -43172, -97610, -99346, -68347, -81359, -91678, -85967, -102370, -64935, -62706, -42768, -3791, -4344, -63415, -128032, -125295, -91072, -87664, -91032, -92724, -103384, -95435, -27482, -15807, -54046, -58922, -25508, 470, -36919, -59907, -17629, 31848, 17486, -37047, -95605, -98438, -92896, -63926, -86476, -120287, -118237, -71386, -25808, -14679, -14536, 9194, 23635, -14990, -56123, -84298, -103660, -123772, -139840, -115419, -88422, -97178, -72305, -41191, -43421, -53584, 5568, -10615, -28877, -5231, -11688, -9578, -13001, -70886, -65709, -33120, -66682, -35252, -31069, -78101, -85824, -84943, -76655, -31187, -10394, -56568, -86378]
18635h6378k596l279j1455J3940q917J720M06M850Q903j2701L7233L5355k3826
18622d6745j1320m1588K6153M4015j2393m7924k9275J9254Q1917N0808k9158k256
18610A488O1966q05o2917K516j7363l2866J8215J2502M646k1459k0235n1197L5305
18597g0204L7014J0759Q556n0798J6903M5580J222n0113j9690k8979l9965L6146
18585a03569L8798J8012k7651k1790p982m1933j3874j1136j0961j6319K5893K731
18573a69781M6620N0251K3501k694M6835K8112k1946j6091J628o8196P528k8421
18561a02654k4768l119P4305L0514K4242N764l5321J2525j6580j5171K7408K6115
18549C260K7020k6303m5955m8344J0829J3823J9428K8347n4831m8927K3278M2401
$$ y = [-86378, -88974, -92253, -103708, -89768, -98685, -96965, -96559, -91709, -82806, -95507, -58274, -22919, -46745, -58065, -99653, -73500, -29485, -41878, -89802, -119077, -99823, -17906, 32902, 3744, 1488, 63454, 62649, -268, 2248, -15115, -47981, -29766, -17264, -12618, -34077, -54312, -105509, -70204, -33190, -22431, -13875, -64673, -47770, -2190, -968, -51081, -70771, -99750, -139715, -103569, -64771, -46759, -74410, -96200, -104182, -146115, -159989, -171125, -182086, -198405, -172512, -169781, -123161, -72910, -49409, -52103, -5268, 22844, 898, -15193, -13565, -81761, -74233, -102654, -127422, -130541, -56236, -25722, -1480, 4284, -31037, -18512, -35092, -50263, -22855, 3260, 30280, 3977, -41978, -90322, -79493, -65670, -46242, -17895, -72726, -121653, -98375, -55974]
18537e5974m224o8334l8723l895O0629L3032L0470j5213K6039M6484L8712R243
18525E8246n9410r9700j1938Q7828p64J3829J1329j0567l3627L1437L7778k9292
18513d851l0114N9618J3370K0785J8071l2996k0489m6906p6977k1333N0991J27211
18501E6380N4710j8602M0326R8182J36661J86421J41108L7745P1533K7768k6895
18490H05337j25690j84533j39417j44677j05170m1797k0011R271m8424K9033P1059
18479A04981l2741j4504O279l2236k1657O0777L5478j2654J8065l02q8266l2920
18467i700J1028j553K4822Q337n815N3095m1174m4070o0807J4026K7926K5776
18455A891K0188J1717M0241j217K4651j949l6850k3317k4992n566J4176M0124
$$ y = [-55974, -60198, -128532, -167255, -171150, -110521, -77489, -47019, -62232, -36193, 10291, 49003, 58246, -1164, -100864, -112802, -24974, -25738, -11909, -580, -11147, -44774, -13337, 24441, -4851, -34965, 24653, 38023, 58808, 76879, 43883, 23394, -23512, -100489, -121822, -70831, 56380, 111090, 92488, 132814, 230996, 367657, 554078, 695186, 732931, 804464, 832232, 805337, 679647, 495114, 355697, 211020, 105850, 64053, 44042, 53313, 4889, 33922, 104981, 72240, 57736, 64015, 31779, 10122, 70899, 106377, 93723, 111788, 111486, 23220, -9700, 1328, -225, 24597, 32934, 27119, 80214, 39040, -5030, -65837, -51811, -23885, 1891, 22079, 33796, 74037, 72820, 97471, 95522, 58672, 35355, 10363, 4797, 18973, 59097]
18443E9097N8693M5439k7541l3028L4021K7126N1844M5812J31228J80719J74733
18432G48143J53568J14101O6857n3192j53081j29724j31954j38507j50126j12221
18422B13864l9499m2929k5793l3269j1031O600k4865k7231j5033n857K0244j2228
18410B973q207j5512L4934L5409l3246o0501j627k5259l6899Q3119M5075j548
18398A8711M096l2715m5641L3403M9486l3879O670N801K3368L083M389J4876r327
18385D2321k7068K288n8384m5385j8268N0429l2208l0159J5594K3375k1192m7214
18373a45871P241L2344K2154K3715O1405M7313l0783n7804L982o6345n5103M1652
18361a16100m714m212O3688L4568n934J6681L1052m5689j4114m8762m0685J1902
$$ y = [59097, 117790, 163229, 135688, 102660, 136681, 163807, 215651, 261463, 392691, 573410, 748143, 901711, 1015812, 1082669, 1029477, 876396, 746672, 614718, 476211, 326085, 213864, 174365, 131436, 105643, 72374, 61343, 67943, 43078, 15847, 814, -5043, 15201, 2973, -5234, -20746, 14188, 49597, 16351, -44150, -45777, -71036, -107935, -24816, 20259, 18711, 22807, -9908, -55549, -22146, 27340, -6539, 131, 5932, 29300, 32383, 36772, 51648, 42321, 15253, 17541, -40843, -86228, -104496, -54067, -86275, -116434, -100840, -77465, -98657, -145871, -138630, -106286, -84132, -60417, 988, 48301, 17518, -40286, -36304, -102649, -157752, -116100, -120814, -125026, -61338, -26770, -32704, -16023, 15029, -30660, -44774, -93536, -134221, -122319]
18349a22319J0476N7376L9234L6404P7351j5774p1987L735k4624p4521k0659j2056
18337a17364J5454J6889p029J3101K2551M0894J0131l157m2240p364O153j9086
18325g1067J9059J6802K2252M52n5910J3890L2283J7281n1074k7574M7783j1003
18313d6826J5237j5162j8185M5457J5460J1858Q022m5825m0395Q989l155J4724
18301d9801K1768J9354k1961j8855j0217O1672O4667k392K3395j2047k6881k6159
18289B2543m3548j7344j7626k0121j4932J512N6658P108n3413m4858n054L569
18277a25506N8595j9651o2347J8158j7917K7590M4277P796J874N101J9682j6824
18265e9172J0897L5429J2044o4366R073J8253L1084K7454r581k5972m4287J0118
$$ y = [-122319, -111843, -54467, -15233, 21171, 98522, 82748, 10761, 14496, -10128, -84649, -105308, -117364, -101910, -85021, -92050, -78949, -56398, -15504, -5373, -8530, -50770, -58134, -51981, -71067, -52008, -35206, -12954, -12502, -68412, -54522, -22239, -4958, -56032, -83606, -35823, -46826, -31589, -46751, -64936, -19479, -4019, 7839, 15861, -29964, -70359, -61370, -64525, -49801, -28033, -8679, -30640, -49495, -59712, 1960, 66627, 64235, 87630, 75583, 48702, 22543, -21005, -38349, -55975, -76096, -91028, -89516, -32858, -25750, -79163, -124021, -129075, -125506, -66911, -86562, -148909, -130751, -148668, -121078, -76801, -69005, -67131, -62030, -42348, -59172, -48275, -12846, -802, -65168, -56095, -37842, -6758, 20696, 11115, -14857, -59144, -49026]
18253d9026j1738L2260M9892L7182k6734m1890l4315K7119j7054M809N750m174
18241b7919m9968J082L6780K7902k6007k7785K5317K1684n308M687q4838l0862
18229a35235J0586L2414K1237M1625k5029Q809K3506J0550J6278k5618l8781l9984
18217i9642K495J1307Q995K423P182k105n930k7822M4255K6574N5446L6220j8904
18204D0494j6714Q640j4227k6775m2862j4029L8592M8523K081J786K218L2110
18192E9837J7773K1591J8178M3360N4831N0944K1924N6914J13622J25935J02346
18181F87255P5370M1234J5640k9301k0110o6685j15432j09975p8612m9866m8124
18170C01394n1175q6780o9155m6024k2506k1001j0614K7369O820j1777N573o65
$$ y = [-49026, -60764, -28504, 21388, 58570, 31836, -10054, -44369, -17250, -34304, -29495, -23745, -27919, -77887, -76805, -40025, -12123, -38130, -65915, -40598, -18914, -24222, -19535, -104373, -135235, -124649, -92235, -70998, -29373, -54402, -45593, -22087, -11537, 4741, -20877, -59658, -99642, -97147, -85840, -76845, -74422, -67240, -69345, -75275, -103097, -58842, -32268, 23178, 59398, 40494, 23780, 32420, 18193, -8582, -51444, -65473, -26881, 21642, 23723, 25509, 27727, 59837, 77610, 99201, 117379, 160739, 215570, 266514, 288438, 345352, 458974, 584909, 687255, 762625, 803859, 819499, 790198, 770088, 703403, 587971, 477996, 399384, 349518, 301394, 250219, 163439, 94284, 48260, 25754, 4753, -5861, 21508, 28328, 16551, 22124, 21459]
18158B1459L3811R573o388L2515j4002p586k1732l474k5876q282L8003k4857l7904
18145a4740L2609J1985K0399K2424j4460N45j2959J7159P019j0082K7969m736
18133H3132l2957j4468m3576j0591N1993P161O248K8518K6612R0461Q8534Q7863
18121C68930N2395P5043N7634L0074Q5394R6555K3361q4143j10506j09004p5757
18110D09976k8207o0006o3240o6089L768j5642k4263j2198Q775k2762p590m1862
18098H0660n4974k5456L9073J7811m366j8944K5956k0125k3652o691m8992j4934
18086e4634L021m076M868J737J8541L7524K2507j4301K531q5849m7046K9283R227
18073g6667l868L1284K5632q694l3005N2420L7445j9879p0361k4037K9638K9750
$$ y = [21459, 55270, 64843, 58455, 90970, 76968, 69382, 47650, 44176, 18300, 10018, 48021, 23164, -14740, 17869, 29854, 50253, 72677, 58217, 58762, 45803, 62962, 69981, 59899, 87868, 83132, 50175, 35707, -7869, -18460, 33533, 40694, 46942, 75460, 102072, 192533, 281067, 368930, 421325, 496368, 554002, 584076, 669470, 766025, 789386, 705243, 594737, 485733, 409976, 381769, 321763, 258523, 192434, 196202, 180560, 156297, 144099, 152874, 130112, 122522, 80660, 25686, 230, 39303, 57114, 52748, 33804, 59760, 39635, 15983, 9292, -39700, -54634, -51613, -55689, -50821, -49084, -30543, 6981, 29488, 15187, 17718, -68131, -115177, -85894, -76667, -80535, -49251, -23619, -32313, -65318, -12898, 24547, 4668, -65693, -89730, -60092, -30342]
18061c0342J2360L439J4033j4898o123J5485k1863Q514m415j3524k0938R646k5934
18048g4560N465L0419k7901r381K3563M6313J7965k4459l0969K2216R563l262
18036a5028M7499J4249J8166K2833Q389o2545k8607k0371k1982L3108k9248l0309
18024f3846J3698O804K918M364p946o556O0704j0722n5924j7361k1761M400N2784
18011c8444J4569n1396R419l8748p303N3984p757k5035M2638Q434K4256K2634
17999G251L5506l2821j3373Q131p727p964l3962l002N7099K8760M792N355J7969
17986F6014l6916o7401K0949K8775k8045j7487j9785O438n183R1j8518o17J2424
17973e9261M1704M6949K2486o9248k3367j9777Q611O5893Q859L035O899o861k1921
$$ y = [-30342, -17982, -14543, -510, -15408, -21531, -6046, -27909, -19395, -23810, -37334, -58272, -48626, -74560, -69095, -38676, -66577, -75958, -52395, -6082, 11883, -12576, -43545, -21329, -11766, -15028, 32471, 46720, 64886, 87719, 96108, 33563, 4956, -15415, -37397, -4289, -33537, -63846, -50148, -43344, -40426, -36062, -44008, -50564, 10140, -582, -56506, -73867, -95628, -91228, -38444, -23875, -75271, -65852, -104600, -111903, -57919, -65676, -90711, -48073, -39639, -15383, 7251, 42757, 9936, -3437, 4694, -3033, -10997, -44959, -47961, 9138, 37898, 42690, 48045, 66014, 29098, -38303, -17354, 11421, -16624, -34111, -53896, -47458, -52641, -52550, -71068, -71685, -59261, -17557, 29392, 51878, -17370, -40737, -60514, -51903, 13990, 22849, 25884, 32783, 25922, 4001]
17960D001j1264k2500L1354q112m2785L2284m037j2484l088O836O602N7442j4421
17947A9828n7860M4337L5184k4309K2603K1918J7605m3826j6823j1800L1758j3625
17935B4990n279j0041J0628r139n181J8013k1913J5384j1106l2421K9675J0194
17923A3804p595k2670R355K2156L5044L9928L454J9118n3725l0867q535M4883
17911F4350J0581l0268l8995k7067K7092J0851N008k6820J2521L2871j1142m7654
17899a8672L388P1812N9412l5113k5705M83J5325J9993j7703K545K5837P510J3129
17886A22241j5705m0288q338J5383j3953P989k2124J3381K7142l0558K3245j2505
17874F5910J8497n6974K1387o858k9829M2215K3144k3673K9232M0739o317k3032
$$ y = [4001, -7263, -29763, 1591, -6521, -49306, -17022, -21059, -33543, -36631, -29795, -23193, 34249, 19828, -38032, 6305, 41489, 17180, 39783, 61701, 79306, 35480, 18657, 6857, 38615, 24990, 19711, 9670, 20298, 11159, 5978, 23991, 2078, 17462, 6356, -26065, 3610, 13804, 6209, -16461, -7106, 15050, 50094, 90022, 93476, 112594, 58869, 28002, 19467, 64350, 74931, 44663, 5668, -21399, 5693, 16544, 21552, -5268, 7253, 40124, 28982, -18672, -15284, 56528, 115940, 80827, 55122, 55605, 70930, 90923, 73220, 75765, 101602, 109112, 122241, 106536, 66248, 57910, 73293, 59340, 67329, 45205, 58586, 85728, 55170, 78415, 65910, 84407, 27433, 48820, 41962, 12133, 54348, 77492, 53819, 83051, 123790, 117473, 94441]
17862I4441o282m2321k2259L2277K0203l6163l3681r512J6112K6822M700q423
17850C5914K9644J5408o118L702k3739k9250K5708N2490n025k3842l3756k898
17838C8238k884M670L2535P701k3135J4222O597J9465J4301m0896n1619l8245
17826a9050M7734M2729J2968N4288N6882k9645j9702n4924K7584O572m9447J440
17814G7429N0361J6567k0574l3588r543o326j9834j3212R166L8970O3133L7137
17802A89686j461j5741l9004o503Q025P112l8077J6496N3285L5625l829M948m2001
17789A68561l6736J1687j1453m083M8289l6212n262j8457K1487j3320l6295J6146
17777A04352k6813o4539j2523Q2653P4579J7310j6035n6997j3927P007k7318J9573
$$ y = [94441, 88159, 45838, 23579, 55856, 76059, 39896, 6215, -3297, 12815, 39637, 44337, 35914, 65558, 80966, 74848, 78550, 54811, 25561, 51269, 103759, 98734, 74892, 41136, 38238, 35354, 40024, 72559, 80260, 57125, 71347, 77944, 97409, 111710, 70814, 19195, -19050, 28684, 71413, 84381, 138669, 195551, 165906, 146204, 91280, 118864, 125436, 75989, 77429, 127790, 144357, 123783, 90195, 80652, 74326, 54492, 41280, 50446, 89416, 152549, 189686, 188225, 172484, 133480, 126977, 135002, 142114, 104037, 120533, 173818, 209443, 205614, 210562, 168561, 131825, 143512, 132059, 127976, 176265, 140053, 134791, 116334, 137821, 124501, 88206, 104352, 77539, 13000, 477, 83130, 157709, 175019, 158984, 101987, 88060, 95067, 67749, 87322]
17765H7322O40k513k8272L0408K1688K080N599J4430k8783k1785K0059J4836K7844
17752A43553J2260O5268j2295r811m4902l4586r16O452m9446K2964P769K0721
17740A27031L006R082P975O9103O8202K8739p852k7342k7572J3223J4087K6376
17728C04058J397O645J8443k5378k3902j4364L4227m369o412n930J2977R182J780
17715C08354K7366K4823k0357l9728j358k3752j7341L8104L7246L3038M6587M7767
17703D60749Q1965N9371K7672L7889M0459M0296Q019l7319j6780j8157J8857L0743
17691G33764N6919K7463Q903N6418k8225j2727O3584k711L9777J16804O4908N8340
17679A183217Q3507K4642O8504R8730J17367J03442J64828J41451K11066K14479
$$ y = [87322, 87962, 85449, 57177, 87585, 109273, 111353, 116952, 131382, 102599, 80814, 100873, 115709, 143553, 155813, 221081, 208786, 198975, 154073, 119487, 118571, 125023, 75577, 98541, 106310, 127031, 130037, 139119, 147094, 216197, 284399, 313138, 305286, 277944, 250372, 263595, 277682, 304058, 305455, 312100, 330543, 305165, 281263, 266899, 301126, 296757, 290345, 284415, 297392, 306574, 308354, 335720, 360543, 340186, 300458, 299100, 275348, 258007, 296111, 333357, 366395, 412982, 460749, 542714, 602085, 629757, 667646, 708105, 748401, 756420, 719101, 702321, 684164, 703021, 733764, 790683, 818146, 827049, 883467, 855242, 842515, 906099, 903388, 943165, 1059969, 1124877, 1183217, 1266724, 1291366, 1359870, 1458600, 1575967, 1679409, 1844237, 1985688, 2196754, 2411233]
17669B411233K38859J97499L16179L38691M00826M40250M30994M03489K91763
17660E469783K32523K49554L72059M92611O26819P78825R58306J184474J451503
17651A1816457J741492K158940K678371L428303M496907N801970P657721J0182540
17643D9962701J3573508J8013727K3518400K9309805L2647531K8559373J2454934
17636B08039979j0928614k8626017l3886364k9972294k3178315j7042914j2511391
17629E1894070r385301p134046n551405m431565l499573k817822k265617j836946
17621A4971795j526833j255290j026633q52467o75224n65250m37908l67041l20478
17612G944671k85570l13597l46776l81916l11491j56937n5948n3550J0915O3905
$$ y = [2411233, 2650092, 2847591, 3163770, 3502461, 3903287, 4343537, 4774531, 5178020, 5469783, 5702306, 5951860, 6323919, 6816530, 7443349, 8222174, 9180480, 10364954, 11816457, 13557949, 15716889, 18395260, 21823563, 26320470, 32122440, 39780161, 49962701, 63536209, 81549936, 105068336, 134378141, 167025672, 195585045, 208039979, 197111365, 168485348, 134598984, 104626690, 81448375, 64405461, 51894070, 42508769, 35374723, 29823318, 25391753, 21892180, 19074358, 16808741, 14971795, 13444962, 12189672, 11163039, 10310572, 9635348, 9070098, 8632190, 8265149, 7944671, 7659101, 7345504, 6998728, 6616812, 6305321, 6148384, 6092436, 6038886, 6049801, 6113706]
17602F113706J48353J94337J62039J21258R9611J49712J59778K66627L75106N07661
17592H298188O99742Q44414J030739J271648J687818K156820K711425L415284
17584B2116078M442283N879040P869943J0511809J4020053J8627009K4061153
17577A07527368K8982916L0019140K1692009K272319j8858318l0353079l0638093
17570A10644262k5075133j8740752j3708402j0118156p593624n888639m619111
17563B4900445l601342k915547k378792j900833j565740j232919j057558r68389
17555I279325q43719o42848n42610m09195l63386l79619l37883l93827m82734
17546D883504m72308m14106l27705k34740k40407k29158k19921k32006k18341
$$ y = [6113706, 6262059, 6456396, 6618435, 6739693, 6839304, 6989016, 7148794, 7415421, 7790527, 8298188, 8997930, 9842344, 10873083, 12144731, 13832549, 15989369, 18700794, 22116078, 26558361, 32437401, 40307344, 50819153, 64839206, 83466215, 107527368, 136510284, 166529424, 188221433, 190493752, 171635434, 141282355, 110644262, 85569129, 66828377, 53119975, 43001819, 35408195, 29519556, 24900445, 21299103, 18383556, 16004764, 14103931, 12538191, 11305272, 10247714, 9279325, 8435606, 7792758, 7250148, 6840953, 6477567, 6097948, 5760065, 5366238, 4883504, 4411196, 3997090, 3669385, 3434645, 3194238, 2965080, 2745159, 2513153, 2294812]
17537B294812j55670j29789o6015p7577j24555q8429k3552p4570j06098p0448
17527A378109o4092n2038o5859p5552o1477j26165r4141n7490k9058L6008k2011
17516G66234l2653o7110J1263J7528l1788p6894o6693m9384k9654O0406l2386
17505D68869q19l889k5821m2922K018J5594N596k3834k8411K5770J4550R325K7825
17492D43851O123l4835l5591l5680n3626p4861p564J66l599k0088n9890n421N5165
17479A74150L5016K3726J230q645l7877j5892M7472o2043o3936J1421O1703M8189
17467B14514o281m2945k4577K516K9125L2365K4217k6614m153j2733m8925p491
17455A29018N3587R364p7182J9667n771J940K9016k5858p476j1649K2183J3133
$$ y = [2294812, 2139142, 2009353, 1943338, 1865761, 1741206, 1652777, 1629225, 1554655, 1448557, 1378109, 1314017, 1261979, 1196120, 1120568, 1059091, 932926, 838785, 781295, 752237, 788245, 766234, 733581, 666471, 677734, 695262, 663474, 586580, 519887, 470503, 440849, 501255, 468869, 468050, 464161, 438340, 395418, 397436, 413030, 418626, 394792, 366381, 392151, 406701, 416026, 443851, 449974, 415139, 379548, 343868, 290242, 215381, 207817, 207983, 204384, 184296, 124406, 118985, 174150, 209166, 232892, 234122, 225477, 187600, 171708, 219180, 157137, 93201, 104622, 166325, 214514, 208233, 165288, 140711, 143227, 172352, 204717, 228934, 202320, 198167, 185434, 136509, 129018, 182605, 191969, 114787, 134454, 128683, 130623, 159639, 133781, 126305, 114656, 136839, 149972]
17443A49972n910K0414J5460q804O79J7232j1239p6024l3225K0204R860L7615
17431A36234M0948j0513n4799l5449L690j0782r127n399j7030o7651j1224J6463
17419b4639r45L2863J0193l6577k831J4654m320r894j0795N101K0115j7518L6060
17406A1467N9218j6529M0504q834P036j0125p0928k0322J7004K1923j1787k1579
17394b952J4421K0710L2257K9725P8o2191q17K2290O019M952K492l57L32J2863
17380G9822N7119K5808n4435q8643Q472M7124k7491j1348m9529j6679P4881M4072
17368H9173k1975j5994j0166J0909k2360J6635j5595o7538l9828J2859O0173K5474
17356B1767k68j3469k0l894j3478l1711J6719n89P245K3694N81j4261Q081K920
$$ y = [149972, 144062, 164476, 179936, 171132, 171811, 189043, 177804, 101780, 68555, 88759, 98619, 136234, 177182, 166669, 111870, 76421, 80111, 69329, 60202, 54803, 37773, -29878, -41102, -24639, -25584, 7279, 17472, -19105, -21936, -7282, -11602, -21496, -32291, -27190, -7075, -24593, 11467, 70685, 54156, 94660, 85826, 92862, 82737, 11809, -8513, 8491, 30414, 18627, -2952, 11469, 32179, 64436, 94161, 94239, 32048, 31231, 53521, 59540, 64492, 66984, 66627, 66959, 79822, 136941, 162749, 108314, 19671, 28143, 75267, 47776, 36428, -13101, -29780, 45101, 89173, 67198, 51204, 41038, 51947, 29587, 46222, 30627, -36911, -76739, -63880, -3707, 21767, 21499, 8030, 8010, 4116, -9362, -41073, -24354, -24943, -17698, 5996, 6577, -7684, 397, 3317]
17342C317J3783R703J4438m9153l3278J8323K0890k5193k9343P441K2827M6477
17330B0232P876n178L9872J2264O53K7975J2385q2291j9063l3715R273J5811r646
17317c552k476M2171k5991R49K1121l9141k0461R53M8134N987J6264p983m1030
17304e055J5803m177j3529o2425K486P0163K5677m4301r838l306j8426k135j3497
17291f2560j3819Q220J3176J3205L0480k7459m6102o287k007L2973M4837L6395
17279B1052j0298q742k7403m5627M0970m930K558K6375m0180n1387l704K5109
17267g6207O0271K8590k5440l4554o1360j6429q47L211M5711J4645M0389n3611
17255g5631m0362L5998J8379j9885j02N0318J5186j2303k812J1723j1590K6791
$$ y = [3317, 17100, 26803, 41241, -7912, -41190, -22867, -1977, -27170, -56513, -49072, -26245, 20232, 28108, 22930, 62802, 75066, 75719, 103694, 116079, 33788, 14725, -18990, -9717, 6094, -3552, -6028, 36143, 10152, 11101, 32222, -6919, -27380, -26427, 21707, 27694, 43958, 35975, -5055, 10748, 6571, -6958, -69383, -66897, 3266, 28943, -15358, -25196, -28502, -46928, -49063, -62560, -76379, -68159, -54983, -41778, -11298, -38757, -84859, -91146, -93153, -60180, -15343, 21052, 10754, 2012, -25391, -71018, -30048, -34978, -32420, -6045, -46225, -97612, -101316, -76207, -15936, 12654, -12786, -47340, -108700, -125129, -125976, -122765, -77054, -62409, -22020, -75631, -115993, -79995, -61616, -81501, -81603, -31285, -16099, -28402, -31214, -19491, -31081, -4290]
17243d290K4514O081o031l7095j1656j6147j5999L8124O6575k8950j8336j630
17231d840N168K9152k0083n9671j205K1028J1760j1065l403M9413k3015l4222
17219d0983N2038M6378k847p2876j7906J502p921m768R639L8273l1302k9482L6056
17206b4199J2617p106r839q896k5662J6291J129P327K8720Q493k5753o646M022
17193b9502p175j8281j6643k4893J1212O1834O56R038n710L7848o45K652j7908
17180B483k13l8001n6071M3979M0720p405p815J284J9839o131K8251k194l5745
17167a7019K3678K630p607l277k391n8496l9329K2467K0298L7974q90M2757K7991
17154D8786j8434n2940j9237J0978M5542K8557Q704n0173j9885q394L8937J8465
$$ y = [-4290, 20224, 26305, 20274, -16821, -28477, -44624, -60623, -22499, 44076, 15126, -3210, -4840, 328, 29480, 9397, -50274, -51479, -30451, -18691, -29756, -33159, 16254, -6761, -40983, 11055, 57433, 54586, -18290, -36196, -34694, -42615, -47383, -37744, 529, -30773, -60255, -24199, -11582, -18688, -28527, -37423, -63085, -46794, -45665, -38338, -9618, -1125, -26878, -33524, -29502, -36677, -54958, -71601, -96494, -85282, -23448, -22792, -13754, -19464, 18384, 17739, 20391, 2483, 2270, -35731, -91802, -47823, -7103, -14508, -22323, -21039, -1200, -7331, 20920, 18726, -17019, 6659, 9289, 1682, -1595, -3986, -62482, -101811, -79344, -59046, -21072, -21962, 20795, 48786, 30352, -22588, -41825, -30847, 14695, 43252, 51956, 1783, -18102, -26496, 12441, 30906]
17142C0906m8286q8508M4630L0866k9551J1510L0206J6046k2490j4980k6613n952
17130g2216J2454K3886P6417k1709M854q209k6840k1310K2625K5803K3018j9633
17118A9140j8525j9885k0714o269J0397M8487j1376J1929J5884J2656N9447L3254
17106A34425R889m1254n0192k7572J4992M3733L6542M5166J3078M2554O3696P1063
17094C56120N8625O4321Q8341R3914M7077M3329J4085j01299j11306r9059l5247
17083D18901k9219l9612p7064m2702o6717k9933M2614n1386n9414j209j551N263
17071F7971k83j414p073k1599l0348J7566m2901m480K611j8452j3037R370K901
17058c9168q386M3843M2565P771n81k1013j4532N1924L7066r887l1995Q522n378
$$ y = [30906, -17380, -105888, -61258, -30392, -59943, -48433, -18227, -2181, -24671, -39651, -66264, -72216, -59762, -35876, 40541, 18832, 23686, 15477, -11363, -32673, -10048, 15755, 38773, 19140, 615, -19270, -39984, -46253, -35856, 12631, 1255, 13184, 29068, 41724, 101171, 134425, 144314, 103060, 52868, 25296, 40288, 84021, 120563, 165729, 178807, 221361, 285057, 356120, 414745, 479066, 567407, 661321, 708398, 751727, 765812, 664513, 553207, 454148, 418901, 389682, 350070, 273006, 230304, 163587, 133654, 176268, 124882, 65468, 64259, 62708, 67971, 67688, 66274, 59201, 37602, 7254, 24820, -18081, -22561, -19950, -38402, -51439, -42069, -39168, -47554, -3711, 38854, 46625, 46044, 25031, 10499, 62423, 99489, 89602, 57607, 66129, 60751]
17045F0751l864L2021P748k8196l4756j76r383M0665L7498L1492L9476R606Q0971
17032B63853Q2149K2059N1773Q9808J43243J25575O1581o8799p8906j09913j25039
17021D57384p2328q0654n5710m0891j0517n3563l2000J256K241J6377j8183n7030
17009E6382P156J5553q0663m5517L7042M72j6376K4972P311L493j2852o832K5178
16996A5319J2452o45K724m3711M0541O2201m2124o0833q465J7127L1400j9654
16984F332N124k5906J3175K3587m8487k5646M105j9595l2997N1509J1330p218
16972d4687l1623l488J2303j3670P168K7125P39m2798L8666N6281n308l2709k5770
16959e7771J9322K4512K2148l0369K2496O512l4879J1333j3232o542k4189r909
$$ y = [60751, 56887, 88908, 96656, 68460, 33704, 33528, 24145, 64810, 102308, 133800, 173276, 182882, 263853, 346002, 368061, 419834, 509642, 652885, 778460, 840041, 771242, 692336, 582423, 457384, 385056, 304402, 248692, 207801, 197284, 143721, 111721, 112977, 115218, 131595, 113412, 56382, 63538, 79091, -1572, -47089, -10047, -9575, -25951, -979, 6332, 9825, -3027, -9859, 15319, 27771, 27126, 29850, -13861, 26680, 88881, 46757, -14076, -22541, -5414, 25986, 6332, 11456, -14450, -1275, 22312, -26175, -51821, -47716, -67311, -100308, -48799, -37469, -44687, -76310, -79798, -67495, -81165, -73997, -46872, -46133, -88931, -50265, 6016, 708, -32001, -57771, -38449, -13937, 8211, -22158, 338, 6850, -28029, -16696, -29928, -36470, -60659, -70568]
16947g0568J4669M570j919K4747P2028q325m4367m3802J0855j5241J6370N818
16935c5165r47j1113r999k1379j0336j8923K5959P739j6197L8035r83q181M933
16922e6557R31P9947K5499q330Q798k2239n2779n719n5389M359L1471o351O392
16909d9967K1309R799l9117p5127N766L7830N9522K9090j8313J2337n540k2884
16897c5295j1724K3845K396J2738p590j7647j4585Q225j821k9312N794K139n8808
16884a21645j6218K4110M394L9750K8745L0675r004l9448Q669J1981K0232l376
16872b1135o829k3757j9142L8474L3822j9006l5837j4371k5480J1330n548L8709
16860d8770M5059J0939n324j3578j2113l60n601j0740J367K045K1949R349O499
$$ y = [-70568, -55899, -51329, -53248, -28501, 43527, 35202, -9165, -52967, -42112, -57353, -40983, -35165, -36112, -47225, -57224, -78603, -88939, -107862, -81903, -74164, -90361, -52326, -53309, -61490, -56557, -55626, 24321, 49820, 41490, 50288, 28049, -24730, -30449, -85838, -81479, -50008, -56359, -49967, -28658, -18859, -57976, -133103, -127337, -89507, -29985, -895, -19208, -6871, -12411, -35295, -47019, -23174, -20778, -8040, -15630, -33277, -47862, -39637, -41458, -70770, -64976, -62837, -121645, -137863, -113753, -109359, -69609, -40864, -10189, -19193, -58641, -49972, -37991, -17759, -21135, -27964, -51721, -70863, -32389, 1433, -17573, -53410, -67781, -93261, -81931, -87479, -48770, -3711, 7228, 1904, -11674, -23787, -24147, -29748, -40488, -39121, -37076, -15127, -5778, 721]
16847G21k3747L7175j4386j0275q013o4221j6416M5880J1221K2456M6776k2190
16835D981o835j1388M5847k6950k4700P998m1042j2157k0043k6265R05J2859J2244
16822h4546J919j2365R746m6105K0246K368J2052K3668j7489l2832j6471J9434
16810a20375J4983L3312J1816k1916q467L1676J3168j1880k0191j2909J9297J2516
16798e8970M943q370k6641J3014L5103K0292K0946N707K4439L9314j0707p0766
16786a1696n0612j1573q882J3732N4681L5805n6123k9277j7906j5604k1617N5945
16774f3127K4963M775K324P023m503O774N695Q143l7433K3267L0334l7917M996
16761b4686J01731J7192o054o3044o0366o1796k3348L2137O7574K4261l1557J5429
$$ y = [721, -23026, 14149, -237, -10512, -18525, -82746, -99162, -53282, -42061, -19605, 27171, 4981, -1854, -13242, 32605, 5655, -19045, -11047, -52089, -64246, -84289, -110554, -109649, -96790, -84546, -82627, -94992, -85246, -131351, -111105, -108737, -96685, -73017, -90506, -123338, -139809, -120375, -105392, -72080, -60264, -82180, -90647, -58971, -45803, -57683, -77874, -90783, -71486, -58970, -54027, -62397, -89038, -76024, -40921, -20629, 317, 6024, 30463, 69777, 59070, -11696, -62308, -73881, -82763, -69031, -14350, 21455, -34668, -63945, -81851, -97455, -119072, -63127, -38164, -33389, -31065, -24042, -28545, -21771, -16076, -7933, -45366, -22099, 8235, -29682, -24686, 77045, 94237, 88183, 25139, -35227, -97023, -120371, -88234, -20660, 3601, -27956, -12527]
16749a2527K3756k5150J6477K8456l102l4678j2628J6687O54n2780J3519O1070
16737A9754J2543l8119k4074J063j2597O0097J1165O419k1185n8100K9527K1231
16725G724q33k4468M214k0379M877J4467M580N701P1700K1525K496l2123l8121
16712B1360n8969j0425L3452j3679J2348k028p100J343l9902j293R917K217K4119
16699b8640M5835m6770m2074j0454O8063N6231l7429m8355k0315k764k846j2974
16687h2492M0082L246k4469O093k5531j769N2740N1652N261o0082l6504n874K4539
16674e3108K5678O2154j3601l8068l9796k3833k2182P0857P0802J6018L398k2803
16662C5516j3379o047m4382k3647j1725L8642J5022J2657K5954k2596O08M6716
$$ y = [-12527, 11229, -13921, 2556, 31012, 27910, -6768, -19396, -2709, -2055, -54835, -41316, 19754, 32297, -5822, -29896, -28833, -41430, 18667, 29832, 36251, 15066, -43034, -13507, 7724, 6891, -17577, -13363, -33742, -28865, -14398, -9818, -4117, 67583, 89108, 91604, 59481, 21360, -37609, -48034, -14582, -28261, -15913, -17941, -25041, -23698, -63600, -64893, -54976, -52759, -28640, 17195, -29575, -71649, -82103, -14040, 42191, 4762, -43593, -63908, -66672, -69518, -82492, -42410, -39164, -63633, -57540, -83071, -84840, -32100, 19552, 24813, -35269, -71773, -77647, -53108, -27430, 34724, 21123, -16945, -56741, -80574, -102756, -31899, 38903, 54921, 58319, 35516, 22137, 16090, -28292, -51939, -63664, -25022, -10000, 2657, 28611, 6015, 6623, 53339]
16650E3339m4607k2573K4305l1968J2739K595j3392k5482R05n1891K5310o172
16638g6892j878j242o9733P72M9428j1478R523k2100J3759K9512L513k6220j6912
16625a19948L4561j4775j2758K1460K0535J7847k0194j8054J8722M8460M5682
16614B1538k2646n7033L4058K6152K2247J673l5899L8578M3218j516k1774l0087
16602A8509L2643K2503l9752l9688j1729m2470L8284L9408K4662J3835n8327p2255
16590g4377l2610L7625P593k3775J4790L0506p313l904K422k2999J5625O101M8284
16577b032L4449j8175l8235L0503l2413j749Q836K8514p899k2514o654l0298m1707
16564i9374M4471L733p085J7860M4402K005j4075k7281l3441J819m457k0754J9405
$$ y = [53339, 8732, -13841, 10464, -21504, -8765, -6170, -19562, -45044, -44139, -96030, -70720, -76892, -78770, -80012, -149745, -148973, -99545, -111023, -101500, -123600, -109841, -80329, -76816, -103036, -119948, -85387, -100162, -112920, -91460, -70925, -53078, -73272, -91326, -72604, -24144, 21538, -1108, -58141, -24083, 2069, 24316, 25989, -9910, 28668, 71886, 70370, 48596, 18509, 51152, 73655, 33903, -5785, -17514, -59984, -21700, 17708, 42370, 56205, -2122, -74377, -106987, -69362, -61769, -85544, -70754, -40248, -47561, -51465, -49043, -72042, -56417, -50316, -2032, 32417, 14242, -23993, 6510, -25903, -27652, -18816, 9698, 1799, -20715, -27369, -57667, -99374, -54903, -51170, -58255, -40395, 4007, 6012, -8063, -35344, -68785, -66966, -71423, -92177, -72772]
16551g2772R800K9476p736q9890Q811O3796N7507o947L120N634l1810o9511J2106
16538h8416M5301K0218K6363R609R305l350k3185m7191j9309j5048O471Q977j3962
16525h4217J6923l679L3777K1004J002j134j193m8347j0531j989L657k488L6472
16512d0743N5536L125k8148J278p923J2885m449j2935j1065J2710L9781K0220
16500D0272j0980n1612l6274K3893N261J541L0117q948R010j1765K4699j7677
16488b463j9071Q500O98K7241K327L326p838M0466j0943p2414o6562l823m3227
16475a43783J8633J9433j4973J2100P28l0464K4255L490J8499O628N4111K7778
16463c565J4825J514j4756q958Q606M9086P029J694n4816k8398l1354j8074k0888
$$ y = [-72772, -62972, -33496, -41232, -131122, -122311, -58515, -1008, -7955, -4835, 799, -31011, -100522, -88416, -43115, -22897, 3466, 13075, 22380, 19030, -4155, -51346, -70655, -85703, -79232, -70255, -84217, -67294, -70973, -37196, -16192, -15190, -16324, -17517, -65864, -76395, -78384, -74727, -77215, -40743, 14793, 17918, -10230, -8952, -16875, -3990, -8439, -21374, -32439, -19729, 20052, 40272, 29292, -22320, -58594, -34701, -29440, -27899, 2218, -6730, 2280, -9485, 15214, -2463, -21534, -13034, -12336, 14905, 17232, 20558, 12720, 53186, 42243, -30171, -96733, -100556, -143783, -125150, -105717, -120690, -108590, -107862, -138326, -114071, -110581, -92082, -85454, -31343, -3565, 11260, 12774, -1982, -10940, -2334, 46752, 53781, 55475, 659, -27739, -59093, -77167, -98055]
16450i8055m2204o872M9750K7009L7307k3200k2088K6982L8336Q010o048K4945
16438A3872r91l4515R700L9704J0665K0323j5132N024j832j3182p4242k8473R574
16425e9505P2352J3035j7368n960J8644j6974l8103N202l6777m0166o383l0613
16413a42616N4863N2784N4664O306l5179j6497J1658k821P506J8339K5444j3813
16401B0638l4361L1024L2655J3157O615l487J562k1035k8261L117n576K4933q70
16388D0111k1314J9000K8960J8634o9159m8424J4657K3656q017l4484q514n593
16376e0487j1494K31o578l0328J5863P921q816K1632J769j0680j0861L2141M6320
16363c367M7592j1049l741k5711m7999k998J2257K804K2545k6280j4346p672L6179
$$ y = [-98055, -140259, -147131, -97381, -70372, -33065, -56265, -78353, -51371, -13035, -5025, -11073, 13872, 12881, -21634, -11934, 27770, 38435, 58758, 43626, 48650, 46818, 33636, -40606, -69079, -59505, 12847, 25882, 8514, 2554, 21198, 4224, -33879, -28677, -65454, -105620, -112003, -142616, -87753, -34969, 19695, 26001, -9178, -25675, -14017, -16838, -9332, 9007, 34451, 20638, -13723, 17301, 49956, 63113, 69728, 66241, 67803, 46768, 18507, 21624, 16048, 40981, 40111, 18797, 37797, 66757, 85391, 16232, -32192, -17535, 6121, -1896, -36380, -44894, -50487, -61981, -61750, -68328, -98656, -82793, -74872, -83688, -62056, -60287, -70967, -81828, -49687, -3367, 44225, 33176, 29435, 3724, -44275, -47273, -35016, -32212, -9667, -35947, -50293, -57965, -21786]
16350b1786l1777R59L4363o446P884N386K9130l3200l2145J7911n2122M3381O6174
16337B7712L750K9066P773k6869J0399j2360m1923j4704J3205r115J4328K0868
16325B2130K2279p266j8569k9861M384P22o2436Q436J8597J4494K1930P096K4158
16312B6094K4225L774r6910k6739P869P603k4005k548P9501n497j8435K5642k6950
16299b6376k4613K9359L4664O1094j1072o2775Q6q631m6896o312l3849K5837Q6501
16286A7017K1901n5753j2989m493J9216l525J2012J0200j4888j7724n836K6207
16274h655J8289j1294N971j0691j4535j1420K9730m2489j8113M2167K6541l5364
16262b9863l4009J3655q485K6259r658l2364J8626o199o6474J6965n911M4419
$$ y = [-21786, -53563, -52604, -18241, -24687, -16803, -11417, 17713, -15487, -47632, -29721, -81843, -38462, 27712, 31462, 60528, 68301, 41432, 51831, 39471, -2452, -17156, -3951, -13066, 1262, 22130, 44409, 37143, 18574, -11287, -6903, -6181, -68617, -60181, -41584, -27090, -5160, 1936, 26094, 50319, 54093, -42817, -69556, -61687, -54084, -78089, -80637, -1136, -6633, -25068, 574, -26376, -50989, -21630, 13034, 74128, 63056, 281, 367, -8264, -55160, -61472, -95321, -69484, 17017, 38918, -16835, -29824, -34317, -15101, -18626, -6614, 3586, -11302, -29026, -34862, -8655, 9634, -1660, 4311, -6380, -20915, -32335, -2605, -45094, -63207, -21040, 5501, -29863, -63872, -50217, -58702, -32443, -42101, -74465, -55839, -62038, -128512, -111547, -117458, -73039]
16250g3039L1555P840l604K4660J2969J9677K7J2423O0334n539q5867l8676j6933
16237e4173L5887N2887O296k880J8677J3849o8974l2124L9429l1751l9052L9979
16225b1950k55J3325K1572k6634k3801L4132k9080l5496J5419J5050j5704p929
16213f1351k074j3632J1960N0720k3382j6257L6882j354L6973L848j0955l3830
16201b2452j1472P919j2808k4954l119J5675K5142J3613k4758l1349N5808O591
16189f164J0967m22j3838J7651o296K4058J8670k8266j00789M6267Q7852j3210
16177C6480o9085J1109N8368N741N220P403J3242J9659l4512o5796k9153l877
16165d5201J020M0561J5101L1166p2644o2352J6383O7180K1103M4643k0159l5693
$$ y = [-73039, -41484, -33644, -37248, -12588, 381, 20058, 20085, 32508, 92842, 87303, 1436, -37240, -54173, -18286, 34601, 40897, 38017, 56694, 70543, 1569, -30555, 8874, -22877, -61929, -21950, -22205, -8880, 12692, -13942, -37743, -3611, -32691, -68187, -52768, -37718, -53422, -61351, -63425, -77057, -65097, -14377, -37759, -54016, -17134, -18488, 18485, 22333, 11378, -22452, -33924, -26005, -38813, -63767, -66886, -51211, -26069, -12456, -37214, -68563, -12755, -6164, 4803, 4381, -9457, 8194, 1898, 25956, 44626, 16360, -84429, -38162, 49690, 36480, -32605, -21496, 36872, 42613, 47833, 55236, 68478, 88137, 53625, -12171, -41324, -45201, -44181, -3620, 11481, 42647, -29997, -92349, -75966, -8786, 12317, 56960, 36801, 1108]
16153A108J652j6412J9135J6674J4934j2551k0690j4013k0979J054M120n171K4551
16140f588K8636K0753J2715j8181l9552m0050j2173j1802P972M7568J7817m121
16128B994k5624M0327N7099j3500o9655n2717K6461R115l6833j2083L9668K0703
16116a4045l040J3160L493n3722k4330M3108P1614J8791p0842l7408l809J9683
16104c7347M6794o255M4143Q616l3228J0447N609j0375m2279M7052K801j2804
16092B3174l2934m2881j1684J3437k4489K0161n665k752K873M7119K5537L1560
16080D3456N751k9176k4162j1904j1517j3350q710J548L1373J244K2146Q146l4654
16067a9809j21j3553j9345N963J2489k085M303O2001L6638j8208m0574p6047J6466
$$ y = [1108, 2760, -13652, 5483, 22157, 37091, 24540, 3850, -10163, -31142, -30088, -25968, -31139, -6588, 22048, 42801, 55516, 37335, -2217, -42267, -54440, -66242, -58270, -10702, 7115, 2994, -22630, 17697, 74796, 61296, -8359, -61076, -34615, -25500, -62333, -74416, -34748, -14045, -17085, -3925, -432, -54154, -78484, -35376, 36238, 55029, -15813, -53221, -57030, -37347, 9447, 3192, 47335, 55951, 22723, 33170, 38779, 28404, -13875, 33177, 35978, 23174, -9760, -52641, -64325, -50888, -75377, -55216, -60881, -63633, -60760, -13641, 11896, 43456, 49207, 20031, -4131, -16035, -27552, -40902, -49612, -48064, -16691, -15447, 6699, 14845, -19809, -19930, -33483, -52828, -46865, -34376, -36461, -32158, 29843, 66481, 48273, 7699, -68348, -51882]
16054e1882P8795M8054r5481q3921M148R2775k053k6285j0152J4585J4671O72
16042a6074J9555L2277K8347M867K0945k8484J3133k2927n7764K8262J7356l5990
16030C503n5255N995L6160J9546n060k5462k3357j0734k5883Q291K2586J1887
16018c7783K6137J6936J4614l3095n8455j2525m796R21O9543L1751K1554j7825
16006A6977n845J0653J0068k0347l6888K6311M6487m474q1185N56P624J9891k3851
15993c4023l2922k7065K9633M1095L2877K997j7822K5726K254j0376j2417N9391
15981E9348L82o889n696j4429j7430L5007q425l7391o7582J5207L3788o809p780
15968b8699J4074J5624N8713K361l6091l1893l458l7882m1602K1756J6210j4257
$$ y = [-51882, 26913, 74967, -20514, -104435, -100287, -7512, -9565, -35850, -46002, -31417, -16746, -16074, 3481, 35758, 64105, 68972, 89917, 61433, 74566, 51639, -6125, 22137, 39493, 3503, -51752, -45757, -9597, 9949, 4889, -20573, -43930, -54664, -80547, -72256, -49670, -37783, -11646, 5290, 19904, -13191, -71646, -84171, -88967, -88046, -18503, 13248, 34802, 16977, 11132, 21785, 31853, 11506, -25382, 929, 47416, 42942, -38243, -37687, -30063, -10172, -34023, -66945, -94010, -64377, -23282, 9595, 12592, -5230, 20496, 22750, 12374, -43, 59348, 59730, 52841, 47145, 32716, 15286, 50293, 41868, 4477, -63105, -47898, -14110, -20919, -28699, -14625, 999, 59712, 62073, 25982, -5911, -9369, -47251, -88853, -67097, -50887, -65144]
15956f5144j4347o459J2038L2915N3278K2642l1936O20l1312l5865K3652J7918
15944b2000J2398L8008J0562m9810k9095j1541J2951M5875M1709J7420k8445j415
15932C6617O216R695l6613m1995m1944N15L6634m138l6941J0676M3019k988L0534
15919I287L3977K617j8642m7670k0132k194N7360K5434m2381k3057L2340k1158
15907a4219J2543j9521p126m027M6080L8843j5077n9337l4339N093M1276L3713
15895B3902L5394J9187q892j712M139k9626n2404Q167K6540k0607o814j2349m738
15882a9813K4241k2507j9894l4959k116k3035O7702L779l8806J926L312m0240
15870a00410L666N4946R071q682J0152L5071n417K0903p882l5657m8570M5074
$$ y = [-65144, -79491, -85950, -73912, -40997, 12281, 34923, 2987, 3607, -27705, -63570, -39918, -22000, -9602, 28406, 38968, -10842, -39937, -51478, -38527, 7348, 49057, 66477, 38032, 36617, 42833, 52528, 15915, -26080, -68024, -67509, -30875, -35013, -71954, -61278, -18259, -21247, 9287, 43264, 45881, 27239, -20431, -40563, -42757, 14603, 40037, -2344, -25401, 6939, -14219, -1676, -21197, -28323, -32350, 13730, 52573, 37496, -21841, -56180, -51087, -9811, 23902, 59296, 78483, 69591, 67879, 72018, 42392, -10012, -1845, 24695, 4088, -2726, -15075, -19813, 4428, -18079, -37973, -72932, -75048, -98083, -30381, -26602, -65408, -63482, -60170, -100410, -96744, -41798, -32727, -41409, -31257, 3814, -1603, 19300, 11418, -24239, -72809, -27735]
15858b7735M8368L2153L222m2248j1572J1402J8523k1128j9896m456l1498r659
15846e4524l581l4059J627J1207r441k628L7134j6403m6615l711L5783N7237M2952
15833A4978L1795j3690K1206m0532m0913J2164N277j5931j87J3849k8485M2195
15821A726J4573r105K0356L436j4493j4958O530j9546r844N234k55l7489j7734
15808g1569J73M655R805j0420J3072N4216L6514k3731n7264k7959L635R552O2091
15795B770Q1814j139m7569k9233j1008N250j4047K9160r473j352M107K2737j5434
15782A6583n0703k6501M454k9047p456M1356p808J9037L3375L0596j5205n2600
15770d3919l444M5498K461L483K8627J398l0216k8201o470k341L5375r101l526
$$ y = [-27735, 20633, 52786, 56008, 13760, 2188, 13590, 32113, 10985, -8911, -13367, -44865, -54524, -58105, -92164, -90537, -79330, -88771, -91399, -54265, -70668, -117283, -120994, -85211, -27974, 14978, 46773, 33083, 54289, 13757, -27156, -14992, -9715, -25646, -25833, -11984, -40469, 1726, 16299, 7194, 27550, 30986, 16493, 1535, 8065, -11481, -21325, -16091, -16346, -53835, -71569, -71396, -66741, -56936, -67356, -54284, -68, 36446, 12715, -44549, -72508, -68873, -59321, 2770, 84584, 83445, 35876, 6643, -4365, 885, -13162, 15998, 6525, 5173, 9280, 32017, 16583, -34120, -60621, -56167, -85214, -92670, -51314, -59122, -40085, -6710, 23886, 8681, -43919, -47363, -1865, 596, 4079, 32706, 34104, 3888, -24313, -30783, -33124, 2251, -6850, -10376]
15757a0376k7661L4621L4868n2792j0168k8544j5647M3532O9662L2941L29j5440
15745E5325j5317k9925m1072k5546m4737L1482K4469q990Q997l752K8652l5255
15733e5669j8823O2806L4940j7230j2582L426K7304L9378J6461J7708o249l9907
15721E1563J7315m1947k6794J69K6829j7376L6675l653k0386l0344O412n4792
15709e6329j0331M2447K5763M3797M1311j6242j0537J6231l3562j1729J0303l1650
15697I472K0718J436N342k6767j5657j7736j5111J3508L8215M855j2141j1444
15685e310j7283L0529J1872K4732l2200n1656N6126N6761j9098q1451l0919O346
15673e1551k7151J9000M5466j2848M0632p012m9449m9666m7252K9545M9887L7856
$$ y = [-10376, -38037, -3416, 31452, -21340, -31508, -60052, -75699, -32167, 37495, 70436, 70765, 55325, 40008, 10083, -30989, -56535, -101272, -69790, -45321, -54311, -45314, -49066, -20414, -55669, -74492, -11686, 23254, 6024, -6558, -3132, 24172, 63550, 80011, 97719, 91470, 51563, 68878, 26931, 137, 306, 27135, 9759, 46434, 42781, 22395, -7949, -1537, -56329, -66660, -24213, 1550, 45347, 86658, 70416, 59879, 76110, 42548, 30819, 41122, 9472, 30190, 31626, 36968, 10201, -5456, -23192, -38303, -24795, 13420, 18275, 6134, -5310, -22593, 7936, 19808, 44540, 12340, -39316, 16810, 73571, 54473, -26978, -57897, -51551, -78702, -59702, -14236, -27084, 13548, 6536, -42913, -92579, -139831, -110286, -60399, -22543]
15661b2543N332J8184r960k1831l1414M464K6306J3927m3259J0337K5341o458
15649c1574j2840N069k7002l5550L4770J1035m814M8821J4677k6427J7058K8231
15637B1454j9718l9056l7452j422j3951K2291L9877M5558M608N45m5624j1435
15625c4325L0760M4973J4876j7937k975K5623k5244j121j3249l5682J9582M5707
15613E0988j7035k9467k4748m434J1614k8391j3540J3194P1683l160M319n3683
15601b2660o192K6280K2410J7754r279l2148m2227O934O5963N0913K9906l34k7425
15588G9895o0562L162J9660j3750m203K4117L2890J7700n7829m8392K84K9573
15576B2545l7351L1380m4161j6230L1106K2134P200m1201k9994K7520M1639L335
$$ y = [-22543, -17211, 973, -8987, -30818, -62232, -57768, -31462, -17535, -60794, -50457, -25116, -31574, -44414, -39345, -66347, -101897, -67127, -56092, -60906, -12085, 2592, -23835, -6777, 21454, 1736, -37320, -74772, -76194, -90145, -67854, -27977, 17581, 22189, 22734, -22890, -34325, -3565, 41408, 56284, 38347, 35372, 60995, 35751, 34630, 21381, -14301, 5281, 50988, 33953, 4486, -20262, -24696, -13082, -41473, -55013, -41819, 29864, 26704, 31023, -22660, -28852, -2572, 19838, 37592, 28313, -3835, -46062, -39128, 26835, 77748, 107654, 107320, 79895, 19333, 22495, 42155, 28405, 24202, 48319, 81209, 98909, 41080, -7312, -7028, 22545, -14806, 16574, -27587, -43817, -12711, 9423, 16623, -24578, -54572, -27052, 14587, 17922]
15564A7922K8745j1084k4466L948j8775j0439q899K950J2516P362j4038L204K8372
15551A7318j3466m0268l1919m2131O3394M0437k8504k0277L6478K4742J1906l108
15539A4602K3643p781k121J7461p097k9493o058k3089Q369j1177O9397J5313j4001
15526D7968j6638n2499J1237L1615J6714K7556M4591j2408o4349m5616K7783M1571
15514E7525K58K5781J163o8166Q70K1891j6705K2769m97M5303j886l0494j7693
15501D0119j2455L5732j3759l155k1967P196O8709L4352n9325m5863l04K6494
15489E5774l3831k0223J0230j2228K6934j0107l3721L084L9321N7704k614P680
15477H8003N7759k2616l3451n1963j9379l008N5168M8549K3966n7666l9668J03
$$ y = [17922, 46667, 35583, 11117, 15065, -3710, -14149, -23048, -20098, -7582, -220, -14258, -11054, 17318, 3852, -36416, -68335, -110466, -47072, -6635, -35139, -55416, -18938, 5804, 17710, 14602, 38245, 30464, 28343, 45804, 38707, 9214, 3156, -19933, -11564, -22741, 46656, 61969, 47968, 31330, -21169, -9932, 21683, 38397, 65953, 110544, 98136, 33787, -11829, 15954, 57525, 57783, 83564, 84727, 16561, 17431, 39322, 22617, 45386, 44889, 90192, 88306, 57812, 40119, 27664, 63396, 49637, 46482, 24515, 31711, 100420, 134772, 75447, 29584, 29280, 55774, 21943, 1720, 11950, -278, 26656, 16549, -17172, -14088, 25233, 82937, 80323, 88003, 145762, 123146, 89695, 37732, 18353, 15345, 70513, 119062, 143028, 85362, 45694, 45797]
15465D5797K8497j0698o2701l8387k9O9078l62L31K534K3682j1875n868N986j6039
15451B9946p956l4251P961J7983k3400m479K8985m8875p0538O3886K6699k3233
15439c7272K3027L847p71k3954M4113K7738J9860l6729o2135N691L268L5296K899
15426D878l9992L2776K2284j127K7106k6374l8006L347m965p113M341l549k6301
15413e2695J6677K6859l0542K7552M4668j5822M9028L1450m3468l4992l5456j9790
15401c6531L95J0823M5275M0965l0832k8123K525J6918l8289p3046m3969L9227
15389i4662L5114M7754m754j3847m954L3402K0461K6630l1287l6920R915P633
15377e515J4906j252N4800O120n7962M963L4352j3946l7286R618M5860m1733l5472
$$ y = [45797, 74294, 63596, 895, -37492, -37521, 31557, 31195, 31526, 34060, 57742, 45867, 39999, 45985, 29946, 21990, -12261, -4300, 13683, -9717, -14196, 14789, -34086, -104624, -40738, -14039, -37272, -14245, -10398, -11169, -35123, 8990, 36728, 56588, 19859, -42276, -36585, -33317, 1979, 4878, -35114, -2338, 19946, 18819, 45925, 19551, -18455, -15108, -20073, -27186, -22845, -26394, -52695, -36018, -9159, -39701, -12149, 32519, 16697, 65725, 97175, 53707, 18715, -16741, -36531, -36136, -25313, 19962, 60927, 30095, 1972, 4497, 21415, -16874, -89920, -133889, -94662, -59548, -11794, -16548, -30395, -35349, -1947, 18514, 45144, 13857, -23063, -13148, -5515, 9391, 8139, 62939, 69059, 11097, 16060, 50412, 36466, -820, 8798, 54658, 12925, -22547]
15364b2547J9275J8495L4113j2375J9121j8502j7526Q277L0416L3645K73k3383
15352F9282M888l9528o6555j9718l7564l9187L9704n564J2399K9063J4821K0444
15340a7515k7340l2060K3557P341L5649J2022N033p212J689j8531J8082P363m450
15327C628J913q968q16N592L3258K8587M352j8018k6236j3010j1805M4841M3455
15314H6773j2393M926m5338p981J7854m5503M6422L0265J3624l8122j7050m494
15302B8983J0216J427J7430j6561k6982l2113J3739M0133J5922P604N976L38k0480
15289D5632k8133j6009O04J0516n4296R390k1674n0360O2349J3976J1511O685
15277i809N581K0787j8310J7244R486J4178J6352j9105k9217J7603q477k5556
$$ y = [-22547, -3272, 15223, 49336, 36961, 56082, 37580, 20054, 28331, 58747, 92392, 92665, 69282, 74170, 34642, -31913, -51631, -89195, -128382, -88678, -94242, -81843, -52780, -37959, -17515, -44855, -76915, -53358, -46017, -10368, 1654, 6687, -525, 1164, -17367, 715, 8078, 3628, 5541, -3427, -4243, 1349, 34607, 63194, 67546, 49528, 23292, 10282, -1523, 43318, 86773, 74380, 79306, 33968, 25987, 43841, -1662, 44760, 75025, 88649, 50527, 33477, 28983, 39199, 40626, 58056, 41495, 14513, -17600, -3861, 36272, 52194, 59798, 65774, 66112, 45632, 17499, 1490, 2094, 12610, -41686, -32296, -53970, -104330, -41981, -28005, -16494, -9809, -4228, 16559, -1751, 15493, 24979, 39157, 55509, 36404, 7187, 24790, 16313, -9243]
15265i243j385L7453J754j8134q062K003K890l3259R721M2422L131m1552k9241
15252d1502L3574K4602M71O466L5806k2766k3717p370j0010l1055n7155M5244
15240d7412M5479L9200J1210j3566p992k7506q950L4932l3465k3889N3183Q018
15228B9242l5714k7912J5442N1801L3082L8994k4895l9613m019o3J1394J197L5192
15215H4128j4609p682k3096k5189k0622p376K3299M3172p91r678j7960k764K7553
15202D8385N425k5061q305n921k1161L6023M1871n1828n6011j8496J8198K2925
15190a3956M96K6638o844k7145p611L6851K1080m1984n5967j149N8505K4746j0418
15177C242O450L0342L9646o93n7987l5109J002K6005M5994n820P058L7354L3363
$$ y = [-9243, -10628, 26825, 28579, 10445, 2383, 4386, 7276, -25983, -16262, 26160, 29291, -12261, -41502, -7928, 16674, 17145, 23611, 59417, 36651, 12934, 5564, -4446, -35501, -92656, -47412, -1933, 37267, 48477, 34911, 26919, -587, -9537, 25395, -8070, -31959, 21224, 29242, -6472, -34384, -18942, 32859, 65941, 104935, 80040, 40427, 36408, 36345, 47739, 48936, 84128, 69519, 61837, 38741, 13552, -7070, -14446, 8853, 52025, 51234, 41556, 23596, 20832, 48385, 53810, 28749, 20444, 14523, -6638, 29385, 71256, 19428, -36583, -55079, -36881, -13956, -13460, 13178, 6334, -20811, -28422, 8429, 29509, -12475, -68442, -69591, -11086, 13660, 3242, 9692, 40034, 79680, 78987, 21000, -14109, -13107, 12898, 58892, 53072, 60130, 97484, 130847]
15164A30847L769m8347o9913m7871L4391P1405L9035J2985r355K381m6639k0518
15152E2170m1361m464j375j3316m1396o090q008L3892O1929L1341P998k6505m1149
15139C666p2375J6275N3919j5584M662l7565l1832K642O6371Q231j884J7757J3215
15126B7498L6533J8606r304m7277m1223n648k0068L1162q323J0595L6935J2446
15114D1932p0180q409J9263K9795J6858k527L9603j8867n5546P004K737J7611
15102A9274q418J5278L1617K3990K5494j3700Q566K6832k5040j0191l9349M6129
15090A00482L2575l051q7159j3801J7723m4094K013P077k1602q01J4732j959O648
15077H783J9760j2596M633K8675q407k3858j3921L2615j9763k2Q268m1621Q047
$$ y = [130847, 134616, 86269, 16356, -31515, 2876, 74281, 113316, 126301, 116946, 119327, 72688, 52170, 10809, 6345, 4970, -8346, -49742, -55832, -63840, -29948, 31981, 63322, 71320, 44815, 3666, -68709, -52434, 1485, -14099, -9437, -47002, -78834, -76192, -9821, -1590, -3474, 14283, 27498, 64031, 82637, 73333, 26056, -15167, -20815, -40883, -9721, -18044, -7449, 29486, 41932, -28248, -36657, -17394, 12401, 29259, 26732, 66335, 47468, -8078, -1074, 1663, 19274, 10856, 26134, 57751, 81741, 107235, 93535, 102101, 128933, 103893, 93702, 54353, 100482, 133057, 130006, 42847, 29046, 46769, 2675, 4688, 11765, -9837, -10638, 4094, 2135, 8783, 28543, 15947, 20580, 49255, 40848, 16990, 3069, 35684, 15921, 15899, 24167, -17454, -9407]
15064i407J8371k1593L3990J8761M970k9701j5729K562P040O2363J8070r134j479
15051G9084q563o3995k7097P8697N1540j0141o6997n43j775j6386K073K5098L2104
15038G3099l7567n903M8581n9511p0720k6812O4514O01L4906K0623L0110l7066
15026C4855O433J0692j9692J2275K1858j7425J5868k062n37l2686K4636k9844
15014B4371n3596R965M4925K8861L3785p2432K0035N8443k9881l7509j4088o264
15002F615k0575l60k700k540l2805r250N3024L0801L7775M9362p073o544k1601
14989G4129n7320r709j628R211J717r382J4956M6881j9089j01K6805j009m218
14976G1243j1865K0670n7540p240L734k0641J6632K6743L9554K352m1170r249
$$ y = [-9407, 8964, -12629, 21361, 40122, 45092, 15391, -338, 2224, 9264, 71627, 89697, 80563, 79084, 70521, 6526, -20571, 58126, 109666, 99525, 32528, 31985, 30210, 13824, 15897, 40995, 73099, 35532, 29629, 78210, 18699, -52021, -78833, -14319, -13718, 21188, 41811, 71921, 34855, 41288, 51980, 32288, 44563, 66421, 48996, 64864, 62802, 62265, 29579, 54215, 24371, -29225, -19260, 25665, 54526, 88311, 15879, 35914, 94357, 64476, 26967, 12879, 6615, -13960, -14320, -17020, -19560, -52365, -61615, -8591, 22210, 59985, 109347, 102274, 95730, 74129, 16809, 7100, 5472, 14683, 16400, 7018, 21974, 68855, 49766, 49665, 76470, 75461, 71243, 59378, 80048, 22508, 15268, 19002, -1639, 14993, 41736, 81290, 83642, 42472, 33223]
14964C3223N6194L3465j7741l9064K246J462l3418J6586j9662j111N7027j7760
14952G1447O2294K2676o1564m008M8367n074q2840k8281M6084j2443m2667j3170
14940H21j906O869L6599R567m8516K9783O172P970M0338m6954m535M4938L0110
14927A11256J7988n9003k8103m4870L6137N4900j1694k43J4056k7928J5869k4145
14915E4220k8757K1371q640l0317J7860k966J1138K088k0732O3913K7645n0344
14903E6479k6933N0037L4958K7125J0745l2868P813l515m6182m9085j4474j2249
14891A851l6014M1659K299p655K1356J5719O936L0566r989m8099M6783K6792m7152
14878D5052P826k696m3684p444L3840J8408j8195k1318J0014K0245k7383N3912
$$ y = [33223, 89417, 122882, 105141, 66077, 68323, 69785, 36367, 52953, 33291, 32180, 89207, 71447, 133741, 156417, 94853, 90845, 139212, 134138, 51298, 23017, 69101, 56658, 13991, 821, -1085, 5784, 42383, 51950, 3434, 33217, 39389, 47359, 87697, 40743, 36208, 81146, 111256, 129244, 70241, 42138, -2732, 33405, 88305, 76611, 76368, 90424, 62496, 78365, 54220, 25463, 46834, 38194, 7877, 25737, 22771, 33909, 35997, 15265, 79178, 106823, 56479, 29546, 79583, 114541, 141666, 152411, 119543, 127356, 123841, 77659, 28574, 14100, 1851, -34163, 7496, 9795, 2140, 23496, 39215, 46151, 76717, 66728, 18629, 65412, 92204, 45052, 52878, 50182, 6498, -946, 32894, 51302, 33107, 11789, 21803, 42048, 14665, 68577]
14866F8577J9197o6021l117N0849P9799k1383o4855k2607k9304l738M0286M923
14854E2606M7048J2985m7097m5157m083N0184j1268r057Q460l5186l9006n888
14842b5459O1020K1289j9492j404j1694J8172J3266j6648m046J874m0507Q559
14830D930L7476l61l1471J9760N9477n0260j8239N0018J2787r246p753l7574k2197
14817G347j6575J3808K7057j6464r265O2471L9884j0393l5770K3521J2380L1694
14805A29695L3455j01474l800K0394l9960l6907M1181K9130m1094k8393L8842
14794D1069L2414p652r607q811J001j6588J75K7821N247N726m662k556j08o1045
14780B424k6472M9468N7648L732k4128K821Q443J7602M6515K0252p946j0156k4181
$$ y = [68577, 87774, 21753, 18636, 69485, 149284, 127901, 63046, 40439, 11135, 7397, 47683, 52606, 99654, 112639, 65542, 20385, 16302, 66486, 55218, 46161, 54621, 19435, -19571, -25459, 35561, 56850, 37358, 35954, 24260, 42432, 55698, 39050, 35004, 36878, -3629, 4930, 42406, 42045, 10574, 30334, 89811, 39551, 21312, 71330, 84117, 74871, 67118, 29544, 7347, -9228, 4580, 31637, 15173, 5908, 68379, 108263, 97870, 62100, 85621, 98001, 129695, 163150, 61676, 57876, 78270, 38310, 1403, 42584, 71714, 30620, 2227, 41069, 73483, 65831, 56224, 47413, 48414, 31826, 32001, 59822, 65069, 70795, 66133, 63577, 63469, 2424, -24048, 25420, 83068, 86800, 62672, 65493, 73936, 91538, 138053, 158305, 150359, 140203, 116022]
14767A16022l2809K6935m3006J0356J323n5307K3420K5243o626k6156j79J5224
14755E4440j0966L413r160l8243L7022L7438m5686R065K0741M109K9018j2884
14743G8307j4933k5576j6704J5463J4175J6185j0503O292J1350J4175k3314M893
14731F9810N700q780r846O218M3071J7153k6892l2300Q770K5158O0153K9999q950
14718A79264m9342m2688m3280n859Q115L395R122M2837M6882n2639n4482J7640
14706E8965K6253J0655j4366L7142Q935k0235j8105j1187j2226k3051K0674J7097
14694H0551J6330J5259k3860m6722L3293K7997r234J7448n076R292l6113k3802
14682E5363L3055j1240j1435j7416K953K5188j8116J4652j0141l3493l3012r699
$$ y = [116022, 83213, 110148, 67142, 77498, 78821, 23514, 46934, 72177, 65551, 39395, 39216, 54440, 43474, 46887, 37727, -516, 36506, 73944, 28258, 37323, 58064, 62173, 91191, 78307, 63374, 37798, 21094, 36557, 50732, 66917, 56414, 62706, 74056, 88231, 64917, 69810, 75510, 66730, 56884, 63102, 106173, 123326, 96434, 64134, 72904, 98062, 158215, 188214, 179264, 129922, 87234, 43954, 38095, 46210, 49605, 58727, 101564, 148446, 95807, 41325, 58965, 85218, 95873, 81507, 118649, 127584, 107349, 89244, 78057, 65831, 42780, 63454, 80551, 96881, 112140, 88280, 41558, 74851, 102848, 93614, 111062, 105986, 115278, 79165, 55363, 88418, 77178, 65743, 48327, 51280, 76468, 58352, 73004, 62863, 29370, -3642, -13341]
14670a3341J2372p805J5115j361J186j2331k7389L0394P978l131l848K6489M7495
14657G1823M5153j9765j3169N174m0016N1890J9579k393k9973l4723J505L1124
14645H6209M9571Q853n63p126q638m4353p4306J042L9861M7367j336l3356n6639
14632F586Q623K7788o15M116l5385k9668L4213O1564O557j9355m6203o667o577
14619D977O4115J6939n6107L0974J0738k9719M493J8000N076P476J4357J5320
14607A06639n8342J9263N446k6655j462K8888K1376J3357j5172N153Q909J4521
14595A21921m6214l1867J7083k9511J6721J0510j4614J396l348K0097K1755q546
14583G5383j1123k6561m223K0742o882J6321J0550m913j5962o3766K9947K8075
$$ y = [-13341, -969, -8774, 6341, 4980, 6166, -6165, -33554, -3160, 4818, 1687, -2161, 24328, 71823, 116976, 97211, 84042, 89216, 49200, 101090, 120669, 118276, 88303, 53580, 55085, 86209, 135780, 144633, 144070, 136944, 128306, 83953, 9647, 10689, 50550, 97917, 96581, 63225, 6586, 15209, 42997, 42382, 46498, 11113, -18555, 15658, 77222, 83779, 64424, 18221, 11554, 4977, 69092, 86031, 29924, 60898, 71636, 41917, 46410, 64410, 69486, 76962, 91319, 106639, 48297, 67560, 73006, 46351, 44889, 73777, 95153, 108510, 93338, 98491, 107400, 121921, 75707, 43840, 60923, 31412, 48133, 58643, 44029, 45425, 42077, 62174, 83929, 75383, 64260, 37699, 33476, 54218, 47336, 63657, 74207, 69294, 53332, -10434, 19513, 47588]
14571D7588Q33k8378R120R335k3466k9985L5716N0350k8784j0951J2299K830Q657
14558E5164p350j7518k8244L8420O1299k331n6223N885M4651l4537j3976J3288
14546E8528j0077J0651j4765K3276K2746P324l5627m5763J971l2987k6502L9623
14534a602j3772M9693L3290J6847j8037l1016m9162j7038L3575O7953j7042M907
14522E8596k2697k2797j3045L246L7913M5761k1074j8151K4731L5428K133n0738
14510E9306j9587o013q757J1241K7092M0318K8275m353J0688M4877L3783J5858
14498B32728n4972k3795n70l2833L1552L6173k1947o293l9679O203l3632J1582
14486A04517j3005p704J2325K3022J3936L1828k4337j2447j5992k9756j3021M541
$$ y = [47588, 48421, 20043, 29163, 38498, 15032, -14953, 20763, 71113, 42329, 31378, 43677, 46507, 55164, 47814, 30296, 2052, 40472, 101771, 99440, 43217, 49102, 93753, 59216, 45240, 58528, 48451, 59102, 44337, 67613, 90359, 97683, 62056, 16293, 18264, -14723, -41225, -1602, -15374, 34319, 67609, 84456, 66419, 35403, -13759, -30797, 2778, 70731, 53689, 58596, 35899, 13102, 57, 3303, 41216, 86977, 65903, 47752, 72483, 107911, 110044, 59306, 39719, 33706, 24949, 36190, 63282, 103600, 131875, 127522, 138210, 183087, 216870, 232728, 177756, 153961, 153391, 120558, 152110, 188283, 166336, 160043, 120364, 126567, 92935, 104517, 91512, 83808, 96133, 119155, 133091, 164919, 140582, 128135, 112143, 82387, 69366, 73907]
14474G3907n461J188M3725M2553L748l481q789k1887k0195K5366J7583k2884m4574
14461H0799l6180P502L6440L448n426m5444j2774N759k8283k4881K4039R1124
14449I6123M6214j3396k4900l2674j4379K3330k49O799m4006J5542L5463K3586
14437A17453j6245O345J3295K2480L7674J4542m5666m3953k4746j8218M3000N073
14425A11034n5239k5522K1428M4404O827n5033k7548O7697M8193L4645M7003J338
14413B19227k4753n2929j2864K435K8164J3010L7992j3072k1762p722k8008J9672
14401A59390O791p121m1374j3278J5326M7621J6927m8730j404j2966m2392j5293
14389F3497L1688o632k96j221k3060N928L7290j0585K7336l1323k9522K289r530
$$ y = [73907, 68446, 69634, 113359, 155912, 159660, 156179, 147390, 125503, 105308, 130674, 148257, 125373, 80799, 44619, 52121, 88561, 92009, 86583, 41139, 28365, 34124, 5841, -19040, 4999, 96123, 142337, 128941, 104041, 71367, 56988, 80318, 80069, 86868, 42862, 58404, 93867, 117453, 101208, 107553, 120848, 143328, 181002, 195544, 149878, 105925, 81179, 62961, 105961, 111034, 55795, 30273, 51701, 96105, 102932, 47899, 20351, 88048, 136241, 170886, 217889, 219227, 194474, 141545, 128681, 131116, 159280, 172290, 210282, 197210, 175448, 167726, 139718, 159390, 166181, 159060, 117686, 104408, 119734, 167355, 184282, 135552, 134148, 121182, 78790, 63497, 95185, 88553, 88257, 87036, 63976, 69904, 107194, 96609, 123945, 92622, 63100, 65389, 55859]
14376E5859J4823R096O0144j0665l9936j4710L4065j7064k5737K842M708k9415
14364D4010l3941Q8859J6103q12K7763K1986n8711n830j8264L9028N3940l9358
14352A34773j6216M4677k5312J468N9418p929n9227j7420L823q622K7908L755
14340A41096j0102j8730m7917j0668K8931J5534L6424l2552l5304L5570N3881
14329A56163K4317J0368M148p930q930o4048k0034K6969j4370q858L2160L8241
14317A68196m9770m3270K6812L8730m32K9077k478o800J1769o6015p495L2727
14305A31051j1930p4747j894N1140J170L7529J7362j3329K367j8264k725m2066
14293G5664j4378K1345O941K8532k6010l383J2618O124J7870J2804K3494O9693
$$ y = [55859, 70682, 79778, 139922, 129257, 89321, 74611, 108676, 91612, 65875, 68717, 73425, 44010, 10069, 98928, 115031, 114219, 141982, 163968, 105257, 99427, 81163, 120191, 174131, 134773, 118557, 163234, 137922, 139390, 198808, 190879, 131652, 114232, 118055, 109433, 137341, 141096, 130994, 112264, 64347, 53679, 82610, 98144, 134568, 102016, 66712, 102282, 156163, 180480, 190848, 194996, 187066, 178136, 114088, 94054, 121023, 106653, 97795, 129955, 168196, 118426, 75156, 101968, 140698, 140266, 169343, 166865, 160065, 171834, 105819, 98324, 131051, 119121, 44374, 42480, 93620, 94790, 132319, 149681, 136352, 138719, 120455, 117730, 75664, 61286, 82631, 89572, 118104, 92094, 88711, 101329, 107453, 125323, 138127, 161621, 231314]
14281B31314k2963m8097o5510j1032R334K3964K899K1105K5108o985o1359R14
14269I8692p381J5484j4104k0438n7698o886Q7458J3416k1331j9607j2825j3102
14257D1678J1856M8360J1188L7238J3313l154j4923j6721O9J7988k1454l2772
14245I2666N3498K7159K4983k2849L1935M5709p680n1825o307l3752l9523J6767
14233A30781q141j8451L2618o582j8543J9166M181J0100J7815o904l0915m3935
14221H1190j0762L7050l3062l597K5374Q521K3947K4840n369K4897k317m923K1137
14208A86926M828l5891P048K7513J375m9681l6820L0362M1169J9853P051m1138
14196A62595k4397r839j8259n391m764Q3003Q086n869K8324J2347m3082l9696
$$ y = [231314, 208351, 160254, 94744, 83712, 93046, 117010, 119909, 141014, 166122, 159137, 97778, 98692, 91311, 106795, 92691, 72253, 14555, 7669, 95127, 108543, 87212, 67605, 54780, 41678, 53534, 101894, 113082, 150320, 163633, 160479, 145556, 128835, 128904, 146892, 125438, 92666, 146164, 173323, 198306, 175457, 207392, 253101, 245421, 193596, 187289, 153537, 114014, 130781, 122640, 104189, 136807, 130225, 111682, 130848, 135029, 145129, 162944, 156040, 125125, 81190, 70428, 107478, 74416, 70819, 96193, 104714, 128661, 153501, 148132, 173029, 170712, 165789, 186926, 191754, 155863, 162911, 190424, 191799, 142118, 105298, 135660, 176829, 196682, 203733, 162595, 138198, 128359, 110100, 104709, 99945, 182948, 191034, 185165, 213489, 225836, 182754, 143058]
14184A43058l13n721J391l396K131K2805k3466M021J3334j0845m1263O240l2990
14171G4986J1609J518J2541L1840K5503K7741n1104l5103K4705K9149l0987K514
14159A24912L7947r631l6534j2613K9884M0631m5453j5140K7101K8911k455l9181
14147A28379k1411K4402l0418l4518r456l3727n516K7238L6584M6811L7470J3117
14135A78955k0841M339L9734m4333k1928l044k6365K7405M0083k5535J0502J0253
14123A69225j6367J9202r971M708k2952j4730L2478L8378n4306m7431M870r692
14111I3412N2027O553k0751M0664J3863l0764j5900l1769O4049K5799k8096k2448
14099A46639q083l6108J7169M5049p190J1975k7463J9217K859q285J6152P743
$$ y = [143058, 142745, 137024, 138415, 135019, 137150, 159955, 136489, 140510, 153844, 142999, 101736, 107976, 74986, 86595, 88113, 100654, 132494, 157997, 185738, 134634, 99531, 124236, 153385, 122398, 124912, 162859, 153228, 116694, 104081, 133965, 174596, 129143, 114003, 141104, 170015, 167560, 128379, 106968, 131370, 100952, 66434, 56978, 23251, 17735, 44973, 81557, 128368, 165838, 178955, 158114, 162453, 202187, 157854, 135926, 132882, 106517, 133922, 174005, 148470, 158972, 169225, 152858, 172060, 162089, 166797, 143845, 129115, 161593, 199971, 145665, 98234, 103104, 93412, 145439, 151992, 131241, 171905, 185768, 155004, 139104, 107335, 171384, 197183, 169087, 146639, 138556, 102448, 119617, 164666, 157476, 169451, 141988, 161205, 164064, 155779, 171931, 179674]
14087A79674L9009J3859k4645j2165L694m9249j1462j439L1951L5221j191n3669
14075A49588K479q097m7739k1037Q640M4808J9921O9322J0736j1351n8461R734
14063A68543K3128J9835k107k931n7467j5725M402K6579p424k2805j2499j842
14051A19687K9239K2753J0071j4280K8915J1374O939K1421l2155n7711J4592M2718
14039B03563q738L3064J9356n5298K4201l2553k2168r785j329K8544Q001L8211
14027B25069p352K2467J1462j6020k0600l2836M495k685K2208j8221l7115R975
14015A60847j9062J2929M0603L270Q050j730q009m0461K9389J4073P4721j432
14003B73188m0339J4581l5898K0221L7865m1743l9258m6721m5842N1390j525Q429
$$ y = [179674, 218683, 232542, 207897, 195732, 199426, 150177, 138715, 137276, 169227, 204448, 203257, 149588, 152067, 143970, 96231, 75194, 83834, 128642, 148563, 217885, 228621, 217270, 158809, 168543, 191671, 211506, 209399, 206468, 149001, 133276, 137678, 164257, 156833, 134028, 121529, 119687, 148926, 171679, 181750, 167470, 196385, 207759, 214698, 236119, 203964, 146253, 160845, 203563, 194825, 227889, 247245, 191947, 216148, 183595, 161427, 151642, 150313, 178857, 186858, 225069, 217717, 240184, 251646, 235626, 215026, 182190, 186685, 184000, 206208, 187987, 150872, 160847, 141785, 154714, 195317, 198587, 206637, 204907, 196898, 156437, 185826, 199899, 274620, 273188, 232849, 247430, 211532, 231753, 269618, 227875, 188617, 141896, 96054, 147444, 145919, 154348]
13991A54348k8924p66O2652Q0434j1198l1519k9481o349N4801L2101K5637k5179
13979B76557l4679j7754m9154K1843O4717O977j5960l1937J3226Q999l9249j5085
13967A88501O294Q310k5462j9212P405Q479o58K1247M8887k3522k8563J4860N5018
13954B61584r804p125J4006j8440l1085q150K1656O605p0413q039J8997J7176
13942A86968m813R540O081m6973j5595K3470P2490n80j6367n809K3831k107j6169
13929B13967L0626Q5533l679m1138k8213O041j179l2602J6063J202J896o437j7750
13916B24330n026N381k5235j2487L7125P0752m6242n1384l4397m1667K5884L6382
13904A83416L4521M8566m1288l6693L3070J892j9566P504l421R834j3188r923
$$ y = [154348, 125424, 124658, 187310, 267744, 256546, 225027, 195546, 189197, 243998, 276099, 301736, 276557, 241878, 224124, 174970, 196813, 261530, 268507, 252547, 220610, 233836, 242835, 203586, 188501, 194795, 203105, 177643, 158431, 165836, 174315, 173657, 194904, 243791, 220269, 191706, 206566, 261584, 251780, 244655, 258661, 240221, 209136, 200986, 222642, 229247, 158834, 150795, 169792, 186968, 182155, 191695, 197776, 150803, 135208, 158678, 231168, 230588, 214221, 208412, 232243, 230136, 213967, 244593, 330126, 326447, 285309, 257096, 263137, 261958, 229356, 245419, 246621, 248517, 242080, 224330, 219304, 224685, 199450, 186963, 224088, 294840, 248598, 197214, 162817, 121150, 147034, 183416, 217937, 266503, 225215, 188522, 221592, 223484, 203918, 211422, 208001, 217835, 204647, 194724]
13892A94724j4747L4034n402o591J9262J6919j2617J7050k2626J4355K8586J2707
13880B75654m6824k0348J5435l2946L485J2192j8778j8251j5812L8644N6986J1080
13868B60517p298N666L4938j3776j8313j2878J0654j631l6446j6277Q565J6445
13856B30166r955M5574K4373m2902n2569j6576K7186L1347K4587K3175j9206o1913
13844B03287K6853N1592j9030k3756n983J1922L0165k932k3448o982j186L9890
13832B80392k2962K4588M4805J684j5210j5588o2547j1080N785J707J7684R9J3887
13819B63244K3067P504L432J54N445n888j9O306K3269j1621j7787m3477K4763
13806B78392L1587R83o2555m671l689l226M7145J645l1350k6072J1145l6127J329
$$ y = [194724, 179977, 214011, 208609, 202018, 221280, 238199, 225582, 242632, 220006, 234361, 262947, 275654, 228830, 208482, 223917, 190971, 194456, 206648, 187870, 169619, 153807, 192451, 249437, 260517, 253219, 258885, 293823, 280047, 261734, 248856, 259510, 257879, 221433, 205156, 213721, 230166, 220211, 265785, 290158, 247256, 194687, 178111, 205297, 236644, 261231, 284406, 265200, 203287, 230140, 281732, 262702, 238946, 232963, 244885, 275050, 272118, 248670, 241688, 240502, 280392, 257430, 282018, 326823, 328507, 313297, 297709, 235162, 224082, 229867, 231574, 249258, 249357, 263244, 286311, 293815, 297247, 297401, 302846, 296958, 296939, 303245, 326514, 314893, 297106, 253629, 278392, 309979, 310962, 248407, 243736, 240047, 236821, 283966, 285611, 254261, 228189, 239334, 203207, 204536]
13793B04536j3744L9531J1165K6914M6023j6582j1974O822o336j5992l6004Q137
13781B42496M5033M3990J5698n6263o6232k806o128L4351L4184J5315j0502J1634
13769C00770j268K9122L9101k8841l1302l2461R068p216l4856j8653r824K59M6480
13756B60379O0646j4719m4222P165R844k5107Q570J6033J4424n8065M8841M474
13744B88263L212j7185k0906j9792n8633R708J4143N1205K4093j7131J6471n80
13732B72868j124l0399J3951L3782M3421K1460l3607n2861j5684J8792M1374j3699
13720B98274k7274j9286l2026N1079K81j0072J0274J062J37J5287J3366j0909
13708B90193o423m099r052j8912j8257J5352R473m1275L0423q157k4287L9970
$$ y = [204536, 190792, 230323, 241488, 268402, 314425, 297843, 285869, 292691, 286355, 270363, 234359, 242496, 287529, 331519, 347217, 290954, 224722, 221916, 215788, 250139, 284323, 299638, 289136, 300770, 299502, 328624, 367725, 338884, 307582, 275121, 284189, 276973, 242117, 223464, 213640, 213899, 260379, 321025, 306306, 262084, 269249, 279093, 253986, 262556, 278589, 293013, 234948, 283789, 288263, 291475, 274290, 253384, 233592, 174959, 184667, 198810, 250015, 274108, 256977, 273448, 272868, 271744, 241345, 255296, 289078, 332499, 353959, 320352, 267491, 251807, 270599, 311973, 298274, 271000, 251714, 219688, 270767, 271048, 260976, 271250, 272312, 272449, 287736, 301102, 290193, 283770, 279671, 270619, 251707, 233450, 248802, 258275, 217000, 247423, 239266, 214979, 254949]
13696B54949K3688J5801K4699j5845r872L521N3888J4590m8119m4313K9128P2895
13684C75010Q846n1581q3678J9771l148j3263L8112o674k3152j2487L5119O3391
13672C46266j2983J6450J2626k5521l0702q123j9654L2847L093K5672p885j2315
13660C19771N226K0135k626J7969N450k6933m6012j7902p510P474j4570j009J4015
13647B73478K3074p725n6929l7446P6666o614k8715K4965N1346k1447Q414r037
13635B90030L6970j0949k6906L1446j0093J8324K0572J4491r669K9236K6051l4124
13623C75379j4911o36J7809l1336k8172J9567L2780n0321j3655M194J5440J8612
13611C44750l181l5536L4252p667m5871j442P451K5928M4463m5650o0593J3067
$$ y = [254949, 278637, 294438, 319137, 303292, 293420, 296941, 350829, 365419, 317300, 272987, 302115, 375010, 383856, 332275, 248597, 268368, 265220, 251957, 290069, 283395, 260243, 247756, 282875, 346266, 333283, 349733, 362359, 336838, 306136, 298013, 278359, 311206, 314299, 339971, 332086, 319771, 324997, 345132, 342506, 360475, 365925, 338992, 292980, 275078, 267568, 275042, 260472, 259463, 273478, 296552, 288827, 231898, 194452, 271118, 264504, 235789, 260754, 312100, 290653, 299067, 290030, 327000, 316051, 289145, 320591, 310498, 328822, 349394, 363885, 354216, 383452, 409503, 375379, 360468, 359832, 377641, 346305, 318133, 337700, 370480, 320159, 306504, 310698, 326138, 344750, 341569, 306033, 340285, 332618, 286747, 285305, 292756, 318684, 363147, 317497, 256904, 269971]
13599B69971P2328K3135l8790M370L8408J5569J9437j1777k7888j8091l7777K478
13587C11373Q7250J0418k6258N900O340j9638k4564K550M2455K2606J997m100
13575D16329j7621k8382k1519K622k937K6348j0820k5454m168o949j9793K4861
13563C32517O7003l0297l2463k081Q327R929n002k8040L4576J574m7040J2149
13551C21152J5580j6666l9264M5100J0882R774J7228J3536J0356L2684Q573j1145
13539D17790j8395j5830m349l0465P608K4596N5199m8578k4549N2290J8139l4384
13527C99072l0931k1232l1340M6774M2531r57L2808j4714l9686J0746M633l0328
13515C67376j547L2145J1912l8465N9186J5391l2310j0765L5628k764k1572J2361
$$ y = [269971, 342299, 365434, 326644, 331014, 369422, 384991, 404428, 392651, 364763, 346672, 308895, 311373, 398623, 409041, 382783, 388683, 395023, 375385, 350821, 353371, 395826, 418432, 420429, 416329, 398708, 370326, 348807, 351429, 348492, 374840, 364020, 338566, 334398, 327449, 307656, 332517, 399520, 369223, 336760, 334679, 343006, 352935, 347933, 319893, 354469, 356043, 309003, 321152, 336732, 320066, 280802, 325902, 336784, 346558, 363786, 377322, 387678, 420362, 428935, 417790, 399395, 383565, 379216, 348751, 356359, 380955, 436154, 387576, 363027, 415317, 433456, 399072, 368141, 346909, 315569, 362343, 404874, 403917, 436725, 422011, 382325, 393071, 397704, 367376, 365829, 397974, 409886, 371421, 430607, 445998, 413688, 402923, 438551, 435787, 414215, 426576]
13503D26576J34j1470l2220K505J0877P853o175j0092k0454k3380L2970j0073
13491C67051j237r463N0922l4930m6977j3896M3376p010J2406k6421M4772M6153
13479D24746N850J4175J5836K1797l4596m5547j3387Q266N7977K5023j7940J6792
13467D78992n4490k7752r890J8303L1131k537J3387M5277q359N329k4304m8233
13455D16854j2287j3287j7563M9409M4814L5407N5442l9568l4390k6025L9104
13444D97910m793m5241m9010j0310L5684j3987L13k6013r152J5882K2143j5276
13432C98150j898M8939J0218n799k1440j303n777j8089L1063L022R270j5760j6070
13419D14526J9310m395l1293k3567K0805L8164N7651Q9107P054m2615o1396p638
$$ y = [426576, 426710, 415240, 383020, 385525, 396402, 404255, 398080, 387988, 367534, 344154, 377124, 367051, 365814, 356351, 407273, 372343, 325366, 311470, 354846, 347836, 360242, 333821, 378593, 424746, 430596, 444771, 460607, 482404, 447808, 402261, 388874, 397140, 455117, 480140, 462200, 478992, 424502, 396750, 386860, 405163, 436294, 433757, 447144, 492421, 484062, 489391, 465087, 416854, 404567, 391280, 373717, 423126, 467940, 503347, 558789, 519221, 484831, 458806, 497910, 493117, 447876, 398866, 388556, 424240, 410253, 410566, 384553, 375401, 391283, 413426, 398150, 396252, 445191, 455409, 449610, 428170, 426867, 421090, 403001, 434064, 437086, 446356, 430596, 414526, 433836, 429441, 398148, 374581, 395386, 433550, 491201, 580308, 587362, 544747, 483351, 475713]
13407D75713j8145M003L876k4078J455l9566j3102m2829K9988L5645J4878K1593
13395D49431j9063n0778k4220J7573O618K1701J7279m436K534L8212J7905k638
13383D70118k0280k5474q397M1413J0J3910j2254j5255J7125K7650K583k705p692
13370D80752J1764L8266o378m2719k4568L9893o348k8807r518O0570j3625k2402
13358D76880m2991l5723K8405N8840j5393k9537k1016J4463M4852L5851p134l3783
13346D73714K8515J7102j6399J6724j7296J5075j7773k6944o1771K138J8677L9429
13334D71191j5693l0579n58J8586l3703R974K9898j459l933M2260L249m121M300
13321D89412K9398L5730L046q837L7706K3883k1353J5608l6693o4488j3880P758
$$ y = [475713, 457568, 461571, 465447, 441369, 442824, 403258, 390156, 347327, 377315, 412960, 427838, 449431, 430368, 379590, 355370, 372943, 379561, 401262, 418541, 414105, 416639, 454851, 472756, 470118, 449838, 424364, 415967, 457380, 457390, 471300, 459046, 443791, 460916, 488566, 491149, 488444, 480752, 492516, 530782, 524404, 481685, 457117, 497010, 490662, 461855, 452337, 512907, 499282, 476880, 433889, 398166, 426571, 485411, 470018, 440481, 419465, 433928, 478780, 514631, 507497, 473714, 502229, 519331, 502932, 519656, 502360, 517435, 499662, 472718, 410947, 413085, 431762, 471191, 455498, 424919, 424361, 442947, 409244, 419218, 449116, 447657, 443724, 485984, 489233, 485112, 489412, 518810, 554540, 557586, 548749, 586455, 610338, 588985, 604593, 567900, 503412, 489532, 497290]
13309D97290r298k4440q025N5940L9796l252K0750K9361O857r552J2978j3738
$$ y = [497290, 487992, 463552, 455527, 511467, 551263, 548011, 568761, 598122, 604979, 595427, 608405, 594667]
$$ [...]
##END NTUPLES=NMR SPECTRUM
##END=
