##TITLE=Analysis number 325633
Compound Code btb 12329
Book Reference 131068
Project Code adrs fraglib
Chemist Name jom
##JCAMPDX= 6.0         $$ Bruker NMR JCAMP-DX V2.0
##DATA TYPE= NMR SPECTRUM
##DATA CLASS= NTUPLES
##ORIGIN= Bruker BioSpin GmbH
##OWNER= nmr
$$ XWIN-NMR		Version 3.5
$$ Fri Jan  5 12:00:21 2007 GMT Standard Time (UT+0h)  MAYBRIDGE\nmr@NMR_250MHZ
##.OBSERVE FREQUENCY= 250.131544655141
##.OBSERVE NUCLEUS= ^1H
##.ACQUISITION MODE= SIMULTANEOUS (DQD)
##.ACQUISITION SCHEME= undefined
##.AVERAGES= 16
##.DIGITISER RES= 18
##SPECTROMETER/DATA SYSTEM= dpx250
##.PULSE SEQUENCE= zg30
##.SOLVENT NAME= DMSO
##.SHIFT REFERENCE= (INTERNAL, DMSO, 0, 16.522)
##AUDIT TRAIL= $$ (NUMBER, WHEN, WHO, WHERE, WHAT)
$$ ##TITLE= Audit trail, XWIN-NMR		Version 3.5
$$ ##JCAMPDX= 5.01
$$ ##ORIGIN= Bruker BioSpin GmbH
$$ ##OWNER= nmr
$$ C:\u/data/dgb/nmr/ADRS/490/pdata/1/auditp.txt
$$ ##AUDIT TRAIL=  $$ (NUMBER, WHEN, WHO, WHERE, WHAT)
(   1,<2007-01-05 11:59:59.91 +000>,<MAYBRIDGE\nmr>,<NMR_250MHZ>,
      <created by zg, POWCHK disabled, PULCHK disabled
       configuration hash MD5:
       49 4B E0 1D 92 C2 6B 37 9F E6 65 BC 52 41 86 1D
       data hash MD5: 64K
       33 A8 40 7C 95 E9 11 EB 64 A5 BF 86 6A 8D 32 C0>)
(   2,<2007-01-05 12:00:13.04 +000>,<MAYBRIDGE\nmr>,<NMR_250MHZ>,
      <Start of raw data processing
       ef LB = 0.3 FT_mod = 6 PKNL = 1 SI = 32K 
       data hash MD5: 32K
       F1 42 B2 A9 C0 E3 A4 15 13 03 8D F8 5F 17 F2 9A>)
(   3,<2007-01-05 12:00:14.82 +000>,<MAYBRIDGE\nmr>,<NMR_250MHZ>,
      <apk 
       data hash MD5: 32K
       90 59 94 8B CB C0 A2 48 00 5E 0D 3C CA 66 E0 0E>)
(   4,<2007-01-05 12:00:15.76 +000>,<MAYBRIDGE\nmr>,<NMR_250MHZ>,
      <abs ABSG = 5 
       data hash MD5: 32K
       11 F7 54 86 CC 68 7A E6 9E CD FA 6B 18 AC B0 70>)
$$ ##END=
$$ 
$$ hash MD5
$$ DB E2 90 8A BE 19 25 20 00 F1 1E 58 E9 4F AE D6
##$RELAX= 
##$RELAX= 
##$RELAX= 
##$RELAX= 
##$RELAX= 
##$RELAX= 
##$RELAX= 
$$ Bruker specific parameters
$$ --------------------------
##$DU= <C:\u>
##$EXPNO= 490
##$NAME= <ADRS>
##$PROCNO= 1
##$TYPE= <nmr>
##$USER= <dgb>
##$AMP= (0..31)
100 100 100 100 100 100 100 100 100 100 100 100 100 100 100 100 100 100 
100 100 100 100 100 100 100 100 100 100 100 100 100 100 
##$AQSEQ= 0
##$AQ_mod= 3
##$AUNM= <au_zg>
##$AUTOPOS= <39 >
##$BF1= 250.13
##$BF2= 250.13
##$BF3= 250.13
##$BF4= 250.13
##$BF5= 500.13
##$BF6= 500.13
##$BF7= 500.13
##$BF8= 500.13
##$BYTORDA= 1
##$CFDGTYP= 0
##$CFRGTYP= 5
##$CHEMSTR= <none>
##$CNST= (0..31)
1 1 145 1 1 1 1 1 1 1 1 1 1 1 1 1 1 1 1 1 1 1 1 1 1 1 1 1 1 1 1 1 
##$CPDPRG= <>
##$CPDPRG1= <>
##$CPDPRG2= <>
##$CPDPRG3= <>
##$CPDPRG4= <mlev>
##$CPDPRG5= <mlev>
##$CPDPRG6= <mlev>
##$CPDPRG7= <mlev>
##$CPDPRG8= <mlev>
##$CPDPRGB= <>
##$CPDPRGT= <>
##$D= (0..31)
0 1 0 0 0 0 0 0 0 0.06 0 0 0 0 0 0 0.0002 0 0 0 0 0 0 0 0 0 0 0 0 0 0 
0 
##$DATE= 1167998398
##$DBL= (0..7)
120 120 120 120 120 120 120 120 
##$DBP= (0..7)
150 150 150 150 150 150 150 150 
##$DBP07= 0
##$DBPNAM0= <>
##$DBPNAM1= <>
$$ [...]
##$SUBNAM6= <"">
##$SUBNAM7= <"">
##$SUBNAM8= <"">
##$SUBNAM9= <"">
##$SW= 20.6930455092707
##$SWIBOX= (0..15)
0 0 3 0 0 0 0 0 0 0 0 0 0 0 0 0 
##$SW_h= 5175.983436853
##$TD= 65536
##$TD0= 1
##$TE= 294.16
##$TE2= 300
##$TE3= 300
##$TEG= 300
##$TL= (0..7)
0 120 120 120 120 120 120 120 
##$TP= (0..7)
150 150 150 150 150 150 150 150 
##$TP07= 0
##$TPNAME0= <>
##$TPNAME1= <>
##$TPNAME2= <>
##$TPNAME3= <>
##$TPNAME4= <>
##$TPNAME5= <>
##$TPNAME6= <>
##$TPNAME7= <>
##$TPOAL= (0..7)
0.5 0.5 0.5 0.5 0.5 0.5 0.5 0.5 
##$TPOFFS= (0..7)
0 0 0 0 0 0 0 0 
##$TUNHIN= 0
##$TUNHOUT= 0
##$TUNXOUT= 0
##$USERA1= <user>
##$USERA2= <user>
##$USERA3= <user>
##$USERA4= <user>
##$USERA5= <user>
##$V9= 5
##$VALIST= <valist>
##$VCLIST= <CCCCCCCCCCCCCCC>
##$VD= 0
##$VDLIST= <DDDDDDDDDDDDDDD>
##$VPLIST= <PPPPPPPPPPPPPPP>
##$VTLIST= <TTTTTTTTTTTTTTT>
##$WBST= 1024
##$WBSW= 4
##$XGAIN= (0..3)
0 0 0 0 
##$XL= 0
##$YL= 0
##$YMAX_a= 380971
##$YMIN_a= -420622
##$ZGOPTNS= <>
##$ZL1= 120
##$ZL2= 120
##$ZL3= 120
##$ZL4= 120
##$ABSF1= 16.522
##$ABSF2= -4.171173
##$ABSG= 5
##$ABSL= 3
##$ALPHA= 0
##$AQORDER= 0
##$ASSFAC= 0
##$ASSFACI= 0
##$ASSFACX= 0
##$ASSWID= 0
##$AUNMP= <proc_1d>
##$AZFE= 0.1
##$AZFW= 0.1
##$BCFW= 0
##$BC_mod= 0
##$BYTORDP= 0
##$COROFFS= 0
##$CY= 12.5
##$DATMOD= 1
##$DC= 0
##$DFILT= <>
##$DTYPP= 0
##$F1P= 14.0000005364418
##$F2P= -0.99999901652339
##$FCOR= 0.5
##$FTSIZE= 32768
##$FT_mod= 6
##$GAMMA= 0
##$GB= 0
##$INTBC= 1
##$INTSCL= 1
##$ISEN= 128
##$LB= 0.3
##$LEV0= 0
##$LPBIN= 0
##$MAXI= 10000
##$MC2= 0
##$MEAN= 0
##$ME_mod= 0
##$MI= 0
##$NCOEF= 0
##$NC_proc= -3
##$NLEV= 6
##$NOISF1= 0
##$NOISF2= 0
##$NSP= 0
##$NTH_PI= 0
##$NZP= 0
##$OFFSET= 16.522
##$PC= 1
##$PHC0= 211.1975
##$PHC1= 6.245635
##$PH_mod= 1
##$PKNL= yes
##$PPARMOD= 0
##$PSCAL= 4
##$PSIGN= 0
##$REVERSE= no
##$SF= 250.13
##$SI= 32768
##$SIGF1= 0
##$SIGF2= 0
##$SINO= 400
##$SIOLD= 32768
##$SREGLST= <1H.DMSO>
##$SSB= 0
##$STSI= 32768
##$STSR= 0
##$SW_p= 5175.98343685301
##$SYMM= 0
##$S_DEV= 0
##$TDeff= 65536
##$TDoff= 0
##$TI= <Analysis number 999999
Compound Code 99
Book Reference 9
Project Code 9>
##$TILT= no
##$TM1= 0
##$TM2= 0
##$TOPLEV= 0
##$USERP1= <user>
##$USERP2= <user>
##$USERP3= <user>
##$USERP4= <user>
##$USERP5= <user>
##$WDW= 1
##$XDIM= 32768
##$YMAX_p= 419748673
##$YMIN_p= -56026
$$ End of Bruker specific parameters
$$ ---------------------------------
##NTUPLES= NMR SPECTRUM
##VAR_NAME=  FREQUENCY,     SPECTRUM/REAL,   SPECTRUM/IMAG
##SYMBOL=    X,             R,               I
##VAR_TYPE=  INDEPENDENT,   DEPENDENT,       DEPENDENT
##VAR_FORM=  AFFN,          ASDF,            ASDF
##VAR_DIM=   32768,         32768,           32768
##UNITS=     HZ,            ARBITRARY UNITS, ARBITRARY UNITS
##FACTOR=    0.157963299565203, 1,           1
##FIRST=     4132.6476996994, 0,             0
##LAST=      -1043.33573715361, 0,           0
##MIN=       -1043.33573715361, -56026,      0
##MAX=       4132.6476996994, 419748673,     0
$$ Real data points
##PAGE= N=1
##DATA TABLE= (X++(R..R)), XYDATA
$$ [...]
18457E2304770l540550m996403o416155o916124o245249m978821l760858k780167
$$ 52304770 48764220 43767817 37351662 30435538 24190289 19211468 15450610 12670443
18449A2670443k071377j563377j193742r38912p21859n70770m61495l73905l04513
$$ 12670443 10599066 9035689 7841947 6903035 6181176 5610406 5148911 4775006 4470493
18440D470493k79470k35721k03838j71691j45051j24554j03271o9745m7128r976
$$ 4470493 4191023 3955302 3751464 3579773 3434722 3310168 3206897 3137152 3090024 3080048
18430C080048L0491O1972P7577J08978J30865J70157K40075L22040M37091N95277
$$ 3080048 3110539 3172511 3250088 3359066 3489931 3660088 3900163 4222203 4659294 5254571
18420E254571P81679J048788J427635J949099K638982L459210M244081M579345
$$ 5254571 6036250 7085038 8512673 10461772 13100754 16559964 20804045 25383390
18412B5383390M115771L099153K097324J245611L32082l94292n78310q29585j511623
$$ 25383390 29499161 32598314 34695638 35941249 36273331 35879039 35300729 34471144 32959521
18403C2959521k294359l018445l801638m312573m084633l311239k475293j797637
$$ 32959521 30665162 27646717 23845079 19532506 15447873 12136634 9661341 7863704
18395G863704j335404j004167p65921n93702m71622l71555l12276k63640k29434
$$ 7863704 6528300 5524133 4758212 4164510 3692888 3321333 3009057 2745417 2515983
18386B515983k03883j74124j58093j75389j45580j36628j16885r7408r8408q1128
$$ 2515983 2312100 2137976 1979883 1804494 1658914 1522286 1405401 1307993 1209585 1128457
18376A128457q7060q7052o4225m8184m9066n0398m2439k8517k0095k8530m1155
$$ 1128457 1041397 954345 890120 841936 792870 742472 700033 671516 651421 622891 581736
18365E81736k8995k1255j8643j3687j6685j4383q40o014q459j6595k5810q444
$$ 581736 552741 531486 512843 499156 482471 468088 467248 461234 452775 436180 410370 401926
18353D01926q570p635j1430j4870q986j2152l442m649j4867j797J1047l087J915
$$ 401926 393356 385721 374291 359421 350435 338283 334841 330192 315325 313528 324575 321488 323403
18340C23403l093k771j3241m820Q917k512o930k62m065l722j2960j4496J3881
$$ 323403 320310 317539 304298 299478 308395 305883 298953 298691 294626 290904 277944 263448 277329
18327B77329q70r746k5735p768j139l282j6682j1646P338j3669q667r334M571
$$ 277329 276459 266713 240978 233210 232071 228789 212107 200461 207799 194130 185463 176129 180700
18314A80700J4801J1338J0634j357l469L056J792o491p046J5925J6393M251m194
$$ 180700 195501 206839 217473 216116 212647 215703 217495 211004 203958 219883 236276 240527 236333
18301B36333M497j2111o696q615j8945q340N633q466o300R068K793j6291K110
$$ 236333 240830 228719 222023 213408 194463 186123 191756 183290 176990 186058 188851 172560 174670
18288A74670j581j7440P911J9509K664j8415l763P604M21P583O774N79k730n44
$$ 174670 173089 155649 163560 183069 185733 167318 163555 171159 171580 179163 185937 186516 183786 183242
18274A83242l364J043L923M544m068q646o834N791M605p207j4682J275Q454J0769
$$ 183242 179878 180921 184844 189388 185320 176674 169840 175631 180236 173029 158347 159622 168076 178845
18260A78845J1975o977j2648P027J7191O336j421N841K5645R602j6066q231j1990
$$ 178845 190820 183843 171195 178222 195413 201749 200328 206169 231814 241416 225350 217119 205129
18247B05129q102j9377j4545N857J1753l798j915j0132j4121O165R073J3959n984
$$ 205129 197027 177650 163105 168962 180715 176917 175002 164870 150749 156914 165987 179946 173962
18234A73962l196J9175K5528R74K029Q096N334P027k040M879j209j1443Q473P879
$$ 173962 170766 189941 215469 216443 218472 226568 231902 238929 236889 241768 240559 229116 237589 245468
18220B45468J9967J556q817r901j306M744l182K203J0117p082r070n893J0521
$$ 245468 265435 266991 258174 248273 246967 251711 248529 250732 260849 253767 244697 238804 249325
18207B49325J4309l784n070k348o112J0583J5671K3001p1Q08N286o999m498P28
$$ 249325 263634 259850 254780 252432 246320 256903 272574 295575 295504 296312 301598 294599 290101 290829
18193B90829Q275J1954J6233Q573M957J6403K1565J2366J4150K1509J8725K889
$$ 290829 299104 311058 327291 335864 340821 357224 378789 391155 405305 426814 445539 448428
18181D48428o952j1781J3377J1841J352J3321K4163P398J2032K1831j384n909
$$ 448428 441476 429695 443072 454913 456265 469586 493749 501147 513179 535010 533626 527717
18169E27717l09J3395J0129Q762J7449J2605J4198K3599K6869K0851J6573L6040
$$ 527717 527408 540803 550932 559694 577143 589748 603946 627545 654414 675265 691838 727878
18157G27878M8999N7551P9654O9290P4420O3330L4810L5468O1565P5878R5926
$$ 727878 776877 834428 914082 983372 1057792 1121122 1155932 1191400 1252965 1328843 1424769
18146A424769R1644R3059R6590J11784J53338K03699K57920L17430M15142N60388
$$ 1424769 1516413 1609472 1706062 1817846 1971184 2174883 2432803 2750233 3165375 3725763
18136C725763P06760R39140J294039J785300K480461L425453M454749M965135
$$ 3725763 4432523 5371663 6665702 8451002 10931463 14356916 18811665 23776800
18128B3776800L738565N80556j868971j833830l08573J279824J906553N21444
$$ 23776800 27515365 28095921 26226950 24393120 24084547 25364371 27270924 27792368
18120B7792368k654576m821859m681785l549254k516557j781395j278701r20753
$$ 27792368 25137792 20315933 15634148 12084894 9568337 7786942 6508241 5587488
18112E587488o46869m60427l48368k43903j60082j33371r3999n2934k1660r232
$$ 5587488 4940619 4480192 4131824 3887921 3727839 3594468 3500469 3447535 3425875 3416643
18102C416643k1867r193J4337L7671Q6903J31692J75929J99436K62194L63059
$$ 3416643 3394776 3385583 3399920 3437591 3524494 3656186 3832115 4031551 4293745 4656804
18092D656804M95510O97208R79185J357182J893138K599411L627528M815608N621986
$$ 4656804 5152314 5849522 6828707 8185889 10079027 12678438 16305966 21121574 26743560
18083B6743560M878289K277180O57075J762707L883424M681042K739081r37312
$$ 26743560 31621849 33899029 34556104 36318811 40202235 44883277 47622358 46685046
18075D6685046l975421m621201k998933j180309j101469l297756n378045n343499
$$ 46685046 42709625 38088424 35089491 33909182 32807713 29509957 24131912 18788413
18067A8788413m160878k993676k140124j529067j109679q26436o11393m74996
$$ 18788413 14627535 11633859 9493735 7964668 6854989 6028553 5417160 4942164
18059D942164l79127l17558k81486k57215k06070j45645j23804q3621p4850r3663
$$ 4942164 4563037 4245479 3963993 3706778 3500708 3355063 3231259 3147638 3072788 2979125
18049B979125p4235m8835l0364J6143P5363J32142J89499L00786M42856O19932
$$ 2979125 2904890 2856055 2825691 2841834 2917197 3049339 3238838 3539624 3982480 4602412
18039D602412Q95145J271572J803604K572746L514570M176145L532766P91895
$$ 4602412 5497557 6769129 8572733 11145479 14660049 18836194 22368960 23160855
18031B3160855j843469k055308p33377P54811J595881R17099j570533l764399
$$ 23160855 21317386 19262078 18528701 19283512 20879393 21796492 20225959 16461560
18023A6461560l951915l067337k155618j527872j084319p79614n79596m61925
$$ 16461560 12509645 9442308 7286690 5758818 4674499 3894885 3315289 2853364
18015B853364l51481k90389k23472j70765j46240j19826j07149q7352p7987r7333
$$ 2853364 2501883 2211494 1988022 1817257 1671017 1551191 1444042 1356690 1278703 1181370
18005A181370r5966p3739n9515l8774n2126n6353o5097p2488n0610n1812l1551
$$ 1181370 1085404 1011665 952150 913376 861250 804897 739800 667312 616702 564890 533339
17994E33339j4470l6079k0611j1428k4370l6783k6194j7221j6914j0496q183n531
$$ 533339 518869 482790 462179 450751 426381 389598 363404 346183 329269 318773 310590 305059
17982C05059m034p896r187j9118k6217j9927M939R220j1759o047l069m158J0976
$$ 305059 301025 293129 283942 264824 238607 218680 223619 232839 221080 215033 211964 207806 218782
17969B18782r207j1057K118l474M253J373k824J441J3368R638Q40K747J4803L3954
$$ 218782 209575 198518 200636 197162 201415 202788 199964 201405 214773 224411 225251 227998 242801 276755
17955B76755K0510K2250K1087J2874K4949J2147J2142J3140m137j0209j5372l0506
$$ 276755 297265 319515 340602 353476 378425 390572 402714 415854 411717 401508 386136 355630
17943C55630k6153r965k8064j9164j3271k1465j1963k0076j9608q288o900J407
$$ 355630 329477 319512 291448 272284 259013 237548 225585 205509 185901 177613 170713 172120
17931A72120o157j8659J691K754j5999k0201j2257m650M891Q788J733J657N699
$$ 172120 165963 147304 148995 151749 135750 115549 103292 98642 103533 112321 114054 115711 121410
17918A21410L37l943k2M000O48o622K632J2226J0655K224l30P644J497q58J490
$$ 121410 121747 117804 117782 121782 122430 115808 118440 130666 141321 143545 143215 150859 152356 151498 152988
17903A52988K0344J5705J1032K2637K5029J9818M483l369Q732J5293L704j0773
$$ 152988 173332 189037 200069 222706 247735 267553 272036 268667 277399 292692 296396 285623
17891B85623n840j5798k2831j6787p526p433k0178k2795k0359o612j3634j1316
$$ 285623 279783 263985 241154 224367 216841 209408 189230 166435 146076 139464 125830 114514
17879A14514q760k107q424L276r004j95J0948k934o969M629J4406l734n887l431
$$ 114514 105754 103647 95223 98499 89495 89300 100248 97314 90345 94974 109380 105646 99759 96328
17865I6328m683p700m950J238o384j1592K264j971L035L768q256N726K027l509
$$ 96328 91645 83945 78995 80233 73849 62257 64521 62550 65585 69353 61097 66823 68850 65341
17851F5341j541j4164M123Q803k383j5945R792K631K700R377m855j9366l450n101
$$ 65341 63800 49636 53759 62562 60179 44234 54026 56657 59357 68734 63879 44513 41063 35962
17837C5962M647Q102R83K717L404L168L664R311K78j6547o741j43K2413J523k415
$$ 35962 40609 48711 49694 52411 55815 58983 62647 71958 72236 55689 48948 48805 71218 72741 70326
17822G0326P786J1135M009j2910j8829n333M346j099L339j2006k0576M229J4892
$$ 70326 78112 89247 93256 80346 61517 56184 60530 59431 62770 50764 30188 34417 49309
17809D9309O568k841k715P278P213k3897N554K376j8419q182L750K919R345j1719
$$ 49309 55877 53036 50321 57599 64812 40915 46469 48845 30426 22244 25994 28913 38258 26539
17795B6539P282J4181j07o341j896K33J8700r98o960r6j1476N006j646l287J892
$$ 26539 33821 48002 47895 41554 39658 39891 58591 57593 50633 50537 39061 44067 42421 39134 41026
17780D1026j606J158l577r476j219q915Q075m186j171O498Q868j8793l712k711
$$ 41026 39420 40578 37001 27525 26306 17391 25466 21280 20109 26607 35475 16682 12970 10259
17766A0259K728N603L838O141L595j1656o157N699k875m647j3k642O106R081L066
$$ 10259 12987 18590 22428 28569 32164 20508 14351 20050 17175 12528 12515 9873 15979 25060 28126
17751B8126l481l789O788k460j0447l091k018R806K706O879N414o032J0262j852
$$ 28126 24645 20856 27644 25184 14737 11646 9628 19434 22140 29019 34433 28401 38663 36811
17737C6811Q00j091l719j29r65m267M622J2734j5554j064N034l817o45K592Q60
$$ 36811 37611 36520 32801 32672 31707 27440 32062 44796 29242 28178 33212 29395 28750 31342 32202
17722C2202j3645j5129j0187J0873J6769k793q107Q142L04J667m096l472n534
$$ 32202 18557 3428 -6759 4114 20883 18090 9983 18125 18429 20096 16000 12528 6994
17709F994j4812r58P820J6219N575q043K673P884r137o164J0863k219Q22N499
$$ 6994 -7818 -8776 -956 15263 20838 12795 15468 23352 14215 8051 18914 16695 17517 23016
17695B3016P232l277k535n7J1389o644j7163p096o629k574m64P604R84J166n2
$$ 23016 30248 26971 24436 24379 35768 29124 11961 4865 -1764 -4338 -4802 2802 3786 4952 4900
17680D900J306q486o260J1148P116o872K4J0978n548o707R107j4215o819J6790
$$ 4900 6206 -2280 -8540 2608 9724 2852 2876 13854 8306 1599 10706 -3509 -10328 6462
17666F462J6124L191J159j1044M298O545Q98p619N130q78p336J935R562o470m086
$$ 6462 22586 25777 26936 15892 20190 26735 27633 20014 25144 24266 16930 18865 28427 21957 17871
17651A7871J3449O501j6916j9894j887R157j1509M541L35j1039O777O819P934
$$ 17871 31320 37821 20905 1011 -876 8281 -3228 1313 1648 -9391 -2614 4205 12139
17638A2139l699q160J0560J4253l859j3043j248p98k93J3678M025K373j112j5477
$$ 12139 8440 280 10840 25093 21234 8191 6943 6145 5852 19530 23555 25928 24816 9339
17624I339L548K690O738J4970m244j1769m311m648J7249J7840K494P93J5899L1989
$$ 9339 12887 15577 22315 37285 33041 21272 16961 12313 29562 47402 49896 50689 66588 98577
17610I8577J0017L820J971O61j086L308J2175J3640o480k3540m1055j6083j1248
$$ 98577 108594 112414 114385 115046 113960 117268 129443 143083 136603 113063 72008 55925 44677
17597D4677Q93l91N443j3142j3703j646J0695q692N370P298r590n049N247J2420
$$ 44677 45570 45179 50622 37480 23777 22131 32826 24134 29504 36802 27212 22163 27410 39830
17583C9830L403k315K364k017j613O908L485l99k946N0O2L757l86O54L69J1471
$$ 39830 43233 40918 43282 41265 39652 46560 50045 49646 46700 46750 46812 50569 50183 50837 51206 62677
17567F2677L5766K9120K1862K0751P380R666J3259P239J5855J3964n764j3866
$$ 62677 98443 127563 149425 170176 177556 187222 200481 207720 223575 237539 231775 217909
17555B17909r293q731j0844k0345j2446j1783j3490l0302k7196o813p109j1797
$$ 217909 208616 199885 189041 168696 156250 144467 130977 100675 73479 66666 59557 47760
17543D7760O284j7955j4344m369M803M438k504M031j415r811p498p964q575O996
$$ 47760 54044 36089 21745 17376 22179 26617 24113 28144 26729 16918 9420 1456 -7119 -123
17529a23P817l640j36P97j3191K1663K9924J773J770J902n725n76J5183K6721
$$ -123 7694 4054 3918 4715 -8476 13187 43111 44884 46654 48556 42831 42255 57438 84159
17515H4159K2656J4605L104j523p948l447p987l590p72K64p555k2157j2185j5898
$$ 84159 106815 121420 124524 123001 115053 111606 103619 100029 99257 99521 91966 69809 57624 41726
17501D1726k3857j0443J647R046p524M125j367j471R856k183J982M152m676m693
$$ 41726 17869 7426 9073 18119 10595 14720 13353 11882 21738 19555 21537 25689 21013 16320
17487A6320N73M750l372K986K242m824m559N301m560j2730j0095q671O409R920
$$ 16320 16893 21643 18271 21257 23499 18675 14116 19417 14857 2127 -7968 -16639 -10230 -310
17473c10j957k100R669O61r251J360R798q365j866m801l569R956j784q213K280
$$ -310 -2267 -4367 5302 5963 -3288 -1928 7870 -495 -2361 -7162 -10731 -775 -2559 -10772 -8492
17458h492J4407p916j4250J190J5001J5342l347j065K218Q690O38N118j186p363
$$ -8492 5915 -2001 -16251 -15061 -60 15282 11935 10870 13088 21778 22416 27534 26348 18985
17444A8985n904j2101j0274j4115J2900K215k491O138J1717o111l868J1876J4043
$$ 18985 13081 980 -9294 -23409 -10509 -8294 -10785 -4647 7070 959 -2909 8967 23010
17431B3010j5458j4177J7647O494k515M7M153J89o1l371R752j3763k153n526p746
$$ 23010 7552 -6625 11022 17516 15001 15048 19201 19390 19329 15958 25710 11947 9794 4268 -3478
17416c478o386n966n640J9966J8620k97k0223J668n841r261m037L277k315m496
$$ -3478 -9864 -15830 -21470 -1504 17116 16819 -3404 -1736 -7577 -16838 -20875 -17598 -19913 -24409
17402b4409O34J2097Q188p472L858J1331k269p642L459j6755o50J0042P399N378
$$ -24409 -23775 -11678 -3490 -10962 -7104 4227 1958 -5684 -2225 -18980 -19630 -9588 -2189 3189
17388C189M29n910l496L486L201N19p466q512M043P704J707Q196J3412l28o813
$$ 3189 3618 -2292 -5788 -2302 899 1418 -6048 -14560 -10517 -2813 -1106 7090 20502 20174 13361
17373A3361n264p586j3320J3014k351J531L605K10q814o694J5028k403j9249k508
$$ 13361 8097 511 -12809 205 -2146 -615 2990 3200 -5614 -12308 2720 317 -18932 -21440
17359b1440J6807J2904j688j805Q638Q263j2123q971p43o978K234p067N590R471
$$ -21440 -4633 8271 6583 4778 13416 21679 9556 585 -158 -7136 -4902 -11969 -6379 3092
17345C092r668Q082J1492L802j0037j0785j0422L860q828K89J2579M116P823m913
$$ 3092 -6576 1506 12998 16800 6763 -4022 -14444 -10584 -19412 -19123 -6544 -2428 5395 482
17331D82j645J767K517p181M203j866o856j1045n271O0O137M979O007K699o480
$$ 482 -1163 604 3121 -4060 143 -1723 -8579 -19624 -24895 -24835 -18698 -13719 -7712 -5013 -11493
17316a1493j002J301j3331j1938J1956J7301J0461j047O168P537M70j4205r761
$$ -11493 -12495 -11194 -24525 -36463 -24507 -7206 3255 2208 8376 15913 16383 2178 -7583
17303g583J0464N362N051p526N023n551p275j467j2401k5090J0051P309P713J4232
$$ -7583 2881 8243 13294 5768 10791 5240 -2035 -3502 -15903 -40993 -30942 -23633 -15920 -1688
17289a688l981J0102L39j6968j681k0608K82J8012k373j4075N672J101J5225J1504
$$ -1688 -5669 4433 4772 -12196 -13877 -34485 -34203 -16191 -18564 -32639 -26967 -25866 -10641 863
17275H63K396J1229p16p666q980n937l226k760q592M117J0420Q283o598r007n419
$$ 863 3259 14488 13772 6106 -2874 -8811 -12037 -14797 -23389 -19272 -8852 -569 -7167 -16174 -21593
17260b1593j557J1980o45J48J37K716L857Q159J1540Q687q315j5120j725R695
$$ -21593 -23150 -11170 -11815 -11667 -11530 -8814 -4957 3202 14742 23429 15114 -6 -1731 7964
17246G964K850m70q043k578M921K695j4999m219r49q849n003M431k598q653Q011
$$ 7964 10814 10344 2301 -277 4644 7339 -7660 -11879 -12828 -21677 -26680 -22249 -24847 -33500 -25489
17231b5489M960J3103J7378O881m086n851o547p567r376l747P462l333P518m018
$$ -25489 -20529 -7426 9952 16833 12747 6896 349 -7218 -16594 -20341 -12879 -16212 -8694 -12712
17217a2712N335k814N618Q839m757N089J5014O311k604m512j4038p940q42J3384
$$ -12712 -7377 -10191 -4573 4266 -491 4598 19612 25923 23319 18807 4769 -3171 -4013 9371
17203I371K535n025J0689P014n25j4274j8117j604N971J8057j45r057N22K9k586
$$ 9371 11906 6881 17570 24584 24059 9785 -8332 -9936 -3965 14092 13947 4890 5412 5441 2855
17188B855k198O11n745l63R48l324r61J969m893J222J1K515O23J5653n417n734
$$ 2855 657 1268 -4477 -4840 -3892 -7216 -8177 -6208 -11101 -9879 -9868 -7353 -6730 8923 3506 -2228
17172b228l544j82K210p211o0l810J779O017K134m807P119J5151q23k0361p749
$$ -2228 -5772 -5954 -3744 -10955 -11015 -14825 -13046 -7029 -4895 -9702 -2583 12568 11745 -8616 -16365
17157a6365l333J3203J3357k388O098q731j3098O178L690K845j1852l803L464
$$ -16365 -19698 -6495 6862 4474 10572 1841 -11257 -5079 -1389 1456 -10396 -14199 -10735
17144a0735J2056K070L563k351N252M652o648J868q665j2809k340Q27L678k098
$$ -10735 1321 3391 6954 4603 9855 14507 7859 9727 1062 -11747 -14087 -13260 -9582 -11680
17130a1680j3430J1584N200j072m30Q94P707K210P161J3777l337j1883p218j2551
$$ -11680 -25110 -13526 -8326 -9398 -9828 -8934 -1227 983 8144 21921 18584 6701 -517 -13068
17116a3068K979l588l830P552N43l592l356o034J4717N770j0056q806Q995K907
$$ -13068 -10089 -13677 -17507 -9955 -9412 -13004 -16360 -22394 -7677 -1907 -11963 -20769 -11774 -8867
17102h867J062M55m593j2334r35q146L969J2045K2538J3459m117k4117m536r92
$$ -8867 -7805 -7350 -11943 -24277 -25212 -33358 -29389 -17344 5194 18653 14536 -9581 -14117 -15109
17088a5109N030J8195p884j800j3191q730O650J35k885O07J3480N928j3811J634
$$ -15109 -10079 8116 232 -1568 -14759 -23489 -16839 -16704 -19589 -18982 -5502 426 -13385 -11751
17074a1751j55q397K266O110k376L025L381L325N460N234j1531n353N925Q150
$$ -11751 -11906 -20303 -18037 -11927 -14303 -11278 -7897 -4572 888 6122 -5409 -10762 -4837 3313
17060C313P074Q846j0049j2440J268J3420O785j771j6216j4756r666L587J2097
$$ 3313 10387 19233 9184 -3256 -1988 11432 18217 16446 230 -14526 -24192 -20605 -8508
17047h508P961P795o491q402k0886q663R165n969o387N079J1334J8998M453j989
$$ -8508 -547 7248 757 -7645 -28531 -37194 -28029 -33998 -40385 -35306 -23972 -4974 -521 -2510
17033b510j098n75N102O353m343p2j970L240L688P60j364J265q64j978J0446o704
$$ -2510 -3608 -4183 919 7272 2929 2857 887 4127 7815 8575 7211 8476 7612 5634 16080 9376
17017I376m560j0268N78J076j1415j3497n724N435J6394j260M683k460N57K0187
$$ 9376 4816 -5452 -4874 -3798 -15213 -28710 -34434 -28999 -12605 -13865 -9182 -11642 -11085 9102
17003I102M11K975n615r867n567K2123l523j5585o114n636J1558m288j0486O194
$$ 9102 9513 12488 6873 -2994 -8561 13562 10039 -5546 -11660 -17296 -5738 -10026 -20512 -14318
16989a4318J4609R586M931j1791p308N962l332l38N35m321r332n200M046l753
$$ -14318 291 9877 14808 3017 -4291 1671 -1661 -1999 -1464 -5785 -15117 -20317 -16271 -20024
16975b0024J785m056k574Q39O364R210K879m499N525j2653K486M558k198j77R913
$$ -20024 -18239 -22295 -24869 -24030 -17666 -8456 -5577 -10076 -4551 -17204 -14718 -10160 -12358 -12535 -2622
16960b622J9034K051j1079j2880K402P788j1855o06l930p774J1769J7935n495
$$ -2622 16412 18463 7384 -5496 -3094 4694 -7161 -7767 -11697 -19471 -7702 10233 4738
16947D738r95N890l13J152m30o014r77o071N957k833l529N954l962m32n113l268
$$ 4738 3743 9633 9320 10472 10042 4028 3051 -3020 2937 104 -3425 2529 -1433 -1865 -6978 -10246
16931a0246J1846Q10j2905j0905j459O674L534N151N366P208K023k51R011r074
$$ -10246 1600 2410 -10495 -21400 -22859 -16185 -12651 -7500 -2134 5074 7097 6846 15857 6783
16917F783l087p438j3745n931O370K161L299m41j256r735k652j0780J92j585J5877
$$ 6783 3696 -3742 -17487 -23418 -17048 -14887 -11588 -12029 -13285 -23020 -25672 -36452 -36260 -37845 -21968
16902b1968J8094l309r667J6269J3636j3719j704N693R962r32p961j6347k894
$$ -21968 -3874 -7183 -16850 -581 13055 -664 -2368 3325 13287 12355 4394 -11953 -14847
16889a4847L34K163R767R285j567l559l800OL419L470O334l649n392L963n987
$$ -14847 -14513 -12350 -2583 6702 5135 1576 -2224 -2218 1201 4671 11005 7356 1964 5927 -60
16874f0J458j380q098j1578q227Q898M389J4478N770j4613j77K759n23o430J287
$$ -60 1398 18 -8080 -19658 -27885 -18987 -14598 -120 5650 -8963 -9140 -6381 -6904 -13334 -12047
16859a2047P686O204j641m024j1470j1964M621O678R821q235P081M295J0070k568
$$ -12047 -4361 1843 202 -3822 -15292 -27256 -22635 -15957 -6136 -14371 -7290 -2995 7075 4507
16845D507o672K573Q440o609j964J505L271j1976n401j015m067J656Q868J4250
$$ 4507 -2165 408 8848 2239 275 1780 5051 -6925 -12326 -13341 -17408 -15752 -6884 7366
16831G366o44k461l915k30J2992L392L566k615j6053o37Q782K806j0086o152j0645
$$ 7366 6722 4261 346 116 13108 16500 20066 17451 1398 761 9543 12349 2263 -3889 -14534
16816a4534l431J784O008O234Q129j024K374l850l091J073J629R423P416K306
$$ -14534 -17965 -16181 -10173 -3939 4190 3166 5540 1690 -1401 -328 1301 10724 18140 20446
16802B0446j3014K748L564O962j4003j1869p274N442J48L159M684K31o883p424
$$ 20446 7432 10180 13744 20706 6703 -5166 -12440 -6998 -6850 -3691 993 1224 -5659 -13083
16788a3083o182j2623l185J1650N76M868O958m285L927L6K821N946R289P01l16
$$ -13083 -19265 -31888 -35073 -23423 -22847 -17979 -11021 -15306 -11379 -11343 -8522 -2576 6713 7414 7098
16773G098K211R299q93l620o995k0357n80M252R930q924k828k36Q098Q103p130
$$ 7098 9309 18608 17715 14095 7100 -13257 -13837 -9585 345 -8579 -11407 -11643 -3545 4558 -2572
16758b572l463L048K635p079l667J7175Q468p777j3006n560K873J320q48Q974
$$ -2572 -6035 -2987 -352 -7431 -11098 6077 14545 6768 -6238 -11798 -8925 -7605 -8453 521
16744E21L568n944j717J3137J0928p566j298l535q513j2663L738J1158j7244r642
$$ 521 4089 -1855 -3572 9565 20493 12927 11629 8094 -419 -13082 -9344 1814 -15430 -25072
16730b5072O454L497L680J6367R627J481j4201j5432n594K959l15J104L690j5192
$$ -25072 -18618 -15121 -11441 4926 14553 16034 1833 -13599 -19193 -16234 -16549 -15445 -11755 -26947
16716b6947k423J3077J7671j58j0131L916Q380m366r994K282m09j225J4209K1244
$$ -26947 -29370 -16293 1378 1220 -8911 -4995 3385 -981 -10975 -8693 -9102 -10327 3882 25126
16702B5126k038j5889j2476L549J1578P749j082n622J0212n93q990p0J638l906
$$ 25126 23088 7199 -5277 -1728 9850 17599 16517 10895 21107 20514 11524 11454 13092 9186
16688I186N722l920j777J10m307q640n323O818O925k822j4923P132l183L142l970
$$ 9186 14908 10988 9211 9321 5014 -3626 -8949 -2131 4794 1972 -12951 -5819 -9002 -5860 -9830
16673i830r889N190J7226J0619l970j2812j3571r141J1762P299L285p816J869
$$ -9830 -19719 -14529 2697 13316 9346 -3466 -17037 -26178 -14416 -7117 -3832 -11648 -9779
16660i779Q480k860L262j1119n338J1986P11L471O094L127j707p510j3141j1315
$$ -9779 -1299 -4159 -897 -12016 -17354 -5368 -4657 -1186 4908 8035 6328 -1182 -14323 -25638
16646b5638M463l324j0650P313P206J1282J2141m492q057l407K250J3997L42M687
$$ -25638 -21175 -24499 -35149 -27836 -20630 -9348 2793 -1699 -9756 -13163 -10913 3084 3426 8113
16632H113J2855j2342r898J2366J7068j6260j3194j0786N128N773j041r287L289
$$ 8113 20968 8626 -1272 11094 28162 11902 -1292 -12078 -6950 -1177 -2218 -11505 -8216
16619h216Q720k145J223J651n978Q887j068n761l669Q86l349N996N766n982J855
$$ -8216 504 -1641 -418 1233 -4745 4142 3074 -2687 -6356 -5470 -8819 -2823 2943 -3039 -1184
16604a184l96m68L497j252j2535m170p88O145O660J026K143L37r918j0197Q450
$$ -1184 -1580 -2048 1449 197 -12338 -16508 -17296 -11151 -4491 -3465 -1322 -985 -10903 -21100 -12650
16589a2650O138J937l809J45M879P869k276j990m123Q043p899l439N080k261J0510
$$ -12650 -6512 -4575 -8384 -8239 -3360 4509 2233 243 -3880 4163 -3736 -7175 -2095 -4356 6154
16574F154K573M256L648q555R632J1999j1420k112J877k607k884J6868M538n065
$$ 6154 8727 12983 16631 8076 17708 29707 18287 16175 18052 15445 12561 29429 33967 28902
16560B8902l696l424q567l300N397o286o420l719Q254k639j4523N168j149m02
$$ 28902 25206 21782 13215 9915 15312 9026 2606 -1113 7141 4502 -10021 -4853 -6002 -6404
16546f404R872O128N41k5596l042k13j845O803R736m36J1843k923j9294l130L553
$$ -6404 3468 9596 10137 -15459 -18501 -18714 -20559 -13756 -4020 -4456 7387 4464 -14830 -17960 -14407
16531a4407J2062N64m221L046O245l382q115L206J0386r26r331r955J99M430O154
$$ -14407 -2345 -1781 -6002 -2956 3289 -93 -8208 -5002 5384 4458 -4873 -14828 -14629 -10199 -4045
16516d045m239l940O730O134O228j504j2738j1395J4897J5599m031l564P37q053
$$ -4045 -8284 -12224 -5494 640 6868 5364 -7374 -18769 -3872 11727 7696 4132 4869 -3184
16502c184o449O488J1158q65J769j1587p733N554J173l94N946j0992m552N974
$$ -3184 -9633 -3145 8013 7148 8917 -2670 -10403 -4849 -3676 -4070 1876 -9116 -13668 -7694
16488g694K828j361J0465R974k420M000P833J0993k924j0450J666K4085j879j0876
$$ -7694 -4866 -6227 4238 14212 11792 15792 23625 34618 31694 21244 22910 46995 45116 34240
16474C4240M388J882O592K3993J4622L03Q872J7126L0464K1233L2962L4629N9920
$$ 34240 38628 40510 47102 71095 85717 86020 94892 112018 142482 163715 196677 231306 291226
16461B91226O2024Q9704Q0434L0325J4506m840m0408o4141o2520n9088o0430m9834
$$ 291226 353250 442954 523388 553713 568219 563379 522971 458830 396310 337222 276792 226958
16449B26958l5684k8258l2166k7433k5371P376o507k0387j7886j2672m029L875
$$ 226958 191274 163016 130850 103417 78046 85422 78915 58528 40642 27970 23941 27816
16437B7816K520k716j7145j6912M896J5287J1541p331r327Q87j518p921Q585M754
$$ 27816 30336 27620 10475 -6437 -1541 13746 25287 17956 8629 9516 7998 77 8662 13416
16423A3416p544K8J1164K655o069p173J700j5046p268Q418K7002J0628j2321j3572
$$ 13416 5872 5900 17064 19719 13650 6477 8177 -6869 -14137 -5719 21283 31911 19590 6018
16409F018m488J034o14N030O968O523o473n646k088l59O112j5747j0008q695P237
$$ 6018 1530 2564 1950 6980 13948 20471 13998 8352 6264 5905 12017 -3730 -13738 -22433 -15196
16394a5196p800K068K105P350K03o380j053R5K997J127J577l133R057J8873P987
$$ -15196 -22996 -20928 -18823 -11473 -11270 -17650 -18703 -18608 -15611 -14484 -12907 -16040 -6983 11890 19877
16379A9877J171l467q111k493m346p021R726O758O794J3609N113o141l181M942
$$ 19877 21048 17581 9470 6977 2631 -4390 5336 12094 18888 32497 37610 31469 28288 33230
16365C3230J0544j1970j8934j5670o354m289o599m066r497m551N826J399O514
$$ 33230 43774 31804 12870 -2800 -9154 -13443 -20042 -24108 -33605 -38156 -32330 -30931 -24417
16352b4417J0735N961r603j9641K1249J5075K1005J7727M933L32q749o547N220
$$ -24417 -13682 -7721 -17324 -36965 -15716 -641 20364 38091 43024 43356 34607 28060 33280
16339C3280q88Q27p593k1243o009J1202l067l835K526j572j0498o645j807N317
$$ 33280 32392 33219 25626 4383 -1626 9576 6509 2674 5200 3628 -6870 -13515 -15322 -10005
16325a0005o779j553J5815L468L964P184n994k079j5279j1000J3963J1304m213
$$ -10005 -16784 -18337 -2522 946 4910 12094 6100 4021 -11258 -22258 -8295 3009 -1204
16312a204M517L343m16N870o15n041j4039n098R624M998l407O538J3680n445J780
$$ -1204 3313 6656 6240 12110 11495 6454 -7585 -12683 -3059 1939 -1468 5070 18750 13305 15085
16297A5085j2638j259J4388J0187n315n768k891j502r025M001m03O435J726m810
$$ 15085 2447 1188 15576 25763 20448 14680 11789 10287 1262 5263 4860 11295 13021 8211
16283H211K479J471P403m212p678J1970K585j176O778M450j886m006N605j663
$$ 8211 10690 12161 19564 15352 7674 19644 22229 21053 27831 32281 30395 26389 31994 30331
16269C0331r719l362o904p368M925j310M596J1091J7112L002m427J8251O862J743
$$ 30331 20612 17250 10346 2978 7903 6593 11189 22280 39392 42394 37967 56218 63080 64823
16255F4823j204m268r453J253O241K283R819k5826l0658k9321k2308n000J8268
$$ 64823 63619 59351 49898 51151 57392 59675 69494 43668 13010 -16311 -38619 -43619 -25351
16242b5351N365J550J3052j2686j1226J347J3940l238N294L211o084L041K0147
$$ -25351 -19986 -18436 -5384 -18070 -29296 -27949 -14009 -17247 -11953 -8742 -14826 -11785 8362
16229H362J168p719K287m98K97R893N725L820p514J731n12k273K84n629J791p254
$$ 8362 9530 1811 4098 3600 3897 13790 19515 23335 15821 17552 17040 14767 15051 9422 11213 3959
16213C959q51Q74J247R53j4563j875K4149L854k606J2247J7893j4740j4084P690
$$ 3959 3108 3982 5229 6182 -8381 -10256 13893 17747 15141 27388 45281 30541 16457 24147
16199B4147O149J3809K1592J7549J2703M565j404O172l369j3567j1089j3745k1221
$$ 24147 30296 44105 65697 83246 95949 100514 99110 105282 101913 88346 77257 63512 42291
16186D2291j6879O337l59L455l92j9529j4376j647r920k468R923n77q709o275
$$ 42291 25412 31749 31390 34845 34453 14924 548 -1099 -11019 -13487 -3564 -4141 -12850 -19125
16172a9125K4886J5122l024Q16j335r368J1193L817Q484J9892n43n922n492j6334
$$ -19125 5761 20883 17859 18675 17340 7972 19165 22982 31466 51358 50815 44893 39401 23067
16158B3067j8316j0293R82J0916n282k990N710q610r266n329N647K78m224M697
$$ 23067 4751 -5542 -4560 6356 1074 -1916 3794 -4816 -14082 -19411 -13764 -13486 -17710 -13013
16144a3013J4550J2730P352N570P173J0410J532n501m072o679k589o107J074r141
$$ -13013 1537 14267 21619 27189 34362 44772 46304 40803 36731 30052 27463 21356 22430 13289
16130A3289j2205l503Q617K0676J1630K841K249j7834K648N793n168j0580o099
$$ 13289 1084 -2419 6198 26874 38504 41345 43594 25760 28408 34201 29033 18453 12354
16117A2354K519P197k693l516j385p611P019L673M05r984J97l149N728R204J9638
$$ 12354 14873 22070 19377 15861 14476 6865 13884 17557 17962 7978 8175 5026 10754 19958 39596
16102C9596j5606p346j0356M297M677n973r206j2083p257J1026K3238J6181J4298
$$ 39596 23990 16644 6288 10585 15262 9289 83 -12000 -19257 -8231 15007 31188 45486
16089D5486J6329J2095O609N532Q802L173r045k068j0914j410j0030L562J0871
$$ 45486 61815 73910 80519 86051 94853 98026 88981 86913 75999 74589 64559 68121 78992
16076G8992M173m54j432O835J3178N527j8724n083J0562n734p067M94J2312J2845
$$ 78992 83165 82711 81279 88114 101292 106819 88095 83012 93574 87840 80773 81267 93579 106424
16062A06424J2177J5422R986j3089n514L677J7634o052o295K822k522O139R928
$$ 106424 118601 134023 144009 130920 125406 129083 146717 140665 134370 137192 134670 140809 150737
16049A50737j4400r975J3490K571k789m828K947J3066J4910j0905o492l586P49
$$ 150737 136337 126362 139852 142423 139634 134806 137753 150819 165729 154824 148332 144746 145495
16036A45495K886k729J0739K1318O606m421J761N954J3004K453o808j836J2202
$$ 145495 148381 145652 156391 177709 184315 179894 181655 187609 200613 203066 196258 194422 206624
16023B06624J1518L028P187J1366J6400p899n129l793R617J3422K0615J5074k159
$$ 206624 218142 221170 228357 239723 256123 248224 243095 239302 248919 262341 282956 298030 295871
16010B95871n513k480P200J1257K0735R298P001J2570P494q150J4039K1312K5963
$$ 295871 290358 287878 295078 306335 327070 336368 343369 355939 363433 355283 369322 390634 416597
15997D16597J9793J1405J9614K9707K6879P545K1330J5230K6080K3266J7175K2150
$$ 416597 436390 447795 467409 497116 523995 531540 552870 568100 594180 617446 634621 656771
15985F56771L8945N3285M5802K2721K5700N3463L5818M2299M5083N7566N3358
$$ 656771 695716 749001 794803 817524 843224 896687 932505 974804 1019887 1077453 1130811
15974A130811P7443R3282Q8644R2268J01334J02729J22472J46752J55292J85595
$$ 1130811 1208254 1301536 1390180 1482448 1583782 1686511 1808983 1955735 2111027 2296622
15964B296622K53465L04970L67295M11808M31855M20769M00841M16502N02712
$$ 2296622 2550087 2855057 3222352 3634160 4066015 4486784 4887625 5304127 5806839
15955E806839O40439Q39516J115309J473876J923321K503323L300880M441266
$$ 5806839 6447278 7286794 8402103 9875979 11799300 14302623 17603503 22044769
15947B2044769O224428Q957944J2903079J7995878K3174852K5861424K2577238
$$ 22044769 28269197 37227141 50130220 68126098 91300950 117162374 139739612
15940A39739612J1796497l717245j7849585k5343992k5302226k0694506j5082189
$$ 139739612 151536109 147818864 129969279 104625287 79323061 58628555 43546366
15933D3546366j0448784p166990n001135l589222k672437k086840j680917j392621
$$ 43546366 33097582 25930592 20929457 17340235 14667798 12580958 10900041 9507420
15925I507420j157125r41408p43560n89985n17888n21465n30376m95060m44086
$$ 9507420 8350295 7408887 6665327 6075342 5557454 5035989 4505613 4010553 3566467
15916C566467m02651l29717k72003k42667k04969j78075j47622j19723j18029
$$ 3566467 3163816 2834099 2562096 2319429 2114460 1936385 1788763 1669040 1551011
15907A551011j07109q3314p7057p7139q1160p3234n1128n3983n1387n4585m1903
$$ 1551011 1443902 1360588 1283531 1206392 1125232 1051998 1000870 946887 895500 840915 799012
15896G99012l6474l9471m7119l8713k7672j2711j7271j8507k6341j9667j0540
$$ 799012 762538 723067 675948 637235 609563 596852 579581 561074 534733 515066 504526
15885E04526j217j5178j0714j3387k2120k5613j1841q919j0436j2991P048j2615
$$ 504526 503309 488131 477417 464030 441910 416297 404456 395537 385101 372110 379158 366543
15873C66543j7460j9364j7111J48q032q012j0227j238l413j7112j1640j1166j9094
$$ 366543 349083 329719 312608 312756 304724 296712 286485 285247 281834 264722 253082 241916 222822
15860B22822j0202N584m783J411j0595j3200N414j883k0266o41q782O85q347j7907
$$ 222822 212620 218204 213421 214832 204237 191037 196451 194568 174302 173661 164879 165564 157217 139310
15846A39310N036K529j794l592j0310j4511q931m618j2005O700J5792N644N555
$$ 139310 144346 146875 145081 141489 131179 116668 107737 103119 91114 97814 113606 119250 124805
15833A24805r0j0574p023r109k601j7330j6840o021n604L721N460N087l111O976
$$ 124805 124715 114141 107118 98009 95408 78078 61238 55217 49613 53334 58794 63881 60770 67746
15819F7746P640L3031K0372J9734K1417K7394P445l797j3130k0639j8203j0487
$$ 67746 75386 108417 128789 148523 169940 197334 204779 200982 187852 167213 149010 138523
15807A38523r59n070p25l387K658q47j103l469q270j2809j3703j4980o285k8389
$$ 138523 137564 132494 131769 128382 131040 130193 129090 125621 117351 104542 90839 75859 69574 41185
15793D1185j0757j1801J120R758J8401L5562K7501M295L209O479j595J0968q221
$$ 41185 30428 18627 19747 29505 47906 83468 110969 115264 118473 124952 123357 134325 126104
15780A26104l1140j7288N328J6265O207m38n412m670J0967j7642k9559m550Q090
$$ 126104 94964 77676 83004 99269 105476 105038 99626 94956 105923 88281 58722 54172 62262
15767F2262J0408j4164m270j974Q662L134n691k83k549M958p376j971J512J0435
$$ 62262 72670 58506 54236 52262 60924 64058 58367 58084 55535 60493 53117 51146 52658 63093
15753F3093M114J0795M185O091j916j4278o990k355k490j5056K29N082n97k2739
$$ 63093 67207 78002 82187 88278 86362 72084 65094 62739 60249 45193 45422 50504 49907 27168
15739B7168p058J9582K2015Q240R660J9351K581j2222j0755j3256k698K710j1768
$$ 27168 20110 39692 61707 69947 79607 98958 101539 89317 78562 65306 62608 65318 53550
15726E3550l504r255k039r438p564q11n212K844j103M523K258N840K0922o629
$$ 53550 50046 40791 38752 29314 21750 20939 15727 18571 17468 21991 24249 30089 51011 44382
15712D4382l249l36j021J923R594R596J2583o869r128n329n646P267o137j6485
$$ 44382 41133 40797 39776 41699 51293 60889 73472 66603 57475 52146 46500 53767 47630 31145
15698C1145J5395J1589j1394j218p76K545L799q3M158k72k7803j7678Q892j258
$$ 31145 46540 58129 46735 45517 44741 47286 51085 51002 55160 54888 27085 9407 18299 17041
15684A7041q822J0030k437J5125L1907M80j7378m598q684K346J3847O769L988
$$ 17041 8219 18249 15812 30937 62844 63324 45946 41348 32664 35010 48857 55626 59614
15671E9614m60R72j689n026J752p542j4746q665q034r250M25q855j8779J3678
$$ 59614 59154 60126 58437 53411 55163 47621 32875 24210 16176 6926 7351 -1504 -20283 -6605
15657f605R759Q96j4164K591P126k839l705P910J994J3960J4207j788j6098k173
$$ -6605 3154 4050 -10114 -7523 -397 -3236 -6941 969 2963 16923 31130 29342 13244 11071
15643A1071K4197L130J3108M141L364K1202J1746j324j5400j8043l1404j5031
$$ 11071 35268 38398 51506 55647 59011 80213 91959 90635 75235 57192 25788 10757
15631A0757p416j5435j0998o556L778J5906J5634Q394r593k3850p017N675M798
$$ 10757 3341 -12094 -23092 -29648 -25870 -9964 5670 14064 4471 -19379 -26396 -20721 -15923
15618a5923p90J811Q593l150K000K06k986N194j289o746q297n691J3163J1826
$$ -15923 -16713 -14902 -6309 -9459 -7459 -7253 -10239 -5045 -6334 -13080 -21377 -27068 -13905 -2079
15604b079J1240J0529q565P84r503M628P063j1795n242J0351m426j5426R93J4610
$$ -2079 9161 19690 11125 11909 2406 7034 14097 2302 -2940 7411 2985 -12441 -11448 3162
15590C162Q339j4534M237J3193R094n115q751q887l071k552m404N475p74J5591
$$ 3162 11501 -3033 1204 14397 23491 18376 9625 738 -2333 -4885 -9289 -3814 -4588 11003
15576A1003J2009j0636o377o080p841N987R178o116N399n091p738j394k990l142
$$ 11003 23012 12376 5999 -81 -7922 -1935 7243 1127 6526 1435 -6303 -7697 -10687 -13829
15562a3829K069O791J5664O806J1414N523o907K441J416Q985k041p167m242j0327
$$ -13829 -11760 -4969 10695 17501 28915 34438 27531 29972 31388 40373 38332 31165 26923 16596
15548A6596j4298l365L640j3185m431M9R234M010q053M575J5616k029j3752J1985
$$ 16596 2298 -1067 2573 -10612 -15043 -14994 -5760 -1750 -9803 -5228 10388 8359 -5393 6592
15534F592Q028n334k3p300o134K0480P596L687R823j1206j4571J731L324L593
$$ 6592 14620 9286 9263 1963 -4171 16309 23905 27592 37415 26209 11638 13369 16693 20286
15520B0286j3920j909K639k1571N993Q061K502M134n494N683m092j5544k3838
$$ 20286 6366 4457 7096 -14475 -8482 -421 2081 6215 721 6404 2312 -13232 -37070
15507c7070J443J4827P197J304o219N090O913N570O193J4015R55n847l620L197
$$ -37070 -35627 -20800 -13603 -12299 -18518 -13428 -6515 -945 5248 19263 20218 14371 10751 13948
15493A3948m889o435O482K0736Q763J294l534j2923Q00k039N070l77k1865l34
$$ 13948 9059 2624 9106 29842 38605 39899 36365 23442 24242 22203 27273 26896 5031 4697
15479D697N188j2633p849r478P1J7958K1673j005J011L229k949l47J2639M878
$$ 4697 9885 -2748 -10597 -20075 -20004 -2046 19627 18622 19633 22862 19913 19566 32205 37083
15465C7083r798q88R378K38l886k0735j1141L454K8860J208k2379m538j290R476
$$ 37083 27285 26397 35775 36013 32127 11392 251 3705 32565 33773 11394 6856 5566 15042
15451A5042L180J58r177J28O598j4425J528N998k665R286q256q222J2716K032
$$ 15042 18222 18380 9203 9331 15929 1504 3032 9030 6365 15651 7395 -827 11889 13921
15437A3921j452l96K852J1975K4672J9128o59R655K1322J0573J3244K6140M1889
$$ 13921 12469 12073 14925 26900 51572 70700 70041 79696 101018 111591 124835 150975 192864
15424A92864M7911N3427N1945P3626P6280N9924L3202j4476m5158n1726p0761
$$ 192864 240775 294202 346147 419773 496053 555977 589179 574703 529545 477819 407058
15413D07058q0024o0771n3267m0813l7993r991j2908p803j7277n084j4553j6796
$$ 407058 327034 266263 212996 172183 134190 124199 111291 103488 86211 81127 66574 49778
15401D9778n742J726j4887q78R653n591r407q160M920L465J704l443N548L222
$$ 49778 44036 45762 30875 29997 39650 34059 24652 16492 21412 24877 26581 23138 28686 31908
15387C1908P56Q56j7282j7065N26O265P912N825o46j3696q865K571j339r401N869
$$ 31908 32664 33520 16238 -827 -301 5964 13876 19701 19055 5359 -3506 -935 -2274 -11675 -5806
15372e806l90o76L839R421K69n136n527Q65N820J3288n46j975P493K188j9586
$$ -5806 -6196 -6872 -3033 6388 6657 1521 -4006 -3141 2679 15967 15421 13446 20939 23127 3541
15357C541o259j250k912L535J8073J040r636k585p829l842O765J0375N165n214
$$ 3541 -2718 -3968 -6880 -3345 14728 15768 6132 3547 -4282 -8124 -1359 9016 14181 8967
15343H967p050L400J781j2368r550l174q508J948K0246L836N450r083k797J2626
$$ 8967 1917 5317 7098 -5270 -14820 -17994 -26502 -24554 -4308 -472 4978 -4105 -6902 5724
15329E724J0155j1567J587M454p363p11l886n516N44L352O465R805l186j253O22
$$ 5724 15879 4312 5899 10353 2990 2279 -1607 -7123 -6579 -3227 3238 13043 9857 8604 9226
15314I226P987o60j0248m529j08J867q426o390P784p149m351J3937J7727p27r373
$$ 9226 17213 16553 6305 1776 1668 3535 -4891 -11281 -3497 -10646 -14997 -1060 16667 15940 6567
15299F567j4543q191P680J0672R476P932j2367r951Q27N009J018M44n844l439
$$ 6567 -7976 -16167 -8487 2185 11661 19593 7226 -2725 -1898 3111 4129 4573 -1271 -4710
15285d710j39N265R996P764r913O558M78l0834L985K5739O958k059p854k1043
$$ -4710 -4849 416 10412 18176 8263 14821 15299 -15535 -11550 14189 21147 19088 11234 -9809
15271i809o183J7452l67j0736k520J0697O487k856o568j219q896o427J8434M095
$$ -9809 -15992 1460 1093 -9643 -12163 -1466 5021 2165 -4403 -5622 -14518 -20945 -2511 1584
15257A584j7831l417K906M247J2932J0483J3751j240r163q57n860q016p551J33
$$ 1584 -16247 -19664 -16758 -12511 421 10904 24655 23415 14252 13395 7535 -481 -8032 -7899
15243g899J8723J7579l002j1553k4034J42J1519k189l826n731o393N352L300J5147
$$ -7899 10824 28403 25401 13848 -10186 -10044 1475 -714 -4540 -10271 -16664 -11312 -8012 7135
15229G135J1049J0010m03m413O26j1868j5396j1201P508n022P332m163J954R000
$$ 7135 18184 28194 27791 23378 24004 12136 -3260 -14461 -6953 -11975 -4643 -8806 -6852 2148
15215B148R264J812k463j2264k76K116M705K553p478l890O343L836j0478Q48J0378
$$ 2148 11412 13224 10761 -1503 -1779 337 5042 7595 117 -3773 2570 6406 -4072 -3224 7154
15200G154m887k6485j3989J4172L4679J7197L153n377j3992k1155p504P409Q316
$$ 7154 2267 -24218 -38207 -24035 10644 27841 30994 25617 11625 -9530 -17034 -9625 -1309
15187a309L08L358J5520j334j2013j2466o089R17j414p938N464K1495Q904m468
$$ -1309 -1001 2357 17877 16543 4530 -7936 -14025 -13108 -14522 -22460 -16996 4499 13403 8935
15173H935n572j1114n816l973o294j3109L664K2093M277j5030m551L932K895R274
$$ 8935 3363 -7751 -13567 -17540 -23834 -36943 -33279 -11186 -6909 -21939 -26490 -22558 -19663 -10389
15159a0389Q712P145r127l526Q742M070m37O94L106j364O055j2327j88N956J152
$$ -10389 -1677 5468 -3659 -7185 1557 5627 5190 5884 8990 7626 13681 1354 1166 7122 8274
15144H274J204o434l772K747k333p450o398J142o446p038P861j711M166k304j529
$$ 8274 9478 3044 -728 2019 -314 -7764 -14162 -13020 -19466 -26504 -18643 -20354 -16188 -18492 -20021
15129b0021R317P013J0696O085j5339o521J1507j886N680k649l919J1156K541
$$ -20021 -10704 -3691 7005 13090 -2249 -8770 2737 851 6531 3882 -37 11119 13660
15116A3660M952K473j4858p186K715m315M795l20j0467L337N591r129j1945k188
$$ 13660 18612 21085 6227 -959 1756 -2559 2236 1916 -8551 -5214 377 -8752 -20697 -22885
15102b2885R65M563J500n40P802j440q418o837J1781P83n886j112L787J1316N161
$$ -22885 -21920 -17357 -15857 -16397 -8595 -10035 -18453 -25290 -13509 -12726 -18612 -19724 -15937 -4621 540
15087E40K597o345L891k772p499M106J179L854O653o676o275J1012J359J088Q543
$$ 540 3137 -3208 683 -2089 -9588 -5482 -4303 -449 6204 -472 -6747 4265 5624 6712 15255
15072A5255N800p533j5648r235n003k45m536m166N390M969j656L000p188J2104
$$ 15255 21055 13522 -2126 -11361 -16364 -16609 -21145 -25311 -19921 -14952 -16608 -13608 -20796 -8692
15058h692Q604l719p800o084P178o331O778J7730q070o926K106N318k161m535
$$ -8692 -88 -3807 -11607 -17691 -10513 -16844 -10066 7664 -406 -7332 -5226 92 -2069 -6604
15044f604O813L220R584k653n842J0020N43k0167p238J343j2Q872P839j4506Q96
$$ -6604 209 3429 13013 10360 4518 14538 15081 -5086 -12324 -10981 -10993 -2121 5718 -8788 -7892
15029g892J0526O897N387p921q210n301r790p898M138R425l660N895k790J6178
$$ -7892 2634 9531 14918 6997 -1213 -6514 -16304 -24202 -20064 -10639 -14299 -8404 -11194 4984
15015D984J3810j0293j9129k478k996N434j4624J001N463N305n450k841M684Q812
$$ 4984 18794 8501 -10628 -13106 -16102 -10668 -25292 -24291 -18828 -13523 -18973 -21814 -17130 -8318
15001h318J4900L176k491p986k1463m724J3464M697L227K944N104P05j8718j4714
$$ -8318 6582 9758 7267 -719 -22182 -26906 -13442 -8745 -5518 -2574 2530 3235 -15483 -30197
14987c0197o113K4839J7369l026j1698l827p971p019P406J0277Q479l321p402
$$ -30197 -36310 -11471 5898 2872 -8826 -12653 -20624 -27643 -20237 -9960 -1481 -4802 -12204
14974a2204m065J672k450K497J5531P604o644o278O820J1004J673R313O922j3342
$$ -12204 -16269 -14597 -17047 -14550 981 8585 1941 -4337 2483 13487 15160 24473 31395 18053
14960A8053j956k2664q638P370J0888j419K001L502j2896J403J3489r636j5031
$$ 18053 16097 -6567 -15205 -7835 3053 1634 3635 7137 -5759 -4356 9133 -503 -15534
14947a5534k70J5133o041j7568j850Q62J6549J2405l847n50k217M747R822m110
$$ -15534 -15804 -671 -6712 -24280 -26130 -25268 -8719 3686 -161 -711 -2928 1819 11641 7531
14933G531J820L767L536p447o944L633J1233J7469l584j9249l010O61n591o91
$$ 7531 9351 13118 16654 9207 2263 5896 17129 34598 31014 11765 8755 9416 3825 3134
14919C134n301n607q840J0342R210j0878m964k170l942O750K1895Q981l156j163
$$ 3134 -2167 -7774 -16614 -6272 2938 -7940 -12904 -15074 -19016 -12266 9629 18610 15454 14291
14905A4291K077m432j3622p242l609r245J115Q22Q662J1506R03n387J648M651
$$ 14291 16368 11936 -1686 -8928 -12537 -21782 -20667 -19845 -11183 323 1226 -4161 -2513 2138
14891B138j1554p01L37J3607O485J0269k602m419l382l195j4753o957J0512k152
$$ 2138 -9416 -10117 -9780 3827 10312 20581 17979 13560 10178 6983 -7770 -14727 -4215 -6367
14877f367J725P89J0497R466r952l748Q980j4134j4719O826N057p49o244J905
$$ -6367 -4642 -3853 6644 16110 6158 2410 11390 -2744 -17463 -10637 -5580 -6329 -12573 -10668
14863a0668J0853J4165N192j1602j018q743l20J1815q21n306j1587j1100K460
$$ -10668 185 14350 19542 7940 6922 -1821 -2141 9674 8853 3547 -8040 -19140 -16680
14850a6680k234L423P856J1886L654j3384j3071J0205l65l671Q693M023Q45R318
$$ -16680 -18914 -15491 -7635 4251 7905 -5479 -18550 -8345 -8710 -12381 -3688 335 1180 10498
14836A0498j10N143k259o321Q367k365r506K121m19j659K452j473J2445N942m27
$$ 10498 10388 15531 13272 6951 15318 12953 3447 5568 5149 3490 5942 4469 16914 22856 22429
14821B2429o844k515o722Q797J401l317K693J039K307l298j1834j7211j1151J796
$$ 22429 15585 13070 6348 15145 16546 13229 15922 16961 19268 15970 4136 -13075 -24226 -22430
14807b2430L452o863o997L027J1422M896J0096p057L110J6346l456j566l207j749
$$ -22430 -18978 -25841 -32838 -29811 -18389 -13493 -3397 -10454 -7344 9002 5546 3980 773 -976
14793i76k695p546k264O014K321j148r52j823O930L519J691j7443l557L979k996
$$ -976 -3671 -11217 -13481 -7467 -5146 -6294 -7246 -9069 -2139 1380 3071 -14372 -17929 -13950 -16946
14778a6946r341P837p530l166r119J0721J2272j1661J3271J7308o68j1012j6029
$$ -16946 -26287 -18450 -25980 -29146 -38265 -27544 -15272 -26933 -13662 3646 2978 -8034 -24063
14765b4063O759R681n289P06O601Q649J3217J919j4552j2131q379R309J5743Q492
$$ -24063 -17304 -7623 -12912 -12206 -5605 3044 16261 18180 3628 -8503 -16882 -7573 8170 16662
14751A6662M109j2513j2220M253J3774k404J517O600k3105j6148J1042P480j1414
$$ 16662 20771 8258 -3962 291 14065 11661 13178 19778 -3327 -19475 -8433 -953 -12367
14738a2367p061j758m313P326R993O535O681k164J513k189r47n780Q1M124M096
$$ -12367 -19428 -21186 -25499 -18173 -8180 -1645 5036 2872 4385 2196 1249 -4531 -4450 -326 3770
14723C770Q472o386j3661o003K041J2672L057p082k945M001J0840m980j1591q233
$$ 3770 12242 5856 -7805 -13808 -11767 905 3962 -3120 -6065 -2064 8776 3796 -7795 -16028
14709a6028J912J4606M293J812J19l821k907m854o537J4325J1918m427j1613j0136
$$ -16028 -14116 490 4783 6595 6714 2893 -14 -4868 -11405 2920 14838 10411 -1202 -11338
14695a1338Q029n431k616N870j07k191l941N148j195l217M440J7515J0099k059
$$ -11338 -3309 -8740 -11356 -5486 -5593 -7784 -11725 -6577 -7772 -10989 -6549 10966 21065 19006
14681A9006p730r759m310K246k621M630J7082N843k733j1453r796j7308n961l723
$$ 19006 11276 1517 -2793 -547 -3168 1462 18544 24387 21654 10201 405 -16903 -22864 -26587
14667b6587P077Q647J2621J373j3601J598O128J1100K087M236P21o495o725j0048
$$ -26587 -19510 -10863 1758 3131 -10470 -8872 -2744 8356 10443 14679 15400 8905 2180 -7868
14653g868q389j803q089l71K861P122J7854K775J326Q803L319p785k607K951q00
$$ -7868 -16257 -18060 -26149 -26520 -23659 -16537 1317 4092 5418 14221 17540 9755 7148 10099 9299
14638I299M528q000j4180j549r062L136J3053p01q05L443N464j3382r402P207
$$ 9299 13827 5827 -8353 -9902 -18964 -15828 -2775 -3476 -4281 -838 4626 -8756 -18158 -10951
14624a0951Q696P076N736M795J819j3731m072m302n520J2662j0968o385j048Q477
$$ -10951 -2255 4821 10557 15352 17171 3440 -632 -4934 -10454 2208 -8760 -15145 -16193 -7716
14610g716l044Q908L687M344L059n068R28j146k27R794K086l728m45j550J1087
$$ -7716 -10760 -1852 1835 6179 9238 4170 5098 3952 3725 13519 15605 11877 11432 9882 20969
14595B0969J1243l535M61n112k0467j7484j622R345j7536K576K782J746M11Q076
$$ 20969 32212 28677 29138 24026 3559 -13925 -15547 -6202 -23738 -21162 -18380 -16634 -16223 -8147
14581h147j1669L682M689M679J2208J2466k647J042r167r436m313Q963n415J026
$$ -8147 -19816 -16134 -11445 -6766 5442 17908 15261 16303 7136 -2300 -6613 2350 -3065 -2039
14567b039r867o839M289K827q881R124J8029k550o4K029O817k639q125p398R487
$$ -2039 -11906 -18745 -14456 -11629 -20510 -11386 6643 4093 4029 6058 12875 10236 2111 -5287 4200
14552D200Q831j253J453j0031n682j1876J6882Q033l44m392k091k160j4420K679
$$ 4200 13031 11778 13231 3200 -2482 -14358 2524 10557 10213 5821 3730 1570 -12850 -10171
14538a0171o004R319L343m670L222l409m411n423j31oJ8988l186o19p73m216J937
$$ -10171 -16175 -6856 -3513 -8183 -4961 -8370 -12781 -18204 -18335 -18341 647 -2539 -3158 -3931 -8147 -6210
14522f210N783Q181p156q08j0807p997J689J0239P229M344m416J5026n03j7842
$$ -6210 -427 7754 598 -210 -11017 -19014 -17325 -7086 143 4487 71 15097 14594 -3248
14508c248j6574J327p41q579J3183O367J01l853J0925J0335K826r560j6407o856
$$ -3248 -19822 -18495 -19236 -27815 -14632 -8265 -8164 -12017 -1092 9243 12069 2509 -13898 -20754
14494b0754l482M45p326K851L442J0798N515O172j6597J747m113m067J4352Q073
$$ -20754 -24236 -23791 -31117 -28266 -24824 -14026 -8511 -2339 -18936 -17189 -21302 -25369 -11017 -2944
14480b944r1J3072j2342k981j930k42N339j323l536O086Q079L143j7656j343J3710
$$ -2944 -3035 10037 -2305 -5286 -7216 -7458 -2119 -3442 -6978 -892 7187 10330 -7326 -8669 5041
14465E041l787r809Q10R394m66P659p50j3043j0757r135Q750J3641J3116Q2O953
$$ 5041 1254 -8555 -7745 1649 1183 8842 8092 -4951 -15708 -24843 -16093 -2452 10664 10746 17699
14450A7699m221j169j974o877m220k600m968Q034J2196M126j0465j4280l633P02
$$ 17699 13478 12309 10335 3458 -762 -3362 -8330 -296 11900 16026 5561 -8719 -12352 -11650
14436a1650M798J143p438P673J3289N826l69J25L966k742N730l132P680r8m996
$$ -11650 -6852 -5709 -13147 -5474 7815 13641 13272 13397 17363 14621 20351 17219 24899 24801 19805
14421A9805j0525j4217l12Q34K033j416M944o295j2597j0126J1456J3016J7525
$$ 19805 9280 -4937 -5249 -4415 -2382 -3798 1146 -5149 -17746 -27872 -16416 -3400 14125
14408A4125n016j1680M159j0692J227J2580p102k947l684N44P970K795N037j274
$$ 14125 9109 -2571 1588 -9104 -7877 4703 -2399 -5346 -9030 -8486 -516 2279 7316 6042
14394F042o056K602N671n464L463k387q935n350J0627j1677q285j1344N303K1048
$$ 6042 -14 2588 8259 2795 6258 3871 -5064 -10414 213 -11464 -19749 -31093 -25790 -4742
14380d742J8143k383j6024o637m376J79q075J0313J6023K5909j21j547m496j6992
$$ -4742 13401 11018 -5006 -11643 -16019 -15840 -23915 -13602 2421 28330 28209 26662 22166 5174
14366E174q193j1507l056R301Q230L646M412l859J2044J338p298K644o236o811
$$ 5174 -3019 -14526 -17582 -8281 -51 3595 8007 4148 16192 17530 10232 12876 6640 -171
14352a71p44R175K732J1148j238n154o875j4541j4058M322J6145N369r241q343
$$ -171 -915 8260 10992 22140 20902 15748 8873 -5668 -19726 -15404 741 6110 -3131 -11474
14338a1474K38Q127l02L203L719K966j666o147k569m969p082P610J7161j357k437
$$ -11474 -11236 -3109 -3411 -208 3511 6477 4811 -1336 -3905 -8874 -15956 -8346 8815 7458 5021
14323E021m561L344k307j820K375l950M634J5440J693r108l484j6897q548N311
$$ 5021 460 3804 1497 -323 2052 -1898 2736 18176 19869 10761 7277 -9620 -18168 -12857
14309a2857O157K4574J5439j9343j0834K546O136j041m94k109J8m98j2925k3615
$$ -12857 -6700 17874 33313 13970 3136 5682 11818 10777 10283 8174 8192 7694 -5231 -28846
14295b8846k82K782J3709Q391M547k567r855J2399O667k5m002M55J963o985J0368
$$ -28846 -29128 -26346 -12637 -4246 301 -2266 -12121 278 6945 6920 2918 3373 5336 -1649 8719
14280H719M915j3445p870k769L907R658R057j851j1293m228J827n387k239N9M96
$$ 8719 13634 189 -7681 -10450 -6543 3115 12172 10321 -972 -5200 -3373 -8760 -10999 -10940 -10444
14265a0444j0595J8007j259Q046k824M901R69j2984l685J1526j73p27r784K783
$$ -10444 -21039 -3032 -4291 3755 931 5832 6801 -6183 -9868 1658 1485 758 -9026 -6243
14251f243R868K003p168l706j198j443P984K114N098r395j6178K650J1182L136
$$ -6243 3625 5628 -1540 -5246 -6444 -7887 97 2211 7309 -2086 -18264 -15614 -4432 -1296
14237a296J704l287p015m450n510k621J1480J885n499j733j15R83q638j832J506
$$ -1296 408 -2879 -9894 -14344 -19854 -22475 -10995 -9110 -14609 -16342 -16457 -15474 -24112 -25944 -24438
14222b4438m69J4328Q945n61N503j2657j3190l90l181n18J818J3818K680p178
$$ -24438 -24907 -10579 -1634 -2195 3308 -9349 -22539 -22929 -26110 -26628 -24810 -10992 -8312 -15490
14208a5490R364M335k523m801o152P337M520R187J4055l536j0327j6428p586O947
$$ -15490 -6126 -1791 -4314 -9115 -15267 -7930 -3410 5777 19832 16296 5969 -10459 -18045 -11098
14194a1098J2819P342j0758j0553K2504J6084l480M61o537r894r120K591m617
$$ -11098 1721 9063 -1695 -12248 10256 26340 22860 23321 16784 6890 -2230 361 -4256
14181d256j357k305O749O365J5082m809l99k551j2534j3255j6801M471J9324O784
$$ -4256 -5613 -7918 -1169 5196 20278 15469 15070 12519 -15 -13270 -30071 -25600 -6276 508
14167E08o36J427O870k39Q554q921j5693j4023N581M866q109J1835mN044N082
$$ 508 -128 1299 8169 7930 16484 7563 -8130 -22153 -16572 -11706 -19815 -7980 -7984 -2940 2142
14152B142L582L796m538q726M519l447n135J3478O129o429M171N409j8265j1275
$$ 2142 5724 9520 4982 -3744 775 -2672 -7807 5671 11800 5371 9542 14951 -3314 -14589
14138a4589J1484j814L662L43J495o819q335L692j47P421n702J682L723Q699N227
$$ -14589 -3105 -4919 -1257 -914 581 -6238 -14573 -10881 -11028 -3607 -9309 -7627 -3904 4795 10022
14123A0022j1077m924M074m321j0650K095J8373O247j2610p535j0645k565K0654
$$ 10022 -1055 -5979 -1905 -6226 -16876 -14781 3592 9839 -2771 -10306 -20951 -23516 -2862
14110b862J2496L487j7617k3697j1752k900R586J8755J0407J1848l126o340J699
$$ -2862 9634 13121 -4496 -28193 -39945 -42845 -33259 -14504 -4097 7751 4625 -1715 -16
14097a6j654J930K894p239O361p01j1160k0435l399J0597O776Q187m233R052K760
$$ -16 -1670 260 3154 -4085 2276 1575 -9585 -30020 -33419 -22822 -16046 -7859 -12092 -3040 -280
14082b80J231j032J0366Q258o876k416j3546p818J4536j796o763k408J1639Q776
$$ -280 951 -81 10285 18543 11667 9251 -4295 -12113 2423 627 -6136 -8544 3095 11871
14068A1871n508j0505N471q726q63O626j5028N186R234j842P124R577m340r272
$$ 11871 6363 -4142 1329 -7397 -8260 -1634 -16662 -11476 -2242 -4084 3040 12617 8277 -995
14054i95N195p671j031j3412l73K893l693J5363J6889j1694o5K853l905J0355
$$ -995 4200 -3471 -4502 -17914 -18287 -15394 -19087 -3724 13165 1471 1406 4259 354 10709
14040A0709J5046j4886p988k227L622J4032o671p624m772M166P602O30q235j962
$$ 10709 25755 10869 2881 654 4276 18308 11637 4013 -759 3407 11009 11639 3404 1442
14026A442p123p52L099Q477J0733N006M118j5545k0879J136R154j982j0978o581
$$ 1442 -5681 -6433 -3334 5143 15876 20882 25000 9455 -11424 -10288 -1134 -3116 -14094 -20675
14012b0675K6516J1073o704o61r037o421K022o325L639r39J3605k193j5286K456
$$ -20675 5841 16914 10210 9549 512 -5909 -3887 -10212 -6573 -7512 6093 3900 -11386 -8930
13998h930M377L590P165j706q804M44O261k101N301R372p896k2710j1633Q798
$$ -8930 -4553 -963 6202 4496 -4308 -3864 2397 296 5597 14969 7073 -15637 -27270 -18472
13984a8472J9j296J326P650K906j0153P497K212o873R022J772J1026k14J570J0458
$$ -18472 -18453 -19749 -18423 -10773 -7867 -18020 -10523 -8311 -15184 -6162 -4390 6636 6422 7992 18450
13969A8450J973p500j0327m953L230q776O05J166K975j550J3197k097j285N925
$$ 18450 20423 12923 2596 -2357 873 -7903 -7298 -6132 -3157 -4707 8490 6393 5108 11033
13955A1033q000l315O927p768o876J820J1524k741K902l573P362Q419m164K688
$$ 11033 3033 -282 6645 -1123 -7999 -6179 5345 2604 5506 1933 9295 17714 13550 16238
13941A6238O076j306N762N436j6534j2538M192O396l453j309n94k172N86N516
$$ 16238 22314 21008 26770 32206 15672 3134 7326 13722 10269 8960 8366 6194 6780 12296
13927A2296l140O148L175q298p935j0665J952J8315J2646K320j2710k743P010
$$ 12296 9156 15304 18479 10181 2246 -8419 -6467 11848 24494 26814 14104 11361 18371
13914A8371J583j1689p683K933j2413k701l211K510Q760O52l871o374Q634m366
$$ 18371 19954 8265 582 3515 -8898 -11599 -14810 -12300 -3540 -2888 -6759 -13133 -4499 -8865
13900h865j498J4604O835Q292K417j11l419N498j0224J2816o604k2215q576K125
$$ -8865 -10363 4241 11076 19368 21785 21674 18255 23753 13529 26345 19741 -2474 -11050 -8925
13886h925J2499J6129l208N98k2758o288Q442R303m107J0263J2461l066p441M867
$$ -8925 3574 19703 16495 17093 -5665 -11953 -3511 5792 1685 11948 24409 21343 13902 18769
13872A8769J0468l763r644N19L827O679L97J4108j7478j3419N498L872N33j6001
$$ 18769 29237 25474 15830 16349 20176 26855 27252 41360 23882 10463 15961 19833 20366 4365
13858D365k0098l931P882L673M121o94k069J717K453r862l329J1536M99K965j725
$$ 4365 -15733 -19664 -11782 -8109 -3988 -4682 -6751 -5034 -2581 -12443 -15772 -4236 -3737 -772 -2497
13843b497k090K97P826L736R10l652M709n685p321J0257L552j4279n787K556l02
$$ -2497 -4587 -4290 3536 7272 8182 4530 9239 3554 -3767 6490 10042 -4237 -10024 -7468 -7770
13828g770L779J953L237Q088J346K414j3946j0996q37P438R530P38k377R382o99
$$ -7770 -3991 -2038 1199 9287 10633 13047 -899 -11895 -12732 -5294 4236 4974 2597 11979 11280
13813A1280J0695j456O442k861j8438m782m30j8881k229K585N838J1572L663K662
$$ 11280 21975 20519 26961 24100 5662 880 450 -18431 -20660 -18075 -12237 -665 2998 5660
13799E660J0419j3028n469l240m618P790r07K052O506r250j267L777j0405Q85
$$ 5660 16079 3051 -2418 -5658 -10276 -2486 -3393 -1341 5165 -4085 -5352 -1575 -11980 -11095
13785a1095J4094Q243o325p574J335K276j797k547r050L104o56j1648K162K433
$$ -11095 2999 11242 4917 -2657 -1322 954 -843 -3390 -12440 -9336 -9992 -21640 -19478 -17045
13771a7045P889P441R218J0230M857j655N356L367o084j5308r345O154J1090L775
$$ -17045 -9156 -1715 7503 17733 22590 20935 26291 29658 23574 8266 -1079 5075 16165 19940
13757A9940L074M235M62j9923j3677L158K899k202R246K709j4649P760M501o11
$$ 19940 23014 27249 27711 7788 -5889 -2731 168 -2034 7212 9921 -4728 3032 7533 6922
13743F922O792q907m950n961P232j530M160J5372n004j3103R730J190m248r798
$$ 6922 13714 4807 -143 -6104 1128 -402 3758 19130 14126 1023 10753 11943 7695 -2103
13729b103O942K334q84K894K830q098o243j20J000k481K1268N975j691P97q796
$$ -2103 4839 7173 6289 9183 12013 3915 -2328 -2448 -1448 -3929 17339 23314 21623 22420 13624
13714A3624k364q618L337k316j672j448K648J6102N594p929N948K2085m249j3313
$$ 13624 11260 2642 5979 3663 1991 543 3191 19293 24887 16958 22906 44991 40742 27429
13700B7429j7654n306J2133k345p074j2472j7247Q360L345L690J0214J77n170
$$ 27429 9775 4469 16602 14257 7183 -5289 -22536 -14176 -10831 -7141 3073 3250 -1920
13687a920m676J2133l474L667R072N286K730k980p136o936R82M565o285j2263
$$ -1920 -6596 5537 2063 5730 14802 20088 22818 19838 12702 5766 6748 11313 5028 -7235
13673g235l618p78O557k393N45M574J3969j561j527M711M762O468M714k055j0381
$$ -7235 -10853 -11631 -5074 -7467 -6922 -2348 11621 10060 8533 13244 18006 24474 29188 27133 16752
13658A6752K221R282j5075q044n40J5067M597k0771O920j174r340p849O438l292
$$ 16752 18973 28255 13180 5136 4596 19663 24260 3489 10409 9235 -105 -7954 -1516 -4808
13644d808l57J2494P567k815m530j2428P883J1415o46P35k436j271K410L34r529
$$ -4808 -5165 7329 14896 12081 7551 -4877 3006 14421 13775 14510 12074 10803 13213 13547 4018
13629D018l440L824Q23r127k430o867K184K1323o116q391N788J7571J0806l646
$$ 4018 578 4402 5225 -3902 -6332 -13199 -11015 10308 4192 -4199 1589 19160 29966 26320
13615B6320j0269J4666l740j6384p958K19P414R017j322J672R260L033j3835j8954
$$ 26320 16051 30717 26977 10593 2635 2854 10268 19285 17963 19635 28895 31928 18093 -861
13601h61r255r61k464j2166K711K1234K1599R515j5505n427M629j4836K976Q554
$$ -861 -10116 -11077 -13541 -25707 -22996 -1762 19837 29352 13847 8420 13049 -1787 1189 9743
13587I743l42J0519K51j4556j5343R674J7558k384p403n167j9638j2138J3932
$$ 9743 9401 19920 20171 5615 -9728 -54 17504 15120 7717 2550 -17088 -29226 -15294
13574a5294P209M152M606j2086J219l894p864j4806M36O982R725P098L925l824
$$ -15294 -8085 -3933 673 -11413 -10194 -14088 -21952 -36758 -36322 -29340 -19615 -12517 -8592 -12416
13560a2416K069J6289M728l409K661k696k586l72J5346J8394k1068j9973j475
$$ -12416 -10347 5942 10670 7261 9922 7226 4640 4268 19614 38008 16940 -3033 -4508
13547d508J421L39j4351j1042J3821J5503j929Q940R569Q309k204j7527J2839
$$ -4508 -3087 -2748 -17099 -28141 -14320 1183 -746 8194 17763 26072 23868 6341 19180
13534A9180O302n381o125r319q008m959J0312J2530o269n300m034m343J1985j0285
$$ 19180 25482 20101 13976 4657 -3351 -8310 2002 14532 8263 2963 -1071 -5414 6571 -3714
13520c714p032j554O108P370p263R39M673N013J6979l241k621n003q68K248R839
$$ -3714 -10746 -12300 -6192 1178 -6085 -5146 -473 4540 21519 18278 15657 10654 9786 12034 21873
13505B1873M62j7218K531N791P259n751m224j988L997M50R394k684o583o876O522
$$ 21873 22335 5117 7648 13439 20698 14947 10723 8735 12732 13182 22576 19892 13309 6433 12955
13490A2955P025L273j6810k77J342J789J7203m947o076m230o014l725J3406O267
$$ 12955 19980 23253 6443 6166 7508 9297 26500 21553 15477 11247 5233 1508 14914 21181
13476B1181J371J1128m094J81j56k3603j5325K98M823j676r790O301M226J3129
$$ 21181 22552 33680 29586 29767 29611 6008 -9317 -9019 -4196 -5872 -15662 -9361 -5135 7994
13462G994J2894j1511p639P31N754r656l057M712J2807p535l173J5871m729o492
$$ 7994 20888 9377 1738 2469 8223 -1433 -4490 222 13029 5494 2321 18192 13463 6971
13448F971Q696o377k3225L49O971J0820J1089L247j7688m248J045J7805O20q188
$$ 6971 15667 9290 -13935 -13586 -6615 4205 15294 18541 853 -3395 -2350 15455 16075 7887
13434G887j5416k1001l330Q643J2857P071M817J2311J4376r199R62j710j4728
$$ 7887 -7529 -28530 -31860 -23217 -10360 -3289 1528 13839 28215 19016 19978 18268 3540
13421C540o532J1421Q939j0429q073P621m264o247j14P651Q403Q512m120O358
$$ 3540 -2992 8429 17368 6939 -1134 6487 2223 -4024 -4138 3513 11916 20428 16308 22666
13407B2666J2331j2974j2885R30p17j0002O259L280r370p523R54O806n271o273
$$ 22666 34997 22023 9138 10068 9351 -651 5608 8888 -482 -8005 -7051 -245 -5516 -11789
13393a1789P921K210m006O40J5925J6684M049j0349n292p58N233L437j700k301
$$ -11789 -3868 -1658 -5664 -5024 10901 27585 31634 21285 15993 15235 20468 23905 22205 19904
13379A9904j73o941K663q046Q358J4636j56J607P181K945j0750r167j3920q580
$$ 19904 19731 12790 15453 7407 15765 30401 30245 31852 39033 41978 31228 22061 8141 -439
13365d39Q015J9503Q891j2172j5489o331R635k911j6229l62J0253J3598j94k069
$$ -439 7576 27079 35970 23798 8309 1978 11613 8702 -7527 -7889 2364 15962 15768 13699
13351A3699l506r91m783k2N301j2131O493K1296Q728j1166j3985j19m920L662
$$ 13699 10193 9202 4419 4397 9698 -2433 4060 25356 34084 22918 8933 8814 3894 7556
13337G556k402l967q02m69l544l727Q839R260J1187j5752m287P370L761l462N39
$$ 7556 5154 1187 385 -84 -3628 -7355 1484 10744 21931 6179 1892 9262 13023 9561 10100
13322A0100N715l60m214j0128O307L25r771M027M386m497J1518R911M510M821
$$ 10100 15815 15455 11241 1113 7420 7745 -2026 2001 6387 1890 13408 23319 27829 32650
13308C2650N127J93J728q472r657m819J621Kq21j1712j0978J5969O072n129j1348
$$ 32650 37777 37970 39698 31226 21569 16750 18371 18373 17552 5840 -5138 10831 16903 11774 426
13293D26J870j0432l026J3994J505o136Q05K688J2483Q910L483o27K0411J235
$$ 426 2296 -8136 -11162 2832 4337 -1799 -994 1694 14177 23087 26570 25943 46354 47589
13279D7589j2759n066n142p342M908N33j3092j6073J3386J951r191R415k1k307
$$ 47589 34830 29764 24622 17280 22188 22721 9629 -6444 6942 8893 -298 9117 9096 6789
13265F789j087j656m326p679R926K6791K944m361O004Q463r199j0749j6254P581
$$ 6789 5702 4046 -280 -7959 1967 28758 31702 27341 33345 41808 32609 21860 5606 13187
13251A3187O053k753j2101o791L530j612p514J5510K1906j028J863L243k569n362
$$ 13187 19240 16487 4386 -2405 1125 -487 -8001 7509 29415 28387 30250 33493 30924 25562
13237B5562p486l810m868M8n592N107K343m087Q796m978M392J2011O446l463j3783
$$ 25562 18076 14266 9398 9446 3854 8961 11304 7217 16013 11035 15427 27438 33884 30421 16638
13222A6638j3621m465N022L338m238j0020N922R53Q129J5381r505j6933j5528
$$ 16638 3017 -1448 3574 6912 2674 -7346 -1424 -471 7658 23039 13534 -3399 -18927
13209a8927J159J0411P16J7176M682J0473l043m871l375J164q991n976Q718J8711
$$ -18927 -17768 -7357 -6641 10535 15217 25690 22647 17776 14401 15565 6574 598 9316 28027
13195B8027J2826j6939j5063N101J2298j2202n597O941J0219o897k2682l938J3781
$$ 28027 40853 23914 8851 13952 26250 14048 8451 15392 25611 18714 -3968 -7906 5875
13182E875J232j1831k460j0274l32J8835J3520P32N974Q535J694n488n342O187
$$ 5875 7107 -4724 -7184 -17458 -17790 1045 14565 15297 21271 29806 31500 26012 20670 26857
13168B6857P709q74j7610p747q110Q44m981m141r16J4046K557J2412P090j3428
$$ 26857 34566 33692 16082 8335 225 1069 -3912 -8053 -8969 5077 7634 20046 27136 13708
13154A3708M545k056J254J2014j311M56k399l341J428O343K571r615k635J5378
$$ 13708 18253 16197 17451 29465 28154 28610 26211 22870 24298 30641 33212 23597 20962 36340
13140C6340J1387m824j8869p853j2060o191J4341J1292O692p650j0478p553K858
$$ 36340 47727 42903 24034 16181 4121 -2070 12271 23563 30255 22605 12127 4574 7432
13127G432K0033J0757j905p001n456r36O391P624O188R10P975j4279j2680o106
$$ 7432 27465 38222 36317 29316 23860 22924 29315 36939 43127 44037 52012 37733 25053 18947
13113A8947m468K863Q278M378j7063N407m406n215p525M338l404Q450J3405j4891
$$ 18947 14479 17342 25620 29998 12935 18342 13936 8721 1196 5534 2130 10580 23985 9094
13099I094J770N64l968q718J426k458j534j099O141K7436J768j71p286j3720o255
$$ 9094 10864 11428 7460 -1258 168 -2290 -3824 -4923 1218 28654 30422 30251 22965 9245 2990
13084B990L198m614J8275K769N696Q965K17q510n43l700J0437K168p049j3574
$$ 2990 6188 1574 19849 22618 28314 37279 37496 28986 28443 24743 35180 37348 30299 16725
13070A6725k398k238m578q363L720J1733J1375N884j642R345Q474j1955r876M569
$$ 16725 14327 12089 7511 -852 2868 14601 25976 31860 30218 39563 48037 36082 26206 30775
13056C0775J0152O67n59r982j452l436K654R024k677l34L03j6571j944O84K893
$$ 30775 40927 41594 41035 31053 29601 26165 28819 37843 35166 34832 35135 18564 16620 17304 20197
13041B0197N19k182R33j132j797R123O134J1640j3339m463Q279N075j0518j2766
$$ 20197 20716 18534 19467 18335 16538 25661 31795 43435 30096 25633 33912 38987 28469 15703
13027A5703l754J6360k704j0335L608J807j4391j2300J5672J5504J906K802l194
$$ 15703 11949 28309 25605 15270 18878 20685 6294 -6006 9666 25170 27076 29878 26684
13014B6684j0063q985R674k672p959R891J6566n177p213N977J4380l464q848j628
$$ 26684 16621 7636 17310 14638 6679 16570 33136 27959 20746 26723 41103 37639 28791 27163
13000B7163K055j447Q388m506q674R22r665M389p462l36J4396J3467P029K950
$$ 27163 29218 27771 36159 31653 22979 23901 14236 18625 11163 10827 25223 38690 45719 48669
12986D8669r95j2351j4350m025L104n659k152N700J060M373P499J821M462M502
$$ 48669 47674 35323 20973 16948 20052 14393 12241 17941 19001 23374 30873 32694 37156 41658
12972D1658j1778L65L328j1870J697L85j0322J2019N555M74J4546k93l859p905
$$ 41658 29880 30245 33573 21703 23400 23785 13463 25482 31037 31511 46057 45764 41905 34000
12958C4000O11J916J1200K251K254j768r188q039J0587J824r804j751J6141m30
$$ 34000 34611 36527 47727 49978 52232 50464 41276 33237 43824 45648 35844 34093 50234 49804
12944D9804j1160j7782k189J5514J342k931Q217R04r593o106q649J442J5091M201
$$ 49804 38644 20862 18673 34187 35529 32598 40815 41719 32126 26020 17371 18813 33904 38105
12930C8105k571p77O591j1229M96j547K679M665o516q442J0495n004o579O329
$$ 38105 35534 34757 41348 30119 30615 29068 31747 36412 29896 21454 31949 26945 20366 26695
12916B6695L690L966q248l163m534K488q683M06J7289J0064p072j4646M858J2118
$$ 26695 30385 34351 26103 22940 18406 20894 12211 12617 29906 39970 32898 18252 23110 35228
12902C5228Q373M620K007p131l610L455J3202J0253Q135k314j2453j2555o149
$$ 35228 43601 48221 50228 43097 39487 42942 56144 66397 74532 72218 59765 47210 41061
12889D1061m559p91l77j3670J2357J7678j90j194O030r081j7374K25O101r61o02
$$ 41061 36502 35711 35334 21664 34021 51699 51509 50315 56345 47264 29890 30115 36216 35255 34653
12874C4653J204O610N620N64j85q893q153j219n081q994k160k550J1297J6435
$$ 34653 35857 42467 48087 48651 48466 39573 31420 30201 25120 16126 13966 11416 22713 39148
12860C9148K244j1214k563J0004M394o559q097Q651J2578n57j569j0835j4619
$$ 39148 41392 30178 27615 37619 42013 35454 27357 36008 48586 48029 46460 35625 21006
12847B1006l973J1731n232J797L892J0611K599J0624q28M831j9476j1716m673
$$ 21006 17033 28764 23532 25329 29221 39832 42431 53055 52227 57058 37582 25866 21193
12834B1193P326P840J495o795J144j574J851l085J8757L999j675M705p684k0224
$$ 21193 28519 36359 37854 31059 32203 30629 32480 29395 48152 52151 50476 55181 47497 27273
12820B7273j1907K0361Q967J447N147J1418J836k909o0m298j0228L811J0239q022
$$ 27273 15366 35727 44694 46141 51288 62706 64542 61633 61573 57275 47047 50858 61097 53075
12806E3075l829K196Q430l583j2075L669j9709j1778J5922R596K8200Q394n379
$$ 53075 49246 51442 59872 56289 44214 47883 28174 16396 32318 41914 70114 78508 73129
12793G3129j4469j1370j0115K490M643k993j2796q890J023Q507J5583N623m77
$$ 73129 58660 47290 37175 39665 44308 41315 28519 19629 20652 29159 44742 50365 49888
12780D9888j315k565o496O298L956N19J3910p749k798k83o387N58J2003K043j0396
$$ 49888 48573 46008 39512 45810 49766 50285 64195 56446 53648 53365 46978 47536 59539 61582 51186
12765E1186r29o224O082O82J739O750j218N120O425j0864p099M492Q904n914p706
$$ 51186 50257 44033 50115 50797 52536 59286 58068 63188 69613 58749 51650 56142 65046 59132 51426
12750E1426n693p062N448J1222J2067j6694L314P012k994j0011Q476J3019o210
$$ 51426 45733 38671 44119 55341 67408 50714 54028 61040 58046 48035 56511 69530 63320
12737F3320j4269o448J52J3940L443R820L889j1836N378N875R112N426M267p56
$$ 63320 49051 42603 42755 56695 60138 69958 73847 62011 67389 73264 82376 87802 92069 91313
12723I1313j1469n414O896P977Q531J0338P209q126j1166n553j611J5309q505
$$ 91313 79844 74430 81326 89303 97834 108172 115381 107255 96089 90536 88925 104234 95729
12710I5729n482p456J158q981J673o08N552K641j2969O91R298n228q811j4007
$$ 95729 90247 82791 83949 74968 76641 76033 81585 84226 71257 71948 81246 76018 67207 53200
12696E3200q224L662l508M037O982m83P57L268m206j841J9462J5310K669n543
$$ 53200 44976 48638 45130 49167 56149 55666 56423 59691 55485 53644 73106 88416 91085 85542
12682H5542J100J7792J6458J4106M988M850J8741J755l547n6m016j719j635K0585
$$ 85542 86642 104434 120892 134998 139986 144836 163577 165332 161785 161729 157713 155994 154359 174944
12668A74944K0950J7650J4279K4084K1724K8022M6591P1535P2116R7120J23229
$$ 174944 195894 213544 227823 251907 273631 301653 348244 419779 491895 589015 712244
12657G12244J67547K34916K94963L11654K54207Q9950j09593k47121l02000k76160
$$ 712244 879791 1114707 1409670 1721324 1975531 2065481 1955888 1708767 1406767 1130607
12647A130607k17863j69710j02240r2745q3403o3786m2544m1842m2206l5286m4979
$$ 1130607 912744 743034 640794 548049 464646 400860 358316 316474 274268 238982 194003
12636A94003k4525p341J397j2011j1458p176j2714j6189j30L654J1324R087p316
$$ 194003 169478 162137 163534 151523 140065 132889 120175 103986 103856 107510 118834 127921 120605
12623A20605Q210q65R63N92O756l9j3341q64j716j1107q387R989N270m748l670
$$ 120605 128815 127950 128913 129505 136261 136222 122881 122017 120301 109194 100807 110796 116066 111318 107648
12608A07648J0441K067q085P215j615k332j4591k0174N401j020O13M157n492j0787
$$ 107648 118089 120156 112071 119286 117671 115339 100748 80574 85975 84955 85568 89725 84233 73446
12594G3446J1024J3938J070l651n824n356n562J320l566J1047K0778k908j584
$$ 73446 84470 98408 99478 95827 90003 84647 79085 80405 76839 87886 108664 105756 104172
12581A04172J041O076M464J806N135R957j2054j7553j0134L932R057N760l897
$$ 104172 105213 111289 115753 117559 122694 132651 120597 103044 92910 96842 105899 111659 107762
12568A07762l704Q93p901K18L603m5M474J3954L80K252O448k439J111l113q948
$$ 107762 104058 104951 97050 97268 100871 100826 105300 119254 119634 121886 128334 125895 127006 123893 114945
12553A14945M353l75P342q56l650M459J9685N571o289P469J420J0913k461k642
$$ 114945 119298 118923 126265 125409 121759 126218 145903 151474 145185 152654 154074 164987 162526 159884
12539A59884P729J6240J2857J4354K630p03J1454J0221J1509K2720L7735L2709
$$ 159884 167613 183853 196710 211064 213694 212991 224445 234666 246175 268895 306630 339339
12527C39339L3347L6208M3272K7596m481m5380q5609q6661o6574m6316m483m188
$$ 339339 372686 408894 452166 479762 475281 429901 344292 257631 191057 144741 140258 136070
12515A36070J7936K8155O036j7707k4017k9363L763j040K215J6696K7033J3527
$$ 136070 154006 182161 188197 170490 146473 117110 120873 119833 122048 138744 165777 179304
12503A79304k48J6427M034J861L826l085K995m235n66k359J5853j2825k2064j7957
$$ 179304 179056 195483 199517 201378 205204 202119 205114 200879 200313 197954 213807 200982 178918 160961
12489A60961k0690n594M59k18p511q629q732J4731J2551J5245Q968K990O930J0013
$$ 160961 140271 134677 135136 134918 127407 118778 110046 124777 137328 152573 161541 164531 171461 181474
12475A81474J9673Q661K7840L4528L3311M0419L8476K8898J3674M867j7973k2023
$$ 181474 201147 209808 237648 272176 305487 345906 384382 413280 426954 431821 413848 391825
12463C91825j9124m4758m4034k7997k5477o994j5960j1090m380j8427j2224j3033
$$ 391825 372701 327943 283909 255912 230435 223441 207481 196391 192011 173584 161360 148327
12451A48327J279r111j6783k280P564N324J97J4766R498L126J9524K9192K5328
$$ 148327 149606 140495 123712 121432 128996 134320 134517 149283 158781 161907 181431 210623 235951
12438B35951L373o773J1930L874j6395j3274q362m239j6145n054j2379P320o5
$$ 235951 239324 232551 244481 248355 231960 218686 210324 206085 189940 184886 172507 179827 179762
12425A79762j7314o876r312L849P751r561j0470J1787K0618M1662J7788J1639
$$ 179762 162448 155572 146260 150109 157860 148299 137829 149616 170234 211896 229684 241323
12413B41323K0945J6619J442k0896k9067j6505j9161j6137m736K463J8283J2635
$$ 241323 262268 278887 280329 259433 230366 213861 194700 178563 173827 176290 194573 207208
12401B07208K2447K3502M705m226J0501m366l398J5034J4247p453q513m022m067
$$ 207208 229655 253157 257862 253636 264137 259771 256373 271407 285654 278201 269688 265666 261599
12388B61599j1438J019J23n111p605j4249q031J6419O21j111j181J8308Q293K799
$$ 261599 250161 251180 251303 246192 238587 224338 216307 232726 233347 232236 231055 249363 257656 260455
12374B60455J658R45j6757k3109j1268n599j8189P503M5558O5000N5340N2470
$$ 260455 262113 263058 246301 223192 211924 206325 188136 195639 241197 306197 361537 414007
12362D14007N6840K1322K6040K7189J0373k8615j4537j4825j5614R323n085k227
$$ 414007 470847 492169 518209 545398 555771 527156 512619 497794 482180 491503 486418 484191
12350D84191o328j122P719J4148J6002J2278R850Q299J0641k0918m592N306J3446
$$ 484191 477863 476741 484460 498608 514610 526888 536738 545037 555678 534760 530168 535474 548920
12337E48920K2211K2025K6447L2337J0947J8260J8661O194p928k627J297J619
$$ 548920 571131 593156 619603 651940 662887 681147 699808 706002 698074 695447 696744 698363
12325F98363J4467J5350J7814k717J390N713J7976M398K600m651o265L956J776
$$ 698363 712830 728180 745994 743277 744667 750380 768356 772754 775354 770703 764438 768394 770170
12312G70170J3199J1767K0022J8568J7222J9920K0672K8225J4972O005K1457K3716
$$ 770170 783369 795136 815158 833726 850948 870868 891540 919765 934737 940742 962199 985915
12300I85915O462K5959K0424J6550L5681K0675J0202L1273J4008J0720J2572K1397
$$ 985915 992377 1018336 1038760 1055310 1090991 1111666 1121868 1153141 1167149 1177869 1190441 1211838
12288A211838L1492K1644K7272L0643K3090K3642L5035L4888K7600N0833M3359
$$ 1211838 1243330 1264974 1292246 1322889 1345979 1369621 1404656 1439544 1467144 1517977 1561336
12277A561336K3065M0873M4882N3555N5105O0881N7347P8919R0983P4095Q1218
$$ 1561336 1584401 1625274 1670156 1723711 1778816 1839697 1897044 1975963 2066946 2141041 2222259
12266B222259J02919Q0975P7100J06129J17721J11864J25966J24092R9739J02293
$$ 2222259 2325178 2406153 2483253 2589382 2707103 2818967 2944933 3069025 3168764 3271057
12256C271057J19356J37436J46290J52719J68860J97556K08599K26298K63240
$$ 3271057 3390413 3527849 3674139 3826858 3995718 4193274 4401873 4628171 4891411
12247D891411K99626L13211L42061L69180M14628M51047M73265N33125O15082
$$ 4891411 5191037 5504248 5846309 6215489 6630117 7081164 7554429 8087554 8702636
12238H702636P23650Q24579R11537R93158J097130J235824J457442J738939K086461
$$ 8702636 9426286 10250865 11162402 12155560 13252690 14488514 15945956 17684895 19771356
12229A9771356K501866L030348L731560M626438N780266P207041Q959680J1160331
$$ 19771356 22273222 25303570 29035130 33661568 39441834 46648875 55608555 66768886
12221F6768886J4253966J8919671K5944093L5894734M8443896O1291062O7941927
$$ 66768886 81022852 99942523 125886616 161781350 210225246 271516308 339458235
12214C39458235N7267252K3023186k3775238n9303682o9809392o1043444m6505397
$$ 339458235 396725487 419748673 395973435 336669753 266860361 205816917 159311520
12207A59311520l3718745k4244434j7709747j3444069j0730571q838449p318994
$$ 159311520 125592775 101348341 83638594 70194525 59463954 50625505 43306511
12200D3306511n978705m887154m019839l319761k766480k321418j987679j728756
$$ 43306511 37327806 32440652 28420813 25101052 22334572 20013154 18025475 16296719
12192A6296719j499379j294977j106652r74410q81678q01655p09075o38488n73327
$$ 16296719 14797340 13502363 12395711 11421301 10539623 9737968 9028893 8390405 7817078
12183G817078n23203m50065m18255l59804l16885k91718k70469k52315k36825
$$ 7817078 7293875 6843810 6425555 6065751 5748866 5457148 5186679 4934364 4697539
12174D697539k16531k01581j89806j62524j60713j60763j53120j33474j18466
$$ 4697539 4481008 4279427 4089621 3927097 3766384 3605621 3452501 3319027 3200561
12165C200561j18539j04474r2038q8623p5949o5240o2344o4100l9378n8637o6627
$$ 3200561 3082022 2977548 2885510 2796887 2720938 2655698 2593354 2529254 2489876 2431239 2364612
12154B364612n5710l2929n1908n8322m4289m0098m5168m8892m3373l7464l1354
$$ 2364612 2308902 2275973 2224065 2165743 2121454 2081356 2036188 1987296 1943923 1906459 1875105
12143A875105j6611k0726l0889k3755k8503k4486l0526k8743l2368l4389j7881
$$ 1875105 1858494 1837768 1806879 1783124 1754621 1730135 1699609 1670866 1638498 1604109 1586228
12132A586228j848n67j517q304M338m42O221r110k1473k963m58O626J9201J3666
$$ 1586228 1584380 1583813 1582296 1573992 1578330 1577888 1584109 1574999 1553526 1550563 1550105 1556731 1575932 1589598
12118A589598K150K934l208q961j3284j662K3471P114o495r942P634J6485l28
$$ 1589598 1591748 1594682 1591474 1582513 1569229 1567567 1591038 1598152 1591657 1581715 1589349 1605834 1605506
12105A605506j3580J4404J5680K1626J9821O354J4582K8720J9038K0869L8418
$$ 1605506 1591926 1606330 1622010 1643636 1663457 1669811 1684393 1713113 1732151 1753020 1791438
12094A791438L1860M5116M8786P5214J04186J16312J03765N9977J7954J719p368
$$ 1791438 1823298 1868414 1917200 1992414 2096600 2212912 2316677 2376654 2394608 2396327 2388959
12083B388959N97J1878J6204K0446K8778M1869L8557L3175K4619K5662L5061L1625
$$ 2388959 2389556 2401434 2417638 2438084 2466862 2508731 2547288 2580463 2605082 2630744 2665805 2697430
12071B697430J8488J8888M1060M1329N2749O1641P2179Q2326R5538J06300J14326
$$ 2697430 2715918 2734806 2775866 2817195 2869944 2931585 3003764 3086090 3181628 3287928 3402254
12060C402254J19015J04324Q8289O7184N6255M9889O2739O9570O3825O4330Q3869
$$ 3402254 3521269 3625593 3713882 3781066 3837321 3887210 3949949 4019519 4083344 4147674 4231543
12049D231543R5354J02633Q7794Q1586Q2933Q4483Q5545O8866P4738Q6745P3055
$$ 4231543 4326897 4429530 4517324 4598910 4681843 4766326 4851871 4920737 4995475 5082220 5155275
12038E155275N2486O8608O9270N0020N8772N0438N5643O1946N0755L3605M0520
$$ 5155275 5207761 5276369 5345639 5395659 5454431 5504869 5560512 5622458 5673213 5706818 5747338
12027E747338N0043L3537K8386M2633K7781N693m185j4653k0697m9830o7224o4188
$$ 5747338 5797381 5830918 5859304 5901937 5929718 5935411 5931226 5916573 5895876 5846046 5778822 5714634
12015E714634m9484n2255n9237m3462k5226l3052l4178o0171p9660p9855q2348
$$ 5714634 5665150 5612895 5553658 5510196 5484970 5451918 5417740 5357569 5277909 5198054 5115706
12004E115706r1321j21582j12921r4757p4415q5801r5375j06581j01099r8775
$$ 5115706 5024385 4902803 4789882 4695125 4620710 4534909 4439534 4332953 4231854 4133079
11994D133079j12457r1845p9188q7832r2900r0216o9310o3631p7095p2697p1166
$$ 4133079 4020622 3928777 3849589 3761757 3668857 3578641 3509331 3445700 3368605 3295908 3224742
11983C224742n8503o6803o3880o5567o2680o3061o2084n9918o0285o3319n5888
$$ 3224742 3166239 3099436 3035556 2969989 2907309 2844248 2782164 2722246 2661961 2598642 2542754
11972B542754n5995o5209n2257n1084n1664l5694l7758n0482m9714m6430m8403
$$ 2542754 2486759 2421550 2369293 2318209 2266545 2230851 2193093 2142611 2092897 2046467 1998064
11961A998064n5618m7285m9501m7805m7293l8097l5705k2526l3648k6096k3539
$$ 1998064 1942446 1895161 1845660 1797855 1750562 1712465 1676760 1654234 1620586 1594490 1570951
11950A570951k5330l3477l5440j9284k0772l554j4931k9949k1937l2453k8916
$$ 1570951 1545621 1512144 1476704 1457420 1436648 1433094 1418163 1388214 1366277 1333824 1304908
11939A304908m2842m6255k3757k2484k2306k9803k7986l3860k1701k0526k8865
$$ 1304908 1262066 1215811 1192054 1169570 1147264 1117461 1089475 1055615 1033914 1013388 984523
11928I84523k0871n605l068k7669j4429o381K580k57P294O578P561n330l817R217
$$ 984523 963652 958047 954979 927310 912881 906500 909080 908823 916117 922695 930256 924926 921109 930326
11914I30326o765j1458j0122j0062Q06j3856l2094m4109n3143m5102m4255k1003
$$ 930326 923561 912103 901981 891919 892725 878869 846775 802666 749523 704421 660166 639163
11902F39163j4299k2249q450j1655l59j026k128j7768O66o068j2691o135N23l076
$$ 639163 624864 602615 594165 582510 582151 581125 578997 561229 561895 555827 543136 537001 537524 534448
11888E34448j036M397j117O757j1443j3980j4811k160j1307M102K999j133j3633
$$ 534448 533412 537809 536692 543449 532006 518026 503215 501055 489748 493850 496849 495716 482083
11875D82083o805j98Q088P612k523j0773j3818o105k980r162p158j1829R972j655
$$ 482083 475278 475080 483168 490780 488257 477484 463666 457561 454581 445419 438261 426432 436404 434749
11861D34749j2707o573p036l792M098m222m045j0665l667m10r841k326j481n241
$$ 434749 422042 415469 408433 404641 408739 404517 400472 389807 386140 385730 375889 373563 372082 366841
11847C66841J061r118l189k966J664K978Q273j5515o342J3566j332j4910K825
$$ 366841 367902 358784 355595 352629 354293 357271 365544 350029 343687 357253 355921 341011 343836
11834C43836J1176J21m556J3675p694p441j1791j325k668q614o028K664J0554
$$ 343836 355012 355133 350577 364252 356558 349117 337326 336001 333333 324719 318691 321355 331909
11821C31909m51k7591j1319k959N290J6609m020j5367r370j2385o103j484o287
$$ 331909 331458 303867 292548 289589 294879 311488 307468 292101 282731 270346 264243 262759 256472
11808B56472M217L172J2386L564m76P736o333l246J1506J730O349O395Q847L189
$$ 256472 260689 263861 276247 279811 279335 287071 280738 277492 288998 290728 297077 303472 312319 315508
11794C15508p136j3332j1832L215R603M784r603J521P096J7336o628j775J1288
$$ 315508 308372 295040 283208 286423 296026 300810 291207 292728 299824 317160 310532 308757 320045
11781C20045J1325L5926J5668L0107L0647O6109P9602R4236J27605J75198K22373
$$ 320045 331370 367296 382964 413071 443718 509827 589429 683665 811270 986468 1208841
11770A208841K79627L01860K80449J42434o6413k44356l25077k78385k29866j72146
$$ 1208841 1488468 1790328 2070777 2213211 2146798 1902442 1577365 1298980 1069114 896968
11760H96968j34164r8746q7314o3155n5685n2289l7595k3977l2868k6723q157
$$ 896968 762804 664058 576744 513589 457904 405615 368020 344043 311175 284452 276295
11749B76295j3897j8827r726j4356k561J596n480N392j0639J408N517p328P07
$$ 276295 262398 243571 233845 219489 216928 218524 213044 218436 207797 209205 214722 207394 208101
11736B08101n834P466N10j2507j5345q524k019o651j0216q385O839m309N441P113
$$ 208101 202267 209733 210243 197736 182391 173867 171848 165197 154981 146596 153435 149126 154567 161680
11722A61680N139l048k04Q19l143o013j9732K598N843M587M6p912m467O19r373
$$ 161680 166819 163771 163567 164386 161243 155230 135498 138096 143939 148526 148572 140660 136193 136812 127439
11707A27439K808N477n774N824K35o113j2589O786l149L379o613j263N042p1q375
$$ 127439 130247 135724 129950 135774 136009 129896 117307 124093 120944 124323 117710 116447 121489 121418 113043
11692A13043p591R141P023k446P786l549k1526r309P488J6488J8493j085k5641
$$ 113043 105452 114593 121616 119170 126956 123407 101881 92572 100060 116548 135041 133956 108315
11679A08315j4740q961j389J7602J6934p35j0967o024r100j705P552N347j815
$$ 108315 93575 84614 83225 100827 117761 117026 106059 100035 90935 89230 96782 102129 100314
11666A00314j313j1448l253p16P448J1487l887N027J6664j0598r598R793K094
$$ 100314 99001 87553 84300 83584 91032 102519 98632 103659 120323 109725 100127 109920 112014
11653A12014j3053r9Q891L63m61k179p473J1294Q041p629k624K370L236n155n372
$$ 112014 98961 98862 107753 108116 107655 105476 98003 109297 117338 109709 107085 109455 112691 107536 102164
11638A02164o614m969J895l133j1276r871N507L278j0188N152k082q398M099J4613
$$ 102164 95550 90581 92476 89343 78067 68196 73703 76981 66793 71945 69863 61465 65564 80177
11624H0177J2702J3908O635k128N63p728m65M163P18j1183j1767q702L807K097
$$ 80177 92879 106787 113422 111294 111857 104129 103664 107827 108545 97362 85595 76893 80700 82797
11610H2797L899L873J993q889j7547l581j822O439j538p9N700n221j696R344j3321
$$ 82797 86696 90569 92562 83673 66126 62545 60723 67162 65624 65545 71245 66024 64328 73672 60351
11595F0351m165N419p578o950n945J7562N608k625l395J974m735Q931k885k82
$$ 60351 56186 61605 54027 47077 41132 58694 64302 61677 58282 60256 55521 64452 61567 61285
11581F1285n403J892P566o845Q998K599P700Q066l464j904n120o029R437k332
$$ 61285 55882 57774 65340 58495 67493 70092 77792 85858 82394 80490 75370 69341 78778 76446
11567G6446M61j2936j3007J4688R906n323o225K222P91L012j738R227p43j5025
$$ 76446 76907 63971 50964 65652 75558 70235 64010 66232 67023 70035 68297 77524 76781 61756
11553F1756M807J426j7632K97L618R783J629j4913R179k043n262N989O372l110
$$ 61756 66563 67989 50357 50654 54272 64055 65684 50771 59950 57907 52645 58634 65006 61896
11539F1896j195k468o081k71n331J5513R839N96n931k451J174k514n117j948j659
$$ 61896 60701 58233 52152 51881 46550 62063 71902 72498 66567 64116 65290 62776 57659 55711 54052
11524E4052N325Q630l878o824K522l052j515j0639j970k549k206J2905J3759K643
$$ 54052 59377 68007 64129 57305 59827 56775 55260 44621 42651 40102 37896 50801 64560 67203
11510F7203M48k031l083n602q484J437K152J8091j4511j3184K967P157P024o160
$$ 67203 67651 65620 62537 56935 48451 49888 52040 70131 55620 42436 45403 52560 59584 53424
11496E3424K006j2984j2089N409k389L061J0873j123k200q748K299N183Q793p560
$$ 53424 55430 42446 30357 35766 33377 36438 47311 46188 43988 35240 37539 42722 51515 43955
11482D3955m544R949o74Q288Q847l798O976M48k533p140j3629r49R909n122j0044
$$ 43955 39411 49360 48686 56974 65821 62023 68999 69447 66914 59774 46145 45196 55105 49983 39939
11467C9939n379P239J1019O404Q253r569l874L442j504n02J412k925j328r793
$$ 39939 34560 41799 52818 59222 67475 57906 54032 57474 55970 55468 56880 53955 52627 42834
11453D2834L103k600K45J3024K516q063P53J2188j3794j8591L275P243o328l966
$$ 42834 45937 43337 43582 56606 59122 51059 51812 64000 50206 31615 34890 42133 35805 31839
11439C1839M182k681P69j493k299p844J9250r872j8185J7293P794l598k798J5604
$$ 31839 36021 33340 34109 32616 30317 22473 41723 31851 13666 30959 38753 35155 32357 47961
11425D7961K935j6543j763K463r878L405L356Q758R393l820N863j892j3719o947
$$ 47961 50896 34353 32590 35053 25175 28580 31936 40694 50087 46267 52130 50238 36519 29572
11411B9572R321L393j0416j0238k762L271J3705j0860M098J2607K730k711j789
$$ 29572 38893 42286 31870 21632 18870 22141 35846 24986 29084 41691 44421 41710 39921
11398C9921n822l150P803o981n78L997k033J2473R54j3212k762j3954n351M675
$$ 39921 34099 30949 38752 31771 31193 35190 33157 45630 46584 33372 30610 16656 11305 15980
11384A5980K0419N765K342N412k502N308N299K0545M680q431r396j3254j869M125
$$ 15980 36399 42164 44506 49918 47416 52724 58023 78568 83248 74817 65421 52167 50298 54423
11370E4423J426J212m928n021m390n186N658O876j4158j5576L552R494q789k156
$$ 54423 55849 57061 52133 47112 42722 37536 43194 50070 35912 20336 23888 33382 24593 22437
11356B2437o072Q710J1019j2167o907o555n546O340k416l977j18M635J9837L671
$$ 22437 16365 25075 36094 23927 17020 10465 4919 11259 8843 4866 4748 9383 29220 32891
11342C2891o754K8J782p562O003J4364m782n465k570l950l145L847Q41p41J2001
$$ 32891 26137 26165 27947 20385 26388 40752 35970 30505 27935 23985 20840 24687 25528 24787 36788
11327C6788m919L317J3753p810m481n149p815j4794K420J9186M301q640N317N757
$$ 36788 31869 35186 48939 41129 36648 31499 23684 8890 11310 30496 34797 26157 31474 37231
11313C7231j970J380q41j0761K033j305K479K081r256Q032J001j533O384P216
$$ 37231 35261 36641 35800 25039 27072 25767 28246 30327 21071 29103 30104 28571 34955 42171
11299D2171M23O876m655j3765o661J1260l938j2867j3531K424J8231K764M543
$$ 42171 42594 49470 44815 31050 24389 35649 31711 18844 5313 7737 25968 28732 33275
11286C3275l305M108o112k067J685J1235J5192O858O779m788k1590l749o275P559
$$ 33275 29970 34078 27966 25899 27584 38819 54011 60869 67648 62860 41270 37521 31246 38805
11272C8805M559N41N063n983j0914O426K998M416Q970k236l937J23J307r896O396
$$ 38805 43364 43905 48968 42985 32071 38497 41495 45911 54881 52645 48708 48831 50138 40242 46638
11257D6638Q84k539o06p769N185L707j0146j2115l60J730j3851P003Q59J6277
$$ 46638 47522 44983 44377 36608 41793 45500 35354 23239 22879 24609 10758 17761 18620 34897
11243C4897l818p197J241P021L012q577J0688M823M035J2329M198P314K116j4454
$$ 34897 31079 23882 25123 32144 35156 26579 37267 42090 46125 58454 62652 69966 72082 57628
11229E7628m907L900q531m909J2456P812R67l477q77m488O375R96j469J0721J0782
$$ 57628 52721 56621 48090 43181 55637 63449 64416 60939 60062 55574 61949 62945 61476 72197 82979
11214H2979J3095O139j279K266m358J3617J1656J6928J7467J7722M0150L7544
$$ 82979 96074 102213 100934 103200 98842 112459 124115 141043 158510 176232 216382 253926
11202B53926L3955K9401M4432O6272O5894J01614J29385J93231L16530M84419
$$ 253926 287881 317282 361714 427986 493880 595494 724879 918110 1234640 1719059
11192A719059P13430R79171J062904P02369J85883j34823n47197r93360j066632
$$ 1719059 2432489 3411660 4474564 5176933 5362816 5227993 4680796 3687436 2620804
11183B620804q01886n03976l10464k10721j24853r3186o6185o1006n5979n1454
$$ 2620804 1818918 1314942 1004478 793757 668904 575718 509533 448527 392548 341094
11173C41094m3660m3996l1695j4236q881j0516j3279j9694j3309p803k3925j3232
$$ 341094 297434 253438 221743 207507 198626 188110 174831 155137 141828 134025 110100 96868
11161I6868j1122l047L66j093o451K188N763R545o27o869r866n79J380m318j7662
$$ 96868 85746 82699 83065 81972 75521 77709 83472 93017 92390 85521 75655 75076 76456 72138 54476
11146E4476k0131j514J833Q329J5651O017r452L249m205L920j411j5737j2138
$$ 54476 34345 32831 34664 42993 58644 64661 55209 58458 54253 58173 56762 41025 28887
11133B8887L991J5734j4843j5407Q169K0602J6346j2776k0896n861J1176J3467
$$ 28887 32878 48612 33769 18362 26531 47133 63479 50703 29807 23946 35122 48589
11121D8589j5055M791M990j552m711J446j112n968q587K88L137J2856R092j312
$$ 48589 33534 38325 43315 41763 37052 38498 37386 31418 22831 23119 26256 39112 48204 46892
11107D6892J1854k665o491o333j1487l267m939p202J0564L567j0221J1541O552
$$ 46892 58746 56081 49590 43257 31770 28503 23564 16362 26926 30493 20272 31813 38365
11094C8365L668L282K562m5j4687o090k604j0571l649O036k020L717J7890N943
$$ 38365 42033 45315 47877 47832 33145 27055 24451 13880 10231 16267 14247 17964 35854 41797
11080D1797j6843p995O411k043J418j717r375J902L399R098K839n6k399J491J5317
$$ 41797 24954 16959 23370 21327 22745 21028 11653 13555 16954 26052 28891 28835 26436 27927 43244
11065D3244k592j0764R038J1362j3114j2953Q850J4387P381r645o876m046m148
$$ 43244 40652 29888 38926 50288 37174 24221 33071 47458 54839 45194 38318 34272 30124
11052C0124R54J445j793J1827M013J29O804l751M75L420J235o906O44Q642P376
$$ 30124 31078 32523 30730 42557 46570 46699 53503 49752 50227 53647 54882 47976 48620 57262 64638
11037F4638M646Q319J7622J8840J2616J2288r37j2110j8904Q96K744J548K990
$$ 64638 69284 77603 95225 114065 126681 138969 138032 125922 107018 107914 110658 112206 115196
11024A15196K8875K2660J3830m593l932q712q575k4488p141j0921j1560J2132
$$ 115196 144071 166731 180561 175968 172036 163324 154749 130261 123120 112199 100639 112771
11012A12771O052p91J023M344q345j0731k0557q816K987m819j026j174J4654J6503
$$ 112771 118823 118032 119055 123399 115054 104323 83766 74950 77937 73118 72092 70918 85572 102075
10998A02075K789j4546j2382J603k362m979l534n003k564j986j6008p685m933
$$ 102075 104864 90318 77936 79539 77177 72198 68664 63661 61097 59111 43103 35418 30485
10985C0485L352J086P278K094N976O299o511l838j0753j0552J2727Q977J8384
$$ 30485 33837 34923 42201 44295 50271 56570 50059 46221 35468 24916 37643 46620 65004
10972F5004O656m669J1913N017j2326N298J1823J6540L178m441J0941J0200R718
$$ 65004 71660 66991 78904 83921 71595 76893 88716 105256 108434 103993 114934 125134 134852
10959A34852J3320K8186L3884L2746L6386N4292O4905P2707R1944J36808K02040
$$ 134852 148172 176358 210242 242988 279374 333666 398571 471278 563222 700030 902070
10948I02070L01386M70757O94649R15393Q86807L78455q8772n1718O3794l03705
$$ 902070 1203456 1674213 2368862 3284255 4171062 4549517 4460745 4409027 4472821 4169116
10938D169116q54469r49372p04201m33145k65237j74203j15170o1317k5285J4124
$$ 4169116 3314647 2365275 1661074 1227929 962692 788489 673319 612002 586717 600841
10928F00841L5214M6069K4405n8512j26389r9729q9816n6460k8354l3578k6119
$$ 600841 636055 682124 706529 648017 521628 421899 332083 275623 247269 213691 187572
10917A87572k5076k9883j1286j8442j0190r433n775M30R556l643K351p723k8317
$$ 187572 162496 132613 121327 102885 92695 83262 77487 77917 87473 83830 86181 78458 50141
10904E0141p613J0464M482j278n882n898L740J164J826m580j5149j259L613L606
$$ 50141 42528 52992 57474 56196 50314 44416 48156 49320 51146 46566 31417 30158 33771 37377
10890C7377M248n050K148j2944l88P368N533j718k56n09k991j044J832J837R67
$$ 37377 41625 36575 38723 25779 25391 32759 38292 36574 36318 35809 32818 31774 33606 35443 36410
10875C6410L527J557o646q645l949R380m532N383K024p33n358R43L787P565j931
$$ 36410 39937 41494 34848 26203 22254 31634 27102 32485 34509 33776 28418 29361 33148 40713 38782
10860C8782o477l163J7285N413q366m250k522M246m30L846N831P106n495j0804
$$ 38782 32305 29142 46427 51840 43474 39224 36702 40948 40518 44364 50195 57301 51806 41002
10846D1002l487k014J3424l23o349l353J4196n66M824j8939o619J414J614n281
$$ 41002 37515 35501 48925 48602 42253 38900 53096 52530 57354 38415 31796 33210 34824 29543
10832B9543Q311Q49j398m104O809J4566J767n784j6493r533O064K377j057l293
$$ 29543 37854 38703 37305 33201 40010 54576 56343 50559 34066 24533 30597 32974 31917 28624
10818B8624j3767J2751N839J0501P468O739r109j4400n569K264n348k574Q23O499
$$ 28624 14857 27608 33447 43948 51416 58155 49046 34646 29077 31341 25993 23419 24242 30741
10804C0741M008R200J104r256o263m255J0015M018M307j2772r430k09N824J0183
$$ 30741 34749 43949 45053 35797 29534 25279 35294 39312 43619 30847 21417 21208 27032 37215
10790C7215K201n317R838o230j0021r995m025N810L032J71j00O811J0099N39q173
$$ 37215 39416 34099 43937 37707 27686 17691 13666 19476 22508 22679 22579 29390 39489 40028 31855
10775C1855M263K40j6899j0998Q214M556l32J7667J4360l788o75j5887n998R581
$$ 31855 36118 36358 19459 8461 16675 21231 20899 38566 52926 49138 48463 32576 26578 36159
10761C6159M475j0367P676o23j3658j2986J2120K1754J0393N483R238j0390m521
$$ 36159 40634 30267 37943 37320 23662 10676 22796 44550 54943 60426 69664 59274 54753
10748E4753j594m624Q177l117j8772K837J2666N127J5593M111n080j572o574k69
$$ 54753 53159 48535 56712 53595 34823 37660 50326 55453 71046 75157 70077 68505 61931 61662
10734F1662r5j0989j6683j1043K3573K2282o542L119q61l870J754o504M201l823
$$ 61662 61567 50578 33895 22852 46425 68707 62165 65284 64423 60553 62307 55803 60004 56181
10720E6181R848j440R22O155J0977K677r053j3589P976R997j1649j136K564l894
$$ 56181 66029 64589 65511 71666 82643 85320 76267 62678 70654 80651 69002 67866 70430 66536
10706F6536J4393N451J096M938n985j2096m781N439P625J002l916m034M092J0732
$$ 66536 80929 86380 87476 92414 86429 74333 69552 74991 82616 83618 79702 75668 79760 90492
10692I0492J5465l924j0253m459j44l289J5982M917K976k941j457O085J1124L491
$$ 90492 105957 102033 91780 87321 87177 83888 99870 104787 107763 104822 103365 109450 120574 124065
10678A24065Q199K752j0437O956J7442J2197K7462M3637L0607K9234J2572M820
$$ 124065 132264 135016 124579 131535 148977 161174 188636 232273 262880 292114 304686 309506
10666C09506o542l0413l8277j3504l546p524r316J301P558j787n136j202J3159
$$ 309506 302964 272551 234274 220770 217224 209700 200384 201685 209243 207456 202320 201118 214277
10653B14277K3202J2042J3760J2024J3916J4158P924J0087R097K1496J7212R764
$$ 214277 237479 249521 263281 275305 289221 303379 311303 321390 330487 351983 369195 378959
10641C78959K7769K5628K4162L6406N4374M7197M1127P5347R1886J04509J00431
$$ 378959 406728 432356 456518 492924 547298 594495 635622 710969 802855 907364 1007795
10630A007795P0220N0059N2989P1787J02174J42548J95506K72343L48083M40927
$$ 1007795 1078015 1128074 1181063 1252850 1355024 1497572 1693078 1965421 2313504 2754431
10620B754431N83184P35202Q86171J038765J149560J112468P89721L16614o1741
$$ 2754431 3337615 4072817 4958988 5997753 7147313 8259781 9049502 9366116 9304375
10611I304375k12370r1105J90977N76276J039144J506457J965502K249289K044470
$$ 9304375 9092005 9000900 9191877 9768153 10807297 12313754 14279256 16528545 18573015
10602A8573015J138395j91921j162821j343437r80704l69395L38885J066393J845305
$$ 18573015 19711410 19519489 18356668 17013231 16032527 15663132 16002017 17068410 18913715
10593A8913715K495727K739261K210029O53135j316738k582523k762908k263294
$$ 18913715 21409442 24148703 26358732 27011867 25695129 23112606 20349698 18086404
10585A8086404j485716o90408J5237O59980J123215J258740Q03929l08226j565266
$$ 18086404 16600688 15910280 15925517 16585497 17708712 18967452 19771381 19463155 17897889
10576A7897889k295122k278818j835644j280302p88326l64524j9414J72705J72149
$$ 17897889 15602767 13323949 11488305 10208003 9419677 9055153 9035739 9208444 9380593
10567I380593o7227n03975r61001j209860j201315j017517q20509o18625m65542
$$ 9380593 9313366 8809391 7848390 6638530 5437215 4419698 3599189 2980564 2515022
10558B515022l61075k88342k34804j88401j52673j27206j09083r0552q9367r0770
$$ 2515022 2153947 1865605 1630801 1442400 1289727 1162521 1053438 962886 873519 782749
10548G82749m8714j6680k7202m0217m3469m0836k5987k4616k9623l1971l0734
$$ 782749 734035 717355 690153 649936 606467 565631 539644 515028 485405 453434 422700
10537D22700k7535k7269k6141k4592k3197j5998k2655j4339j2386j1424k6365
$$ 422700 395165 367896 341755 317163 293966 277968 255313 240974 228588 217164 190799
10526A90799m16O419j1794j7314l686J9151k937o939j9575j3394P673l226k029
$$ 190799 190383 196802 185008 167694 164008 183159 180222 173283 153708 140314 147987 144761 142732
10513A42732l666j2362p335p110J575N850J0950j246r821N77J383J0609L218k271
$$ 142732 139066 126704 119369 112259 113834 119684 130634 129388 119567 120144 121527 132136 135354 133083
10499A33083q902l711R7m239l869P29r783j4532N320R331j6229o257M370K47r25
$$ 133083 124181 120470 120567 116328 112459 113188 103405 88873 94193 103524 87295 81038 85408 85655 84730
10484H4730L274J3948j1317l152P925P997j779J2146j4286j5408O440O567m349
$$ 84730 88004 101952 90635 87483 95408 103405 101626 113772 99486 84078 90518 97085 92736
10471I2736j4679r572Q265J8353m32o812L784M924O351j753J098p393N50L37Q344
$$ 92736 78057 68485 76750 95103 94671 87859 91643 96567 102918 101165 102263 94870 95420 95757 104101
10456A04101o881m2q181p118l100j5993n844j994L064r20K330j4567J45o668o985
$$ 104101 97220 97178 88997 81879 78779 62786 56942 54948 58012 57092 59422 44855 45000 38332 31347
10441C1347J2322J3106k199n608M024N335N800N199m159J29J351j2942j2931R49
$$ 31347 43669 56775 54576 48968 52992 58327 64127 69326 65167 65296 66647 53705 40774 41723
10427D1723K004m314J4694O051j1656k0402p781J4100J1126n348j0643L803j222
$$ 41723 43727 39413 54107 60158 48502 28100 20319 34419 45545 40197 29554 33357 32135
10414C2135L028J1772k901n183l246j146L90p655j737J1126o806r69P893Q077
$$ 32135 35163 46935 44034 38851 35605 34459 34849 27194 25457 36583 29777 28808 36701 44778
10400D4778J183R24K625j1578j2861P904m648r258P003J664M418j800q898J583
$$ 44778 45961 46885 49510 37932 25071 32975 28327 19069 26072 27736 32154 30354 21456 23039
10386B3039L745L082R40p893j1540r432L408J3137O685q144N476m304L183J0153
$$ 23039 26784 29866 30806 22913 11373 1941 5349 18486 25171 17027 22503 18199 21382 31535
10372C1535n524j5O530P122k704j4249J5624j2013M141q13j8518p702L024M749
$$ 31535 26011 25996 32526 39648 36944 22695 38319 26306 30447 29634 11116 3414 6438 11187
10358A1187l099J2946O665O023Q820p370m185j1023p502N409k548N935J7603J0888
$$ 11187 8088 21034 27699 33722 42542 35172 30987 19964 12462 17871 15323 21258 38861 49749
10344D9749r695o886K307r351q036J4949J2554n517j1293P754k835j5049O116
$$ 49749 40054 33168 35475 26124 18088 33037 45591 40074 28781 36535 33700 18651 24767
10331B4767N954k945j804M10K688m912L93K151p228R718j064J3786K951n405j756
$$ 24767 30721 27776 25972 26382 29070 24158 24551 26702 19474 29192 28128 41914 44865 39460 37704
10316C7704N091q619j1213J1154J259P107J1961O869j4651j3522k0038m070J6758
$$ 37704 42795 34176 22963 34117 35376 42483 54444 61313 46662 33140 13102 9032 25790
10303B5790J067j3167R25L701q587k362r575R223P526o663m377K0425O265j951
$$ 25790 26857 13690 14615 18316 9729 7367 -2208 7015 14541 7878 3501 23926 30191 28240
10289B8240j0107j0032o615j712n247o875J2163J6917R854N255q46j0374O331
$$ 28240 18133 8101 1486 -226 -5473 -12348 -185 16732 26586 31841 30995 20621 26952
10276B6952P265k40j1324l961K271l315L934r586l997J926n95k127K153p25o542
$$ 26952 34217 33977 22653 18692 20963 17648 21582 11996 7999 9925 9330 7203 9356 8631 2089
10261B089L939l672J0206o19m258o3n75L959O100K566R266L506q712j3617K082
$$ 2089 6028 2356 12562 11943 7685 7622 7047 11006 17106 19672 28938 32444 23732 10115 12197
10246A2197n524k621j2863l927J9659J8802J2553j0381p085n839m172J8691J0413
$$ 12197 6673 4052 -8811 -12738 6921 25723 38276 27895 20810 14971 10799 29490 39903
10233C9903q48q947r553n232k165l244p143m592k374M625j153R19J7832J1162
$$ 39903 39055 30108 20555 15323 13158 9914 2771 -1821 -4195 430 -723 196 18028 29190
10219B9190L603R64Q255p888j7572j2182o101N42K282J1528J2133j8450l671J0392
$$ 29190 32793 33757 42012 34124 16552 4370 -1731 -1189 1093 12621 24754 6304 2633 13025
10205A3025J779k190P103Q689k94l484j1477j0428L996L49J0813K704l214k412
$$ 13025 14804 12614 19717 28406 28112 24628 13151 2723 6719 7068 17881 20585 17371 14959
10191A4959j018M089O478J7n258q043J0368L885R659o789m160J4433J6223L347
$$ 14959 13941 18030 24508 24525 19267 11224 21592 25477 35136 28347 24187 38620 54843 58190
10177E8190Q516Q17r944k625r013K530M833j246k080J2771K1208J8621k100M261
$$ 58190 66706 67523 57579 54954 45941 48471 53304 52058 49978 62749 83957 102578 100478 104739
10163A04739O754q224R39l04N869R006J4645J1255J7934N169k680j4632k7953
$$ 104739 111493 103269 104208 103904 109773 118779 133424 144679 162613 167782 165102 150470 122517
10150A22517j8091o436m895l676q60l922J8134K1682l427o676q659p068j5132
$$ 122517 104426 97990 93095 89419 88559 84637 102771 124453 121026 114350 105691 98623 83491
10137H3491j3469r320j7361j214R135r58R317L794j0281r811p019j186K761Q695
$$ 83491 70022 60702 43341 42127 51262 50304 59621 63415 53134 43323 36304 35118 37879 46574
10123D6574m455J474r487j3031o352n131K937j418j2722L334j017K02q557m737
$$ 46574 42119 43593 34106 21075 14723 9592 12529 11111 -1611 1723 706 908 -7649 -12386
10109a2386J2917J8953J796j2o302R72k743p839R451m689j0419J792M15N981P773
$$ -12386 531 19484 21280 21268 14966 15938 13195 5356 14807 10118 -301 1491 1906 7887 15660
10094A5660m942m913M515J1141q570j0212p41l921J5715j441j4307j5723N042
$$ 15660 10718 5805 10320 21461 12891 2679 1938 -1983 13732 12291 -2016 -17739 -12697
10081a2697N501J043j735n428O729J3892j1502j5366P59R669J0191j1474R611
$$ -12697 -7196 -6153 -7888 -13316 -6587 7305 -4197 -19563 -18804 -9135 1056 -10418 -807
10068h07Q299j693r178r013n443n817J2280P439m405k236j42J2601O259M691N856
$$ -807 7492 5799 -3379 -12392 -17835 -23652 -11372 -3933 -8338 -10574 -10716 1885 8144 12835 18691
10053A8691K545j3510j2848K094J6823O960j499q529O87j683p930O741K354m468
$$ 18691 21236 7726 -5122 -3028 13795 20755 19256 10727 11414 9731 1801 8542 10896 6428
10039F428k268R472J354l739L743J1576N093q484p573J1439j0008k4888N578J4258
$$ 6428 4160 13632 14986 11247 14990 26566 31659 23175 15602 27041 17033 -7855 -2277 11981
10025A1981M02m853n672J281K612p450r118o940l480J0506N085m15J386J2993
$$ 11981 12383 7530 1858 3139 5751 -1699 -10817 -17757 -21237 -10731 -5646 -6061 -4675 8318
10011H318n382L58M470m316r829j791N463J0731M728j6292o774J3243Q108R431
$$ 8318 2936 3294 7764 3448 -6381 -8172 -2709 8022 12750 -3542 -10316 2927 11035 20466
9997B0466Q63p196q417j0357J191N419p50N822l378P521J1176o175j279m501o615
$$ 20466 21329 14133 5716 -4641 -3450 1969 1219 7041 3663 11184 22360 16185 14906 10405 3790
9982C790p277J8568J9189R791n242p770l378j1299m225j90J651m810o848O907
$$ 3790 -3487 15081 34270 44061 38819 31049 27671 16372 12147 11957 13608 8798 1950 8857
9968H857Q092J781O399R628m755k0565j751J1166M388n108J76p204r237k044N070
$$ 8857 16949 18730 25129 34757 30002 9437 7686 18852 23240 18132 18308 11104 1867 -177 4893
9953D893L080L578P120p4j1986P745p407k0530j107J1650J4051J581J5209O256
$$ 4893 7973 11551 18671 18597 6611 14356 6949 -13581 -14688 -3038 11013 12594 27803 34059
9939C4059M338o736m117j59k167j6764r207R262K861M890k288k0504k351J6373
$$ 34059 38397 31661 27544 27385 25218 8454 -753 8509 11370 16260 13972 -6532 -8883 7490
9925G490J241j5174J4706J1077J545j604J4903R163j0733k09O192K538k6200q682
$$ 7490 8731 -6443 8263 19340 20885 19281 34184 43347 32614 32405 38597 41135 14935 6253
9911F253L725J6174N570j259k486j6762n272K910o658M022L546j532j0026k45
$$ 6253 9978 26152 31722 30463 27977 11215 5943 8853 2195 6217 9763 8231 -1795 -2040
9897b040K687J950O597Oj1223l43l794J139K618M059n12J5459K082j4654o992
$$ -2040 647 2597 9194 9200 -2023 -2366 -6160 -5021 -2403 1656 1144 16603 18685 4031 -2961
9882b961j805N541K064P544j8P145J736r786j5296j0397M836J506K363M054l344
$$ -2961 -4766 775 2839 10383 10365 17510 19246 9460 -5836 -16233 -11397 -9891 -7528 -3474 -6818
9867f818k66p132J113O695k377R79J0875R285M822P962j9135j6464N944P476q595
$$ -6818 -7084 -14216 -13103 -6408 -8785 -7806 3069 12354 17176 25138 6003 -10461 -4517 2959 -5636
9852e636j4685R287J3448p118p911m415L373K4902J2179K382r032j4701j459n183
$$ -5636 -20321 -11034 2414 -4704 -12615 -17030 -13657 11245 23424 25806 16774 2073 614 -4569
9838d569M077J3274Q316m094L411J398j0627j7045O386P658o779N392p050p826
$$ -4569 -492 12782 21098 17004 20415 21813 11186 -5859 527 8185 1406 6798 -252 -8078
9824h078m058o684J2172J2677K928O526L647r663P454K552L602r604j7726o010
$$ -8078 -12136 -18820 -6648 6029 8957 15483 19130 9467 16921 19473 23075 13471 -4255 -10265
9810a0265K484q03M314M761m651n244L032O662j665J062m288o21O709O470M444
$$ -10265 -7781 -8584 -4270 491 -4160 -9404 -6372 290 -1375 -313 -4601 -5222 1487 7957 12401
9795A2401n828j3491L105J1121L819J252r754m810k058k364J3269j0704m517N451
$$ 12401 6573 -6918 -3813 7308 11127 12379 2625 -2185 -4243 -6607 6662 -4042 -8559 -3108
9781c108J1081o404n8o145q3J1596N109j3575K116m86l710M892r403j1314M671
$$ -3108 7973 1569 1511 -4634 -4717 6879 11988 -1587 529 43 -3667 1225 -8178 -19492 -14821
9766a4821J0502Q747J9n834j7336N132J2787R373J666L407L14n312p570q693J0997
$$ -14821 -4319 4428 4447 -1387 -18723 -13591 -804 8569 10235 13642 13956 8644 1074 -7619 3378
9751C378q114m411M954k279l058L715m162L717m869J0018J2766m421l376J462
$$ 3378 -4736 -9147 -4193 -6472 -9530 -5815 -9977 -6260 -11129 -1111 11655 7234 3858 5320
9737E320j0607n114M102P115P122r446j3116J1886J6785q6j0482R806J0900J218
$$ 5320 -5287 -10401 -6299 816 7938 -1508 -14624 -2738 14047 13961 3479 13285 24185 25403
9723B5403o22p937N77j618K675l087K97p081J642m537M479J3414m166j8923j0231
$$ 25403 24781 16844 17421 15803 18478 15391 15688 8607 10249 5712 10191 23605 19439 516 -9715
9708i715L213N346q039l49M710k849n60R587N476K820L158n572k2954l277J6768
$$ -9715 -6502 -1156 -9195 -9544 -4834 -7683 -8243 1344 6820 9640 12798 7226 -15728 -19005 -2237
9693b237n035L695J2988J75j2384k646J4895l060j3434K821Q022K766L917j811
$$ -2237 -7272 -3577 9411 9586 -2798 -5444 9451 6391 -7043 -4222 3800 6566 10483 8672
9679H672q868j1632K518J835P364l841R62P619J3840J1248L992n975k389r929
$$ 8672 -196 -11828 -9310 -7475 -111 -3952 -2990 4629 18469 29717 33709 27734 25345 15416
9665A5416q425n548o900k184K546o40l446J3232J4883P476K3786K2639J5003o068
$$ 15416 6991 1443 -5457 -7641 -5095 -5735 -9181 4051 18934 26410 50196 72835 87838 81770
9651H1770k1508j7973j8185n98P28n245r839R75R286k978j9235P12J1274K292
$$ 81770 60262 42289 24104 23506 24234 18989 9150 10125 19411 16433 -2802 -2090 9184 11476
9637A1476K48j1788r452q680Q692O79J2527P097p975P247R01l417J230J4245m398
$$ 11476 11724 -64 -9516 -18196 -9504 -8825 3702 10799 2824 10071 10972 7555 8785 23030 18632
9622A8632r179l861J1182r947K256k536O55k426P94M459N03m02K45J639j5653
$$ 18632 9453 5592 16774 6827 9083 6547 7202 4776 5570 10029 10532 10130 10375 12014 -3639
9607c639m645O806Q714m099J1094J199q843M774J394k890j6407l976o419o890
$$ -3639 -8284 -1478 7236 3137 14231 15430 6587 11361 12755 9865 -6542 -10518 -16937 -23827
9593b3827K253R397O74j0030n566Q340J3433N315O601m230N977Q62o949j4352
$$ -23827 -21574 -12177 -11503 -21533 -27099 -18759 -5326 -11 6590 2360 8337 9199 2250 -12102
9579a2102q234R06k866L886j344l001K3727o223J165R558l2l875N23m724j4110
$$ -12102 -20336 -19430 -22296 -18410 -19754 -22755 972 -5251 -4086 5472 5440 1565 2088 -2636 -16746
9564a6746m031P751J4660P194J0238O828j028M30J035K578j0140j7188r739J0179
$$ -16746 -20777 -13026 1634 8828 19066 25894 24866 25296 26331 28909 18769 1581 -8158 2021
9550B021J2384P904j2066j0523k693Q755Q32q13q824k964k676K413O399j3448
$$ 2021 14405 22309 10243 -280 -2973 5782 6614 5801 -3023 -5987 -8663 -6250 149 -13299
9536a3299J6137K8281j4036k037J0838j2376K983Q931p472j3149K692R170p02
$$ -13299 2838 31119 17083 15046 25884 13508 16491 25422 17950 4801 7493 16663 15961
9523A5961j6113j038J852k361j1401j3662O565J3301J1146J1205J3655O707q593
$$ 15961 -152 -1190 662 -1699 -13100 -26762 -20197 -6896 4250 15455 29110 35817 27224
9510B7224j2013n311r145R37J2305N467j147m765p120N126L549R91j3951o256
$$ 27224 15211 9900 755 1692 13997 19464 18317 13552 6432 11558 15107 16098 2147 -4109
9496d109Q552K396j0984l936M802m042N637J3284L795j4094n158J2910M646j6992
$$ -4109 4443 6839 -4145 -8081 -3279 -7321 -1684 11600 15395 1301 -3857 9053 13699 -3293
9482c293k857J1173J527q062j454p924M73Q792P592p282o690Q030Q542M215q186
$$ -3293 -6150 5023 6550 -1512 -2966 -10890 -10417 -1625 5967 -1315 -8005 25 8567 12782 4596
9467D596k2706J0563J7763n164j7014o810j068J042K460k570M598O101K248r006
$$ 4596 -18110 -7547 10216 5052 -11962 -18772 -19840 -18798 -16338 -18908 -14310 -8209 -5961 -14967
9453a4967l031O172K316P79J305r72n259O030J5765p867K728L437m766J907J7650
$$ -14967 -17998 -11826 -9510 -8731 -7426 -8398 -13657 -7627 8138 271 2999 6436 1670 3577 21227
9438B1227N576n175j1446j849p497j1350o542M092M177N760P464K789r275J781
$$ 21227 26803 21628 10182 8333 836 -10514 -17056 -12964 -8787 -3027 4437 7226 -2049 -268
9424b68M232l343J336q662O910L443j474o16J127j353R322P499K174o070n489
$$ -268 3964 621 1957 -6705 205 3648 2174 1558 2685 1332 10654 18153 20327 14257 8768
9409H768j1940L004J076j900j74Q01q718N410N198k946L487L684r928j6317l207
$$ 8768 -3172 -168 908 -992 -1166 -365 -9083 -3673 1525 -1421 2066 5750 -4178 -20495 -23702
9394b3702L419O300N548m641m416M033J4151R646J0594j3724l082k910j506O23
$$ -23702 -20283 -13983 -8435 -13076 -17492 -13459 692 10338 20932 7208 4126 1216 -290 333
9380C33J4593Q218j5674j4463n030M650J870n889J0835j755m50O96J1069l580
$$ 333 14926 23144 7470 -6993 -12023 -7373 -5503 -11392 -557 -2312 -2762 -2066 9003 5423
9366E423m590J0978Q344j3713o689P530M321L057l306m385J459k220N409j002
$$ 5423 833 11811 20155 6442 -247 7283 11604 14661 11355 6970 8429 6209 11618 10616
9352A0616k877n616j0685q02M529k626j521P919J383j647O300K383K947Q245p37
$$ 10616 7739 2123 -8562 -9364 -4835 -7461 -8982 -1063 320 -1327 4973 7356 10303 18548 17811
9337A7811K23o082k420j9624j5102J545N962J5856n341J352J4322K293p783n077
$$ 17811 18034 11952 9532 -10092 -25194 -23649 -17687 -1831 -7172 -5820 8502 10795 3012 -2065
9323b065O720J358J247j638p612m556R604M550p035J914m47l448k589p903k246
$$ -2065 4655 6013 7260 5622 -1990 -6546 3058 7608 573 2487 2040 -1408 -3997 -11900 -14146
9308a4146M392R797j901L391m298j660j758M786O324r834j5960R32J4552L796
$$ -14146 -9754 43 -1858 1533 -2765 -4425 -6183 -1397 4927 -4907 -20867 -19935 -5383 -1587
9294a587O340q87k596j1201J2333Q144j1288M298k612k702r412j246P698l477
$$ -1587 4753 3866 1270 -9931 2402 10546 -742 3556 944 -1758 -11170 -12416 -4718 -8195
9280h195J2345J4925j934j5395p25J076O728j935j4120j629J0928q923l317r391
$$ -8195 4150 19075 17141 1746 1021 2097 8825 6890 -7230 -8859 2069 -6854 -10171 -19562
9266a9562j111L898o74M933K946J0110J2899m00P139O936k0358o121j3076j2023
$$ -19562 -20673 -16775 -17449 -12516 -9570 540 13439 13039 20178 27114 6756 635 -12441 -24464
9252b4464o834J4993p37J68N910P92J921m8j959K194J5746R832j8562j8639j5340
$$ -24464 -31298 -16305 -17042 -16874 -10964 -10172 -8251 -8299 -10258 -8064 7682 17514 -1048 -19687 -35027
9237c5027J4550J8862M482P55J0981P722m619j2635k196J4343o53p683K467p784
$$ -35027 -20477 -1615 2867 3622 14603 22325 17706 5071 2875 17218 16565 8882 11349 3565
9223C565k907L105q17R280J0207J74j258j3510j1162o3J798J78k236j5723m435
$$ 3565 658 3763 2946 12226 22433 22607 21349 7839 -3323 -3386 -1588 -1410 -3646 -19369 -23804
9208b3804J536Q009J2521J2671j383P046j317j4365n536O25Q727O125N257p323
$$ -23804 -22268 -14259 -1738 10933 9550 16596 15279 914 -4622 -3997 4730 10855 16112 8789
9194H789j986J0471j982N057J025q332k384R691j140k967j2k803o925j0125m878
$$ 8789 6803 17274 15292 20349 21374 13042 10658 20349 19209 16242 16230 13427 6502 -3623 -8501
9179h501M916N364Q478o131j4019N954R934j052j2252m647J596J0868Q703K121
$$ -8501 -3585 1779 10257 4126 -9893 -3939 5995 4943 -7309 -11956 -10360 508 9211 11332
9165A1332j0095K618j4j3382j928j1037J480P339N335K7P304K78n917l624L405
$$ 11332 1237 3855 3841 -9541 -11469 -22506 -21026 -13687 -8352 -8325 -1021 -743 -6660 -10284 -6879
9150f879q878q763L195J4355m0n761q704J0511J1453k290p130l235j0588J841
$$ -6879 -15757 -24520 -21325 -6970 -7010 -12771 -21475 -10964 489 -1801 -8931 -12166 -22754 -20913
9136b0913J1317J0424k439l065n70M822l70Q329o751p737q213q32M943m391M351
$$ -20913 -9596 828 -1611 -4676 -5246 -424 -794 7535 784 -6953 -15166 -15998 -11055 -15446 -11095
9121a1095N599n694m538O278J7472o718l53L317q936k237J5338k677l511j2415
$$ -11095 -5496 -11190 -15728 -9450 8022 1304 951 4268 -4668 -6905 8433 5756 2245 -10170
9107a0170m542n807M089N150k934K0838P045l465j5388j8063O304K113j959m946
$$ -10170 -14712 -20519 -16430 -11280 -14214 6624 13669 10204 -5184 -23247 -16943 -14830 -16789 -21735
9093b1735Q868J3774j60p467k173R577N46l810n133p811j388l198j495O875p3
$$ -21735 -12867 907 747 -6720 -8893 684 1230 -2580 -7713 -15524 -16912 -20110 -21605 -14730 -14803
9078a4803j3453n548M939J7046J0688J2681m729j160P868j2085j5484l244N520
$$ -14803 -28256 -33804 -28865 -11819 -1131 11550 6821 5661 13529 1444 -14040 -17284 -11764
9065a1764O698p03k454p177P933K012q647j8734M936J7526J5149p611l773j986
$$ -11764 -5066 -5769 -8223 -15400 -7467 -5455 -14102 -32836 -27900 -10374 4775 -2836 -6609 -8595
9051h595L393L163l175p523k642o738n85M654J1146N570l15P017P459N22J4644
$$ -8595 -5202 -2039 -5214 -12737 -15379 -22117 -22702 -18048 -6902 -1332 -1647 5370 12829 13351 27995
9036B7995j61j9728n743L385k903j059J7812j4695p406o227j119L206l478j321
$$ 27995 27834 8106 2363 5748 2845 1786 19598 4903 -2503 -8730 -9849 -6643 -10121 -11442
9022a1442O572L895P759P284r809o566J7251J0039k0312k197Q959j8319p692m305
$$ -11442 -4870 -975 6784 14068 4259 -2307 14944 24983 4671 2474 11433 -6886 -14578 -18883
9008a8883M308J6245J5490M516r635J6827l810k3234p026Q621o50j8445O190K4457
$$ -18883 -14575 1670 17160 21676 12041 28868 25058 1824 -5202 3419 2769 -15676 -9486 14971
8994A4971N090n656p428J5933o050n221j3714k875q912L54k298M138J2224K103
$$ 14971 20061 14405 6977 22910 16860 11639 -2075 -4950 -13862 -13508 -15806 -11668 556 2659
8980B659P659Q97k435n92k08m443o858m03Q345k862j5366r18J5178J5860o191
$$ 2659 10318 11215 8780 8188 7980 3537 -3321 -3724 4621 1759 -13607 -14525 653 16513 10322
8965A0322m097k156J410p075r507N989O633J1100L90R302P56j2313p621j16j1749
$$ 10322 6225 4069 5479 -1596 -11103 -5114 1519 12619 13009 22311 23067 10754 3133 3017 -8732
8950h732o293J2064J2315J4202p442o957O236M406l379j69l115p484j773j775
$$ -8732 -15025 -2961 9354 23556 16114 9157 15393 19799 16420 16251 13136 5652 3879 2104
8936B104l918N414J3031J1858j9841j1453N77j870m41l624j338q69J4166Q965
$$ 2104 -1814 3600 16631 28489 8648 -2805 -2228 -4098 -4539 -8163 -9501 -10370 3796 12761
8922A2761N515J857j0867j0066L066J284P578P936K839k420j556j1716m548R798
$$ 12761 18276 20133 9266 -800 2266 3550 11128 19064 21903 19483 17927 6211 1663 11461
8908A1461O95j5631j743M420j0242k707j1815J3839J1521J2999J2895q001j1879
$$ 11461 12156 -3475 -5218 -798 -11040 -13747 -25562 -11723 -202 12797 25692 17691 5812
8895E812j2029r119r792K305R711j0318K615K042P26N432M091o861j0773P562
$$ 5812 -6217 -15336 -25128 -22823 -13112 -23430 -20815 -18773 -18047 -12615 -8524 -15385 -26158 -18596
8881a8596K1888P802j1871M840j319p778Q39m501k522j220j306l835M051M561
$$ -18596 3292 11094 -777 4063 2744 -5034 -4195 -8696 -11218 -12438 -13744 -17579 -13528 -8967
8867h967j4738j175J2843J630n974r68P875k284l938k764O986J2649j1586j5786
$$ -8967 -23705 -24880 -12037 -10407 -16381 -17349 -9474 -11758 -15696 -18460 -11474 1175 -10411 -26197
8853b6197L170J5107o77r442k136Q343o323K970j55N497l083k688j0525J3195
$$ -26197 -23027 -7920 -8597 -18039 -20175 -11832 -18155 -15185 -15340 -9843 -12926 -15614 -26139 -12944
8839a2944K2033O925O042K585j7679o585r064k016Q871m35L043K728M394L024
$$ -12944 9089 16014 22056 24641 6962 377 -8687 -10703 -1832 -2267 776 3504 7898 10922
8825A0922q798j1038L61j1251l575Q657J7960J0963j3132j5001Q818K3303N385
$$ 10922 2124 -8914 -8553 -19804 -23379 -14722 3238 14201 1069 -13932 -5114 18189 23574
8812B3574o446j2411M995J071J831k260Q43K885p56l932m212Q937R442j157n248
$$ 23574 17128 4717 9712 10783 12614 10354 11197 14082 13326 9394 5182 14119 23561 22404 17156
8797A7156J2212l394j5847k339j4133R45j2273N407N102K747O702k246l091l834
$$ 17156 29368 25974 10127 7788 -6345 -5400 -17673 -12266 -7164 -4417 2285 39 -3052 -6886
8783f886R920j1381n118J669N917m990L000N676Q50O693m369m435l901q733R752
$$ -6886 3034 -8347 -13465 -11796 -5879 -10869 -7869 -2193 -1343 5350 981 -3454 -7355 -16088 -6336
8768f336J6062L065O03M262O896J4889J27j2511N545n012r108j544j8140q73J5258
$$ -6336 9726 12791 13394 17656 24552 39441 39568 27057 32602 27590 18482 16938 -1202 -2075 13183
8753A3183o919m04M174p289j1083m448K0769L486m519l185O39R958l97j4696P50
$$ 13183 6264 5860 10034 2745 -8338 -12786 7983 11469 6950 3765 4404 14362 13965 -731 19
8738A9J0715J946m327l26L574l984q056k559M388M80L100k403o224j091m183N731
$$ 19 10734 12680 8353 8027 11601 7617 -439 -2998 1390 1870 4970 2567 -3657 -4748 -8931 -3200
8722c200J0115P174n457n288j8700j1307J5485J1245j4075R402l581q976J0637
$$ -3200 6915 14089 8632 3344 -15356 -26663 -11178 67 -14008 -4606 -8187 -17163 -6526
8709f526M465q223r635M593J9604J038m227j9442o900k524J636J3206J4376L995
$$ -6526 -2061 -10284 -19919 -15326 4278 5316 1089 -18353 -25253 -27777 -26141 -12935 1441 5436
8695E436j79r891o742N062J4749j0777m177P93M476J1716q091L172J6776J2265
$$ 5436 5257 -4634 -11376 -6314 8435 -2342 -6519 -5726 -1250 10466 2375 5547 22323 34588
8681C4588j6876o267n007q566l386L884N36r48j97J327k290K886p544k825k305
$$ 34588 17712 11445 6438 -2128 -5514 -1630 -1094 -2042 -2239 -912 -3202 -316 -7860 -10685 -12990
8666a2990o914M601j991n11J3400J2614P984J0202J904r279l653q04L145j1251
$$ -12990 -19904 -15303 -17294 -17805 -4405 8209 16193 26395 28299 19020 15367 14563 17708 6457
8652F457q949L794J9101O835Q11l676q993j3004Q877K317l784p303j0882k416
$$ 6457 -2492 1302 20403 27238 28049 24373 15380 2376 11253 13570 9786 2483 -8399 -10815
8638a0815J5011J972o960p705j174m348m835m47o851P92K086Q059r028J2906R927
$$ -10815 4196 6168 -792 -8497 -9671 -14019 -18854 -19301 -26152 -25360 -23274 -15215 -24243 -11337 -1410
8623a410M461n085n202L32l488O694p22q302j281L821M54J427O193L400N272J306
$$ -1410 3051 -2034 -7236 -6904 -10392 -3698 -4420 -12722 -14003 -10182 -9728 -8301 -2108 1292 6564 7870
8607G870j1190m501M455J474L040K18n448k369O519N066J4349N531O28j2039m350
$$ 7870 -3320 -7821 -3366 -1892 1148 1366 -4082 -6451 68 5134 19483 25014 25642 13603 9253
8592I253o815l703J342m263n983o894O136l888o176R733J755k673j258J1487J1350
$$ 9253 2438 -1265 77 -4186 -10169 -17063 -10927 -14815 -20991 -11258 -9503 -12176 -13434 -1947 9403
8577I403N137q251J27L281l9m49k767Q399L26j5444j6206J0964J4036r5j777j4349
$$ 9403 14540 6289 6416 9697 9658 9209 6442 14841 15167 -277 -16483 -5519 8517 8422 6645 -7704
8561g704o900j2116N693J9109L122m881P850j763J0872J9806l955k0147j8001
$$ -7704 -14604 -26720 -21027 -1918 1204 -3677 4173 2410 13282 33088 29133 8986 -9015
8548i015j3324R52q9m3J1401J8739k23o678K039l749J207J1822r744j9024Q276
$$ -9015 -22339 -21387 -21476 -21519 -10118 8621 8398 1720 3759 10 1217 13039 3295 -15729 -7453
8533g453K196M514Q92o722m914j4184Q010P336N420m057o276j878J2670J381O75
$$ -7453 -5257 -743 149 -6573 -11487 -25671 -17661 -10325 -4905 -8962 -15238 -17116 -4446 -3065 -2390
8518b390k355m889L292K021r744o346o917O892J3415J2292j4267j8294M777J9915
$$ -2390 -4745 -9634 -6342 -4321 -14065 -20411 -27328 -20436 -7021 5271 -8996 -27290 -22513 -2598
8504b598O907J511r199j7563r071K893N203P640O651K0265j2993j5700N690P750
$$ -2598 4309 5820 -3379 -20942 -30013 -27120 -21917 -14277 -7626 12639 -354 -16054 -10364 -2614
8490b614K2860M1008J7558j682J128k198j1343j9189m1780l3252l449J3634K288
$$ -2614 20246 61254 78812 77130 78258 76060 64717 45528 3748 -29504 -32953 -19319 -17031
8477a7031R896K430r751l137j1550K911J2443N250q00J0655r202j5250k826L131
$$ -17031 -7135 -4705 -14456 -17593 -29143 -26232 -13789 -8539 -9339 1316 -7886 -23136 -25962 -22831
8463b2831K948J498J5408P093L827L795J4201J1825o541j6330j8013k9158m534
$$ -22831 -19883 -18385 -2977 4116 7943 11738 25939 37764 31223 14893 -3120 -32278 -36812
8450c6812O684Q243M440R234J0629l521j6671o562j0166N160O094J6205J3277
$$ -36812 -30128 -21885 -17445 -8211 2418 -1103 -17774 -24336 -34502 -29342 -23248 -7043 6234
8437F234J3526j6274j2804M033p431K293N384J867p56q922p756N902J3313J1939
$$ 6234 19760 3486 -9318 -5285 -12716 -10423 -5039 -3172 -3928 -12850 -20606 -14704 -1391 10548
8423A0548J9218J4693j2114j6710n173M139o292n901Q639N458j0317q214k988
$$ 10548 29766 44459 32345 15635 10462 14601 8309 2408 11047 16505 6188 -2026 -5014
8410e014p038J5381M744k244k546o232o85J2435J499k870J2555r315q135j054
$$ -5014 -12052 3329 8073 5829 3283 -2949 -3634 8801 10300 7430 19985 10670 2535 1481
8396A481J0741K272n228j4776K282P637J335J1678l385p456r182J1504J3408o253
$$ 1481 12222 14494 9266 -5510 -3228 4409 5744 17422 14037 6581 -2601 8903 22311 16058
8382A6058j3646M97J4103J813j0310j8349j3547J2325R514N983K768n873j4269
$$ 16058 2412 2909 17012 18825 8515 -9834 -23381 -11056 -1542 4441 7209 1336 -12933
8369a2933R49J4416J5073k202r669j0906p507o3J0746J7335J559p035k810j0595
$$ -12933 -11984 2432 17505 15303 5634 -5272 -12779 -12842 -2096 15239 16798 9763 6953 -3642
8355c642o522p13n709o141o510n572J9975L3805n899m256m151q727R917j6397
$$ -3642 -10164 -10877 -16586 -22727 -29237 -34809 -14834 18971 13072 8816 4665 -4062 5855 -10542
8341a0542j8700j37j0071J7170O478J0118J0132o344j4794M439J67r882P539k82
$$ -10542 -29242 -29379 -39450 -22280 -15802 -5684 4448 -1896 -16690 -12251 -12084 -21966 -14427 -14709
8327a4709p059O384L914j849r35J4232P50l434Q788N341j3595q591j0184L161
$$ -14709 -21768 -15384 -11470 -13319 -14254 -22 728 -2706 6082 11423 -2172 -10763 -20947 -17786
8313a7786q668n616M226J3484O238J1470J5015l164k564P291k038j2775j332n332
$$ -17786 -26454 -32070 -27844 -14360 -8122 3348 18363 15199 12635 19926 17888 5113 3781 -1551
8299a551l80Q830r685j0419P29O588M530q496m865K97J2759Q784l730j1207p30
$$ -1551 -1931 6899 -2786 -13205 -12476 -5888 -1358 -9854 -14719 -14422 -1663 7121 3391 -7816 -8546
8284h546j757P943R554J2936j0314j3985J096m74R488L168O012n948l850j0882
$$ -8546 -10303 -2360 7194 20130 9816 -4169 -3073 -3547 5941 9109 15121 9173 5323 -5559
8270e559l339o992n623p419J2115J5244k991n644Q401n579q763n007k569J148
$$ -5559 -8898 -15890 -21513 -28932 -16817 -1573 -4564 -10208 -1807 -7386 -16149 -21156 -23725 -22577
8256b2577j38j0178K884J8532j348q958J5356Q126L88n688K526p465n794N427
$$ -22577 -22715 -32893 -30009 -11477 -12825 -21783 -6427 1699 2087 -3601 -1075 -8540 -14334 -8907
8242h907P411o708j802O22L778J883M619p580j4346j162Q964O016O417J2170n782
$$ -8907 -1496 -8204 -10006 -9384 -5606 -3723 896 -6684 -21030 -22192 -13228 -7212 -795 11375 5593
8227E593q788l545k220m0o119o758O418J2708j2774K556J0999N678j432j0603
$$ 5593 -3195 -6740 -8960 -9000 -15119 -21877 -15459 -2751 -15525 -12969 -1970 3708 2276 -8327
8213h327r997K135O673J481l554j2515N612J4138j652q60Q950k181p283K065j361
$$ -8327 -18324 -16189 -9516 -8035 -11589 -24104 -18492 -4354 -6006 -6866 2084 -97 -7380 -5315 -6676
8198f676L125J1540N867L513r114j1449L073Q003o305L322m169j3064m002J5085
$$ -6676 -3551 7989 13856 17369 8255 -3194 -121 7882 1577 4899 730 -12334 -16336 -1251
8184a251j2468l391K0750J024p075O203j317L234l595r495n016m814P826O487
$$ -1251 -13719 -17110 3640 4664 -2411 3792 2475 5709 2114 -7381 -12397 -17211 -9385 -2898
8170b898N856R465L418p378q771r92O88R080J1069j963m918k1500j532j462k800
$$ -2898 2958 12423 15841 8463 -308 -1300 -612 8468 19537 17574 12656 -8844 -10376 -11838 -14638
8155a4638Q204j05k662k687o046o707L035K0803J0450q18n508m014r687n066J555
$$ -14638 -6434 -6539 -9201 -11888 -17934 -24641 -21606 -803 9647 8829 3321 -693 -10380 -15446 -13891
8140a3891K901k396l893k539P312R076L516n445l347N069O59p316j841n376L03
$$ -13891 -10990 -13386 -17279 -19818 -12506 -3430 86 -5359 -8706 -3637 -2978 -10294 -12135 -17511 -17208
8125a7208J1907J205k339l4K164J022L061N363j1874j064R651j0939o225J4530
$$ -17208 -5301 -4096 -6435 -6469 -4305 -3283 -222 5141 -6733 -7797 1854 -9085 -15310 -780
8111g80J6357P592n669J350J999j1595k10j1302j3225p344M401Q981J5517P337
$$ -780 15577 23169 17500 18850 20849 9254 9044 -2258 -15483 -22827 -18426 -9445 6072 13409
8097A3409p456l571q055J31P028j0679k310J499J3495M604n670q870K971J1593
$$ 13409 5953 2382 -5673 -5542 1486 -9193 -11503 -10004 3491 8095 2425 -6445 -3474 8119
8083H119q35k848L22l995m976j084p499J715J2972n083O21J660J865o82M893l639
$$ 8119 7284 4436 4758 763 -4213 -5297 -12796 -11081 1891 -3192 -2571 -911 954 272 5165 1526
8067A526K941j44Q6l324m535L594j3532l035q166N908J5196K028J0122J031l862
$$ 1526 4467 4323 4409 1085 -3450 144 -13388 -16423 -24589 -18681 -3485 -1457 8665 9696 5834
8052E834r289M375L679J1288p207j2177O109m087N386L116n362p48o386k089k099
$$ 5834 -3455 920 4599 15887 8680 -3497 2612 -1475 3911 7027 1665 917 -5469 -7558 -9657
8037i657J03n054K269j386m617m483K0242N72o097j517m98j338K041J5690j626
$$ -9657 -9554 -14608 -12339 -13725 -18342 -22825 -2583 -2011 -8108 -9625 -10123 -11461 -9420 6270 4644
8022D644L271k153j847K895j1306k766J4804J1382O53M658k811k976O443k562
$$ 4644 7915 5762 3915 6810 -4496 -7262 7542 18924 19577 24235 21424 18448 24891 22329
8008B2329q227j0215N139p265j996p885K429R398J464P25M392L126j5688O565
$$ 22329 14102 3887 9026 1761 -235 -8120 -5691 3707 5171 5896 10288 13414 -2274 4291
7994D291J2406j358J997n120j002j701O701Q787o116o244j1800m241K514q863
$$ 4291 16697 15339 17336 12216 11214 9513 16214 25001 18885 12641 841 -3400 -886 -9749
7980i749j0240j4763N230J0487J2521k643k763J0881J196m951j956r5K984O871
$$ -9749 -19989 -34752 -29522 -19035 -6514 -9157 -11920 -1039 157 -4794 -6750 -6845 -3861 3010
7966C010j0639r847N838l92J8065O231J2685j0046j2091R949M00m817j393P508
$$ 3010 -7629 -17476 -11638 -12030 6035 12266 24951 14905 2814 12763 13163 8346 6953 14461
7952A4461l28j3182J80j726o633r015p899K955J3509J837J846j1493o230M276
$$ 14461 14133 951 1131 -595 -7228 -16243 -24142 -21187 -7678 -5841 -3995 -15488 -21718 -17442
7938a7442J4816R820L357K057l000L180k627j1987n392J0181R218j46J49j0065
$$ -17442 -2626 7194 10551 12608 9608 12788 10161 -1826 -7218 2963 12181 12035 12184 2119
7924B119r0Q40l940m793M178L060M867L803j4054q593l415k095P796n545J315
$$ 2119 2029 2869 -1071 -5864 -1686 1374 6241 10044 -4010 -12603 -16018 -18113 -10317 -15862 -14547
7909a4547J8097J2581j66K4N831r719o847j813M354l311J5650P097N557m401j2409
$$ -14547 3550 16131 15965 15989 21820 12101 5254 3441 7795 4484 20134 27231 32788 28387 15978
7894A5978j2736J7203J5883n824k3053Q19M55j0501J009P649J150q695p745r020
$$ 15978 3242 20445 36328 30504 7451 8270 8725 -1776 -767 6882 8032 -663 -8408 -17428
7880a7428j6535J3370J9442J4063l403m644M682J1771j058l996r124o41q416p972
$$ -17428 -33963 -20593 -1151 12912 9509 4865 9547 21318 20260 16264 7140 6499 -1917 -9889
7866i889M308Q30R822N600n515j1851R052l902K207O137O712j5360j3021K572
$$ -9889 -5581 -4751 5071 10671 5156 -6695 2357 -1545 662 6799 13511 -1849 -14870 -12298
7852a2298N77J2515j335L93q758L540K993m996K599N634J6332k020r484r330q827
$$ -12298 -11721 794 -541 -148 -8906 -5366 -2373 -7369 -4770 864 17196 15176 5692 -3638 -12465
7837a2465Q43K521R791J1214j2141p1R441L131o008n336j026Q443K172o195q377
$$ -12465 -11622 -9101 690 11904 -237 -308 9133 12264 6256 920 -106 8337 10509 4314 -4063
7822d063m108Q99j258K801P563m975j6337K333q4L362P42j445N096L607M192K331
$$ -4063 -8171 -7272 -8530 -5729 1834 -3141 -19478 -17145 -17229 -13867 -13125 -14570 -9474 -5867 -1675 656
7806F56j289j4804k0129k115J4657R273M046J3970m305O169J4349R80j0720k9218
$$ 656 -633 -15437 -35566 -37681 -23024 -13751 -9705 4265 -40 6129 20478 21458 10738 -18480
7792a8480k328J8207P293R57N762o602n172P245L267r349J1441j777o924o96n920
$$ -18480 -20808 -2601 4692 5649 11411 4809 -363 6882 10149 800 12241 10464 3540 2844 -3076
7777c076j3996j981J9060J726r396K496K105l389m398J0461M337k195K708K204
$$ -3076 -17072 -19053 7 1733 -7663 -5167 -3062 -6451 -10849 -388 3949 1754 4462 6666
7763F666k767r6k020n954r676K865p590O373R288J0360R504j0105m289O061O482
$$ 6666 3899 3803 1783 -4171 -13847 -10982 -18572 -12199 -2911 7449 16953 6848 2559 8620 15102
7748A5102L324l901j3316r249J857n538N17N078j435k658Q173P319j4577q966
$$ 15102 18426 14525 1209 -8040 -6183 -11721 -11204 -6126 -7561 -10219 -2046 5273 -9304 -18270
7734a8270R012J6085K896L665j0547p167j167M782P893J6837l639j7748j7205
$$ -18270 -9258 6827 9723 13388 2841 -4326 -5493 -711 7182 24019 20380 2632 -14573
7721a4573j0167K4853q554j8487R3Q273P006J608n782j11R375N803Q001L035k514
$$ -14573 -24740 113 -8441 -26928 -26835 -18562 -11556 -9948 -15730 -15841 -6466 -663 7338 10373 7859
7706G859j4891q962N531K0419J795Q887n788j0331o002o250j2368j34N763J0459
$$ 7859 -7032 -15994 -10463 9956 11751 20638 14850 4519 -1483 -7733 -20101 -20235 -14472 -4013
7692d013P770m7j3321j688O061M201Q744k512j138j8780l450O560J0125L60j3500
$$ -4013 3757 3710 -9611 -11299 -5238 -1037 7707 5195 4057 -14723 -18173 -11613 -1488 -1128 -14628
7677a4628j192k969Q385j4605n023N042P086Q240Q72q998J0001J0051K987P84
$$ -14628 -15820 -18789 -10404 -25009 -30032 -24990 -17904 -9664 -8792 -17790 -7789 2262 5249 6033
7663F033Q663l215J127l863l435j2338J891J4933M463L547M426j9031k642L283
$$ 6033 14696 11481 12608 8745 5310 -7028 -5137 9796 14259 17806 22232 3201 559 3842
7649C842P700p494j582k623m57n000Q18L63j0457j1181J5736L379M027q812p255
$$ 3842 11542 4048 2466 -157 -614 -5614 -4796 -4433 -14890 -26071 -10335 -6956 -2929 -11741 -18996
7634a8996K770N196K960q974N07J8146J0364j117k4280j4874O554k579L351P422
$$ -18996 -16226 -11030 -8070 -17044 -16537 1609 11973 10856 -13424 -28298 -21744 -24323 -20972 -13550
7620a3550k585O036J746J1599L941p673M731k413r181q039J1688J8729P6n436
$$ -13550 -16135 -10099 -8353 3246 7187 -486 4245 1832 -7349 -15388 -3700 15029 15105 9669
7606I669P416j71k449Q491M80j9152q351N221m119J59J351n658P576Q048K386
$$ 9669 17085 16914 14465 22956 23436 4284 -4067 1154 -2965 -2806 -1455 -7113 463 8511 10897
7591A0897j185k877P59j1778M89J455n836M693O041j4525m112m355n073j923R657
$$ 10897 9712 6835 7594 -4184 -3695 -2240 -8076 -3383 2658 -11867 -15979 -20334 -25407 -27330 -17673
7576a7673J2816P586K772p838Q456P87r321K024n432r469K010M308P944J871O904
$$ -17673 -4857 2729 5501 -2337 6119 6906 -2415 -391 -5823 -15292 -13282 -8974 -1030 841 7745
7561G745m242j9697j285K318K997K22L817R548K06n091m20j344k983L733N550
$$ 7745 3503 -16194 -17479 -15161 -12164 -11942 -8125 1423 1629 -3462 -3882 -5226 -8209 -4476 1074
7546A074j468q484N44M498N539M95J7999r689N697m30j2184m45L324Q852j5461
$$ 1074 -394 -8878 -8334 -3836 1703 2198 20197 10508 16205 15775 3591 3146 6470 15322 -139
7531a39N63M401M514j247n613k061N435J7306R942k4687j4064N133q710p590r088
$$ -139 424 4825 9339 8092 2479 418 5853 23159 33101 8414 -5650 -517 -9227 -16817 -25905
7516b5905J227l735R242J730L103R764J3778M11j2904n020j277L375Q004r644
$$ -25905 -24678 -28413 -19171 -17441 -14338 -4574 9204 9615 -3289 -8309 -9586 -6211 1793 -7851
7502g851o299k975o285j866l106m144O231J26J5187J6957p571m343m612j2906
$$ -7851 -14150 -17125 -23410 -25276 -28382 -32526 -26295 -26169 -10982 5975 -1596 -5939 -10551 -23457
7488b3457m377R178J0602R713Q083k136m072n658j4338M739j808J1065J0041m129
$$ -23457 -27834 -18656 -8054 1659 9742 7606 3534 -2124 -16462 -11723 -13531 -2466 7575 3446
7474C446N674l146n68o694o936L302J2979J2304m446m372j0332J0223J4957q439
$$ 3446 9120 5974 5406 -1288 -8224 -4922 8057 20361 15915 11543 1211 11434 26391 17952
7460A7952j9580o892L523J8908N138o332l345o569m384N779o561m932J874J810
$$ 17952 -1628 -8520 -4997 13911 19049 12717 9372 2803 -1581 4198 -2363 -7295 -5421 -3611
7446c611o655j3900J680Q851P638O043j12J0765J472K346n548L612q995J106j4083
$$ -3611 -10266 -24166 -22486 -13635 -5997 46 -66 10699 12171 14517 8969 12581 3586 4692 -9391
7431i391j0356J567J2524J260o525M042O000n488L373k660L801M478r546j088
$$ -9391 -19747 -18180 -5656 -4396 -10921 -6879 -879 -6367 -2994 -5654 -1853 2625 -6921 -8009
7417h009l101p851M386J4636J3794m582j8265j0488l539k51K309k310M311j5843
$$ -8009 -11110 -18961 -14575 61 13855 9273 -8992 -19480 -23019 -23270 -20961 -23271 -18960 -34803
7403c4803J626P968J2790J2788Q874n662R854q712m422m152K217K815m528J99
$$ -34803 -33177 -25209 -12419 369 9243 3581 13435 4723 301 -3851 -1634 1181 -3347 -3148
7389c148O525J2575j0086k1588o893R96J9594J2102K539q714j1815p780J4922
$$ -3148 3377 15952 5866 -15722 -22615 -21619 -2025 10077 12616 3902 -7913 -15693 -771
7376g71J1369r795k4688j247J662J2086J3584Q869o37q930j4240P81L44o901j089
$$ -771 10598 803 -23885 -25132 -23470 -11384 2200 11069 10432 1502 -12738 -11957 -11613 -18514 -19603
7361a9603J944P869O234O492P925o70k817q38l91M495j1677j1344K508L007j813
$$ -19603 -17659 -9790 -3556 2936 10861 10191 7374 6536 6145 10640 -1037 -12381 -9873 -6866 -8679
7346h679N578l275n041M913J1304p853j5925K157J1270J8921Q797P889k706j8125
$$ -8679 -3101 -6376 -11417 -6504 4800 -3053 -18978 -16821 -5551 13370 22167 30056 27350 9225
7332I225r990l4m225O887m813J304P820j6m087m0r595N742J2533r723K37n111
$$ 9225 -765 -799 -5024 1863 -2950 -1646 6174 6158 2071 2031 -7564 -1822 10711 988 1225 -3886
7316c886m822L34Q882k405m213N993J1333o896r647K478p647J4769J1870K209
$$ -3886 -8708 -8374 508 -1897 -6110 -117 11216 4320 -5327 -2849 -10496 4273 16143 18352
7302A8352k084o57K418J1528r28o010j3074j4327K435j2281k400Q716m868m328
$$ 18352 16268 15611 18029 29557 28629 22619 9545 -4782 -2347 -14628 -17028 -8312 -13180 -17508
7288a7508J2963M234j477O980Q49k546r325q601M980P776P172J782j5601j7067
$$ -17508 -4545 -311 -1788 5192 6041 3495 -5830 -14431 -9451 -1675 5497 7279 -8322 -25389
7274b5389J0708K449J3725k58m72J144m459j058P897n328j102L439R82N224j2156
$$ -25389 -14681 -12232 1493 1235 763 1907 -2552 -3610 4287 -1041 -2143 1296 2278 7502 -4654
7259d654q389j784N735O742o061Q36J4199j6372j3998J2209K2074q142n051o718
$$ -4654 -13043 -14827 -9092 -2350 -8411 -7575 6624 -9748 -23746 -11537 10537 2395 -2656 -9374
7245i374m528m913P824J2206j302r631k306J7653J7582j25j6110j3514K691n278
$$ -9374 -13902 -18815 -10991 1215 -87 -9718 -12024 5629 23211 23086 6976 -6538 -3847 -9125
7231i125o957R762R983R83m872n492R75j977J356l141K446k95o242j748J0660
$$ -9125 -16082 -6320 3663 4646 -226 -5718 -4743 -6720 -5364 -8505 -6059 -6354 -12596 -14344 -3684
7216c684J5148J1076j0620k4156P641Q320M257n344o04R81j3430k664M726J934
$$ -3684 11464 22540 11920 -12236 -4595 3725 7982 2638 2034 3015 -10415 -13079 -8353 -6419
7202f419n205k386R100m294O633m484k099J4293J0466o222j236m684j1392O003
$$ -6419 -11624 -14010 -4910 -9204 -2571 -7055 -9154 5139 15605 9383 8147 3463 -7929 -1926
7188a926j7127j8110P690P922J5729m014j857m157J325J0676k729j2763O795J5822
$$ -1926 -19053 -37163 -29473 -21551 -5822 -9836 -11693 -15850 -14525 -3849 -6578 -19341 -12546 3276
7174C276j460q332o128Q410L725O371r318r898o2K1738L815j548O474r52k798
$$ 3276 1816 -6516 -12644 -4234 -509 5862 -3456 -13354 -13416 8322 12137 10589 17063 16111 13313
7159A3313j0063p423J494R514o983M075n481l613J3471j0271j7652M507O476J271
$$ 13313 3250 -4173 -2679 6835 -148 3927 -1554 -5167 8304 -1967 -19619 -15112 -8636 -7365
7145g365j0668o482P368J9286Q798r051q062k2223k483K891R253J1398O858r252
$$ -7365 -18033 -24515 -17147 2139 10937 1886 -6176 -28399 -30882 -27991 -18738 -7340 -482 -9734
7131i734N954m102M975J1574j921j1618j1773m183K2406J3495j02P049L680q679
$$ -9734 -3780 -7882 -2907 8667 6746 -4872 -16645 -20828 1578 15073 14971 22020 25700 17021
7117A7021m469j1782J424J4341j8788j297M62L202R98j829J710l021Q99J2331
$$ 17021 12552 770 2194 16535 -2253 -3550 -3088 114 1112 -717 993 -2028 -1129 11202
7103A1202Q852k020j4630K401j453j0078l634p351j3649M707J2540M967o376P978
$$ 11202 20054 18034 3404 5805 4352 -5726 -9360 -16711 -30360 -25653 -13113 -8146 -14522 -6544
7089f544M796J737J3468R411k515l598j0258o575M959p612J340N651K884m295
$$ -6544 -1748 -11 13457 22868 20353 16755 6497 -78 4881 -2731 -1391 4260 7144 2849
7075B849j8304m153n071L726J0855P160N295L030j2199o406J625k504P910N347
$$ 2849 -15455 -19608 -24679 -20953 -10098 -2938 2357 5387 -6812 -13218 -11593 -14097 -6187 -840
7061h40n760j338l653q702J1851R633K299k498r377J3374p492n729R307r501p38
$$ -840 -6600 -7938 -11591 -20293 -8442 1191 3490 992 -8385 4989 -2503 -8232 1075 -8426 -9164
7046i164J6371j388o984k1337q382o595J675J3351J4665L751L466K455K676N91
$$ -9164 7207 5819 -1165 -22502 -30884 -37479 -35804 -22453 -7788 -4037 -571 1884 4560 5151
7032E151j575l440l388J0855l934j2098m182J0370K680M734r544j844N887r62
$$ 5151 3576 136 -3252 7603 3669 -8429 -12611 -2241 439 5173 -4371 -6215 -328 -1290
7018a290m985n886k693p223N161l90k215K2261R843j672p396r890J1968k0801
$$ -1290 -6275 -12161 -14854 -22077 -16916 -17306 -19521 2740 12583 10911 3515 -6375 5593 -15208
7004a5208k736J1992M086J0635j5265j8932J4685M16J7939N780p805m715K645
$$ -15208 -17944 -5952 -1866 8769 -6496 -25428 -10743 -10327 7612 13392 5587 872 3517
6991C517M605k725p215k2192j024K311p055P821k54j469J4760J840j0502n888
$$ 3517 8122 5397 -1818 -24010 -25034 -22723 -29778 -21957 -22211 -23680 -8920 -7080 -17582 -23470
6977b3470O068K174q458o775J0294R129n13r321J0300L999n912q381p070J927
$$ -23470 -17402 -15228 -23686 -30461 -20167 -11038 -11551 -20872 -10572 -6573 -12485 -20866 -27936 -26009
6963b6009L674O546R166K592q123j4177R863n25K809J3381O88l949j556N057l886
$$ -26009 -22335 -15789 -6623 -4031 -12154 -26331 -16468 -16993 -14184 -803 -115 -4064 -5620 -563 -4449
6948d449O256K099p213m404R89L721m924k079q829R082K760O655j057o132Q45
$$ -4449 1807 3906 -3307 -7711 -6722 -3001 -7925 -10004 -18833 -9751 -6991 -336 -1393 -7525 -6680
6933f680k384M939L307J943n629k787m458m873N958J0508r379J107O093J251j3383
$$ -6680 -9064 -4125 -818 1125 -4504 -7291 -11749 -16622 -10664 -156 -9535 -8428 -2335 -1084 -14467
6918a4467P833Q729k047P35P673l084m379q853p038P607N939l338r263N278J3470
$$ -14467 -6634 2095 48 783 8456 5372 993 -7860 -14898 -7291 -1352 -4690 -13953 -8675 4795
6903D795Q447k063M786P566j3894k3047r123J651K697J457M825j80Q423l001j934
$$ 4795 13242 11179 15965 23531 9637 -13410 -22533 -20882 -18185 -16728 -11903 -12083 -3660 -6661 -8595
6888h595O937O124j0705r23J5894O560p493j903m955n353L577M036O717N32r646
$$ -8595 -1658 4466 -6239 -7162 8732 15292 7799 5896 941 -4412 -835 3201 9918 10450 804
6873H04j567j364M236O716j255O092j697j794J987M388O428J1409M173o912j3552
$$ 804 -763 -2127 2109 8825 7570 13662 11965 10171 12158 16546 22974 34383 38556 31644 18092
6858A8092j0489j870o334j691k037k181l975n515P080N483n817o903N828M807
$$ 18092 7603 5733 -601 -2292 -4329 -6510 -10485 -16000 -8920 -3437 -9254 -16157 -10329 -5522
6844e522O659O383O603l516p622p802R069J0031L404j3461J865R890K711k291
$$ -5522 1137 7520 14123 10607 2985 -4817 4252 14283 17687 4226 6091 15981 18692 16401
6830A6401m492k6498M228K5272l986r018o621q715J158K225n122p64J668K1268
$$ 16401 11909 -14589 -10361 14911 10925 1907 -4714 -13429 -12271 -10046 -15168 -15932 -14264 7004
6816G004J2524M811K601k4954K363o102m930r202q713Q365J2304J0042N916k0
$$ 7004 19528 24339 26940 1986 4349 -1753 -6683 -15885 -24598 -16233 -3929 6113 12029 12009
6802A2009p900O332q41j1187j0677q592l817O495J3893J2400o99j8259m576J4408
$$ 12009 4109 10441 9600 -1587 -12264 -20856 -24673 -18178 -4285 8115 7416 -10843 -15419 -1011
6788a011j0067j1802R662K857P426M987K323r28k457n932m639M192M316p988l032
$$ -1011 -11078 -22880 -13218 -10361 -2935 2052 4375 3447 990 -4942 -9581 -5389 -1073 -9061 -12093
6773a2093k291n992M460L087j1826j3561K0401J9537n582j3269M866n613O373
$$ -12093 -14384 -20376 -15916 -12829 -24655 -38216 -17815 1722 -3860 -17129 -12263 -17876 -11503
6760a1503J481n7O296j022J2886j0261K217R036r794n148l460J0424J6523o028
$$ -11503 -10022 -10079 -3783 -4805 8081 -2180 37 9073 -721 -5869 -9329 1095 17618 11590
6746A1590j5023L656J3941j0448m556o347M901n403K59M951N684P837j154m86
$$ 11590 -3433 223 14164 3716 -840 -7187 -2286 -7689 -7430 -2479 3205 11042 9888 9402
6732I402j1735p95J787M124p148L758J5851J478k0215q66P624N14M777O598j9150
$$ 9402 -2333 -3128 -1341 2783 -4365 -607 15244 16722 -3493 -4359 3265 3779 8556 15154 -3996
6717c996j0780O758J8764p570P71K5500n721j7425m301n837R32p331M681J793
$$ -3996 -14776 -8018 10746 3176 3947 29447 23726 6301 2000 -3837 -2905 -10236 -5555 -3762
6703c762j0244l736j714J1038j165k143l311N093J2463m672N996J1369k742p135
$$ -3762 -14006 -17742 -19456 -8418 -9583 -11726 -15037 -9944 2519 -2153 3843 15212 12470 5335
6689E335l643j666k519P817J0518J477J53M109j219n203j743j0749j663J2636
$$ 5335 1692 26 -2493 5324 15842 17319 17472 21581 20362 15159 13416 2667 1004 13640
6675A3640M808l439m81j5421j5814J2486J4062P425j7374j0857O461L1N79J609
$$ 13640 18448 15009 14528 -893 -16707 -4221 9841 17266 -108 -10965 -4504 -4473 -3894 -2285
6661b285n15M914P128j1914K705r21J3024J3563p295j9295o921l756k256J0179
$$ -2285 -2800 2114 9242 -2672 33 -888 12136 25699 18404 -891 -7812 -11568 -13824 -3645
6647c645K718K814P867M351J862l997M660N832Q68q679J314m655k147n412P971
$$ -3645 -927 1887 9754 14105 15967 11970 16630 22462 23330 14651 15965 11310 9163 3751 11722
6632A1722M665q071j0636n671O566k646j2137N187J7985l380m591l241N785m019
$$ 11722 16387 8316 -2320 -7991 -1425 -4071 -16208 -11021 6964 3584 -1007 -4248 1537 -2482
6618b482J0370J2256l520m287j6877p268L842J5495L247Q15q79K763L631j7809
$$ -2482 7888 20144 16624 12337 -4540 -11808 -7966 7529 10776 11591 10712 13475 17106 -703
6604g03k1815k212K863N891R76n958j169N131J4940J7890L593p120l882O03o98
$$ -703 -22518 -24730 -21867 -15976 -15000 -20958 -22127 -16996 -2056 15834 19427 12307 8425 9028 8330
6589H330k475k092Q71r8k0266j2214J107J4681R386J110M579J470P397P968j6387
$$ 8330 5855 3763 4634 4536 -15730 -27944 -26837 -12156 -2770 -1660 2919 4389 11786 19754 3367
6574C367k2936J4286O957K126P051m462j5035o768O936J4965J0105k804M98j6824
$$ 3367 -19569 -5283 1674 3800 10851 6389 -8646 -15414 -8478 6487 16592 13788 14286 -2538
6560b538o161L584j904P671l136K023j0606J5739j224j2680k689m483n256J010
$$ -2538 -8699 -5115 -7019 652 -2484 -461 -11067 4672 3448 -9232 -11921 -16404 -21660 -20650
6546b0650P170M000J172n019l093J4968P040q248J706p69j4343R37P803J632L830
$$ -20650 -13480 -9480 -8308 -13327 -16420 -1452 5588 -2660 -954 -1723 -16066 -15129 -7326 -5694 -1864
6531a864P406l942r104j4151j0704P642J0442J0350J1427J081k704o253l680J062
$$ -1864 5542 1600 -7504 -21655 -32359 -24717 -14275 -3925 7502 8583 5879 -374 -4054 -2992
6517b992M222P871K883P54m912j3860J448K789J834J5402M796j9564R9r468k420
$$ -2992 1230 9101 11984 12738 7826 -6034 -4586 -1797 37 15439 20235 671 770 -8698 -11118
6502a1118L616n663m759m002P365J0315k067j2524M033N052o794j7157l727K2056
$$ -11118 -7502 -13165 -17924 -21926 -14561 -4246 -6313 -18837 -14804 -9752 -16546 -33703 -37430 -15374
6488a5374P192R220J972J503J1953j307l706K586J1997l249j4796p356p959k798
$$ -15374 -8182 1038 3010 4513 16466 15159 11453 14039 26036 22787 7991 635 -7324 -10122
6474a0122j2166J028J7335R191j1577o432m603R477O94l869Q65J5293l972l774
$$ -10122 -22288 -21260 -3925 5266 -6311 -12743 -17346 -7869 -7175 -11044 -10179 5114 1142 -2632
6460b632j1408k034M685K137J1376l654m848n1J7340P005j4609j3115L823m668
$$ -2632 -14040 -16074 -11389 -9252 2124 -1530 -6378 -6429 10911 17916 3307 -9808 -5985 -10653
6446a0653n232j5616J476N603K577K128l896O577Q770J0736Q093j4958m246K961
$$ -10653 -15885 -31501 -30025 -24422 -21845 -19717 -23613 -17036 -8266 2470 10563 -4395 -8641 -5680
6432e680M295r343p470p039J5804N079m257M47L347M927J571M983M084q7n427
$$ -5680 -1385 -10728 -18198 -25237 -9433 -4354 -8611 -8164 -4817 110 1681 6664 10748 10661 5234
6417E234k932l304J596P572R284p048M709M841k271o522j867k493J1214L802j4749
$$ 5234 2302 -1002 594 8166 17450 10402 15111 19952 17681 11159 9292 6799 18013 21815 7066
6402G066j3844K95N075N840k142K433j1955o116J4116O531j0082o410j0200j8611
$$ 7066 -6778 -6483 -1408 4432 2290 4723 -7232 -13348 768 7299 -2783 -9193 -19393 -38004
6388c8004M606J9185P081l283p13P08J2889R533j3266j6336M35m947m462P452
$$ -38004 -33398 -14213 -7132 -10415 -11128 -10420 2469 12002 -1264 -17600 -17165 -22112 -26574 -19122
6374a9122M335J3974o352J363J529J0294p63j0411j1870k398Q55J2373j775j9410
$$ -19122 -14787 -813 -7165 -5802 -4273 6021 5258 -5153 -17023 -19421 -18566 -6193 -7968 -27378
6360b7378j17J4163J1421q161K794J0130J8519J1817j723q667j1675o386J3099
$$ -27378 -27495 -13332 -1911 -10072 -7278 2852 21371 33188 31465 22798 11123 4737 17836
6347A7836q864P97n298r444q514o746P105N075P22o009K954N279P365Q677n046
$$ 17836 8972 9769 4471 -4973 -13487 -20233 -13128 -8053 -7331 -13340 -10386 -5107 2258 10935 5889
6332E889j3368P487M327J1128P080j9063n220O470r792J1961J0284l718j2608
$$ 5889 -7479 8 4335 15463 22543 3480 -1740 4730 -5062 6899 17183 13465 857
6319H57n523n07L507n104N143l842j897m920K124k655J4530J0338j0754m221j276
$$ 857 -4666 -5173 -1666 -6770 -1627 -5469 -7366 -12286 -10162 -12817 1713 12051 1297 -2924 -4200
6304d200N358j629o708L401n285j2855K699J0971j544Q949n478q249J472J9090
$$ -4200 1158 -471 -7179 -3778 -9063 -21918 -19219 -8248 -9792 -843 -6321 -14570 -13098 5992
6290E992K254o448L445R051k266o761j5597j054j976J1244J0569J2515j1952p13
$$ 5992 8246 1798 5243 14294 12028 5267 -10330 -11384 -13360 -2116 8453 20968 9016 8303
6276H303J1234j1168j878l168j4857O693N327o236m323R122J440j6480J0623J1429
$$ 8303 19537 8369 6491 3323 -11534 -4841 486 -5750 -10073 -951 489 -15991 -5368 6061
6262F061j2687R914j448j6932L257M091n487m326K686l774j2655J4429J6648o581
$$ 6061 -6626 3288 1840 -15092 -11835 -7744 -13231 -17557 -14871 -18645 -31300 -16871 -223 -6804
6248f804J929N082J1217n45j1136K81M08j386k999P719O693r756o434K553j2601
$$ -6804 -4875 207 11424 10879 -257 24 432 -954 -3953 3766 10459 703 -5731 -3178 -15779
6233a5779l723J3437N489O826o229j3578r847J1787P087j317J1056K410o088J894
$$ -15779 -19502 -6065 -576 6250 21 -13557 -23404 -11617 -4530 -5847 5209 7619 1531 3425
6219C425Q465Q16K347q699j497l760L101q643n338j727o077K059K0528J2713q078
$$ 3425 11890 12706 15053 6354 4857 1097 4198 -4445 -9783 -11510 -17587 -15528 5000 17713 9635
6204I635q305m625m045k971P247K469K732o575r316k375N940P179M905N169m924
$$ 9635 1330 -3295 -7340 -10311 -3064 -595 2137 -4438 -13754 -16129 -10189 -3010 1895 7064 2140
6189B140r013J769K451J251m152J0914k669j6760n979p274M724J6545N440n409
$$ 2140 -6873 -5104 -2653 -1402 -5554 5360 2691 -14069 -20048 -27322 -22598 -6053 -613 -6022
6175f022K169O733P13J2209N230p316Q71q016M567K565r07P544J2996q90k6355
$$ -6022 -3853 2880 3593 15802 21032 13716 14587 6571 11138 13703 12796 20340 33336 32446 6091
6160F091k3546j821k559M555m575O525n8j93O945O928O75n731j2432Q343O238
$$ 6091 -17455 -19276 -21835 -17280 -21855 -15330 -15388 -15581 -8636 -1708 -1033 -6764 -19196 -10853 -4615
6145d615J6617Q55n806o430l964J15O66N684K481m728n129J3280O609M669J0192
$$ -4615 12002 12857 7051 621 -3343 -3228 -2562 3122 5603 875 -4254 9026 15635 20304 30496
6130C0496l910j3151j1518r605K195O102o5m057n687j728k010N884O424k131O072
$$ 30496 26586 13435 1917 -7688 -5493 609 544 -3513 -9200 -10928 -12938 -7054 -630 -2761 3311
6115C311R271M419j6350j9301J2840K5895p499n598m730j4765q764o275l043N843
$$ 3311 12582 17001 651 -18650 -5810 20085 12586 6988 2258 -12507 -21271 -27546 -30589 -24746
6101b4746K1858Q647l360K815J0030p784j0874M126M987K664l150J339P419o25
$$ -24746 -2888 5759 2399 5214 15244 7460 -3414 712 5699 8363 5213 6552 13971 13346
6087A3346r004M228K677j1961m538J0746Q398j5419N029o769j8898P336j056R30
$$ 13346 4342 8570 11247 -714 -5252 5494 13892 -1527 3502 -3267 -22165 -14829 -15885 -14955
6073a4955M735M932J428O307p70k764O181l88l888L355o782r425m352N875j390
$$ -14955 -10220 -5288 -3860 2447 1677 -1087 5094 4706 818 4173 -2609 -12034 -16386 -10511 -11901
6058a1901K469j7129o132J4396M99P787J4275O933p826j9608n928L721P968N119
$$ -11901 -9432 -26561 -32693 -18297 -17798 -10011 4264 11197 3371 -16237 -22165 -18444 -10476 -5357
6044e357n215j480J1262K878r667j4018P128K965O316K630q641Q909q62p265q175
$$ -5357 -10572 -12052 -790 2088 -7579 -21597 -14469 -11504 -5188 -2558 -11199 -2290 -3152 -10417 -18592
6029a8592r496K033R352O135J1765K1784k970o536K87J0863O403l291j4233k557
$$ -18592 -28088 -26055 -16703 -10568 1197 22981 20011 13475 13762 24625 31028 27737 13504 10947
6015A0947J413q296m064k062q026p228O581q876P692R761l281N969M756q188j4477
$$ 10947 12360 4064 0 -2062 -10088 -17316 -10735 -19611 -11919 -2158 -5439 530 5286 -2902 -17379
6000a7379p992L262J108L611j302Q537J155K599P768J1032l490r640N848M499
$$ -17379 -25371 -22109 -21001 -17390 -18692 -10155 -9000 -6401 1367 12399 8909 -731 5117 9616
5986I616j5017m768K082l498R82O539M338J555m787n484P044L959k2222J2575
$$ 9616 -5401 -10169 -8087 -11585 -10603 -4064 274 1829 -2958 -8442 -1398 2561 -19661 -7086
5972g086J0577K280J9051Q853n841k882k057n784k042J451N819K269Q25K697n737
$$ -7086 3491 5771 24822 33675 27834 24952 22895 17111 15069 16520 22339 24608 25433 28130 22393
5957B2393m886j3238J807N883j402r197n478R640N984n197L686o99r093m610N433
$$ 22393 17507 4269 6076 11959 10557 1360 -4118 5522 11506 6309 9995 9296 203 -4407 1026
5942A026l984l043J3114L175m187k77N221R111n050P10K389j1653q014Q386j0737
$$ 1026 -2958 -6001 7113 10288 6101 5824 11045 20156 15106 15816 18205 6552 -1462 6924 -3813
5927c813p774n024N262N054K107J17k95Q699J478n955nJ079o190k4878j862K3912
$$ -3813 -11587 -16611 -11349 -6295 -4188 -4071 -4366 4333 5811 -144 -149 930 -5260 -30138 -32000 -8088
5911h088R844L588L850J184j4017j1657M26J710l203J047o073m506M917m20J8074
$$ -8088 1756 5344 9194 10378 -3639 -15296 -14870 -13160 -16363 -15316 -21389 -25895 -20978 -21398 -3324
5896c324j067M74n382l684N994J524N470J4152q827p409q180l312J804J0950j8902
$$ -3324 -4391 -3917 -9299 -12983 -6989 -5465 5 14157 5330 -2079 -10259 -13571 -11767 -817 -19719
5881a9719j4421J5054R286O626K456j357L865O731m894q847l67N650K554l585
$$ -19719 -34140 -19086 -9800 -3174 -718 -2075 1790 8521 3627 -5220 -5587 63 2617 -968
5867i68p855M88o15J411K185M183N6k650K740r157m787J4205J0522r530j771k004
$$ -968 -8823 -8335 -8950 -7539 -5354 -1171 -1115 -3765 -1025 -10182 -14969 -764 9758 228 -1543 -3547
5851c547J2817J2478O98n095j7544O16J3817N987j1728l318m408o927J397N954
$$ -3547 9270 21748 22446 17351 -193 423 14240 20227 8499 5181 773 -6154 -4757 1197
5837A197p43n825L652J438K125l718q554j081q4p366n93k26J4253J6814k33j2564
$$ 1197 454 -5371 -1719 -281 1844 -1874 -10428 -11509 -11593 -18959 -19552 -19778 -5525 11289 11056 -1508
5821a508k822R543m204q141R30O417O972n398o217N399l214k187j5681J816K346
$$ -1508 -4330 5213 1009 -7132 -6202 215 7187 1789 -4428 971 -2243 -4430 -20111 -18295 -15949
5806a5949O757n950J0763J6285L384j369l968j0762o853J3303K563l709j3662
$$ -15949 -9192 -15142 -4379 11906 15290 13921 9953 -809 -7662 5641 8204 4495 -9167
5793i167j119M376K263m666K418j2269o156N89L648R202N000K071q576q016J7694
$$ -9167 -10286 -5910 -3647 -8313 -5895 -18164 -24320 -23731 -20083 -10881 -5881 -3810 -12386 -20402 -2708
5778b708P464n380q18J6042L762q314j2480l372P636P64L801j2389l827O472K698
$$ -2708 4756 -624 -1442 14600 18362 10048 -2432 -5804 1832 2596 6397 -5992 -9819 -3347 -649
$$ [...]
##END NTUPLES=NMR SPECTRUM
##END=
