##TITLE=Analysis number 307102
Compound Code btb 13447
Project Code adrs
Chemist Name outsourced
##JCAMPDX= 6.0         $$ Bruker NMR JCAMP-DX V2.0
##DATA TYPE= NMR SPECTRUM
##DATA CLASS= NTUPLES
##ORIGIN= Bruker BioSpin GmbH
##OWNER= NMR
$$ XWIN-NMR		Version 3.5
$$ Wed Apr 20 16:30:48 2005 GMT Daylight Time (UT+1h)  MAYBRIDGE\NMR@NMR_250MHZ
##.OBSERVE FREQUENCY= 250.131544655141
##.OBSERVE NUCLEUS= ^1H
##.ACQUISITION MODE= SIMULTANEOUS (DQD)
##.ACQUISITION SCHEME= undefined
##.AVERAGES= 16
##.DIGITISER RES= 18
##SPECTROMETER/DATA SYSTEM= dpx250
##.PULSE SEQUENCE= zg30
##.SOLVENT NAME= CDCl3
##.SHIFT REFERENCE= (INTERNAL, CDCl3, 0, 16.522)
##AUDIT TRAIL= $$ (NUMBER, WHEN, WHO, WHERE, WHAT)
$$ ##TITLE= Audit trail, XWIN-NMR		Version 3.5
$$ ##JCAMPDX= 5.01
$$ ##ORIGIN= Bruker BioSpin GmbH
$$ ##OWNER= NMR
$$ C:\u/data/dgb/nmr/ADRS/1940/pdata/1/auditp.txt
$$ ##AUDIT TRAIL=  $$ (NUMBER, WHEN, WHO, WHERE, WHAT)
(   1,<2005-04-20 16:30:29.77 +100>,<MAYBRIDGE\NMR>,<NMR_250MHZ>,
      <created by zg, POWCHK disabled, PULCHK disabled
       configuration hash MD5:
       62 19 C7 07 E1 42 D1 B7 37 6C 3D D0 77 39 F9 E6
       data hash MD5: 64K
       CF EA 40 5C 38 F3 22 86 77 73 84 1E B7 13 61 4B>)
(   2,<2005-04-20 16:30:41.10 +100>,<MAYBRIDGE\NMR>,<NMR_250MHZ>,
      <Start of raw data processing
       ef LB = 0.3 FT_mod = 6 PKNL = 1 SI = 32K 
       data hash MD5: 32K
       8D DD 14 F3 59 46 2C 56 C6 C0 A1 DE F4 17 C1 51>)
(   3,<2005-04-20 16:30:42.73 +100>,<MAYBRIDGE\NMR>,<NMR_250MHZ>,
      <apk 
       data hash MD5: 32K
       5D A8 49 55 D9 A2 2C B5 1A 9D E9 2F 9F CC 08 EC>)
(   4,<2005-04-20 16:30:43.44 +100>,<MAYBRIDGE\NMR>,<NMR_250MHZ>,
      <abs ABSG = 5 
       data hash MD5: 32K
       E9 41 7E BE E6 55 F8 E4 D6 72 7F 8C D1 FC 3B 5C>)
$$ ##END=
$$ 
$$ hash MD5
$$ E9 B8 63 7C CA 9C 28 FC 34 76 C1 2C F4 0D 17 F0
##$RELAX= 
##$RELAX= 
##$RELAX= 
##$RELAX= 
##$RELAX= 
##$RELAX= 
##$RELAX= 
$$ Bruker specific parameters
$$ --------------------------
##$DU= <C:\u>
##$EXPNO= 1940
##$NAME= <ADRS>
##$PROCNO= 1
##$TYPE= <nmr>
##$USER= <dgb>
##$AMP= (0..31)
100 100 100 100 100 100 100 100 100 100 100 100 100 100 100 100 100 100 
100 100 100 100 100 100 100 100 100 100 100 100 100 100 
##$AQSEQ= 0
##$AQ_mod= 3
##$AUNM= <au_zg>
##$AUTOPOS= <41 >
##$BF1= 250.13
##$BF2= 250.13
##$BF3= 250.13
##$BF4= 250.13
##$BF5= 500.13
##$BF6= 500.13
##$BF7= 500.13
##$BF8= 500.13
##$BYTORDA= 1
##$CFDGTYP= 0
##$CFRGTYP= 5
##$CHEMSTR= <none>
##$CNST= (0..31)
1 1 145 1 1 1 1 1 1 1 1 1 1 1 1 1 1 1 1 1 1 1 1 1 1 1 1 1 1 1 1 1 
##$CPDPRG= <>
##$CPDPRG1= <>
##$CPDPRG2= <>
##$CPDPRG3= <>
##$CPDPRG4= <mlev>
##$CPDPRG5= <mlev>
##$CPDPRG6= <mlev>
##$CPDPRG7= <mlev>
##$CPDPRG8= <mlev>
##$CPDPRGB= <>
##$CPDPRGT= <>
##$D= (0..31)
0 1 0 0 0 0 0 0 0 0.06 0 0 0 0 0 0 0.0002 0 0 0 0 0 0 0 0 0 0 0 0 0 0 
0 
##$DATE= 1114011028
##$DBL= (0..7)
120 120 120 120 120 120 120 120 
##$DBP= (0..7)
150 150 150 150 150 150 150 150 
##$DBP07= 0
##$DBPNAM0= <>
##$DBPNAM1= <>
##$DBPNAM2= <>
$$ [...]
##$SUBNAM7= <"">
##$SUBNAM8= <"">
##$SUBNAM9= <"">
##$SW= 20.6930455092707
##$SWIBOX= (0..15)
0 0 3 0 0 0 0 0 0 0 0 0 0 0 0 0 
##$SW_h= 5175.983436853
##$TD= 65536
##$TD0= 1
##$TE= 296.16
##$TE2= 300
##$TE3= 300
##$TEG= 300
##$TL= (0..7)
0 120 120 120 120 120 120 120 
##$TP= (0..7)
150 150 150 150 150 150 150 150 
##$TP07= 0
##$TPNAME0= <>
##$TPNAME1= <>
##$TPNAME2= <>
##$TPNAME3= <>
##$TPNAME4= <>
##$TPNAME5= <>
##$TPNAME6= <>
##$TPNAME7= <>
##$TPOAL= (0..7)
0.5 0.5 0.5 0.5 0.5 0.5 0.5 0.5 
##$TPOFFS= (0..7)
0 0 0 0 0 0 0 0 
##$TUNHIN= 0
##$TUNHOUT= 0
##$TUNXOUT= 0
##$USERA1= <user>
##$USERA2= <user>
##$USERA3= <user>
##$USERA4= <user>
##$USERA5= <user>
##$V9= 5
##$VALIST= <valist>
##$VCLIST= <CCCCCCCCCCCCCCC>
##$VD= 0
##$VDLIST= <DDDDDDDDDDDDDDD>
##$VPLIST= <PPPPPPPPPPPPPPP>
##$VTLIST= <TTTTTTTTTTTTTTT>
##$WBST= 1024
##$WBSW= 4
##$XGAIN= (0..3)
0 0 0 0 
##$XL= 0
##$YL= 0
##$YMAX_a= 245302
##$YMIN_a= -428574
##$ZGOPTNS= <>
##$ZL1= 120
##$ZL2= 120
##$ZL3= 120
##$ZL4= 120
##$ABSF1= 16.522
##$ABSF2= -4.171173
##$ABSG= 5
##$ABSL= 3
##$ALPHA= 0
##$AQORDER= 0
##$ASSFAC= 0
##$ASSFACI= 0
##$ASSFACX= 0
##$ASSWID= 0
##$AUNMP= <proc_1d>
##$AZFE= 0.1
##$AZFW= 0.1
##$BCFW= 0
##$BC_mod= 0
##$BYTORDP= 0
##$COROFFS= 0
##$CY= 12.5
##$DATMOD= 1
##$DC= 0
##$DFILT= <>
##$DTYPP= 0
##$F1P= 14.0000005364418
##$F2P= -0.99999901652339
##$FCOR= 0.5
##$FTSIZE= 32768
##$FT_mod= 6
##$GAMMA= 0
##$GB= 0
##$INTBC= 1
##$INTSCL= 1
##$ISEN= 128
##$LB= 0.3
##$LEV0= 0
##$LPBIN= 0
##$MAXI= 10000
##$MC2= 0
##$MEAN= 0
##$ME_mod= 0
##$MI= 0
##$NCOEF= 0
##$NC_proc= -4
##$NLEV= 6
##$NOISF1= 0
##$NOISF2= 0
##$NSP= 0
##$NTH_PI= 0
##$NZP= 0
##$OFFSET= 16.522
##$PC= 1
##$PHC0= -75.33441
##$PHC1= 6.835403
##$PH_mod= 1
##$PKNL= yes
##$PPARMOD= 0
##$PSCAL= 4
##$PSIGN= 0
##$REVERSE= no
##$SF= 250.13
##$SI= 32768
##$SIGF1= 0
##$SIGF2= 0
##$SINO= 400
##$SIOLD= 32768
##$SREGLST= <1H.CDCl3>
##$SSB= 0
##$STSI= 32768
##$STSR= 0
##$SW_p= 5175.98343685301
##$SYMM= 0
##$S_DEV= 0
##$TDeff= 65536
##$TDoff= 0
##$TI= <Analysis number 999999
Compound Code 99
Book Reference 9
Project Code 9>
##$TILT= no
##$TM1= 0
##$TM2= 0
##$TOPLEV= 0
##$USERP1= <user>
##$USERP2= <user>
##$USERP3= <user>
##$USERP4= <user>
##$USERP5= <user>
##$WDW= 1
##$XDIM= 32768
##$YMAX_p= 388117767
##$YMIN_p= -532780
$$ End of Bruker specific parameters
$$ ---------------------------------
##NTUPLES= NMR SPECTRUM
##VAR_NAME=  FREQUENCY,     SPECTRUM/REAL,   SPECTRUM/IMAG
##SYMBOL=    X,             R,               I
##VAR_TYPE=  INDEPENDENT,   DEPENDENT,       DEPENDENT
##VAR_FORM=  AFFN,          ASDF,            ASDF
##VAR_DIM=   32768,         32768,           32768
##UNITS=     HZ,            ARBITRARY UNITS, ARBITRARY UNITS
##FACTOR=    0.157963299565203, 1,           1
##FIRST=     4132.6476996994, 0,             0
##LAST=      -1043.33573715361, 0,           0
##MIN=       -1043.33573715361, -532780,     0
##MAX=       4132.6476996994, 388117767,     0
$$ Real data points
##PAGE= N=1
##DATA TABLE= (X++(R..R)), XYDATA
$$ [...]
18406A28342N923p884k2866k9933j2519K382J4928Q466Q327l0864p023K2392K8696
18393A08367j7769j6864j8852o276j9365j2775j5687J0391L0481M1918n910k518
18381G5141N002k3171j5195j1758M960n640J0972J6410Q189J9315O551n761L0879
18368A15894r348j7478j319J1753l854j9112O847j8390j492R587Q690j2116j682
18355F7980J364J9M126K7804J4699j2144L179m5354m0666N919L171r178j2003
18342H916K214q40K7663j1092K6345J7843J0343L0684J7761j3597k4690r308l0165
18329E2077k9260J1570J2516J2716J9382o247n612k720M327r713l817L371j927
18316E6663j8587J13J6721J0714K6218n848j4949L4114P831j1653l725j2841j0877
$$ y = [128342, 134265, 126381, 103515, 73582, 61063, 63445, 78373, 86839, 95166, 64302, 57279, 79671, 108367, 90598, 73734, 54882, 48606, 29241, 16466, 779, 11170, 41651, 83569, 77659, 75141, 80143, 56972, 41777, 30019, 34979, 29339, 40311, 56721, 64910, 84225, 90776, 85015, 115894, 106546, 89068, 87749, 99502, 95648, 76536, 83383, 64993, 63501, 73088, 81778, 69662, 67980, 69344, 69363, 73489, 101293, 115992, 103848, 107027, 61673, 21007, 26926, 30097, 20919, 8916, 11130, 10290, 37953, 26861, 53206, 71049, 81392, 112076, 129837, 116240, 91550, 82242, 52077, 22817, 34387, 46903, 59619, 79001, 72754, 67142, 64422, 68749, 59036, 55219, 58590, 56663, 38076, 38189, 54910, 65624, 91842, 85994, 71045, 105159, 112990, 101337, 97612, 84771, 73894]
18303G3894N803K5361J6482n557q255J080J5887k3668J481j1108j0389J5741M3904
18290A40656K0122R37k2139k3217J6760Q104Q41M468L41k4706o076J6929J6229
18277A49249j0651l3125J2680J3297K5549L978R121k6410j041L1816J095o624
18265A68934k2024p530J0940J9290K5273L579m7798k8037K7860J0570M994r377
18253A56674j3212P468K4370L326j1586m768K1963J6829l5191p781K0531n633
18241A72990L2545K1132k779l934J1631K2825J1254l018k6891Q63m231J1997l0406
18228B13978j2778l1096r508K2006K6889J4771L1887j5625j1290j2822j04j5534
18216B00774M935j112q144N600N943K3403L0704R909J0580m977P47j8976r383
$$ y = [73894, 79697, 105058, 121540, 115983, 107728, 108808, 124695, 101027, 102508, 91400, 81011, 96752, 140656, 160778, 161715, 139576, 116359, 133119, 141223, 142064, 146532, 146873, 122167, 116091, 133020, 149249, 138598, 105473, 118153, 131450, 156999, 160977, 170098, 143688, 142647, 174463, 175558, 168934, 146910, 139380, 150320, 169610, 194883, 198462, 150664, 122627, 150487, 161057, 166051, 156674, 143462, 150930, 175300, 178626, 167040, 162272, 184235, 201064, 165873, 158092, 178623, 172990, 205535, 226667, 223888, 219954, 231585, 254410, 265664, 262646, 235755, 236618, 232387, 244384, 213978, 201200, 170104, 160596, 182602, 209491, 224262, 256149, 240524, 229234, 216412, 216308, 200774, 205709, 204597, 196453, 202053, 207996, 231399, 262103, 272012, 282592, 277615, 278362, 259386, 250003]
18203B50003k4592j6538j5056P935L0120J8671L3525J7489j071J8149L161J2127
18191C33923l2715j2715K7207m938L3353N1609k012k1405K0039P383m614J2312
18179D07427j1628j6112l794R79K1300j703j1211K1290n380j6934J0632K1938
18167D16804K859j4273q21J5009K0632K1790M955K6384J7001K9667K4019j1428
18155E52598K6449j682p817K2166J5859J6802j0388j5898k2688J3112N5323M9315
18143F93151L9172L2747J4392L4247R105K5452J1193q95J4450M6568K9332L5669
18131I84583M3623Q8003R5521P1664Q6914J01732J34067J81786K16023K52313
18121B256229K99394M18087N41280P54480J120444J619995K370823L374197M741614
$$ y = [250003, 225411, 208873, 193817, 201752, 231872, 250543, 284068, 301557, 300486, 318635, 321796, 333923, 301208, 288493, 315700, 310762, 344115, 395724, 393712, 372307, 392346, 399729, 395115, 407427, 395799, 379687, 375893, 376872, 398172, 396469, 385258, 406548, 401168, 384234, 394866, 416804, 419663, 405390, 404569, 419578, 440210, 462000, 466955, 493339, 510340, 540007, 564026, 552598, 579047, 577365, 569548, 591714, 607573, 624375, 613987, 598089, 575401, 588513, 643836, 693151, 732323, 765070, 779462, 813709, 822814, 848266, 859459, 858564, 873014, 919582, 948914, 984583, 1028206, 1116209, 1211730, 1283394, 1370308, 1472040, 1606107, 1787893, 2003916, 2256229, 2555623, 2973710, 3514990, 4269470, 5389914, 7009909, 9380732, 12754929, 17496543]
18112A7496543O083643O534202M335124J235582L17164m205924q393747o204111
18104A7198476l432779k124108j491118r88580q29397r76676j013658q79964p14354
18095D747842n94460m57796l38699k34443j94103j38373r1573l6879m3791j9600
18085B598125m6763m6362l6818l1520j0294j498M8131N3344R5625J27936J17307
18074B867213J12889J36984J76017K00711K12974K50007L36672M62557O42231
18065E398255Q60852J199809J601381J989152K276314K507960K616571K403653
18057B0853947J884360J325006P63394K42224N6443L61993R51952J523039K043900
18048C0006258K365692K241797J390848K31550q09107j852860k729687k996651
$$ y = [17496543, 23580186, 30114388, 34449512, 35685094, 36002258, 31796334, 23402587, 17198476, 13765697, 11641589, 10150471, 9161891, 8332494, 7355818, 6342160, 5462196, 4747842, 4153382, 3695586, 3356887, 3122444, 2928341, 2789968, 2698395, 2661516, 2617725, 2598125, 2551362, 2505000, 2468182, 2436662, 2426368, 2424870, 2473001, 2526345, 2621970, 2749906, 2867213, 2980102, 3117086, 3293103, 3493814, 3706788, 3956795, 4293467, 4756024, 5398255, 6259107, 7458916, 9060297, 11049449, 13325763, 15833723, 18450294, 20853947, 22738307, 24063313, 24826707, 25068931, 25125374, 25487367, 26439319, 27962358, 30006258, 32371950, 34613747, 36004595, 36236145, 35427038, 33574178, 30844491, 27847840]
18040B7847840k730413k175830j323227k44047O97069J241407J241062P27236
18032B5281097r2000j185975k153418k584081k214227j323079m77042J56951O12213
18023A6020439P07316N17655J70845k81249n66970o28143l17309M43929J177254
18014A7243767J711725K114177K326911K183017J752469J380921J089374P19602
18006C0521963O65865J168683J841381K336406K758626L051760K748481J559643
17998D6652808J56890j044966k328793l587582l859906l365603k732054j769846
17990B8120948m08049J094680K483479L473538L754977L416233K405504N56663
17982D4897973j453356l008616l705077l674489l181129k178974q77200J46812
$$ y = [27847840, 25117427, 22941597, 21618370, 21374323, 22071392, 23312799, 24553861, 25281097, 25189097, 24003122, 21849704, 19265623, 17051396, 15728317, 15251275, 15408226, 16020439, 16727755, 17245410, 17416255, 17135006, 16568036, 15939893, 15622584, 16066513, 17243767, 18955492, 21069669, 23396580, 25579597, 27332066, 28712987, 29802361, 30521963, 31187828, 32356511, 34197892, 36534298, 39292924, 42344684, 45093165, 46652808, 46809698, 45764732, 43435939, 39848357, 35988451, 32622848, 29890794, 28120948, 27712899, 28807579, 31291058, 34764596, 38519573, 41935806, 44341310, 44897973, 43444617, 40436001, 36730924, 33056435, 29875306, 27696332, 26819132, 26965944]
17974B6965944P23030Q60321M84997l12958j273162k154615k756555l098585k889412
17965A6549005k292511j749471j318998j065099r16402q03477p20582n96158m53227
17956F633080l96919l68660l56218l48368k97640k86464k44221j71943o1196K1934
17946D123385O0732J79246L55580N10631P63812J155542J639988K264899K994331
17937A4048146L496563L441993K708847J498952j27260j759115k786538k728723
17929A7792865j666787l93757O40766J324957J548023J168009L93099n57678j643777
17920A8605720k539193k758926k332493j699778j254416j002688q06261o74637
17912E537328n65369n04809l93896l20260k95197k49682k00565k41071k47802
$$ y = [26965944, 27688974, 28549295, 29034292, 28721334, 27448172, 25293557, 22537002, 19438417, 16549005, 14256494, 12507023, 11188025, 10122926, 9206524, 8403047, 7682465, 7086307, 6633080, 6236161, 5867501, 5511283, 5162915, 4865275, 4578811, 4334590, 4162647, 4101451, 4123385, 4184117, 4363363, 4718943, 5229574, 5993386, 7148928, 8788916, 11053815, 14048146, 17544709, 20986702, 23695549, 25194501, 25067241, 23308126, 20521588, 17792865, 16126078, 15732321, 16373087, 17698044, 19246067, 20414076, 20807175, 20249497, 18605720, 16066527, 13307601, 10975108, 9275330, 8020914, 7018226, 6211965, 5537328, 4971959, 4467150, 4073254, 3752994, 3457797, 3208115, 3007550, 2766479, 2518677]
17903B518677k40104k17943j67235j75028j08940r9526r9391p0525j03385j14011
17893A122589j20288r5976o9973p6469p7507o5363n0957l741l3400p3237m8218
17882D07460n5800j1153r287m5968k3085j5211p067o339M575J2620K0898m832
17870B66811k6896j5825l977R898O593k7480N994R025m57J8112m482j9925k265
17857B15126M340L372J1777J1026K0629o583o686K6564r699k7624k3175p426k6869
17844A84772k7799l5975j4297r314J530l3937j1149l542J7273M0640Q510n186
17832A11526j0292K9708N473j0666m919j9913k8816j148J3468Q010o90j5292K540
17819G8989O256J2109J77j7462J655m641J4567M3998P796q600j8035o355L520
$$ y = [2518677, 2278573, 2060630, 1893395, 1718367, 1609427, 1509901, 1410510, 1339985, 1236600, 1122589, 1002301, 906325, 836352, 759883, 682376, 617013, 566056, 562315, 528915, 455678, 407460, 351660, 340507, 331220, 285252, 262167, 246956, 239889, 233550, 238125, 250745, 271643, 266811, 239915, 224090, 220113, 230011, 236604, 209124, 215118, 224143, 223686, 241798, 237316, 217391, 215126, 219466, 222838, 234615, 245641, 266270, 259687, 253001, 279565, 269866, 242242, 219067, 211641, 184772, 156973, 120998, 106701, 97387, 98917, 64980, 53831, 50289, 67562, 108202, 116712, 111526, 101234, 130942, 136415, 125749, 120830, 100917, 72101, 70953, 84421, 92431, 91741, 76449, 78989, 85245, 97354, 97531, 80069, 81724, 77083, 91650, 135648, 143444, 134844, 116809, 110454, 113974]
17806A13974L4075L1242J6196k0820j0016j2416Q621J0155n894k333L245k1168
17794A44861j9252j2946j6588j4041K2382K4989j2557j936j5425M291j4051n206
17782H4521K1290K914k2059k2365j6408K9875L9105K7260K0276N234M186k5337
17770A48492R612L0990M1592K2040Q429n66k380j8547l1678k7260j9932L510k2152
17757A42150L635K0164K723j2431L254K21J728k313J6355R715J4875J7461j0495
17744B07042J2135l016R760j133k5994q948J8625J2711k1750O429r806k3736K5156
17731A97475J797j6665k7046K9682M2470L0028K9021l192J7135Q845K6145p797
17719C27898j4409j9822L888m590J2955k2743J9679N929j9856J1213N76J8844
$$ y = [113974, 148049, 179291, 195487, 174667, 164651, 152235, 160856, 171011, 165117, 162784, 166029, 144861, 125609, 112663, 96075, 82034, 104416, 129405, 116848, 114912, 99487, 103778, 89727, 84521, 105811, 108725, 86666, 64301, 47893, 77768, 116873, 144133, 164409, 169643, 173829, 148492, 158104, 189094, 230686, 252726, 261155, 260589, 258209, 239662, 207984, 180724, 160792, 164302, 142150, 145785, 165949, 168672, 156241, 159495, 159716, 161444, 159131, 175486, 185201, 200076, 217537, 207042, 219177, 216161, 225921, 224788, 198794, 189846, 208471, 221182, 199432, 205861, 196055, 172319, 197475, 199272, 182607, 155561, 185243, 227713, 257741, 286762, 283570, 300705, 309550, 335695, 327898, 313489, 293667, 297555, 292965, 305920, 283177, 302856, 308785, 288929, 300142, 300718, 319562]
17707C19562K9593J554j3724P980J8821J4036K3672j3490j7443j632K1264O543
17695C96736J8131J4145o438Q070p979r438K6888L8359J088j2119j0729J9476
17683D76190J3439O666L2153K5246K4742K4070L4332M1725M6276M9149K7256O0281
17671H61525N4366P4929M1203O4187O4662O0196O3418R5714Q8229Q8419J22840
17660A679688J62820J94940K24511K95405M26011N43033P46585J004692J348340
17651F626025J848747K368030K785270K925818K722283K345966J426173M28137
17643B3476449L13586L65116M91803P98263Q22574L49082j104259k359440k835907
17634B0317267l273047l143999k336487j618618j184786r04374p37599o38051
$$ y = [319562, 349155, 350709, 336985, 344965, 363786, 377822, 401494, 388004, 370561, 368929, 390193, 396736, 414867, 429012, 422574, 430644, 422665, 413227, 440115, 478474, 479562, 467443, 456714, 476190, 489629, 496295, 528448, 553694, 578436, 602506, 636838, 678563, 724839, 773988, 801244, 861525, 915891, 990820, 1032023, 1096210, 1160872, 1221068, 1284486, 1380200, 1468429, 1556848, 1679688, 1842508, 2037448, 2261959, 2557364, 2983375, 3526408, 4272993, 5277685, 6626025, 8474772, 10842802, 13628072, 16553890, 19276173, 21622139, 23048312, 23476449, 23790035, 24155151, 24646954, 25445217, 26267791, 26616873, 25512614, 23153174, 20317267, 17044220, 13900221, 11563734, 9945116, 8760330, 7855956, 7118357, 6480306]
17626F480306n54329m60822l52387k59112k09416j70764r8731l5223n157M767
17616D339132K38K1462M8065Q1237J02391K02911L34196M64275O48840R15132
17606G157879J322055J931733K629231L411206M071550M357655M224194L640471
17598C2745974K423336J208965N83810N30627P99551J078065J130317O81812j203278
17589C9979179l456313m351818n029336n130177m063769k836712k039106j572275
17581A1499673j286785j095237r85509q53814o84392n24148m26088l05675j92664
17572E145361j45305j51535j47987j43410j47584j68942j00799m2093k4979K929
17562D075656N1571J23724J79554L47335N84208R15336J266343J651882J875503
$$ y = [6480306, 5925977, 5465155, 5112768, 4853656, 4644240, 4473476, 4374745, 4339522, 4334365, 4339132, 4339370, 4360832, 4408897, 4490134, 4592525, 4795436, 5129632, 5593907, 6242747, 7157879, 8479934, 10411667, 13040898, 16452104, 20523654, 24881309, 29105503, 32745974, 35169310, 36378275, 36962085, 37492712, 38292263, 39370328, 40500645, 41182457, 39979179, 36522866, 32171048, 27141712, 22011535, 17947766, 15111054, 13071948, 11499673, 10212888, 9117651, 8132142, 7278328, 6593936, 6069788, 5643700, 5338025, 5145361, 5000056, 4848521, 4700534, 4557124, 4409540, 4240598, 4139799, 4097706, 4072727, 4075656, 4127227, 4250951, 4430505, 4777840, 5362048, 6277384, 7543727, 9195609, 11071112]
17553A1071112J815833J616444J229725M28561n328M2876J3919J90544L63419
17544A6767105L16125k61809j195339j641838j877906k035871j751880j249624
17536G068963q94341o53505n19412m55561l78392l29796k23167j59240j10050
17527C345499m5073M375N2113P3912R4689J26198J57592J80228K06110K29937
17517D425580K55772K37377K56256K75795L04927M56178O77981J003132J446621
17508I339619J946474K596024L353582M072304M625952M764793M433398L619217
17500C8751363K414355J199604K22988l11511m20304m00102l88296p10438j438272
17491C8919387k296480l095595l652970l859404l727021l266788k671779k147123
$$ y = [11071112, 12886945, 14503389, 15733114, 16161675, 16156347, 16199223, 16213142, 16403686, 16767105, 17083230, 16821421, 15626082, 13984244, 12106338, 10070467, 8318587, 7068963, 6174622, 5521117, 5001705, 4546144, 4167752, 3837956, 3614789, 3455549, 3345499, 3300426, 3304801, 3356914, 3430826, 3525515, 3651713, 3809305, 3989533, 4195643, 4425580, 4681352, 4918729, 5174985, 5450780, 5755707, 6211885, 6889866, 7892998, 9339619, 11286093, 13882117, 17235699, 21308003, 25933955, 30698748, 35132146, 38751363, 41165718, 42365322, 42588310, 42276799, 41856495, 41456393, 41068097, 40357659, 38919387, 36622907, 33527312, 29874342, 26014938, 22287917, 19021129, 16349350, 14202227]
17483A4202227j751652j411499j174631j018277q72810p56714o66466n65404n12364
17474E472410m51886l64709k48489j64216j33479p5530m248M4159R5888J23149
17464D293049J68968K65582L02698L85428N52837P77579J103391J503992K027339
17455A1380863K637858L229903L717939L930905L815948L289411K431765J526345
17447C5960937O34446l3282k97984n02558p46178j158420j777911k517421l076110
17438B6485519l359431l304116l037985k557209k059477j661425j381489j112876
17430H011511r53739q68662p35229o01997n04101m66429l81758l23082k83090
17421B893424k48827k19713j87698j66393j34077j35684j77507j89064j47922
$$ y = [14202227, 12450575, 11039076, 9864445, 8846168, 7973358, 7216644, 6550178, 5984774, 5472410, 5020524, 4655815, 4407326, 4243110, 4109631, 4034101, 4029853, 4074012, 4169900, 4293049, 4462017, 4727599, 5030297, 5415725, 5968562, 6746141, 7849532, 9353524, 11380863, 14018721, 17248624, 20966563, 24897468, 28713416, 32002827, 34434592, 35960937, 36595383, 36562101, 36264117, 35761559, 35015381, 33856961, 32079050, 29561629, 26485519, 23126088, 19821972, 16783987, 14226778, 12167301, 10505876, 9124387, 8011511, 7057772, 6189110, 5453881, 4851884, 4347783, 3881354, 3499596, 3176514, 2893424, 2644597, 2424884, 2237186, 2070793, 1936716, 1801032, 1623525, 1434461, 1286539]
17412A286539j20779q5204j01704j43775q5743o1429n1707l7336n7288n6184m3659
17401D41731l2488k9698j4367m5595m9747l7107q295k056M10J501m263j4070R576
17388B15532K435J0585J0802j5623m0336m1137n728M801j9351j0364j5970N168
17376A00814J3299O810M077k1374l977K2120j7160l326K6918l7784l0152P994
17364F8259J9697K710J2856K5228l056q323J6270l004J5213M008k5623M667k8497
17351A00405J1715J3660j0244j8755l1517l0734k5381K8654K6800Q791j8860J58
17339E4692O8k1273L707Q823L208M412P140L6082K125Q680P007k1351l2768K387
17325F2939l1791k8950K1927l356M244P046k0682J1173L0755j6472l0385k030
$$ y = [1286539, 1165760, 1080556, 978852, 835077, 749334, 687905, 636198, 598862, 541574, 485390, 441731, 409243, 379545, 365178, 319583, 269836, 232729, 224434, 222378, 222788, 224289, 220026, 205956, 215532, 217967, 228552, 239354, 223731, 183395, 142258, 136530, 141331, 121980, 111616, 95646, 100814, 114113, 120923, 125000, 103626, 99649, 121769, 104609, 101283, 128201, 90417, 60265, 68259, 87956, 90666, 103522, 128750, 125694, 117371, 133641, 130637, 145850, 149858, 124235, 128902, 100405, 112120, 125780, 115536, 96781, 65264, 34530, 9149, 37803, 64603, 73394, 54534, 54692, 54760, 33487, 37194, 46017, 49225, 53637, 60777, 96859, 98984, 107664, 114671, 93320, 60552, 62939, 31148, 2198, 24125, 20769, 25013, 32059, 11377, 22550, 53305, 36833, 6448, 4418]
17313D418J6472K3788J4468j0869p200R122j6689K2054j3804k6052l1976m919
17301b1187J1366K1132K2371o592K879K9767Q557j7025k9514k0703j4413j0953
17289b4315p742J0107K5923o285j0581o074m114J5052L2207J9635M172n443o038
17276C6504J1071j8765k1245j5910J6466J2021J2028j4023k8674j3794J2525K1731
17264I935K8316M90j1239P215j7814J2048L4591j3159j8201J574L567J0683l129
17251D4877k8150P019j2083r875L69J4084k597l0375j7367j949r454K4631N393
17238a5477J5233J0203k4818m1808l539Q534L001J5091k3934j2621q417j9139
17226i7691J3597J4801M670K042J0073Q031J709o491j7439k1695K0196J8221j0500
$$ y = [4418, 20890, 44678, 59146, 48277, 41077, 50199, 33510, 55564, 41760, 15708, -16268, -21187, -9821, 11311, 33682, 27090, 29969, 59736, 68293, 51268, 21754, 1051, -13362, -24315, -32057, -21950, 3973, -2312, -12893, -18967, -23081, -8029, 24178, 43813, 47985, 42542, 36504, 47575, 28810, 7565, -8345, 8121, 20142, 32170, 18147, -10527, -24321, -11796, 9935, 38251, 38741, 27502, 34717, 16903, 28951, 63542, 50383, 32182, 33756, 37323, 48006, 44877, 16727, 23746, 11663, 1788, 2157, 16241, 13644, -16731, -34098, -36047, -45501, -20870, -15477, -244, 9959, -14859, -56667, -60206, -51672, -48671, -33580, -57514, -70135, -78552, -97691, -84094, -69293, -64623, -62581, -52508, -44477, -42768, -49259, -66698, -88393, -68197, -49976, -60476]
17213f0476J3732J6636K0206R377N864p132m832J6373o188l2825L623n553j8805
17200e0000k1646j144J169p26M337R938J5962J4325R44j2901j0697l1078n679
17187h7196M980K4918M128K2319J0167r87J6859J1469N523k896n263l6670l5117
17174f7766l8922K5889K1773J1118J8543k098r043l638J3689M433K5973j952J7785
17161A5784j2850j8676J758K5844o539O101J3533J4198O718l8225j0876L0352
17149B7122K1819j2495j3385j9194j0991O033O044l0136m048J0582J1782J6688
17137I821K4903K7969J9992K5065j4664k7671L731o714j1758k4958k7474Q86k7022
17124b7894j0038j2056J6624K6371P988k6633n06N784K2219N187j1704J9313J9195
$$ y = [-60476, -46744, -30108, -9902, -525, 5339, -1793, -6625, 9748, 3560, -29265, -25642, -31195, -50000, -71646, -72790, -71621, -72347, -68010, -58072, -42110, -27785, -26841, -39742, -50439, -81517, -87196, -82216, -57298, -53170, -30851, -20684, -21671, -4812, 6657, 12180, 9284, 4021, -32649, -67766, -106688, -80799, -59026, -47908, -29365, -31463, -40506, -44144, -30455, -26022, -49, -2001, 15784, 2934, -15742, -13984, 11860, 5321, 11422, 24955, 39153, 45871, 7646, -3230, 27122, 48941, 36446, 23061, 3867, -7124, -1091, 4953, -25183, -29231, -18649, -6867, 9821, 34724, 62693, 82685, 107750, 93086, 65415, 69146, 62432, 50674, 25716, -1758, -872, -27894, -37932, -49988, -33364, -6993, 995, -25638, -26144, -20360, 1859, 7046, -4658, 14655, 33850]
17111C3850j7766k8514j062K2488J9035r343k135J4172l121k571N823K284j471
17098C1669j8441j3415K1743l885l574M5436M1338L5718L9052k334j0494j6443
17086A46370j7827j1726J5012K0706n255k758K650k6088n0562n1460k4234j7720
17074b2892J4485K7243k171j6409l2082k4760J193n809R278J9020k542o8o16J6867
17060a9263Q457m050o652J1546J949j5670j7033M948K9347k786K74L4060L0647
17047E5774m317J2235N346P045M555p797k5468j8915q396R311o073O815k44k2391
17033G480m713Q705K6015r233m3807l9955J2432J2924l957J2124j3930p321K7618
17020a5618O136j4537j3049k2902k3586K810m910K0897L2008K2828K0951O189
$$ y = [33850, 16084, -12430, -13492, 8996, 28031, 18688, 16553, 30725, 27604, 25033, 30856, 33140, 31669, 13228, -187, 21556, 17671, 14097, 59533, 100871, 136589, 175641, 173307, 162813, 146370, 128543, 116817, 131829, 152535, 147280, 144522, 147172, 121084, 70522, 19062, -5172, -22892, -8407, 18836, 16665, 256, -31826, -56586, -55393, -61202, -51924, -32904, -35446, -35514, -36130, -19263, -10806, -14856, -21508, -9962, -8013, -23683, -40716, -35768, -6421, -9207, -8933, 25127, 55774, 51457, 63692, 69038, 76083, 80638, 72841, 47373, 28458, 20062, 29373, 23300, 30115, 29871, 7480, 2767, 11472, 37487, 28254, -15553, -55508, -43076, -30152, -34109, -21985, -35915, -43236, -15618, -9482, -24019, -37068, -59970, -83556, -80746, -85656, -64759, -32751, -9923, 11028, 17217]
17008A7217L4461N484j8528o394J0979L1300M8350Q736k086K4453K5127J7134
16996A96233R991j9810k6866l1417l4977j304p663m7200l0351O025n276l869r31
16983B585k2970o857J3178J842J855k7366j8345J2704R340p4p42J5357O358K882
16969a0253k4227K787J3656n909p91j6536q785m82J0414J2275K4841M4340j888
16956C9442j2789K4681N1462J4348N636P497M424p025r254L705P294p633J281
16943A23069M630J3261j653j5768j9394k9290j9849l0682n160l9293l7074J6417
16931d0786N8685l719j8690l4878k0953o995K5052M195l6939j3771J5200P423
16919f6176q375n238J1579J9782K4884n246j3549K0310q70n150K0462K2380k7384
$$ y = [17217, 51678, 57162, 38634, 32240, 43219, 74519, 122869, 131605, 129519, 153972, 179099, 196233, 206224, 186414, 159548, 128131, 93154, 91850, 84187, 36987, 6636, 12661, 7385, 3516, 2585, -20385, -27242, -14064, -12222, -10367, -37733, -56078, -43374, -34034, -34108, -34850, -19493, -13135, -10253, -34480, -31693, -18037, -23946, -24737, -41273, -50058, -50540, -40126, -27851, -3010, 41330, 39442, 26653, 51334, 102796, 117144, 122780, 130277, 134701, 127676, 118422, 122127, 129421, 121788, 123069, 127699, 140960, 139307, 123539, 104145, 74855, 55006, 24324, 19164, -20129, -57203, -40786, 17899, 14180, -4510, -39388, -60341, -67336, -42284, -38089, -75028, -88799, -73599, -66176, -74551, -79789, -68210, -48428, -23544, -28790, -42339, -22029, -22899, -28049, -7587, 14793, -12591]
16906a2591j7782j9403k379L111M773r551l502l477m883l236O683q001K1096n669
16892e4811j9175L357K0500M454l0915l512J4482k399k4771j2035L3099j3563
16880h5289N062K6251J4541j9019k0076j051r252L0360K3775l691k2867j1458
16868g2714K5041k7730J0639J8031k4787j6034J8435J6361J104r72j6887M52K3932
16855d5129k7349O098R740j6007p474J4742J8039j2812K540j7293m6413J3800
16843a07518P194K0280J632K7214J300k5258P97J7583P46J3474j86M170n838j5624
16829f0034J5157J0644j880J3038j5385l714K3136K4258l436k0350K942K0643
16817E019K5771k1594o3640N7P781j2792K0900J8564j3157k5742M307L342j2334
$$ y = [-12591, -30373, -49776, -52155, -49044, -44271, -53822, -57324, -60801, -65684, -68920, -62237, -70238, -49142, -54811, -73986, -70629, -50129, -45675, -76590, -80102, -65620, -68019, -92790, -104825, -71726, -85289, -80227, -53976, -39435, -58454, -78530, -79581, -88833, -58473, -34698, -38389, -61256, -72714, -47673, -75403, -64764, -46733, -71520, -87554, -69119, -52758, -51654, -52626, -69513, -69061, -45129, -72478, -66380, -56640, -72647, -80121, -65379, -47340, -60152, -57612, -74905, -121318, -107518, -100324, -80044, -78412, -51198, -49898, -75156, -74359, -56776, -56030, -42556, -42742, -38572, -44410, -60034, -44877, -34233, -36113, -23075, -38460, -42174, -19038, 5220, 1784, -18566, -15624, 5019, 30790, 9196, -54444, -54387, -46606, -59398, -38498, -19934, -33091, -58833, -54526, -51184, -63518]
16804f3518J6769N580J166P238K8651j3485j0528j3571o548M898j0137r278o205
16791f8968N0456N697m952j9447j4414l2920p749K581j1076K3202L2663N15J3025
16778c1387J1559P424j9235j6925j098Q389p795M784K6791L428m778N508j0738
16765b4073o312j1053j7973j8866J407O144j083K0822M489O466k0050k5876K1735
16752f4223J2535j7805q156J3842J3761n29j5553l896K1470l735j608L4744m843
16739b3996l2223r711n685j6450m624R475j195K1067M640K5880j1817j6550J8225
16726d2964L0801n892P117J9130O481k2947m0894j0185L1044K5364O25Q434J4235
16713B0349l3196k3189k4700n449M794R797k1493q227J2418K0567p271n849J5428
$$ y = [-63518, -46749, -41169, -40003, -32765, -4114, -17599, -28127, -41698, -48246, -43348, -53485, -62763, -68968, -18512, -12815, -17767, -37214, -51628, -84548, -92297, -89716, -100792, -77590, -44927, -44412, -31387, -19828, -12404, -31639, -48564, -49662, -41273, -49068, -44284, -17493, -14065, -18843, -13335, -24073, -30385, -41438, -59411, -78277, -76870, -70726, -71809, -50987, -46498, -40032, -60082, -85958, -64223, -51688, -69493, -77649, -63807, -50046, -50575, -66128, -70024, -48554, -52289, -53897, -19153, -23996, -56219, -65930, -71615, -88065, -92689, -83214, -84409, -63342, -58702, -32822, -44639, -61189, -42964, -12163, -18055, -10938, 8192, 14673, -8274, -49168, -59353, -28309, -2945, -2320, 6114, 20349, -12847, -36036, -60736, -66185, -61391, -51594, -73087, -81314, -68896, -48329, -55600, -61449, -46021]
16700d6021j594j0228J6441j6182k0417K8688K6284k320j2194P90q812m0814K390
16687h3989M3515L9513L392m136K270L452j6490k068j1368j8061r0O836M108j1457
16673d4573n346r883K49J3188r37k726K0828O526k9064J3143l541p656j6936o48
16659f7376J4006p292J0371J7459P355p068J438L723J0203J9840l4689j3751N526
16646d0255j1803k2412P473M0544M814j9788q231k7194N603J7003J8850N620K3984
16633e792j3449J0135j9188j2526j6499P871J7379k5805m0678L278L2040J6169
16621d7065o286J3344K0492K401m791l3690J1450J7001j5855j4690j1650N968
16609f3371L1298L314K193q241l902K585j3689r589J684L5226j3987j0640J0548
$$ y = [-46021, -47615, -57843, -41402, -57584, -78001, -49313, -23029, -25349, -37543, -36753, -45565, -86379, -83989, -40474, -961, 2431, -1705, 565, 4017, -12473, -14541, -25909, -43970, -44060, -37224, -33116, -44573, -49919, -59802, -59553, -46365, -47302, -50028, -29200, -22674, -51738, -38595, -42136, -49792, -66728, -67376, -53370, -60662, -50291, -32832, -25477, -32545, -31107, -27384, -17181, 2659, -32030, -45781, -40255, -52058, -74470, -66997, -26453, -21639, -41427, -49658, -76852, -71249, -54246, -35396, -29776, -5792, -19241, -9106, -28294, -40820, -57319, -49448, -32069, -57874, -98552, -95274, -63234, -47065, -53351, -40007, -19515, -17114, -21905, -55595, -44145, -27144, -42999, -57689, -69339, -63371, -32073, -28759, -26566, -34807, -38709, -36124, -49813, -59402, -57718, -22492, -36479, -47119, -36571]
16596c6571n1J5932k8273j0024J0526J4505j8262K623j0714k721K631K8221P024
16583b5154R018j654k21j0613K8085J4895k2189j0545J005K2877J6954l3534j6738
16570b7814j7389J8751m162r71k780j3670o523N621m161q448k0160r632K9956
16557f1382L6207j397j2269q269j7419l08J6074o727M459K7424K2128K0317r548
16544I290l557J4554R941M768l4418l9813l1621j147O150L6275J8231m2020l6752
16531i0119J2903J3169L415L4832J3046k7573k0676l217J5531P429j202P006J8424
16518a7032J700j5473R939J7050r533k0150j6451J194J1062p814Q355J5722J9312
16505b119J1200K1784n450n0888j3037j0236o672p4l2419j1990J7992J6350K8482
$$ y = [-36571, -36622, -20690, -48963, -58987, -48461, -33956, -52218, -49595, -60309, -63030, -60399, -32178, -25154, -16136, -17790, -18011, -28624, -539, 14356, -7833, -18378, -17373, 5504, 22458, -11076, -27814, -45203, -26452, -30614, -31585, -34365, -48035, -54558, -48937, -53098, -61546, -81706, -91338, -61382, -25175, -26572, -38841, -47110, -64529, -64837, -48763, -55490, -51031, -23607, -1479, 18838, 9290, 5733, 20287, 30228, 34996, 578, -39235, -70856, -72003, -65853, -29578, -11347, -53367, -90119, -77216, -64047, -60632, -25800, -12754, -40327, -61003, -64220, -48689, -41260, -42462, -35456, -17032, -15332, -30805, -20866, -3816, -13349, -33499, -49950, -48756, -37694, -45508, -37153, -21431, -2119, 9081, 30865, 25415, -25473, -38510, -48746, -55418, -55492, -87911, -99901, -81909, -65559, -37077]
16492c7077J5587m454o934j7561M321J5614J3373P143j2613r655K4684J7526j6720
16479f766k0271j8187M13K3607K028k1944l434M843n380j4426J5048K2802o600
16466b8267k0074J3254L7311k3174k1288J2771J852m164o092J0858L4516J2116
16454A9619j2730k5371j8415J3820K7650q30j7344j669q531j6415N959K1250J7610
16441D603j9841j9156N89K4200K0585k1570j6700k945j5495Q082n781K3146K2994
16428B711k4860k4854L445j1687J963L6935J1535l1998O664P125K4493Q925l1367
16415b0970m699J9453j797l0954R447M033O14K3146P056l7168R6J5886j9758k9254
16401f4869J752O022N66J5084R836J7756n750P802n305o325K9029Q840j0327o897
$$ y = [-37077, -21490, -25944, -32878, -50439, -46118, -30504, -17131, -9988, -22601, -32256, -7572, 9954, -6766, -27037, -45224, -44811, -21204, -19176, -41120, -44554, -39711, -45091, -59517, -44469, -21667, -28267, -48341, -35087, 2224, -20950, -42238, -29467, -27615, -31779, -37871, -27013, 7503, 19619, 6889, -18482, -36897, -23077, 4573, 3743, -13601, -15270, -23801, -40216, -34257, -13007, 4603, -15238, -34394, -33805, -9605, 10980, -10590, -27290, -30235, -45730, -37648, -43429, -20283, 2711, -22149, -47003, -43558, -55245, -53282, -16347, -4812, -36810, -30146, -23021, 1472, 10397, -20970, -25669, -6216, -8013, -38967, -29520, -25487, -24873, -1727, 5329, -31839, -31743, -15857, -35615, -64869, -63117, -57095, -56529, -41445, -31609, -13853, -19603, -11801, -17106, -23431, 5598, 14438, 4111, -2786]
16387b786L06m866n496N879J0525P311j6196k8051k6885j9747J5950l237J5406
16374e1887k865M47L1557J8112j187m613j7715Q62j0157k330n77k621R881J2631
16360b0462j0228j7113j2122q631M4466n093j3779k22J2310J6045k332m768j3349
16347c5278k53K829k141j7193J3887N0812k5524l9596K9787K2537P822k5426l0856
16334d8593q097K0451K2025j2812j664k358K6007J8690k5238q433J0687J8768
16322I433n558j1809k7770k7151L1984M0953M33m1875j4821O26j5429n816m27
16309f7227J6859M4349J5710j2164r146j0313K159Q004R239J1615j4021l7723
16297d2659R548N653J3128P930J7672l355p387j2529K017R473K7694j8829j6163
$$ y = [-2786, -2480, -7346, -12842, -6963, 3562, 10873, -5323, -33374, -60259, -80006, -64056, -67293, -51887, -54752, -54305, -22748, -4636, -5823, -10436, -28151, -27289, -37446, -39776, -40353, -42974, -33093, -20462, -30690, -47803, -59925, -68556, -24090, -29183, -42962, -43184, -30874, -14829, -17161, -21929, -35278, -35531, -32702, -34843, -52036, -38149, 12663, -12861, -52457, -22670, -133, 7689, -17737, -48593, -56690, -36239, -14214, -27026, -28690, -31048, -5041, 13649, -11589, -20022, -9335, 9433, 3875, -7934, -35704, -62855, -30871, 10082, 10515, -31360, -46181, -45555, -60984, -66800, -67227, -50368, -6019, 9691, -2473, -11619, -21932, -19773, -11769, -2530, 9085, -4936, -42659, -33111, -27458, -14330, -6400, 11272, 7917, 530, -11999, -9982, -509, 27185, 8356, -7807]
16284g807L696R831K4635r18k522l625l916l9364j5693j4838l0826j6082L165
16271i4264N4879J6437R02j7567j6287J3515Q724J4063J424o790l1953O867K6426
16258b3624j770j4688k4557J1615J6594o94j5367K7890J6509k7816m618p888j7397
16245f5811P697J7299Q515K943K0955o818j3417p747j1736M00L2787J4041j4547
16232a5439O649j4020O62k5287r796J9839J3683p535O063m234l925R185k2102
16219d6257M092J8343J0688k6268j1885J8887K71j1037K5514R646J0754K2061
16207B4809N856j1226l3813n618J0670q246J279Q163J4397Q346k875k6908j3210
16194b8376K0218J9036k8226k3072M546P337K4212j5536k8891M881J5927q176
$$ y = [-7807, -4111, 5720, 30355, 29437, 26915, 23290, 19374, -19990, -35683, -50521, -81347, -97429, -94264, -39385, -22948, -22046, -39613, -55900, -42385, -33661, -19598, -18174, -24964, -56917, -50050, -23624, -25394, -40082, -64639, -53024, -36430, -37124, -52491, -24601, -8092, -35908, -40526, -48414, -65811, -58114, -40815, -32300, -29357, -8402, -15220, -28637, -36384, -48120, -47720, -14933, -892, -15439, -8790, -22810, -22148, -47435, -57231, -37392, -23709, -31244, -25181, -29415, -33340, -24155, -46257, -42165, -23822, -13134, -39402, -51287, -32400, -32129, -43166, -17652, -8006, 2748, 24809, 30665, 19439, -14374, -19992, -9322, -17568, -16289, -8126, 6271, 14617, 11742, -15166, -28376, -8158, 10878, -17348, -40420, -35874, -28537, -4325, -19861, -48752, -43871, -27944, -36120]
16182c6120j0450O021K2522J5791J219j0427j8276k2887p176j9921K1312K9637
16170b8755J5549J1690k2268j6772K3820J5435k859J6671O359l4602P19j970l457
16157b0440n536J5958L2656j8554O855j3269j3767J1381Q502n79l2992M890j187
16144b6082m620J1520j1518k7149j7716J1202J2374J9496K527k5711j0957p196
16132g3830O914k140J2360M816J5137J3077M626j5298j3298r763J539J6371K0679
16119a8810K0164k2894k0089J2720K7918K17k9798j6129m940p9O171J4949K977
16106b7623Q67j2133j5762m288J4371J4781K766j4186J159K3262j7412j7391N410
16093d6179K0756K5473L231l3960q482j7021j7421N797N5258J2568J7043q427
$$ y = [-36120, -46570, -40549, -18027, -2236, -1017, -11444, -29720, -52607, -59783, -79704, -58392, -28755, -13206, -1516, -23784, -40556, -16736, -1301, -4160, 12511, 18870, -15732, -15013, -16983, -20440, -25976, -10018, 22638, 4084, 10939, -2330, -16097, -4716, 3786, 3207, -29785, -24895, -26082, -30702, -19182, -30700, -57849, -75565, -64363, -51989, -32493, -29966, -55677, -66634, -73830, -66916, -69056, -56696, -51880, -36743, -23666, -19040, -34338, -47636, -57399, -55860, -39489, -18810, 1354, -21540, -41629, -28909, -991, -774, -30572, -46701, -51641, -51720, -45549, -30600, -27623, -26756, -38889, -54651, -58939, -44568, -29787, -27021, -41207, -40048, -16786, -34198, -51589, -46179, -25423, 50, 3281, -30679, -39161, -56182, -73603, -67806, -12548, 20, 17063, 8636]
16081H636j8694K4785Q090l920m0324K6256J9930o101k628K028j6181j7655J0351
16068e427J4714J1554j2394j9925K1035n563l2906j9002P584L384k1453L4251
16056b4148L0573M846p464N814K888j0800k680o638p754K148L767j670j3203j5100
16042c9421o987k1429M26J6477k470j4068M5046K2786q188j2684j0284k5842J7450
16029c9188J6892K5018j5481j3753j0367N569J6411m033J7559k02p398j4784K863
16016b0894j9614o302q869J6169L3657L838q693n169j1484j4015K829J6530J001
16003b1016J728J1722j2720J6909q164m543o414k8612K5264K2981j1621K955n395
15990a6926k0019K3799K393J122p025j4004J11o432J4230o619j0305J1814O081
$$ y = [8636, -10058, 14727, 22817, 18897, -21427, 4829, 24759, 18658, 16030, 18058, 1877, -15778, -5427, 9287, 20841, 8447, -11478, 9557, 3994, -28912, -47914, -40330, -36946, -58399, -24148, 6425, 11271, 3807, 9621, 12509, 1709, -971, -7609, -15363, -13215, -9448, -11118, -24321, -39421, -46408, -67837, -67411, -50934, -53404, -67472, -22426, 360, -7828, -20512, -30796, -56638, -39188, -22296, 2722, -12759, -26512, -36879, -31310, -14899, -18932, -1373, -1575, -8973, -23757, -20894, -40508, -46810, -55679, -39510, -5853, -2015, -10708, -15877, -27361, -41376, -38547, -22017, -21016, -19288, -7566, -20286, -3377, -11541, -16084, -22498, -51110, -25846, -2865, -14486, -11531, -16926, -36945, -13146, -10753, -9631, -16656, -30660, -30549, -36981, -22751, -29370, -39675, -27861, -21780]
15977b1780O935r98L132J3826J3385j8457j7996l451j1921j1309M143J6317O787
15964b1387J4341j4851j5663K5255Q019j9596k0845K2135K2427J6142l2370k3922
15952d0315p855K4308n61K0838J2135J026n282J3609j6990k2950J0615O643J1827
15939G048p51R101j6936K1188j1354k5138j5153J4505Q483O130J0703K5512O992
15926D0330q762j2349j0497J3606K29l5296r624m997K2787K2232j7036J319l775
15913a833m963M822L348K2522o468k0944j6897O537K3561o283M73p693J0524J1576
15899A8282J8295j5000k7154j4825L3433L1406J7827k2645j5101l4689m6087j431
15887e7689N395j6306M459N82J0945k533J1439L2772P37j035M441r834J3063L6538
$$ y = [-21780, -14845, -15843, -12711, 1115, 14500, -3957, -21953, -25404, -37325, -48634, -44491, -28174, -21387, -7046, -21897, -37560, -12305, -4286, -23882, -44727, -22592, -165, 15977, -16393, -40315, -48170, -23862, -24423, -3585, 8550, 9576, 4294, 17903, 913, -22037, -11422, -4779, 7048, 6297, 15398, -1538, 19650, 8296, -16842, -31995, -17490, -9007, -2877, 7826, 33338, 40330, 31568, 19219, 8722, 22328, 22557, -12739, -22363, -27360, -4573, 17659, 623, 1942, -1833, -6796, -1974, 1374, 23896, 17428, -3516, -20413, -13876, 9685, 3402, 3875, -3818, 6706, 18282, 36577, 21577, -5577, -20402, 13031, 44437, 62264, 39619, 24518, -10171, -56258, -57689, -52294, -68600, -64141, -63559, -52614, -55147, -43708, -10936, -10199, -11234, -6793, -16627, -3564, 32974]
15873C2974j0889l774r497j8878n263J8946R237m357l2875o170K3827M589M768
15860B638j0111k5159J8345K643J4072O952M6365R224K167J7904k2677L095L8556
15847A04014L4949L4143P606m5371j1428N206j0357L4902Q611N4259K0324N5803
15835B92661M2229J4478J1323k5464j236Q90q739K039M8401P2680L5659L0452
15823E15373l548p173j9032k6870J217J6503L6479N9879N1612J8659J218j650
15811F42667m0243n4862l5926r451J4507l512K6234p704L207n025l3209k7249
15799D69434l9920k4797k2226j6433l468L5260L024j1045l8299n1753l5890j9504
15787B44383j8529k1441k3595K4829M4979M620k2697k1013k3617o2762k0621l1375
$$ y = [32974, 22085, 18311, 8814, -10064, -15327, 3619, 12856, 8499, -24376, -30546, -6719, -2130, 2638, -7473, -32632, -14287, -11644, 2428, 9380, 55745, 64969, 67136, 85040, 62363, 65458, 104014, 138963, 173106, 180712, 135341, 123913, 129119, 118762, 153664, 162275, 216534, 236858, 292661, 334890, 349368, 360691, 335227, 333991, 334881, 326142, 328181, 376582, 449262, 484921, 515373, 511825, 504652, 485620, 458750, 459967, 476470, 512949, 572828, 624440, 643099, 644317, 642667, 602424, 547562, 511636, 502185, 516692, 513180, 539414, 531710, 534917, 529892, 496683, 469434, 429514, 404717, 382491, 366058, 362590, 397850, 400874, 389829, 351530, 299777, 263887, 244383, 225854, 204413, 180818, 205647, 250626, 255246, 232549, 211536, 187919, 125157, 104536, 73161]
15775G3161k4833J9864r488k6051r694j8969j1686M223O656K852J2656J4751j0469
15762B2973l7654k1125J8107J7834Q662N340J2536r489m8256j7917L0370k434
15750b1053l5232j0943Q550J2204J7368J7780L0911J1925p213k3676j9350J027
15738a7702k619L655J6070k221l850J7287r85M35M343j9556M979P99N469j8170
15724a2066j3420K0053K7732R996k6209n569m271Q179P731j5718Q771J4932o344
15711A3797j4467J7760j2633j5126P716J8792l784j9895r036L890J1149O770j7884
15698a2951j1398J9625J6784K4257k6873j6145Q903J4501j1891l3601q68J1719
15686a7938J4688q342n201j1396J8064j3023r040K8j0490K0590K1372r53l6325
$$ y = [73161, 48328, 68192, 58704, 32653, 22959, 3990, -7696, -3473, 3183, 6035, 18691, 33442, 22973, -14681, -35806, -17699, 135, 8797, 14137, 26673, 17184, -31072, -48989, -18619, -21053, -56285, -67228, -58678, -46474, -29106, -11326, 19585, 31510, 24297, 621, -18729, -17702, -20321, -16666, -596, -2817, -6667, 10620, 9635, 10070, 14413, -5143, -164, 635, 6104, -12066, -25486, -5433, 22299, 32295, 6086, 517, -3754, 4425, 12156, -3562, 5209, 20141, 13797, -670, 17090, 4457, -10669, -2953, 15839, 12055, -7840, -16876, -12986, -1837, 4933, -12951, -24349, -4724, 12060, 36317, 9444, -6701, 2202, 16703, 4812, -28789, -29657, -17938, -3250, -11592, -16793, -28189, -10125, -23148, -32188, -32160, -42650, -22060, -688, -1641, -37966]
15673c7966N769K7741K1744j865l5758J466M890j0940l815L1692J0936M053j2601
15660E346j5051j0509P594J2267j3763L4J2716J6481r365J7436r229j4283J5536
15647A5210j3193p77l5513P498K0019l5828k4431R400r121N763M314Q188p166
15634e5637Q464R628k4563j3899J9078J2805M477m09N786N944r34J6924K7727
15621A5391M2222j2596m596j4251r346K1438j1203j4908k2072q247J1934K9600
15609B3366j554j5035l0334j6427j2476L6103K3015J601j6169l546j1811J7836
15597e431L192j5043J6731K1955O688j469k947J8561k7754Q512p102N561j7031
15584D423k7519j0476K291R365J5841J2811k1475j014M351q822M899L2548k746
$$ y = [-37966, -32197, -4456, 17288, 15423, -20335, -18869, -13979, -24919, -28734, 2958, 13894, 17947, 5346, -9705, -20214, -12620, -353, -14116, -14082, -1366, 15115, 5750, 23186, 13957, -326, 15210, 2017, 1240, -34273, -26775, -6756, -42584, -67015, -57615, -66736, -60973, -56659, -48471, -55637, -47173, -37545, -62108, -76007, -56929, -44124, -39647, -40056, -34270, -28326, -29260, -12336, 15391, 57613, 45017, 40421, 26170, 16824, 38262, 27059, 12151, -9921, -18168, -6234, 23366, 21812, 6777, -23557, -39984, -52460, -16357, 6658, 8259, -7910, -11456, -23267, -5431, -2239, -17282, -551, 21404, 28092, 26623, 23676, 42237, 14483, 22995, 15893, 21454, 4423, -23096, -33572, -31281, -21916, -6075, 6736, -14739, -15753, -11402, -20224, -15325, 17223, 14477]
15571A4477k7644N73R662p861K695O020J9820J4478j1537k3787j2695p386J8238
15558d947Q234n664J8623K2793k3221K772n821j996k2972J782L9714K6892L504
15545E9693m130M396j7062J6895N64j4371m1498j8670q01P779Q181k5728R294
15532a5458K1483j1598r751p044J5088n383k373N899j2940p75J0747r27q633J3618
15518h047Q948J4918J1272l7632j6080J333J6699R680j6475L836j8136p610J4362
15505b2932L7271J0288m091R45r807j3597k2404r393K624O198J0570L2945r01
15492A7716j460k4234j3593m898K855q877M094k3306j9744m992J129K8111K6813
15479b0386j3596K3190K5003p242j7275m3532l3565J4424K0209J1969K0650J8948
$$ y = [14477, -13167, -12594, -2932, -10793, -8098, -2078, 17742, 32220, 20683, -3104, -15799, -23185, -4947, 3287, -2377, 16246, 39039, 15818, 18590, 12769, 10773, -12199, -10417, 29297, 56189, 59693, 55563, 59959, 42897, 59792, 60356, 45985, 4487, -14183, -14984, -7205, 976, -24752, -15458, 6025, -5573, -15324, -22368, -7280, -12663, -15036, -9137, -22077, -22852, -12105, -13032, -21665, -8047, 901, 15819, 27091, -10541, -26621, -25288, -8589, 1091, -15384, -11548, -29684, -37294, -22932, 14339, 24627, 20536, 21481, 11674, -1923, -24327, -33720, -31096, -24898, -14328, 18617, 17716, 16256, -7978, -21571, -26469, -23614, -32491, -28397, -51703, -71447, -76439, -75310, -47199, -20386, -33982, -10792, 14211, 6969, -10306, -53838, -87403, -72979, -52770, -40801, -20151, -1203]
15467a203J4583k2810j8635k552K3446J7481K0757j0826j7317J630J2361j0908
15455F007r327j2771o381K7066o42j2443J6951k092J4557M840j4195m68j738k0187
15441a0823j7953j3925J1262O481m005K6225K8419J320j8794j5169r124j2697
15429b8783K845j0274K6829J4904r475J2894k2724k362K9638k569j5853j2667
15417a7597j1841j6557J2221R754K912j3814j0929J1615n717J4907q40l4598R765
15404e0719J6130P070K2k3746P157J8264J3064j865l699N09l1282n470K5104J7280
15390a2181L477K2222j7302l154j0070P063M896k0416j6619J9873M920q623j2048
15377c7962K4159Q308P468r95k9850l0563rK4695J6974Q227J5305J6409J8151
$$ y = [-1203, 13380, -9430, -28065, -30617, -7171, 10310, 31067, 20241, 2924, 4554, 16915, 6007, -3320, -16091, -22472, 4594, 3952, -8491, 8460, 6368, 20925, 25765, 11570, 11102, 9364, -10823, -28776, -42701, -31439, -24958, -28963, -2738, 25681, 27001, 8207, -6962, -16086, -28783, -25938, -36212, -9383, 5521, -3954, 8940, -13784, -16146, 13492, 10923, -4930, -17597, -29438, -45995, -33774, -24020, -21108, -34922, -45851, -34236, -39953, -25046, -25886, -60484, -50719, -34589, -27519, -27497, -51243, -44086, -25822, -12758, -14623, -18322, -17813, -49095, -54565, -29461, -12181, -8704, 13518, -3784, -6938, -17008, -9945, -5049, -25465, -42084, -22211, -17291, -25914, -37962, -13803, -5495, 1973, 978, -28872, -59435, -59444, -34749, -17775, -9548, 5757, 22166, 40317]
15364D0317j3083k7193J35J2030k8803k7559j4537J3524L3883m158J2680J8590
15352A5826J7414j7596l4415O410K2705J4755O021k0390r839K987J2227O233o237
15339A6101j5550j2721N559N381n206j315J4881J8256j7801k9456j0925J6254
15327a6542n481j094J7171r089J6802K0113k1160k5182N806M411n260J038J2731
15314e736J6226q61K0666Q033l7039k6728j4822L8929Q679j4212k208K0064M844
15301A5835j8512j2595L74K2413M736j8037j430K3870J9971K23L003K211k3614
15288A8448l4328L164K4895m148j2429J4033J1823R817J5013j2688l8222k6721
15276c1343r316J4796l568p489K3479K0514P83Q681P419m534J0257Q153q647j0067
$$ y = [40317, 27234, 41, 176, 12206, -16597, -44156, -58693, -45169, -11286, -15444, -2764, 15826, 33240, 15644, -18771, -12361, 10344, 25099, 31120, 10730, 891, 3878, 16105, 22338, 16101, 551, -12170, -6611, -1230, -6436, -7751, 7130, 25386, 7585, -21871, -32796, -16542, -22023, -23117, -5946, -15035, 1767, 21880, 720, -24462, -18656, -14245, -19505, -18467, -5736, 10490, 9629, 30295, 38328, 1289, -25439, -40261, -1332, 7347, -6865, -9073, 10991, 15835, -2677, -15272, -14898, 7515, 12251, -5786, -7216, 16654, 36625, 36848, 39851, 42062, 18448, -15880, -12716, 12179, 8031, -4398, 9635, 21458, 31275, 46288, 33600, -4622, -31343, -40659, -25863, -29431, -36920, -13441, 7073, 7856, 16537, 23956, 19422, 29679, 37832, 29185, 19118]
15262A9118j3600p303r712j0505q624J7250O847j4635L174j212K342M0135P910
15249C1185l3666j3808L8049K4544Q559j6694l2150o188M136P672j6231l762K8819
15236B0465k0990M890m784q278M145j5146l656Q503k222K4354N765p871N014r63
15222I226j1424k0770j9767J2137K6724q497j4719j39K1409l011o581M675j3440
15209b4177j1888J8446J791M009N115q861K2616k2340k5588L7789K2610J4176
15197C3698Q665j6168p838n914Q53Q712l542J9705N282j9238M659l0619j3181
15184a4926m150n916p773k0312l649P449L0946J5253M555j1684j0197P545N624
15171g235o259J0723q005k612j0561K822J4913Q662j5291Q322j7655L771J0706
$$ y = [19118, 5518, -1785, -11497, -22002, -30626, -13376, -6529, -21164, -17990, -19202, -16860, 23275, 31185, -2481, -16289, 21760, 46304, 54863, 38169, 6019, -169, 3967, 11639, -4592, -8354, 20465, -525, 4365, -419, -8697, -4552, -19698, -23354, -14851, -17073, 7281, 13046, 5175, 10189, 9226, -2198, -22968, -42735, -30598, -3874, -12371, -27090, -27229, -5820, -8831, -15412, -10737, -24177, -36065, -17619, -15828, -11819, -6704, -15565, 7051, -15289, -40877, -3088, 19522, 33698, 42363, 26195, 18357, 12443, 13296, 22008, 18466, 38171, 43453, 24215, 28874, -1745, -14926, -19076, -24992, -32765, -53077, -56726, -49277, -18331, -3078, 1477, -10207, -20404, -12859, -7235, -13494, -2771, -10776, -13388, -23949, -21127, -6214, 2448, -12843, -4521, -22176, -18405, -7699]
15158g699K1220K0005N621k5649p627n631l197O369K1911k0798k3193j760l229
15145b3657J2659n076J0154K0090n143k8333k9440j0860K995j953j0772M1038
15133b8298M7000L447k3506r46k4636J6616j451j6378q239R682J0292K0301J0409
15120A4293q130k0963M048K281l0813j2004K0592J5327J0001N069K6279J9587
15108D5567j7287k7107j219K689p701L114O495J4731k1134l774j6529r512J9491
15095a2176J0825O239J6015l612J5054j265j2305P406J1026j2901j8740j929N782
15082I419Q137L606J4457J786j899r470l0096j8114J4842K9808k540j1958l1735
15069b3757J3516K0583m3968p133J1649J9274N170o469o21J166Q911O109K8243
$$ y = [-7699, 13521, 33526, 39147, 13498, 5871, 240, -2957, 3412, 25323, 4525, -18668, -20428, -23657, -10998, -16074, -5920, 14170, 9027, -19306, -48746, -59606, -56611, -58564, -69336, -28298, 18702, 22149, -1357, -2303, -26939, -10323, -11774, -28152, -36391, -26709, -16417, 3884, 14293, 6163, -14800, -10752, -8471, -39284, -51288, -30696, -15369, -5368, -299, 25980, 45567, 28280, 1173, -46, 2643, -5058, -1944, 4551, 19282, -1852, -5626, -22155, -31667, -12176, -1351, 4888, 20903, 17291, 32345, 31080, 18775, 26181, 37207, 24306, 5566, 3637, 9419, 17556, 21162, 35619, 37405, 35506, 26036, -4060, -22174, -7332, 22476, 19936, 7978, -23757, -10241, 10342, -33626, -40759, -29110, -9836, -4666, -11135, -11756, -10590, -1679, 4430, 32673]
15056C2673j6129k8715r941J6458n015j8051L1121K1741k387J335j1887m4392
15044c3189J690O1377J1789p692n80j5031O985n26P581k5071k0613k739J9852
15031C833j0877J593J27M024K1698j0752m1941J3072P328J0801j924j2115k5603
15018d0736n705K2420J6492k1491j223k024j8913J619L6541L7838M387j0531J169
15005A9843j0266p561l5323k4361j2652L1112Q857j5165P521J024O414j3477L2284
14992a1750J1083m39O486j581m799O495P197k237P053p82l0571j2819M9085N768
14978B8189j9716p406j606Q481r411J2179j1134j0488q919P438r697J358J2186
14965h546Q035M211L050J377j6086j3877K795M4342J4000p231k3756j415J1039
$$ y = [32673, 16544, -12171, -22112, -5654, -10669, -28720, 2401, 24142, 21755, 23090, 11203, -33189, -31499, 29878, 41667, 33975, 33395, 18364, 25349, 24823, 32404, 7333, -13280, -16019, 3833, -7044, -5451, -5324, -1300, 20398, 9646, -32295, -19223, -11895, -1094, -3018, -15133, -40736, -46441, -24021, -7529, -29020, -30243, -32267, -51180, -49561, -13020, 24818, 29205, 18674, 19843, 9577, 2016, -33307, -57668, -70320, -39208, -30351, -45516, -37995, -36971, -30557, -44034, -11750, -667, -1106, 5380, 3799, -1000, 5495, 12692, 10455, 17508, 16726, -13845, -26664, 22421, 28189, 8473, 1067, -539, 7942, -1469, 10710, -424, -10912, -19831, -12393, -22090, -20732, -8546, -511, 3700, 6750, 8127, -7959, -21836, -19041, 25301, 39301, 32070, 8314, 6899, 17938]
14952A7938P207j6610m496k626J857p427M655k318J3278j2744l4743K6057r659
14939a9631K005q763J3597R558n539K5831O5k651q045J5188j3223j0025n68K2133
14925A9932j0112j1414j8939r893J423K4398J3981r526k0941k4556P062Q819K8204
14912a562J8796m660o966L362r214N296m203K3784J6533j2343k8059j2594J2768
14899I38J7364J3545q147n992j346N03j868k7434L900L3024J5460l3968l0889
14886b4910o735L315J7975j201N140J3355P047r628n30M099K2533m863j9973m21
14872E203p240R681j1110J8670J6437j8524M818n440j6507k3583R17k202P276
14859b1604J5555k4253l5851K8239K2959O005k570J5573r208j4929J1772Q641
$$ y = [17938, 25145, 8535, 4039, 1413, 3270, -4157, 498, -1820, 11458, -1286, -36029, -9972, -19631, -17626, -26389, -12792, -3234, -8773, 17058, 17123, 14472, 6427, 21615, 8392, -1633, -2201, 19932, 9820, -1594, -20533, -30426, -29003, -4605, 9376, -150, -21091, -45647, -38585, -29766, -1562, 17234, 12574, 5608, 8970, -244, 5052, 849, 24633, 41166, 28823, 764, -11830, 938, 18302, 31847, 23700, 17708, 16362, 16865, 14997, -12437, -8537, 24487, 39947, 5979, -24910, -31645, -28330, -10355, -11556, -6416, 6939, 13986, 4358, 3828, 7927, 30460, 25597, 5624, 5203, -2037, 7644, -3466, 15204, 31641, 13117, 17935, 12495, -4012, -27595, -26678, -28880, -21604, -6049, -30302, -66153, -37914, -14955, -8950, -11520, 4053, -5155, -20084, -8312, 329]
14847C29J6247m362j5003l024N027M153k7602K0917J994k2287k802K450l865m095
14833c1923P30J2878J254j4458K824J9604n187k607L113j139L589L687l745P85
14819a0595o572L76M332L376K6085p351l6531J9463K3691k3527k5931J1896o974
14806b8262N181K5775J9680r195k426N623j3465J065j8208k779J5728N343j1335
14793g275Q063M096J3167j3623j1060j405K7397J5477l442j3706J4513k4650l082
14780D470j6516K5075K7886M962j9954l0629j6500J9771P680j7233k8558n968
14768d5514m281l403m924J4997M2603K2870m732L260L4300l508k8645j2082j7734
14755f793q749J516N533J5755J0845P593j204j6450l5267j2431K4711M769n836
$$ y = [329, 16576, 12214, -2789, -5813, -786, 3367, -24235, -3318, -1324, -23611, -26413, -23963, -27828, -31923, -31193, -18315, -17061, -31519, -28695, -9091, -14278, -16885, -13772, -14911, -11322, -7635, -11380, -10595, -17167, -16791, -12459, -9083, 17002, 9651, -26880, -7417, 16274, -7253, -33184, -21288, -28262, -23081, 2694, 22374, 13179, 10753, 16376, 2911, 3976, -14232, -17011, -1283, 4060, -7275, 788, 4884, 18051, 4428, -6632, -8037, 19360, 34837, 31395, 17689, 32202, 7552, 4470, -12046, 13029, 40915, 45877, 25923, -4706, -21206, -1435, 6245, -10988, -39546, -45514, -49795, -53198, -58122, -43125, -522, 22348, 17616, 20876, 55176, 51668, 23023, 10941, -6793, -15542, -14026, -8493, 7262, 18107, 25700, 24496, 8046, -27221, -39652, -14941, -10172, -16008]
14742a6008k2206N817J6875L331K0599R646m653L183j4465p41O839K848J0488
14729B1553J4314L614k0011j0516l773L709k0819p402R218K1562K0048p702j0277
14716A3518j8046m320L603J1064L3487o472k4565j9886j889n600J5450K3885N84
14703B0813n946q55q105Q966R516L1723k1480l3992k456L840k9683k2041p084
14690e6784L730L9202L4034q049k1819m841J5059J7001j5697j5776J1630Q592
14678F282p310k7291J8462L4978j0378L814R050L44K1522r792L503R124n542L157
14664D9923n914o328J9343J4168l1638l3601p639K0257Q844m37j1348J630j6840
14651D20k6450p330Q103J4257J672l731q483k3271m422L1313Q063j8663M5685
$$ y = [-16008, -38214, -32397, -15522, -12191, 8408, 18054, 13401, 16584, 2119, 1378, 8217, 11065, 21553, 35867, 39481, 19470, 8954, 5181, 8890, -11929, -19331, -10113, 11449, 31497, 23795, 13518, -4528, -8848, -5245, 5819, 39306, 32834, 8269, -11617, -13506, -19106, -3656, 20229, 20813, 14867, 14012, 5907, 14873, 24389, 56112, 34632, 640, -1816, 2024, -27659, -49700, -56784, -53054, -13852, 20182, 12133, -9686, -14527, 532, 17533, 1836, -13940, -2310, 6282, -1028, -28319, -9857, 25121, 14743, 18557, 27607, 27951, 49473, 39681, 43184, 52308, 46766, 49923, 44009, 37681, 57024, 71192, 39554, 5953, -1686, 18571, 27415, 26978, 15630, 17260, 420, -26030, -33360, -25257, -11000, -9328, -13059, -21542, -44813, -49235, -17922, -9859, -28522, 17163]
14638A7163Q894O751j4386m9589j1619j986O811R052J0879O230J3339O302O246
14625A4087o103Q393J7482o720j9162j578J818l629J9070M549k2243j9933J2792
14612a177J1064o206k2046n732O400Q359q395L424O375K7230Q874k2426K524J1361
14598A9629k7361j6925K5421K8510j1204M659J1690J3951k028l337n284j0796
14586B6925J2869J2015o500k3970j1429J7542N199J2178J2834O069N724k0688
14574D8768m5483J1372K7814J1793O225k9366l073j5793j2682J3789K0076j0794
14562B2646j0479k2950O63l802L089J266q665n21M8209O77j9642J0047J4210j6169
14548A8579J762J4186j0524k3858r201p417J7888J8842M753l122l86r472j5325
$$ y = [17163, 26057, 32808, 18422, -31167, -42786, -44772, -37961, -28909, -18030, -11800, 1539, 7841, 14087, 7984, 16377, 33859, 27139, 7977, 6399, 8217, 4588, 23658, 28207, 5964, -13969, -1177, 9887, 3681, -18365, -24097, -17697, -9338, -17733, -14309, -7934, 19296, 28170, 5744, 8268, 19629, -7732, -24657, 764, 29274, 18070, 22729, 34419, 48370, 46342, 43005, 37721, 26925, 39794, 51809, 45309, 21339, 9910, 27452, 32651, 44829, 57663, 63732, 69456, 48768, 3285, 14657, 42471, 54264, 60489, 31123, 28050, 12257, -425, 13364, 33440, 22646, 12167, -10783, -10120, -13922, -10833, -9567, -18232, -18753, 29456, 30133, 10491, 20538, 34748, 18579, 20341, 34527, 24003, 145, -9056, -16473, 1415, 20257, 25010, 21888, 21502, 12030, -3295]
14535c295j1483j1345j067J3211L0423K0543j381j4358M530J481J7749j2943M143
14522C6208k464q907k939k6309q31L6953J9693j790j5175j4920R554R676j9858
14509A8891j4054J5426J3391J491j0380J6000j4202l1484K8621M4726r922J918
14497F0422n088k7506k8796P75J4098P722O095j8701N183l1956j5130J3071J813
14484a7998Q927Q531l0551o634J7150J0796j647M29n614K250j180n041K3571o40
14470B349l2828j5854L7706K8824j3537j9986R288P545L993k0646j1540J3461
14458a1225M789j9333k0111K9117L2683j1991N53J0150K987k0810j2400j0234
14446b5825J7964r886r129j0806J4736Q20O126J8348J0767k3974q70M226J0256
$$ y = [-3295, -14778, -26123, -27190, -13979, 16444, 36987, 35606, 21248, 25778, 27259, 45008, 32065, 36208, 33744, 24837, 21898, -4411, -5242, 31711, 51404, 49614, 34439, 19519, 29073, 38749, 18891, 4837, 20263, 33654, 35145, 24765, 40765, 26563, -4921, 23700, 68426, 58504, 60422, 55334, 27828, -968, -193, 13905, 21627, 27722, 9021, 14204, -17752, -32882, -19811, -17998, -9071, -540, -31091, -37725, -20575, -9779, -11426, -10997, -16611, -14361, -15541, -20582, 2989, 2349, -30479, -46333, -8627, 20197, 6660, -13326, -4038, 3507, 7500, -13146, -24686, -11225, -6436, -25769, -45880, -16763, 15920, 3929, 4482, 14632, 17619, -3191, -15591, -25825, -7861, -17747, -26876, -37682, -22946, -22126, -16000, 2348, 13115, -10859, -11729, -7503, 2753]
14433B753K5965J1621n285l0336j5608J783K1351P808R718j1245J2849L1283o452
14420E6205l8546j4982J8141K9364N970j7219j9732Q376J9297o873J4253J2753
14408F7007q353R840J1881j9370m4379q309J971K997O924K7034P124r944k602
14395D1821j1633k4630l366J0333R924m352o439K6534Q465j4958q084j0438j5709
14382b532k078J7109R619k145p076K5913k931k3713k5563M191m269l5974P417
14369d2032L3698K6962j5412j3169K1384k260j9979N71L7846q32m3423n530J2012
14356a0164L0339L1432j6268j6929j6844Q131K1826J9293K1690m6631j2898k507
14344A0470j153J2575j3549j1781j6647L1518K9875n279j4376J1325J9989O94
$$ y = [2753, 28718, 40339, 35054, 4718, -10890, -9107, 12244, 20052, 29770, 18525, 31374, 62657, 56205, 17659, 2677, 20818, 50182, 56152, 38933, 19201, 27577, 46874, 40001, 54254, 67007, 58654, 68494, 80375, 61005, 16626, 8317, 10288, 13285, 20209, 47243, 54367, 44423, 41821, 30188, 5558, 2192, 12525, 22449, 18097, 11658, 38192, 46657, 31699, 23615, 13177, -2532, -4610, 12499, 22118, 19973, 12897, 38810, 35879, 12166, -13397, -9206, -13475, -49449, -42032, -8334, 18628, 3216, -9953, 11431, 9171, -10808, -10237, 27609, 26777, -16646, -22176, -10164, 20175, 51607, 35339, 18410, 1566, 9697, 31523, 50816, 72506, 25875, 12977, 10470, 9317, 21892, 8343, -3438, -20085, 11433, 41308, 36029, 21653, 32978, 52967, 53661]
14332E3661Q89L713j7734k4223M521J1650P745K9640J6737j0888K367j5902l681
14319E8495L2724P278j9486j9177P980J37k9841Q763q562m1611l5230M20J7343
14306b0767K7259L7060K5519J043j8552j0279q626p104J2282j1945L027m013j9807
14293E097J4813N311Q515J2344j7558k1984k4370J504k793J8218R967r059K0262
14280B0267p125j4543k0440N041J989k0412l366m494Q695Q080J9152p937N48K0765
14266F220J3389l2678j5649J6708M176O693l826R022L3251p968j352K347m872
14253B5461j3520L173K6053K0050P938j933j4430k5830j090L431j1561n2772j2599
14240d7629L9647K9520k6947k8983K958M414J5682N0232K2558p049j1892Q275
$$ y = [53661, 54550, 58263, 40529, 16306, 20827, 32477, 40222, 69862, 86599, 75711, 78078, 62176, 58495, 91219, 98497, 79011, 59834, 67814, 67951, 38110, 46873, 38311, -3300, -38530, -38110, -20767, 6492, 43552, 69071, 70114, 51562, 41283, 32657, 25553, 37835, 25890, 28917, 24904, 5097, 19910, 25221, 33736, 46080, 28522, 6538, -17832, -16328, -19121, -903, 9064, 5, 20267, 13142, -1401, -21841, -16800, -14811, -35223, -38589, -43083, -34388, -26308, -7156, -15093, -14545, 6220, 19609, -13069, -28718, -12010, -7834, -1141, -4967, 4055, 37306, 29338, 27986, 30333, 25461, 11941, 15114, 41167, 61217, 69155, 67222, 52792, 26962, 25872, 29303, 17742, -35030, -47629, -7982, 21538, -5409, -34392, -31434, -27020, -11338, 38894, 61452, 54403, 42511, 50786]
14228E0786k2704k645L0308J3974J9573k4632k7048k6267J0476M576J2607k313
14216C6691j3575p537m428r8p018L372N0102K8065l2519n5192K2559P358L547
14203C1327K678j9410k957K1496J2091J6713k946p759j1139o899j6693l3833j4959
14190c2290J8746L5656J6503O193l7353R019j820j3906k1199j7744k3914J4630
14178d7479L5092L2923O581K9406n939k5143q501O322o023J3548l4435K1244R88
14165A8584M857j1849j7341j8378K144J0201k297L7912k70j3135R727J0106j800
14152B8461j5660k7426J1505L1100N242j6616j2271M4849M2010Q708l2128m708
14140F3066k0355r174k6855k0124K899J5194j8035r666J0658P063J4078J6231
$$ y = [50786, 28082, 25437, 55745, 69719, 89292, 64660, 37612, 11345, 21821, 26397, 39004, 36691, 23116, 15579, 11151, 11053, 4035, 7407, 57509, 85574, 53055, -2137, 20422, 27780, 31327, 34005, 14595, 11638, 33134, 45225, 61938, 58992, 51233, 40094, 33195, 16502, -17331, -32290, -13544, 22112, 38615, 44808, 7455, 16474, 14654, 748, -20451, -38195, -62109, -47479, -12387, 20536, 27117, 56523, 50584, 25441, 16940, 23262, 17239, 30787, -3648, 17596, 18584, 23441, 11592, -5749, -24127, -21983, -11782, -14079, 23833, 23563, 10428, 20155, 30261, 28461, 12801, -14625, -3120, 27980, 33222, 16606, 4335, 49184, 91194, 99902, 67774, 63066, 42711, 33537, 6682, -13442, -10543, 4651, -13384, -23050, -12392, -5329, 8749, 24980]
14128B4980J6120J6296m90k1411j1976k114j0311R666J3192J2570l454J7158J0393
14115G0619L97q382k1035k6111k8078P165K3733m567k7207J8063J0298k2914o582
14102a4601K1657j577k7840N322q06J978K0031J4990l7468r150L2656K8660J066
14089C4918J6553J4628q466j2809k5515j2976K3137n446j1154k213j5468J2825
14077H014n140p276J5330J7445J2981J8912M503k8208J202j2341p83P743j1451
14064B0931k9895R796K6237K1183J8312n0962j6974J0617M963R313K2718K1451
14052F7690N470k3447p891M949j9681j7764M995J294p441J6147m090J693j773
14039B0151j3272O142J3833m854j7257K1009R167R502J6392k4071k6091M44J6715
$$ y = [24980, 41100, 57396, 56906, 35495, 23519, 21405, 11094, 20760, 33952, 46522, 43068, 60226, 70619, 71016, 62634, 41599, 15488, -12590, -5425, 18308, 13741, -13466, 4597, 14895, -8019, -14601, 7056, 5479, -22361, -17039, -17845, -15867, 4164, 19154, -18314, -27464, 5192, 33852, 34918, 51471, 66099, 57633, 44824, 19309, 6333, 29470, 24024, 12870, 10657, -4811, 8014, 2874, -4402, 10928, 28373, 41354, 60266, 64769, 36561, 37763, 25422, 24639, 32382, 20931, -8964, 832, 27069, 48252, 66564, 15602, -1372, 9245, 14208, 23521, 46239, 67690, 73160, 49713, 41822, 46771, 27090, 9326, 14321, 15615, 8174, 24321, 20231, 21924, 20151, 6879, 13021, 26854, 22000, 4743, 25752, 34919, 44421, 60813, 36742, 10651, 11095, 27810]
14026B7810j962N437j7478j0075K1953L5173K514m877M267k4254k2543k9051J6638
14013C552K4617O8m190k1855J5480K166O109r703p430K1253J8103o891j9721M380
13999B5938j0262k0220N25P84P864K2004K4101K1666K5361q686j8289l0480j0307
13986B9999J141o434k83P531j3217o390q140l934l348q697M3077K8608k269k0033
13972C7611k6791J4823J5599k506Q046J2865P596p951J2371L1250j804l8155r694
13959E3260p484j3262k3092j6471k9363Q372J7803P487J5941O919J0449O775j3575
13946B3759r369l974l8393J8831J5911r575J5465o501J2512K7536K1234J1559
13934G8995j7699l3336l337J6648j6516j1086K2852Q267L182k119k5227j7542
$$ y = [27810, 25848, 31285, 13807, 3732, 25685, 60858, 63372, 58495, 62762, 38508, 15965, -13086, 3552, 28169, 28237, 24047, 2192, 17672, 19838, 25947, 16244, 8814, 30067, 48170, 41279, 21558, 25938, 15676, -4544, -4019, -3235, 4629, 26633, 50734, 72400, 97761, 89075, 70786, 40306, 29999, 31140, 24706, 24423, 31954, 18737, 12347, 4207, 273, -3075, -11772, 31305, 59913, 57644, 37611, 10820, 25643, 41242, 38736, 46782, 59647, 67243, 59292, 71663, 102913, 101109, 62954, 53260, 45776, 32514, 9422, -7049, -36412, -28040, -10237, -2750, 13191, 20110, 30559, 37334, 23759, 14390, 10416, -27977, -9146, 6765, -2810, 12655, 6154, 18666, 46202, 67436, 78995, 61296, 27960, 24623, 41271, 24755, 13669, 36521, 44788, 47970, 45851, 20624, 3082]
13922C082L0026K9460O200j706j9493n111l0452k2876P037R819J3696J4307M9969
13909H3958k6401j7308r715J2026J1373l3655L10o775Q494L0794R178j6951k2399
13896B2929J0742J2762J5769M949p493j8481L761M281q141n583j3545l0262l70
13883h682J5905J1503Q603R274q606j1107K2962J5510j7157l0506m116L831K0822
13870B8236N610k9235K788J2778J3004q381j9016o057N674J9169J5388J1242n239
13857D5961r920K639l3112O686O307j4399L7088J8369N262k3479m0300k2440J4566
13844f772J3196K3734k916q202J4132P403M125j0278l296j5621L361J9116j511
13831C6471N225M430k673K013k386o483J1960k1430j8860M610J5141J2921j3591
$$ y = [3082, 33108, 62568, 68768, 67062, 47569, 42458, 12006, -10870, -3833, 5986, 19682, 33989, 83958, 57557, 40249, 30534, 42560, 53933, 20278, 20588, 13813, 22307, 53101, 62279, 45328, 22929, 33671, 46433, 62202, 67151, 59658, 41177, 44938, 49219, 41078, 35495, 21950, -8312, -8682, 7223, 18726, 27329, 36603, 27997, 16890, 39852, 55362, 38205, 7699, 3583, 7414, 28236, 33846, 4611, 7399, 20177, 33181, 24800, 5784, -273, 5401, 24570, 39958, 51200, 45961, 36041, 38680, 5568, 12254, 18561, 4162, 41250, 59619, 64881, 41402, 1102, -21338, -6772, 6424, 30158, 27242, 19040, 33172, 40575, 44700, 34422, 31126, 15505, 18866, 37982, 36471, 41696, 46126, 43453, 45466, 43080, 36597, 48557, 27127, 8267, 12877, 28018, 40939, 27348]
13818B7348j2283J021j4958j597j5349P585N38J926r139j2559K4333K2788K8866
13805D8520o702j3857q809j7760J5292L4418M0756J4165l9304l9099l656L593
13793B7557r113J2930J5574K843n788j3973O066k9378j5582j209J8444P314J1585
13780B7270K2270K1351L927k6011j4213j347r753n028K3580k1765j4668M896K0374
13767C0883J7365k3640k7683Q08P309M8725O623J0414J2531j066j070j6463j6247
13754D8489L0444j023o820p576J3729m4836j7524O99l682K304R202J6449j87o579
13740C3089L110L0815n628Q76j8495j8464q797J8075K6284J8857j4220q642J6285
13727G3145K0633l621j4033P738J3701k7263k8654k2273j9955J0908M3706K6985
$$ y = [27348, 15065, 16086, 1128, -469, -15818, -8233, -7695, -5769, -14908, -27467, -3134, 19654, 48520, 41818, 27961, 19152, 1392, 16684, 51102, 91858, 106023, 66719, 27620, 23964, 27557, 18444, 31374, 46948, 49791, 44003, 30030, 36096, 6718, -8864, -10073, 8371, 15685, 27270, 49540, 70891, 74818, 48807, 34594, 33247, 23494, 18466, 42046, 20281, 5613, 10509, 30883, 48248, 24608, -3075, -2267, 5042, 53767, 60390, 70804, 83335, 82269, 81199, 64736, 48489, 78933, 77910, 71090, 63514, 77243, 32407, 14883, 15582, 11900, 14204, 23406, 39855, 39668, 33089, 36199, 67014, 61386, 62262, 43767, 25303, 16506, 34581, 60865, 79722, 65502, 56860, 73145, 93778, 90157, 76124, 83862, 97563, 70300, 41646, 19373, -582, 10326, 54032, 81017]
13715H1017P421k7710k1783P986K3415k297k8870j6889j371n281M477O371k46
13702B6240m5511m852L9034J3688j6470J6009j985j564K4831j0341k8006Q04K7829
13689C9706j2437k8128P234n300K7515K3421q866j7197K9067J0709k4841j2209
13677B8674J2172l189P745J4930p231M113J599K1935M629l4363m5284K6602J0421
13664D2753J7959l0353k0588J9814J6349J3466q012N008J3763j9994N743p212
13652D8696q04R975L2285L133j8068k431p166j3760Q627k5931k8995k198K3081
13639B6444N116j5869r8j0414K3678K2017Q329j6758k7364j0896L870p393j8517
13626a7855k819P518J8382j5443j5496K2243K8455K4468j6771J5647N6K6091j3166
$$ y = [81017, 88438, 60728, 38945, 46931, 70346, 68049, 39179, 22290, 20919, 15638, 20115, 26486, 26240, -19271, -24123, 14911, 28599, 12129, 28138, 26153, 24589, 49420, 39079, 11073, 11877, 39706, 27269, -859, 6375, 1075, 28590, 52011, 43145, 25948, 55015, 65724, 40883, 28674, 40846, 37657, 45402, 60332, 53101, 57214, 58813, 80748, 85377, 51014, 5730, 32332, 42753, 60712, 30359, 9771, 29585, 45934, 59400, 51388, 56396, 70159, 50165, 55908, 48696, 47892, 57867, 90152, 93285, 75217, 72786, 65620, 51860, 60487, 34556, 5561, 3363, 26444, 31560, 15691, 15593, 5179, 28857, 50874, 59203, 42445, 15081, 4185, 8055, 662, -17855, -20674, -13156, 5226, -10217, -25713, -3470, 24985, 49453, 32682, 48329, 48385, 74476, 61310]
13613F1310J0669k5786k0073K146K07K7339K5905k2490m1707j0377M8270M2523
13601I7936k0536M642j9184l1958j6870K2475n684O425J0153M591J9242j5025
13589E6207l33J3385R972k4778N895n808O95m28N914n33k0738M652k646j631l203
13574C6622j9609k5443j6295j1149J0004L5327Q039q13J7742J0477l895j1489
13562B9518p683K179O925N424J2698l706j6030N603k2987l9046L6841K5824K15
13549C5775J1187m054o054M351j5734R284o685n687j2067j1911J8487K1892J1568
13536E0352O683O85k147j1908r129K6347Q360l0167o640K8302M1246M970l0330
13523G6624j1135l147J4668J0372j6218n816J073j8361j4391l229R432l051m241
$$ y = [61310, 71979, 46193, 26120, 28266, 28473, 55812, 81717, 59227, 17520, 7143, 55413, 97936, 77400, 82042, 62858, 30900, 14030, 36505, 30821, 37246, 47399, 51990, 71232, 56207, 55874, 69259, 79231, 54453, 60348, 54540, 55235, 54807, 60721, 60188, 39450, 44102, 41456, 39825, 36622, 17013, -8430, -24725, -35874, -25870, 9457, 17496, 16683, 34425, 44902, 41007, 29518, 21835, 24014, 30939, 36363, 49061, 45355, 29325, 34928, 11941, -27105, 9736, 35560, 35775, 46962, 42908, 36854, 41205, 25471, 34755, 28070, 22383, 10316, -1595, 16892, 38784, 50352, 57035, 57720, 55573, 43665, 34536, 60883, 69243, 39076, 32436, 60738, 101984, 106954, 76624, 65489, 62342, 77010, 87382, 71164, 65348, 66421, 48060, 33669, 30440, 39872, 36821, 32580]
13510C2580J4107J2975L810M156J5122j0987k1197K9608K3863j464j4164q472
13498G9937j7337q268j1543k814L419R7L5148Q613k7743l5102j8901L6802M8536
13485I0844J000q913k8679m96J6397J6042m089m274j5013j6354L45J298K3647
13472G1755R3N146k3685p544K7334J0969K929p995r695J5848K3861k0755j7008
13459G1253j0062l9159m407o238n283j4328N521J9988J6187L5555J5577j3129
13447G1475k9522l2767j4787K6086n502Q22J8822J6771J9686o497Q105J0442j5949
13434F7185m988k0305n36L9868K9527P883m4289l0515J8330Q974J1397M220k5344
13421F1407o601L465J0193P581k8734j7956j0414Q442L0393J6067m19J0966J2346
$$ y = [32580, 46687, 59662, 63472, 67628, 82750, 71763, 50566, 80174, 104037, 102573, 88409, 79937, 62600, 54332, 42789, 39975, 43394, 43491, 78639, 87252, 59509, 24407, 5506, 42308, 90844, 91844, 82931, 54252, 53756, 70153, 86195, 82106, 77832, 62819, 46465, 46810, 48108, 71755, 71848, 76994, 53309, 45765, 73099, 84068, 86997, 79002, 69307, 85155, 109016, 88261, 71253, 61191, 22032, 17625, 11387, 6104, -8224, -2703, 17285, 33472, 69027, 84604, 71475, 41953, 9186, -5601, 20485, 14983, 15805, 34627, 51398, 71084, 64587, 72692, 83134, 67185, 62197, 41892, 41356, 81224, 110751, 118634, 74345, 43830, 62160, 71134, 82531, 86751, 61407, 54806, 58271, 68464, 76045, 47311, 29355, 18941, 27383, 57776, 73843, 73424, 84390, 96736]
13408I6736k7544j817M267P709N916j4976J5558j2229l0143j0145J030K0884J4351
13395F9597j4700j1484j5056j5224J9919J3093K6874k5401r286K2653J1079k7505
13383D4559K956R104k6595J648K1513N856K419M1002K4996p174j8161p930J5422
13370A09615j0762l1724l6122L0329p959P967j6315k8790M733J7531Q562j4942
13358C2123j05M067j3633M467m442k4373R20L6818J6192K2644Q760R658N954k8535
13344G0515k7444J7626R928j8618Q910K6027q159o680k2677j1266L0455J183L862
13331G3662J5662N391j3183r649J9099J0155o253j3073k6993r588N12k4484j6720
13318D538M288L2683L4804M712l892L255P042O307J0358K6942j921j2048L930
$$ y = [96736, 69192, 67375, 71642, 79351, 85267, 70291, 85849, 73620, 43477, 33332, 34362, 55246, 69597, 54897, 43413, 28357, 13133, 33052, 46145, 73019, 47618, 38332, 60985, 72064, 44559, 47515, 56619, 30024, 31672, 53185, 59041, 61460, 102462, 127458, 120284, 102123, 94193, 109615, 98853, 67129, 31007, 61336, 53377, 61344, 45029, 16239, 20972, 38503, 47065, 32123, 32018, 36085, 22452, 26919, 22477, -1896, -976, 35842, 52034, 74678, 83438, 93096, 99050, 70515, 43071, 60697, 70625, 52007, 60917, 86944, 78785, 72105, 49428, 38162, 68617, 69800, 73662, 89324, 94715, 81532, 71883, 90982, 101137, 94884, 81811, 54818, 45230, 45742, 21258, 4538, 8826, 41509, 76313, 81025, 77133, 80388, 87430, 93737, 104095, 131037, 129116, 117068, 120998]
13305A20998k1139m4432j8916j1392K5677J1274N089o450L930L2865J1481k14
13293A08771n658j0295j3420J1040J1329j0446j0582j0873O916r211J0810p782
13281G0599q06L1080Q027p605j711p081n944M167P970k192j7803O899J0869L288
13267I9757j2079J3886m620k1508l566P51q739K7606N825k0610k6001k2649K712
13254C0765L5789R555J5375J2189j940k3081j2091J0629j3540Q80J0906J8277
13242I3713P164J5104Q873k2120J1734J3477L817k736m2189K7254J8205k5731
13230A06565k5417J5090L2754k768j5118o642j1524Q392J4922K218j7424r449
13218I1599J3129P36R26J3162J7088q98r375j4214J6202J596K562J9674J9197
$$ y = [120998, 99859, 55427, 36511, 25119, 50796, 62070, 67159, 60709, 64639, 97504, 108985, 108771, 103113, 92818, 79398, 90438, 101767, 91321, 80739, 69866, 76782, 67571, 78381, 70599, 69793, 100873, 108900, 101295, 99584, 92503, 86559, 90726, 98696, 96504, 78701, 85600, 96469, 99757, 87678, 101564, 96944, 75436, 71870, 72621, 63882, 91488, 97313, 76703, 50702, 28053, 30765, 66554, 76109, 91484, 103673, 101733, 78652, 66561, 77190, 63650, 64530, 75436, 93713, 100877, 115981, 124854, 102734, 114468, 127945, 131762, 129026, 86837, 114091, 132296, 106565, 81148, 96238, 128992, 126224, 111106, 104464, 92940, 101332, 116254, 118472, 101048, 91599, 104728, 105464, 106390, 119552, 136640, 135742, 126367, 112153, 128355, 129951, 132513, 152187, 171384]
13205A71384o646o038M793O976q00l4493j2447P605M467J4101k9072j0485j542
13192A07803l664j3915j3023P805J3484L3087j634j1872J2549J1936l018k5855
13180A13683K952j6508J3210J3098m551J4406L0839k9718k1391j0468q556P855
13168A04851k725K2686J8389m452j6163M842j5781k2918J8750K0336k0375n118
13156A02322J7776j368p342J1056N58m019q381J7576L959M222N113L5269j7471
13143A59270n497J8586J29M506n0J070J3222J4619P062N641L757K5297M3855M6530
13129C37997N0970O8185P8976J62893J84773K39836K77596K93827K76927J46060
13119B118040K4592j59793k62043k82739k68843k10444j29089j04452p1946p1529
$$ y = [171384, 164738, 158700, 163493, 170469, 169669, 135176, 122729, 130334, 134801, 148902, 119830, 109345, 107803, 104139, 90224, 77201, 85006, 98490, 131577, 129943, 118071, 130620, 142556, 139538, 113683, 116635, 100127, 113337, 126435, 121884, 136290, 167129, 137411, 116020, 105552, 96996, 104851, 102126, 124812, 143201, 138749, 122586, 127428, 111647, 88729, 107479, 127815, 107440, 102322, 120098, 118730, 111388, 122444, 123002, 118983, 110602, 128178, 132137, 136359, 141472, 176741, 159270, 153773, 172359, 172488, 176994, 176944, 178014, 191236, 205855, 212917, 218558, 222315, 247612, 291467, 337997, 388967, 457152, 536128, 699021, 883794, 1123630, 1401226, 1695053, 1971980, 2118040, 2142632, 1982839, 1720796, 1438057, 1169214, 958770, 829681, 725229, 653283, 581754]
13109E81754o8961p0441m6581j7818m2352k4060q691J3456L645j6788j9320k6403
13097B57440m0516j6511J5423J3091J2132r499m1808N704P898M889j9137k2759
13085A66347J0932n315j1980k7425n1368M076L2751q105l458O201O993K1312O823
13072A47784k7854j9339R867J6989K766K0007k0967m014J4528K713P747R421K6639
13059A86287J4799L055p268N206j7289q124j3400k573p657l499L2411n257l351
13046A73340j1589J2492R180j1751j1113j8303K286M5128L168J8909j0307Q791
13034B10231J9757K1633J0681N546J0586Q154l5988l3213L745K803K5900J9704
13022B69539o40k9466m1501m0403o8638q5444j37396j77359j42170o8026j1276
$$ y = [581754, 512793, 442352, 395771, 377953, 335601, 311541, 302850, 316306, 319951, 303163, 283843, 257440, 216924, 200413, 215836, 228927, 241059, 231560, 189752, 195456, 203354, 208243, 189106, 166347, 177279, 171964, 159984, 132559, 81191, 85267, 118018, 109913, 106455, 112656, 119649, 140961, 147784, 119930, 100591, 110458, 127447, 130213, 150220, 129253, 125239, 139767, 142480, 150227, 159648, 186287, 201086, 204141, 196873, 202079, 184790, 176666, 163266, 160693, 153036, 149537, 181948, 176691, 173340, 161751, 174243, 183423, 171672, 160559, 142256, 144542, 189670, 192838, 211747, 201440, 210231, 229988, 251621, 262302, 267848, 278434, 286588, 250600, 217387, 221132, 223935, 249835, 269539, 268899, 239433, 197932, 157529, 88891, 3447, -133949, -311308, -453478, -521504, -532780]
13011e32780M1546N8913M7791Q2039P6457L7862q504m29L4502K1360K4499K3563
12999i3181J8965N582J4802J6449K648Q101K81K7934L0037N049p539J0766K5926
12986F5820J744l1638j3015L1559L390p381R142L355m035L690R852k2146n185
12973D5152O462K1644n606J6120n908J754J2364J2036K783O503j608o894k441
12960A02361Q246n414j1160o524p711J2274N72m3826j7674j3819M4901M9939k644
12947A09521j8644R325j4664K4540M4827R124L44N581l4639j8426K1966J9043
12935A57898j0103p850M538J7970M6646O2306K4614k3217k5857n687M4329L3625
12923C19212k007j8486M186J3942M915j1284m7846l1017j2701l78l263Q115J1989
$$ y = [-532780, -491234, -432321, -384530, -302491, -226034, -188172, -196676, -197105, -162603, -141243, -116744, -93181, -74216, -68634, -53832, -37383, -34735, -26634, -26353, 1581, 31618, 36667, 29128, 39894, 65820, 67564, 35926, 22911, 54470, 57860, 50479, 59621, 62976, 58941, 62631, 72483, 50337, 45152, 51614, 73258, 67652, 83772, 77864, 79618, 91982, 104018, 106801, 113304, 111696, 104802, 102361, 110607, 105193, 94033, 87509, 79798, 92072, 92644, 48818, 31144, 17325, 62226, 112165, 109521, 90877, 100202, 85538, 110078, 154905, 164029, 164373, 169954, 135315, 116889, 138855, 157898, 147795, 139945, 144483, 162453, 209099, 271405, 296019, 272802, 246945, 241258, 285587, 319212, 317205, 298719, 302905, 316847, 321762, 310478, 262632, 231615, 218914, 218536, 215273, 223388, 235377]
12910B35377j8696m4503L558O598k2683n784K2108L724J3506q989n209j0300m969
12897A63738J0275J4019N228j5982p927J9764L2182M7169K5634o476j1111k6291
12885B50222j1242l8286l2777k3254L4J5580j6028Q424L7412n032M789J0204l314
12872A96732R372j1408j8130l254o674j2916Q732K3546J4910K9037J5041j2361
12860B32627j040N386Q815p562o527l2915P669K9753K7918l024L028J1364k4997
12847B50495j0240j2147J746K273K7981k1169k8998n469K9045J5532N185j4918
12835B39316r557J4296J4571p964k3692P213J6764J5427j284O099J0415M1690
12823C23294L4280N8635L0709L1328j9062k116k0485l5373j6831Q531O335j0372
$$ y = [235377, 216681, 172178, 175736, 182334, 159651, 153867, 175975, 179699, 193205, 184216, 179007, 168707, 163738, 174013, 188032, 193260, 177278, 169351, 189115, 221297, 268466, 294100, 287624, 276513, 250222, 238980, 200694, 167917, 144663, 144697, 160277, 144249, 152673, 190085, 185053, 189842, 200046, 196732, 206104, 194696, 176566, 173312, 166638, 153722, 162454, 186000, 200910, 229947, 244988, 232627, 231587, 236973, 245788, 238226, 231699, 198784, 206453, 236206, 264124, 261100, 264128, 275492, 250495, 240255, 228108, 229854, 232127, 260108, 238939, 209941, 204472, 233517, 249049, 254234, 239316, 229759, 244055, 258626, 250662, 226970, 234183, 250947, 266374, 265090, 271189, 281604, 323294, 357574, 416209, 446918, 478246, 459184, 457068, 436583, 401210, 384379, 392910, 399245, 388873]
12811C88873k6038j0580L0053J1370q240l901L4642J1672J5788L7728N4263O5235
12799F00865J03326R8068O9672O0955K5694o3003q9199r0572p0550m3033r839
12788E92384q662k9137k270J6117J791Q441K4244L7685J0057N893M2451R206K496
12775G10696P349J0350j1011K5313r939m1594k1069J3522k4251J3028K0294j3446
12763F79242L241l4410k821K2856K204M360k0505L2467J9703J724K5635P088j5159
12750G25625l0640K1536P427K1797M1532J6319K9074M6552J0378L1491L9299M2779
12738A003169M0407M0638O7690N3723N9558L6099M2995N0321M7511L8193L7506
12727A517810J8159M0260N9659M0458L7034K9078N2459P1902Q1028Q0636J05823
$$ y = [388873, 362835, 352255, 382308, 393678, 385438, 381537, 416179, 427851, 443639, 481367, 535630, 600865, 704191, 802259, 871931, 932886, 958580, 895577, 806378, 715806, 645256, 602223, 592384, 583722, 554585, 552315, 568432, 570223, 578664, 602908, 640593, 650650, 656543, 698994, 708200, 710696, 718045, 728395, 717384, 742697, 732758, 691164, 670095, 683617, 659366, 672394, 692688, 679242, 682483, 648073, 645252, 668108, 670312, 674672, 654167, 686634, 706337, 708061, 733696, 740784, 725625, 694985, 716521, 723948, 745745, 787277, 803596, 832670, 879222, 889600, 921091, 960390, 1003169, 1043576, 1084214, 1151904, 1205627, 1265185, 1301284, 1344279, 1394600, 1442111, 1480304, 1517810, 1535969, 1576229, 1635888, 1676346, 1713380, 1742458, 1794917, 1866819, 1947847, 2028483, 2134306]
12716B134306J45325J30399Q2832R6205O4846O6913P1286J07305J15880J16223
12706C131520J05860J54786J81363J98577K39913K46489L07079L45645L36851
12697E248083L44060L84828M60961N46960O20824O86546P91417Q47217R78327
12688A0909223J159292J407145J728949K074896K533060L020316L612946M414524
12680C0860351N654290P570538J0451597J4786559K1049100K9691721M0545664
12673A60609820N1993643N9216328N5342332M1067541J9888103j1201181l8689437
12666C38227149n4985346n8573342m5977052l0674324k0595156j5224263j2913114
12659I9284552j2139969j1833357j0901814r297001p508857n916252m605980l507056
$$ y = [2134306, 2279631, 2410030, 2492862, 2589067, 2653913, 2720826, 2792112, 2899417, 3015297, 3131520, 3237380, 3392166, 3573529, 3772106, 4012019, 4258508, 4565587, 4911232, 5248083, 5592143, 5976971, 6437932, 6984892, 7605716, 8292262, 9083679, 9930896, 10909223, 12068515, 13475660, 15204609, 17279505, 19812565, 22832881, 26445827, 30860351, 36514641, 44085179, 54536776, 69323335, 90372435, 120064156, 160609820, 212603463, 271819791, 327162123, 368229664, 388117767, 376916586, 338227149, 283241803, 224668461, 178691409, 148017085, 127421929, 112197666, 99284552, 87144583, 75311226, 64409412, 55112411, 47603554, 41687302, 37081322, 33574266]
12651C3574266k703991k270752k118144k225631k435549k535185k410697k037178
12643A4837139j600372j298884j038054q98734q26789p64691p15577o94085n90080
12634F409873m98242m59978l94114m02168l76930l14272l20496l11079l13082
12625C019512k54353k07989k03146j69639j21181j03115o5540n5167m2351J2466
12615A809497O3502J10336J28826R8427L1673k2505j37729k50215k58667j81537
12605A391608j38669r0440p2269n4446l6399m7477k8706J707l3531o6319l0731
12594G94328q5n989k7139P464J0573j7068l1688l0320o5110l6446j8295P234j9181
12581E68278J296J9673J0795j6020l2559l7590m8550l3896M174k2116m8588m2614
$$ y = [33574266, 30870275, 28599523, 26481379, 24255748, 21820199, 19285014, 16874317, 14837139, 13236767, 11937883, 10899829, 10001095, 9174306, 8409615, 7694038, 6999953, 6409873, 5911631, 5451653, 5057539, 4655371, 4278441, 3964169, 3643673, 3332594, 3019512, 2765159, 2557170, 2354024, 2184385, 2063204, 1960089, 1894549, 1839382, 1797031, 1809497, 1872999, 1983335, 2112161, 2210588, 2242261, 2219756, 2082027, 1831812, 1573145, 1391608, 1252939, 1162499, 1090230, 1035784, 999385, 951908, 923202, 924909, 891378, 825059, 794328, 794243, 788254, 761115, 768579, 779152, 762084, 730396, 700076, 634966, 598520, 580225, 587459, 568278, 569574, 589247, 600042, 584022, 551463, 513873, 465323, 431427, 435601, 413485, 364897, 322283]
12569C22283k3317m9246l0145L2377L3900J4385l805k1485J5318J6108q471K4220
12557C22122K632J7462j1593j1980j9770l4017q869K1721L4720O7557M0744L0042
12545D50771j3192o8207o1783n034L8336J7795j0883r627j9562j9320J753J2039
12533C13086l774j0807l0725Q777P033J1572k4211n571n947n576k2682m5571n0260
12520A35344k8797m639O289l88Q386N6486K6307K6954K5321p831o648J1618P870
12507B56272j5556j2160K6247l415k1872j6517k3041j4344j0881K8374R552l7400
12495A65259j9173O054K0141k5131j7251l5959j171k0321k4334q120J5448L9598
12483I5040K5578j3709k4251l0290j3259L883J5453J5198o143J9003J8888K9092
$$ y = [322283, 298966, 249720, 219575, 251952, 285852, 300237, 296432, 274947, 290265, 306373, 297902, 322122, 324754, 342216, 330623, 318643, 298873, 264856, 255987, 277708, 312428, 379985, 420729, 450771, 437579, 369372, 307589, 302555, 340891, 358686, 347803, 338176, 318614, 299294, 301047, 313086, 309312, 298505, 267780, 276557, 283590, 295162, 270951, 265380, 259433, 253857, 231175, 185604, 135344, 106547, 101908, 108197, 107809, 116195, 172681, 198988, 225942, 251263, 243432, 236784, 248402, 256272, 240716, 228556, 254803, 251388, 229516, 212999, 189958, 175614, 164733, 193107, 202659, 165259, 146086, 152140, 172281, 147150, 129899, 93940, 92769, 72448, 48114, 39994, 55442, 95040, 120618, 106909, 82658, 52368, 39109, 42992, 58445, 73643, 67500, 86503, 105391, 134483]
12471A34483l019L0569j4588j6602K2804J1800k0405k7229l719j0219L4383m582
12459A33676j2432k908q175K792L455k3252l513k0164k5232l516J8748K0540P575
12446H7594p103k7279K261K0633K0994N958n847o08R127n350k3083l660p630M747
12432G0754K8454J5908j5104O357j1089l757Q632j4579k8747O940J2104r324o555
12419E9994K4982r117l0072r775M314J7000M079j6182k090j8367J4693K1236J6940
12406G7635M737M531j2164n742j5504J3614K132j9135P965L2090J8921J0872j0898
12393A09054J8360R515l3802m581Q635K1963K4159l1546j3866J650R449K9536
12381A48526J1082N305M282j158j5810j1627o730P805k472j0974j253m924o492
$$ y = [134483, 131464, 162033, 147445, 130843, 153647, 165447, 145042, 117813, 114094, 103875, 138258, 133676, 121244, 118336, 110161, 112953, 116408, 93156, 89643, 69479, 44247, 40731, 59479, 80019, 87594, 80491, 53212, 55473, 76106, 97100, 103058, 97211, 96603, 105730, 100380, 77297, 73637, 66007, 70754, 99208, 115116, 100012, 106369, 95280, 91523, 100155, 85576, 56829, 63769, 75873, 66549, 59994, 84976, 75859, 45787, 36012, 40326, 57326, 61405, 45223, 43133, 24766, 39459, 60695, 77635, 82372, 86903, 74739, 68997, 53493, 67107, 69239, 50104, 58069, 90159, 109080, 119952, 109054, 127414, 136929, 103127, 98546, 107181, 129144, 153303, 121757, 107891, 109541, 118990, 148526, 159608, 164913, 169195, 168037, 152227, 140600, 133870, 141675, 139203, 128229, 126976, 122052, 115560]
12368A15560o881j795j510J0439p104N036J9967J6655j426J6519J2746q192K180
12355A72194k618J949j3264j4890r489p210J8069K9420P006K0132j4510k516O316
12342A90589J0733q807R463M4009M4535K3372J0954J4818K4749K2616O7327O0411
12330E14769N4284O3122O3196P2272J9270j8704q6797j49382j63681j55730q8983
12319A23636o7061j3464m958j3561m0109l1013n151j3111J7309P66J5033J3781
12307a7903k0272M889J6420P024m90J6943J4607K201M552M860k3427o931l95J119
12293C197k597K091Q896R96J5150p284j5031j5000Q193P394l039o974k422J1224
12279D794J8449J3314K584J6980q257P748K548q465j591P709J8596O518n707M305
$$ y = [115560, 108679, 106884, 105374, 115813, 108709, 113745, 133712, 150367, 148941, 165460, 178206, 170014, 172194, 169576, 171525, 158261, 143371, 133882, 126672, 144741, 174161, 181167, 201299, 186789, 184273, 190589, 201322, 192515, 201978, 245987, 290522, 313894, 324848, 339666, 364415, 387031, 454358, 514769, 569053, 632175, 695371, 767643, 786913, 768209, 681412, 532030, 368349, 212619, 123636, 56575, 43111, 38153, 24592, -15517, -46530, -51681, -64792, -47483, -46717, -31684, -17903, -38175, -33286, -16866, -9842, -10332, 6611, 21218, 23419, 27971, 32831, 9404, 2473, 2078, 3197, 600, 2691, 11587, 12583, 27733, 20449, 5418, -9582, -1389, 6005, 2966, -4008, -6430, 4794, 23243, 36557, 39141, 56121, 47864, 55612, 58160, 49695, 48104, 55813, 74409, 80927, 75220, 79525]
12265G9525j2173j7677K124J6573m02m772j011k9324j7244J2379K7755j828J4763
12252F8688r202p153N531j322m207k653j2809k1140O715M4343L1844J5769K450
12239A16854J0816k89j1772R133J2382L0538r500k3922K9620K752j4018K0837
12227A73431M6629J4220k133J4215K7480M7640N2606O1164O5270R0901J52544
12216G43967K28089K65948K96192L11324K35077J25435j6514j64127k28762k27285
12206A569344j95017j17775o4962o8699o1570k4165m2810j13865q1562l7123k8511
12195G33285k8811l024J7127K6437L2434R3290R1001R6993J08876J07239Q7229
12184A362076N8159Q765j6052o7581q3380o5238n9320p4854m9668k6153j7200
$$ y = [79525, 67352, 49675, 51799, 68372, 67970, 63198, 62187, 32863, 15619, 27998, 55753, 53925, 68688, 59486, 52333, 57864, 56542, 52335, 49682, 36873, 15733, 22448, 66791, 98635, 114404, 116854, 127670, 127381, 115609, 124742, 137124, 167662, 158162, 134240, 163860, 166612, 152594, 173431, 220060, 234280, 232147, 246362, 273842, 321482, 374088, 435252, 500522, 591423, 743967, 972056, 1238004, 1534196, 1845520, 2080597, 2206032, 2189518, 2025391, 1796629, 1569344, 1374327, 1256552, 1191590, 1122891, 1061321, 1037156, 994346, 880481, 798919, 761796, 733285, 704474, 701450, 718577, 745014, 777448, 870738, 961739, 1058732, 1167608, 1274847, 1362076, 1420235, 1429000, 1412948, 1345367, 1261987, 1196749, 1137429, 1062575, 1012907, 986754, 969554]
12173I69554r211J1288N3664R8211Q6265Q2028O6658L6103J269k6138k8864q2460
12161A258367r6232j15789j37726p8544l1523k2492l7348o0079k7536r194J4104
12150F56008K8011R816k1321j1460n506q275m0673m4653m7116m5697l1828j1707
12138D25599l8196k9225K6629j5689l7080j6943m92K36j5147k0490n638K0010
12126B93574J3576k0138l2464L495J7194j0203J3590J3915N815K525j431k2435
12114B77013N902l101J8593R577j027k0559N271j1231J4727j1885k4373M205N67
12101B63679M945q031l648m5436k5500r711m705J1388K9061N159N069J6928j1868
12088B27330j0913P690K64k5504k9479l376K3012J8601L144l777j6134J081J3541
$$ y = [969554, 960343, 971631, 1025295, 1123506, 1209771, 1291799, 1358457, 1394560, 1395829, 1369691, 1340827, 1258367, 1162135, 1046346, 908620, 830076, 798553, 776061, 738713, 678634, 651098, 641904, 656008, 684019, 693835, 672514, 661054, 655548, 647273, 606600, 561947, 514831, 469134, 437306, 425599, 387403, 358178, 384807, 369118, 332038, 315095, 314603, 314839, 299692, 279202, 273564, 293574, 307150, 287012, 254548, 258043, 275237, 265034, 278624, 292539, 298354, 300879, 299448, 277013, 282915, 279814, 298407, 307984, 306957, 286398, 291669, 280438, 295165, 283280, 258907, 263112, 263679, 268624, 260593, 256945, 211509, 186009, 176298, 171593, 182981, 212042, 217201, 222270, 239198, 227330, 216417, 224107, 224371, 198867, 169388, 166012, 189024, 207625, 210769, 206992, 190858, 191939, 205480]
12075B05480J108J7744O763j5487l2503j9043j3973p985r499J2017J3973q125
12063A50470J2857L1250j8411k2906k0401R674L6131j9220k9014K669k1608J90
12051A11681M8209J9506K264J3119L1587L3080J3762j8369l902J6486l0618J3223
12039B50028J661j0497K161J6558J5107r148N872K1854J8804J0307r92k5487j7
12026B96211j0248P855j3243o6J6748n187k4794j4585P889j4733j2513r222k8484
12013A95628N354J1863K0374j4222Q019J9734p272j1659r921J651j9414o113J3753
12000B07775J1906j4398r140J2964r023k1283J1967j3033k6164j9658j9634k4732
11988H7547N846J1100J6212K732J4891J8075P593J1597q213j8485l791l5507k4075
$$ y = [205480, 206588, 224332, 231095, 215608, 183105, 164062, 150089, 142104, 132605, 144622, 158595, 150470, 163327, 194577, 176166, 153260, 132859, 142533, 178664, 159444, 130430, 133099, 111491, 111681, 159890, 179396, 181660, 194779, 226366, 259446, 273208, 254839, 250937, 267423, 236805, 250028, 251689, 241192, 243353, 259911, 275018, 265870, 271742, 293596, 312400, 322707, 321715, 296228, 296211, 285963, 293818, 280575, 280509, 297257, 292070, 267276, 252691, 260580, 245847, 233334, 224112, 195628, 200982, 212845, 233219, 218997, 227016, 246750, 239478, 227819, 217898, 219549, 200135, 194022, 207775, 219681, 205283, 196143, 209107, 200084, 178801, 190768, 177735, 151571, 131913, 112279, 87547, 93393, 104493, 120705, 123437, 138328, 156403, 163996, 175593, 167380, 148895, 145104, 109597, 85522]
11975H5522O232Q327r789J1732J0178j3548J0387K2940n466J6052K447N763o013
11962A44764J3838K0725J5732k0203k8132j0693M886q435k850j9768P732L9217
11950A56813K0619o482j9543k0954k904j5491o198Q517K6493J4109k823n676r056
11937A37424l1110j2955K118o60r688L983J631j288j2659P687K0727O784k5834
11924H6160j7980j028K5584J9830j2696Q197J5289J7758K7085J7449K264K8258
11912B16170l539l2854j555k3496q045L563J1256P306K0860P846J0874K6803J0438
11899B45627K5815J7886K7928J8219J3461K4224l3270k2859j6286j1420K385m52
11887B91258l6828k6812L916Q853o876j3209L766K107l235l3627J4383K6842r755
$$ y = [85522, 91754, 100081, 90292, 102024, 112202, 98654, 109041, 131981, 126515, 142567, 145014, 150777, 144764, 158602, 179327, 195059, 174856, 146724, 136031, 140917, 132482, 129632, 109864, 117596, 156813, 177432, 170950, 151407, 130453, 127549, 112058, 105860, 114377, 140870, 154979, 152156, 146480, 137424, 106314, 93359, 95477, 94817, 85129, 89112, 90743, 89455, 76796, 84483, 105210, 111994, 86160, 68180, 67152, 92736, 112566, 99870, 108067, 123356, 141114, 168199, 185648, 187912, 216170, 212631, 179777, 178222, 154726, 146681, 150244, 161500, 168806, 189666, 197512, 208386, 235189, 245627, 271442, 289328, 317256, 335475, 348936, 373160, 339890, 317031, 300745, 289325, 291710, 291258, 254430, 227618, 231534, 240387, 233511, 220302, 224068, 226175, 222940, 189313, 203696, 230538, 220783]
11874B20783q134k941M4466K688l1044K1420R968j6710M266L1813K4020k2193
11862B78402J31k3923J6771q32j7146M720l731J807j061N241J8591q292j9870
11849B50808j2232J8376p035n274j2884j3021k608J2637l638J2139O350J6356
11837B59974K6930J7219j1827k074q348J9903k101J1601n388j839j4178j3060
11825B76812r062O927K4632P733Q582J0069J1459K995J5083K1635J1206j6780
11813C71291k750K9742L3524N475J6991L6149N3903O9528Q6684J18799J46693
11802I66029J29160P5117L8580l8169j32626j67584j20502n3788p384l4396l5603
11791F18834m8167j6202k7568n632J5624j3017l3665o879m625j3694Q216k0487
$$ y = [220783, 212649, 209708, 254174, 256862, 225818, 247238, 257206, 240496, 244762, 276575, 300595, 278402, 278533, 254610, 271381, 270549, 253403, 258123, 254392, 256199, 255138, 260379, 278970, 270678, 250808, 238576, 256952, 249917, 244643, 231759, 218738, 216130, 228767, 225129, 237268, 243618, 259974, 286904, 304123, 292296, 290222, 281874, 301777, 299676, 311277, 305889, 304050, 289872, 276812, 267750, 274677, 299309, 307042, 315624, 325693, 337152, 340147, 355230, 376865, 388071, 371291, 368541, 398283, 431807, 437282, 454273, 490422, 544325, 613853, 700537, 819336, 966029, 1095189, 1170306, 1208886, 1170717, 1038091, 870507, 750005, 696217, 688833, 654437, 618834, 570667, 554465, 526897, 521265, 536889, 523872, 490207, 483328, 478703, 465009, 473225, 452738]
11779D52738k4047k5384J790N3459K3475j4629k6465l1590J0321L4927K6127Q270
11767D88992j0474K8613k5248l9855r662N332K6921J3772l5559l514K6353K4592
11755D90263J8088l299K3311K4098K0679L5782L0645R303M84N482N829K6098N1750
11742G38513J9782j059J5672L6626K9005K4975L6591J8127J5838K8866L5652L9563
11730A038151M3477K9210L7917N6273O6678N1323N8560Q9628P9731M9810O5283
11719A666041J11630R6928R3556R3092R6926J41812J49160J52938J69387K32365
11709C003835K34013K69662L34899M17748M91866N66818O97322Q05149R68370
11700G789682J092107J185730J303459J325336J268288J169071J017864Q60962
$$ y = [452738, 428691, 403307, 405097, 458556, 482031, 467402, 440937, 409347, 419668, 454595, 480722, 488992, 478518, 507131, 481883, 442028, 432366, 437698, 464619, 478391, 442832, 439318, 465671, 490263, 508351, 505052, 528363, 552461, 573140, 608922, 639567, 648870, 649354, 654836, 660665, 686763, 738513, 758295, 757236, 772908, 809534, 838539, 863514, 900105, 918232, 934070, 962936, 998588, 1038151, 1081628, 1110838, 1148755, 1205028, 1271706, 1323029, 1381589, 1471217, 1550948, 1600758, 1666041, 1777671, 1874599, 1968155, 2061247, 2158173, 2299985, 2449145, 2602083, 2771470, 3003835, 3237848, 3507510, 3842409, 4260157, 4752023, 5318841, 6016163, 6821312, 7789682, 8881789, 10067519, 11370978, 12696314, 13964602, 15133673, 16151537, 17012499]
11692A7012499P49355O34799N83802N24905M62463M43080L84761L59092L85787
11683B1540543L94955M59786N03501N84429O66058P22560P58089P88905P95113
11674B7213939P25361O21565N24395L82782J44575j33101l93599n95325o94698
11665B7795894o94222o34412n36290l86027l24956k49996k68347k38577k34891
11656B4228176k12389k16363k76560l18012l68684m39924n53330o83672q13386
11647B0345856r25690r73866j024811j120902j142348j107226j043937j017631
11639A1989445r14762p60254o27739m86607l62255k52846j49247o4918M9976J78037
11629H598830L05297N02279O70735Q20491J014369J137804J274715J355018J409562
$$ y = [17012499, 17761854, 18396653, 18980455, 19505360, 19967823, 20410903, 20795664, 21154756, 21540543, 21935498, 22395284, 22898785, 23483214, 24149272, 24871832, 25629921, 26418826, 27213939, 27939300, 28560865, 29085260, 29468042, 29612617, 29479516, 29085917, 28490592, 27795894, 27101672, 26467260, 25930970, 25544943, 25219987, 24969991, 24701644, 24463067, 24228176, 24015787, 23799424, 23522864, 23204852, 22836168, 22396244, 21842914, 21159242, 20345856, 19420166, 18446300, 17421489, 16300587, 15158239, 14051013, 13007076, 11989445, 11074683, 10314429, 9686690, 9200083, 8837828, 8584982, 8435735, 8370817, 8420793, 8598830, 8904127, 9406406, 10077141, 10897632, 11912001, 13049805, 14324520, 15679538, 17089100]
11620A7089100J419967J423273J364441J243320J151330J012492Q49104P26242
11612B6279269O34182N48867M78699L94054L12136L26115L58306L93221M63901
11603C0188750O04616P82152R62036J063792J204306J261976J176002R69125O97158
11594C8909913M17471J95844R174r5462j63089k17808l02552l91464n14988n90076
11584C7256963o08874p06628p88381p84311p82012p86659p27862o41623o30638
11575C0799975n67100n32276n27942n23404n55127o18882p01335p41566p95049
11566B5237294q19148q12878q40038r49726j079403j200123j346115j453693j490305
11557A5245865j408683j316501j189676j076750r01593p12926n65929m27184k86497
$$ y = [17089100, 18509067, 19932340, 21296781, 22540101, 23691431, 24703923, 25553027, 26279269, 26913451, 27462318, 27941017, 28335071, 28647207, 28973322, 29331628, 29724849, 30188750, 30793366, 31575518, 32537554, 33601346, 34805652, 36067628, 37243630, 38212755, 38909913, 39327384, 39523228, 39532402, 39436940, 39273851, 39056043, 38753491, 38362027, 37847039, 37256963, 36648089, 35941461, 35153080, 34368769, 33586757, 32800098, 32072236, 31430613, 30799975, 30232875, 29700599, 29172657, 28649253, 28094126, 27475244, 26773909, 26032343, 25237294, 24418146, 23605268, 22765230, 21815504, 20736101, 19535978, 18189863, 16736170, 15245865, 13837182, 12520681, 11331005, 10254255, 9352662, 8639736, 8073807, 7646623, 7360126]
11548G360126j87520o0827M4515J64933K26120J94592J76805J15549m337j14549
11538G915407k03169l29214m26419m61753n13159m90392m45231l80301l03771
11529D361998k39677j89222j34394p6086o4998J0423N4596J48384K38361L41842
11519D451227M40225O04568P66779R37151J078161J122518J114426J065244Q84674
11510A2464973O54379L52839J6080k54450n34159o77251p65062p40682o48669
11501I867998m73872k93071r3601J53113M16653P01641J023698J347831J657396
11492A4307786J881280J996948J956648J682882J278195P44832J01493n45609
11484B3404455j122718j474455j736034j816883j733045j526241j294969j037213
$$ y = [7360126, 7172606, 7111779, 7156294, 7321227, 7547347, 7741939, 7918744, 8034293, 8029956, 7915407, 7712238, 7383024, 6956605, 6494852, 5981693, 5491301, 5046070, 4665769, 4361998, 4122321, 3933099, 3798705, 3722619, 3657621, 3668044, 3722640, 3871024, 4109385, 4451227, 4891452, 5496020, 6262799, 7199950, 8278111, 9400629, 10515055, 11580299, 12464973, 13119352, 13472191, 13488271, 13233821, 12699662, 12022411, 11257349, 10516667, 9867998, 9394126, 9101055, 9007454, 9160567, 9577220, 10278861, 11302559, 12650390, 14307786, 16189066, 18186014, 20142662, 21825544, 23103739, 23848571, 23950064, 23404455, 22281737, 20807282, 19071248, 17254365, 15521320, 13995079, 12700110, 11662897]
11476A1662897p19470m24329j90026K7126K84524M48159N71573O58385O53182
11467A2972021N76771M51787K59014K5842k37156n45825p99335r47873j015970
11458A0739276j075529j049860r39174q03272o78373n60454m92695l88760l25209
11449D425950k89081k35724j70316p7967p318P8516J43419K65733L86478M57340
11439D977030N92362O66374P18939O70729N21998L48829J61172j34145l26855
11430H196433m47745n19477n71902n34284m43694l15909j70065n7232P7645K29802
11420E443572L82750N66093P52202R45996J045944J075806J054045R25140O36215
11411A2827763L38870k0362l91036p17928r40287j022358j051640r69653q29838
$$ y = [11662897, 10943427, 10519098, 10329072, 10356198, 10640722, 11088881, 11660454, 12318839, 12972021, 13548792, 14000579, 14259593, 14285435, 14048279, 13502454, 12703119, 11755246, 10739276, 9663747, 8613887, 7674713, 6871441, 6193068, 5632614, 5139919, 4751159, 4425950, 4136869, 3901145, 3730829, 3652862, 3645544, 3724060, 3867479, 4133212, 4519690, 4977030, 5569392, 6235766, 6954705, 7625434, 8147432, 8496261, 8657433, 8523288, 8196433, 7748688, 7229211, 6657309, 6123025, 5679331, 5363422, 5193357, 5136125, 5213770, 5443572, 5826322, 6392415, 7144617, 8090613, 9136557, 10212363, 11266408, 12191548, 12827763, 13166633, 13146271, 12755235, 12037307, 11097020, 10074662, 9023022, 8053369, 7223531]
11402G223531p32723n42675m36615l01755j65462o4176L152J54444K71405L17289
11392E726415L81399L77039K90466J79803N9909r3118k67271m04452n10767n61211
11382E178212n65398n26815m71308m11812l56852l31432k90608k24236j82922
11373A816829j66250j64089j47925j34052q9537q5679j12569r1697o8197o5930
11363F90904k9815l1848m2674j7754o22Q350K1960L2050k3667j4473j633k9225
11351E61553k7821k7483l4861r616j7759k9758k6106k36J4287Q739r860j5272
11339C85807k090J8426J4481o736J3587K2490o748l091l022p884j3629j6217J7
11326C95391M2257K1276k2722l1642j1386m661J5414k9261l5545K300j4834j1211
$$ y = [7223531, 6490808, 5948133, 5511518, 5209763, 5044301, 4980125, 4983277, 5137721, 5409126, 5726415, 6107814, 6484853, 6775319, 6955122, 7015031, 6921913, 6654642, 6250190, 5739423, 5178212, 4612814, 4085999, 3614691, 3202879, 2846027, 2514595, 2223987, 1999751, 1816829, 1650579, 1486490, 1338565, 1204513, 1114976, 1029297, 916728, 825031, 756834, 690904, 661089, 629241, 586567, 568813, 568191, 576541, 598501, 630551, 606884, 592411, 590778, 561553, 533732, 506249, 471388, 461772, 444013, 414255, 388149, 387913, 402200, 410939, 401079, 385807, 383717, 402143, 416624, 409888, 423475, 445965, 439217, 436126, 433104, 425220, 411591, 395374, 395391, 437648, 458924, 436202, 404560, 393174, 388513, 403927, 374666, 339121, 341421, 326587, 315376]
11314C15376q514j4998J9017P122N672M835J197j0769K6226K4544N80j7118k5445
11301C27725m5812o189m279k4375R659J7058L658r040J1130m938j3651j2675o293
11288B41978l2124R561K2133L4579p069k5849O976M0925L6972M9924m074j112
11276C72820K1180J895N693m632r548k1810N582J7555j5950J5561j4880J2928
11264C86394K0038J5480Q856L0413L1125O657L0530L3241J328L4420N1133J8954
11252F68569J0065O365j0040M946M844J6760j040k7070j607J4515J007l6588k3770
11239F26956K2440O91Q098J7310K2516K3525J3036q914M932j460N112l423J5902
11226G46721J5143o327L956q084j5447j3700j758J2618k5082j2589j4003l5063
$$ y = [315376, 306862, 291864, 310881, 318003, 323675, 328510, 329707, 318938, 345164, 369708, 370288, 353170, 327725, 281913, 275724, 271445, 247070, 256729, 273787, 277445, 268405, 279535, 274597, 260946, 248271, 241978, 209854, 219415, 241548, 276127, 269058, 243209, 250185, 291110, 328082, 378006, 373932, 372820, 394000, 395895, 401588, 396956, 387408, 365598, 371180, 388735, 372785, 388346, 373466, 386394, 406432, 421912, 430768, 461181, 492306, 498963, 529493, 562734, 564062, 598482, 649615, 668569, 678634, 684999, 674959, 679905, 684749, 701509, 700469, 673399, 671792, 686307, 687314, 650726, 626956, 649396, 650087, 658185, 675495, 698011, 721536, 734572, 725658, 730590, 729130, 734242, 730819, 746721, 761864, 755537, 759493, 751409, 735962, 722262, 720504, 733122, 708040, 695451, 681448, 646385]
11214F46385l1724L3279O570l643p696j8862K2399n497m2892R464J0346j70j0755
11201F07204l460j5351j7243k8049m2607k0066n021N63n443j6375J9579L3148
11189E06879R933L1791J1915L7454J9785R185j1223q465J5895K5653J4154J8421
11177F81377P854K1826M6447K5893K1455J9929k700k4687n736K6932K0251k1568
11165H17273J5221M2980M3383Q282K2501J2403J2673K0663p311j359L1920L2676
11153A051305K1106N0749J6557j8406J6748J0886j643j3628Q388q308m4470j3824
11141A075460k419j4848M462l547N840K2467J7229M842L1737L9017K9793M062
11129A214095j8089O759M2686K0173J6723J8975O3213P9244O7513Q8401R6342
$$ y = [646385, 614661, 647940, 654510, 650867, 643171, 624309, 646708, 641211, 598319, 607783, 618129, 617959, 607204, 603744, 588393, 571150, 543101, 500494, 480428, 475407, 475970, 470527, 454152, 473731, 506879, 516812, 548603, 560518, 597972, 617757, 626942, 615719, 607254, 623149, 648802, 662956, 681377, 689231, 711057, 757504, 783397, 804852, 824781, 822081, 797394, 791658, 818590, 838841, 817273, 832494, 875474, 918857, 927139, 949640, 962043, 974716, 995379, 988068, 986709, 1018629, 1051305, 1072411, 1123160, 1139717, 1121311, 1138059, 1148945, 1147302, 1133674, 1142062, 1133754, 1089284, 1075460, 1073041, 1058193, 1062655, 1059108, 1064948, 1087415, 1104644, 1109486, 1141223, 1180240, 1210033, 1214095, 1196006, 1202765, 1245451, 1265624, 1282347, 1301322, 1364535, 1443779, 1511292, 1599693, 1696035]
11118A696035P0387Q8135J41940J94991K29420K53771L14111M11979N08764N63348
11108D472881P22416R06028J058014J323363J608337J928708K323918K663762
11100A7007427K777380K594952K107048J367830M90661l56737r60748j273729
11092B3754084j268357j030628p22021l23355R4198M77821R44247J331737J570780
11083B4828506J646393J434476R37926J76566o97015j490503k101151k393962
11075B2341236k340938k147803j905534j617962j444799j368493j263128j108385
11067I144194r69446q49692p28086o18187n35081m49021l69320l33428k80284
11058D011649k05686j87436j88773j45482r7770o8972q9621l9647p254j1364J260
$$ y = [1696035, 1766422, 1854557, 1996497, 2191488, 2420908, 2674679, 2988790, 3400769, 3909533, 4472881, 5195297, 6101325, 7159339, 8482702, 10091039, 12019747, 14343665, 17007427, 19784807, 22379759, 24486807, 25854637, 26345298, 25988561, 25027813, 23754084, 22485727, 21455099, 20733078, 20409723, 20503921, 20981742, 21925989, 23257726, 24828506, 26474899, 27909375, 28847301, 29023867, 28326852, 26836349, 24735198, 22341236, 20000298, 17852495, 15946961, 14328999, 12884200, 11515707, 10252579, 9144194, 8174748, 7325056, 6596970, 5978783, 5443702, 4994681, 4625361, 4291933, 4011649, 3805963, 3618527, 3429754, 3284272, 3186502, 3117530, 3027909, 2988262, 2981008, 2969644, 2970904]
11047B970904N1862O8737J01424J09096J35199J49267J92950K11769L06938L84667
11037D682813M59429N94582P22514Q76666J034201J220270J509254J868979K349558
11028A5318266K923390L537562M182558M697234M915196M785589M130346K950313
11020D7440454J522690J6878j312179k138513k480547k347920j861443j110718
11012C7728702k74745N60199J295781J929819K431982K595942K414684J825478
11004E0507842Q06790m57515j848733l135413m030534m389611m368783l996682
10996B9087361l503018l029717k668616k338499k063481j821146j638883j435696
10988A0588305j266507j036162q68810p42344o24772n60370m74487l96874l32882
$$ y = [2970904, 3022766, 3091503, 3192927, 3302023, 3437222, 3586489, 3779439, 3991208, 4298146, 4682813, 5142242, 5736824, 6459338, 7336004, 8370205, 9590475, 11099729, 12968708, 15318266, 18241656, 21779218, 25961776, 30659010, 35574206, 40359795, 44490141, 47440454, 48963144, 48980022, 47667843, 45529330, 43048783, 40700863, 38839420, 37728702, 37453957, 38014156, 39309937, 41239756, 43671738, 46267680, 48682364, 50507842, 51314632, 50857117, 49008384, 45872971, 41842437, 37452826, 33084043, 29087361, 25584343, 22554626, 19886010, 17547511, 15484030, 13662884, 12024001, 10588305, 9321798, 8285636, 7416826, 6674482, 6049710, 5489340, 5014853, 4617979, 4285097]
10979D285097k84850k58331k34996k20628j52928j19332p5292k8068l8251n1254
10969B821167k8063K0437K9719J6606J5378N2020J06252J14035J56149K00494
10959C504194K47138L48896M62178N31658O90666Q31971R93990J187283J432430
10950A0230404J671423J909110K120378K250101K214349J912140J258733M79006
10942B4045644l64739r96720j376372j426505j164583p71873l54689M9428L72651
10933A8012242O86399R54166J101130J175330J015466O45090J48787n47271j260324
10924B1931015j805679k171898k268180k104896j780153j445268j216105j053975
10916H084861r32930q45645p83320p06581o00792n22348m13342l40789k87280
$$ y = [4285097, 4000247, 3741916, 3506920, 3286292, 3133364, 3014032, 2938740, 2910672, 2872421, 2821167, 2793104, 2813541, 2843260, 2859866, 2875244, 2927264, 3033516, 3147551, 3303700, 3504194, 3751332, 4100228, 4562406, 5094064, 5784730, 6616701, 7610691, 8797974, 10230404, 11901827, 13810937, 15931315, 18181416, 20395765, 22307905, 23566638, 24045644, 23680905, 22684185, 21307813, 19881308, 18716725, 17944852, 17590163, 17639591, 18012242, 18698641, 19652807, 20753937, 21929267, 22944733, 23589823, 23738610, 23191339, 21931015, 20125336, 17953438, 15685258, 13580362, 11800209, 10354941, 9138836, 8084861, 7151931, 6306286, 5522966, 4816385, 4215593, 3693245, 3279903, 2939114, 2651834]
10907B651834k80123k54052k13231k02857j65928j33170j33174j20312q6257n7355
10897A005375n2744o5678n5588k6927q559m0569n6430n1372k8426j9356l0214
10886E69512k0407k2132k8911m1365k6793j3150k7655l0426j1316Q340l069k2002
10874C30626m849N189o639j1952o118l472j1543K177J5568o283k1240l435j0866
10861B67163p970j5281L747l926o577J0612k4884q21K0263N142j0221l978O391
10848B39660k293l757k4645J0646j1234N459j2544l6208O714O557n0840k4009
10836A03506Q633M1565J314l073k2242k161K5247P843k6422k9247K3233j1122
10824A17074m5935Q658P672j3377l328q309K6534N835K0179J9245l479K903J1372
$$ y = [2651834, 2371711, 2117659, 1904428, 1701571, 1535643, 1402473, 1269299, 1148987, 1062730, 1005375, 952631, 886953, 831365, 804438, 795879, 755310, 698880, 647508, 619082, 599726, 569512, 549105, 526973, 498062, 456697, 429904, 416754, 389099, 358673, 347357, 355697, 352628, 330626, 325777, 330966, 324327, 312375, 306257, 302785, 291242, 293419, 308987, 302704, 281464, 278029, 267163, 259193, 243912, 247659, 243733, 237156, 247768, 222884, 222063, 242326, 247468, 237247, 233269, 239660, 237367, 233610, 208965, 219611, 208377, 213836, 201292, 165084, 171798, 178355, 127515, 103506, 112139, 153704, 155018, 151945, 129703, 127542, 152789, 160632, 134210, 104963, 128196, 117074, 71139, 79797, 87469, 74092, 70764, 62455, 88989, 94824, 115003, 134248, 130769, 133672, 145044]
10811A45044R865j5122n3475m2703O462J7549L1055Q661O17Q018J6268m020k3048
10798A05171J68Q073K1110l058j5333j6598p048P406K0530O69J718J8554j5434
10785A25928R273J8801R098J5406j4179j6367J112m033J0892K204j5969J4572
10773A56738K2174k8164j7309L0765J9571K322L440k3761l346K1613K2637P356
10761B14036o479J4785K7473l329j7952q089L018J930p765j0928J0820J4123k446
10748B29197k2980J718k7944M846j0292J0809L621P365k2270L105l691j9865j874
10735A51745J9679J001j8260o936R107r354k5354J7998R683J2330N69j0984K2180
10722A73404k9108j1359K0270J9558J3406j9276k6702l6091j5846K9062K3347
$$ y = [145044, 154909, 139787, 86312, 43609, 50071, 67620, 98675, 107336, 107953, 115971, 132239, 128219, 105171, 105339, 113412, 134522, 131464, 116131, 99533, 92485, 99891, 120421, 121090, 122808, 141362, 125928, 135201, 154002, 163100, 178506, 164327, 147960, 149072, 145039, 155931, 158135, 142166, 156738, 178912, 150748, 133439, 164204, 183775, 186097, 189537, 165776, 162430, 184043, 206680, 214036, 207557, 222342, 249815, 246486, 228534, 220445, 223463, 225393, 217628, 206700, 217520, 231643, 229197, 206217, 207935, 179991, 184837, 174545, 185354, 188975, 196340, 174070, 177175, 173484, 153619, 151745, 171424, 172425, 154165, 147229, 156336, 146982, 121628, 139626, 149309, 161639, 162208, 151224, 173404, 144296, 132937, 153207, 172765, 186171, 166895, 140193, 104102, 88256, 117318, 140665]
10711A40665J9882J1017L013K4425k9814q090J7262o92J2097P90M825j7788q806
10698A68786J560J7349L815k9019N729K1887K4627j8364j4115K3002L4399L2720
10686B72376J3847J1618K7389K4914R315K4547J6092J0297k9019J1793M370j5466
10674C82073j6339o212J6436r469r128m747M0453K0907R81o695j3726n680k7990
10661C60864m591l717l1432l7522l5141k1258k6668k416J718j0519R249l998k1912
10648A72657j0276M677j6053O909J6460Q083l3771m9195p132J8203j0409N610
10636A05763k6214j2759O421J5559L5527K4419k927j2647J2478R472j1200k2383
10624A21509R087k035k124l296n924P364m374J9709K6558J6978M607J9951J5024
$$ y = [140665, 160547, 171564, 174577, 199002, 169188, 161098, 178360, 177668, 189765, 190555, 195380, 177592, 168786, 170346, 187695, 191510, 162491, 168220, 190107, 214734, 196370, 182255, 205257, 239656, 272376, 286223, 297841, 325230, 350144, 359459, 384006, 400098, 410395, 381376, 393169, 397539, 382073, 365734, 359522, 375958, 366489, 357361, 352614, 393067, 413974, 414955, 408260, 394534, 388854, 360864, 356273, 352556, 321124, 283602, 248461, 227203, 200535, 198119, 199837, 189318, 198567, 194569, 172657, 162381, 167058, 151005, 157914, 174374, 182457, 148686, 99491, 92359, 110562, 100153, 105763, 79549, 66790, 73211, 88770, 124297, 148716, 145789, 133142, 145620, 155092, 143892, 121509, 130596, 128561, 126437, 123141, 117217, 124581, 120207, 139916, 166474, 183452, 188059, 208010, 223034]
10611B23034K4626L8405N1230L9397M6710K0647J69J1728J0755j1322l0766l1393
10599C93220R670J5661m5432k6511P492K4677K6148J6600J9439J4769O721K1035
10587D83489K006j7978j1653l9585j7170p836k5541n2865k6740n568k4256j1423
10575B44880j9343j7036r962J0207K8020j3477j861L8468J2979L849o623j5054
10563B55047l8722m438J4049q676l3541Q868K4149J7910j5369k2957j5382n893
10551A75045K5047R118k5771m1129l3238K1956J0362Q881q273P656L1060L7293
10539B18007J290J3689J057M0674J0302P125K3303L4092L9319L2542K7758M5888
10527D95046L7424o658j9103m440L6148K7510k861j2470p628P030L1562N2474
$$ y = [223034, 247660, 286065, 337295, 376692, 423402, 444049, 444218, 455946, 466701, 455379, 424613, 393220, 402890, 418551, 373119, 346608, 354100, 378777, 404925, 421525, 440964, 455733, 462454, 483489, 485495, 467517, 455864, 416279, 399109, 391273, 365732, 312867, 286127, 280559, 256303, 244880, 225537, 208501, 198539, 208746, 236766, 223289, 221428, 259896, 272875, 276724, 270101, 255047, 216325, 211887, 225936, 217260, 183719, 192587, 216736, 234646, 219277, 196320, 180938, 175045, 200092, 209210, 183439, 142310, 109072, 131028, 141390, 150271, 141998, 149654, 180714, 218007, 219297, 232986, 234043, 274717, 285019, 292144, 315447, 349539, 388858, 421400, 449158, 495046, 532470, 525812, 506709, 502269, 538417, 565927, 563066, 550596, 542968, 549998, 581560, 634034]
10515F34034O6562J4126L861N3144L6039q668j7063r977j6447l2145j6296j5840
10503F91330k0506k4650k1821k2840l1667l1326m054j0992J7489L4421K9631J9416
10491F24431J2158l742K4406J006j1184M1777K6912J4329K2998j0527j1175l5292
10479F96097j6760l445R171N9857N6056K2297N1955M3417J6521J8388O0082M9312
10467A062948K8316L659m7555m9608j2447o534q113J4285O0743L4216q18n368
10455A073724j4633k2111l7469p747j9300j6386m2656n4775l7144j9690k183j3790
10443G85840j9564L1420L8410K2360l536J3923Q981l3916l3698o8150m2531m1811
10431F57728k6178J596j0346m3973k7389j1845k1388j1457o363o115O812m607
$$ y = [634034, 700596, 714722, 718583, 771727, 807766, 799098, 782035, 772058, 755611, 723466, 707170, 691330, 670824, 646174, 624353, 601513, 569846, 538520, 534466, 523474, 540963, 575384, 605015, 624431, 636589, 632847, 657253, 658259, 647075, 688852, 715764, 730093, 753091, 742564, 731389, 696097, 679337, 675892, 685063, 744920, 800976, 823273, 875228, 918645, 935166, 953554, 1013636, 1062948, 1091264, 1094923, 1047368, 997760, 985313, 978779, 970666, 984951, 1045694, 1079910, 1079092, 1073724, 1059091, 1036980, 999511, 991764, 972464, 956078, 913422, 858647, 821503, 801813, 799630, 785840, 766276, 797696, 836106, 858466, 854930, 868853, 877834, 843918, 810220, 742070, 699539, 657728, 631550, 633146, 622800, 578827, 551438, 539593, 518205, 506748, 500385, 494270, 501082, 496475]
10419D96475k6351p564j7841k8553j8966k7210k0849p214k2345r551q968l8689
10407B62374J378J2533L421l6173k8884N192r448k4836k3984j7325j8799j7671
10395A07778j8358M082K9008M0241J0006j4434k188J8954Q914M525j3862r522
10383A65144k0494J5085m474j5227K1053Q228k9495k8035J898k813K4178J9943
10371A54991J7314j795L192l935J6628M2047n236j6127K9381j1402k1169n796
10359A98093Q772L389J801r136k5307l110j9353j1216J0483P168K006K164j2319
10346A53435o455J9396J7035q63K3628j7768j7097P68M19J2384r447l5702j731
10333A38002J3286k0528j2202j306j175q223J5075j7802k2524r909j1620P264
$$ y = [496475, 470124, 462560, 444719, 416166, 397200, 369990, 349141, 341927, 319582, 310031, 301063, 262374, 263752, 276285, 279706, 243533, 214649, 219841, 210393, 185557, 161573, 144248, 125449, 107778, 89420, 93502, 122510, 162751, 172757, 158323, 156135, 175089, 184003, 188528, 174666, 165144, 144650, 159735, 155261, 140034, 161087, 169315, 139820, 111785, 113683, 110870, 135048, 154991, 172305, 170510, 173702, 169767, 186395, 228442, 223206, 207079, 236460, 225058, 203889, 198093, 206865, 210254, 212055, 202919, 177612, 174502, 155149, 143933, 154416, 161584, 163590, 165754, 153435, 146980, 166376, 183411, 182548, 206176, 188408, 171311, 172079, 172498, 184882, 175435, 139733, 138002, 151288, 130760, 118558, 117252, 116077, 107854, 122929, 105127, 82603, 72694, 61074, 68338]
10321F8338k4075j4270P660R384k743m452J5905q341j3241P290R473J6512J5601
10308H3041L228n980q456j6382j8022L666J8177J7423J3842o5K1794r94l893p646
10294I9733J8688L9436L0987J0652K1283L5019P2262O8297M8537L9109N546l2450
10282D57099k9819l7096r552m0445r020K938m2307k4618j597J4733J3085k9293
10270B64108k8704p706M5958L8435o705k8649J600j7249r315l042l4473n0580
10258A63678l3500k5211J4626k1512o084K2827J1656J3285k3548n0646p628K5284
10246H3227Q356j1219j9161K3440J456k0180j8986m461p277M4723K3647j8030
10234H5535N215j8882K4173O695K580k0513M842Q662K008j0115k3547k7947K3493
$$ y = [68338, 44263, 29993, 37653, 47037, 44294, 39842, 55747, 47406, 34165, 41455, 50928, 67440, 83041, 86269, 80289, 71833, 55451, 37429, 41095, 59272, 76695, 90537, 90472, 112266, 111272, 107379, 99733, 118421, 157857, 188844, 199496, 220779, 255798, 328060, 396357, 444894, 484003, 489549, 457099, 427280, 390184, 380632, 340187, 331167, 334105, 291798, 267180, 265583, 280316, 293401, 264108, 235404, 227698, 273656, 312091, 305386, 276737, 278337, 261088, 251773, 248731, 214258, 163678, 130178, 104967, 119593, 98081, 91997, 114824, 126480, 139765, 116217, 65571, 57943, 83227, 91583, 80364, 61203, 84643, 86099, 65919, 46933, 42472, 35195, 79918, 103565, 85535, 90750, 71868, 96041, 102736, 105316, 84803, 89645, 98307, 100315, 90200, 66653, 38706, 62199]
10221F2199K9318P613R477j1793K2619K4243J8017R517J3219R577j6106N113k3551
10208A59462J7135K3891k765L459j6933j5739j0343j9932K0925J7079o519J3164
10196A82884M5585N835l1798K339m8860k3377J7806M692j3516j2610j4228P434
10184A22186l0281k6750r640J1068P402J8580O825j1246J4265K10j5803j2682
10172G4134j3464j909K7813P880j5555j2807N978P548J437L853M855k2083k6555
10159D1125j866J0234O065K057O775n867j9329k4964J4708J3536J038J5538K8557
10146H7607k653l768J8999k5925J7587N466j5060j5813l490P858j981J0633p182
10133G2278R947k6658k3157Q508O779j0919j5873n07K5539l475j4997J848L908
$$ y = [62199, 91517, 99130, 108607, 96814, 119433, 143676, 161693, 171210, 184429, 194006, 177900, 183013, 159462, 176597, 200488, 197723, 201182, 184249, 168510, 158167, 138235, 159160, 176239, 169720, 182884, 228469, 234304, 202506, 204845, 155985, 132608, 150414, 155106, 141590, 128980, 114752, 122186, 91905, 65155, 55515, 66583, 73985, 92565, 99390, 88144, 102409, 102619, 86816, 74134, 60670, 58761, 86574, 94454, 78899, 66092, 72070, 79618, 81055, 84908, 89763, 67680, 41125, 39259, 49493, 55558, 57615, 64390, 58523, 39194, 14230, 28938, 42474, 43512, 59050, 87607, 84954, 81186, 100185, 74260, 91847, 97313, 82253, 66440, 62950, 70808, 68827, 79460, 72278, 82225, 55567, 32410, 40918, 47697, 36778, 20905, 20398, 45937, 42462, 27465, 29313, 33221]
10120C3221j9424j5808j5567J3661N201j9883J3336j9490j1380J6940L5956N2347
10108F9110R434j8600P23p21k3469k575K3112q331P117K1610J3264J7298k2862
10095H5110l0606n605Q810O401j9684p154j4586l3347j0246K3397R046o261j1197
10082e922p325J6956j7914m635J3058J7659m4972J2046M5563J0548k672q069J5425
10069C9746O406L5417J2120j419J4737k022j1148j8917r875J0964K6420m8120
10057E4309k6119L8745J7627j2838J970L619k880k974N212j833J3503j0661K871
10044H0551L2914p821j8030n727K4854Q510j798k7047l2143k1023j6626m629j156
10031A0829p131j7087K6309L0074M56K580J9946N379J428K592L614q884J980Q048
$$ y = [33221, 13797, -2011, -17578, -3917, 1284, -18599, -5263, -24753, -36133, -19193, 16763, 69110, 78544, 59944, 60667, 59946, 36477, 33902, 57014, 48683, 55800, 77410, 90674, 107972, 85110, 54504, 48899, 57709, 64110, 44426, 37272, 22686, -10661, -20907, 2490, 11536, 5275, -5922, -13247, 3709, -14205, -18840, -5782, 11877, -33095, -21049, 24514, 35062, 32390, 24321, 39746, 46152, 81569, 93689, 92270, 107007, 104985, 93837, 74920, 65045, 76009, 102429, 54309, 28190, 66935, 84562, 71724, 73694, 77313, 74433, 71459, 76671, 74838, 88341, 77680, 80551, 113465, 105644, 87614, 81887, 106741, 115251, 113453, 86406, 54263, 33240, 16614, 11985, 10829, 3698, -13389, 12920, 42994, 43450, 46030, 65976, 71355, 72783, 75375, 78989, 70105, 72085, 80133]
10017H0133O093J8561j1913k4569k4335j0062K7513L2528K3069R482j7945m171
10005A04384o243j7970M260r094n330K4880J1582J0877r176k8465L297j5904J0598
9992G7696J781J7877J2786k8724o101k552j736o506J1075J7165o55j7607R606
9979H4105J5332O808j84k2885N482P794J1871j2892k712N123j3531J0235J7219
9966A11765K0218j5897j6306K9573j2222k2660n486m749L639o601K9530J8629
9954A29433k555k631o207R992j8925n808L2323J5189j6128l720l434j4437K692
9941A15784K1868J3371J2508L145j4100q004J2619L1650j1800Q009q12j1009k3470
9928A49759n129O344J1074L362J3665N840M057j629P618K3532j41R223p3r379
$$ y = [80133, 86226, 104787, 92874, 68305, 43970, 33908, 61421, 93949, 117018, 126500, 108555, 104384, 98141, 80171, 84431, 75337, 70007, 94887, 106469, 117346, 108170, 79705, 83002, 67098, 77696, 79477, 97354, 110140, 81416, 75315, 72763, 71027, 64521, 75596, 92761, 92106, 74499, 84105, 99437, 106245, 106061, 83176, 88658, 96452, 108323, 95431, 92719, 97842, 84311, 94546, 111765, 131983, 116086, 99780, 129353, 117131, 94471, 88985, 84236, 87875, 81274, 110804, 129433, 126878, 124247, 118040, 128032, 109107, 103299, 135622, 150811, 134683, 130963, 127529, 113092, 115784, 137652, 151023, 163531, 166676, 152576, 144572, 157191, 188841, 177041, 185050, 184238, 173229, 149759, 144630, 150974, 162048, 165410, 179075, 184915, 188972, 187343, 194961, 218493, 218352, 227575, 227502, 218123]
9914B18123n394K7238J4191l3910k122j496J7943J980j439l74J313l034j5104
9901B17915J2815N823K230L2019N50J4599Q263K473O904J0852J595j0501p753
9888B97784j355j2231m2919m129J2161M914K45m455J8166J7255k437m1491k7471
9875B14037K8292J6176m899J6141m796j945l780M464P68J7207j2847j6246N993
9862B58565j3759j0501l188k869J946J4318J4992j975J3539m5638l1579Q996K1729
9849B24576j47j528O826l1950O755J4199m550J2547Q450J8328K2864J9870L174
9836B99414k3199p758K8589K8529K668P574j5416k1067o837n732n789J0465J3084
9823C04525k2375k5150J1637K5923K0882o935n993j4661j1987J0211J5033J5036
$$ y = [218123, 212729, 239967, 254158, 220248, 218126, 216630, 234573, 236553, 235114, 234740, 236053, 233019, 217915, 230730, 236553, 238783, 270802, 271352, 285951, 294214, 296687, 303591, 314443, 316038, 305537, 297784, 296429, 284198, 241279, 237150, 249311, 254225, 254470, 250015, 268181, 285436, 282999, 241508, 214037, 242329, 258505, 253606, 269747, 264951, 263006, 259226, 263690, 264458, 281665, 268818, 252572, 258565, 244806, 234305, 231117, 228248, 230194, 244512, 259504, 257529, 271068, 225430, 193851, 202847, 224576, 224429, 222901, 229727, 197777, 204532, 218731, 214181, 226728, 235178, 253506, 276370, 296240, 299414, 276215, 268457, 297046, 325575, 328243, 335817, 320401, 299334, 292497, 286765, 280976, 291441, 304525, 282150, 257000, 268637, 294560, 315442, 308507, 302514, 287853, 275866, 286077, 301110, 316146]
9811C16146k0530m186J2659L5090j5884l1414k2158J1946j4129O249M959k5586
9799B53162K3563K4032M880N32j3986J3131j3401l2836r394j3225m9615j9645
9787A67198K2278J3758j739K2199O152j7412j0417j9692q810O253j6754L1652
9775A94666K6132k495j5310l8482j6180k0986j4358q086l759R49k1527pm600k317
9761G3640K2794p721j367k3339j012K3051J8411j1817k5238m279K756j5895k5211
9748B4773j0352L755K3317K2066L017k975m103l920j339j6694P997P404L0864
9735H3810M524J9198K3285j8290k765p249j3073O304j0806N089j174k6094l6395
9722B6364L2877J7511L20J4740L6853N150q970n260J8057m976n023J449P31j4812
$$ y = [316146, 295616, 291430, 304089, 339179, 323295, 291881, 269723, 281669, 267540, 273789, 278748, 253162, 276725, 300757, 305637, 306169, 292183, 305314, 291913, 259077, 249683, 236458, 186843, 167198, 189476, 203234, 201495, 223694, 229846, 212434, 202017, 182325, 173515, 179768, 163014, 194666, 220798, 218303, 202993, 164511, 148331, 127345, 112987, 104901, 101142, 102091, 80564, 80557, 75957, 73640, 96434, 88713, 87346, 64007, 62995, 86046, 104457, 92640, 67402, 63123, 65879, 49984, 24773, 14421, 18176, 41493, 63559, 66576, 63601, 59498, 55578, 54239, 37545, 45542, 52946, 83810, 88334, 107532, 130817, 112527, 109762, 102513, 89440, 95744, 84938, 90027, 88853, 62759, 26364, 59241, 76752, 77072, 91812, 128665, 133815, 124845, 119585, 137642, 132666, 127643, 129092, 129823, 115011]
9708A15011J5461M2449L4922j490j0112j1218l649k8016n470j0885J640J6155
9696A54798K418j1503m913r420k5704K1078Q987Q081K8462L488J2056m026k9166
9683A54636n618L4959P390j0609j0740k4867J2892L1906J4482K4101J2686K962
9671B44180K4196K0673M546K908J0045O241j2948j3791q602K691K485j4500Qj0385
9657B57747N816J1512j0723J7467K6189q674P553J7327K1317l3908k5548R199
9645B95274M1767K5962j2871k7697j1094j7216l0157P506J5916J3523M17M223
9633C05553j8728N941J934R719j8627j852O191k1598J8907J1210k5701K1269J7069
9620C11287k2316j6446J2036K154Q122K7543l3189l1597J18J6400P491R366J0574
$$ y = [115011, 130472, 172921, 207843, 206353, 196241, 185023, 181374, 153358, 147888, 137003, 138643, 154798, 157216, 145713, 140800, 131380, 105676, 126754, 135741, 143822, 172284, 175772, 187828, 183802, 154636, 149018, 183977, 191367, 180758, 170018, 145151, 158043, 189949, 204431, 228532, 241218, 244180, 268376, 289049, 293595, 296503, 306548, 312789, 299841, 286050, 277448, 280139, 282624, 268124, 268132, 257747, 263563, 275075, 264352, 281819, 308008, 299334, 306887, 324214, 345531, 311623, 286075, 295274, 337041, 363003, 350132, 322435, 311341, 294125, 263968, 271474, 287390, 300913, 301330, 305553, 286825, 292766, 294700, 304419, 285792, 283940, 290131, 268533, 287440, 298650, 272949, 294218, 311287, 288971, 272525, 284561, 286715, 294837, 322380, 289191, 257594, 257712, 274112, 281603, 290969, 301543]
9607C01543k0275R785K9331m522o090L6193K1109J1508K0649K8780K6797K9037
9595D83845M6119J7606J3900r28j2543O274l6776j3407M489O141J5309k163k2850
9582E05016Q317L13J3133j2150M267j192J2117K8686K2191L1223O4670K6730K9860
9569G33181M0072L068j2132J85j7351K6623M7883K3799N617Q552Q698j1377J5021
9556H71839L593J0295J9707M1316K4576M7500M1171j7105K7253K4250K9310M9106
9544A172811P7788Q2086O0374Q9111J00952J36880J50653J94539K29847K72276
9534B567317L15863M11268M59678M53148M54327M98519M67845L85163L42304L83830
9524F739262L80466M17873M64579N67577O61547P07130P72307Q24274Q43513Q52996
$$ y = [301543, 281268, 291053, 320384, 315862, 309772, 345965, 367074, 378582, 399231, 428011, 454808, 483845, 529964, 547570, 561470, 560542, 547999, 554273, 517497, 504090, 508579, 514720, 530029, 527866, 505016, 513333, 513646, 526779, 514629, 518896, 517704, 529821, 558507, 580698, 611921, 676591, 703321, 733181, 773253, 776321, 764189, 764374, 747023, 773646, 821529, 845328, 850945, 859497, 868195, 856818, 871839, 875432, 885727, 905434, 946750, 971326, 1018826, 1059997, 1042892, 1070145, 1094395, 1123705, 1172811, 1250599, 1332685, 1393059, 1482170, 1583122, 1720002, 1870655, 2065194, 2295041, 2567317, 2883180, 3294448, 3754126, 4207274, 4661601, 5160120, 5627965, 6013128, 6355432, 6739262, 7119728, 7537601, 8002180, 8569757, 9231304, 9938434, 10710741, 11535015, 12378528, 13231524]
9514A3231524Q05326Q10214Q12247Q12789P45571P07833O55797O10910N30893
9505A9723104M00321L82327L31544M16555M51197M99373N17534M73625M04969
9496B3600549K67100J50789Q9873J6161j4280l059k8076m1490l8418p4026n2449
9485B3872674q0529j54325k31924l17594m52260n45966n58384n09872m24295m41779
9475B0155746m94257n59177o78309p97147r15398r87653j000640r28532q10138
9466A2984495o90417n58384l92972k93371k86656k41278j64708j56638j85938
9457A0014133k45449j86939j08191L6465K20849M04663N28659O07162O93117O49309
9447A2613778N20774L99914L14549L50431M09902N22313P27873R46387J117082
$$ y = [13231524, 14036850, 14847064, 15659311, 16472100, 17217671, 17925504, 18581301, 19192211, 19723104, 20123425, 20505752, 20837296, 21253851, 21705048, 22204421, 22721955, 23195580, 23600549, 23867649, 24018438, 24108311, 24124472, 24110192, 24107133, 24079057, 24037567, 23999149, 23925123, 23872674, 23792145, 23637820, 23405896, 23088302, 22636042, 22090076, 21531692, 21021820, 20597525, 20155746, 19661489, 19102312, 18424003, 17626856, 16711458, 15723805, 14723165, 13794633, 12984495, 12294078, 11735694, 11342722, 11049351, 10762695, 10521417, 10356709, 10200071, 10014133, 9768684, 9581745, 9473554, 9510019, 9730868, 10135531, 10664190, 11271352, 11964469, 12613778, 13134552, 13534466, 13849015, 14199446, 14609348, 15131661, 15859534, 16805921, 17923003]
9438A7923003J319593J512734J632893J668503J593266J469335J276020J082450
9430B9477797Q97334P89091Q09525R09679J008535J062194J026884R48579Q30904
9421C7760522N53455L42033K45068K77527L90064L68420K31281J92866J97437
9412D0558673J16060N4062j02685k70341m76735p12168q04488p62635o50817m76990
9402C6471936l85210l62854l77484n24709p43880j008325j127004j133314j149598
9393B9659558j230351j309823j442158j633733j654947j597858j465502j306676
9385A8018510j136319r98273q57906p44186o92845p12539p43852q00791q41122
9376A0490677q65136q57730q52734q10923p18505o49334o06225n18981m49709
$$ y = [17923003, 19242596, 20755330, 22388223, 24056726, 25649992, 27119327, 28395347, 29477797, 30375131, 31164222, 31973747, 32883426, 33891961, 34954155, 35981039, 36929618, 37760522, 38313977, 38656010, 38901078, 39178605, 39568669, 39937089, 40168370, 40361236, 40558673, 40674733, 40728795, 40626110, 40355769, 39879034, 39166866, 38362378, 37599743, 36948926, 36471936, 36086726, 35723872, 35346388, 34821679, 34077799, 33069474, 31942470, 30809156, 29659558, 28429207, 27119384, 25677226, 24043493, 22388546, 20790688, 19325186, 18018510, 16882191, 15883918, 15026012, 14281826, 13588981, 12876442, 12132590, 11331799, 10490677, 9625541, 8767811, 7915077, 7104154, 6385649, 5736315, 5130090, 4611109, 4161400]
9367D161400l67550l01325k55181k57117k22780k27677k12361j56201j39228j11359
9357A910621j02694q7997n3922l2089o7763p8334q2748l3306n7819n8314n2354
9346A203281l6512m4102m8884l5880j385l17l0532j9943j7616n5520q237l881
9334I00472j6824m253Q112j5579j3606R614J185J5410J5505J8822K1644K1708
9322I62210K4736J0134M859n346j6662N736O379N209J777n399L2267J0484j9025
9309A017359J7039M5040K2836K5209K7848J8299L5184N0445O6893O6830O6788
9298A459770O2463M3919N2676N8232M2894P1766R1813P9883J02276J19195J31847
9287B316734J54455J66460K13055K86974L93382M94431O19476P37441R24354J086034
$$ y = [4161400, 3793850, 3492525, 3237344, 2980227, 2757447, 2529770, 2317409, 2161208, 2021980, 1910621, 1807927, 1719930, 1666008, 1633919, 1566156, 1487822, 1405074, 1371768, 1313949, 1255635, 1203281, 1166769, 1122667, 1073783, 1037903, 1036518, 1036201, 1005669, 985726, 968110, 912590, 904353, 900472, 883648, 879395, 887507, 871928, 858322, 867936, 869121, 884531, 900036, 918858, 940502, 962210, 986946, 997080, 1001939, 996593, 979931, 985667, 992046, 997255, 999032, 993633, 1025900, 1036384, 1017359, 1034398, 1079438, 1102274, 1127483, 1155331, 1173630, 1208814, 1259259, 1326152, 1392982, 1459770, 1522233, 1566152, 1618828, 1677060, 1719954, 1791720, 1883533, 1963416, 2065692, 2184887, 2316734, 2471189, 2637649, 2850704, 3137678, 3531060, 4025491, 4644967, 5382408, 6306762, 7392796]
9277G392796J274010J406701J478625J418396J230753R33313N41076J14489l10715
9268A5479444o03273p93002q61096q78521q98325q48375p56193o56011n37946
9259H646702l81706k14569l3156J61216L80699O14334Q10765R47195J062564J105136
9249A3099180J048407R13783O71346L28222l3207m22684o99738q75224r12248
9240A3117837r06497r06045q89428q78635q55899q17662p91107o96931n86053
9231E789580m58555l75776l15028k57413k03031j59881j55994j20307r7323o3851
9221C582421m5331l0061j546O4136J19833J54138K00724K36103K63618K82449
9211D826484L25488M17383N59281O72818P89316J001212J251312J480750J761680
$$ y = [7392796, 8666806, 10073507, 11552132, 12970528, 14201281, 15134594, 15675670, 15790159, 15479444, 14876171, 14083169, 13222073, 12343552, 11445227, 10596852, 9840659, 9184648, 8646702, 8264996, 8050427, 8017271, 8178487, 8559186, 9173520, 9984285, 10931480, 11994044, 13099180, 14147587, 15061370, 15732716, 16060938, 16027731, 15605047, 14905309, 14030085, 13117837, 12211340, 11305295, 10415867, 9537232, 8681333, 7863671, 7072564, 6375633, 5789580, 5331025, 4955249, 4640221, 4382808, 4179777, 4019896, 3863902, 3743595, 3646272, 3582421, 3537090, 3507029, 3505483, 3569619, 3689452, 3843590, 4044314, 4280417, 4544035, 4826484, 5151972, 5569355, 6128636, 6801454, 7590770, 8591982, 9843294, 11324044, 13085724]
9202A3085724K122758K445489K739598K911991K881798K586957K071754J352528
9194C2198597N90871q1241m67738o77599r28699j158662j398077j674957j827660
9185B4574835j786871j538585j241899q38880m38011l4600M19196Q64058J303891
9176B1283134J716726K020445K245912K325865K158188J737025J067377K41970
9168C4796642n73489j188397j555479j654799j675338j713626j829431k024107
9160B2581976k159374k125493j975390j733516j491786j281379j091849r63786
9152I759403q09186p03794o36992n62454m82042m09084l70030k74599k27845j81603
9142E101774j44760p7778j6823J4492L6043J17771J47889K01186K26771L18574
$$ y = [13085724, 15208482, 17653971, 20393569, 23305560, 26187358, 28774315, 30846069, 32198597, 32789468, 32708227, 32240489, 31562890, 30634191, 29475529, 28077452, 26402495, 24574835, 22787964, 21249379, 20007480, 19168600, 18730589, 18695989, 19115185, 19979243, 21283134, 22999860, 25020305, 27266217, 29592082, 31750270, 33487295, 34554672, 34796642, 34223153, 33034756, 31479277, 29824478, 28149140, 26435514, 24606083, 22581976, 20422602, 18297109, 16321719, 14588203, 13096417, 11815038, 10723189, 9759403, 8950217, 8246423, 7609431, 7046977, 6564935, 6155851, 5785821, 5511222, 5283377, 5101774, 4957014, 4879236, 4862413, 4876905, 4912948, 5030719, 5178608, 5379794, 5606565, 5925139]
9132E925139L82530M75238O02132P22767Q56273J021710J252777J455716J723870
9123A4418152J940176K043958J963525J755365J429440J154812R16236P66643
9115B6388307O53518M54649O7448m43311j019794j467785j650290j605323j421533
9106A9955886j172944q90879n89664k68732P3049M41066P90810J153184J414688
9097B0906464J606059J672922J615413J357224J019086N87074J85869n0448k16373
9088B8683290l98722o42568r76867j405113j728150j827662j735590j514959j205569
9079A7248090r97555q33533o82512n16277l32847k02053o6974O6244J81866K95011
9069A4159460M09965N37984O62953Q46906R99067J124438J306017J485913J702958
$$ y = [5925139, 6307669, 6782907, 7385039, 8107806, 8964079, 9985789, 11238566, 12694282, 14418152, 16358328, 18402286, 20365811, 22121176, 23550616, 24705428, 25621664, 26388307, 27041825, 27496474, 27563922, 27120611, 26100817, 24633032, 22982742, 21377419, 19955886, 18782942, 17892063, 17302399, 17033667, 17106716, 17547782, 18338592, 19491776, 20906464, 22512523, 24185445, 25800858, 27158082, 28177168, 28764242, 28950111, 28899663, 28683290, 28284568, 27642000, 26665133, 25260020, 23531870, 21704208, 19968618, 18453659, 17248090, 16250535, 15417002, 14734490, 14218213, 13885366, 13683313, 13616339, 13682583, 13864449, 14159460, 14569425, 15107409, 15770362, 16617268, 17616335, 18740773, 20046790, 21532703, 23235661]
9060B3235661J901960K125433K371595K563076K765307K942774L060981L057993
9052D4024780L020058K807644K465904K048538J484544Q47253J77830m48080j048926
9043E5379545j508137j832378k025316k090378k149644k185260k247324k342393
9035C8998715k467412k508951k466915k400714k279251k104462j922516j731898
9027B1116596j511365j306763j131802r73422p66368o01873m60151l29784k09857
9018A3825211r6340m68N4895P1116N7013k8217j40565l10916m95333o98027q64810
9007A1373559r43554q82775q30385p52152o58300n94150n22389m70660m23364
8998E295830l81746l43017k85846k16985k33803k48119k11763j63732j47404j44609
$$ y = [23235661, 25137621, 27263054, 29634649, 32197725, 34963032, 37905806, 40966787, 44024780, 47044838, 49852482, 52318386, 54366924, 55851468, 56698721, 56876551, 56428471, 55379545, 53871408, 52039030, 50013714, 47923336, 45773692, 43588432, 41341108, 38998715, 36531303, 34022352, 31555437, 29154723, 26875472, 24771010, 22848494, 21116596, 19605231, 18298468, 17166666, 16193244, 15426876, 14825003, 14364852, 14035068, 13825211, 13728871, 13728403, 13783298, 13854414, 13911427, 13883210, 13742645, 13431729, 12936396, 12238369, 11373559, 10430005, 9547230, 8716845, 7964693, 7306393, 6712243, 6189854, 5719194, 5295830, 4914084, 4571067, 4285221, 4068236, 3834433, 3586314, 3374551, 3210819, 3063415, 2918806]
8988B918806j53301j36453j01751r8819o4601r0681j29241r0052o5146j01069
8978A887692n8867n7451n0749o6257o5647l9943k6977m0825j8488o2167o1697
8967A338624l0275k9291n9929n4330m1075k0465n252j3182m1867k4818l7368k9724
8955I51048j5188j4918l1882r575k0038L36R539k3998l9456k2990j7265r695j8080
8942G37838m606m899l5942j5176j2076o934J1032j3570j6177K2231p109m3172
8930F11440l4849K0715K7673l3343J176j5083R599K8140m531q015p877l1497n135
8917E58413J039j4613j0017k2117p75J846q590j6488O452L420j0158l2198l4374
8904D21840j687J3664L263k246l551k3037j1538P824q116p55m833R590j0829j3852
$$ y = [2918806, 2765505, 2629052, 2527301, 2428482, 2363881, 2273200, 2143959, 2053907, 1988761, 1887692, 1828825, 1771374, 1720625, 1654368, 1588721, 1548778, 1521801, 1480976, 1462488, 1400321, 1338624, 1308349, 1279058, 1219129, 1164799, 1123724, 1103259, 1098007, 1084825, 1042958, 1018140, 980772, 951048, 935860, 920942, 889060, 879485, 859447, 859783, 869322, 845324, 805868, 782878, 765613, 755918, 737838, 733232, 728333, 692391, 677215, 665139, 658205, 669237, 655667, 639490, 661721, 654612, 611440, 576591, 597306, 624979, 591636, 592812, 577729, 587328, 615468, 610937, 602922, 595045, 563548, 558413, 559452, 544839, 534822, 512705, 511930, 513776, 505186, 488698, 495150, 498570, 488412, 456214, 421840, 420153, 433817, 437080, 434834, 431283, 408246, 396708, 404532, 396416, 395661, 390828, 400418, 389589, 375737]
8890C75737Q957J7838J0153j4631k1814k3976r854J1444j372m66K6082l096k1339
8877C53663J7540P660R626j2608k6811J3560J4803P735J9846p379q753J2300K8543
8864D29725p433k9123R43J7045L711m153r809N769m546k2662k732J5675r119l0956
8850C52335j4787m614M791P355J5703J5038K0101J7339J3092l421j6313k0157
8838C86462J1400M480j5282j9403j7651q2L906r879k713l524J2323j200j1522
8825C37315r401J022j9067n145R186o841L045J093n815j3117J644j7889Q620j0875
8811B73775k9018j747J1951J0685k3674j9697J6590l107l402J0220j551P358L1050
8798B79433J8716n80m236L0597J9759N3786Q00M442K1090L012l7637k7828n48
$$ y = [375737, 384694, 402532, 412685, 398054, 376240, 352264, 342410, 353854, 352482, 352016, 378098, 375002, 353663, 371203, 378863, 388489, 375881, 349070, 362630, 377433, 385168, 405014, 397635, 388882, 401182, 429725, 422292, 393169, 394112, 411157, 414868, 410715, 400906, 406675, 402129, 379467, 376735, 392410, 383291, 352335, 337548, 332934, 337725, 345080, 360783, 375821, 395922, 413261, 426353, 422932, 406619, 386462, 397862, 402342, 387060, 367657, 350006, 349924, 353830, 343951, 341238, 337714, 350037, 348837, 337315, 327914, 328936, 309869, 304724, 313910, 307069, 310114, 311207, 305392, 292275, 293919, 276030, 284650, 273775, 244757, 243010, 254961, 265646, 241972, 222275, 238865, 235758, 232356, 242576, 241025, 248383, 279433, 298149, 297569, 293333, 323930, 343689, 397475, 398275, 402717, 423807, 426819, 389182, 361354, 360806]
8785C60806M008n209j360j5693o391j4417Q294K1204L3800J8660N567J9034l869
8772D24434O07o492O144L1708n738j7717J5849J3363j9560k3125l1548m2189j0317
8759C35419j2365L104k8095n2566l7801Q585J5430j5676N578K3162K2324Q237
8747B75336j9235O78J8078j0511m7875k5338J9585J6539q537j1233k6575r84L9337
8734B19265r454l738J9275N1559K0601m504q85L333R730J7326j589J623N410R909
8720C37861N922o172K8054L0117L2035q413q59N944j3292r806r151k7358j3456
8707C51426k695m3665k1378P939K0252K009l458K50J938j8675k3166m544K8198
8694B94431L6191K899J566K4946J9321J5066J29R524k796k1576l8460k0418q04
$$ y = [360806, 364814, 359605, 358245, 342552, 336161, 321744, 330038, 351242, 385042, 403702, 409269, 428303, 424434, 425041, 418549, 424693, 456401, 450663, 432946, 448795, 462158, 442598, 419473, 387925, 345736, 335419, 323054, 326158, 298063, 245497, 207696, 216281, 231711, 216035, 221613, 244775, 267099, 275336, 256101, 256779, 274857, 264346, 216471, 191133, 210718, 227257, 218720, 207487, 180912, 179928, 219265, 209811, 206073, 225348, 276907, 297508, 293004, 292119, 295452, 305182, 322508, 320919, 322542, 327952, 337861, 343783, 337611, 365665, 395782, 427817, 419404, 418545, 424489, 411197, 401391, 392240, 364882, 351426, 348731, 305066, 283688, 291627, 311879, 313888, 310430, 310680, 312618, 293943, 270777, 266233, 294431, 330622, 333521, 335087, 360033, 379354, 394420, 394549, 404073, 401277, 379701, 341241, 320823, 320019]
8681C20019K8440j6641m156J4140J2096J9063j558J2503J9483N3588P5911Q4302
8669F17190R4644Q0056J28248O3331K5414j8958j18489j62674j08541o6948k9660
8658E03613m056l6268j0384J675l6651m6752k4977k8414K845j1958k2229L852
8646B90296J6093q374k4504k7679n260P193J3775J1765K0408j44M58Q47K7773
8633C22647J9275k4146k5858r941l2671j2485j567K803O733n721K0006k4104l9532
8620A95439m057R201L5041k153k8122j0233K344J0929Q916K2530K1499J4397O932
8607B82663j3067l0170q044N817O695J67J2147P320O356K4929m398j8590j0401
8594B61424j0812k5848J7936r42L093m507j8112k5059m209J3615l888J3791J0999
$$ y = [320019, 348459, 331818, 327662, 341802, 353898, 372961, 371403, 383906, 403389, 456977, 532888, 617190, 711834, 791890, 920138, 983469, 1008883, 989925, 871436, 708762, 600221, 533273, 503613, 499557, 463289, 452905, 454580, 417929, 371177, 346200, 317786, 320631, 308673, 286444, 290296, 306389, 298015, 273511, 245832, 240572, 247765, 261540, 273305, 293713, 293569, 294027, 294874, 322647, 341922, 317776, 291918, 281977, 249306, 236821, 235254, 238057, 244790, 239069, 259075, 234971, 195439, 191382, 200583, 235624, 233471, 205349, 195116, 197460, 208389, 217305, 239835, 261334, 275731, 282663, 269596, 239426, 231382, 237199, 243894, 244061, 256208, 263528, 269884, 294813, 290415, 271825, 261424, 250612, 224764, 242700, 241758, 244851, 240344, 222232, 197173, 192964, 206579, 202691, 216482, 227481]
8581B27481j1395n3707m6152J7690p485N090R746J5305j6249j9189L4928J9910
8569A75973o998q375k7720q601J5098j7304l5985L315J5321k751R883j8578j2886
8556H0392J9590K1032J3056j1456k6908l8219J8828N510J0118L7122j9863l2548
8544G6654n9K0865P965J5434p856k4963m360k724j762j05J7958L28k2898k5628
8530D8849N392k555j1151R121J1448L3642o139J591J9234N615j8204M733j0192
8517I1384m328K6034j7815l8998R480J6727P458j3850k703N080J8853J3314R984
8504A20620l0022k6226j4577J815o767K4474K4646q202j1223M3990J4193k0834
8492A11887j610l430k8630k3434N697L5168m121j1947K054p376l625n867K7948
$$ y = [227481, 216086, 162379, 116227, 133917, 126432, 131522, 141268, 156573, 140324, 121135, 156063, 175973, 168975, 160600, 132880, 124279, 139377, 122073, 86088, 89403, 104724, 101973, 111856, 93278, 80392, 99982, 121014, 134070, 122614, 95706, 57487, 76315, 81825, 91943, 129065, 109202, 76654, 76595, 97460, 105425, 120859, 113003, 88040, 83680, 80956, 79194, 79089, 97047, 97375, 74477, 48849, 54241, 51686, 40535, 49656, 61104, 94746, 88607, 90198, 109432, 115047, 96843, 101576, 91384, 87056, 113090, 95275, 56277, 65757, 82484, 89942, 76092, 73389, 78469, 97322, 110636, 120620, 90598, 64372, 49795, 51610, 44843, 69317, 93963, 85761, 74538, 118528, 132721, 111887, 110277, 106847, 78217, 54783, 60480, 95648, 91527, 79580, 81634, 74258, 70633, 64766, 92714]
8479I2714K0594j1749p724j4843j2532J5523o34Q524p076j0436j5733k4558j2731
8466A9339l188J7834J2473R21J6303O387l285l647O377R172j8077K460K2994m169
8452H1894R274K0914L726j2240k1748O585J4028K8278K9726r182j8987k283J8518
8439A48503M302k4795L3229O6026M6009j2326q633j0228m8326k1061K0486j1987
8427A81199k9782p727o907j2463O23J8872o68j561J6246K011m661j0558j017L447
8413A47054j4509K5917j1194l3627k2378J1731L516K164K9641q506O118p046j4117
8400A14764J3459p45k561J3804L4298L0616K7128M5657P0625K9971J3728J9264
8388D10008L1743k6518o9865n5163k9826k5277j1428K1920K0671j7772k9500m3162
$$ y = [92714, 113308, 101559, 93835, 78992, 66460, 81983, 81349, 89873, 82797, 72361, 56628, 32070, 19339, 16151, 33985, 46458, 47379, 63682, 70069, 66784, 63137, 69514, 78686, 60609, 63069, 86063, 81894, 91168, 112082, 115808, 103568, 81820, 88405, 102433, 130711, 160437, 151255, 132268, 129985, 148503, 152805, 128010, 161239, 227265, 273274, 260948, 252315, 242087, 193761, 172700, 193186, 181199, 151417, 143690, 136783, 124320, 124943, 143815, 143147, 141586, 157832, 159843, 155182, 144624, 143607, 147054, 132545, 158462, 147268, 113641, 91263, 102994, 106510, 108674, 138315, 129809, 135927, 128881, 114764, 128223, 127478, 124917, 138721, 173019, 203635, 230763, 276420, 347045, 377016, 390744, 410008, 441751, 415233, 345368, 290205, 260379, 235102, 223674, 245594, 266265, 248493, 218993, 175831]
8376A75831l5723l716j4404p721j095L4072m561n1844k4378k511j855J4012L0262
8363A06369j3681J6844P243k8641k5016L3785K5906P456O498K8480L4148M3187
8351B42578L5296L7108N1123N8391J7257L2180Q020k4588n8526n5430m1488k1117
8339B80804k7035j0713p53k1502l0791k8371o370K678n834l4105k7150k5546M41
8326F5753L1120m904j6682J8385J2069J2897L4511o024j0688l7217R822J8708
8314A27750M398K2844L5426M6898M3266K1476L3644K6746j8603P341R057m6537
8302C13706m5847l0765m4918k9457q221j945j2214j1483J1785P875k1357j1423
8290A15736N923j7541j2508K2608M955L773j0244p521J952q979j4125o092j7947
$$ y = [175831, 140108, 136392, 121988, 114267, 113172, 147244, 142683, 90839, 66461, 63950, 62095, 76107, 106369, 92688, 109532, 116775, 88134, 63118, 96903, 122809, 130265, 136763, 165243, 199391, 242578, 277874, 314982, 366105, 424496, 441753, 473933, 481953, 457365, 398839, 343409, 301921, 280804, 253769, 243056, 242303, 220801, 190010, 161639, 155269, 157947, 152113, 118008, 90858, 65312, 65753, 96873, 91969, 75287, 93672, 105741, 118638, 153149, 147125, 136437, 99220, 109042, 127750, 132148, 154992, 190418, 237316, 280582, 302058, 335702, 362448, 343845, 351186, 360243, 313706, 267859, 237094, 192176, 162719, 154498, 152553, 140339, 128856, 140641, 148516, 127159, 115736, 121659, 104118, 91610, 114218, 119173, 122946, 112702, 105181, 107133, 98154, 84029, 77937, 59990]
8277E9990k4509j1792L78k9583k736K587L491K4495K4472P690K6385K0188J9244
8264A20300L5876J9041J754k6809j145M8100N546l324q786l57K1992K18K2851
8251B35257K0288J2112L5255M0211N8162J03545R0516J30555J54330J68258K52913
8240A301402K66840K09327J40278M9474o2484j52076j97968k21311k15817j81946
8230I35719j27539r0510n8159l8717o4977q5500o1084l7051m6982k1211q300l4034
8218B61655k8797j2570J2768L959J6462o879k331J1923o928P236P415L1079N0097
8205C45089M0924P8309R6814J51057J80038K24078K48339K29760J68804O2085
8195A825297m0368j36736j87315j83323k04758j86562j39621q9555m6475l1943
$$ y = [59990, 35481, 23689, 24067, -5516, -8252, -5665, -2174, 22321, 46793, 54483, 80868, 101056, 120300, 156176, 175217, 176971, 150162, 149017, 197117, 202663, 199339, 190553, 190196, 212188, 212406, 235257, 255545, 267657, 302912, 343123, 401285, 504830, 595346, 725901, 880231, 1048489, 1301402, 1568242, 1777569, 1917847, 1967321, 1904837, 1752761, 1554793, 1333482, 1117665, 935719, 808180, 717670, 659511, 620794, 555817, 470317, 409233, 372182, 325200, 303989, 295689, 261655, 232858, 220288, 233056, 237015, 253477, 246598, 244267, 256190, 249262, 256498, 263913, 294992, 345089, 386013, 464322, 561136, 712193, 892231, 1116309, 1364648, 1594408, 1763212, 1825297, 1784929, 1648193, 1460878, 1277555, 1072797, 886235, 746614, 657059, 610584, 578641]
8185E78641p2255m4756p4411n5024n4708l6250j5187k6021k1322k007k3543l0890
8173A22267r885N976J277J6630j4991l6451J628J3982J3096j0366k2773R707K2585
8160A12682k0531p777p168p407J1397L734K1260J6263r73k7239m3407j8675O887
8147C9046P807n921N386j115J2860M1278l1451j0877J8102q583n033K2354R38
8134H4791K0237J4587M721j1895o41J1771M406j7254j3723J2085J8984Q020p059
8121A29030m9M6911N3758N5936K5583O7669M4226Q4476J16036J35263J26391P1174
8109I56404N7692J4048n9581o5238p6179j15592j01234o2522p9835q2887l4717
8098C50359k4961o0878k4625K0611J2364k4594k1417j0101j4960k1250l260K3870
$$ y = [578641, 506386, 461630, 387219, 332195, 277487, 241237, 226050, 200029, 178707, 176700, 153157, 122267, 112382, 118358, 119635, 136265, 121274, 84823, 86451, 100433, 113529, 103163, 80390, 90097, 112682, 92151, 84374, 77206, 69799, 81196, 84930, 106190, 122453, 121480, 94241, 50834, 32159, 39046, 46853, 40932, 46318, 45203, 58063, 99341, 67890, 57013, 75115, 66532, 61499, 83853, 84791, 105028, 119615, 124336, 112441, 111800, 123571, 127977, 110723, 97000, 109085, 128069, 136089, 129030, 128981, 175892, 229650, 285586, 311169, 378838, 423064, 507540, 623576, 758839, 885230, 956404, 1014096, 1028144, 968563, 903325, 827146, 711554, 610320, 547798, 467963, 385076, 350359, 325398, 264520, 239895, 260506, 272870, 248276, 226859, 216758, 201798, 180548, 177288, 201158]
8086B01158L514l426k6242K102K1369j4195k628O857P481J8235K6832J1909K2719
8073B75685J8347J2312K0003O6116J18488J53126J81014J89566K37499K55588
8063A527744K12942J49854K6580q5491j89262k24525k36731j86027j44292r5815
8053G54977p1318j06571o0484m0861n4447n1063k9005m4088k8306r46j0132r407
8041B48349j3859j8848j0522k9960l862m139L739j0056k780l300L1102J645m75
8028A87034L427P669n040K5378J8201L8688N5540P4873R4378J03848J25290Q8383
8016H17669P6857L9881p225n7424p4620p2347q8826p4488o5805o9886l3532r486
8004C80768k7615l602l8811o0404m5592k1731m1207k4606P920j3730m7721q878
$$ y = [201158, 204672, 201246, 175004, 177106, 198475, 184280, 181652, 188509, 195990, 214225, 241057, 252966, 275685, 294032, 306344, 326347, 392463, 510951, 664077, 845091, 1034657, 1272156, 1527744, 1740686, 1890540, 1917120, 1831629, 1642367, 1417842, 1181111, 995084, 850792, 754977, 683659, 577088, 516604, 475743, 421296, 370233, 341228, 297140, 268834, 267888, 257756, 248349, 234490, 215642, 205120, 175160, 171298, 167159, 170898, 160842, 158062, 154762, 185864, 187509, 187034, 190461, 198130, 193090, 218468, 236669, 275357, 330897, 405770, 500148, 603996, 729286, 817669, 894526, 934407, 927182, 869758, 795138, 722791, 633965, 559477, 493672, 423786, 390254, 380768, 353153, 349551, 310740, 250336, 204744, 183013, 141806, 117200, 125120, 111390, 63669, 54791]
7992E4791J6299R3o614J0418J0558J3764j3335j1922J6966K5519J9474o094J1716
7979A41633j6296l2537P336r125p732r461k3062o102Q421K1521j9059j0958m265
7966D0314r262j600K2186n610j9289K6158K406k444j0548j9336R309J1197K75
7953D3756J4125K174j8292j5047J0656j6243K1179J3833j6977k0233K492P703
7941B9126K7045q280n685M590p68k814N071k2878J9349M694l7950k4158n317K9260
7927A1285K6178J0414J844J0239k55j4361k6378j127J4686Q365k467r103l3636
7914d316K883L7136K1738K331m7647l5330k9134K9695K2333J978j0960O911L037
7901F55J8149J1352k0155j4440j3500j7144J9429N2417K921j3063M845j8011j3429
$$ y = [54791, 71090, 71183, 64569, 74987, 85545, 99309, 85974, 74052, 91018, 116537, 136011, 129917, 141633, 125337, 92800, 100136, 91011, 83279, 73818, 50756, 44654, 53075, 74596, 55537, 44579, 40314, 31052, 29452, 51638, 46028, 26739, 52897, 55303, 52859, 42311, 22975, 32284, 43481, 43756, 57881, 60055, 41763, 26716, 37372, 21129, 42308, 56141, 39164, 18931, 21423, 29126, 56171, 47891, 42206, 46796, 46028, 43214, 48285, 25407, 44756, 49450, 11500, -12658, -17975, 11285, 37463, 47877, 49721, 59960, 59705, 45344, 18966, 17839, 32525, 40890, 38423, 29320, -4316, -1433, 35703, 57441, 59772, 12125, -23205, -52339, -22644, -311, 1667, -9293, -2382, 655, 18804, 30156, 10001, -4439, -17939, -35083, -15654, 36763, 39684, 26621, 31466, 13455, 26]
7888B6j2695K0747M4353p283m3600k6657R695L041m771K3622k1063j8953K4104
7875i434N657o115J5628M932M957n886j2773R535j288J356j5775o427J80K924
7861a2529J855k549r853q375q596J812K3921P380J8189P136l3350j5090O459J6004
7847g586K928j730J992j5999l445Q804P511K4857N609k3603k3608J7799N474j744
7833b741M975m885K578J5235K3684r943m1167m336M3321j1645k5453J6337K9252
7820C5212K140j1603q604P574k5852l3226Q650p925j0799L7658n434J2912J6218
7807A6921o047j1991k4617m143j8883K0157J5903K2115K1956L457k801l5598o445
7794a0016L342J4659k75K500r806O591k5468j5667r762K3208o6k6430n442K0675
$$ y = [26, -12669, 8078, 52431, 45148, 1548, -25109, -15414, -12373, -17144, 6478, -14585, -33538, -9434, -3777, -9892, 5736, 10668, 15625, 9739, -3034, 6501, 5213, 6569, -9206, -15633, -15453, -12529, -10674, -13223, -23076, -31451, -40047, -38235, -14314, -6934, 11255, 18391, -14959, -30049, -23590, -7586, -4658, -6388, -4396, -20395, -23840, -15036, -7525, 17332, 22941, -662, -24270, -6471, -997, -2741, 2234, -2651, -73, 15162, 38846, 28903, -12264, -16600, 26721, 15076, -10377, 5960, 35212, 37352, 25749, 17145, 24719, -1133, -34359, -25709, -33634, -44433, -6775, -12209, 703, 16921, 10874, -1117, -25734, -29877, -48760, -28603, -12700, 9415, 31371, 34828, 32027, -3571, -10016, -6674, 7985, 7710, 10210, 404, 6995, -18473, -34140, -43902, -20694, -20760, -47190, -52632, -31957]
7780c1957L6402j6628l7568J4330qP79M8893O536l3949k9315L4220l648j3989
7767b5902J0044Q754r020K7121J398o255j152j4824j4620O069K2126k7974j8015
7754d2250J667K695K9979n782m0339k4372L3405L7382m699J235j185L212r78J5507
7740E477J816q950q21J371J3555k6081l6330N41m118p614j0666J2698J1406N721
7726d1995j160M064L0676N236k2263O846J353J7513L941J2502N342L088K589j8972
7712H760J1525k5720j6108j7345m490K3429L4659R451k1382q168j0985K8985K7785
7699D0396J3083j2816k6598k2035j3738j7935j5218K0260K9661j7754j6536N795
7687c3435j612J1110l8786n066R337J9578n966p242J5662L0706r742K1J2951n846
$$ y = [-31957, 4445, -12183, -49751, -35421, -35429, -34650, 14243, 20779, -13170, -42485, -8265, -11913, -25902, -15858, -7104, -16124, 10997, 12395, 6140, 4988, -9836, -24456, -18387, 3739, -24235, -42250, -40583, -37888, -7909, -13691, -54030, -78402, -44997, -7615, -12314, -11079, -12264, -9052, -10030, 5477, 7293, -1657, -2478, -1107, 12448, -13633, -49963, -49422, -53540, -61154, -71820, -59122, -47716, -41995, -43155, -39091, -8415, -3179, -25442, -18596, -17243, 270, 4211, 16713, 22055, 25143, 27732, 8760, 20285, -5435, -21543, -38888, -43378, -19949, 14710, 24161, 2779, -5389, -16374, 12611, 40396, 53479, 40663, 14065, -7970, -21708, -39643, -54861, -34601, -4940, -22694, -39230, -33435, -35047, -23937, -62723, -67789, -58452, -38874, -44840, -52082, -36420, -5714, -15456, -15435, -2484, -8330]
7673h330R595p01k8092J1904K3530L478l7447j8253K3625L818Q019J5601r067
7660b320j064J604k2338k7713L288K2158K3968K4856j1208m0057k988p032j5208
7647e4054j8251R429K09J369M6313J3937q519m485J5881p223k2245j9995q365
7634e5999m29K7160K6248J4495J7537k864j0017j492l4486J0397j956j9386j7004
7621d7796K800L1906J1170O487L3963j4122n834J5442J2800k3534k8154j0508
7609a5380k8242Q741J5871J9783j759o277l3906j0338J7575L8356K1915j7138
7597I201k2396o739o059j4130n335M721K7361r076j8218j4040n219o816J7064
7584d9681l516Q599J4162R007K391N165m293O927k216n186L109J8032m601r593
$$ y = [-8330, 1265, 564, -27528, -15624, 7906, 11384, -26063, -44316, -20691, -16873, -8854, 6747, -2320, -3384, -1780, -24118, -51831, -48543, -26385, -2417, 22439, 11231, -28826, -31814, -38846, -54054, -72305, -62876, -62667, -61298, -14985, -1048, -9567, -14052, 1829, -5394, -27639, -47634, -55999, -56428, -29268, -3020, 11475, 29012, 26148, 16131, 14639, -19847, -9450, -11406, -30792, -47796, -44996, -13090, -1920, 4567, 38530, 24408, 18574, 34016, 46816, 23282, -4872, -15380, -43622, -34881, -19010, 773, -986, -7263, -41169, -51507, -33932, 4424, 26339, 9201, -13195, -19934, -25993, -40123, -45458, -40737, -13376, -22452, -40670, -54710, -59929, -66745, -49681, -53197, -44598, -30436, -21429, -19038, -13873, -18166, -11239, -13455, -18641, -15532, 2500, -2101, -11694]
7570a1694j9104j7095K0818N256J4715N507P101K699j0272j6571j5038j3460P966
7557c9172J4874J832L711l881k2018M338K1500j9160K3421j657l0893Q317M3028
7544D240j1261k9611j5483J5094O900K853j692L444O305J7797J0485j0434l1948
7531c3311L717L8836R166J9886K991O543m630k2872k8243m7094J979j72M046P956
7517d1202j2587q153J9260k525J4602J62O265K1890M796k0702K2146J2678R806
7504B6436n00k5369k6599J7613n71k1182j1252K0639L982J317l7585J5779M232
7491c3060L49j0753k7478R637L4317K2790L912n577k5631k2585R431P887J5163
7478b1598M4357K3365k0783k7387j9790P240J3964l004k319p012j4407m876j1586
$$ y = [-11694, -30798, -47893, -27075, -21819, -7104, -1597, 5504, 8203, -2069, -18640, -33678, -47138, -39172, -24298, -22466, -18755, -22636, -44654, -40316, -18816, -37976, -14555, -16212, -47105, -38788, 4240, -7021, -36632, -52115, -37021, -30121, -27268, -28960, -25516, -19211, -1414, 9071, -1363, -33311, -29594, 9242, 18408, 38294, 41285, 47828, 43198, 20326, -7917, -55011, -53032, -53204, -49158, -41202, -53789, -61942, -42682, -45207, -30605, -30443, -24178, -2288, 2508, -18194, 3952, 16630, 26436, 25936, 567, -26032, -8419, -8990, -30172, -41424, -20785, -16803, -15486, -53071, -37292, -33060, -32711, -43464, -70942, -61305, -26988, -4198, -286, -5863, -31494, -54079, -44648, -36761, -21598, 22759, 46124, 25341, -2046, -21836, -14596, -632, -3636, -5955, -12967, -27374, -32250, -43836]
7465d3836q737M627J7828q89j2296j2918J4334K0996J6773R78N273r614j1630
7452a9111k3738L541Q370J0219J1812J412J9847J6954N728M300j4907n718J510
7439B0219R259J1986j4115r898k1532j0773p676Q727J0019l36K464l559m966j3838
7425b4019k3381J2131n195J9895J6926K6321m239p320j661P283K5710j0716j6777
7412A4958P742j463J8661N684k1757j9782J9012J8363J7685O141k0560k9395j339
7399A3950j1605k582Q945O25M110m6665j3120L4721N496k1830K878L3674l644
7386D953k6559l2483q103j779L460J6937K0416j8758k2136o555J5241K6028M30
7373b8908r466P700K11J5736J0713p112j5951r039k101j9030K6842J4214n377
$$ y = [-43836, -52573, -47946, -30118, -31007, -43303, -56221, -41887, -20891, -4118, -3140, 2133, -7481, -19111, -42849, -39308, -30938, -20719, -8907, -7495, 12352, 29306, 35034, 39334, 24427, 18709, 20219, 29478, 41464, 27349, 17451, -4081, -14854, -22530, -13803, -3784, -4120, -1656, -5215, -10181, -24019, -47400, -35269, -40464, -20569, -3643, 22678, 18439, 11119, 9458, 16741, 42451, 31735, 14958, 22700, 21237, 39898, 45582, 23825, 4043, 23055, 41418, 59103, 65244, 44684, 15289, 13950, 2345, -237, 8708, 9333, 13443, -33222, -46342, -11621, -6125, -27955, -25077, 8597, 4953, -21606, -54089, -62192, -63971, -60511, -43574, -23158, -41916, -64052, -70607, -55366, -29338, -28908, -38374, -30674, -30463, -14727, -4014, -11126, -27077, -36116, -38217, -57247, -30405, -16191, -21568]
7360b1568j1025J8448K1755J5622L435J3423l0975k7984o298K0377K012j8814
7348b1592k1465m1061N392L8613J8366J3253R689K9129r559O528j1383j761K0857
7335C5006q546l611L813O93K2290n88k4185j7562j3371q986n185j6738K2836J6509
7321B375N449n945N277K3N153m029k0241o925r741j0247o744j097J5138Q38n05
7306c1221K1443J527J439R131j589j8594j0337J6026J7034j0770P078K1887q680
7293A4374j1304J6363k392k1592k0197J1803K0220P814J9194j248k4432k502J7914
7280B4015K6284k9578n6514j3735Q970J784K3913J1040k067n635K7197J540j7977
7267g63k214J6224J0516k9679j3313M304K225M1465j777l1410l0348j9346R164
$$ y = [-21568, -32593, -14145, 7610, 23232, 26667, 40090, 9115, -18869, -25167, -4790, -2778, -21592, -43057, -84118, -78726, -40113, -21747, -8494, 1195, 30324, 20765, 27293, 15910, 14149, 35006, 26460, 22849, 26662, 27355, 49645, 49057, 24872, 7310, -6061, -15047, -20232, -36970, -14134, 2375, 7824, 1879, 7156, 7179, 12332, 8303, -11938, -18863, -28604, -38851, -45595, -46692, -31554, -30716, -31221, -9778, -8251, -6812, 2319, 730, -17864, -28201, -12175, 4859, -5911, 1167, 23054, 14374, 3070, 19433, 17041, -4551, -24748, -12945, 7275, 15089, 34283, 33035, 8603, 6101, 24015, 50299, 20721, -35793, -49528, -40558, -38774, -14861, -3821, -5888, -11523, 15674, 17214, -763, -2977, 13247, 23763, -5916, -19229, -14925, -12700, 28765, 26988, -4422, -34770, -54116, -44952]
7254d4952K4797J5139Q027M279n7409j7808n012R55K1377L7675K7374J9936p652
7241B6726k2860k6911k2540j4501J0179L7989K3756j6272N52R961m309k3893r359
7228c1482P281L1385K3269j2606o2045k3442k176J9124N986J3126J2067L8968
7216A9455j791m6513k3065L3743M5507R508l9526m8504q923J3998K404l754j0309
7203e7770J2547r59k4488q779J5810J7508k946L9827j1648l058R440n417k0254
$$ y = [-44952, -20155, -5016, 3011, 7290, -50119, -67927, -72939, -71984, -50607, -12932, 14442, 34378, 26726, 3866, -23045, -45585, -60086, -49907, -11918, 11838, -4434, -3882, 6079, 1770, -22123, -31482, -24201, 7184, 30453, 17847, -44198, -67640, -69816, -50692, -44706, -31580, -19513, 19455, 17664, -28849, -51914, -18171, 27336, 36844, -2682, -51186, -60109, -46111, -43707, -47461, -57770, -45223, -46182, -70670, -79449, -63639, -46131, -49077, -9250, -20898, -23956, -14516, -19933, -40187]
$$ [...]
##END NTUPLES=NMR SPECTRUM
##END=
