##TITLE=123-86-4 - 
##JCAMPDX= 6.0         $$ Bruker NMR JCAMP-DX V2.0
##DATA TYPE= NMR SPECTRUM
##DATA CLASS= NTUPLES
##ORIGIN= BRUKER
##OWNER= aubrays
$$ TOPSPIN		Version 1.3
$$ 2008-08-13 09:24:30.273 +0200  aubrays@isicrmn500
$$ Compression mode = diff/dup
##.OBSERVE FREQUENCY= 125.769106928127
##.OBSERVE NUCLEUS= ^13C
##.ACQUISITION MODE= SIMULTANEOUS
##.ACQUISITION SCHEME= undefined
##.AVERAGES= 512
##.DIGITISER RES= 17
##SPECTROMETER/DATA SYSTEM= spect
##.PULSE SEQUENCE= zg_pi_gd.pv
##.SOLVENT NAME= CDCl3
##.SHIFT REFERENCE= INTERNAL, CDCl3, 1, 219.3917
##AUDIT TRAIL= $$ (NUMBER, WHEN, WHO, WHERE, WHAT)
$$ ##TITLE= Audit trail, TOPSPIN		Version 1.3
$$ ##JCAMPDX= 5.01
$$ ##ORIGIN= Bruker BioSpin GmbH
$$ ##OWNER= aubrays
$$ $$ /level_1/data/aubrays/nmr/123-86-4/1/pdata/2/auditp.txt
$$ ##AUDIT TRAIL=  $$ (NUMBER, WHEN, WHO, WHERE, VERSION, WHAT)
(   1,<2008-08-13 09:21:11.160 +0200>,<aubrays>,<isicrmn500>,<TOPSPIN 1.3>,
      <created by zg, POWCHK enabled, PULCHK disabled
       configuration hash MD5:
       50 C1 1D F3 BE 4A A9 73 D1 C5 59 56 B9 EE E2 EE
       data hash MD5: 64K
       D2 1A 0E 72 14 9F 46 27 B3 59 2E 09 55 A9 DD FF>)
(   2,<2008-08-13 09:22:08.349 +0200>,<aubrays>,<isicrmn500>,<TOPSPIN 1.3>,
      <Start of raw data processing
       ft FT_mod = 6 PKNL = 1 SI = 32K 
       data hash MD5: 32K
       73 6A EC BB 84 E9 EA D3 42 37 13 CC 0A 83 32 A8>)
(   3,<2008-08-13 09:22:16.421 +0200>,<aubrays>,<isicrmn500>,<TOPSPIN 1.3>,
      <apk 
       data hash MD5: 32K
       79 F7 99 C9 A8 37 DA 87 04 15 D0 7B D4 8A 22 EF>)
$$ ##END=
$$ 
$$ $$ hash MD5
$$ $$ 91 07 DB B7 EF 76 4B F2 BA 1C 9A 2C B5 ED 3A ED
##$RELAX= 
##$RELAX= 
##$RELAX= 
##$RELAX= 
##$RELAX= 
##$RELAX= 
$$ Bruker specific parameters
$$ --------------------------
##$DU= </level_1>
##$EXPNO= 1
##$NAME= <123-86-4>
##$PROCNO= 2
##$TYPE= <nmr>
##$USER= <aubrays>
##$AMP= (0..31)
100 100 100 100 100 100 100 100 100 100 100 100 100 100 100 100 100 100 
100 100 100 100 100 100 100 100 100 100 100 100 100 100 
##$ANAVPT= -1
##$AQSEQ= 0
##$AQ_mod= 1
##$AUNM= <au_zg>
##$AUTOPOS= <>
##$BF1= 125.756532
##$BF2= 500.125
##$BF3= 125.756532
##$BF4= 125.756532
##$BF5= 500.13
##$BF6= 500.13
##$BF7= 500.13
##$BF8= 500.13
##$BYTORDA= 1
##$CFDGTYP= 2
##$CFRGTYP= 5
##$CHEMSTR= <none>
##$CNST= (0..63)
1 1 145 1 1 1 1 1 1 1 1 1 1 1 1 1 1 1 1 1 1 1 1 1 1 1 1 1 1 1 1 1 1 1 
1 1 1 1 1 1 1 1 1 1 1 1 1 1 1 1 1 1 1 1 1 1 1 1 1 1 1 1 1 1 
##$CPDPRG= <waltz16>
##$CPDPRG1= <>
##$CPDPRG2= <waltz16>
##$CPDPRG3= <>
##$CPDPRG4= <mlev>
##$CPDPRG5= <mlev>
##$CPDPRG6= <mlev>
##$CPDPRG7= <mlev>
##$CPDPRG8= <mlev>
##$CPDPRGB= <>
##$CPDPRGT= <>
##$D= (0..63)
0 3 0.00345 0 0 0 0 0 0 0 0 0.03 2e-05 3e-06 0.0005 0 0 0 0 0 0 0 0 0 
0 0 0 0 0 0 0 0 0 0 0 0 0 0 0 0 0 0 0 0 0 0 0 0 0 0 0 0 0 0 0 0 0 0 0 
0 0 0 0 0 
##$DATE= 1218610028
##$DBL= (0..7)
120 120 120 120 120 120 120 120 
##$DBP= (0..7)
150 150 150 150 150 150 150 150 
##$DBP07= 0
##$DBPNAM0= <>
##$DBPNAM1= <>
##$DBPNAM2= <>
##$DBPNAM3= <>
$$ [...]
##$SUBNAM7= <"">
##$SUBNAM8= <"">
##$SUBNAM9= <"">
##$SW= 238.77111608331
##$SWIBOX= (0..15)
0 1 2 3 0 0 6 0 0 0 0 0 0 0 0 0 
##$SW_h= 30030.03003003
##$TD= 65536
##$TD0= 1
##$TE= 298
##$TE2= 300
##$TE3= 300
##$TEG= 300
##$TL= (0..7)
0 120 120 120 120 120 120 120 
##$TP= (0..7)
150 150 150 150 150 150 150 150 
##$TP07= 0
##$TPNAME0= <>
##$TPNAME1= <>
##$TPNAME2= <>
##$TPNAME3= <>
##$TPNAME4= <>
##$TPNAME5= <>
##$TPNAME6= <>
##$TPNAME7= <>
##$TPOAL= (0..7)
0.5 0.5 0.5 0.5 0.5 0.5 0.5 0.5 
##$TPOFFS= (0..7)
0 0 0 0 0 0 0 0 
##$TUNHIN= 0
##$TUNHOUT= 0
##$TUNXOUT= 0
##$USERA1= <user>
##$USERA2= <user>
##$USERA3= <user>
##$USERA4= <user>
##$USERA5= <user>
##$V9= 5
##$VALIST= <valist>
##$VCLIST= <CCCCCCCCCCCCCCC>
##$VD= 0
##$VDLIST= <DDDDDDDDDDDDDDD>
##$VPLIST= <PPPPPPPPPPPPPPP>
##$VTLIST= <TTTTTTTTTTTTTTT>
##$WBST= 1024
##$WBSW= 4
##$XGAIN= (0..3)
0 0 0 0 
##$XL= 0
##$YL= 0
##$YMAX_a= 27627
##$YMIN_a= -31997
##$ZGOPTNS= <>
##$ZL1= 120
##$ZL2= 120
##$ZL3= 120
##$ZL4= 120
##$ABSF1= 0
##$ABSF2= 0
##$ABSG= 0
##$ABSL= 0
##$ALPHA= 0
##$AQORDER= 0
##$ASSFAC= 0
##$ASSFACI= 0
##$ASSFACX= 0
##$ASSWID= 0
##$AUNMP= <proc_1d>
##$AXLEFT= 0
##$AXRIGHT= 0
##$AXTYPE= 0
##$AXUNIT= <>
##$AZFE= 0.1
##$AZFW= 0.5
##$BCFW= 0
##$BC_mod= 0
##$BYTORDP= 0
##$COROFFS= 0
##$CY= 15
##$DATMOD= 1
##$DC= 0
##$DFILT= <>
##$DTYPP= 0
##$F1P= 0
##$F2P= 0
##$FCOR= 0.5
##$FTSIZE= 32768
##$FT_mod= 6
##$GAMMA= 0
##$GB= 0
##$INTBC= 1
##$INTSCL= 1
##$ISEN= 30
##$LB= 0
##$LEV0= 0
##$LPBIN= 0
##$MAXI= 10000
##$MC2= 0
##$MEAN= 0
##$ME_mod= 0
##$MI= 0
##$NCOEF= 0
##$NC_proc= -6
##$NLEV= 6
##$NOISF1= 0
##$NOISF2= 0
##$NSP= 0
##$NTH_PI= 0
##$NZP= 0
##$OFFSET= 219.3917
##$PC= 1.4
##$PHC0= 19.92311
##$PHC1= -284.4206
##$PH_mod= 1
##$PKNL= yes
##$PPARMOD= 0
##$PPDIAG= 0
##$PPIPTYP= 0
##$PPMPNUM= 100
##$PPRESOL= 1
##$PSCAL= 4
##$PSIGN= 0
##$REVERSE= no
##$SF= 125.756532
##$SI= 32768
##$SIGF1= 0
##$SIGF2= 0
##$SINO= 80
##$SIOLD= 32768
##$SREGLST= <13C.CDCl3>
##$SSB= 0
##$STSI= 32768
##$STSR= 0
##$SW_p= 30030.03003003
##$SYMM= 0
##$S_DEV= 0
##$TDeff= 65536
##$TDoff= 0
##$TI= <>
##$TILT= no
##$TM1= 0
##$TM2= 0
##$TOPLEV= 0
##$USERP1= <user>
##$USERP2= <user>
##$USERP3= <user>
##$USERP4= <user>
##$USERP5= <user>
##$WDW= 0
##$XDIM= 32768
##$YMAX_p= 526440140
##$YMIN_p= -9897763
$$ End of Bruker specific parameters
$$ ---------------------------------
##NTUPLES= NMR SPECTRUM
##VAR_NAME=  FREQUENCY,     SPECTRUM/REAL,   SPECTRUM/IMAG
##SYMBOL=    X,             R,               I
##VAR_TYPE=  INDEPENDENT,   DEPENDENT,       DEPENDENT
##VAR_FORM=  AFFN,          ASDF,            ASDF
##VAR_DIM=   32768,         32768,           32768
##UNITS=     HZ,            ARBITRARY UNITS, ARBITRARY UNITS
##FACTOR=    0.916471756035951, 1,           1
##FIRST=     30030.03003003, 203259,         -581168
##LAST=      0,             -842751,         211857
##MIN=       0,             -9897763,        0
##MAX=       30030.03003003, 526440140,      0
$$ Real data points
##PAGE= N=1
##DATA TABLE= (X++(R..R)), XYDATA
$$ [...]
$$ plain form
17504 -241108 -857271 767463 -2894353 -3981341 9878 -2484479 -743433 -990899 -582864
17495 -582864 -2801042 -1384496 -53862 895933 -977215 -1526893 -2964204 -1201308 -894072
17486 -894072 -472952 -388385 -2785817 -1921027 -2311140 -1547651 168295 -2157730 -2602526
17477 -2602526 119231 -1350367 -767504 -3058792 1016496 -1839057 99334 -1544524
17469 -1544524 67292 -1824427 2146249 -2559310 -1465995 -70308 -1990835 -467560
17461 -467560 -2389195 -2104359 -1447214 605772 -2599309 -1958795 1897731 -486852 -332868
17452 -332868 -1133064 -1659650 156953 -1549627 -1998910 -1786711 154414 4301 -954257
17443 -954257 -2325365 -1457265 -854672 364739 -511091 -303652 -3043608 -1251620 1284490
$$ packed form
17504b41108o16163J624734l661816j086988L991219k494357J741046k47466M08035
17495e82864k218178J416546J330634R49795j873148n49678j437311J762896L07236
17486h94072M21120Q4567k397432Q64790l90113P63489J715946k326025m44796
17477b602526K721757j469598N82863k291288M075288k855553J938391j643858
17469a544524J611816j891719L970676m705559J093315J395687j920527J523275
17461d67560j921635K84836O57145K052986l205081O40514L856526k384583J53984
17452c32868q00196n26586J816603j706580m49283K12199J941125j50113r58558
17443i54257j371108Q68100O02593J219411q75830K07439k739956J791988K536110
$$ plain form
17434 1284490 -1344846 -464382 -645120 -1146107 -2128113 -253295 -3258917 -2478241 864562
17425 864562 992541 -2010845 -1878635 -1930620 -1036100 -379983 -2373753 -978443 -197963
17416 -197963 -1603992 158319 -340324 -24016 -3681924 -2644832 -1358855 197750 -1744247
17407 -1744247 -692591 -291054 -528809 -4157492 -1839684 -1444953 -579562 -871426 -673172
17398 -673172 -556983 -2624472 -532749 -2460761 -1632649 -1073876 -119767 -1351925 -1165149
17389 -1165149 -3676314 -578963 -3263907 -1912149 -885376 -2418000 207315 476457
17381 476457 -3053623 -831637 -2354280 -2063555 -2735415 336664 -1688027 -2633420 -1149667
17372 -1149667 358578 -727900 1012166 -894790 -539922 297953 158825 -172035 -470389
$$ packed form
17434A284490k629336Q80464j80738n00987r82006J874818l005622P80676L342803
17425H64562J27979l003386J32210n1985Q94520O56117j993770J395310P80480
17416a97963j406029J762311m98643L16308l657908J037092J285977J556605j941997
17407a744247J051656M01537k37755l628683K317808L94731Q65391k91864J98254
17398f73172J16189k067489K091723j928012Q28112N58773R54109j232158J86776
17389a165149k511165L097351k684944J351758J026773j532624K625315K69142
17381D76457l530080K221986j522643K90725o71860L072079k024691r45393J483753
17372a149667J508245j086478J740066j906956L54868Q37875j39128l30860k98354
$$ plain form
17363 -470389 -1367742 -687369 1041588 -1404493 -748587 -164508 -2451859 -523311 -651174
17354 -651174 -1425850 -1153815 -3444669 -2301200 -569089 -34697 235027 -551864 -370379
17345 -370379 -1019419 -350680 201767 -2592797 -300121 -605265 -1295006 -805785 999776
17336 999776 -202830 -2258674 -380946 -2662887 -137295 -1740462 -3045287 1712610
17328 1712610 -2383450 -2868102 -2123708 953237 -1142000 -1661451 1483895 -2371410 -204097
17319 -204097 -576936 537158 -24737 -948394 103349 2071986 2177780 -1379236 -3363174
17310 -3363174 -415662 -496399 -1171048 578837 -121392 -2441840 1718549 -1411813 -1790750
17301 -1790750 818129 204979 770704 -2897924 1307014 -295272 -1154638 -1170778 -1967271
$$ packed form
17363d70389q97353O80373J728957k446081O55906N84079k287351J928548j27863
17354f51174p74676K72035k290854J143469J732111N34392K69724p86891J81485
17345c70379o49040O68739N52447k794564K292676l05144o89741M89221J805561
17336I99776j202606k055844J877728k281941K525592j603167j304825M757897
17328A712610m096060m84652P44394L076945k095237n19451L145346l855305K167313
17319b04097l72839J114094n61895r23657J051743J968637J05794l557016j983938
17310c363174K947512q0737o74649J749885p00229k320448M160389l130362l78937
17301a790750K608879o13150N65725l668628M204938j602286q59366j6140p96493
$$ plain form
17292 -1967271 -3588859 -834662 -2114980 1204256 1550802 1990643 -205222 -1791703
17284 -1791703 -1204002 -2634289 -1700111 -865471 -532784 -1623230 -1618051 -1718560 -2032135
17275 -2032135 455871 -2226077 -2428935 -662390 -167318 -2564337 -1817197 -461654 -1229637
17266 -1229637 -4384576 -1001870 -1839148 -2600574 -2041641 926631 -2375097 -2608799 -1875166
17257 -1875166 -2220822 -3281174 -818423 -675361 -689307 -670204 -2657265 -454203 -705800
17248 -705800 -2000901 -1075031 -2284336 -4221181 -1855962 412835 -173799 -991621 -1599993
17239 -1599993 -424525 -1106914 -2461584 -1218636 -1266276 -943746 639490 -1680708 -720742
17230 -720742 -676344 -1466026 -2054532 916892 -1141025 10835 -583257 -532984 796287
$$ packed form
17292a967271j621588K754197j280318L319236L46546M39841k195865j586481
17284a791703N87701j430287R34178Q34640L32687j090446N179j00509l13575
17275b032135K488006k681948k02858J766545M95072k397019P47140J355543p67983
17266a229637l154939L382706q37278p61426N58933K968272l301728k33702P33633
17257a875166l45656j060352K462751J43062j3946J9103j987061K203062k51597
17248g05800j295101R25870j209305j936845K365219K268797n86634q17822o08372
17239a599993J175468o82389j354670J242948m7640L22530J583236k320198R59966
17230g20742M4398p89682n88506K971424k057917J151860n94092N0273J329271
$$ plain form
17221 796287 -300329 1067126 -3557099 -41723 -1194455 -3315300 -3735675 -41738
17213 -41738 -1064154 391924 -865755 -1224158 -1462393 -2086871 -2140646 -1971828 -477013
17204 -477013 -1444512 2173547 720275 855589 -2127574 -1693964 -599494 -3714792 -1311492
17195 -1311492 -2496884 297365 86729 -1613128 -1040077 -1867458 -2107128 -619660 -1735165
17186 -1735165 -1071588 -3045970 -131655 -1344959 -1828172 -2541562 -1118884 -180855 -1618851
17177 -1618851 -879599 -2210082 -2048074 2584267 1480447 1654740 -1825905 -2349155 -3422660
17168 -3422660 -538828 979482 453047 -230108 -2499051 -100625 -2196245 -1004354
17160 -1004354 -456621 -2116164 -2450640 -2728398 -415578 -102929 -903616 -855512 -72334
$$ packed form
17221G96287j096616J367455m624225L515376j152732k120845m20375L693937
17213d1738j022416J456078j257679l58403k38235o24478n3775J68818J494815
17204d77013r67499L618059j453272J35314k983163M33610J094470l115298K403300
17195a311492j185392K794249k10636j699857N73051q27381k39670J487468j115505
17186a735165O63577j974382K914315j213304m83213p13390J422678R38029j437996
17177a618851P39252j330483J62008M632341j103820J74293l480645n23250j073505
17168c422660K883832J518310n26435o83155k268943K398426k095620J191891
17160a004354N47733j659543l34476k77758K312820L12649q00687M8104P83178
$$ plain form
17151 -72334 -1726054 1464722 -1993702 -2782530 -1747086 453304 -1138041 -1566019 -1821231
17142 -1821231 572042 -3863072 -2280296 -368483 -452449 -1534226 -1677011 -1605424 -2387478
17133 -2387478 251005 -2026200 -1007425 -1668363 -1346901 -1610626 -1397083 -3326202 -524028
17124 -524028 1310719 -627152 -560671 -943084 -1630503 -2370345 411970 -2497511 -2355786
17115 -2355786 -416217 -1213529 -456836 -993534 901032 -2037152 -1337249 -825719 -3557994
17106 -3557994 -1081502 -1371339 -1271698 -25752 -720996 -1665297 -1948806 -745023 -876067
17097 -876067 -1074673 606439 -4040338 -669195 1259574 -2061792 -2297016 -2250490 -2612829
17088 -2612829 452353 -2817721 -465568 -207375 -2017251 -56661 -1412880 -2492343
$$ packed form
17151g2334j653720L190776l458424p88828J035444K200390j591345m27978k55212
17142a821231K393273m435114J582776J911813q3966j081777j42785P1587p82054
17133b387478K638483k277205J018775o60938L21462k63725K13543j929119K802174
17124e24028J834747j937871O6481l82413o87419p39842K782315k909481J41725
17115b355786J939569p97312P56693n36698J894566k938184O99903N11530k732275
17106c557994K476492k89837R9641J245946o95244r44301k83509J203783j31044
17097h76067j98606J681112m646777L371143J928769l321366k35224M6526l62339
17088b612829L065182l270074K352153K58193j809876J960590j356219j079463
$$ plain form
17080 -2492343 -899756 -1029345 -1042958 954569 -2073816 32732 -1146932 -2169521 -738484
17071 -738484 -548613 -92589 -1533785 -221902 -1736267 -553600 -2614718 -2189926 2799651
17062 2799651 -1837605 -1627012 -1321871 -972442 -2669674 -85842 -2409963 -4172028 1623463
17053 1623463 -1615167 -1370535 -1698095 -1967439 -2727773 -1806728 -1641045 -4094803 -516993
17044 -516993 -1066324 -917616 311500 795502 61972 -1276285 441140 -2124154 -1783985
17035 -1783985 -81376 -1539056 -4833393 802657 -344527 -1423262 -2298254 -956046
17027 -956046 319331 -277327 -1259558 286613 -1782049 -1613836 -2543321 134341 -2885954
17018 -2885954 -126339 3144375 -666356 -1683470 -613742 -1488879 -1752783 -575675
$$ packed form
17080b492343J592587j29589j3613J997527l028385K106548j179664j022589J431037
17071g38484J89871M56024j441196J311883j514365J182667k061118M24792M989577
17062B799651m637256K10593L05141L49429j697232K583832k324121j762065N795491
17053A623463l238630K44632l27560k69344p60334R21045J65683k453758L577810
17044e16993n49331J48708J229116M84002p33530j338257J717425k565294L40169
17035a783985J702609j457680l294337N636050j147184j078735q74992J342208
17027i56046J275377n96658r82231J546171k068662J68213r29485K677662l020295
17018b885954K759615L270714l810731j017114J069728q75137k63904J177108
$$ plain form
17010 -575675 -1839147 -1713929 -1737774 -3495589 -1645752 -1359791 -1972478 -914140 -1464123
17001 -1464123 -925719 -1149987 -1367199 130566 -1549420 575972 -1972073 -422365 -2495290
16992 -2495290 -2102612 -3689514 -3805173 -929802 -1193533 -138864 -2337581 -2414281 2099853
16983 2099853 -633705 -1821204 -2240305 -1489277 -1800135 -443111 -281499 -2769196 -2865226
16974 -2865226 883781 -2374873 -643486 -2005749 -2069606 -783893 887022 847572 -1076977
16965 -1076977 -1980387 -1662674 -1234143 -1517939 -566532 -2617303 -363375 -832806 -2143468
16956 -2143468 -2242403 -279686 -261647 -1152314 -1236799 -1291773 -460113 -2393976 254752 -1196831
16946 -1196831 -156965 -1065149 -2058860 -2407654 -2912111 -723488 -1079062 -1127705 -1520983
$$ packed form
17010e75675j263472J25218k3845j757815J849837K85961o12687J058338n49983
17001a464123N38404k24268k17212J497765j679986K125392k548045J549708k072925
16992b495290L92678j586902j15659K875371k63731J054669k198717p6700M514134
16983B099853k733558j187499m19101P51028l10858J357024J61612k487697r6030
16974b865226L749007l258654J731387j362263o3857J285713J670915l9450j924549
16965a076977r03410L17713M28531k83796R51407k050771K253928m69431j310662
16956b143468r8935J962717J8039q90667q4485n4974Q31660j933863K648728j451583
16946a196831J039866r08184r93711l48794n04457K188623l55574m8643l93278
$$ plain form
16937 -1520983 1198916 -2059854 -2145373 -2002162 579161 -900257 -199792 -892317 -166638
16928 -166638 -1353254 -670199 -1061746 -1296773 -2863868 564944 -1615618 -1721017 -1360710
16919 -1360710 -2697131 -2129735 -1679873 -622026 -2282548 -1388997 -1110290 -3415536 -295426
16910 -295426 -2044308 -1588056 -130913 -2259751 944249 -1055457 -2460123 -1906617 -1734120
16901 -1734120 -1335521 163436 -2759942 196082 -2039162 1486670 -1349712 -1400087 -523250
16892 -523250 -757953 -560807 -2855682 -1430920 -1948132 242173 -3723643 -1977441 -1972858
16883 -1972858 -877101 -2725692 26976 -1553883 -1543401 -1368927 -1210729 1899428 -2284808
16874 -2284808 -1976334 -2149696 -1883651 -687325 -1506190 -1236347 -1278391 -150673 -2051966
$$ packed form
16937a520983K719899l258770q5519J43211K581323j479418P00465o92525P25679
16928a66638j186616O83055l91547k35027j567095L428812k180562j05399L60307
16919a360710j336421N67396M49862J057847j660522Q93551K78707k305246L120110
16910b95426j748882M56252J457143k128838L204000j999706j404666N53506J72497
16901a734120L98599J498957k923378K956024k235244L525832k836382n0375Q76837
16892e23250k34703J97146k294875J424762n17212K190305l965816J746202M583
16883a972858J095757j848591K752668j580859J0482J74474J58198L110157m184236
16874b284808L08474j73362K66045J196326q18865K69843m2044J127718j901293
$$ plain form
16865 -2051966 -527017 -2473126 -761271 -2795567 -520955 -541617 -1293466 -1598702 -2453940
16856 -2453940 -2060712 -482066 928308 -2689078 1608839 -1187835 -4305432 -3651312
16848 -3651312 -1020093 -1858333 -1030601 -2805565 -195919 727337 -169248 568813 -1478585
16839 -1478585 -371470 -2273203 -3840263 -744318 -1276958 -568431 -3372120 -2284535
16831 -2284535 771163 -2532713 -713641 -2354435 -1747725 -1365 -983025 -475119 -1063816
16822 -1063816 -1049240 -1036316 -1360976 -3069759 -174802 -2070854 -606977 -2748704 -1094613
16813 -1094613 -1877243 1308751 -1509695 -1427639 -1897620 -1770146 -1824935 -1246230 -1654982
16804 -1654982 -2133021 -108952 -147173 -748166 -1104324 331868 -2056178 -1101906 -1252157
$$ packed form
16865b051966J524949j946109J711855k034296K274612k0662p51849l05236q55238
16856b453940L93228J578646J410374l617386M297917k796674l117597O54120
16848c651312K631219q38240Q27732j774964K609646R23256q96585P38061k047398
16839a478585J107115j901733j567060L095945n32640P08527k803689J087585
16831b284535L055698l303876J819072j640794O06710J746360r81660N07906n88697
16822a063816J4576J2924l24660j708783K894957j896052J463877k141727J654091
16813a094613p82630L185994k818446Q2056m69981J27474n4789N78705m08752
16804a654982m78039K024069l8221o00993l56158J436192k388046R54272j50251
$$ plain form
16795 -1252157 -2919282 -1247411 -198917 -1610672 -1888862 -593757 -1559057 -621932 -1752067
16786 -1752067 -1068130 -1539003 -1568691 -4821869 -3585407 -3500753 -1014328 -303982 -296706 -1903439
16776 -1903439 52423 -1618757 -525407 -436276 -360128 -316683 597123 -1266724 -1218863
16767 -1218863 -558002 -1600621 -1812903 -1659169 -1409432 665822 1309590 -913794 -1895707
16758 -1895707 -1300983 -2962662 598769 -949837 1030046 215768 291353 -2773653 32007
16749 32007 -677015 -2409536 -1449813 -376737 -2561091 -1073726 341953 -2961279 -2261632
16740 -2261632 -108666 -1731361 -2468396 -2362376 -3511314 -1020514 -1921587 -539957 -1924847
16731 -1924847 -902811 -1893005 -381801 1396856 -1155564 -1665586 -648926 -565588 -370851
$$ packed form
16795a252157j667125J671871J048494j411755k78190J295105r65300R37125j130135
16786a752067O83937m70873k9688l253178J236462Q4654K486425P10346P276j606733
16776a903439J955862j671180J093350Q9131P6148M3445R13806j863847M7861
16767a218863O60861j042619k12282J53734K49737K075254O43768k223384r81913
16758a895707N94724j661679L561431j548606J979883q14278P5585l065006K805660
16749C2007p09022j732521R59723J073076k184354J487365J415679l303232O99647
16740b261632K152966j622695p37035J06020j148938K490800r01073J381630j384890
16731a924847J022036r90194J511204J778657k552420n10022J016660Q3338J94737
$$ plain form
16722 -370851 -1809364 -845259 -566477 -3032 -1452885 -536139 2010595 1289470 -2237334
16713 -2237334 -927899 947697 47925 -2602029 -611367 28500 -151811 1120033 504228
16704 504228 -614973 287989 -2032018 -155525 -2648227 -2189494 -2149678 -2142822 -1493154
16695 -1493154 160801 -2977937 -2613622 -331648 -1779577 -1534441 -739486 -977837 -2579431
16686 -2579431 -1477788 73193 -752064 -589869 -1553770 -475936 -985840 -1793609 -1675180
16677 -1675180 -2769955 -594014 -1012856 -2993155 -904348 -1654607 -2216157 -2823940 -1291352
16668 -1291352 -286717 -2267277 67839 -754472 894406 -2800966 559702 -1216674
16660 -1216674 -1344457 -2094878 911043 2260672 -2924178 -2928488 -1942477 -1133850 71982
$$ packed form
16722c70851j438513R64105K78782N63445j449853R16746K546734p21125l526804
16713b237334J309435J875596q99772k649954J990662O39867j80311J271844o15805
16704E04228j119201R02962k320007J876493k492702M58733L9816O856O49668
16695a493154J653955l138738L64315K281974j447929K45136P94955k38351j601594
16686b579431J101643J550981q25257J62195r63901J077834n09904q07769J18429
16677a675180j094775K175941m18842j980299K088807p50259n61550o07783J532588
16668a291352J004635j980560K335116q22311J648878l695372L360668j776376
16660a216674j27783p50421L005921J349629n184850m310R86011Q08627J205832
$$ plain form
16651 71982 828634 -467851 -1043419 -960631 -1531250 -1128441 -1297931 -1397588 530554 -2649353
16641 -2649353 -2344402 -569685 -4267285 599370 -2441293 -2436430 -454830 -846640 -1444482
16632 -1444482 -2783323 -549106 -1971653 -2471457 -2673099 -2204004 -2454268 243493 -2016867
16623 -2016867 -2454720 -1312786 354597 -2111098 -434522 1182601 -686802 -568351
16615 -568351 -493802 -3696271 -713354 -1004782 -3062273 1096038 778113 -2183181 -1883330
16606 -1883330 -960072 -2567438 663676 -1205486 -207434 -1920955 -3064759 -2755418 -820789
16597 -820789 665683 -187326 -1308749 -860905 -3070447 -668643 -2453068 -2253793 -1971841
16588 -1971841 -1433122 -3687330 -1077820 -1780068 -1824642 -1585836 225517 -1183249 -3890647
$$ packed form
16651G1982P56652j296485n75568Q2788n70619M02809j69490r9657J928142l179907
16641b649353L04951J774717l697600M866655l040663M863J981600l91810n97842
16632a444482j338841K234217j422547m99804k01642M69095k50264K697761k260360
16623b016867m37853J141934J667383k465695J676576J617123j869403J18451
16615e68351P4549l202469K982917k91428k057491M158311l17925k961294K99851
16606a883330R23258j607366L231114j869162R98052j713521j143804L09341J934629
16597h20789J486472q53009j121423M47844k209542K401804j784425J99275K81952
16588a971841N38719k254208K609510p02248m4574K38806J811353j408766k707398
$$ plain form
16579 -3890647 -865618 -161199 -808128 -2926812 -1531387 -2446503 -2736379 -575327 -502253
16570 -502253 942366 -1016294 -1781349 -1676627 595169 -2160332 -2187256 -3152527 -717081
16561 -717081 -455725 -2014545 -1233596 -1926096 731459 -1506152 -3539726 -1186731 -3383149
16552 -3383149 -220454 -2480598 -309993 -2433298 -9897763 2133070 947701 -2884573
16544 -2884573 310685 -2211772 -2776329 448233 -2318191 -1328021 -1630439 -2700055 -3001824
16535 -3001824 -635067 -1909616 -473063 -976326 -2235837 -2994140 -1303541 -33481
16527 -33481 -1346378 -212066 -3673674 -1732835 -3919026 -1238016 -4123529 -2299714
16519 -2299714 -1100415 -2479626 -1703688 -569714 -1474773 -1280618 -737730 -2145028 -575940
$$ packed form
16579c890647L025029P04419o46929k118684J395425r15116k89876K161052P3074
16570e02253J444619j958660p65055J04722K271796k755501k6924r65271K435446
16561g17081K61356j558820P80949o92500K657555k237611k033574K352995k196418
16552c383149L162695k260144K170605k123305p464465J2030833j185369l832274
16544b884573L195258k522457n64557L224562k766424R90170l02418j069616l01769
16535c001824K366757j274549J436553n03263j259511p58303J690599J270060
16527c3481j312897J134312l461608J940839k186191K681010k885513J823815
16519b299714J199299j379211P75938J133974r05059J94155N42888j407298J569088
$$ plain form
16510 -575940 910871 -3141293 -1673779 -844030 -2167343 -1230498 1288741 -2829828 -2674855
16501 -2674855 -1286000 -2061203 -1956423 -2312064 -3650520 -614664 1256744 613064 -544129
16492 -544129 -2593185 -1744041 -2955571 -4105939 -2414670 2006304 -1869875 23421
16484 23421 523624 -3226075 756762 645507 -3434039 855021 -5039216 801595 -2737316
16475 -2737316 -1024007 -586378 -408710 -3353169 -1446968 -3158000 -1206441 -1116309 973701
16466 973701 -583469 685228 -282339 927321 -2845531 -3100536 -2310549 -13143 -689467
16457 -689467 -937499 -1000016 -3403994 -371230 -2089947 -2336732 713138 -1765299 -3889846
16448 -3889846 -2267203 -2747217 -1708040 -746230 -1215188 -1948309 609170 2382935 -1565299
$$ packed form
16510e75940J486811m052164J467514Q29749j323313R36845K519239m118569J54973
16501b674855J388855p75203J04780l55641j338456L035856J871408o43680j157193
16492e44129k049056Q49144j211530j150368J691269M420974l876179J893296
16484B3421N00203l749699L982837j11255m079546M289060n894237N840811l538911
16475b737316J713309M37629J77668k944459J906201j711032J951559R0132K090010
16466I73701j557170J268697r67567J209660l772852k55005P89987K297406o76324
16457f89467k48032o2517k403978L032764j718717k46785L049870k478437k124547
16448c889846J622643m80014J039177R61810m68958p33121K557479J773765l948234
$$ plain form
16439 -1565299 1975828 -71495 927215 -1129247 -1729454 567156 -3036746 -1483700
16431 -1483700 905926 -1461580 -2303117 -2569222 -2492619 1551975 860792 -2561615 -349359
16422 -349359 -1168568 2242969 -2805108 -2711600 1893513 -415544 -991978 -871030 -1895468
16413 -1895468 -519796 -2344583 -2166445 -3870410 3462 -988404 -4517943 -1965493
16405 -1965493 -1084441 -1605959 1688712 -4831257 -3262872 -3051055 -1128806 -3856448 -4825797
16396 -4825797 -2613386 -2004003 -1191326 -1683890 -1727745 217634 1262 -3366531 -2583726
16387 -2583726 -448490 -3672721 -1419083 10869749 1448401 6592167 -2172570 1249225
16379 1249225 -74244 -2469323 -1642 -1072456 1640780 -1614841 -1686159 -1876633 -1137623
$$ packed form
16439a565299L541127k047323R98710k056462o00207K296610l603902J553046
16431a483700K389626k367506q41537k66105P6603M044594o91183l422407K212256
16422c49359q19209L411537n048077R3508M605113k309057n76434J20948j024438
16413a895468J375672j824787J78138j703965L873872r91866l529539K552450
16405a965493Q81052n21518L294671o519969J568385K11817J922249k727642r69349
16396d825797K212411O09383Q12677m92564m3855J945379k16372l367793P82805
16387b583726K135236l224231K253638J2288832r421348N143766q764737L421795
16379A249225j323469k395079K467681j070814K713236l255621p1318j90474P39010
$$ plain form
16370 -1137623 -3036979 -20454 -1537895 -1867793 -1851673 -1379909 -624107 -2482881 -1052611
16361 -1052611 -1856433 -2370840 -3547031 -665725 -941548 1470680 -205941 -1241309 -1904095
16352 -1904095 -1930860 127595 -4588796 875352 -2917041 2118870 -941960 -429307 -1156829
16343 -1156829 -2615828 -1448846 109061 828660 -2066254 -1022935 -2583427 -1555247
16335 -1555247 -3128531 -515925 -2109221 -1416232 -1047640 -976400 -2718276 -453906 -286425
16326 -286425 -1977212 -2905983 -452317 -106070 -1564963 -737177 -1517164 -54858 -2286824
16317 -2286824 -1577999 -1686670 -3032706 -3257493 140638 -423253 -1519152 -1526927 -852987
16308 -852987 -1809902 161636 195027 -519032 -3481914 -1590104 941893 -471172 -1442883
$$ packed form
16370a137623j899356L016525j517441l29898J6120M71764P55802j858774J430270
16361a052611q03822n14407j176191K881306k75823K412228j676621j035368o62786
16352a904095k6765K058455m716391N464148l792393N035911l060830N12653p27522
16343a156829j458999J166982J557907P19599k894914J043319j560492J028180
16335a555247j573284K612606j593296O92989L68592P1240j741876K264370J67481
16326b86425j690787r28771K453666L46247j458893Q27786p79987J462306k231966
16317b286824P08825j08671j346036k24787L398131n63891j095899p775O73940
16308h52987r56915J971538L3391p14059k962882J891810K531997j413065r71711
$$ plain form
16299 -1442883 188573 -1751361 371393 -1232853 -440908 -1057576 -1943311 -478105 -3162729
16290 -3162729 -2298269 -1452815 -652637 -2690422 -276293 -1711184 -1553443 -1756620 -1684574
16281 -1684574 -3232761 -4040608 -1392466 -1540405 -1658081 -3896334 -1311186 -1503028 -919589
16272 -919589 -1195506 -2253846 464212 -779136 -719416 -2146086 -2556307 -818496 -1833722
16263 -1833722 -2976216 -2700075 -351953 1483873 -1784133 -1741130 560398 -196000 -145038
16254 -145038 -1834192 -1180862 -1416894 -669884 -1226816 -1374820 -523979 -1713123 -387934
16245 -387934 -231117 -3733118 -366022 221677 -2282788 -1892717 -343414 -1348921 -490815
16236 -490815 -121741 -128438 -2158844 -536695 -174636 589759 -1835908 -2167680 -2753333
$$ packed form
16299a442883J631456j939934K122754j604246P91945o16668q85735J465206k684624
16290c162729Q64460Q45454Q00178k037785K414129j434891J57741k03177P2046
16281a684574j548187q07847K648142j47939j17676k238253K585148j91842N83439
16272i19589k75917j058340K718058j243348N9720j426670m10221J737811j015226
16263a833722j142494K76141K348122J835826l268006M3003K301528p56398N0962
16254a45038j689154O53330k36032P47010n56932j48004Q50841j189144J325189
16245c87934J56817l502001L367096N87699k504465L90071J549303j005507Q58106
16236d90815L69074o697k030406J622149L62059P64395k425667l31772n85653
$$ plain form
16227 -2753333 -444592 -2422551 -2635907 -4599114 -1869470 -1007200 -5159658 -3346824
16219 -3346824 -156583 -444786 -967654 -2032625 1337801 1398077 -3053830 -428906 18001
16210 18001 -2088022 -2574409 -1832942 -2100307 -703642 -4391113 -2660897 -31109 -2289165
16201 -2289165 -2850142 -1241818 -1874632 -604806 -2052152 -2523409 427211 -939172 -386426
16192 -386426 -1613613 -512766 -994614 -1900987 -3624536 1266042 448935 -2696468 -1346883
16183 -1346883 -1147705 -674806 -3604105 -2150308 -640506 -1528244 -1247364 -2497352 -2472938
16174 -2472938 -866687 -861283 -396679 -3900359 -1336902 -1439707 -1033410 -14060 -524633
16165 -524633 -1984205 -959721 -933853 2711908 909412 -2125969 -861337 -2561904 -2737629
$$ packed form
16227b753333K308741j977959k13356j963207K729644Q62270m152458J812834
16219c346824L190241k88203n22868j064971L370426O0276m451907K624924M46907
16210A8001k106023m86387P41467k67365J396665l687471J730216K629788k258056
16201b289165n60977J608324o32814J269826j447346m71257K950620j366383N52746
16192c86426j227187J100847m81848r06373j723549M890578q17107l145403J349585
16183a346883J99178M72899k929299J453797J509802q87738K80880j249988K4414
16174b472938J606251N404M64604l503680K563457j02805M06297J019350n10573
16165e24633j459572J024484K5868L645761j802496l035381J264632j700567j75725
$$ plain form
16156 -2737629 -2189756 -819455 -251283 -1037044 -1149192 -2553248 -1364434 -176732 -744564
16147 -744564 -2499867 -2524469 -2219345 -717907 -3365917 -2963522 -5147610 -1248309 -2975371
16138 -2975371 222970 -3039619 -2277829 -474224 -2805465 -1731703 285116 -431853
16130 -431853 192398 -2755570 -2483065 -1564553 -2510041 -1183035 556407 -2356751 -1420198
16121 -1420198 354511 -1456397 -3043394 -2493379 57096 -2237784 1584062 -2113639
16113 -2113639 -1491486 1377111 -2912203 -514847 -157587 -107883 169308 -3907287 -2598298
16104 -2598298 -1534991 172637 -2816526 -337837 -1149595 459683 -3087183 -2649047
16096 -2649047 -2452206 -184868 -602485 -1124320 -1271399 -1377915 -1064004 -710183 22867
$$ packed form
16156b737629N47873J370301N68172p85761j12148j404056J188814J187702n67832
16147g44564j755303k4602L05124J501438k648010M02395k184088L899301j727062
16138b975371L198341l262589P61790J803605k331241J073762K016819p16969
16130d31853O24251k947968K72505R18512r45488J327006J739442k913158R36553
16121a420198J774709j810908j586997N50015K550475k294880L821846l697701
16113b113639O22153K868597m289314K397356L57260M9704K77191m076595J308989
16104b598298J063307J707628k989163K478689q11758J609278l546866M38136
16096b649047J96841K267338m17617n21835j47079j06516L13911L53821P33050
$$ plain form
16087 22867 -347549 -918068 -1416129 -1417002 868982 -537596 863680 -217817 -24716 -611260
16077 -611260 -1178356 437831 1552516 -3756584 -965739 -970550 -690810 -394046 -442597
16068 -442597 -2120087 -2056407 121524 -1996757 -1297140 -1735090 -3321715 -2696988 238109
16059 238109 -1779675 -2367633 -2209499 -423910 -665752 456481 -3588664 -1117426 -2822219
16050 -2822219 -1075776 -888152 -1513586 -333715 -1141644 -912428 -1929362 -940125 -353352
16041 -353352 356684 -3962264 -1733112 -2230350 -1900939 679703 -394457 -175656 801806
16032 801806 -3124297 -4639 -3032139 -2171204 303465 -2411093 -1557441 176921 -2265097
16023 -2265097 -1533589 -844632 -2206952 -2501330 -2310635 -3576898 -47740 -2091688 1062876
$$ packed form
16087B2867l70416n70519m98061q73K285984j406578J401276j081497J93101n86544
16077f11260n67096J616187J114685n309100K790845m811K79740K96764m8551
16068d42597j677490O3680K177931k118281O99617m37950j586625O24727K935097
16059B38109k017784n87958J58134J785589k41842J122233m045145K471238j704793
16050b822219J746443J87624o25434J179871q07929K29216j016934R89237N86773
16041c53352P10036m318948K229152m97238L29411K580642j074160K18801R77462
16032H01806l926103L119658l027500Q60935K474669k714558Q53652J734362k442018
16023b265097P31508O88957j362320k94378J90695j266263L529158k043948L154564
$$ plain form
16014 1062876 -2120558 -1362466 -1520377 -950540 -208822 -3023677 -2483596 -3147746 -2641675
16005 -2641675 -1395295 -3080560 138520 -116141 -2129116 -2273678 -1107840 -3913438
15997 -3913438 -2025573 -997562 -1253676 -1636002 1062197 -787102 -2565591 -1967094 -2000467
15988 -2000467 -1949225 -2416072 -2038303 -6961 -1097426 294895 1229133 900440 -216124
15979 -216124 -1409160 852906 -2888088 -1824449 -3061193 -2427046 -1868036 263261 -2314855
15970 -2314855 -665711 -2529240 -919195 -1012430 -1857237 -1252763 -667867 -1959779 -3120615
15961 -3120615 -2441506 -3139503 -1339836 -508519 -1546670 -2586586 -884069 -3670974 -5001696
15952 -5001696 -540601 -818405 -1269648 -2136635 -1641503 -3504778 -1500143 -589304 -4285814
$$ packed form
16014A062876l183434P58092j57911N69837P41718k814855N40081o64150N06071
16005b641675J246380j685265L219080k54661k012975j44562J165838k805598
15997c913438J887865J028011k56114l82326K698199j849299j778489N98497l3373
15988b000467N1242m66847L77769K031342j090465J392321R34238l28693j116564
15979b16124j193036K262066l740994J063639j236744O34147N59010K131297k578116
15970b314855J649144j863529J610045r3235q44807O04474N84896j291912j160836
15961c120615O79109o97997J799667Q31317j038151j039916J702517k786905j330722
15952e001696M461095k77804m51243q66987M95132j863275K004635R10839l696510
$$ plain form
15943 -4285814 -1906144 -1702487 -1875224 -1532647 -205990 -1455429 -6018015 629021 -1143615
15934 -1143615 -2513515 -3381454 -1392998 -430645 -1575650 -2309392 -3772983 -378721 -1954347
15925 -1954347 -468480 -666019 -500853 -2365519 -1606476 80863 -2320242 387843 -3004599
15916 -3004599 -1626116 -1102765 -2176898 -1993519 -1882152 -1054126 -1257298 -2503996 -2017082
15907 -2017082 -397210 -1663504 -2191213 -518640 -1539250 -1358411 -3548209 -1472426
15899 -1472426 -2504876 -898337 -1763946 -974293 -2744987 -2185923 -950077 -4292762 -1482174
15890 -1482174 -223894 896693 -2801652 -546475 -313572 -880739 -563125 386119 55204
15881 55204 -1936414 -719967 853018 -1230057 1098188 373941 -1891415 -830692 -556430
$$ packed form
15943d285814K379670K03657j72737L42577J326657j249439m562586O647036j772636
15934a143615j369900q67939J988456R62353j145005p33742j463591L394262j575626
15925a954347J485867j97539J65166j864666P59043J687339k401105K708085l392442
15916c004599J378483N23351j074133J83379J11367Q28026k03172j246698M86914
15907b017082J619872j266294n27709J672573j020610J80839k189798K075783
15899a472426j032450J606539q65609P89653j770694N59064J235846l342685K810588
15890a482174J258280J120587l698345K255177K32903n67167L17614R49244l30915
15881E5204j991618J216447J572985k083075K328245p24247k265356J060723K74262
$$ plain form
15872 -556430 -2250828 2344526 -2501312 -648552 672554 1475979 -1881079 -1627153 24950
15863 24950 -2213344 -3892726 -1205929 -3244311 148704 -2685056 -2450738 -2538655 -1231493
15854 -1231493 -2137925 978431 -1655166 -3520834 -1372444 -1831563 -1029656 -1667964 477737
15845 477737 -909378 -614261 -394579 -1395393 -1587492 -920784 -1472341 -1455269 -3156241
15836 -3156241 166295 -2891242 -255106 -873144 -2457624 -1567777 -2621389 -3312131 959375
15827 959375 -1810264 -1894346 -1407937 573274 803613 -893148 -1602822 -530690 -2418826
15818 -2418826 -2094967 -53725 -918652 -2749223 -1683720 -333040 -2445178 -2203852 -1026781
15809 -1026781 -2045082 -3648586 -2322393 -2555703 -3437899 110530 -2457940 -80080
$$ packed form
15872e56430j694398M595354m845838J852760J321106Q03425l357058K53926J652103
15863B4950k238294j679382K686797k038382L393015k833760K34318q7917J307162
15854a231493r06432L116356k633597j865668K148390m59119Q01907o38308K145701
15845D77737j387115K95117K19682j000814j92099O66708n51557J7072j700972
15836c156241L322536l057537K636136o18038j584480Q89847j053612o90742M271506
15827I59375k769639q4082M86409J981211K30339j696761p09674J072132j888136
15818b418826L23859K041242q64927j830571J065503J350680k112138K41326J177071
15809a026781j018301j603504J326193k33310q82196L548429k568470K377860
$$ plain form
15801 -80080 -210637 -1103546 -736497 288065 1199653 -52634 -39674 36134 -1475516 39602
15791 39602 -1691673 -2299510 -599946 -1961299 -2159706 -1025208 696466 -2276914 -1616303
15782 -1616303 -1518930 -1729113 -2383388 162041 -871784 -203046 -3713558 -1171052 -431935
15773 -431935 -3641952 -582541 -4191272 759848 984470 -3035988 -812592 -1213255 -2787616
15764 -2787616 -2215062 -2382531 -573134 519645 -809798 -1272621 -1209643 -2249750 -2605230
15755 -2605230 -1168467 -1875368 -1324152 -2550385 -2277398 -2307199 -2147687 -2899512 -2282038
15746 -2282038 -3772344 -1960800 -743776 -1028743 -2800000 -3444778 -862881 -611640 -663598
15737 -663598 -3412282 -391013 -1581406 -728640 -2259611 126765 -1153011 -1818169 -3070403
$$ packed form
15801h0080j30557q92909L67049J024562R11588j252287J2960P5808j511650J515118
15791C9602j731275o07837J699564j361353j98407J134498J721674k973380O60611
15782a616303R7373k10183o54275K545429j033825O68738l510512K542506P39117
15773d31935l210017L059411l608731M951120K24622m020458K223396m00663j574361
15764b787616N72554j67469J809397J092779j329443m62823O2978j040107l55480
15755b605230J436763p06901N51216j226233K72987k9801J59512p51825O17474
15746b282038j490306J811544J217024k84967j771257o44778K581897K51241n1958
15737f63598k748684L021269j190393Q52766j530971K386376j279776o65158j252234
$$ plain form
15728 -3070403 -1266613 -3609641 -3619781 101010 -2810691 -3566856 -1299399 -535066 -2757354
15719 -2757354 1153754 -1439566 -3580299 -4603897 -3275179 -695535 -3531186 -1120882
15711 -1120882 -1242293 -2124754 -1079383 -318501 -2043749 -166799 -2556802 955253 -1166401
15702 -1166401 -1813745 -1403872 -2761563 -3214671 -3475079 -650367 -430855 -2567937 272619
15693 272619 -1100913 -1135639 -1153113 -3236009 -1239533 -46024 -2672132 -2916258 -2556259
15684 -2556259 -2376589 -610234 119048 -3062768 154568 -1113219 1028332 -997044
15676 -997044 -3165943 -2322744 -1549933 -2012542 -1892298 -1537932 -2541747 -4241736 -2968611
15667 -2968611 -2133564 -2396977 -603035 -2540588 -3330971 -1408236 -3149461 -4271218 -2957274
$$ packed form
15728c070403J803790k343028j0140L720791k911701p56165K267457P64333k222288
15719b757354L911108k593320k140733j023598J328718K579644k835651K410304
15711a120882j21411q82461J045371P60882j725248J876950k390003L512055k121654
15702a166401o47344M09873j357691m53108k60408K824712K19512k137082K840556
15693B72619j373532l4726j7474k082896J996476J193509k626108k44126L59999
15684b556259J79670J766355P29282l181816L217336j267787K141551k025376
15676i97044k168899Q43199P72811m62609J20244L54366j003815j699989J273125
15667b968611Q35047k63413J793942j937553p90383J922735j741225j121757J313944
$$ plain form
15658 -2957274 -1553037 -1725695 -804657 -6255 -2002816 -880748 -1508942 -1631854 187941
15649 187941 -1051057 -993132 -384232 -1974633 -1287828 -1891597 -2020306 842856 -1219428
15640 -1219428 -2771428 -2302736 -397378 -284822 -1511913 -822338 -2858002 -704709 -3799083
15631 -3799083 -2761720 -393545 -1124843 -2380690 -1888419 -1857335 -958873 -436006 -3513575
15622 -3513575 -1305750 1179116 -856605 -2272348 -2964941 -526052 659920 -601545
15614 -601545 -2714302 -947776 -3791332 -3187390 -3148060 -191950 -158862 -1470501 -1123449
15605 -1123449 -263008 -3331252 -755271 -500048 -2120961 -2911592 98455 -2784739 343790
15596 343790 -2982755 -2696659 -2457915 -1631333 154091 -1422759 1445699 -891572 -2249641
$$ packed form
15658b957274J404237j72658R21038P98402j996561J122068o28194j22912J819795
15649A87941j238998N7925O08900j590401O86805o03769j28709K863162k062284
15640a219428j552000M68692J905358J12556j227091O89575k035664K153293l094374
15631c799083J037363K368175p31298j255847M92271L1084Q98462N22867l077569
15622c513575K207825K484866k035721j415743o92593K438889J185972j261465
15614f01545k112757J766526k843556O03942L9330K956110L3088j311639L47052
15605a123449Q60441l068244K575981K55223j620913p90631L010047k883194L128529
15596C43790l326545K86096K38744Q26582J785424j576850K868458k337271j358069
$$ plain form
15587 -2249641 -1772035 -2111660 933479 -2412843 -3357097 332718 -2272955 -2301600 -2007795
15578 -2007795 -53698 -2051008 -2946208 -799343 -2646581 -2509290 -568943 -723119 -1852377
15569 -1852377 149193 1349939 -1629488 621416 -643164 -3938047 -1206885 -1020239
15561 -1020239 -1489818 -425216 -274368 234533 58051 -2574275 -2815960 -2405907 -586150
15552 -586150 -782441 -2343308 -3146566 -2000199 -1814914 744649 1362387 -695347 117011
15543 117011 -2480345 195284 -1637688 -1499369 -3224349 -137446 -3243932 -2102966
15535 -2102966 -554579 -662949 -2955468 -1786257 -872806 -732863 -1144022 -1883020 -2961497
15526 -2961497 1359825 -3773451 -2731197 -747423 -1378887 -1624360 -3200271 -3319779 -1133732
$$ packed form
15587b249641M77606l39625L045139l346322r44254L689815k605673k8645K93805
15578b007795J954097j997310q95200K146865j847238J37291J940347j54176j129258
15569a852377K001570J200746k979427K250904j264580l294883K731162J86646
15561a020239m69579J064602J50848N08901j76482k632326k41685M10053J819757
15552e86150j96291j560867q03258J146367J85285K559563O17738k057734Q12358
15543A17011k597356K675629j832972J38319j724980L086903l106486J140966
15535b102966J548387j08370k292519J169211R13451J39943m11159p38998j078477
15526b961497M321322n133276J042254J983774o31464k45473j575911j19508K186047
$$ plain form
15517 -1133732 -707144 -2964218 -2389543 -616905 -2968552 84366 -964351 -1118776 -2807865
15508 -2807865 -510957 -857805 -242167 75779 -1540009 650774 -761869 -3449063 -1390403
15499 -1390403 -1479291 -3213164 -963961 -2627859 764341 -1508824 -1686689 -450823 -743255
15490 -743255 205646 -2496889 -1863028 -840786 -2215532 -1249722 -1895602 -1915625 -2809346
15481 -2809346 -3170981 -2088859 -3514368 -4305361 -973966 -3307041 -1047198 -416193 -2129256
15472 -2129256 -2392383 -2316687 -1210088 997972 -1977123 -657280 -3208718 -516905 -348654
15463 -348654 -133674 -3568005 -3474430 732973 538019 -2216364 404874 -1648575 1239826
15454 1239826 -1809334 -2048402 -4149136 -1183550 -2300368 -1787516 -1132245 -900026 -925777
$$ packed form
15517a133732M26588k257074N74675J772638k351647L052918j048717j54425j689089
15508b807865K296908l46848O15638L17946j615788K190783j412643k687194K058660
15499a390403q8888j733873K249203j663898L392200k273165j77865J235866k92432
15490g43255R48901k702535O33861J022242j374746R65810o45880k0023q93721
15481b809346l61635J082122j425509p90993L331395k333075K259843O31005j713063
15472b129256k63127P5696J106599K208060k975095J319843k551438K691813J68251
15463c48654K14980l434331R3575M207403j94954k754383K621238k053449K888401
15454A239826l049160k39068k100734K965586j116818N12852O55271K32219k5751
$$ plain form
15445 -925777 -355402 -242190 -660956 -606872 -1032316 -201523 -1474835 -1831571 644923
15436 644923 -3051072 -3450970 -809376 415692 -3073165 -3449445 -567176 -1681266 -1536379
15427 -1536379 -1201309 -3039476 -385856 1425260 -1350145 -2515920 -2392168 -3912340
15419 -3912340 -2594983 -62896 -955939 -833255 -3170637 -490758 -1160822 -393024 -1711790
15410 -1711790 -1860272 -859233 -2528511 -2704240 -521573 -2989543 -2072709 -780525 168683
15401 168683 -1985537 -2988168 -1080422 -893970 -2285265 -2338291 -2220689 -2630721 -112929
15392 -112929 -2067352 -1024177 -299078 -2067465 -969572 -88068 -4757400 -3688252 -3563318
15383 -3563318 -1745490 -1111585 256125 -2457906 -94764 -1511307 -2471408 -1342589
$$ packed form
15445i25777N70375J13212m18766N4084m25444Q30793j273312l56736K476494
15436F44923l695995l99898K641594J225068l488857l76280K882269j114090J44887
15427a536379L35070j838167K653620J811116k775405j165775J23752j520172
15419c912340J317357K532087q93043J22684k337382K679879o70064P67798j318766
15410a711790j48482J001039j669278j75729K182667k467970R16834J292184R49208
15401A68683k154220j002631J907746J86452j391295n3026J17602m10032K517792
15392a12929j954423J043175P25099j768387J097893Q81504m669332J069148J24934
15383c563318J817828O33905J367710k714031K363142j416543r60101J128819
$$ plain form
15375 -1342589 -1066095 -620336 -301555 -315678 -2680222 -1318814 -897517 -2679174 -814440
15366 -814440 323857 -592628 -1163774 -2433455 -659996 -2254662 -3921002 466497 -98453
15357 -98453 756994 -239940 -490427 -2410268 -2217139 -247861 -1676242 -1971366 237142
15348 237142 -1723895 -594657 -2016437 -433700 -455159 -767408 -928184 -1582623 -1278841
15339 -1278841 -1325485 -1055270 -785850 -1210892 -2331474 -1895769 -1833522 2683714 -2607790
15330 -2607790 -578840 -2225835 -1718751 117412 -1559999 -1726325 -2719619 -3928228 -327069
15321 -327069 -3048423 275064 -1836676 -899055 -2059839 -3690558 -1356043 -2876761
15313 -2876761 -1508618 -364599 -908780 -1758762 -617343 -2265926 -1431683 -597889 -835131
$$ packed form
15375a342589K76494M45759L18781j4123k364544J361408M21297j781657J864734
15366h14440J138297r16485n71146j269681J773459j594666j666340M387499n64950
15357i8453Q55447r96934k50487j919841J93129J969278j428381k95124K208508
15348B37142j961037J129238j421780J582737k1459l12249j60776o54439L03782
15339a278841m6644K70215K69420m25042j120582M35705O2247M517236n291504
15330b607790K028950j646995N07084J836163j677411j66326r93294j208609L601159
15321c27069k721354L323487k111740R37621j160784j630719K334515j520718
15313b876761J368143J144019n44181q49982J141419j648583Q34243Q33794k37242
$$ plain form
15304 -835131 -1801826 -2006194 -4882885 655949 -2584855 -872970 -440296 -1726060 -1627962
15295 -1627962 -2713033 -1834400 -2349042 -582829 -794360 -276805 -2120951 -1907905 -1502765
15286 -1502765 758428 -802006 -746996 -2217265 -2968810 -1684 -3118037 -1899962 -14937
15277 -14937 -1091647 327634 -3476808 -2641350 -895987 -427121 -3236153 -3903933 -1549019
15268 -1549019 -311959 -1152743 318866 563793 -1933028 -1025493 -546384 1130722 -604374
15259 -604374 -2962000 -3203743 -4240797 -1968598 -1717466 -738303 -511209 -1150595 -1194410
15250 -1194410 -1575188 -1026308 -2673735 -2175797 -483092 -1730393 -1500416 -478296 -1798175
15241 -1798175 -1689718 -1434356 -2572765 99426 818654 -1507129 -1835657 -1663359 -869411
$$ packed form
15304h35131r66695k04368k876691N538834l240804J711885M32674j285764R8098
15295a627962j085071Q78633n14642J766213k11531N17555j844146K13046M05140
15286a502765K261193j560434N5010j470269p51545K967126l116353J218075J885025
15277a4937j076710J419281l804442Q35458J745363M68866k809032o67780K354914
15268a549019J237060q40784J471609K44927k496821R07535M79109J677106j735096
15259f04374k357626k41743j037054K272199K51132R79163K27094o39386m3815
15250a194410l80778N48880j647427M97938J692705j247301K29977J022120j319879
15241a798175J08457K55362j138409K672191P19228k325783l28528J72298P93948
$$ plain form
15232 -869411 -1929159 -1689728 -3784387 -2307541 -1374539 -3252961 -2270634 -554493 -815079
15223 -815079 -1162983 -2979408 -4812657 -193729 -1581927 -1292496 -762714 -2363964 -3132512
15214 -3132512 -3666216 -2663413 -1661469 -1053588 1710638 -1294897 -997546 218648 319855
15205 319855 -1902516 192233 -3064589 -1707897 538604 -2725653 -2231718 -2703849 -3250602
15196 -3250602 -1850184 -1466594 -1498129 -855670 -1133717 -1659944 -3306429 839866 -2877202
15187 -2877202 -1515470 -1415377 -1656148 -1489450 -1595151 -3146458 -1009539 -3658 -1499941
15178 -1499941 -1352676 -3383306 -753429 -956686 -1085918 -2240461 534829 -1400480 -464009
15169 -464009 1330332 -644351 -381030 -1155155 -1796709 -163763 -2074111 -1488129 -1994295
$$ packed form
15232h69411j059748K39431k094659J476846R33002j878422R82327J716141k60586
15223h15079l47904j816425j833249M618928j388198K89431N29782j601250p68548
15214c132512n33704J002803J001944O07881K764226l005535K97351J216194J01207
15205C19855k222371K094749l256822J356692K246501l264257M93935m72131n46753
15196c250602J400418L83590l1535O42459k78047n26227j646485M146295l717068
15187b877202J361732J00093k40771J66698j05701j551307K136919J005881j496283
15178a499941J47265k030630K629877k03257j29232j154543K775290j935309R36471
15169d64009J794341j974683K63321p74125o41554J632946j910348N85982n06166
$$ plain form
15160 -1994295 -511512 -3984932 -1357272 87165 -761352 320165 -1709523 -1221120
15152 -1221120 555008 -1194262 -2359948 -1264629 -2083424 -1542911 1995299 537712
15144 537712 -1546453 2245190 -2786082 -2017109 -3121044 -397347 -716524 -4990832 -1428821
15135 -1428821 -2133403 345630 -681412 -3610160 -2375871 -1508951 -622787 -2293807 -1091621
15126 -1091621 -1501501 -2860410 -449510 -1401706 -5043777 -990296 -943285 -3067684 -1044419
15117 -1044419 -1570430 -1830362 -1317479 1443488 -843271 -1808950 -728768 1797235 -2653515
15108 -2653515 -926691 -939114 -2167122 -1061015 -2194596 -3076263 -853713 -1547173 -2161074
15099 -2161074 -2662945 97864 -2128762 -1782707 -1624618 -2560594 155057 -1853629 -2866837
$$ packed form
15160a994295J482783l473420K627660J444437q48517J081517k029688M88403
15152a221120J776128j749270j165686J095319q18795N40513L538210j457587
15144E37712k084165L791643n031272P68973j103935K723697l19177m274308L562011
15135a428821p04582K479033j027042k928748J234289Q66920Q86164j671020J202186
15126a091621m09880j358909K410900r52196l642071M053481M7011k124399K023265
15117a044419n26011k59932N12883K760967k286759r65679J080182K526003m450750
15108b653515J726824j2423j228008J106107j133581q81667K222550o93460o13901
15099b161074n01871K760809k226626L46055J58089r35976K715651k008686j013208
$$ plain form
15090 -2866837 -3435523 1247741 -2048542 296454 -1511844 -2209205 -1708512 -123353 -5037287
15081 -5037287 -1101469 -149475 -487007 -1443383 -1325274 -85269 -273887 -860978 -1800833
15072 -1800833 -2309690 1584911 37651 -2482777 -333627 63946 -3042380 -811105
15064 -811105 -948899 -83887 -770037 -2790699 -1582951 -2258557 -155830 -833375 -1175228
15055 -1175228 -3019344 44789 -2863563 -2293609 -1845309 -3307060 -3934369 -4016447 -3782032
15046 -3782032 -1393654 -1097594 -1367383 -539129 545942 -1868763 -1682838 701851 -3483305
15037 -3483305 -2263512 -1969228 -2331011 -301538 -647210 -4203034 -410875 240340 -3523005
15028 -3523005 -2410282 367893 -2471935 -1911907 -888254 -790319 -1875464 -2224397 -1762996
$$ packed form
15090b866837n68686M683264l296283K344996j808298o97361N00693J585159m913934
15081e037287L935818R51994l37532r56376J18109J240005j88618n87091r39855
15072a800833n08857L894601j547260k520428K149150L97573l106326K231275
15064h11105j37794Q65012o86150k020662J207748o75606K102727o77545l41853
15055a175228j844116L064133k908352N69954M48300j461751o27309q2078K34415
15046c782032K388378K96060k69789Q28254J085071k414705J85925K384689m185156
15037c483305J219793K94284l61783K029473l45672l555824L792159O51215l763345
15028c523005J112723K778175k839828N60028J023653R7935j085145l48933M61401
$$ plain form
15019 -1762996 -2377692 -300426 -2596654 -996060 -1879058 74596 -694180 -522293 -2285439
15010 -2285439 -1329219 -930486 -550119 -1231207 -2965542 -1785975 -1002143 -2272698 -2034219
15001 -2034219 -554071 119155 -204408 836622 -2460346 -2411824 -56516 -3626146 -523331
14992 -523331 -385656 590289 -1654080 -1006641 -134835 -2869810 -777851 -2764455 -1098391
14983 -1098391 -786258 -1490216 -1114202 -1422117 1843459 -1872950 -2539985 -886300 -2323869
14974 -2323869 -438524 -1920686 -1831396 -41117 -2993048 -930319 -1713942 -46414 -1442821
14965 -1442821 -2810322 -492303 -2282592 -2555242 -1857709 -987497 -1140523 -1772232 -2372098
14956 -2372098 -1820029 -829705 -3015564 -2668048 -2509920 -3013870 -1949780 -459329 -1032196
$$ packed form
15019a762996o14696K077266k296228J600594q82998J953654p68776J71887j763146
15010b285439R56220L98733L80367o81088j734335J179567P83832j270555K38479
15001b034219J480148O73226l23563J041030l296968M8522K355308l569630L102815
14992e23331J37675R75945k244369O47439Q71806k734975K091959j986604J666064
14983a098391L12133p03958L76014l07915L265576l716409o67035J653685j437569
14974b323869J885345j482162Q9290J790279k951931K062729p83623J667528j396407
14965a442821j367501K318019j790289k72650O97533Q70212j53026o31709n99866
14956b372098N52069R90324k185859L47516J58128n03950J064090J490451n72867
$$ plain form
14947 -1032196 -2042221 -2826815 -2452548 -1241168 -873768 -1751185 -1192512 -3600268 -4730132
14938 -4730132 1070978 -753762 -716861 -894504 -723058 -1518154 -1330022 -650200 -2001192
14929 -2001192 -787729 -2407679 -3571437 -583240 -1901155 -1464961 -1254808 -1415142 -568045
14920 -568045 -1348957 -1166823 -2520736 -3889651 -3519014 -1310356 -2391202 -1277937 -837335
14911 -837335 -285341 -2138147 222310 -1490014 -1497555 -1278542 175578 -1801488 -2890928
14902 -2890928 -1220252 -1348511 -1877323 -1633120 -2387591 -1643987 1288395 -1980920 -1548273
14893 -1548273 -1249335 -1209600 -1842027 -2989744 -2724268 -735599 461126 223986 -845696
14884 -845696 -942878 1127450 -2301209 -29214 -821065 -784709 -3575587 -1147173 -345195
$$ packed form
14947a032196j010025p84594L74267J211380L67400q77417N58673k407756j129864
14938d730132N801110j824740L6901j77643J71446p95096J88132O79822j350992
14929b001192J213463j619950j163758K988197j317915M36194K10153j60334Q47097
14920e68045p80912J82134j353913j368915L70637K208658j080846J113265M40602
14911h37335N51994j852806K360457j712324p541K19013J454120j977066j089440
14902b890928J670676j28259n28812K44203p54471P43604K932382l269315M32647
14893a548273K98938L9735o32427j147717K65476J988669J196725k37140j069682
14884h45696r7182K070328l428659K271995p91851L6356k790878K428414Q01978
$$ plain form
14875 -345195 439617 -1150454 948997 -1445750 -591543 -900371 -298265 -541626 -2497626
14866 -2497626 -2208911 -1807280 2049890 -1876249 -1229975 -3061625 -2543979 -1472859 -1617153
14857 -1617153 -645682 336703 -2134165 -364984 1137163 -1726820 -537956 -904484 499848
14848 499848 -2257115 -1904237 -2886324 -463988 -1424864 -2435751 -2199593 -1298602 -1020968
14839 -1020968 -1801998 1837591 -2896181 919803 125300 -2489457 -3956492 -1391438
14831 -1391438 -2370838 -2286444 -175882 -4054742 -4086490 -1398353 177191 -1287356 -3103055
14822 -3103055 -1177452 -1592066 -1756545 -2980161 -2674707 -1431843 546656 -1414115 -1350108
14813 -1350108 -488221 -3033972 -938070 -664988 -1201630 50448 -1916877 -427539 -1273275
$$ packed form
14875c45195P84812j590071K099451k394747Q54207l08828O02106k43361j956000
14866b497626K88715M01631L857170l926139O46274j831650N17646J071120j44294
14857a617153R71471R82385k470868J769181J502147k863983J188864l66528J404332
14848D99848k756963L52878r82087K422336r60876j010887K36158R00991K77634
14839a020968p81030L639589m733772L815984p94503k614757j467035K565054
14831a391438r79400Q4394K110562l878860l1748K688137J575544j464547j815699
14822c103055J925603m14614j64479j223616L05454J242864J978499j960771O4007
14813a350108Q61887k545751K095902K73082n36642J252078j967325J489338q45736
$$ plain form
14804 -1273275 -2665020 -859316 -2818695 -292756 -117676 175003 47530 -1560839 -269219
14795 -269219 -613392 51731 -110104 -1567576 -3456361 -3610232 -1173078 -1930037 -3359970
14786 -3359970 -2265178 -948735 -2630173 -3647702 -1597989 -1341648 -2706069 45865
14778 45865 -671997 -1310975 -639330 -515342 -2894245 -313965 -3174386 -1811204 -2063563
14769 -2063563 -1875767 -64606 -2542202 -213484 -1497682 -2991309 -3145696 -764637
14761 -764637 -2262634 -2031311 424752 -769018 -1042425 -1447934 -1729436 -2175027 -984364
14752 -984364 -1517047 -2374404 -401256 -687458 -2158561 -345420 -2021914 -1694354 -2225153
14743 -2225153 -171365 -2037708 -2555005 -2896251 -1615527 -1749579 415215 -2105387 334138
$$ packed form
14804a273275j391745J805704j959379K525939J75080K92679j27473j608369J291620
14795b69219l44173O65123j61835j457472j888785j53871K437154p56959j429933
14786c359970J094792J316443j681438j017529K049713K56341j364421K751934
14778D5865p17862o38978O71645J23988k378903K580280k860421J363182k52359
14769b063563J87796J811161k477596K328718j284198j493627j54387K381059
14761g64637j497997K31323K456063j193770k73407m05509k81502m45591J190663
14752i84364n32683q57357J973148k86202j471103J813141j676494L27560n30799
14743b225153K053788j866343n17297l41246J280724j34052K164794k520602K439525
$$ plain form
14734 334138 -4477790 -1778660 -4095635 -390883 -861839 -2164837 -1825852 -2623983 -1427032
14725 -1427032 -425340 226511 -1116553 -2269274 -2333672 -2461573 448781 -644302 -1728098
14716 -1728098 -1144435 -1919987 -1961823 -1350100 -761566 -796715 -2138680 -2246796 632343
14707 632343 -2925128 -1771103 -2323329 -2093315 -1188863 -795257 -1616815 -887698 -31257
14698 -31257 -1858946 -2054344 -1075680 1142821 -1423681 -2349527 -3779257 -1213661 -1849145
14689 -1849145 -3540873 -797214 -139039 -2840399 -3715362 -1326979 -2844227 -5052528
14681 -5052528 -3017421 -2159552 -1778834 -923904 -1642097 -2773828 283040 -935622 -1499280
14672 -1499280 -1344906 -228004 236973 -2261508 -1537503 -3363136 -2673415 -1240748 -1295266
$$ packed form
14734C34138m811928K699130k316975L704752m70956j302998L38985p98131J196951
14725a427032J001692O51851j343064j152721o4398j27901K910354j093083j083796
14716a728098N83663p75552m1836O11723N88534l5149j341965j08116K879139
14707F32343l557471J154025n52226K30014R04452L93606q21558P29117Q56441
14698c1257j827689j95398R78664K218501k566502r25846j429730K565596o35484
14689a849145j691728K743659O58175k701360q74963K388383j517248k208301
14681e052528K035107Q57869L80718Q54930p18193j131731L056868j218662n63658
14672a499280J54374J116902M64977k498481P24005j825633O89721J432667n4518
$$ plain form
14663 -1295266 -308953 -3049362 -2391158 -1074189 -1828707 -3647325 -2450331 -400654 -1950509
14654 -1950509 623525 -1552339 -3672499 -2380081 -3045854 -914186 -2932569 -403470
14646 -403470 -1091810 -38289 -2261918 1180913 -2474018 -2942091 -2558951 -1746590 -2640770
14637 -2640770 -2584178 -755978 -557170 -1701384 -200275 -2840469 194220 -1510317 -1614370
14628 -1614370 -1585680 -612146 -254196 -837494 -890099 -1122785 -1511486 -767908 -1504816 -1221896
14618 -1221896 759412 -1383567 -406978 -1933573 -2967859 -745718 -361836 -2598595
14610 -2598595 -1687640 -2170968 302139 -3080118 -2192532 -2423021 -1776067 -875739 -3181782
14601 -3181782 -2437530 -2289351 -2995401 -2338448 -1593318 799482 786691 -1667701 -1226310
$$ packed form
14663a295266R86313k740409O58204J316969p54518j818618J196994K049677j549855
14654a950509K574034k175864k120160J292418o65773K131668k018383K529099
14646d03470o88340J053521k223629L442831l654931m68073L83140Q12361q94180
14637b640770N6592J828200J98808j144214J501109k640194L034689j704537j04053
14628a614370K8690R73534L57950n83298n2605k32686l88701P43578p36908K82920
14618a221896J981308k142979R76589j526595j034286K222141L83882k236759
14610b598595R10955m83328K473107l382257Q87586k30489O46954R00328k306043
14601c181782P44252J48179p06050O56953P45130K392800j2791k454392M41391
$$ plain form
14592 -1226310 -1723692 1007179 -1465632 -2471144 -1172397 -3070459 -2762835 -2794940 784550
14583 784550 110535 -1164333 -373991 396255 -1392540 -2532045 -1596612 326995 1476013
14574 1476013 -1454634 -2163848 -1740292 -2084750 -3846872 -340606 360956 -1192528 -2391327
14565 -2391327 -1323364 -2153175 -2187438 -1457372 -402747 -1891989 -1322357 -871767 -985079
14556 -985079 -816871 -1196498 -1736034 -1618705 -2297936 -864778 973800 -310110 -532696
14547 -532696 -1269432 -2289500 -123314 -1246055 -473601 -954946 -220049 -963825 362173
14538 362173 -293575 -15448 -1934121 -392040 -1571665 -2745533 -1864813 -2324499 -377906
14529 -377906 24224 483749 -2942303 -2544525 -593640 -674297 -1085250 -999402 -3075199
$$ packed form
14592a226310m97382K730871k472811j005512J298747j898062L07624l2105L579490
14583G84550o74015j274868P90342P70246j788795j139505R35433J923607J149018
14574A476013k930647p09214M23556l44458j762122L506266P01562j553484j198799
14565b391327J067963q29811l4263P30066J054625j489242N69632M50590j13312
14556i85079J68208l79627n39536J17329o79231J433158J838578j283910k22586
14547e32696p36736j020068K166186j122741P72454m81345P34897p43776J325998
14538C62173o55748K78127j918673J542081j179625j173868Q80720m59686J946593
14529c77906M02130M59525l426052L97778J950885q0657m10953Q5848k075797
$$ plain form
14520 -3075199 -1766939 -66544 -1186108 -288886 -2952380 -1830911 -2584255 -1967426 -1255470
14511 -1255470 -1351266 -3022321 -1237920 -1135952 -1070274 -1728069 -968318 -2931573 -1689443
14502 -1689443 -1492077 -2904289 -782588 -1725391 -2683823 -496834 213168 -925246 127288
14493 127288 -340458 -2461067 1882585 -3042467 -450515 -2405750 -2118860 -1702853 -4160971
14484 -4160971 -1916466 -2753471 -2961962 -771375 -683638 -2043563 -828031 -5112274 -3316261
14475 -3316261 -3604923 -403424 -492841 -1960581 -1171598 -2255358 -1620855 -605342 127417
14466 127417 -2911763 -1783730 84221 -1338927 -1701947 -1896796 -2003357 -4120432 -265290
14457 -265290 -1488286 -1890880 -1052091 -1474148 -3198123 -2144239 1863377 -1715710 -1156940
$$ packed form
14520c075199J308260J700395j119564Q97222k663494J121469p53344O16829P11956
14511a255470r5796j671055J784401J01968O5678o57795P59751j963255J242130
14502a689443J97366j412212K121701r42803r58432K186989P10002j138414J052534
14493A27288m67746k120609M343652m925052K591952j955235K86890M16007k458118
14484d160971K244505q37005k08491K190587Q7737j359925J215532m284243J796013
14475c316261k88662L201499q9417j467740P88983j083760O34503J015513P32759
14466A27417l039180J128033J867951j423148l63020j94849j06561k117075L855142
14457b65290j222996m02594Q38789m22057j723975J053884M007616l579087N58770
$$ plain form
14448 -1156940 1242859 -1204215 -1635536 -1983721 -3403277 -1748246 -934221 -1657681 -1975757
14439 -1975757 365989 -2359416 -235437 553851 -1532245 -4745665 1233126 -2350471
14431 -2350471 -32412 -1680917 -1150384 -968426 -1322545 -1263517 310272 -1584734 -1677274
14422 -1677274 -1430468 67355 -506768 -715237 -1118277 -1121573 -1398430 -2633519 -763962
14413 -763962 -1006879 -1634978 385997 -615606 -287189 -509860 -498451 -1771846 157909
14404 157909 -2697870 1219420 -4211223 311356 -3096862 -2340242 -287063 400738 -1019516
14395 -1019516 -2324933 -2527623 -2008063 -2060068 -1806407 -509762 -2994455 -2443803 -2283245
14386 -2283245 -959878 -1714619 -435573 -2748977 -1238357 -1733944 -770434 -185231 -2319677
$$ packed form
14448a156940K399799k447074m31321l48185j419556J655031Q14025p23460l18076
14439a975757K341746k725405K123979P89288k086096l213420N978791l583597
14431b350471K318059j648505N30533J81958l54119N9028J573789j895006r2540
14422a677274K46806J497823n74123k08469m03040l296k76857j235089J869557
14413g63962k42917o28099K020975j001603L28417k22671J1409j273395J929755
14404A57909k855779L917290n430643M522579l408218P56620K053179O87801j420254
14395a019516j305417k02690N19560n2005K53661J296645k484693N50652J60558
14386b283245J323367p54741J279046k313404J510620m95587R63510N85203k134446
$$ plain form
14377 -2319677 -90814 -274241 -1784049 -4992138 -1431035 -1616300 -1833926 -410640 -2819254
14368 -2819254 -2496849 -457591 -255988 -1398928 -1807659 -821510 1234082 -2045770 -905452
14359 -905452 -1744113 -824060 464366 -1867911 -1837561 73258 -2758180 -245215 -998702
14350 -998702 -3714811 -2902781 -2430419 -3762595 -1972559 -2592427 -1224173 -4238152 -888927
14341 -888927 -1217767 -918858 -3596486 -126772 -657870 -3978594 -2738889 -2902154 -3596201
14332 -3596201 -1839235 -2758304 -1996972 216518 -1845737 -1961470 -3299939 -1394636 -987465
14323 -987465 1138679 -2763347 -887796 -2623641 -1688351 -3392040 -1844558 -4781829
14315 -4781829 -2291837 -1801879 257775 -2114517 -3194158 -4001586 9329 -1248183
$$ packed form
14377b319677K228863j83427j509808l208089L561103j85265k17626J423286k408614
14368b819254L22405K039258K01603j142940m08731R86149K055592l279852J140318
14359i05452q38661R20053J288426k332277L0350J910819k831438K512965p53487
14350i98702k716109Q12030M72362j332176J790036o19868J368254l013979L349225
14341h88927l28840K98909k677628L469714n31098l320724J239705j63265o94047
14332c596201J756966r19069P61332K213490k062255j15733j338469J905303M07171
14323i87465K126144l902026J875551j735845R35290j703689J547482k937271
14315d781829K489992M89958K059654k372292j079641q07428M010915j257512
$$ plain form
14307 -1248183 -2509853 -1869470 -745731 -973225 56574 -1812718 -1094962 -2803436 747956
14298 747956 -1206358 -2106230 -2864787 -1359090 -1866066 -3239354 718571 -742013 -1989085
14289 -1989085 -91274 -246405 -815566 -2500687 -1373791 -993461 -1449828 -3178713 -2479340
14280 -2479340 -2314697 323861 -1517586 -1906230 -963448 -2966456 -505742 -3152341 -1717123
14271 -1717123 -2250919 -1881734 -751664 -641540 -4380915 -3661439 -1600589 -600521 -5395
14262 -5395 -2220626 -3052375 -1260899 -3270112 -1507939 993722 -1211474 -1700871 -2374651
14253 -2374651 155798 -592580 -1273439 -1598585 931603 -4729360 -766644 -1417784 -2523764
14244 -2523764 271324 1724938 -2340198 -4376557 -154182 -1945604 -3001444 -1048773
$$ packed form
14307a248183j261670O40383J123739k27494J029799j869292P17756j708474L551392
14298G47956j954314q99872p58557J505697n06976j373288L957925j460584j247072
14289a989085J897811j55131n69161j685121J126896L80330m56367j728885O99373
14280b479340J64643K638558j841447l88644R42782k003008K460714k646599J435218
14271a717123n33796L69185J130070J10124l739375P19476K060850J000068N95126
14262e395k215231q31749J791476k009213J762173K501661k205196m89397o73780
14253b374651K530449p48378o80859l25146K530188n660963L962716o51140j105980
14244b523764K795088J453614m065136k036359M222375j791422j055840J952671
$$ plain form
14236 -1048773 -2126276 -1582834 -1698620 -933651 -1562694 -2901180 -688428 -1631393 -494315
14227 -494315 -1035450 -3721825 -61687 -4978390 -1816148 130542 -1048966 -1306451 -333341
14218 -333341 648451 -358423 -3050078 -909921 -848386 -256046 -1555288 -3464483 29219
14209 29219 -1413563 -1577023 -1190490 97273 -395804 -889641 -1186358 -1035827 -1877800
14200 -1877800 283817 -2039409 -3671181 -1555319 737825 -1737555 -1497085 -1920577
14192 -1920577 -1452431 -1268627 -223309 -1291863 -1982056 -1441751 -1099662 -3039377 -2552007
14183 -2552007 -1781038 -964169 -1047996 -988358 333543 -723576 -73016 -1452757 -2948930
14174 -2948930 -1959552 -1155683 -1276351 -1109411 -2228498 -1722109 -2599643 -2391624 22358
$$ packed form
14236a048773j077503N43442j15786P64969o29043j338486K212752r42965J137078
14227d94315n41135k686375L660138m916703L162242J946690j179508k57485R73110
14218c33341R81792j006874k691655K140157O1535N92340j299242j909195L493702
14209B9219j442782j63460L86533J287763m93077m93837k96717J50531q41973
14200a877800K161617k323226j631772K115862K293144k475380K40470m23492
14192a920577M68146J83804J045318j068554o90193N40305L42089j939715M87370
14183b552007P70969Q16869q3827N9638J321901j057119O50560j379741j496173
14174b948930R89378Q03869j20668J66940j119087N06389q77534K08019K413982
$$ plain form
14165 22358 -1614922 -1388309 170898 -1446434 830723 987338 -832014 -959902 -1785095
14156 -1785095 -2194862 -450504 -2938491 -1723544 -310605 -1331389 -2840707 -3732642
14148 -3732642 320931 -230138 -818800 -96001 362516 -309231 433361 -922803 -607252
14139 -607252 -819190 -2086932 -2321980 -790783 -2289587 -4490115 -138504 -1337211 -919785
14130 -919785 -1666410 -1987710 -1425856 -1331170 -1282656 -1650727 -2362505 -3340422 -1154890 -2439805
14120 -2439805 -3396708 -2556945 -1685547 -1702445 428123 74855 -1658089 -1376569 -2484851
14111 -2484851 -590227 -1242171 -434229 -972714 -2791592 -2765855 -2484586 164947 -1062852
14102 -1062852 -1006283 -2656031 754569 -1433163 -3846849 -1984737 -1725117 -1283400 -3363071
$$ packed form
14165B2358j637280K26613J559207j617332K277157J56615j819352j27888q25193
14156a785095m09767J744358k487987J214947J412939j020784j509318q91935
14148c732642M053573n51069n88662P22799M58517o71747P42592j356164L15551
14139f07252k11938j267742k35048J531197j498804k200528M351611j198707M17426
14130i19785p46625l21300N61854R4686M8514l68071p11778r77917K185532j284915
14120b439805r56903Q39763Q71398j6898K130568l53268j732944K81520j108282
14111b484851J894624o51944Q07942n38485j818878K5737K81269K649533j227799
14102a062852N6569j649748L410600k187732k413686J862112K59620M41717k079671
$$ plain form
14093 -3363071 -2401896 -3057887 -3400585 -1211133 -1273862 -855383 -1520331 -1927033 -1470753
14084 -1470753 20048 -1099934 -2032758 -2435959 -3583601 -247085 273727 -456911 -902956
14075 -902956 -310797 -1372081 347248 -2050769 -3659073 306907 -3599168 63974
14067 63974 -2364321 -3030745 -1208635 -1136453 -2078651 -4553216 -2836437 390219 -1430943
14058 -1430943 -523042 -2854783 -3632590 613449 -302942 -319463 -3369608 -1649637 -1301314
14049 -1301314 -4690265 -1203622 666240 -911915 -4034047 -1938634 -1994224 -206598
14041 -206598 -3330806 -3280688 -3529077 1911491 -389871 -3355736 -2920454 -1032654 -3489236
14032 -3489236 -2771229 -1831469 -2158934 -3256239 -194812 -3432141 -1002679 -191922 -1683628
$$ packed form
14093c363071R61175o55991l42698K189452o2729M18479o64948m06702M56280
14084a470753J490801j119982r32824m03201j147642L336516N20812p30638m46045
14075i02956N92159j061284J719329k398017j608304L965980l906075L663142
14067F3974k428295o66424J822110P2182r42198k474565J716779L226656j821162
14058a430943R07901k331741p77807M246039r16391j6521l050145J719971L48323
14049a301314l388951L486643J869862j578155l122132K095413n5590J787626
14041b06598l124208N0118k48389N440568k301362k965865M35282J887800k456582
14032c489236P18007R39760l27465j097305L061427l237329K429462Q10757j491706
$$ plain form
14023 -1683628 -69487 -783590 -1942079 -1479727 -612120 -2849415 -1126135 558953 -2584398
14014 -2584398 -2715699 -589138 381572 -1000515 -3966117 -3364520 -1472713 -842517 -1665452
14005 -1665452 -1697439 -1179120 -1690060 -902519 -2403797 -3613915 -1276644 1299008 -99356
13996 -99356 -2395844 -996944 -1981810 -5081407 498441 -706393 -2136411 -1071720 -1299987
13987 -1299987 -2270464 -1288572 -49900 -3148385 -3492845 -1584675 -1967293 -2135924 -1230216
13978 -1230216 -2086897 -1423535 -266737 -1118393 -3370205 -1691722 -2712053 -1024811 -2454246
13969 -2454246 -969902 -639384 -1799016 1030142 -559848 -35011 -2328293 436646
13961 436646 -909481 -1156804 -701590 -3209464 -1111036 1673157 -2096245 -2741281 -1197905
$$ packed form
14023a683628J614141p14103j158489M62352Q67607k237295J723280J685088l143351
14014b584398j31301K126561R70710j382087k965602O01597J891807O30196q22935
14005a665452l1987N18319n10940P87541j501278j210118K337271K575652j398364
13996i9356k296488J398900r84866l099597N579848j204834j430018J064691k28267
13987a299987r70477R81892J238672l098485l44460J908170l82618j68631R05708
13978a230216q56681O63362J156798q51656k251812J678483j020331J687242j429435
13969b454246J484344L30518j159632K829158j589990N24837k293282K764939
13961D36646j346127k47323M55214k507874K098428K784193l769402o45036J543376
$$ plain form
13952 -1197905 130176 1659123 -145007 -2188331 1656820 -1956869 -2518981 -3532362
13944 -3532362 -2472446 -1025905 -701076 -738575 -1099948 -717242 -1687985 -1599124 -1664516 -1175389
13934 -1175389 -1597813 -283824 -1625343 -588907 1151381 31744 354544 460814 -930016
13925 -930016 -1235336 -1566424 511958 -1825105 -458672 -1247577 -896845 -478606 -1294095
13916 -1294095 -2979470 -2726553 776583 -1768422 -1218188 -3459134 11071 -1860900
13908 -1860900 -2286475 -889630 148039 -471614 -1619433 -1883493 -2690873 -3834391 -808359
13899 -808359 -1435323 -246125 247600 -1714118 -3338033 -236510 -2096120 -3116223 -1755123
13890 -1755123 612021 -3723842 679044 -840024 -1524040 -1672164 -864045 -1038867 -934252
$$ packed form
13952a197905J328081J528947j804130k043324L845151l613689n62112j013381
13944c532362J059916J446541L24829l7499l61373L82706r70743Q8861o5392M89127
13934a175389m22424J313989j341519J036436J740288j119637L22800J06270j390830
13925i30016l05320l31088K078382k337063J366433p88905L50732M18239q15489
13916a294095j685375K52917L503136k545005N50234k240946L470205j871971
13908a860900m25575J396845J037669o19653j147819k64060q07380j143518L026032
13899h08359o26964J189198M93725j961718j623915L101523j859610j020103J361100
13890a755123K367144m335863M402886j519068o84016j48124Q08119j74822J04615
$$ plain form
13881 -934252 -1193147 -2928052 -1597121 -339369 -581798 -1732070 -1701502 -3874471 -1136049
13872 -1136049 -1386911 -771040 -1817283 -1829755 -2718631 -600833 -793426 -2126358 -1759357
13863 -1759357 -1954691 -3561361 -464157 -3074386 -334157 -2445976 303856 166593
13855 166593 -1493572 1186016 -1169778 -1996236 -1888177 -2489590 -2927272 -1390889 775510
13846 775510 -404612 -2121069 -1292502 -2205183 -2229815 -1520906 496196 -2551279 -1576188
13837 -1576188 -2741014 -1340520 -1965307 -2734734 -2000145 -1311687 -2930649 -1794740 1461307
13828 1461307 -2143557 -3983977 -191820 -2334684 780576 -249896 -4788881 -417663
13820 -417663 -848225 -25740 -1394663 -2042953 -1575514 -2752985 -452615 -2023935 -804078
$$ packed form
13881i34252k58895j734905J330931J257752k42429j150272L0568k172969K738422
13872a136049k50862O15871j046243j2472q88876K117798j92593j332932L67001
13863a759357j95334j606670L097204k610229K740229k111819K749832j37263
13855A66593j660165K679588k355794q26458J08059o01413m37682J536383K166399
13846G75510j180122j716457Q28567r12681k4632P08909K017102l047475R75091
13837a576188j164826J400494o24787p69427P34589O88458j618962J135909L256047
13828A461307l604864j840420L792157k142864L115260j030472m538985M371218
13820d17663m30562Q22485j368923o48290M67439j177471K300370j571320J219857
$$ plain form
13811 -804078 -3043012 1217052 -1655713 -1249055 -1869774 -3069604 -924835 764099 -96203
13802 -96203 -201753 1132560 -1606905 -2008049 195700 -844617 -3463240 -2746482 -1712768
13793 -1712768 -3031802 -2156613 -1240877 110537 -1911169 -1221129 -1349343 -564332 -775135
13784 -775135 -1889843 -3436912 -2721694 -2474414 -1183278 -1653867 -1050843 -2432952 -4811315
13775 -4811315 -1841436 -2165928 -96706 1157280 -2177814 1464186 -3132918 511556
13767 511556 -1740774 145305 -491103 908986 -2044402 389723 -1917865 -1035422 -3160315
13758 -3160315 1383677 -2486644 -4196588 -2319551 -1706243 -2103750 -1394784 -1751216 -1237760
13749 -1237760 -496642 -1883429 -1643591 -1719042 -2341582 -594081 -1056731 -1248292 -1934228
$$ packed form
13811h04078k238934M260064k872765M06658o20719j199830K144769J688934q60302
13802i6203j05550J334313k739465m01144K203749j040317k618623P16758J033714
13793a712768j319034Q75189R15736J351414k021706O90040j28214P85011k10803
13784g75135j114708j547069P15218K47280J291136m70589O03024j382109k378363
13775d811315K969879l24492K069222J253986l335094L642000m597104L644474
13767E11556k252330J886079o36408J400089k953388K434125k307588Q82443k124893
13758c160315M543992l870321j709944J877037O13308l97507P08966l56432N13456
13749a237760P41118j386787K39838p5451o22540J747501m62650j91561o85936
$$ plain form
13740 -1934228 -773956 -2841271 -394072 -20307 -1451186 11252 -2931913 165542
13732 165542 -1165360 1307270 -1955723 -1303443 -34123 -2908945 -1199149 -2670859
13724 -2670859 -2286587 -1362549 -1738168 -2876561 -2085943 -606874 -64503 -4246291 -1013266
13715 -1013266 435311 -3129558 -2325366 -1856582 -1115189 -2666861 -252093 -4278470 -2490356
13706 -2490356 -2735355 -848778 -1804314 -1170992 421784 -260906 -1308885 -2232290 -2295887
13697 -2295887 -540383 -3778521 -566878 -1271465 -3316690 -2260988 951134 -2613467
13689 -2613467 -2455742 -968709 -3325228 -1507225 -3036644 833528 -1316411 -1927543
13681 -1927543 -2682417 -2580103 -636766 -1442743 -977126 -3002605 -4244401 -2467732 607944
$$ packed form
13740a934228J160272k067315K447199L73765j430879J462438k943165L097455
13732A65542j330902K472630l262993O52280J269320k874822J709796j471710
13724b670859L84272R24038l75619j138393P90618J479069N42371m181788L233025
13715a013266J448577l564869Q04192M68784P41393j551672K414768m026377J788114
13706b490356k44999J886577r55536O33322J592776o82690j047979r23405o3597
13697b295887J755504l238138L211643p04587k045225J055702L212122l564601
13689b613467J57725J487033k356519J818003j529419L870172k149939o11132
13681a927543p54874J02314J943337q05977M65617k025479j241796J776669L075676
$$ plain form
13672 607944 -1462188 -1297913 -603272 6308 -2676380 -1646643 -2344395 -3710264 -1020437
13663 -1020437 -2302996 1583417 -1094559 -2149426 -5390154 -1176849 -2049056 -1873186
13655 -1873186 -1659791 -1504786 -1862464 -3631805 -1880447 -2724902 287905 -1259124 -530597
13646 -530597 -2030486 -1868820 -1572006 -2890008 -514389 -607184 -1791210 -1387218 -983636
13637 -983636 -1710122 -1635660 -2204987 1615550 -2091821 -1934090 -1463633 -1735558 -3788232
13628 -3788232 -1389173 -2027314 -687870 -1115956 -697281 -2107185 -400421 -30996 -886423
13619 -886423 -989840 -1112825 -365588 -2108700 453983 -996672 -3960755 -1265560 -555615
13610 -555615 -4208273 -936319 -361525 -690041 -1857785 -2378043 -2703240 -1307563 -291297
$$ packed form
13672F07944k070132J64275O94641O09580k682688J029737o97752j365869K689827
13663a020437j282559L886413k677976j054867l240728M213305q72207J75870
13655a873186K13395J55005l57678j769341J751358q44455L012807j547029P28527
13646e30597j499889J61666K96814j318002K375619r2795j184026M03992M03582
13637i83636p26486P4462n69327L820537l707371J57731M70457k71925k052674
13628c788232K399059o38141J339444m28086M18675j409904J706764L69425q55427
13619h86423j03417j22985P47237j743112K562683j450655k964083K695195P09945
13610e55615l652658L271954N74794l28516j167744n20258l25197J395677J016266
$$ plain form
13601 -291297 -3409131 -2167113 -2962746 981857 -2600449 294084 -3295753 -1773870
13593 -1773870 -1280510 -1563183 -949529 -551200 -340117 -1192481 -418560 -1149794 453407
13584 453407 -838059 74170 348594 -2986543 764310 -3442986 -1516001 -1330034 -1930734
13575 -1930734 -1926478 -1737540 -744419 -2253530 129202 -1484657 -1971865 -1015393 -1460491
13566 -1460491 -1002025 -936774 118785 -122347 -3288720 -1993369 -1781511 -2620355 872472
13557 872472 633509 146235 -2189577 -19874 348246 -2235585 722880 -2140855 -3463535
13548 -3463535 1037496 -1947714 -1597386 -1494505 -4153700 -766684 -1941649 -2158328 -3258434
13539 -3258434 -1541228 -407827 -3058240 -749624 72540 -195040 -947376 -1675641 490454
$$ packed form
13601b91297l117834J242018p95633L944603l582306K894533l589837J521883
13593a773870M93360k82673O13654L98329K11083q52364P73921p31234J603201
13584D53407j291466R12229K74424l335137L750853m207296J926985J85967o00700
13575a930734M256J88938R93121j509111K382732j613859m87208R56472m45098
13566a460491M58466O5251J055559k41132l166373J295351K11858q38844L492827
13557H72472k38963m87274k335812K169703L68120k583831K958465k863735j322680
13548c463535M501031k985210L50328J02881k659195L387016j174965k16679j100106
13539c258434J717206J133401k650413K308616Q22164k67580p52336p28265K166095
$$ plain form
13530 490454 -1476303 -1716948 -3310495 -1930915 -1995796 -2484916 -134347 -1473432 -1687690
13521 -1687690 -1101342 -1144813 -2868052 -320428 -1875562 -951509 -146523 -2793734 -395624
13512 -395624 -1697372 -14733 455338 -608555 -918870 305156 -2394849 -1006145 -486742
13503 -486742 -2266331 -1605943 -2285833 -3113717 -273093 744277 -2557159 -2650781 -1418513
13494 -1418513 -826037 -698180 -1074085 -3336874 -1786468 -1787106 -4579424 784443 -1890839
13485 -1890839 -1542506 -50473 -651722 1438594 -3177123 -1220474 -1245865 -3660196 -852164
13476 -852164 -4095204 -800858 -1214378 -2079644 -2663707 -1683735 -1043484 -3809377 -2029936
13467 -2029936 631018 -1385419 -89484 -1471289 -1773778 -1397076 -2492 -2438843
$$ packed form
13530D90454j966757k40645j593547J379580o4881m89120K350569j339085k14258
13521a687690N86348m3471j723239K547624j555134R24053Q04986k647211K398110
13512c95624j301748J682639M70071j063893l10315J224026k700005J388704N19403
13503d86742j779589O60388o79890q27884K840624J017370l301436r3622J232268
13494a418513N92476J27857l75905k262789J550406o38k792318N363867k675282
13485a890839L48333J492033o01249K090316m615717J956649k5391k414331K808032
13476h52164l243040L294346m13520q65266n84063R79972O40251k765893J779441
13467b029936K660954k016437J295935j381805l02489L76702J394584k436351
$$ plain form
13459 -2438843 -959320 -1294849 -143291 -5235786 -629793 -2870150 -1581841 -2428903
13451 -2428903 975843 -1512878 226582 -3714620 -876412 -2616062 -1192080 -2160966
13443 -2160966 -2314900 -2557226 501719 -2332731 -935632 -1661783 925498 -2751868 -3088774
13434 -3088774 -1716673 -3265735 -2190954 -936815 -1498059 -2248075 -1684009 -3232307 -778280
13425 -778280 -2862818 -2511026 333066 68934 -34378 -3772586 -2059607 -860686 -951724
13416 -951724 -2575105 -181422 -2412770 -1642388 -92917 -1400083 -3065146 -1451248
13408 -1451248 -108798 -1126164 -310488 -1428589 -1151947 -1042560 -2502336 -409452 -2537123
13399 -2537123 -524119 -3163869 -308048 -869873 -3525677 -1714315 -1879913 -3732243
$$ packed form
13459b438843J479523l35529J151558n092495M605993k240357J288309q47062
13451b428903L404746k488721J739460l941202K838208j739650J423982r68886
13443b160966j53934k42326L058945k834450J397099p26151K587281l677366l36906
13434c088774J372101j549062J074781J254139n61244p50016N64066j548298K454027
13425g78280k084538L51792K844092k64132j03312l738208J712979J198921r1038
13416i51724j623381K393683k231348P70382J549471j307166j665063J613898
13408a451248J342450j017366Q15676j118101K76642J09387j459776K092884k127671
13399b537123K013004k639750K855821n61825k655804J811362j65598j852330
$$ plain form
13391 -3732243 -752584 -205270 -89839 -2896530 1500147 -1435799 531718 -2131940
13383 -2131940 2941065 4631571 3701905 -935723 -986212 -1373530 -1932835 596699 -2507816
13374 -2507816 -3782632 -1141233 -104585 -2726154 -913940 -61486 -2066459 -945909
13366 -945909 -854052 -2330922 241734 -923471 -1945549 -93882 13221 -3018407 -235916
13357 -235916 -497528 -1296868 -5117724 -2134138 151567 -293021 -2131459 697151 -3005347
13348 -3005347 -1166214 -2015626 820081 -1843941 -2772859 -468781 -387029 -1534031 -1813656
13339 -1813656 143957 -3991715 -588477 -916305 -2050861 -2415087 582386 -326664 -2360099
13330 -2360099 248040 -543076 -671924 -2734021 -228755 -2139577 -1702014 -358364 -1751452
$$ packed form
13391c732243K979659N47314J15431k806691M396677k935946J967517k663658
13383b131940N073005J690506r29666m637628n0489l87318n59305K529534l104515
13374b507816j274816K641399J036648k621569J812214Q52454k004973J120550
13366i45909R1857j476870K572656j165205j022078J851667J07103l031628K782491
13357b35916k61612p99340l820856K983586K285705m44588j838438K828610l702498
13348c005347J839133q49412K835707k664022r28918K304078Q1752j147002k79625
13339a813656J957613m135672L403238l27828j134556l64226K997473r09050k033435
13330b360099K608139p91116j28848k062097K505266j910822M37563J343650j393088
$$ plain form
13321 -1751452 -523296 -2526622 -1586376 136396 -2334082 515330 -1847753 -677307
13313 -677307 -1934272 -103394 -889141 -209542 -550868 1468447 -270854 1868718 -1239435
13304 -1239435 935776 -2586809 1216192 -1391852 -373072 337191 -2797188 -1216218
13296 -1216218 -2206799 -247439 -2514564 -1641850 665820 -2411032 -1171366 2637301
13288 2637301 -8112 -605534 -112084 31570 -356881 2398305 3307749 5038355 3649350
13279 3649350 10270288 18753876 40976107 121336504 305899007 169840282 51351444
13272 51351444 20142787 9745840 5349175 5800910 1707735 1265228 1020809 147755
13264 147755 237926 1364617 -348934 -335138 617748 1625624 -525925 2524369 1901306
$$ packed form
13321a751452J228156k003326R40246J722772k470478K849412k363083J170446
13313f77307j256965J830878p85747O79599l41326K019315j739301K139572l108153
13304a239435K175211l522585L803001k608044J018780P10263l134379J580970
13296a216218r90581J959360k267125Q72714K307670l076852J239666L808667
13288B637301k645413n97422M93450J43654l88451K755186R09444J730606j389005
13279C649350O620938Q483588K2222231Q0360397J84562503j36058725j18488838
13272E1351444l1208657j0396947m396665M51735m093175m42507k44419q73054
13264A47755R0171J126691j713551J3796R52886J007876k151549L050294o23063
$$ plain form
13255 1901306 1180160 -1163664 286415 2246624 -374201 2600896 -59611 1858907
13247 1858907 2418143 2996169 8622294 10049513 18387202 40838324 133351559 323010121
13239 323010121 171887047 49166161 17876971 7759000 3069105 3286862 2924405
13232 2924405 3047960 518583 2265710 -142530 -1011746 -1105465 -714089 -1400140 -92793
13223 -92793 -993342 92291 -1225597 -371231 598648 1893104 -2068449 939667 3700462
13214 3700462 1181528 87209 5118665 5932461 6453785 12818434 20581892 48848979
13206 48848979 144381321 316243593 162794828 48842314 20529650 9260992 5839496
13199 5839496 2834071 1821461 2267843 112166 -943061 -228342 -1131712 -1988375 -2176336
$$ packed form
13255A901306p21146k343824J450079J960209k620825K975097k660507J918518
13247A858907N59236N78026N626125J427219Q337689K2451122R2513235J89658562
13239C23010121j51123074j22720886l1289190j0117971m689895K17757l62457
13232B924405J23555k529377J747127k408240q69216r3719L91376o86051J307347
13223i2793r00549J085633j317888Q54366R69879J294456l961553L008116K760795
13214C700462k518934j094319N031456Q13796N21324O364649P763458K8267087
13206D8848979R5532342J71862272j53448765j13952514k8312664j1268658l421496
13199E839496l005425j012610M46382k155677j055227P14719r03370q56663j87961
$$ plain form
13190 -2176336 -164652 333625 -1719117 -4196330 -1154180 -2128453 -2630645 -1026807 -1096310
13181 -1096310 -3063862 303132 -2277467 -352776 -1525602 -2111404 -44065 -3093684
13173 -3093684 -1246667 -4550522 -2566429 -1959489 -407868 -1614575 -1830621 -3277654
13165 -3277654 170899 -1398760 -697511 -1909789 1399298 -2075965 1351448 -1702152
13157 -1702152 -491953 253087 -1916467 2048450 8127825 3058833 177369 -3076140
13149 -3076140 -4104554 1136325 -397350 -738206 113145 -202889 -1744987 1028802 -2549309
13140 -2549309 -4182229 -2527646 -1765007 -1052639 -1949884 -2684421 -1225805 -1794631 773889
13131 773889 -1670899 918379 -2161652 -1583398 -2018778 -1895106 -2102680 -2500520 -178145
$$ packed form
13190b176336K011684M98277k052742k477213L042150r74273n02192J603838o9503
13181a096310j967552L366994k580599J924691j172826n85802K067339l049619
13173c093684J847017l303855J984093O06940J551621j206707k16046j447033
13165c277654L448553j569659P01249j212278L309087l475263L427413l053600
13157a702152J210199P45040k169554L964917O079375n068992k881464l253509
13149c076140j028414N240879j533675l40856Q51351l16034j542098K773789l578111
13140b549309j632920J654583P62639P12368q97245p34537J458616n68826K568520
13131G73889k444788K589278l080031N78254m35380J23672k07574l97840K322375
$$ plain form
13122 -178145 -311708 -79507 -2514079 250368 -3586418 -784350 759276 -3150348 -1481196
13113 -1481196 -1409100 195418 -2098172 -786660 551449 -1116245 -3027702 -1927488
13105 -1927488 -1959556 -1550277 -2297868 -1956895 -4407211 -566144 -2613203 -1186448 -2162111
13096 -2162111 -1427498 -2855827 -937786 -55789 -3960082 -2482519 -2900915 -2930490 -2468154
13087 -2468154 -2180306 -402171 -3287137 -2458283 -1741866 -2421507 -431370 -2477929 -438276
13078 -438276 -1363265 -1892445 -3388161 858392 -2007562 563416 -2905398 -1799101 -998093
13069 -998093 -1050894 209674 -2694974 -4869719 -2946775 -2356193 -693625 -2651994 -1965162
13060 -1965162 -1775498 393068 -474775 -943019 -22844 -486200 -490261 -189109 -387955 -151795
$$ packed form
13122a78145j33563K32201k434572K764447l836786K802068J543626l909624J669152
13113a481196P2096J604518k293590J311512J338109j667694j911457J100214
13105a927488l2068M09279p47591L40973k450316L841067k047059J426755r75663
13096b162111P34613j428329J918041Q81997l904293J477563m18396k9575M62336
13087b468154K87848J778135k884966Q28854P16417o79641J990137k046559K039653
13078d38276r24989n29180j495716M246553k865954K570978l468814J106297Q01008
13069i98093n2801J260568k904648k174745J922944N90582J662568j958369O86832
13060a965162J89664K168566q67843m68244R20175m63356m061L01152j98846K36160
$$ plain form
13050 -151795 -1080046 -3556872 -1740178 -2014979 -2160318 -2236816 1508306 254182 -476850
13041 -476850 -2304988 -959947 -751761 -1978543 -1694500 -1778250 -3862569 -2974159 -178692
13032 -178692 13758 -2553553 -894051 -1308684 -1603769 -2457180 342128 -1576523 392473
13023 392473 -1925112 -371104 -1186698 -1665133 -2103918 -2938483 -1501543 496292 -1342389
13014 -1342389 -1196202 -1990186 -1339816 585151 -1579396 -693375 -2043805 -2247545 -760320
13005 -760320 -2780942 -722707 -270649 -1949864 -794103 -2067669 -1046418 -455272 -891895
12996 -891895 -553557 -241247 -2108661 -714843 -2686136 507680 -2290363 -1973372 261418
12987 261418 -869996 -2644180 -2753342 -679263 -2616897 -1870424 -3019128 -1315309 -1722044
$$ packed form
13050a51795r28251k476826J816694k74801j45339p6498L745122j254124p31032
13041d76850j828138J345041K08186j226782K84043q3750k084319Q88410K795467
13032a78692J92450k567311J659502m14633k95085q53411K799308j918651J968996
13023C92473k317585J554008q15594m78435m38785q34565J436940J997835j838681
13014a342389J46187p93984O50370J924967k164547Q86021j350430k03740J487225
13005g60320k020622K058235M52058j679215J155761j273566J021251N91146m36623
12996h91895L38338L12310j867414J393818j971293L193816k798043L16991K234790
12987B61418j131414j774184j09162K074079j937634P46473j148704J703819m06735
$$ plain form
12978 -1722044 -670166 -1193591 -1756539 -2376770 -1366076 -3807616 -2065345 -3636777 751379
12969 751379 -1598516 -1783104 -1212323 -1009220 -1589954 -1116097 -444042 -1945932 -407034
12960 -407034 -1223037 -1200323 -1018541 308983 -1733470 -4150730 -3398500 -2487341 -3299240
12951 -3299240 -951646 -3174672 -2355919 -1617272 -1548546 -2270144 -637910 -2310960 -1304203
12942 -1304203 -2349456 -1721335 -2308982 -2739495 -483623 -3822514 -2335382 -534876 -2605547
12933 -2605547 -3748360 -2358398 -3457619 -102584 360009 -825918 -2944700 -2527936
12925 -2527936 -1984744 -220004 -3928169 769751 -999173 684584 -3416401 903692
12917 903692 -1904986 -2310054 -1655391 -1609463 -3682924 -2114998 -1284518 -2210557 -4097606
$$ packed form
12978a722044J051878n23425n62948o20231J010694k441540J742271j571432M388156
12969G51379k349895j84588N70781K03103n80734M73857O72055j501890J538898
12960d07034q16003K2714J81782J327524k042453k417260P52230R11159q11899
12951c299240K347594k223026Q18753P38647O8726p21598J632234j673050J006757
12942a304203j045253O28121n87647m30513K255872l338891J487132J800506k070671
12933b605547j142813J389962j099221L355035M62593j185927k118782M16764
12925b527936N43192J764740l708165M697920j768924J683757m100985M320093
12917I03692k808678m05068O54663M5928k073461J567926Q30480r26039j887049
$$ plain form
12908 -4097606 -514643 418267 -2713552 -1090736 -2942675 -661085 -1234616 -1699044 -1916466
12899 -1916466 -3454648 -3060409 1035351 19426 315765 -967754 68468 388377 -863196
12890 -863196 -1371865 -3525122 -87904 -2560540 -1425082 -1219445 -2792406 -1856861 -1470896
12881 -1470896 -615260 -2366933 -2117046 -1320830 2101894 400616 -1219519 -2030277 -1487275
12872 -1487275 -721292 -1222244 766775 -4062898 -2155674 177846 -134409 -3503396 -687361
12863 -687361 -781030 151114 -2858443 -2066128 607090 -3028984 -2203591 -2759386 -1435166
12854 -1435166 -3044222 -851272 -1402525 -3179873 -2304998 -859904 -475547 -1049138 -3170432
12845 -3170432 -3738465 -527752 -786244 -4045702 -3574158 -2829716 -1914215 -733466 -2305487
$$ packed form
12908d097606L582963R32910l131819J622816j851939K281590n73531m64428k17422
12899a916466j538182L94239M095760j015925K96339j283519J036222L19909j251573
12890h63196n08669k153257L437218k472636J135458K05637j572961R35545L85965
12881a470896Q55636j751673K49887P96216L422724j701278j620135q10758N43002
12872a487275P65983n00952J989019m829673J907224K333520l12255l368987K816035
12863f87361r3669R32144l009557P92315K673218l636074Q25393n55795J324220
12854a435166j609056K192950n51253j777348Q74875J445094L84357n73591k121294
12845c170432n68033L210713k58492l259458M71544P44442R15501J180749j572021
$$ plain form
12836 -2305487 181198 -1275970 -1675778 -2845654 -67067 -174651 -1392134 -2396321
12828 -2396321 -199978 251577 -657237 -1776152 657497 -2013181 -783478 -1777124 -1525455
12819 -1525455 -1489045 -1917607 660179 276318 -2223935 -1759798 521917 1042579 -605006
12810 -605006 -1703905 -3019526 -151509 -1838309 -407853 -1680843 558734 -1072745
12802 -1072745 -1169454 -2363209 -52031 64431 -4849994 -2622344 -573952 -618512 -1181748
12793 -1181748 -2036096 -1868666 -3610543 -2418866 16994 -440608 -4221997 -371240 -1550698
12784 -1550698 -1434903 -1604171 -2034407 -4330173 -1706467 -359715 -1653009 -2443284 -810960
12775 -810960 -2068485 -1862747 -2072014 -1443669 -1019848 122706 -1050030 -1043939 -947805 -2842798
$$ packed form
12836b305487K486685j457168l99808j169876K778587j07584j217483j004187
12828b396321K196343M51555r08814j118915K433649k670678J229703r93646K51669
12819a525455L6410m28562K577786l83861k500253M64137K281715N20662j647585
12810f05006j098899j315621K868017j686800J430456j272990K239577j631479
12802a072745r6709j193755K311178J16462m914425K227650K048392m4560n63236
12793a181748q54348J67430j741877J191677K435860m57602l781389L850757j179458
12784a550698J15795j69268m30236k295766K623706J346752j293294p90275J632324
12775h10960j257525K05738k09267O28345M23821J142554j172736O091R6134j894993
$$ plain form
12765 -2842798 -3202575 -736880 -2801521 399598 -2065003 -4092545 658672 -946135
12757 -946135 -1231058 -776509 -1143108 -564446 -2692912 -1759172 -2981059 -469067 -2368324
12748 -2368324 -637584 -2446904 -1573196 -1715826 -1922432 -531205 -1751075 -3296950 793987
12739 793987 -3526269 -2523971 -1348655 -3424313 -5225759 -2033333 -498646 -4062544
12731 -4062544 -1024336 -2117454 -2215366 -657926 -2950298 -2429902 153231 -114737 -4087988
12722 -4087988 -888765 -955091 854137 -578742 -666048 -1324715 -3071143 -364738 60435
12713 60435 -3284735 -1242478 -309672 -922470 -2678859 1050140 -1591786 -3845352 -1721960
12704 -1721960 -2078135 -2872434 -1370372 420550 -1017258 -1880296 -425161 59989 -928664
$$ packed form
12765b842798l59777K465695k064641L201119k464601k027542M751217j604807
12757i46135k84923M54549l66599N78662k128466R33740j221887K511992j899257
12748b368324J730740j809320Q73708j42630k06606J391227j219870j545875M090937
12739G93987m320256J002298J175316k075658j801446L192426J534687l563898
12731d062544L038208j093118r7912J557440k292372N20396K583133k67968l973251
12722d087988L199223o6326J809228j432879q7306o58667j746428K706405M25173
12713F0435l345170K042257R32806o12798j756389L728999k641926k253566K123392
12704a721960l56175p94299J502062J790922j437808q63038J455135M85150r88653
$$ plain form
12695 -928664 -3055268 -3329540 -125423 -1453560 -1320246 -359761 -2517615 -1053623 -339525
12686 -339525 -1060438 -312688 -2074173 -875768 -636651 -1564737 123972 -1519562 -2175005
12677 -2175005 -1464945 -1491360 -1976698 -2662494 -954842 -2922556 -3366663 -797241 -698849
12668 -698849 -1583887 -1936332 -1935745 -500337 2082010 -4242970 -2586590 -281648 -3375223
12659 -3375223 2993738 -1422925 -2162778 -2004033 -3029337 -1070501 -1177875 -2119087 -3285407
12650 -3285407 -2110870 -2178446 -1672510 -191884 -1911285 -3155311 -1012828 -1817493 -885280
12641 -885280 -770430 -763382 -2390690 -3097000 -3999136 -2003345 -1174281 -807069 -396229 -885458
12631 -885458 -1303222 -1712385 -941740 -2126522 -2031631 -86174 -864954 -1308648 -1826167
$$ packed form
12695i28664k126604k74272L204117j328137J33314R60485k157854J463992P14098
12686c39525p20913P47750j761485J198405K39117r28086J688709j643534o55443
12677b175005P10060k6415m85338o85796J707652j967714m44107K569422R8392
12668f98849q85038l52445N87J435408K582347o324980J656380K304942l093575
12659c375223O368961m416663p39853J58745j025304J958836j07374r41212j166320
12650c285407J174537o7576N05936J480626j719401j244026K142483q04665R32213
12641h85280J14850P048j627308p06310r02136J995791Q29064L67212M10840m89229
12631h85458m17764m09163P70645j184782R4891J945457p78780m43694n17519
$$ plain form
12622 -1826167 -2613119 -2097499 -1438445 -529230 -2655106 -1958798 -1854187 -2171437 -1732314
12613 -1732314 -1088910 -455907 -1522494 -2495318 -1012073 -868247 -496706 -1164019 665566
12604 665566 -1569453 -3421976 -1057994 -634505 -2696214 -2661604 -765761 -2653949 -1085281
12595 -1085281 -3007393 -2654243 -2540331 -3428116 -888235 -1498701 -1034780 552605 -710865
12586 -710865 724870 -621439 71415 1161422 -1616137 -2175316 -2735640 -3740464 -1996456
12577 -1996456 -3458700 -2125641 -1930680 -1281153 -155585 -2137397 -934433 -492989 -3035482
12568 -3035482 -1299874 -2462558 -4522 -2782031 -831145 -2289587 -193070 -3850710
12560 -3850710 -708410 -2495587 -682439 -1898712 -1426553 -886361 -525893 -1568505 -2944472
$$ packed form
12622a826167p86952N15620O59054R09215k125876O96308J04611l17250M39123
12613a732314O43404O33003j066587r72824J483245J43826L71541o67313J829585
12604F65566k235019j852523K363982M23489k061709L4610J895843j888188J568668
12595a085281j922112L53150J13912q87785K539881o10466M63921J587385j263470
12586g10865J435735j346309O92854J090007k777559n59179n60324j004824J744008
12577a996456j462244J333059J94961O49527J125568j981812J202964M41444k542493
12568c035482J735608j162684K458036k777509J950886j458442K096517l657640
12560c850710L142300j787177J813148j216273M72159N40192L60468j042612j375967
$$ plain form
12551 -2944472 -1279238 -1636057 -436431 -168171 -1890058 -617341 -3715895 -2598108
12543 -2598108 764626 -3066714 386321 815888 1903704 -1033979 1850468 -1682340
12535 -1682340 690898 -3279693 -645100 -921699 -5347288 -2641329 -2951149 -33089
12527 -33089 -1192644 -2131533 -669964 -72796 -952524 -1917605 -1272438 -2454014 718757
12518 718757 -943321 -2737630 -2493146 -800029 -1676814 -768575 -2275592 259129 -4322116
12509 -4322116 -4958788 -2295939 -151478 -2026057 -1962920 -766185 -243027 -3091951 -2155752
12500 -2155752 -213677 -1790373 -860402 -2119085 -377920 -1047572 -1717020 448085 -1169560
12491 -1169560 -874415 -1458789 -2564522 -3334808 -2308636 -945310 -1370477 -4475505 -2293225
$$ packed form
12551b944472J665234l56819J199626K68260j721887J272717l098554J117787
12543b598108L362734l831340L453035M29567J087816k937683K884447l532808
12535a682340K373238l970591K634593k76599m425589K705959l09820K918060
12527c3089j159555r38889J461569N97168q79728r65081O45167j181576L172771
12518G18757j662078j794309K44484J693117q76785R08239j507017K534721m581245
12509d322116o36672K662849K144461j874579O3137J196735N23158k848924R36199
12500b155752J942075j576696R29971j258683J741165o69652o69448K165105j617645
12491a169560K95145n84374j105733p70286J026172J363326m25167l105028K182280
$$ plain form
12482 -2293225 -1414196 -1215706 -1433085 -1394632 -3161098 -21852 -1193794 -1185337 -897007
12473 -897007 -2452935 -1110106 -515864 -3622664 147037 -1479332 -1873889 -2370008 -2216251
12464 -2216251 -642062 -2802495 489389 -1579597 -2831928 -280170 -336536 -1926450
12456 -1926450 -1875238 -4046344 -1813388 -534961 -957255 -256577 -1596166 -3419110 256409
12447 256409 -2027966 -1328543 101035 -1656728 -1912448 -1346785 -573744 -3774400 363047
12438 363047 -3984284 -1755265 -509164 -2077347 -2830641 -3254331 -966610 -1934310 -2608703
12429 -2608703 -3498564 -1572849 -278503 -1629200 52242 -1334963 -633148 -884986 913753
12420 913753 -1687922 -1256714 472905 -2682578 -1154519 -1347235 -263164 -895135 -1337341
$$ packed form
12482b293225Q79029J98490k17379L8453j766466L139246j171942Q457K88330
12473h97007j555928J342829N94242l106800L769701j626369l94557m96119J53757
12464b216251J574189k160433L291884k068986j252331K551758n6366j589914
12456a926450N1212k171106K232956J278427m22294P00678j339589j822944L675519
12447B56409k284375O99423J429578j757763k55720N65663P73041l200656M137447
12438C63047m347331K229019J246101j568183p53294m23690K287721r67700o74393
12429b608703q89861J925715J294346j350697J681442j387205P01815k51838J798739
12420I13753k601675M31208J729619l155483J528059j92716J084071o31971m42206
$$ plain form
12411 -1337341 -2424935 -1868050 -1828318 -3745154 1340506 -1424634 1107004 714997 -37837
12402 -37837 -3073186 -1835708 -1145291 -1601235 -1888436 -1270081 -471621 -2563762 -169034
12393 -169034 -325771 -2650743 369655 -2471307 -342210 -1114675 -500296 -1645307 -1757470
12384 -1757470 -3187401 620081 -2716461 -892124 -1988031 -3063686 122633 -1306415
12376 -1306415 -94167 -2181165 -105002 138298 -955195 -4074716 -969353 1051554
12368 1051554 -1685637 -1348738 -2541824 -1681308 -7291 -3464471 -3167785 1459043 -1409995
12359 -1409995 -1649509 -2513780 -1250986 -3609615 -3557819 1137118 -4434468 -1661594 691876
12350 691876 -2643137 -994440 -2542380 -1359548 -2563525 -1335806 -629139 -1858334
$$ packed form
12411a337341j087594N56885L9732j916836N085660k765140K531638l92007p52834
12402c7837l035349J237478O90417m55944k87201O18355P98460k092141K394728
12393a69034j56737k324972L020398k840962K129097p72465O14379j145011j12163
12384a757470j429931L807482l336542J824337j095907j075655L186319j429048
12376a306415J212248k086998K076163K43300j093493l119521L105363K020907
12368A051554k737191L36899j193086Q60516J674017l457180K96686M626828k869038
12359a409995k39514q64271J262794k358629N1796M694937n571586K772874K353470
12350F91876l335013J648697j547940J182832j203977J227719P06667j229195
$$ plain form
12342 -1858334 -3008722 -1920345 -642514 -1387677 -1592441 -1750579 -1021793 -2876049 -1220801
12333 -1220801 -2052585 -1618442 -1555831 -496017 -1563802 -1206761 107569 -113910 -735813
12324 -735813 -321137 -2610168 -72150 -2021662 478662 -1080691 -1513338 -1377951 -241808
12315 -241808 -2476380 -350561 -371684 -2114898 -2679286 -2341071 -1414340 -3621458 -1917543
12306 -1917543 -431993 -1246023 -1360525 -3318694 -2659069 -2348881 -887067 -3891114 -3797662
12297 -3797662 -709918 -3300603 -741158 -661306 -2286155 -2261823 -4412062 -381061 -1878960
12288 -1878960 469442 -1115383 -2099982 -1480372 266082 -291607 -2094276 -1594938 -2033187
12279 -2033187 -1912449 -1793475 -1226339 -3741679 -2315408 -1631291 -1929979 -1588377 -1912855
$$ packed form
12342a858334j150388J088377J277831p45163k04764j58138P28786j854256J655248
12333a220801q31784M34143O2611J059814j067785L57041J314330k21479o21903
12324g35813M14676k289031K538018j949512K500324j559353m32647J35387J136143
12315b41808k234572K125819k1123j743214n64388L38215R26731k207118J703915
12306a917543J485550q14030j14502j958169O59625L10188J461814l004047R3452
12297c797662L087744k590685K559445P9852j624849K4332k150239M031001j497899
12288a878960K348402j584825r84599O19610J746454n57689j802669M99338m38249
12279b033187J20738J18974N67136k515340J426271O84117k98688L41602l24478
$$ plain form
12270 -1912855 -1016485 889564 -924215 -1307656 -1213493 -1474841 -2183097 -2181033 -224182
12261 -224182 -1651951 -412088 -2642676 -2741392 -1030442 -1871112 -666727 -1116720 -1037611
12252 -1037611 -2026900 -1816603 1127830 -2533636 -1820596 719621 -2178205 -738395 -907660
12243 -907660 -3527478 -3170394 313223 -3343142 133359 -480914 -2051690 -460375 610312
12234 610312 -354268 -815762 -204491 -1921161 383425 -2639810 112087 -2863939 -1810353
12225 -1810353 -2445320 582776 -1707899 416700 -253523 -1352385 -139770 -2643823
12217 -2643823 -1628468 -2643619 -1714769 -2398979 -1593024 -3892949 -2988425 -2116101 -2558704
12208 -2558704 -2959982 -2616135 -2135996 -602956 -1890878 -1870754 -751379 -1720160 322067
$$ packed form
12270a912855Q96370J906049j813779l83441R4163k61348p08256K064J956851
12261b24182j427769J239863k230588r8716J710950q40670J204385m49993P9109
12252a037611r89289K10297K944433l661466P13040K540217k897826J439810j69265
12243i07660k619818L57084L483617l656365L476501o14273j570776J591315J070687
12234F10312r64580m61494O11271j716670K304586l023235K751897k976026J053586
12225a810353o34967L028096k290675K124599o70223j098862J212615k504053
12217b643823J015355j015151R28850o84210Q05955k299925R04524Q72324m42603
12208b558704m01278L43847M80139J533040j287922K0124J119375r68781K042227
$$ plain form
12199 322067 -702302 -375535 -825507 -1601415 -3528239 1544577 -747814 24455 -63748
12190 -63748 97525 -2547420 304437 -939812 -1530062 -1227702 -1529246 -446924 -1742217
12181 -1742217 -492623 -155799 -1888117 755989 -1304046 1045159 305134 -1746863
12173 -1746863 -5165206 -1893103 -2008979 -2412208 -944320 325967 -1094958 -1083371 -953176
12164 -953176 -1875364 -1807943 -1407408 -1621535 -1833543 -1564742 145029 -2182974 -734649
12155 -734649 -2981718 -1496877 -1245064 -1722096 -1556796 -2460949 -1133674 -2748294 -878397
12146 -878397 -856495 -642659 -780566 -1421784 -1934076 817462 -1921019 -614387 -2658917
12137 -2658917 -2536930 546285 2105994 -1217016 863459 -2705196 337855 -1937550
$$ packed form
12199C22067j024369L26767m49972p75908j926824N072816k292391P72269q8203
12190f3748J61273k644945K851857j244249n90250L02360l01544J082322j295293
12181a742217J249594L36824j732318K644106k060035K349205p40025k051997
12173a746863l418343L272103j15876m03229J467888J270287j420925J1587J30195
12164i53176r22188O7421M00535k14127k12008K68801J709771k328003J448325
12155g34649k247069J484841K51813m77032J65300r04153J327275j614620J869897
12146h78397K1902K13836j37907o41218n12292K751538k738481J306632k044530
12137b658917J21987L083215J559709l323010K080475l568655L043051k275405
$$ plain form
12129 -1937550 -4424287 -3322691 -3368228 -2240512 -4089634 -2543431 -526673 -1651356
12121 -1651356 -2185883 -2290078 -2876013 751605 -2957863 -1572578 -572685 -1704562 -2722700
12112 -2722700 -3568479 -238568 -1919772 -88669 160670 -890393 -391701 -305395 -283703
12103 -283703 -2754148 -352179 -2592511 -1429830 -1974095 -480310 -2708737 -869749
12095 -869749 432429 2511 -3498627 988033 -1973145 -2341297 -498133 -2400717 -1676438
12086 -1676438 -3433175 -1505071 -1223419 -2827259 -1302307 -1555649 -1383662 -1314035 -1823985
12077 -1823985 -1463376 -200247 -2197493 -1105979 -978769 -1673183 -1422745 851055 -601267
12068 -601267 1209806 -917743 624102 -390258 -579759 -1732791 -1973675 -1056958 -400999
$$ packed form
12129a937550k486737J101596m5537J127716j849122J546203K016758j124683
12121a651356n34527j04195n85935L627618l709468J385285R99893j131877j018138
12112b722700q45779L329911j681204J831103K49339j051063M98692Q6306K1692
12103b83703k470445K401969k240332J162681n44265J493785k228427J838988
12095h69749J302178m29918l501138M486660k961178l68152J843164j902584P24279
12086a676438j756737J928104K81652j603840J524952k53342J71987O9627n09950
12077a823985L60609J263129j997246J091514J27210o94414K50438K273800j452322
12068f01267J811073k127549J541845j014360j89501j153032k40884R16717O55959
$$ plain form
12059 -400999 -2671296 -875216 -891313 -2127470 -64680 -2145013 -582990 -4186381 -2028717
12050 -2028717 -15478 -624108 -4041914 -405444 -1092648 -1618243 -4080668 -978798 -2679432
12041 -2679432 -1953148 -1762577 -1602712 827838 -2167277 -2231666 -3627818 -2392451 -141147
12032 -141147 486419 -1728161 -2007270 -1229967 -1450410 -1716137 -2494948 -1070261 -1799649
12023 -1799649 -893412 86123 232554 -1420772 -2189504 -3416864 786889 -3392552 -2137167
12014 -2137167 -1257821 -1641593 -1673475 -1491090 -1104057 -586662 -1391646 -2852998 -118478
12005 -118478 -2501593 -1245837 612073 -2209437 -2366540 -2055300 -2729955 -278840 -2768088
11996 -2768088 -70828 -2996213 -1560375 -3634378 -1628436 -2537732 1061290 -3283437
$$ packed form
12059d00999k270297J796080j6097j236157K062790k080333J562023l603391K157664
12050b028717K013239o08630l417806L636470o87204n25595k462425L101870j700634
12041b679432P26284J90571J59865K430550k995115o4389j396152J235367K251304
12032a41147O27566k214580k79109P77303k20443k65727p78811J424687p29388
12023a799649R06237R79535J46431j653326p68732j227360M203753m179441J255385
12014b137167Q79346l83772l1882J82385L87033N17395q04984j461352K734520
12005a18478k383115J255756J857910k821510j57103L11240o74655K451115k489248
11996b768088K697260k925385J435838k074003K005942r09296L599022m344727
$$ plain form
11988 -3283437 -1629796 444129 -1813638 -1427437 -2704622 -3907261 -2741930 -2098984
11980 -2098984 -857346 -1938392 325637 -1023721 -1529329 -2667380 -3787708 -1123763
11972 -1123763 -2679691 -749983 -1566094 -1288452 -3206309 -2404394 -2358791 -322274 -1196547
11963 -1196547 -427378 -313699 -1543999 1371044 -1369108 -52658 -2592221 -1056289
11955 -1056289 -2635458 -1019936 -886066 -368580 -1417210 388709 -937275 -1385821 -121970
11946 -121970 -2378184 -3572789 652239 -1458668 -1765501 -2035907 -1838077 -166066 -1448273
11937 -1448273 -3951322 -446654 -3813 -2371385 -1088484 496338 -1830913 -2065916
11929 -2065916 -2678122 -958040 -56239 -1613327 -1738845 -1873568 -900881 -300195 -1752303
$$ packed form
11988c283437J653641K073925k257767L86201j277185j202639J165331O42946
11980b098984J241638j081046K264029j349358n05608j138051j120328K663945
11972a123763j555928J929708q16111K77642j917857Q01915M5603K036517q74273
11963a196547P69169J13679j230300K915043k740152J316450k539563J535932
11955a056289j579169J615522J33870N17486j048630J805919j325984m48546J263851
11946a21970k256214j194605M225028k110907l06833k70406J97830J672011j282207
11937a448273k503049L504668M42841k367572J282901J584822k327251k35003
11929b065916o12206J720082R01801j557088j25518j34723R72687O00686j452108
$$ plain form
11920 -1752303 -2723024 -2414047 -1195077 -1162889 -2268148 385323 -612491 -1151432 -2771431
11911 -2771431 473915 -1900288 -1738411 -1820243 -2896092 -2892322 932669 -2227483 -964594
11902 -964594 -3944570 -1745294 -1718374 -3320158 -2864740 -2549122 -2037520 -1108652 622067
11893 622067 -672063 -2773071 5498 -1808973 -2816899 -1233391 -3154271 -1200444
11885 -1200444 -4359246 -528134 -1903030 -763246 -747888 -1978483 -837140 -3079481
11877 -3079481 -1193556 -4197957 -1349004 -2632826 -1719395 -2456736 -3700485 1041762
11869 1041762 -2667955 -1751215 -739237 39121 -1823095 -2393306 -1414492 -2006371 276619
11860 276619 -2674337 -2803435 741696 -2547116 -2864813 -869029 -548556 -3505755 -2477092
$$ packed form
11920a752303r70721L08977J218970L2188j105259K653471r97814n38941j619999
11911b771431L245346k374203J61877q1832j075849L770L824991l160152J262889
11902i64594k979976K199276K6920j601784M55418L15618N11602R28868J730719
11893F22067j294130k101008K778569j814471j007926J583508j920880J953827
11885a200444l158802L831112j374896J139784J5358j230595J141343k242341
11877c079481J885925l004401K848953j283822R13431p37341j243749M742247
11869A041762l709717R16740J011978P78358j862216n70211R78814n91879K282990
11860B76619k950956j29098L545131l288812l17697J995784L20473k957199J028663
$$ plain form
11851 -2477092 -2199155 -2548410 -3321620 -2601058 -1320276 -1405051 -2746897 -20076 -157351
11842 -157351 -1844544 -224087 -2576648 -2031908 -1202438 -2593657 -1779866 -3320882 -2897890
11833 -2897890 -1598603 1126694 -1457248 -2685102 -3599892 -2285587 -751946 -1869773
11825 -1869773 -1203233 -1770181 -3558435 -2890254 -2135160 -2391189 -3144789 -1976211 -1208184
11816 -1208184 -2180655 -934513 -380254 149579 -2528219 -1645232 -1490259 -1401734 -2870834
11807 -2870834 -724 -2375390 -2206317 -766948 -582584 -2542728 -2420044 -624537 -1529483
11798 -1529483 -1120664 -660426 -186520 -859938 -2741387 -1467333 -1947427 235323 -2184586
11789 -2184586 45209 -2584785 -1431179 -1972224 -1222372 -553424 -765191 -809447 -2562786
$$ packed form
11851b477092K77937l49255p73210P20562J280782q4775j341846K726821j37275
11842a57351j687193J620457k352561N44740Q29470j391219Q13791j541016M22992
11833b897890J299287K725297k583942j227854r14790J314305J533641j117827
11825a869773O66540n66948j788254O68181P55094k56029p53600J168578P68027
11816a208184r72471J246142N54259N29833k677798Q82987J54973Q8525j469100
11807b870834K870110k374666J69073J439369J84364j960144J22684J795507r04946
11798a529483M08819M60238M73906o73418j881449J274054m80094K182750k419909
11789b184586K229795k629994J153606n41045P49852O68948k11767m4256j753339
$$ plain form
11780 -2562786 -2115839 -1681873 -2086617 -1729334 -2545947 -3075399 -3438953 -1711843 -940325
11771 -940325 -690476 -2868310 -2288510 -1571982 -5582373 -1121001 -155447 352334 -736408
11762 -736408 -525536 -681823 -519738 -1845945 -1964127 -2676498 -963325 -397352 -1398710
11753 -1398710 -2372289 200307 -2611631 -2703228 -2466482 -2969942 -3000050 -1733166 -406178
11744 -406178 -686292 -191646 -1893230 -1726956 -3164665 -1212621 -399543 -106340 -1003542
11735 -1003542 -2324156 -2311569 -850823 -1852336 -2955240 -909812 -2047867 -2983069 -1176458
11726 -1176458 -445930 -1786315 -422444 -491310 -830418 -1937959 -2215029 -4894531 -1664691
11717 -1664691 -1981466 389029 367499 -1006685 -3740645 -523810 -90524 -1675660 -124157
$$ packed form
11780b562786M46947M33966m04744L57283q16613n29452l63554J727110P71518
11771i40325K49849k177834N79800P16528m010391M461372R65554N07781j088742
11762g36408K10872j56287J62085j326207j18182p12371J713173N65973j001358
11753a398710r73579K572596k811938r1597K36746n03460l0108J266884J326988
11744d06178k80114M94646j701584J66274j437709J952044Q13078K93203q97202
11735a003542j320614J2587J460746j001513j102904K045428j138055r35202J806611
11726a176458P30528j340385J363871o8866l39108j107541k77070k679502L229840
11717a664691l16775K370495k1530j374184k733960L216835M33286j585136J551503
$$ plain form
11708 -124157 -581839 -2715936 -2524974 -277372 -2513828 -1912488 -1232343 -1458305 -615669
11699 -615669 -3515076 -1046862 -874838 -1869050 -3512372 -1581874 -2817859 -2882521 -163351
11690 -163351 -3394859 -2185258 -1216401 -2112720 -585517 326548 -2334246 -2471428 -4964414
11681 -4964414 -3606455 553183 -3595862 540 -1266780 -790911 -2764552 -1621441
11673 -1621441 -2289522 -2647904 -1179501 383790 -1703120 -2773050 -368572 -811157 -1941956
11664 -1941956 -1108697 -1650511 127878 -2098184 -9273 -3521518 -266814 -974388 -2657458
11655 -2657458 -3678487 -3223028 728919 13134289 47247285 20285419 4987652 12728239
11647 12728239 106050314 185105408 54925644 15737979 43082723 230778044 237207951
$$ packed form
11708a24157m57682k134097J90962K247602k236456O01340O80145k25962Q42636
11699f15669k899407K468214J72024r94212j643322J930498j235985o4662K719170
11690a63351l231508J209601R68857q96319J527203R12065k660794j37182k492986
11681d964414J357959M159638m149045L596402j267320M75869j973641J143111
11673a621441o68081l58382J468403J563291k086910j069930K404478m42585j130799
11664a941956Q33259n41814J778389k226062K088911l512245L254704p07574j683070
11655b657458j021029M55459L951947J2405370L4112996k6961866j5297767P740587
11647A2728239R3322075P9055094j30179764l9187665K7344744J87695321O429907
$$ plain form
11640 237207951 48459938 16324016 54130763 185133760 114588936 17236047 7232568
11633 7232568 24331757 53153272 19159993 1458598 1147404 1240610 -935331 651893
11625 651893 1505357 2168297 -190292 -728899 1188477 3193924 -434206 -1741306 1769087
11616 1769087 69721 2694636 -1366901 266431 -1053527 110416 -746639 -918812
11608 -918812 -1009627 779595 1733149 869324 -4606 -1644367 1151127 -762188 -872116
11599 -872116 -2982069 -1637751 -1601876 -1852469 -3717899 -1589152 -15869 -1115626 265794
11590 265794 -1339712 688904 1636147 10000 -494809 -1048751 -1077235 -1413484 -585460
11581 -585460 -2686212 -3352707 -1243231 -2015418 -386783 738766 255705 160176 641959
$$ packed form
11640B37207951j88748013l2135922L7806747J31002997p0544824r7352889j0003479
11633G232568J7099189K8821515l3993279j7701395l11194R3206k175941J587224
11625F51893Q53464O62940k358589n38607J917376K005447l628130j307100L510393
11616A769087j699366K624915m061537J633332j319958J163943q57055j72173
11608i18812r0815J789222R53554q63825q73930j639761K795494j913315j09928
11599h72116k109953J344318L5875k50593j865430K128747J573283j099757J381420
11590B65794j605506K028616R47243j626147n04809n53942k8484l36249Q28024
11581e85460k100752o66495K109476p72187J628635J125549m83061r5529M81783
$$ plain form
11572 641959 -2161313 -1721456 -1317431 -1095975 -1181146 -1779954 433994 -285697 -180362
11563 -180362 -81407 -3022211 -3022386 -150618 399257 -1453364 -476461 -1475416 476161 -1620278
11553 -1620278 -1744970 881036 -2788317 -2275228 -492371 -2445592 -2437055 -2010288 -997392
11544 -997392 716238 -2639624 -2814639 90255 -2777022 -2594833 -1240230 131133 -1300769
11535 -1300769 267186 92583 -3176786 -2485717 -2292248 969159 180400 -3573242 -2530374
11526 -2530374 248806 -352162 -715941 -1441724 -4173521 -2817419 -184682 -900481 -1303582
11517 -1303582 143115 -458689 -948533 985789 -1712340 -1000465 -2726275 -2279280 1225957
11508 1225957 547993 -245277 708681 -884369 266015 657543 -343509 -843854 -478782
$$ packed form
11572F41959k803272M39857M04025K21456q5171n98808K213948p19691J05335
11563a80362R8955k940804j75K871768N49875j852621R76903r98955J951577k096439
11553a620278j24692K626006l669353N13089J782857j953221Q537M26767J012896
11544i97392J713630l355862j75015K904894k867277J82189J354603J371363j431902
11535a300769J567955j74603l269369O91069J93469L261407p88759l753642J042868
11526b530374K779180o00968l63779p25783k731797J356102K632737p15799m03101
11517a303582J446697o01804m89844J934322k698129P11875j725810M46995L505237
11508A225957o77964p93270R53958j593050J150384L91528j001052n00345L65072
$$ plain form
11499 -478782 -2372172 2508009 -78817 721762 -352881 2074264 8132768 54463473
11491 54463473 85736353 21009790 11837424 63586514 308349334 263252127 48487892
11484 48487892 33949086 178703411 526440140 271231763 44505238 38720881 195640445
11477 195640445 350559951 106227561 14965221 16644060 72341370 76745557 9059644
11470 9059644 5544952 -554971 134374 150035 -297848 1367837 1178899 1012085 -2130747
11461 -2130747 -1695548 1092835 -991174 -1926340 -3064410 515718 -29137 -2242331 -936424
11452 -936424 42333 -2523744 1445799 126276 -177047 -2181433 -1829957 -3073183 -256296
11443 -256296 195476 730451 -848117 -27606 -1076829 251159 -682028 -3481201 744019
$$ packed form
11499d78782j893390M880181k586826Q00579j074643K427145O058504M6330705
11491E4463473L1272880o4726563r172366N1749090K44762820m5097207k14764235
11484D8487892j4538806J44754325L47736729k55208377k26726525n784357J56919564
11477A95640445J54919506k44332390r1262340J678839N5697310M404187o7685913
11470I059644l514692o099923O89345J5661m47883J665685j88938j66814l142832
11461b130747M35199K788383k084009r35166j138070L580128n44855k213194J305907
11452i36424R78757k566077L969543j319523l03323k004386L51476j243226K816887
11443b56296M51772N34975j578568Q20511j049223J327988r33187k799173M225220
$$ plain form
11434 744019 -203326 738310 271881 144111 -301623 -1523973 68720 429706 -2898880
11425 -2898880 1671668 -2657241 -1783603 -99457 -3743838 -1096687 -700663 -1105780 -1077759
11416 -1077759 292099 -1019879 149024 -541541 -45606 -1526557 -1886341 1210733 -691241
11407 -691241 -1621624 -1213633 -1565247 -1096085 -137881 -772210 -1094760 -3498742 -1622885
11398 -1622885 -1622123 -814435 -996363 1061325 857283 -618313 -1955291 -405769 385836
11389 385836 -1100097 1481117 -1333060 -3199606 419603 371875 98487 -1944124 -2051242
11380 -2051242 -2508661 -3655946 1624753 -552913 -2717277 -632769 -2736629 -673777
11372 -673777 -502635 -3416289 -1325665 -1315531 154125 -1422273 -344616 -190258 364883
$$ packed form
11434G44019r47345R41636m66429j27770m45734j222350J592693L60986l328586
11425b898880M570548m328909Q73638J684146l644381K647151L96024m05117K8021
11416a077759J369858j311978J168903o90565M95935j480951l59784L097074j901974
11407f91241r30383M07991l51614M69162R58204o34329l22550k403982J875857
11398a622885P62Q07688j81928K057688k04042j475596j336978J549522P91605
11389C85836j485933K581214k814177j866546L619209m7728k73388k042611j07118
11380b051242m57419j147285N280699k177666k164364K084508k103860K062852
11372f73777J71142k913654K090624J0134J469656j576398J077657J54358N55141
$$ plain form
11363 364883 -1167416 -761859 -1874908 1338005 -2534787 -752477 -956668 -1794765 -888018
11354 -888018 -713108 -2700836 975522 -962391 398793 -1879155 736188 148049 -2968078
11345 -2968078 -42600 -2063138 2354795 801760 -2124118 1498280 1701667 761378
11337 761378 -165970 231596 -481098 2150346 11370251 46733276 33439789 9277186
11329 9277186 12549152 79396070 197505715 82316113 18454843 31651473 182903905
11322 182903905 272761734 71877691 15945444 36608981 163529068 147859263 23591976
11315 23591976 2968693 17055032 45058421 21207523 -828507 -3265063 -1254775
11308 -1254775 -2564014 -1317792 -176748 -236179 373559 -1127766 514362 -843907 -398334
$$ packed form
11363C64883j532299M05557j113049L212913l872792J782310k04191q38097R06747
11354h88018J74910j987728L676358j937913J361184k277948K615343n88139l116127
11345b968078K925478k020538M417933j553035k925878L622398K03387r40289
11337G61378r27348L97566p12694K631444R219905L5363025j3293487k4162603
11329I277186L271966O6846918J18109645j15189602o3861270J3196630J51252432
11322A82903905Q9857829k00884043n5932247K0663537J26920087j5669805j24267287
11315B3591976k0623283J4086339K8003389k3850898k2036030k436556K010288
11308a254775j309239J246222J141044n9431O09738j501325J642128j358269M45573
$$ plain form
11299 -398334 -2399551 -2880207 -1295358 -2058466 -1159986 -2704983 -191695 1052600 -1945734
11290 -1945734 -1737420 -549254 -2727841 839316 -1951075 -546486 -1801883 154672
11282 154672 -1791317 -2327319 -890187 -2010749 -600152 -370946 -192604 1330216 -961900
11273 -961900 -2252604 -1104514 -777139 -3117685 676983 -210169 -2399315 -315518 -1871017
11264 -1871017 -1657543 2225161 -1823414 -1365630 -371169 -1699093 -2079518 -1841577 1028188
11255 1028188 -560738 -3989286 -1439582 -1173599 -2987140 -2323315 -2372597 664146 -3967190
11246 -3967190 -1996193 -580974 5631 -1330936 -1782388 -40534 -157014 615478 -2621140
11237 -2621140 -1662087 -61286 -388591 1159317 358874 -1041265 -1335416 -1372359 -1458655
$$ packed form
11299c98334k001217m80656J584849p63108Q98480j544997K513288J244295k998334
11290a945734K08314J188166k178587L567157k790391J404589j255397J956555
11282A54672j945989n36002J437132j120562J410597K29206J78342J522820k292116
11273i61900j290704J148090L27375k340546L794668q87152k189146K083797j555499
11264a871017K13474L882704m048575M57784R94461j327924l80425K37941K869765
11255A028188j588926l428548K549704K65983j813541O63825m9282L036743m631336
11246c967190J970997J415219N86605j336567m51452J741854j16480P72492l236618
11237b621140R59053J600801l27305J547908q00443j400139k94151l6943q6296
$$ plain form
11228 -1458655 -2867535 -1796347 -3643839 -872235 -1423971 -334909 -2161976 -2170852 -1453579
11219 -1453579 -2343941 938547 -2568731 -2018967 -2207488 -2601064 1060113 1088088 -2015957
11210 -2015957 253055 -2258616 -1401756 -3284852 -1080929 -1308622 -1479401 -1905635 -2315497
11201 -2315497 -1275093 -1441411 -2182777 -498869 -2860508 -2274114 404617 -2107353 -2010498
11192 -2010498 -1875200 -2034032 -1088001 -308868 -3595577 -2932370 -3468361 -1866557 -2167563
11183 -2167563 -857014 -1900908 -774450 -1139656 -2907905 291900 -1695145 -2216176
11175 -2216176 -1808488 -884338 -1876663 -183331 -2067992 -797668 -341917 2764743 -3529723
11166 -3529723 173986 857676 -3394734 -642158 -2587524 -2654929 -934642 -1680616 -685555
$$ packed form
11228a458655j408880J071188j847492K771604n51736J089062j827067q876P17273
11219a453579q90362L282488l507278N49764j88521l93576L661177K7975l104045
11210b015957K269012k511671Q56860j883096K203923k27693j70779m26234m09862
11201b315497J040404j66318p41366J683908k361639N86394K678731k511970R6855
11192b010498J35298j58832R46031P79133l286709O63207n35991J601804l01006
11183b167563J310549j043894J126458l65206j768249L199805j987045n21031
11175b216176M07688R24150r92325J693332j884661J270324M55751L106660o294466
11166c529723L703709O83690m252410K752576j945366o7405J720287p45974R95061
$$ plain form
11157 -685555 400618 -2115231 -1505536 -198680 -1247522 -1484996 -208279 -2233573 184918
11148 184918 -195127 -1996841 179462 1626467 -1354065 -960322 66972 -1738843 90896
11139 90896 -1278002 -1520187 801555 -2683562 -67180 -2544851 -2411318 -1418005 -884695
11130 -884695 -1098960 -1508238 -2199288 -2364921 -1805652 -465761 -384947 -1225048 -987394 -1508882
11120 -1508882 -226905 -566144 -1381478 -833002 -2032307 -1453087 -173880 -12952 -858359
11111 -858359 -140205 -2670034 -445258 -2517252 -1129580 1079718 -603600 -699943 -311792
11102 -311792 -547585 -1399698 -1820970 -1178940 -2170947 -1412359 -2000669 -2016192 -1984035 604049
11092 604049 -2454880 -335072 -649519 -2071575 -1776607 902351 2452989 394214 -3328534
$$ packed form
11157f85555J086173k515849O09695J306856j048842k37474J276717k025294K418491
11148A84918l80045j801714K176303J447005k980532L93743J027294j805815J829739
11139I0896j368898k42185K321742l485117K616382k477671J33533R93313N33310
11130h84695k14265m09278o91050j65633N59269J339891Q0814q40101K37654n21488
11120a508882J281977l39239q15334N48476j199305N79220J279207J60928q45407
11111h58359P18154k529829K224776k071994J387672K209298j683318r6343L88151
11102c11792k35793q52113m21272O42030r92007P58588n88310j5523L2157K588084
11092F04049l058929K119808l14447j422056K94968K678958J550638k058775l722748
$$ plain form
11083 -3328534 -1700791 928425 -189987 -1626443 -1289419 -3724330 -1425227 -2519071
11075 -2519071 1187979 -1557483 -1189276 -1448988 -3276830 401078 -1033471 -1139263 -2296751
11066 -2296751 -845686 -2344014 -3062148 -660021 -3837749 -2238678 -351434 -104840
11058 -104840 -1762917 -3170474 -1917253 -955072 264069 -1268430 -1437870 692055 -1616992
11049 -1616992 -65477 -1356158 -356561 -497788 -775453 -1409640 -2715489 -2829623 -2277015
11040 -2277015 -755922 997456 -28800 -1744489 -3523367 -612311 -399175 -36193
11032 -36193 -301955 28014 -1385700 -1542029 -1038823 -1483894 -1204109 -663119 -4026874
11023 -4026874 -1522799 -1301605 -1473322 -453477 -1267323 144181 -776660 -1123466 -2897009
$$ packed form
11083c328534J627743K629216j118412j436456L37024k434911K299103j093844
11075b519071L707050k745462L68207k59712j827842L677908j434549j05792j157488
11066b296751J451065j498328p18134K402127l177728J599071J887244K46594
11058a04840j658077j407557J253221R62181J219141j532499j69440K129925k309047
11049a616992J551515j290681R99597j41227k77665o34187j305849j14134N52608
11040b277015J521093J753378j026256j715689j778878K911056K13136L62982
11032c6193k65762L29969j413714j56329N03206m45071K79785N40990l363755
11023d026874K504075K21194j71717J019845q13846J411504r20841l46806j773543
$$ plain form
11014 -2897009 -1550483 -1053797 -3897020 -5093769 -2981267 -2448836 -2375036 -457366 -279632
11005 -279632 -4342777 -876659 -2300590 -728198 -1083681 -1401108 942242 -1208672 1573023
10996 1573023 -1349327 -2312277 -323725 -2279100 -2816939 14925 -1605795 -523474
10988 -523474 -1692269 -2242150 794104 -2254317 -2892863 -3330298 -1796969 -1846177 -1848560
10979 -1848560 -2017218 -1180051 -2213410 -990972 -975433 -1495014 -2714133 -891120 -3825218
10970 -3825218 -2449777 -1241431 -1613381 -1734768 -986163 1625063 -196789 -1949707 -3414396
10961 -3414396 -1676471 -1111038 -2033886 -2727781 -2203276 -2103876 -726800 -417308 -2654702
10952 -2654702 1636940 -207862 -2866271 -621636 -2575217 638323 -3405379 -496016
$$ packed form
11014b897009J346526M96686k843223j196749K112502N32431P3800J917670J77734
11005b79632m063145L466118j423931J572392l55483l17427K343350k150914K781695
10996A573023k922350r62950J988552j955375n37839K831864j620720J082321
10988e23474j168795n49881L036254l048421o38546m37435J533329m9208k383
10979a848560j68658Q37167j033359J222438J5539n19581j219119J823013k934098
10970c825218J375441J208346l71950j21387P48605K611226j821852j752918j464689
10961c414396J737925N65433r22848o93895N24505R9400J377076L09492k237394
10952b654702M291642j844802k658409K244635j953581L213540m043702K909363
$$ plain form
10944 -496016 -1775119 -2162608 -2724623 -1864427 -1112698 -3799396 1248495 -1594675 -2603356
10935 -2603356 -864002 -2404634 -2193352 -68502 -567421 -1437018 -1590390 -1805414 -952526
10926 -952526 -3511035 -238525 -1865813 -48399 1469253 695720 -2585064 -2410987 688851
10917 688851 -1841964 1114204 326614 -1565048 -2835095 -1797922 -1706127 -611500 564162
10908 564162 -2004276 -3216142 -2623459 -859752 -2695595 -2142433 -1777057 -3676173 -532291
10899 -532291 -2951756 -797336 -914454 -2290547 -1760326 340958 -1133067 -1386281 -2363790
10890 -2363790 -2374292 -554165 -1022170 -1690623 -1694006 -676265 -2191654 -1991221 -3144202
10881 -3144202 -956799 -1007600 -2097849 2254823 -495945 -1605676 -4431470 -1046249
$$ packed form
10944d96016j279103l87489n62015Q60196P51729k686698N047891k843170j008681
10935b603356J739354j540632K11282K124850m98919q69597j53372k15024Q52888
10926i52526k558509L272510j627288J817414J517652p73533l280784J74077L099838
10917F88851k530815K956168p87590j891662j270047J037173R1795J094627J175662
10908E64162k568438j211866N92683J763707j835843N53162L65376j899116L143882
10899e32291k419465K154420j17118j376093N30221K101284j474025k53214r77509
10890b363790j0502J820127m68005o68453l383J017741j515389K00433j152981
10881c144202K187403n0801j090249M352672k750768j109731k825794L385221
$$ plain form
10873 -1046249 -3041814 -1757519 -2012002 625569 -3983418 -75258 -3349618 -1845482
10865 -1845482 -1040859 694596 -704966 -2480748 122859 -1963591 -1239248 -1887747 -570203
10856 -570203 -2802281 -1105017 -2757403 -1728937 -1952160 -2475505 -2776103 -2017477 -722382
10847 -722382 -2189077 -1370787 -529949 -183022 -3590689 -2203195 -2496661 -2780912 -3396160
10838 -3396160 -1980476 -1226420 -2870613 -615389 -1795757 -2944603 -221527 -834412
10830 -834412 -506217 -1132046 -286374 -952385 -1398346 -691351 -1888543 -1371164 -1134602
10821 -1134602 -1483769 -3789776 -1843216 -1313219 302417 -2130914 -239739 -1695070
10813 -1695070 -616806 -1750733 -1142739 -258365 -3944939 -2554586 -2156812 -511392 -1047873
$$ packed form
10873a046249j995565J284295k54483K637571m608987L908160l274360J504136
10865a845482Q04623J735455j399562j775782K603607k086450P24343o48499J317544
10856e70203k232078J697264j652386J028466k23223n23345l00598P58626J295095
10847g22382j466695Q18290Q40838L46927l407667J387494k93466k84251o15248
10838c396160J415684P54056j644193K255224j180368j148846K723076o12885
10830h34412L28195o25829Q45672o66011m45961P06995j197192N17379K36562
10821a134602l49167k306007J946560N29997J615636k433331J891175j455331
10813a695070J078264j133927O07994Q84374l686574J390353L97774J645420n36481
$$ plain form
10804 -1047873 -3988714 -2418130 -2427376 -656234 -2423366 -2107637 -3024205 -2860711 165380
10795 165380 1448975 804212 -611920 -2445706 -40722 162274 -692001 -1495603 -274679
10786 -274679 -1884084 -1526063 -1670886 -1153233 -658485 -2049558 -643684 -1580820 -404332
10777 -404332 -429918 641470 -1125494 800005 -932869 -1631710 -2564542 722289 -664005
10768 -664005 -3246670 177554 -293084 -3301412 -2132284 -2927747 -2119648 -448828 -297498
10759 -297498 -2188493 -1400454 -53520 -4162 -1942031 -2686693 186110 -1560427 -2793805
10750 -2793805 -1541595 -1298063 -792402 -834275 1787778 -3399698 -1215622 -963535 -1496162
10741 -1496162 -1570935 -2670765 -2389018 1817031 -2396701 -588706 -1824646 -3695307 526337
$$ packed form
10804a047873k940841J570584r246J771142j767132L15729r16568J63494L026091
10795A65380J283595o44763j416132j833786K404984K02996q54275q03602J220924
10786b74679j609405L58021j44823N17653M94748j391073J405874r37136J176488
10777d04332k5586J071388j766964J925499j732874o98841r32832L286831j386294
10768f64005k582665L424224m70638l008328J169128p95463Q08099J670820J51330
10759b97498j890995P88039J346934M9358j937869p44662K872803j746537j233378
10750b793805J252210K43532N05661m1873K622053n187476K184076K52087n32627
10741a496162p4773j099830K81747M206049m213732J807995j235940j870661M221644
$$ plain form
10732 526337 -502774 -3104677 1320202 -2201719 -1399937 1505654 824136 -2868659 -1039506
10723 -1039506 -524353 -3771501 -3976007 -3346973 -2458948 -1095635 -153868 -2125920 1005710
10714 1005710 -448736 -433671 -2669171 -940102 -1142558 -2708375 1519949 -1178934 -115701
10705 -115701 -174696 -3604867 1837078 -805396 840457 -277073 -1401126 -2350998 -3113050
10696 -3113050 -75379 -251305 -361568 -966389 -1118312 -1294117 -3536043 -552281 -1109447
10687 -1109447 -1406062 -2817038 -1175802 -1884331 -1643202 -775073 -3779759 -1069181 -1201160
10678 -1201160 -516335 -1270051 -93032 -2896336 -3348354 -2314487 65285 131814 -329977
10669 -329977 -1799340 -2338295 -1697119 37071 -609586 702203 942464 -2536881 854093
$$ packed form
10732E26337j029111k601903M424879l521921Q01782K905591o81518l692795J829153
10723a039506N15153l247148k04506O29034Q88025J363313R41767j972052L131630
10714A005710j454446J5065k235500J729069k02456j565817M228324k698883J063233
10705a15701n8995l430171N441945k642474J645853j117530j124053r49872p62052
10696c113050L037671j75926j10263o04821j51923j75805k241926K983762n57166
10687a109447k96615j410976J641236p08529K41129Q68129l004686K710578j31979
10678a201160O84825p53716J177019k803304m52018J033867K379772O6529m61791
10669c29977j469363n38955O41176J734190o46657J311789K40261l479345L390974
$$ plain form
10660 854093 -3853910 -1068110 -651166 -740561 -1691382 -576015 -3039362 -1756180 -325302
10651 -325302 -1419942 -3101961 -1270346 -758462 -1411382 -2425239 -878342 -2470684 -2579398
10642 -2579398 -1969601 -2628629 -1430859 -1070271 -214676 -1157742 -1506139 -902403 -2677634
10633 -2677634 -1968770 286619 -301599 -3793918 -1070442 -657613 60063 -1376839 -3597619
10624 -3597619 122905 -1383404 -1319011 1262164 -1907747 -815609 -1600042 -2215312 -2301755
10615 -2301755 -2018434 -799229 -1876216 -30911 -3169807 -811781 -1722143 -519303
10607 -519303 -3850643 -1346480 -1355187 -710731 -403306 -2723850 -2522902 -1264356 -2259749
10598 -2259749 -2287247 -1726220 -1317929 -386659 -1633356 -425114 -707391 -2970883 -1978841
$$ packed form
10660H54093m708003K785800M16944q9395r50821J115367k463347J283182J430878
10651c25302j094640j682019J831615N11884o52920j013857J546897j592342j08714
10642b579398O09797o59028J197770L60588Q55595r43066l48397O03736j775231
10633b677634P08864K255389n88218l492319K723476M12829P17676j436902k220780
10624c597619L720524j506309O4393K581175l169911J092138p84433o15270q6443
10615b301755K83321J219205j076987J845305l138896K358026r10362J202840
10607e19303l331340K504163q707O44456L07425k320544K00948J258546r95393
10598b259749k7498N61027M08291R31270j246697J208242k82277k263492R92042
$$ plain form
10589 -1978841 -2720786 -1600042 -1661582 -1164888 -190252 -1099050 -1644644 -814092 -2171183
10580 -2171183 -2333980 -618240 -3409760 -902590 522584 -992449 168015 -2495063
10572 -2495063 -1719186 -1740706 -1346853 -2630992 -1383607 -200200 -3415959 -2712734 -867824
10563 -867824 -1695357 -626935 633472 -3852052 -3326366 -2235947 -278549 780655 -2490755
10554 -2490755 -2456296 -1299223 -661299 -1462748 -739156 -1741036 -849007 -742129 7862
10545 7862 -1923886 -2371571 -1042898 -302480 -1563888 -961318 -3439935 -1665379 -195059
10536 -195059 -1712557 -2541546 -73503 1789464 -1584008 -2783904 -241852 841907
10528 841907 -437847 -2753744 -2086118 -312684 -2799587 -2478091 -3450022 -3505713 -1317161
$$ packed form
10589a978841p41945J120744o1540M96694R74636r08798n45594Q30552j357091
10580b171183j62797J715740k791520K507170J425174j515033J160464k663078
10572b495063P75877k1520L93853j284139J247385J183407l215759P03225J844910
10563h67824q27533J068422J260407m485524N25686J090419J957398J059204l271410
10554b490755L4459J157073O37924q01449P23592j001880Q92029J06878P49991
10545G862j931748m47685J328673P40418j261408O02570k478617J774556J470320
10536a95059j517498q28989K468043J862967l373472j199896K542052J083759
10528H41907j279754k315897O67626J773434k486903L21496r71931n5691K188552
$$ plain form
10519 -1317161 -1104826 -2317802 -618976 -726175 -1861394 -1719606 -755800 -812207 -1432137
10510 -1432137 -33363 -2670825 415802 -1791597 -1991706 -784285 -3955588 -2953165
10502 -2953165 -1903833 -1200154 -2574645 -3030273 -1556393 219312 -1594045 -1564848 -276329
10493 -276329 -59090 -1508960 506939 -1324181 739942 -802751 -1711878 -1355895 -3634645
10484 -3634645 -1644486 -2007635 -125413 -1082168 -2364192 -192845 -3649517 732425
10476 732425 -592092 -515837 -1260863 -1717016 381803 -1518738 -3114620 -661966 -1190026
10467 -1190026 -2831955 -1169907 -1102104 259332 -201242 -1658279 -576503 -1417825 -3208875
10458 -3208875 -417520 1477600 108804 -181774 281385 -319113 1684142 -2855627 -1476300
$$ packed form
10519a317161K12335j212976J698826j07199j135219J41788R63806n6407o19930
10510a432137J398774k637462L086627k207399k00109J207421l171303J002423
10502b953165J049332P03679j374491m55628J473880J775705j813357K9197J288519
10493b76329K17239j449870K015899j831120K064123j542693r09127L55983k278750
10484c634645J990159l63149J882222r56755j282024K171347l456672M381942
10476G32425j324517P6255p45026m56153K098819j900541j595882K452654n28060
10467a190026j641929J662048O7803J361436m60574j457037J081776q41322j791050
10458c208875K791355J895120j368796k90578M63159o00498K003255m539769J379327
$$ plain form
10449 -1476300 -2331759 -379972 -3532582 -1468742 -3894994 1339105 -1881558 -581559
10441 -581559 290376 2694560 -1075534 -1695265 -467164 -2068555 -645861 33539 -1564378
10432 -1564378 -813174 -630694 -1906577 -1447155 -407031 -3108433 -1185309 -2801612 -1357365
10423 -1357365 -2297843 -1774021 -3014723 -2713987 -1178484 -2258283 -123742 -1889049 -2777248
10414 -2777248 -1280950 -2897471 -1432251 323330 211841 -1518402 -2851137 1091772
10406 1091772 -2202736 279524 -896928 -3615684 -944037 -4102501 750808 -1693542
10398 -1693542 -1549789 -2491648 227695 -2756005 -2057645 -2040479 -1164815 -425905 2024898
10389 2024898 -1344982 -1967466 -1315082 -1252965 40210 -3073108 -1645861 -1921635 -4708819
$$ packed form
10449a476300q55459J951787l152610K063840k426252N234099l220663J299999
10441e81559Q71935K404184l770094o19731J228101j601391J422694O79400j597917
10432a564378P51204J82480j275883M59422J040124k701402J923124j616303J444247
10423a357365r40478N23822j240702L00736J535503j079799K134541j765307q88199
10414b777248J496298j616521J465220J755581j11489j730243j332735L942909
10406A091772l294508K482260j176452k718756K671647l158464M853309k444350
10398a693542J43753r41859K719343k983700O98360J7166Q75664P38910K450803
10389B024898l369880o22484O52384O2117J293175l113318J427247k75774k787184
$$ plain form
10380 -4708819 -2784226 -1813549 -2570357 -779939 -1971220 -623545 -50172 -2394639 -1701577
10371 -1701577 383480 -1138339 381437 -3498265 -798277 -2159251 -1221990 -1464031
10363 -1464031 -1381162 -2689827 -289163 -1741899 -22127 -3755247 -2653428 -2153064 796030
10354 796030 -1016198 -4221417 -1547946 -109442 -1729837 -1209373 -349541 103389 -2209139
10345 -2209139 -3636951 229885 -888107 -2167823 -738478 -2526961 -1024546 -3357297
10337 -3357297 514776 -707520 -2093657 867764 650977 -4016091 -1088507 -1348376
10329 -1348376 -917615 -507522 -501392 -2175137 213006 -1547506 -1732781 -1806642 -332060
10320 -332060 -2001715 -13499 -2071931 -1400502 -1579004 -2342148 -3128201 -3875152 -2580935
$$ packed form
10380d708819J924593R70677p56808J790418j191281J347675N73373k344467O93062
10371a701577K085057j521819J519776l879702K699988j360974R37261k42041
10363a464031Q2869j308665K400664j452736J719772l733120J101819N00364K949094
10354G96030j812228l205219K673471J438504j620395N20464Q59832M52930k312528
10345b209139j427812L866836j117992j279716J429345j788483J502415k332751
10337c357297L872073j222296j386137K961421k16787m667068K927584k59869
10329a348376M30761M10093O130j673745K388143j760512j85275p3861J474582
10320c32060j669655J988216k058432O71429j78502p63144p86053p46951J294217
$$ plain form
10311 -2580935 -1657991 -923070 -1997124 -1443057 -2306993 -1538029 -1765213 411797 -690490
10302 -690490 -334474 -491978 -2707350 -1944389 -1629684 -348805 -3479243 -2258971 87964
10293 87964 532319 -2508601 -1717093 -3606532 -214164 -1360494 -1640408 -2360682 -542413
10284 -542413 -1655536 -1519347 327516 -329574 -734547 -1671283 -3813804 -2206572 -3447345
10275 -3447345 -1278997 -1620039 -2124012 -2163113 -533792 -197570 549772 -1619748 -1433939
10266 -1433939 -2522527 -3683034 -583496 -423981 -2899214 -131953 -1164345 -1202039 -1878158
10257 -1878158 -2210530 -1155809 561375 -91053 -913636 -896070 -1031698 -730941 -1483205
10248 -1483205 -1905410 -2118691 -1788185 881315 -351320 -1654253 -3319219 -2313950 127455
$$ packed form
10311b580935R22944P34921j074054N54067q63936P68964k27184K177010j102287
10302f90490L56016j57504k215372P62961L14705J280879l130438J220272K346935
10293H7964M44355l040920P91508j889439L392368j146330k79914p20274J818269
10284e42413j113123J36189J846863o57090m04973r36736k142521J607232j240773
10275c447345K168348l41042n03973l9101J629321L36222P47342k169520J85809
10266a433939j088588j160507L099538J59515k475233K767261j032392l7694o76119
10257a878158l32372J054721J717184o52428q22583J7566j35628L00757p52264
10248a483205m22205k13281L30506K669500j232635j302933j664966J005269K441405
$$ plain form
10239 127455 -3068053 -977776 -1703185 282756 -1931608 -39628 -1530506 -2670775
10231 -2670775 -1205103 -1802360 -2092980 -3480591 922768 1754194 -1338212 -490622 344528
10222 344528 -1704938 -461309 -1200091 -932348 -2456511 -1224796 -3232480 -3050139 191001
10213 191001 -1161521 -217472 -507881 -3467160 -2643962 -1932053 -959505 -1939382 -2494132
10204 -2494132 -2091125 -770325 44659 -473147 -1879697 -1444201 -2240885 -2678938 -1093682
10195 -1093682 -3065974 -1959176 -2171660 -768598 -2648820 532878 -1182624 -2337849
10187 -2337849 -1091455 -640571 -3099594 -2553786 -1976958 -1622364 861799 -1498873 -429857
10178 -429857 -3327888 -1835538 903387 -2070583 -3083339 -1983849 -3688042 -1393215
$$ packed form
10239A27455l195508K090277p25409J985941k214364J891980j490878j140269
10231b670775J465672n97257k90620j387611M403359Q31426l092406Q47590Q35150
10222C44528k049466J243629p38782K67743j524163J231715k007684J82341L241140
10213A91001j352522R44049k90409k959279Q23198P11909R72548r79877n54750
10204b494132M03007J320800Q14984n17806j406550M35496p96684m38053J585256
10195a093682j972292J106798k12484J403062j880222L181698j715502j155225
10187b337849J246394M50884k459023N45808N76828L54594K484163k360672J069016
10178d29857k898031J492350K738925k973970j012756J099490j704193K294827
$$ plain form
10170 -1393215 -1166299 -2097249 11125 -4865651 -1782647 -183943 -1664527 -1666929 -805479
10161 -805479 -1893064 -2257971 -285410 -3363210 565686 242817 -2415338 870893 -791866
10152 -791866 -3252636 81792 -1306418 -2982949 -1988373 -1363005 1170147 803978 -3391702
10143 -3391702 -1107302 -1147917 -1153601 581471 -268742 -2603997 -1161626 728529 -991011
10134 -991011 -3277019 -1989469 -3460427 -1526530 1176362 -4015892 -1755306 -493229
10126 -493229 -1238039 -510239 -4548267 -2220068 -1724519 -2254721 -2010431 -1723982 851866
10117 851866 -1141335 -1325785 -727432 19883 -2924741 -1291073 -1691818 -1267852 -2519061
10108 -2519061 -1559416 -1784022 -561501 -3241657 -1141246 -874323 -1715063 -2088086 -982950
$$ packed form
10170a393215K26916r30950K108374m876776L083004J598704j480584k402Q61450
10161h05479j087585l64907J972561l077800L928896l22869k658155L286231j662759
10152g91866k460770L334428j388210j676531R94576O25368K533152l66169m195680
10143c391702K284400m0615n684J735072q50213k335255J442371J890155j719540
10134i91011k286008J287550j470958J933897K702892n192254K260586J262077
10126d93229p44810P27800m038028K328199M95549n30202K44290K86449K575848
10117H51866j993201j84450N98353P47315k944624J633668m00745M23966j251209
10108b519061R59645k24606J222521k680156K100411K66923q40740l73023J105136
$$ plain form
10099 -982950 -2037450 -1146284 -1563991 1688257 -1356677 -2630362 -2398724 -972268 -379455
10090 -379455 -801197 -1905495 -3776172 -2355946 -3296586 -1730229 -1159921 -4867614 -1906527
10081 -1906527 -918340 -2043229 -49418 415671 -1175222 -1619329 -1281628 -1946562 -3828570
10072 -3828570 -348410 277597 -1650267 -275926 260956 -1440421 1269871 35140
10064 35140 -1008030 1231002 -177980 -924612 -1965755 -884114 -1797438 -3398152 -1061643
10055 -1061643 -3163402 -2218076 498969 -1920220 -2292659 -1678763 -473755 -1469423 -2856548
10046 -2856548 -1399736 -1325288 -3592388 180169 -4303085 -829537 -427936 -701860 -3243917
10037 -3243917 -335214 -3702082 -873475 -1938415 -2942106 -2308716 -3690593 -1834276
$$ packed form
10099i82950j054500Q91166m17707L252248l044934j273685K31638J426456N92813
10090c79455m21742j104298j870677J420226r40640J566357N70308l707693K961087
10081a906527R88187j124889J993811M65089j590893m44107L37701o64934j882008
10072c828570L480160O26007j927864J374341N36882j701377K710292j234731
10064C5140j043170K239032j408982p46632j041143J081641r13324j600714K336509
10055a061643k101759R45326K717045k419189l72439O13896J205008r95668j387125
10046b856548J456812P4448k267100L772557m483254L473548M01601k73924k542057
10037c243917K908703l366868K828607j064940j003691O33390j381877J856317
$$ plain form
10029 -1834276 -2936642 -1641818 -2441042 -1421720 -195857 1732849 -752361 -1148252
10021 -1148252 -473052 -440953 -2098394 -590181 -882642 -1399559 -455564 -2319091 -3499029
10012 -3499029 -1085412 -3609812 -3179048 -3326263 -2061647 -236856 -3372743 -1645920
10004 -1645920 -3494619 -2018941 -605994 -1142326 759605 -1473687 -1576874 -1138097 1501028
9995 1501028 268692 -1957633 -2804935 -661407 1319997 -2376841 -436854 -963050 -3372536
9986 -3372536 -2228546 1542095 701657 -2376190 -23164 556995 -1831561 -245743 -3161280
9977 -3161280 -1423778 -1415467 -1250808 -934369 -2178721 -69102 -1478348 -1927705 -2351166
9968 -2351166 -3139765 -2533122 -1902124 -278840 -355441 1675966 -2685034 -1451037 -2697183
$$ packed form
10029a834276j102366J294824p99224J019322J225863J928706k485210l95891
10021a148252O75200L2099j657441J508213k92461n16917R43995j863527j179938
10012c499029K413617k524400M30764j47215J264616J824791l135887J726823
10004a645920j848699J475678J412947n36332J901931k233292j03187M38777K639125
9995A501028j232336k226325q47302K143528J981404l696838J939987n26196k409486
9986c372536J143990L770641q40438l077847K353026N80159k388556J585818k915537
9977c161280J737502Q311J64659L16439j244352K109619j409246m49357m23461
9968b351166p88599O06643O30998J623284p6601K031407m361000J233997j246146
$$ plain form
9959 -2697183 -2395592 133362 -2394963 -2668035 -1510737 -2811778 -1591883 -2244737 478573
9950 478573 -5099774 -1535015 -1218590 -1178046 -615622 -2122745 -91611 -2728614 -2888071
9941 -2888071 -1285630 -1700224 -1251223 -369279 -1311800 -983904 -667425 -2987417 -3516312
9932 -3516312 -717551 -1774398 -1458271 -2157777 -515670 -1802426 -716889 -2914624 -1259439
9923 -1259439 652880 -3177600 -482918 -443714 -1078876 -51826 -802398 -2283645 -763818
9914 -763818 -2436508 -3953030 -1123827 -1758872 671686 -1547961 -2734079 -1987394 -816983
9905 -816983 -2252858 -163948 -646547 -4676264 -2988285 -1577452 -788916 547199 -928715
9896 -928715 -394475 -973930 -497373 -1808127 -1478981 -740477 -1587386 260803 -2118789
$$ packed form
9959b697183L01591K528954k528325k73072J157298j301041J219895o52854K723310
9950D78573n578347L564759L16425M0544N62424j507123K031134k637003j59457
9941b888071J602441m14594M49001Q81944r42521L27896L16479k319992n28895
9932c516312K798761j056847L16127o99506J642107j286756J085537k197735J655185
9923a259439J912319l830480K694682L9204o35162J027050p50572j481247J519827
9914g63818j672690j516522K829203o35045K430558k219647j186118P46685J170411
9905h16983j435875K088910m82599m029717J687979J410833P88536J336115j475914
9896i28715N34240n79455M76557j310754L29146P38504q46909J848189k379592
$$ plain form
9887 -2118789 -2694187 -3743021 124238 -1615340 -1215149 -1065760 -664298 -1922991 -4819636
9878 -4819636 -1112438 -842104 -1305395 -248198 -2782096 -2834630 -3226249 -579184 -1619552
9869 -1619552 -1102995 -1266285 -2339142 -1887987 -198223 -1973608 -2703962 -1087241 -814144
9860 -814144 -659108 -2675151 195030 -2510183 -279151 -1409272 -2090443 -1672367 -921360
9851 -921360 -502799 -1660574 -1976694 -225735 -3892222 -1078197 -1086844 -1704717 -486528
9842 -486528 -1014746 -2266248 -1336430 -958693 -1441526 -234064 -1239470 -2287682 -1710279
9833 -1710279 866346 -1461216 -2496830 -1720292 -2656570 -538069 -410198 -733704 -479987
9824 -479987 -2385947 51835 -689825 -862635 -1731766 -1610420 -1590829 -1863012 -1694819 -4973186
$$ packed form
9887b118789n75398j048834L867259j739578M00191J49389M01462j258693k896645
9878d819636L707198K70334m63291J057197k533898n2534l91619K647065j040368
9869a619552N16557j63290j072857M51155J689764j775385p30354J616721K73097
9860h14144J55036k016043K870181k705213K231032j130121o81171M18076P51007
9851i21360M18561j157775l16120J750959l666487K814025q647o17873J218189
9842d86528n28218j251502R29818L77737m82833J207462j005406j048212N77403
9833a710279K576625k327562j035614P76538r36278K118501J27871l23506K53717
9824d79987j905960K437782p41660j72810q69131J21346J9591k72183J68193l278367
$$ plain form
9814 -4973186 -1242019 -971865 -2580954 -1620702 -1420481 -2989099 -1182494 -3855104 -428845
9805 -428845 -3382830 -398576 -3476092 -2258544 -2742741 -1019296 -977787 283827 258818
9796 258818 -1561401 -1758137 -2044483 790763 -2043256 -3200697 -679885 -1509130 -3418639
9787 -3418639 -2060884 -3976789 -3321537 -2758915 -3499690 -1827552 -1560269 -1228466 -1423329
9778 -1423329 688555 -2728163 1041671 -987900 -1127637 -149174 -574965 -1734819 -1685988
9769 -1685988 -768945 -1332085 -961692 -957683 -716235 -795881 -1709326 -2961353 -1831478 -295848
9759 -295848 -1369787 -233097 -547217 -2472128 184808 -453366 -1199971 -1118145 -1193608
9750 -1193608 -719362 882377 -2951465 1911621 -3358602 -1829611 -2260857 1325628 -336855
$$ packed form
9814d973186L731167K70154j609089R60252K00221j568618J806605k672610L426259
9805d28845k953985K984254l077516J217548m84197J723445M1509J261614k5009
9796B58818j820219j96736k86346K835246k834019j157441K520812q29245j909509
9787c418639J357755j915905O55252N62622p40775J672138K67283L31803j94863
9778a423329K111884l416718L769834k029571j39737R78463m25791j159854M8831
9769a685988R17043n63140L70393M009K41448p9646r13445j252027J129875J535630
9759b95848j073939J136690l14120j924911K656936o38174p46605Q1826p5463
9750a193608M74246J601739l833842M863086n270223J528991m31246L586485j662483
$$ plain form
9741 -336855 -2889454 -161877 -1428567 -114514 -638910 -1545715 -1318848 -674648 -1737812
9732 -1737812 -2139942 -829344 -588680 -1492498 -1540514 -3355233 -786370 -1963502 -953925
9723 -953925 511921 -2451496 -3325687 -1397781 -1164302 -1216770 -639848 -1508632 -629910
9714 -629910 -1381292 -2390741 -3761420 1340759 -561498 -801515 -2879225 -2585807 -2941436
9705 -2941436 -285458 -729241 -4241429 -2924996 -1759772 -871198 -1717262 -4926498 303028
9696 303028 -1888434 -316107 1016628 -2406404 -2501418 -856828 1597886 -2320080 -2664941
9687 -2664941 -2923538 1013750 -2986387 45510 -1645764 -2885396 776719 641797 -1636988
9678 -1636988 -1389015 1008898 -1274931 -2813079 -1485296 -587926 -387601 -2200079 -1949828
$$ packed form
9741c36855k552599K727577j266690J314053n24396r06805K26867O44200j063164
9732a737812m02130J310598K40664r03818m8016j814719K568863j177132J009577
9723i53925J465846k963417q74191J927906K33479n2468N76922q68784Q78722
9714f29910p51382j009449j370679N102179j902257k40017k077710K93418l55629
9705b941436K655978m43783l512188J316433J165224Q88574q46064l209236N229526
9696C03028k191462J572327J332735l423032r5014J644590K454714l917966l44861
9687b664941k58597L937288m000137L031897j691274j239632L662115j34922k278785
9678a636988K47973K397913k283829j538148J327783Q97370K00325j812478K50251
$$ plain form
9669 -1949828 -1367502 649703 -113777 -1830683 -673032 -2711399 -2322812 -994028 -2270295
9660 -2270295 -594806 632461 -787524 -3791582 -967984 -2913747 -8301 -2841223
9652 -2841223 -3870747 1778362 808337 -2899862 -1218851 -553478 -3120423 -3241962 -3042242
9643 -3042242 -1028857 -1256450 -93790 -395414 367647 -3649937 -1000588 -961011 1762073
9634 1762073 -719467 -1943035 -1873306 336547 -1368464 -837222 -2926694 -1628828 -4363165
9625 -4363165 -1136580 1210459 -70840 811381 -686789 -910211 -909631 -2271113 -2411737
9616 -2411737 -1733285 -3195645 -1984559 -1904494 -2628817 1158264 -2677687 -1999923 -783059
9607 -783059 -792385 654947 -425730 -1932602 -2425619 -704477 523787 -3133191 1044684
$$ packed form
9669a949828N82326K017205p63480j716906J157651k038367L88587J328784j276267
9660b270295J675489J227267j419985l004058K823598j945763K905446k832922
9652b841223j029524N649109r70025l708199J681011O65373k566945j21539J99720
9643c042242K013385k27593J162660l01624P63061m017584K649349L9577K723084
9634A762073k481540j223568O9729K209853j705011N31242k089472J297866k734337
9625d363165L226585K347039j281299Q82221j498170k23422N80j361482j40624
9616b411737O78452j462360J211086Q0065p24323L787081l835951O77764J216864
9607g83059r326J447332j080677j506872m93017J721142J228264l656978M177875
$$ plain form
9598 1044684 -2113860 -1096921 -945754 753069 -2233850 -852528 -2476121 -678471
9590 -678471 181880 -144119 -241918 666029 -3140022 -1834328 1390991 897926 -1390702
9581 -1390702 -449891 -2053684 -93709 -3108770 -395405 -2486268 -975979 -2281814
9573 -2281814 -2476550 -1982397 647214 257677 -1732661 -2418943 -505270 -2000905 -517851
9564 -517851 -2112667 -1081010 -1265904 897433 -1579231 -1051370 -1432368 -1951316 -3466930
9555 -3466930 -1838379 -1077067 -2901808 51842 -3040073 -2476984 -1847684 -1511387 -1599097
9546 -1599097 -669689 -744763 -2101546 -2420656 -2503700 29787 -1388556 -2850136 504432
9537 504432 289423 -1737722 -994098 -1398885 -657106 -2406267 -1520892 -3621248 -1529992
$$ packed form
9598A044684l158544J016939J51167J698823k986919J381322j623593J797650
9590f78471Q60351l25999r7799R07947l806051J305694L225319m93065k288628
9581a390702R40811j603793J959975l015061K713365k090863J510289j305835
9573b281814j94736M94153K629611l89537j990338o86282J913673j495635J483054
9564e17851j594816J031657j84894K163337k476664N27861l80998n18948j515614
9555c466930J628551P61312j824741K953650l091915N63089O29300L36297q7710
9546a599097R29408p5074j356783l19110q3044K533487j418343j461580L354568
9537E04432k15009k027145P43624m04787P41779j749161Q85375k100356K091256
$$ plain form
9528 -1529992 -2962064 -3213503 -4262883 -246153 -4276886 -1771221 -964476 -46883 -3774977
9519 -3774977 -981744 -963517 -1983800 -1493301 -1491068 -519215 -915995 -3976118 427338
9510 427338 -1681687 -994886 -1878 1127615 -3616195 -1625879 -1070092 -1561545 -392487
9501 -392487 -2688813 -111676 730345 -957921 -2178148 -575709 890880 -1705496 -307523
9492 -307523 -111635 -678350 -3983564 -2240055 -1736201 -2707931 -2716417 -1936253 -330837 1250805
9482 1250805 -1203784 -954952 -1923138 -2918611 327090 -430150 -1004590 1893335 -3393429
9473 -3393429 798565 -3199544 -3199599 -1646582 -1648878 -1212383 516155 149283 -11742 -3659354
9463 -3659354 -626233 -1473560 -409331 -417383 -70209 -133478 -2693828 -2260168 -2306196 -1124350
$$ packed form
9528a529992j432072k51439j049380M016730m030733K505665Q06745R17593l728094
9519c774977K793233J8227j020283M90499K233R71853l96780l060123M403456
9510D27338k109025O86801R93008J129493m743810J990316N55787m91453J169058
9501c92487k296326K577137Q42021j688266j220227J602439J466589k596376J397973
9492c07523J95888n66715l305214J743509N03854r71730q486P80164J605416J581642
9482A250805k454589K48832r68186r95473L245701p57240n74440K897925n286764
9473c393429M191994l998109n5J553017k296M36495J728538l66872j61025l647612
9463c659354L033121q47327J064229q052L47174o3269k560350M33660m6028J181846
$$ plain form
9453 -1124350 -4902387 -942201 -898206 -217673 -1610548 -615041 220161 -2410611 1944915
9444 1944915 -2533477 -1580044 -366236 853611 -2393348 -2803262 -152001 -1208566 -2104033
9435 -2104033 -1116341 -21883 -202175 -3341728 -880226 -1443363 -2290883 -2572575 -1309899
9426 -1309899 -3018865 391127 -1246430 -292700 -875982 -2436891 -1203859 -1874577 -968048
9417 -968048 -722565 -638106 -3166272 -1796819 -2310657 -1728781 -2042380 -1968730 189597 -5460594
9407 -5460594 -2112189 -2291458 -1754968 -1856023 -1501787 -3173002 -2066406 -1500771 -1034485
9398 -1034485 -1480904 -1078944 -2955918 677369 -3056672 -52416 -2076793 -1096404 -2285132
9389 -2285132 -1934106 -1656779 -1136973 -4317770 -1298323 -2343246 -541756 1271981 -2542863
$$ packed form
9453a124350l778037L960186M3995O80533j392875R95507Q35202k630772M355526
9444A944915m478392R53433J213808J219847l246959m09914K651261j056565q95467
9435b104033R87692J094458j80292l139553K461502n63137q47520k81692J262676
9426a309899j708966L409992j637557R53730n83282j560909J233032o70718R06529
9417i68048K45483Q4459k528166J369453n13838N81876l13599P3650K158327n650191
9407e460594L348405j79269N36490j01055L54236j671215J106596N65635M66286
9398a034485m46419M01960j876974L633287l734041L004256k024377R80389j188728
9389b285132L51026K77327N19806l180797L019447j044923J801490J813737l814844
$$ plain form
9380 -2542863 -1998444 -630225 -354130 193113 -2170055 -1564503 876508 -1731493 -885250
9371 -885250 -1070493 -1178358 -1866109 -2632584 147122 -479854 -809169 -1331412 -201412
9362 -201412 -2650305 1751515 -2422003 -1273244 -4074307 -504297 -1357806 -3546363 -2961718
9353 -2961718 -3115759 481570 -2126794 -1593305 736265 -1833321 672806 -1921430 -499913
9344 -499913 -1536311 464820 -166012 -81031 688640 -1847531 -2399378 -1978611 -351276
9335 -351276 -1036757 -2898363 -3254420 -680569 -725816 -1047645 -2425732 -1608125 -3138608
9326 -3138608 -362082 -1589130 286150 -1504065 -2863076 -577807 -27285 -3043553
9318 -3043553 -2400986 111059 -2746474 9924 -3855105 -1217725 1214972 -2357178
$$ packed form
9380b542863N44419J368219K76095N47243k363168O05552K441011k608001Q46243
9371h85250j85243j07865o87751p66475K779706o26976l29315n22243J130000
9362b01412k448893M401820m173518J148759k801063L570010q53509k188557N84645
9353b961718j54041L597329k608364N33489K329570k569586K506127k594236J421517
9344d99913j036398K001131o30832Q4981P69671k536171n51847M20767J627335
9335c51276o85481j861606l56057K573851m5247l21829j378087Q17607j530483
9326c138608K776526j227048J875280j790215j359011K285269N50522l016268
9318c043553O42567K512045k857533K756398l865029K637380K432697l572150
$$ plain form
9310 -2357178 -1023592 -263465 -766883 -1081222 -1489723 70705 825186 796842 -870067
9301 -870067 700884 -769404 467966 -2700641 -547184 -1531503 -1392721 -1227453 -3487876
9292 -3487876 -3175804 626067 -401130 -219026 -450776 -972033 -3314465 -1335928 -820801
9283 -820801 -1507848 -2820547 -1209345 -1508284 -3725104 248183 -1611501 -2199670 -1874084
9274 -1874084 -1696912 -1951507 -258567 -1556010 -2079620 -1738732 783184 -2404269 -3477075
9265 -3477075 -758942 -424575 -2492365 -1394299 -2502111 -2206063 -596565 -5562516 -1800387
9256 -1800387 850626 -3298607 -2809041 -1959111 -2958608 352756 -3080421 -2082672 -1414911
9247 -1414911 -1936963 -2268559 -233500 -930897 -2517870 -2328990 66929 -1927121 -1644447
$$ packed form
9310b357178J333586P60127n03418l14339m08501J560428P54481k8344j666909
9301h70067J570951j470288J237370l168607K153457r84319J38782J65268k260423
9292c487876L12072L801871j027197J82104k31750n21257k342432J978537N15127
9283h20801o87047j312699J611202k98939k216820L973287j859684n88169L25586
9274a874084J77172k54595J692940j297443n23610L40888K521916l187453j072806
9265c477075K718133L34367k067790J098066j107812K96048J609498m965951L762129
9256a800387K651013m149233M89566Q49930r99497L311364l433177R97749O67761
9247a414911n22052l31596K035059o97397j586973J88880K395919j994050K82674
$$ plain form
9238 -1644447 -265548 -2310271 -1487795 -1099302 1142452 -643750 -2719435 -1038507 -1218721
9229 -1218721 -1075637 -2877596 -2438546 -1965576 -481679 793908 -2914250 -1625816 -1491868
9220 -1491868 -1539269 -2285027 -819373 -1701865 -4022191 -1739763 -1376015 -883747 -1335314
9211 -1335314 2005215 -2163490 -2788311 -2258692 -1937432 -3420794 -3888769 117936 -2435252
9202 -2435252 -1717495 357161 -1362188 -2246728 -2108150 -2015515 -1307489 133706 354341
9193 354341 538648 -2228144 -448341 -571217 -2723089 -1076477 -230363 -1364438 -122251
9184 -122251 -632342 -3378314 -1804633 -1232660 -1849373 -1290692 -3234524 -349279 -1998500
9175 -1998500 -2189687 -3167065 -1516121 -41069 -2022047 -1148724 -2996241 -808751 -34388
$$ packed form
9238a644447J378899k044723Q22476L88493K241754j786202k075685J680928j80214
9229a218721J43084j801959M39050M72970J483897J275587l708158J288434J33948
9220a491868m7401p45758J465654q82492k320326K282428L63748M92268m51567
9211a335314L340529m168705o24821N29619L21260j483362m67975M006705k553188
9202b435252P17757K074656j719349q84540J38578R2635P08026J441195K20635
9193C54341J84307k766792J779803j22876k151872J646612Q46114j134075J242187
9184a22251n10091k745972J573681N71973o16713N58681j943832K885245j649221
9175a998500j91187r77378J650944J475052j980978Q73323j847517K187490P74363
$$ plain form
9166 -34388 -244675 -1054212 -2277706 -2444783 -1875074 -1899298 -4382841 -1412262 -1755810 -327024
9156 -327024 -1352550 -2170128 -4203923 -3137661 -66219 -2587768 -982407 -1297234 -189520
9147 -189520 -2054739 -1745493 -1168838 -770769 -854090 756849 -166624 -3058231 -2932979
9138 -2932979 -1062239 -980561 -2340551 333874 -2068917 1586675 -2829843 -1770979 -441898
9129 -441898 -2364322 -1372164 -2509436 -1348949 -403421 -2274832 -3026494 -1406979 -2134316
9120 -2134316 -1642801 -2713980 -2359883 -2794347 -3556904 183902 2643794 84967 -2773050
9111 -2773050 -2326154 -3647936 -6254 -1800300 -829605 680175 -110668 -2245856 -596292
9102 -596292 627535 -1908750 -1915914 647543 -1026477 -337126 -2092020 -1697791 -809534
$$ packed form
9166c4388k10287q09537j223494j67077N69709k4224k483543K970579l43548J428786
9156c27024j025526q17578k033795J066262L071442k521549J605361l14827J107714
9147a89520j865219L09246N76655L98069q3321J610939r23473k891607J25252
9138b932979J870740Q1678j359990K674425k402791L655592m416518J058864J329081
9129d41898j922424R92158j137272J160487R45528j871411p51662J619515p27337
9120b134316M91515j071179L54097m34464p62557L740806K459892k558827k858017
9111b773050M46896j321782L641682j794046R70695J509780p90843k135188J649564
9102e96292J223827k536285p164K563457j674020O89351j754894L94229Q88257
$$ plain form
9093 -809534 -528920 -2216096 1183624 -3117869 -1593871 1429131 325446 -1636915 -2681927
9084 -2681927 -2475275 644551 -2119808 -517934 -1861249 -2283702 -169383 -1156397 -165243
9075 -165243 -3099365 -3048728 -748481 -3119573 -665617 -806443 -1636155 -2033028 -2344348
9066 -2344348 -1192721 -2537532 176358 -1765746 -874268 -1477387 -3299523 -1140838 -2495798
9057 -2495798 -1464045 -1546635 288069 -1735316 -977493 -2656791 -1629419 -1422567 -235503
9048 -235503 -2669009 -651965 -3733680 -453316 34987 -1582215 -3045758 -1215734 -903785
9039 -903785 -2003424 -2079980 -1069412 -1318620 -1744363 -900883 -2839084 -3027647 -2625118
9030 -2625118 -1709020 -3647390 -1324809 200371 -2648036 -981243 -543634 -2598699 -1324085
$$ packed form
9093h09534K80614j687176L399720m301493J523998L023002j103685j962361j045012
9084b681927K06652L119826k764359J601874j343315m22453K114319r87014R91154
9075a65243k934122N0637K300247k371092K453956j40826q29712l96873l11320
9066b344348J151627j344811K713890j942104Q91478o03119j822136K158685j354960
9057b495798J031753q2590J834704k023385P57823j679298J027372K06852J187064
9048b35503k433506K017044l081715L280364M88303j617202j463543J830024L11949
9039i03785j099639p6556J010568k49208m25743Q43480j938201j88563M02529
9030b625118R16098j938370K322581J525180k848407J666793M37609k055065J274614
$$ plain form
9021 -1324085 -4330681 -2441348 -1609058 -986341 -938147 -1878244 -1352325 -169634 34100
9012 34100 -1586548 241300 -1505915 -1325487 -1268203 -2084276 -419795 -1145442 -2908654
9003 -2908654 -1794071 -160824 -1944982 -3293382 340362 -1424138 -1356652 -587374 -3340770
8994 -3340770 -1992290 -1409415 -711793 -1104144 269205 209238 -2458509 -1309073 -1417340
8985 -1417340 -4203374 -1315638 -1246940 -2550083 -432219 -1569229 1359815 -1176103 -1953565
8976 -1953565 -1803782 -2662741 6290 -2418319 -2587238 -1675081 -2195014 -1615500 -2424951
$$ packed form
9021a324085l006596J889333Q32290O22717M8194r40097N25919J182691K03734
9012C4100j620648J827848j747215J80428N7284q16073J664481p25647j763212
9003b908654J114583J633247j784158j348400L633744j764500O7486P69278k753396
8994c340770J348480N82875O97622l92351J373349n9967k667747J149436j08267
8985a417340k786034K887736O8698j303143K117864j137010K929044k535918p77462
8976a953565J49783q58959K669031k424609j68919R12157n19933N79514q09451
$$ [...]
##END NTUPLES=NMR SPECTRUM
##END=
