##TITLE=Analysis number 325818
Compound Code cc 01704
Project Code adrs
Chemist Name aci
##JCAMPDX= 6.0         $$ Bruker NMR JCAMP-DX V2.0
##DATA TYPE= NMR SPECTRUM
##DATA CLASS= NTUPLES
##ORIGIN= Bruker BioSpin GmbH
##OWNER= nmr
$$ XWIN-NMR		Version 3.5
$$ Tue Jan 16 08:14:46 2007 GMT Standard Time (UT+0h)  MAYBRIDGE\nmr@NMR_250MHZ
##.OBSERVE FREQUENCY= 250.131544655141
##.OBSERVE NUCLEUS= ^1H
##.ACQUISITION MODE= SIMULTANEOUS (DQD)
##.ACQUISITION SCHEME= undefined
##.AVERAGES= 16
##.DIGITISER RES= 18
##SPECTROMETER/DATA SYSTEM= dpx250
##.PULSE SEQUENCE= zg30
##.SOLVENT NAME= CDCl3
##.SHIFT REFERENCE= (INTERNAL, CDCl3, 0, 16.522)
##AUDIT TRAIL= $$ (NUMBER, WHEN, WHO, WHERE, WHAT)
$$ ##TITLE= Audit trail, XWIN-NMR		Version 3.5
$$ ##JCAMPDX= 5.01
$$ ##ORIGIN= Bruker BioSpin GmbH
$$ ##OWNER= nmr
$$ C:\u/data/dgb/nmr/ADRS/1160/pdata/1/auditp.txt
$$ ##AUDIT TRAIL=  $$ (NUMBER, WHEN, WHO, WHERE, WHAT)
(   1,<2007-01-16 08:14:22.17 +000>,<MAYBRIDGE\nmr>,<NMR_250MHZ>,
      <created by zg, POWCHK disabled, PULCHK disabled
       configuration hash MD5:
       49 4B E0 1D 92 C2 6B 37 9F E6 65 BC 52 41 86 1D
       data hash MD5: 64K
       55 FF FA 62 0B F7 64 C3 34 42 0E F0 D4 0E E6 84>)
(   2,<2007-01-16 08:14:35.67 +000>,<MAYBRIDGE\nmr>,<NMR_250MHZ>,
      <Start of raw data processing
       ef LB = 0.3 FT_mod = 6 PKNL = 1 SI = 32K 
       data hash MD5: 32K
       E0 D2 09 D7 79 41 68 B6 F6 1A E7 6B 99 4C 09 32>)
(   3,<2007-01-16 08:14:37.62 +000>,<MAYBRIDGE\nmr>,<NMR_250MHZ>,
      <apk 
       data hash MD5: 32K
       5F F5 B2 6D 73 28 00 C1 28 57 D2 50 B9 89 FD C8>)
(   4,<2007-01-16 08:14:38.39 +000>,<MAYBRIDGE\nmr>,<NMR_250MHZ>,
      <abs ABSG = 5 
       data hash MD5: 32K
       71 A2 26 4F 74 28 C6 D8 CB C2 F1 30 02 68 F9 CC>)
$$ ##END=
$$ 
$$ hash MD5
$$ 16 36 FB 0D 6A 63 14 91 ED 27 76 53 2C A4 1F 49
##$RELAX= 
##$RELAX= 
##$RELAX= 
##$RELAX= 
##$RELAX= 
##$RELAX= 
##$RELAX= 
$$ Bruker specific parameters
$$ --------------------------
##$DU= <C:\u>
##$EXPNO= 1160
##$NAME= <ADRS>
##$PROCNO= 1
##$TYPE= <nmr>
##$USER= <dgb>
##$AMP= (0..31)
100 100 100 100 100 100 100 100 100 100 100 100 100 100 100 100 100 100 
100 100 100 100 100 100 100 100 100 100 100 100 100 100 
##$AQSEQ= 0
##$AQ_mod= 3
##$AUNM= <au_zg>
##$AUTOPOS= <42 >
##$BF1= 250.13
##$BF2= 250.13
##$BF3= 250.13
##$BF4= 250.13
##$BF5= 500.13
##$BF6= 500.13
##$BF7= 500.13
##$BF8= 500.13
##$BYTORDA= 1
##$CFDGTYP= 0
##$CFRGTYP= 5
##$CHEMSTR= <none>
##$CNST= (0..31)
1 1 145 1 1 1 1 1 1 1 1 1 1 1 1 1 1 1 1 1 1 1 1 1 1 1 1 1 1 1 1 1 
##$CPDPRG= <>
##$CPDPRG1= <>
##$CPDPRG2= <>
##$CPDPRG3= <>
##$CPDPRG4= <mlev>
##$CPDPRG5= <mlev>
##$CPDPRG6= <mlev>
##$CPDPRG7= <mlev>
##$CPDPRG8= <mlev>
##$CPDPRGB= <>
##$CPDPRGT= <>
##$D= (0..31)
0 1 0 0 0 0 0 0 0 0.06 0 0 0 0 0 0 0.0002 0 0 0 0 0 0 0 0 0 0 0 0 0 0 
0 
##$DATE= 1168935260
##$DBL= (0..7)
120 120 120 120 120 120 120 120 
##$DBP= (0..7)
150 150 150 150 150 150 150 150 
##$DBP07= 0
##$DBPNAM0= <>
##$DBPNAM1= <>
##$DBPNAM2= <>
##$DBPNAM3= <>
$$ [...]
##$SUBNAM7= <"">
##$SUBNAM8= <"">
##$SUBNAM9= <"">
##$SW= 20.6930455092707
##$SWIBOX= (0..15)
0 0 3 0 0 0 0 0 0 0 0 0 0 0 0 0 
##$SW_h= 5175.983436853
##$TD= 65536
##$TD0= 1
##$TE= 294.16
##$TE2= 300
##$TE3= 300
##$TEG= 300
##$TL= (0..7)
0 120 120 120 120 120 120 120 
##$TP= (0..7)
150 150 150 150 150 150 150 150 
##$TP07= 0
##$TPNAME0= <>
##$TPNAME1= <>
##$TPNAME2= <>
##$TPNAME3= <>
##$TPNAME4= <>
##$TPNAME5= <>
##$TPNAME6= <>
##$TPNAME7= <>
##$TPOAL= (0..7)
0.5 0.5 0.5 0.5 0.5 0.5 0.5 0.5 
##$TPOFFS= (0..7)
0 0 0 0 0 0 0 0 
##$TUNHIN= 0
##$TUNHOUT= 0
##$TUNXOUT= 0
##$USERA1= <user>
##$USERA2= <user>
##$USERA3= <user>
##$USERA4= <user>
##$USERA5= <user>
##$V9= 5
##$VALIST= <valist>
##$VCLIST= <CCCCCCCCCCCCCCC>
##$VD= 0
##$VDLIST= <DDDDDDDDDDDDDDD>
##$VPLIST= <PPPPPPPPPPPPPPP>
##$VTLIST= <TTTTTTTTTTTTTTT>
##$WBST= 1024
##$WBSW= 4
##$XGAIN= (0..3)
0 0 0 0 
##$XL= 0
##$YL= 0
##$YMAX_a= 471289
##$YMIN_a= -773932
##$ZGOPTNS= <>
##$ZL1= 120
##$ZL2= 120
##$ZL3= 120
##$ZL4= 120
##$ABSF1= 16.522
##$ABSF2= -4.171173
##$ABSG= 5
##$ABSL= 3
##$ALPHA= 0
##$AQORDER= 0
##$ASSFAC= 0
##$ASSFACI= 0
##$ASSFACX= 0
##$ASSWID= 0
##$AUNMP= <proc_1d>
##$AZFE= 0.1
##$AZFW= 0.1
##$BCFW= 0
##$BC_mod= 0
##$BYTORDP= 0
##$COROFFS= 0
##$CY= 12.5
##$DATMOD= 1
##$DC= 0
##$DFILT= <>
##$DTYPP= 0
##$F1P= 14.0000005364418
##$F2P= -0.99999901652339
##$FCOR= 0.5
##$FTSIZE= 32768
##$FT_mod= 6
##$GAMMA= 0
##$GB= 0
##$INTBC= 1
##$INTSCL= 1
##$ISEN= 128
##$LB= 0.3
##$LEV0= 0
##$LPBIN= 0
##$MAXI= 10000
##$MC2= 0
##$MEAN= 0
##$ME_mod= 0
##$MI= 0
##$NCOEF= 0
##$NC_proc= -2
##$NLEV= 6
##$NOISF1= 0
##$NOISF2= 0
##$NSP= 0
##$NTH_PI= 0
##$NZP= 0
##$OFFSET= 16.522
##$PC= 1
##$PHC0= 228.3361
##$PHC1= 5.278907
##$PH_mod= 1
##$PKNL= yes
##$PPARMOD= 0
##$PSCAL= 4
##$PSIGN= 0
##$REVERSE= no
##$SF= 250.13
##$SI= 32768
##$SIGF1= 0
##$SIGF2= 0
##$SINO= 400
##$SIOLD= 32768
##$SREGLST= <1H.CDCl3>
##$SSB= 0
##$STSI= 32768
##$STSR= 0
##$SW_p= 5175.98343685301
##$SYMM= 0
##$S_DEV= 0
##$TDeff= 65536
##$TDoff= 0
##$TI= <Analysis number 999999
Compound Code 99
Book Reference 9
Project Code 9>
##$TILT= no
##$TM1= 0
##$TM2= 0
##$TOPLEV= 0
##$USERP1= <user>
##$USERP2= <user>
##$USERP3= <user>
##$USERP4= <user>
##$USERP5= <user>
##$WDW= 1
##$XDIM= 32768
##$YMAX_p= 547691958
##$YMIN_p= -258444
$$ End of Bruker specific parameters
$$ ---------------------------------
##NTUPLES= NMR SPECTRUM
##VAR_NAME=  FREQUENCY,     SPECTRUM/REAL,   SPECTRUM/IMAG
##SYMBOL=    X,             R,               I
##VAR_TYPE=  INDEPENDENT,   DEPENDENT,       DEPENDENT
##VAR_FORM=  AFFN,          ASDF,            ASDF
##VAR_DIM=   32768,         32768,           32768
##UNITS=     HZ,            ARBITRARY UNITS, ARBITRARY UNITS
##FACTOR=    0.157963299565203, 1,           1
##FIRST=     4132.6476996994, 0,             0
##LAST=      -1043.33573715361, 0,           0
##MIN=       -1043.33573715361, -258444,     0
##MAX=       4132.6476996994, 547691958,     0
$$ Real data points
##PAGE= N=1
##DATA TABLE= (X++(R..R)), XYDATA
$$ [...]
$$ plain form
22594 12367123 15915942 21164674 29854348 45936494 76835702 124316783 168910132
22587 168910132 195417417 206251909 203671587 178057738 133654747 89865454 57806620
22580 57806620 39132155 28797226 22335350 17724534 14193088 11479699 9435294 7915899
22572 7915899 6770902 5872069 5130407 4493175 3943411 3483366 3088509 2750658 2472531
22563 2472531 2244903 2053781 1880501 1733658 1593231 1460449 1336546 1217327 1112301
22554 1112301 1013775 926022 852691 808147 780470 763415 763461 761792 747078 724310 695040 662728
22542 662728 625704 582017 538797 499607 471984 455720 441679 433227 441932 443360 436164 428531
22530 428531 418797 400633 385774 367889 343607 323541 311911 309315 299642 297576 303835 302440 298038
$$ packed form
22594A2367123L548819N248732Q689674J6082146L0899208M7481081M4593349
22587A68910132K6507285J0834492k580322k5613849m4402991m3789293l2058834
22580E7806620j8674465j0334929o461876m610816l531446k713389k044405j519395
22572G915899j144997q98833p41662o37232n49764m60045l94857l37851k78127
22563B472531k27628j91122j73280j46843j40427j32782j23903j19219j05026
22554A112301r8526q7753p3331m4544k7677j7055M6j669j4714k2768k9270l2312
22542F62728l7024m3687m3220l9190k7623j6264j4041q452Q705J428p196p633
22530D28531r734j8164j4859j7885k4282k0066j1630k596r673k066O259j395m402
$$ plain form
22517 298038 296659 299687 320077 352735 404096 516335 725384 992109 1194720 1303329 1336114
22506 1336114 1263156 1062117 796531 575300 428101 337736 287685 249161 215614 180280
22496 180280 159126 147752 138597 129007 123348 117795 118635 116919 116837 115760 112079 113315 112493 108472 104846
22481 104846 95188 86761 90855 88182 83313 89480 92484 89158 82233 76513 72443 68916 65687 63567
22467 63567 60607 56867 54593 63545 91180 142114 207251 263144 301076 322389 322729 286938 241436
22454 241436 212555 192984 185038 177106 166333 159096 147025 137208 136288 136325 130046 125037 119844 117143
22440 117143 117880 119255 130799 145162 160943 173442 181708 183804 167033 144521 131892 129190 128286
22427 128286 121763 109315 107226 110087 111844 106856 106382 105978 103250 103333 100301 99646 95088 91052 87192
$$ packed form
22517B98038j379L028K0390L2658N1361J12239K09049K66725K02611J08609L2785
22506A336114p2958k01039k65586k21231j47199r0365n0051l8524l3547l5334
22496A80280k1154j1374r155r590n659n553Q40j716q2j077l681J236q22m021l626
22481A04846r658q427M094k673m869O167L004l326o925n720m070l527l229k120
22467F3567k960l740k274Q952K7635N0934O5137N5893L7932K1313L40l5791m5502
22454B41436k8881j9571p946p932j0773p237j2071r817r20L7o279n009n193k701
22440A17143P37J375J1544J4363J5781J2499Q266K096j6771k2512j2629k702r04
22427A28286o523j2448k089K861J757m988m74m04k728Q3l032o55m558m036l860
$$ plain form
22412 87192 86990 89768 89952 85353 78392 73180 65469 60869 65736 72750 76542 82180 91532 93306 93083
22397 93083 95256 92688 92036 88167 83360 71769 61535 45080 32742 24863 29238 35924 37040 38629
22383 38629 38407 39563 40588 45658 41084 31714 25122 20118 11350 4569 9157 17406 32052 41645
22369 41645 40827 36605 29636 22283 18225 15854 11153 6572 8278 9320 16243 22817 22879 27611 40142
22354 40142 47950 49087 46946 29482 21979 29330 41534 50071 52973 51496 47269 46376 43365 42532
22340 42532 42664 41225 40256 39031 44667 47412 51975 56147 54594 53244 51002 42009 32970 28801 30381
22325 30381 34024 33737 40105 39745 38307 35460 32885 28489 25187 12617 12990 17447 12116 13236 16642
22310 16642 16987 23619 31259 33265 31927 23220 19203 19732 26803 30665 32108 32997 35391 33757 33286
$$ packed form
22412H7192k02K778J84m599o961n212p711m600M867P014L792N638R352J774k23
22397I3083K173k568o52l869m807j1591j0234j6455j2338p879M375O686J116J589
22383C8629k22J156J025N070m574r370o592n004q768o781M588Q249J4646R593
22369D1645q18m222o969p353m058k371m701m581J706J042O923O574O2M732J2531
22354D0142P808J137k141j7464p503P351J2204Q537K902j477m227q93l011q33
22340D2532J32j439r69j225N636K745M563M172j553j350k242q993r039m169J580
22325C0381L643k87O368l60j438k847k575m396l302j2570L73M457n331J120L406
22310A6642L45O632P640K006j338q707m017N29P071L862J443Q89K394j634m71
$$ plain form
22295 33286 33539 25790 24336 15466 10066 11563 15398 22682 31644 44085 61789 59291 35659 21710
22281 21710 14932 6776 3267 11668 11324 18725 21740 22610 36139 48424 51267 45987 38666 31700
22267 31700 28680 35346 37084 28798 19821 24061 30433 29640 22222 29597 35978 38150 43784 46350 51420
22252 51420 46106 42684 41585 40848 40809 46931 53951 62386 64823 76088 85771 90131 103343 126785
22238 126785 149183 169076 180196 189713 200926 222861 262386 329151 407096 495285 629352
22227 629352 839414 1179436 1811031 3154628 5963251 9715750 10796732 8518071 5553414
22218 5553414 3219236 1998639 1378589 1023251 806906 666226 542361 445066 377073
22209 377073 326168 290434 273134 253958 222842 191505 164961 143588 121972 114580 102314 88354
$$ packed form
22295C3286K53p749j454q870n400J497L835P284Q962J2441J7704k498k3632j3949
22281B1710o778q156l509Q401l44P401L015Q70J3529J2285K843n280p321o966
22267C1700l020O666J738q286q977M240O372p93p418P375O381K172N634K566N070
22252E1420n314l422j099p37l9O122P020Q435K437J1265R683M360J3212K3442
22238A26785K2398J9893J1120R517J1213K1935L9525O6765P7945Q8189J34067
22227F29352K10062L40022O31595J343597K808623L752499J080982k278661k964657
22218E553414k334178j220597o20050l55338k16345j40680j23865r7295o7993
22209C77073n0905l5734j7300j9176l1116l1337k6544k1373k1616p392j2266j3960
$$ plain form
22197 88354 87273 87760 81282 71147 67680 56106 47203 40232 27334 23164 24481 29813 36210 37368
22183 37368 37485 38376 38676 37640 41077 42929 43845 36397 28677 26821 23439 17915 12575 14212 20964
22168 20964 24736 26749 30832 30775 29455 32065 28801 23081 18212 26475 46881 64605 74098 64682
22154 64682 45780 29311 26495 25760 18430 15428 20338 22829 25940 20382 17998 18159 18903 19855 15666
22139 15666 10101 7867 10962 3865 1319 -65 618 3979 7131 10924 16287 18585 16490 7260 -1454
22124 -1454 2371 5622 7437 12071 11391 16214 15684 16381 20613 26952 15141 10063 8096 5338 10812
22109 10812 13980 12951 15960 13063 18345 30688 37117 38185 53964 74818 90096 91228 77522
22096 77522 59343 45976 46236 44856 36470 21944 20005 21015 14617 7301 13068 15713 19876 21857
$$ packed form
22197H8354j081M87o478j0135l467j1574q903o971j2898m170J317N332O397J158
22183C7368J17Q91L00j036L437J852R16p448p720j856l382n524n340J637O752
22168B0964L772K013M083n7j320K610l264n720m869Q263K0406J7724R493r416
22154F4682j8902j6469k816p35p330l002M910K491L111n558k384J61P44R52m189
22139A5666n565k234L095p097k546j384O83L361L152L793N363K298k095r230q714
22124a454L825L251J815M634o80M823n30O97M232O339j1811n078j967k758N474
22109A0812L168j029L009k897N282J2343O429J068J5779K0854J5278J132j3706
22096G7522j8179j3367K60j380q386j4526j939J010o398p316N767K645M163J981
$$ plain form
22082 21857 23951 16844 7445 4828 4017 3337 4439 12121 14531 15831 9320 10439 10759 7282 -17
22067 -17 232 5181 7323 3762 13059 16920 21535 19359 21896 22987 17596 10707 8755 10406 12527
22052 12527 24272 25146 23135 23409 22783 24932 17552 4796 143 4996 5697 7500 11714 9694 5069
22037 5069 11149 16918 26855 33566 35802 37432 39629 40799 50041 66724 81996 103939 139819 199493
22023 199493 312825 506770 769057 984764 1100921 1140175 1085452 897726 644677 431482
22013 431482 283730 199069 155861 129563 101923 80251 62119 45800 39737 29735 24115 28038
22001 28038 33063 34982 30905 24190 16998 18245 16613 15124 12161 7003 7082 9486 6036 3626 -524
21986 -524 2569 9615 13604 17789 19180 14879 10176 6582 8544 12919 18926 23811 18106 12976 13447
$$ packed form
22082B1857K094p107r399k617q11o80J102P682K410J300o511J119L20l477p299
22067a7K49M949K142l561R297L861M615k176K537J091n391o889j952J651K121
22052A2527J1745Q74k011K74o26K149p380j2756m653M853P01J803M214k020m625
22037E069O080N769R937O711K236J630K197J170R242J6683J5272K1943L5880N9674
22023A99493J13332J93945K62287K15707J16157L9254n4723j87726k53049k13195
22013D31482j47752q4661m3208k6298k7640k1672j8132j6319o063j0002n620L923
22001B8038N025J919m077o715p192J247j632j489k963n158P9K404l450k410m150
21986e24L093P046L989M185J391m301m703l594J962M375O007M885n705n130M71
$$ plain form
21971 13447 5666 3132 -2554 3538 6773 4787 692 7752 5132 2308 2542 3913 7826 7267 4589
21956 4589 2874 9718 11362 4032 8662 11182 9004 7977 10159 6401 10470 14887 8481 6261 15283
21941 15283 25447 20317 11689 8731 9392 11669 9919 9797 12836 5674 5863 13009 13049 10179 1542
21926 1542 1182 1654 1688 5668 1581 -71 -179 -8117 -10459 -10388 -8529 -4867 -4001 831 1450 2539 5239
21909 5239 2135 -9804 -8982 -2464 1691 3986 3352 -118 -3826 -2603 3674 5111 1923 4591 5662
21894 5662 4876 3549 1929 3719 2998 4859 507 954 2660 516 -2617 -3000 -2220 -2100 2803 1320
21878 1320 -2546 -1414 4970 1665 -1619 2846 1210 7501 13872 10995 10484 13737 12080 14845 12543
21863 12543 8011 2992 -4902 -4245 -2655 -228 -1870 -7858 -13148 -6522 -2952 -6067 -667 -26 -1879
$$ packed form
21971A3447p781k534n686O092L235j986m095P060k620k824K34J371L913n59k678
21956D589j715O844J644p330M630K520k178j027K182l758M069M417o406k220R022
21941A5283J0164n130q628k958O61K277j750j22L039p162J89P146M0k870q637
21926A542l60M72L4L980m087j652j08p938k342P1J859L662Q66M832O19J089K700
21909E239l104j1939Q22O518M155K295o34l470l708J223O277J437l188K668J071
21894E662p86j327j620J790p21J861m352M47J706k144l133l83P80J20M903j483
21878A320l866J132O384l305l284M465j636O291O371k877n11L253j657K765k302
21863A2543m532n019p894O57J590K427j642n988n290O626L570l115N400O41j853
$$ plain form
21848 -1879 -4941 -3402 -3745 -3698 -4622 -3875 -6077 -1794 -7095 -11438 -5880 -6520 -7547 -7148 -3037 -4276
21832 -4276 -4123 2480 4922 4527 1705 -1313 -2635 -2289 -7541 -19487 -21396 -10334 -4916 1210 -4280
21817 -4280 -4877 -10263 -18846 -16980 -15827 -10389 -3889 -2618 -41 4181 3565 7057 4626 2852 44
21802 44 -95 449 -552 2361 2275 2056 6586 7287 82 -3721 340 -6019 -7224 -2891 1987 4786 -607
21785 -607 -5805 -4525 -4750 -1610 2294 -279 -776 3531 5312 791 -11703 -13603 -9761 -1046 -2580
21770 -2580 -3321 496 -12 2051 1038 4473 2954 4801 984 -938 -1339 -3231 -9980 -13986 -927
21755 -927 4095 6654 9139 11609 16173 8272 3860 -3458 -1863 -1867 -3288 -913 -1944 3582 5626 5242
21739 5242 2418 6730 3754 770 4424 -3444 -12058 -9112 -1047 1420 -396 -560 -11787 -15163 -6106
$$ packed form
21848a879l062J539l43M7r24P47k202M283n301m343N558o40j027L99M111j239
21832d276J53O603K442l95k822l018j322L46n252j1946j909J1062N418O126n490
21817d280n97n386q583J866J153N438O500J271K577M222o16L492k431j774k808
21802D4j39N44j001K913q6k19M530P01p205l803M061o359j205M333M878K799n393
21785f07n198J280k25L140L904k573m97M307J781m521j2494j900L842Q715j534
21770b580p41L817n08K063j013L435j519J847l817j922m01j892o749m006J3059
21755i27N022K559K485K470M564p901m412p318J595mj421K375j031N526K044l84
21739E242k824M312k976k984L654p868q614K946Q065K467j816j64j1227l376R057
$$ plain form
21724 -6106 1939 5211 17754 22715 18258 9243 -917 -7518 -5914 -1033 -991 231 -2254 -1462 1829
21709 1829 -3866 -1150 -410 3534 3879 4833 3867 -68 -6726 -2907 -3615 -5326 -3920 2649 7314 4165
21693 4165 -854 -904 990 -5057 -10705 -12133 -8071 -4553 6334 9655 4286 2984 4016 2092 2841
21678 2841 15552 17698 16412 12643 4819 355 -9322 -8017 -6095 -11807 -7380 936 2696 8109
21664 8109 13176 8910 1707 -3273 852 5560 15719 23118 36374 56581 55831 40042 28356 22628
21650 22628 9929 -221 821 7951 8102 5907 5871 3706 -867 3539 792 -3197 -2897 -3303 -4073
21635 -4073 -1693 1887 3901 -862 -4106 -5626 -6997 -8073 -4872 2726 9710 9947 6567 6217 8518
21620 8518 1980 -4032 -9676 -9765 -4958 -4735 -9053 -15119 -14314 -5265 -848 3747 3559 -1566 -5311 -4691
$$ packed form
21724f106Q045L272J2543M961m457r015j0160o601J604M881M2J222k485P92L291
21709A829n695K716P40L944L45R54r66l935o658L819p08j711J406O569M665l149
21693D165n019n0J894o047n648j428M062L518J0887L321n369j302J032j924P49
21678B841J2711K146j286l769p824m464r677J305J922n712M427Q316J760N413
21664H109N067m266p203m980M125M708J0159P399J3256K0207p50j5789j1686n728
21650B2628j2699j0150J042P130J51k195l6k165m573M406k747l989L00m06p70
21635d073K380L580K014m763l244j520j371j076L201P598O984K37l380l50K301
21620H518o538o012n644q9M807K23m318o066Q05R049M417M595j88n125l745O20
$$ plain form
21604 -4691 -946 1610 5463 11237 8322 5807 1941 -1022 -4506 -4211 4781 9135 11284 9857 6006
21589 6006 3478 1774 -3980 -9198 -7340 -9872 -10585 -3292 4444 -366 -1288 -708 1455 4521 -4706
21574 -4706 -7609 -1265 -546 1939 4518 4150 1619 2183 2495 3900 -992 -5585 -9535 -9448 -868 2481
21558 2481 4824 5915 7740 4927 -251 -1184 233 -88 -2254 5177 3839 2780 5344 2182 -7899
21543 -7899 -8146 -7857 -3900 3056 3649 -5521 -10927 -10299 -15183 -7402 -1085 679 790 -1884 -3761 2102
21527 2102 -1262 -2862 1678 279 1944 4778 -1452 4766 6750 1420 -3243 1269 4010 2562 -545
21512 -545 -3975 -4369 -1866 -6401 -8131 -4583 -5537 -3193 -5002 -7458 -10591 -10902 -10576 -9766 -11448 -6153
21496 -6153 -6588 -4179 2249 -684 -74 -2255 -3331 1913 7246 340 -7271 -8934 -10490 -16171 -13708
$$ packed form
21604d691L745K556L853N774k915k515l866k963l484K95Q992M354K149j427l851
21589F006k528j704n754n218J858k532p13P293P736m810r22N80K163L066r227
21574d706k903O344P19K485K579l68k531N64L12J405m892m593l950Q7Q580L349
21558B481K343J091J825k813n178r33J417l21k166P431j338j059K564l162j0081
21543g899k47K89L957O956N93r170n406O28m884P781O317J764J11k674j877N863
21527B102l364j600M540j399J665K834o230O218J984n330m663M512K741j448l107
21512e45l430l94K503m535j730L548r54K344j809k456l133l11L26Q10j682N295
21496f153m35K409O428k933O10k181j076N244N333o906p611j663j556n681K463
$$ plain form
21481 -13708 -9270 -9337 -6452 -7445 -6530 -4518 -7741 -11397 -12169 -12720 -8435 -7676 -7031 -3962 -3238 -2768 1424
21464 1424 6180 11355 9399 3417 749 -5491 -8092 -16198 -18752 -14959 -9815 -5213 1582 6322 6213
21449 6213 2588 -1756 -7431 -4185 -767 370 -1476 4552 2320 6629 2536 8314 8145 7866 3135
21434 3135 1560 3950 3965 5167 1142 651 7064 5734 3206 -2676 -3696 -8057 -9761 -8474 -10238
21419 -10238 -9349 -5176 -1968 -4497 -1638 -1500 514 1531 6214 5092 -7428 -12969 -8949 -128 -4663
21404 -4663 -10825 -9202 -8315 -9170 -7293 -5300 -1932 -8719 -10110 -10226 -9803 -14787 -12870 -10108 -6773 -5371
21388 -5371 -4055 -95 -5333 -15352 -15783 -10618 -4294 -1024 -3234 -12013 -5103 -4806 -5195 -3516 -1012
21373 -1012 -3669 -7733 -6462 476 5189 2677 -3079 -11963 -11743 -11330 -10137 -10701 -14315 -12860 -8198
$$ packed form
21481a3708M438o7K885r93R15K012l223l656p72n51M285P59O45L069P24M70M192
21464A424M756N175j956n982k668o240k601q106k554L793N144M602O795M740j09
21449F213l625m344n675L246L418J137j846O028k232M309m093N778j69k79m731
21434C135j575K390J5J202m025m91O413j330k528n882j020m361j704J287j764
21419a0238Q89M173L208k529K859J38K014J017M683j122j2520n541M020Q821m535
21404d663o162J623Q87q55J877J993L368o787j391j16M23m984J917K762L335J402
21388e371J316L960n238j0019m31N165O324L270k210q779O910K97l89J679K504
21373a012k657m064J271O938M713k512n756q884K20M13J193n64l614J455M662
$$ plain form
21358 -8198 -7071 -10284 -11376 -9917 -9923 -3920 -5604 -1672 -965 -3707 -5744 -5403 -10667 -14756 -9759 -16074
21342 -16074 -16809 -10948 -10825 -15277 -15191 -13107 -5958 -4546 -6803 -8266 -9757 -6615 -125 -1429 -3687
21327 -3687 -824 -3156 -4461 -3206 12 6335 6399 -6067 -9753 -9999 -3005 -2039 -8121 -9273 -4089
21312 -4089 -5709 -10133 -13314 -14639 -7812 1362 2945 -4248 -1433 4199 5419 5578 -3140 -6006 -5383
21297 -5383 -6367 -1780 -5627 -6462 -7157 -3565 -444 -2810 -7278 -6360 -7003 -9893 -8750 -318 -1704 -5143
21281 -5143 -3968 1291 1730 -1374 -3359 -7732 -5394 5626 5083 -651 -1717 -4178 -3738 2056 -1351
21266 -1351 -1947 -1184 2531 4970 1791 -3519 -3904 -1918 1141 -978 -715 264 3944 3753 4367 2735
21250 2735 4173 9730 9889 7715 7279 8475 2144 -1101 -4375 -7954 -7056 -6254 1343 8943 15218 4480
$$ packed form
21358h198J127l213j092J459oO003j684L932P07k742k037L41n264m089M997o315
21342a6074p35N861J23m452Q6K084P149J412k257j463j491L142O490j304k258
21327c687K863k332j305J255L218O323O4j2466l686k46O994R66o082j152N184
21312d089j620m424l181j325O827R174J583p193K815N632J220J59q718k866O23
21297e383r84M587l847q35o95L592L121k366m468R18o43k890J143Q432j386l439
21281e143J175N259M39l104j985m373K338J1020n43n734j066k461M40N794l407
21266a351n96P63L715K439l179n310l85J986L059k119K63R79L680j91O14j632
21250B735J438N557J59k174m36J196o331l245l274l579Q98Q02P597P600O275j0738
$$ plain form
21234 4480 -3217 -8621 -11028 -12601 -15151 -10577 -5777 -6531 -11983 -7692 -6176 -3817 -6865 -11352 -14460
21219 -14460 -8388 -5170 -4409 -6506 -2862 -4880 -9133 -15736 -22521 -22325 -15267 -1103 -695 -7944 -9216
21204 -9216 -14760 -11891 -7258 -5970 -2115 3507 6060 458 -6573 -4260 -5191 -14638 -20304 -17179 -15644
21189 -15644 -11830 -15411 -11684 -10609 -9611 -9864 -8557 -4826 -4374 -6515 -7438 -4604 253 977 459 -4425
21173 -4425 -7105 -10471 -11456 -10869 -6580 -1284 -7628 -9269 -6847 -7773 -7781 -3572 -3500 -995 566 -5972 -11967
21156 -11967 -3676 -262 -3057 -9085 -5536 625 -2017 491 -1010 5716 4596 336 -4857 -9355
21142 -9355 -6193 -6587 -9106 -8061 -1110 3266 -3962 -4317 -2856 -5426 -6714 -10689 -4658 -3761 -8390
21127 -8390 -13150 -11419 -7766 -11026 -8732 -7145 -5892 -7220 -8085 -10132 -9570 -10215 -6238 -9358 -12930
$$ packed form
21234D480p697n404k407j573k550M574M800p54n452M291J516K359l048m487l108
21219a4460O072L218P61k097L644k018m253o603o785J96P058J4164M08p249j272
21204i216n544K869M633J288L855N622K553n602p031K313r31r447n666L125J535
21189a5644L814l581L727J075R98k53J307L731M52k141r23K834M857P24n18m884
21173d425k680l366r85N87M289N296o344j641K422r26qM209P2K505J561o538n995
21156a1967Q291L414k795o028L549O161k642K508j501O726j120m260n193m498
21142i355L162l94k519J045O951M376p228l55J461k570j288l975O031Q97m629
21127h390m760J731L653l260K294J587J253j328q65k047N62o45L977l120l572
$$ plain form
21112 -12930 -9831 -6457 -6052 1661 3852 -275 -1513 -4889 -9417 -4537 -1155 -6066 -11683 -16855 -20323
21097 -20323 -11005 -7093 -8834 -2613 -6223 -12006 -10473 -7569 -3687 -4314 -7227 -7866 -10248 -9943 -598
21082 -598 -461 -1626 -6144 -5634 -6027 -5484 -2486 -3440 -11177 -16262 -10891 -4954 -1715 -2002 -4069 -7617
21066 -7617 -9975 -5924 -6080 -8465 -12725 -16828 -20801 -15019 -5051 -3596 -6972 -14169 -19706 -20368 -16193
21051 -16193 -10214 -3932 3757 6677 4360 6606 4591 4133 3939 1498 -1746 -5778 -5688 -1775 4494
21036 4494 -112 -6174 -9463 -14006 -8013 -497 -2239 -2489 2943 -4234 -14527 -12953 -5451 -3369 -6603
21021 -6603 -8267 -5838 -3962 -1368 -1897 -3828 -2156 -7976 -11540 -11219 -5545 -3752 -2445 -4837 -9998
21006 -9998 -6238 -6747 -8795 -8689 -4511 2539 4793 997 -9574 -15894 -10075 -7357 -12419 -8943 -11708
$$ packed form
21112a2930L099L374M05P713K191m127j238l376m528M880L382m911n617n172l468
21097b0323R318L912j741O221l610n783J533K904L882o27k913o39k382L05R345
21082e98J37j165m518N10l93N43K998r54p737n085N371N937L239k87k067l548
21066g617k358M051j56k385m260m103l973N782R968J455l376p197n537o62M175
21051a6193N979O282P689K920k317K246k015m58j94k441l244m032R0L913O269
21036D494m606o062l289m543N993P516j742k50N432p177j0293J574P502K082l234
21021f603j664K429J876K594n29j931J672n820l564L21N674J793J307k392n161
21006i998L760n09k048J06M178P050K254l796j0571o320N819K718n062L476k765
$$ plain form
20991 -11708 -6963 -8932 -5974 1188 -1852 -5920 -14320 -19412 -14613 -6658 -4785 -8062 -9931 -11393
20977 -11393 -122 9374 5657 -5941 -3348 3279 272 113 7157 7365 2473 -1567 -6318 -7177 -10460
20962 -10460 -15833 -16732 -11854 -6554 -7037 -3199 -7284 -2283 -620 -574 -7341 -10631 -10441 -10872 -6980 -646
20946 -646 2305 2869 2058 -6747 -8669 -513 -4911 -11362 -9604 -11762 -18956 -16214 -11425 -3079 680
20931 680 -2056 -3710 -10503 -11507 -6963 -3243 2457 -95 1186 5047 7202 33 -5212 -2216 -2728
20916 -2728 4235 8821 -21 -4978 728 8601 2963 -448 -4687 -7829 -7129 -7363 -268 5338 10377
20901 10377 8777 7188 -5344 -17018 -20134 -16528 -14324 -10948 -10920 -11131 -10490 -5452 -8191 -11348 -14532
20886 -14532 -11994 -12399 -11373 -9388 -3935 -8729 -8884 -15569 -20149 -13175 -2356 2080 3174 -2051 -3027
$$ packed form
20991a1708M745j969K958P162l040m068q400n092M799P955J873l277j869j462
20977a1393J1271R496l717j1598K593O627l007j59P044K08m892m040m751q59l283
20962a0460n373q99M878N300m83L838m085N001J663M6o767l290J90m31L892O334
20946f46K951N64q11q805j922Q156m398o451J758k158p194K742M789Q346L759
20931F80k736j654o793j004M544L720N700k552J281L861K155p169n245K996n12
20916b728O963M586q842m957N706P873n638l411m239l142P00k34P095N606N039
20901A0377j600j589j2532j1674l116L606K204L376K8k11O41N038k739l157l184
20886a4532K538m05J026J985N453m794j55o685m580O974J0819M436J094n225r76
$$ plain form
20871 -3027 -3527 -5087 -1743 -1364 -3501 -6310 -5061 1181 -1268 -3894 -7627 -10606 -11662 -8598 -5521
20856 -5521 -7737 -10923 -7976 -4836 -5883 -3750 -1580 6770 7749 8311 6620 10352 458 -11921 -14924
20841 -14924 -13913 -10739 -10252 -10731 -6376 -8093 -12141 -13702 -10047 -8585 -8446 -11161 -19039 -22706 -14153
20826 -14153 -4306 -10519 -6587 891 3524 -3212 -3302 -7952 -10228 -7276 -3345 -2042 -474 -1714 -4520
20811 -4520 -6674 -3156 -1357 -7081 -10524 -6665 -3233 228 -1240 -2140 -10653 -9043 -4124 -7998 -9030
20796 -9030 -12399 -7468 -565 -4865 -9796 -6427 -6944 -17396 -20372 -16392 -10476 -10605 -8842 -5141 -5070
20781 -5070 -4210 -6336 -8440 -8122 -5416 -13436 -15449 -11237 -3721 -2501 -2882 -4226 -9309 -6161 -3629
20766 -3629 -7070 -11552 -6946 1623 -2436 -8497 -10612 -16259 -13389 -8090 -1970 -3894 -6702 -14245 -8868
$$ packed form
20871c027n00j560L344L79k137k809J249O242k449k626l733k979j056L064L077
20856e521k216l186K947L140j047K133K170Q350R79N62j691L732r894j2379l003
20841a4924J011L174M87m79M355j717m048j561L655J462J39k715p878l667Q553
20826a4153R847o213L932P478K633o736r0m650k276K952L931J303J568j240k806
20811d520k154L518J799n724l443L859L432L461j468r00q513J610M919l874j032
20796i030l369M931O903m300m931L369n17j0452k976L980N916j29J763L701P1
20781e070Q60k126k104L18K706q020k013M212P516J220l81j344n083L148K532
20766c629l441m482M606Q569m059o061k115n647K870N299O120j924k808p543N377
$$ plain form
20751 -8868 -78 5661 4667 4952 -3921 -10320 -4118 -657 -1341 -5718 -8599 -5357 -8300 -8096 1076 4806
20735 4806 -1329 -5131 -8354 -12185 -14044 -12854 -7401 -7005 -7872 -6255 -5431 1491 -338 372 4098 -3522
20719 -3522 -11221 -12251 -17185 -18844 -12386 -5916 2138 -11 -3916 -4702 -7046 -17743 -24534 -18742 -12962
20704 -12962 -4720 -8414 -11384 -11874 -7382 -7538 -10274 -19598 -21538 -13488 -11154 -22632 -24910 -20420 -18221
20689 -18221 -12991 -8206 -4913 -716 2611 -4537 -7286 -5821 -6536 -4581 -7029 -8153 -6708 954 4206
20674 4206 4769 -27 -8425 -8411 -3936 -5379 -9754 -15878 -15325 -12504 -8997 -15379 -20622 -13018 -12311 -14267
20658 -14267 -11526 -4480 -10559 -8613 -4776 201 6599 690 -5676 -6339 -5352 -10565 -8303 797 145
20643 145 -6155 -14530 -12469 -13491 -16583 -16730 -16234 -15734 -13511 -6512 -6777 -18655 -17624 -12730 -7012 -3578
$$ packed form
20751h868Q790N739r94K85q873o399O202L461o84m377k881L242k943K04R172L730
20735D806o135l802l223l831j859J190N453L96q67J617Q24O922j829P10L726p620
20719c522p699j030m934j659O458O470Q054k149l905p86k344j0697o791N792N780
20704a2962Q242l694k970m90M492j56k736r324j940Q050K334j1478k278M490K199
20689a8221N230M785L293M197L327p148k749J465p15J955k448j124J445P662L252
20674D206N63m796q398J4M475j443m375o124N53K821L507o382n243P604P07j956
20658a4267K741P046o079J946L837M977O398n909o366o63R87n213K262R100o52
20643A45o300q375K061j022l092j47M96N00K223O999k65j1878J031M894N718L434
$$ plain form
20627 -3578 -7001 -11250 -11270 -9718 -7117 614 4012 314 -6840 -13862 -13098 -15715 -11615 -5675 -5401 -3543
20611 -3543 -389 9789 1371 -6356 -4126 -2072 -4534 -4795 1328 3619 -2148 -7910 -4397 -2333 -1693
20596 -1693 -5928 -14574 -19797 -20990 -17190 -12813 -12291 -12732 -16751 -15437 -11660 -12477 -13145 -13690 -15936 -21088
20580 -21088 -19460 -14803 -16525 -18609 -19975 -20404 -24382 -24052 -15189 -11921 -8841 -12320 -7357 -1191 -969
20565 -969 -3734 -10556 -17824 -11473 -12376 -11431 -9651 -11725 -11723 -11288 -23019 -23232 -11011 -9536 -8323 2359
20549 2359 886 -6227 -2676 -4495 -4427 -8477 -17341 -14546 -4417 -3797 -4594 -656 3998 -150 -9615
20534 -9615 -16537 -18118 -22647 -19471 -13356 -14151 -12149 -7725 -5006 -1201 -3011 -5626 -4939 -5800 -1302
20519 -1302 -4735 -7381 -1057 -1183 -1899 -4434 -6700 -14073 -22797 -20910 -10878 -9629 -13751 -14139 -9597
$$ packed form
20627c578l423m249k0J552K601P731L398l698p154p022P64k617M100N940K74J858
20611c543L154J0178q418p727K230K054k462k61O123K291n767n762L513K064O40
20596a693m235q646n223j193L800M377N22m41m019J314L777q17o68n45k246n152
20580b1088J628M657j722k084j366m29l978L30Q863L268L080l479M963O166K22
20565i69k765o822p268O351r03R45J780k074KM35j1731k13J2221J475J213J0682
20549B359j473p113L551j819O8m050q864K795J0129O20p97L938M654m148r465
20534i615o922j581m529L176O115p95K002M424K719L805j810k615O87q61M498
20519a302l433k646O324j26p16k535k266p373q724J887J0032J249m122l88M542
$$ plain form
20504 -9597 -2351 5604 4982 -1314 280 -3316 -10560 -13174 -8206 -7499 -3701 -7678 -5823 -7610 -13029
20489 -13029 -12293 -11522 -12076 -5822 -1774 -3568 -9156 -9316 -13163 -15054 -9429 -4198 1122 9953 7197
20474 7197 -605 -7175 -13307 -12562 -8209 -2899 -3621 -3511 1130 -1026 -9711 -13392 -11779 -10987 -8787 -10239
20458 -10239 -5692 2139 3400 -4042 -9035 -6392 -6072 -6751 -4033 1363 -1705 4661 11811 9577 3111
20443 3111 304 -6092 -3163 -2170 -3416 -9348 -14520 -11045 -7424 -6154 -12138 -13746 -17285 -19771 -14340
20428 -14340 -9641 -10951 -8510 -10941 -11963 -6868 -2296 -1917 -14126 -15237 -9458 -6170 -3282 -3146 -7955
20413 -7955 -3822 -5168 -1462 -1607 -2196 -2602 -1899 -9972 -18037 -14293 -14661 -15347 -14697 -11221 -8916 -10482
20397 -10482 -10886 -9896 -4620 1199 3583 3547 3774 -655 -7494 -12743 -7009 -6417 -10640 -11827 -7730 -5979
$$ packed form
20504i597P246P955o22o296J594l596p244k614M968P07L798l977J855j787n419
20489a3029P36P71n54O254M048j794n588j60l847j891N625N231N320Q831k756
20474G197p802o570o132P45M353N310p22J10M641k156q685l681J613P92K200j452
20458a0239M547P831J261p442m993K643L20o79K718N396l068O366P150k234o466
20443C111k807o396K929R93j246n932n172L475L621J270n984j608l539k486N431
20428a4340M699j310K441k431j022N095M572L79j2209j111N779L288K888J36m809
20413g955M133j346L706j45n89m06P03q073q065L744l68o86O50L476K305j566
20397a0482m04R90N276N819K384l6K27m429o839n249N734N92m223j187M097J751
$$ plain form
20381 -5979 -2656 -6203 -6308 -5049 -9115 -11642 -7385 -7088 -12388 -10939 -7483 -2540 415 -411 -932 780
20365 780 -3048 -5829 -12695 -17828 -22999 -19509 -13921 -15477 -13768 -13726 -14698 -9318 -2902 4942 6517 2179
20349 2179 -38 1434 2526 375 -7237 -9362 -2368 -2351 -9548 -9511 -7116 -11160 -4079 238 2487 1107
20333 1107 -245 -7828 -10141 -14447 -12401 -10843 -16064 -16418 -13256 -13069 -15564 -16807 -14591 -6829 -10068
20318 -10068 -11474 -11798 -9779 -1494 884 9 -5125 -10324 -15998 -14499 -12164 -13923 -18938 -18593 -16439
20303 -16439 -18303 -18288 -14279 -6017 -3644 -5163 2563 3311 -1736 -6658 -4509 2380 -7167 -14090 -10957
20288 -10957 -10131 -6962 -10976 -9103 -5231 -9793 -12963 -17622 -16136 -8689 -11349 -19136 -20119 -14405 -8808
20273 -8808 -10987 -10898 -7442 -6704 -11084 -13477 -15097 -8756 -1707 -620 -3316 -6306 -11772 -9517 -7558
$$ packed form
20381e979L323l547j05J259m066k527M257K97n300J449L456M943K955q26n21J712
20365G80l828k781o866n133n171L490N588j556J709M2r72N380O416P844J575m338
20349B179k217J472J092k151p612k125O994J7p197L7K395m044P081M317K249j380
20333A107j352p583k313m306K046J558n221l54L162J87k495j243K216P762l239
20318a0068j406l24K019Q285K378q75n134n199n674J499K335j759n015L45K154
20303a6439j864J5M009Q262K373j519P726P48n047m922K149O889r547o923L133
20288a0957Q26L169m014J873L872m562l170m659J486P447k660p787r83N714N597
20273h808k179Q9L456P38m380k393j620O341P049J087k696k990n466K255J959
$$ plain form
20258 -7558 -9589 -12279 -13291 -15352 -13686 -13162 -14935 -13874 -10031 -12645 -11407 -10845 -11320 -10189 -13079
20243 -13079 -9660 -12767 -9647 -7382 -4167 3075 1341 -4122 -12003 -16091 -14095 -14843 -16756 -19237 -10345
20228 -10345 -2173 4005 -68 632 2022 8163 4957 501 -8696 -13092 -8697 -16420 -14252 -636
20214 -636 -773 -8253 -7155 3371 3800 378 -3662 -3458 -931 4578 3300 6778 1369 -7046 -11658
20199 -11658 -15311 -16233 -12789 -6308 -3373 -7124 -10597 -6678 -3812 -496 -790 -1526 -5557 -7022 -7809
20184 -7809 -7864 -7335 -6187 -6258 -4969 3480 -147 -6128 -2465 5423 -1787 -5485 -5487 -932 3669 104 341
20167 341 1171 5514 8363 828 -9796 -16195 -12882 -6960 -7830 -5921 -4418 -4972 -3410 -2251 -2554 -3531
20151 -3531 915 -2095 -5448 -2024 1287 4220 6126 1511 -3228 -4289 -845 5151 5365 -3198 -10897
$$ packed form
20258g558k031k690j012k061J666N24j773J061L843k614J238N62m75J131k890
20243a3079L419l107L120K265L215P242j734n463p881m088J996p48j913k481Q892
20228a0345Q172O178m073P00J390O141l206m456r197m396M395p723K168J3616
20214f36j37p480J098J0526M29l422m040K04K527N509j278L478n409q415m612
20199a1658l653r22L444O481K935l751l473L919K866L316k94p36m031j465p87
20184g809n5N29J148p1J289Q449l627n981L663P888p210l698kM555M601l565K37
20167C41Q30M343K849p535j0624o399L313N922q70J909J503n54J562J159l03r77
20151c531M446l010l353L424L311K933J906m615m739j061L444N996K14q563p699
$$ plain form
20136 -10897 -20578 -23244 -24155 -25065 -25116 -22210 -18632 -12255 -8163 -11834 -12915 -9408 -11619 -13762 -12355
20121 -12355 -14123 -8698 -8180 -6611 -5107 -9021 -8850 -13422 -15789 -15758 -11011 -14501 -19384 -15182 -7917
20106 -7917 -4708 -11163 -12334 -7869 -10659 -20568 -20782 -16434 -11776 -7643 -10313 -12772 -13660 -15459 -13900
20091 -13900 -12024 -378 1489 -6465 -3642 -644 1412 -3190 -8884 -9761 -11439 -15003 -15426 -21685 -13986
20076 -13986 -13010 -10680 -14437 -19604 -14772 -12889 -11360 -13764 -11503 -10302 -17544 -20519 -22556 -23771 -20639
20061 -20639 -22419 -12185 -10391 -11164 -4635 -1863 1257 2633 2151 -7139 -10223 -6941 -6261 -11268 -15307
20046 -15307 -16046 -12319 -10701 -15166 -20736 -20073 -11942 -11009 -5778 -1875 1600 3511 646 261 -6000
20031 -6000 -13455 -14029 -20138 -18396 -17192 -16654 -12942 -13076 -14985 -2927 5107 -2654 -10922 -6657 -8392
$$ packed form
20136a0897r681k666r11r10n1K906L578O377M092l671j081L507k211k143J407
20121a2355j768N425N18J569J504l914J71m572k367L1M747l490m883M202P265
20106g917L209o455j171M465k790r909k14M348M658M133k670k459q88j799J559
20091a3900J876J1646J867p954K823K998K056m602n694q77j678l564m23o259P699
20076a3986R76K330l757n167M832J883J529k404K261J201p242k975k037j215L132
20061b0639j780J0234J794p73O529K772L120J376m82r290l084L282O80n007m039
20046a5307p39L727J618m465n570O63Q131R33N231L903L475J911k865l85o261
20031f000p455n74o109J742J204N38L712j34j909J2058Q034p761q268M265j735
$$ plain form
20016 -8392 -14078 -17069 -11504 -10181 -10736 -9148 -8584 -6404 -4751 -7729 -19810 -19215 -17062 -11824 -9389
20001 -9389 -6150 -8428 -11039 -7984 -2729 -3701 -10188 -21083 -19950 -17638 -9501 -13754 -15190 -12374 -4589
19986 -4589 -741 -8647 -5832 -7616 -9717 -44 1008 -1711 -3154 -4557 -10822 -9368 -6539 -4025 -7817
19971 -7817 -12679 -14049 -11387 -6053 -8006 -14095 -15631 -14208 -15380 -15226 -13201 -18835 -25521 -28191 -17600
19956 -17600 -12146 -11646 -15117 -14171 -14373 -12628 -4478 -7169 -11607 -14206 -15004 -10666 -8898 -15217 -10496
19941 -10496 -8785 -8646 -8364 -10146 -8489 -11734 -9421 189 325 -1770 -1050 -5906 -6150 -502 4739 -4754
19925 -4754 -12787 -6860 -3097 -2574 -1373 -3173 -963 2149 1510 -5241 -10236 -10062 -12145 -13249 -18486
19910 -18486 -15141 -5187 -2717 -6478 -7157 -6161 -8546 -7829 -7499 -15142 -16411 -13462 -17288 -14314 -12172
$$ packed form
20016h392n686k991N565J323n55J588N64K180J653k978j2081N95K153N238K435
20001i389L239k278k611L055N255r72o487j0895J133K312Q137m253j436K816P785
19986d589L848p906K815j784k101R673J052k719j443j403o265J454K829K514l792
19971g817m862j370K662N334j953o089j536J423j172J54K025n634o686k670J0591
19956a7600N454N00l471R46k02J745Q150k691m438k599p98M338J768o319M721
19941a0496J711J39K82j782J657l245K313R610J36k095P20m856k44N648N241r493
19925d754q033N927L763N23J201j800K210L112o39o751m995J74k083j104n237
19910a8486L345R954K470l761o79R96k385P17L30p643j269K949l826K974K142
$$ plain form
19895 -12172 -15585 -21116 -19909 -16845 -10573 -10774 -5715 -7839 -8974 -6519 -3171 -8600 -9638 -3626 -5883
19880 -5883 -11338 -10195 -4115 -3156 -4303 371 766 -8722 -7182 -5587 -5211 -1085 -869 -146 -8013 -15022
19864 -15022 -10316 -13898 -10242 -4290 -1168 -7285 -4498 721 -1363 -2388 -680 1999 600 -8702
19850 -8702 -7410 3403 8237 3418 -4434 -2228 1872 3527 -1908 -7870 -9244 -7521 -10101 -17266
19836 -17266 -17640 -9802 -7239 -3709 -5042 -8025 -4519 -5274 -7767 -14452 -15202 -12666 -8245 -7220 -5960
19821 -5960 -7211 -3716 -6450 -7814 -2941 -2568 -6178 -4358 -2246 572 -6512 -15126 -14908 -6041 -4125
19806 -4125 -4165 -7327 -10217 -8321 -12721 -9171 -5705 6840 10925 7633 1225 -7697 -13603 -12886 -8695
19791 -8695 -8211 -6725 -10256 -16601 -15036 -9830 -9683 -11474 -18231 -15613 -13610 -11117 -11750 -19059 -17900
$$ packed form
19895a2172l413n531J207L064O272k01N059k124j135K455L348n429j038O012k257
19880e883n455J143O080R59j147M674L95r488J540J595L76M126K16P23p867p009
19864a5022M706l582L656N952L122o117K787N219k084j025J708K679j399r302
19850h702J292J0813M834m819p852K206M100J655n435n962j374J723k580p165
19836a7266l74P838K563L530j333k983L506p55k493o685p50K536M421J025J260
19821e960j251L495k734j364M873L73l610J820K112K818p084q614K18Q867J916
19806d125m0l162k890J896m400L550L466J2545M085l292o408q922n906P17M191
19791h695M84J486l531o345J565N206J47j791o757K618K003K493o33p309J159
$$ plain form
19776 -17900 -20708 -21183 -18624 -11128 -5378 -2356 3186 -1767 -2961 -5619 -2358 1038 -652 2457 -1012
19761 -1012 3580 -5237 -17595 -17053 -13179 -10762 -9834 -5344 -7908 -6057 -2864 -1505 -9511 -12938 -6243
19746 -6243 -6027 -9061 -8854 -4255 -2641 -3546 -5473 -2723 -6285 -4027 -1895 -6066 -10455 -16564 -13424
19731 -13424 -10696 -10183 -10619 -7031 -10989 -18796 -19765 -22657 -19377 -13457 -10550 -12466 -11174 -10529 -7577
19716 -7577 -6663 -7669 -4228 -3479 -1383 -3838 -6788 -5439 -8562 -8013 -4665 -3627 -8887 -9181 -8912 -10847
19700 -10847 -8764 -13137 -11103 -6865 -8981 -9041 -5150 -4565 -5090 -3980 -9966 -7154 -5225 -17631 -16240
19685 -16240 -9186 -3725 -4120 -5287 -4208 -4485 -6512 -11942 -12219 -7604 66 4210 296 -5132 -2982
19670 -2982 7020 8692 4962 -2102 -10662 -12584 -9532 -10660 -14517 -10919 -13223 -17589 -20339 -21214 -16413
$$ packed form
19776a7900k808m75K559P496N750L022N542m953j194k658L261L396j690L109l469
19761a012M592q817j2358N42L874K417R28M490k564J851L193J359q006l427O695
19746f243K16l034K07M599J614r05j927K750l562K258K132m171m389o109L140
19731a3424K728N13m36L588l958p807r69k892L280N920K907j916J292O45K952
19716g577R14j006L441P49K096k455k950J349l123N49L348J038n260k94K69j935
19700a0847K083m373K034M238k116o0L891N85n25J110n986K812J929j2406J391
19685a6240P054N461l95j167J079k77k027n430k77M615P670M144l914n428K150
19670b982J0002J672l730p064q560j922L052j128l857L598k304m366k750q75M801
$$ plain form
19655 -16413 -8757 -7614 -9301 -13023 -13173 -12999 -14685 -12121 -14681 -17089 -19043 -23111 -26396 -20060 -18726
19640 -18726 -15425 -14611 -17004 -18804 -12309 -8158 -8251 -3676 -4157 -2738 -879 -1838 -5908 -12518 -16765 -15954
19624 -15954 -17692 -15003 -2517 -500 -2903 -8665 -8201 -4697 -8793 -13541 -15954 -16162 -14953 -18141 -15597
19609 -15597 -20549 -24864 -24482 -22992 -22864 -16110 -6975 -5552 -7772 -1092 -2521 -3614 -4510 -8366 -12500
19594 -12500 -14913 -12537 -7931 -6626 -4453 -10762 -18521 -22511 -11518 -5607 -2493 644 3103 -4700
19580 -4700 -4651 -2272 -6584 -12293 -17331 -12477 -10341 -12395 -10986 -11284 -5085 1936 -2549 -9164 -9778 -8682
19564 -8682 1491 7776 4282 4507 -311 -7044 -15029 -16262 -13787 -14144 -14235 -10098 -6225 -4864 -7078
19549 -7078 -13813 -12450 -11794 -13710 -12754 -15757 -16691 -18201 -19137 -17264 -14264 -11570 -14509 -11950 -13198 -19516
$$ packed form
19655a6413P656J143j687l722j50J74j686K564k560k408j954m068l285O336J334
19640a8726L301Q14k393j800O495M151r3M575m81J419J859r59m070o610m247Q11
19624a5954j738K689J2486K017k403n762M64L504m096m748k413k08J209l188K544
19609a5597m952m315L82J490J28O754R135J423k220O680j429j093q96l856m134
19594a2500k413K376M606J305K173o309p759l990J0993N911L114L137K459p803
19580d700M9K379m312n709n038M854K136k054J409k98O199P021m485o615o14J096
19564h682J0173O285l494K25m818o733p985j233K475l57r1M137L873J361k214
19549g078o735J363O56j916R56l003r34j510r36J873L000K694k939K559j248o318
$$ plain form
19533 -19516 -21980 -13280 -3330 -3889 -15889 -20587 -20700 -12684 -13145 -16455 -11493 -4354 -4094 -8623 -8458
19518 -8458 -10162 -9940 -1277 243 6752 7010 2638 -2755 -8025 -11422 -6555 -3901 1410 1736 -2456
19503 -2456 -6343 -14453 -10912 -376 -6808 -13228 -14024 -11288 -8796 -7595 -12532 -12553 -11070 -820 3141
19488 3141 -1499 -3592 -13041 -16650 -18198 -10235 -2250 -8255 -9727 -8600 -1361 -4980 -4280 -2744 -4805
19473 -4805 -4923 -10890 -11482 -9662 -6297 -7389 -5261 -6866 -10882 -10822 -12170 -13757 -14940 -17835 -19594 -14920
19457 -14920 -14804 -20992 -13840 -9095 -9945 -1031 6175 -169 -12365 -12366 -5125 -7085 -2780 -3968 -6274
19442 -6274 -5986 -6348 -9288 -8666 -2616 1384 4740 4906 3029 2796 2884 7661 12622 7359 1258 -6003
19426 -6003 -10120 -10189 -12401 -7851 -9740 -19262 -19378 -13093 -7316 -1380 -11911 -17224 -10384 -10856 -10120 -13500
$$ packed form
19533a9516k464Q700R950n59j2000m698j13Q016m61l310M962P139K60m529J65
19518h458j704K22Q663J520O509K58m372n393n270l397M867K654N311L26m192
19503b456l887q110L541J0536o432o420p96K736K492J201m937k1J483J0250L961
19488C141m640k093r449l609j548P963P985o005j472J127P239l619P00J536k061
19473d805j18n967n92J820L365j092K128j605m016O0j348j587j183k895j759M674
19457a4920J16o188P152M745q50Q914P206o344j2196jP241j960M305j188k306
19442f274K88l62k940O22O050M000L356J66j877k33Q8M777M961n263o101p261
19426f003m117o9k212M550j889r522j16O285N777N936j0531n313O840m72P36l380
$$ plain form
19410 -13500 -15486 -11510 -3232 4303 8095 8721 4003 -2182 -2391 -4502 -8528 -8922 -12691 -10071 -14161
19395 -14161 -10540 -5406 -866 -5045 -10225 -4949 -10426 -9938 -6303 2159 -768 1422 2718 1073 -275
19380 -275 -1972 -357 4751 1798 457 -3415 -3314 -6436 -12866 -18536 -10108 -3208 -664 -2109 1248
19365 1248 15758 23569 32724 63024 103944 131504 131119 104462 68622 46949 35073 26059 19131
19352 19131 7127 2640 9018 11159 4410 -4101 -10345 -6036 -3353 -7792 -8439 1015 10533 11708
19338 11708 11450 12954 12072 12793 7749 7514 5728 4963 6941 5889 1611 926 -831 3905 9463 10294
19322 10294 11892 7550 6606 13224 20803 15101 10029 5404 4618 -162 4522 6909 9838 5188 10234
19307 10234 10209 15427 18573 20603 19649 20765 20743 21884 22656 24406 23430 25452 30218 37392 35860 40308
$$ packed form
19410a3500j986L976Q278P535L792O26m718o185k09k111m026l94l769K620m090
19395a4161L621N134M540m179n180N276n477M88L635Q462k927K190J296j645j348
19380b75j697J615N108k953j341l872J01l122o430n670Q428O900K544j445L357
19365A248J4510P811R155L0300M0920K7560l85k6657l5840k1673j1876r014o928
19352A9131j2004m487O378K141o749q511o244M309K683m439o47R454R518J175
19338A1708k58J504q82P21n044k35j786p65J978j052m278o85j757M736N558Q31
19322A0294J598m342r44O618P579n702n072m625p86m780M684K387K929m650N046
19307A0234k5N218L146K030r54J116k2J141P72J750r76K022M766P174j532M448
$$ plain form
19291 40308 42282 48286 53877 68073 82942 87163 91364 101049 120962 138526 156976 170883 191575
19278 191575 220363 258544 293373 336449 382262 426469 470894 515967 559854 610461 654784
19267 654784 676408 690645 697579 689523 669561 642366 605744 563806 515694 465151 416050 376719
19255 376719 333123 285902 245428 213611 188408 168043 144460 129029 109868 97183 94344 91948
19243 91948 87592 82101 64590 52106 53029 53210 47362 39836 36060 30077 30606 33762 35386 38464 32393
19228 32393 27022 28626 29779 26933 25415 14404 13117 20269 24429 24120 11682 5193 5934 5447 5820
19213 5820 7250 7628 7880 11678 4937 1760 11857 7019 -2148 -1588 1285 3018 1187 1063 1427 6709
19197 6709 9267 -2674 -6822 -9356 -2165 -761 -5491 -8663 -3765 -1587 -4544 -3014 2629 -2991
$$ packed form
19291D0308J974O004N591J4196J4869M221M201R685J9913J7564J8450J3907K0692
19278A91575K8788L8181L4829M3076M5813M4207M4425M5073M3887N0607M4323
19267F54784K1624J4237O934q056j9962k7195l6622m1938m8112n0543m9101l9331
19255C76719m3596m7221m0474l1817k5203k0365k3583j5431j9161j2685k839k396
19243I1948m356n491j7511j2484R23J81n848p526l776n983N29L156J624L078o071
19228C2393n371J604J153k846j518j1011j287P152M160l09j2438o489P41m87L73
19213E820J430L78K52L798o741l177J0097m838r167N60K873J733j831j24L64N282
19197F709K558j1941m148k534P191J404m730l172M898K178k957J530N643n620
$$ plain form
19183 -2991 -5148 -1468 -212 -3504 -712 3250 4208 2909 -4613 -7437 -6434 -6518 1884 3146 2555 2804
19167 2804 1796 786 -5581 -5793 -5511 -3732 -9133 -7415 -12397 -18116 -18377 -15749 -10555 -2599 2033
19152 2033 3490 4799 -1109 -7215 -8590 -9837 -11015 -12243 -19762 -20304 -12476 -4782 -4101 -1401 -7617
19137 -7617 -10880 -12307 -7115 -7718 -5605 -7219 -8769 -6869 -4774 -1899 3642 -2538 1433 -4850 -16318
19122 -16318 -13507 -4764 -7086 -9021 -9359 -14621 -17451 -19906 -15153 -10250 -9015 -12216 -9369 -9545 -9102
19107 -9102 -6896 -2415 3644 1292 -6256 -6651 -7526 -2708 3905 1562 3522 2306 3298 -7889 -16996
19092 -16996 -14573 -10176 -1526 -1087 -773 -395 -4590 -4219 -1306 979 -2902 986 -1223 -7937 -14738
19077 -14738 -10834 -10204 -8957 -10551 -10563 -14957 -13635 -11431 -14625 -16019 -12371 -6723 698 -1983 -10147
$$ packed form
19183b991k157L680J256l292K792L962R58j299p522k824J003q4Q402J262n91K49
19167B804j008j010o367k12K82J779n401J718m982n719k61K628N194P956M632
19152B033J457J309n908o106j375j247j178j228p519n42P828P694O81K700o216
19137g617l263j427N192o03K113j614j550J900K095K875N541o180L971o283j1468
19122a6318K811Q743k322j935l38n262k830k455M753M903J235l201K847j76M43
19107i102K206M481O059k352p548l95q75M818O613k343J960j216R92j1187r107
19092a6996K423M397Q650M39L14L78m195L71K913K285l881L888k209o714o801
19077a4738L904O30J247j594j2m394J322K204l194j394L648N648P421k681q164
$$ plain form
19062 -10147 -11767 -1641 4210 2978 482 4127 4959 -721 -8290 -4516 -182 -2506 -4662 -7731
19048 -7731 -4981 -1064 317 -4496 -11385 -12091 -8641 -5445 -6107 -5035 -8912 -15712 -20662 -18028 -11577
19033 -11577 -151 1687 -3084 -12945 -13870 -18261 -17182 -5892 -312 -7820 -15644 -13621 -12162 -10211
19019 -10211 -8612 -15098 -13709 -7722 -6799 -11789 -9339 -3359 -5689 -3115 -3931 -7693 -6724 -4161 -3258
19004 -3258 -4788 -2092 -6455 -8598 -6498 -4318 -3709 -5761 -9723 -11441 -11662 -8513 -5580 -1146 -2990
18989 -2990 -7069 -12987 -18968 -12328 -977 -5560 -10095 -7734 -4023 1813 4995 5787 7030 -1280 -5798
18974 -5798 -995 -2386 -999 3853 -1159 -2717 3765 5840 4524 825 1184 -536 -7878 -6993 1464
18959 1464 11555 5598 3932 9763 9689 9115 10305 4130 -7148 -6807 -3591 2165 -5015 -4734 -9311
$$ packed form
19062a0147j620J0126N851j232k496L645Q32n680p569L774M334k324k156l069
19048g731K750L917J381m813o889p06L450L196o62J072l877o800m950K634O451
19033a1577J1426J838m771r861r25m391J079J1290N580p508p824K023J459J951
19019a0211J599o486J389N987R23m990K450N980k330K574q16l762R69K563R03
19004c258j530K696m363k143K100K180O09k052l962j718k21L149K933M434j844
18989b990m079n918n981O640J1351m583m535K361L711N836L182P92J243q310m518
18974e798M803j391J387M852n012j558O482K075j316l699L59j720p342Q85Q457
18959A464J0091n957j666N831p4n74J190o175j1278L41L216N756p180K81m577
$$ plain form
18944 -9311 -11319 -8139 -10481 -5462 147 1810 -7273 -12147 -7219 -5098 1062 -2605 -7093 -997 3137
18929 3137 -703 -2079 4317 4102 -5239 -4609 -10006 -7976 -1105 -12450 -15661 -10262 -5552 -7416 -7395
18914 -7395 -8189 -4332 -1947 -6346 -3611 -4314 -4907 -2741 -3677 -9492 -13980 -12455 -10643 -5922 -6570 -5829
18898 -5829 -10752 -12574 -9867 -1084 4869 1077 -5375 642 5204 4532 -501 -3850 699 463 -8273
18883 -8273 -12447 -4478 -6675 -10994 -7560 -10487 -12464 -12652 -16055 -20555 -20731 -14208 -6586 -2281 -2535
18868 -2535 -12386 -18046 -20968 -18978 -13267 -6065 -5087 -4535 -408 1950 -1722 -8596 -8302 -14156 -16346
18853 -16346 -12860 -6128 -7697 -6044 2066 -1300 -6668 -11746 -14538 -15770 -15030 -9475 -9950 -8683 -5538
18838 -5538 -6099 -9469 -20146 -26282 -26652 -25353 -22139 -15305 -10879 -9184 -10712 -14991 -14473 -4091 2456
$$ packed form
18944i311k008L180k342N019N609J663r083m874M928K121O160l667m488O096M134
18929C137l840j376O396k15r341O30n397K030O871j1345l211N399M710j864K1
18914g395p94L857K385m399K735p03n93K166r36n815m488J525J812M721o48P41
18898e829m923j822K707Q783N953l792o452O017M562o72n033l349M549k36q736
18883h273m174P969k197m319L434k927j977j88l403m500j76O523P622M305k54
18868b535r851n660k922J990N711P202R78N52M127K358l672o874K94n854k190
18853a6346L486O732j569J653Q110l366n368n078k792j232P40N555m75J267L145
18838e538n61l370j0677o136l70J299L214O834M426J695j528m279N18J0382O547
$$ plain form
18823 2456 7485 4056 8238 8442 908 -739 -410 -994 -6195 -8825 -7041 -2055 366 -2960 -3750 -649
18807 -649 -2857 -8456 -8116 -5349 -5729 -12039 -14145 -11013 -10570 -17379 -18404 -20729 -26651 -22961 -12191
18792 -12191 -8073 -8344 -6621 1514 4572 -513 -5207 -8712 -19810 -15926 1199 -1923 -3840 -6885
18778 -6885 -8744 -9917 -3586 -1187 -1552 -2351 -5442 4462 12440 20696 37059 65647 78592 64120
18764 64120 39429 21381 14492 16461 13761 4944 -951 -3754 -5436 -8872 -5401 -3495 -2584 -4218
18750 -4218 -867 2075 2577 -4073 -5917 -5693 -1993 2513 -4992 -11832 -13454 -10243 -5436 -2978 -3207
18735 -3207 -1802 3180 1743 -6870 -9108 -6554 -2608 -3061 -5403 -9442 -16064 -19878 -23972 -16190 -9968
18720 -9968 -11402 -10544 -11292 -17886 -15866 -10314 -4770 2566 4194 1540 6806 3154 -202 -4538 -4420
$$ packed form
18823B456N029l429M182K04p534j647L29n84n201k630J784M986K421l326p90L101
18807f49k208n599L40K767l80o310k106L132M43o809j025k325n922L690J0770
18792a2191M118k71J723Q135L058n085m694l505j1098L884J7125l122j917l045
18778f885j859j173O331K399l65p99l091R904P978Q256J6363K8588J2945j4472
18764F4120k4691j8048o889J969k700q817n895k803j682l436L471J906R11j634
18750d218L351K942N02o650j844K24L700M506p505o840j622L211M807K458k29
18735c207J405M982j437q613k238K554L946m53k342m039o622l814m094P782O222
18720i968j434Q58p48o594K020N552N544P336J628k654N266l652l356m336J18
$$ plain form
18705 -4420 -1374 -1411 -4379 -4107 -2241 -4790 -3715 -928 -4510 -10279 -9117 118 1955 -3373 -6901
18690 -6901 -4304 889 -1316 -2223 -3001 -6777 -10280 -17772 -18259 -10523 -34 -2359 -6226 -5567 -4544
18675 -4544 560 7690 466 -8042 -8351 -3999 721 368 -1694 -1231 -2149 -5043 -4872 3881 11679 16833
18659 16833 15570 8928 7010 8595 6611 6384 10922 16289 15988 15760 13786 11436 14411 17226 21947
18644 21947 28218 42649 53558 81381 129638 200867 286724 338854 317492 247799 191016 152010
18632 152010 160570 210136 287746 350305 348255 277766 190331 129229 86010 63722 54701 47544
18620 47544 36479 32678 29874 27876 24909 20827 19872 15458 9923 10126 13269 14160 17191 14149 9970
18605 9970 10198 8061 2792 3206 6581 8141 14440 22177 21773 25657 29532 32433 43308 58338 79098
$$ packed form
18705d420L046l7k968K72J866k549J075K787l582n769J162R235J837n328l528
18690f901K597N193k205r07p78l776l503p492m87P736J0489k325l867O59J023
18675d544N104P130p224q508l09M352M720l53k062M63r18k894J71Q753P798N154
18659A6833j263o642j918J585j984k27M538N367l01k28j974k350K975K815M721
18644B1947O271J4431J0909K7823M8257P1229Q5857N2130k1362o9693n6783l9006
18632A52010Q560M9566P7610O2559k050p0489q7435o1102m3219k2288r021p157
18620D7544j1065l801k804j998k967m082r55m414n535K03L143Q91L031l042m179
18605I970K28k137n269M14L375J560O299P737m04L884L875K901J0875J5030K0760
$$ plain form
18590 79098 120840 197351 292532 363127 366641 303766 229387 183882 178233 218449 294100 368882
18578 368882 394290 333203 236842 156348 102972 71472 48892 37240 34490 37893 34475 29713
18566 29713 20671 20635 19847 13831 7809 4466 2071 6274 7089 5658 8763 6716 -2422 -7388 -1187
18551 -1187 6623 5526 3011 1608 2414 -923 342 -511 1561 -3081 -4304 -5278 3993 5815 2227
18536 2227 2562 4063 2614 2607 -8487 -13446 -8741 -8864 -14403 -9468 -8871 -8564 -13892 -16241 -13497 -14734
18520 -14734 -15871 -11846 -6284 -6819 -7726 -9461 -5287 -3266 -1646 -3901 -2675 -4290 -7679 -4659 -4510
18505 -4510 -8846 -1918 9655 11339 4877 99 -6331 -4391 3953 5861 -2111 1083 4421 1083
18491 1083 1358 9152 5095 2588 12607 18402 11909 4445 1946 1308 6639 7086 7804 2400 7165
$$ packed form
18590G9098M1742P6511R5181P0595L514o2875p4379m5505n649M0216P5651P4782
18578C68882K5408o1087r6361q0494n3376l1500k2580j1652k750L403l418m762
18566B9713r042l6p88o016o022l343k395M203Q15j431L105k047r138m966O201
18551a187P810j097k515j403Q06l337J265q53K072m642j223r74R271J822l588
18536B227L35J501j449pj1094m959M705j23n539M935N97L07n328k349K744j237
18520a4734j137M025N562n35r07j735M174K021J620k255J226j615l389L020J49
18505d510m336O928J1573J684o462m778o430J940Q344J908p972L194L338l338
18491A083K75P794m057k507J0019N795o493p464k499o38N331M47P18n404M765
$$ plain form
18476 7165 9583 8303 5709 5008 -724 -3007 1679 3645 201 -6197 -7223 1023 2524 -3290 -6053
18461 -6053 -233 7937 7615 6164 9184 8450 8348 4818 1207 8211 6605 626 -2225 -1868 -5 -207
18445 -207 4315 4597 8748 3653 5755 13157 9762 9128 10212 13830 13661 13647 9520 2795 3474 11951
18429 11951 16319 14169 18199 23207 28876 31667 35788 33742 29523 25729 24554 23206 20772 4514
18415 4514 -1190 5536 10809 13821 10618 4233 -227 -3242 -8056 -5625 1481 9018 4478 1330 -929
18400 -929 -2322 3264 7514 9127 8935 9482 10014 9593 10458 21922 20140 15488 15321 12043 8353 6628
18384 6628 4848 13860 19103 21924 19065 24311 29214 42102 57383 69297 62716 54104 46714 41041
18370 41041 29798 31860 46703 55477 61160 56313 50687 44219 38883 37283 28153 16592 7152 6347
$$ packed form
18476G165K418j280k594p01n732k283M686J966l444o398j026Q246J501n814k763
18461f053N820Q170l22j451L020p34j02l530l611P004j606n979k851L57J863k02
18445b07M522K82M151n095K102P402l395o34J084L618j69j4m127o725O79Q477
18429A1951M368k150M030N008N669K791M121k046m219l794j175j348k434j6258
18415D514n704O726N273L012l203o385m460l015m814K431P106P537m540l148k259
18400i29j393N586M250J613j92N47N32m21Q65J1464j782m652j67l278l690j725
18384F628j780R012N243K821k859N246M903J2888J5281J1914o581q612p390n673
18370D1041j1243K062J4843Q774N683m847n626o468n336j600r130j1561r440q05
$$ plain form
18356 6347 3889 -349 -4097 3746 8996 9636 6953 3328 7659 11663 13144 7049 7079 8659 8395 17122
18340 17122 25722 28825 27427 22581 29085 38620 46336 37451 28296 23168 18580 29581 48326 65088
18326 65088 83299 97401 88521 70120 52833 43862 44801 53468 65993 72790 63934 44573 33478
18313 33478 20558 4898 -579 3223 8085 6424 2871 3792 -4952 -9823 -16372 -17411 -13127 -10299
18299 -10299 -7375 2984 8786 2610 6104 4834 -1231 670 -1445 -3429 2797 7809 11352 21772
18285 21772 24178 24503 15886 7773 8235 4604 -4317 -10659 -15671 -10249 -4876 -1832 951 4764 7995
18270 7995 8701 10111 8036 -1045 -10230 -20748 -23680 -20253 -14015 -6011 -4126 -10116 -13699 -19164 -25190
18255 -25190 -32811 -25491 -21892 -27643 -32842 -22488 3441 32254 54791 70109 76496 69707 60895
$$ packed form
18356F347k458m238l748P843N250O40k683l625M331M004J481o095L0J580k64Q727
18340A7122Q600L103j398m846O504R535P716q885r155n128m588J1001J8745J6762
18326F5088J8211J4102q880j8401j7287q971R39Q667J2525O797q856j9361j1095
18313C3478j2920j5660n477L802M862j661l553R21q744m871o549j039M284K828
18299a0299K924J0359N802o176L494j270o065J901k115j984O226N012L543J0420
18285B1772K406L25q617q113M62l631q921o342n012N422N373L044K783L813L231
18270G995P06J410k075r081r185j0518k932L427O238Q004J885n990l583n465o026
18255b5190p621P320L599n751n199J0354K5929K8813K2537J5318O387o789q812
$$ plain form
18242 60895 74705 92873 109818 119851 123828 143858 192844 279460 364253 374876 325402 270768
18230 270768 232915 235983 289121 381845 425500 371114 280974 197951 144344 117969 95377 79824
18218 79824 71001 64678 58783 58815 66591 71352 73530 74563 70850 61867 60245 59841 58166 49509 40229
18203 40229 34675 28257 23774 33525 59441 79828 98027 107342 104213 95635 89352 93299 107434
18190 107434 144674 195268 258120 348953 461810 519009 485398 419195 363441 342929 386921
18179 386921 499420 615094 624090 533692 430622 352798 309204 276807 259433 253298 252605 253046
18167 253046 260252 271486 282420 289414 294227 309701 335297 358446 388998 435330 507775 627883
18155 627883 794168 965814 1053530 1018606 922498 850366 846708 933507 1108249 1307957 1412969
$$ packed form
18242F0895J3810J8168J6945J0033L977K0030M8986Q6616Q4793J0623m9474n4634
18230B70768l7853L068N3138R2724M3655n4386r0140q3023n3607k6375k2592j5553
18218G9824q823o323n895L2P776M761K178J033l713q983j622m04j675q657r280
18203D0229n554o418m483R751K5916K0387J8199R315l129q578o283L947J4135
18190A07434L7240N0594O2852R0833J12857N7199l3611o6203n5754k0512M3992
18179C86921J12499J15674Q996r0398j03070p7824m3594l2397j7374o135o93M41
18167B53046P206J1234J0934O994M813J5474K5596K3149L0552M6332P2445J20108
18155F27883J66285J71646Q7716l4924r6108p2132l658Q6799J74742J99708J05012
$$ plain form
18144 1412969 1371323 1265584 1192533 1196566 1285065 1429309 1561980 1664770 1778662 1954949
18134 1954949 2200226 2528208 2998197 3689941 4702954 6137755 8285230 11863606 18500606
18125 18500606 30718481 47708824 60171628 59861975 48590339 35822284 27344311
18118 27344311 24863003 28705228 40182126 56384397 66190521 62392433 48137572 33763214
18110 33763214 24529584 21980581 24436952 25512133 21153620 15486591 10678784 7901818
18102 7901818 6401036 5468355 4821262 4344771 3994834 3782589 3770892 3960313 4332760
18093 4332760 4704015 4705459 4291415 3778767 3435978 3279724 3250239 3341804 3564673 3864301
18083 3864301 4209730 4647874 5301656 6336568 7928984 10446763 14707673 22502076 36622332
$$ packed form
18144A412969m1646j05739p3051M033Q8499J44244J32671J02790J13892J76287
18134A954949K45277L27982M69989O91744J013013J434801K147475L578376O637000
18125A8500606J2217875J6990343J2462804l09653j1271636j2768055q477973
18118B7344311k481308L842225J1476898J6202271R806124l798088j4254861j4374358
18110C3763214r233630k549003K456371J075181m358513n667029m807807k776966
18102G901818j500782r32681o47093m76491l49937k12245j1697J89421L72447
18093D332760L71255J444m14044n12648l42789j56254k9485R1565K22869K99628
18083C864301L45429M38144O53782J034912J592416K517779M260910P794403J4120256
$$ plain form
18074 36622332 56418169 71558578 71709343 58701918 43580059 33377677 30303205
18067 30303205 34622796 47575000 66086251 77675334 73123974 55944243 37855571
18060 37855571 24724578 17100646 12697200 9883945 7981515 6637614 5612804 4818383
18052 4818383 4188600 3687924 3316156 3005990 2699101 2394639 2138816 1977955 1932490 1964770
18042 1964770 1968823 1851947 1645280 1435018 1283213 1211716 1223838 1335496 1457700 1456815 1292923
18031 1292923 1050388 838548 701070 618145 567235 528072 491512 459396 438685 423289 411408
18020 411408 398502 380442 367711 347796 322969 303400 297708 291550 289555 291130 291619 283629 284787
18007 284787 292225 292925 307887 319729 329825 337159 339015 320910 303801 297366 307071 324739 331010
$$ packed form
18074C6622332J9795837J5140409J50765j3007425j5121859j0202382l074472
18067C0303205M319591J2952204J8511251J1589083m551360j7179731j8088672
18060C7855571j3130993p623932m403446k813255j902430j343901j024810p94421
18052D818383o29783n00676l71768l10166l06889l04462k55823j60861m5465L2280
18042A964770M053j16876k06667k10262j51805p1497J2122J11658J22204q85j63892
18031A292923k42535k11840j37478q2925n0910l9163l6560l2116k0711j5396j1881
18020D11408j2906j8060j2731j9915k4827j9569n692o158j995J575M89p990J158
18007B84787P438P00J4962J1842J0096P334J856j8105j7109o435R705J7668O271
$$ plain form
17994 331010 327360 320181 324370 340919 385025 445537 545442 709990 963116 1352723 1793154
17983 1793154 1972448 1785269 1436508 1133843 959973 915761 994486 1225132 1655614 2167057
17973 2167057 2358415 2085848 1609907 1156018 838850 642162 516397 442128 397729 373649
17963 373649 364987 359396 335463 308164 276487 255892 240906 231109 227123 221465 218399 218616 228127
17950 228127 240352 261008 307009 380696 488951 599768 660307 646036 581217 538291 536118
17939 536118 602315 756933 1006403 1409992 1945676 2333995 2278277 1920594 1521137 1249123
17929 1249123 1156694 1223885 1474470 1965473 2683646 3224418 3161832 2660313 2064702 1632073
17919 1632073 1476205 1681324 2248859 2745951 2586800 2052659 1512296 1152091 959706
$$ packed form
17994C31010l650p179M189J6549M4106O0512R9905J64548K53126L89607M40431
17983A793154J79294j87179l48761l02665j73870m4212P8725K30646M30482N11443
17973B167057J91358k72567m75941m53889l17168j96688j25765p4269m4399k4080
17963C73649q662n591k3933k7299l1677k0595j4986r797l986n658l066K17R511
17950B28127J2225K0656M6001P3687J08255J10817O0539j4271o4819m2926k173
17939E36118O6197J54618K49470M03589N35684L88319n5718l57683l99457k72014
17929A249123r2429O7191K50585M91003P18173N40772o2586n01519n95611m32629
17919A632073j55868K05119N67535M97092j59151n34141n40363l60205j92385
$$ plain form
17910 959706 897548 976091 1271397 1834027 2289039 2121574 1604147 1082155 737651 549196
17900 549196 444379 388290 350093 322614 298991 276936 255382 239244 227640 213903 207603
17889 207603 202998 205668 207312 212915 210812 208032 203286 198326 193543 190770 198021 207592 220563 236172
17875 236172 255008 285381 337427 415992 530811 719572 1070916 1793257 2880950 3562937
17865 3562937 3201652 2374690 1598056 1139912 945251 908263 1041714 1451304 2119906 2515215
17855 2515215 2191357 1576573 1016314 667250 478683 370715 307610 257923 219153 186897
17845 186897 181171 195860 208096 217436 214553 200089 172175 132613 109638 101903 105992 111644 117581
17832 117581 120608 119741 128606 122577 112790 96230 87731 81466 73177 64592 58405 49445 47925 59046
$$ packed form
17910I59706o2158P8543K95306N62630M55012j67465n17427n21992l44504j88455
17900E49196j04817n6089l8197k7479k3623k2055k1554j6138j1604j3737o300
17889B07603m605K670J644N603k103k780m746m960m783k773P251R571J2971J5609
17875B36172J8836L0373N2046P8565J14819J88761L51344P22341J087693O81987
17865C562937l61285q26962p76634m58144j94661l6988J33451M09590O68602L95309
17855B515215l23858o14784n60259l49064j88567j07968o3105m9687l8770l2256
17845A86897n726J4689J2236R340k883j4464k7914l9562k2975p735M089N652N937
17832A17581L027q67Q865o029r787j6560q499o265q289q585o187q960j520J1121
$$ plain form
17818 59046 76182 85764 84136 88690 92223 82460 67798 68718 76942 80530 85569 83766 67645 50061
17804 50061 54570 61958 66669 68812 64033 56913 41621 42592 81554 131342 184966 212458 203702
17791 203702 174084 147072 115126 96644 106900 122383 142031 149980 142552 134919 137045 140802
17779 140802 133867 124761 122954 116842 112732 123073 131368 136147 144224 156427 161617 167620 177550 184174
17765 184174 184263 179755 179622 190426 199910 195297 199787 210045 214892 223433 234773 253692 272174 297304
17751 297304 311654 324314 324370 339827 375688 425483 498658 586924 702521 822908 901313 959667
17739 959667 968284 935047 910352 926593 1010510 1166047 1322040 1453209 1592649 1690059 1793940
17728 1793940 1965449 2275648 2729283 3312988 4179841 5601093 8075931 12722855 21811006
$$ packed form
17818E9046J7136R582j628M554L533r763j4662R20Q224L588N039j803j6121j7584
17804E0061M509P388M711K143m779p120j5292R71L8962M9788N3624K7492q756
17791B03702k9618k7012l1946j8482J0256J5483J9648P949p428p633K126L757
17779A40802o935r106j807o112m110J0341Q295M779Q077J2203N190O003R930O624
17765A84174Q9m508j33J0804R484m613M490J0258M847Q541J1340J8919J8482K5130
17751B97304J4350J2660N6J5457L5861M9795P3175Q8266J15597J20387P8405N8354
17739I59667Q617l3237k4695J6241Q3917J55537J55993J31169J39440R7410J03881
17728A793940J71509L10199M53635N83705Q66853J421252K474838M646924R088151
$$ plain form
17719 21811006 36038156 46193575 42695164 32622143 23071135 17993561 17365441 21106144
17711 21106144 31283959 47123492 55512446 47729316 33953017 21442384 13740439
17704 13740439 9587125 7195357 5740967 4824275 4220086 3792742 3473127 3227155 3064752
17695 3064752 3058723 3176416 3294004 3335251 3291737 3136206 2971728 2861474 2801948 2862128
17685 2862128 3037823 3231406 3440573 3686522 3945090 4289887 4831385 5702312 6897167
17676 6897167 8486703 10849483 14760964 21736994 35034560 59709546 91593257 104836401
17668 104836401 89896585 65958023 45956042 36232593 35354589 43492632 63417704
17661 63417704 87918625 92846446 75082112 51791278 32935171 21909141 15806481
$$ packed form
17719B1811006J4227150J0155419l498411j0073021r551008n077574o28120L740703
17711B1106144J0177815J5839533Q388954p783130j3776299j2510633p701945
17704A3740439m153314k391768j454390r16692o04189m27344l19615k45972j62403
17695C064752o029J17693J17588M1247m3514j55531j64478j10254n9526O0180
17685B862128J75695J93583K09167K45949K58568L44797N41498Q70927J194855
17676F897167J589536K362780L911481O976030J3297566K4674986L1883711J3243144
17668A04836401j4939816k3938562k0001981r723449q78004Q138043J9925072
17661F3417704K4500921M927821j7764334k3290834j8856107j1026030o102660
$$ plain form
17654 15806481 12155282 9805619 8201888 7075865 6217408 5473939 4734081 4035602 3447069
17645 3447069 3011214 2697642 2473429 2331570 2285188 2343374 2390308 2343023 2189081 1929983
17635 1929983 1668331 1444407 1289620 1186387 1120280 1072006 1039905 1006486 980849 978690 1018122
17624 1018122 1112142 1254496 1387769 1459433 1528101 1593139 1631030 1678759 1724519 1809647 1930787
17613 1930787 2104423 2483235 3280888 4312997 4582015 3969286 3186190 2619584 2389004
17604 2389004 2382091 2554586 2857940 3257704 3743372 4338563 5179580 6444412 8386055
17595 8386055 11461578 16723485 26543318 43568229 62894743 72281669 75641431 77104083
17587 77104083 68067320 51110197 34443624 22346692 15392122 11359451 8801955 7092490
$$ packed form
17654A5806481l651199k349663j603731j126023q58457p43469p39858o98479n88533
17645C447069m35855l13572k24213j41859m6382N8186M6934m7285j53942k59098
17635A929983k61652k23924j54787j03233o6107m8274l2101l3419k5637k159L9432
17624A018122R4020J42354J33273P1664O8668O5038L7891M7729M5760Q5128J21140
17613A930787J73636L78812P97653J032109K69018o12729p83096n66606k30580
17604B389004o913J72495L03354L99764M85668N95191Q41017J264832J941643
17595H386055L075523N261907R819833J7024911J9326514R386926L359762J462652
17587G7104083r036763j6957123j6666573j2096932o954570m032671k557496j709465
$$ plain form
17579 7092490 5897576 5015493 4367003 3925230 3660932 3523609 3426039 3360075 3415279 3600072
17569 3600072 3805073 3878088 3866865 3958277 4152257 4295512 4443090 5016296 6283172 7415680
17559 7415680 7109047 5941796 4736286 4000661 3697760 3633924 3798316 4192006 4762620
17550 4762620 5459225 6362960 7624024 9531943 12641200 17907308 27431468 43947993
17542 43947993 65488326 83536231 92196390 94142091 89576175 75011069 54630681
17535 54630681 36677548 24239729 17016012 12688125 9896039 8008410 6682490 5731356
17527 5731356 5031214 4492352 4066536 3654747 3266591 2940358 2669894 2468931 2332174
17518 2332174 2232815 2201410 2251089 2328108 2442665 2638439 3028030 3620661 3897648 3549852
$$ packed form
17579G092490j194914q82083o48490m41773k64298j37323r7570o5964N5204J84793
17569C600072K05001P3015j1223R1412J93980J43255J47578N73206J266876J132508
17559G415680l06633j167251j205510p35625l02901o3836J64392L93690N70614
17550D762620O96605R03735J261064J907919L109257N266108R524160J6516525
17542D3947993K1540333J8047905Q660159J945701m565916j4565106k0380388
17535E4630681j7953133j2437819p223717m327887k792086j887629j325920r51134
17527E731356p00142n38862m25816m11789l88156l26233k70464k00963j36757
17518B332174r9359l1405M9679P7019J14557J95774L89591N92631K76987l47796
$$ plain form
17508 3549852 3023832 2553343 2263830 2110163 2028226 1989964 2036856 2198087 2470631 2862984
17498 2862984 3458743 4400341 5877268 8477807 13529717 21875410 29611836 32133902
17490 32133902 33517116 33502152 28242098 20511124 13456084 8768108 6150266 4602143
17482 4602143 3593776 2915604 2433658 2068458 1785621 1568397 1401846 1258972 1136550
17473 1136550 1023739 915368 829873 764783 716223 693209 684444 699443 731029 750562 764728
17462 764728 769958 757287 742874 708960 656824 622510 606778 565256 502726 443193 401605 370446
17450 370446 339513 319855 313315 316806 310696 295443 279259 269936 272029 292698 317744 315604 297462
17437 297462 270982 251249 237986 229366 218059 208473 201617 201595 206302 204036 196941 187077 189453 199975
$$ packed form
17508C549852n26020m70489k89513j53667q1937l8262M6892J61231K72544L92353
17498B862984N95759R41598J476927K600539N051910Q345693P736426K522066
17490C2133902J383214j4964n260054p730974p055040m687976k617842j548123
17482D602143j008367o78172m81946l65200k82837k17224j66551j42874j22422
17473A136550j12811j08371q5495o5090m8560k3014q765J4999L1586J9533J4166
17462G64728N230j2671j4413l3914n2136l4314j5732m1522o2530n9533m1588l1159
17450C70446l0933j9658o540L491o110j5253j6184r323K093K0669K5046k140j8142
17437B97462k6480j9733j3263q620j1307r586o856k2M707k266p095r864K376J0522
$$ plain form
17423 199975 200924 204685 212429 217127 224047 224019 221639 226256 241384 265894 292460 316489 338895 344871
17409 344871 324001 292601 273231 259918 246882 236871 227478 213031 198119 194568 191705 187212
17397 187212 174448 160087 148427 142706 139556 140793 136302 139474 154099 168056 177758 184072 180021
17384 180021 169733 166544 163051 150879 131963 118658 118700 125243 125335 125117 136036 144731 164169 184741
17370 184741 207201 213445 202989 194794 191121 195856 193014 180295 176140 168326 159393 162480 162241 156734
17356 156734 152149 147457 143753 126611 119302 120694 129491 134018 133955 129643 123992 113377 106816 104097
17342 104097 110024 123235 138150 142961 138084 127361 113699 102049 98590 94289 92065 89649 88392
17329 88392 85417 87348 83096 79052 85716 91418 95276 96356 97441 93149 94534 90050 92459 95434
$$ packed form
17423A99975R49L761P744M698O920k8k380M617J5128K4510K6566K4029K2406N976
17409C44871k0870l1400j9370j3313j3036j0011r393j4447j4912l551k863m493
17397A87212j2764j4361j1660n721l150J237m491L172J4625J3957R702O314m051
17384A80021j0288l189l493j2172j8916j3305M2O543R2k18J0919Q695J9438K0572
17370A84741K2460O244j0456q195l673M735k842j2719m155p814q933L087k39n507
17356A56734m585m692l704j7142p309J392Q797M527o3m312n651j0615o561k719
17342A04097N927J3211J4915M811m877j0723j3662j1650l459m301k224k416j257
17329H8392k975J931m252m044O664N702L858J080J085m292J385m484K409K975
$$ plain form
17315 95434 97613 100652 104485 110218 113613 116012 121595 122039 119739 119326 121887 121547 126837 141045 143702
17300 143702 139488 130615 118246 109417 104791 104400 102155 90015 84046 90011 78503 67423 64237
17287 64237 65557 62361 59211 56147 52170 48561 47518 46921 43199 33787 36445 43116 49776 56361 54724
17272 54724 46856 45152 50567 55639 56085 59957 61399 57599 47093 42031 50723 60722 57999 58223 58460
17257 58460 63148 76436 94813 108342 101893 93016 79391 66061 53155 43302 36511 36796 43605
17244 43605 45358 47944 52228 49526 49434 48136 44309 36722 33528 37162 33640 20957 13183 21191 22311
17229 22311 25349 36034 47191 51351 53613 60295 63526 64715 58917 56673 63992 64996 55226 44381
17215 44381 38917 33798 39718 41018 39941 38944 42254 43671 45402 50417 46260 45090 47040 45354 50324
$$ packed form
17315I5434K179L039L833N733L395K399N583M44k300m13K561l40N290J4208K657
17300A43702m214q873j2369q829m626l91k245j2140n969N965j1508j1080l186
17287F4237J320l196l150l064l977l609j043n97l722r412K658O671O660O585j637
17272E4724p868j704N415N072M46L872J442l800j0506n062Q692R999k723K24K37
17257E8460M688J3288J8377J3529o449q877j3625j3330j2906r853o791K85O809
17244D3605J753K586M284k702r2j298l827p587l194L634l522j2683p774Q008J120
17229B2311L038J0685J1157M160K262O682L231J189n798k244P319J004r770j0845
17215D4381n464n119N920J300j077r97L310J417J731N015m157j170J950j686M970
$$ plain form
17200 50324 56967 57489 56115 58064 60177 64196 68581 73745 82259 99706 126696 180633 283045
17187 283045 407310 467833 427023 344987 273807 240828 267640 356003 452638 459140 373981
17176 373981 275236 192648 146593 120974 97793 78498 64218 57390 60088 59022 53879 48391
17164 48391 43050 43571 47713 52734 50672 48415 46794 46880 52404 51471 45337 37195 36315 32500 36433 44622
17148 44622 44799 41209 41767 52837 67638 79443 91796 121054 174054 257124 350390 372775 322074
17135 322074 256319 214637 205755 242476 323226 380935 355611 277083 198449 142621 107461 86867
17123 86867 75761 69004 69925 68541 65034 56605 48668 47993 42097 35975 28592 27006 21169 23011 30298
17108 30298 31332 33562 41209 49149 47320 45679 39509 31984 30973 34703 36343 36203 28658 28300 36634
$$ packed form
17200E0324O643N22j374J949K113M019M385N164Q514J7447K6990N3937J02412
17187B83045J24265O0523m0810q2036p1180l2979K6812Q8363R6635O502q5159
17176C73981r8745q2588m6055k5619k3181j9295j4280o828K698j066n143n488
17164D8391n341N21M142N021k062k257j621Q6N524r33o134q142q80l815L933Q189
17148D4622J77l590N58J1070J4801J1805J2353K9258N3000Q3070R3266K2385n0701
17135C22074o5755m1682q882L6721Q0750N7709k5324p8528p8634n5828l5160k0594
17123H6867j1106o757R21j384l507q429p937o75n896o122p383j586n837J842P287
17108C0298J034K230P647P940j829j641o170p525j011L730J640j40p545l58Q334
$$ plain form
17093 36634 46080 42220 41440 47105 39443 39968 41294 41621 47240 49012 47313 47840 52648 53966 51732
17078 51732 61023 71276 92327 140161 209445 280344 319740 336400 340027 298725 231452 169367
17066 169367 124461 97487 75370 66298 57893 51880 47913 49186 48867 46228 40880 34026 32313 36365
17052 36365 35657 34401 40820 44334 35874 29149 23107 25491 30493 32927 44095 53950 63379 66023
17038 66023 58878 45023 38834 34625 35953 38017 40216 46346 57669 70818 90631 116225 165433
17025 165433 250903 336318 415078 504380 555358 527701 471583 395242 297254 214524 154372
17014 154372 120236 103569 92564 73625 51935 42479 39564 35550 31527 32253 29075 29209 33959
17001 33959 34750 31312 29492 30670 38277 37254 34270 32957 35595 42390 47913 53799 52568 40734
$$ packed form
17093C6634R446l860p80N665p662N25J326L27N619J772j699N27M808J318k234
17078E1732R291J0253K1051M7834O9284P0899L9396J6660L627m1302o7273o2085
17066A69367m4906k6974k2117r072q405o013l967J273l19k639n348o854j713M052
17052C6365p08j256O419L514q460o725o042K384N002K434J1168R855R429K644
17038F6023p145j3855o189m209J328K064K199O130J1323J3149J9813K5594M9208
17025A65433Q5470Q5415P8760Q9302N0978k7657n6118p6341r7988q2730o0152
17014A54372l4136j6667j1005j8939k1690r456k915m014m023P26l178J34M750
17001C3959P91l438j820J178P607j023k984j313K638O795N523N886j231j1834
$$ plain form
16987 40734 32563 32432 29533 31744 33909 37952 45123 46903 48672 52565 55559 74185 114174 167126
16973 167126 224352 247331 256439 263332 240227 182956 127439 97077 78899 59215 47881 43427
16961 43427 42806 35347 32184 24928 21544 20525 24073 23214 24929 24020 21894 22554 28114 17541 12664
16946 12664 11279 18390 28734 32132 35803 38651 30869 18443 11460 13485 14573 15566 21709 25337
16932 25337 18129 17965 32218 55717 78996 118131 158507 176315 186819 179271 149233 104596
16920 104596 71918 54085 46298 35855 27851 27031 28595 23816 27243 28251 17360 12199 8476
16907 8476 13433 18930 21910 28805 33339 29304 27711 17308 3273 -1856 3007 2731 2186 2455 535
16892 535 1191 2891 8109 13555 8955 9356 12229 12636 9152 5232 12027 16545 21583 35965 45994
$$ packed form
16987D0734q171j31k899K211K165M043P171J780J769L893K994J8626L9989N2952
16973A67126N7226K2979R108O893k3105n7271n5517l0362j8178j9684j1334m454
16961D3427o21p459l163p256l384j019L548q59J715r09k126O60N560j0573m877
16946A2664j385P111J0344L398L671K848p782j2426o983K025J088R93O143L628
16932B5337p208j64J4253K3499K3279L9135M0376J7808J0504p548l0038m4637
16920A04596l2678j7833p787j0443q004q20J564m779L427J008j0891n161l723
16907H476M957N497K980O895M534m035j593j0403j4035n129M863k76n45K69j920
16892E35O56J700N218N446m600M01K873M07l484l920O795M518N038J4382J0029
$$ plain form
16877 45994 60080 77828 94992 111482 124864 132081 122425 92860 70539 64407 53156 45033
16865 45033 39434 31624 29649 29144 28160 28711 29710 31741 30868 30091 27583 24176 29238 31574 35101 35497
16849 35497 33238 38220 34528 35382 40315 52289 63384 64186 75695 87292 104251 138675 179094
16836 179094 234615 311385 425508 630746 1035526 1755684 2626174 2930076 2453169 1712769
16826 1712769 1078895 694861 497415 383529 294682 226392 178427 150246 134520 117411
16816 117411 103689 89871 81832 74304 61725 48893 40534 39725 38021 36114 37313 37569 36567 36737
16802 36737 34225 26128 22830 16276 16665 18766 14770 15702 15281 16267 14523 20207 28663 31009 39147
16787 39147 46803 54973 50505 39060 27737 19829 13295 14114 22081 20749 22775 16095 15256 15109 12805
$$ packed form
16877D5994J4086J7748J7164J6490J3382P217r656k9565k2321o132j1251q123
16865D5033n599p810j975n05r84N51R99K031q73p77k508l407N062K336L527L96
16849C5497k259M982l692Q54M933J1974J1095Q02J1509J1597J6959L4424M0419
16836A79094N5521P6770J14123K05238M04780P20158Q70490L03902m76907p40400
16826A712769o33874l84034j97446j13886q8847o8290m7965k8181j5726j7109
16816A17411j3722j3818q039p528j2579j2832q359q09j704j907J199K56j002J70
16802C6737k512q097l298o554L89K101l996R32m21R86j744N684Q456K346Q138
16787C9147P656Q170m468j1445j1323p908o534Q19P967j332K026o680q39j47k304
$$ plain form
16772 12805 15186 15661 17957 17212 12731 7028 8413 3622 -154 -508 8873 23635 24728 25722 27939
16757 27939 28656 31966 31742 32743 26166 14134 1512 -11392 -15686 -23827 -18278 -7359 -6968 3000
16743 3000 15595 22203 18775 13445 14497 14467 14942 16966 10936 14030 13542 15485 22320 30526 26508
16728 26508 20487 15727 11240 11974 8845 2153 -2123 7629 10069 9579 11519 12496 3884 2509 4521
16713 4521 15438 22048 22612 21078 15758 13802 16906 20100 18118 12234 9371 4642 2709 6759 14218
16698 14218 19993 20589 26222 23346 25370 25719 26091 22352 12535 6933 -1083 -2337 -1075 6093 10191
16683 10191 7591 -1546 4031 8791 14916 10819 2060 -4064 2754 6258 4531 274 -8116 -2424
16669 -2424 -631 376 8966 12598 13080 13723 11241 12143 14923 22491 26735 28525 25188 21906 27336
$$ packed form
16772A2805K381M75K296p45m481n703J385m791l776l54R381J4762J093R94K217
16757B7939P17L310k24J001o577j2032j2622j2904m294q141N549J0919L91R968
16743C000J2595O608l428n330J052l0M75K024o030L094m88J943O835Q206m018
16728B6508o021m760m487P34l129o692m276R752K440m90J940R77q612j375K012
16713D521J0917O610N64j534n320j956L104L194j982n884k863m729j933M050P459
16698A4218N775N96N633k876K024L49L72l739r817n602q016j254J262P168M098
16683A0191k600r137N577M760O125m097q759o124O818L504j727m257q390N692
16669b424J793J007Q590L632M82O43k482R02K780P568M244J790l337l282N430
$$ plain form
16654 27336 30544 25361 19945 20798 18497 21441 28651 34396 35991 32767 27260 24491 24994 22954 24232
16639 24232 21795 16296 14022 17321 17493 20160 23397 25071 21323 20759 27564 29290 26432 29463 25140
16624 25140 16255 13686 18916 27950 32082 19928 8524 9206 15679 25432 27841 30071 31301 25371
16610 25371 26871 28170 27944 23381 30856 30672 32143 31778 27833 21481 17714 18979 20743 19644 18817
16595 18817 23473 26194 15741 3346 16059 44029 75938 84449 76844 60308 48509 57519 66690
16582 66690 49705 31251 22967 19177 25091 26809 28163 23442 12822 -888 2690 14928 23297
16569 23297 24183 26894 17960 13297 15806 18864 32061 33675 22999 19584 17873 26407 34326 40832
16555 40832 46099 50581 55380 59931 64215 64834 59401 51533 34621 24020 26142 31714 30078 38409
$$ packed form
16654B7336L208n183n416Q53k301K944P210N745J595l224n507k769N03k040J278
16639B4232k437n499k274L299J72K667L237J674l748n64O805J726k858L031m323
16624B5140q885k569N230R034M132j2154j1404O82O473R753K409K230J230n930
16610B5371J500J299k26m563P475j84J471l65l945o352l767J265J764j099q27
16595A8817M656K721j0453j2395J2713K7970L1909Q511p605j6536j1799R010R171
16582F6690j6985j8454q284l790N914J718J354m721j0620j3710L578J2238Q369
16569B3297Q86K711q934m663K509L058J3197J614j0676l415j711Q534P919O506
16555D0832N267M482M799M551M284O19n433p868j6912j0601K122N572j636Q331
$$ plain form
16541 38409 43894 58330 72489 93183 106525 137310 206735 324082 504198 553432 470587
16530 470587 302362 154189 83958 59308 50855 52398 57440 55426 49369 45184 31610 25597
16518 25597 29061 32970 26258 8912 11645 25420 36022 38217 36924 43221 55623 64951 88799
16505 88799 103052 100067 90233 81089 74773 80591 75188 58575 42617 33597 38726 56684 83160
16492 83160 95873 91126 83920 67216 52608 35836 18649 13314 20786 34979 48995 65720
16480 65720 73667 72199 81672 74960 64477 59525 28994 -12444 -34688 -53473 -55264 -56822 -56640
16467 -56640 -55052 -49568 -37322 -30461 -19651 -6489 -7710 -6302 -7646 -23269 -36192 -43571 -39956
16454 -39956 -29186 -20943 -16903 -11295 -11146 -3677 1152 -7622 -24383 -34974 -43071 -37816 -21516 -9876
$$ packed form
16541C8409N485J4436J4159K0694J3342L0785O9425J17347J80116M9234q2845
16530D70587j68225j48173p0231k4650q453J543N042k014o057m185j3574o013
16518B5597L464L909o712j7346K733J3775J0602K195j293O297J2402R328K3848
16505H8799J4253k985r834r144o316N818n403j6613j5958r020N129J7958K6476
16492H3160J2713m747p206j6704j4608j6772j7187n335P472J4193J4016J6725
16480F5720P947j468R473o712j0483m952l0531m1438k2244j8785j791j558J82
16467e6640J588N484J2246O861J0810J3162j221J408j344j5623j2923p379L615
16454c9956J0770Q243M040N608J49P469M829q774j6761j0591q097N255J6300J1640
$$ plain form
16440 -9876 -2531 -7248 -21808 -34271 -49211 -73482 -101346 -127189 -174921 -203215 -174474 -111298
16428 -111298 -50366 -11957 6708 19308 13281 4514 -3316 -8126 -15827 -18402 -26061 -28547 -27776
16415 -27776 -34566 -48832 -56075 -55515 -75919 -122051 -200582 -258444 -160936 37910 185200 333039
16403 333039 368519 324638 290399 265929 243925 229796 205378 190441 181246 187500 197032 193716
16391 193716 194023 197832 208336 211907 207878 205037 205810 204433 199912 196012 196675 211322 230691 249803
16377 249803 266011 274152 263174 249883 255078 275124 288266 284866 280736 270105 245423 229792
16365 229792 219375 225592 235331 227987 220344 211140 214233 224619 247502 264067 266055 266120 274377 299258
16351 299258 321893 346834 379238 397885 388988 374423 372673 395393 443610 473586 475448 458284
$$ packed form
16440i876P345m717j4560j2463j4940k4271k7864k5843m7732k8294K8741O3176
16428a11298O0932L8409J8665J2600o027q767p830m810p701k575p659k486P71
16415b7776o790j4266p243N60k0404m6132p8531n7862R7508J98846J47290J47839
16403C33039L5480m3881l4239k4470k2004j4129k4418j4937r195O254R532l316
16391A93716L07L809J0504L571m029k841P73j377m521l900O63J4647J9369J9112
16377B49803J6208Q141j0978j3291N195K0046J3142l400m130j0631k4682j5631
16365B29792j0417O217R739p344p643r204L093J0386K2883J6565J988O5Q257K4881
16351B99258K2635K4941L2404J8647q897j4565j750K2720M8217K9976J862j7164
$$ plain form
16339 458284 433138 403252 404074 410900 425815 463117 504061 545853 611542 696061 774841 814961
16327 814961 800862 777616 782050 825133 867431 879905 880844 893785 962173 1120714 1318244 1498138
16315 1498138 1661603 1812550 1956371 2073036 2134067 2165773 2238992 2365989 2501751 2655100
16305 2655100 2892923 3212462 3513218 3848583 4261314 4688267 5097190 5527211 6034708
16296 6034708 6712401 7609859 8690951 10115832 12083289 14563666 17615502 21743031
16288 21743031 27922505 37154409 49659176 66033236 92191250 141379083 238721557
16281 238721557 400818208 547691958 547123980 431961021 291132477 180901520 119364976
16274 119364976 86532779 66058223 51478027 40560331 32313765 26309325 21923637
$$ packed form
16339D58284k5146k9886Q22O826J4915L7302M0944M1792O5689Q4519P8780M0120
16327H14961j4099k3246M434M3083M2298J2474R39J2941O8388J58541J97530J79894
16315A498138J63465J50947J43821J16665O1031L1706P3219J26997J35762J53349
16305B655100K37823L19539L00756L35365M12731M26953M08923M30021N07497
16296F034708O77693Q97458J081092J424881J967457K480377L051836M127529
16288B1743031O179474R231904J2504767J6374060K6158014M9187833R7342474
16281B38721557J62096651J46873750n67978j15162959j40828544j10230957o1536544
16274A19364976l2832197k0474556j4580196j0917696q246566o004440m385688
$$ plain form
16267 21923637 18638353 16064062 13981049 12253861 10782241 9532980 8411226 7401174
16259 7401174 6603433 5999459 5456289 4971817 4583225 4245047 3914269 3612160 3331084
16250 3331084 3050881 2792760 2571169 2364450 2179380 2048020 1963291 1908469 1886410 1884537
16240 1884537 1869155 1811279 1709402 1582176 1480017 1412215 1345211 1257856 1150288 1051484
16230 1051484 1000241 1001863 1008119 1011911 1019041 1015035 980358 945542 930105 897684 836699 765462
16218 765462 705973 675101 679141 687296 679670 660485 625719 604491 589636 569605 558465 567962
16206 567962 575014 560032 537499 529227 532366 528206 528480 520526 507062 488881 478798 488017 518677
16193 518677 560376 558148 517179 480098 459891 442389 417945 395973 359971 324959 297437 273941
$$ packed form
16267B1923637l285284k574291k083013j727188j471620j249261j121754j010052
16259G401174p97741o03974n43170m84472l88592l38178l30778l02109k81076
16250C331084k80203k58121k21591k06719j85070j31360q4729n4822k2059j873
16240A884537j5382n7876j01877j27226j02159o7802o7004q7355j07568r8804
16230A051484n1243J622O256L792P130m006l4677l4816j5437l2421o0985p1237
16218G65462n9489l0872M040Q155p626j9185l4766k1228j4855k0031j1140R497
16206E67962P052j4982k2533q272L139m160K74p954j3464j8181j0083R219L0660
16193E18677M1699k228m0969l7081k0207j7502k4444k1972l6002l5012k7522k3496
$$ plain form
16181 273941 261648 264891 281818 289613 287231 271086 249047 235700 226035 226190 223456 223691 223254 219377
16167 219377 217684 220122 226755 217480 204207 193157 181602 171936 176097 179921 193590 243438 361017
16154 361017 532192 759905 888901 818125 697144 586794 502159 456763 443374 437152 423115
16143 423115 399716 383367 368924 351753 341551 329693 314552 305338 299665 291677 297402 311959
16131 311959 339536 393477 461102 499359 483869 444900 406145 381606 358036 339177 318417
16120 318417 304413 300793 301150 301416 306696 309600 310011 300294 285012 280267 281903 287576 294828 291419
16106 291419 288018 293258 303404 327195 345348 349012 339692 313698 296197 284282 278236 291425
16094 291425 304259 306632 311221 320706 330879 334089 324963 311442 285468 257616 237662 212208
$$ packed form
16181B73941j2293L243J6927P795k382j6145k2039j3347r665J55k734K35m37l877
16167B19377j693K438O633r275j3273j1050j1555r666M161L824J3669M9848J17579
16154C61017J71175K27713J28996p0776j20981j10350q4635m5396j3389o222j4037
16143D23115k3399j6349j4443j7171j0202j1858j5141r214n673p988N725J4557
16131C11959K7577N3941O7625L8257j5490l8969l8755k4539k3570j8859k0760
16120C18417j4004l620L57K66N280K904M11r717j5282m745J636N673P252l409
16106B91419l401N240J0146K3791J8153L664r320k5994j7501j1915o046J3189
16094B91425J2834K373M589R485J0173L210r126j3521k5974k7852j9954k5454
$$ plain form
16082 212208 201951 210619 208485 211878 223758 218779 229893 248287 248632 244920 243249 235627 226860
16069 226860 210956 198068 194112 204155 229842 256970 263513 262278 252311 237703 227012 223795
16057 223795 218870 207901 194413 183292 195046 224301 253571 272250 272028 272023 283158 299424 309507
16044 309507 304063 304499 313639 322407 323967 323948 316669 312418 308629 312246 326953 348764 364413 374155
16030 374155 380383 384219 391234 403990 407705 419353 438081 459611 499060 563496 598422 591221
16018 591221 555127 507840 469345 438705 419708 404648 391784 371152 361472 355889 353046 361691
16006 361691 360132 361923 369342 389405 409650 418788 424509 440904 479174 565750 707711 812016
15994 812016 766328 647884 529139 452794 422066 414351 407857 399972 394678 377006 365297 359664
$$ packed form
16082B12208j0257Q668k134L393J1880m979J1114J8394L45l712j671p622q767
16069B26860j5904j2888l956J0043K5687K7128O543j235r967j4608j0691l217
16057B23795m925j0969j3488j1121J1754K9255K9270J8679k22nJ1135J6266J0083
16044C09507n444M36R140Q768J560j9p279m251l789L617J4707K1811J5649R742
16030C74155O228L836P015J2756L715J1648J8728K1530L9449O4436L4926p201
16018E91221l6094m7287l8495l0640j8997j5060j2864k0632r680n583k843Q645
16006C61691j559J791P419K0063K0245R138N721J6395L8270Q6576J41961J04305
15994H12016m5688j18444j18745p6345l0728p715o494p885n294j7672j1709n633
$$ plain form
15982 359664 358635 353359 351474 348896 333670 308538 293696 299851 313327 308040 289597 269006 276161
15969 276161 308811 339369 354260 359516 349696 339836 329180 311986 301911 301388 303577 297766 287533
15956 287533 276766 272083 271983 270183 268120 267143 265704 266939 266729 262859 259984 261467 259218 261987 259310
15941 259310 258790 254036 244690 239642 238241 237703 234418 230605 218215 205568 200371 201808 200244 197464
15927 197464 196582 193124 186482 184715 181552 178970 184922 192478 197984 188600 176742 170657 170783 163585
15913 163585 160096 155367 157856 156752 157261 157066 155209 150780 145471 149483 151039 151608 149736 146752 151896
15898 151896 149231 147301 141634 139201 139851 139977 137966 139853 145814 153732 153341 144424 131540 126073 121666
15883 121666 121141 121273 119102 114934 124577 128403 128532 129232 127121 123193 121708 129063 127965 119184 116915
$$ packed form
15982C59664j029n276j885k578j5226k5132j4842O155J3476n287j8443k0591P155
15969B76161L2650L0558J4891N256r820r860j0656j7194j0075n23K189n811j0233
15956B87533j0767m683j00j800k063r77j439J235k10l870k875J483k249K769k677
15941B59310n20m754r346n048j401n38l285l813j2390j2647n197J437j564k780
15927A97464q82l458o642j767l163k582N952P556N506r384j1858o085J26p198
15913A63585l489m729K489j104N09j95j857m429n309M012J556N69j872k984N144
15898A51896k665j930n667k433O50J26k011J887N961P918l91q917j2884n467m407
15883A21666n25J32k171m168R643L826J29P00k111l928j485P355j098q781k269
$$ plain form
15868 116915 115899 111085 102811 94282 86710 85831 92659 99283 101810 109154 114680 109407 98792 92492
15854 92492 93515 88394 90396 93220 92016 90244 97721 100366 101006 104195 103544 99172 87826 81881 75954
15839 75954 75333 78076 85933 86462 83546 82745 85737 86795 80062 71128 61873 62041 73448 85606 88885
15824 88885 78157 70163 71383 71867 64483 63012 70627 71402 70554 73730 82765 98533 104921 106136 107956
15809 107956 98023 81722 69033 61599 47822 44282 47372 44473 44354 54598 61849 60509 61857
15796 61857 68072 73499 81462 75010 67398 66982 68293 70808 68439 70898 63351 53618 46915 50398 59743
15781 59743 62007 58900 60324 54614 51798 45796 45492 47364 48642 47296 46413 55302 50935 48509 56862
15766 56862 57666 57008 59474 62074 57815 56934 49624 45002 45200 53108 63616 64185 63622 67907 70034 66984
$$ packed form
15868A16915j016m814q274q529p572q79O828O624K527P344N526n273j0615o300
15854I2492J023n121K002K824j204j772P477K645O40L189o51m372j1346n945n927
15839G5954o21K743P857N29k916q01K992J058o733q934r255J68J1407J2158L279
15824H8885j0728p994J220M84p384j471P615P75q48L176R035J5768O388J215J820
15809A07956r933j6301j2689p434j3777l540L090k899j19J0244P251j340J348
15796F1857O215N427P963o452p612m16J311K515k369K459p547r733o703L483R345
15781E9743K264l107J424n710k816o002l04J872J278j346q83Q889m367k426Q353
15766E6862Q04o58K466K600m259q81p310m622J98P908J0508N69n63M285K127l050
$$ plain form
15750 66984 69049 65111 59682 58432 59513 56667 56566 63677 66729 72986 77408 75173 78121 79238 83868
15735 83868 87762 94276 100762 112626 138429 171381 210743 261193 333628 435519 611470 963840
15723 963840 1631439 2522306 2975628 2604796 1878086 1211574 798262 566442 422207 334719
15713 334719 273216 227465 189311 155768 139636 127288 116367 108293 97607 89264 87058 83735
15701 83735 77950 70976 66759 68732 65591 61728 63889 68016 61543 55089 57804 60013 59453 56207 57813
15686 57813 55281 49462 38708 37919 38151 40389 49288 52141 48657 48711 46884 46181 48610 36949 35678
15671 35678 36332 46305 48330 43713 42349 43928 44954 40552 40085 39321 31760 29297 29694 31818 31852 26858
15655 26858 22776 25854 31007 24452 22538 24370 29231 36442 31085 33715 33933 34516 30544 30925 28002
$$ packed form
15750F6984K065l938n429j250J081k846j01P111L052O257M422k235K948J117M630
15735H3868L894O514O486J1864K5803L2952L9362N0450P2435J01891J75951L52370
15723I63840O67599Q90867M53322l70832p26710o66512m13312k31820j44235q7488
15713C34719o1503m5751l8154l3543j6132j2348j0921q074j0686q343k206l323
15701H3735n785o974m217J973l141l863K161M127o473o454K715K209n60l246J606
15686E7813k532n819j0754p89K32K238Q899K853l484N4j827p03K429j1661j271
15671C5678O54R973K025m617j364J579J026m402m67p64p561k463L97K124L4m994
15655B6858m082L078N153o555j914J832M861P211n357K630K18N83l972L81k923
$$ plain form
15640 28002 28326 29113 30200 34832 38508 36398 34658 35378 37311 42719 44011 36084 26791 27715 25000
15625 25000 29436 33652 36497 41686 37454 30119 30990 26322 23607 23127 22844 27528 19793 17178 20248
15610 20248 19344 22816 25282 24524 23954 23966 17677 17244 24160 19913 19790 21081 27519 34688 37052 33940
15594 33940 25473 28498 33659 28425 25110 27626 34071 36745 33771 32939 34150 30820 30872 27237 20977
15579 20977 20624 30615 33401 27764 26250 24618 20177 17941 19797 18100 18367 17701 18724 19222 13723
15564 13723 8868 13231 20847 22799 25359 22669 20676 26744 30511 27368 19006 19887 20924 15497 16565
15549 16565 21905 25728 24652 18344 17058 19504 18946 23588 31975 34145 31669 31281 38385 37184 26689
15534 26689 17950 13715 13402 10766 10076 8361 9024 8878 10486 10881 9748 16235 17472 16042 8101 9770
$$ packed form
15640B8002L24P87J087M632L676k110j740P20J933N408J292p927r293R24k715
15625B5000M436M216K845N189m232p335Q71m668k715m80k83M684p735k615L070
15610B0248r04L472K466p58n70J2o289m33O916m247j23J291O438P169K364l112
15594C3940q467L025N161n234l315K516O445K674k974q32J211l330N2l635o260
15579B0977l53R991K786n637j514j632m441k236J856j697K67o66J023M98n499
15564A3723m855M363P616J952K560k690j993O068L767l143q362Q81J037n427J068
15549A6565N340L823j076o308j286K446n58M642Q387K170k476l88P104j201j0495
15534B6689q739m235l13k636o90j715O63j46J608L95j133O487J237j430p941J669
$$ plain form
15518 9770 14207 17476 16693 14166 17937 18454 20874 21723 21551 23409 20638 20455 21920 13030 4220 3992
15502 3992 11081 21231 16548 13055 12726 13330 18902 22931 19851 15870 17421 24158 17586 12997 17373
15487 17373 16673 8534 13586 19069 19301 16539 9282 9425 17052 19936 16239 15819 12344 14718 23247
15472 23247 23509 18977 17977 21343 17407 22596 21212 26603 27075 22061 13468 8029 4306 7429 13988
15457 13988 17378 17961 16367 20419 21510 20281 21286 21905 29833 24109 16658 12692 6653 5629 12404
15442 12404 21373 26455 26987 21057 21877 27756 28414 24730 13305 5804 4093 11611 15997 21172 25324
15427 25324 24930 24251 24152 15370 17118 20427 10656 8697 15104 13769 13455 18934 17622 10023 10560 11971
15411 11971 26002 26731 21401 21759 20455 17987 15805 17550 13237 9059 16342 21545 16529 13507 11955
$$ packed form
15518I770M437L269p83k527L771N17K420Q49j72J858k771j83J465q890q810k28
15502C992P089J0150m683l493l29O04N572M029l080l981J551O737o572m589M376
15487A7373p00q139N052N483K32k762p257J43P627K884l697m20l475K374Q529
15472B3247K62m532j000L366l936N189j384N391M72n014q593n439l723L123O559
15457A3988L390N83j594M052J091j229J005O19P928n724p451l966o039j024O775
15442A2404Q969N082N32n930Q20N879O58l684j1425p501j711P518M386N175M152
15427B5324l94o79r9q782J748L309r771j959O407j335l14N479j312p599N37J411
15411A1971J4031P29n330L58j304k468k182J745m313m178P283N203n016l022j552
$$ plain form
15396 11955 10662 12561 9976 11536 13893 9204 7452 4804 2418 4120 7193 14051 20662 24511
15382 24511 24841 23113 19556 12696 17936 16785 13203 14676 15997 14830 2743 -616 6093 14141
15368 14141 23525 24847 16363 10287 12364 14706 14455 16237 14215 9773 11194 10641 4933 6903 13632
15353 13632 17559 16545 18661 19380 16773 9265 7594 15240 17188 6212 4548 9213 11880 11721 4884
15338 4884 -1575 3504 7774 7035 12118 5942 11012 16277 19345 22577 24757 22231 8295 -1713
15324 -1713 2461 4993 6057 6322 7001 14990 21123 27337 23903 18900 15068 8391 -447 -611 668
15309 668 -1602 -409 5492 7539 7863 5450 10573 17482 17315 15473 15582 13241 8945 9219 12020 13311
15293 13311 19378 11337 10277 16227 19390 20223 20715 17897 13099 10391 15826 12123 13760 13031 10757
$$ packed form
15396A1955j293J899k585J560K357m689j752k648k386J702L073O858O611L849
15382B4511L30j728l557o860N240j151l582J473J321j167j2087l359O709Q048
15368A4141R384J322q484o076K077K342k51J782k022m442J421n53n708J970O729
15353A3632L927j014K116P19k607p508j671P646J948j0976j664M665K667j59o837
15338D884o459N079M270p39N083o176N070N265L068L232K180k526j3936j0008
15324a713M174K532J064K65O79P989O133O214l434n003l832o677q838j64J279
15309F68k270J193N901K047L24k413N123O909j67j842J09k341m296K74K801J291
15293A3311O067q041j060N950L163Q33M92k818m798k708N435l703J637p29k274
$$ plain form
15278 10757 16394 18372 15870 15823 21987 24728 24872 22845 24170 24334 16509 14030 16567 18085 23541
15263 23541 14347 8866 13273 17430 20728 23990 17089 8627 2670 -2878 -2423 3176 6218 8437 7597
15248 7597 6439 2183 6132 13383 13793 17307 18456 7470 5569 8089 10286 14967 22113 23625 23165
15233 23165 15745 17049 15523 14487 13686 12741 18969 23376 22007 11277 4271 3459 3657 6263 8100
15218 8100 7018 -821 1069 6602 12667 14665 13252 11006 8603 6863 9446 2939 -1375 904 10038
15203 10038 19095 19120 13389 4520 5701 10182 9266 4520 7032 12922 20216 21006 19020 17830 18765 17354
15187 17354 17068 11848 2631 7986 15297 13892 9361 8098 5658 8125 11159 10569 3817 -515 200
15172 200 3129 6472 6752 7362 10728 7469 4335 2900 -711 -5209 -1998 2542 5283 7565 10375
$$ packed form
15278A0757N637J978k502m7O164K741J44k027J325J64p825k479K537J518N456
15263B3541r194n481M407M157L298L262o901q462n957n548M55N599L042K219q40
15248G597j158m256L949P251M10L514J149j0986j901K520K197M681P146J512m60
15233B3165p420J304j526j036q01r45O228M407j369j0730p006q12J98K606J837
15218H100j082p839J890N533O065J998j413k246k403j740K583o507m314K279R134
15203A0038R057K5n731q869J181M481r16m746K512N890P294P90j986j190R35j411
15187A7354k86n220r217N355P311j405m531j263k440K467L034n90o752m332P15
15172B00K929L343K80O10L366l259l134j435l611m498L211M540K741K282K810
$$ plain form
15157 10375 4352 4541 3900 4100 877 4521 3156 -1220 1229 4955 4758 13277 9108 1651 1976 2976
15141 2976 802 -1021 2074 9162 13480 12505 9612 11185 16934 16826 16246 16574 12027 11493 8518 9518
15125 9518 6130 6432 8651 9110 12014 13452 9077 3536 2481 5561 4992 2359 279 7439 11965
15110 11965 14351 15678 16462 13579 7019 3049 3387 8236 14226 10904 2125 -1872 -634 4148 7209
15095 7209 8363 10656 10485 7975 8481 10335 8667 10187 9305 10484 13725 19929 13904 11714 10385
15080 10385 10175 9454 10133 2835 582 1645 2401 7839 12520 15956 13598 11965 11009 12013 13011 10903
15064 10903 9402 9490 13167 11274 11291 16415 17945 20176 17422 7749 5189 5702 5922 9754 7374 -355
15048 -355 -5551 -9558 -6404 3126 6839 1141 4308 1198 -6008 -6815 -3827 4923 12870 14506 13318
$$ packed form
15157A0375o023J89o41K00l223L644j365m376K449L726j97Q519m169p457L25J000
15141B976k174j823L095P088M318r75k893J573N749j08n80L28m547n34k975J000
15125I518l388L02K219M59K904J438m375n541j055L080n69k633k080P160M526
15110A1965K386J327P84k883o560l970L38M849N990l322q779l997J238M782L061
15095G209J154K293j71k510N06J854j668J520q82J179L241O204o025k190j329
15080A0385k10p21O79p298k253J063P56N438M681L436k358j633r56J004R98k108
15064A0903j501Q8L677j893J7N124J530K231k754r673k560N13K20L832k380p729
15048c55n196m007L154R530L713n698L167l110p206q07K988Q750P947J636j188
$$ plain form
15033 13318 17125 16744 8938 9330 4213 913 -5276 -5276 -5768 -9369 -776 12411 21589 19139 20604 12128
15017 12128 7115 9613 2115 -6343 -8657 -7894 -8348 -2110 6425 5307 4539 1966 2031 2301 7817 3116
15001 3116 1885 -4688 -9337 -10223 -12203 -4978 7804 7344 9512 15287 14886 16521 14403 7826 10532
14986 10532 3555 -4930 1436 7724 7693 5838 -1956 -7066 -4021 -384 3527 2145 3624 13617 19068
14971 19068 17055 16120 18558 16262 11314 6823 -817 3241 4462 -3220 -6835 -9684 -7854 683 6742
14956 6742 10810 18012 17139 11622 8250 -2751 -4933 -4753 -4263 -2684 -3529 -2155 -1721 928 -4941 -5516
14940 -5516 -1111 6220 5468 2940 782 5821 6811 7847 9097 1408 -4336 1262 3285 4639 3519
14925 3519 4683 2130 -2128 4671 6063 7496 -888 -7413 -2637 -3178 -7395 -3808 2417 5938 14098
$$ packed form
15033A3318L807l81p806L92n117l300o189%m92l601Q593J3187R178k450J465q476
15017A2128n013K498p498q458k314P63m54O238Q535j118p68k573O5K70N516m701
15001C116j231o573m649q86j980P225J2782m60K168N775m01J635k118o577K706
14986A0532o977q485O366O288l1j855p794n110L045L637L911j382J479R993N451
14971A9068k013r35K438k296m948m491p640M058J221p682l615k849J830Q537O059
14956F742M068P202q73n517l372j1001k182J80M90J579q45J374M34K649n869n75
14940e516M405P331p52k528k158N039R90J036J250p689n744N598K023J354j120
14925C519J164k553m258O799J392J433q384o525M776n41m217L587O225L521Q160
$$ plain form
14910 14098 15209 15109 13087 9764 4139 -1149 2347 3592 2145 8374 26142 40301 30764 11329
14896 11329 11336 11182 8767 -5287 -2790 21245 32107 21109 293 1453 2024 1635 5315 4919 -5688
14881 -5688 -13855 -5526 2382 7283 2220 -3480 -3281 -2958 60 -443 -3100 -6147 -11222 -13323 -6744
14866 -6744 -5091 -4494 1516 5367 3225 6884 10917 9047 12650 21495 18960 11673 2141 -893 3088
14851 3088 10639 6690 -1107 -1470 6765 12008 12512 11511 18292 17282 15641 12584 8199 8072 8069 8863
14835 8863 6949 3955 -1032 -251 1026 4281 8082 6822 7626 4668 -2312 -2814 -361 7953 9940
14820 9940 8989 11440 11468 8261 7853 9872 7722 5414 5472 7842 14546 13792 7141 5791 9191 11180
14804 11180 8679 10952 8663 4361 2875 2595 3287 3885 3146 -60 230 -1877 -5906 -7011 6844
$$ packed form
14910A4098J111j00k022l323n625n288L496J245j447O229J7768J4159r537j9435
14896A1329Pj54k415j4054K497K4035J0862j0998k0816J160N71l89L680l96j0607
14881e688q167Q329P908M901n063n700J99L23L018n03k657l047n075k101O579
14866f744J653N97O010L851k142L659M033j870L603Q845k535p287r532l034L981
14851C088P551l949p797l63Q235N243N04j001O781j010j641l057m385j27lP94
14835H863j914k994m987P81J277L255L801j260Q04k958o980n02K453Q314J987
14820I940r51K451K8l207m08K019k150k308N8K370O704p54o651j350L400J989
14804A1180k501K273k289m302j486k80O92N98p39l206K90k107m029j105J3855
$$ plain form
14789 6844 10695 11317 8852 9046 7119 6530 7162 7919 1038 -664 1130 -1432 -1713 2221 5289 6561
14773 6561 9162 14602 9010 1179 -633 -5165 -5396 99 4487 1252 -3348 -2310 -2995 -951 -2139
14758 -2139 790 9454 16573 16896 16117 7283 3799 1143 -1523 5332 14598 15243 11918 11609 13525 12513
14742 12513 12010 14823 15098 9925 3213 -2693 -2571 725 3007 786 -4507 -1672 1107 648 -566
14727 -566 4000 6079 5906 4237 5040 11943 25718 22566 9288 5242 9832 5443 11127 13193 8514
14712 8514 9026 12401 13128 13547 10719 10449 11735 7407 2758 3891 8693 8611 7203 7885 5666 2708
14696 2708 5841 6809 7089 2983 293 5495 6961 7068 7583 5485 -952 -66 -2366 2232 5397 546
14680 546 -7509 -6413 -8596 -7251 -1968 1111 378 -9017 -4842 7616 14693 15146 8723 3406 -2958
$$ packed form
14789F844L851O22k465J94j927n89O32P57o881j702J794k562k81L934L068J272
14773F561K601N440n592p831j812m532k31N495M388l235m600J038o85K044j188
14758b139K929Q664P119L23p79q834l484k656k666O855R266O45l325l09J916j012
14742A2513n03K813K75n173o712n906J22L296K282k221n293K835K779m59j214
14727e66M566K079j73j669Q03O903J3775l152j3278m046M590m389N684K066m679
14712H514N12L375P27M19k828k70J286m328m649J133M802q2j408O82k219k958
14696B708L133R68K80m106k690N202J466J07N15k098o437Q86k300M598L165m851
14680E46q055J096k183J345N283L079p33r395M175J2458P077M53o423n317o364
$$ plain form
14665 -2958 -7953 -6298 -2490 -664 -1939 -3711 503 3061 -2607 1065 3889 -8412 -11869 -9704
14651 -9704 -6022 -1098 -2117 -2708 8796 13581 14696 15189 20359 16721 13634 7176 4962 5907 6782
14636 6782 6312 14222 18629 11086 3303 5904 5027 4308 11705 16156 13009 8515 11019 16176 10804
14621 10804 7010 5451 1972 2885 5585 13514 6958 -677 -3508 -574 6090 6542 7529 8407 2621
14606 2621 -770 -1337 -1063 291 10236 15584 7815 5519 3067 4632 4411 4877 7828 -4458 -1993
14591 -1993 4939 -281 -5607 -4382 -2811 -2016 -1761 1312 2164 488 964 -1579 4272 12506 5205 1709
14575 1709 2245 1012 1138 526 3378 3883 -1141 -485 2673 3225 2719 7422 2366 -2317 157 2857
14559 2857 -3407 -7168 -929 883 2681 4531 6448 8974 9909 4858 4045 8918 17996 17602 5129
$$ packed form
14665b958m995J655L808J826j275j772M214K558n668L672K824j2301l457K165
14651i704L682M924j019n91J1504M785J115M93N170l638l087o458k214R45Q75
14636F782m70P910M407p543p783K601q77p19P397M451l147m494K504N157n372
14621A0804l794j559l479R13K700P929o556p635k831K934O664M52R87Q78n786
14606B621l391n67K74J354R945N348p769k296k452J565k21M66K951j2286K465
14591a993O932n220n326J225J571P95K55L073Q52j676M76k543N851Q234p301l496
14575A709N36j233J26o12K852N05n024O56L158N52n06M703n056m683K474K700
14559B857o264l761O239J812J798J850J917K526R35n051q13M873R078l94j2473
$$ plain form
14544 5129 -5938 -2504 4363 6243 3674 888 3948 1985 1053 3232 2517 4718 2598 1298 3642
14529 3642 5171 2634 -4145 -8337 -7954 -5011 -3516 -578 1846 -113 -4986 -3211 1975 3506 1595
14514 1595 5297 2799 2309 -2692 -11926 -10177 -8805 -5712 -4987 -5993 1307 7564 -916 -3638 -7857
14499 -7857 -1615 3582 5231 10540 9762 8326 8268 9375 14865 18572 15853 11536 11095 9864 1896 -1460
14483 -1460 -441 -3611 2117 3241 5664 6894 4767 3823 9745 6116 3682 8579 5373 8907 11744
14468 11744 9204 8335 10628 10365 8377 3418 12489 12548 8571 6789 8205 4629 3168 3857 9125 17395
14452 17395 17619 15837 5514 -2147 5536 15601 23153 23681 21486 18408 12241 10598 3386 -985
14438 -985 -54 10936 17590 7118 -908 -130 -914 -6376 -9447 -9199 -8759 -9959 -6949 4707 8602
$$ packed form
14544E129j1067L434O867J880k569k786L060j963r32K179p15K201k120j300K344
14529C642J529k537o779m192L83K943J495K938K424j959m873J775N186J531j911
14514A595L702k498m90n001r234J749J372L093P25j006P300O257q480k722m219
14499g857O242N197J649N309p78j436n8J107N490L707k719m317m41j231p968l356
14483a460J019l170N728J124K423J230k127r44N922l629k434M897l206L534K837
14468A1744k540q69K293k63j988m959R071N9l977j782J416l576j461O89N268Q270
14452A7395K24j782j0323p661P683J0065P552N28k195l078o167j643p212m371
14438i85R31J0990O654j0472q026P78p84n462l071K48M40j200L010J1656L895
$$ plain form
14423 8602 2741 3577 4776 2839 7689 3807 3631 7729 1819 -4446 742 8898 14224 9034 -367
14408 -367 566 5974 6367 5213 6839 3849 1531 -4100 -916 8161 9142 3401 1680 3569 2364 3291
14392 3291 -5884 -11210 -5600 -7342 -6648 2060 12656 15138 12742 15223 10188 4293 2382 8044 9848
14377 9848 9356 6427 3749 -310 253 8011 11837 10379 2134 -2920 6059 4514 7375 8752 1600
14362 1600 -6971 -8244 -7510 -7478 -3975 -766 3639 10414 4551 4714 5948 3609 402 -1477 -924 1836
14346 1836 4135 6565 9899 7774 5486 5727 2376 2720 10015 7678 8558 5437 1916 8734 9908
14331 9908 12701 13486 8090 7194 3201 -1772 -1718 1893 3089 3817 2611 1304 775 -3110 -5744 -5575
14315 -5575 1647 2782 2255 6585 2309 -557 4092 10953 7669 7490 634 2114 6723 -913 -4902
$$ packed form
14423H602n861Q36J199j937M850l882j76M098n910o265N188Q156N326n190r401
14408c67R33N408L93j154J626k990k318n631L184R077R81n741j721J889j205R27
14392C291r175n326N610j742O94Q708J0596K482k396K481n035n895j911N662J804
14377I848m92k929k678m059N63P758L826j458q245n054Q979j545K861J377p152
14362A600q571j273P34L2L503L209M405O775n863J63J234k339l207j879N53K760
14346A836K299K430L334k125k288K41l351L44P295k337Q80l121l521O818J174
14331I908K793P85n396q96l993m973N4L611J196P28j206j307n29l885k634J69
14315e575P222J135n27M330m276k866M649O861l284j79o856J480M609p636l989
$$ plain form
14300 -4902 -3164 -3352 -3403 -731 3725 414 -8369 -8147 -6617 -1896 2964 4085 7985 14023 8515 9068
14284 9068 10333 13945 13213 16144 9200 865 1256 3825 3433 1108 -655 -2185 -1875 -2908 3181 4037
14268 4037 -542 -737 -1813 4844 8369 4467 4790 1690 -3761 -9173 -909 9920 16183 8425 2665
14253 2665 5307 4503 -1300 141 4054 1552 51 -591 -4485 -6332 -1104 -573 707 854 -7584 -11211
14237 -11211 -8212 -4062 3855 9305 7691 7496 5358 6655 10061 1962 -1491 -9694 -10914 -8022 -9867
14222 -9867 -2360 -142 2846 -3354 -9187 -6268 -5430 757 10825 15033 5454 -4811 -7208 -6066
14208 -6066 -7254 -10549 -9836 -3545 2056 -436 -7598 -4403 3064 3181 3365 6359 3548 4703 808
14193 808 -2954 -2615 -7491 -7161 -5385 -6013 -6564 -3939 -5809 643 6806 3750 -6802 -7471 -10277 -6491
$$ packed form
14300d902J738j88n1K672M456l311q783K22J530M721M860J121L900O038n508N53
14284I068J265L612p32K931o944q335L91K569l92k325j763j530L10j033O089Q56
14268D037m579j95j076O657L525l902L23l100n451n412Q264J0829O263p758n760
14253B665K642q04n803J441L913k502j501o42l894j847N228N31J280J47q438l627
14237a1211K999M150P917N450j614j95k138J297L406q099l453q203j220K892j845
14222i867P507K218K988o200n833K919Q38O187J0068M208r579j0265k397J142
14208f066j188l295P13O291N601k492p162L195P467J17J84K994k811J155l895
14193H08l762L39m876L30J776o28n51K625j870O452O163l056j0552o69k806L786
$$ plain form
14177 -6491 -6659 -8379 -8430 1575 2098 918 3166 2347 5507 3313 -7796 -12642 -6288 -2439 2444
14162 2444 7662 7835 5517 2241 -1549 -391 1958 2298 736 -655 1375 -1223 -596 -1576 -1435 2447
14146 2447 1249 -3329 9365 14938 7711 4639 3747 2181 -1552 -3973 -8185 -4128 3760 9326 13878
14131 13878 6999 10145 6049 2324 -5152 -5607 3249 4527 2502 -937 -3756 -1149 -1135 -1138 -11244 -5611
14115 -5611 -3357 1853 10871 12034 8902 7785 7974 5718 6450 2993 582 -6610 2555 1074 -540
14100 -540 -1231 2412 3641 2652 -3790 5174 10771 9010 4750 2851 3429 3905 5378 3449 2630 9805
14084 9805 14709 14641 9611 8059 9546 8737 10570 6722 397 3278 16041 18565 13875 12042 9644
14069 9644 5189 256 2949 14283 19962 11979 7688 12642 11329 13802 10068 9085 5700 2658 -825
$$ packed form
14177f491j68j720n1J0005N23j180K248q19L160k194j1109m846O354L849M883
14162B444N218J73k318l276l790J158K349L40j562j391K030k598O27r80J41L882
14146B447j198m578J2694N573p227l072q92j566l733k421m212M057P888N566M552
14131A3878o879L146m096l725p476m55Q856J278k025l439k819K607J4lj0106N633
14115e611K254N210R018J163l132j117J89k256P32l457k411p192R165j481j614
14100e40o91L643J229r89o442Q964N597j761m260j899N78M76J473j929q19P175
14084I805M904o8n030j552J487q09J833l848o325K881J2763K524m690j833k398
14069I644m455m933K693J1334N679p983m291M954j313K473l734r83l385l042l483
$$ plain form
14054 -825 6257 10817 3233 230 1569 4577 -46 -4712 -3055 3035 4679 5869 1825 -3045 -2915
14039 -2915 -10760 -10043 -6271 -3789 -9149 -4900 -8206 -12391 -7037 246 5662 12552 17951 19004 16240
14024 16240 15604 12786 14136 6296 5193 4001 6171 14277 19678 24396 28390 33255 38284 41151 49074
14009 49074 58406 67438 66001 64720 61571 58107 53315 50588 44772 40943 35120 30606 32456 33208 25395
13994 25395 20797 15950 9909 4059 9444 10146 5970 6209 1542 4320 5032 6989 8891 11471 12022
13979 12022 4052 4620 597 4036 5250 4077 267 -4364 -4422 -482 11250 17211 9131 7303 2978
13964 2978 2549 -413 -5949 -9371 -8261 -10298 -7577 -7939 -11813 -13455 -11886 -6987 -3266 62 2202
13949 2202 1178 4666 1930 8941 9702 8729 5525 6685 8762 8820 8171 8311 3765 4283 3686 7442 7783
$$ packed form
14054h25P082M560p584l003J339L008m623m666J657O090J644J190m044m870J30
14039b915p845P17L772K482n360M249l306m185N354P283N416O890N399J053k764
14024A6240o36k818J350p840j103j192K170Q106N401M718L994M865N029K867P923
14009D9074R332R032j437j281l149l464m792k727n816l829n823m514J850P52p813
13994B5395m598m847o041n850N385P02m176K39m667K778P12J957J902K580N51
13979A2022p970N68m023L439J214j173l810m631n8L940J1732N961q080j828m325
13964B978m29k962n536l422J110k037K721l62l874j642J569M899L721L328K140
13949B202j024L488k736P011P61r73l204J160K077N8o49J40m546N18n97L756L41
$$ plain form
13932 7783 9776 6469 4039 2802 4536 -58 -1381 -6363 -9667 -10876 -5863 2517 2730 1747 957
13917 957 5445 9905 7269 6276 3605 -1625 -8249 -9434 -12239 -5773 -11514 -10608 -8268 -2719 -146
13902 -146 -3488 -3750 2476 5514 5972 11051 10304 11086 10156 8897 11995 16044 8539 8826 7022 -1826
13886 -1826 -2760 4352 5555 2395 1546 1287 -47 1461 7005 8419 10138 3478 -779 1416 4270
13871 4270 -2918 -7877 -3126 5077 9679 9945 740 -855 2749 4204 -1613 -3106 -2048 3490 4187
13856 4187 7399 4162 5556 1272 -7769 287 1412 8112 4394 4086 4934 3946 4196 6472 7178 8001
13840 8001 6334 -3387 -5099 3343 9208 8721 3076 -5019 -9578 -8255 -6325 -518 -1395 -11754 -10454
13825 -10454 -4140 1283 5635 4247 2841 -7424 -15293 -7422 6726 3158 -5822 -8636 -5786 -6806
$$ packed form
13932G783J993l307k430j237J734m594j323m982l304j209N013Q380K13r83p90
13917I57M488M460k636r93k671n230o624j185k805O466n741R06K340N549K573
13902a46l342k62O226L038M58N079p47P82r30j259L098M049p505K87j804q848
13886a826r34P112J203l160q49k59j334J508N544J414J719o660m257K195K854
13871D270p188m959M751Q203M602K66r205j595L604J455n817j493J058N538O97
13856D187L212l237J394m284r041Q056J125O700l718l08Q48r88K50K276P06Q23
13840H001j667r721j712Q442N865m87n645q095m559J323J930N807q77j0359J300
13825a0454O314N423M352j388j406j0265p869P871J4148l568q980k814K850j020
$$ plain form
13811 -6806 -7844 -9591 -5722 3609 877 -1043 -5493 -8011 -7898 -11138 -7326 -5006 -2416 2211 2301
13796 2301 -2281 -1296 717 2104 -3327 -4193 1560 11970 7888 1454 3354 9718 4850 -1593 -5101
13781 -5101 -8753 -7148 -1516 -1525 -6743 -1380 1103 -134 4532 7817 2679 -1091 -1926 3204 13017 15430
13765 15430 13596 5788 -678 -5939 -1576 -7500 -8247 -2912 2113 6975 6048 7412 3039 -3897 -2530
13750 -2530 800 -5143 -4921 -1614 -2241 -4970 -6215 -4298 -1317 3026 6238 2641 -923 4885 6610
13735 6610 8098 6747 6114 7200 5197 -925 -10315 -6262 -4207 -1926 2280 5399 3474 2248 5622
13720 5622 7873 9747 9664 5573 7057 6636 2236 -8670 -13227 -14463 -11048 -1150 -789 -6494 -8785
13705 -8785 -6984 -3960 409 3287 5043 5516 6528 5758 5341 1127 -2852 -8535 -13608 -10438 -4169
$$ packed form
13811f806j038j747L869R331k732j920m450k518J13l240L812K320K590M627R0
13796B301m582R85K013J387n431q66N753J0410m082o434J900O364m868o443l508
13781e101l652J605N632rn218N363K483j237M666L285n138l770q35N130R813K413
13765A5430j834p808o466n261M363n924p47N335N025M862r27J364m373o936J367
13750b530L330n943K22L307o27k729j245J917K981M343L212l597l564N808J725
13735F610J488j351o33J086k003o122r390M053K055K281M206L119j925j226L374
13720E622K251J874q3m091J484m21m400j0906m557j236L415R898L61n705k291
13705h785J801L024M369K878J756M73J012p70m17m214l979n683n073L170O269
$$ plain form
13690 -4169 -4752 -4796 -4214 -5596 -4134 -4990 -700 2870 2242 3724 -5191 1890 11121 7006 1200 -1754
13674 -1754 -2853 -1134 2038 2937 -3273 -14903 -8669 -4504 -9444 -9124 -4036 -5866 -10409 -7977 -6882
13659 -6882 -3549 6114 2709 5057 -4805 -7285 -8046 -7010 -5172 3119 1375 -3570 -2221 -3246 -3128
13644 -3128 -2530 -3735 -6299 -8608 -9352 -6228 -12904 -10340 -7417 -3069 -2787 -5328 -1409 458 -2289
13629 -2289 1242 884 -923 -305 -1011 -1441 -2355 -5614 -7194 -9174 -14074 -6263 3413 6539 7356 5564
13613 5564 675 -1467 3121 2261 2021 -1587 -3957 -5359 1289 -707 -2069 -2841 648 -3447 -5986
13598 -5986 360 6423 -486 4 5492 1013 1361 -443 -2508 -2747 -1967 6340 7598 379 -2689 -5088
13582 -5088 -7758 -4574 223 -4661 -4000 307 4784 447 224 3627 1021 -7436 -10010 -8912 -5155
$$ packed form
13690d169n83m4N82j382J462q56M290L570o28J482q915P081R231m115n806k954
13674a754j099J719L172Q99o210j1630O234M165m940L20N088j830m543K432J095
13659f882L333R663l405K348r862k480p61J036J838Q291j744m945J349j025J18
13644c128N98j205k564k309p44L124o676K564K923M348K82k541L919J867k747
13629b289L531l58j807O18p06m30r14l259j580j980m900P811R676L126Q17j792
13613E564m889k142M588q60k40l608k370j402O648j996j362p72L489m095k539
13598e986O346O063o909M90N488m479L48j804k065k39P80Q307J258p219l068k399
13582e088k670L184M797m884O61M307M477m337k23L403k606q457k574J098L757
$$ plain form
13567 -5155 -8411 -5198 -5072 553 1483 -2293 -1433 -1989 -1890 -2677 -4905 -2360 -1278 -5223 -3297 5412
13551 5412 2961 -3981 -4943 -5322 -7253 -11 5134 5007 6210 11112 12821 10268 6465 5381 -190
13536 -190 6713 10470 8085 8040 8258 743 1157 -262 7725 9359 6042 5324 5905 4340 6062 8603
13520 8603 -2566 -7041 -7614 -4050 -2808 -776 5653 15542 16352 14740 21068 18192 12882 10401 2328
13505 2328 -1677 -1870 -449 -5699 -8081 -5257 -287 3788 2582 1496 4234 2127 4481 9246 14359
13490 14359 12358 13287 7696 3043 7037 -1090 -7287 -5638 -7992 -1448 5272 12247 11043 8494 5822
13475 5822 4227 2364 -845 -776 -5527 -5891 784 3994 8003 8727 3330 407 647 -2714 -8289 -12433
13459 -12433 -7027 -2100 6620 10162 8967 4213 -864 -3667 -2195 953 -5666 -3518 313 -3059
$$ packed form
13567e155l256L213J26N625R30l776Q60n56R9p87k228K545J082l945J926Q709
13551E412k451o942r62l79j931P242N145j27J203M902J709k553l803j084n571
13536a90O903L757k385m5K18p515M14j419P987J634l317p18N81j565J722K541
13520H603j1169m475n73L564J242K032O429R889Q10j612O328k876n310k481q073
13505B328m005j93J421n250k382K824M970M075j206j086K738k107K354M765N113
13490A4359k001R29n591m653L994q127o197J649k354O544O720O975j204k549k672
13475E822j595j863l209O9m751l64O675L210M009P24n397k923K40l361n575m144
13459a2433N406M927Q720L542j195m754n077k803J472L148o619K148L831l372
$$ plain form
13445 -3059 -5086 -4075 -7188 -4583 -2769 998 3112 6296 4601 -5180 -8400 -5427 -1583 -5962 -4321
13430 -4321 -1285 5324 11755 11989 12153 9898 10079 9458 4310 3811 7672 4970 2527 9681 10745 7717
13414 7717 5458 1613 6965 8823 13932 14174 4828 6971 7012 4824 -2280 -6699 -1238 4789 5293 7577
13398 7577 6051 9168 7880 7814 8284 6840 8607 9601 12602 16540 12234 2094 -6043 -6832 -5629 2124
13382 2124 6762 3892 7225 14755 10674 -903 -7527 -921 2530 -411 -705 -5643 -12480 -6133 -4188
13367 -4188 -1989 -5280 -3966 223 -25 -5703 -4806 1806 4118 2000 -1393 -2108 -2280 -980 -2102 281
13351 281 -2799 1369 6371 6442 5929 4702 4976 7891 7858 9533 8971 1619 -8018 -9054 -5958 -5949 -11251
13334 -11251 -6039 -4264 -131 1137 -4073 -4863 -6680 -5808 1982 4386 4542 6309 6344 4880 -1295 931
$$ packed form
13445c059k027J011l113K605J814L767K114L184j695r781l220K973L844m379J641
13430d321L036O609O431K34J64k255J81o21n148m99L861k702k443P154J064l028
13414G717k259l845N352J858N109K42r346K143M1k188p104m419N461O027N04K284
13398G577j526L117j288o6M70j444J767R94L001L938m306j0140q137p89J203P753
13382B124M638k870L333P530m081j1577o624O606L451k941k94m938o837O347J945
13367d188K199l291J314M189k48n678Q97O612K312k118l393p15j72J300j122K383
13351B81l080M168N002P1n13j227K74K915l3J675n62p352r637j036L096Rn302
13334a1251N212J775M133J268n210p90j817Q72P790K404J56J767L5j464o175K226
$$ plain form
13318 931 4928 11104 14003 6582 111 -5770 -8635 -1683 -1901 -2606 2204 5452 6393 10922 8069 5610
13302 5610 11802 14171 9832 4830 6152 9072 17032 14660 9073 5210 -3799 -9140 -12940 -8171 -2042
13287 -2042 -5391 -9807 -8031 -6817 -2606 -919 275 -1134 -10743 -11428 -6447 -11183 -8313 -4242 -304
13272 -304 -1641 -14754 -16041 -5826 -6553 -6810 -5302 -4498 -6851 -4005 -2865 -446 3901 1154 -4658
13257 -4658 -6774 -2748 -4602 -5848 -3687 -972 4120 316 -810 -3018 -10073 -12511 -9934 -4994 -7928
13242 -7928 -15548 -15414 -14663 -13194 -12142 -8337 -7475 -2927 -1088 12724 16334 14670 8078 -3322 -7380
13227 -7380 -1811 -7113 -7965 -5841 -9355 -13285 -16084 -11589 -4705 -3327 -3455 -3012 -5871 -3434 -2563 910
13211 910 -2581 -2173 -3052 -2915 3605 7121 -4316 -4965 218 4497 9426 5646 388 -663 4029 2304
$$ packed form
13318I31L997O176K899p421o471n881k865O952k18p05M810L248R41M529k853k459
13302E610O192K369m339n002J322K920P960k372n587l863r009n341l800M769O129
13287b042l349m416J776J214M211J687J194j409r609o85M981m736K870M071L938
13272c04j337j3113j287J0215p27k57J508Q04k353K846J140K419M347k747n812
13257d658k116M026j854j246K161K715N092l804j126k208p055k438K577M940k934
13242g928p620J34P51J469J052L805Q62M548J839J3812L610j664o592j1400m058
13227g380N569n302q52K124l514l930k799M495O884J378j28M43k859K437Q71L473
13211I10l491M08q79J37O520L516j1437o49N183M279M929l780n258j051M692j725
$$ plain form
13195 2304 2456 8624 5754 1863 4507 7546 -1599 -6558 170 -1366 -401 -3764 -4498 -2842 -5707
13180 -5707 -2730 -5558 -161 4692 7130 5376 482 -6496 -4286 205 -316 -4771 -5264 -3867 -2921
13165 -2921 -3731 -6338 321 3981 4060 12032 12997 12103 2955 -4216 -2495 3441 7200 1843 -5216 -84
13149 -84 981 -1712 -439 1711 -138 -6091 -1560 296 -5667 -8863 -12950 -13603 -12266 -9304 -3079
13134 -3079 -1497 -8950 -7030 6423 11123 8354 6370 -64 -4337 -6373 806 2349 -3788 -8717
13120 -8717 -6205 -3952 2960 2782 1693 -59 7474 14007 8110 -1499 -3576 -847 2815 -1339 -8781
13105 -8781 -7717 -7128 -632 -822 -2821 1741 7056 12046 6777 6322 7208 8694 12270 10122 9109 5011
13089 5011 4179 5281 -859 -5600 -114 -866 -4786 -2716 -5534 -4435 273 -2567 -5268 -1925 3099
$$ packed form
13195B304J52O168k870l891K644L039r145m959O728j536R65l363p34J656k865
13180e707K977k828N397M853K438j754m894o978K210M491n21m455m93J397R46
13165b921q10k607O659L660P9P972R65q94r148p171J721N936L759n357p059N132
13149h4J065k693J273K150j849n953M531J856n963l196m087o53J337K962O225
13134c079J582p453J920J3453M700k769j984o434m273k036P179J543o137m929
13120h717K512K253O912j78j089j752P533O533n897r609k077K729L662m154p442
13105h781J064N89O496j90j999M562N315M990n269m55Q86J486L576k148j013m098
13089E011q32J102o140m741N486p52l920K070k818J099M708k840k701L343N024
$$ plain form
13074 3099 1279 -1580 -1913 -735 -1384 6989 10079 10899 8656 6741 6026 -586 -2063 729 -3868 -8759
13058 -8759 -4273 4167 4410 641 -1439 -5195 -11826 -16712 -11054 -4349 -1049 -1368 4546 7179 6079
13043 6079 -656 69 1390 3533 5090 7953 8734 3459 802 1317 -181 1351 6344 10970 9594
13028 9594 8586 -97 -3597 -8507 -8619 1386 -2790 -137 1198 -374 -4584 -4250 -4794 -10361 -12821
13013 -12821 -12836 -6733 -2666 17 1564 -1442 -4883 -6323 -10767 -6825 -6129 -6060 -6128 95 -5529 -3806
12997 -3806 910 4270 999 -322 -190 -133 -537 -2306 -1110 -927 -1859 -4537 -1445 -2419 -7863 -4334
12981 -4334 924 3494 1380 1993 2928 1295 622 -59 3844 4594 5762 7945 2481 -4013 -6267 -7602
12965 -7602 -8433 1722 9080 7821 -843 -1695 2795 4609 4344 7217 3989 3640 -5030 -10775 -7301
$$ packed form
13074C099j820k859l33J178o49Q373L090Q20k243j915p15o612j477K792m597m891
13058h759M486Q440K43l769k080l756o631m886N658O705L300l19N914K633j100
13043F079o735P25J321K143J557K863P81n275k657N15j498J532M993M626j376
13028I594j008q683l500m910j12J0005m176K653J335j572m210L34n44n567k460
13013a2821j5O103M067K683J547l006l441j440m444L942O96O9o8O223n624J723
12997c806M716L360l271j321J32N7m04j769J196J83r32k678L092r74n444L529
12981d334N258K570k114O13R35j633o73o81L903P50J168K183n464o494k254j335
12965g602q31J0155P358j259q664q52M490J814k65K873l228l49q670n745L474
$$ plain form
12950 -7301 -8968 -2788 -1319 -4399 1886 5279 -3540 -7019 -3831 3094 5884 3809 336 -2639 2662
12935 2662 -2592 -8700 -6544 -4662 -2622 -6532 -6152 555 5093 7551 6268 1454 1519 755 4197 -815
12919 -815 -5724 -7668 -4573 1851 5770 8533 6979 2 2050 7389 -1654 -3131 -2917 -2481 -7237
12904 -7237 -7043 -1012 725 -1132 -2753 -7360 -9584 -8310 -8846 -3971 1333 4380 8789 17139 29516
12889 29516 29372 41264 60937 61099 45623 26240 13336 4989 1493 -759 -5412 -3328 -3304 -4901
12875 -4901 -4019 -2486 5729 5064 3067 11733 20600 13279 3363 3833 -304 -789 5346 -1457 30 5799
12859 5799 -241 -3246 955 1455 -357 1889 4520 6278 8008 6268 2717 3960 2232 -8317 -13425
12844 -13425 -4734 1277 -1849 -5292 -4412 -2142 1624 -194 -1835 -4529 -1810 -3759 -9059 -7150 -2440
$$ packed form
12950g301j667O180J469l080O285L393q819l479L188O925K790k075l473k975N301
12935B662n254o108K156J882K040l910L80O707M538K458j283m814O5p64L442n012
12919h15m909j944L095O424L919K763j554o977K048N339r043j477K14M36m756
12904g237J94O031J737j857j621m607k224J274n36M875N304L047M409Q350J2377
12889B9516j44J1892J9673J62j5476j9383j2904q347l496k252m653K084K4j597
12875d901Q82J533Q215o65j997Q666Q867p321r916M70m137m85O135o803J487N769
12859E799o040l005M201N00j812K246K631J758J730j740l551J243j728j0549n108
12844a3425Q691O011l126l443Q80K270L766j818j641k694K719j949n300J909M710
$$ plain form
12829 -2440 -1997 -2543 -3391 -1122 -573 -1955 -4970 -9395 -12758 -7953 -2406 -2440 -3442 -951 149 -4336
12813 -4336 -3148 1418 6682 14723 7114 2188 1156 -3199 2714 5311 3879 1825 2138 6841 3275
12798 3275 3390 4516 5933 9015 7859 3980 2047 -712 4777 3840 4301 8189 9460 1459 1229 11480
12782 11480 32211 51503 45518 37059 30034 21914 13311 5251 7184 9891 6160 8314 15556 25099
12768 25099 31607 34510 44468 49131 40862 30935 16571 10021 11983 13146 13934 9193 6256 -392
12754 -392 6174 12257 13885 20702 28246 35931 34882 37601 39317 38130 36307 51298 72131 110229
12740 110229 180818 315525 504351 618278 571499 426561 278966 174688 114227 83549
12730 83549 66172 51516 39845 31401 22761 12175 7295 7845 12237 17891 14971 6988 4992 11523
$$ packed form
12829b440M43n46q48K269N49j382l015m425l363M805N547l4j002K491J100m485
12813d336J188M566N264Q041p609m926j032m355N913K597j432k054L13M703l566
12798C275J15J126J417L082j156l879j933k759N489r37M61L888J271q001k30J0251
12782A1480K0731J9292n985q459p025q120q603q060J933K707l731K154P242R543
12768B5099O508K903R958M663q269r927j4364o550J962J163P88m741k937o648
12754c92O566O083J628O817P544P685j049K719J716j187j823J4991K0833L8098
12740A10229P0589J34707J88826J13927m6779j44938j47595j04278o0461l0678
12730H3549j7377j4656j1671q444q640j0586m880N50M392N654k920p983j996O531
$$ plain form
12716 11523 11673 12912 8417 9025 11443 14050 11119 4391 -193 1851 6391 11653 13375 9006 -386
12701 -386 -911 -1976 -2853 797 478 1851 4161 1481 797 6698 7277 1858 -1427 950 -136 376
12685 376 6354 14359 11160 13084 17507 18561 15891 18765 17613 16772 11689 8630 6394 -868 -4676
12670 -4676 -539 1266 -1183 -9309 -10858 -11772 -14452 -11468 913 663 254 2322 -9120 -15610 -10292
12655 -10292 -6491 -13660 -14183 -10970 -13274 -14785 -9640 -12677 -7689 -10470 -17635 -22651 -16143 -7326 -1722
12640 -1722 8085 5742 2631 8642 8202 4596 3363 -1344 -2929 -2882 -7817 -8485 -4010 -1292 172 2293
12624 2293 5963 8985 5630 -69 -5051 -12765 -11331 -3934 -6578 -8922 -6264 -6546 -9049 -3295 -6484
12609 -6484 -3324 566 2725 -595 -12213 -14759 -11166 -5596 4453 5213 4986 718 -635 -962 -664
$$ packed form
12716A1523J50J239m495O08K418K607k931o728m584K044M540N262J722m369r392
12701c86n25j065q77L650l19J373K310k680o84N901N79n419l285K377j086N12
12685C76N978Q005l199J924M423J054k670K874j152q41n083l059k236p262l808
12670d676M137J805k449q126j549r14k680K984J2381k50m09K068j1442o490N318
12655a0292L801p169n23L213k304j511N145l037M988k781p165n016O508Q817N604
12640a722R807k343l111O011m40l606j233m707j585M7m935o68M475K718J464K121
12624B293L670L022l355n699m982p714J434P397k644k344K658k82k503N754l189
12609f484L160L890K159l320j1618k546L593N570J0049P60k27m268j353l27K98
$$ plain form
12594 -664 8349 12189 3308 -3957 -2330 1379 -1159 -402 958 -4933 -8981 -6627 -3714 4126 11263
12579 11263 12972 12852 9342 1593 -3356 -4339 -6786 -5465 -4785 -4453 -4782 959 -1743 -1123 -516 -4798
12563 -4798 -3983 -755 518 -1270 -1847 4922 6118 4046 -1057 -8122 -11484 -3837 -922 83 1437
12548 1437 -2535 -7302 -9109 -12788 -10757 99 5490 4643 -22 -6317 -2730 1844 1393 4448 11593
12533 11593 1687 -9371 -12344 -11662 -7346 -5205 -2141 1513 -481 -1701 2737 6482 5543 5655 3499
12518 3499 5061 311 -4140 -2637 -2173 1729 -2638 -6525 -5113 -687 -9922 -10549 -12943 -6759 3695
12503 3695 7575 6799 2830 -282 -1987 -6663 -8834 -10460 -9384 -2058 1136 4259 6231 6823 8831
12488 8831 8262 5040 -2188 1471 -1268 -12465 -11104 -3521 4708 89 4209 2420 -587 -1307 -3089
$$ packed form
12594f64R013L840q881p265J627L709k538P57J360n891m048K354K913P840P137
12579A1263J709j20l510p749m949r83k447J321O80L32l29N741k702O20O07m282
12563d798Q15L228J273j788n77O769J196k072n103p065l362P647K915J005J354
12548A437l972m767j807l679K031J0856N391q47m665o295L587M574m51L055P145
12533A1593r906j1058k973O82M316K141L064L654j994j220M438L745r39J12k156
12518C499J562m750m451J503M64L902m367l887J412M426r235o27k394O184J0454
12503C695L880p76l969l112j705m676k171j626J076P326L194L123J972N92K008
12488H831n69l222p228L659k739j1197J361P583Q229m619M120j789l007p20j782
$$ plain form
12473 -3089 2578 5638 3874 1282 1287 5015 9989 14537 16590 17831 19784 14967 1728 -6834 -614
12458 -614 -2047 2625 1476 1333 1336 3281 4746 7074 -2243 -5143 -321 3466 6875 -2043 -5232 -4572
12442 -4572 -5270 -5872 -3802 -4058 -4708 -7289 -17563 -15435 -4236 -3446 843 -1704 -2396 3606 3915 2308
12426 2308 -3507 -7067 -6910 -5782 -6931 -8795 -5635 -3241 -6029 -9361 -15607 -9630 -470 5352 -267
12411 -267 -3841 -6280 -10350 -8121 -7974 -7647 2996 2189 3824 7806 10021 9817 5425 2241 5698 4578
12395 4578 6734 11489 5293 1242 -3465 -7241 -9522 -6598 -4128 2142 2395 2265 4433 -1369 -1485
12380 -1485 535 2663 8118 13436 8714 2225 -4016 -12935 -14352 -5599 1135 4919 3850 393 -3448
12365 -3448 -3565 -2468 -4690 -3174 -390 -6754 -12486 -10487 -4517 -522 2292 3259 2005 -10499 -19075
$$ packed form
12473c089N667L060j764k592NL728M974M548K053J241J953m817j3239q562O220
12458f14j433M672j149j43LJ945J465K328r317k900M822L787L409q918l189O60
12442d572o98o02K070k56o50k581j0274K128J1199P90M289k547o92O002L09j607
12426B308n815l560J57J128j149j864L160K394k788l332o246N977R160N822n619
12411b67l574k439m070K229J47L27J0643q07J635L982K215k04m392l184L457j120
12395D578K156M755o196m051m707l776k281K924K470O270K53j30K168n802j16
12380a485K020K128N455N318m722o489o241q919j417Q753O734L784j069l457l841
12365c448j17J097k222J516K784o364n732J999N970L995K814R67j254j2504q576
$$ plain form
12350 -19075 -17211 -8462 -5659 -13490 -13685 -11476 -9578 -3633 -1012 -5392 -2331 317 -7596 -7213 -3959
12335 -3959 -662 -4780 -5757 122 516 -4727 -2333 -1631 -4809 3087 5246 -2965 -5979 -5758 -2403 -1925
12319 -1925 -4443 -5628 -6512 -9920 -14965 -18954 -10891 -1554 6292 6597 -1334 -7298 -2839 -2765 -5541 -6201
12303 -6201 -4010 1110 3131 3598 -3003 396 1456 -2631 -12197 -8378 -9574 -7639 -9264 -11594 -5452
12288 -5452 -5704 -11648 -10152 -7945 -6852 -4510 -4705 -7609 -6480 -4045 1578 2719 1658 128 1719
12273 1719 11791 5636 10 94 10800 7208 584 -1988 -2422 -1493 3835 8700 7957 6254 10447
12258 10447 10475 10533 10577 1003 -7302 -9626 -7450 -2417 -4387 -6458 64 -4823 -7446 -5303 924 283
12242 283 -6257 1952 5416 1405 855 -208 -7042 -10612 -9338 -4001 3270 11281 4873 -939 7172
$$ packed form
12350a9075J864Q749K803p831j95K209J898N945K621m380L061K648p913L83L254
12335c959L297m118r77N879L94n243K394P02l178P896K159q211l014K21L355M78
12319a925k518j185q84l408n045l989Q063R337P846L05p931n964M459P4k776o60
12303f201K191N120K021M67o601L399J060m087r566L819j196J935j625k330O142
12288e452k52n944J496K207J093K342j95k904J129K435N623J141j061j530J591
12273A719J0072o155n626Q4J0706l592o624k572m34R29N328M865p43j703M193
12258A0447K8N8M4r574q305k324K176N033j970k071O522m887k623K143O227o41
12242B83o540Q209L464m011n50j063o834l570J274N337P271Q011o408n812Q111
$$ plain form
12227 7172 5834 -2552 -5892 -6546 843 1056 -7445 -6885 -3018 -3884 -11125 -16199 -12940 -12130 -8396 -1829
12211 -1829 -6007 -11040 -10398 -10789 -10622 -7926 -13803 -11257 1989 4440 4373 4356 951 1335 1541 -1225 -605
12194 -605 -5847 -2611 790 2889 -5504 -10428 -12066 -12099 -13441 -10324 -7156 -9374 -6075 -1092 -6492
12179 -6492 -12061 -7833 -2204 -1337 -1869 -1228 2347 -6096 -6553 -5650 -6706 -5437 -12551 -13330 -12595 -16184
12163 -16184 -17301 -12153 -1380 -5825 -12659 -15948 -10602 -6308 -5659 -6684 -13262 -14694 -6665 -435
12149 -435 -138 5758 7351 1772 744 1692 9778 13505 9146 -241 -546 167 1803 -551 -7233 -1645
12133 -1645 7630 11767 1780 -9229 -6270 -5297 -6212 -6113 -662 -706 -2119 -1400 -5942 -3052 1882 -2375
12117 -2375 -3928 -4116 -3798 -8066 -8381 -10579 -9481 -742 6138 7138 8533 -824 -6432 -8103 -2222
$$ packed form
12227G172j338q386l340o54P389K13q501N60L867q66p241n074L259Q10L734O567
12211a829m178n033O42l91J67K696n877K546J3246K451o7j7l405L84K06k766O20
12194f05n242L236L401K099q393m924j638l3j342L117L168k218L299M983n400
12179f492n569M228N629Q67n32O41L575q443m57R03j056J269p114p79P35l589
12163a6184j117N148J0773m445o834l289N346M294O49j025o578j432Q029O230
12149d35K97N896J593n579j028R48Q086L727m359r387l05P13J636k354o682N588
12133a645R275M137r987j1009K959R73r15R9N451m4j413P19m542K890M934m257
12117b375j553j88L18m268l15k198J098Q739O880J000J395r357n608j671N881
$$ plain form
12102 -2222 -1541 -2600 1957 8936 12482 11955 6795 7992 863 4553 11172 6020 -4802 -4523 1066
12087 1066 2558 11044 17860 15350 12706 15032 14053 8132 4054 -1079 -5396 -2451 1379 1436 1347 2515
12071 2515 1551 -85 -3634 -1530 -1455 -2412 2153 4981 6945 -1926 -7457 -9781 -5725 2131 6233 11373
12055 11373 6515 6556 11192 8847 8484 6777 4097 -1109 429 -1054 -4339 -260 -168 3554 -1109 -4461
12039 -4461 -6039 -4992 -2256 -1330 -119 -3712 529 -3206 -7139 -17247 -12773 -5984 -2836 2163 1544
12024 1544 -4615 -8382 -8614 -8108 -6612 -6060 -1566 -473 3289 7102 2468 1594 2753 7394 7107 5673
12008 5673 1724 -2705 -840 365 6004 8473 2682 -9681 -15964 -12168 -13756 -5438 694 508 2006
11993 2006 3115 3144 398 -4451 -5816 -5137 -761 -1088 -3844 -372 581 -2822 2651 7414 1253 -7660
$$ packed form
12102b222O81j059M557O979L546n27n160J197p129L690O619n152j0822K79N589
12087A066J492Q486O816k510k644K326r79n921m078n133m317K945L830N7q9J168
12071B515r64j636l549K104P5r57M565K828J964q871n531k324M056P856M102N140
12055A1373m858M1M636k345l63j707k680n206J538j483l285M079R2L722m663l352
12039d461j578J047K736R26J211l593M241l735l933j0108M474O789L148M999o19
12024A544o159l767k32N06J496N52M494J093L762L813m634q74J159M641k87j434
12008E673l949m429J865J205N639K469n791j2363o283L796j588Q318O132j86J498
11993B006J109K9k746m849j365O79M376l27k756L472R53l403N473M763o161q913
$$ plain form
11977 -7660 -10255 -5812 -6160 -1159 2458 1276 4244 3465 991 6579 5960 2795 7570 3229 3842 1458
11961 1458 -308 -755 -3763 -4849 -1356 -534 -4620 -650 -6008 -12552 -12679 -13960 -12480 -14766 -17352
11946 -17352 -18633 -10721 -6579 -77 -1888 -2899 -117 1838 5891 6352 411 -932 4286 9307 11595
11931 11595 -1802 -8948 -4926 -2862 -2837 -3605 -2035 -515 -3727 -5418 -6138 -4918 -1917 -4854 -11846
11916 -11846 -18999 -15514 -8332 -17088 -19488 -13869 -11568 -13586 -15713 -25500 -28422 -28557 -22062 -18942 -13558
11901 -13558 -794 -7192 -6931 -2891 -9142 -19175 -20509 -12572 -7104 -9178 -15395 -16885 -14565 -13900
11887 -13900 -11173 -8630 1968 4449 8430 4011 -3078 2702 2874 -11958 -22647 -26899 -21859 -18928
11873 -18928 -20508 -13006 -5476 -5935 -8937 -11688 -9958 -5832 -7597 -10648 -10399 -8226 -6320 -6414 -7552
$$ packed form
11977g660k595M443l48N001L617j182K968p79k474N588o19l165M775m341O13k384
11961A458j766m47l008j086L493Q22m086L970n358o544j27j281J480k286k586
11946a7352j281P912M142O502j811j011K782J955M053M61n941j343N218N021K288
11931A1595j3397p146M022K064K5p68J570J520l212j691p20J220L001k937o992
11916a1846p153L485P182q756k400N619K301k018k127r787k922j35O495L120N384
11901a3558J2764o398K61M040o251j0033j334P937N468k074o217j490K320O65
11887a3900K727K543J0598K481L981m419p089N780J72j4832j0689m252N040K931
11873a8928j580P502P530m59l002k751J730M126j765l051K49K173J906r4j138
$$ plain form
11858 -7552 -7900 -2864 -3387 -8981 -13237 -5038 -5408 -6760 -5317 -3684 -4939 -6676 886 9198 4639
11843 4639 -1494 -2229 8734 12535 14917 16601 13173 4161 -5025 -9030 -12060 -6209 3833 1453
11829 1453 -2172 -3121 0 6251 7632 1002 -1100 1604 2531 2432 8178 8288 7555 11604 11918 11981 6293
11812 6293 976 -703 7681 11629 9944 10457 10804 9156 17257 18630 11797 5414 5318 39 -6468 -7034
11796 -7034 -3067 -1581 30 -5137 -10868 -15058 -17918 -12222 -10838 -7063 -3002 -3207 -831 1922 -2515
11781 -2515 -1526 -624 -9946 -11888 -5451 572 2174 4857 -418 -5819 69 2613 3932 8679 8585 5705
11765 5705 4899 -115 -7328 -6892 -8674 -5049 1550 8173 6221 7322 9035 9089 5148 -740 -4856 -9488
11749 -9488 -5996 2054 1566 892 -2598 -295 -4407 -8648 -11330 -10996 -4321 -9330 -6261 -4776 -6850
$$ packed form
11858g552l48N036n23n594m256Q199l70j352J443J633j255j737P562Q312m559
11843D639o133p35J0963L801K382J684l428r012r186m005l030N851J0042k380
11829A453l625r49L121O251J381o630k102K704R27r9N746J10p33M049L14O3n688
11812F293n317j679Q384L948j685N13L47j648Q101J373o833o383r6n279o507n66
11796g034L967J486J611n167n731m190k860N696J384L775M061k05K376K753m437
11781b515R89R02r322j942O437O023J602K683n275n401N888K544J319M747r4k880
11765E705q06n014p213M36j782L625O599O623j952J101J713N4l941n888m116m632
11749i488L492Q050m88o74l490K303m112m241k682L34O675n009L069J485k074
$$ plain form
11734 -6850 -7466 -3200 -2970 -4530 -7402 -13759 -13975 -12885 -4718 -5311 -11239 -10698 -7022 -10019 -14228 -12411
11718 -12411 -9042 -7888 -9006 -10478 -8735 -5462 -7221 -11864 -15404 -15359 -12016 -6744 -1660 5735 11771
11703 11771 6006 -2798 -2761 2406 -791 1385 -589 4790 5890 2142 2892 4990 8063 16062 17797
11688 17797 25811 33501 31347 28554 25188 14925 7974 8214 9407 5675 -3375 -1241 171 -455 -5941
11673 -5941 -6607 -3627 1873 -1120 -3287 3616 4224 4879 -1696 -5278 -6487 -3872 -1197 -3033 -2528 -454
11657 -454 -2161 -5356 -7760 -9720 -3980 -326 3098 3912 6762 10193 6965 -121 670 529 2903 6376
11641 6376 2948 -1100 -8122 -12427 -11402 -10192 -12426 -15048 -14039 -14065 -20869 -22078 -20272 -14733 -6468
11626 -6468 -7667 -2050 -3238 -7789 -17482 -17459 -10843 -12328 -10343 -6671 -11809 -9893 -10659 -16997 -17640 -17061
$$ packed form
11734f850o16M266K30j560k872o357k16J090Q167n93n928N41L676k997m209J817
11718a2411L369J154j118j472J743L273j759m643l540M5L343N272N084P395O036
11703A1771n765q804L7N167l197K176j974N379J100l748P50K098L073P999J735
11688A7797Q014P690k154k793l366j0263o951K40J193l732r050K134J412o26n486
11673e941o66K980N500k993k167O903O08O55o575l582j209K615K675j836N05K074
11657d54j707l195k404j960N740L654L424Q14K850L431l228p086P91j41K374L473
11641F376l428m048p022m305J025J210k234k622J009k6o804j209J806N539Q265
11626f468j199N617j188m551r693K3O616j485J985L672n138J916p66o338o43N79
$$ plain form
11610 -17061 -7926 -4275 -3618 -2665 221 -554 -5228 -4952 -4419 2276 7774 8836 2918 -1852 -7344 -3104
11594 -3104 712 -3195 -363 6453 6252 -2042 -13907 -14123 -10398 -2934 2006 7461 2944 2123 1918
11579 1918 1247 -1341 -2422 2926 10130 18093 21359 32406 36506 33940 40088 38019 32271 15240
11565 15240 5503 -996 -2246 2028 3557 -2778 -3918 -3574 -229 5101 11581 6824 2964 1440 5434
11550 5434 6513 8930 9141 1405 -2492 -5240 -9281 -7791 -5257 -2910 -12861 -15355 -16444 -20837 -18675
11535 -18675 -13215 -6474 4539 6841 5001 4394 -5070 -9159 -8907 -7092 -3730 -142 -4752 -10493 -11719
11520 -11719 -3008 6811 7791 9042 2914 4308 8239 4315 -212 -1196 5785 7143 2337 -1263 -6281
11505 -6281 -7116 -2371 1503 -2402 -6618 -2552 1313 -2232 -6405 -11085 -7863 -649 -2301 -4054 -2071
$$ packed form
11610a7061R135L651O57R53K886p75m674K76N33O695N498J062n918m770n492M240
11594c104L816l907K832O816k01q294j1865k16L725P464M940N455m517q21k05
11579A918o71k588j081N348P204P963L266J1047M100k566O148k069n748j7031
11565A5240r737o499j250M274J529o335j140L44L345N330O480m757l860j524L994
11550E434J079K417K11p736l897k748m041J490K534K347r951k494j089m393K162
11535a8675N460O741J1013K302j840o07r464m089K52J815L362L588m610n741j226
11520a1719Q711R819R80J251o128J394L931l924m527r84O981J358m806l600n018
11505f281q35M745L874l905m216M066L865l545m173m680L222P214j652j753J983
$$ plain form
11490 -2071 -1851 -5685 -639 -1881 -2618 4850 9138 11954 11321 7522 404 2383 6090 2708 6225
11475 6225 3627 3794 89 4968 4707 1338 3341 7987 8290 -5039 -12535 -12603 -5566 -5644 -8808 -9597
11459 -9597 -5368 -8657 -6997 1161 5901 2417 -373 -4662 -9692 -11747 -7488 -8854 -13146 -7029 -6398
11444 -6398 -5271 -4354 24 105 -10870 -14547 -13500 -12641 -10126 -4882 2585 -2974 -13271 -14254 -6209
11429 -6209 -1748 3450 6734 4231 5136 8144 8622 -1737 -11088 -10234 -6498 -2636 777 -1801 -1893 -333
11413 -333 -2962 1044 -2738 4440 3168 -2120 -6105 -1993 741 4063 2232 6840 8991 7972 6011
11398 6011 1618 -3806 -8730 -5218 -5618 -8164 -1684 -3942 -3511 -5799 -1059 1043 2988 8451 8839
11383 8839 3464 -1267 149 6575 3765 3593 -149 4512 9880 8596 3219 3959 -6170 -2063 4236
$$ packed form
11490b071K20l834N046j242p37P468M288K816o33l799p118J979L707l382L517
11475F225k598J67l705M879k61l369K003M646L03j3329p496o8P037p8l164p89
11459i597M229l289J660Q158M740l484k790m289n030k055M259j366m292O117O31
11444f398J127R17M378Q1j0975l677J047Q59K515N244P467n559j0297r83Q045
11429f209M461N198L284k503R05L008M78j0359r351Q54L736L862L413k578r2J560
11413c33k629M006l782P178j272n288l985M112K734L322j831M608K151j019j961
11398F011m393n424m924L512m00k546O480k258M31k288M740K102J945N463L88
11383H839n375m731J416O426k810j72l742M661N368j284n377P40j0129M107O299
$$ plain form
11368 4236 -2697 -7806 -6085 584 5491 4669 18 -307 1232 3266 5706 9053 8679 -2061 814
11353 814 4214 6024 7202 3214 -5496 -5622 -5238 -13442 -12960 -15010 -12842 -11450 -7959 -6474 -7364 -8392
11337 -8392 -15366 -15986 -6841 -10471 -17349 -14700 -11866 -3595 4324 2717 6866 12757 8104 6957 10133
11322 10133 8899 9658 5822 906 1564 -1317 -2475 3646 7016 5410 2231 -2335 -8309 -5360 -2725
11307 -2725 1339 2925 5298 9801 7561 5497 -2378 4441 1573 2402 5113 8769 12954 15527 13558
11292 13558 10729 8778 6396 11433 17654 19042 15792 20484 32808 42846 40520 40386 46885 54679
11278 54679 62437 62086 67545 68672 77992 100020 123719 146340 168225 187826 212526 235690 277703
11265 277703 337610 422726 548639 755738 1120426 1817170 3032097 4543518 5654752
$$ packed form
11368D236o933n109J721O669M907q22m651l25J539K034K440L347l74j0740K875
11353H14L400J810J178l988q710j26L84q204M82k050K168J392L491J485q90j028
11337h392o974o20R145l630o878K649K834Q271P919j607M149N891m653j147L176
11322A0133j234P59l836m916O58k881j158O121L370j606l179m566n974K949K635
11307b725M064J586K373M503k240k064p875O819k868Q29K711L656M185K573j969
11292A3558k829j951k382N037O221J388l250M692J2324J0038k326j34O499P794
11278E4679P758l51N459J127R320K2028K3699K2621K1885J9601K4700K3164M2013
11265B77703N9907Q5116J25913K07099L64688O96744J214927J511421J111234
$$ plain form
11256 5654752 6151363 6294063 5860359 4706139 3299818 2137781 1390042 968048 728674
11247 728674 578075 474711 401771 348974 307758 265570 227600 194318 167011 139179 121334
11236 121334 107639 94599 79269 67984 67538 63759 61595 54649 51093 45884 35792 31172 30735
11223 30735 29489 19158 12108 11624 20204 26932 22659 24352 26928 29316 25037 19176 12656 9738
11209 9738 11358 8932 7218 7275 5567 12963 19473 23919 17083 15225 12945 9386 3174 7071 8844
11194 8844 12849 9971 10165 12218 11380 11090 22460 21778 10948 8488 10950 7478 9994 23504 17286
11179 17286 17085 19345 19621 23552 30442 24966 23752 26949 28512 28359 29765 36316 43561 42453 29657
11164 29657 27161 29981 39603 44063 46519 49460 47418 49838 56528 58553 65099 83002 98026 110748
$$ packed form
11256E654752M96611J42700m33704j154220j406321j162037p47739m21994k39374
11247G28674j50599j03364p2940n2797m1216m2188l7970l3282k7307k7832j7845
11236A21334j3695j3040j5330j1285m46l779k164o946l556n209j0092m620m37
11223C0735j246j0331p050m84Q580O728m273J693K576K388m279n861o520k918
11209I738J620k426j714N7j708P396O510M446o836j858k280l559o212L897J773
11194H844M005k878J94K053q38k90J1370o82j0830k460K462l472K516J3510o218
11179A7286k01K260K76L931O890n476j214L197J563j53J406O551P245j108j2796
11164B9657k496K820R622M460K456K941k042K420O690K025O546J7903J5024J2722
$$ plain form
11150 110748 133810 163714 198235 235707 278829 329517 414722 549164 772938 1184139 1971192
11139 1971192 3261462 4568475 5092910 4992058 5041820 5313111 5045654 4009247 2763089
11130 2763089 1780356 1188047 860475 660954 529071 439266 368483 305289 253141 211141
11120 211141 179111 152036 134669 115763 97529 86367 79605 68464 60966 52030 52455 51468 51321
11107 51321 50908 48662 48145 44897 39248 31881 27299 32252 32869 29545 29876 31953 31570 28122 22210 20384
11091 20384 18290 15143 21027 16309 18920 23785 19289 12897 13596 13906 5630 5859 11354 13372 10349
11076 10349 5620 -2905 -5295 1001 5224 10141 11273 4313 4510 12724 15010 10356 7727 6222 2641
11061 2641 1756 1868 6048 8327 16953 14595 8718 5727 7297 6600 -838 -7286 -8000 -2736 4077 7438
$$ packed form
11150A10748K3062K9904L4521L7472M3122N0688Q5205J34442K23774M11201P87053
11139A971192J290270J307013N24435j00852M9762K71291k67457j036407j246158
11130B763089r82733n92309l27572j99521j31883q9805p0783o3194n2148m2000
11120B11141l2030k7075j7367j8906j8234j1162o762j1141p498q936M25r87j47
11107E1321m13k246n17l248n649p367m582M953O17l324L31K077l83l448n912j826
11091B0384k094l147N884m718K611M865m496o392O99L10q276K29N495K018l023
11076A0349m729q525k390O296M223M917J132o960J97Q214K286m654k629j505l581
11061B641q85J12M180K279Q626k358n877k991J570o97p438o448p14N264O813L361
$$ plain form
11045 7438 8279 5956 8239 2979 -4231 -7605 -3397 -8163 -9465 -238 27 -5792 -4077 974 -4126
11030 -4126 -7887 -9462 -14856 -19899 -16223 -9357 -5409 -7847 -7717 -4243 5516 8648 2346 -7671 -12025
11015 -12025 -12691 -9431 -8531 -8634 -3877 2698 10472 11128 12443 13078 6994 8749 12342 10456 6082 5137
10999 5137 8834 14295 7763 7320 3763 -942 315 3781 6703 6366 2020 2236 7302 6251 5301 -6668
10983 -6668 -7121 -6975 -5403 -418 232 -2082 -511 -6741 -6420 3162 807 -2238 -1176 -765 -2406 473
10967 473 -1394 -2752 -3963 -954 -6951 -8317 2952 9495 8821 7823 2291 -778 -2788 3909 8177
10952 8177 8102 9287 11814 13621 13024 7448 7063 12254 12697 8645 9659 6370 2193 1306 6555 10823
10936 10823 9309 4777 8937 11544 12141 7341 2652 -6118 -2112 4637 975 -3174 472 2453 -430
$$ packed form
11045G438Q41k323K283n260p210l374M208m766j302R227K65n819J715N051n100
11030d126l761j575n394n043L676O866L948k438J30L474R759L132o302j0017m354
11015a2025o66L260R00j03M757O575P774O56J315O35o084J755L593j886m374r45
10999E137L697N461o532m43l557m705J257L466K922l37m346K16N066j051r50j1969
10983f668m53J46J572M985O50k314J571o230L21R582k355l045J062M11j641K879
10967D73j867j358j211L009n997j366J1269O543o74r98n532l069k010O697M268
10952H177p5J185K527J807n97n576l85N191M43m052J014l289m177q87N249M268
10936A0823j514m532M160K607N97m800m689q770M006O749l662m149L646J981k883
$$ plain form
10921 -430 -4222 -3193 -3479 -2532 -1021 3535 6952 8112 5322 558 4723 5186 3271 4128 5305 3716
10905 3716 -300 1746 2048 -864 2984 -2277 -5878 -977 5339 -1342 -312 1046 -616 818 1311
10890 1311 381 -4452 194 4758 2105 232 -2022 -7257 -6404 -11483 -13503 -13402 -14034 -15768 -14405 -14677
10874 -14677 -8959 -5789 -8581 -11600 -9661 -4034 -4241 -7823 -9836 -3519 -1022 -3086 -333 2105 926
10859 926 -6342 -9601 -7992 -565 6568 10216 5220 2826 9457 2966 -2385 4185 9287 4104 -3466
10844 -3466 -4746 -4157 -6551 -9709 -8069 -10333 -6373 -5730 -6678 -5024 -4562 -4063 2303 7666 877 1562
10828 1562 8512 6472 5326 979 2054 12300 17128 15811 13158 21193 30665 39031 36061 28146
10814 28146 26493 22511 15102 5623 762 -631 1543 1511 175 -9635 -5515 -4479 -4946 -6517 -7360
$$ packed form
10921d30l792J029k86R47J511M556L417J160k790m764M165M63j915Q57J177j589
10905C716m016K046L02k912L848n261l601M901O316o681J030J358j662J434M93
10890A311r30m833M646M564k653j873k254n235Q53n079k020J01o32j734J363k72
10874a4677N718L170k792l019J939N627k07l582k013O317K497k064K753K438j179
10859I26p268l259J609P427P133L648m996k394O631o491n351O570N102n183p570
10844c466j280N89k394l158J640k264L960O43r48J654M62M99O366N363o789O85
10828A562O950k040j146m347J075J0246M828j317k653Q035R472Q366k970p915
10814B8146j653l982p409r479m861j393K174l2j336r810M120J036m67j571q43
$$ plain form
10799 -7360 -6589 -7784 -54 5434 5081 8668 7022 7529 10065 8594 7853 2871 -1474 -4420 -4755 -4557
10783 -4557 -2214 -5259 -7863 -6342 -7594 -3038 924 -4277 -10374 -6898 -8040 -17634 -11734 -12428 -12964
10768 -12964 -15362 -15161 -17197 -15874 -5830 -6515 -7230 -3331 -5098 430 2330 2110 441 -6266 -6603
10753 -6603 -1609 3086 5752 2194 1769 -1104 -1901 -823 -117 -1545 83 -2290 -6558 -8292 -6023
10738 -6023 -1619 3366 8756 12045 7866 5754 11547 19703 31271 43273 57224 93191 171533
10725 171533 257120 247632 181534 108409 57647 37641 20702 14703 10764 1579 -2263 -378 543
10712 543 212 -395 -3671 -9032 -7880 -10210 -6556 713 8257 13985 18231 19145 27484 28524 28601 32116
10696 32116 34130 24464 20308 23161 20590 23301 18695 10478 853 -4093 -10416 -11600 -10147 -13016
$$ packed form
10799g360P71j195P730N488l53L587j646N07K536j471p41m982m345k946l35J98
10783d557K343l045k604J521j252M556L962n201o097L476j142r594N900o94n36
10768a2964k398K01k036J323J0044o85p15L899j767N528J900k20j669o707l37
10753f603M994M695K666l558m25k873p97J078P06j428J628k373m268j734K269
10738f023M404M985N390L289m179k112N793Q156J1568J2002J3951L5967P8342
10725A71533Q5587r488o6098p3125n0762k0006j6939n999l939r185l842J885R21
10712E43l31o07l276n361J152k330L654P269P544N728M246R14Q339J040P7L515
10696C2116K014r666m156K853k571K711m606q217r625m946o323j184J453k869
$$ plain form
10682 -13016 -9665 -9552 -9843 -6101 -5576 -1808 6241 5063 4101 -1197 3371 1903 -5349 -7842 -9874
10667 -9874 -1973 4231 990 1471 7208 7338 2462 -10618 -5385 -2753 -4008 317 1256 -1199 -975
10652 -975 -5589 -7057 -11253 -11650 -4428 -1358 -5403 -4056 -1067 2662 8180 8673 8726 5584 5178 2529
10636 2529 5551 2624 -3247 -815 -772 -4771 -670 -638 3078 6425 1709 -4436 -3037 -5666 -8704 -7037
10620 -7037 -7428 -7145 -6710 -10311 -12905 -5600 -104 5148 5530 4990 1453 6577 14517 21447 14880 6733
10604 6733 2692 596 -8619 -10560 -15863 -12845 -2482 1902 -1142 3003 7163 2844 -4119 -6486
10590 -6486 -5532 -6254 -9400 -2808 -4701 175 1222 5013 5396 1517 1850 6904 8569 7956 2878 5759
10574 5759 7179 4846 7332 8773 10490 7910 308 -5566 -2098 -39 -735 -2023 -1521 -3631 -5784
$$ packed form
10682a3016L351J13k91L742N25L768Q049j178r62n298M568j468p252k493k032
10667i874P901O204l241M81N737J30m876j3080N233K632j255M325R39k455K24
10652i75m614j468m196l97P222L070m045J347K989L729N518M93N3l142m06k649
10636B529L022k927n871K432M3l999M101L2L716L347m716o145J399k629l038J667
10620g037l91K83M35l601k594P305N496N252L82n40l537N124P940O930o567q147
10604F733m041k096r215j941n303L018J0363M384l044M145M160m319o963k367
10590f486R54p22l146O592j893M876J047L791L83l879L33N054J665o13n078K881
10574E759J420k333K486J441J717k580p602n874L468K059o96j288N02k110k153
$$ plain form
10559 -5784 -2093 6284 6382 6445 3798 -1521 -1508 2391 -583 -5694 -5267 1871 498 -6090 -12907 -13102 -4545
10542 -4545 -1377 1952 -2372 -5864 -3695 442 -1385 -7464 -4923 -8361 -7857 -1761 1116 779 -2424
10527 -2424 -4969 -6030 -10589 -10840 -5423 -5970 -2138 -845 -3199 -3731 -3399 788 1372 -5663 -8227 -4343
10511 -4343 -5215 -6330 -8122 -10210 -9900 -4008 -6040 -4047 -3005 -6161 156 -3408 -17005 -11295 -6927
10496 -6927 -677 2959 4825 -2196 -3878 15 -5167 -5045 -5082 -5000 -4704 -3683 -4520 -9020 -7439 -8499
10480 -8499 -7137 -2353 1609 6167 2258 -980 -9958 -13651 -11898 -7845 3667 7539 8274 10533 4791
10465 4791 5072 10350 4950 231 2764 -2167 -8281 -8858 -5946 -1803 -3456 -4844 -9006 -8471 -8858 -11620
10449 -11620 -11263 -9182 -7326 -13284 -15378 -9112 -3086 -4938 -14227 -14247 -5982 -1523 4658 11119 9340
$$ packed form
10559e784L691Q377R8O3k647n319J3L899k974n111M27P138j373o588o817j95Q557
10542d545L168L329m324l492K169M137j827o079K541l438N04O096K877l37l203
10527b424k545j061m559k51N417n47L832J293k354n32L32M187N84p035k564L884
10511d343q72j115j792k088L10N892k032J993J042l156O317l564j3597N710M368
10496f927O250L636J866p021j682L893n182J22l7Q2K96J021q37m500J581j060
10480h499J362M784L962M558l909l238q978l693J753M053J1512L872P35K259n742
10465D791K81N278n400m719K533m931o114n77K912M143j653j388m162N35l87k762
10449a1620L57K081J856n958k094O266O026j852r289k0Q265M459O181O461j779
$$ plain form
10434 9340 -782 -45 -3313 -4102 -1195 -5376 -3384 -6042 -9341 -6801 -5159 -4040 -3516 -13798 -14957
10419 -14957 -10412 -8952 -9383 -1704 -1115 -2670 240 5398 10457 17013 17457 19925 25570 24653 15387
10404 15387 8744 11058 10602 6298 8407 3222 -2660 -6395 -13241 -11404 -11275 -13152 -4102 4520 4558
10389 4558 6810 8263 3580 -1412 6071 8968 5548 -27 -4831 -4636 -3687 -1266 2210 84 -5986
10374 -5986 -1780 1043 -6153 -8963 -14865 -17608 -17695 -11416 -9963 -9980 -12421 -14404 -15861 -9708 -2124 2000
10358 2000 1615 750 -1254 -1173 -6152 -9223 -125 -275 2638 12593 10091 4851 7589 8648 8187 6732
10342 6732 10209 11469 16141 16348 3410 3693 2612 -1173 -7784 -7720 -6121 -4748 1060 2550 2490 4737
10326 4737 8610 8322 3885 6682 6578 -772 -2434 3369 5199 588 1434 2349 1372 3410 6015 9207
$$ packed form
10434I340j0122P37l268p89K907m181J992k658l299K540J642J119N24j0282j159
10419a4957M545J460m31P679N89j555K910N158N059O556M44K468N645r17r266
10404A5387o643K314m56m304K109n185n882l735o846J837J29j877R050Q622L8
10389D558K252J453m683m992P483K897l420n575m804J95R49K421L476k126o070
10374e986M206K823p196k810n902k743q7O279J453j7k441j983j457O153P584M124
10358B000l85q65k004Q1m979l071R098j50K913R955k502n240K738J059m61j455
10342F732L477J260M672K07j2938K83j081l785o611O4J599J373N808J490o0K247
10326D737L873k88m437K797j04p350j662N803J830m611Q46R15r77K038K605L192
$$ plain form
10310 9207 3423 6573 4143 8109 11011 16453 14410 3902 -1308 1008 4537 4129 -3983 -11885 -5278
10295 -5278 6238 4503 -7982 -2172 2955 -414 -1249 -3182 5775 10921 5083 -1990 1103 6237
10281 6237 6128 4282 7528 704 -2128 -722 1357 -116 105 2566 718 -544 9779 15863 5663
10266 5663 -3998 -4167 334 -1461 -1876 -5591 -8073 -9300 -7409 -4431 -5502 -8665 -1606 5201 1151
10251 1151 -3624 -5141 -10872 -15090 -19474 -17872 -10091 -8061 -8741 -11204 -15375 -17272 -13493 -5737 3876
10236 3876 -1218 -2333 -5939 -2204 2806 4476 4797 5447 6527 1334 -557 1329 6576 7160 4432
10221 4432 2872 6550 3182 -4299 -8085 -6218 -7161 -8520 -9591 -8564 -6560 -1335 3267 8281 7974
10206 7974 5200 4090 5094 4667 3426 7386 4179 3009 7267 12705 13697 9387 6787 6261 1284
$$ packed form
10310I207n784L150k430L966K902N442k043j0508n210K316L529m08q112p902O607
10295e278J1516j735j2485N810N127l369q35j933Q957N146n838p073L093N134
10281F237j09j846L246o824k832J406K079j473K21K461j848j262J0323O084j0200
10266E663r661j69M501j795m15l715k482j227J891K978j071l163P059O807m050
10251A151m775j517n731m218m384J602P781K030o80k463m171j897L779P756R613
10236C876n094j115l606L735N010J670L21O50J080n193j891J886N247N84k728
10221D432j560L678l368p481l786J867r43j359j071J027K004N225M602N014l07
10206G974k774j110J004m27j241L960l207j170M258N438R92m310k600n26m977
$$ plain form
10191 1284 -404 -3255 2156 4685 -4635 -18739 -14408 -8630 -3769 -1733 -2662 8552 10182 -1772
10177 -1772 607 5740 13632 10623 14293 21160 23450 19944 17749 12813 192 -5291 -5948 -10633 -11337
10162 -11337 -5525 -2452 3615 5715 3267 6281 3448 2520 8853 7484 5684 7552 3171 -2087 -6490
10147 -6490 -629 5732 9139 2977 1698 -3450 -742 -1196 -1085 -9431 -13227 -6801 2898 8918 10492
10132 10492 -314 -5027 -6560 -4932 -3510 5721 10766 8394 -3667 -12110 -6332 2831 3262 1668
10118 1668 4218 8765 4218 8566 14126 18144 18240 16824 16341 13420 12084 7345 3350 6654 4084
10103 4084 -5566 -8702 -5184 3218 10392 13226 8636 1799 -4161 -6474 -4598 7636 7166 326 1634
10088 1634 4903 -1236 -2624 747 2233 -349 2234 1906 3979 12160 20489 21928 21329 14774 8299
$$ packed form
10191A284j688k851N411K529r320j4104M331N778M861K036r29J1214J630j1954
10177a772K379N133P892l009L670O867K290l506k195m936j2621n483o57m685p04
10162a1337N812L073O067K100k448L014k833r28O333j369j800J868m381n258m403
10147f490N861O361L407o162j279n148K708m54J11q346l796O426R699O020J574
10132A0492j0806m713j533J628J422R231N045k372j2061q443N778R163M31j594
10118A668K550M547m547M348N560M018R6j416m83k921j336m739l995L304k570
10103D084r650l136L518Q402P174K834m590o837n960k313J876J2234m70o840J308
10088A634L269o139j388L371J486k582K583l28K073Q181Q329J439n99o555o475
$$ plain form
10073 8299 10949 11141 11607 14416 12913 15159 12683 10878 10358 11481 19529 26597 23321 18541 17264
10058 17264 15620 14413 11246 3272 994 3957 1095 -3434 2750 -1712 45 6379 6289 9437 13638
10043 13638 20053 22664 15261 13149 8871 7235 11262 17652 18307 11841 15657 24071 35033 44054
10029 44054 53587 69015 74000 69676 61654 57527 59356 74538 90897 111373 138483 165502 210234
10016 210234 265175 359754 516642 797524 1366023 2582187 4547567 5581220 4578025
10007 4578025 3062768 1749771 1045385 702450 518056 397730 320200 257653 211587 171635
9997 171635 140000 115288 106537 105414 93787 84202 84461 89212 90163 84396 69587 49207 42617 41914
9983 41914 37198 33000 29744 31530 29584 18953 18028 31837 42347 36392 33330 38750 37078 28399
$$ packed form
10073H299K650J92M66K809j503K246k476j805n20J123Q048P068l276m780j277
10058A7264j644j207l167p974k278K963k862m529O184m462J757O334r0L148M201
10043A3638O415K611p403k112m278j636M027O390O55o466L816Q414J0962R021
10029D4054R533J5428M985m324q022m127J829J5182J6359K0476K7110K7019M4732
10016B10234N4941R4579J56888K80882N68499J216164J965380J033653j003195
10007D578025j515257j312997p04386l42935j84394j20326p7530o2547m6066l9952
9997A71635l1635k4712q751j123j1627r585K59M751R51n767j4809k0380o590p03
9983D1914m716m198l256J786j946j0631r25J3809J0510n955l062N420j672q679
$$ plain form
9969 28399 22357 20696 19221 25965 25514 24782 15646 8262 5442 8809 16107 12692 10215 7543 13475
9954 13475 9969 11676 4198 991 14775 20390 22803 20374 16131 12071 8100 1293 7566 16467
9940 16467 20992 25275 23516 17186 20962 20397 13337 14318 13412 9742 10118 9293 11212 3139 -360 714
9924 714 3160 1945 -2460 -1302 3109 -3168 -7694 -7110 -669 6060 9932 15097 20449 21568 19295
9909 19295 15898 13120 8016 11455 17539 21391 18597 11727 15906 10236 8217 12710 10457 13968 14762
9894 14762 15667 16944 19951 22475 25422 37011 55935 86055 114377 108113 84250 60116 43155
9881 43155 40446 28586 24424 19287 15043 12170 15038 20074 21295 15753 19459 24034 23764 22064 22112
9866 22112 17991 13961 17823 20255 19503 19727 23331 21181 12794 7950 18235 19799 6746 -2287 1729
$$ packed form
9969B8399o042j661j475O744m51p32r136p384k820L367P298l415k477k672N932
9954A3475l506J707p478l207J3784N615K413k429m243m060l971o807O273Q901
9940A6467M525M283j759o330L776n65p060R81r06l670L76q25J919q073l499J074
9924G14K446j215m405J158M411o277m526N84O441O729L872N165N352J119k273
9909A9295l397k778n104L439O084L852k794o870M179n670k019M493k253L511P94
9894A4762R05J277L007K524K947J1589J8924L0120K8322o264k3863k4134j6961
9881D3155k709j1860m162n137m244k873K868N036J221n542L706M575k70j700M8
9866B2112m121m030L862K432p52K24L604k150q387m844J0285J564j3053r033M016
$$ plain form
9851 1729 6399 8856 11190 16084 16030 17427 14717 16321 18518 11663 10605 11734 16841 22440 18983
9836 18983 20289 20778 22101 21077 15737 14623 19375 19309 17062 15763 8183 6796 6342 12336 17438 8253
9820 8253 5186 6497 9858 14754 14993 15788 20366 21023 21350 22535 30338 30520 27272 26302 31004 34117
9804 34117 30317 27196 26203 15536 5085 9350 15235 14674 12710 10501 11929 15415 14352 15037 18140
9789 18140 23670 27525 31940 35630 35319 33582 39396 51042 74674 93340 96758 97570 94515 73667
9775 73667 54629 39005 33713 27912 23543 27447 30671 30008 29154 27350 26368 27152 25748 26248 26938 23274
9759 23274 22587 25493 25398 21549 22941 16044 14858 18379 25271 19079 16427 16595 15750 18982 18244 14592
9743 14592 18369 18122 24725 29942 33212 33513 22618 15738 19282 19920 19996 18684 19493 25560 22631 24364
$$ packed form
9851A729M670K457K334M894n4J397k710J604K197o855j058J129N107N599l457
9836A8983J306M89J323j024n340j114M752o6k247j299p580j387m54N994N102r185
9820H253l067J311L361M896K39P95M578O57L27J185P803J82l248r70M702L113
9804C4117l800l121r93j0667j0451M265N885n61j964k209J428L486j063O85L103
9789A8140N530L855M415L690l11j737N814J1646K3632J8666L418Q12l055k0848
9775G3667j9038j5624n292n801m369L904L224o63q54j804r82P84j404N00O90l664
9759B3274o87K906r5l849J392o897j186L521O892o192k652J68q45L232p38l652
9743A4592L777k47O603N217L270L01j0895o880L544O38P6j312Q09O067k929J733
$$ plain form
9727 24364 23239 20839 19970 18629 20997 30099 37062 37294 31165 23441 23343 24976 28213 30212 28401 25550
9711 25550 28227 30865 32012 29644 27042 28399 22750 20966 23335 23516 21172 20250 23392 20594 17060
9696 17060 28089 32634 36524 39139 37780 30898 29565 26145 30983 34107 30944 26955 22729 25879
9682 25879 30237 36042 32405 29381 35632 37877 39248 36574 34520 45199 48882 42477 32989 35612
9668 35612 36061 40216 51430 54535 48792 41498 41554 40970 45101 47077 53332 56580 56346 53263 43502 40669
9652 40669 41618 43126 47362 43794 47386 45214 38869 34288 42311 53321 47760 44501 44724 47058 42930
9637 42930 42238 43326 47144 48023 50765 54060 56069 60340 61398 63711 55814 50647 57056 64730 59268
9622 59268 56213 58149 65161 68908 67529 70085 66220 62830 68705 70651 65676 61939 72490 79139
$$ packed form
9727B4364j125k400q69j341K368R102O963K32o129p724r8J633L237J999j811k851
9711B5550K677K638J147k368k602J357n649j784K369J81k344r22L142k798l534
9696A7060J1029M545L890K615j359o882j333l420M838L124l163l989m226L150
9682B5879M358N805l637l024O251K245J371k674k054J0679L683o405r488K623
9668C5612M49M155J1214L105n743p294N6n84M131J976O255L248k34l083r761k833
9652D0669R49J508M236l568L592k172o345m581Q023J1010n561l259K23K334m128
9637D2930o92J088L818Q79K742L295K009M271J058K313p897n167O409P674n462
9622E9268l055J936P012L747j379K556l865l390N875J946m975l737J0551O649
$$ plain form
9608 79139 79252 75851 65274 66280 69821 69267 63621 64644 64409 66605 73842 73528 75044 77574 73820
9593 73820 74352 73868 77799 82985 85777 76571 68489 62729 63344 72459 77070 76910 76841 83464 87042 88088
9577 88088 85444 88331 88617 93417 98050 101310 93995 96100 101713 104063 103139 102028 103949 102898 95944
9562 95944 96584 105179 109863 117397 119742 119765 116130 116960 123232 127286 127372 127460 128891 127066 128894 127042 131901
9545 131901 130357 137318 140893 147093 145314 142241 150251 147870 150183 157100 159209 161249 163503 166857
9531 166857 167896 163995 161156 166686 177113 175761 179017 187644 194581 195231 202704 210138 217911 214916
9517 214916 209456 210670 220960 221601 220583 226735 233384 234366 238024 238686 240647 246025 251994 262839 265863
9502 265863 269004 274427 281760 280456 281668 289736 302065 314222 318241 318142 315192 326225 348734 362387
$$ packed form
9608G9139J13l401j0577J006L541n54n646J023k35K196P237l14J516K530l754
9593G3820N32m84L931N186K792r206q082n760O15R115M611j60o9O623L578J046
9577H8088k644K887K86M800M633L260p315K105N613K350r24j111J921j051o954
9562I5944O40Q595M684P534K345K3l635Q30O272M054Q6Q8J431j825J828j852M859
9545A31901j544O961L575O200j779l073Q010k381K313O917K109K040K254L354
9531A66857J039l901k839N530J0427j352L256Q627O937O50P473P434P773k995
9517B14916n460J214J0290O41j018O152O649R82L658O62J961N378N969J0845L024
9502B65863L141N423P333j304J212Q068J2329J2157M019r9k950J1033K2509J3653
$$ plain form
9488 362387 356792 368047 377692 378075 384877 392964 391302 398991 413516 424595 428463 434885 446501 458239
9474 458239 470727 477757 488626 496155 504857 508267 511888 516709 528743 542938 545914 562931 580908
9461 580908 588899 597723 602174 612470 623931 631868 641071 651813 665192 672374 675302 686410 699292
9448 699292 702660 707339 716467 730646 734273 743110 749498 757033 755215 757742 766329 779482 788397 787683
9434 787683 791377 800832 797713 788196 792351 788555 788337 788946 794457 795941 789072 780077 774099 770444 772215
$$ packed form
9488C62387n595J1255R645L83O802Q087j662P689J4525J1079L868O422J1616J1738
9474D58239J2488P030J0869P529Q702L410L621M821J2034J4195K976J7017J7977
9461E80908P991Q824M451J0296J1461P937R203J0742J3379P182K928J1108J2882
9448F99292L368M679R128J4179L627Q837O388P535j818K527Q587J3153Q915p14
9434G87683L694R455l119r517M155l796k18O09N511J484o869q995n978l655J771
$$ [...]
##END NTUPLES=NMR SPECTRUM
##END=
