##TITLE=Analysis number 325980
Compound Code cc 02010
Project Code adrs
Chemist Name stores
##JCAMPDX= 6.0         $$ Bruker NMR JCAMP-DX V2.0
##DATA TYPE= NMR SPECTRUM
##DATA CLASS= NTUPLES
##ORIGIN= Bruker BioSpin GmbH
##OWNER= nmr
$$ XWIN-NMR		Version 3.5
$$ Mon Jan 22 11:30:57 2007 GMT Standard Time (UT+0h)  MAYBRIDGE\nmr@NMR_250MHZ
##.OBSERVE FREQUENCY= 250.131544655141
##.OBSERVE NUCLEUS= ^1H
##.ACQUISITION MODE= SIMULTANEOUS (DQD)
##.ACQUISITION SCHEME= undefined
##.AVERAGES= 16
##.DIGITISER RES= 18
##SPECTROMETER/DATA SYSTEM= dpx250
##.PULSE SEQUENCE= zg30
##.SOLVENT NAME= CDCl3
##.SHIFT REFERENCE= (INTERNAL, CDCl3, 0, 16.522)
##AUDIT TRAIL= $$ (NUMBER, WHEN, WHO, WHERE, WHAT)
$$ ##TITLE= Audit trail, XWIN-NMR		Version 3.5
$$ ##JCAMPDX= 5.01
$$ ##ORIGIN= Bruker BioSpin GmbH
$$ ##OWNER= nmr
$$ C:\u/data/dgb/nmr/ADRS/1550/pdata/1/auditp.txt
$$ ##AUDIT TRAIL=  $$ (NUMBER, WHEN, WHO, WHERE, WHAT)
(   1,<2007-01-22 11:30:29.82 +000>,<MAYBRIDGE\nmr>,<NMR_250MHZ>,
      <created by zg, POWCHK disabled, PULCHK disabled
       configuration hash MD5:
       49 4B E0 1D 92 C2 6B 37 9F E6 65 BC 52 41 86 1D
       data hash MD5: 64K
       11 51 BB B8 FF F7 41 B9 8E 03 B8 9F 31 7F 20 C3>)
(   2,<2007-01-22 11:30:47.16 +000>,<MAYBRIDGE\nmr>,<NMR_250MHZ>,
      <Start of raw data processing
       ef LB = 0.3 FT_mod = 6 PKNL = 1 SI = 32K 
       data hash MD5: 32K
       E8 A7 E7 BE E0 C7 F2 DC 96 B4 43 19 78 E9 ED 16>)
(   3,<2007-01-22 11:30:49.07 +000>,<MAYBRIDGE\nmr>,<NMR_250MHZ>,
      <apk 
       data hash MD5: 32K
       86 3A 01 F6 9C EA 40 A4 8F 4F DD 3E CC 73 B0 22>)
(   4,<2007-01-22 11:30:49.77 +000>,<MAYBRIDGE\nmr>,<NMR_250MHZ>,
      <abs ABSG = 5 
       data hash MD5: 32K
       97 88 4F D8 7D 2A CA 84 B4 70 21 7E 42 66 24 CD>)
$$ ##END=
$$ 
$$ hash MD5
$$ 60 CC 9A B0 E5 F3 A6 48 5F FF A9 47 4F 10 86 14
##$RELAX= 
##$RELAX= 
##$RELAX= 
##$RELAX= 
##$RELAX= 
##$RELAX= 
##$RELAX= 
$$ Bruker specific parameters
$$ --------------------------
##$DU= <C:\u>
##$EXPNO= 1550
##$NAME= <ADRS>
##$PROCNO= 1
##$TYPE= <nmr>
##$USER= <dgb>
##$AMP= (0..31)
100 100 100 100 100 100 100 100 100 100 100 100 100 100 100 100 100 100 
100 100 100 100 100 100 100 100 100 100 100 100 100 100 
##$AQSEQ= 0
##$AQ_mod= 3
##$AUNM= <au_zg>
##$AUTOPOS= <32 >
##$BF1= 250.13
##$BF2= 250.13
##$BF3= 250.13
##$BF4= 250.13
##$BF5= 500.13
##$BF6= 500.13
##$BF7= 500.13
##$BF8= 500.13
##$BYTORDA= 1
##$CFDGTYP= 0
##$CFRGTYP= 5
##$CHEMSTR= <none>
##$CNST= (0..31)
1 1 145 1 1 1 1 1 1 1 1 1 1 1 1 1 1 1 1 1 1 1 1 1 1 1 1 1 1 1 1 1 
##$CPDPRG= <>
##$CPDPRG1= <>
##$CPDPRG2= <>
##$CPDPRG3= <>
##$CPDPRG4= <mlev>
##$CPDPRG5= <mlev>
##$CPDPRG6= <mlev>
##$CPDPRG7= <mlev>
##$CPDPRG8= <mlev>
##$CPDPRGB= <>
##$CPDPRGT= <>
##$D= (0..31)
0 1 0 0 0 0 0 0 0 0.06 0 0 0 0 0 0 0.0002 0 0 0 0 0 0 0 0 0 0 0 0 0 0 
0 
##$DATE= 1169465428
##$DBL= (0..7)
120 120 120 120 120 120 120 120 
##$DBP= (0..7)
150 150 150 150 150 150 150 150 
##$DBP07= 0
##$DBPNAM0= <>
##$DBPNAM1= <>
##$DBPNAM2= <>
$$ [...]
##$SUBNAM7= <"">
##$SUBNAM8= <"">
##$SUBNAM9= <"">
##$SW= 20.6930455092707
##$SWIBOX= (0..15)
0 0 3 0 0 0 0 0 0 0 0 0 0 0 0 0 
##$SW_h= 5175.983436853
##$TD= 65536
##$TD0= 1
##$TE= 294.16
##$TE2= 300
##$TE3= 300
##$TEG= 300
##$TL= (0..7)
0 120 120 120 120 120 120 120 
##$TP= (0..7)
150 150 150 150 150 150 150 150 
##$TP07= 0
##$TPNAME0= <>
##$TPNAME1= <>
##$TPNAME2= <>
##$TPNAME3= <>
##$TPNAME4= <>
##$TPNAME5= <>
##$TPNAME6= <>
##$TPNAME7= <>
##$TPOAL= (0..7)
0.5 0.5 0.5 0.5 0.5 0.5 0.5 0.5 
##$TPOFFS= (0..7)
0 0 0 0 0 0 0 0 
##$TUNHIN= 0
##$TUNHOUT= 0
##$TUNXOUT= 0
##$USERA1= <user>
##$USERA2= <user>
##$USERA3= <user>
##$USERA4= <user>
##$USERA5= <user>
##$V9= 5
##$VALIST= <valist>
##$VCLIST= <CCCCCCCCCCCCCCC>
##$VD= 0
##$VDLIST= <DDDDDDDDDDDDDDD>
##$VPLIST= <PPPPPPPPPPPPPPP>
##$VTLIST= <TTTTTTTTTTTTTTT>
##$WBST= 1024
##$WBSW= 4
##$XGAIN= (0..3)
0 0 0 0 
##$XL= 0
##$YL= 0
##$YMAX_a= 442525
##$YMIN_a= -550122
##$ZGOPTNS= <>
##$ZL1= 120
##$ZL2= 120
##$ZL3= 120
##$ZL4= 120
##$ABSF1= 16.522
##$ABSF2= -4.171173
##$ABSG= 5
##$ABSL= 3
##$ALPHA= 0
##$AQORDER= 0
##$ASSFAC= 0
##$ASSFACI= 0
##$ASSFACX= 0
##$ASSWID= 0
##$AUNMP= <proc_1d>
##$AZFE= 0.1
##$AZFW= 0.1
##$BCFW= 0
##$BC_mod= 0
##$BYTORDP= 0
##$COROFFS= 0
##$CY= 12.5
##$DATMOD= 1
##$DC= 0
##$DFILT= <>
##$DTYPP= 0
##$F1P= 14.0000005364418
##$F2P= -0.99999901652339
##$FCOR= 0.5
##$FTSIZE= 32768
##$FT_mod= 6
##$GAMMA= 0
##$GB= 0
##$INTBC= 1
##$INTSCL= 1
##$ISEN= 128
##$LB= 0.3
##$LEV0= 0
##$LPBIN= 0
##$MAXI= 10000
##$MC2= 0
##$MEAN= 0
##$ME_mod= 0
##$MI= 0
##$NCOEF= 0
##$NC_proc= -3
##$NLEV= 6
##$NOISF1= 0
##$NOISF2= 0
##$NSP= 0
##$NTH_PI= 0
##$NZP= 0
##$OFFSET= 16.522
##$PC= 1
##$PHC0= 228.1506
##$PHC1= 8.181472
##$PH_mod= 1
##$PKNL= yes
##$PPARMOD= 0
##$PSCAL= 4
##$PSIGN= 0
##$REVERSE= no
##$SF= 250.13
##$SI= 32768
##$SIGF1= 0
##$SIGF2= 0
##$SINO= 400
##$SIOLD= 32768
##$SREGLST= <1H.CDCl3>
##$SSB= 0
##$STSI= 32768
##$STSR= 0
##$SW_p= 5175.98343685301
##$SYMM= 0
##$S_DEV= 0
##$TDeff= 65536
##$TDoff= 0
##$TI= <Analysis number 999999
Compound Code 99
Book Reference 9
Project Code 9>
##$TILT= no
##$TM1= 0
##$TM2= 0
##$TOPLEV= 0
##$USERP1= <user>
##$USERP2= <user>
##$USERP3= <user>
##$USERP4= <user>
##$USERP5= <user>
##$WDW= 1
##$XDIM= 32768
##$YMAX_p= 286207584
##$YMIN_p= -92958
$$ End of Bruker specific parameters
$$ ---------------------------------
##NTUPLES= NMR SPECTRUM
##VAR_NAME=  FREQUENCY,     SPECTRUM/REAL,   SPECTRUM/IMAG
##SYMBOL=    X,             R,               I
##VAR_TYPE=  INDEPENDENT,   DEPENDENT,       DEPENDENT
##VAR_FORM=  AFFN,          ASDF,            ASDF
##VAR_DIM=   32768,         32768,           32768
##UNITS=     HZ,            ARBITRARY UNITS, ARBITRARY UNITS
##FACTOR=    0.157963299565203, 1,           1
##FIRST=     4132.6476996994, 0,             0
##LAST=      -1043.33573715361, 0,           0
##MIN=       -1043.33573715361, -92958,      0
##MAX=       4132.6476996994, 286207584,     0
$$ Real data points
##PAGE= N=1
##DATA TABLE= (X++(R..R)), XYDATA
$$ [...]
24551a0369L6503k839n636L166K7260J5131p935n149o073k4130j1966j0435r461
24538a1933j1931J5469J6355K4617j6988k0688m329K0287J7671J3864K0486k8592
24526C4288n2042j3238J7672J9642k59J2064o67j1674j844k1767j1971K4404K1142
24513A5750k9702k6531Q14L6375R080n06n303K807k4657J713J6198K0395J284
24500A7717j5460o32K2791M133J0420k2290K827R363k7423n336Q125M928j2098
24487b935K3510Q453j3167k1954j4720M929R228j0920J7593L067k5415J7252N543
24474D64l6465o1J5851j2061k1417K0037J3800n381J5789Q518n563p960p502p71
24460b2722N80m188Q618P056o121N678J1727q32k3026J9016J2953k473j8943q443
$$ plain form
24551 -10369 26134 23295 17659 20825 48085 63216 55281 50132 44059 19929 7963 -2472 -11933
24538 -11933 -23864 -8395 7960 32577 15589 -5099 -9428 10859 28530 42394 62880 34288
24526 34288 -17754 -30992 -13320 6322 6063 18127 17460 5786 3942 -17825 -29796 -5392 15750
24513 15750 -13952 -40483 -39669 -3294 5786 5280 -23 2784 -21873 -20160 -3962 16433 17717
24500 17717 2257 1625 24416 28549 38969 16679 19506 28869 1446 -3890 4235 9163 -2935
24487 -2935 20575 29028 15861 -6093 -20813 -15884 -6656 -17576 17 3084 -22331 -5079 464
24474 464 -36001 -36062 -20211 -32272 -53689 -33652 -19852 -25233 -9444 -926 -6489 -14449 -21951 -22722
24460 -22722 -22142 -26330 -17712 -10656 -16777 -11099 628 -204 -23230 -4214 8739 6266 -12677 -21120
24446b1120M894R946P434n033k1455k1308L4058L490p862P330O410L917K4706
24433B5407r95k6400O568J9451K068J7284m8k4550p309J2258K59k4051O455J7608
24419B4005L771r007K717k4628P039j789j2647j8849Q601M568j5847j7299Q367
24406d0998J9028P13J9882L0187l704p740J735k2613J2368J1832O770k5590j7700
24393a5830j7313K0861J1838j1060j4091L0640L0638L49k0477j2380j0458m315
24381a1598J6863K8251J67j6349j8489j1806j3287P32j1414k6768q696J7352M8509
24368f533r485O696J8096n923r696Q466K9398j2433j485j1408o242l630L211j932
24354b900J0949L239N007l1146k893n394n136L0044J8154k82m646j6007k2125
$$ plain form
24446 -21120 -16226 -6280 1154 -3879 -25334 -46642 -12584 -9094 -16956 -9626 -3216 701 25407
24433 25407 24412 -1988 4580 24031 26099 43383 43335 18785 11476 23734 23993 -58 6397 24005
24419 24005 27776 18769 21486 -3142 3897 2108 -10539 -29388 -20787 -16219 -32066 -49365 -40998
24406 -40998 -21970 -21257 -1375 28812 25108 17368 19103 -3510 8858 20690 27460 1870 -15830
24393 -15830 -33143 -12282 -444 -11504 -25595 5045 35683 36032 15555 3175 -7283 -11598
24381 -11598 5265 33516 33683 17334 -1155 -12961 -26248 -25516 -36930 -63698 -72394 -55042 -6533
24368 -6533 -16018 -9322 8774 2851 -6845 1621 31019 18586 17101 5693 -549 -4179 -968 -2900
24354 -2900 8049 11288 16295 -14851 -17744 -23138 -28274 1770 19924 19642 14996 -1011 -23136
24341b3136K863K8507J0131R468o697J0505K0376N7j3662q885k8561r252o8K9384
24327B1030M699j2419Q62K678M597R71r62j2103j6193j0350J3125j6172l0982
24314e1219K6889K0217j6788N907K2428M179j7097l4369K2K479L852J3195K6133
24301E828K1990K7788O95l3698l3448n694Q553q643J7420J454Q679q744M109J4284
24287B0573O463j2485k2883j3165p098j6622j338J5313J4723Q184N238P467m755
24274c85m500R990p543r86K010j0238J5840J3942J8738j1623k6458Q73M592l550
24260G02j5989o451M526J6244Q682J717J652j50q383j6272R613J2576L851m221
24246H097J428J0967k4844n031J6568J1125j0837J5094l633j6913j9712R192P108
$$ plain form
24341 -23136 -20273 8234 18365 27833 21136 31641 52017 52074 38412 29527 966 -8286 -8354 21030
24327 21030 25729 13310 14172 16850 21447 22418 21456 9353 -6840 -17190 -4065 -20237 -51219
24314 -51219 -24330 -4113 -20901 -14994 7434 11613 -5484 -39853 -39831 -37352 -33500 -20305 5828
24301 5828 27818 55606 56301 22603 -10845 -16539 -7986 -16629 791 2245 10924 2180 6289 20573
24287 20573 27036 14551 -8332 -21497 -28595 -45217 -46555 -31242 -16519 -8335 -3097 4370 -385
24274 -385 -4885 5105 -2438 -3424 -1414 -11652 4188 18130 36868 25245 -1213 -340 4252 702
24260 702 -15287 -21738 -17212 -968 7714 9431 11083 10933 2550 -13722 -4109 8467 12318 8097
24246 8097 9525 20492 -4352 -9383 7185 18310 7473 22567 18934 2021 -17691 -8499 -1391
24233a391o466J2696J995J7087j7015J033j6989j5681r353J7704P734k5280K1955
24220a1971K9697m82m749j0507N574J5875j4827M923J3280k5055N019O140k0170
24207g253p125Q502J2092Q969l009k0932k455p610O408M968J2769P420k2060j1268
24193b0584L3369J4587k0986k0941m271J7146j8694K887K6542J604l2393j6955
24181c8689J0474L3231J7269j4520l3734j0273l98J5866K6120K1199n895l1275
24169a0625k0456J5113J4839n625j1684P339J4643O551K0905J359j6128L081j8440
24156H72j4540k705M718J4656k0749R422J4851o116L307j3781N63L388Q608J0428
24142A2922k1224j5026J1425J6312k462j1374L405J6545J0736j6646j9806P995
$$ plain form
24233 -1391 -7857 4839 6834 23921 6906 7939 -9050 -24731 -34084 -16380 -8646 -33926 -11971
24220 -11971 17726 17244 12495 1988 7562 23437 8610 13533 26813 1758 6777 12917 -7253
24207 -7253 -14378 -5876 6216 15185 12176 -8756 -11211 -18821 -12413 -7445 5324 12744 -9316 -20584
24193 -20584 12785 27372 6386 -14555 -18826 -1680 -20374 -17487 9055 10659 -21734 -38689
24181 -38689 -28215 5016 22285 7765 -25969 -36242 -36640 -20774 5346 26545 20650 -10625
24169 -10625 -31081 -15968 -1129 -6754 -18438 -11099 3544 10095 31000 32359 16231 19312 872
24156 872 -13668 -16373 -11655 3001 -17748 -8326 6525 409 3716 -10065 -9502 -6114 2494 12922
24142 12922 -8302 -23328 -11903 4409 1947 -9427 -6022 10523 21259 4613 -15193 -7198
24130g198J0053L1375M943k446m1564q643j0184j189K9500k913j9878K1018K1863
24117B4737j176P877r944k4392J0627J2843K30M734J5880p989k4826J1059J5342
24104C5002k8369J3340L0980j0018k21k5531k0500R308l421k1158Q376p31p235
24091b0178R067K5548m582k3577l0680j7170K3557J4765j1201p340N675P637r552
24078c8031j6969J1687J3764l721P189Q231K4073J2554j1576r114J3264l29k434
24065H588J0314R171j5326j7400j5854J5083r487m115L956j0777p321K0090J2391
24052f87J7893n080o204L2759O63j4852j3339j0858j0671o134J025P727K1439
24039A3681m914j0342l2011J379j902J7585L702L748n761K1974j86l407j4084
$$ plain form
24130 -7198 2855 34230 39173 36727 -4837 -13480 -23664 -24853 4647 1734 -18144 2874 24737
24117 24737 23561 31438 21494 -2898 7729 20572 20802 25536 41416 33427 8601 19660 35002
24104 35002 6633 19973 50953 40935 40714 15183 -5317 3991 570 -20588 -12212 -12943 -20178
24091 -20178 -11111 14437 9855 -13722 -44402 -61572 -38015 -23250 -34451 -41791 -36116 -28479 -38031
24078 -38031 -55000 -43313 -29549 -33270 -26081 -17850 6223 18777 7201 -1913 11351 11022 8588
24065 8588 18902 28073 12747 -4653 -20507 -5424 -14911 -19026 -15070 -25847 -33168 -13078 -687
24052 -687 17206 12126 5922 38681 39344 24492 11153 295 -10376 -16510 -15485 -7758 13681
24039 13681 8767 -1575 -33586 -32207 -34109 -16524 -12822 -9074 -14835 7139 6953 3546 -10538
24026a0538J2509K112j9438q512M851O666K0227L499P379j735l483P559N991k2104
24012D983l2493J7230K5181P480l932l593j6221J2676P11J2463J2841k996p490
23999B6840j2107k5734j4135M711O828N196m609n492J3590j1803L340J7375L1407
23986C5407O82k2697k751K926j2717j5681P299J3485K226m1027J0614Q620r977
23973b3591J57L720K5762J3552m286p14J1327p717j8847O951J6991j6004j5538
23960h237n190J2650J5090k5585J0258K9995K477j2580r791q99j073j6693j5676
23947b5254k155Q918J3124J6431Q242P010r48j077n247j1724q918q860J7158J6087
23933B2787J5152q207K067K2954o174J95N053m8000l2019j7500p427L4662J9867
$$ plain form
24026 -10538 1971 4083 -15355 -23867 -19016 -12350 7877 11376 18755 17020 13537 21096 27087 4983
24012 4983 -27510 -10280 14901 22381 18449 14856 -1365 11311 12022 24485 37326 34330 26840
23999 26840 14733 -11001 -25136 -20425 -13597 -8401 -13010 -18502 -4912 -16715 -13375 4000 35407
23986 35407 36089 13392 10641 13567 850 -14831 -7532 5953 8179 -32848 -22234 -13614 -23591
23973 -23591 -23434 -19714 6048 19600 15314 14600 25927 18210 -637 6314 23305 7301 -8237
23960 -8237 -13427 -777 14313 -11272 -1014 28981 31458 18878 9087 8188 7115 -9578 -25254
23947 -25254 -27409 -18491 -5367 11064 19306 26316 25368 24291 19044 7320 -1598 -10458 6700 22787
23933 22787 37939 29732 31799 54753 48579 48774 53827 5827 -26192 -43692 -51119 -16457 3410
23920C410J659P365p560L788p876r260K292K5956M986j7182o303n694Q242K695
23906F518K076J9325k1625j9050K1190J0787m2554j8263J7528m708o05J2808J4419
23893b154P781j9972J5153j9429k599K3607n452J4720j23j8978j6467j5979J311
23880c8581L2415J1476j2300Q863o279P94K4667K6691j1742l091n956J726L10
23867B8993l3245j2993J6723J6874n911j7873R117J9774J0957J7757j9356l432
23855B7385o213j0320j1901j612P418J3819J3701K092m9559k4290K4184K9040
23843A3744M083j2302l937p022J1251O103K3202n760r448j6150J2838K0999L457
23830D1058K695p659N808L629k7650l2095J492j2401l515K2883P637k3126k1412
$$ plain form
23920 3410 5069 12434 4874 8662 786 -8474 -6182 19774 24760 7578 1275 -4419 3823 6518
23906 6518 8594 27919 6294 -12756 8434 19221 -23333 -41596 -24068 -28776 -29381 -16573 -2154
23893 -2154 5627 -14345 808 -18621 -21220 2387 -3065 11655 11532 -7446 -23913 -39892 -38581
23880 -38581 -6166 5310 -6990 1873 -4406 -3612 21055 47746 36004 32913 26957 28683 28993
23867 28993 -4252 -17245 -522 16352 10441 -7432 1685 21459 32416 50173 30817 27385
23855 27385 21172 10852 -1049 -2661 4757 18576 32277 34369 -15190 -39480 -15296 13744
23843 13744 17827 5525 1588 -5434 5817 11920 35122 29362 19914 3764 16602 37601 41058
23830 41058 43753 36094 41902 45531 17881 -14214 -12722 -25123 -28638 -5755 1882 -21244 -42656
23817d2656o446J3696J6911K1800K376o57r491j7708p935K933K5372Q9j9821N788
23803a5749Q285j2888J6031L3478K2443m362J2286p831j8362l3206J2086P79R521
23790B2511R320R17j7351j7072L671j22n190j906j5388J001j2864q976K9555K5366
23776A3472J61n609N921l426o367j0497K2939K515j585J5054j66r813k6004k692
23762f097K9807J9282j1591j9046J267j089J636m531j3077j4097p273K371J7238
23749e200J1253j7732M453K2725J3814k1916j9910o736L143K0147J9624k459o510
23736A4696j4745k3727j104J5301Q110P268J533k474J8998J1686j6823j8298j9928
23723a9507j1869M811J8475K0263Q320r604k9506k595J7070J4008l340j4532J987
$$ plain form
23817 -42656 -49102 -35406 -18495 3305 5681 5024 -4467 -22175 -30110 -27177 -1805 -1716 -21537 -15749
23803 -15749 -7464 -20352 -4321 29157 51600 47238 59524 51693 33331 125 12211 12990 22511
23790 22511 31831 32748 15397 -1675 1996 1874 -3316 -5222 -20610 -19609 -32473 -41449 -11894 13472
23776 13472 13633 8024 13945 10519 4152 -6345 16594 19109 17524 32578 32412 22599 -3405 -6097
23762 -6097 23710 42992 31401 12355 13622 12533 14169 9638 -3439 -17536 -24809 -22438 -5200
23749 -5200 6053 -11679 -7226 15499 29313 7397 -12513 -19249 -16106 4041 23665 21206 14696
23736 14696 -49 -23776 -24880 -9579 -1469 5799 7332 4858 23856 35542 18719 421 -19507
23723 -19507 -31376 -26565 -8090 12173 20493 10889 -18617 -21212 -4142 9866 6526 -8006 -6019
23710f019J4050J9091j9310j2077J0754m321j5319k062Q180J626J1009j77o166
23697g41J4922r481k2842P24L2542J4041m909j5078J116q797j3540k1552p584
23684d1179K0235r351p486J0721K44J3124j1903J1093J060j7421n918K0518L083
23671a3180j0737J2078N234o289K4231k47j2550m946Q107J5129j757L194r261
23658I006j3493n507j0856m210J6877K2324k3753k0966M203p60J0303l148K1697
23645A717K3588j8547k1890J3063r115q821K3453J9997Q267K811l1810j8350J5491
23632a46P875Q119M94j4829j0545j5110K1629j89q572l308J0228l5925p096K3381
23618b3994J6726L33J931K1435Q298j0041n905K3508J7884j8811j2957l839j1526
$$ plain form
23710 -6019 8031 27122 7812 -4265 6489 2168 -13151 -15213 -7033 -5407 5602 5425 -741
23697 -741 14181 4700 -18142 -17418 15124 29165 24256 9178 10294 1497 -12043 -33595 -41179
23684 -41179 -20944 -30295 -37781 -27060 -26816 -13692 -25595 -14502 -13442 -30863 -36781 -16263 -13180
23671 -13180 -23917 -11839 -6605 -12894 11337 11090 -1460 -6406 1701 16830 15073 18267 9006
23658 9006 -4487 -9994 -20850 -25060 -8183 14141 -9612 -30578 -26375 -27135 -16832 -19980 1717
23645 1717 25305 6758 -15132 -2069 -11184 -20005 3448 23445 31712 34523 2713 -15637 -146
23632 -146 7729 15848 16342 1513 -9032 -24142 -2513 -2702 -11274 -14582 -4354 -40279 -47375 -23994
23618 -23994 -7268 -6935 -5004 16431 24729 14688 8783 32291 50175 31364 18407 14568 3042
23605C042Q551K1670Q028j2387p524p11j5238k0866j9085K3275K909M012k726
23592g050j784Q996j964M223Q150L113n017j4627J5474L4413p811l1116r070J1133
23578G063J2572m426k0868o765K0825K4038o733k4913J8727Q025j9151j5387p422
23565a4415J3562J6548p775K161R672L943j8371k7817J3439K2157j663j0208J6970
23552A8203o236N977O403r169J2393j4372q504J1903k427l406L844m1027k1437
23539d7855L001P177K0253L407j4753j626K4840L978q579L280p172j4618p770
23526c6437M530J1912J0459k0357n157L6102K6739m347k9139o395J3131P315o727
23513A629j244K88J1416O623l825K2722m897l6358j8068O478Q259K78K2600j1763
$$ plain form
23605 3042 11593 33263 41291 28904 21380 20669 5431 -15435 -34520 -11245 -8336 -4324 -7050
23592 -7050 -8834 162 -1802 2421 10571 13684 8667 -5960 9514 43927 36116 5000 -4070 7063
23578 7063 19635 15209 -5659 -12424 8401 32439 25706 793 19520 27545 8394 -6993 -14415
23565 -14415 -853 15695 7920 10081 19753 23696 5325 -22492 -9053 13104 11441 1233 18203
23552 18203 11967 17944 24347 15178 27571 13199 4695 16598 14171 10765 14609 -26418 -47855
23539 -47855 -44854 -37677 -17424 -14017 -28770 -30396 -5556 -1578 -10157 -6877 -14049 -28667 -36437
23526 -36437 -31907 -19995 -9536 -29893 -35050 1052 27791 23444 -5695 -12090 1041 8356 1629
23513 1629 385 673 12089 18712 14887 37609 32712 -3646 -21714 -15236 -6977 -6699 15901 4138
23499D138k8307j494r615q293O203j535L3454J5588L92k3196L290p62j9361J2574
23485a6924j1839r780K3123J1001N219p79k5231j923L5434n613l6939K2063O992
23472e196j9526r43J2401J4398l608J2665L5660R865J550L405k781j9476j7757
23459B0657j3435r422J124K2978N357p065k990n780k057M002o777P608M320p419
23445A1101j7773j2824j0232L957J9575R236N362q16J3952P534l6000j7906J6863
23432g971J5866j51L727k82l924k1034k767j1470k019K7825L5938N236j2139n488
23418B1347L393n014P865j7535j9204p301J4663J8973K2242k191K336k06j9701
23405A9667k5698K965n926k1776l455l280J3079K6590J9434K0495K212k3779k4305
$$ plain form
23499 4138 -24169 -25663 -35278 -43571 -37368 -38903 -5449 10139 10531 -12665 -9375 -10137 -29498 -16924
23485 -16924 -28763 -38543 -15420 -4419 800 21 -25210 -27133 8301 2688 -34251 -12188 -5196
23472 -5196 -24722 -25665 -13264 1134 -2474 10191 45851 55716 57266 60671 57890 38414 20657
23459 20657 7222 -2200 -1076 21902 27259 20194 17204 11424 9367 13369 6592 14200 18520 11101
23445 11101 -6672 -19496 -29728 -25771 -6196 3040 8402 7586 21538 29072 -6928 -24834 -7971
23432 -7971 7895 7744 11471 11189 7265 -13769 -16536 -28006 -30025 -2200 33738 38974 26835 21347
23418 21347 24740 19726 27591 10056 -9148 -16449 -1786 17187 39429 37238 39574 39368 19667
23405 19667 -6031 -3066 -8992 -30768 -34223 -37503 -24424 2166 21600 42095 44307 20528 -3777
23392c777M304L547j8313j8419k1622J2318R541J4478K599P017k585R666J82r870
23378a0934k2324K0778N598j1958j1544J8828Q091p135J8351j7740q537N144k598
23365a5980n592O190K9418j1806j1872K0726J6728K359o972M993q45j8020l0784
23352b1457J5168J3733Q844l362k1o62Q362r808k2441j7204j4586J4849K964K0607
23338e014K5025K5505L478k4214j1688q939j1487J4444q405k0533N627J5043L3867
23325C2709L742l1372j1037k024j8668R331K9655J8370J7314k5208k4790M502
23313B524J804L701J1717j5022l081q224N633k9192K8610K1009k4184n712O865
23300c552r427j5666L009j5969j8666O085M0065L7980J7790J0076k3017j8296
$$ plain form
23392 -3777 527 4074 -14239 -32658 -54280 -41962 -32421 -17943 -15344 -8327 -10912 -1246 -1064 -10934
23378 -10934 -33258 -12480 -6882 -18840 -30384 -11556 -3465 -10600 7751 -9989 -18526 -13382 -15980
23365 -15980 -21572 -15382 14036 2230 -9642 11084 27812 30171 23199 28192 27347 9327 -21457
23352 -21457 -6289 7444 16288 12926 12905 12243 20605 10797 -11644 -28848 -43434 -28585 -25621 -5014
23338 -5014 20011 45516 48994 24780 13092 4153 -7334 7110 -1295 -21828 -16201 -1158 32709
23325 32709 36451 5079 -5958 -7982 -26650 -17319 12336 30706 48020 22812 -1978 2524
23313 2524 4328 8029 19746 4724 1643 -6581 -948 -30140 -1530 19479 -4705 -10417 -3552
23300 -3552 -12979 -28645 -25636 -41605 -60271 -54186 -14121 23859 41649 51725 28708 10412
23288A0412J247J7336k816J485n570l3578j3469P886p858k853J9517M659J4259
23275A0657J2617P529r413K180j6808k2977Q850J7689J8545l137J2029k7285k7480
23262a7004j7049Q128J7180R991l235j3465j5453J2475K2538K0255k437j398j083
23249A9443n881j6543j6307J451m258l291j6734L785L3384K2706j6660N634J9978
23236B6707j6664j5110J601j4623p873J1253J2372o285l956J3465p6j5569n043
23223a9801m504k015q853J8255L927J1161J3178O020q040k320j5960q346r682
23210b6980J9676K7401k2696k531l408m457j9262n087J3085L2748K3004k8116
23198C377j1347m691J8230M670j1047L723l533j7608N015J6404J2540o385j1126
$$ plain form
23288 10412 11659 28995 26179 27664 22094 -11484 -24953 -17067 -24925 -27778 -8261 -3602 10657
23275 10657 23274 30803 21390 23570 6762 -16215 -7365 10324 28869 25732 37761 10476 -17004
23262 -17004 -34053 -25925 -8745 1246 -1989 -15454 -30907 -18432 4106 24361 21924 20526 19443
23249 19443 13562 -2981 -19288 -17837 -22095 -25386 -42120 -38335 -4951 17755 1095 6729 26707
23236 26707 10043 -5067 -3466 -18089 -25962 -14709 -2337 -8622 -12578 887 811 -14758 -19801
23223 -19801 -24305 -26320 -35173 -16918 -12991 -1830 11348 17368 9328 7008 -8952 -17298 -26980
23210 -26980 -7304 20097 -2599 -5130 -8538 -12995 -32257 -37344 -24259 8489 31493 3377
23198 3377 -7970 -12661 5569 10239 -808 2915 -618 -18226 -13211 3193 15733 9348 -1778
23185a778k2201Q917K5324J3681o814O905n306j4930l9064j3196L412l526K4245
23172b4331j1822R990p753K014L202J9389J7237j0050L668R446J208j0266j7561
23159a5629M0199R942j4449l8848q056j2910J5549J1432J5767n564m962k7552
23147c5081R314M4428L079N122j6478l0837l196K1522r958L0490J8858j5779j0846
23134A0638m524J74k292k5840p526O200J4589J6117j1074k0913j3557J3285j370
23121b6093n91j9250j1902J7911J6209J2366K6154j1686k6509l821J1312Q220
23109g680l624j682k3052J042J0024J6508K2683j4270m2320m582O813J6486O860
23096a6794K146R216n847j317n81P624m471j6054Q413L3612K6731J311l5552l6756
$$ plain form
23185 -1778 -23979 -15062 10262 23943 17129 24034 18728 3798 -35266 -48462 -45050 -48576 -24331
23172 -24331 -36153 -26163 -33916 -31902 -28700 -9311 7926 -2124 1544 10990 12198 1932 -15629
23159 -15629 24570 34512 20063 -18785 -26841 -39751 -24202 -12770 2997 -2567 -7529 -35081
23147 -35081 -25767 18661 21740 26862 10384 -20453 -23649 -2127 -12085 18405 37263 21484 10638
23134 10638 6114 6288 3996 -21844 -29370 -23170 -8581 7536 -3538 -24451 -38008 -24723 -26093
23121 -26093 -26684 -45934 -57836 -39925 -23716 -11350 14804 3118 -23391 -27212 -15900 -7680
23109 -7680 -11304 -12986 -36038 -34996 -24972 -8464 14219 -51 -42371 -46953 -40140 -23654 -16794
23096 -16794 -14648 -5432 -11279 -12596 -13177 -5553 -10024 -26078 -17665 15947 42678 43989 8437 -28319
23082b8319R04Q226k488R539R389j2029q217J7921M603P241J6077Q946l7777k5257
23068c1241o82R356K0136K275j885j4516j3455Q508n114j489N023J7104q050o964
23054b0994J3464k0532j9620J4178r10J3094K2357j2381R15l852K7000j3826k4908
23041b6015J2276J6139m974J3487k674o636J6084M079l670j8067p180j3977j5024
23028c6152K0817J7618j8028l6161J9852K2347K1442Q008J1710k1718m1784o671
23016c8720J9165J7650k470k0221k7055K995K1464J3133J4667k019k116J0305
23004F778J0570K493J0374m605j3417J4373k8277j2217K8415L3414K222Q029j5983
22991D2169l7944j8233m33j134O129Q103L493R60k6686L338K4053k218j1799j1667
$$ plain form
23082 -28319 -27415 -19189 -21677 -12138 -2749 -14778 -22995 -5074 -471 6770 22847 31793 -5984 -31241
23068 -31241 -31923 -22567 -2431 -156 -2041 -16557 -30012 -21504 -26618 -28107 -23084 -5980 -14030 -20994
23054 -20994 -7530 -28062 -47682 -33504 -34414 -21320 1037 -11344 -10429 -14281 12719 -1107 -26015
23041 -26015 -13739 2400 -2574 10913 8239 1603 17687 21766 18096 29 -7151 -21128 -36152
23028 -36152 -15335 2283 -15745 -51906 -32054 -9707 11735 19743 31453 9735 -32049 -38720
23016 -38720 -19555 -1905 -4375 -24596 -51651 -48656 -27192 -14059 608 -1411 -3527 6778
23004 6778 17348 19841 30215 25610 12193 26566 -1711 -13928 14487 47901 50123 58152 42169
22991 42169 4225 -14008 -14441 -15575 -9446 -1343 2150 3110 -23576 -20238 3815 1597 -10202 -21869
22977b1869j823J0042m688N138l773P960L4166j1068m0553m761J603L961Q31j0232
22963c5066n623J9674J5829j3693j0378m803N190N436J2314N707M814o075j0985
22950a7659m274n258Q478J5783j3123J5750J753j3241k1900j5793K2241R698J3404
22937d141L5415r277j5563n765o436n566j7162j0824Q293J8897K1630j2078K254
22924c23j2015R270J1091K022j6767P714K3773p146k327j8393k6290m345Q650
22911b5086P003J9754j8927j7699J6487K2946k3142k2118j5695J4172K1328M601
22899a6376Q413m554j515k1457j2682J7134M4603K1456N518P521J0523j1270k3751
22886B3563l4491j0686o180n254K0583K0200n167M454J9364J281k4498Q355J0503
$$ plain form
22977 -21869 -23692 -13650 -18338 -13200 -16973 -9013 25153 14085 -26468 -31229 -29626 -25665 -24834 -35066
22963 -35066 -40689 -21015 -5186 -18879 -29257 -34060 -28870 -23434 -11120 -5413 -599 -6674 -17659
22950 -17659 -21933 -27191 -18713 -2930 -16053 -303 1450 -11791 -33691 -49484 -27243 -17545 -4141
22937 -4141 31274 21997 6434 669 -5767 -11333 -28495 -39319 -31026 -12129 9501 -2577 -323
22924 -323 -12338 -3068 8023 10045 -6722 992 24765 17619 15292 -3101 -29391 -33736 -25086
22911 -25086 -18083 1671 -17256 -34955 -18468 4478 -18664 -40782 -56477 -42305 -20977 -16376
22899 -16376 -7963 -12517 -14032 -35489 -48171 -31037 13566 35022 40540 48061 58584 47314 23563
22886 23563 -10928 -21614 -27794 -33048 -12465 7735 2568 7022 26386 27667 3169 11524 22027
22873B2027k7547o283L766L450N519J5253K0946J2873k9092m0213J1727P866j4959
22860a4667P104P977o343j745J4026J966K5883J657l113o217Q56l5803j5937N530
22846a8826J4605J8039q558r651J814j565l101j5029q547J5058K8184J9410l6304
22833d471j0248J2862k1650J7462J2405J8092r224j5708p647o738m11k695m43
22820a8414K129p50j6684j7361o501R513K2318L0995R270j8293n200j9612j0159
22807c8749K5824J5136j8320j6198j8234p57J7035J2450J7911m201q928J9036
22795B005Q529j4933o08J123K550K0034j894j0835j2947q790J030P49J3104J1487
22781A0604J8158r240L511k919o927R066l53n902j2217P709L1678n772k0066k5163
$$ plain form
22873 22027 -5520 -11803 -8037 -4587 932 16185 37131 50004 20912 -19301 -7574 292 -14667
22860 -14667 -7563 414 -5929 -7674 6352 8318 34201 35858 32745 26528 27384 -8419 -24356 -18826
22846 -18826 -4221 13818 5260 -4391 -2577 -4142 -7243 -22272 -30819 -15761 12423 31833 -4471
22833 -4471 -14719 -1857 -23507 -6045 6360 24452 15228 -480 -8127 -14865 -15276 -17971 -18414
22820 -18414 -16285 -17035 -33719 -51080 -57581 -48068 -25750 5245 14515 -3778 -8978 -28590 -38749
22807 -38749 -12925 2211 -16109 -32307 -50541 -51298 -34263 -21813 -3902 -8103 -17031 2005
22795 2005 10534 -4399 -5007 -3884 -1334 18700 16806 5971 -6976 -15766 -14736 -13987 -883 10604
22781 10604 28762 19522 23033 20114 13187 22253 21900 15998 3781 11490 43168 37396 17330 -7833
22767g833L723J5202K022j7568p619K4023M006j2926o760N641K0646n311p892
22754I354K272O164K6822j0209j9870p647J1408j7807j196j0418J9734j3460o03
22741e456p860k3801j9156J7003L773J2839J8604k190J197K3976P916q765J4590
22728C2670n72p13j0447M284j4962j2423Q96o856J1471J865m187l715O218j2228
22714h699k3253j6855J247K2590J4272j607J7199l986L330j7126j3230Q778L1858
22701A4518K8022j6630j1149j9810j8509q534j0206K794K421J6960J6416m122
22689g829q800m36K2086J1997J7874J4233K038j0699l5672j1168J828M161k4864
22676b5251j2821J4699K2999p732j660L736K1087N095j3458J2808l95Q637o57
$$ plain form
22767 -7833 -4110 11092 13114 -4454 -12073 11950 15956 3030 -3730 1911 22557 17246 9354
22754 9354 11626 17790 44612 34403 14533 6886 18294 487 -709 -11127 8607 -4853 -5456
22741 -5456 -13316 -37117 -56273 -39270 -35497 -22658 -4054 -6244 -5047 18929 26845 18080 32670
22728 32670 32098 31385 20938 25222 10260 -2163 -1267 -8123 3348 5213 1026 -2689 3529 -8699
22714 -8699 -31952 -48807 -47560 -24970 -10698 -12305 4894 908 4238 -12888 -26118 -17340 14518
22701 14518 42540 25910 14761 -5049 -23558 -32092 -42298 -39504 -37083 -20123 -3707 -7829
22689 -7829 -16629 -17065 5021 17018 34892 49125 51163 40464 4792 -6376 -4548 -387 -25251
22676 -25251 -38072 -23373 -374 -8106 -9766 -6030 15057 20152 6694 19502 19107 27744 27087
22663B7087M020N813J901j0392k6054j9515J7709J1631j9235j109K2196j4941
22651h89j2151j1312r67J9203K0486k0126J644j3437j025N916J0994J567L180
22638C083K529j2994l7898N374J3727N111j411j1815n838Q639J5358L6133k030
22625A7968P6o512r802q834J1058J1957l0326j5906o868l045L4443j338o860m194
22611a8183K2084M0272p424l0342j4184R509j6535L54J2938Q039K055j0665Q242
22598F160j1718o788J2780J0790j215j8612j522J6915J9940O542J4146o622l0560
22585A0236j0152K1935j36j6617k4366O401K5853J2654p960J8816j4940l0111
22573h387j6549J5840m23P875M184O686m777k314L663k6764m944K4160q819J3414
$$ plain form
22663 27087 31107 36920 38821 28429 2375 -17140 569 12200 -7035 -8144 14052 -889
22651 -889 -13040 -24352 -25319 -6116 14370 -5756 -4112 -17549 -18574 -12658 -1664 -97 3083
22638 3083 5612 -7382 -45280 -39906 -26179 -21068 -22479 -34294 -40132 -31493 -16135 19998 17968
22625 17968 18044 11532 1730 -7104 3954 15911 -14415 -30321 -37189 -40234 -5791 -7129 -13989 -18183
22611 -18183 3901 44173 36749 6407 -7777 1732 -14803 -14449 -1511 6528 8583 -2082 6160
22598 6160 -5558 -12346 434 11224 10009 -8603 -10125 6790 26730 33272 47418 40796 10236
22585 10236 84 22019 21883 5266 -19100 -12699 13154 25808 17848 36664 21724 -8387
22573 -8387 -24936 -9096 -9519 -1644 2540 9226 4449 2135 5798 -20966 -25910 -1750 -10569 2845
22559B845O212M223m4738K92P44J4754j4371p799k183L2458R390j6499r17j0796
22545b6385j1275J9323J8954q061O083M937j503J7016K1621P2j3914j8472l0532
22532b2136R383R689r718O82J2917O938j1030K195p772j7994Q39j894j0521J5600
22518b2822K3694M001n956j4777P357J0123l999J305J5344J0598q705q10R203
22505B4556j7082l3371o807O802K4101j4376N14N623k249O990J6146m78l226K1385
22491B8528p060j251J1350j0525k7400K006K7197K815m1826j8793J6210K3208
22479D459P608j4634N943q450m341n28M196j3070M29R76P33L710R836R75O847
22464D689J629k2935j9499J535J0692j70K5465j3438j4595J1206J0340J7105j141
$$ plain form
22559 2845 9057 13280 -31458 -31166 -30422 -15668 -30039 -37838 -40021 -7563 1827 -14672 -15589 -26385
22545 -26385 -37660 -18337 617 -7444 -1361 3576 2073 19089 40710 40782 26868 8396 -22136
22532 -22136 -12753 -3064 -12782 -12100 817 7755 -3275 -1080 -8852 -26846 -26007 -27901 -38422 -22822
22518 -22822 872 4873 -1083 -15860 -8503 1620 -2379 -1074 14270 24868 16163 15353 24556
22505 24556 7474 -25897 -32704 -25902 -1801 -16177 -15663 -10040 -12289 -5299 10847 10369 7143 28528
22491 28528 21468 20217 31567 21042 -6358 -4352 22845 25660 -16166 -34959 -18749 4459
22479 4459 12067 -2567 3376 -5074 -9415 -9943 -5747 -18817 -18388 -17412 -16679 -12969 -3133 -2158 4689
22464 4689 6318 -16617 -36116 -34581 -23889 -24059 1406 -12032 -26627 -15421 -5081 12024 10883
22451A0883k3210j7351k813J6303K9194J1759k9831k8561m246R488m861J7384
22439a5862L8966K423j599R027j3488M884k2559J4052J0527j1852r648k1533P560
22426i102L3986J1817q661k6262m917o778L180n67l19J1239p494p727P626N495
22412A516q070j0132m521J1800r241K1719J5672j4334q981J0031M467j9745j1105
22399b0924R348j5974Q069J1031O250R019m763j3510k4214j3669J0442L2431J6759
22386A0295L28P760q728k1059p977P404j0772m696J6992k2753j5903P087K4481
22373a7541P59N058m682P282J1843j107p626q310p086J8196J4193N502j7336q195
22359i050K5027J3083k8704j5129R111K1088j0955k4174k6007O447K7925K1692
$$ plain form
22451 10883 -12327 -29678 -32491 -16188 13006 24765 -5066 -33627 -37873 -28385 -33246 -15862
22439 -15862 23104 25527 23928 32955 19467 24351 1792 15844 26371 14519 4871 -16662 -9102
22426 -9102 24884 36701 28040 1778 -3139 -9917 -6737 -7304 -7623 3616 -3878 -11605 -3979 1516
22412 1516 -6554 -16686 -21207 -9407 -18648 3071 18743 4409 -4572 5459 9926 -9819 -20924
22399 -20924 -11576 -27550 -19481 -8450 -2200 6819 2056 -11454 -35668 -49337 -38895 -6464 10295
22386 10295 10623 18383 9655 -11404 -19381 -11977 -22749 -27445 -10453 -33206 -49109 -42022 -17541
22373 -17541 -16782 -11724 -16406 -9124 2719 1612 -6014 -14324 -21410 -3214 10979 16481 -855 -9050
22359 -9050 15977 29060 356 -14773 -5662 15426 4471 -19703 -45710 -39263 -11338 10354
22347A0354J4517O025k3568J3756M27j7448j3588J041J091q797Q045j0792L3603
22334A4666J2224k0382O073M444P661P476j9691r290j9592j733n978J7327q905
22321a5700m799M985J5207J8161j0112j7111O037j684r976m5857k424K9734J8122
22308a5417J7146k5825k889P575J0143J5857M503L156k949K6215n104m528j3104
22295A4779n057N621m228Q499J1640j2754l766O245m1869k0952K7520K3742Q624
22282A8044k2493j0385K7763j2387k1578O447p276q95N93J4119Q958J5591O561
22269B3062J163P574J4070q738p028j6935k53n465j3823j8072p992J1515j1336
22256c2258n042L3712q08J2100K8803p767k6997J2865r366m9880k950K4085O683
$$ plain form
22347 10354 24871 30896 7328 21084 21511 4063 -9525 -8484 -7393 -16190 -8145 -18937 14666
22334 14666 26890 6508 12581 17025 24686 32162 12471 3181 -16411 -18144 -24122 -6795 -15700
22321 -15700 -20499 -15514 -307 17854 7742 -9369 -3332 -5016 -14992 -60849 -63273 -33539 -15417
22308 -15417 1729 -24096 -26985 -19410 -9267 6590 11093 14249 11300 37515 32411 27883 14779
22295 14779 9722 15343 11115 19614 31254 18500 14734 20979 -20890 -41842 -14322 9420 18044
22282 18044 -4449 -14834 12929 542 -21036 -14589 -21865 -22760 -22167 -8048 910 16501 23062
22269 23062 24225 31799 45869 37131 30103 13168 12915 7450 -6373 -24445 -32437 -20922 -32258
22256 -32258 -37300 -3588 -4396 7704 36507 28740 1743 14608 5242 -44638 -47588 -23503 -16820
22243a6820m515k710M5628M5110q911k5075j8585n471J2460k0772l5518j8368
22231e3547k205J4653K6845k464P116K4993J037N159Q348o48l165j6516k2813
22218a3207j3699O215o201K5078R111n314r188P416k349L427n431m547K7051k4464
22204f102k9610J8273m002K5409j7658j4336Q452L1621l93j3545l944j1829J2619
22191e045K3286j5876j3347J0408p223J6844n321R427K3493J450k0504l2095K0262
22178E759J1493O077q372K548l827N273k0466k969J5627J2944j12J517Q767N65
22164C4824j0327j0673K903k5245M581L2817K110j0104J12O387k4847m741K562
22151C59Q766n201j0070M49r055k963m291O803J8659O958J3694n289k469l2994
$$ plain form
22243 -16820 -21335 -24045 21583 66693 57782 32707 14122 8651 21111 339 -35179 -53547
22231 -53547 -55752 -41099 -14254 -16718 -9602 15391 16428 21587 29935 29287 26122 9606 -13207
22218 -13207 -26906 -20691 -26892 -1814 7297 1983 -7205 211 -2138 1289 -4142 -8689 18362 -6102
22204 -6102 -35712 -17439 -21441 3968 -13690 -28026 -19574 12047 11654 -1891 -5835 -17664 -5045
22191 -5045 18241 2365 -10982 -574 -7797 9047 3726 13153 36646 38096 17592 -14503 5759
22178 5759 17252 23329 14957 17505 13678 18951 -1515 -4484 11143 24087 23975 25492 34259 34824
22164 34824 24497 13824 16727 -8518 -3937 28880 30990 20886 20998 27385 2538 -2203 359
22151 359 9125 3924 -6146 -5697 -14752 -17715 -22006 -15203 3456 10414 24108 18819 16350 -16644
22137a6644l0141j2102J5603L047K7691K5810o204L018j1235j7111r584J2292
22125a5560o668M516j7710m061O487J2621P703j9517Q31K1587k294J3385Q483
22112I803j4812k5342k9040K2135Q968o7N271J7513m888k0313J0204P155j2674
22099b6087j7877o665J9654Q974m909J600j8266J7918N142j2142k917l870j8097
22086e7542j2433J1356j2827J3261L429m724K5454P916K789o438L022K674l538
22073b7601R409M2262k3496O213n01k8778K579J0610j4187K050R8J7860Q211M68
22059E197K267o560k5824j5452j928J1394o397L962P322O805J1153J1870l706
22046A03J5742N462m633m7746j1939J3279l875l3937K04K9780L1681J9550O956
$$ plain form
22137 -16644 -46785 -58887 -43284 -40237 -12546 13264 7060 10078 -1157 -18268 -27852 -15560
22125 -15560 -22228 -17712 -35422 -39483 -32996 -20375 -12672 -32189 -31358 -9771 -12065 1320 9803
22112 9803 -5009 -30351 -59391 -37256 -28288 -28355 -23084 -5571 -10459 -30772 -20568 -13413 -26087
22099 -26087 -43964 -50629 -30975 -22001 -26910 -25310 -43576 -25658 -20516 -32658 -35575 -39445 -57542
22086 -57542 -69975 -58619 -71446 -58185 -54756 -59480 -34026 -26110 -23321 -29759 -26737 -24063 -27601
22073 -27601 -18192 24070 574 6787 6286 -22492 -19913 -9303 -23490 -21440 -21342 -3482 4729 5197
22059 5197 7464 904 -24920 -40372 -42300 -30906 -37303 -33341 -26019 -19214 -8061 3809 103
22046 103 15845 21307 16674 -31072 -43011 -29732 -33607 -67544 -67340 -37560 -5879 13671 20627
22033B0627J896L817R697Q263r435k998J3386k751l1214j1499K566K53k0906N869
22019a2429j2832J2151J9306O569j3168n957o900k0744o306K0393K0507m882K165
22006b127J1075j0211j5195R137L409J7949k749m690k5599j4462M903R456j709
21993b0813l418J8737o436j6227K0508L8444j892n80j346n187j8828k3565j7153
21980c7756J6122j4624r757O907j1999P330J0426J0742p888N419K7385j2334m3821
21967e3848N485K6297J6072O701O326L731p121j0731n828Q681r076J8271n976
21954a016j1403J391j2330j3389J3642J1732J0917j2550P362Q855n241R301M795
21941A2066m736j1925j3473J0396K1928o533k2704M02J5454P247j856j2101J6879
$$ plain form
22033 20627 22523 26340 36037 44300 34865 31867 45253 42502 11288 -211 2355 2608 -18298 -12429
22019 -12429 -25261 -13110 6196 12765 -403 -6360 -13260 -34004 -40310 -19917 590 -4292 -2127
22006 -2127 8948 -1263 -16458 -7321 -3912 14037 11288 6598 -19001 -33463 -28560 -19104 -20813
21993 -20813 -24231 -5494 -11930 -28157 -7649 30795 28903 28323 26977 21790 2962 -20603 -37756
21980 -37756 -21634 -36258 -46015 -39108 -51107 -43777 -33351 -22609 -30497 -25078 2307 -10027 -53848
21967 -53848 -48363 -22066 -5994 707 7033 10764 3643 -7088 -12916 -4235 -13311 4960 -1016
21954 -1016 -12419 -11028 -23358 -36747 -23105 -11373 -456 -13006 -5644 3211 -2030 7271 12066
21941 12066 7330 -4595 -18068 -7672 14256 7723 -14981 -14579 875 8122 6266 -5835 11044
21928A1044j215L311J8041J6255j376l0128j6058K0016j6543j3458j9646J723
21916b8034R544q861J102K0585K0062M141l8j9675j3878j2939K0930L1499j0999
21903A3439k1886l254O726M187j0541m958j9034N627q863m46L3159N517r020J5622
21889F275K0151j0972k2800j6096j3228J4839L8345N493J4169j6929j9654k0402
21877b0809M753J551n293j4646l333J2528K3162r777R293J0207K4563r941j8490
21864C768k860j2565j3250l298Q198n362o798L38J0529k0673L387p626J2206J1448
21850b2558j1906o407o705Q689J3168M458q01K4661L0747l993k3938p785r51q431
21836a1752j5086k426Q375J1991L0447q893l7996J1014J7364m447J7580l575j470
$$ plain form
21928 11044 9829 13140 31181 47436 46060 15932 -126 19890 3347 -10111 -29757 -28034
21916 -28034 -18490 -27351 -26249 -5664 14398 18539 18501 -1174 -15052 -27991 -7061 24438 13439
21903 13439 -8447 -11701 -4975 -788 -11329 -16287 -35321 -29694 -38557 -39003 -5844 -327 -9347 6275
21889 6275 26426 15454 -7346 -23442 -36670 -21831 16514 22007 36176 19247 -407 -20809
21877 -20809 -16056 -14505 -19798 -34444 -37777 -25249 -2087 -11864 -2571 7636 32199 22258 3768
21864 3768 908 -11657 -24907 -28205 -20007 -25369 -32167 -31829 -21300 -41973 -38586 -46212 -34006 -22558
21850 -22558 -34464 -40871 -47576 -38887 -25719 -21261 -22062 2599 33346 29353 5415 -2370 -3321 -11752
21836 -11752 -26838 -29264 -20889 -8898 21549 12656 -25340 -14326 3038 -1409 16171 12596 11126
21823A1126J59M56m413l6582j8819M355P906J1948K1407j3681j635j4264K861
21810b9176K062O420N538J1965r416R44j1298k050P402J2934j2683o016L2516
21797I142k668j0344j627o662n558J2118l31k6595j6613J9017J6857Q691k679
21784g252K36J9906J018o832q047K3871n853j2546K119J4699j6759l237J9389
21771B0712n472r392p816j5913p078J124O24K4551K6404Q625j731j179N761j857
21757C7363l3282j4147L2475Q680k1649q09L868k2133m821K667K2280j2327J0726
21744H891l687j0236k1626j0797J6118J0480p403J4424K633j4271q270j881K3971
21731a654O774k0123j3780L942P892j128R539K9563k6848k2172J6157J0489N730
$$ plain form
21823 11126 11285 11741 7328 -29254 -48073 -43718 -35812 -23864 -2457 -16138 -17773 -32037 -29176
21810 -29176 -27114 -20694 -15156 -3191 -12607 -11663 -22961 -25011 -17609 -4675 -17358 -23374 9142
21797 9142 6474 -3870 -5497 -12159 -17717 -5599 -5930 -32525 -49138 -30121 -13264 -4573 -7252
21784 -7252 -7016 12890 13908 7076 -971 22900 17047 4501 6620 21319 4560 1323 20712
21771 20712 15240 5848 -1968 -17881 -24959 -23835 -23211 1340 27744 36369 34638 33459 39220 37363
21757 37363 4081 -10066 22409 31089 9440 8631 12499 -9634 -14455 -11788 10492 -1835 8891
21744 8891 5204 -5032 -26658 -37455 -21337 -10857 -18260 -3836 -1203 -15474 -23744 -25625 -1654
21731 -1654 5120 -15003 -28783 -24841 -16949 -18077 -8538 21025 -5823 -27995 -11838 -1349 4381
21718D381n439l378Q103K5036p830j0622k8979M509M3472K4364k3803k0280l1688
21705b2154k9566J7580j322j3334N762J5274J7289K3928J2363j6109j0466r040
21693i795p320j7928j2635K7760J9676J3398j5220P604j2097j1061L3160J8960
21681C4502j0180r539j1455l1134N509K9027J7926j8932l1844p759J770R679J64
21668b2266p53R487K310K1074J8923m504j1813k218m057k477n654k7162k774K1512
21654a0372L229j8563J8135J0362K1770J7289j1443k4548j0028K3444q421j9033
21642h179l1483n81J4573L513p201M187L0974K446K869K175k2565k0142J0558
21629a8856J9946M33n175j6711J2838J8166r020L602j1881R369k958J4363J0620
$$ plain form
21718 4381 -1058 -4436 3667 28703 20873 10251 -18728 -14219 29253 53617 29814 9534 -22154
21705 -22154 -51720 -34140 -35462 -48796 -43034 -27760 -10471 13457 25820 9711 -755 -9795
21693 -9795 -17115 -35043 -47678 -19918 -242 13156 -2064 5540 -6557 -17618 15542 34502
21681 34502 24322 14783 3328 -27806 -22297 6730 24656 5724 -26120 -33879 -32109 -22430 -22266
21668 -22266 -23019 -13532 -11222 9852 28775 24271 12458 10240 6183 3706 -1948 -29110 -31884 -10372
21654 -10372 -7143 -25706 -7571 2791 24561 41850 30407 5859 -4169 19275 10854 -8179
21642 -8179 -39662 -40243 -25670 -22157 -29358 -25171 5803 8249 11118 13293 -9272 -29414 -18856
21629 -18856 1090 1523 -3652 -20363 -7525 10641 1621 5223 -6658 2711 -247 14116 24736
21616B4736j3939r446l7607k6776J8424M673J200J5201J3401k4164J6954K2324
21604D981j4017l785r244l321M964K7481K0142L971m893k0098k6741j6011N857
21591c0714n025k45J3806R331O381l158M604L209k326J2911k1150L983k021n93
21577a1007k038o241n163N07K6309K5889k2150r252j8918j0709R17J0455j2524
21564c3925p569m457r776J1471L3543J5506l687k2170p631j0105L428J901J6208
21551a7263J6373j085k7747J2455J7363n166L778O277l1164O619K5351K1781j0906
21538A6666l7547L574L4595J4627m342j3692k4783K0229O226k6006p937J4165
21526d225m289J6725j8369k1941J9244N840j2279q725j190J045p803J049J7100
$$ plain form
21616 24736 10797 1351 -36256 -63032 -44608 -39935 -38735 -23534 -10133 -34297 -17343 4981
21604 4981 -9036 -12821 -22065 -25386 -20422 7059 27201 31172 26279 6181 -20560 -36571 -30714
21591 -30714 -35739 -35984 -22178 -12847 -6466 -9624 -5020 -1811 -4137 8774 -12376 -8393 -10414 -11007
21577 -11007 -13045 -19286 -24449 -23942 2367 28256 6106 -3146 -22064 -32773 -31856 -21401 -33925
21564 -33925 -41494 -45951 -55727 -44256 -10713 4793 1106 -21064 -28695 -38800 -35372 -33471 -17263
21551 -17263 -890 -1975 -29722 -17267 96 -5070 -1292 4985 -26179 -19560 5791 27572 16666
21538 16666 -20881 -17307 17288 31915 27573 13881 -10902 9327 15553 -10453 -18390 -4225
21526 -4225 -8514 8211 -10158 -32099 -12855 -7015 -19294 -28019 -29209 -28164 -35967 -34918 -17818
21513a7818N917o41K0613Q001J7755J5362j4405J1289j6161k4786l4718l3599
21501f3191R842J8124L5616J5455k4314R02j6363k2286k721M239J6895P174J5773
21488d855n060r174j4161j4389J7319Q85N381M682L848p677J5126O928J0686J0108
21474A9647p045k1298r359R552J2714O022j6056J9880K450l5099j6597J3402K4744
21461B957j2603k0721j990J8394n40J9173R130J2463P521k0358k738J2350j4576
21448H462j5265j6967l955L8133J952j2855k6121J3820K8735J2166j2265k2483
21436f643n109L3793Q872j1543j0877j5830j0952j560N361m943J851J2510j753
21423f823K480L916J847J5233K4245q401k2743q212L190o543l71J542K2704m391
$$ plain form
21513 -17818 -11901 -12542 8071 16072 33827 49189 34784 46073 29912 5126 -29592 -63191
21501 -63191 -53349 -35225 391 15846 -8468 -7566 -23929 -46215 -48936 -44697 -27802 -20628 -4855
21488 -4855 -9915 -19089 -33250 -47639 -30320 -29435 -24054 -19372 -15524 -23201 -8075 -1147 9539 19647
21474 19647 12602 -8696 -18055 -8503 4211 10233 -5823 14057 16507 -18592 -35189 -21787 2957
21461 2957 -9646 -30367 -32357 -13963 -14503 4670 13800 26263 33784 13426 10688 23038 8462
21448 8462 -6803 -23770 -27725 10408 12360 -495 -26616 -12796 15939 28105 15840 -6643
21436 -6643 -11752 22041 30913 19370 8493 -7337 -18289 -19849 -14488 -19431 -17580 -5070 -6823
21423 -6823 -4343 -427 1420 16653 40898 32497 9754 1542 4732 -1811 -2182 -640 22064 17673
21409A7673j8924N258k4092J7610L0743O275o065k0040m758P803P548J3371j3274
21396A9128j6579m0016j8619L902Q736J4377o596R05J5370K58O862O512j3400
21383a9160j7956R698j0767K289J5528J6273L2598k759j7069k9809L591J5065
21371b478O12j0929j2822J2488J061p093p430J8974J6164J9118j3828j5746K34
21358a675j1570J0093J9802r756K898O866j6601J3778K0114J0832j7819k7047
21346h5k918j4367R09O812k0120N224q451r316L4993o962k8373l402L3628P674
21332d754j479R248O031k2838l1519j2450L2600Q315j3947J2696P108P797m59
21319c651j068J5391j461O801k3222j6657j5076J7547K9503j3934j3898M643j1077
$$ plain form
21409 17673 -1251 4007 -20085 -2475 28268 34543 28478 8438 3680 11483 19031 32402 19128
21396 19128 2549 -37467 -56086 -52184 -43448 -29071 -35667 -34762 -19392 -19134 -12272 -5760 -19160
21383 -19160 -37116 -27418 -38185 -35896 -20368 -4095 28503 25744 8675 -21134 -17543 -2478
21371 -2478 -1866 -12795 -25617 -13129 -12068 -19161 -26591 -7617 8547 27665 13837 -1909 -1675
21358 -1675 -13245 -3152 16650 6894 9792 16658 57 13835 33949 44781 26962 -85
21346 -85 -3003 -17370 -16461 -9649 -29769 -24545 -32996 -42312 -7319 -14281 -42654 -46056 -12428 -4754
21332 -4754 -6233 3015 9046 -13792 -45311 -57761 -25161 -16846 -30793 -18097 -10989 -3192 -3651
21319 -3651 -4719 10672 9211 16012 -7210 -23867 -38943 -21396 8107 -5827 -19725 -15082 -26159
21306b6159k2597J3726J4328q608L3221r55j8516J4769n42J155j3197l940J2122
21293e193L633p836L003P109j3249J1002n171j0806j949P637m120k3243j0623
21280d9806L1462K7845J969l809k7189o583J0654K4019J4306j4762j5267p001
21268a4162P596l162J938k0091j5006m188R548J4278O416R304M411K722j1511
21255a1907K0244k6903k458O225j4610o082J0506Q719p746o508O012M908J2889
21242f711j6826o871N321J3559N546j8914j064j2712j7386M535L040J498j4623
21229f1608K7017K8100p173l119q987J7079K8746j1217q532R088o272k351j2237
21216a1466j7519K722O296p303N079j8169K0616K3282M295k4347p643K9302R386
$$ plain form
21306 -26159 -48756 -35030 -20702 -29310 3911 2956 -15560 -791 -1333 -178 -13375 -17315 -5193
21293 -5193 -1560 -9396 -6393 716 -12533 -1531 -6702 -17508 -19457 -11820 -15940 -39183 -49806
21280 -49806 -18344 9501 11470 7661 -19528 -26111 -15457 8562 22868 8106 -7161 -14162
21268 -14162 -6566 -9728 -7790 -27881 -42887 -47075 -37527 -23249 -16833 -7529 -3118 -396 -11907
21255 -11907 8337 -18566 -21024 -14799 -29409 -35491 -24985 -16266 -24012 -30520 -24508 -19600 -6711
21242 -6711 -23537 -30408 -25087 -11528 -5982 -24896 -25960 -38672 -56058 -51523 -48483 -46985 -61608
21229 -61608 -34591 -6491 -13664 -16783 -25770 -8691 20055 8838 306 9394 3122 771 -11466
21216 -11466 -28985 -26263 -19967 -27270 -22191 -40360 -19744 3538 7833 -16514 -24157 5145 14531
21203A4531j7100o043J493j2647k2114M613R837J7991J0496m718J9482N870k2397
21190g06j8492J1352K3624k515j7377j7302r294j5197Q537J7667J4327R022J0530
21177A4176j0624l855J9673l493j8435j0556L839P167K22O453O009q297q008l811
21163i540j9647N658j7614K4279L2533K073J1307m064k5268L38K1951M129j2160
21150A3975O402O431n94j5061k9793j6533j0353k050L1919N117k2455K0164j6092
21137b8923j2331J4901k13R810J8479q804k227O127n357K3223k0710P957J0327
21124A2259M539k861j9389q014j05K998Q769J9008K532j1590k1541p445N459K596
21110a2785J1190k474l6118l612l432k0343J5268K3640N120O22M2799j2675k0452
$$ plain form
21203 14531 -2569 -8612 -7119 -19766 -41880 -37267 -27430 -9439 1057 -3661 15821 21691 -706
21190 -706 -19198 -7846 15778 13263 -4114 -21416 -30710 -45907 -37370 -19703 -5376 3646 14176
21177 14176 3552 -303 19370 15877 -2558 -13114 -9275 -2108 -1886 4567 10576 2279 -5729 -9540
21163 -9540 -29187 -23529 -41143 -16864 15669 17742 29049 24985 -283 55 22006 26135 13975
21150 13975 20377 26808 26214 11153 -18640 -35173 -45526 -47576 -15657 -10540 -32995 -12831 -28923
21137 -28923 -41254 -26353 -26566 -16756 1723 -7081 -9308 -3181 -8538 14685 -6025 1932 12259
21124 12259 16798 13937 -5452 -13466 -13571 -10573 -1804 17204 19736 8146 -13395 -20840 -15381 -12785
21110 -12785 -1595 -4069 -40187 -43799 -47231 -67574 -52306 -28666 -23546 -22924 19875 7200 -13252
21097a3252j0439o38P704L526P628o209r094j2748p316p030L52m077K0813Q59
21083b9921j4088R239o430o932K0018L4723o595j5222j0379r898J1792m483K559
21070b5617L5125J0255j2644n426n115k981k5872j6561N047K5787P770o787O941
21057a0078n291m537J6378L91L1274o690j8306J3943L029n124m34n533N707j0198
21043D531J9247J460j2703J7763r25j6654P113P009O98o277l760j0684k9508o945
21029b9635Q043P448L186J8389k8887j7085P746K979J7005K325p318p606n613
21016b9023J8524N614M908J624r246l07o573l830K1008J0539j919m460J835j5286
21002f592j3917j0191J0528L832j5066N185J4218K45K5672L369k1036l3688k959
$$ plain form
21097 -13252 -23691 -24329 -16625 -13099 -5471 -11680 -20774 -33522 -40838 -47868 -47516 -51593 -30780 -29921
21083 -29921 -44009 -34770 -41200 -48132 -28114 6609 14 -15208 -25587 -35485 -23693 -28176 -25617
21070 -25617 9508 19763 7119 1693 -3422 -6403 -32275 -48836 -43789 -18002 -10232 -17019 -10078
21057 -10078 -15369 -19906 -3528 -3137 28137 21447 3141 17084 20113 14989 14555 9022 14729 4531
21043 4531 23778 25238 12535 30298 29373 12719 19832 26841 27539 21262 17502 6818 -22690 -29635
21029 -29635 -21592 -14144 -10958 7431 -21456 -38541 -30795 -27816 -10811 -8486 -15804 -23410 -29023
21016 -29023 -10499 -4885 23 1647 -7599 -7906 -14479 -18309 2699 13238 11319 6859 8694 -6592
21002 -6592 -20509 -30700 -20172 -16340 -31406 -26221 -12003 -11758 13914 17283 -3753 -37441 -40400
20989d0400M052j7455M750J4500O821J1993J9928K738J7820R400k2286m357n277
20976B227p054R143j4490J995l001k2034j0848O383K7090p434n559j4097n629
20963d3308P489L2630L5559k2153k0589m924J8430P068N91J3208N769j2405k2258
20950d893j8564J2839L0161p894k6326n502R588k871K357j7791k847o294J478
20937c6559J4384o086l331J0700R828p99J0745q624p957j6942j0084M267J3808
20924b6650J7088q959j7006J3495J0539J8465L580m306o416l304j937l172j4984
20911b3567j8334k3808K6223n977n35M248J4679j022L791j564J5263P296q232
20898a1539l231O917J6802j9218j9224o765k152K2517L0701m753j5570j0958p789
$$ plain form
20989 -40400 -36348 -53803 -49053 -34553 -27732 -15739 4189 6927 24747 34147 11861 7504 2227
20976 2227 -4827 4316 -10174 -8179 -11180 -33214 -44062 -37679 -10589 -18023 -23582 -37679 -43308
20963 -43308 -35819 -3189 32370 10217 -10372 -15296 3134 10202 10793 24001 29770 17365 -4893
20950 -4893 -23457 -10618 19543 11649 -14677 -20179 -10591 -13462 -11105 -28896 -31743 -38037 -36559
20937 -36559 -22175 -28261 -31592 -20892 -11064 -11863 -1118 -9742 -17699 -34641 -44725 -40458 -26650
20924 -26650 -9562 -18521 -35527 -22032 -11493 6972 10552 6246 -170 -3474 -5411 -8583 -23567
20911 -23567 -41901 -65709 -39486 -45463 -45998 -41750 -27071 -28093 -24302 -25866 -10603 -3307 -11539
20898 -11539 -14770 -7853 8949 -10269 -29493 -36258 -38410 -15893 14808 10055 -5515 -16473 -24262
20885b4262J7961J6073K446p104L28l3133r631Q758O207K1537j688K3224m82k9415
20871i181j4903J6322J2727k86n393k4545r317l415K6528O193j6250j0042K2423
20858i139N670j5517r15o490P28P747L2898N287k6318j6621L402K6632J8536j4260
20844A1640n440j169J5744j4844j5272N896m473r86J1629j7257j7417p793r436
20831d9178R428K8406J4028N510j3912j5792r397J1090K2276Q175R598j2074j1096
20818b938j5770j3235j4263J0457R636L863M074J0473p115L464k1327J2837K1178
20805A334O393j3668k6624O415P575J7121J7455M523j5358Q724n786Q62m815j3929
20791i778J1599J1823J5826J0080k1648k2875N085k399J6198n364j6505J215Q411
$$ plain form
20885 -24262 -6301 9772 12218 5114 5442 -27691 -37322 -28564 -22357 -820 -2508 20716 20234 -9181
20871 -9181 -24084 -7762 4965 4679 -714 -25259 -34576 -37991 -11463 -5270 -21520 -31562 -9139
20858 -9139 -3469 -18986 -19901 -26391 -25663 -17916 14982 20269 -6049 -22670 -19268 7364 25900 11640
20844 11640 6200 5031 20775 5931 -9341 -3445 -7918 -8904 2725 -14532 -31949 -39742 -49178
20831 -49178 -39750 -11344 2684 8194 -5718 -21510 -30907 -19817 2459 10634 20232 8158 -2938
20818 -2938 -18708 -31943 -46206 -35749 -26113 -22250 -18176 -7703 -14818 -11354 -32681 -19844 1334
20805 1334 7727 -5941 -32565 -26150 -18575 -1454 16001 20524 5166 13890 8104 8966 4151 -9778
20791 -9778 1821 13644 29470 39550 17902 -4973 112 -2287 13911 8547 -7958 -6743 1668
20778A668r053J3808q151k4993K808r918K678p965j0984J7373J727P561n468o378
20764c5287K4253P04j4781K448J1001L640P729J4937Q571n201O42j4028j8691
20751a4063N450j377j4421k0795J6872M98L844J5672K904J1418J7318p735j6382
20738g97j5620J6641l600j2335k073M01o927J0521K7376l285m014m045p617P753
20724B379m004N081K5467j4442k9800k8735J442R47J087O187L4908M342l8623
20711c3764O073J9876K1066l898o927j9891k7250k3943L0115J5623R2J4855K8752
20698B0779N627j1476k8667K637J8878O904R625j0835k744J7420j3649j3337j977
20685h15R548Q413j2941j3980r578J7840m744j218J0086j0589j68J9124l201J8098
$$ plain form
20778 1668 -7385 6423 -1728 -26721 -23913 -33831 -31153 -39118 -50102 -32729 -31002 -23441 -28909 -35287
20764 -35287 -11034 -10330 -25111 -22663 -11662 -8022 -293 14644 23215 18014 18656 4628 -14063
20751 -14063 -8613 -9990 -24411 -45206 -28334 -27836 -23992 -8320 -5416 6002 23320 15585 -797
20738 -797 -16417 224 -3376 -15711 -17784 -17383 -24310 -13789 13587 10302 6288 2243 -5374 2379
20724 2379 -1625 3456 28923 14481 -15319 -44054 -42612 -41665 -40578 -34391 517 4859 -33764
20711 -33764 -27691 -7815 13251 9353 2426 -17465 -44715 -68658 -38543 -22920 -22828 -7973 20779
20698 20779 26406 14930 -13737 -11100 7778 14682 24307 13472 10728 28148 14499 1162 -815
20685 -815 8733 17146 4205 -9775 -19353 -1513 -6257 -7475 2611 -7978 -8146 10978 7777 25875
20671B5875L958m862q886L096k013k0463k7479K1133J1114L999p646J3088n975
20658D939k2882k585R693J896Q62J0771L666k1320Q93K4292j5072l8560k381M614
20644d1174P039O315l328r408l834J3841J1473k722J4656J9731k3715K176J406
20631g544J3341j8616J437j8590j5009j059L922K8715K0316l408q770j0886J9427
20618C276K434j3449Q454K9268j057n0916j652K5670K632L947R382q563k0718
20605a1292j9109j593J8773L384N730J3526J3691L583R466O162k3317k9841l2462
20592d3299O682k401n722J7127J3451n280l4006l27L7674j4245N26n634J91O925
20578b8338M639R957J3378R132l686j3434m883m566O619r891k549o41M513J3791
$$ plain form
20671 25875 29833 24971 16085 19181 17168 -3295 -30774 -9641 1473 5472 -2174 10914 4939
20658 4939 -17943 -20528 -10835 -8939 -8077 2694 6360 -14960 -14067 10225 -4847 -43407 -45788 -41174
20644 -41174 -34135 -27820 -31148 -40556 -44390 -30549 -19076 -21798 -7142 12589 -11126 -8950 -7544
20631 -7544 5797 -12819 -11382 -29972 -44981 -46040 -42118 -13403 6913 3505 -5265 -16151 3276
20618 3276 5710 -7739 715 29983 28926 -21990 -23642 2028 4660 8607 17989 9426 -11292
20605 -11292 -30401 -31994 -13221 -9837 -4107 9419 23110 26693 36159 42321 19004 -10837 -43299
20592 -43299 -36617 -39018 -44740 -27613 -14162 -19442 -53448 -53775 -16101 -30346 -29820 -35454 -35263 -28338
20578 -28338 -23699 -13742 -364 8768 5082 -8352 -13235 -17801 -11182 -21073 -23622 -24263 -19750 -5959
20564e959k867j1279N151p350J2993J8837R567k5037j1436P315m320q976J4954
20551h407J145j442J8915J1199J4461K412j7444k8948j685N739Q717k4504j1042
20538c0884J4955R049j749l270K69K627m668p283J1717M826n787K883O17J706
20524d992Q556j1524j0000k5140j5812r271n068K0037J1848j0645N261J5878K584
20511b8288K0716K0029J2284L761k8168j0950p175m705J3149n114n793J2356R73
20498f925O294J6954P146j2388k822j2196m496K456J5130k1658J2885J8339r492
20485I227l0696N376K2743Q151j7648o771l0857j3387m678M4006K4774O885q430
20472H695K21L292j5314l2563J091J2214j406K618p856J506J0812P796j2164P703
$$ plain form
20564 -5959 -8826 -20105 -14954 -22304 -9311 9526 19093 -5944 -17380 -10065 -14385 -23361 -8407
20551 -8407 -7262 -8704 10211 21410 35871 38283 20839 -8109 -9794 -4055 4662 -19842 -30884
20538 -30884 -15929 -6880 -8629 -11899 -11630 -9003 -13671 -20954 -9237 -4411 -10198 -7315 -6698 -4992
20524 -4992 3564 -7960 -17960 -43100 -58912 -68183 -73251 -53214 -41366 -52011 -46750 -30872 -28288
20511 -28288 -7572 12457 24741 28502 334 -10616 -17791 -22496 -9347 -14461 -20254 -7898 -6925
20498 -6925 -631 16323 23469 11081 8259 -3937 -8433 -5977 9153 -12505 380 18719 9227
20485 9227 -21469 -16093 6650 14801 -2847 -9618 -40475 -53862 -58540 -14534 10240 17125 8695
20472 8695 8916 12208 -3106 -35669 -34578 -22364 -23770 -21152 -29008 -27502 -16690 -8894 -21058 -13355
20458a3355M616J832J1216J5933q787k2462n009k0555J5168K7141J5452O311Q759
20445C6260k8434l6655j2674K1382K1482k3130q685K3504m353j2200M96J496J6076
20432e435N462O030K375M46K769q413k940j826L448J0031J4855k5436j1072p289
20418a6995J512L4925N33j2453m233q673J8306K3585m895k5019n746j3845j5759
20405b8757r928n267J3965L3406K4727j1078j4608j6971p017K7140L1456J0909
20393D7977k9816j3227j5492k856O659j5223j2824J0192j2389J8259N833Q41J6472
20380D406K1523J9302N03j2935j7849n179k0562k633k0862j6578J8088J9298J0919
20367b559k246j3614k2324J5194J4299Q652K4018m191l4335L006R807j2547J549
$$ plain form
20458 -13355 -8739 -6907 4309 20242 11455 -11007 -16016 -36571 -21403 5738 21190 27501 36260
20445 36260 7826 -28829 -41503 -20121 1361 -21769 -30454 -6950 -11303 -23503 -23007 -21511 -5435
20432 -5435 27 6057 8432 8878 11647 3234 294 -1532 1916 11947 26802 1366 -9706 -16995
20418 -16995 -15483 19442 19975 7522 3289 -5384 12922 36507 31612 6593 847 -12998 -28757
20405 -28757 -38685 -43952 -29987 3419 28146 17068 2460 -14511 -21528 5612 37068 47977
20393 47977 18161 4934 -10558 -13414 -6755 -21978 -34802 -24610 -36999 -18740 -12907 -12066 4406
20380 4406 25929 45231 45734 32799 14950 9771 -10791 -13424 -34286 -50864 -32776 -13478 -2559
20367 -2559 -4805 -18419 -40743 -25549 -11250 -2598 21420 17229 -17106 -14100 -4293 -16840 -15291
20354a5291J3589r606j5762J731N285J6820o800J2490K2438j5277j9643Q437M181
20341B592o09k8192j4718Q003M61L615O46K680J0639J5355j0750J039O728M541
20327B030J6591k3499o452J2417l584j2121k0611M281j094l40o283r55Q830N570
20313b5220n498N955J443J4801o316k1320p15L930J053J1278J695L813R007j3171
20299a9265q494k65n618J5473J820J9460J8211l1928l3633l0460l602K590K1767
20286e3944K2887K7890J1366k1619r375p334M737J5698M65R04J4737n502K8425
20273B9335J3898n365k9560j4924J2919M628k7026p58k039k8564p572M281Q920
20260d1827J1232L996l785r16j3809K627K4209R590L168J2505p329J0580M798
$$ plain form
20354 -15291 -1702 -11308 -27070 -25339 -20054 -3234 -10034 2456 24894 9617 -10026 -1589 2592
20341 2592 1983 -26209 -40927 -32924 -32463 -28848 -28202 -25522 -14883 472 -10278 -9239 -2511 2030
20327 2030 18621 -4878 -11330 1087 -2497 -14618 -35229 -30948 -32042 -32382 -38665 -39620 -30790 -25220
20313 -25220 -30718 -24763 -23320 -8519 -14835 -36155 -36870 -32940 -31887 -20609 -18914 -15101 -6094 -19265
20299 -19265 -27759 -28024 -33642 -18169 -16349 3111 21322 -10606 -44239 -74699 -78301 -75711 -53944
20286 -53944 -31057 -3167 8199 -13420 -22795 -30129 -25392 -9694 -9229 -8325 6412 910 29335
20273 29335 43233 37868 8308 -6616 6303 10931 -16095 -16853 -18892 -47456 -55028 -50747 -41827
20260 -41827 -30595 -26599 -30384 -31300 -45109 -42482 -18273 -8683 -5515 6990 -339 10241 15039
20247A5039n748L732K1965o762l8720k8974N440J7198J5903L645j9153M110j4564
20234b6889J4586J4568R110k4383l8855M972K8062J9020o741m440m754J161j0877
20221b5460M641k340O965P264j0121k3434J3967K1670j8000k5232P790K0268m591
20208b6613O187r334q056L4766K5251J1528k9246o183R745j6312j1559r125J3485
20195a5466n029m538K3318J1720J659j4234q694K0294J1495k0863j2591n11k5069
20182c8509n644K635K7284j492j9892K1460J8046Q94k4045m2695j0510K4566M096
20169d3806k127O283k27J1540j0284K6032J777q548p101j8148M34J3493J6674
20156a4008k9141J2623L7068O890l3085R297J0737k4875j8120n012L69o352K8842
$$ plain form
20247 15039 9291 13023 34988 28226 -10494 -39468 -34028 -16830 -927 2718 -16435 -12325 -26889
20234 -26889 -12303 2265 11375 -13008 -51863 -46891 -18829 191 -6550 -10990 -15744 -14583 -25460
20221 -25460 -20819 -23159 -16194 -8930 -19051 -42485 -28518 -6848 -24848 -50080 -42290 -22022 -26613
20208 -26613 -20426 -29760 -37816 -3050 22201 33729 4483 -1700 8045 -8267 -19826 -28951 -15466
20195 -15466 -20495 -25033 -1715 10005 11664 -2570 -11264 9030 20525 -338 -12929 -13440 -38509
20182 -38509 -44153 -41518 -14234 -15726 -35618 -14158 3888 4782 -19263 -61958 -72468 -47902 -43806
20169 -43806 -45933 -39650 -39877 -28337 -38621 -12589 -10812 -19360 -26461 -44609 -44175 -30682 -14008
20156 -14008 -43149 -30526 6542 13432 -19653 -10356 381 -24494 -42614 -47626 -47257 -53609 -24767
20143b4767K8348n861r615L890J4553k1157j3455q372J2374k5724j0239J804K6260
20130c1961K6581J5560j0031r147J555o37q704j4159J0266N010j423K531n879
20117b0438J1710j066k7005o387j401n921J2687L766J3549K5031j1842j6906J5623
20104h600o328m3963m328N443K3052R456K491Q22O477K4739M962Q300L706j9382
20090F847m895J8939O741L594j4655k709j7858m870j0422r023R186J0167j661
20077a0619J9010Q466j3136j9538o977q262R961K5326j0653k8304p507N254K5576
20064a1403O037J371k801K1213J4460k4950k0734m596J6997L3977K1258j7673
20052C3156k7388k3441J281J1641p47M237q741o717J0231Q735n906o95j450k3878
$$ plain form
20143 -24767 3581 -2280 -11895 -8005 6548 -14609 -28064 -36436 -24062 -49786 -60025 -58221 -31961
20130 -31961 -5380 10180 149 -8998 -7443 -8080 -16784 -30943 -20677 -15667 -17090 -14559 -20438
20117 -20438 -8728 -9794 -36799 -43186 -44587 -50508 -37821 -34055 -20506 4525 -7317 -24223 -8600
20104 -8600 -14928 -58891 -63219 -57776 -34724 -25268 -22777 -21955 -15478 9261 14223 22523 26229 6847
20090 6847 1952 20891 27632 31226 16571 13862 -3996 -8866 -19288 -28311 -19125 -8958 -10619
20077 -10619 8391 16857 3721 -15817 -22794 -31056 -21095 4231 -6422 -34726 -42233 -36979 -11403
20064 -11403 -5366 -3995 -6796 14417 28877 3927 -16807 -21403 -4406 29571 50829 33156
20052 33156 5768 -17673 -16392 -4751 -5498 -1261 -10002 -16719 -6488 2247 -3659 -4354 -5804 -29682
20038b9682O116L256r36R820J2479J2515o198J4671q490k3068k9608R370J9432
20025a0323K4549n111j8977l738j2141p430J594k009m605q487J4185j3969o2l12
20011d6836k97L664J0014P234J1146K2483N897j1308j494q009j0269j4786k8889
19998f1450o914L4517L8915j1800j4887o221K5571J4559j5353j3296K1278J3684
19986A8603L010j9690l1690k2810J2920K4896p727j7447J4892j3020k933J6559
19974b4437J4806J9861N615j0924k5190R381R528Q127p994m276o274j0920j8278
19961d0975P746q916J8134K3180K874j2035n858N37q607n53j414L724J2260j9507
19947b9410o546j8932j278K1353M503J2924j655j7568j150j0327n365K6232K2373
$$ plain form
20038 -29682 -23566 -20310 -21246 -11426 1053 13568 7370 22041 13551 -9517 -39125 -29755 -10323
20025 -10323 14226 9115 -9862 -13600 -25741 -33171 -31577 -33586 -38191 -46678 -32493 -46462 -46524 -46836
20011 -46836 -47133 -43469 -33455 -26221 -15075 7408 13305 1997 503 -7506 -17775 -32561 -61450
19998 -61450 -68364 -33847 5068 -6732 -21619 -27840 -2269 12290 -3063 -16359 4919 18603
19986 18603 21613 1923 -29767 -52577 -39657 -14761 -22488 -39935 -25043 -38063 -40996 -24437
19974 -24437 -9631 10230 15845 4921 -20269 -10888 -1360 6767 -1227 -5503 -11777 -22697 -40975
19961 -40975 -33229 -42145 -24011 -831 2043 -9992 -15850 -15313 -23920 -24473 -25887 -22163 -9903 -29410
19947 -29410 -35956 -54888 -56166 -34813 -30310 -17386 -19041 -36609 -37759 -48086 -53451 -27219 -4846
19934d846R175j6743J1769j1240P427k2168p343R601K45q121p523L718J4020J2490
19920i539n582Q207O195o857m417J834Q991j4352n48K3527K3767K0899j1924k9095
19906A1106o217k8386K411M3500Q993J7P506l805j1326j3327Q182j7754K581N3237
19892E6718M523k2410p120k7602k6466j0539J1959K1670l1840j0668R460q910
19880d1225J7150L8542j5348j1627J1489K953j2571j9575P299J639O166L31q237
19867b3014k775J9399k646J2893p356j8308n523K2955j692l3983J068J9539Q117
19854a1326P197J9264o173j1686p787j2999j6465J2622P787n174k5041p071K6703
19841c0149K4810kk2814j3868K3551K4893K888j3068q543l638K0091r010n950
$$ plain form
19934 -4846 4329 -12414 -645 -11885 -4458 -26626 -33969 -24368 -24123 -32244 -39767 -36049 -22029 -9539
19920 -9539 -15121 -6914 -719 -7576 -11993 -10159 -1168 -15520 -16068 7459 31226 52125 40201 11106
19906 11106 4889 -23497 -21086 22414 31407 31424 38930 35125 23799 10472 18654 900 3481 56718
19892 56718 61241 38831 31711 4109 -22357 -32896 -20937 733 -31107 -41775 -32315 -41225
19880 -41225 -24075 14467 -881 -12508 -1019 1934 -10637 -30212 -22913 -21274 -15108 -14777 -23014
19867 -23014 -25789 -6390 -9036 3857 -3499 -21807 -27330 -4375 -6067 -40050 -38982 -19443 -11326
19854 -11326 -4129 15135 8962 -2724 -10511 -23510 -39975 -27353 -19566 -24740 -49781 -56852 -30149
19841 -30149 -5339 -5341 -28155 -42023 -18472 6421 9309 -3759 -12302 -15940 4151 -4859 -10809
19828a0809J4157J1755K970j7008P951J963j5706J6772j2932j0379J824M968q000
19815a2474L346j2987l250Q994M891L450M055o615o418M50J1665J6054j04j5644
19801d587R10L340q977K2440j7653o341j2113q232J1312L687J9244R725k885j2891
19787c021Q832J9783J9494j6548j3166j0826j1556k0751j0813K2178J3671q183
19775a0906o956J1732J0467j4112j4310R50j6445J1897J3247K6635L874J771n901
19762A1943j1371j202r107p037l338K0489j2845j3315K2203O149j896l909L786
19749E50k959L460m438m845m081k099O466j0295j2386L3339K123n980j5070k8302
19735d4517R081o331j136K639j3909q549J1888J1172K4847J3153r508L906j4867
$$ plain form
19828 -10809 3348 15103 18073 1065 9016 10979 -4727 12045 -887 -11266 -9442 -4474 -12474
19815 -12474 -9128 -22115 -25365 -16371 -11480 -8030 -3975 -10590 -17008 -16558 -4893 11161 11057 -4587
19801 -4587 -3677 -337 -9314 13126 -4527 -10868 -22981 -31213 -19901 -16214 3030 12755 9870 -3021
19787 -3021 5811 25594 45088 28540 15374 4548 -7008 -27759 -38572 -16394 -2723 -10906
19775 -10906 -17862 -6130 4337 -9775 -24085 -23135 -39580 -27683 -14436 12199 16073 17844 11943
19762 11943 572 -630 -9737 -16774 -20112 377 -12468 -25783 -3580 2569 673 -3236 550
19749 550 -2409 1051 -3387 -8232 -12313 -14412 -7946 -18241 -30627 2712 4835 -1145 -16215 -44517
19735 -44517 -35436 -41767 -42903 -40264 -54173 -62722 -50834 -39662 -14815 -1662 -11170 -7264 -22131
19722b2131j851m954N030M2534J2810j2773p617l169k8673J5077K947J1623L9841
19709D8694L146l1087M78n277J0665N581j446J0042l8126j8512J3400l673O527
19696D12o972j9045j1559K7566P347K1923j6433L0655K2258k6351l6145j5040
19684b1384j0464p188J5342K6846J5634O467j4462j8024J38J0191l066J4359j2242
19671B147k329J5027J794m751P650o296k5028j4864N112J1503J3688J240j6562
19658a1669j1176P546M15j3741n979l953J3043K9815j5197Q187N834l8527l2565
19645f7967J6377N365K0744J7839j820j2532P678R533r857l246O857j7985J498
19632b7516J846N864J4758J1536k265r957j0522j3400j2781l803K0845J1298m549
$$ plain form
19722 -22131 -23982 -28936 -23906 18628 31438 18665 11048 7879 -20794 -5717 -2770 8853 48694
19709 48694 51840 20753 21231 15954 26619 32200 30754 40796 2670 -15842 -2442 -6115 412
19696 412 -6560 -25605 -37164 -9598 -2251 19672 3239 33894 56152 29801 -6344 -21384
19684 -21384 -31848 -39036 -23694 3152 18786 25253 10791 -7233 -7095 3096 30 14389 2147
19671 2147 -182 14845 16639 11888 19538 13242 -11786 -26650 -21538 -10035 3653 4893 -11669
19658 -11669 -22845 -15299 -14884 -28625 -34604 -38557 -25514 4301 -10896 -2709 3125 -35402 -67967
19645 -67967 -51590 -46225 -25481 -7642 -9462 -21994 -14316 -4783 -14640 -17886 -11029 -29014 -27516
19632 -27516 -25670 -19806 -5048 6488 4223 -5734 -16256 -29656 -42437 -46240 -25395 -14097 -18646
19619a8646o626K371O640J1178J482o589K036J3743n511k1904J8314j597k1794
19606b6903j445J1316J6319K1971L0118j3052l1666j331m471L323j1820l0080
19594c7721q678N718J4019R635m786J4671K4579j2589j8686Q923r681J5674K0534
19581B1612j7926k780j501K2127R532k3903k3597k1562Q534J7757l80J3802l124
19568a409l4005j2420J036L0729J8470m173K601J4203P116j3288l1003p42J3156
19555i729K895Q764k837k4877k6395J9612J2758N633J034k661Q55r008l610l969
19541c1535o026J1689j5863j8979j797J7200L2523p294q236m063j972K4549Q784
19528a020J1395J4574M352j9121j0093K606k5178N99J7029N523o53J0117R921
$$ plain form
19619 -18646 -25272 -22901 -16261 -5083 -3601 -10190 -8154 5589 78 -21826 -3512 -5109 -26903
19606 -26903 -28348 -17032 -713 21258 51376 38324 6658 5327 856 4179 -7641 -37721
19594 -37721 -46399 -40681 -26662 -17027 -21813 -7142 17437 4848 -13838 -4915 -14596 1078 21612
19581 21612 3686 906 -595 21532 31064 7161 -16436 -37998 -29464 -11707 -12087 1715 -1409
19568 -1409 -35414 -47834 -46798 -16069 2401 -1772 829 15032 22148 8860 -22143 -22885 -9729
19555 -9729 -6834 1930 -907 -25784 -52179 -32567 -19809 -14176 -13142 -15803 -14948 -23956 -27566 -31535
19541 -31535 -37561 -25872 -41735 -60714 -62511 -45311 -12788 -20082 -28318 -32381 -34353 -9804 -1020
19528 -1020 10375 24949 29301 10180 87 2693 -22485 -21886 -4857 666 13 10130 20051
19515B0051j733k3959j1672J7603M309m988n417o119J4617j2772J0160j3550k1331
19502c4801Q80O756J7806l461k3084N852J2717j9273J2783K5925P648n122n07
19489D119n864j9104O886J9054J8138J8054J742j8521k1588j4154j7839J4272
19477a4805J5789p368p080p907j4102R568l320K2743L2104R481J2872k6775J3634
19464C4834M140k1490l2704j2608P53J8520M0606j345k1641k6330j9393n671J5100
19451b7229J9048J1697K6503J561k9779k7679J4072J9778k114j8695l310J2744
19439c403M809P76j2918Q92j1128P969o39r859k2350L397J7373J6318l209j5781
19425b7753m106K1692J2903q150J7740K2113M71k8418k8890j0791P942J3320P51
$$ plain form
19515 20051 18318 -5641 -17313 290 4599 -389 -5806 -11925 2692 -10080 80 -13470 -34801
19502 -34801 -33921 -27165 -9359 -12820 -35904 -30052 -17335 -36608 -23825 2100 9748 4626 4119
19489 4119 -1745 -20849 -13963 5091 23229 41283 43025 24504 2916 -11238 -29077 -14805
19477 -14805 984 -6384 -13464 -21371 -35473 -25905 -29225 -6482 25622 35103 47975 21200 34834
19464 34834 38974 17484 -15220 -27828 -27075 -8555 32051 30706 9065 -17265 -36658 -42329 -27229
19451 -27229 -8181 3516 30019 31580 1801 -25878 -11806 7972 5858 -12837 -16147 -3403
19439 -3403 1406 2182 -10736 -9844 -20972 -13003 -13642 -23501 -45851 -42454 -25081 -8763 -11972 -27753
19425 -27753 -31859 -10167 2736 -5414 12326 34439 34910 6492 -22398 -33189 -25247 -11927 -11176
19412a1176J6081K0085m2214k9082N534N529J0115K477J2502P875K658j7100K6468
19399I752J2499J879Q933k3753j7993j733M563J4593J3602O088J0147Q89j1679
19386B7787k0191j3571J4970r949j6932M832R445k1308K513J8311J1994o494j4189
19373a2782n141L2373j3447l3697J7684M2292J1101l0141j6577j7800j2948J3777
19361b5306l345j276J1763L1868J5190j171N5m1429o172j1207K129J0743r061
19348b7219q082Q176J2162J2844j5722q684J7243J4341J120n407K130k6490j1448
19335c5036J7665K8493k695P444j1594j3918j5132J4323J6100L542k5736j2194
19323b8738O443J3575K5372K1895n303l0765j3428r88k379j7974R096P977r642
$$ plain form
19412 -11176 4905 24990 -17224 -46306 -40772 -35243 -25128 -22651 -10149 -2274 384 -16716 9752
19399 9752 22251 24130 33063 9310 -8683 -10416 -5853 8740 22342 28430 38577 39466 27787
19386 27787 7596 -5975 8995 -954 -17886 -13054 -3609 -24917 -22404 -4093 7901 1407 -12782
19373 -12782 -17923 14450 1003 -32694 -15010 27282 38383 8242 -8335 -26135 -39083 -25306
19361 -25306 -28651 -29927 -18164 13704 28894 27723 27778 -13651 -19823 -31030 -28901 -18158 -27219
19348 -27219 -35301 -27125 -14963 -2119 -17841 -26525 -9282 5059 6179 772 2902 -23588 -35036
19335 -35036 -17371 11122 8427 15871 4277 -9641 -24773 -10450 5650 9192 -16544 -28738
19323 -28738 -22295 -8720 16652 38547 33244 2479 -10949 -11937 -14316 -32290 -23194 -15217 -24859
19310b4859j3389Q468R931M3712J0816k3449k5405k337K3323K4634k0882k4492
19298a3929L850P72q135K6119J5475j4897k6963j7759J7810J4106k3910k279J5334
19285a4406N300q758K6809J0945O974L709j5459k3050j0918R78j1654j188k785
19272c3503J9606K6758j0011j7605O80J1172Q581R957j0374k0716R54J344K81
19259a2876m689j7230J7034J3390l767l1938K231J2035p765Q574K7857o262j815
19246e221R823j014L34m07q720o165J2338L568r061N23q495K082J1074O107L460
19231A0226K1789j2005j0950O53j8009j562k179J3474k391O99O237R85O696j4201
19217e38N466R955J3011j1040k4877K2626p740j2236r696j7897j0030J2789M658
$$ plain form
19310 -24859 -38248 -29780 -19849 23863 34679 11230 -14175 -16512 6811 31445 10563 -13929
19298 -13929 -10079 -9307 -17442 8677 24152 9255 -17708 -35467 -17657 -3551 -27461 -29740 -14406
19285 -14406 -9106 -17864 8945 19890 26864 30573 15114 -7936 -18854 -17876 -29530 -30718 -33503
19272 -33503 -13897 12861 2850 -14755 -14075 -2903 5678 15635 5261 -15455 -14501 -13157 -12876
19259 -12876 -17565 -34795 -17761 -4371 -8138 -40076 -37845 -25810 -33575 -25001 2856 -3406 -5221
19246 -5221 4602 3588 3922 3515 -5205 -11370 968 4536 -4525 -4002 -12497 -10415 659 6766 10226
19231 10226 32015 20010 9060 9713 -8296 -9858 -12037 1437 -954 -255 5982 6967 13663 -538
19217 -538 4928 14883 27894 16854 -8023 14603 6863 -5373 -15069 -32966 -42996 -30207 -25549
19204b5549j9379M042p88K1456M444O74o942M921J5922L525j6604k0642r033K7716
19190a6237R538k916J1252J7503r6j8865k6190o346R047K8204K2826n0705j3721
19177c6706J3082l621M184m539K3246R661k7788K521J6046r477J1827L0313P61
19164B9510k0218k1486k1640j4985R909M443J468K248k5289J5981M0524L2714
19152C3179O263k2823m446j4106k0390J0056N438K970P107j5039p40K222j104
19139a1413L939J4373K6412o645j9574J5469R437P369k5673k8115k7498J7094
19127b4825J0117k704l888n057Q800K1298N395J3314P384j8327q335M708k661
19114E219j4165L0361K3575j4917J437j2365l1849r687J2807K2284j0263q819
$$ plain form
19204 -25549 -44928 -40886 -41674 -20218 -15774 -15100 -22042 -17121 -1199 2326 -14278 -34920 -43953 -16237
19190 -16237 -6699 -9615 1637 19140 19044 179 -26011 -32357 -23310 4894 27720 -22985 -36706
19177 -36706 -23624 -27245 -23061 -27600 -4354 5307 -22481 -19960 -3914 -13391 -1564 28749 29510
19164 29510 9292 -12194 -33834 -48819 -38910 -34467 -32999 -30751 -56040 -40059 465 33179
19152 33179 39442 16619 12173 -1933 -22323 -12267 -6829 -3859 3248 -11791 -12531 -10309 -11413
19139 -11413 -7474 6899 33311 26666 7092 22561 31998 39367 13694 -14421 -41919 -24825
19127 -24825 -14708 -17412 -21300 -26357 -17557 3741 9136 22450 29834 11507 3172 7880 5219
19114 5219 -8946 21415 44990 30073 31510 19145 -12704 -22391 -9584 12700 2437 -6382
19102f382J0580N133P313q169O115r434k3786J8307J5340m190r061j710r437R381
19088@j2998q543j2445P628j2746n898J6997K261R260M255Q83p980j6339o639
19074d2304J6795J7983n463p802K301j6704O495O423J1134O98K4532J9289K9429
19061F2806J6185k2225l5007N667L57Q241j0381j1391q003j63J2412J3139J2867
19048D4504j7140j4015K89J1784j7475j0204J641M2864J4948o333j239M924L1495
19035H6043J4749M819Q158N917K0905N7632Q6627J75879L00184M11123P2050l10487
19023I33599j86980k5720J24730L00335J99419l05159k96077q9574O5078K61605
19013I81256L58598K4281l84821k45896k1574J66492L12761J98911l62910m01040
$$ plain form
19102 -6382 4198 9331 16644 8475 14590 5156 -18630 -323 15017 10827 1766 56 -9381 0
19088 0 -12998 -21541 -33986 -26358 -39104 -45002 -28005 -25744 -16484 -12229 -11346 -19326 -35665 -42304
19074 -42304 -25509 -7526 -12989 -20791 -18490 -35194 -28699 -22276 -11142 -10444 14088 33377 62806
19061 62806 78991 56766 21759 27426 27783 36024 25643 14252 6249 6086 18498 31637 44504
19048 44504 27364 13349 13638 25422 7947 -2257 -616 42248 57196 50863 49624 54548 86043
19035 86043 100792 105611 113769 119686 140591 198223 284850 460729 760913 1172036 1244086 933599
19023 933599 746619 720899 845629 1145964 1345383 1040224 744147 654573 719651 981256
19013 981256 1339854 1364135 979314 733418 711844 878336 1191097 1390008 1027098 626058
19003F26058k31671j19000m4992n3769m7220k5237m1001k7342K6612k0836o258
18992C5344j9300P234K3447j233N93K066J7102J1063j147j2246k8073j5854n965
18979A3031L4181N983k8315l103J4988j2101P16j627R024P320r935K307J239j8921
18965A4787j8989K706L0824K7k2391j4245L0085M0934O322k0533o208M277j7649
18952B9947J3955N093k1716k4642p724L427j0672q886L1770m728j5845o714J8457
18939A722J0173j1334R272J44m764K2459j3491Q084j7737j0205j3143j5037L796
18926c0061n872J8217J1965J3518L928j831M32J9057K7404l284m334j872j7856
18913B9411k5332J2236j5015J299j0444J1923J3135O020J0209R064j5137j6115
$$ plain form
19003 626058 394387 275387 230395 176626 129406 104169 63168 35826 62438 41602 35344
18992 35344 16044 23278 46725 45492 46085 48151 65253 76316 75169 62923 34850 18996 13031
18979 13031 47212 53195 24880 21777 36765 24664 25380 23753 32777 40097 30162 32469 33708 14787
18965 14787 -4202 -1496 29328 29355 6964 -7281 22804 63738 70060 49527 43319 47596 29947
18952 29947 43902 48995 27279 2637 -5087 -1660 -12332 -21218 10552 5824 -10021 -16735 1722
18939 1722 11895 561 9833 9977 5213 27672 14181 22265 4528 -5677 -18820 -33857 -30061
18926 -30061 -35933 -17716 -5751 7767 11695 9864 10296 29353 56757 53473 49139 47267 29411
18913 29411 4079 16315 1300 2599 -7845 4078 17213 23233 33442 42506 27369 11254
18901A1254m766m419m284L400J9379R151j8144N11l796j0062p159P717N255J3796
18887A7833j1950m924K9307K1599j7117j0183l3444r500K4872K436J6596Q782
18875C4307k1235K552j271J183K200l436l838J9508j9512j2695J3537L041j0969
18862C372j7209k358K276Q756J2283R859q880J0113K4970j0853j8683j2054l0887
18849b9295l0910J3266J8289R782O410Q955J9320j062k903R433q895K1279J3106
18836D6775K1987O56j166J0545N87K5827P080j2619m2373k7449o606P436K7264
18823E7944J375j865j3304j8723q000K2796Q885n596j5924j392J0658K027J7356
18810E6237K0616k3562r271J2291j1377r934j6893q601J0013K4221j143J546K4919
$$ plain form
18901 11254 6488 2069 -2215 1185 20564 29715 11571 12082 8286 -1776 -8935 -1218 4037 17833
18887 17833 5883 959 30266 51865 34748 24565 -8879 -18379 6493 8929 25525 34307
18875 34307 13072 15624 14353 15536 17736 14300 10462 29970 10458 -2237 11300 14341 3372
18862 3372 -13837 -16195 -13919 -5163 7120 16979 8099 18212 43182 32329 13646 1592 -29295
18849 -29295 -60205 -46939 -28650 -18868 -12458 -3503 15817 14755 11852 21285 12390 33669 46775
18836 46775 68762 69418 68252 78797 79384 105211 112291 99672 57299 29850 23244 30680 57944
18823 57944 59319 57454 44150 25427 17427 40223 49108 43512 27588 26196 36854 38881 56237
18810 56237 76853 53291 44020 56311 44934 35000 18107 9506 19519 43740 42597 44143 69062
18797F9062J2160k3528R668Q640j203j1118l1428k9287j37n184J1747J2212K765
18784B4369Q689L273J1332j4447M063r118n434o79j3774j2912L586L6195K6137
18771F1280n369j5407K2988Q5723J50626J13081j21653j44279p0699l866j3263
18760E9162J0015j144l1781k4008j493l634n939j006K1876K608l396N679N377
18747C2316J3560j9561k1319Q281n344L731j37J695l211o077r207J4878J6870
18734B6475j1317J8041J6502j9940k4333J2200L47m488J026J6792R108j3497n422
18721B1494n260p454J3558l064L1110J5391J1565k0649J1890r273k0346m196J2746
18708D7512k32k1229k355q707R354q40O766K3300l364j405n451M81J077M476J8731
$$ plain form
18797 69062 81222 57694 67362 76002 74799 63681 32253 2966 2829 -2355 9392 21604 24369
18784 24369 33058 36331 47663 33216 37279 28161 22727 22048 8274 -4638 -1052 35143 61280
18771 61280 55911 40504 63492 149215 299841 412922 291269 146990 76291 72425 59162
18760 59162 69177 68033 36252 12244 10751 7117 1178 172 22048 24656 21260 26939 32316
18747 32316 45876 26315 4996 13277 7933 11664 11527 13222 10011 3934 -5273 9605 26475
18734 26475 15158 33199 49701 29761 5428 17628 17975 13487 14513 31305 40413 26916 21494
18721 21494 16234 8780 22338 19274 50384 65775 77340 56691 68581 59308 38962 34766 47512
18708 47512 47280 26051 23696 14989 24343 23503 30269 53569 50205 48800 43349 43830 44907 49383 68114
18693F8114M901J4034p260n092j1443m520p153k569j5710J8442K7160J9423j2491
18680H5836m7665k7875j5462J1059M4367j4082m0877N62K391J7620K9893N218
18668E0985p647J2653l2912n4227J1083K2270K8435O606k9581q413N791K8498
18656C3541J7713l868j9262m047p437k557K744m93L1412L170J0249j3018j5280
18643C2867j4594L4547P466P356l47k5842k1867K1643J8801J2216o839N245J5226
18630H5878K166j4547n505j4009m723J1188k020P178N783P455M926J0322l0006
18617F4086k2903q597Q883k325j5906J8404J9289K7920k207j4890J5096J5975
18605A02825J3718M1935K4618k6842n5971j7705J7727L0480j241P818J6512K004
$$ plain form
18693 68114 73015 87049 79789 74697 63254 58734 51581 49012 33302 51744 78904 98327 85836
18680 85836 38171 10296 -5166 5893 50260 36178 -4699 -4137 -1746 15874 45767 50985
18668 50985 43338 55991 23079 -31148 -20065 2205 30640 37246 7665 -748 5043 33541
18656 33541 51254 47386 28124 24077 16640 14083 16827 16334 47746 50916 61165 48147 32867
18643 32867 18273 52820 60286 67642 67295 41453 19586 41229 60030 72246 65407 70652 85878
18630 85878 88044 73497 67992 53983 49260 60448 58428 65606 71389 78844 83770 94092 64086
18617 64086 41183 32586 41469 39144 23238 41642 60931 88851 86644 71754 86850 102825
18605 102825 116543 158478 183096 156254 100283 82578 100305 130785 129544 137362 153874 155878
18593A55878L4357M7486k5943l7658K6038K1365J2786L3064K0283l6901o024J1127
18581B55858j4363j8459J7913j4997J0699L1138j867J0785J5848K0680l2539k0240
18569B60456o00n380j4592J90j9896l1440l2240m4199j8172j448J6904J4649K4746
18556A48978p215l7326Q457J7956L1032p474n6830k3564M823k598J0055O325M564
18543I7183j6025j8824k4866K1848l556J406R952J8133J7126Q063L924j722K2523
18530A35165J9246k1442J133p04j3383j1574J12O37k072N335j9510l2903K0416
18517H0456M9911L4865l9021l2717K88K5752K0766J4210j7753j3982O513J0218
18505A39506j9224k5489q767K2328R609J2868K3605k544j8148j2898J759K786
$$ plain form
18593 155878 190235 237721 211778 174120 200158 221523 234309 267373 287656 250755 244731 255858
18581 255858 241495 223036 240949 225952 236651 267789 265922 276707 292555 313235 280696 260456
18569 260456 259856 254476 239884 240074 220178 188738 156498 112299 94127 92679 109583 124232 148978
18556 148978 141763 104437 112894 130850 161882 154408 97578 74014 78837 76239 86294 92619 97183
18543 97183 81158 62334 37468 59316 55760 57166 67118 85251 102377 110440 114364 112642 135165
18530 135165 154411 132969 134102 133398 120015 108441 108553 109190 107118 112453 92943 60040 80456
18517 80456 130367 165232 126211 93494 93782 119534 140300 154510 136757 122775 129288 139506
18505 139506 120282 94793 86026 108354 117963 130831 154436 151892 133744 120846 122605 125391
18493A25391J6757R561N452j0015j9858J7005K7494N5354K2235j8751m4900l2519
18481A53206K782L2032M4711L7216L1698P034r475k5383K7934K2797P498L1376
18469C63426j1697j1759M683n711k7302O2844N6763k1204l0887j6557M846K0834
18457C88279N9839J7725k1082j9163J480j3449j2700L6861J762j5232J7154L4747
18445D76221O576j6703N596J3825J4583L2017M532M44J6323K6205L5967M4429
18433F60015K6122L5319N5528J14731K08677K52580P5193j79731j08908J0606
18423A150132J19747J81845K92589M04965K57503P6484J73043R2815k81147j34425
18413B333551J36714L49561M35255J95586k33826j87943K04331M58172L50220
$$ plain form
18493 125391 142148 151709 157161 147146 127288 144293 171787 227141 249376 230625 185725 153206
18481 153206 155988 188020 232731 269947 301645 308679 299204 273821 301755 324552 332050 363426
18469 363426 351729 339970 344653 338942 311640 374484 431247 410043 379156 362599 367445 388279
18457 388279 448118 465843 444761 425598 427078 413629 400929 437790 439552 424320 441474 476221
18445 476221 482797 466094 471690 485515 500098 532115 536647 537091 553414 579619 615586 660015
18433 660015 686137 721456 776984 891715 1100392 1352972 1428165 1248434 1139526 1150132
18423 1150132 1269879 1451724 1744313 2149278 2406781 2483265 2656308 2749123 2467976 2333551
18413 2333551 2470265 2819826 3255081 3450667 3216841 3028898 3233229 3691401 4041621
18404D041621J96804J13978j93221Q6567M59389N76268L87832M41245K98024L92331
18394F800838M07654M03710L62159K39364O96063J174229J431078J568770K006979
18385A5090844K476247L700008N722117R224711J5445265K7513793N1344595P5469780
18377B05987360K5622148o0091709m3078952p230888K4436105N7414352M8269356
18370B51327772m5693689o2530413k5037029O081863L8645666O8192074K1572968
18363B52559212o7821186m9544551j1116132K1203709N4003593M6172527n1985897
18356A93471275p5022893m2122505k2098895j3327105r076047o119577m115176
18349B1589077k845703k069497j858357k008958j722889j127158o58228l12269
$$ plain form
18404 4041621 4238425 4352403 4159182 4245749 4705138 5281406 5669238 6110483 6408507 6800838
18394 6800838 7208492 7612202 7974361 8213725 8909788 10084017 11515095 13083865 15090844
18385 15090844 17567091 21267099 26989216 36213927 51659192 79172985 130517580 205987360
18377 205987360 231609508 171517799 128438847 121207959 145644064 203058416 251327772
18370 251327772 205634083 143103670 118066641 124148504 162794170 230986244 252559212
18363 252559212 184738026 135193475 124077343 145281052 199284645 245457172 193471275
18356 193471275 118448382 76325877 54226982 40899877 31823830 25704253 21589077
18349 21589077 18743374 16673877 14815520 12806562 11083673 9956515 9298287 8986018
18341H986018m41068p88259q88686m09039J7124K08890m12134q76264n98255k50534
18331D547793J24493M00244J1797p66945p08467m01080j20968J10190J67774k47674
18321C117157m42386k49632l3032J10478K19061p1439m69107l55770k06740j29859
18311A488731j11456j10033q6562p8337n4124m0742m4901m9066m7140k724o401
18300H57245l0351j0674l5967k9414j470j6991j7097q820l6304l9736l4289j7925
18288E78207J0674n479l848k3804o225l180p704k2127q921l0114N556L0909N99
18275E14543j670J4701r864J3740N8953J05k8280Q602Q903n6465q716O2768R03
18262E78223N202J7561k6451j5613O2686K1350n0484J5764P746m0731n5646j5181
$$ plain form
18341 8986018 8544950 7756691 6868005 6458966 6476090 6684980 6272846 5396582 4798327 4547793
18331 4547793 4672286 5072530 5084327 4317382 3608915 3207835 3086867 3197057 3364831 3117157
18321 3117157 2674771 2425139 2392107 2502585 2721646 2650207 2181100 1825330 1618590 1488731
18311 1488731 1377275 1267242 1180680 1102343 1048219 1007477 962576 913510 866370 863646 857245
18300 857245 826894 816220 780253 750839 749369 732378 715281 706461 670157 630421 596132 578207
18288 578207 588881 583402 579554 555750 549525 546345 538641 516514 507593 477479 483035 513944 514543
18275 514543 512873 527574 517710 531450 590403 590508 562228 570830 579733 523268 514552 577320 578223
18262 578223 583425 600986 574535 558922 621608 642958 592474 608238 615984 575253 519607 504426
18250E04426o5547k6261J7851l1607l8773k3397j8808k3545K1433L3854o28m2133
18238C06865l9525J8815j0703j2702%k745k4942n675O926M862o035r956m0105
18225A85080o414n815J4321J2077l830o412k0690J3909L3647J3748q492r750q018
18212B03361j6800N584L7061J7006O401j6029j4322j6442k5570R062O37J6530
18200B06479K4916K700k8371j7030k0187J271K9121P50J3197J9846j7563j3297
18188B01832M680o615k4895k4362N78Q742L039M344j5138r264j0796q290N161
18175A29016P368m333l3040j1378J0283Q670L02J5868O598j1562j634K0859K5595
18162A62612r053o612j5845k1780J9235J3561M574K8958K416m9288j0766K0720
$$ plain form
18250 504426 438879 412618 430469 398862 360089 336692 317884 294339 315772 349626 348998 306865
18238 306865 267340 286155 275452 262750 262750 260005 235063 229388 236314 241176 235141 225185 185080
18225 185080 178666 172851 187172 199249 195419 189007 168317 182226 215873 229621 221129 211379 203361
18212 203361 186561 192145 229206 246212 252613 236584 222262 205820 180250 189312 189949 206479
18200 206479 231395 234095 205724 188694 168507 169778 198899 199649 212846 232692 215129 201832
18188 201832 206512 199897 175002 150640 151218 159960 162999 167343 152205 142941 132145 123855 129016
18175 129016 136384 132051 99011 87633 97916 106586 106888 122756 129354 117792 116158 137017 162612
18162 162612 153559 146947 131102 109322 128557 142118 146692 175650 178066 128778 118012 138732
18150A38732M6267K859O820k6425r560j827M7135K9182J4966l673n296N938K5957
18137B71075J3787K3897K7885K3782J8650J5007L3687M4951M9117O1320L9472
18126F22630O7543P8021J12866J15754J24303J29093J49844K41645L50885M58376
18116B450960O12337R06085J308309K045730L588915O522147J2598516K2560175
18108E2593174K0331960j5666994k4658047j3178592o554031l682284k346100
18101F839086j572965j053100p77042o10236m55136l44994k78272k62184j92357
18092A292800j44885j23499j03836q0679n2139l6921n5424l1459n5031m5843k2565
18081E40519l3386k7797j4976r966k7276n1712l3250j3056j2795J6316l919r309
$$ plain form
18150 138732 184999 187858 194678 168253 158693 156866 204001 233183 248149 244476 239180 245118 271075
18137 271075 284862 308759 336644 360426 379076 394083 427770 472721 521838 583158 622630
18126 622630 690173 768194 881060 996814 1121117 1250210 1400054 1641699 1992584 2450960
18116 2450960 3063297 3969382 5277691 7323421 10912336 17434483 30032999 52593174
18108 52593174 72925134 57258140 32600093 19421501 12867470 9185186 6839086
18101 6839086 5266121 4213021 3435979 2825743 2370607 2025613 1747341 1485157 1292800
18092 1292800 1147915 1024416 920580 839901 787762 750841 695417 663958 608927 563084 540519
18081 540519 507133 479336 464360 454394 427118 375406 342156 329100 316305 332621 328702 319393
18069C19393l9696n2558k2006P354J5435j7726o929k3861l8011j8312J1798L9317
18057A74198J5876p409k8791j0090k8299j2233K6872M597R61j1394k978R071J433
18044A31814J9790L9063R415J404L1450N3980P861n9907m3824J4125K4144j6802
18032B12513j9829j1239J8403M6729O542j5619k7356k8416l7377n1961l9764J0994
18020F3620K4697P676n999k498k1920j1263Q966J6045m064k3432K348R112p153
18007E6135J0925k187p573k676J1409L5708J2526j5136P184M6859j245k1692k6404
17994A03833k1842K049q405J3411R200N431k1006j7920J5436J0889O5471N2641
17982B09188P089j4059m7270l4847l4364m6967j6837K0972K0419r616j9186J3482
$$ plain form
18069 319393 279697 227139 205133 212487 227922 210196 203267 179406 141395 123083 134881 174198
18057 174198 190074 182665 153874 143784 115485 103252 130124 134721 135682 124288 121310 130381 131814
18044 131814 151604 190667 200082 201486 232936 286916 294777 234870 191046 205171 229315 212513
18032 212513 192684 181445 199848 246577 253119 237500 210144 181728 144351 92390 52626 63620
18020 63620 88317 95993 89994 87496 65576 54313 63279 79324 75260 51828 54176 63288 56135
18007 56135 67060 64873 57300 54624 66033 101741 114267 99131 106315 153174 151929 130237 103833
17994 103833 81991 84040 75635 89046 98246 103677 82671 64751 80187 91076 156547 209188
17982 209188 216277 202218 154948 120101 85737 38770 21933 42905 63324 53708 34522 48004
17970D8004L9121J0826O634O02j458Q414l7474m4164l641m254j918j3481j9828
17957a2617p393P725N109k2700L601M8514J4553m631Q576J1738Q126J5540j4353
17944F1788j6520n324J2431k2621k2103j8543m362L0575n947k3510J2837j1915
17932a3214O680J3148O115l495p653Q183K1220k6583k4629K1395j1798O217l2851
17919c7265k3730j77r303P576K3461J5187K5488J2468L046n437j1678k3490J3003
17906a0851J6384O98J8442J6777k117J2849k6046L54J4513J3141J8035j824p452
17893F2903N408j6530j0479L835J4304p610m097k4l3668m2380L384P905J4377
17880b672J3480l485M444P788K3196K2625j388l109J9387n184k1432J5027J4444
$$ plain form
17970 48004 87125 97951 104585 105187 103729 112143 74669 30505 26864 22610 20692 7211 -12617
17957 -12617 -20010 -12285 -7176 -29876 -26275 22239 36792 32161 40737 52475 60601 76141 61788
17944 61788 45268 39944 52375 29754 7651 -10892 -15254 15321 9374 -14136 -1299 -13214
17932 -13214 -6534 6614 12729 9234 1581 9764 30984 4401 -20228 1167 -10631 -4414 -37265
17919 -37265 -60995 -61172 -70475 -62899 -39438 -24251 1237 13705 16751 11314 -364 -23854 -10851
17906 -10851 5533 6231 24673 41450 39333 52182 26136 26490 41003 54144 72179 70355 62903
17893 62903 68311 51781 41302 45137 59441 51831 47734 47710 14042 -28338 -24954 -17049 -2672
17880 -2672 10808 7323 11767 19555 42751 65376 63988 60879 80266 75082 53650 68677 83121
17867H3121m3510l7498L97J9j1019k0031J304J0219K575K4079K8244k847n25k842
17853C1686J225J3837k4384k3450Q719j6237k8310L2886K0705J5219R558O429
17841D7883m572j0158j4225Q991m677J202O109O908J4288m0053j1721J5466J0753
17828B6194Q963J769k9243j3036J7779J2621M763j0198K113j307q988p653K935
17815F712l458P464j904j0654l364J5900J9385j0044j0559J059L057K1856R935
17802D5385j9223j0135p332Q812J6154r28M463p071k2641r543j6427J5532J8322
17789A5368K091O63l676J5281j257L952K7305J2661j9037l323j4325j4684J1751
17776C2770q719n166L509Q467j1167J822K4373j1295j3560O050P551J3250L228
$$ plain form
17867 83121 39611 2113 2510 2529 -8490 -28521 -27217 -16998 -14423 9656 37900 35053 34528 31686
17853 31686 32911 46748 22364 -1086 7633 -8604 -36914 -4028 16677 31896 41454 47883
17841 47883 43311 33153 18928 27919 23242 24444 30553 37461 51749 11696 -25 15441 26194
17828 26194 35157 36926 7683 -5353 12426 25047 29810 19612 21725 20418 11430 3777 6712
17815 6712 3254 10718 8814 -1840 -5204 10696 30081 20037 9478 10537 13594 35450 45385
17802 45385 26162 16027 8695 17507 33661 32733 37196 30125 7484 -2059 -18486 -2954 15368
17789 15368 17459 18122 14446 29727 28470 32422 59727 72388 53351 50028 35703 21019 32770
17776 32770 24051 18885 22394 30861 19694 21516 45889 34594 21034 27084 34635 47885 51113
17763E1113J5797l0602k3464p61k759J6483N765j8058Q88j2101o812j225j1858
17750a7594O541J0633K2486K990J382M634q360j4018J8009K3490J9527j5432l1938
17737B2350j2414J1025J2096P013O699k340R612K11J5244L0434J9866Q832M5867
17724A74495P3566J08775K17733L98141L36237j72990l21759j42186M0577K37777
17714I50366L49099J3728l41270k35349l9639J20009L04403L04050k31624l90820
17704H02953j54812P2872K43785L48619m4783m53338l04094j57384r8391o2578
17694A92849m7227k2110k2563L161R095r383j0549k795o269k3745J2735N837l5544
17681D3492j8187P426J2540J616k0872j3064N396k807O333Q646j2788k832O963
$$ plain form
17763 51113 66910 36308 12844 12083 9324 25807 31572 13514 14402 2301 -4511 -5736 -17594
17750 -17594 -11053 -420 22066 25056 26438 31072 22712 8694 26703 50193 69720 54288 22350
17737 22350 9936 20961 33057 40070 46769 44429 54041 54252 69496 99930 119796 128628 174495
17724 174495 248061 356836 574569 972710 1308947 1135957 814198 672012 712589 950366
17714 950366 1299465 1313193 971923 736574 696935 816944 1121347 1425397 1193773 802953
17704 802953 648141 721013 964798 1313417 1268634 815296 511202 353818 255427 192849
17694 192849 145622 123512 100949 104110 113205 103822 93273 90478 84209 60464 73199 79036 43492
17681 43492 25305 32731 45271 46887 26015 12951 18347 15540 21873 30519 17731 14899 21862
17668B1862j0267J007M090O796k939J5519J118N941j3051j9643o214o523J2553
17655A0249j1112O769K6677J764n085O094J2583j6726l5277j1842P188M2936K80
17642C4498N422k675n245P842k2992o312q893j5444j8268k2055P313M4939l821
17629e691Q701M182J9457k797j6824j432K987j0368J0105L344k1448p03J5737
17616E250J6021m577j6695j1562m880K0152J752j2777k416p924J7461K9022j0784
17603A8043k0172K634J4565k744J6163q682p136J6071J7766L787j5596k5249j105
17590H345J8493J2437J5284k253k57j1377j9265J1255M769R941P424l5095l7996
17577a8295N82J9222J922P54J4347J509j8735q747K627m41M1466P00l1057M855
$$ plain form
17668 21862 11595 12602 16692 23488 20549 36068 37186 43127 30076 10433 4219 -2304 10249
17655 10249 -863 5906 32583 34347 29262 35356 47939 31213 -4064 -15906 -8718 34218 34498
17642 34498 39920 37245 32000 39842 16850 10538 1645 -13799 -32067 -54122 -46809 -1870 -5691
17629 -5691 3010 7192 26649 23852 7028 5596 8583 -1785 8320 11664 -9784 -10487 5250
17616 5250 21271 16694 -1 -11563 -16443 3709 5461 -7316 -9732 -17656 -195 28827 18043
17603 18043 -2129 505 15070 12326 28489 19807 12671 28742 46508 50295 34699 9450 8345
17590 8345 26838 39275 54559 52306 52049 40672 21407 32662 37431 47372 54796 19701 -18295
17577 -18295 -17713 1509 3431 4185 18532 20041 1306 -7441 -4814 -5255 36211 36911 5854 10709
17563A0709Q192N159O166j0349j2401J2188O151m401q146q902q863j6987N868
17550a5616J2J1069P277M990j1250O747l229L626K2150j4693k2671L313L670L176
17536a429K8938k0185l456M306O706n583o373J9722J4362j5756k1612J201j482
17523f41j1406J5253j6258J77J6483j1609l723o024K6534J3373j3895m922o309
17510b967R259K369l528L698J3016J470O102k3081j4421P261J6012q768k2556
17497a6134K2060J41J442J331l028R587J1630J3847j6869l8884p673o693L473
17484b5770j0919k147k818J3103J1774J3117n953K5646J3591k2591k8920K242
17472a9645k812m57j628P22K881J5355K8571M060K360j0500j2873k3355Q134k562
$$ plain form
17563 10709 18901 24060 30226 19877 7476 19664 25815 21414 13268 4366 -4497 -21484 -15616
17550 -15616 -15604 -4535 2742 7732 -3518 3229 0 3626 25776 11083 -11588 -8275 -4605 -1429
17536 -1429 27509 7324 3868 8174 14880 9297 2924 22646 37008 21252 -360 841 -641
17523 -641 -12047 3206 -13052 -12875 3608 -8001 -11724 -17748 8786 22159 8264 3342 -2967
17510 -2967 6292 8661 5133 8831 21847 23317 29419 6338 -8083 -822 15190 6422 -16134
17497 -16134 5926 6067 7509 8840 5812 15399 27029 40876 24007 -14877 -22550 -29243 -25770
17484 -25770 -36689 -38836 -41654 -28551 -16777 -3660 -9613 16033 29624 7033 -21887 -19645
17472 -19645 -22457 -22914 -24542 -23820 -20939 -5584 22987 27047 29407 18907 6034 -17321 -9187 -11749
17458a1749J8358J5060j1371l0747j6563J3773O348n633K1427K9148n866j5022
17446G163K2466M0012Q1494J22851J07786l6565j40198o9989n4088l1825j4733
17435C4374K9087K489k9516K873l556k6147j0672J545J1813K7493r459m2576j7437
17422b9689M5770L5600n123N679j1934j2661n420M534Q627n213j5561l055p332
17409D222J7064L851j5714J311J7146J1477P349J4654M480j8823J0553N784m692
17396E8662m116J8994j4110k9678k0869o082N279J7193K7892R228j3879k2714
17384B5800J584r239p055J1115P814J022m141N162j0510k4055J7425J7972l002
17371B9892j7488J6902L503j6691j3070M878j9355j9523K6401L6904P018r532
$$ plain form
17458 -11749 6609 21669 10298 -20449 -37012 -23239 -16891 -22524 -1097 28051 22185 7163
17446 7163 29629 69641 151135 273986 381772 345207 205009 135020 80932 49107 34374
17435 34374 63461 65950 36434 39307 35751 9604 -1068 477 12290 39783 30324 -12252 -29689
17422 -29689 16081 51681 46558 52237 40303 27642 22222 26756 35383 30170 14609 11554 4222
17409 4222 21286 25137 9423 10734 27880 39357 46706 61360 65840 47017 57570 63354 58662
17396 58662 54546 73540 59430 29752 8883 2801 8080 25273 53165 62393 48514 25800
17384 25800 27384 18145 11090 22205 30019 31041 26900 32062 21552 -2503 14922 32894 29892
17371 29892 12404 29306 32809 16118 3048 7926 -11429 -30952 -4551 32353 39371 29839
17359B9839j0731M372j2247k1551N526N337m5P020J2315P397J539j138j7358j9495
17345i220N409k424J1336j813K7323K8378j6131j0346J3096j5734j5862l021J8746
17332B9737o28j8335J562n277l316j679k476P928J852o269L506J2402J3904o6
17318C2845J4n001j0731J8737J8039P128j9705n3534p55P480n59Q953K5540K3143
17304E1594K1226J1755n916k6112j804p117k316M729M589J8697N7j0262k5674
17291C3446K8743L7302L1493L8536J9186N8955R2339J82875L50112L26771j78740
17280A021018l74576k27204r9366n9867k5423K0944L4135K6843Q0798J84572L16946
17269H98820L59789j16740l71191k15408m4189N9931J78502L19736K99419k37792
$$ plain form
17359 29839 19108 23480 11233 -10318 -4792 545 500 7520 19835 27232 28771 27633 10275 -9220
17345 -9220 -3811 -6235 5101 3288 30611 58989 42858 32512 45608 29874 14012 10991 29737
17332 29737 29109 10774 12336 7059 3743 2064 -412 7516 9368 3099 6605 19007 32911 32845
17318 32845 32859 27858 17127 35864 53903 61031 41326 -12208 -12963 -5483 -6042 2911 28451 51594
17304 51594 72820 84575 78659 52547 50743 43626 41310 46039 50628 69325 69382 59120 33446
17291 33446 62189 99491 130984 169520 188706 247661 340000 522875 872987 1199758 1021018
17280 1021018 646442 419238 319872 260005 234582 255526 289661 316504 397302 581874 898820
17269 898820 1258609 1141869 770678 555270 511081 571012 749514 1069250 1368669 1130877
17259A130877m10746k44375j28496n0987j5492k1717K6270N1209R5067J71191
17249F02801L14133L45548j77677l90948k63362j20651p6759n3177o801J4297
17239A87404o193l2057j3499n540K8963K1707j9743k3087R948Q939R893J1267
17227A78002J3817K2869M869J1740j849k2138k7032n3500m79J6305j9060l1712
17215I1832p3K4423R792j6784m032K36l088N336j5019j2422o393m985K5198R932
17201A03953k0639m76o273p625K4397N216k1103M428N774L6482K3212P535K7442
17188A82323R3316J48498K56409L92513K37435k21263k32546o1531P9071K58914
17178A133139K80064j88801l82983j89431r6634o2652o7702j5088Q553K8334O3067
$$ plain form
17259 1130877 720131 475756 347260 296273 280781 259064 285334 336543 431610 602801
17249 602801 916934 1262482 1084805 693857 430495 309844 233085 179908 173107 187404
17239 187404 181211 149154 135655 130115 159078 180785 161042 137955 147903 156842 166735 178002
17227 178002 191819 214688 219557 231297 229448 207310 180278 126778 126299 142604 123544 91832
17215 91832 91759 116182 125974 109190 105158 105394 102306 107642 92623 80201 73808 68823 94021 103953
17201 103953 83314 82838 76565 68940 93337 98553 77450 81878 87652 124134 147346 154881 182323
17188 182323 275639 424137 680546 1073059 1310494 1089231 856685 795154 874225 1133139
17178 1133139 1413203 1224402 841419 651988 555354 492702 425000 409912 418465 446799 509866
17167E09866O6309R7470K30495L94650K20434l21081k89584q3934J07735K87319
17157A219679K70115k40071m75954l03696j33847p0569l5408k4054N861k2839
17147A89217k6092r678j2737q028r338J0671J017k4690m221j4975k4941j35K0175
17134H6245J3091k301O186K2072K001j5581J953J0872j6668q538J964M0240J0248
17121A51784k0273o341k0152k817P915L712J264Q502j2907m0852k0381j752j2049
17108C5653M645N825R973l0063j8264j0952K2219K6265J7373J0446j036J011m025
17095F9070k832j237q503k0028k5743k464Q05R220J6009L0818M396J144J8340
17082H8995J0884j4067k1171k1155J0828L0815o749j2471k5391J395j2631R098
$$ plain form
17167 509866 576175 673645 904140 1298790 1519224 1198143 908559 824625 932360 1219679
17157 1219679 1489794 1249723 773769 470073 336226 265657 230249 206195 212056 189217
17147 189217 163125 153447 140710 132682 123344 134015 135032 110342 106121 91146 66205 66070 86245
17134 86245 99336 97035 103221 125293 127294 111713 113666 124538 107870 99332 101296 141536 151784
17121 151784 131511 125170 105018 102201 110116 113828 115092 123594 110687 69835 49454 47702 35653
17108 35653 40298 46123 56096 26033 7769 -3183 19036 45301 62674 73120 72084 73095 69070
17095 69070 66238 65001 56498 36470 10727 8263 9068 18288 34297 65115 69511 70655 88995
17082 88995 99879 85812 64641 43486 54314 85129 78380 65909 40518 41913 29282 38380
17070C8380K9801n03l3088N4J3427p163K9195N669l068R478n415J3561j1651l0579
17056D8098m600K420K9148L310j1602k7326k1680R941L7266j3471K6717J5320
17044I3541P109K22j3008j796n803m274J2928J0724J0368J7720L22l7045j853
17031H9155o372m2417n677K8228j8738m3833j733L3793K8707j2373k4339q52N202
17018B8751J1272J2532n624J3286O151k0111j7858N366K1462o666k2703j9468
17006F390j2487N065L7849K5488K5605j460J3605m202m5251j2665J5970J5251
16994F9158j6609j452l579J3167J2521M276j714N392j0316l4372j1433J7407K3194
16981F5640p371r264R443O184J4872Q509O109j4072L631P625j376N807l015j7785
$$ plain form
17070 38380 68181 67678 34590 34644 48071 40908 70103 75772 72704 82182 76767 90328 78677 48098
17056 48098 43498 45918 75066 78376 66774 39448 17768 27709 64975 51504 78221 93541
17044 93541 100650 100872 87864 86068 80265 75991 88919 99643 110011 127731 128053 91008 89155
17031 89155 82783 40366 34689 62917 44179 346 -1387 32406 61113 48740 24401 23549 28751
17018 28751 40023 52555 46931 60217 66368 46257 28399 33765 55227 48561 25858 6390
17006 6390 -6097 -1032 36817 62305 87910 86450 100055 95853 50602 37937 53907 69158
16994 69158 52549 51097 47518 60685 73206 77482 75768 81160 70844 36472 25039 42446 65640
16981 65640 58269 49005 58448 64632 79504 88013 94122 80050 83681 91306 89930 95737 92722 74937
16967G4937N409k7446J1828O869j7420J8775J2137r290Q649J8642M555j5873M487
16954I6259P461j2459K5528K0378k812m147K6440j404k908J557Q64J2078P463
16941A74298L5J0829J7070N542P127k3621k6221K3334Q612j2058L433r105J4932
16928A94207K5291M0670p078n0998J8018N6525j0906q260M1149N3804o082m8416
16916B97924k9462k1292l8634k4375J3813K5047J5843k5904l9077O363M2389j7044
16904B05591j4866L9366l736k9667j6456J764O36n513j4862m306k3585l4997q498
16891I0871j6997J213K7376L503Q594k279o637J397k3874j0915M1407K1285J722
16878A36666k356J2074k3256m4458m662L523p05k9375k4778J2230J6287L7648
$$ plain form
16967 74937 80346 52900 64728 71597 54177 72952 85089 75799 84448 103090 107645 91772 96259
16954 96259 103720 91261 116789 137167 134355 130208 156648 155244 152336 153893 154757 166835 174298
16941 174298 174333 185162 202232 207774 214901 191280 165059 188393 197005 184947 188380 179275 194207
16928 194207 219498 260168 253090 202092 220110 276635 265729 257469 298618 352422 346340 297924
16916 297924 268462 247170 208536 184161 197974 223021 238864 212960 173883 180246 222635 205591
16904 205591 190725 230091 226355 196688 180232 181996 182632 177119 162257 157951 134366 99369 90871
16891 90871 73874 75087 102463 105966 114560 112281 105644 107041 83167 72252 113659 134944 136666
16878 136666 134310 146384 123128 78670 74008 77531 76826 47451 22673 34903 51190 88838
16866H8838K4062J1320M0999j2700J90n532k6875k3382J1341K1267K5520K6J567
16853A56641j2055k9521O966j0568M740N1281J3926j1654K3941N280j1451q811
16841A78715j9648J6571L9384l907j8009n407K125K7982N0649J7055R225j2692
16829B82043j6472Q645O9497K3528k886N3551K6106J002P1088M544q2786j0201
16817D27659j6032m1756j9984M4607P2793J0523k693k1897l5734J2585M8512N5905
16805E34488q027l210K7388K7403J7833l03o1789o0510N848l2090m258K7251q560
16792D61464l1859L5699M8450J4502J1539l144J4627K1976P857R266Q474K5178
16780F24029k9848l8081M653M2195K6983O236J8168Q576k023Q105J9111L0396
$$ plain form
16866 88838 112900 124220 165219 152519 152709 147177 120302 96920 108261 129528 155048 155074 156641
16853 156641 144586 115065 122031 111463 116203 167484 181410 169756 193697 198977 187526 178715
16841 178715 159067 175638 215022 211115 193106 187699 189824 217806 268455 285510 294735 282043
16829 282043 265571 274216 343713 367241 364355 417906 444012 445014 516102 520646 437860 427659
16817 427659 411627 369871 349887 394494 467287 477810 475117 453220 417486 430071 478583 534488
16805 534488 526461 523251 550639 578042 595875 595572 533783 473273 479121 447031 442773 470024 461464
16792 461464 429605 465304 513754 528256 539795 536651 551278 573254 581111 590377 598851 624029
16780 624029 594181 556100 560753 602948 629931 636167 654335 662911 660888 668993 688104 718500
16768G18500O3196J01391N6689O2615Q5727J06506J48257K08726L75487N59054
16758B486148M73610j24800j80521J47083Q7141j71312K3660K64285K41333L7129
16748C283756n8567J35589M13621M60716K39245L81099P12562L89131L1569M13576
16738F402297J014131J241083P23217O70680J426695J911244K459295M029512
16730A9878154P009678J2551874K3132141M3121894O1202056J2528796n8340095
16723A21084498m4887408k2602412j0989831n405343k324320R33309N026797J1129040
16715E1964330K1575611M0756423N8800991J4209589n4163761l9203350j3154393
16708H0785440N712546K6293712N7558448Q1869330Q408675q6204898o4482739
$$ plain form
16768 718500 781696 883087 939776 1002391 1088118 1194624 1342881 1551607 1927094 2486148
16758 2486148 2959758 2834958 2654437 2801520 2888661 2717349 2741009 3005294 3246627 3283756
16748 3283756 3225189 3360778 3774399 4235115 4474360 4855459 5568021 5957152 5988721 6402297
16738 6402297 7416428 8657511 9380728 10051408 11478103 13389347 15848642 19878154
16730 19878154 26887832 39439706 62571847 105693741 166895797 179424593 121084498
16723 121084498 76197090 53594678 42604847 37199504 34875184 35808493 40835290 51964330
16715 51964330 73539941 114296364 173097355 187306944 133143183 93939833 80785440
16708 80785440 86497986 112791698 170350146 252219476 260628151 174423253 109940514
16701A09940514l3025851j7086699q621644l298268J023023O220905J5044900
16694G0196880L1060558N9537917Q2344414J0258055q7053369o6232179l4491543
16687F5620733j8908354j1542316p608179n088765l631871k696785j797559j159331
16679A3187573j113790j301066j091239q93945q74953n42986j03676K51008o6000
16670G450926r30318j069263o97413l86074k75744k28499j58758m8744O4796K15599
16660C936508M95273O49973J31459p40146q49951m59185k33821j49924p2644n7229
16650B650313q2462J9185N1939k6272l616M3387P7064J44933J28721Q2904J38804
16639C224900L04775N24946O26563K44674o7244K11993N45800Q73658P45717K71398
$$ plain form
16701 109940514 76914663 59827964 51206320 47908052 48931075 55151980 70196880
16694 70196880 101257438 160795355 243139769 253397824 166344455 100112276 65620733
16687 65620733 46712379 35170063 27561884 22473119 18841248 16144463 14346904 13187573
16679 13187573 12073783 10772717 9681478 8787533 7912580 7369594 7265918 7516926 7450926
16670 7450926 6520608 5451345 4753932 4367858 4092114 3863615 3704857 3656113 3720909 3936508
16660 3936508 4431781 5081754 5213213 4473067 3623116 3163931 2930110 2780186 2707542 2650313
16650 2650313 2567851 2587036 2638975 2612703 2609087 2652474 2729538 2874471 3003192 3086096 3224900
16639 3224900 3529675 4054621 4681184 4925858 4858614 5070607 5616407 6490065 7235782 7507180
16629G507180p8841K95953Q13860J257202J278613M54150O45970J600251K355808
16620A6130146L431602N010650O901976J0653489J8776394L3721915O1992242
16613A56618414Q9195046K6027840p3307282n1735976r102812K8351282O7230680
16606B33277192N2930392o2915055q4331681m7250870k4634266j3508320q055724
16599D5511668m617197j309203J492407N490134J2849777K5607667M7209439O0741749
16591A92976441Q493048n6948575l6970649p152193J8329614M5150251L3161324
16584A97039261m7072097n7269350l1250869j7204465j0520529p125857n307153
16577B1288941l761218k658724j758040j180421j083384j318073j150827o81828
$$ plain form
16629 7507180 7428339 7724292 8538152 9795354 11073967 11528117 12174087 13774338 16130146
16620 16130146 19561748 24572398 31474374 42127863 60904257 94626172 156618414
16613 156618414 245813460 271841300 198534018 146798042 137695230 166046512 233277192
16606 233277192 286207584 223292529 138960848 91709978 67075712 53567392 45511668
16599 45511668 40894471 39585268 41077675 46567809 59417586 85025253 132234692 192976441
16591 192976441 201469489 144520914 107550265 100398072 118727686 163877937 197039261
16584 197039261 149967164 92697814 61446945 44242480 33721951 26596094 21288941
16577 21288941 17527723 14868999 13110959 11930538 10847154 9529081 8378254 7696426
16569G696426j22851O4725m91957r56263o28850k96718l5009J23305r2700o72488
16559D587620p31033n13838l47129k12688j66896j70450j74903j36214r4837j03632
16549A936000p3168l4000l1368l6345p2421j01727n4256k0110n4589p0328l6934
16538A350754l4513n4528n9244n2356k4466n079j6905m1042o0162n4170k2374
16527I25915J3190j3447m1040l0621l0146j4834k2935m0935p950j1208j2961j5441
16515F97587k0136j3656m927O4326M8287M6055J3899l3511m2613O6529L5347n0374
16503H06813l909L495n6559q5590j7332k3969J7603J1074n6434q5195j7512J6979
16491E09464M6189O5328K6364K4267k6408j4569J8691J3288j6997J0693l9342
$$ plain form
16569 7696426 7573575 7638300 7146343 6190080 5561230 5264512 5229503 5352808 5260108 4587620
16559 4587620 3856587 3342749 2995620 2782932 2616036 2445586 2270683 2134469 2039632 1936000
16549 1936000 1862832 1828832 1797464 1761119 1688698 1586971 1532715 1512605 1458016 1387688 1350754
16538 1350754 1316241 1261713 1202469 1150113 1125647 1120568 1103663 1062621 1002459 948289 925915
16527 925915 939105 925658 884618 853997 823851 809017 786082 745147 737197 725989 713028 697587
16515 697587 677451 663795 658868 723194 771481 817536 831435 797924 755311 821840 857187 806813
16503 806813 802904 806399 749840 664250 646918 622949 640552 651626 595192 509997 492485 509464
16491 509464 555653 620981 647345 671612 645204 630635 649326 662614 645617 656310 616968
16480F16968o8656l0503L1710m0562j3535K5308j2032n5135l7808L363l466k534
16468D13118m420o239R057R148p744k3751m6878k5914n135K6839L4844j1866l3496
16455C27563j9363l0291j4388L0861J269j8053K0253M0089k474L934l8285k4704
16443B76411J161L296l2501j3660O472K4487N625J8536r714n464q240n443k973
16430B57993j5869P395J4741J3172J3172k7483n0539k9017J6491K3069J7026J7531
16418B57682k8218k3286k7754l4206n416K1931K0212J8198J1750q839j2936l2826
16406A56292n437J7609O841j749j885l0046m443R339J1249J6658n365o2256l2614
16393G4193K0399K5517K6137L3671j1145n3435k2310r672K5800M3245j0725q166
$$ plain form
16480 616968 548312 517809 549519 508957 495422 520730 508698 453563 415755 419118 415652 413118
16468 413118 408698 402459 411516 420664 412920 389169 342291 316377 311242 338081 372925 361059 327563
16455 327563 308200 277909 263521 294382 295651 277598 297851 337940 335466 339400 301115 276411
16443 276411 277572 280868 248367 234707 241179 265666 271291 289827 280113 274649 266409 260966 257993
16430 257993 242124 249519 264260 277432 290604 263121 212582 183565 200056 223125 240151 257682
16418 257682 229464 206178 178424 144218 138802 160733 180945 199143 210893 202054 189118 156292
16406 156292 150855 168464 175305 173556 171671 141625 137182 146521 157770 174428 169063 106807 74193
16393 74193 94592 120109 146246 179917 168772 115337 93027 83355 109155 152400 141675 133509
16381A33509j174l202J2072j0398K1994K5806k8939j6183J7628J2545P731M330
16369A75719K243l7830J423K0828j263l472j6195k8772k8741j4382J5473J613
16357H6644p853J0808j800l739j6731l705K0196J9161K1596J5873j3345n051m540
16344A17514j1686N486P597j1372k0754l0561o725J9699J3752o162R263J6058
16332A02109j5531J2823L728p695J3934k776j6817m309j1231J6114J3550M743
16320A08642m030L829l00l592m55O368J8373N529K776Q280j8456r563k6409k4284
16306F6708K9909M97q340j4650p904o298K7573K1872m003r384j2075j0773j312
16293G1820R331K3017K783j1509q328j602J9470p081o793j6276m5874k0438M469
$$ plain form
16381 133509 132335 129133 141205 130807 152801 178607 149668 133485 151113 163658 171389 175719
16369 175719 177962 140132 141555 162383 161120 157648 141453 112681 83940 69558 85031 86644
16357 86644 78791 89599 87799 84060 67329 63624 83820 102981 124577 140450 127105 122054 117514
16344 117514 105828 111314 118911 107539 86785 56224 49499 69198 82950 76788 86051 102109
16332 102109 86578 99401 103129 95434 109368 106592 89775 85466 74235 90349 103899 108642
16320 108642 104612 108441 108141 104549 104094 110462 128835 134364 137140 145420 126964 117401 90992 66708
16306 66708 96617 97114 88774 74124 66220 59922 87495 109367 105364 95980 83905 73132 71820
16293 71820 81151 104168 106951 95442 87114 85512 104982 97901 91108 74832 28958 8520 12989
16280A2989K7401Q980K7698J965r34J8108J4996j8009j7619j906J0718j263j6184
16267F6940n787N577l681J5693J0069O383O422o48l8855m785j4077j4208k258
16254B6785N340J0500k390k3766J2553k705k433k389O239L5843K5811R85K640
16241I3013j811m8730k2014P667K476J2475j2303j3292R763L2996J0604J5682
16229H6526K4096J0385k5003j5314l825n927k2752L5J5981L2230m857j3847J3244
16216I0972o697j4730r631j4624K680J0306p636K8950K4074m600j7457j7536k044
16203F2027J4258M449o899k123r292J675P93o526j1895j6700K1038J7669q199
16190F0275P96J8426K9524J7074j6520k7705k128J0450K963j5695j1511Q952K0555
$$ plain form
16280 12989 40390 49370 77068 79033 78099 96207 111203 93194 75575 73669 84387 83124 66940
16267 66940 61153 66730 63049 78742 88811 95194 101616 100968 62113 57328 43251 29043 26785
16254 26785 32125 42625 40235 16469 29022 26317 23884 21495 27734 63577 89388 90373 93013
16241 93013 91202 42472 20458 28125 30601 43076 30773 17481 27244 60240 70844 86526
16229 86526 110622 121007 96004 80690 76865 70938 48186 48221 64202 96432 91575 77728 90972
16216 90972 84275 69545 59914 45290 47970 58276 50640 79590 103664 99064 81607 64071 62027
16203 62027 76285 80734 73835 71712 62420 64095 64888 58362 46467 29767 50805 68474 60275
16190 60275 61071 79497 109021 126095 109575 81870 79742 90192 93155 77460 65949 74901 95456
16177I5456J6500m023j4059K7107J7755J6118N504k469M222K963J2435K1901K5299
16164B24709O1506J30298K57486L52917K55987k80474l87847k04592j03427l1078
16154B75485j6872N184O397M9904J29207K23567L83226L06527k48433l53248j77213
16143E83731p1206N0131J71352L39622K29103l02899l50463j86336j11605n8346
16133B93084j3652j2263J1119M1717J09479K14106L37395K55595k45514l64092
16123F26974k13618j25243n2276l3670l5433l993N220j7020p726j5583l9091k1868
16111F6673L022q857J0304K7493K521p31j749k0764m927k8070l064J3406J2601
16098F7858J3710l260k1153n127q131k230n300j327M583J8910J7868j488k7587
$$ plain form
16177 95456 111956 107933 93874 120981 138736 154854 160358 157889 162111 165074 177509 199410 224709
16164 224709 286215 416513 673999 1026916 1282903 1002429 614582 409990 306563 275485
16154 275485 258613 263797 270194 320098 449305 672872 1056098 1362625 1114192 760944 583731
16143 583731 512525 562656 734008 1073630 1302733 999834 649371 463035 351430 293084
16133 293084 279432 267169 278288 320005 429484 643590 980985 1236580 991066 626974
16123 626974 413356 288113 235837 202167 166734 162741 167961 150941 143215 127632 88541 66673
16111 66673 69695 60838 71142 98635 101156 100425 98676 77912 72985 44915 41851 55257 67858
16098 67858 81568 78308 57155 52028 43897 41667 36367 35040 39623 58533 76401 74913 47326
16085D7326p201Q115J0748K7943k169k3894j9098N63J1542J5856k554q168j6408
16072D2601o45J3820J4359n178k1987R57q982r992M451J3053p550K103n989m17
16058C0604k595J9549J1886K725p265J673J4451J0302l499M459J2679K5101l958
16045A16112m578j5072M463L5386L9102P3775J21258J97630L50332L93382r2640
16034A219150l33860j59133M1823K09477L41385J6783m43732l25865j62488r1320
16024C12220m7870O7J4849m652R982M6539R6676J78873L39093L60796j16337l68118
16012H22118j59423L9791J85223L30554J4073l85698k81588j50689j06619o4180
16002B43562n4180l2847l3252j5469j5824J3363j4772j5822k140O815l26n379
$$ plain form
16085 47326 40125 48240 58988 86931 84762 60868 41770 42333 53875 69731 67177 59009 42601
16072 42601 41956 55776 70135 64957 42970 43927 34945 24953 29404 42457 34907 37010 31021 30604
16058 30604 28009 47558 59444 62169 54904 56577 71028 81330 77831 82290 94969 120070 116112
16045 116112 111534 96462 100925 136311 175413 249188 370446 568076 918408 1311790 1219150
16034 1219150 885290 726157 767980 977457 1318842 1335625 891893 566028 403540 312220
16024 312220 264350 264417 279266 274614 284596 331135 427811 606684 945777 1306573 1190236 822118
16012 822118 662695 702486 887709 1218263 1232336 846638 565050 414361 307742 243562
16002 243562 189382 156535 123283 107814 91990 105353 90581 74759 72619 79434 79108 73729
15990G3729J6274m75j0747k6180J0972K6061K3437J8128k9379j0085j9151k8300
15978D4284k7109k2851m9J7485o97M066J1556k2072K637J6958K7381m548j7630
15965B9411J3619P566r202k1401L564L409j0448j8442o758L0440L227R424p625
15952B6784j1122K2599k3762r792N588l043J4532K5204j2195K423k43j4499k0383
15939B091j3058J812L6219o84J7727K7171j5594m045j8058j8563k8564Q861Q420
15926C735K2829j1283k3153q178J1744R575r574q128k9465j3429J1428N0792K2492
15913B9385j353k2529j1784l09L0551K5971n984k3823j8988J8818K3144k559j7145
15900B3395k4733r720M272M055J9422R8J7872N009J684J7584n981r100j5229j3212
$$ plain form
15990 73729 90003 89528 78781 52601 63573 89634 113071 131199 101820 91735 72584 44284
15978 44284 17175 -5676 -5725 11760 11063 15129 26685 4613 7250 24208 51589 47041 29411
15965 29411 43030 50596 41394 19993 23557 26966 16518 -1924 -8682 21758 24985 34409 26784
15952 26784 15662 38261 14499 4707 10295 7252 21784 46988 34793 37216 36973 22474 2091
15939 2091 -10967 -9155 27064 26380 44107 71278 55684 51639 33581 15018 -13546 -4685 3735
15926 3735 26564 15281 -7872 -16050 -4306 5269 -4305 -12433 -41898 -55327 -43899 6893 29385
15913 29385 28032 5503 -6281 -6590 23961 49932 43948 20125 1137 19955 43099 40540 23395
15900 23395 -1338 -11058 -6786 -2731 16691 16789 34661 39670 41354 58938 52957 43857 28628 15416
15886A5416k0162k7439Q499J6626l601j6621O366L5488K0018Q536L9004j7142
15874F4988j771j8614j6122j3865O422O387M955J6530k0019k3632K428R551p733
15861I505J0331P419M4345L0554k3876l3123j8355Q363l138k7996j4493J3170
15849B706J6286p799K415j4421k3796k40R464M465J6174q896j1565p133J2670
15836i670J5859N059K3553j04j8607j375r909N648L264j5305q344P509L0319M376
15822C2273R83J8521l369k365l577j1763O219r778n592j8651k51J9914j2547o097
15808C920K1798k079J3618K3722j1096L66m449k880l530j8737P970P04m160L142
15794B8309R179k9021l7264j1214Q84K4918P393Q054P882j1779P897K2667j185
$$ plain form
15886 15416 -4746 -32185 -23686 -7060 -10661 -27282 -20916 14572 34590 43126 82130 64988
15874 64988 63217 44603 28481 14616 21038 27425 32380 48910 28891 5259 7687 17238 9505
15861 9505 19836 27255 71600 102154 78278 45155 26800 35163 32025 4029 -10464 2706
15849 2706 18992 11193 13608 -813 -24609 -24849 -15385 -10920 5254 -3642 -15207 -22340 -9670
15836 -9670 6189 11248 34801 34697 16090 14715 4806 10454 13718 -1587 -9931 -2422 27897 32273
15822 32273 33256 51777 48408 46043 42466 30703 36922 27144 21552 2901 2650 22564 10017 3920
15808 3920 25718 23639 37257 60979 49883 50249 45800 42920 39390 20653 28623 29327 25167 28309
15794 28309 37488 8467 -28797 -40011 -39127 -14209 -6816 1238 9120 -2659 5238 27905 26720
15781B6720J3129n807j3531q906K3162J584o898J6100M885J304k9872k090P334
15768B7114k0311L783J7257q254p861L2969M0j9360K740L964J3003j406k7781
15755A5897q445J2829J8696J1167o329j5705q416m52N710j6587l1969R205J0016
15742d383K6330k616j7180J952K0912J003o118n369J9983J1585M769j9085j4330
15729A7453j0695J77P557m407P527M948N176J4359J3559K59j922j6355l1074M189
15715A0751J2364q111j5991j4061P764o420j1570o965N161K9433O279R369r136
15702H867k5127m817L5170K2051n973J9150N483N281j2677n186M301J1103J0151
15689F7777j2437j2949L950j8074j3352r46p083J7415K4000q719L034J1743P182
$$ plain form
15781 26720 39849 34042 20511 11605 34767 36351 29453 45553 50438 51742 21870 19780 27114
15768 27114 6803 10586 27843 19589 11728 44697 44737 25377 28117 32081 45084 43678 15897
15755 15897 7452 20281 38977 50144 43815 28110 19694 19242 24952 8365 -23604 -14399 -4383
15742 -4383 21947 19331 2151 4103 25015 26018 19900 14531 34514 46099 50868 31783 17453
15729 17453 6758 6935 14492 10085 17612 22560 27736 42095 55654 55913 53991 37636 6562 10751
15715 10751 23115 15004 -987 -15048 -7284 -13704 -25274 -32239 -27078 2355 8634 18003 8867
15702 8867 -16260 -21077 14093 36144 30171 49321 54804 60085 47408 42222 46523 57626 67777
15689 67777 55340 42391 46341 28267 14915 13969 6886 24301 48301 39582 42616 54359 61541
15676F1541r173k0209M398J0675j7959K6625M768L234k9951M869K016Q98J1900
15663E3632M011k671l512l5433N068j2400k8382m836j8170K1218O474m534L313
15650a6222K1124K7688p004J1063k135P174O862m4496p054L843n836q957P600
15637f350R210l2783j5263N38L3694K0700q835J2750r166J267n124q344J2546
15624D840K8141o23j3445r791m797K6435J4600j9521j5556j0777K2810K1606L7413
15611H1335k310l2947p883l5302j0658j0573K3104L955p014p702r185M588M2334
15598C1742J141p548R424l951j9596k1736n294J3341L6637J2933l4686k1715l375
15585a2683Q194n675m477l491q933J6923K4561K6890J045L179n906n851N95J2165
$$ plain form
15676 61541 52368 32159 36557 47232 29273 55898 60666 63900 33949 38818 40834 41732 53632
15663 53632 57643 54972 51460 16027 21095 8695 -19687 -24523 -42693 -21475 -15001 -19535 -16222
15650 -16222 4902 32590 25586 36649 34514 41688 48550 4054 -3000 843 -4993 -13950 -6350
15637 -6350 2860 -29923 -45186 -44648 -10954 9746 911 13661 4495 5762 638 -7706 4840
15624 4840 32981 32358 18913 9122 4325 30760 45360 25839 10283 -494 22316 43922 81335
15611 81335 79025 46078 38195 2893 -7765 -18338 4766 8721 1707 -5995 -15180 -10592 31742
15598 31742 32883 25335 34759 30808 11212 -10524 -15818 -2477 34160 47093 12407 -9308 -12683
15585 -12683 -4489 -10164 -14641 -18132 -27065 -10142 14419 41309 42354 45533 39627 33776 34371 46536
15571D6536J3851r642k9808k8874J527L822k512Q733L0800J1736l932j9888m622
15558A7727r363K5549r155Q63r314L546j2811j6103R836K0562J3209J1986j7155
15545B9377j8882j6235J9494n492k0219J4747p963p882K74K0104L2102M395J1932
15532E5752J2902j7096l0382Q275K464l1999Q801J6201K951k129j4972K3633R259
15519D3660j9142j0348j4161j0068K6889J7826n741n968q856o651J8966j139m457
15506B0810R978P151N277m446j0106M519L2047M205k5101k0858j931q27l026r166
15492H526k0130R17P118J4406r326r570K408J79o253R929J4726j382m513p368
15478c33J2066L1652m041k4405O778J6676P334l222J1747j1722M587j7652l1122
$$ plain form
15571 46536 60387 50745 20937 -7937 -6410 -2588 -5100 3633 34433 46169 42237 22349 17727
15558 17727 8364 33913 24758 25621 16307 19853 7042 -9061 775 21337 34546 46532 29377
15545 29377 10495 -5740 13754 8262 -11957 2790 -5173 -13055 -12781 7323 39425 43820 55752
15532 55752 68654 51558 21176 29451 31915 -84 8717 24918 27869 25740 10768 34401 43660
15519 43660 24518 14170 9 -10059 16830 34656 28915 22947 14091 7440 26406 25267 20810
15506 20810 30788 37939 43216 38770 28664 33183 65230 69435 44334 23476 21545 20718 17692 8526
15492 8526 -11604 -10687 -3569 10837 1511 -8059 -5651 -5472 -11725 -1796 12930 11548 7035 -333
15478 -333 11733 43385 39344 14939 21717 38393 45727 42505 54252 42530 47117 29465 -1657
15465a657j1549J278J628j3723J125N601q905J5298r044L787n511J3994L0953
15452B3275j1838l5381m569J2440K3344j0392p167m976J9436K1639J5656k6400
15440A5067j8250K464J7694J9655j4849n505Q703R513p013j77j4808J3314n99
15427B5209J3264J0433q148r991j5347p951K1803M428L576R971j7248j8575L0034
15414D1458Q023k1941l4580m4878J2437M0857J6540n606p035o757P882K6593j0284
15401B2709p154j6310J5093L4786r425p439j5544q61J8239J9827r171j5404k5704
15388C642l299J0002R588J9891J0909N763n570L562l1426k9141k1065Q545J5811
15375b788P858J1869l630O157Q28p911M711j0847m900J311R453K23J491K2016
$$ plain form
15465 -1657 -13206 -11928 -10300 -24023 -22898 -17297 -26202 -10904 -19948 -16161 -21672 -7678 23275
15452 23275 11437 -23944 -28513 -16073 7271 -3121 -10288 -15264 4172 25811 41467 15067
15440 15067 -3183 -719 16975 36630 21781 16276 24979 34492 27479 27302 12494 25808 25209
15427 25209 38473 48906 40758 30767 15420 7469 29272 33700 37276 47247 29999 11424 41458
15414 41458 49481 27540 -7040 -51918 -39481 1376 17916 12310 5275 -1482 6400 32993 22709
15401 22709 15555 -755 14338 49124 39699 32260 16716 15855 34094 53921 44750 29346 3642
15388 3642 343 10345 19933 39824 50733 56496 50926 54488 23062 -6079 -27144 -18599 -2788
15375 -2788 5070 16939 13309 19466 20294 12383 17094 6247 1347 2658 12111 12334 13825 35841
15361C5841n670k2628j6297K2469j2915j308R899K7287k126j7614q421o430K1129
15348B3216K0798j3303k5653k419O098L626J4488Q63j2437m837n360N976j309
15335I747k3183M822J0193j942L1303L431l8438k4042J8044J518M151J5256L888
15322A4748N673J1092j5898j7860m490j6755o426N117P203k828j967J1720m251
15309a4922K6064m86j883n20m177K4161k841k8496K7800P693J268r354K2662J887
15295D8856k8687J699J173P11j9040O843K437j5789M373n291p977K9162K6714
15282D5184O030k3756j4015J2054o42k6314J5049J4017Q663j3120j2651l461k3723
15269a6685J4383J9179J158n925j8255J4590K1141N469j9574j558K0889Q627m859
$$ plain form
15361 35841 30171 7543 -8754 13715 800 -508 9391 36678 34552 16938 8517 2087 23216
15348 23216 44014 30711 5058 2639 8737 12363 26851 27714 15277 10440 5080 11056 9747
15335 9747 -13436 -8614 1579 -363 30940 34371 -4067 -28109 -10065 -8547 -4396 10860 14748
15322 14748 20421 31513 15615 -2245 -6735 -23490 -29916 -24799 -17596 -20424 -22391 -10671 -14922
15309 -14922 11142 10656 8773 8253 4076 28237 25396 -3100 24700 32393 33661 24307 46969 48856
15295 48856 20169 21868 23041 23752 4712 11555 13992 -1797 2576 -2715 -10692 18470 45184
15282 45184 51214 27458 13443 25497 24855 -1459 13590 27607 36270 23150 10499 7038 -16685
15269 -16685 -2302 16877 18035 12110 -6145 8445 29586 35055 15481 13923 34812 43439 38580
15256C8580k3463P851K386n060L492M769o857p168l775J0189J2163k5835j5596
15243h324m769P895J0513O624J0275n196l086K790j480k3370o242K1809K6671
15230C4110l837P373p015o823O886k6696k2970J9232J9173J2123N675K682O820
15217D6733j2658k0431o114L5081j0882p021k0075n457M66m650k580J1693j546
15204B559j4485Q395p998L453R697L167k429M484J3041j8964m579L879o21p107
15190g508K3995J9789q057j1701J821K920Q219J3816j1056l5402l785J7960n345
15177E666N465p41n718o46q37K024j4854j9633j2702P267K1208O987L398J7078
15163A3962N213K941j8042j8618m841J1446J8190p807R500q619P663o476P866
$$ plain form
15256 38580 15117 22968 25354 20294 23786 28555 21698 14530 10755 20944 33107 7272 -8324
15243 -8324 -13093 -5198 5315 11939 22214 17018 13932 16722 15242 -8128 -14370 7439 34110
15230 34110 30273 37646 30631 23808 30694 3998 -18972 260 19433 31556 37231 39913 46733
15217 46733 34075 13644 7530 42611 31729 24708 4633 -824 -358 -5008 -7588 4105 2559
15204 2559 -11926 -3531 -11529 -8076 1621 4788 2359 6843 19884 920 -3659 220 -401 -7508
15190 -7508 16487 36276 28219 16518 18339 21259 29478 43294 32238 -3164 -6949 11011 5666
15177 5666 11131 10390 4672 4026 3189 5213 -9641 -29274 -41976 -34709 -13501 -6514 -3116 13962
15163 13962 19175 22116 4074 -14544 -19385 -7939 10251 2444 11944 3325 10988 4512 12378
15150A2378P661o739J4327J7021J6727k8357n30O159o324k825Q82r536j4495o952
15136f03P962k624J2614j0138m628K562l670j2767J924K894L216K628J4549K9882
15122D3801J5899j1454k6819j9464K3759J5307p755K762k1222j9402K256l913
15110f245k8931J8110J6625l138K5267M261K2344J1504j86l679j8401k4745k2186
15097i400L087L0019j8271j2795K7756J8062L277J777m473j8184o591L296O150
15084B3710J6207o664q878j7088k0108p892M40M520J0343K7108L2544J681o96
15071E5227j6304o463P56j226l1314J2026q522M874L9441k2127l0847M682J9825
15058B0028m738j5462K642j8927R571K9804j926j6177j7543O947J150P87o200
$$ plain form
15150 12378 20039 13300 27627 44648 61375 33018 32488 38647 32323 29498 30380 20844 6349 -603
15136 -603 7359 4735 17349 7211 2583 5145 1475 -11292 -9368 -6474 -3258 -630 13919 43801
15122 43801 59700 48246 21427 1963 25722 41029 33274 36036 14814 -4588 -2332 -6245
15110 -6245 -35176 -17066 -441 -3579 21688 25949 48293 59797 59611 55932 37531 12786 -9400
15097 -9400 -6313 23706 5435 -7360 20396 38458 41735 43512 39039 20855 14264 17560 23710
15084 23710 39917 33253 24375 7287 -12821 -20713 -20273 -15753 -5410 21698 54242 55923 55227
15071 55227 38923 32460 33216 31990 676 12702 4180 9054 48495 26368 -4479 203 20028
15058 20028 15290 -172 2470 -16457 -6886 22918 20992 4815 -12728 -5781 -4631 -3844 -10044
15045a0044j4735K1627J5839j1030K0119J4291K600J818r46k7590k2476Q866J3565
15032A1904L3312j7984j7912j2801O053K8592k607K0941j3005L027k8734J5901
15020B6687K0579m103j1224r878j24Q484O381k5756n180K1244Q130j7867R893
15007B7266J8285J0420J1133Q231k860m2857l5558L005J2280K553R636Q161J2753
14994D2448p03l1163k0266M994O154q687j7391j698L61q684o25K2091L1163K7790
14980D5784J1277j5166q488Q199N58j9222k1583k56J1128p205J3129M172N037
14967B7364p94k406J2178R722l6594k1826p214L387j3602j2713L322J1495K4455
14954c226L2476Q329j6578n903k448L804q787J2551P862j7338k591j0137J2441
$$ plain form
15045 -10044 -24779 -3152 12687 1657 21776 36067 38667 40485 39539 11949 -10527 -1661 11904
15032 11904 45216 27232 9320 -3481 2572 31164 28557 49498 36493 39520 10786 26687
15020 26687 47266 43163 31939 22061 21937 30421 36802 11046 5866 27110 35240 17373 27266
15007 27266 45551 55971 67104 75335 72475 29618 -5940 -2935 9345 11898 21534 29695 42448
14994 42448 41745 10582 -9684 -4690 1464 -7223 -24614 -26312 -25951 -34635 -35260 -13169 17994 45784
14980 45784 57061 41895 33407 41606 42164 22942 1359 1103 12231 5026 18155 22327 27364
14967 27364 26570 24164 36342 46064 9470 -12356 -19570 -16183 -29785 -42498 -39176 -27681 -3226
14954 -3226 29250 37579 21001 15098 12650 16454 7667 20218 28080 10742 8151 -1986 10455
14941A0455J6333J4305J110j1851k4976q937k601L3813K3656k8720n622O264o201
14928A7028l1233k2133L9540K8840k6809l1660m3362J7286M1254J3356o309j0946
14916a5148K194j3258j9074K6068L4176J8844O50j452k2696k0544r322O577p412
14903b0397n395L8403L2129J1550o063q038J8739j5082r14o855o544p129N731
14890C0135o634n69n076J7993J3144k4098m0903M969K0080K0795k6221j6740M092
14877i033N897j7633m1848k77L756K6726Q296O916M320o860J3221K3215n047p750
14863C899k8827k956K5720K2491k7566J7546J3968k0582j2854M869k5073k1294
14851e0659L4485J5614j136R566J4843k5570j189k2761m793P077L3733J4590k0723
$$ plain form
14941 10455 26788 41093 42203 30352 5376 -3561 -6162 27651 51307 22587 16965 23229 17028
14928 17028 -14205 -36338 3202 32042 5233 -26427 -69789 -52503 -11249 2107 -4202 -15148
14916 -15148 -12954 -26212 -45286 -19218 14958 33802 34452 33000 10304 -10240 -19562 -12985 -20397
14903 -20397 -25792 12611 44740 56290 50227 42189 60928 45846 44932 38077 31533 24404 30135
14890 30135 23501 22932 17856 35849 48993 24895 -16008 -11039 9041 29836 3615 -13125 -9033
14877 -9033 -3136 -20769 -62617 -62894 -59138 -32412 -24116 -17200 -12880 -19740 -6519 16696 11649 3899
14863 3899 -24928 -27884 -2164 20327 -7239 10307 24275 3693 -9161 -4292 -29365 -50659
14851 -50659 -16174 -560 -1696 7870 22713 -2857 -4046 -26807 -31600 -24523 9210 23800 3077
14838C077k9108Q490J3297j8407J4358Q276R303J9948J3028K0118j8584l7008
14826F788k0185J5944N883k7572O336K0531J900j2349j4448j7239J0270J6260
14814g881M465L078M958J438K4760l6772k0030J4893J2662K820L058K6825n833
14801B8441R101M683k3339Q092J4122q899K451j3984j9894r702n39j7178K7653
14788A008J6041j5900j8713K073j9804Q995J9031L345K7189K6956j6092k0021
14776A4108R314M593L4443L879k0319l096o664r357M642m100l8455J3920k630
14763B78k6422r671J7009Q092K5179J7907J9180K6888m552J3964O557k5689k0790
14750D7930k3635k7535N632L6674L489k7822k4009j3657J5224J5504K2098j5985
$$ plain form
14838 3077 -26031 -17541 -4244 -22651 -8293 -17 9286 29234 42262 62380 43796 6788
14826 6788 -13397 2547 8430 -19142 -12806 7725 9625 -2724 -17172 -34411 -24141 -7881
14814 -7881 -3416 -338 4620 6058 30818 -5954 -25984 -11091 1571 4391 7449 34274 28441
14801 28441 37542 42225 18886 26978 41100 32201 34652 20668 774 -8928 -9467 -26645 1008
14788 1008 17049 1149 -17564 -15491 -35295 -26300 -7269 -3924 23265 50221 34129 14108
14776 14108 23422 28015 62458 66337 46018 42922 36258 26901 31543 27443 -11012 2908 278
14763 278 -26144 -35815 -18806 -10714 14465 32372 51552 78440 73888 87852 94409 68720 47930
14750 47930 24295 -3240 2392 39066 42555 14733 -9276 -22933 -7709 7795 29893 13908
14738A3908k3813K246J1239k6273j8742K7487N3958J5573l4843r695j5459m6728
14726e1142q462L2187K0124M504J3915l508j4483J808q237r097J3167J5661j5036
14713h599L702N785j4757p144J5542J6743J5424p692J1686K492j8985l0713j2973
14700b9489J1071l498J2995p80j3033m045J7692J9063J5549q60j4135m643k446
14687C441m811K2742j504k3514j34J2698o343O21k40l209M582M908L1886J9352
14673F0475j9668j6483N290l995l476J6506j4710l2880J3717j4949N943j762J999
14660c993P308K2118n878m744j6017J213j165K0756J6006J530n244P326K3417
14647F2633J8531k9711l2690k3936J1439n737l494M241J1085K2706O555j7056
$$ plain form
14738 13908 -9905 -7659 3580 -22693 -41435 -13948 40010 55583 20740 11045 -4414 -51142
14726 -51142 -59604 -27417 -7293 -2789 11126 7618 -6865 -5057 -13294 -22391 -9224 6437 -8599
14713 -8599 -4897 888 -13869 -21013 -5471 11272 26696 19004 30690 33182 14197 -16516 -29489
14700 -29489 -18418 -21916 -8921 -9701 -22734 -26779 -9087 9976 25525 24665 10530 5887 3441
14687 3441 -1370 21372 19868 -3646 -3780 8918 2575 3196 2956 -253 4329 9237 41123 60475
14673 60475 40807 24324 29614 25619 22143 38649 23939 -8941 4776 -10173 -4230 -5992 -3993
14660 -3993 3315 25433 19555 14811 -1206 7 -1158 19598 35604 37134 31890 39216 62633
14647 62633 81164 51453 18763 -5173 6266 529 -2965 1276 12361 35067 41622 24566
14635B4566k291j4836k5754O111Q856O834Q447n898j0029K3307K1331P931K6988
14622G5563J2393j8156l3138n0018m345m463J4974J7923K71k4759J1723N614J8840
14609B2422J4637Q697j7471J6102L0417o550k4970j5583j8365M567J5381k502
14597B6782L342j2537p377j8413k9869j619L0717K8416J8449k4464r824J9365
14585B2968k389n325J9777p482k3320j58l886k489j0402j3755l946J7617q610
14572b1400O485r659O313l98j1218j2125j348K0689K0577Q339J2067L832j6569
14559E585q796J6576L3315P291o482Q704l7979o26r817P354K0358K2740J7232
14546G5455j153k8204j2555n428m736N51K1100r071j1173j6868j7068J9328J6440
$$ plain form
14635 24566 22275 7439 -18315 -12204 -3348 3486 11933 6035 -3994 19313 40644 48575 75563
14622 75563 87956 69800 36662 -13356 -17701 -22164 -7190 10733 11004 -13755 -2032 3582 22422
14609 22422 37059 45756 28285 44387 74804 68254 43284 27701 9336 13903 29284 26782
14597 26782 30124 17587 10210 -8203 -38072 -39691 -8974 19442 37891 13427 3603 22968
14585 22968 20579 15254 35031 27549 4229 4071 185 -2304 -12706 -26461 -30407 -12790 -21400
14572 -21400 -14915 -24574 -18261 -18659 -29877 -42002 -43350 -22661 -2084 6255 18322 22154 5585
14559 5585 -3211 13365 46680 53971 47489 56193 18214 17588 7771 15125 35483 58223 75455
14546 75455 74302 46098 33543 28115 23379 23930 45030 35959 24786 7918 -9150 10178 26618
14533B6618q94p245P245N921j097k0791j1161K9754J2710n714j1673k3105j6502
14520a5934J7220K2132l340K293k512k2279N460J4257o842j7083k0327K4228P770
14507E043M642K3489q816j1309J719j7761L247K6629l3616m545l937n670J0485
14494a0400j466J528K4360K7402L29J0906K693k8867k2111J5405P011k1497k3987
14481a8694R200R789q579j4205k446R613J6109p233O218L2163l9000j7917K7703
14468B721n912K670o76J3366L808k8043l1340J1981M918J2294K1769K8305J6256
14455E2117q933j2959j2292j4756j1312N190J7086N65j668M393Q848J1611j0320
14442B7570R071K1190k4198n0521n122J8595L110j2983J4446J7027L7145k7004
$$ plain form
14533 26618 25724 18479 25724 31645 30548 9757 -1404 28350 41060 35346 23673 568 -15934
14520 -15934 1286 23418 20078 22371 19859 -2420 3040 17297 10455 -6628 -26955 -2727 5043
14507 5043 9685 33174 24358 13049 14768 -2993 254 26883 -6733 -11278 -15215 -20885 -10400
14494 -10400 -11866 -10338 14022 41424 41753 52659 55352 26485 4374 19779 26790 5293 -18694
14481 -18694 -9494 295 -8284 -22489 -24935 -15322 787 -6446 -228 31935 -7065 -24982 2721
14468 2721 -3191 -521 -1197 12169 15977 -12066 -43406 -31425 -26507 -14213 7556 35861 52117
14455 52117 43184 30225 17933 3177 -8135 -2945 14141 14706 13038 17431 26279 37890 27570
14442 27570 36641 57831 33633 -16888 -22010 -3415 -305 -13288 1158 18185 55330 28326
14430B8326n458r815M194k585k4908K7407N379k6715k5781N199n438j027K6111
14417e111Q369l803O370p4J655o273K7106p442k8223p456j2378j6742p783J7727
14403c4058M0525j5466k9334j3664R044M7779k954m375J3479J0513K452N420k0374
14390H987l591J8688J7473Q730l4493o355J2596j2498k3809j9177j4192Q484K3447
14377a5710J2010k4808K0231J1318J5215J7452n519k2583q579Q130R106j4521
14365A742j1212Q983L819J1418K0350m806k3698J2636L1974o428k2537K435J1636
14352C6312k7702r565J1271L725O521k882J8704J1469l6328j2053J0684K4804
14340C4960l914J955P622O507n95k0605m2343l731L0438K3774K5029n717l3440
$$ plain form
14430 28326 22868 13053 17247 14662 -10246 17161 22540 -4175 -29956 -24757 -30195 -31222 -5111
14417 -5111 3258 -545 5825 5751 7406 1133 28239 20797 -7426 -14882 -27260 -44002 -51785 -34058
14403 -34058 6467 -8999 -38333 -51997 -42953 4826 1872 -2503 10976 21489 23941 29361 8987
14390 8987 5396 24084 41557 50287 15794 9439 22035 9537 -14272 -33449 -47641 -39157 -15710
14377 -15710 -3700 -28508 -8277 3041 18256 35708 30189 7606 -973 7157 16263 1742
14365 1742 -9470 -487 3332 14750 35100 30294 6596 19232 51206 44778 22241 24676 36312
14352 36312 8610 -955 10316 14041 20562 17680 36384 47853 11525 -528 10156 34960
14340 34960 31046 33001 40623 47130 46535 25930 -16413 -20144 10294 34068 59097 53380 19940
14327A9940K840J7169l26n338o975l561q377l5323o686J9290M8531J8000l3100
14314B6084l0827J2193J1285J5600K4228r871j2575J4879k0900n1765R246N107
14302g316o021L800N048J5994l929r425j3564m422m221O648j7252j3571q185Q689
14288d7727O284K0617K7037O318n832J0713J4194k7324j7414J4468J9769k799
14276A8304k8702R001J5319j0531K931O984J1548J191j4455j2461k468k3666K256
14263b4749K4847P804j8122j71P341K4261J922k072o803q758o316R922J3462l750
14249A8818j7798o006J8251J9794o255r020P999p939o255K0906j4218l7918k4942
14236d4583J646K1477J7046J2697Q832J0878M691M450j0475J0193K2312m883l4468
$$ plain form
14327 19940 22780 39949 39623 34285 27310 23749 15372 -19951 -26637 -7347 41184 59184 26084
14314 26084 -4743 7450 18735 34335 58563 48692 36117 50996 30096 -21669 -12423 -7316
14302 -7316 -13337 -9537 -4489 11505 7576 -1849 -15413 -19835 -24056 -17408 -34660 -48231 -56416 -47727
14288 -47727 -41443 -20826 6211 12529 6697 17410 31604 4280 -13134 1334 21103 18304
14276 18304 -10398 -1397 13922 3391 6322 13306 24854 26045 11590 -871 -3339 -27005 -24749
14263 -24749 98 7902 -10220 -10391 -3050 21211 23133 21061 14258 5500 -816 9106 22568 18818
14249 18818 1020 -4986 13265 33059 26804 17784 25783 17844 11589 32495 18277 -19641 -44583
14236 -44583 -42937 -21460 -4414 8283 17115 27993 32684 37134 26659 36852 59164 54281 19813
14223A9813j1988M232J3650J0263n338N411l328L15p58K037K25K404J7735k8980
14209B5693j6103o561P921J4158p285r513J3582K1864j4101J4261q510r477j2901
14196A3028j7958j5578O087K1781n283J2395o59j6276j4648M0343J2541k705r716
14183B3352L345P434l589j3349k2524l0574R249J4392n362J172L279O425K3854
14170A7104j4017l430M244j3347q731j8972N247l407J0972j775Q911M886J2841
14157E26k138K868k922o72J9061J2884J66q46o524M749j8145j1541R796L288J0426
14142B0976K000l4660j8466K2995K7091m429p214L140J612j473P487k6648m577
14129a2166L2862J8569j7792j403m867k1176k950K2133Q487j7688J578j6074k190
$$ plain form
14223 19813 7825 12057 25707 35970 30632 36043 32715 33030 32272 34309 34534 36938 54673 25693
14209 25693 9590 3029 10950 25108 17823 8310 21892 43756 29655 43916 35406 25929 13028
14196 13028 -4930 -20508 -14421 7360 2077 14472 13813 -2463 -17111 23232 35773 33068 23352
14183 23352 26697 34131 30542 17193 -5331 -35905 -26656 -12264 -17626 -16454 -13175 -6750 17104
14170 17104 3087 -343 3901 -9446 -18177 -37149 -31902 -35309 -24337 -26112 -17201 -12315 526
14157 526 -1612 1256 -1666 -2338 16723 29607 29773 28927 22403 27152 9007 -2534 7262 10550 20976
14142 20976 22976 -11684 -30150 -7155 19936 15507 8293 11433 13045 11572 19059 -7589 -12166
14129 -12166 20696 39265 21473 20070 15203 -5973 -8923 13210 21697 4009 5587 -10487 -12677
14116a2677r772l516q265j9997o674L1787L6049R686j2205K953M544N631J6073
14103C3617k2608m714K2327J5504O247j6076j8517k482m960N997K654O317n867
14090A7439j8981j5040m897Q759k12k0625m873j3551J6598K7563J0886N287p330
14077A023j3782K2160p702j019J9923j4835N339j4259L111n741K2696K2177l070
14064C6021k6896L383K1211j8517j8532j1355J1011O483J6296J3518N669R510
14052D7802P273m592q54j9794k1862n062R454k6928Q495Q861n657K301J8618j5339
14038B716k9328j4892K5136P613R55l03J360J7582J4904P319L555k0512O60m138
14024A2627l6738J165N1679K0509L132j0633l676J296l5456j9780P386J8313J154
$$ plain form
14116 -12677 -22449 -25965 -34230 -54227 -60901 -29114 6935 16621 4416 7369 11913 17544 33617
14103 33617 11009 6295 28622 44126 50373 34297 15780 13298 8338 14335 16989 23306 17439
14090 17439 -1542 -16582 -21479 -12720 -12932 -33557 -38430 -51981 -35383 -7820 3066 8353 1023
14077 1023 -12759 9401 1699 680 20603 5768 11107 -3152 -41 -5782 16914 39091 36021
14064 36021 9125 12508 33719 15202 -3330 -14685 -3674 2809 19105 32623 38292 47802
14052 47802 55075 50483 49629 29835 7973 2911 12365 -14563 -6068 2793 -2864 -563 18055 2716
14038 2716 -26612 -41504 -16368 -8755 -7800 -8103 -6743 10839 25743 33062 36617 16105 16765 12627
14024 12627 -24111 -22946 28733 49242 52374 41741 38065 39361 3905 -15875 -8489 9824 10978
14011A0978j9509K917j3641j406M2382J8343j6990m2548r286K1718O900r818O184
13998c776O95J8479o870k2185k816J3528j313J7489J5627N006J2336J3608p425
13985E2383jJ1180l2825o550o230j5867J0820J2904k869r798O586K0574K421J158
13971D3886K389J0978k4317R76n087o977P467J1400R353n507J152j1593j5407
13958A8713M936j0712N026p05k4743j032K9538J4497r995k6846j3850n654j9172
13945c9999J0353K2868j2077k6796J5197K2937K378j356J4185K671J0714J549
13933B2624j316J1592n353j3910N733r760q639j3711j0163N01k62j4954R080M276
13919b4262k1738K1368J4590M5Q753J7922J581K0346j3617M785k2121q081J3953
$$ plain form
14011 10978 -8531 -5614 -19255 -20661 21721 40064 23074 -19474 -28760 -7042 -142 -9960 -3776
13998 -3776 -3081 15398 8528 -13657 -16473 -2945 -4258 13231 28858 33864 46200 59808 52383
13985 52383 52382 63562 30737 24187 17957 2090 12910 25814 22945 13147 19733 40307 42728 43886
13971 43886 46275 57253 32936 33912 28825 21848 29315 40715 50068 44561 45713 34120 18713
13958 18713 23649 12937 17963 17258 -7485 -8517 21021 35518 25523 -1323 -15173 -20827 -39999
13945 -39999 -29646 -6778 -18855 -45651 -30454 -7517 -5139 -6495 7690 10361 21075 22624
13933 22624 21308 32900 27547 13637 19370 9610 971 -12740 -22903 -22402 -22664 -37618 -28538 -24262
13919 -24262 -46000 -24632 -10042 -9997 -1244 16678 18259 38605 24988 29773 7652 -429 13524
13906A3524O421J6618O353l643o689M497M256l2981k4895j5900L8781K2201n040
13893B3503l3958j1742q297J5675J6565J9342P118Q643N51o606j1792J2474j9015
13880A2461o125N913r834j701P449Q772J324m177j1629k590N562J462J2550o081
13866A3356j8070M820M153K3593l061j7835j6462p816p827r492J7356m657j920
13853b3862p490p792K7205K1740N946p769l3018N647m786J4992J9058n911j2311
13840h351j540k076j861l539K4791k194p842K9629q222k3252Lk2506r66J1769
13826a6157L2271k222j6168p182J5522Q065r346R486L2021J1830j6653j9596j2500
13813I371J7589l099k0479j4122J5083L973N2n216j190L112J0105k032K3657R392
$$ plain form
13906 13524 19945 36563 42916 39273 32584 37081 41337 8356 -16539 -32439 6342 28543 23503
13893 23503 -10455 -22197 -30494 -14819 1746 21088 28206 36849 37400 30794 19002 31476 12461
13880 12461 6336 12249 2415 714 8163 16935 18259 14082 2453 -137 5425 6887 19437 13356
13866 13356 -4714 106 4259 27852 24791 6956 -9506 -17322 -25149 -34641 -17285 -21942 -23862
13853 -23862 -31352 -39144 -11939 9801 15747 7978 -25040 -19393 -24179 -9187 9871 3960 -8351
13840 -8351 -9891 -11967 -13828 -17367 7424 5230 -2612 27017 18795 -4457 -4454 -26960 -27926 -16157
13826 -16157 16114 13892 -2276 -9458 6064 14129 4783 14269 46290 58120 41467 21871 9371
13813 9371 26960 23861 3382 -10740 4343 8316 8368 3152 1962 5074 15179 13147 36804 46196
13799D6196q961M667k596o412k0370l773n613l789j7154m550J1990k3701l932
13786c7998K7272J8258J7807j0271j6757J3033j3039J8803j4081Q734l4047r594
13774c1880j219J1213j5285J6896L7993Q577M519n823j6285l3917j9737J8021
13762b6927P694j3135m513K4599J2760J3127j53k132r548j2709j1735j1129Q228
13749b5573R551N963n474J6592p695K1822J8128J1575k5141k7918Q945O555K2694
13736C0024l028j5584k2429r133K19M067k687j2752p890N362J6500Q859K2594
13723A4122j5360l3275m6k028j7586P567J9246J5464J0543J0987n663j505J067
13710C533r569K0424j5172j5353J8941P010J5772j184j7790j0277Q644M33j6827
$$ plain form
13799 46196 37235 41902 39306 32894 12524 8751 3138 -651 -17805 -22355 -10365 -34066 -37998
13786 -37998 -10726 7532 25339 15068 -1689 11344 -1695 17108 3027 11761 -22286 -31880
13774 -31880 -33099 -21886 -37171 -20275 17718 26295 30814 24991 8706 -25211 -44948 -26927
13762 -26927 -19233 -32368 -36881 -12282 478 13605 13452 11320 1772 -10937 -22672 -33801 -25573
13749 -25573 -16022 -10059 -15533 1059 -6636 15186 33314 44889 19748 -8170 775 7330 30024
13736 30024 26996 11412 -11017 -20150 -19931 -15864 -18551 -31303 -39193 -33831 -17331 -8472 14122
13723 14122 -1238 -34513 -34559 -36587 -54173 -46606 -27360 -11896 -1353 9634 3971 2466 3533
13710 3533 -6036 14388 -784 -16137 2804 9814 25586 24402 6612 -3665 4979 5412 -11415
13697a1415k5050K6960J7132J7869P094L066m906k1315K03K619r13J3953j3040
13684A2257q197J3573l5706n991J2699K7822J8870r869k2744p254J0945J8557
13672B4962q899J221l888r063J7693j7124k5449O430J4018L4970j0960k579J1964
13659C3296J3255l1112k0780j1902J998m982o156j9883P070K3779J4221k1100
13647b2296j0880j2501J5811m669j0563j1192O218M046n958J1712J2940J3954
13635a3378R848j4224P069K0211J955P31J805n9Q970L527j4746j033K3442j8487
13621A5631j0097j6163j777K0167K2577M799p610J0658O506J1318j2181k9503
13609A4325r461j0325j0530L269Q049K1987J8412q64n679k0490p948n625J9132
$$ plain form
13697 -11415 -36465 -9505 7627 25496 32590 35656 30750 9435 9638 12257 11344 25297 12257
13684 12257 4060 17633 -18073 -24064 -11365 16457 35327 25458 2714 -4540 6405 24962
13672 24962 16063 17284 13396 4333 22026 4902 -20547 -14117 -99 34871 23911 21332 33296
13659 33296 46551 15439 -5341 -17243 -15245 -20227 -26383 -46266 -39196 -15417 -1196 -22296
13647 -22296 -33176 -45677 -29866 -34535 -45098 -56290 -50072 -46026 -51984 -40272 -27332 -13378
13635 -13378 -3530 -17754 -10685 9526 11481 12212 14017 13958 22928 26455 11709 10676 34118 15631
13621 15631 5534 -10629 -12406 7761 30338 35137 27527 38185 44691 56009 43828 14325
13609 14325 4864 -5461 -15991 -12722 -4673 17314 35726 34862 29183 8693 745 -4880 14252
13596A4252L1674k5379k9903O776Q57R960R941J3105j1645m291j5687J3994j2974
13583F80P664J7604n589j7529k1358k2787o351J4603J6562p249k5584J1873J7345
13570b0116N731J9846P110j1181j5921J090O076k0825L0533J8531j2175k8677
13558a9978k2277K29J3494K1876J6376K0438J1691O444M101r297j1530l4193P187
13545D561K6080J6004O987l6668l2837j5407L6756K4783j9542P9j3738q933o222
13532a8097J1510M0643M809r953k0269n890o09j2950r777Q114M131j231J0021
13519D52R327O804o991j1007k7406l6393K2162J2529J4233j131L9333l1210Q015
13506a283L1115Q363r303k2246j1159n594j4764J5993J4499k1344j0897J861J2795
$$ plain form
13596 14252 45926 20547 -9356 -2580 -1723 8237 18178 31283 19638 15347 -340 13654 680
13583 680 8344 25948 20359 2830 -18528 -41315 -47666 -33063 -16501 -23750 -49334 -37461 -20116
13570 -20116 -14385 5461 12571 1390 -14531 -13441 -7365 -28190 2343 20874 8699 -19978
13558 -19978 -42255 -42026 -28532 -6656 9720 30158 41849 48293 52394 43097 31567 -2626 4561
13545 4561 30641 46645 53632 16964 -15873 -31280 5476 30259 10717 10796 -2942 -11875 -18097
13532 -18097 -6587 34056 38865 28912 8643 2753 2144 -10806 -20583 -12469 -8338 -9569 452
13519 452 9779 16583 9592 -1415 -28821 -65214 -43052 -30523 -16290 -17421 21912 -9298 -1283
13506 -1283 29832 38195 28892 6646 -4513 -10107 -24871 -8878 5621 -15723 -26620 -24759 -11964
13493a1964L8197J8979j8309k5214j037J3344j5238J6834J7552l388j8355O745
13481A8146K044o9k3329n208j003j3846o357K5399J2232J0931q00r821l717k6116
13467b1514P837J7964K9194j2683l0950o09J6945L6509j1870j5497j4683M793
13455E436P726M009L102L95r106q433K7786J4343q414k2407j8730k8256n835J3618
13441b4766K3858L8136j0914j0207J1152r325j5115p714j2627j2243r16L1151
13429D70J5621P495n844K45j0039R303N273o301K7367M776m154k2313q387J562
13415A5074M477Q73j3301j288K239L2266K5490q929n8029q707J9587L284n755
13402G281P099J8835j4252L43k0258k0027J2139J2181J3944R094j5027j2807J7848
$$ plain form
13493 -11964 26233 45212 26903 1689 652 13996 -1242 15592 33144 29756 11401 18146
13481 18146 20190 20121 -3208 -8416 -9419 -23265 -29622 -4223 8009 18940 18140 8319 4602 -21514
13467 -21514 -13677 4287 33481 20798 -10152 -10761 6184 42693 30823 15326 643 5436
13455 5436 13162 17171 20273 20668 11562 3129 30915 45258 36844 14437 -4293 -32549 -38384 -24766
13441 -24766 -908 37228 26314 16107 27259 17934 2819 -4895 -17522 -29765 -30681 470
13429 470 16091 23586 17742 17987 7948 17251 22524 16223 43590 48366 44212 21899 13512 15074
13415 15074 19551 20424 7123 5835 8074 40340 65830 56901 -1128 -9835 9752 13036 7281
13402 7281 14380 33215 18963 19306 -952 -20979 -8840 3341 17285 26379 11352 -1455 16393
13389A6393m479k7534j2674Q743J8018J931L640J2343J6300R25J713k2556J098
13376A3861j0843J0704J5718k2120k1010J4161Q181j1406j489J6379O459J3956
13364C2551J8644k3983r610J8120k2846k5497j4002j7573J0089J601O592N672
13352b0242j2317K784j4123O53K2547j091k3710K4422K4938J4335J6244j1743
13340B2697k8336k6060q955k580k920J0535L282o395J3405J9852j2409J0673L5408
13327B8197M522j8445j1278k2950j7410J8753J7267k3761j853M5996M1213J2476
13315G2727n74j0830p832j2398o510J2561J0518k5260k6698N746J0545J3074O07
13302C5676P245k327k3540j8415R94p202q99j78K8091J1551k6625l0604N137K035
$$ plain form
13389 16393 11914 -15620 -28294 -19551 -1533 398 4038 16381 32681 33606 35319 12763 13861
13376 13861 3018 13722 29440 7320 -13690 471 8652 -2754 -4243 12136 18595 32551
13364 32551 51195 27212 17602 35722 12876 -12621 -26623 -44196 -34107 -32506 -25914 -20242
13352 -20242 -32559 -29775 -43898 -43245 -20698 -21789 -45499 -21077 3861 18196 34440 22697
13340 22697 -5639 -31699 -40654 -43234 -46154 -35619 -32337 -38732 -25327 -5475 -17884 -7211 28197
13327 28197 32719 14274 2996 -19954 -37364 -18611 -1344 -25105 -26958 19038 60251 72727
13315 72727 72153 61323 53491 41093 34583 47144 57662 32402 5704 11450 21995 35069 35676
13302 35676 42921 40594 17054 -1361 -367 -7569 -8468 -8646 19445 30996 4371 -26233 -21096 -19061
13288a9061k1785K2029N613L865K326j2082J0077J0750j6814J6425O541l940J8754
13275B2698O356n812R437J4139J3217J369l5181K114r41P380m098j2503N674n161
13261A8688k2387j798J9777K136j4209N577J4502Q140k6774l5176J9562N344j1901
13248a8519J164J1856K5105q10J5421l03J0946j9897k3462j7653L490J3459J6654
13235A7451J5691J1960k770j2517q201K959j9821L224L870n69j0738K0827m863
13222A6503K115j1587K607p530j3913j2746J5705J3819p669n327n132j3182J1698
13209a4639J0713O759O075n457n553n407l575K0641O177p130p277k4632j4392
13196c7697k0202J5104L4774J7214P303j5709q346R395J7628O497M321n932j8802
$$ plain form
13288 -19061 -40846 -18817 -13204 -9339 -7013 -19095 -9018 1732 -15082 1343 7884 3944 22698
13275 22698 29054 23242 32679 46818 60035 61404 26223 28337 27396 34776 30678 18175 23849 18688
13261 18688 -3699 -5497 14280 16416 2207 7784 22286 30426 3652 -31524 -11962 -6618 -18519
13248 -18519 -17355 -5499 19606 18796 34217 33914 44860 24963 1501 -16152 -12662 797 17451
13235 17451 33142 45102 42332 29815 21614 24573 4752 7976 11846 11277 539 21366 16503
13222 16503 18618 7031 9638 2108 -11805 -24551 -8846 4973 -2696 -8023 -13155 -26337 -14639
13209 -14639 -3926 2833 8908 3451 -2102 -7509 -11084 9557 15734 8604 1327 -23305 -37697
13196 -37697 -57899 -42795 -8021 9193 16496 787 -7559 1836 19464 25961 30282 24350 5548
13183E548l6616L206r05J3336K1119k2437r3L024n267r545P031J4686M718L323
13169A128l432J0388j5509P046q887K881P694j92k6664k8754n644K6559L6988
13156C602Q121j2341j5940m407J873J2682J2717j177L999J3040J3269R445p487
13143C7396m808l2072j4797J216O546k883k130K9461M3544L354k3877j9315k175
13130A9460j1538k1145o868N842K6755J7089J4517q694j7814P748Q274J3774n37
13117D6863k3958j2292q511M704J3150p723j1283K2018L040n271Q232J5712J391
13104D6072j6319J1087q670m3693o110Q743q55J4003J8571p748r646k1296J4264
13091a597J732j9356J1350N230m41J6126N011N80j431o169j2845L226n840j9961
$$ plain form
13183 5548 -31068 -27862 -28767 -15431 5688 -16749 -16842 -13818 -19085 -28630 -21599 -6913 -2195 1128
13169 1128 -2304 8084 -7425 -379 -9266 -6385 1309 1117 -25547 -54301 -59945 -33386 3602
13156 3602 11723 -618 -16558 -20965 -19092 -6410 6307 5130 9129 22169 35438 44883 37396
13143 37396 32588 516 -14281 -13065 -6519 -9402 -11532 17929 61473 64827 40950 21635 19460
13130 19460 7922 -13223 -20091 -14249 12506 29595 44112 35418 17604 25352 33626 47400 46863
13117 46863 22905 10613 2102 6806 19956 12233 950 22968 26008 20737 28969 44681 46072
13104 46072 29753 40840 32170 -11523 -17633 -8890 -9745 4258 22829 15081 5435 -15861 -1597
13091 -1597 135 -19221 -7871 -2641 -3082 13044 18055 18635 17204 11035 -1810 1416 -4424 -24385
13077b4385j8771j438k0826J8498K1526J0768o291J4856n769P139J2401q031j5027
13064a5350m072N504Q363q096j43K1025K814j6551j138K2357J460p904j1771k632
13050f134J6164J0734j1890k4081J3331N737l876j073N322J6488k731j1736k1043
13037a4788J9775K8280p96j1674J5186q510n282k3373N61K4497K7633l004k9481
13024A9024k1084q175j2752n950J7009K9927J6273Q856p269J3590R731o051k1924
13011C1205r953j7219j7783j4092O950R145K895J3519P040Q015J0616j8861j3714
12998b237j9429j4186J0115j4842k3315J5251L5953o913j1738p415J496J371J6708
12985a9181K5428J2110r357j6294J5098R435q770j3200j5437J7867J2300j144
$$ plain form
13077 -24385 -43156 -44594 -65420 -46922 -25396 -14628 -20919 -6063 -11832 -4693 7708 -323 -15350
13064 -15350 -19422 -13918 -5555 -13651 -13794 7231 10045 -6506 -7644 14713 16173 8269 -3502 -6134
13050 -6134 10030 20764 8874 -15207 -1876 3861 -15 -1088 4234 20722 17991 6255 -14788
13037 -14788 4987 33267 32471 20797 35983 27473 22191 -1182 -621 23876 51509 48505 19024
13024 19024 -2060 -10235 -22987 -28937 -11928 17999 34272 43128 35859 49449 59180 53129 31205
13011 31205 21252 4033 -13750 -27842 -20892 -11747 -8852 4667 11707 19722 30338 11477 -2237
12998 -2237 -21666 -35852 -25737 -40579 -63894 -48643 -12690 -19603 -31341 -38756 -37260 -35889 -19181
12985 -19181 6247 18357 9000 -7294 7804 17239 8469 -4731 -20168 -2301 9999 8855
12973H855j3580j9887K1697K3694j3519m49o91j9142p044j0391L0341M1740j5460
12960B6164j5260p21J1954j288k075P248j7452k1223l742L185J3628j1177N673
12947e086O025o868r35j6765N438K7795K0483j3800n516N73r055j8724r122O274
12933a9283j036j669n91J2193J7428M860O523nj6000n050P978j5988j0187l004
12919b3831L3742j5968j3379j3118J2620Q969K6005L739r088M224n68m606J5724
12906B4465l679p81j2110j0912K8826l57k3478o542j33K270n759n55J6135m196
12892C194o15j5944J2547L0340q177q176K358l826l7095j0517L7364K3821k405
12879B2869m0556k1051O338L5811l522j9588r087J0814K4055k1126j9676l678
$$ plain form
12973 8855 -4725 -24612 -2915 20779 7260 6811 6120 -13022 -20066 -30457 -116 41624 26164
12960 26164 10904 10183 22137 20849 18774 26022 8570 -12653 -16395 -13210 418 -10759 -5086
12947 -5086 939 -5929 -6864 -23629 -18191 9604 30087 16287 10771 11344 2289 -16435 -25557 -19283
12933 -19283 -20319 -21988 -22579 -10386 7042 11902 18425 18420 2420 -2630 5348 -10640 -20827 -23831
12919 -23831 9911 -6057 -19436 -32554 -19934 -10965 15040 18779 9691 13915 13347 8741 24465
12906 24465 20786 20005 7895 -3017 25809 25452 1974 -4568 -4701 -2431 -8190 -8745 7390 3194
12892 3194 2579 -13365 -818 29522 21345 13169 15527 11701 -25394 -35911 1453 25274 22869
12879 22869 -17687 -38738 -32400 3411 -111 -19699 -28786 -17972 6083 -15043 -34719 -38397
12867c8397J8000j626N308m966Q490J8056J7071j6924k695J3225K0904r204k7789
12854e47j6769r786J1962j0511o755j4304M285J3623P006M19j1439l597J120J2099
12840b3194K8263J6810J0297m888k0924j2035J0196J8444K4757K2128j7836k8609
12828B3409j0275l5681m748J9519K5726J0688o671j3471j9806m277O019M681k840
12815g727M084J7301n631j2521J7874J3181J0448P124r294m050k1613J890J0818
12802B1884O064J4223o085j7274k2088J0788p019J1076J2944j6305L36R587K261
12789B0392j027k6778r34N788K3645j0864j9400N587J4116k8155k6916J3382J7089
12776a4075L660J165J9568L952l561j6154J1113K3980L250k823k8447j3822j3821
$$ plain form
12867 -38397 -20397 -22023 -16715 -21681 -13191 4865 21936 5012 2317 15542 36446 27242 -547
12854 -547 -17316 -27102 -15140 -25651 -32406 -46710 -42425 -28802 -21796 -21377 -32816 -36413 -35293 -23194
12840 -23194 5069 21879 32176 27288 6364 -5671 4525 22969 47726 69854 52018 23409
12828 23409 13134 -22547 -27295 -7776 17950 28638 21967 8496 -11310 -15587 -9568 -4887 -7727
12815 -7727 -3643 13658 8027 -4494 13380 26561 37009 44133 34839 30789 9176 11066 21884
12802 21884 27948 42171 36086 18812 -3276 7512 493 11569 24513 8208 8544 18131 20392
12789 20392 19365 -7413 -8347 -2559 21086 10222 -9178 -3591 10525 -17630 -44546 -31164 -14075
12776 -14075 -10415 -9250 10318 14270 10709 -5445 5668 29648 32898 30075 1628 -12194 -26015
12763b6015J0815j1118M544J4963Q441k619j0440J7917K2041M845J248j2633k8130
12750f141j5703j2457J7729J8063j402j8896J0802j009J0032L85k149n956o879
12737a3581M183P456R736k3963o104K918J5917j3091j2885J6760J2872Q581O922
12724A5721K714j3199j1634j1008K4086K141k864J4086j4849k6033k223K0395
12712b667J4411L120J014K6178j0053l8791j9873P077J8259K3098R506j3187j4599
12699C493P12K5543j6213O603P173l0533q875M252J5972R998R81j6497K429o057
12685a019P376j3701L91j25P935l084j8222m04O396J1120R670m840J6435J1307
12671B9235K522j0744j4485j507j897j5771k0759j2283L2820J5905R120j0550
$$ plain form
12763 -26015 -15200 -26318 -21774 -6811 1630 -989 -11429 6488 28529 33374 34622 21989 -6141
12750 -6141 -21844 -34301 -16572 1491 89 -18807 -8005 -9014 1018 1403 -746 -6702 -13581
12737 -13581 -9398 -1942 7794 -16169 -22273 -19355 -3438 -16529 -29414 -12654 218 8799 15721
12724 15721 18435 5236 -6398 -17406 6680 8821 5957 20043 5194 -20839 -23062 -2667
12712 -2667 11744 14864 15878 42056 32003 -6788 -26661 -19584 -1325 21773 31279 18092 3493
12699 3493 4205 29748 13535 20138 27311 -3222 -12097 -7845 8127 18125 19106 2609 5038 -1019
12685 -1019 6357 -7344 -6953 -7078 857 -2227 -20449 -20853 -14457 -3337 6333 1493 17928 29235
12671 29235 31757 21013 6528 5021 3124 -12647 -33406 -45689 -12869 3036 12156 1606
12659A606L407N734j394j8624K323n909l939K3745O095k501J4366m111P301M677
12645C2776j570k7152N928N342m637M601j8626j0269K0345R924k36J2147k557
12632B6016Q979j2022k378J1018l000q812j8687K520J8770J2697R820j4735j1823
12619A8363r219j1609j1414o794Q937l432J9760o040q6P801j5449K6364J9610
12606C6792j9603l839o684J9769j594r745N015p012k4572o427K0501k190k4801
12593b4390j849M690j2481R59K737R34J2234k5929L23J7800N314L5216j0664j9695
12579a4801q137K4167k728n512J881j2698J6440J8961R649m783k2419j7261j0113
12566b7354n457K1932J9075j574n702l0482p258K3418K715o664j9661k383K8006
$$ plain form
12659 1606 5013 10747 9353 -9271 -6948 -12857 -16796 6949 13044 10543 24909 20798 28099 32776
12645 32776 31206 4054 9982 15324 10687 15288 -3338 -13607 6738 16662 16426 28573 26016
12632 26016 34995 22973 20595 31613 28613 19801 1114 3634 22404 35101 44921 30186 18363
12619 18363 9144 -2465 -13879 -20673 -11736 -15168 4592 -1448 -1534 6267 -9182 17182 36792
12606 36792 17189 13350 6666 26435 24841 15096 20111 13099 -11473 -17900 2601 411 -24390
12593 -24390 -26239 -21549 -34030 -33071 -30334 -29400 -17166 -43095 -42772 -24972 -19658 15558 4894 -14801
12579 -14801 -22938 1229 -1499 -7011 -5130 -17828 -1388 17573 27222 22439 20 -17241 -27354
12566 -27354 -32811 -10879 8196 6622 920 -29562 -36820 -13402 -10687 -17351 -37012 -39395 -11389
12553a1389L3468q246j3633p118P569L0156l525m3625J344L7116K1j0008j7936
12540e806o006J1232J1046M752k0872O272J2266k5274j692j5952J7624k949k0694
12527c6053L7398K1352k0954R480K4449K4327j2162k6032o483j1106K1579K1335
12515D7130p539k6299Q735R250o404k3299j0681K457K3933K816J0050l0626j5520
12502a5997j0786K055O467l328Q812J5580J9602k174m600l367J2977P394o130
12489B6505J2472k451p615r009j6922O595J3207L755K2667K4596m3796k1513j7837
12476i346O56j6101k733J5571L721r428r949Q122O534j365K5537j100J0217k0456
12462a20k2209L437j1138O054K1544L133K2751K1944j3984j0715o444m030k9006
$$ plain form
12553 -11389 22079 13833 200 -6918 651 30807 27282 -16343 -14999 22117 22138 12130 -5806
12540 -5806 -11812 -580 10466 15218 -5654 618 12884 -12390 -14082 -30034 -12410 -15359 -36053
12527 -36053 1345 22697 1743 11223 35672 59999 47837 21805 15322 4216 25795 47130
12515 47130 39591 13292 22027 31277 24873 1574 -9107 -6650 17283 20099 30149 -477 -15997
12502 -15997 -26783 -24728 -18261 -21589 -12777 2803 22405 20231 15631 12264 25241 32635 26505
12489 26505 38977 36526 28911 19902 2980 9575 22782 26537 49204 73800 30004 8491 -9346
12476 -9346 -8690 -24791 -27524 -11953 -8232 -17660 -27609 -19487 -12953 -14318 11219 10119 20336 -120
12462 -120 -22329 -18892 -30030 -23976 -2432 701 23452 45396 31412 20697 14253 10223 -18783
12449a8783j1303J0801O216P653J507k701j3594n500K2823K1836k2751k3881J0301
12436a7376J9753J5172K612j6934j9072O695K1499p261J176n138n524r847p561
12423b1806N782P93J7288M045j0619n296J0883J184k1999j5874k715Q459J2764
$$ plain form
12449 -18783 -30086 -19285 -13069 -5416 -3909 -6610 -20204 -25704 -2881 18955 -3796 -27677 -17376
12436 -17376 2377 17549 20161 3227 -15845 -9150 12349 5088 6264 1126 -4398 -14245 -21806
12423 -21806 -16024 -15231 2057 6102 -4517 -9813 1070 2254 -19745 -35619 -38334 -29875 -17111
$$ [...]
##END NTUPLES=NMR SPECTRUM
##END=
