##TITLE=Analysis number 325269
Compound Code cc 05702
Project Code adrs
Chemist Name creative chem
##JCAMPDX= 6.0         $$ Bruker NMR JCAMP-DX V2.0
##DATA TYPE= NMR SPECTRUM
##DATA CLASS= NTUPLES
##ORIGIN= Bruker BioSpin GmbH
##OWNER= nmr
$$ XWIN-NMR		Version 3.5
$$ Mon Dec 18 10:46:34 2006 GMT Standard Time (UT+0h)  MAYBRIDGE\nmr@NMR_250MHZ
##.OBSERVE FREQUENCY= 250.131544655141
##.OBSERVE NUCLEUS= ^1H
##.ACQUISITION MODE= SIMULTANEOUS (DQD)
##.ACQUISITION SCHEME= undefined
##.AVERAGES= 16
##.DIGITISER RES= 18
##SPECTROMETER/DATA SYSTEM= dpx250
##.PULSE SEQUENCE= zg30
##.SOLVENT NAME= DMSO
##.SHIFT REFERENCE= (INTERNAL, DMSO, 0, 16.522)
##AUDIT TRAIL= $$ (NUMBER, WHEN, WHO, WHERE, WHAT)
$$ ##TITLE= Audit trail, XWIN-NMR		Version 3.5
$$ ##JCAMPDX= 5.01
$$ ##ORIGIN= Bruker BioSpin GmbH
$$ ##OWNER= nmr
$$ C:\u/data/dgb/nmr/ADRS/1780/pdata/1/auditp.txt
$$ ##AUDIT TRAIL=  $$ (NUMBER, WHEN, WHO, WHERE, WHAT)
(   1,<2006-12-18 10:45:50.82 +000>,<MAYBRIDGE\nmr>,<NMR_250MHZ>,
      <created by zg, POWCHK disabled, PULCHK disabled
       configuration hash MD5:
       49 4B E0 1D 92 C2 6B 37 9F E6 65 BC 52 41 86 1D
       data hash MD5: 64K
       09 7D C9 86 9C B1 8B C5 C6 FE 20 FD 8C ED F9 52>)
(   2,<2006-12-18 10:46:13.46 +000>,<MAYBRIDGE\nmr>,<NMR_250MHZ>,
      <Start of raw data processing
       ef LB = 0.3 FT_mod = 6 PKNL = 1 SI = 32K 
       data hash MD5: 32K
       41 C0 07 4E DA 60 71 E3 20 22 E3 45 CF 1E C6 8B>)
(   3,<2006-12-18 10:46:17.83 +000>,<MAYBRIDGE\nmr>,<NMR_250MHZ>,
      <apk 
       data hash MD5: 32K
       2B C8 00 73 40 19 EB 41 60 25 DA A2 14 96 08 AF>)
(   4,<2006-12-18 10:46:19.21 +000>,<MAYBRIDGE\nmr>,<NMR_250MHZ>,
      <abs ABSG = 5 
       data hash MD5: 32K
       C7 89 67 EB 46 66 2C 20 26 8F 6F 9D 61 1E 73 DB>)
$$ ##END=
$$ 
$$ hash MD5
$$ 14 06 0F 72 17 23 ED D9 30 2B D5 F3 E5 67 56 DB
##$RELAX= 
##$RELAX= 
##$RELAX= 
##$RELAX= 
##$RELAX= 
##$RELAX= 
##$RELAX= 
$$ Bruker specific parameters
$$ --------------------------
##$DU= <C:\u>
##$EXPNO= 1780
##$NAME= <ADRS>
##$PROCNO= 1
##$TYPE= <nmr>
##$USER= <dgb>
##$AMP= (0..31)
100 100 100 100 100 100 100 100 100 100 100 100 100 100 100 100 100 100 
100 100 100 100 100 100 100 100 100 100 100 100 100 100 
##$AQSEQ= 0
##$AQ_mod= 3
##$AUNM= <au_zg>
##$AUTOPOS= <6 >
##$BF1= 250.13
##$BF2= 250.13
##$BF3= 250.13
##$BF4= 250.13
##$BF5= 500.13
##$BF6= 500.13
##$BF7= 500.13
##$BF8= 500.13
##$BYTORDA= 1
##$CFDGTYP= 0
##$CFRGTYP= 5
##$CHEMSTR= <none>
##$CNST= (0..31)
1 1 145 1 1 1 1 1 1 1 1 1 1 1 1 1 1 1 1 1 1 1 1 1 1 1 1 1 1 1 1 1 
##$CPDPRG= <>
##$CPDPRG1= <>
##$CPDPRG2= <>
##$CPDPRG3= <>
##$CPDPRG4= <mlev>
##$CPDPRG5= <mlev>
##$CPDPRG6= <mlev>
##$CPDPRG7= <mlev>
##$CPDPRG8= <mlev>
##$CPDPRGB= <>
##$CPDPRGT= <>
##$D= (0..31)
0 1 0 0 0 0 0 0 0 0.06 0 0 0 0 0 0 0.0002 0 0 0 0 0 0 0 0 0 0 0 0 0 0 
0 
##$DATE= 1166438748
##$DBL= (0..7)
120 120 120 120 120 120 120 120 
##$DBP= (0..7)
150 150 150 150 150 150 150 150 
##$DBP07= 0
##$DBPNAM0= <>
##$DBPNAM1= <>
##$DBPNAM2= <>
$$ [...]
##$SUBNAM7= <"">
##$SUBNAM8= <"">
##$SUBNAM9= <"">
##$SW= 20.6930455092707
##$SWIBOX= (0..15)
0 0 3 0 0 0 0 0 0 0 0 0 0 0 0 0 
##$SW_h= 5175.983436853
##$TD= 65536
##$TD0= 1
##$TE= 295.16
##$TE2= 300
##$TE3= 300
##$TEG= 300
##$TL= (0..7)
0 120 120 120 120 120 120 120 
##$TP= (0..7)
150 150 150 150 150 150 150 150 
##$TP07= 0
##$TPNAME0= <>
##$TPNAME1= <>
##$TPNAME2= <>
##$TPNAME3= <>
##$TPNAME4= <>
##$TPNAME5= <>
##$TPNAME6= <>
##$TPNAME7= <>
##$TPOAL= (0..7)
0.5 0.5 0.5 0.5 0.5 0.5 0.5 0.5 
##$TPOFFS= (0..7)
0 0 0 0 0 0 0 0 
##$TUNHIN= 0
##$TUNHOUT= 0
##$TUNXOUT= 0
##$USERA1= <user>
##$USERA2= <user>
##$USERA3= <user>
##$USERA4= <user>
##$USERA5= <user>
##$V9= 5
##$VALIST= <valist>
##$VCLIST= <CCCCCCCCCCCCCCC>
##$VD= 0
##$VDLIST= <DDDDDDDDDDDDDDD>
##$VPLIST= <PPPPPPPPPPPPPPP>
##$VTLIST= <TTTTTTTTTTTTTTT>
##$WBST= 1024
##$WBSW= 4
##$XGAIN= (0..3)
0 0 0 0 
##$XL= 0
##$YL= 0
##$YMAX_a= 292039
##$YMIN_a= -269021
##$ZGOPTNS= <>
##$ZL1= 120
##$ZL2= 120
##$ZL3= 120
##$ZL4= 120
##$ABSF1= 16.522
##$ABSF2= -4.171173
##$ABSG= 5
##$ABSL= 3
##$ALPHA= 0
##$AQORDER= 0
##$ASSFAC= 0
##$ASSFACI= 0
##$ASSFACX= 0
##$ASSWID= 0
##$AUNMP= <proc_1d>
##$AZFE= 0.1
##$AZFW= 0.1
##$BCFW= 0
##$BC_mod= 0
##$BYTORDP= 0
##$COROFFS= 0
##$CY= 12.5
##$DATMOD= 1
##$DC= 0
##$DFILT= <>
##$DTYPP= 0
##$F1P= 14.0000005364418
##$F2P= -0.99999901652339
##$FCOR= 0.5
##$FTSIZE= 32768
##$FT_mod= 6
##$GAMMA= 0
##$GB= 0
##$INTBC= 1
##$INTSCL= 1
##$ISEN= 128
##$LB= 0.3
##$LEV0= 0
##$LPBIN= 0
##$MAXI= 10000
##$MC2= 0
##$MEAN= 0
##$ME_mod= 0
##$MI= 0
##$NCOEF= 0
##$NC_proc= -3
##$NLEV= 6
##$NOISF1= 0
##$NOISF2= 0
##$NSP= 0
##$NTH_PI= 0
##$NZP= 0
##$OFFSET= 16.522
##$PC= 1
##$PHC0= 214.6665
##$PHC1= 7.290771
##$PH_mod= 1
##$PKNL= yes
##$PPARMOD= 0
##$PSCAL= 4
##$PSIGN= 0
##$REVERSE= no
##$SF= 250.13
##$SI= 32768
##$SIGF1= 0
##$SIGF2= 0
##$SINO= 400
##$SIOLD= 32768
##$SREGLST= <1H.DMSO>
##$SSB= 0
##$STSI= 32768
##$STSR= 0
##$SW_p= 5175.98343685301
##$SYMM= 0
##$S_DEV= 0
##$TDeff= 65536
##$TDoff= 0
##$TI= <Analysis number 999999
Compound Code 99
Book Reference 9
Project Code 9>
##$TILT= no
##$TM1= 0
##$TM2= 0
##$TOPLEV= 0
##$USERP1= <user>
##$USERP2= <user>
##$USERP3= <user>
##$USERP4= <user>
##$USERP5= <user>
##$WDW= 1
##$XDIM= 32768
##$YMAX_p= 507145484
##$YMIN_p= -126203
$$ End of Bruker specific parameters
$$ ---------------------------------
##NTUPLES= NMR SPECTRUM
##VAR_NAME=  FREQUENCY,     SPECTRUM/REAL,   SPECTRUM/IMAG
##SYMBOL=    X,             R,               I
##VAR_TYPE=  INDEPENDENT,   DEPENDENT,       DEPENDENT
##VAR_FORM=  AFFN,          ASDF,            ASDF
##VAR_DIM=   32768,         32768,           32768
##UNITS=     HZ,            ARBITRARY UNITS, ARBITRARY UNITS
##FACTOR=    0.157963299565203, 1,           1
##FIRST=     4132.6476996994, 0,             0
##LAST=      -1043.33573715361, 0,           0
##MIN=       -1043.33573715361, -126203,     0
##MAX=       4132.6476996994, 507145484,     0
$$ Real data points
##PAGE= N=1
##DATA TABLE= (X++(R..R)), XYDATA
$$ [...]
16869b9618L9768J3694j7334l6988M0960L2166J6337J8062L096k8803n0713j3060
16857a2433J5346P385k5623k2236O621J3689J4519k8307K16L8502l258q750J7269
16844A2940k7001r198L957J813j1628j8039q857J985K7412J3189k918j4366k0559
16831e1270K0571L5905K0354M903j7547K0185m034O494j1653l7641l437j3406
16819c0576K098K5147J0480N652l3047J0345j6577J3211J4587j5393l2798j0056
16807e6927J8706L9859K5690k989J2500j9068k0390K138L394j0776k3119M3509
16795A2527J1162j7575M964l555m2734j2059K8081Q321m509k3264J1787K7262
16783D08K767p507q865j1265r685r466J3417K807L3577K0006l3067j2584J7284
$$ plain form
16869 -29618 10150 23844 6510 -30478 10482 42648 58985 77047 80143 51340 627 -12433
16857 -12433 2913 10298 -15325 -37561 -30940 -17251 -2732 -31039 -30823 7679 4421 -4329 12940
16844 12940 -14061 -23259 -19302 -17489 -29117 -47156 -56013 -54028 -26616 -13427 -16345 -30711 -51270
16831 -51270 -30699 5206 25560 30463 12916 33101 29067 35561 23908 -13733 -17170 -30576
16819 -30576 -28478 -3331 7149 12801 -20246 -9901 -26478 -13267 1320 -14073 -46871 -56927
16807 -56927 -38221 1638 27328 24339 36839 17771 -2619 -481 2913 -7863 -30982 12527
16795 12527 23689 6114 11078 7523 -35211 -47270 -19189 -10868 -15377 -38641 -26854 408
16783 408 3175 -4332 -13197 -24462 -34147 -43613 -30196 -27389 6188 26194 -6873 -19457 -2173
16770b173N4931J9966L05K248k8077j8770P041K477j8074J6519K176n767k5083
16757G719K0007J9723J3808j9938l2843m1037m210K9760J588j6703P371J30J6307
16744A682l562l1746q909J845k1471L6365K5235j476r212l8096l6815N2431J3220
16731b0509j1615k1053J7563J8117J1185K0676K1899P9p324j1027J0938K1113
16719E0042j2507k2878m7051l516j141M1993j0680k2133K0710N1415l3927l0144
16707a9817Q444o487r27r049k7611J0537L5947j8718J708P220N014k433j7039
16694c3211J4399m100J5347K3879m2075J270K8776j202j3070J7632M0654k428
16682D5871l5753j1873r10m345j0565l215p073q78P925R400J4124l891l306k4648
$$ plain form
16770 -2173 52758 72724 73029 75277 47200 28430 35471 37948 19874 36393 38569 32802 7719
16757 7719 27726 47449 61257 41319 8476 -32561 -36771 -7011 -5423 -22126 -14755 -14625 1682
16744 1682 -1880 -33626 -42535 -40690 -62161 -25796 -561 -2037 -11249 -49345 -86160 -33729 -20509
16731 -20509 -32124 -53177 -35614 -17497 -6312 14364 36263 36342 29018 17991 28929 50042
16719 50042 37535 14657 -32394 -35910 -37051 4942 -5738 -27871 -7161 44254 10327 -19817
16707 -19817 -11373 -17860 -18787 -27836 -55447 -44910 -8963 -27681 -25973 -18753 -13739 -16172 -33211
16694 -33211 -18812 -22912 -7565 16314 -25761 -24491 4285 3083 -9987 7645 48299 45871
16682 45871 10118 -1755 -2665 -7010 -17575 -20790 -27863 -28741 -20816 -11416 2708 -1183 -4489 -29137
16668b9137o874R80L1391L2956O228j899k8020j7611m1441J4446N7213q937k5229
16655a5934l0109k7002j2881M6816L2442K724m6431J9876J4275o931L766n928
16643b5317l1354J2713L1314j2716n6J1900k2429J3948K2632q706k8055J5474
16631b0652n325j7825L2994L9848J2225l482k5652k5984o460j652j3481m743J1031
16618b9158n739M604J1894j1168N690M9701J3062r067J0840o176J519K084j9354
16605A8732k92m5241j0106l489k0467J3219r405j4316K9038N8619l104l7610J7996
16592f426L0301M700k8622m438l560p83M655Q631J1228k0679j3921k8569j2047
16579e9530L2823l8190K489M4305j3474j427k059R974k124J8420K4628j664k2831
$$ plain form
16668 -29137 -36011 -35031 -3640 29316 35544 33645 5625 -11986 -53427 -38981 18232 9295 -15934
16655 -15934 -46043 -73045 -85926 -39110 -6668 -3944 -50375 -30499 -16224 -23155 -19389 -25317
16643 -25317 -56671 -43958 -12644 -25360 -25416 -13516 -35945 -21997 635 -8071 -36126 -20652
16631 -20652 -25977 -43802 -10808 29040 41265 37783 12131 -13853 -20313 -21965 -35446 -40189 -29158
16618 -29158 -34897 -30293 -18399 -29567 -23877 25824 38886 29819 40659 34483 36002 38086 18732
16605 18732 18440 -26801 -36907 -40396 -60863 -47644 -57049 -71365 -42327 16292 13188 -24422 -6426
16592 -6426 23875 28575 -47 -4485 -8045 -8828 -4173 4458 15686 -4993 -18914 -47483 -59530
16579 -59530 -26707 -64897 -62408 -18103 -31577 -33004 -35063 -25089 -27213 -8793 15835 14171 -8660
16566h660L8341O967j6783j1180m416q46n594k5903K3590K1757M858m2788P340
16553a3317p918J8676J9353K3286qL4262l12m1529n9884K590N3547L2396K6504
16540H7646J1352l9361j9868l3032j3623j8225j0212o584n952j4972L1495K0631
16528a0705j50j0941k3702O539k7394K2135J7811m411n251k4825n035M960K448
16515e8521L6459L0857J2568p180j3861j1646q874j3234K0189J3545m387k0630
16503b4715O06m400J8459j5165m770J5214K8971k824k0682O715J1612J332K5414
16490C5767R571n1712n2085j1431K7257L2470J7364P556Q057j3590k1128Q765
16478c139j0128O197k851J6552m045n137j8859l7138p600L5159j898l4984K302
$$ plain form
16566 -8660 29681 36648 19865 8685 4269 3423 -2171 -28074 -4484 17273 22131 -20657 -13317
16553 -13317 -21235 -2559 16794 40080 40072 74334 74022 32493 -27391 -24801 28746 61142 87646
16540 87646 98998 59637 39769 6737 -6886 -25111 -35323 -41907 -47859 -62831 -31336 -10705
16528 -10705 -10855 -21796 -45498 -38959 -66353 -44218 -26407 -30818 -36069 -60894 -65929 -60969 -58521
16515 -58521 -22062 8795 21363 14183 322 -11324 -20198 -33432 -13243 302 -4085 -24715
16503 -24715 -24109 -28509 -10050 -25215 -29985 -14771 14200 11376 -9306 -2591 9021 10353 35767
16490 35767 45338 -6374 -58459 -69890 -42633 -10163 7201 14757 22814 9224 -11904 -3139
16478 -3139 -13267 -7070 -9921 6631 2586 -2551 -21410 -58548 -66148 -30989 -32887 -67871 -65569
16465f5569j667J0917K1754J5929l241K1124R45K805k604P003N541l0187m4466
16452f1716M831K3729M3917r803m1013k6454j5792O683L1176J4474J564K3041
16440e363J013r002j1741L736m392N696J1662N872n844j0120L395l436L596K24
16426a4704L355q631j1712j0057J5968k77K0495J901j5089k8018N648M9244J7828
16413B5951L713j2423J1408l0013k2850r260J1378K8479K8273J685m9243q959
16401b1861N166O554M818P155L319j9106J6820n261k2997J927O971l887j0574
16388c0956K032K2491J4849K943P266k2689J983J6189L052l9257j6588r008l3065
16375h0758J7724M8305J3352j986J7126j6761m5896j4242L1615R552j8771K8558
$$ plain form
16465 -65569 -67236 -56319 -34565 -18636 -21877 -753 192 2997 393 7396 12937 -17250 -61716
16452 -61716 -56885 -33156 10761 958 -40055 -66509 -82301 -75618 -44442 -29968 -28404 -5363
16440 -5363 -4350 -13352 -25093 -21357 -25749 -20053 -8391 -2519 -8363 -18483 -15088 -18524 -14928 -14704
16426 -14704 -11349 -19980 -31692 -41749 -25781 -26058 -5563 -3662 -18751 -46769 -41121 8123 25951
16413 25951 29664 17241 28649 -1364 -24214 -33474 -22096 6383 34656 36341 -12902 -21861
16401 -21861 -16695 -10141 -5323 1832 5151 -13955 2865 -2396 -25393 -23466 -16495 -20382 -30956
16388 -30956 -28924 -6433 8416 11359 18625 -4064 -2081 14108 17160 -22097 -38685 -47693 -80758
16375 -80758 -63034 -14729 -1377 -3363 13763 -2998 -48894 -63136 -31521 -21969 -40740 -12182
16363a2182K4563O934j1883O027K0680j0850j37k7658q066p26k9493j7027K1335
16350c8483K207K0363k4126n550J7149L4602j3885l2088R646J4233N6505L7780
16338G8353o821k4380p078j0140M006L4312j8727j130j0612j0310j3528j5678
16326a733l6394J7099J2348n967P674J6236J8998M88k5662k6660N122J9392q969
16313h028k591k402k6808m821J8751j1802q806K7978J1217j9989j883r021o988
16300d5193P464R207L8475k9051j9324J1232r070o983n825J5103K1612j8390n827
16287c6570l259J7521j1987q842L5179P172k8468L349L4700K069j387j5847J5226
16274H856m153n0452j6173J5441k1574K647P755M2492Q604J342p045j8023M846
$$ plain form
16363 -12182 12381 19315 7432 13459 34139 23289 23152 -4506 -12572 -13298 -42791 -59818 -38483
16350 -38483 -36276 -15913 -40039 -45589 -28440 6162 -7723 -39811 -30165 -15932 40573 78353
16338 78353 71532 47152 40074 29934 33940 68252 49525 48395 37783 27473 13945 -1733
16326 -1733 -38127 -21028 -8680 -14647 -6973 9263 28261 28749 3087 -23573 -18451 941 -8028
16313 -8028 -10619 -13021 -39829 -44650 -25899 -37701 -46507 -18529 -7312 -27301 -29184 -38205 -45193
16300 -45193 -37729 -28522 9953 -19098 -38422 -27190 -36260 -43243 -49068 -33965 -12353 -30743 -36570
16287 -36570 -39829 -22308 -34295 -43137 -7958 -786 -29254 -25905 8795 10864 9477 -6370 8856
16274 8856 4703 -45749 -61922 -46481 -68055 -65408 -57653 -15161 -6557 -5215 -12260 -30283 -25437
16261b5437K1599J1833l86L7100j0470l2465k3530K2087q630q101n87j8876n181
16248d1044N120O911K7176k1007q354J0129J056R706m589k0121M647j6141J322
16235d5189N601K2973L2889l473O938L7145n8068l6754o86J6979J9526r299J911
16222i507k6109j9369O034K4545J0373K6213L1993N36o034k3485o52l725k7006
16209a6193N797M5655R799q280m2677r615j0462j3358J1130L7619k4765m4409
16197e9759k9987N1047M4701K0228r733j2774J2811J8162m2858l2883M04J6853
16185b3788M6345j0480j4046K313K4309M170R628j0025Q86r945L794r643q582
16172D936j0879m9912j5088K8180J0261K6979J2581p127k3294N59o388J2871J7669
$$ plain form
16261 -25437 -3838 7995 7609 44709 34239 1774 -21756 331 -8299 -16400 -16987 -35863 -41044
16248 -41044 -35924 -29013 -1837 -22844 -31198 -21069 -20013 -10307 -14896 -35017 -30370 -46511 -45189
16235 -45189 -39588 -16615 16274 12801 19739 56884 -1184 -37938 -38624 -21645 -2119 -11418 -9507
16222 -9507 -35616 -54985 -48951 -24406 -14033 12180 44173 44709 38675 15190 14538 10813 -16193
16209 -16193 -10396 35259 45058 36778 -5899 -15514 -25976 -39334 -28204 9415 -15350 -59759
16197 -59759 -89746 -38699 6002 26230 16497 3723 16534 34696 -8162 -41045 -40641 -23788
16185 -23788 22557 12077 -1969 344 24653 28823 38451 28426 29312 19367 23161 13518 4936
16172 4936 -5943 -55855 -70943 -42763 -32502 -5523 7058 -69 -23363 -22804 -29192 -16321 1348
16159A348K4363J7948m5345l9930j3992M424k477K3341L879J3153j886o076K3871
16146B621R598j2524j0285Q148M105q176k6757L4792M1890l0492l3192K563J5646
16133b063L4313j1795j4527R183j2797r210K8927k5294j4943K414K449k2572K11
16120c5704K1122L0016K0866n162k4282r975J4641J3960k6659j5798n764q178
16108c0917K9514J0407l7800l0851K2663n609j8630M4371K7818J1644j7759k7764
16096b2913k7411K4433K3985l3828l464L3153K4362l5975j0227k1410N300L2912
16084a1083J7275N277m0822k7057k1743O18J7879P673j0949L0677K1692k4812
16072c5375l3436J9159L4774Q497J1653k3515J032o025n853O824J1120J8052j8189
$$ plain form
16159 1348 25711 43659 -1686 -41616 -55608 -51184 -53661 -30320 -26441 -13288 -15174 -21250 2621
16146 2621 12219 -305 -10590 -2442 1663 -6513 -33270 1522 43412 12920 -20272 -17709 -2063
16133 -2063 32250 20455 5928 15111 2314 -6896 22031 -3263 -18206 -15792 -13343 -35915 -35704
16120 -35704 -14582 15434 36300 31138 6856 -3119 11522 25482 -1177 -16975 -22739 -30917
16108 -30917 -1403 9004 -28796 -59647 -36984 -42593 -61223 -16852 10966 22610 4851 -22913
16096 -22913 -50324 -25891 -1906 -35734 -39198 -6045 18317 -17658 -27885 -49295 -43995 -11083
16084 -11083 6192 11469 -29353 -56410 -78153 -77535 -59656 -51983 -62932 -32255 -10563 -35375
16072 -35375 -68811 -49652 -14878 -6381 5272 -18243 -17211 -23236 -29089 -22265 -11145 6907 -11282
16059a1282k0812J7672L4533l3507m9410N879J2822L3723q265j6661J8167j187
16047a8328m3293k2226k5857K8933J0200K6264N2423N478k0510J5352N014J5559
16035B9009J7081J975l6728j3802M902r199L522L7203J0532k9338j3412k9246
16023b7501k185K8362P478P715K2797J335l796j5990l8935j6120L678Q627O916
16010a7619j4514Q95K2717K1645l241j8659M079J7972L304Q148k6968J17q336
15997a0460l467J2526l751M956j2146L0291J3531m966k7745L5502R676L293j5792
15984C1448k0303q737J2030J588j2454j9448J3774L692P312m333l3471j3293J8429
15971b3766J3049L1843P543k8514j1207J1292Q458K1420J2831L6598m5327m2915
$$ plain form
16059 -11282 -32094 -14422 20111 -13396 -62806 -56927 -44105 -10382 -18647 -35308 -17141 -18328
16047 -18328 -61621 -83847 -109704 -80771 -70571 -44307 8116 13594 -6916 8436 13450 29009
16035 29009 46090 48065 11337 -2465 2437 -6762 -3240 33963 44495 15157 1745 -27501
16023 -27501 -29686 -1324 6154 13869 36666 38001 34205 18215 -20720 -36840 -33162 -24535 -17619
16010 -17619 -32133 -31238 -8521 13124 9883 -8776 -4697 13275 16579 24727 -2241 -2124 -10460
15997 -10460 -13927 -1401 -5152 -196 -12342 17949 31480 26514 -1231 34271 43947 47240 31448
15984 31448 11145 2408 14438 16026 3572 -15876 -2102 1590 8902 4569 -28902 -42195 -23766
15971 -23766 -10717 21126 28669 155 -11052 240 8698 30118 42949 79547 34220 -8695
15959h695k234O647j3379j2019R220O563J9295N690O021m6534j3358k5090J7034
15946e0839K7413J7986L1251K9723j7915k9576j299m812j6670J6429Q742r598
15934H35k2061j5384p167J3450M2440J0598j7536J8304P308j0541m0262j9885
15922c9901K9798N1677J8332L103M956j3660l0295k9086K1199K7324p3847j1700
15910d2100Q609J7162L487J1963l6744l3629J5469J7573j0098L2502l3446m6258
15898i5510K5977L9556J477J9834l639l2621P634K1387J9085M147Q287j1321k2944
15885a8651k416J3304K1267J6545J0781j7223j256j7080J1059R757j1643k7328
15873a2884P42J9341k238j9377J1250k3278L2709J6643j8420k1585J8392J0099
$$ plain form
15959 -8695 -10929 -4282 -17661 -29680 -20460 -13897 5398 11088 17109 -29425 -42783 -67873 -50839
15946 -50839 -23426 -5440 25811 55534 37619 8043 6744 1932 -14738 1691 10433 835
15934 835 -21226 -36610 -43777 -30327 12113 22711 5175 23479 30787 20246 -20016 -39901
15922 -39901 -10103 41574 59906 63009 67965 54305 24010 -5076 16123 43447 -30400 -42100
15910 -42100 -33491 -16329 -12842 -879 -37623 -71252 -55783 -38210 -48308 -15806 -49252 -95510
15898 -95510 -69533 -29977 -28500 -8666 -12305 -44926 -37292 -15905 3180 7327 15614 4293 -18651
15885 -18651 -21067 -7763 13504 30049 40830 23607 22351 5271 16330 26087 14444 -12884
15873 -12884 -12142 7199 4961 -14416 -3166 -26444 6265 22908 4488 -17097 1295 11394
15861A1394l2904j1517l647n734K0080J6220o417o466R463L8166l308k1900j1966
15848h536L863k3332l5605J611J8494L9973L2554k014j1571K382O121j2180k7851
15835a6091n9401J142L9724J5463L9469J817k8390j2663k4917j3182J8349l973
15823d2653Q647K1472P601j2282P968J6029o268j800K120j5762J8566m648j7187
15810a8197l899Q717R801r152J4680l5285k2529j157q799R997J9397J0835j305
15797b6896J1651K4792K538J728k7330k8281j8766L4931L5674K5317l492j8567
15785A3299n461j9601R340M0986j690k8974k6758m058M0892K1190k019l6094j0707
15772i655K1026k176m5919r427J2924n731k1415L2634J9094J973j3196k1243L376
$$ plain form
15861 11394 -21510 -33027 -36674 -42408 -22328 -6108 -12525 -18991 -9528 28638 25330 3430 -8536
15848 -8536 -4673 -28005 -63610 -61999 -43505 -3532 29022 27008 15437 17819 23940 11760 -16091
15835 -16091 -75492 -74350 -34626 -19163 20306 22123 -6267 -18930 -43847 -57029 -38680 -42653
15823 -42653 -34006 -12534 -4933 -17215 -9247 6782 514 -1286 834 -14928 3638 -1010 -18197
15810 -18197 -22096 -13379 -3578 -12730 1950 -33335 -55864 -57021 -65820 -55823 -36426 -25591 -26896
15797 -26896 -15245 9547 12085 13813 -13517 -41798 -60564 -25633 10041 35358 31866 13299
15785 13299 7838 -11763 -2423 38563 36873 7899 -18859 -22917 17975 39165 37146 1052 -9655
15772 -9655 11371 9195 -36724 -46151 -33227 -38958 -60373 -27739 -8645 -6672 -19868 -41111 -37735
15759c7735J1815j7324K1385J0828j1884K3758p397p857K7094q696J1352J3435
15747B8774J1914M423K1916M9713N4219L6486O7380J24970J40584o2338j37513
15736C40528r8791p1838m8174l5250l6148l808J2880J2080k8890m7752K64J4088
15724I189k8337J3913l940m15j343J6935J2676j1654L305o676p997J4388L736
15711A3780j7808P40J0685l616M880J9227m2614M123p585r655K799J115L446j114
15697b1597N6522J6587k6714j7551n968j4249j5092L5339L496q103q650Q463J7627
15684B0110K1990j1099k0594j2842p317J7626P151k8762j9137L1747L1546p280
15672B3139n2054J6970J6585j971P221m984k4219p819L1071J5101J0119P970j9469
$$ plain form
15759 -37735 -25920 -43244 -21859 -11031 -22915 843 -6554 -14411 12683 3987 15339 28774
15747 28774 40688 45111 67027 116740 170959 207445 274825 399795 540379 478041 340528
15736 340528 241737 169899 121725 86475 50327 46519 59399 71479 42589 -5163 -4899 9189
15724 9189 -19148 -5235 -9175 -9590 -10933 6002 18678 7024 10329 3653 -4344 10044 13780
15711 13780 -4028 -3288 7397 3781 8661 27888 -14726 -10603 -18188 -27843 -25044 -23929 -20483 -21597
15697 -21597 34925 51512 24798 7247 1279 -12970 -28062 7277 10773 2670 -5980 2483 20110
15684 20110 42100 31001 10407 -2435 -9752 7874 15025 -13737 -32874 -1127 30419 23139
15672 23139 -28915 -11945 4640 2669 9890 4906 -19313 -27132 3939 19040 29159 37129 17660
15659A7660j5580K2399o85k6924P05K643j041K5539l323k1323m577K1j6462k642
15645b3590p95k2451R156j6806k5638J7776L3332M009j1620k644j5049L7158L1325
15632A4163K5778J5257j4137J1323p241n617k544r452l472j4061j422j821r005
15619b251j6298J2391m679K0924j9798J9118J4954l789K0173J708p828j9271j1198
15606D156K4860j2658j9970J2293K4302n081l1987k24J2537q981k7250j6738M0700
15593d041K8746k944j4556m1089L981J1171J0608J4716K8100q50j5823l2550p968
15580b2499L677M3957M0235m224j0710j4077j1316J6438l9728q90K2324K6994
15568E0181k1201J2911J1061k1623j6392K1801J2113n6482m2131L764J5101R72
$$ plain form
15659 17660 2080 24479 23794 -3130 -2425 218 -823 24716 21393 70 -4507 -4486 -20948 -23590
15645 -23590 -24385 -46836 -37680 -54486 -80124 -62348 -29016 -25007 -36627 -39271 -54320 -17162 14163
15632 14163 39941 55198 41061 52384 45143 39526 36982 27530 24058 9997 8575 6754 -2251
15619 -2251 -18549 -6158 -10837 10087 -9711 9407 24361 20572 40745 42453 34625 15354 4156
15606 4156 29016 16358 -3612 8681 32983 27902 -4085 -4309 8228 -753 -28003 -44741 -4041
15593 -4041 24705 21761 7205 -33884 -29903 -18732 -8124 6592 34692 33842 18019 -14531 -22499
15580 -22499 -18822 25135 65370 61146 50436 36359 25043 41481 1753 863 23187 50181
15568 50181 28980 41891 52952 31329 14937 36738 48851 -7631 -49762 -45998 -30897 -29925
15556b9925Q563L0623j5376l7607K1029L8774k2927l0313j9411j205K5660L4808
15544B693k4552j3649l1445P123L2071o08l473L718J3074j3414J3074J3670K2685
15531B0967J0398l8360P754L5040k7363o347J2909k2711J1008J3147J2813J8510
15519D7765M894l738J1266k0079j0662J5819k160j2622j715M056n7393K455n400
15506b7514Q190P970j9766J7571M226q24Q409k675l6928k2608L636p580R474K5959
15492c2460O534Q954o060N550L1457L8982j8003m7619m6928n0988R107J8228L1044
15479e2202K2301k3681j3416N867M561j1424L8610K6128o1L627j674l3036N33
15466c3867K8758M034n077l6025l0833j938j3888J9859J677K7304K2375L8034
$$ plain form
15556 -29925 -21362 9261 -6115 -43722 -22693 16081 -6846 -37159 -56570 -57775 -32115 2693
15544 2693 -21859 -35508 -66953 -59830 -27759 -28367 -31840 -28122 -15048 -28462 -15388 -1718 20967
15531 20967 31365 -6995 759 35799 8436 2089 14998 -7713 3295 16442 29255 47765
15519 47765 52659 48921 60187 40108 29446 45265 43105 30483 28768 32824 -24569 -22114 -27514
15506 -27514 -19324 -11354 -31120 -13549 -9323 -10147 -1738 -4413 -41341 -63949 -60313 -67893 -58419 -32460
15492 -32460 -25926 -16972 -23032 -17482 13975 52957 34954 -12665 -59593 -110581 -101474 -83246 -52202
15479 -52202 -29901 -53582 -66998 -61131 -56570 -67994 -29384 -3256 -3317 310 -1364 -34400 -33867
15466 -33867 -5109 -1075 -6152 -42177 -73010 -74948 -88836 -68977 -67300 -39996 -17621 20413
15454B0413k2328j6154N1667k0432j8607J5939j925j3746j9055J783j7012k0532
15442e9989K9538K1691J9854K8789K608j6657l4962j5920o194Q675l3130k3353
15430g9050n91K8510J3476R332K083J1253M23Q101l157j5631l2475K5551N5831
15417B3656j802k4964L932k6097j0641R997J2912q636R30K9523m405m0785j921
15404c8301K5381O146j3553M690J9432R352k1142m439K6525j4390k207J1899j2212
15391b819n624P105M506K5653k3823k4349K1034N546r922J3522K7440J133j4049
15378B5353o771J0565r031K0856R620j710p94k9512L419K384J1567j3410j7557
15365D979k1572j0749o850j1788k0288J1444K3528R987k419J9137K0387L160J3509
$$ plain form
15454 20413 -1915 -18069 33598 13166 -5441 10498 8573 -5173 -24228 -22445 -39457 -59989
15442 -59989 -30451 -8760 11094 39883 42491 25834 -9128 -25048 -31242 -22567 -55697 -79050
15430 -79050 -79641 -51131 -37655 -28323 -26240 -14987 -14564 -6463 -9620 -25251 -57726 -32175 23656
15417 23656 21854 -3110 822 -25275 -35916 -25919 -13007 -21643 -20713 8810 4405 -36380 -38301
15404 -38301 -12920 -6774 -20327 -15637 3795 13147 -7995 -12434 14091 -299 -2506 9393 -2819
15391 -2819 -8443 -1338 3168 28821 4998 -19351 1683 7229 -2693 10829 38269 39402 25353
15378 25353 18582 29147 20116 40972 50592 48882 48088 18576 21995 24379 35946 22536 4979
15365 4979 -16593 -27342 -34192 -45980 -66268 -54824 -31296 -21309 -23728 -4591 15796 18956 32465
15352C2465k4473n6687l046m520j5127L3573L1723r663j3043j198K484K8453N303
15339F244N170l0618k4906Q838J0102L365N096j1796L4894N8524K8181k6066l8386
15326B8642n6770p493Q998R774n364R242j0580r262J6382j8016O801J5421J3467
15313A242j6905q418R128K5629K1973K4599r379n510j8860j7749L0568J7816j6837
15300C7297k4587j7485J5741k7716l6961j542M6471K8031K4287l5495p067Q87
15288A861K379k3489m407R030L531m3461k6719J8600K4937k2123J6173J4532j5338
15275d4494K4074J3510j1983j3056L3509R534J9524k5572j4552J0615j7824k3829
15263d0544K6358J4253J1077M833j2690j4113j6755k0752J4149K686K5038K1557
$$ plain form
15352 32465 7992 -48695 -51741 -56261 -71388 -37815 -6092 -15755 -28798 -29996 -27512 941 6244
15339 6244 11414 -19204 -44110 -35272 -25170 -21805 -16709 -28505 6389 64913 93094 67028 28642
15326 28642 -28128 -35621 -26623 -16849 -22213 -12971 -23551 -32813 -16431 -34447 -27646 -12225 1242
15313 1242 -15663 -24081 -14953 10676 32649 57248 47869 42359 23499 5750 36318 54134 37297
15300 37297 12710 -4775 10966 -16750 -53711 -55253 -8782 19249 43536 8041 974 1861
15288 1861 4240 -19249 -23656 -14626 -11095 -54556 -81275 -62675 -37738 -59861 -43688 -29156 -44494
15275 -44494 -20420 -6910 -18893 -31949 1560 11094 30618 5046 -9506 1109 -16715 -40544
15263 -40544 -14186 67 11144 15977 3287 -10826 -27581 -48333 -34184 -31498 -6460 15097
15251A5097o483l1301j8564P515J8127p596J2128J3951q951j3233l63K1704J3380
15238A5411K7929j0978k6558j5460j701K1028l274k1952m1221j6931L9936L869
15226b9902K500M6131r468k538k6617m838L3270K4906m080k6489k743K1550m006
15213A7676q437j2255j3236k7350J7514m853J9738M4372K9862k4965m2010k3941
15201b7885J6750j4071m958n622J0024m706J2233R792M793O905p572M120j0703
15188a0900l3402M909J8938k0373K5686J1245k1871p144M4185P8283K157l2627
15176E9086k9897k7842M125K438j3661O983j8612n66L0189m96J996L8145j2996
15163C8892n9098l2764O773K0145J0405P254j6558R332k963L4516J8617k8955
$$ plain form
15251 15097 8614 -22687 -41251 -33736 -15609 -23205 -11077 2874 -6077 -19310 -19673 2031 15411
15238 15411 43340 32362 5804 -9656 -11357 9671 6397 -15555 -56776 -73707 -33771 -29902
15226 -29902 -27402 18729 9261 6723 -19894 -24732 8538 33444 29364 2875 132 21682 17676
15213 17676 9239 -3016 -16252 -43602 -26088 -30941 -11203 33169 63031 38066 -3944 -27885
15201 -27885 -11135 -25206 -30164 -35786 -25762 -30468 -18235 -8443 -3650 3255 -4317 -197 -10900
15188 -10900 -44302 -39393 -20455 -40828 -15142 -3897 -25768 -32912 11273 89556 91713 59086
15176 59086 29189 1347 5472 7910 -5751 1232 -17380 -17946 12243 11747 13743 51888 38892
15163 38892 -20206 -52970 -46197 -26052 -15647 -8393 -24951 -15619 -18582 15934 34551 5596
15151E596j0854L0536j0857j8863J9291L0925K3702J2267k036j4028l7326k086
15139B6267K4649j9837m2822l2504k2162M3832N1617J0869j2350j1750L3519J1454
15127F0782l0710l7644j5349Q484N1827K7688o986o614k5804k9465M180K7305
15115B7694K8158J1900q14K767p628n4177l0086k2183q0Q760O155Q618K8391J4584
15101B2059R506M424j595k6223k024N380l671P25O750k643k8520l9261N50L8080
15087a6463K9954K858q730j9590l971l0267l51QL3277K3613J7883k0026l2071
15074b3876l4542L086J622J5687R054K3049j1094M854o241l1091k6N646J8233
15061b5639L0264k086o644j2848P722k5042M791l685l916m4509m3132j479K0848
$$ plain form
15151 5596 -5258 25278 14421 -4442 14849 45774 69476 81743 79707 65679 28353 26267
15139 26267 50916 31079 -11743 -44247 -66409 -22577 29040 39909 27559 15809 49328 60782
15127 60782 30072 -7572 -22921 -14437 37390 65078 58092 51478 25674 -3791 389 27694
15115 27694 55852 67752 66938 69705 62077 7900 -22186 -44369 -44449 -35689 -29534 -20916 7475 22059
15101 22059 31565 35989 34394 8171 6147 11527 7856 8581 15331 12688 -15832 -55093 -54543 -16463
15087 -16463 13491 16349 7619 -11971 -15942 -46209 -46560 -46552 -13275 10338 28221 8195 -23876
15074 -23876 -58418 -55332 -53710 -38023 -28969 -5920 -17014 -12160 -18401 -49492 -49518 -43872 -25639
15061 -25639 4625 2539 -4105 -16953 -9231 -34273 -29482 -33167 -37083 -81592 -124724 -126203 -105355
15048a05355M9607M8248K2777J4856K9962N016j5626m3554l6133R154K2674m901
15036c275k9314j8069q645K1016J308R614j510O307K6512J383l4725J2223r33
15023a8108n7496q550J0520K8455L8475K6595m79j4431J3699J2534m936k922j3020
15010A0336l7829N584k148p325L07R564M758r665Q398M4296J9236l998l957k084
14996C5473l6885k123J0151j0728m808r105o417k3033r947K6663K7253k5332K0196
14983h642O0710J3218m178k56n6660j5484J948J5524j2529P281p855o495k1195
14970c4613K7371j98L710J173m536q202k0360o710R495j4294J1820O474O935k0974
14956d2909j4862m428P104J457L8456M1840J0564k28k3584q889m379K2233K1419
$$ plain form
15048 -105355 -55748 -7500 15277 30133 60095 65111 49485 5931 -30202 -21048 1626 -3275
15036 -3275 -32589 -50658 -59303 -38287 -36979 -27365 -28875 -22568 3944 5327 -29398 -17175 -18108
15023 -18108 -75604 -84154 -73634 -45179 -6704 19891 19412 4981 18680 31214 26278 23356 10336
15010 10336 -27493 -21909 -24057 -31382 -31075 -21511 -16753 -26418 -18020 26276 45512 41514 37557 35473
14996 35473 -1412 -3535 6616 -4112 -8920 -18025 -24442 -47475 -57422 -30759 -3506 -28838 -8642
14983 -8642 52068 65286 61108 60852 4192 -11292 -9344 6180 -6349 932 -6923 -13418 -34613
14970 -34613 -7242 -7440 -3730 -2557 -7093 -15295 -35655 -42365 -32870 -47164 -35344 -28870 -21935 -42909
14956 -42909 -57771 -62199 -55095 -53638 -15182 26658 37222 36994 13410 4521 142 22375 43794
14943D3794o993o456o913N41j9464l7515K4809K2615k0398P902Q640J3131N148
14930B8841k8254m3150j0597K5703O032L5287m42j0397k8007j9480Q926k380p465
14917d5383M4695K891N771J7262l0515n134j4327j8385K7099J0594k5809k9192
14905f0433R064p425K0204L3702J3573J568l8130k8488j8752O280K827j3965J9878
14892f0097K2231j8178J291r347r276L0162K6966k4825l3595k603J1787M8039
14880a7445M9660p729o213N667q643j0986l5090l3731O60K0736L5845j1109l1502
14867d9880M767P638r472m778J9651J459j1025l833J5469L830M047l112l0507
14854e5746m372L4887K7423m117J01j1326p342K6013K8448j2875o493l721N637
$$ plain form
14943 43794 36801 30345 23432 23973 4509 -33006 -8197 14418 -5980 1922 10562 23693 28841
14930 28841 587 -42563 -53160 -27457 -21425 13862 13420 3023 -24984 -44464 -35538 -37918 -45383
14917 -45383 -688 2203 7974 25236 -5279 -10413 -24740 -43125 -16026 -5432 -31241 -60433
14905 -60433 -51369 -58794 -38590 -4888 8685 10253 -27877 -56365 -75117 -68837 -66010 -79975 -60097
14892 -60097 -37866 -56044 -54753 -64100 -73376 -43214 -16248 -41073 -74668 -77271 -65484 -17445
14880 -17445 32215 24486 18273 23940 15297 4311 -30779 -64510 -63850 -43114 -7269 -18378 -49880
14867 -49880 -45113 -37475 -46947 -51725 -32074 -30615 -41640 -45473 -30004 -26174 -22127 -25239 -55746
14854 -55746 -60118 -25231 2192 -1925 -1824 -13150 -20492 5521 33969 21094 14601 10880 16517
14841A6517k9885L621n777L385Q578k7649K3895L2886j0276j7240m154Q645K510
14828E056j3040J5314J4799J4771J1113p36j8204j8472j3006k9132J1266J5158
14816e113K7525l1243k9879m918M3804L2366m232m1511k1636J8263L2669J7308
14804C3403Q141j3441k1945M483J2025K520k6617j0413P437k4915j8141J7768
14792b9695j524j5570K9189K7956K0563k214j7375j0483j7746k5455q504K3862
14780b6996K9505L957Q635k376j2501K1846j0180M172P519n621j4956k438M300
14767D866J3800J4505m662k5263K3187p554p166J3450N426L415J6884j249j505
14754D8134l84k1730N32j3573n5991Q845M3693o580k2504j5280p06J2196K6205
$$ plain form
14841 16517 -13368 -9747 -15524 -12139 -3561 -31210 -7315 25571 15295 -1945 -6099 2546 5056
14828 5056 -7984 7330 22129 36900 48013 47277 29073 10601 -2405 -31537 -20271 -5113
14816 -5113 22412 -8831 -38710 -43628 176 32542 28310 -13201 -34837 -16574 16095 33403
14804 33403 41544 28103 6158 10641 22666 25186 -1431 -11844 -4407 -29322 -47463 -29695
14792 -29695 -31219 -46789 -17600 10356 30919 28705 11330 847 -16899 -42354 -50858 -26996
14780 -26996 2509 6466 15101 12725 224 22070 11890 16062 23581 17960 3004 566 4866
14767 4866 18666 33171 28509 3246 26433 18879 11713 25163 30589 34004 50888 49639 48134
14754 48134 47750 26020 26552 12979 -43012 -34167 9526 2946 -19558 -34838 -35544 -23348 2857
14741B857J2999J3487j6708J1359J3700P777K1258l6458j046k4104r95J532J4344
14728B0002L4104o56l958p174M362n08k0343k0139k7311K2688L0879J6612L724
14715E2282k4076J5528N1270j5830l8565l4163l9725L576J7085q089K0378J7024
14703A6695N581L80J3645j0617n358J7510l66k091q72j5743j8999k194L1784L240
14689C2595k8669L1574j8284l9777J2958M007m615k275k905K1212K1299l220R420
14676C3320k1201l2220j4353l26k412K8340k1397l860K1077j4109J706L1245k980
14663B830J0036J3197k5212j7548o933r187K7297J8648m866j552l3562m2151K8076
14650d0927K0106M206k6612P301M0306K1385R548r360l068j6938l9693N846J9183
$$ plain form
14741 2857 15856 29343 12635 23994 37694 45471 66729 30271 29225 5121 4126 5658 20002
14728 20002 54106 53450 49492 42318 46680 46172 25829 5690 -21621 1067 31946 48558 52282
14715 52282 28206 43734 95004 79174 40609 6446 -33279 -29703 -12618 -20707 -329 16695
14703 16695 22276 22656 36301 25684 20326 37836 37470 35379 34507 18764 -235 -2429 29355 32595
14689 32595 3926 35500 17216 -22561 -9603 -5596 -10211 -12486 -15391 5821 27120 23900 33320
14676 33320 12119 -20101 -34454 -34780 -37192 -8852 -30249 -34109 -13032 -27141 -25435 5810 2830
14663 2830 12866 26063 851 -16697 -23630 -32817 -5520 13128 8262 6710 -26852 -69003 -40927
14650 -40927 -20821 -16615 -43227 -35926 4380 25765 35313 25953 22885 5947 -33746 -27900 -8717
14637h717J5574k8536j6979J8636Q090q097l2N4632L4081k4178l3742R268j6119
14624C881l816j5195j0263J2812M089J2164j175L0424N93J25m459l3038J306L4592
14610C2040M1651j4259m0261m157j167l1728J2633Q222J1708L348L610Q037q981
14597B0696k2543k0614l3368n302J9488l669J4235J7008r927k8484N68J5598K3748
14584a2566o308K7788j1079K270j4250j6271q96L0913j1143k5858j5298O1405
14572H707K9929l5268q044L5412j2198L2131L8664k1702j2462k2935r227j7457
14560E550P176R922k6460n2470j4749M9551K7630J9818L3443K7057p171p662j1583
14547F0052l4421k4640L42L2064M0698J1325q05k6170J8308l4336j3634Q685j0902
$$ plain form
14637 -8717 6857 -21679 -38658 -20022 -11932 -20029 -20061 34571 68652 44474 10732 20000 3881
14624 3881 65 -15130 -25393 -12581 -8492 3672 2497 32921 33514 33639 29180 -3858 -2552 32040
14610 32040 73691 59432 19171 15014 13847 -17881 -5248 2974 14682 18030 21640 29677 20696
14597 20696 -1847 -22461 -55829 -61131 -41643 -45312 -31077 -14069 -23996 -52480 -51912 -36314 -12566
14584 -12566 -18874 8914 -2165 105 -14145 -30416 -31312 -399 -11542 -37400 -52698 8707
14572 8707 38636 3368 -4676 30736 18538 50669 89333 67631 55169 32234 23007 5550
14560 5550 12726 22648 -3812 -56282 -71031 -21480 6150 25968 59411 86468 79297 71635 60052
14547 60052 25631 991 1333 33397 74095 85420 84615 58445 76753 42417 28783 37468 26566
14534B6566j7653O917O822K824K4335k6128m5779m5487L865J3727J6434l1259
14522f4816J7089K4135k690J4680K4684P353k2110M5844j1082j6261k4234q891
14510a6299o275Q201L0039l2995j2662M567k724L0566J6378O290j2740k5943k4442
14497c8039J6373J5280K5176m592j9091o972l4765m653K9723O075j6009j9199
14485e0693k430K2581L706J170N3665K2105j4653j4869k9383j6239M813j4260
14473c4487L4121j5198j8910P027K9036j0403k356J7844j4148k0331J5504Q550
14461c751k6572J4066K507j8148j2644J7617J4286J1518j0275M2805N426k4840
14449A1995J610J4058k7647l4947K4975M742K3614p088k6136k2502r497R81K4482
$$ plain form
14534 26566 8913 15830 22652 25476 49811 23683 -22096 -67583 -63718 -49991 -33557 -64816
14522 -64816 -47727 -23592 -26282 -11602 13082 20435 -1675 44169 33087 16826 -7408 -16299
14510 -16299 -22574 -14373 15666 -17329 -29991 -25424 -28148 2418 18796 25086 12346 -13597 -38039
14497 -38039 -21666 -6386 18790 14198 -4893 -11865 -46630 -51283 -21560 -15485 -31494 -50693
14485 -50693 -53123 -30542 -26836 -25666 27999 50104 35451 20582 -8801 -25040 -20227 -34487
14473 -34487 -366 -15564 -34474 -27447 1589 -8814 -11170 6674 -7474 -27805 -12301 -3751
14461 -3751 -30323 -16257 -13750 -31898 -44542 -26925 -12639 -1121 -11396 31409 36835 11995
14449 11995 13605 27663 16 -34931 -9956 -5214 18400 11312 -14824 -37326 -46823 -45842 -21360
14436b1360j2914j5247K8523J9250L4045k7008n2271J550N946R199K8888O776
14424E377J4692J8401j464m8157m4583J720L2378L5121K3566K777j9673k979p925
14411I251J1K2161j8350o40q036q825j9646j237J7195L6312K5662p926m1721m7867
14397d3656L9509N6006k3398j2429K252m0978k2584J8398J9434j8841J9538l775
14385a0524O81L0196J6816P536J6959l1194Q395L471m1989N480N514j132J9763
14372B9972J6848j2466o312k4059q613J3442J4906n759N619N418K5597M705n36
14359E8762M156j1447J8671o165n0237q498L1414L2138J1985o550J21k0986k793
14346E0571j4482J3398K7604j5707l7442l8336J613L9050J5456J391l558k0172
$$ plain form
14436 -21360 -34274 -49521 -20998 -1748 32297 5289 -46982 -45432 -39486 -30287 -1399 5377
14424 5377 20069 38470 37006 -11151 -55734 -54014 -21636 13485 37051 39828 20155 17176 9251
14411 9251 9262 31423 13073 12433 4397 -4428 -24074 -25311 -8116 28196 53858 45932 4211 -43656
14397 -43656 -4147 51859 28461 16032 18284 -22694 -45278 -26880 -7446 -26287 -6749 -10524
14385 -10524 -9843 20353 37169 44705 61664 30470 38865 42336 347 5827 11341 10209 29972
14372 29972 46820 34354 28042 3983 -4630 8812 23718 17959 23578 28996 54593 59298 58762
14359 58762 62918 51471 70142 63977 13740 5242 36656 68794 80779 74229 74350 53364 50571
14346 50571 36089 49487 77091 61384 23942 -14394 -12781 26269 41725 43116 39558 19386
14334A9386k7635k569L0932j2523k6914k6042J5016J9968K4004j2145l854K680
14322C04O813M694J6040j8208j3046p212K5282J9627n251K6356q433O537k3219
14309C0284m2190K5464K981n4165R58J9021L7900J2851N944j9799N742O966j3563
14296A8394J5966J4019J8862J1138k5947l124j0393k7159j038K247k6883l5355
14284d9273K950J4676N943K4283J6643J887K2279p347k3867j4066J5650L6025
14272D5783J03k7923k5401L998O121L7058j3490r634k828J7938n102o043o829
14259A3751l5522r927L0860P591K172r442L328K534J6583J0499r518l835K8781
14246D7855j0115n736J3475n184k2776j9055L789j0802Q648J9670N355O019J1078
$$ plain form
14334 19386 -8249 -10818 20114 7591 -19323 -45365 -30349 -10381 13623 1478 -2376 304
14322 304 7117 11811 27851 9643 -3403 -10615 14667 34294 29043 55399 46966 53503 30284
14309 30284 -11906 13558 16539 -37626 -36668 -17647 20253 33104 39048 19249 24991 31957 18394
14296 18394 34360 48379 67241 78379 52432 49308 38915 11756 10718 12965 -13918 -49273
14284 -49273 -46323 -31647 -25704 -1421 15222 17109 39388 32041 8174 -5892 9758 45783
14272 45783 45886 17963 -7438 -3440 2681 39739 26249 16615 13787 31725 26623 20580 13751
14259 13751 -21771 -31698 -838 6753 8925 -517 2811 5345 21928 32427 22909 19074 47855
14246 47855 37740 32004 45479 40295 17519 -1536 2253 -8549 99 19769 25124 31143 42221
14233D2221k426J3522k9331n2967N470P933J014J80p550j3280j0375J2723J4495
14220a8371L2945J828j6493J3194J3363j7476r087k4223k952k9736J508K4048
14208c1452N6415j4752k5567J3078K3348J12J6507p138n522J5890J1230j5380
14196C6769l6073j322k3097k6661l874M3878Q838m434p820j7267K0400K9554O40
14183A9531k783J345P501k5169k508J0429j4208k1844J6036M987J356J0975J0246
14170A5894k4300J1474J6619N115l1873q515M6011J9779j1833j9335J2118P576
14158C8730j5943j7414k5024R543l014J1333J6055K149J8735j0209k4756j0700
14146a0515K1564J2542k2616j6953N890J7758j7465l69R363K0334J5897Q754k8115
$$ plain form
14233 42221 39795 53317 23986 -28981 -23511 -15578 -14564 -14384 -21934 -35214 -45589 -32866 -18371
14220 -18371 14574 16402 -91 13103 26466 8990 -97 -24320 -27272 -57008 -55500 -31452
14208 -31452 24963 10211 -15356 -2278 21070 21182 37689 30551 25029 40919 52149 36769
14196 36769 696 -626 -23723 -50384 -54258 -10380 -1542 -5976 -13796 -31063 -10663 18891 19531
14183 19531 16748 18093 25594 425 -2083 8346 -5862 -27706 -11670 -6683 -5327 5648 15894
14170 15894 -8406 3068 19687 24802 -7071 -15586 30425 50204 38371 19036 31154 38730
14158 38730 22787 5373 -19651 -10108 -13122 -1789 14266 16415 35150 24941 185 -10515
14146 -10515 11049 23591 975 -15978 -10088 7670 -9795 -10164 -801 19533 35430 44184 16069
14133A6069k5189J1531k2377q885L3433R014l9652r514M0630J8321r392j6006
14121b017p080J8096P799J1001K7179k4927J5353j82p764K766M326k0054l899
14108B0597j7253j3214l441j5034J1824K760r809J6960o215P832M0787Q601k7757
14095A6638j8768K6195M982k1767m9968J8429j1448r915j100J2442j4338K8109
14083b0509L409J4669k2079J1796J4331k5592k397n478L9447j1576k7232O232
14071b4979J1214J6138P916J9518j2075p493l4828m269N203K5997r805o736R966
14058d233P305L5145o691n1475J2925K7981K062n82j0296k6616J6589K808J7754
14045B2676R99j1925k5284j2870k3213l3695J7221N6569J3157j1128L1861J3140
$$ plain form
14133 16069 -9120 2411 -19966 -28851 4582 13596 -26056 -35570 5060 23381 13989 -2017
14121 -2017 -9097 8999 16798 27799 54978 30051 45404 45222 37458 40224 44550 24496 20597
14108 20597 3344 -9870 -13311 -28345 -16521 -13761 -23570 -6610 -12825 -4993 35794 44395 16638
14095 16638 -2130 24065 29047 7280 -42688 -24259 -35707 -45622 -46722 -34280 -48618 -20509
14083 -20509 -17100 -2431 -24510 -12714 1617 -23975 -26372 -31850 7597 -3979 -31211 -24979
14071 -24979 -13765 2373 10289 29807 17732 10239 -24589 -28858 -23655 2342 -7463 -14199 -4233
14058 -4233 3072 38217 31526 -19949 -7024 20957 23019 22437 12141 -14475 2114 4922 22676
14045 22676 23675 11750 -13534 -26404 -49617 -83312 -66091 -9522 3635 -7493 24368 37508
14033C7508l6837J8877j1285l024j8985J5358n252M562k409L0005J1065j0562
14021B9021l1064K2289L8342p693k0406N3j3261J1730j3537O411R011O395J8313
14008E5604J4928l0701k1033j8803l1314o38L7781R694j6513j9214L5282L0895
13996D5968L159p577j5636j5443k8357O868N469q616J1262J3402k5645J7743J9435
13983B2032J3775K532K2107O839k4242k9362J181M5157J8232j5405m1513q992
13971A2341J6405k0909k7638K1216J0280k1279k0504q258L0711K8841k783k9165
13959a0742L284L0156J8569j7109J5156k4977r930r838J4350k1481k9678K1458
13947b0782K6810m427k7302O732P669M9933K8416m7623k7510k4790J7878K8181
$$ plain form
14033 37508 671 19548 8263 5239 -13746 1612 -3640 922 -1487 28518 39583 29021
14021 29021 -2043 20246 58588 50895 30489 30542 17281 29011 15474 21885 30896 37291 55604
14008 55604 70532 39831 18798 -5 -31319 -31957 5824 15518 -995 -20209 15073 45968
13996 45968 49127 41550 25914 10471 -17886 -11018 -5549 -14165 -2903 10499 -15146 2597 22032
13983 22032 35807 38339 60446 67285 43043 13681 14862 60019 78251 62846 21333 12341
13971 12341 28746 7837 -19801 1415 11695 -9584 -30088 -38346 -7635 21206 18423 -10742
13959 -10742 -7458 22698 41267 24158 39314 14337 4407 -5431 8919 -12562 -42240 -20782
13947 -20782 6028 1601 -25701 -18969 -11300 38633 67049 19426 -8084 -32874 -14996 13185
13935A3185L1888L406j5764R37j6008j1743k5111k0032J1714L0930J8307q870
13923A2839j9989l2060q807R446P610l7395J6804L9388K4334P178j5344j8330
13911a4326J3007j3118n353M5241J0001J1027k8063q889J669o852n583K4576K6790
13898E0127j3353K8540J295k138m8774l8006j3745K1235K7466K0538N656N581
13886D4422j0284j0805L1052j2077k5088q004J6524P976j5718n875j1367r687
13874h931j8326j1991n2J1503p909R656K4646K4796j5333j1043J926k1255n299
13861b7612L7366J0514L542j0197l72j3013k6371q498J6041L4028N728j7987j4116
13848a0947k5013L9608J1502k9089L894j901k25N1374J7119R838j5049k4640P108
$$ plain form
13935 13185 45073 48479 32715 33652 17644 5901 -19210 -39242 -27528 3402 21709 12839
13923 12839 -7150 -39210 -48017 -38571 -30961 -68356 -51552 -12164 12170 19348 4004 -14326
13911 -14326 -1319 -14437 -19790 25451 35452 46479 18416 9527 11196 4344 -1239 23337 50127
13898 50127 36774 65314 66609 64471 15697 -22309 -36054 -14819 12647 33185 38841 44422
13886 44422 34138 23333 54385 42308 17220 9216 25740 33716 17998 12123 756 -8931
13874 -8931 -27257 -39248 -39300 -27797 -35706 -26050 -1404 23392 8059 -2984 -1058 -22313 -27612
13861 -27612 9754 20268 23810 13613 13241 228 -26143 -34641 -18600 15428 21156 3169 -10947
13848 -10947 -35960 3648 15150 -13939 -10045 -11946 -12171 39203 56322 66160 51111 26471 33579
13835C3579k2996m8938J5643M4699j983k1755j0002J5565J1474n11n165l255P992
13822A4347K203J2777J3434q370k4920k916R472J8271o257m0487Q317o210r497
13809a9836L208O906L1302M952l1845J0652J9511p958J4602k4831k761J2779K2472
13796C9153K7902k043j3319k1753M376J1248m163q431J46j1167q309j3948O829
13783F521J0810J1514r330k2600j4918l3334J6240L4747l060K1403J4374o726
13771B5641j085K4952M805m154J8224n201l3630j6275K297J8865N072N466L308
13758D8285N671p546j5563p499j9400o205M076K6070J2252j7299q907j6163K5100
13745B2872O541m1342j6689Q63o644M885K6749L9779k0166j8309L9188J6321j2653
$$ plain form
13835 33579 10583 -38355 -22712 21987 20004 -1751 -11753 3812 15286 14775 9610 6355 14347
13822 14347 16550 29327 42761 34391 9471 6555 16027 34298 28041 -12446 -4129 -10339 -19836
13809 -19836 -16628 -9722 21580 26532 -5313 5339 24850 16892 31494 6663 3902 16681 39153
13796 39153 67055 65012 51693 29940 34316 45564 41401 32970 33116 21949 13640 -308 6521
13783 6521 17331 28845 19515 -3085 -18003 -51337 -35097 -350 -3410 17993 32367 25641
13771 25641 24556 49508 54313 50159 68383 63182 29552 13277 15574 34439 39511 44977 48285
13758 48285 53956 46410 30847 23348 3948 -2257 1819 27889 40141 22842 13935 -2228 22872
13745 22872 29413 -11929 -28618 -27755 -34399 -29514 -2765 37014 16848 -1461 37727 54048 41395
13732D1395q223r229J4955j7068j6817K129j5900l010k222j6033J9245J9412j3835
13719e201j3960M136N833K7257k785J730J0030J9817Q553j373k0183j9820P234
13706B1268Q091j3465j1352J0157J7144j8137k078O507J3703N747Q001J7146M33
13693F3165L893M132j8552o408l0220q136L535P274k018k2848m2378J1553L646
13680c3362J5843K238l0676O363K2294k968j9104K0214P466J0150j4497k0864
13668c6903p809r624j545Q727L136J6876J0110J385j7653j9980L1705L5857k198
13655A2084l2260q634N978K0725N061k4494N36p596K3112K113m577m677m1637
13642e4266J6109R238q021J1487O316Q219j5156P554Q343k5399j7569k141N356
$$ plain form
13732 41395 33172 23943 38898 21830 5013 7142 -8758 -11768 -13990 -30023 -10778 8634 -5201
13719 -5201 -19161 -15025 -9192 18065 15280 17010 27040 46857 55410 54037 33854 14034 21268
13706 21268 29359 15894 4542 14699 31843 13706 11628 18135 31838 37585 45586 62732 63165
13693 63165 67058 71190 52638 46230 16010 7874 11409 18683 16665 -6183 -48561 -37008 -33362
13680 -33362 -17519 -15281 -45957 -39594 -17300 -20268 -39372 -19158 -11692 -1542 -16039 -36903
13668 -36903 -44712 -54336 -55881 -47154 -44018 -27142 -17032 -15647 -33300 -53280 -21575 14282 12084
13655 12084 -20176 -28810 -22832 -2107 2954 -21540 -21004 -28600 -5488 -3375 -7952 -12629 -54266
13642 -54266 -38157 -28919 -36940 -25453 -19137 -10918 -26074 -18520 -10177 -35576 -53145 -55286 -49930
13629d9930l646J2808J3556N589m567l367l623J0593j0189j932K4673j77J7689
13616G477K3236l427m383J6401k2437k7768j0650n371K4188K6844K0903o562n7269
13603a8818k9017M8060m755k2486k6131P737O7215P469Q111J0565K306j3565l3118
13590C573k7045K5713q004j6641J4198j5771n738J4672L7333J2988N148q873K6583
13577E8136J1328m6164k8375k4949r87N3045K1687m2608j4937J124J5056N737
13565H093k706j1263k5100j5541Q855K5934J1776k1555K6718j3245N072K5362
13553B2400K8825J259K0000J5215l5784n1236m6908P594M4918J756k2759j4136
13541b8856P4645K7495j2252m787J0139m742k0202l7308M156j888m2299J5352
$$ plain form
13629 -49930 -53576 -40768 -27212 -21623 -26190 -29557 -33180 -22587 -32776 -34708 -10035 -10212 7477
13616 7477 30713 27286 22903 39304 16867 -10901 -21551 -26922 -2734 24110 45013 38451 -18818
13603 -18818 -47835 225 -4530 -27016 -53147 -45410 21805 29274 37385 47950 50256 36691 3573
13590 3573 -23472 2241 -5763 -22404 -8206 -23977 -29715 -15043 22290 35278 40426 31553 58136
13577 58136 69464 23300 -5075 -30024 -31011 22034 43721 1113 -13824 -12700 2356 8093
13565 8093 5387 -5876 -30976 -46517 -37662 -11728 48 -21507 5211 -8034 -2962 22400
13553 22400 51225 52484 72484 87699 51915 679 -46229 -38635 6283 8039 -14720 -28856
13541 -28856 45789 73284 61032 56245 66384 61642 41440 4132 8288 6400 -35899 -20547
13529b0547L5209l1384j8199j4961L3904N085q148Q889o362R898J2663N785Q369
13516B0201o342k177K1486R416k5337l1402M655L350L2382K2479J4578l7481k3583
13503B225j4176K7756J6413o8J0501l3748o39L0360k7126K0402K2860j7664K108
13490C9204k8132J1045p812j0400N290N15K447K7024n483k0925J1981J4227n828
13477C3153m481J687M859k2408j5303j7825J8068P703J7994K6384j3898k1773
13465A4160j9175k2668k9367L032R730K152M1166L8695J6485l0632l5826n182
13453a7430K1330J0816k5385r858O087L641L0142J1804K803m9091k0536J488L1601
13440b588K1078j6137J0175m268j4473K6980Q672r495m1480k5830J1261J9431
$$ plain form
13529 -20547 14662 -16722 -34921 -49882 -15978 -10893 -19041 -10152 -16514 -6616 6047 11832 20201
13516 20201 13859 11682 33168 42584 17247 -14155 -9500 -6150 26232 48711 63289 25808 2225
13503 2225 -11951 15805 32218 32150 42651 8903 8264 38624 11498 31900 54760 37096 39204
13490 39204 11072 22117 14305 3905 9195 9710 12157 39181 33698 12773 24754 38981 33153
13477 33153 28672 30359 35218 12810 -2493 -20318 -2250 5453 23447 49831 35933 14160
13465 14160 -5015 -27683 -57050 -54018 -44288 -42136 -970 37725 54210 23578 -12248 -17430
13453 -17430 3900 14716 -10669 -20527 -14440 -10799 19343 31147 33950 -15141 -35677 -34189 -2588
13440 -2588 18490 2353 12528 8260 -6213 20767 29439 19944 -21536 -47366 -36105 -16674
13428a6674j6310M757n955j0041p107K7352L5279L460j8654J4257J6129p259l7591
13415a8357J1496K7549k2486k6295K270L847J932j6110J2590R190j9031k800R955
13402b6250L298Q380J3474r00N625J22l3014j6207q651R066N436m859K957Q724
13388c2799n160j6301j158M6457J2636l513l9315m1865k618L5724N7825L8003
13376D7916R932P11q399k9318n565K5230n436j7307j244P879k4603M4435M723
13363D8954J2587K4653p807l7761m3838J1812j5607k0407j064j6728K9268K766
13351a3172R32r679L0883J9342j1288j2304J4343K681J175l8507j9412P673K8882
13338A549L922m0710J6674k1475j7720J8587L5017K3105j8567M340J780j6757
$$ plain form
13428 -16674 -32984 -28227 -34182 -44223 -51330 -23978 11301 14761 -3893 10364 26493 19234 -18357
13415 -18357 -6861 20688 -1798 -28093 -25823 -21976 -20044 -36154 -23564 -14374 -33405 -36205 -26250
13402 -26250 -22952 -14572 -1098 -1998 3627 3749 -29265 -45472 -54123 -45057 -39621 -44480 -41523 -32799
13388 -32799 -37959 -54260 -55418 -8961 3675 162 -39153 -81018 -83636 -47912 9913 47916
13376 47916 57848 58559 50160 20842 15277 40507 35071 17764 16520 24399 -204 44231 48954
13363 48954 61541 86194 78387 40626 -3212 8600 -7007 -27414 -28478 -45206 -15938 -13172
13351 -13172 -12240 -21919 8964 28306 17018 4714 19057 21738 22913 -15594 -35006 -27333 1549
13338 1549 5471 -35239 -18565 -40040 -57760 -39173 -4156 18949 382 4722 6502 -10255
13326a0255p882J1233m501K9883q204p340k4928K2358j4802k0882K0404K1873
13314F957L237j6557R707k808k704P016J4327r873Q054L3215k1973o011q714m3540
13300b9667j8082J5058K5344j0498l0735Q074K0172L4811K2876J4393l9312m991
13288G443M31J5107K3901m861K6370P264j1517j7795j9530k2682k0346Q203K9020
13275B1008O736l2732K093L8135K0302m1829n4408R205Q215m6355l437J2319K269
13262e8479q78N674K0328L459J7150k0557n904J4912l097j0958M061p893J6561
13249b5621K4823l514J7591K6629l4845m9431K372L2706q308Q088l245n011M083
13236a3683Q359R631n484J519J6279k0369j3414N3q835M8386N4892l6854j0796
$$ plain form
13326 -10255 -18137 -6904 -11405 18478 10274 2934 -21994 364 -14438 -35320 -14916 6957
13314 6957 10194 -6363 3344 536 -2168 4848 19175 9302 17356 50571 28598 22587 13873 -29667
13300 -29667 -47749 -32691 -7347 -17845 -48580 -40506 -20334 14477 37353 51746 12434 7443
13288 7443 7874 22981 46882 42021 68391 75655 64138 46343 26813 4131 -16215 -8012 21008
13275 21008 27744 -4988 -2895 35240 55542 13713 -40695 -31490 -23275 -69630 -73067 -60748 -58479
13262 -58479 -59357 -53683 -33355 -29896 -12746 -33303 -39207 -24295 -27392 -38350 -34289 -42182 -25621
13249 -25621 -798 -4312 13279 39908 5063 -44368 -41996 -9290 -17598 -9510 -12755 -17766 -13683
13236 -13683 -5324 4307 -1177 342 16621 -3748 -17162 -17109 -25944 22442 77334 40480 29684
13223B9684k1176j9074J7441k084o030j8168J8150j7288L063L1006q083J2598
13211B0039j5516l3703L5893N630k0092r910l3181Q216M1902K38O533R396l60
13198A5085L049o27k1085O851O774Q688J494j4336J1671q123k2249K3575O402
13185A7169J4834k8476k4268K3366K1190M389m087j5757P709N240m849j024m7897
13172c2461k6000P845k164m625L4614M5652K7840n514k6849j9408L847j0726J729
13159f220J5613j9028n132j4309K0517K1062K1361J4031k4643o674j6941l1090
13147c1453n508k4361K0863L1230Q984J9878m642j573J2369p778k8267L1904K1569
13134D3215j6050k5243Q520J2122q203m455m49R609J6636j5780p039q207L2118
$$ plain form
13223 29684 8508 -10566 6875 4791 -1239 -19407 -1257 -18545 -15482 15524 7441 20039
13211 20039 4523 -29180 6713 12343 -7749 -17659 -50840 -42624 -722 -484 6049 15445 15085
13198 15085 18134 17507 -3578 3273 10047 18735 20229 5893 17564 9441 -12808 10767 17169
13185 17169 32003 3527 -20741 2625 23815 28204 24117 8360 16069 21309 16460 15436 -32461
13172 -32461 -58461 -50616 -52780 -57405 -22791 22861 50701 45187 18338 -1070 2777 -7949 -6220
13159 -6220 9393 -9635 -14767 -29076 -8559 12503 33864 47895 23252 16578 -363 -31453
13147 -31453 -36961 -61322 -40459 -9229 -245 19633 14991 13418 25787 18009 -10258 21646 43215
13134 43215 27165 1922 10442 22564 14361 9906 9457 19066 35702 19922 12883 4676 36794
13121C6794J5198L4648m2304k6875o412o446k8821j1101K7796K3639k1138k0192
13109b5214o16J0064N896K3206J4582J7939j7484k1955m290o934m0362o451K5993
13096b5626j0013k6255j5619n772Q161J6323k016M0672P770m439K2405L773Q310
13083A7674Q398k3967o300j2828K375J5949o035m87K4333K1700L7137N672l378
13070H0243k2322m6156K2556k380j1910J693J2395O421k6927m9927k3220K4997
13058c4537K077j3920K8908L0044J8240j8826J0349J4834K7342J287k5974k6527
13046A3297J6140k6170P632j6767j3945Q280j0664K2541J2450p648J6472L0409
13034E2027o380j5225j85O460l6048k2365M503J1533J3186j0299j8103J846j3127
$$ plain form
13121 36794 51992 86640 44336 17461 11049 4603 -24218 -35319 -7523 16116 -5022 -25214
13109 -25214 -25830 -15766 -9870 13336 27918 45857 28373 6418 2128 -4806 -45168 -51619 -25626
13096 -25626 -35639 -61894 -77513 -83285 -75124 -58801 -60817 -20145 -12375 -16814 5591 9364 17674
13083 17674 26072 2105 -4195 -17023 -14648 1301 -4734 -5221 19112 40812 77949 83621 80243
13070 80243 57921 11765 34321 31941 20031 21724 34119 40540 13613 -36314 -59534 -34537
13058 -34537 -32460 -46380 -17472 12572 30812 11986 22335 37169 64511 65798 39824 13297
13046 13297 29437 3267 10899 -5868 -19813 -11533 -22197 344 12794 5146 21618 52027
13034 52027 45647 30422 30237 36697 649 -21716 -17213 -5680 7506 -2793 -20896 -19050 -32177
13021c2177L1727J6657j1341k2556j335J6149k7773j0204j276N562O060M8935
13009A8428J3232L801k2258n084K9354J5264J3791j5342j4295J701J0868n331
12997D4129k0187m4172q439L204J2178j1414Q940J3997N627J206K8040k3116j0219
12984b26k2215o697l851j9283k476q093J6775K0690p892J3069K9323P999n704
12971A1419J3906J4041j1391k7407j996j2205K1019L4988L6899J9377l3077l3167
12959C2406k4683k0882l9181j2056k4L1553L1334R091k6257M684P301Q42J3439
12946G567j7076O195R090M558j0730q573k1705q727q277P498O993J1862J6658
12933d667J0298O675K993k2982k0117j5846K2189J9401J6174j8076l2926K8300
$$ plain form
13021 -32177 -450 16207 4866 -17690 -19025 -2876 -30649 -40853 -42129 -36567 -30507 18428
13009 18428 31660 35461 13203 8119 37473 52737 66528 51186 36891 38592 49460 44129
12997 44129 23942 -20230 -28669 -25465 -13287 -24701 -15761 -1764 3863 5069 33109 9993 -226
12984 -226 -22441 -29138 -32989 -52272 -54748 -62841 -46066 -25376 -33268 -20199 9124 17123 11419
12971 11419 25325 39366 27975 568 -1428 -13633 7386 42374 79273 98650 65573 32406
12959 32406 7723 -13159 -52340 -64396 -64420 -32867 -1533 7558 -18699 -14015 -6714 -5872 7567
12946 7567 -9509 -3314 5776 10334 -396 -8969 -30674 -39401 -47678 -40180 -33187 -21325 -4667
12933 -4667 5631 12306 15299 -7683 -27800 -43646 -21457 -2056 14118 -3958 -36884 -8584
12921h584J0626j4998k75K849J7683J8026P644K481p725Q817m2059l5443J111
12908c9847M3653J8502l6859K449j8033K558K1144j0810O541L1063m995j8687
12896c321p046K894m723J0385J1720J0509Q215J1595j0004J7780k0891k3441p110
12883c438j6216k6152N940J5496J1198p098n06J7404K0684L92j8711Q540J1959
12870A9492j806j8934j2254J8443P203j6300L953J2041M939m5703j4880J1090
12858c2716K3432Q753K4609J7069j2974j1358j9714J1856K0730j8877R490Q312
12846B8612J4948p357j6244k7300k695k9534l781Q846L3819j4386m387j4830O009
12833b8280k750m129O544K979k002r683k648l68J7528O217o558p413O789J1371
$$ plain form
12921 -8584 2042 -12956 -13231 -10382 7301 25327 32971 35452 27727 36544 -5515 -40958 -39847
12908 -39847 3806 22308 -14551 -12102 -30135 -27577 -6433 -17243 -10702 20361 15366 -3321
12896 -3321 -10367 -7473 -12196 -1811 9909 20418 28633 40228 30224 48004 27113 3672 -3438
12883 -3438 -19654 -45806 -39866 -24370 -13172 -20270 -20776 -3372 17312 17704 -1007 7533 19492
12870 19492 17686 -1248 -13502 4941 12144 -4156 -203 11838 16777 -28926 -43806 -32716
12858 -32716 -9284 -531 24078 41147 28173 16815 -2899 8957 29687 10810 20300 28612
12846 28612 43560 36203 19959 -7341 -10036 -39570 -43351 -34505 -686 -15072 -19459 -34289 -28280
12833 -28280 -31030 -35159 -28615 -25636 -27638 -37321 -39969 -40337 -22809 -16592 -23150 -30563 -23774 -12403
12819a2403L616l6524Q975J7354J4855k0211k9993p586j5664O135J0630K9782
12807c1034M8487M570k22k0417m340K8726L6452Q234k007k0654l868k4505l8431
12794a9009j649L6039j5754n883J1963j0354k1238j6647M0344M3137K642l9761
12782C830j5659n764J6425L0672o14j1051J2020l5424l0440J2315M43m519J383
12769b6383j1176n524J9526K6134K4164O847k0082j1247N809K217o009l4311j2432
12756d2467m453J3597L2289K7950q058k5845j0422k8975j793N4652p548J1530
12744A0457K6504R717K494R094l703j6465j1857j7639l2689q553J6500L3308K1114
12731C8282j1905l614J217L176R03k835n994k5658k3807L9037J0847J5635k2480
$$ plain form
12819 -12403 -8787 -45311 -36336 -18982 -4127 -24338 -54331 -61917 -77581 -71446 -60816 -31034
12807 -31034 17453 22023 21801 1384 -2956 25770 62222 70456 68449 47795 43927 19422 -19009
12794 -19009 -20658 15381 -373 -6256 5707 -4647 -25885 -42532 -2188 40949 43591 3830
12782 3830 -11829 -17593 -1168 29504 28890 17839 29859 -5565 -36005 -23690 -23247 -27766 -26383
12769 -26383 -37559 -43083 -23557 2577 26741 33588 13506 2259 8068 10285 4276 -30035 -42467
12756 -42467 -46920 -33323 -1034 26916 18858 -6987 -17409 -46384 -48177 6475 -1073 10457
12744 10457 36961 46678 49172 58266 54563 38098 26241 8602 -24087 -32640 -16140 17168 38282
12731 38282 26377 22763 23980 27156 28059 25224 19230 -6428 -30235 8802 19649 35284 12804
12718A2804m015k7385j8439q742j6191J6539M3565j0288J9013L1863K2342k5343
12706C5723m6105J9374L9093n228j0055J4875l4393k4846M5999J7347M236j9997
12694C6023j1984j2332L857J0225R443m061j5372L243l7069O349J2250J5517o706
12681I383j9038L7834O365k0169K2139j6010L2683p395k6655n896J7145L4447
12669F4833K483l0100J5739J7554j272l0073j7478p90l4648k4857k3616q220K3296
12656d7149L6304L0738q353J3537J3552k2067l0431m0483J3399J1336J0970K5313
12644F666K9568n244j0231J1740o864k2654K4192K5372L0718N513p932N956k4979
12631F1821m4444j2487R947j5295o311J6703j0492Q652Q484j4659L0286j7461
$$ plain form
12718 12804 8789 -18596 -37035 -45777 -61968 -45429 -1864 -12152 6861 38724 61066 35723
12706 35723 -10382 8992 48085 42857 32802 47677 13284 -11562 34437 51784 56020 36023
12694 36023 24039 11707 15564 25789 35232 31171 15799 19042 -18027 -11678 572 16089 9383
12681 9383 -9655 28179 34544 14375 36514 20504 53187 45792 19137 13241 30386 64833
12669 64833 67316 37216 52955 70509 69237 39164 21686 20896 -13752 -38609 -62225 -70445 -47149
12656 -47149 -10845 19893 11540 25077 38629 16562 -13869 -54352 -40953 -29617 -18647 6666
12644 6666 36234 30990 20759 32499 25635 2981 27173 52545 83263 88776 80844 86800 61821
12631 61821 17377 4890 14837 -458 -6769 9934 -558 8094 16578 1919 32205 14744
12619A4744k8765Q655J7778L779J1664J3251j8031j7076j2499j9375k0903J4593
12607c2185R751l898P800K7170o146P797K9029q57K042k0926j8813k5691j0572
12594c5499l8748k1432J8971L2569L7700K6924j5306J5039K2090k3923K8846j0163
12582C7068k3646j6804K1593l8339l0558j4964L5039L0406j7126M921p84L0125
12570A6931M3122j7389l109j6653k675L705j6760j1172n495N411J6464L4376M260
12557E1016m193J2943L4778k013o4901l7856j7043Q926o108r490J5562J4841J217
12544b321J296j0032L818K0564J5335l4910m3110o583n02K6405K9672K7483j233
12531B5882K2384J9782m7737l8405J8008K4398j1611k1209n392k3179j9176O039
$$ plain form
12619 14744 -14021 -5366 12412 16191 27855 41106 23075 5999 -6500 -25875 -46778 -32185
12607 -32185 -22434 -26332 -18532 8638 2492 10289 39318 38461 40503 19577 764 -24927 -35499
12594 -35499 -74247 -95679 -76708 -44139 -6439 20485 5179 20218 42308 18385 47231 37068
12582 37068 13422 -3382 18211 -20128 -50686 -65650 -30611 -205 -17331 -12410 -13194 16931
12570 16931 60053 42664 39555 22902 20227 23932 7172 -4000 -9495 -4084 12380 46756 51016
12557 51016 46823 59766 94544 92531 27630 -10226 -27269 -18343 -24451 -33941 -18379 -3538 -2321
12544 -2321 -1025 -11057 -7239 13325 28660 -6250 -49360 -55943 -56445 -30040 -368 27115 25882
12531 25882 48266 68048 20311 -18094 -86 24312 12701 -8508 -13900 -37079 -56255 -50216
12519e0216J4768N0839M4646j8465k6505K3772J2762r886j440p053l5779Q250
12507E693K0043J3095J413o342p613m6733o855L0961L7774l8637l6106J5390m622
12494b2539j4355m365J6514K1603J4411M446J7694q732J2677K4115k1290j2556
12482B7623P822k953j987l592l7735j3128n291L8910L9447j1360m814N773K0842
12469E9557J0325j4289j0830l895l0077j7355J6820M0175K1207k4056Q70l2653
12457A5799l2212m975L2170m198j263k6708l581J3554R937l9620M336J6245J3103
12444g413m639J0906o859m732R797p003L9501p993N968J1884k8212k4000j9403
12431c2198j4823K3760M8266k884k7836p668P510k4590K2136J0341J981j3303
$$ plain form
12519 -50216 -35448 15391 60037 41572 15067 38839 51601 41715 40275 33222 -2557 5693
12507 5693 25736 38831 40244 33902 26289 -20444 -27299 3662 41436 2799 -33307 -17917 -22539
12494 -22539 -36894 -41259 -24745 -3142 11269 15715 33409 24677 37354 61469 40179 27623
12482 27623 35445 32492 30505 26913 -10822 -23950 -29241 9669 49116 37756 32942 38715 59557
12469 59557 69882 55593 44763 40868 10791 -6564 10256 50431 71638 47582 48452 15799
12457 15799 -16413 -21388 10782 6584 5321 -21387 -24968 -11414 -1477 -41097 -36761 -20516 -7413
12444 -7413 -12052 -1146 -8005 -12737 -2940 -9943 29558 21565 27533 39417 11205 -12795 -32198
12431 -32198 -47021 -23261 25005 22121 -5715 -13383 -5873 -30463 -8327 2014 3995 -9308
12419i308j4010l44j0735R944K0645J2061M2087q478j2292L563M472j1350J3206
12406C9461j7815j786p01J5586K8858N921J1418j6422k1301K634k0937p107M8720
12393F6529J3960N81J5534l2395J92k756k3922k5863j3760L319K0139j2768j9868
12380a1078L1081J1941l3576m1204L458J1644J3040l267k0788J8405P972k8867
12368d1239L1635N289K2790M631k4575J1109L2613K6156J2567k9935j1561l5384
12356D096o740J297J7347J6554m0122k5472j549o183L3086J477K1027J3273l448
12343B4643K0572P694r978L5l6132j3430L556M2139k999k5586l0111l027M8349
12330B5725J6341j3523p615k9218n7462l913M8265N287p772J3755L855q18k5192
$$ plain form
12419 -9308 -23318 -23662 -34397 -24453 -3808 8253 50340 41862 29570 33133 37605 26255 39461
12406 39461 21646 19860 19159 34745 63603 69524 80942 64520 43219 45853 24916 17809 66529
12393 66529 80489 81070 96604 64209 64401 61645 37723 11860 -1900 1419 21558 8790 -11078
12380 -11078 20003 31944 -1632 -42836 -39378 -27734 -14694 -17961 -38749 -20344 -12372 -41239
12368 -41239 -9604 -4315 18475 23106 -1469 9640 42253 68409 80976 51041 39480 4096
12356 4096 -2644 -1347 16000 32554 -7568 -33040 -34589 -40772 -7686 -6209 14818 28091 24643
12343 24643 45215 52909 42931 42966 6834 -6596 -3040 39099 36100 10514 -19597 -22624 25725
12330 25725 42066 28543 20928 -8290 -65752 -69665 -21400 -16113 -23885 -10130 -6275 -7093 -32285
12317c2285j1231M0499L7028o338R129l1519m2308J3780J0788M5483J084j1983
12305B2127P883O742R634J4473l7455m3739l1013L97J9385J4810Q760J8962J9269
12292C0235J6259k0585j9568k9572J3672J7626J7147J7971o55J509K8445K737
12280G5221l5873l3589J4543j0973l752L1186J749J1785l474M095j3482m9970
12268a2534j4598L788p099L0050K9356j924l454k3961k9416J7128P148L41P344
12255B169k007J9058R165l7439j1454M3536K957J3702J1671n901r583J0290j565
12242D4599M47P659J4472k986m5569k0923P967K2734n524j3466j0217L3149J4310
12229D6652o832j0151J238K215j3304l8973m2655m1632M157O1513O5198J2445
$$ plain form
12317 -32285 -43516 -3017 34011 27673 36802 5283 -37025 -23245 -12457 33026 34110 22127
12305 22127 30010 36752 46386 60859 23404 -20335 -51348 -50951 -31566 -16756 -7996 10966 30235
12292 30235 46494 25909 6341 -23231 -9559 8067 25214 43185 42530 44039 72484 75221
12280 75221 39348 5759 20302 9329 5577 36763 38512 50297 46823 50918 37436 -12534
12268 -12534 -27132 -23344 -30443 -393 28963 27039 23585 -376 -29792 -12664 -5516 -5175 2169
12255 2169 162 19220 28385 -9054 -20508 23028 25985 39687 51358 45457 35874 46164 44599
12242 44599 45046 52705 67177 64191 18622 -2301 5666 28400 22876 9410 -807 32342 46652
12229 46652 39820 29669 30907 33122 19818 -19155 -61810 -103442 -99285 -37772 27426 39871
12217C9871N555Q494j592l0653j2684K6445j1988m3522j5774K5866K0497r747
12205G68j0472j6145L0698K9050K384j7977k0821j2546q433l2550J2854L3681
12193i509N820L201O638n004Q32O819m3202p975M5860Q754J4379J7866o052k2089
12179A6338q243o556R226J8020j9038j3221k4016K837K3104J9121K885J385j0582
12166A1260M6609j5972l7964j8222K2661Q319l8527l5888k418M703K8862L7217
12154A0640R413k6967j4283J5009k3003l28K5619J7820j7506K8693K2564j5383
12142C2288J1373n685k5512k3373K839j3340r401Q613r0K6598K2120k1656l1470
12129b6696K337L9043K8685r742l7405R900j993j1200j4237J9336J8089k3911
$$ plain form
12217 39871 45426 53920 52328 21675 8991 35436 23448 -20074 -35848 -9982 10515 768
12205 768 -9704 -25849 4849 33899 36283 18306 -2515 -15061 -23494 -56044 -43190 -9509
12193 -9509 -3689 -488 6150 1146 1978 8797 -34405 -42380 3480 12234 26613 44479 38427 16338
12179 16338 8095 1539 10765 28785 9747 -3474 -27490 -24653 -1549 17572 20457 21842 11260
12166 11260 57869 41897 3933 -14289 8372 16691 -21836 -57724 -60142 -55439 -26577 10640
12154 10640 20053 -6914 -21197 -6188 -29191 -29519 -3900 13920 -3586 25107 47671 32288
12142 32288 43661 37976 12464 -10909 -8070 -21410 -30811 -22198 -22288 4310 26430 4774 -26696
12129 -26696 -24359 14684 43369 33627 -3778 6122 4129 -7071 -21308 -1972 16117 -7794
12117g794q241q476m5607O08N9832J7184J9579k1931k8189R724j3483J8615l160
12104a1339o854L3006J3279j4710n684R764o86j6910j7134K0930L0007K1607M5
12091E5321k6105l0088k2145J2766K4248K5456J7527n197j7181p869k2981j2978
12079i226O820l97k5017k2896J3094j5623J0726J8063m235J7957K8223L69m0475
12066b2617j2711l395P357J4788R828j1177O857J71K1332K9916j2219R822j9894
12053A8058J2989K2194m2719l1898k9572P955L0943o14J7385j8893j0583j3051
12041c7806O279j5868j618M3885J7607P111K5376N5847M4053M6861J8382j2304
12029A97805m1661k1892l7937m6779Q696j5475n2461l5362J7342L3899K9668K7848
$$ plain form
12117 -7794 -16035 -24511 -70118 -69510 -9678 7506 27085 5154 -23035 -13311 -26794 -8179 -11339
12104 -11339 -18193 14813 28092 13382 7698 17462 16776 -134 -17268 3662 33669 55276 55321
12091 55321 29216 -872 -23017 -10251 13997 39453 56980 51783 34602 26733 3752 -9226
12079 -9226 -2406 -2803 -27820 -50716 -37622 -53245 -42519 -24456 -28691 -10734 17489 17858 -22617
12066 -22617 -35328 -38723 -31366 -16578 -6750 -17927 -11070 -10899 10433 40349 28130 37952 18058
12053 18058 31047 53241 10522 -21376 -50948 -42993 -12050 -12664 4721 -14172 -24755 -37806
12041 -37806 -31527 -47395 -49013 -5128 12479 19590 44966 100813 144866 191727 210109 197805
12029 197805 156144 134252 96315 49536 58232 42757 -9704 -45066 -27724 6175 35843 63691
12017F3691j5250J0942O144j6751k7862k1522J6778K8893J0272l0156l7604N37
12005a1888L5374J7433q509j2425k954m120J0074J7881j8798j037j9859K2164
11993B3336O1434N5712P2025M0391J13319J12323J26406J09116L728j56233j83294
11982C78263j29499r0017k5540j2328l2435j5901j6288J4196j1002j6681j0547
11971C2221j322k4277l8292L7899M3826J8545r957o328k6261o996m7771P483K5477
11958D247j5113j8382K7189K0999J2979P771J7464J2614J3103J9154K6848J2926
11946A41799L2674J18621J28139J67043J11095L9948j07444k04974j45863p5411
11936B05627k1967k4891n2062j0122j6665k5434m193q007j2111Q491j5818O057
$$ plain form
12017 63691 48441 59383 65527 48776 20914 -608 16170 45063 55335 25179 -12425 -11888
12005 -11888 23486 40919 32410 19985 17031 12911 22985 40866 22068 21031 1172 23336
11993 23336 84770 140482 212507 252898 366217 478540 604946 714062 717790 561557 378263
11982 378263 248764 158747 133207 120879 88444 72543 56255 70451 59449 42768 32221
11971 32221 30899 6622 -31670 6229 50055 68600 58643 52315 26054 19058 -28713 -21230 4247
11958 4247 -10866 -29248 -2059 18940 31919 39690 57154 69768 82871 102025 128873 141799
11946 141799 174473 293094 421233 588276 699371 739319 631875 426901 281038 205627
11936 205627 183660 158769 106707 96585 79920 54486 50293 42286 30175 38666 22848 28905
11924B8905p301j6029J0840J6141J3151l4831J2116o393l3050j5081L502P771
11912b0259j597K677K7138O4600K088l7298j4573J4953L6855N0264M0796P362
11900A73006j4615K6430M6143L2177J0842m9225n1243m5164R69j3683N523m985
11888A16175k7461R095J5341k5125m1646l6218j8400J622l0914r7L7692O067P756
11875A3887K991l1896k5717j0683j5254J1516K9256K1074K9892L506k2512j5041
11863h981K6489K7949j6100O48k7352J0673j6140n517M642l4R640O80k3485J1385
11849e503Q387J1208k903j2976J3148R353l649j2067r68j8749k9571N518J4825
11836b3947j3283J6250P890J21J777J1851M2113J5713n4229n6236Q039K3634P331
$$ plain form
11924 28905 21604 5575 16415 32556 45707 10876 22992 16599 -16451 -31532 -28030 -20259
11912 -20259 -21856 -19179 7959 72559 74647 37349 22776 37729 74584 124848 165644 173006
11900 173006 158391 184821 230964 263141 273983 224758 173515 128351 129320 115637 121160 116175
11888 116175 88714 97809 113150 88025 46379 10161 -8239 -6617 -37531 -37628 64 6131 13887
11875 13887 16878 -15018 -40735 -51418 -66672 -55156 -25900 -4826 25066 28572 6060 -8981
11863 -8981 17508 45457 29357 30005 2653 13326 -2814 -8331 -3689 -3723 5917 6597 -16888 -5503
11849 -5503 2884 14092 11189 -1787 11361 20714 17065 4998 4030 -14719 -44290 -38772 -23947
11836 -23947 -37230 -20980 -13090 -12969 -11192 659 42772 58485 4256 -51980 -43941 -20307 -12976
11823a2976L299K3361J2103J1757k1440k6256K5556J2179L7032J4560n654j1975
11811F1546O561p614K691K585K096l824m188q39N747L287j3842k0251N191K0903
11797F0049J0574j2529l9575k567j161J0021l148k9303L001o452p614J6059J2301
11784I656K2174l3508j2240J1502j5287j1277q478j3560k489N5962O4996J96m0662
11771B6985l8166p116K5418K8230j712n1636O143K7977K0603n923n460o202n088
11758A4053k1462j2000j5677P88O779o800l488K7507M4080N1566n303l4183L131
11745D8991O406J3806J582n0871j7075j6133J6728J4474J993Q994J2802j0277
11733C1420k8879j0632k4966N976J15j6216J8274P548J2307J581j0694l0112J0144
$$ plain form
11823 -12976 -9677 13684 25787 37544 16104 -10152 15404 27583 64615 79175 73521 61546
11811 61546 68107 60493 63184 65769 67865 64041 59853 59014 64761 68048 54206 33955 39146 60049
11797 60049 70623 58094 18519 15952 14791 24812 21664 -7639 -4638 -11090 -18704 -2645 9656
11784 9656 31830 -1678 -13918 -2416 -17703 -28980 -37458 -51018 -53507 2455 67451 67647 26985
11771 26985 -11181 -18297 7121 35351 33639 -17997 -11854 16123 36726 30803 25343 19141 14053
11758 14053 -7409 -19409 -35086 -34298 -27519 -34319 -37807 -10300 33780 85346 80043 45860 48991
11745 48991 55397 69203 70785 19914 2839 -13294 3434 17908 19901 28895 41697 31420
11733 31420 2541 -8091 -33057 -27081 -26966 -43182 -24908 -17360 -5053 -3472 -14166 -44278 -34134
11720c4134J1153L6682N400K2315Q476j9049l6442J481J8551j7857j2212J3480
11708b156o867j1260R59M158M812P333K603Q450q611K1206R380k8619K450k962
11694H76K1389J8607k5937k5239J748K7307o823l9872k1886j2928q762L5106K3818
11681a2596L7586J8457n0169n186k5859J391K5114k6595J54J7676j947J0420K3946
11668A2392r378k0411J2735J922p120K8515q955j8827K0567n305j4336J4546n926
11655D19j3465k8184j5621K8532M4949k3373j2632r437l379N059M1059K0393j4592
11642A9728k2190k2106L6477K5883J3013K0153r180l7445l2979O283k454j0180
11630a4997M1468J7995l4396o893R141m087j9101L6303L0863m913j8633k9440
$$ plain form
11720 -34134 -22981 13701 19101 41416 49892 30843 -5599 -4118 14433 -3424 -15636 -2156
11708 -2156 -9023 -20283 -19324 -15166 -10354 -3021 -418 8032 -579 20627 30007 1388 3838 876
11694 876 22265 40872 14935 -10304 -8556 18751 11928 -27944 -49830 -62758 -71520 -36414 -12596
11681 -12596 24990 43447 -6722 -11908 -37767 -36376 -11262 -37857 -37703 -20027 -21974 -11554 12392
11668 12392 3014 -17397 -4662 -2740 -9860 18655 9700 -9127 11440 6135 -8201 6345 419
11655 419 -13046 -41230 -56851 -28319 16630 -6743 -19375 -28812 -32191 -27132 13927 34320 19728
11642 19728 -2462 -24568 11909 37792 50805 70958 61778 24333 -8646 -2363 -4817 -14997
11630 -14997 26471 44466 10070 3177 12318 8231 -10870 25433 56296 51383 32750 3310
11618C310L4743l01j935j6389N711K1456l7230k9681K157O650m957p902p68J5662
11604i474K3607P555k2854J1473L9377l0729m0391L590J3258l7962j5103M1441
11592a6212L8829L6506K6588j8692l2135N272m768J5393M8231k0671j7724j0101
11580E0516K5531J0008j5918j8202l133l620N639L5558j9033r476j2533q535j5441
11567B1361K689L6301M374j8301j8886K5802Q414R149J5919K2103J2653q790J0271
11554A23059k3590p009j098j1844j8544j189N838j5740m630L469j5263P143K7290
11541F7892Q090k2096k265Q229N2236K1882j7155K3074O2343P6660J14847O5842
11529D59579N9289j0077p7313r8507q0872p0110k3034P335k0271l8757m0439k9297
$$ plain form
11618 3310 38053 37752 35817 19428 25139 46595 9365 -20316 -18159 -11509 -16466 -24368 -25136 -9474
11604 -9474 14133 21688 -1166 10307 49684 18955 -21436 -17846 -4588 -42550 -57653 -16212
11592 -16212 22617 59123 85711 67019 34884 40156 35388 50781 99012 78341 60617 50516
11580 50516 76047 86055 70137 51935 48802 45182 50821 86379 67346 57870 45337 36802 21361
11567 21361 24050 60351 64725 46424 27538 53340 61754 70903 86822 108925 121578 112788 123059
11554 123059 99469 92460 91362 79518 60974 59785 65623 49883 45253 48722 33459 40602 67892
11541 67892 75982 53886 51621 59850 112086 133968 116813 139887 202230 278890 393737 459579
11529 459579 518868 508791 431478 332971 252099 181989 158955 166290 146019 107262 66823 37526
11517C7526J6304J0225m212k6277J5436L656K744j3190K0146K7571J0424p2158
11505B8195n9149r479J3296Q514j5943J1970J2833k6209J5293R098J1148N3994
11493E3561J0731l9963m1197K4222K096j1727j1091K1651k356J703J6132L741
11481B7503L10K4011p373k86q066j1347M0142m670m7677k56N879k1287j2290J7397
11467A990K6606J0829r500n854j4849L0623M008r756J7185k9156j9742q848k919
11454i383L370m562o326j4004J5283j2670p034J863o18P163K6638l061j607K8873
11440B3925j4079n0023N988K4684l540l0743o429J131N379r948L2281M1154K7850
11427D7630Q891r47j8304j1521j1317m757O534l938J0836k9577l0751m942N4440
$$ plain form
11517 37526 53830 64055 59843 33566 49002 52658 55402 42212 62358 89929 100353 28195
11505 28195 -30954 -40433 -27137 -18623 -34566 -22596 -9763 -35972 -20679 -11581 -433 53561
11493 53561 64292 24329 -16868 7354 9450 -2277 -13368 8283 5927 7630 23762 27503
11481 27503 27813 51824 44451 44165 36099 24752 64894 60224 12547 12291 18170 -3117 -15407 1990
11467 1990 28596 39425 29925 24071 9222 39845 43853 34097 51282 22126 2384 -6464 -9383
11454 -9383 -6013 -10575 -16901 -30905 -15622 -28292 -35326 -33463 -34081 -26918 -280 -3341 -4948 23925
11440 23925 9846 -40177 -34189 -9505 -13045 -43788 -50217 -49086 -43707 -53655 -21374 19780 47630
11427 47630 56521 55574 37270 25749 14432 9675 16209 12271 23107 -6470 -37221 -42163 12277
11414A2277K628j5963O373J8517l931J1650j8429j0559P876J2916p762J1148j4824
11401A1917n651j6218k580J8032j841j1280j4732J9719K3126m483k1619k5983
11389c1593J6027o68K750J8037J1074J2699j1472k8965k5859Q309J7381K6227
11377A3947J0280q109m3376J6861N3624K6291k5358J0384K516J3802O479j1072
11365F6269M881k2561m7001k1029K2185j9385j6357L4424J2532J0648L2263p558
11353D9311p583J3517K2799k4714j2171J0522m258k2401N06L2380q219O908k88
11340E6309j897R449k5988M3754L3042k7232k8124J2836M5682Q897m5348j3164
11328F8216K6885K7563N0535J1542N284J1081J2235L663K3473Q687l2732K3760
$$ plain form
11414 12277 14905 -1058 5315 23832 19901 31551 13122 2563 10439 23355 15593 26741 11917
11401 11917 6266 -9952 -12532 5500 3659 -7621 -22353 -2634 20492 16009 -5610 -31593
11389 -31593 -15566 -16234 -13484 4553 15627 28326 16854 -12111 -37970 -29661 -12280 13947
11377 13947 24227 16118 -27258 -10397 43227 69518 44160 54544 57060 70862 77341 66269
11365 66269 71150 48589 1588 -19441 2744 -16641 -32998 1426 13958 24606 56869 49311
11353 49311 41728 55245 78044 53330 41159 51681 47423 25022 25528 57908 49689 56597 56309
11340 56309 54412 63861 37873 81627 114669 87437 59313 72149 117831 126728 81380 68216
11328 68216 95101 122664 173199 184741 190025 201106 213341 217004 240477 249164 216432 240192
11316B40192M4783j4439m1290k6055J0893L2351M2072J6510J5063K8514M427l022
11304C49999J9280q188k1574k7517j6453q003j4019J3299J2071J4197K2925L844
11292C39861k4085j7239j7223j6306L16j1367j2011L8549K2506M7331O6926N2778
11280D70036O7663J00624J81551K68659L72636M62116M44700K99477j62207n57812
11270A947443n31168m07419k90875j76933j23404r7153o6421J245l2331m9208
11260A73776k2428j6112j6313j9089j1566P672j7873m960m213l0244K5811K7962
11248I2423n170J128r126l4350J023J1756J1538j7967k0154K1605K7559L8859
11236A19124k6118l9161j7585j1431K6263K4071p283k6997K247L159k5994K4553
$$ plain form
11316 240192 284975 270536 229246 203191 214084 246435 288507 305017 320080 348594 353021 349999
11304 349999 369279 361091 339517 312000 295547 287544 273525 286824 298895 313092 336017 339861
11292 339861 315776 298537 281314 265008 265324 253957 241946 280495 303001 350332 417258 470036
11280 470036 537699 638323 819874 1088533 1461169 1923285 2367985 2667462 2505255 1947443
11270 1947443 1416275 1008856 717981 541048 417644 320491 254070 255315 222984 173776
11260 173776 151348 135236 118923 99834 88268 95940 78067 73107 68894 38650 64461 92423
11248 92423 87253 88381 79255 44905 45928 57684 69222 51255 31101 52706 80265 119124
11236 119124 93006 53845 36260 24829 51092 75163 67880 40883 43130 46289 20295 44848
11224D4848J1821J3769l6226m1108J2194L8851L1341l4002l3481j6873J24J1142
11212B400L9953k6222k057J9079M4K6142M8144J5358j8866j736n639l4885K1483
11199H3198P9729R1078P8709R9949J38195L2412l9967l5625l8165r4046j06132
11188B89335p8231q1623k7555l0228k2178J9379M65j1651J5202k228K6930l672
11176I3945Q852J8411l5640q704O3347j0498l9568L0688N990J0332J7241j1579
11164A42817l0844j9254Q128k1200j1565k3976k83M994l052l0157R941M6047J6282
11151H7878K7708J5496l7848k532k109J331q82L2533L9541m2448l9850j4624l8536
11138B5658k441K2641m050j1176K5934J2270k5858J9321K3483P598K6631o014
$$ plain form
11224 44848 56669 70438 34212 -6896 5298 44149 75490 41488 8007 -8866 -8742 2400
11212 2400 42353 16131 14074 33153 33197 59339 107483 122841 103975 102239 96600 61715 83198
11199 83198 162927 254005 332714 432663 570858 603270 563303 527678 489513 395467 289335
11188 289335 211104 129481 101926 71698 49520 68899 69364 57713 72915 70687 97617 93945
11176 93945 102797 121208 85568 76864 140211 129713 90145 120833 126823 137155 154396 142817
11164 142817 111973 92719 100847 79647 68082 44106 43823 48817 45765 15608 25549 71596 87878
11151 87878 115586 131082 93234 90702 88593 89924 89042 121575 161116 118668 78818 64194 25658
11138 25658 23217 45858 41808 30632 56566 68836 42978 62299 85782 93380 120011 113997
11126A13997Q655L8743K939l5357R599M3841Q2269Q2802J21642J0391o8546p9802
11114C31173o2545k7536o1351p8205m137J052q774p866O76l999l2809l6775j1558
11101b654K7226K4488q97J5212J6176L519k5193j984M69j6908K3378K5132o597
11088H1367k0211j4888q626J2846J0391j1499l057J7297J2725L0109L27m0030
11076F6751L800K461l9492K2803L1946L8382J942J1266L4890K483N731k9898j5784
11063A37281k8316n294J5115k6405K32j1665K0928J909M3104Q085K031k3836k1187
11050A11982p381j5350j7308L8501N7764L9594N415k3339q228q434q643P738K3188
11037A95499M3309N1726L0981L5205L7864l085m8128o7361o8399m4246r547P360
$$ plain form
11126 113997 122652 161395 164334 128977 138576 182417 264686 347488 469130 479521 410975 331173
11114 331173 268628 241092 179741 101536 97399 98451 89677 81811 82487 78488 45679 8904 -2654
11101 -2654 24572 49060 48163 63375 79551 83070 57877 55893 56362 39454 62832 87964 81367
11088 81367 61156 46268 37642 50488 60879 49380 46323 63620 76345 106454 106781 66751
11076 66751 70551 73012 33520 56323 88269 126651 128593 139859 174749 177232 182963 153065 137281
11063 137281 108965 103671 118786 92381 92613 80948 101876 103785 146889 154974 157005 133169 111982
11050 111982 104601 89251 71943 110444 168208 207802 213217 189878 181650 173216 164573 172311 195499
11037 195499 238808 290534 321515 356720 394584 391499 343371 276010 207611 163365 153818 161178
11025A61178J8763L5172K2330K4479k1286l3852o131J2070k3049l9622O152O3613
11013B19817k265j3384Q536M9509N9699j090k7923m2036j2790L375n9045l7168
11001A45235L0458K3307j2586M7303J1146k8465L357M1613O5049P2523L3771p01
10989D32010l1577l5346m6591q9384n2551n434O108J4167J3577K2580R048k0640
10977B15967j2446J8848R953j7063l8247j4126K4444L7062J0371J7089M1197J6343
10965C09392k2419l047m9566j5887K0127N2516N0209J2572J3673K1983Q948r92
10953C97509j1342K5322L3174J557J4487J2020J6461M1363N6065N5169M9256J10239
10941H01280J14710O0985L5797R122O90j8020q0836r7660k0111l6903K9141M0304
$$ plain form
11025 161178 179941 215113 237443 261922 240636 206784 200653 212723 189674 150052 156204 219817
11013 219817 217552 204168 212704 262213 321912 320822 292899 250863 238073 241448 182403 145235
11001 145235 175693 199000 186414 233717 244863 216398 219755 261368 326417 398940 432711 432010
10989 432010 400433 365087 318496 229112 176561 171127 177235 191402 204979 227559 236607 215967
10977 215967 203521 222369 232322 215259 177012 162886 187330 224392 234763 251852 293049 309392
10965 309392 286973 283926 234360 218473 238600 291116 341325 353897 367570 389553 398501 397509
10953 397509 386167 411489 444663 446220 460707 472727 489188 530551 586616 641785 691041 801280
10941 801280 915990 976975 1012772 1021894 1022584 1004564 923728 826068 805957 769054 798195 838499
10929H38499J7062L5683k1278k2189q392j6354J3117O0291O3638l1608j9207N0819
10917I60081O3581O1049O7573O2756M5338O1154Q9343P6945P7042J39616J05932
10906A810410J00734J70283K02691J77747J56693K10911L15266L15802K75194
10897C735731J26306Q7761J60901K48234L49845M74300O15889P49709R16538J096763
10887H561977J139250R56646N01257L02646O11648J198328J763442K151299K201741
10878A9388234J643943J408927K134492L388539M948053O982389R704470J3916153
10870F3515200K0610441L1269641M7326673O8819698R1346345J04274565P9982921
10863E07145484j5207029j06516909j16300378q3100579n2772876l3708097k2404564
$$ plain form
10929 838499 855561 891244 869966 847777 839385 823031 836148 896439 960077 928469 909262 960081
10917 960081 1023662 1084711 1152284 1215040 1260378 1321532 1410875 1487820 1564862 1704478 1810410
10906 1810410 1911144 2081427 2284118 2461865 2618558 2829469 3144735 3460537 3735731
10897 3735731 3862037 3949798 4110699 4358933 4708778 5183078 5798967 6548676 7465214 8561977
10887 8561977 9701227 10657873 11159130 11461776 12073424 13271752 15035194 17186493 19388234
10878 19388234 21032177 22441104 24575596 27964135 32912188 39894577 49599047 63515200
10870 63515200 84125641 115395282 162721955 231541653 322887998 427162563 507145484
10863 507145484 491938455 385421546 269121168 186020589 133247713 99539616 77135052
10856G7135052j5503875j1178084q445463o705090n335006m226916l406249k791580
10848A9542789k298302j920827j599366j229923r21674o88228m45787k43464j25149
10839A0070069m17294r42147j100109r11335p09971n65388m52971l84089l52596
10830D234169k77595k49960j89300j86599j94578j98578j51336j33294j41553
10821B511376q3230j01117q0208p5795p7823q1662o5267o1847n1361p1569j4953
10810A746544m6379j07100o7688m8623p9395q7979n1694k4888l2838l9636m3340
10799A116984P083k6880L157P156l6436l5006q743n6591m0057k2199m274m3070
10787H61124n3353l1828k4029j7603r31j2078j6605k3240r618M31j2292l2835
$$ plain form
10856 77135052 61631177 50453093 42007630 35302540 29967534 25740618 22334369 19542789
10848 19542789 17244487 15323660 13724294 12494371 11572697 10884469 10438682 10195218 10070069
10839 10070069 9652775 8710628 7610519 6699184 5989213 5423825 4970854 4586765 4234169
10830 4234169 3956574 3706614 3517314 3330715 3136137 2937559 2786223 2652929 2511376
10821 2511376 2428146 2327029 2246821 2171026 2093203 2011541 1946274 1884427 1833066 1761497 1746544
10810 1746544 1700165 1593065 1525377 1476754 1397359 1309380 1257686 1232798 1199960 1160324 1116984
10799 1116984 1124067 1097187 1100344 1107500 1071064 1036058 1027315 970724 930667 908468 904194 861124
10787 861124 807771 775943 751914 734311 733380 721302 704697 681457 671839 672270 659978 627143
10775F27143n7463l2289Q884L2690j3047k157J9231O237J2489M575j9011m8948
10763E38334k0404k4957m4988l0255l041J8122J516k006L6110l096n4533J8561
10751D29363K9914J3795m286L9982K019q881L379j9499k8013j4772l22J9982M4336
10738E06997M5180L2296j8788p3126n0082L908l352k3444k1002j5053o128o424
10726C70982K3726j139k3154n682r529l6891p175o128R761L4814J6332L4001R608
10713D09526M0995J5094m3514j5919L1722M7941J6325m276l467Q7j7278j5730
10701D61506n613k3219q7921q0100k7783k5953L1890P45J886j3814N932M0804
10689B78360M2006L4149J900j7136j2299j84K8025K4052R015l785l985K303m4362
$$ plain form
10775 627143 569680 537391 546275 578965 565918 563761 582992 589229 601718 606293 587282 538334
10763 538334 517930 492973 447985 417730 414689 432811 434327 432321 468431 465335 410802 429363
10751 429363 459277 473072 468786 508768 510787 501906 505285 485786 457773 443001 442679 462661 506997
10738 506997 552177 584473 565685 492559 442477 446385 443033 419589 398587 383534 377406 370982
10726 370982 394708 393569 370415 364733 355204 318313 311138 305010 314771 349585 365917 399918 409526
10713 409526 450521 465615 422101 406182 437904 485845 502170 497894 494427 494514 477236 461506
10701 461506 455893 432674 344753 264653 236870 210917 242807 243552 245438 231624 237556 278360
10689 278360 320366 354515 356415 339279 326980 326796 354821 378873 387888 384103 380118 382421 338059
10676C38059o8002o210l210m2466r369J3789K3556N457k5880J0829N927q285p1
10663B34124K6156m337n904K7643J8941K5995J5931K9887K4149M6940L9269K8169
10651E06963M2971N8894M1004O8926J9818l1960r6132m7076J5007J6699J0635
10640F05749L9116N1079M9688K0570K6234N9908J14303J58815J56270R7377J20342
10629A499451J12368J05851J20062J86204K70310L75528M56359O39561Q87259
10620D652953J168654J538045J942565K281877K402437K152019J282381J42169
10612A7563100n88871o70254k62522M80561J362629K384186L527555M472552M805445
10603C3074381L927186J493907j470444l101741l003710j887284l75235J244022
$$ plain form
10676 338059 270057 263847 260637 218171 208802 222591 246147 251604 225724 236553 242480 234195 234124
10663 234124 260280 255943 250039 277682 296623 322618 338549 368436 392585 439525 478794 506963
10651 506963 549934 608828 649832 718758 738576 706616 610484 563408 578415 595114 605749
10640 605749 644865 695944 745632 766202 792436 852344 966647 1125462 1281732 1379109 1499451
10629 1499451 1611819 1717670 1837732 2023936 2294246 2669774 3126133 3765694 4652953
10620 4652953 5821607 7359652 9302217 11584094 13986531 16138550 17420931 17563100
10612 17563100 16974229 16303975 16041453 16522014 17884643 20268829 23796384 28268936 33074381
10603 33074381 37001567 38495474 37025030 33923289 30919579 29032295 28657060 29901082
10595B9901082K925444M485372N611212N768070M025398J52466m141523o224718
10587D2502803n845169m299371k480760p64304P29913K014808K828139K771547
10579C7457606J358398j387853m070597n169500m642284l399123k114103j093706
10571A6938838l16472K85353O25317M29329j97996j286360k251361k565361k357220
10562I304067j908388j458482j048791p87688o00435m78042l89656l17800k47844
10553B066941j89685j91638j57551j14486j23874r1409p2533o2794j13959q6205
10543H62807n2131j2773j3910k5607k2889l8051k8008n1184m1475m7186m1407
10532D88186K456l2446l2460K1174p111k5688o508n964o022P133k1262l1n799
$$ plain form
10595 29901082 32826526 37311898 42923110 48691180 52716578 52869044 48727521 42502803
10587 42502803 36657634 32358263 29877503 29113199 29843112 31857920 34686059 37457606
10579 37457606 38816004 37428151 33357554 28188054 23545770 20146647 18032544 16938838
10571 16938838 16622366 16907719 17533036 17962365 17764369 16478009 14226648 11661287 9304067
10562 9304067 7395679 5937197 4888406 4100718 3500283 3022241 2632585 2314785 2066941
10553 2066941 1877256 1685618 1528067 1413581 1289707 1198298 1125765 1062971 949012 862807
10543 862807 810676 797903 783993 758386 735497 697446 669438 618254 576779 529593 488186
10532 488186 490642 458196 425736 446910 439799 414111 407603 401639 395617 402750 381488 381457 375658
10519C75658k50k1271k7959k5773k029L9368l6168o4435l274N381l3957K68j2688
10506A92871O961O785P452J5710j6387O946k4089j0132J5735o678K4099J0198
10494B29471J0422k8470M237L516j7538m693J0870N83k735j9833K5383R070j3683
10481B06600J1757m9327l2458m099L2562K7537K843K1745K4313k87O318M771p337
10468B44938J8908L9674o343q282K2988R854r001J022J7005l913K3923O4971J32331
10455E48075J29829J84735K71283L70886M58763M68586L28434j39085n27313n47636
10445A546557m05160k56640j59742j31203r5734o6875n8215n1939l2405n5696
10435B32948k9110k4456L999K997k1232q370K65K0083J4476j1972k4023j2195
$$ plain form
10519 375658 375408 354137 326178 300405 298376 337744 301576 237141 233867 239248 205291 205559 192871
10506 192871 199832 206617 214069 229779 213392 220338 196249 186117 201852 195174 219273 229471
10494 229471 239893 211423 215660 219176 201638 196945 207815 208398 205663 185830 211213 220283 206600
10481 206600 218357 169030 136572 132473 165035 192572 195415 217160 241473 241186 247504 252275 244938
10468 244938 263846 303520 297177 288895 311883 321737 312736 313758 330763 326850 350773 415744 548075
10455 548075 677904 862639 1133922 1504808 1963571 2432157 2760591 2621506 2094193 1546557
10445 1546557 1141397 884757 725015 593812 498078 431203 372988 321049 288644 232948
10435 232948 203838 179382 183381 186378 165146 156776 157041 177124 191600 179628 155605 143410
10423A43410j0434J3311K3311j5485k8764J0290j7046j971J6568j0858m5284Q488
10411H5536K8463j4737k9090k2467L0827j2403L1338K8854l549l364j6258k0057
10399H3093N385l983J864M7738j58k5143k8969L1527K2341n4557l1866K9021L986
10386H0279J830k0991K0597K7746j0288J0300K3977m0k5016m6279Q167N0004L1587
10373A51873l9138n5460o782L7465k4234j3807l45K5976j902l0214K5904M776
10361G4112N35k097j2346J0751j785J8373M1912P624j2970n1558k0814j2312q81
10348C8544K2947l154j0549k212j3756L611P183m851j3570k105J953J6642n40
10335D0143J0648l694l442k1647L3192L2416K7308P478J0486k3932m314M219R905
$$ plain form
10423 143410 132976 146287 169598 154113 125349 135639 118593 116622 133190 122332 77048 85536
10411 85536 113999 99262 70172 47705 78532 66129 97467 126321 122772 119408 103150 83093
10399 83093 88478 84495 86359 134097 133939 108796 79827 111354 133695 79138 47272 76293 80279
10386 80279 82109 61118 81715 109461 99173 109473 133450 133410 108394 62115 70282 120286 151873
10373 151873 112735 57275 50493 87958 63724 49917 49572 75548 73646 43432 69336 74112
10361 74112 74647 72550 60204 70955 69170 87543 129455 137079 124109 72551 51737 39425 38544
10348 38544 61491 58337 47788 45576 31820 35431 42614 37763 24193 22088 24041 40683 40143
10335 40143 50791 47097 43655 22008 55200 87616 114924 122402 132888 108956 104642 108861 118766
10322A18766J2694j6194j6498k3836m8322k1957J4591j9347K3702j0977j7369
10311d747K3465o117l063J3386j0700J8569K3144m878J127M3220r806m2346K289
10298D3543O3172K278n8818j3262o230J4215K810m8519j9156J3855j231J706M4101
10285C8464q494m5124k391O677K3406J6011j609J6502j5620j0676r713j759k4176
10272a8502j1542l121K0530K9951L2436K6719k5929l7477r844k2159j0009J3685
10260a5262M1323L404K6388O206j4770J4878L0789p469l3741j6307L9834K8655
10248A03928j2250n7001j5970K1723o894k587j3269o747k110J506k789j5708J1406
10235C238J7868K5757K6575K3445k0113j4129m0581j3234L3950K0384J5522Q148
$$ plain form
10322 118766 131460 115266 98768 74932 26610 4653 19244 -103 23599 12622 -4747
10311 -4747 18718 12601 9538 22924 12224 30793 53937 49059 50186 93406 83600 41254 43543
10298 43543 106715 108993 50175 36913 30683 44898 47708 -811 -19967 -6112 -7343 -5637 38464
10285 38464 29970 -15154 -17545 -10868 12538 28549 26940 43442 27822 17146 7433 5674 -18502
10272 -18502 -30044 -33165 -12635 17316 49752 76471 50542 13065 3221 -18938 -28947 -15262
10260 -15262 26061 29465 55853 62059 47289 62167 92956 85487 51746 35439 75273 103928
10248 103928 91678 34677 18707 40430 33536 30949 17680 10933 8823 10329 7540 -8168 3238
10235 3238 21106 46863 73438 96883 76770 62641 22060 8826 42776 63160 78682 86830
10223H6830M901j7668K345o064j1551q075q694K2358o765l7069M1416m196j6183
10210D1585j7855k922J1743j5239k3367J6758M628j469j8154j715K2430Q229k5553
10197i01j712R683K6274M773j5095O66L8722N3478n716k3031k5028J8696O24k7518
10183E3915j9298L7731J6104J2160L086o926J2002J5398J4602j2203j7280M8467
10171A57758P34q443K6437K0498L0178N2652J0219m484k7035j4056l3415m2991
10159A68052k5534L3117N2875L9482M0538K5567j4036k0991n6750p1996l0283
10148A40041J0654j1332J4398J2468K8518M4376M0587r954l6472n6107l1164k700
10136A43313P535j9520J5136J3404k870M39P498k6397j9106l335j1957l4722k3271
$$ plain form
10223 86830 91731 74063 76408 70344 58793 50718 42024 64382 57617 20548 61964 57768 41585
10210 41585 23730 20808 32551 17312 -6055 10703 15331 13862 -4292 -6007 16423 24652 -901
10197 -901 -2613 7070 33344 38117 23022 23688 62410 115888 110172 87141 62113 80809 81433 53915
10183 53915 34617 72348 88452 100612 103698 96772 108774 124172 138774 126571 109291 157758
10171 157758 158492 150049 176486 196984 227162 279814 290033 285549 258514 244458 211043 168052
10159 168052 142518 175635 228510 267992 308530 334097 320061 299070 242320 170324 140041
10148 140041 150695 139363 153761 166229 194747 239123 279710 269756 233284 177177 146013 143313
10136 143313 150848 131328 146464 159868 156998 157437 164935 138538 119432 116097 104140 69418 46147
10123D6147J7500K9013q255K1703J9073j9402j5060J7641J1346j1447n9959k8743
10111A9557J8964J3289k5667j6199K3109P562k800J4376j2851J6876M2896K1099
10099A20211k0975j3591j5723k3093j9889J7893R673l3462k5610n68K3294p361
10087A0799j6751J6344K6804k4097p104P923n663j9234K532J6536o329o2065J6407
10074d3898N0439k3491o1850J3679O3717K9048J3416J427j5746j209M283M57j9410
10061A0862j4327L5919J6159J7962k23m80J538l3647j9104m514j3576j4466l0407
10048d8304r218K7291M2833J2792l6548j3302L3787j2200J5870J1390l8439K5764
10036A1716L5348O309k070k398p376J3659j45k8894j720k0061j7982K4016j1756
$$ plain form
10123 46147 63647 92660 84405 106108 125181 105779 90719 108360 119706 108259 48300 19557
10111 19557 38521 51810 26143 9944 33053 40615 37815 52191 39340 56216 99112 120211
10099 120211 99236 85645 69922 46829 26940 44833 54506 21044 -4566 -5134 18160 10799
10087 10799 -5952 10392 37196 13099 5995 13918 8255 -10979 -8447 8089 1760 -60305 -43898
10074 -43898 6541 -16950 -78800 -65121 -1404 27644 41060 42487 26741 25532 29815 30272 10862
10061 10862 -3465 32454 48613 66575 66352 65872 67410 33763 14659 10145 -3431 -17897 -48304
10048 -48304 -57522 -30231 12602 25394 -11154 -24456 9331 -2869 13001 24391 -14048 11716
10036 11716 47064 53373 51303 48905 41529 55188 55043 26149 24429 4368 -13614 10402 -1354
10023a354M328n89J7650q509Q257j3825L2420J6957j6796j3282k6309j1724K0761
10010G985L492k593L1911M121J3540l0232j2298j6440K5005j001j6861m040K2641
9997B5230m022k2039K7063L4541l3246k1780J6995K1196l206j2581M6247n270
9985F9128j7000J835k2399m859k1132j3641L768R895j1057K4854Q580q987M456
9972B3441j3161J0643k7501J0738K6540L208P630j6360R768J341k4776J6352J2569
9959D0432k1705k4409j3792J5015J5350m009j4166r304K0431J4474M106j7738
9947D685o748K3178k1717k1804m475L3132j4458n9739Q122J6622J5236l12K5198
9934c080M4322n642l6531P487l104P415K6714J0563k1953j018J617Q512P493j690
$$ plain form
10023 -1354 2974 2385 20035 11526 19783 5958 38378 55335 38539 25257 -1052 -12776 7985
10010 7985 11477 8884 40795 44916 58456 28224 15926 -514 24491 23490 6629 2589 25230
9997 25230 21208 -831 26232 60773 27527 5747 22742 43938 40732 28151 74398 69128
9985 69128 52128 53963 31564 26705 5573 -8068 -4300 5595 -5462 19392 27972 18985 23441
9972 23441 10280 20923 -6578 4160 30700 33908 41538 25178 34946 36287 11511 27863 40432
9959 40432 18727 -5682 -19474 -4459 10891 6882 -7284 -16588 3843 18317 22423 4685
9947 4685 -2063 21115 -602 -22406 -26881 6251 -8207 -67946 -59824 -43202 -27966 -28278 -3080
9934 -3080 41242 35600 -931 6556 3452 10867 37581 48144 26191 25173 26790 35302 42795 41105
9920D1105j7407k8640m318M8671L6380J0898k3577k0347j0128j2055M468K2808
9908D7858j2979M015R774n29N235P033j2705j9414J4656k7841k1533K4348O456
9895B4374n496k3753l7218K0114J5935J7290J44k186p365j7448k4691j6216K1338
9882c5178P5094M1328o378m107k4677k1418J1535p487j2583K34K3287K928J0646
9869E3224k0859l4028r244p503j1659O884K7262J8891k0308K478J9472n854p05
9856A8051J3006J0973o682r589J6026O181J1219l7639j2869J848j1241J9662n6
9843A8890n0931m057n819K0630L3706K1081M8l4542L2497Q61j1506J9788j6626
9830B4020j5566J6530j7574l2491J1673L0043Q90k0842J6316K1667K9312q081
$$ plain form
9920 41105 23698 -4942 -9260 39411 75791 86689 63112 42765 32637 20582 25050 47858
9908 47858 34879 38894 48668 48139 53374 60407 47702 28288 42944 15103 -6430 17918 24374
9895 24374 18878 -4875 -42093 -21979 -6044 11246 11390 9204 1839 -15609 -40300 -56516 -35178
9882 -35178 39916 81244 74866 70759 46082 24664 36199 28712 16129 16363 39650 42578 53224
9869 53224 32365 -1663 -10907 -18410 -30069 -23185 4077 22968 2660 5138 24610 18756 18051
9856 18051 31057 42030 35348 25759 41785 47966 59185 21546 8677 10525 -716 18946 18890
9843 18890 -32041 -36098 -41917 -21287 12419 33500 33548 -994 31503 32364 20858 40646 24020
9830 24020 8454 24984 7410 -25081 -13408 16635 17525 -3317 12999 34666 63978 55897
9818E5897j6669J5622J2354J4028L1105O212N231Q410J0955L987K3217J8081l4613
9805A53817R457K1379K4848N8259L9479o685k3102j7081j2156j0307k9736q941
9793A99231L1108O8815N0073J6160L2981N4273J7133o4404q4102n5159m2371o624
9781B17114J656L0280J7739N3493L8913m0332p4512n6639l3041l7914K1072p105
9769A30724j9288M0239Q388J89K5481k2919m4686j5926J84L7421k9988l0933P113
9756H5999r466k0562k8959L6603l001k641j2917k2758K3270k7602l4011L2560
9744A6515k562J405K0756j7498q053k543K5580Q006l9417l2396q470K6423J5345
9731C091j6642L826l749O699O066N606R062K8746J0089k0467m9720l8001R157
$$ plain form
9818 55897 39228 54850 67204 81232 112337 118549 123780 132190 143145 147132 170349 188430 153817
9805 153817 163274 184653 209501 267760 307239 300554 277452 260371 248215 237908 208172 199231
9793 199231 230339 299154 349227 365387 398368 452641 469774 405370 321268 266109 223738 217114
9781 217114 218770 249050 266789 320282 359195 318863 244351 187712 154671 116757 137829 130724
9769 130724 111436 151675 160063 160252 185733 162814 118128 102202 102386 139807 109819 78886 85999
9756 85999 76533 55971 27012 63615 60614 57973 45056 22298 45568 17966 -16045 16515
9744 16515 13953 15358 36114 18616 10563 8020 33600 41606 2189 -30207 -38677 -12254 3091
9731 3091 -13551 -9725 -13474 -6775 -709 4897 13959 42705 52794 32327 -17393 -55394 -46237
9718d6237K5259Q223R849J4831O552L496o536K9134O223j0953l4136j3256P614
9705F3q395J5202J2927l0414J1413J5153n565j3249j4710K6763K5873J656l6367
9692C50j1335K2204j218J5053J6815L271m993l5677n4102L714j0064J5360L4071
9679f551N694J3723K1771m691j6870k5673J3073J680J8599J128J5876N990j4642
9666B9107l7504o426J131J0338j1708J7561L0018o927p488M197j8328k0138J1690
9653d477k6099k9571L2491K3042m037l973l631J3902K001J8054L5767L6565J4910
9640A04944j8354J0080k7610K0878J8404o717k5441j2056Q237J4924Q347k6305
9628F9331k0508K5447m1375m9126j0617K7919l038Q011j808n801K3504q953l6674
$$ plain form
9718 -46237 -20978 -12755 -2906 11925 18477 21973 15437 44571 50794 39841 5705 -7551 63
9705 63 -8332 6870 19797 -10617 796 15949 10384 -2865 -17575 9188 35061 36717 350
9692 350 -10985 11219 10001 25054 41869 45140 40147 4470 -49632 -45918 -55982 -40622 -6551
9679 -6551 -857 12866 34637 29946 13076 -12597 476 2156 20755 21883 37759 43749 29107
9666 29107 -8397 -14823 -13692 -3354 -15062 2499 32517 25590 18102 22299 3971 -16167 -4477
9653 -4477 -30576 -60147 -27656 -4614 -8651 -12624 -16255 -2353 -352 17702 53469 90034 104944
9640 104944 86590 96670 69060 89938 108342 101625 76184 64128 72365 87289 95636 69331
9628 69331 48823 74270 32895 -16231 -26848 1071 -1967 6044 4236 -1565 21939 12986 -23688
9615b3688k1759J0171K389K8508J3889k563Q795R265K378o124k0284j6342J5577
9602B12j1905l9704k151J0502Q75M2740L7975k5025j2240k6236J672M782j5232
9589c3735J0901L9167N082o081r814j5562r565j385K822k4779L5440P234J6096
9576A5821k0642l6917J1488R594Q698Q771K4513K8683j7827k7656J174j9865L4133
9563A9968J8766O981n895j6956j0408J5320J2870J7689n5128j9983J3208L6921
9551C3353J7391J0386p192j7071j5621J9110o266k1643j7490k3987l7014j7174
9539h3218O478O804n371Q436q735P104K5686P4333J3381j9772j0119n0782K579
9526c3196J5848p481j0425N4610K4498k1003p105M851j862r088k2765P738L3548
$$ plain form
9615 -23688 -45447 -35276 -32887 -4379 9510 6947 15742 25007 27385 21261 977 -15365 212
9602 212 -11693 -51397 -53548 -43046 -42171 569 38544 13519 1279 -24957 -23285 -18503 -33735
9589 -33735 -22834 16333 21415 15334 5520 -10042 -19607 -20992 -18170 -42949 -7509 -275 15821
9576 15821 -4821 -41738 -30250 -20656 -11958 -3187 21326 50009 32182 4526 5700 -14165 19968
9563 19968 38734 45715 39820 22864 12456 27776 40646 58335 3207 -16776 -3568 33353
9551 33353 50744 61130 53938 36867 21246 40356 34090 12447 -5043 -29030 -66044 -83218
9539 -83218 -76740 -69936 -75307 -66871 -75606 -68502 -42816 31517 44898 25126 15007 -35775 -33196
9526 -33196 -17348 -24829 -35254 19356 43854 22851 15746 20597 18735 9647 -13118 -5380 28168
9513B8168o45j3853j3529R845J0O558J0667j659k2221Q237O828j4064K7461J1111
9499D2914o137k9781j9390k6688J2788J5220J1080j1140K5332J982J7549J3678
9487D7407k6212l2285N293o430O708j0156j3534q850N317N5127R170m730k0308
9474F517L782J7936J7793N088k1095m5612l4116K9789K9968J2077l693l465K394
9461A7363l1614k8433J6258L1453L2691k6664k0795J6301j8834Q355k3109l3098
9449f0126J2815J1501K2970L0424o442j932J7557k274k2272p283j1890m892Q267
9436a3577J220J5754N713j3283k2959j1886L8946L3681k3995j2555R441k776N703
9423I427j3843n260r357J0947N6008M1768O167k0247m5707l7986M746k3170k9586
$$ plain form
9513 28168 27523 13670 141 9986 9996 16554 27221 25562 3341 11578 18406 4342 31803 42914
9499 42914 36777 6996 -12394 -39082 -26294 -11074 6 -11134 14198 16180 33729 47407
9487 47407 21195 -11090 -5797 -12227 -5519 -15675 -29209 -38059 -32742 22385 31555 26825 6517
9474 6517 10299 28235 46028 51116 30021 -15591 -49707 -19918 10050 22127 18434 14969 17363
9461 17363 -14251 -42684 -26426 5027 37718 11054 -9741 6560 -12274 -3919 -27028 -60126
9449 -60126 -47311 -35810 -12840 17584 11142 9210 26767 24493 2221 -5062 -16952 -21844 -13577
9436 -13577 -12357 3397 9110 -4173 -27132 -39018 -72 33609 9614 -2941 6500 3724 9427
9423 9427 -4416 -9676 -19033 -8086 47922 89690 95857 75610 29903 -8083 -3337 -26507 -56093
9410e6093K203J2452M3666L4919l891L225q11o4595O616K0328j5211P883j8754
9397b8063m617J8676J0611j3167k5511J7937J9080L3374J0096k0117m190N474
9385A9583J8027o767q861j3042J456M4569L1724M927j8612m6494k5205K4277M627
9372C0209M605q21J5795K3762r538P558q654k87k421m6715J2369J3340l1438q700
9358i36j608J8271N848j4517R993j5947P04J67J4606J4070m6307l1317K627L1183
9344a3163K5844L0238k562k2511j0564O231L696l1230J6837M0886J0778o765k6912
9331B0803j3596r30K8128J2861K5987j6908r329L415J2879k3782K55K0930k2577
9318C8136K204J0707m448k0040J0020M537J7827j693k9481n724M066l9359j503
$$ plain form
9410 -56093 -53890 -41438 2228 37147 33256 36481 35670 -28925 -22309 -1981 -17192 -9309 -28063
9397 -28063 -32680 -14004 -3393 -16560 -42071 -24134 -5054 28320 38416 18299 14109 19583
9385 19583 37610 30843 21982 8940 10396 54965 86689 91616 73004 26510 1305 25582 30209
9372 30209 34814 33993 49788 73550 64012 71570 62916 62629 60208 13493 25862 39202 7764 -936
9358 -936 -2544 15727 21575 7058 17051 1104 1808 1975 16581 30651 -15656 -46973 -44346 -13163
9344 -13163 12681 42919 40357 17846 7282 13513 17209 -14021 2816 43702 54480 47715 20803
9331 20803 7207 6277 34405 47266 73253 56345 47016 50431 63310 39528 39783 60713 38136
9318 38136 40340 51047 46599 26559 36579 41116 58943 57250 27769 22045 26111 -13248 -14751
9305a4751q682r284j3450K1145j2630o616L1629K2706k0806k9565R777N022n589
9292c1094K1558L4068K4663O852k9145l4902k8723j1421L7323J5854J183j1726
9280e510J3333J8490k6334j0348j7484k855r32J556j5323K404k991J1924J8017
9267a6053K7387K1002K760M3871J5234k6495j5436J357j2170j5823J9883j3235
9255C2282K0969L356q281j23k3622j3820J323r243K4342M0983K8269k7275l319
9242F5841L579j1698l1952n0051j5675O902Q659n176K5584N615K8879j835j2141
9229A6531k5805K740j346J2636m642j0017PJ1423k6857m0067K1413M2944j364
9216b404J2158j7133Q895P698P311L0604k7876m9055j405K2718r604N905J7788
$$ plain form
9305 -14751 -23433 -32717 -46167 -25022 -37652 -44268 -12639 10067 -10739 -40304 -30527 -25505 -31094
9292 -31094 -9536 24532 49195 56047 26902 -8000 -36723 -48144 -10821 5033 6216 -5510
9280 -5510 7823 26313 -21 -10369 -27853 -30708 -31640 -30084 -45407 -43003 -45994 -34070 -16053
9267 -16053 11334 32336 35096 78967 94201 67706 52270 53627 41457 25634 45517 32282
9255 32282 53251 56607 48326 48203 24581 10761 12084 2841 27183 68166 96435 69160 65841
9242 65841 69420 57722 25770 -24281 -39956 -33054 -24395 -29571 -3987 1628 30507 28672 16531
9229 16531 -9274 -6534 -7880 4756 114 -9903 -9896 1527 -25330 -65397 -43984 -1040 -2404
9216 -2404 9754 -7379 1516 9214 16525 47129 19253 -29802 -31207 -8489 -18093 -12188 5600
9203E600r335j5833N990k2625K0106o420J9491N1327P588p2o388O366J0189k2198
9189D3786j6081j412O800j2841M25J664L5292j1122l9128k2174O132K182J3794
9176G317J0863j0553l692M566r10J039J1591k3830m1417q461L8964L5704J2022
9163C3203J6586j9922j6325j5535O741P795M205k7021k851L444K7767L036j7709
9150C414j6898j229n360K3970j8488m4417m3184K549j6361L4708M7377K4358k013
9137a1574J1782J0721j6685j7768K6089M613N800P285k5369O347k2512j0368J2278
9124a9361m846j5787L2909K6380j1758j5565p593j7517k453N0242O492j9380p629
9111e866J5219J0228L29l4933k0367L3400L8626J0085k5298j8565K0614L114l4576
$$ plain form
9203 5600 -3735 -19568 -13578 -36203 -16097 -22517 -3026 48301 55889 55817 49429 55795 65984 43786
9189 43786 27705 26293 33093 20252 20677 22341 57633 46511 7383 -14791 -8659 -6477 7317
9176 7317 18180 7627 3935 8501 7591 8630 20221 -3609 -45026 -53487 -14523 21181 33203
9163 33203 49789 29867 13542 -1993 4748 12543 16748 -10273 -13124 -9680 18087 21123 3414
9150 3414 -13484 -14713 -20073 3897 -14591 -59008 -102192 -99643 -116004 -81296 -33919 -9561 -11574
9137 -11574 208 10929 -5756 -23524 2565 7178 12978 20263 -5106 1241 -21271 -31639 -19361
9124 -19361 -24207 -39994 -7085 19295 7537 -8028 -15621 -33138 -35591 14651 21143 1763 -5866
9111 -5866 9353 19581 19910 -15023 -35390 -1990 36636 46721 21423 2858 23472 26586 -7990
9098g990o002l1032q828N713m085Q267k5342K0139L9268J0193J9732J6622j6537
9085B0118R080n033M596j0600j4088l5876j8933j3154L0071L5335j5887j8066
9073c2437p222J9120M635M3667R772l6483J0661L0219j1737k4114l272K0911K1014
9060D4734L813P354k4894k1559L902M4423m184m9429j6519J610P875m566l051
9047a0491P420m040j3830R524j4877J946K8731K6350k2838m1814Q346j9333p192
9034e2098Q883j7382L5921N816p776j5027n280j2022n111L9230q241r194L0719
9021a1562q115j2985J4009m849N8J8984J6499R091j7022J1135P718k3000p175
9008g214J309l895J6553K6835K3634j0061m5271O90J5540k5802n216J4032J2160
$$ plain form
9098 -7990 -13992 -45024 -53852 -48139 -52224 -43957 -69299 -49160 -9892 301 20033 36655 20118
9085 20118 29198 24165 28761 18161 4073 -31803 -50736 -63890 -33819 1516 -14371 -32437
9073 -32437 -39659 -20539 -15904 27763 37535 1052 11713 41932 30195 6081 2809 23720 44734
9060 44734 48547 55901 31007 9448 13350 57773 53589 4160 -12359 -10749 -2874 -7440 -10491
9047 -10491 -3071 -7111 -20941 -11417 -26294 -24348 4383 30733 7895 -33919 -25573 -44906 -52098
9034 -52098 -43215 -60597 -24676 -18860 -26636 -41663 -46943 -58965 -64076 -24846 -33087 -42281 -11562
9021 -11562 -19677 -32662 -18653 -23502 -23444 -4460 12039 21130 4108 15243 22961 -39 -7214
9008 -7214 -5905 -9800 6753 33588 57222 47161 1890 2580 18120 -7682 -12898 1134 13294
8995A3294j1904K4458k7358k2166j4712k0695N370M9630o048k7366l5625j7842
8983i0964L7347l964K7381K9221j0915L3775K0147l2919r536J4056j7201k9800
8971c3372j1269J3619J1772j0995M774M2969J7089m567k7778r385k6767J3026
8959b0884O038M9768j1227k6397k7248k3327k0116P411M5293K627K3975L9241
8947D5154J0282k2840n1992J3858P487k4501L3491q499j3777K00Q339j5214m62
8934a8474K7984p293j313o925j1416J2740J6956J6153P301k698n6960j0365j516
8921c5826J1563M703J6534O770j107K280m288J3863M1487J101k0089j8098l2364
8908a3471K740M2493L085k1920M944J0129j9442J4520K1096j5001j5387k0309
$$ plain form
8995 13294 1390 25848 -1510 -23676 -38388 -59083 -53713 -4083 -10131 -37497 -73122 -90964
8983 -90964 -53617 -57581 -30200 -979 -11894 21881 42028 9109 -427 13629 -3572 -33372
8971 -33372 -44641 -31022 -19250 -30245 -25471 17498 34587 30020 2242 -7143 -33910 -20884
8959 -20884 -14846 34922 23695 -2702 -29950 -53277 -73393 -65982 -20689 -18062 5913 45154
8947 45154 55436 32596 -19396 -5538 1949 -22552 10939 2440 -11337 -11137 -2798 -18012 -18474
8934 -18474 9510 2217 904 -6021 -17437 -4697 12259 28412 35713 33015 -23945 -34310 -35826
8921 -35826 -24263 -19560 -3026 3744 2637 4917 629 14492 55979 57080 36991 18893 -13471
8908 -13471 -10731 31762 34847 12927 17871 28000 8558 23078 44174 29173 13786 -6523
8896f523j9232K9376K174o186L7331J252l3414J1028L8016J1703p876j8883P792
8883D6558k0855p067n657r964l0433J5044R08J3943R437M065k5384j1157n862
8870b6424J5392K010l641L5859K5080n828r989L8M1080R813k8362r070l729j5288
8856B6941R892k450k5895O262L3496J0407k1560J4589K3301K916k052l3524M716
8843D7039L018K534K3948j9425j5250j9205l6664j0581J2869k16m4364J3272O517
8830c6508K2424J8649N924k1652M072K1319j2536l9382M685L71P135L8342K0050
8817C2893R486k6J1115k3256j9448k6552J1684J1951O558N0919j1255l9156r834
8804E079l6085r267K7328J4174j1491m0228J291j1572M993j5778N100O0818L1699
$$ plain form
8896 -6523 -25755 3621 5795 -391 36940 38192 4778 15806 53822 65525 57649 38766 46558
8883 46558 25703 18636 12979 3015 -27418 -12374 -11466 2477 11914 15979 -9405 -20562 -26424
8870 -26424 -11032 -9022 -12663 23196 48276 42448 32459 32497 73577 83390 55028 45958 42229 26941
8856 26941 36833 34383 8488 14750 48246 58653 37093 51682 74983 77899 75847 42323 47039
8843 47039 50057 52591 76539 57114 41864 22659 -14005 -24586 -11717 -11933 -56297 -43025 -36508
8830 -36508 -14084 4565 10489 -11163 -7091 14228 1692 -37690 -33005 -32634 -25499 12843 32893
8817 32893 42379 42353 53468 30212 10764 -15788 -4104 7847 14405 65324 54069 14913 5079
8804 5079 -31006 -40273 -12945 1229 -10262 -50490 -49199 -60771 -55778 -71556 -66456 -5638 26061
8791B6061n251k5234N300J5471J6161k2113l5879J6838K3278q434K4296o0014
8779b9520n6256J7297N3886J0892r832J2998J4536j15j8840j147p037R114k6411
8766c0435j8814M510K6509Q23K0172J1457j4597k8290k788j3997P652k512M643
8753c5667J3486j7134j3095j752J2982J3005K874K6344k0189k2664J6524R040
8741a6246J7976k7807K7428K4917j0880j1771j1350o312r045j7952L1734L5915
8729B6607N484o711l3915l8329l3311l536N002Q557L034p394M3574J9235n936
8716a7639K7279L6031n49N065k0274k3622J3192J7563j7985j2462l5095J9287
8704i209K5652k2871L926R717K5198p873j3144k5892q689J1334j5863k749L3031
$$ plain form
8791 26061 20810 -4424 876 16347 32508 10395 -25484 -8646 14632 6198 30494 -29520
8779 -29520 -85776 -68479 -14593 -3701 -13533 -535 14001 13886 -4954 -6101 -13138 -4024 -30435
8766 -30435 -49249 -44739 -18230 -17407 2765 14222 -375 -28665 -31453 -45450 -37798 -40310 -35667
8753 -35667 -22181 -39315 -52410 -54162 -41180 -28175 -25301 1043 -19146 -41810 -25286 -16246
8741 -16246 1730 -26077 1351 26268 15388 3617 -7733 -14045 -23090 -41042 -9308 26607
8729 26607 32091 25380 -8535 -46864 -80175 -83711 -78709 -70152 -67118 -74512 -30938 -11703 -17639
8716 -17639 9640 45671 45122 50187 29913 6291 19483 37046 19061 6599 -28496 -9209
8704 -9209 16443 -6428 -2502 7215 32413 24540 11396 -14496 -23185 -11851 -27714 -30463 2568
8691B568K2881o783j7654n419j5909L1665K987J4745K8436j6413l3702j4658L5255
8678B7999J3522j6812P302k0025l3964j790J0256j9271L7468K7079q846p895r006
8665F017M659j8077k2599J1996K5488k43r595O965Q79J241J6101j687k1676j730
8651b261N5156j4039l9328K4863M660L282J9446l161m292m241L0013l1532l5317
8638C249J6877j8523k4059K588K8231q887M001K7163m0761l2905J4088J647K1543
8625e748M0822k728l1436p568K7120K6190k2207m607K353R308L460j2887J8169
8612D0241K1454j5755m0900l5977K6043M6829j9471l377j4614l4444R213J4457
8600f301N057L3043k2611M1522J7586j531n5266q158J370k8480J6964J5093K5977
$$ plain form
8691 2568 25449 18666 1012 -4407 -20316 11349 14336 29081 57517 41104 7402 -7256 27999
8678 27999 41521 24709 32011 11986 -21978 -23768 -13512 -32783 4685 31764 22918 15023 6017
8665 6017 10676 -7401 -30000 -18004 7484 7241 -2354 4611 5490 6731 22832 21145 -531 -2261
8651 -2261 52895 38856 -472 24391 29051 32333 51779 48618 44326 40085 70098 38566 3249
8638 3249 20126 1603 -22456 -19868 8363 -524 3477 30640 -10121 -43026 -28938 -27291 -5748
8625 -5748 35074 32346 910 -6658 20462 46652 24445 19838 22191 31499 34959 22072 40241
8612 40241 61695 45940 5040 -30937 -4894 41935 22464 19087 4473 -29971 -20758 -6301
8600 -6301 -1244 31799 9188 50710 68296 66765 11499 3341 4711 -23769 -6805 8288 34265
8587C4265l153J0373l038J4593j7497k0735k8280J3984P982J4J2161K733r208
8574A4194k5556l0673k73N758j7596k777M785J1908O626K822L5530L962r516K2532
8560B1726n144j1568J6135J3251n725j5315j7432j0336J6179J9385j4058k6646
8548a9548o981l857k0528K4059L4134j0777j0986l1782N585L4586L6630r349o538
8535A4648J3202l9048j8186r792j5470l3606J5455K1226j7746o9O6916L1740k5005
8522D265j8803j5225q050J3002k4094K2954J9502j548p662J4215K8815n735k679
8509A8957o34M980K149n939k0204m4095l153J9514P776k0391k831j404J5884J1096
8495a8295M2581K8489k1654J059l431k2062L033l1319k1483k341O957L380j0389
$$ plain form
8587 34265 31112 41485 38447 53040 35543 14808 -13472 512 8494 8508 20669 23402 14194
8574 14194 -11362 -42035 -42308 -36550 -54146 -56923 -52138 -40230 -33604 -30782 4748 8710 -806 21726
8560 21726 16582 5014 21149 34400 28675 13360 -4072 -14408 1771 21156 7098 -19548
8548 -19548 -26529 -30386 -50914 -26855 7279 -3498 -14484 -46266 -40681 -6095 30535 21186 14648
8535 14648 27850 -11198 -29384 -39176 -54646 -88252 -72797 -51571 -69317 -69386 -2470 29270 4265
8522 4265 -14538 -29763 -37813 -24811 -48905 -25951 -6449 -7997 -15659 -1444 27371 21636 18957
8509 18957 18323 23303 25452 19513 -691 -44786 -47939 -28425 -20649 -41040 -43871 -45275 -29391 -18295
8495 -18295 24286 52775 31121 32180 28749 6687 9720 -21599 -43082 -45423 -38466 -35086 -45475
8482d5475K8861j8368o015K7446K1915k599N604J5715L1515J4538L286k5986N129
8469E5566m4338l1554J430L7471p164J6075L404j1438q443R928K9461l5814l8858
8456b4274J5957L9146p06k226k3104l0667k3959J4436J5739m376M4566M1213q16
8443F0929l1080j8495K3030J2094p820J6072K7238l183l4452j9788k7739n790
8431h984J9983O084j9884j0301N096P35K2758J6284Q636Q86J1694j6176l3385
8418C426o723O343k6036J3579K2662l07k1675K290Q064J2805J0165J7016j1644
8405B9965k1145L449L356R716O003k941l3538L150K7885J8514k060j1679k6187
8392D488r513M982n676J23L8766L3435K6479M9466Q0740J24208J65454J73182
$$ plain form
8482 -45475 -16614 -34982 -40997 -13551 8364 5765 11369 27084 58599 73137 76423 50437 55566
8469 55566 11228 -20326 -18896 18575 11411 27486 30890 19452 11009 20937 50398 14584 -24274
8456 -24274 -8317 30829 30123 27897 4793 -25874 -49833 -35397 -19658 -24034 20532 61745 60929
8443 60929 29849 11354 34384 46478 38658 54730 81968 78785 44333 24545 -3194 -8984
8431 -8984 10999 17083 -2801 -13102 -8006 -7271 15487 31771 40407 41293 52987 36811 3426
8418 3426 -3297 3046 -22990 -9411 13251 12944 -8731 -6441 1623 14428 24593 41609 29965
8405 29965 8820 12269 15625 25341 31344 28403 -5135 -1985 25900 44414 42354 30675 4488
8392 4488 -5025 -43 -5719 -5596 33170 66605 93084 142550 223290 347498 512952 686134
8380F86134J56863l4351j90631k26979j47031q2191l4944o608k7936k6853l74
8369F5099j6780l8930j61L809j1237k1292K2887K068j9450L9303J0768r060K0565
8356D7589Q60l1085q932l478J9229J882q652J3352K2203P498j3515n979n646N1913
8342H7239M6565R3317J14303J49064K84834L73384L71857J29098l02114m14183
8332I33364l14949k18645j05813m2878k6327p0034l6705m5324l0597K4391M7830
8321A14313j2293o064j3659k0219l5950Q392K7285J009m2538m4282j342K5601
8309B53J1408j711K1478J9893K3563J4759J217j2245k3869k535N066L7933O4674
8296A59884N8164M6980R2989J37695J98435Q8228r1759k15703j82990r5009l7195
$$ plain form
8380 686134 842997 808646 618015 391036 244005 161814 126870 120262 92326 65473 65099
8369 65099 48319 9389 9228 13037 1800 -19492 3395 5463 -13987 25316 36084 27024 47589
8356 47589 48449 17364 8432 4954 24183 26065 17413 30765 52968 60466 46951 40972 35326 87239
8342 87239 133804 227121 341424 490488 775322 1148706 1520563 1649661 1347547 933364
8332 933364 618415 399770 293957 251079 224752 154718 118013 72689 42092 66483 114313
8321 114313 102020 95956 82297 62078 26128 34520 61805 62814 20276 -24006 -25348 253
8309 253 11661 9950 31428 51321 74884 89643 90860 78615 54746 52211 57277 95210 159884
8296 159884 218048 265028 358017 495712 694147 782375 690616 474913 291923 196914 159719
8285A59719m7519n2654k3769j1537Q202k509m3687j481J0221r944J0287P610J9806
8272B2745J9468p929K0466J2592N884L4577K0241J016l0230j6411j2450m2478
8260B7491l261K8617M396k47J1830n105j0268o606k7780m629n330N290O426K8727
8246D9551J4101j0193j3340k0690j5611k9871Q76L6957K856m1602R53J1787n735
8233a9961K6441k101J8179M1784M682L7164O3692l359n1153k6903j5119j5273
8221E8073r595q706j6266J2035K4245J6194q478j7893m541L0963J5505k3002l5789
8208C2745r089j6676L982M1720m5625l7918J5344m072l1049J2683K0834j641P063
8195a1699J3685k9426j3516K460M3026J7819p386K138k160J8173J2372k1491n676
$$ plain form
8285 159719 112200 59546 35777 24240 32442 29933 -13754 -15235 -5014 -14958 -4671 2939 22745
8272 22745 42213 34284 54750 67342 73226 107803 128044 129060 98830 82419 69969 27491
8260 27491 24230 52847 57243 56996 68826 63721 53453 46847 19067 14438 9108 14398 20824 49551
8246 49551 63652 53459 40119 19429 3818 -26053 -25177 11780 14636 -26966 -26013 -14226 -19961
8233 -19961 6480 4379 22558 64342 69024 106188 169880 166521 115368 88465 73346 58073
8221 58073 48478 39772 23506 35541 59786 75980 67502 49609 45068 76031 91536 68534 32745
8208 32745 23656 6980 10962 52682 7057 -30861 -15517 -19589 -50638 -37955 -17121 -18762 -11699
8195 -11699 1986 -27440 -40956 -38496 4530 22349 14963 17101 14941 33114 45486 23995 18319
8182A8319j0333l430J725M580J9242k2345k958N081k4083M316J9000J4897K4387
8169D8398j8510k0019p107N742J2487J6095k2401r149k1169O996K2315r487j851
8156B340P512J4541k0319j1741p912o818R192J3052n63j0865j4799l6427n682
8143f8489J4693R458L6521L266k0513k2900o754N2860M873j1025l1296j8700j2053
8130g0059K8814M3305j1790j1953R741l5851L8449J3415k3399l4546J0521M7710
8118D357J3439K4086R561n988j4765k2432l3190J7774M5545j967l668r157q570
8105A5025P48N796K6931j2566q243p829L5430J0973q670j9358r474k442L2706
8092E9027n836l2330j355j3214L477J5889K3997j7767k7834l6962l800J1751k7186
$$ plain form
8182 18319 7986 4556 6281 10861 30103 7758 4800 9881 -14202 -9886 9114 24011 48398
8169 48398 29888 9869 2762 8504 20991 37086 14685 5536 -15633 -8637 13678 4191 2340
8156 2340 9852 24393 4074 -7667 -15579 -22397 -13205 -153 -716 -11581 -26380 -62807 -68489
8143 -68489 -53796 -44338 -7817 -4551 -25064 -47964 -54718 -1858 3015 -8010 -39306 -58006 -70059
8130 -70059 -41245 2060 -9730 -21683 -11942 -47793 -9344 4071 -19328 -53874 -43353 4357
8118 4357 17796 41882 51443 45455 30690 8258 -24932 -7158 38387 36420 32752 23595 15025
8105 15025 15773 21569 48500 35934 27691 19862 55292 66265 57595 38237 28763 26321 59027
8092 59027 53191 20861 19506 6292 9769 25658 49655 31888 4054 -32908 -36708 -24957 -52143
8079e2143k096J0936J9521p389o24J5070Q560L120k6720M924L4343N820j7899
8066d577L376J3200k1099j227M2388J1969k7951k322M879R99q062o804k489j6457
8052a4177M190k407j1595o32P938L2616L418k1867j3256J5277j5998k4125Q690
8039c1928N776q79j9578j6375J0694J959K401M749q622J7091J6126l730n156L426
8025b4046J5780K4545M5355O496k5858k3620q941k11J7686l8126q060Q486M956
8012e558j9296m167L0789L4122j2073k4764R511P076J635j2374l0427N08M0778
7999A5760K6441j7629l1075Q28J8147J7025J8139m2316k6230K276J4100N753r404
7986h185k189j8617L016N1264j0703k602k831p065J8166K0277l5076j411J6252
$$ plain form
8079 -52143 -54239 -43303 -23782 -31171 -31795 -16725 -8165 -5045 -31765 -26841 7502 13322 -4577
8066 -4577 -1201 11999 -9100 -10327 32061 44030 16079 13757 18636 19635 11573 4769 2280 -14177
8052 -14177 -9987 -12394 -23989 -24621 -16683 15933 19351 -2516 -15772 -495 -16493 -40618 -31928
8039 -31928 -26152 -27031 -46609 -62984 -52290 -50331 -47930 -43181 -51803 -34712 -18586 -22316 -27472 -24046
8025 -24046 -8266 16279 61634 68130 42272 18652 9711 9500 27186 -10940 -19000 -10514 -5558
8012 -5558 -24854 -29021 1768 35890 23817 -947 8564 15640 17275 4901 -25526 -25018 15760
7999 15760 42201 24572 -6503 -5675 12472 29497 47636 5320 -20910 -18634 -4534 1219 -8185
7986 -8185 -10374 -28991 -25975 25289 14586 11984 9153 2088 20254 40531 5455 4044 20296
7973B0296Q457o688L1250k1495k1594p580k9920J7327J5883L7712J2176k7158
7961B8666k305j9924r812r617p476J6589M817l8900K212N482J9228K21K707J2843
7947D731J0770J6382P290k5998M676J3738J6482k3699N31l7229j8714r422J2089
7934b8373p579R483K0424J2495K8192j597O660k314k4787J4469J9378J2201j6296
7921D2356J3016j8816j7478p770J3832p990J7077j7559r436M652J3244m9038k289
7908b6199K122L0688K4337j7981Q509N616Q152L68m1960J3746l502L243K2952
7895C0091k4831l2453J7953K7340L0844n98k1905j2152j0298O270N1313k1858
7883C9716l9380J6055J9063j1062j5207k8371J376j9520L6372L309q71r099k1977
$$ plain form
7973 20296 28753 22065 53315 31820 10226 2646 -27274 -9947 5936 43648 55824 28666
7961 28666 26361 6437 -3375 -12992 -20468 -3879 938 -37962 -35750 -30268 -11040 -10819 -8112 4731
7947 4731 15501 31883 39173 13175 17851 31589 48071 24372 24903 -12326 -31040 -40462 -28373
7934 -28373 -35952 -26469 -6045 6450 34642 33045 39705 37391 12604 27073 46451 58652 42356
7921 42356 55372 36556 19078 11308 25140 17150 34227 16668 7232 11884 25128 -23910 -26199
7908 -26199 -24077 6611 30948 12967 21476 27092 35244 35612 -6348 7398 3896 7139 30091
7895 30091 5260 -27193 -9240 18100 48944 48346 26441 14289 3991 10261 61574 39716
7883 39716 336 16391 35454 24392 9185 -19186 -17810 -37330 -958 2351 1480 -7619 -29596
7870b9596j3306j415K9840j3434l2480O399J5349k2585q37p682K6702L8290L444
7857a311j870Q971M179k3882k0278l418K5863M1820L9695j9813j7045j0826k4411
7844b326k9167k3575M2559q347k4072K9103k128R743n651l233J4007K751k6719
7831b7055J0466K5815J6377L1313k2769k9592k0746j5149j7129N272M25J1261
7819c1511K5932J8072r351n63J6701K8256j9584l7146N543j3465r547p545O784
7806b7424J1566k1431k7466R538L850K8665K4445l968J4828n685k9811K740K2234
7793B081n646j6427K0295J84j3590j3354L447m250K099j3511K812J5899K597J9790
7779B426L2194J1187n1262j7345P792J2034K716K549K8279k2238l1722k0968k2249
$$ plain form
7870 -29596 -42902 -44317 -14477 -27911 -60391 -53992 -38643 -61228 -62065 -69747 -43045 -4755 -1311
7857 -1311 -3181 5790 9969 -13913 -34191 -37609 -11746 30074 69769 49956 32911 22085 -2326
7844 -2326 -31493 -55068 -12509 -20856 -44928 -15825 -17953 -8210 -13861 -17094 -3087 -336 -27055
7831 -27055 -16589 9226 25603 56916 34147 4555 -16191 -31340 -48469 -43197 -42772 -31511
7819 -31511 -5579 12493 3142 2579 19280 47536 27952 -9194 -3651 -17116 -26663 -34208 -27424
7806 -27424 -15858 -37289 -64755 -55217 -51367 -22702 1743 -2225 12603 6918 -22893 -20153 2081
7793 2081 -3565 -19992 303 487 -13103 -26457 -23010 -27260 -25161 -38672 -35860 -19961 -17364 2426
7779 2426 34620 45807 -5455 -22800 -15008 -2974 -258 2291 30570 8332 -23390 -44358 -66607
7766f6607J3157M9764J9026j1262K4964R407k8365k5648j3374M705J2385L0025
7754A8177j8005l061o848J98N3765q689m2330J2269j1858k5140n831J6738J5707
7741d908q584j2441N91o576j5577p954P572J3493L1487J1016J1601p663k4609
7728a2552K2117J2984q229J5902J4019R209Q360Q122j3698k5728r802K894q129
7715A5469j8880l0659J158K1889q565j1912k6825Q858J2891j5511L2085J6018
7703c984j4709k3529K2928K4698j9859n538O995P606J8127K5922K9602j2282j4382
7690D1595N730k4644l8623K430j5431j5673K4413L6954j0305l0280J0952R554
7678c328J9654k2779R048j94j2667J2363K7586R193O522m9257O60k2902L2700
$$ plain form
7766 -66607 -53450 -3686 15340 4078 29042 38449 10084 -15564 -28938 -24233 -11848 18177
7754 18177 172 -2889 -9737 -9539 44226 35537 -6793 5476 -6382 -31522 -37353 -20615 -4908
7741 -4908 -13492 -25933 -25342 -31918 -47495 -55449 -47877 -34384 -2897 8119 19720 12057 -12552
7728 -12552 9565 22549 14320 30222 44241 53450 61810 69932 56234 30506 20704 23598 15469
7715 15469 -3411 -34070 -32912 -11023 -19588 -31500 -58325 -49467 -36576 -52087 -20002 -3984
7703 -3984 -18693 -42222 -19294 5404 -14455 -19993 -12998 -5392 12735 38657 68259 55977 41595
7690 41595 47325 22681 -15942 -13512 -28943 -44616 -20203 16751 6446 -23834 -12882 -3328
7678 -3328 16326 -6453 2595 2401 -10266 2097 29683 38876 45398 -3859 -3199 -26101 6599
7665F599Q189l665m186l5036l2105N1538J3713n502o07J839j0737J0290M865k6519
7651b1324q897j2582L0324N6573J20m5279k9451L9236M1920k1991k9236j1073
7639a1660J8599J2841p621N386k6852m847k5656J0367J3467P051J1918K3926J2847
7626C9766k8682Q717J5534J7063j6529o8410J4891J3011O902m592j3824M148j600
7613a3605n0718J48L1667j914l1016l191K8134R59J5485M614K4805K7900K3979
7600E7247j9677m7594p065P864J2344P827k159K1128J817j5191j8347j4783Q549
7587h040L1342J8015K3503j8079j9916k3592q807N052j4078O512J944Q153k606
7574e97q572J0253n471j0945p754k5955k4635J7732J9783P731j5201J9384L1606
$$ plain form
7665 6599 14788 11123 6937 -28099 -60204 -8666 5047 -455 -1062 777 -9960 330 5195 -21324
7651 -21324 -30221 -42803 -12479 44094 44214 -1065 -30516 8720 50640 28649 -587 -11660
7639 -11660 6939 19780 12159 17545 -9307 -14154 -39810 -29443 -15976 -8925 2993 26919 39766
7626 39766 11084 19801 35335 52398 35869 -32541 -17650 -4639 2263 -2329 -16153 -12005 -13605
7613 -13605 -64323 -64175 -32508 -34422 -65438 -68629 -40495 -39536 -24051 -19437 5368 33268 57247
7600 57247 37570 -10024 -17089 -9225 3119 10946 8787 29915 31732 16541 -1806 -16589 -8040
7587 -8040 23302 41317 64820 46741 26825 3233 -5574 -522 -14600 -8088 -6144 2009 -597
7574 -597 -9169 1084 -4387 -15332 -23086 -49041 -73676 -55944 -36161 -28430 -43631 -24247 7359
7561G359J770j2798l9511L0064L667L90k9434L168L8547L2291m0828k2050L0345
7548B980J4542k2815q311q66k3428p597J2384r954J5276p271J1948J1499J0604
7535a009l457J931r366p617M6593n691k5250n560n450P483J3246J8957P775Q353
7521D0938l596j727j0547K1289K104o263n0971j2879J7855J9118k282p033m0542
7508c4536p345K0540K5743M619j2525O270j5046P281O051n6734k1646J4534R135
7495e3659K9881J0026j283Q89N038J4875J2259P080k0252l357N648k6213j4785
7482c3853P939M0391K3322m3030k4598P240L3558n194j8590J9679j570l126k0258
7469a8090k6688J5210M5672K6776k987r027o336j0858m1630o1462J8264L9688
$$ plain form
7561 7359 9129 -3669 -43180 -13116 -9449 -9059 -38493 -35325 3222 35513 -5315 -27365 2980
7548 2980 17522 -5293 -13604 -14470 -37898 -45495 -33111 -43065 -27789 -35060 -23112 -11613 -1009
7535 -1009 -4466 -2535 -11901 -19518 27075 21384 -3866 -9426 -14876 -7393 5853 24810 32585 40938
7521 40938 37342 35615 25068 46357 48461 42198 -8773 -21652 -3797 15321 13039 6006 -34536
7508 -34536 -41881 -21341 4402 9021 -3504 2766 -12280 -4999 1052 -55682 -77328 -62794 -53659
7495 -53659 -23778 -13752 -15035 -14146 -9108 5767 18026 25106 4854 1497 7145 -19068 -33853
7482 -33853 -25914 14477 37799 -5231 -29829 -22589 10969 5775 -12815 6864 5294 2168 -18090
7469 -18090 -44778 -29568 16104 42880 39893 30866 24530 13672 -27958 -89420 -71156 -31468
7457c1468K6283K876R114m088K2011n081l0473k3672l894O394O674L111O664J3584
7443a965J9524O578j6246o515k9508K2991M3829q160m7831j8157O490L8403r131
7430C02R370Q727J2740j211J278O098O94k3201j1055j6341j1901K180r134K0084
7416a1370P54P839K7870p869r763K7272K4254j8351l8857j7698J4818M1371k80
7403C9990k6336l3355k868N256J0476J4966l350k2329M851J9311J3910j2523K2741
7390C0740N60K023k9435n2708J223K7140K1625p589k8277k7134j7477q076Q684
7377g8701K8284K1764K0089j848J3387L3177j6347l9806k2553M609K7979L7369
7365B7403j5444q720J9046o075p824J0591p96p683L015R580k243k2676R671L6818
$$ plain form
7457 -31468 -5185 -2309 6805 2717 24728 19647 -10826 -34498 -38392 -31998 -25324 -22213 -15549 -1965
7443 -1965 17559 24137 7891 1376 -28132 -5141 38688 30528 -17303 -35460 -28970 9433 302
7430 302 9672 18399 31139 29928 31206 37304 37998 14797 3742 -12599 -24500 -22320 -31454 -11370
7416 -11370 -10616 -2777 25093 17224 7461 34733 58987 40636 1779 -15919 -1101 40270 39990
7403 39990 13654 -19701 -22569 -17313 -6837 8129 4779 -17550 -12699 6612 20522 7999 30740
7390 30740 31300 33323 3888 -48820 -47597 -20457 1168 -6421 -34698 -61832 -79309 -87385 -78701
7377 -78701 -50417 -28653 -8564 -10412 2975 36152 19805 -20001 -42554 -37945 -9966 27403
7365 27403 11959 3239 22285 16210 8386 18977 18181 10498 13513 23093 20850 -1826 7845 44663
7351D4663j6082r841k8965k1796J2792j4864R471J3066j9365j3020k1699Q519
7339e7121Q776Q400m892n27L7140J6629j1634n1151j4655M1470M0553j1776j6374
7326a5162L108R726o123j9362J7702J9258J2494j795j7099k1783m5287O819K7253
7313c0251r907j672j4970q068k0747K0959N7472K4823j3594q191K111k5063j9562
7300d6660J4034M0104k6313L699L5524j3698R503j3478K6983J0571k1036m4332
7288b5099k0842K5694r061k1451k082j3749K1513L1106r45k1736J7626K2898j7855
7275a3983l1930J1447M36r886N0814o590j2132Q142k3691o393J0568k6043j385
7262e0626L3230O149q95k204Q633l048M631j6334l484L519O772n848j9029J3548
$$ plain form
7351 44663 28581 18740 -10225 -32021 -19229 -34093 -24622 -11556 -30921 -43941 -65640 -57121
7339 -57121 -48345 -39945 -44837 -45364 -8224 8405 -3229 -54380 -69035 -27565 12988 1212 -15162
7326 -15162 -12054 -2328 -8451 -27813 -10111 9147 21641 19846 2747 -19036 -64323 -57504 -30251
7313 -30251 -40158 -41830 -56800 -64868 -85615 -64656 -7184 17639 4045 -4146 -2035 -27098 -46660
7300 -46660 -32626 7478 -18835 -15136 20388 6690 16193 2715 29698 40269 19233 -25099
7288 -25099 -45941 -20247 -29308 -50759 -52841 -66590 -45077 -13971 -14916 -36652 -19026 3872 -13983
7275 -13983 -45913 -34466 -34030 -43916 6898 308 -11824 -3682 -27373 -33766 -23198 -49241 -50626
7262 -50626 -17396 -11247 -12142 -14346 -5713 -8761 -4130 -20464 -23948 -20429 -13657 -19505 -38534 -24986
7248b4986K6006J0914J7761o706l858J4492q289k6091j9502j228l774N546P16
7235a8999j4109M6752M0258j8030k1120j5431j9770N809j0611J4995M6896M474
7223D1114j3484J676l3674j2455O465O235N994j9591j3964K2989K34J1599J4046
7210A7184M890l0113O594m991j4736J1106K7368j6134J8077j9251l896L8872q462
7197B6508j9019l2910O7431J2491n0228K3047n4150k9370m443J6129K2234J4432
7185g848O924j5982j734p019L1556k120k6814J7913N7402k9191j0875j4248j3094
7172a5130k725L1414J3918n804l6232L214r363L0171K2645m397j7732k845L6410
7159D3544k0148m5189R192L3753j7414l676j6975J2562J9262Q991p034j2199k1204
$$ plain form
7248 -24986 1020 11934 29695 22989 19131 33623 25334 -757 -20259 -21487 -25261 -19715 -18999
7235 -18999 -33108 13644 53902 35872 14752 -679 -20449 -14640 -25251 -10256 36640 41114
7223 41114 27630 29306 -4368 -16823 -10358 -4123 1871 -17720 -31684 -8695 -8461 3138 17184
7210 17184 22074 -8039 -1445 -6436 -21172 -10066 17302 1168 19245 -6 -3902 34970 26508
7197 26508 7489 -25421 42010 54501 4273 27320 -26830 -56200 -60643 -44514 -22280 -7848
7185 -7848 -924 -16906 -18640 -25659 5897 3777 -23037 -5124 52278 23087 12212 -2036 -15130
7172 -15130 -17855 13559 27477 21673 -14559 -11345 -20708 9463 32108 27711 9979 7134 43544
7159 43544 23396 -21793 -12601 21152 3738 62 -16913 -4351 14911 23902 16868 4669 -16535
7146a6535n539K8577K9354j6601J1724k3425k0444Q564M0854P703l6758j1973
7134d499K269K3241K7518k3833k4238j924J7671K9548J0126j3152J1724j1054
7122D3397k4317m016l1327k4517J6746j335K2786m114P633j0568J1453j5649k9731
7109d3559K0875o778K217J2140L789J3822K3557J7459m126j5160k8454j4719J2766
7096f171J7280k2534P508J314J7008J4869N516l0056M796J4877j5567j5077j3048
7083a9285J4337K7709j1289n637J6129m2672r594j2703J4747J9295j5351O940
7071a7374k3103j0582j4235J0099j1773j3079K3861L3765M4465J231j3940j9402
7059a0067l812p921K1046l511M3661o217k8126o379J017J691O310K8463K3372
$$ plain form
7146 -16535 -22074 6503 35857 19256 30980 7555 -12889 -4325 36529 44232 7474 -4499
7134 -4499 -2230 21011 48529 24696 458 -1466 16205 45753 55879 42727 54451 43397
7122 43397 19080 15064 -16263 -40780 -24034 -25369 -2583 -6697 936 -9632 1821 -13828 -43559
7109 -43559 -22684 -29462 -27245 -15105 -11316 2506 26063 43522 39396 24236 -4218 -18937 -6171
7096 -6171 11109 -11425 -3917 -2603 14405 29274 34790 4734 9530 24407 8840 -6237 -19285
7083 -19285 -4948 22761 11472 5835 21964 -20708 -30302 -43005 -28258 -8963 -24314 -17374
7071 -17374 -40477 -51059 -65294 -55195 -66968 -80047 -56186 -22421 22044 23275 9335 -10067
7059 -10067 -13879 -21800 -754 -4265 39396 33179 5053 -1326 -309 1382 7692 36155 59527
7046E9527m4743l5093o38j1175r303j3925J4024J0622M370M2377L9783N371k0391
7033D0806J4022l9321l4756m232N413K582O52p880R075L782p579k5835J5407j774
7019b9638O751j3562J1333N075J6125m517j8088L6487M0434j9027k1005k760k711
7006D897L4814M704j4438l4890O627O356J9669N620j2088l1491j3122l8117j9674
6993h1133J8507K9748M8532J3442k0955j0061J2414j155l108j8235k1111J8026
6981a5089k527J9410n5K1198K0504J1137N916k0984r203j0841N896L4643k5047
6968C4958r623p864j848j4707J0752m0599l0846J3488N679j2951J7227K9903R02
6955e529k9707m917R857J2925K9495j3169k7928R955K6129J5624l4729k7053p606
$$ plain form
7046 59527 14784 -20309 -20947 -32122 -41425 -55350 -41326 -30704 -26334 16043 55826 61197 40806
7033 40806 54828 15507 -19249 -23481 -18068 -15486 -14834 -22714 -13639 -9857 -17436 -43271 -27864 -29638
7019 -29638 -22887 -36449 -25116 -20041 -3916 -8433 -26521 9966 50400 31373 10368 7608 4897
7006 4897 39711 44415 29977 -4913 1714 8070 27739 33359 21271 -10220 -23342 -61459 -81133
6993 -81133 -62626 -32878 15654 29096 8141 -1920 10494 9339 6231 -12004 -33115 -15089
6981 -15089 -17616 1794 1739 22937 43441 54578 60494 39510 30307 19466 25362 60005 34958
6968 34958 25335 17471 15623 916 11668 -28931 -59777 -46289 -40610 -53561 -36334 -6431 -5529
6955 -5529 -35236 -40153 -30296 -17371 12124 -1045 -28973 -19018 7111 22735 -11994 -39047 -46653
6942d6653M534P393j6349K396K2434L6412J2630p850J2363Q902P225j8912j2326
6929A2199l2766r769J6194N557o654K9169K2706k9861n1899O514L1370J6586k9114
6916a9768k2112j4104M645k750L4366J2347M86j0699J5283M0114m7920o592M8091
6903C1387K440p661L7399m7319l6408P33R043j3312o642R858k358J5691L4876
6890B7727J2285o254j3399K8030R647l1571k3313j9878k4477j1388L0084o485
6878b8992J8867K5621N382j5222p773k762J489J0005L567n4q299k2322O341O732
6864g420K6251N224n920M512k65j7775j1502K9898M168j5785j1303M725j2841
6851h033j4L0773N261J2806J5832K1570k4340l4320l3J7306r440j3958j3875j4323
$$ plain form
6942 -46653 -42119 -34726 -51075 -48679 -26245 10167 22797 14947 27310 36212 43437 24525 12199
6929 12199 -20567 -30336 -14142 -8585 -15239 13930 36636 6775 -45124 -38610 -7240 9346 -19768
6916 -19768 -41880 -55984 -51339 -54089 -19723 -7376 -6890 -17589 -2306 37808 -10112 -16704 31387
6903 31387 33827 26166 63565 16246 -20162 -19429 -10386 -23698 -30340 -20482 -22840 -7149 27727
6890 27727 40012 33758 20359 48389 58036 26465 3152 -16726 -41203 -52591 -22507 -28992
6878 -28992 -10125 15496 20878 5656 -2117 -4879 -3390 6615 10182 10128 1829 -20493 -14152 -7420
6864 -7420 18831 24055 18135 22647 22382 4607 -6895 23003 27171 11386 83 4808 -8033
6851 -8033 -8047 22726 27987 40793 56625 78195 53855 19535 19502 36808 27368 13410 -465 -14788
6837a4788P915K05j0368j314L528J4749o819K1988J3178J1121J609l1828j0697
6824a521O894Q177j8356l4947j623j1498N251j1907N448K4411k457K4197L4531
6811B6600L6570j0890k4930J2778k7376k8511J8699J936k2321K1699K2120M0514
6799F6888j4059p458j0778m6038o101j1521J4280K4828j1617Q647L73N857J6646
6786B9947j7497m8624l4473k8640L663J7799K6925J9007n178K0893K8659J0063
6774B2544m6775J572J033l285K2479N74j7453k0060J6352K0947J7460q557m42
6761F389M890k0769l0648k1541o273l108P103J9835L1080k1420J7798M7415J2142
6748D2893j2058j7257Q577L6240k171k5480k580k307m716R903l2304j9448K1790
$$ plain form
6837 -14788 -6873 -6668 -17036 -18350 -14822 -73 -6892 15096 28274 39395 41004 9176 -1521
6824 -1521 5373 13550 -4806 -39753 -41376 -52874 -47623 -59530 -54082 -29671 -32128 -7931 26600
6811 26600 63170 52280 27350 40128 12752 -15759 2940 4876 -17445 4254 26374 66888
6799 66888 52829 45371 34593 -11445 -17546 -29067 -14787 10041 -1576 7071 7444 13301 29947
6786 29947 12450 -36174 -70647 -99287 -95624 -77825 -50900 -31893 -37071 -16178 12481 22544
6774 22544 -24231 -22659 -21626 -24911 -2432 -1858 -19311 -39371 -23019 -2072 15388 6831 6389
6761 6389 11279 -9490 -40138 -61679 -67952 -71060 -63957 -44122 -13042 -34462 -16664 30751 42893
6748 42893 30835 13578 22155 58395 56224 30744 28164 25857 21141 31044 -1260 -20708 1082
6735A082J8787n3654k8189L5182j3619L934K3902L432J2019m930r78N099R950
6722A2017j9558m894J255j1072j1017L3338r120l0131q47J2985J2207J2961o334
6709h210k3440J203L492M7088K7904J3544n254j4174j7254l7448m8815Q660J8637
6696c4067J3862l654L3558K2586m923J8547j4043J267K060n1132k6275K3947J0341
6683g926K8449K0356j2164k1698k8999q832J9563M259O20M4234K3255q569j6841
6670C5707j8653m519J733q301l881P360j2810j225J0738K1374N865j2928M199
6657B4659o365M857N670K094l47j9456l6898j9528j9883L0326K2210J4288j0318
6644h691m287L2140j4295j8152M4783J8205l0582j2209L650J8226Q838j9545m2678
$$ plain form
6735 1082 19869 -33785 -61974 -26792 -40411 -36477 -12575 -9143 2876 -2054 -3032 2067 12017
6722 12017 -7541 -12435 -11180 -22252 -33269 69 -9051 -39182 -40029 -27044 -14837 -1876 -8210
6709 -8210 -31650 -30447 -26955 20133 48037 61581 56327 42153 24899 -12549 -61364 -52704 -34067
6696 -34067 -20205 -23859 9699 32285 27362 45909 31866 33133 35193 -15939 -42214 -18267 -7926
6683 -7926 20523 40879 28715 7017 -21982 -30814 -11251 -6992 -6372 37862 61117 52548 35707
6670 35707 17054 12535 14268 5967 2086 9446 -3364 -4589 6149 27523 33388 20460 24659
6657 24659 18294 23151 28821 30915 30568 11112 -25786 -45314 -65197 -34871 -12661 1627 -8691
6644 -8691 -12978 19162 4867 -13285 31498 49703 19121 6912 10562 28788 37626 18081 -24597
6631b4597M5142p370n836l5437m7891J5915K8715k5974m845L4574j2355r549J8441
6618c1067J4577K5756k9594J2469J6734j2281K189j6713j8256N495k254M927o705
6605c4723k29P993m541K2275K4177p537j485J7821l563k0814l658j0853K3056
6592G919J2629L522j7266l1227j0479L668j3779l2417J4981K4713O887K3759M0779
6579C3689Q180J1847o1191k279j0421J5259J1873j7935J3141L3679k042l4363
6567e63N631K4318j3983n2906r474P750J2553K6455N313m933j8962P463L2507
6554B1169j8541M424P214j2768j5605n49k0252O950Q123R991K4731m1273j7179
6541d3565K7728j4969J4600R248k5366q338N661J5897J0004j7722q493N66k8772
$$ plain form
6631 -24597 20545 13175 7339 -28098 -75989 -60074 -31359 -57333 -62178 -27604 -39959 -49508 -31067
6618 -31067 -16490 9266 -20328 -7859 8875 -3406 -1217 -17930 -36186 -30691 -32945 -28018 -34723
6605 -34723 -34952 -26959 -31500 -9225 14952 7415 5930 23751 20188 -626 -4284 -15137 7919
6592 7919 20548 24070 6804 -24423 -34902 -31234 -45013 -77430 -62449 -37736 -30849 -7090 33689
6579 33689 41869 53716 -7475 -9754 -20175 -4916 6957 -10978 2163 35842 33800 -563
6567 -563 5068 29386 15403 -37503 -46977 -39227 -26674 -219 5094 161 -18801 -11338 21169
6554 21169 2628 7052 14266 1498 -14107 -14656 -34908 -27958 -19835 -9844 14887 -26386 -43565
6541 -43565 -15837 -30806 -16206 -6958 -32324 -40662 -35001 -19104 -9100 -26822 -35315 -34749 -63521
6528f3521k1884j0152P210L8335J5407l566L4560o694j0437P155j0718k946p234
6515c4485p453M108J3392J4183k4860Q002J8947J2336R266k637k0112J9183K6910
6502C6780J6627J5791l1657l7935j2544k4622L7691M2479K17l0108l6981j0258
6490c4520K5182R62p245P431j2128k9704j0894L3389N6917L8296k3353j5114q983
6477B0236l203k4857l4301r985j6807K6346M7853K1453j4191p684M749k3977r613
6464b3981K6251K9707J0842j0353n911j6526P942q149K1982Q658m627k4879k4755
6451a3799J4732O554p748K7756Q400l5091K193K2513K442J2466k7575k9329n895
6438b2381K9525p692n500J176J1427J1867j0886l5256k3661l381L637k169R58
$$ plain form
6528 -63521 -85405 -95557 -88347 -50012 -34605 -38171 -3611 -10305 -20742 -13587 -24305 -27251 -34485
6515 -34485 -41938 -37830 -24438 -10255 -35115 -27113 -8166 4170 13436 10799 -9313 9870 36780
6502 36780 53407 69198 37541 -394 -12938 -37560 131 42610 42827 12719 -24262 -34520
6490 -34520 -9338 -8376 -15621 -8190 -20318 -50022 -60916 -27527 29390 67686 44333 29219 20236
6477 20236 17033 -7824 -42125 -52110 -68917 -42571 5282 26735 12544 4860 9609 -14368 -23981
6464 -23981 2270 31977 42819 32466 26555 10029 17971 9822 31804 40462 35835 10956 -13799
6451 -13799 933 7487 -261 27495 35895 804 2997 25510 27952 40418 12843 -16486 -22381
6438 -22381 7144 -548 -6048 -4872 6555 18422 7536 -27720 -51381 -54762 -51125 -53294 -52336
6425e2336J0817l0211j7630L0543j1096m0887J8299L5308L8062j5331K4836j5223
6413b4849R142J9872l582k0619L28l29K6188Q869L710k8758j7181K444m183l3318
6399f2266j0422J1348J2672j702k908J5185O445J469j3017M668K003j8367J059
6386e3833J6796J2319n293K248n185n206K3262j5138l4436k2828L308K7349N1903
6373d734K5527j5325J448L430r029k3953k9022M3993k104j1967J9186J8777k1377
6360e150K104j5093j5977j3827J2052K8493L4252J4428J1805j0973j9392l6737
6348a4015l7160J6946K0356K5831o328k1020j1812q535J0609Q031L0797l956K4895
6335C4639j4535l2404k426M6969j419j7918l1913P576R509K2480J2248K913l9710
$$ plain form
6425 -52336 -41519 -71730 -89360 -58817 -69913 -110800 -92501 -57193 -19131 -34462 -9626 -24849
6413 -24849 -15707 4165 583 -20036 -19708 -20037 6151 15020 18730 -10028 -27209 -24765 -28948 -62266
6399 -62266 -72688 -61340 -48668 -50370 -53278 -38093 -31648 -30179 -43196 -38528 -36525 -54892 -53833
6386 -53833 -37037 -24718 -30011 -27763 -32948 -38154 -14892 -30030 -64466 -87294 -83986 -56637 -4734
6373 -4734 20793 5468 6916 10346 1317 -22636 -51658 -7665 -9769 -21736 -2550 16227 -5150
6360 -5150 -3046 -18139 -34116 -47943 -35891 -7398 26854 41282 53087 42114 22722 -14015
6348 -14015 -51175 -34229 -13873 11958 5630 -15390 -27202 -35737 -25128 -17097 13700 9744 34639
6335 34639 20104 -12300 -14726 32243 30824 12906 -19007 -11431 -1922 20558 32806 35719 -3991
6322c991M93K6444j7755k1772k1387j4978R981L3612J3642n490r830L2564L6342
6309E7875l0248l3525m0485J7620J2822j9086J8126P415K4725J8801r230k7237
6297b427o942J6352j3626k5053j5120j4767j2450k3252J6581L1335o655J2772
6285d3252N025p572L5599K681J807n609j4811k019q94L291k1811j5501o04L9617
6271b4053P910q270J0607P331R285k3863l7648J7659M0154J0796J923L6146Q326
6258E6303l1347m1616j5207J5796K916q246P205l4216P1856L2081j6672k5847
6246A3006p22j6933q404L7479j0315r129J9525j2631j0905j1309L8211n054k046
6233B0773k6749j0534j3897J8383o128q006j3957p486L2736J9028l3281J4521
$$ plain form
6322 -3991 -3498 22946 5191 -16581 -37968 -52946 -42965 -9353 4289 -1201 -11031 21533 57875
6309 57875 27627 -5898 -46383 -28763 -15941 -35027 -16901 -9486 15239 34040 24810 -2427
6297 -2427 -9369 6983 -6643 -31696 -46816 -61583 -74033 -97285 -80704 -49369 -56024 -43252
6285 -43252 -38227 -45799 -10200 -7519 -5712 -11321 -26132 -28151 -29045 -25754 -47565 -63066 -63670 -24053
6271 -24053 -16143 -24413 -13806 -6475 2810 -21053 -58701 -41042 -888 9908 11831 47977 56303
6258 56303 24956 -16660 -31867 -16071 -13155 -21401 -14196 -48412 23444 55525 38853 13006
6246 13006 12284 -4649 -13053 24426 14111 4982 24507 11876 971 -10338 27873 22819 20773
6233 20773 -5976 -16510 -30407 -12024 -18152 -26158 -40115 -47601 -14865 4163 -29118 -14597
6221a4597l0518l372J0277j5139K1964J5469j4102J1207k0598j6268m74J9100
6209c7051L6988P605J125o924J4624p756l931j329n207k2801j399J5050J6961
6196E955J1460K2246k7514l1536J0652J3537j9139l0202J7420q694R519M2409
6184A6113J0551k5789p824L656q348m2021J765N9866M3581j0192l1418j0830K4675
6171B3785k4023k4029m036J5690K4352J9093J5646o000k1659k6252Q748k6298
6159b4983m2170J8294J8400k355K2814K2727M3925K4216J5533m390j2565j6057
6147F3389m3974N028J4057j6069l076K1272j8056k2414J5967K4874N406O969j8394
6134C4979n567j8013L916j600l2880J0582K568J2022m610l4090P48p712j8860
$$ plain form
6221 -14597 -45115 -48487 -38210 -53349 -31385 -15916 -30018 -18811 -39409 -55677 -56151 -37051
6209 -37051 -63 7542 8667 1743 16367 8611 4680 3351 -1856 -24657 -26056 -11006 5955
6196 5955 17415 39661 12147 -19389 -8737 4800 -14339 -44541 -27121 -35815 -26296 16113
6184 16113 26664 875 -6949 -3293 -11641 -53662 -51897 7969 51550 41358 9940 -890 23785
6171 23785 -238 -24267 -28303 -12613 11739 30832 46478 40478 18819 -7433 1315 -24983
6159 -24983 -67153 -48859 -30459 -32814 -10000 12727 56652 80868 96401 92011 79446 63389
6147 63389 19415 24443 38500 22431 19355 40627 22571 157 16124 40998 46404 53373 34979
6134 34979 29412 11399 15315 13715 -19165 -8583 -6015 6007 1397 -32693 -31945 -39657 -58517
6121e8517J9313N529Q322J254j5130k0733J3591Q281q029j2817j5404P355J8547
6108d8438j691K398L9831K7788K288m426j3489k706l6269k5796k1118J0040K1222
6095e0366K1387K560K0810J851j169M070j5795m6199J1014L7931K6990M006r410
6082G680m0022j867L0065K146k7520J0699K5224k4787j9556k9265K2232L0500
6070a4471j3114j7740K7319L735J1817R91m975m897n029L6739M0968J2272j3959
6057E9656k7173k0349j2407J1915J096l9604K5823l772j1078j9952K2139M0108
6045B6402M6402l828j2743J3595j0537j9074j0369m357Q207j3265l1721J4545
6033C257j2788k981O258M2654J5767k0663k84k1544k4467k6078k6448K6805K7371
$$ plain form
6121 -58517 -39204 -33675 -25353 -24099 -39229 -59962 -46371 -38090 -46119 -58936 -74340 -66985 -48438
6108 -48438 -50129 -47731 -7900 19888 22176 17750 4261 1555 -34714 -60510 -81628 -71588 -50366
6095 -50366 -28979 -26419 -5609 -3758 -4927 -857 -16652 -62851 -51837 -13906 13084 17090 7680
6082 7680 -32342 -34209 -4144 -1998 -29518 -18819 6405 -18382 -37938 -67203 -44971 -14471
6070 -14471 -27585 -45325 -18006 -14271 -2454 -1463 -6438 -11335 -16364 20375 61343 73615 59656
6057 59656 32483 12134 -273 11642 12738 -26866 -1043 -4815 -15893 -35845 -13706 26402
6045 26402 72804 68976 56233 69828 59291 40217 29848 25491 33698 20433 -11288 3257
6033 3257 -9531 -12512 -6254 36400 52167 31504 31220 9676 -14791 -40869 -67317 -40512 -13141
6020a3141Q76j9434M180J3714N1296J5285k1938k542l3351k7149o715r930q982
6007e7831l2920j50M5671O901k7743J2500J7569j5690j37O746j7541J1304J8161
5994c3160r662M2121L5951k1567j3547j9847M56k6431R879k345j4122J2604q451
5981d8121M078P876K4155M1974J3392N276k4845j3303J4731j2946j9863j8517
5969b6113k681J5481N0443K5372j1895k3784j7728j8202J6798R056k4069L455
5957c867j931n244K875J6832n983k4275M3443K4777j515j9609n252J490r977m898
5943F866N924K5749J5631J8721o191j8825m7168o809N061m9257p447J3554L6046
5930h145O8831k2075l5636j2954O761J6243q072J5078l0437k0718k1320q762K5152
$$ plain form
6020 -13141 -12265 -31699 -27519 -13805 37491 52776 30838 28296 -5055 -32204 -38919 -48849 -57831
6007 -57831 -90751 -90901 -45230 -38329 -66072 -53572 -36003 -51693 -51830 -45084 -62625 -51321 -33160
5994 -33160 -42822 -701 35250 13683 136 -19711 -19255 -45686 -35807 -38152 -52274 -39670 -48121
5981 -48121 -44043 -36167 -12012 29962 43354 48630 23785 10482 25213 12267 -7596 -26113
5969 -26113 -28794 -13313 37130 62502 50607 26823 9095 -9107 7691 16747 -7322 -3867
5957 -3867 -5798 -11042 -8167 8665 2682 -21593 21850 46627 45112 25503 20251 21741 11764 6866
5943 6866 12790 38539 54170 72891 66700 47875 707 -6102 -1041 -50298 -57745 -44191 -8145
5930 -8145 60686 38611 2975 -9979 -3218 13025 4953 20031 -10406 -31124 -52444 -61206 -36054
5917c6054j007R599k976J7630J8554k3306j9943M976m1361j7834K3739L0592K1274
5904a6117L9288j4744k0624k3613P501L8264k870m5233l7061P268K1338Q628Q278
5891b9697j1700k294L8609r540j6553K0554l4699k0098K5310M363K1128j5282
5879b9899q126l688Q84k08j7468p883M7669J3238P153k998k7812k116J2435O294
5865a2525L505j1072n009K938K4649K8683m062j7338J7958q990j918q326j9443
5852a0950J2451j1101J618K1314K5338l9597l5576k014K1592N124O691K9117N421
5839B9428N723J7216J0704J1784k2301l1634n0155j9124J8217K2189R12M4945
5827C7904j7602k1146r187Q245K1346k3377j9540m214J497M4037k8566K125O999
$$ plain form
5917 -36054 -37061 -27462 -30438 -12808 5746 -17560 -37503 -32527 -73888 -91722 -67983 -37391 -16117
5904 -16117 23171 8427 -12197 -35810 -28309 9955 7085 -38148 -75209 -67941 -46603 -37975 -29697
5891 -29697 -41397 -43691 -5082 -14622 -31175 -10621 -45320 -65418 -40108 -35745 -14617 -29899
5879 -29899 -38025 -41713 -40829 -41037 -58505 -66388 -18719 -5481 1672 -1326 -29138 -31254 -18819 -12525
5865 -12525 -9020 -20092 -25101 -22163 2486 31169 27107 9769 27727 18737 16819 8493 -10950
5852 -10950 1501 -9600 -7982 13332 38670 -927 -36503 -38517 -16925 -11801 -5110 24007 29428
5839 29428 35151 52367 63071 74855 52554 20920 -29235 -48359 -30142 -7953 -7041 37904
5827 37904 20302 -844 -10031 -1786 19560 -3817 -23357 -27571 -26074 17963 -10603 -8478 -1479
5814a479K4869j96j1875N602p038q428L222k1057r972J9831L3154q898k7529l360
5800a3154O335n366J5960J9290K6014N465m1176j887J1342J1501l7996J1164J9265
5787B6757j087j5262l5053N497Q689J9113l3377k2955M138k2004J0778N5204L167
5774C605m2566k0593O881j4648K1220L0650K9406j8235k9912K7091K5075j216
5762A6758k4727k7709L3332L2411l658l3520n3451M774M3592K7733J8452n2689
5750a8702k595K3524j270j5569n366K1868j2662k7303j7534J84J4227k1696k4261
5737h7155J0648K114J4425J3003J7517j853k0858m50J2403k1164k9316L8067K1011
5724c1608L2166K1088o173j5027l8076m8536j5143M979M1594L5610O589N85L3242
$$ plain form
5814 -1479 23390 23194 11319 16921 9883 1455 4677 -16380 -26352 -6521 26633 17735 -9794 -13154
5800 -13154 -6819 -12185 3775 23065 49079 54544 13368 11481 22823 34324 -3672 7492 26757
5787 26757 25670 10408 -24645 -19148 -10459 8654 -24723 -47678 -43540 -65544 -54766 438 3605
5774 3605 -38961 -59554 -52673 -67321 -46101 -15451 13955 -4280 -34192 -7101 17974 16758
5762 16758 -7969 -35678 -2346 30065 26407 -7113 -60564 -55790 -12198 15535 33987 -18702
5750 -18702 -21297 2227 957 -14612 -19978 1890 -10772 -38075 -55609 -55425 -41198 -62894 -87155
5737 -87155 -76507 -74393 -59968 -46965 -29448 -31301 -52159 -52609 -40206 -61370 -90686 -52619 -31608
5724 -31608 558 21646 15473 446 -37630 -86166 -101309 -96330 -54736 -19126 -12537 -11952 21290
5711B1290k4050k7817J8916J0352J6080P476j9752J2121k40k3338j4396l423K0473
5698f308p762k6583J5778K2715j8036N210m418j305K0527L2015R274k5733k6852
5685a1478L423j2569L1234K6330k4149l3568m049l537M7519J5346L683L289k3013
5672A8461j4059j9911k7629k3546L2092P937j6546j3841K6911J738L4118L3423
5660C9148o112q806j2365j6284k6126j2421j1092k6385j0654M2618K2371K3488
5648b620K0929q804j4701l10J4188L355m2319P753K7786M632l7576j1750J1649
5635b7788K0185K1730J2567k187Q003N6971r630l8862M759j3114M947O429J5086
5622E9096k627j8474l5636m6707q535j685K8233M6626j1716j7655J4482K744j605
$$ plain form
5711 21290 -2760 -30577 -11661 -1309 14771 22247 2495 14616 14376 -8962 -23358 -26781 -6308
5698 -6308 -14070 -40653 -24875 -2160 -20196 -14986 -19404 -20709 -182 31833 41107 15374 -11478
5685 -11478 -8055 -20624 10610 36940 12791 -20777 -24826 -28363 19156 34502 38185 41474 18461
5672 18461 4402 -15509 -43138 -66684 -34592 -26655 -43201 -57042 -30131 -28393 5725 39148
5660 39148 33036 24230 11865 -4419 -30545 -42966 -54058 -80443 -91097 -48479 -26108 -2620
5648 -2620 18309 9505 -5196 -5506 8682 12037 -30282 -22529 5257 9889 -27687 -39437 -27788
5635 -27788 -7603 14127 26694 24507 32510 89481 79851 40989 45748 32634 37581 44010 59096
5622 59096 56469 37995 2359 -44348 -52883 -54568 -26335 20291 8575 -9080 5402 8146 6541
5609F541j0843j3922k0975J3534k514j5604j197K0825J5679l706J740J2868l8680
5596c6254p345J5663K3587N318J4521Q285M687m625m079K823o433L994k4311k3566
5582b7735L859J2379l732k609K1235K7803J2361l9866k2946O771L055K8166j2883
5569E858k0851N361J0559k0236o950j5246j451J6113J5764m450j7179r392J0062
5556c2038Q635J3247m3626Q204Q272J6508K5062J3621n36j6125o874L48j2383
5543a7685j3845j9057n428M343J2038J6901L0930P315j2226K9209k2531k6529
5531a6565K4767L9922l510l8250l1213K8288K727l5595J2836K4637P654J2917
5519B8615j5932j6433O123J2290n910L509k7493j9010j5828Q297M214J443K1278
$$ plain form
5609 6541 -4302 -18224 -39199 -25665 -28179 -43783 -44980 -24155 -8476 -12182 -10442 2426 -36254
5596 -36254 -43599 -27936 -4349 969 15490 23775 28462 23837 19758 22581 16148 20142 -4169 -27735
5582 -27735 -23876 -11497 -15229 -17838 3397 31200 43561 3695 -19251 -12480 -9425 18741 5858
5569 5858 -14993 -9632 927 -19309 -26259 -41505 -42956 -26843 -11079 -15529 -32708 -42100 -32038
5556 -32038 -23403 -10156 -53782 -45578 -37306 -20798 4264 17885 17349 1224 -5650 -5302 -17685
5543 -17685 -31530 -50587 -56015 -51672 -39634 -22733 8197 15512 3286 32495 9964 -16565
5531 -16565 8202 48124 44614 6364 -24849 3439 6166 -29429 -16593 8044 15698 28615
5519 28615 12683 -3750 2373 14663 8753 12262 -15231 -34241 -50069 -41772 -37558 -36115 -14837
5506a4837J2310K793r9R383o124M196k1500l4610J0695Q291k496N938L483j410
5492b3987m215j1102J6712M5057J5301j0465r407j1926o211P910R672j0327M9038
5479E6050R118k9616J017K2132l1330k7908j6637l196r053k9922R771J8534L0638
5466d02J0316l4369J6919L516k048J6762l1456j1741J2656l133K6144j7935k6552
5453d1323L1051K5564L0545M3747j6774n8339k4554o549J2406K384n918J1575
5441C815o356o490J4703J3152k7076L628j8375R707K357P426j1493l746n247o49
5427b4644O433N984K0263J542L914J9084M8344L494m1274k8310O397m631l742
5414A2854J7266p696l6403l2386J5857J4140k017R709M278K741J1192k6336p612
$$ plain form
5506 -14837 -2527 266 167 9550 3426 7622 -13878 -48488 -37793 -29502 -31998 -26060 -22577 -23987
5492 -23987 -28202 -39304 -22592 22465 37766 27301 17894 5968 -243 7667 17339 7012 56050
5479 56050 65168 35552 36569 58701 27371 -537 -17174 -20370 -29423 -59345 -49574 -31040 -402
5466 -402 9914 -24455 -7536 -4020 -6068 10694 -20762 -32503 -19847 -22980 3164 -14771 -41323
5453 -41323 -10272 15292 45837 89584 72810 14471 -10083 -16632 -4226 -1842 -7760 3815
5441 3815 -2541 -9031 5672 18824 -8252 -4624 -22999 -13292 -10935 -3509 -15002 -18748 -23995 -24644
5427 -24644 -18211 -12227 8036 9578 13492 32576 80920 84414 43140 14830 21227 16596 12854
5414 12854 30120 22424 -13979 -46365 -30508 -16368 -18385 -8676 -4398 -1657 9535 -16801 -24413
5401b4413N0311K3447j5228l1759k8573o913J5631K3851k5040k8286O584N711
5389c4677J3340Q247J2941k425N218J0889J2554l6998j602p26q858Q844o321j2039
5375c1613j8452k1645n904J9960K4135Q514K0656q924k959K2728j2257j0248N300
5362a0709J4931p367j4106N324j1687K1082k508M0875L3679l2182l1824j9747
5350a4239J7482O721L4490J0864m6756J0839L5275k7230j8953m28l2722l8679
5338f3336o763j0903N699J9801L9959k3746j20K0984k459k8046j924L8082L671
5325i101n501j3543J9714J1243J6941j8635K847n254j3460k2145J6904K1829L3105
5312C4944J350k1487j9654J5351L1437j0941j2524M207j1260j0853M875L0621
$$ plain form
5401 -24413 25898 49345 34117 2358 -26215 -33128 -17497 6354 -18686 -46972 -40388 -34677
5389 -34677 -21337 -13090 -149 -2574 2644 13533 26087 -10911 -12513 -13239 -22097 -13253 -19574 -31613
5375 -31613 -50065 -71710 -77614 -57654 -33519 -25005 -4349 -13273 -16232 6496 -5761 -16009 -10709
5362 -10709 4222 -3145 -17251 -11927 -23614 -2532 -5040 35835 69514 37332 5508 -14239
5350 -14239 3243 9964 44454 55318 8562 19401 54676 27446 8493 8065 -24657 -63336
5338 -63336 -70099 -81002 -75303 -55502 -15543 -39289 -39409 -18425 -20884 -48930 -50854 -12772 -9101
5325 -9101 -14602 -28145 -8431 2812 19753 1118 3965 -1289 -14749 -36894 -19990 1839 34944
5312 34944 36294 14807 -4847 10504 41941 31000 18476 22683 11423 570 5445 36066
5300C6066M885l3843j6076p454r565J6555K0874J6201j7059q519k0375J4580k353
5287f083J1019nk9930K5679J088k9102J3120K1240j9534j8372l4297l241j0180
5274g8598M646J6590K8138j8338k4553K3562M8049K9841M316r410J5068l200j0430
5261B5681r7l1179k1605J5460N4876m1154m9396O448K1166K0911O182n0681j0054
5248e3442L4008j5412P99l0417K2290o225j4594Q889j3309P988J4904M0712R987
5235F178j6224l0462J7325O300k0449K5541q31k8464j5881M4132K3665r731K226
5222C325Q353L2272j6734l8204m2441J5315L1143K1495J2066J3898m261j7567
5210A8660L867l5102N943O042k4534j8848k507p205J7102l779L533l295r860L0111
$$ plain form
5300 36066 40951 7108 -8968 -16422 -25987 -9432 11442 27643 10584 2065 -18310 -3730 -6083
5287 -6083 4936 4931 -24999 680 1768 -27334 -14214 7026 -12508 -30880 -65177 -68418 -78598
5274 -78598 -73952 -57362 -29224 -47562 -72115 -48553 -504 29337 33653 24243 39311 36111 25681
5261 25681 25584 -5595 -27200 -11740 43136 1982 -47414 -40966 -19800 1111 7293 -43388 -53442
5248 -53442 -19434 -34846 -34047 -64464 -42174 -48399 -62993 -54104 -67413 -59425 -44521 -3809 6178
5235 6178 -10046 -40508 -23183 -16883 -37332 -11791 -12622 -41086 -56967 -12835 10830 1099 3325
5222 3325 11678 43950 27216 -10988 -53429 -38114 -6971 14524 26590 40488 36227 18660
5210 18660 22527 -12575 -6632 -590 -25124 -43972 -46479 -53684 -36582 -40361 -36828 -40123 -49983 -19872
5196a9872K0091L8482J9701k0064k1462l3913j5427K5062J8292M052j5888j8189
5184a9135J7582J0471q598K147J2612P433j009k6857K4605J9803R101l3302n6300
5171d1447m441J773j6951j8335p788M8976K4724m1205J2666J7156J4199q55N615
5158e913K0847n364p730k5339k292K1892L23j7574k2116k8768J3206J4012K4184
5145b0632J4692l3168p028M538J9669K7040l812l5378n664K0955L566j3960k7747
5132e6929k5710M5177L6528K591J1363O271j6447j8498R086m679n03r985L213
5119a8522J8777j2321j4865L1829M1488j0333k6069p985M509k2243q333P371M0509
5106B3812P022q100j1855L2193M533J0671n6802r604P359L351K2764J3775k1100
$$ plain form
5196 -19872 219 38701 58402 38338 16876 -17037 -32464 -7402 10890 14942 -946 -19135
5184 -19135 -1553 8918 320 2467 15079 22512 21503 -5354 19251 39054 48155 14853 -41447
5171 -41447 -45888 -44115 -61066 -79401 -87189 -38213 -13489 -54694 -42028 -24872 -10673 -11528 -5913
5158 -5913 14934 9570 1840 -23499 -25791 -3899 -3576 -21150 -43266 -72034 -58828 -44816 -20632
5145 -20632 -5940 -39108 -46136 -41598 -21929 5111 1299 -34079 -39743 -18788 -15222 -29182 -56929
5132 -56929 -82639 -37462 -934 1657 13020 19291 2844 -15654 -6568 -11247 -11750 -21735 -18522
5119 -18522 255 -12066 -26931 4898 46386 36053 9984 1999 6508 -15735 -24068 -16697 23812
5106 23812 30834 22734 10879 43072 47605 58276 1474 -8130 -771 2580 25344 39119 18019
5093A8019l1469K752L3929J3549J5571j2429r006l3667n263j6343r72l9772K4980
5080d0121K2223N891M544q197q786j1163L2378K3803K3935q385l3683J4863o812
5067A0490N47J727j5480k6452j3178j6291L665L1770k9550L2540R082K4504R749
5054B3123P341J9155N911J1414K3188k2879k9271m006l5273l4787K6113J2080
5042B109J0161K9439O700K162k9815j4513j0329K0715N775k6658j4326j0285K1188
5029g677L4931j0563l7817m3978J3429K0795J4870R813k2846k1539N324J2156
5017c3102q73M6690J516j7605R104J7573Q239K667L507m0320k6566q657L5099
5004b728J5957q363k815K1414j984j8134K8257J5894J3835j7558k3146K9229O09
$$ plain form
5093 18019 -13450 -10698 23231 36780 52351 39922 30916 -2751 -8014 -24357 -25329 -65101 -40121
5080 -40121 -17898 -12007 -7463 -15660 -24446 -35609 -3231 20572 44507 36122 2439 17302 10490
5067 10490 11037 12764 -2716 -29168 -42346 -58637 -54972 -23202 -52752 -20212 -11130 13374 23123
5054 23123 30464 49619 55530 66944 90132 67253 37982 33976 -1297 -36084 -9971 2109
5042 2109 12270 41709 48409 50571 20756 6243 -4086 16629 22404 -4254 -18580 -28865 -7677
5029 -7677 27254 16691 -21126 -65104 -51675 -30880 -16010 -6197 -29043 -50582 -45258 -33102
5017 -33102 -33975 12715 14231 -3374 5730 23303 31542 34209 37716 -2604 -29170 -37827 -2728
5004 -2728 13229 4866 2051 23465 21481 3347 31604 47498 61333 43775 20629 49858 50467
4991E0467k0078o075j6812K173j515m7014J5258m890J9921L0591l1746l1770K5044
4978a6446M7980J6812k3255k6555L786m801m5799j1569M7182K8662l063J1528
4966B4462J3439j9859j2208J551O717k743k9390j6279j1430L420M135j7022L1412
4953b3795K3521J7579K7260J3095j7073k0644j7060j0580R807o491k1442J536
4941b4287L8601R206r707k9375Q1P035o1379j4555L2419L9135j8071k663L3368
4928a92N4549J25n487k4967k8307j3154J9857M341j0762J5783K1197j5576O798
4915B4205q778Q580J060m2136n1282K4824J5454J4129M977K855J3953m129O15
4902D327k4370P300k770O209R406m485K1909o581R048J5107l05k2622l9228k7158
$$ plain form
4991 50467 30389 24314 7502 9675 8160 -38854 -23596 -28486 -8565 22026 -9720 -41490 -16446
4978 -16446 31534 48346 25091 -1464 2322 -2479 -48278 -59847 -12665 15997 12934 24462
4966 24462 37901 18042 5834 7385 14102 11359 -18031 -34310 -45740 -42320 -38185 -55207 -23795
4953 -23795 -274 17305 44565 57660 40587 19943 2883 -7697 2110 -4381 -25823 -24287
4941 -24287 14314 23520 13813 -15562 -15481 -8446 -69825 -84380 -51961 -12826 -30897 -33560 -192
4928 -192 54357 54482 48995 24028 -4279 -17433 2424 6765 -3997 11786 32983 17407 24205
4915 24205 15427 24007 25067 -17069 -68351 -43527 -28073 -13944 -8967 -6112 7841 3712 4327
4902 4327 -20043 -12743 -15513 -9304 102 -4383 17526 10945 19993 35100 34795 12173 -27055 -54213
4888e4213K7973k4295j5250P009j366o802N0486M5091k231j2832N648l1656j506
4875a3944J7412m755j372n023m0938J1332O066J919L3552O808K312k4988j5367
4862b6986M5539K8001k4465l4691L070m747n689J9028J5243L762j2045M919J38
4849A1077k5922l7093j1110J7389L3580j4329K5985q945l3768J1403L1407K8985
4837B8659M9j1519j5625L0281P327k9367k3577K3399n842j7652J8117J2057j3354
4824B953q587n697L2018j5120j4195m5393O021K2824J2893p658k0719J8808k606
4811b4458j426J3196L8892n447o210J4019r801l3203j6255Q178K2184k180M0575
4798C8064l314k0262j8441R873J8006j1742j2169k934J2943j3205l5952k2574
$$ plain form
4888 -54213 -26240 -50535 -65785 -58776 -60142 -66944 -16458 28633 26402 13570 19218 -12438 -13944
4875 -13944 3468 -1287 -2659 -7682 -48620 -37288 -31222 -29303 4249 11057 13369 -11619 -26986
4862 -26986 18553 46554 22089 -12602 -9532 -14279 -19968 -940 14303 18065 6020 10939 11077
4849 11077 -14845 -51938 -63048 -45659 -12079 -26408 -423 -9368 -43136 -31733 -326 28659
4837 28659 28708 17189 1564 31845 39172 9805 -13772 9627 3785 -13867 4250 16307 2953
4824 2953 -5634 -11331 20687 5567 -8628 -54021 -48000 -25176 -12283 -19941 -40660 -21852 -24458
4811 -24458 -25884 -12688 26204 20757 14547 28566 18765 -14438 -30693 -22515 -331 -2511 38064
4798 38064 34750 14488 -3953 5920 23926 12184 15 -2919 10024 -3181 -39133 -61707
$$ [...]
##END NTUPLES=NMR SPECTRUM
##END=
