##TITLE=Analysis number 325856
Compound Code cc 06605
Project Code adrs
Chemist Name molekula
##JCAMPDX= 6.0         $$ Bruker NMR JCAMP-DX V2.0
##DATA TYPE= NMR SPECTRUM
##DATA CLASS= NTUPLES
##ORIGIN= Bruker BioSpin GmbH
##OWNER= nmr
$$ XWIN-NMR		Version 3.5
$$ Wed Jan 17 10:00:34 2007 GMT Standard Time (UT+0h)  MAYBRIDGE\nmr@NMR_250MHZ
##.OBSERVE FREQUENCY= 250.131544655141
##.OBSERVE NUCLEUS= ^1H
##.ACQUISITION MODE= SIMULTANEOUS (DQD)
##.ACQUISITION SCHEME= undefined
##.AVERAGES= 16
##.DIGITISER RES= 18
##SPECTROMETER/DATA SYSTEM= dpx250
##.PULSE SEQUENCE= zg30
##.SOLVENT NAME= CDCl3
##.SHIFT REFERENCE= (INTERNAL, CDCl3, 0, 16.522)
##AUDIT TRAIL= $$ (NUMBER, WHEN, WHO, WHERE, WHAT)
$$ ##TITLE= Audit trail, XWIN-NMR		Version 3.5
$$ ##JCAMPDX= 5.01
$$ ##ORIGIN= Bruker BioSpin GmbH
$$ ##OWNER= nmr
$$ C:\u/data/dgb/nmr/ADRS/1300/pdata/1/auditp.txt
$$ ##AUDIT TRAIL=  $$ (NUMBER, WHEN, WHO, WHERE, WHAT)
(   1,<2007-01-17 10:00:15.25 +000>,<MAYBRIDGE\nmr>,<NMR_250MHZ>,
      <created by zg, POWCHK disabled, PULCHK disabled
       configuration hash MD5:
       49 4B E0 1D 92 C2 6B 37 9F E6 65 BC 52 41 86 1D
       data hash MD5: 64K
       D3 42 A3 BE F8 99 55 9E F7 A3 5B 6E 43 AC 56 55>)
(   2,<2007-01-17 10:00:26.21 +000>,<MAYBRIDGE\nmr>,<NMR_250MHZ>,
      <Start of raw data processing
       ef LB = 0.3 FT_mod = 6 PKNL = 1 SI = 32K 
       data hash MD5: 32K
       16 DF EA F7 7B BD A7 D9 3E 80 6B FA 7F 98 2E 1F>)
(   3,<2007-01-17 10:00:27.94 +000>,<MAYBRIDGE\nmr>,<NMR_250MHZ>,
      <apk 
       data hash MD5: 32K
       D6 0E 25 A5 D7 61 F2 46 96 06 A4 5C CC 95 C4 CE>)
(   4,<2007-01-17 10:00:28.71 +000>,<MAYBRIDGE\nmr>,<NMR_250MHZ>,
      <abs ABSG = 5 
       data hash MD5: 32K
       7F E5 1F 34 CD 56 3B E6 76 D2 DC F3 04 19 87 B3>)
$$ ##END=
$$ 
$$ hash MD5
$$ 04 AC EB E9 16 06 E8 4C 71 4C 35 14 47 E1 F0 26
##$RELAX= 
##$RELAX= 
##$RELAX= 
##$RELAX= 
##$RELAX= 
##$RELAX= 
##$RELAX= 
$$ Bruker specific parameters
$$ --------------------------
##$DU= <C:\u>
##$EXPNO= 1300
##$NAME= <ADRS>
##$PROCNO= 1
##$TYPE= <nmr>
##$USER= <dgb>
##$AMP= (0..31)
100 100 100 100 100 100 100 100 100 100 100 100 100 100 100 100 100 100 
100 100 100 100 100 100 100 100 100 100 100 100 100 100 
##$AQSEQ= 0
##$AQ_mod= 3
##$AUNM= <au_zg>
##$AUTOPOS= <6 >
##$BF1= 250.13
##$BF2= 250.13
##$BF3= 250.13
##$BF4= 250.13
##$BF5= 500.13
##$BF6= 500.13
##$BF7= 500.13
##$BF8= 500.13
##$BYTORDA= 1
##$CFDGTYP= 0
##$CFRGTYP= 5
##$CHEMSTR= <none>
##$CNST= (0..31)
1 1 145 1 1 1 1 1 1 1 1 1 1 1 1 1 1 1 1 1 1 1 1 1 1 1 1 1 1 1 1 1 
##$CPDPRG= <>
##$CPDPRG1= <>
##$CPDPRG2= <>
##$CPDPRG3= <>
##$CPDPRG4= <mlev>
##$CPDPRG5= <mlev>
##$CPDPRG6= <mlev>
##$CPDPRG7= <mlev>
##$CPDPRG8= <mlev>
##$CPDPRGB= <>
##$CPDPRGT= <>
##$D= (0..31)
0 1 0 0 0 0 0 0 0 0.06 0 0 0 0 0 0 0.0002 0 0 0 0 0 0 0 0 0 0 0 0 0 0 
0 
##$DATE= 1169028014
##$DBL= (0..7)
120 120 120 120 120 120 120 120 
##$DBP= (0..7)
150 150 150 150 150 150 150 150 
##$DBP07= 0
##$DBPNAM0= <>
##$DBPNAM1= <>
##$DBPNAM2= <>
$$ [...]
##$SUBNAM6= <"">
##$SUBNAM7= <"">
##$SUBNAM8= <"">
##$SUBNAM9= <"">
##$SW= 20.6930455092707
##$SWIBOX= (0..15)
0 0 3 0 0 0 0 0 0 0 0 0 0 0 0 0 
##$SW_h= 5175.983436853
##$TD= 65536
##$TD0= 1
##$TE= 294.16
##$TE2= 300
##$TE3= 300
##$TEG= 300
##$TL= (0..7)
0 120 120 120 120 120 120 120 
##$TP= (0..7)
150 150 150 150 150 150 150 150 
##$TP07= 0
##$TPNAME0= <>
##$TPNAME1= <>
##$TPNAME2= <>
##$TPNAME3= <>
##$TPNAME4= <>
##$TPNAME5= <>
##$TPNAME6= <>
##$TPNAME7= <>
##$TPOAL= (0..7)
0.5 0.5 0.5 0.5 0.5 0.5 0.5 0.5 
##$TPOFFS= (0..7)
0 0 0 0 0 0 0 0 
##$TUNHIN= 0
##$TUNHOUT= 0
##$TUNXOUT= 0
##$USERA1= <user>
##$USERA2= <user>
##$USERA3= <user>
##$USERA4= <user>
##$USERA5= <user>
##$V9= 5
##$VALIST= <valist>
##$VCLIST= <CCCCCCCCCCCCCCC>
##$VD= 0
##$VDLIST= <DDDDDDDDDDDDDDD>
##$VPLIST= <PPPPPPPPPPPPPPP>
##$VTLIST= <TTTTTTTTTTTTTTT>
##$WBST= 1024
##$WBSW= 4
##$XGAIN= (0..3)
0 0 0 0 
##$XL= 0
##$YL= 0
##$YMAX_a= 415608
##$YMIN_a= -504594
##$ZGOPTNS= <>
##$ZL1= 120
##$ZL2= 120
##$ZL3= 120
##$ZL4= 120
##$ABSF1= 16.522
##$ABSF2= -4.171173
##$ABSG= 5
##$ABSL= 3
##$ALPHA= 0
##$AQORDER= 0
##$ASSFAC= 0
##$ASSFACI= 0
##$ASSFACX= 0
##$ASSWID= 0
##$AUNMP= <proc_1d>
##$AZFE= 0.1
##$AZFW= 0.1
##$BCFW= 0
##$BC_mod= 0
##$BYTORDP= 0
##$COROFFS= 0
##$CY= 12.5
##$DATMOD= 1
##$DC= 0
##$DFILT= <>
##$DTYPP= 0
##$F1P= 14.0000005364418
##$F2P= -0.99999901652339
##$FCOR= 0.5
##$FTSIZE= 32768
##$FT_mod= 6
##$GAMMA= 0
##$GB= 0
##$INTBC= 1
##$INTSCL= 1
##$ISEN= 128
##$LB= 0.3
##$LEV0= 0
##$LPBIN= 0
##$MAXI= 10000
##$MC2= 0
##$MEAN= 0
##$ME_mod= 0
##$MI= 0
##$NCOEF= 0
##$NC_proc= -2
##$NLEV= 6
##$NOISF1= 0
##$NOISF2= 0
##$NSP= 0
##$NTH_PI= 0
##$NZP= 0
##$OFFSET= 16.522
##$PC= 1
##$PHC0= 228.2524
##$PHC1= 7.11797
##$PH_mod= 1
##$PKNL= yes
##$PPARMOD= 0
##$PSCAL= 4
##$PSIGN= 0
##$REVERSE= no
##$SF= 250.13
##$SI= 32768
##$SIGF1= 0
##$SIGF2= 0
##$SINO= 400
##$SIOLD= 32768
##$SREGLST= <1H.CDCl3>
##$SSB= 0
##$STSI= 32768
##$STSR= 0
##$SW_p= 5175.98343685301
##$SYMM= 0
##$S_DEV= 0
##$TDeff= 65536
##$TDoff= 0
##$TI= <Analysis number 999999
Compound Code 99
Book Reference 9
Project Code 9>
##$TILT= no
##$TM1= 0
##$TM2= 0
##$TOPLEV= 0
##$USERP1= <user>
##$USERP2= <user>
##$USERP3= <user>
##$USERP4= <user>
##$USERP5= <user>
##$WDW= 1
##$XDIM= 32768
##$YMAX_p= 338953248
##$YMIN_p= -51090
$$ End of Bruker specific parameters
$$ ---------------------------------
##NTUPLES= NMR SPECTRUM
##VAR_NAME=  FREQUENCY,     SPECTRUM/REAL,   SPECTRUM/IMAG
##SYMBOL=    X,             R,               I
##VAR_TYPE=  INDEPENDENT,   DEPENDENT,       DEPENDENT
##VAR_FORM=  AFFN,          ASDF,            ASDF
##VAR_DIM=   32768,         32768,           32768
##UNITS=     HZ,            ARBITRARY UNITS, ARBITRARY UNITS
##FACTOR=    0.157963299565203, 1,           1
##FIRST=     4132.6476996994, 0,             0
##LAST=      -1043.33573715361, 0,           0
##MIN=       -1043.33573715361, -51090,      0
##MAX=       4132.6476996994, 338953248,     0
$$ Real data points
##PAGE= N=1
##DATA TABLE= (X++(R..R)), XYDATA
$$ [...]
19800B702K716M186j127N25L150J788L742j0728l042j6610q908J4176L44J1861
$$ 2702 5418 9604 8477 9002 12152 13940 17682 6954 3912 -12698 -21606 -7430 -7086 4775
19786D775O97k57J994j0985P26J3246n176K49K970o031l588J264O240o414k1206
$$ 4775 5472 5215 7209 -3776 -3050 10196 5020 5269 8239 2208 -1380 -116 6124 -290 -21496
19771b1496K825R943L427K2700J0269J067N631m963k4310j9894N729J9563P076
$$ -21496 -18671 -8728 -5301 17399 27668 28735 34366 29403 5093 -14801 -9072 10491 17567
19758A7567o166J2856J7718k2144q66J0645k141j0715j4411j3915J253O593r51
$$ 17567 11401 24257 41975 19831 18965 29610 27469 16754 2343 -11572 -10319 -3726 -4677
19745d677J3222j131m259P772Q004q021l729K296l004n324k410L154l835k763
$$ -4677 8545 7414 3155 10927 18931 10910 7181 9477 6473 1149 -1261 1893 -1942 -4705
19731d705J6074m207k2434n26P830l410J4877K79n282O49L589j744q292P369L839
$$ -4705 11369 7162 -15272 -15798 -7968 -11378 3499 3778 -1504 -855 2734 990 -7302 67 3906
19716C906M690k822L313N555K332j9769j0O691r834Q917P570M076L425J1139L337
$$ 3906 8596 5774 9087 14642 16974 -2795 -2805 3886 -5948 2969 10539 14615 18040 29179 32516
19701C2516j5281r397k2124P645j553m376j9405L142J0252R134J2444l027q86
$$ 32516 17235 7838 -14286 -6641 -8194 -12570 -31975 -28833 -18581 -9447 2997 -30 -916
19688i16J5667J3328k2281j8907j4975p369J3210J5870m589m384j562o624k314
$$ -916 14751 28079 5798 -13109 -28084 -35453 -22243 -6373 -10962 -15346 -16908 -23532 -25846
19675b5846p721o532N095J8287J0826J67R448O037m40Q852r95n169p153j8025
$$ -25846 -33567 -40099 -35004 -16717 -5891 -5724 3724 9761 9321 18173 17178 12009 4856 -13169
19661a3169N313J9580R59M720o8L972J1544Q252J764j1842j2180j0104P975J2984
$$ -13169 -7856 11724 12683 17403 17335 21307 32851 41103 42867 31025 18845 8741 16716 29700
19647B9700n359q644J0861r724j2111O357k007n557j3270k579p386P136O653p969
$$ 29700 24341 15697 26558 16834 4723 11080 9073 3516 -9754 -12333 -19719 -12583 -5930 -13899
19633a3899J8598M642R858k541p242K0561J3669o611j0494j4008J979j552P872
$$ -13899 4699 9341 19199 16658 9416 29977 43646 37035 26541 12533 14512 12960 20832
19620B0832L642M869L496o663p833k967Q902N559j599o157o00O384P253r051l691
$$ 20832 24474 29343 32839 26176 18343 15376 24278 29837 28238 22081 21481 27865 35118 26067 22376
19605B2376Q273L623j3094q458M984M158j2692j4986L148P663M975n122p013Q497
$$ 22376 30649 34272 21178 12720 17704 21862 9170 -5816 -2668 4995 9970 4848 -2165 6332
19591F332J4761q02j3642j7244R2J0714J6102P270Q572o642K553n995k954l730
$$ 6332 21093 20291 6649 -10595 -10503 211 16313 23583 32155 25513 28066 22071 19117 15387
19577A5387q806j6928M513J791J4793J8383O316j4047m944K067K26P10L600q0
$$ 15387 6581 -10347 -5834 -4043 10750 29133 35449 21402 16458 18525 18751 19461 23061 22981
19563B2981o865K15p113q543j2690j3678O483J6100P122R717k742r878J1587O709
$$ 22981 16116 16331 9218 675 -12015 -25693 -19210 -3110 4012 13729 10987 1109 12696 19405
19549A9405l885j145q70o203m991l680J6664N587M365J1763K389P983j0956j7650
$$ 19405 15520 14375 13505 7302 2311 -1369 15295 20882 25247 37010 39399 47382 36426 18776
19535A8776N201l103l979m726j8815m516J1959J0613J2914O720n873J027Q728
$$ 18776 23977 20874 16895 12169 -6646 -11162 797 11410 24324 31044 25171 26198 34926
19522C4926m598p782P901J5725J618K322k6449j3882k969q29q417o75j84j1273
$$ 34926 30328 22546 30447 46172 47790 50112 23663 9781 6812 5983 -2434 -3109 -3293 -14566
19508a4566M860P693o017j4213n981O515J6291P332j1023j2177p752O108K1959
$$ -14566 -9706 -2013 -8030 -22243 -28224 -21709 -5418 1914 -9109 -21286 -29038 -22930 -971
19495i71K9918q151j0289j0746q330p563J0790R819N571Q129J354J822Q100j681
$$ -971 28947 20796 10507 -239 -8569 -16132 -5342 4477 10048 18177 19531 21353 29453 27772
19481B7772K743l807j507L571j3289p687o865j2101O10K1554j562j4105j5253
$$ 27772 30515 26708 25201 28772 15483 7796 931 -11170 -10560 10994 9432 -4673 -19926
19468a9926j575P694m857P040J968n751P396J1309P273l516Q353J972m753J3625
$$ -19926 -21501 -13807 -18664 -11624 -9656 -15407 -8011 3298 10571 7055 15408 17380 12627 26252
19454B6252J2212j9112o405o45j0602J0879R537j1971k339l600l344K964L170
$$ 26252 38464 19352 12947 12302 1700 12579 22116 10145 7806 4206 862 3826 6996
19441F996J4587K352k165m476j8699K611K3283L986j4518q468N526P680J5754
$$ 6996 21583 23935 21770 17294 -1405 1206 24489 28475 13957 5489 11015 18695 34449
19428C4449K636j322p635j4868j3290j1759j962J0629Q362J2178M148K989l018
$$ 34449 37085 35763 28128 13260 -30 -11789 -13751 -3122 5240 17418 21566 24555 21537
19415B1537P116J7605J5025K0973L4416K9057o478L601j1276n926L4973K2781
$$ 21537 28653 46258 61283 82256 116672 145729 139251 142852 131576 125650 160623 183404
19403A83404L839j6534j2272j5295j3431J256J9838p229m0089m3712j5530k1832
$$ 183404 187243 170709 158437 143142 129711 130967 150805 143576 103487 59775 44245 22413
19391B2413k5281Q363J8851L039J5746j2602j0362R30j1661N943J539j1221J907
$$ 22413 -2868 5495 24346 27385 43131 30529 20167 21097 9436 15379 16918 5697 7604
19378G604J7819m549p052L50P808J2123J3811l369p225j695q639l132l590J0401
$$ 7604 25423 20874 13822 14172 21980 34103 47914 44545 37320 35625 26986 23854 20264 30665
19364C0665K4817R590J6743K3782K3994N951k2146l584J8000K0076L4686J6681
$$ 30665 55482 65072 81815 105597 129591 135542 113396 109812 127812 147888 182574 199255
19352A99255R964j4041j7104l1150n466K3393P010k3009m1317l6232l2501j0922
$$ 199255 209219 195178 178074 146924 141458 164851 171861 148852 107535 71303 38802 27880
19340B7880q158j5578j3286N724J4660K92K680k408N379m593o418M606J1426N057
$$ 27880 19722 4144 -9142 -3418 11242 11534 14214 11806 17185 12592 6174 10780 22206 27263
19326B7263J1868l757r79k588J4280j866O415r97K491K5214N1930O6691R6271
$$ 27263 39131 35374 34395 31807 46087 44221 50636 49639 52130 77344 129274 195965 292236
19313B92236J09167K8866m9373m8346p944O2598P3122o734j02298j19411p1506
$$ 292236 401403 430269 380896 332550 324606 387204 460326 453592 351294 231883 160377
19302A60377m2027l3009k7047j3251j2595Q254J019j2324l898m24K69o855L170
$$ 160377 118350 85341 58294 45043 32448 40702 41721 29397 25499 25075 25344 18489 21659
19289B1659m601j7406N532J4484L777j1278m429k264P28m627K961J968K803J4240
$$ 21659 17058 -348 5184 19668 23445 12167 7738 5474 6202 1575 4536 6504 9307 23547
19275B3547n726M472J4378R072p121j1679k302j2828j6208j215P5K2519R515j2152
$$ 23547 17821 22293 36671 45743 38622 26943 24641 11813 -4395 -5610 -5535 16984 26499 14347
19261A4347j8597K272M631N168l320m822M467O156N831M61k532l563J0779j003
$$ 14347 -4250 -1978 2653 7821 4501 -321 4146 10302 16133 16594 14062 10499 21278 20275
19247B0275k69P240n705o813k833R343J0558N703j7327J0111K50j3883n434J1827
$$ 20275 20006 27246 21541 14728 11895 21238 31796 37499 20172 30283 30533 16650 11216 23043
19233B3043n256j3621M988L125Q307L028L106j3503j1718P361O623R92j826K890
$$ 23043 17787 4166 9154 12279 20586 23614 26720 13217 1499 8860 15483 16475 14649 17539
19219A7539Q010n920J2902J634j0326j2254j6620N95J8308K4449J2042r36k2713
$$ 17539 25549 19629 32531 34165 23839 11585 -5035 -4440 13868 38317 50359 49423 26710
19206B6710o381K658M288L072L3693J1634l831J0831n20j824K0365L5476L4932
$$ 26710 20329 22987 27275 30347 64040 75674 71843 82674 82154 80330 100695 136171 171103
19193A71103J5621j2432l5763L654L1232K76k0518k4352k0035J834P733N196p258
$$ 171103 186724 174292 138529 142183 173415 173691 153173 128821 108786 110620 118353 123549 116291
19180A16291r815k9265k0106j2799n389N496L675O5l595L220K493J7991k899q068
$$ 116291 106476 77211 57105 44306 38917 44413 48088 48153 44558 47778 50271 68262 65363 57295
19166E7295r345j5281n37m070J1503K7P510O513k413j5539p762P954J1422J9051
$$ 57295 47950 32669 32132 28062 39565 39592 47102 53615 51202 35663 27901 35855 47277 66328
19152F6328J1554O924N251o206J30J8594J6482J729n786K8846L8126M7621J7861
$$ 66328 77882 84806 90057 83851 83981 102575 119057 120786 115000 143846 181972 229593 247454
19139B47454l1756l8709r581J4144K5930J0969k4360l1960k6611M354p389k1121
$$ 247454 215698 176989 167408 181552 207482 218451 194091 162131 135520 139874 132485 111364
19127A11364k6858p895o010n404L1J6019o535j1827l872n859k803J172r137p001
$$ 111364 84506 76611 70601 65197 65228 81247 74712 62885 59013 53154 50351 51523 42386 35385
19113C5385j109j916M544Q775Q092q790J5471Q835j1051j3048R806K522l413R59
$$ 35385 34276 32360 36904 45679 53771 44981 60452 69287 58236 45188 54994 57516 54103 55062
19099E5062M169m484l28j945l540m458J0286J5905P563O042J9202K5704P933j1452
$$ 55062 59231 54747 54419 52474 48934 44476 54762 70667 78230 84272 103474 129178 137111 125659
19085A25659j2930j2762o352N383J1175R058K9833j056l8229k8228j1922M987
$$ 125659 112729 99967 93615 98998 110173 119231 149064 148008 109779 81551 69629 74616
19073G4616P308n637j9151j6076j7282r109J34L265J8898J2508J8570O371m408
$$ 74616 81924 76287 57136 41060 23778 14669 14803 18068 36966 49474 68044 74415 70007
19060G0007j0429K05M767K99l331L916j4048p163P333J0436N968p531N234J5809
$$ 70007 59578 59783 64550 64849 61518 65434 51386 44223 51556 61992 67960 60429 65663 81472
19046H1472J2026J2348K0608K5012J8900k026j5962j2910O301P013J9834L9648
$$ 81472 93498 105846 126454 151466 170366 168340 152378 139468 145769 152782 172616 212264
19034B12264M1082J0415l1536m6954m2571j5298L06K0319K8667K3653l329l0718
$$ 212264 253346 263761 232225 185271 142700 127402 127708 148027 176694 200347 197018 166300
19022A66300j5226j7993j5678O888J3610m607j4467j1351J785j0199j2819q197
$$ 166300 151074 133081 117403 124291 137901 133294 118827 107476 109261 99062 86243 78046
19010G8046N032N563k775l504N908J7318K1274Q788J7973M343j6156j3008O021
$$ 78046 83078 88641 85866 82362 88270 105588 126862 135650 153623 157966 141810 128802 134823
18997A34823o97J3958J038j6612k1252r395J3130K7359K8547J1648k7781j2343
$$ 134823 134126 148084 149122 132510 111258 101863 114993 142352 170899 182547 154766 142423
18985A42423q521k609O016J8970M3866O525k1699n1350k9868P485J0137j2219
$$ 142423 133902 131293 137309 156279 200145 206670 184971 133621 103753 111238 121375 109156
18973A09156q014n434m155j5302j1358N937J7557J1617K518j0973j2325J1963
$$ 109156 101142 95708 91553 76251 64893 70830 88387 100004 102522 91549 79224 91187
18961I1187M767j32j254j0498J848m195J6513J8624J0266J347k532m659R081Q008
$$ 91187 95954 95822 94568 84070 85918 81723 98236 116860 127126 128473 125941 121282 130363 138371
18947A38371L034K86N681J6345R340K0241K525N549k195R391k353J7299N909Q04
$$ 138371 141405 141691 147372 163717 173057 193298 195823 201372 199177 208568 206215 223514 229423 230227
18933B30227K029J1859j0936j5590j445K0576J8192J9388M3420M9124O7645P0504
$$ 230227 232256 244115 233179 217589 216144 236720 254912 274300 317720 366844 434489 504993
18921E04993P202O228L3627O4226Q1654M3979J8893K4063J4753J3249M3151O6941
$$ 504993 512195 518423 552050 616276 697930 741909 760802 784865 799618 812867 856018 922959
18909I22959J08670R6890P4040J30054J74350K41642L48026N10098P49526J081817
$$ 922959 1031629 1128519 1202559 1332613 1506963 1748605 2096631 2606729 3356255 4438072
18899D438072J722915K972751M728466N333258K079245j787626j066750K486248
$$ 4438072 6160987 9133738 13862204 19195462 21274707 19487081 18420331 20906579
18891B0906579M892916K751562o04135n2710o09058l704689l658348l04419K538565
$$ 20906579 25799495 28551057 27946922 27894212 27285154 23580465 19922117 19617698 22156263
18882B2156263J059384m089106o120090m355416k491913j448210r12587o18192
$$ 22156263 23215647 19126541 13006451 8651035 6159122 4710912 3798325 3180133
18874C180133m25528k68730j66600j43103j17073o9347p5687n6215k7618j1678
$$ 3180133 2754605 2485875 2319275 2176172 2059099 1989752 1914065 1857850 1830232 1818554
18864A818554R763k7333l1730K9139N4447N3850N7795R8882J38650J84736K19122
$$ 1818554 1828317 1800984 1769254 1798393 1852840 1906690 1964485 2063367 2202017 2386753 2605875
18853B605875L40762N59315Q47834J213293J941150L324876N325954O253053K902478
$$ 2605875 2946637 3505952 4353786 5567079 7508229 10833105 16159059 22412112 25314590
18844B5314590j708118j169626K916300N367022K412392j297289m9690N0532l540357
$$ 25314590 23606472 22436846 25353146 30720168 33132560 31835271 31785581 31836113 28295756
18835B8295756m154119n71804K613008Q89069m897694p137548n097721k945664
$$ 28295756 24141637 23569833 26182841 27071910 22174216 15036668 9938947 6993283
18827F993283j738972j131651p89664n76976l98220l01132k20320j47342j22442
$$ 6993283 5254311 4122660 3332996 2756020 2357800 2056668 1836348 1689006 1566564
18818A566564j13452j09173n7129j3307l1542o6236q3212l5333k4488n6348l6374
$$ 1566564 1453112 1343939 1286810 1273503 1241961 1175725 1092513 1057180 1032692 976344 939970
18807I39970J5282J1518m2388q4458n1818l2149m2876j6194M473J0613J2104j1730
$$ 939970 955252 966770 924382 839924 788106 755957 713081 696887 701360 711973 724077 712347
18795G12347m6493k4147j6208k0484J2692J1502K164m3875m6212k3690O425K6216
$$ 712347 665854 641707 625499 605015 617707 629209 631373 587498 541286 517596 524021 550237
18783E50237M3179K8160L3301L9814O3240J24762J71259J11281r206N300R2847
$$ 550237 593416 621576 654877 694691 757931 882693 1053952 1165233 1156027 1161327 1254174
18772A254174K25157K94766J49296q9828p4377P9834J96214J57743O4852M0317
$$ 1254174 1479331 1774097 1923393 1833565 1759188 1839022 2035236 2192979 2257831 2298148
18762B298148J52472L04350L90619M42282N12444P72686J191598J769873K670915
$$ 2298148 2450620 2754970 3145589 3587871 4100315 4873001 6064599 7834472 10505387
18753A0505387M168211O901293J2254474K0443861K3620550P143516j4304002
$$ 10505387 14673598 21574891 33829365 54273226 77893776 85037292 70733290
18746G0733290j3877736m879J4100372J9027672R64421k3430419k5562703j5697206
$$ 70733290 56855554 56850675 70951047 89978719 90943140 67512721 41950018 26252812
18738B6252812q519464m882830l092798k120165j470119r68761o59971m68918
$$ 26252812 17733348 12850518 9757720 7637555 6167436 5198675 4538704 4069786
18730D069786m31062m26655l09587k16673k40613k76423k13759q0863K6357N2218
$$ 4069786 3638724 3212069 2902482 2685809 2445196 2168773 1955014 1874151 1900508 1952726
18720A952726k2358j05879j05871j55514j85832j12229j8095M7569L5621r6824
$$ 1952726 1930368 1824489 1718618 1563104 1377272 1265043 1246948 1294517 1330138 1233314
18710A233314j80416j61311r5026k7822J4246N281p014o862R09j885N801K0375
$$ 1233314 1052898 891587 796561 768739 782985 788266 781252 774390 775299 773414 779215 799590
18698G99590L3119M2148K3809P027K9932M9773Q5477R7334J07198J40471K13759
$$ 799590 832709 874857 898666 905693 935625 985398 1070875 1168209 1275407 1415878 1629637
18687A629637L46359N90926R98113J588536K140146J432314k97943j86956J315052
$$ 1629637 1975996 2566922 3565035 5153571 7293717 8726031 8428088 8241132 9556184
18678I556184K947882L123305J096438j96368r47413j352176K41814J423018J105188
$$ 9556184 12504066 15627371 16723809 16527441 15580028 14227852 14469666 15892684 16997872
18669A6997872k98407k527763l312435k055514m83260K58539o60616j969093j690785
$$ 16997872 16699465 14171702 10859267 8803753 8320493 8579032 7918416 5949323 4258538
18660D258538j041298o48004m27439k70762j55372r2641q9400j03711o3015n1197
$$ 4258538 3217240 2569236 2141797 1871035 1715663 1623022 1533622 1429911 1366896 1315699
18650A315699l5094J7675N5330P3432M4666L2287K6549L7721O4304J03067J27763
$$ 1315699 1280605 1298280 1353610 1427042 1471708 1503995 1530544 1568265 1632569 1735636 1863399
18639A863399J96373K65036L10227L50776M60557P02022J150817J934747L207360
$$ 1863399 2059772 2324808 2635035 2985811 3446368 4148390 5299207 7233954 10441314
18630A0441314M795332M758895Q89270j030947J701733N936100Q807076N540000
$$ 10441314 15236646 19995541 20884811 19853864 21555597 27491697 36298773 41838773
18622D1838773p39464k789362l450132p28205L035753K584475L02302l617479
$$ 41838773 41099309 38309947 34859815 34131610 37167363 39751838 40054140 36436661
18614C6436661p516226o660991k960611L4692Q4954l346764m671285l250790j953465
$$ 36436661 28920435 22259444 19298833 19333525 19418479 16071715 11400430 8149640 6196175
18605F196175j215783p91972n06907l66434l01178k87474k66436j95127q8686
$$ 6196175 4980392 4188420 3681513 3315079 3013901 2726427 2459991 2264864 2176178
18596B176178m0464q2760j54250j54653j55689j01359m3379L89J4412j1908j7851
$$ 2176178 2135714 2052954 1898704 1744051 1588362 1487003 1443624 1444013 1458425 1446517 1428666
18585A428666J5276M4987P1600J33937K01890L10213M29204O07413R69003J595129
$$ 1428666 1443942 1488929 1560529 1694466 1896356 2206569 2635773 3243186 4212189 5807318
18575E807318K699845M587981P043238O853245p36892o847634n379827k333866
$$ 5807318 8507163 13095144 20138382 26991627 26254735 19407101 14027274 11693408
18567A1693408J90258K677552N507068O606918N68916p239694p141595m408407
$$ 11693408 11883666 14561218 20068286 26675204 27244120 20004426 12862831 8454424
18559H454424k533374j458618q38049n03158l47940k49823k51396k95367k54814
$$ 8454424 5921050 4462432 3624383 3121225 2773285 2523462 2272066 1976699 1721885
18550A721885j53799q2367j8564M6952N2132j482m0382J2065M7347P7371J15879
$$ 1721885 1568086 1485719 1467155 1514107 1566239 1564757 1524375 1536440 1583787 1661158 1777037
18539A777037J76921K29590L03104M22600N80413P95935J204607K001296L411943
$$ 1777037 1953958 2183548 2486652 2909252 3489665 4285600 5490207 7491503 10903446
18530A0903446N700542Q504799P967313p24526p931092o506542k822786L06703
$$ 10903446 16603988 25108787 33076100 32351574 24420482 17913940 15091154 15397857
18522A5397857L374224O815060Q582223L238250o326728r683083p126763m020385
$$ 15397857 18772081 25587141 34169364 37407614 31080886 21397803 14271040 10250655
18514A0250655j986497n93762O02608J686521J257468j600320k900579k046395
$$ 10250655 8264158 7670396 8273004 9959525 11216993 9616673 6716094 4669699
18506D669699j169128o48904l31975j97832k03959k13930j55212j05956r1034
$$ 4669699 3500571 2851667 2519692 2321860 2117901 1903971 1748759 1642803 1551769
18497A551769n9574n3412o2817p064J163q1207j04927j01345m7402K9946N2809
$$ 1551769 1492195 1438783 1375966 1368902 1370065 1288858 1183931 1082586 1035184 1065130 1117939
18486A117939Q4720J12926J13398J05365J96294L24472M71243P55688J320462
$$ 1117939 1202659 1315585 1428983 1534348 1730642 2055114 2526357 3282045 4602507
18477D602507K246858L701034M698061J947865l254540m163450k366533p09498
$$ 4602507 6849365 10550399 15248460 17196325 13941785 9778335 7411802 6702304
18469F702304O71090K175717L597569K756908j886961m579019l479987k000481
$$ 6702304 7373394 9549111 13146680 15903588 14016627 9437608 5957621 3957140
18461C957140j142871o73485m05351k85368j74789j29252j52673j56328r5999
$$ 3957140 2814269 2140784 1735433 1450065 1275276 1146024 993351 837023 741024
18452G41024n7778l7585l3964l5350l3529m4204l7944j6404q646N417K1812M1745
$$ 741024 683246 645661 611697 576347 542818 498614 460670 444266 435620 441037 462849 504594
18440E04594J272k2590o6628n8070k7125n452q351j8649P591j3186l9095k6065
$$ 504594 505866 483276 416648 358578 331453 326001 317650 299001 306592 293406 254311 228246
18428B28246l1200k1744j2603j3739K753N131O942m736j3023k1838J2664J3462
$$ 228246 197046 175302 162699 148960 151713 156844 163786 159050 146027 124189 136853 150315
18416A50315K963m330j2141J6357L4773q122j6183j2997n959r71j813J8752K7194
$$ 150315 153278 148948 136807 153164 187937 179815 163632 150635 144676 143705 141892 160644 187838
18403A87838K1202M072j1776j8839j5846J0015R436J4350L9821K9682k4505l8951
$$ 187838 209040 213112 201336 182497 166651 176666 186102 200452 240273 269955 245450 206499
18391B06499k5564j963N336K4001L9809Q140l7348l4603o582l800o375q838r955
$$ 206499 180935 178972 184308 208309 248118 256258 218910 184307 177725 173925 167550 158712 148757
18378A48757p517J4394J7938J0658L381M626K491P969M245n159k1940J487J4899
$$ 148757 141240 155634 173572 184230 187611 192237 194728 202697 206942 201783 179843 181330 196229
18365A96229j244j2561k2918l387K911m489j8869k1358o357Q635K1463J7638r468
$$ 196229 194985 182424 159506 156119 159030 154541 135672 114314 107957 116592 138055 155693 146225
18352A46225J304j2415J3121L7313K8429J2123k9691k2621j379L268J4978M2849
$$ 146225 147529 135114 148235 185548 213977 226100 196409 173788 172409 175677 190655 233504
18340B33504L9352k9470m2588k8584m951J0844L7629M2507L3564M1903L3085J559
$$ 233504 272856 243386 200798 172214 167263 178107 215736 258243 291807 333710 366795 368354
18328C68354j8575J9058L6463L2175J9291j0214k029M2751O1071K7330j5452R060
$$ 368354 349779 368837 405300 437475 456766 446552 444523 487274 548345 575675 560223 569283
18316E69283M8183L5971l147j378Q706r838q044j4720j5184J9393M3431N6648
$$ 569283 617466 653437 650290 648912 657618 647780 639736 625016 609832 629225 672656 729304
18304G29304P9963J03867J05556J29277K05421L04940M40133N93971Q62094J341820
$$ 729304 809267 913134 1018690 1147967 1353388 1658328 2098461 2692432 3554526 4896346
18294D896346K215698L739056O111909P600872K369739n872935o066244k911957
$$ 4896346 7112044 10851100 16963009 24563881 26933620 21060685 14994441 12082484
18286A2082484k07666K397529N300264O276654j23269p412744o704471l937613
$$ 12082484 11874818 14272347 19572611 25849265 25725996 18313252 11608781 7671168
18278G671168k235773j308919p79314n37753l88833k57686j56854j41431j21968
$$ 7671168 5435395 4126476 3347162 2809409 2420576 2162890 2006036 1864605 1742637
18269A742637r5260q3727j9226N295J1960J194J3517M5833K4124O27J2274j361
$$ 1742637 1647377 1563650 1544424 1549719 1561679 1562873 1576390 1622223 1646347 1646974 1659248 1657887
18257A657887M7770J67322K63413L65641N32549P15543J057619J689439K844852
$$ 1657887 1705657 1872979 2136392 2502033 3034582 3750125 4807744 6497183 9342035
18248I342035M678901N983847K605438l021686k603816Q81530M810556P973197
$$ 9342035 14020936 20004783 22610221 19588535 16984719 17866249 22676805 30650002
18240C0650002N954788l58636n189183p685970m841897o76232K959140M095107
$$ 30650002 36604790 36246154 31056971 23371001 18529104 17852872 20812012 24907119
18232B4907119j502947o952621n752973l391770j989828j184934p49146n52240
$$ 24907119 23404172 16451551 10698578 7306808 5316980 4132046 3382900 2830660
18224B830660l96112k90329j93333j08702j09134r2782p3446p5290n6047k9374
$$ 2830660 2434548 2144219 1950886 1842184 1733050 1640268 1566822 1491532 1435485 1406111
18214A406111l8173k2471m260R472J8576r048l6533l959P5989J51580K51671L73235
$$ 1406111 1367938 1345467 1341207 1350679 1369255 1360207 1323674 1319715 1395704 1547284 1798955 2172190
18202B172190N29203P76592J226429K090468L580043M837717K290496l273445
$$ 2172190 2701393 3477985 4704414 6794882 10374925 15212642 17503138 14229693
18194A4229693l992027k019254k29266J396194L189567L832240k63510m799784
$$ 14229693 10237666 8218412 7989146 9385340 12574907 16407147 16143637 11343853
18186A1343853m167207k424350j396952q70365n01374k90850j68975o8099o2959
$$ 11343853 7176646 4752296 3355344 2484979 1983605 1692755 1523780 1455681 1392722
18177A392722j35556j85257j27416l3600L5702L6379m9010j01058p5857n8710
$$ 1392722 1257166 1071909 944493 910893 946595 982974 933964 832906 757049 698339
18167F98339q1420q0921m1533j6240j1694j7196j4738o596k8256m7728m8381l3601
$$ 698339 616919 535998 494465 478225 466531 449335 434597 428001 399745 352017 303636 270035
18155B70035r353J0293L40J8494K2788K916j3948r263M551J9708M0181J8239K089
$$ 270035 260682 270975 271315 289809 312597 315513 301565 292302 296853 316561 356742 374981 377070
18142C77070J4634J8014J4522j4282l1507p934J2708J1770J8956j825q756j5078
$$ 377070 391704 409718 424240 409958 378451 370517 383225 394995 413951 412126 403370 388292
18130C88292k316J5110J3685k220J113K0869N2625P1527R7198R0190Q0064R2594
$$ 388292 385976 401086 414771 412551 413664 434533 487158 558685 655883 746073 826137 918731
18118I18731J67714K40177L32713M83765P21511J149414J991695L722553P034729
$$ 918731 1086445 1326622 1659335 2143100 2864611 4014025 6005720 9728273 16763002
18109A6763002J2173228J2543276m972032j4880774r402498m729135k502371j410212
$$ 16763002 28936230 41479506 36507474 21626700 12224202 7495067 4992696 3582484
18101C582484q52012n55104m17684l06503k46858j99475j60673q5289m0001l8728
$$ 3582484 2730472 2175368 1757684 1451181 1204323 1004848 844175 758886 718885 680157
18091F80157m2449o0376m3475k5684k9563j5854l9557l0748m622R112R829k2014
$$ 680157 637708 577332 533857 508173 478610 462756 423199 392451 387829 396941 406770 384756
18079C84756m6475m4351l5698k8509n433k4328k4710j1008p865j3294o834J810
$$ 384756 338281 293930 258232 229723 224290 199962 175252 164244 156379 143085 136251 138061
18067A38061n633k015L389J5317R31K0751J0059J085J003j6292l1303j3316k834
$$ 138061 132428 130413 133802 149119 150050 170801 180860 181945 182948 166656 135353 122037 119203
18054A19203N894j723R702K6680K451j8751k7459j8430j7712j1498j8051J674
$$ 119203 125097 123374 133076 159756 162207 143456 115997 97567 79855 68357 50306 51980
18042E1980l281J967J527R726J907n38j551K406k463J6097L181j2491j3886M856
$$ 51980 48699 50666 52193 61919 63826 63288 61737 64143 61680 77777 80958 68467 54581 59437
18028E9437J1167q643j0062J4446p032m256J375R470J9404N047j0862J1839K4857
$$ 59437 70604 61961 51899 66345 59313 55057 56432 65902 85306 90353 79491 91330 116187
18015A16187J4406J2746j5363j7952j357l507K9732K6978L3098K9768n961l5254
$$ 116187 130593 143339 127976 110024 108667 105160 134892 161870 194968 224736 218775 183521
18003A83521l7570l3940l0081j641J7884K4706q303k3620j9985j6994R806J1110
$$ 183521 145951 112011 81930 80289 98173 122879 114576 90956 70971 53977 63783 74893
17991G4893j0410j8892q171N974J0697K0794R788j0548j1056k2104j3298q185
$$ 74893 64483 45591 37420 43394 54091 74885 84673 74125 63069 40965 27667 19482
17979A9482j3772L070J8833j79q696L577m673M230J2153M844q670M165o407J030
$$ 19482 5710 8780 27613 27434 18738 22315 17642 21872 34025 38869 30199 34364 27957 28987
17965B8987L638q57R707K3943K2527n514j1157j2447k366j4514l340P737L1334
$$ 28987 32625 31768 41475 65418 87945 82431 71274 58827 56461 41947 38607 46344 77678
17952G7678K1241n126k7995k9013n150N733O275L965j2843j3713j4475j0770M127
$$ 77678 98919 93793 65798 36785 31635 37368 43643 47608 34765 21052 6577 -4193 -66
17939f6M864m08R181M703q651L734J3489O571R888L851j1947j2470j4603J0171
$$ -66 4798 4390 13571 18274 9623 13357 26846 33417 43305 47156 35209 22739 8136 18307
17925A8307o280p397N376R584K160o033m732j7856p447O1J4384P70P850o14k983
$$ 18307 12027 4630 10006 19590 21750 15717 10985 -6871 -14318 -14257 127 897 8747 8133 5150
17910E150L002M625j7969p683J3043N147q255K803K1387m331j9199J0551O358
$$ 5150 8152 12777 -5192 -12875 168 5315 -2940 -137 21250 16919 -2280 8271 14629
17897A4629n948j1466q121J5505J4759J2270n736k8213o553Q647K3440k461j9361
$$ 14629 8681 -2785 -10906 4599 19358 31628 25892 -2321 -8874 -227 23213 20752 1391
17884A391j6379Q698J6170p109j3397l273P113o570o955M536l35R111J77J580
$$ 1391 -14988 -6290 9880 2771 -10626 -13899 -6786 -13356 -20311 -15775 -16110 -6999 -6822 -5242
17870e242K050j1989n012J7352K4157J8034o531j2877M739q734j6245m834k179
$$ -5242 -3192 -15181 -20193 -2841 21316 39350 32819 19942 24681 15947 -298 -5132 -7311
17857g311Q707n89p110K352J2634L833p745J0586j3287j1854J0898P342M591J329
$$ -7311 1396 807 -6303 -3951 8683 12516 4771 15357 2070 -9784 1114 8456 13047 14376
17843A4376n959L202n58k318m1K551o39p281o98r618N223l752j3664j3042Q573
$$ 14376 8417 11619 11061 8743 8702 11253 10614 3333 2635 -6983 -1760 -5512 -19176 -32218 -23645
17828b3645J4558N544M718J2344M803r620p60L232J010M049k790P064r665n430
$$ -23645 -9087 -3543 1175 13519 18322 8702 7942 11174 12184 16233 13443 20507 10842 5412
17814E412j2287l281O394K838m807l655q736K771N153l668L743J043J3451Q67
$$ 5412 -6875 -10156 -3762 -924 -5731 -9386 -18122 -15351 -10198 -13866 -10123 -9080 4371 5238
17800E238l828M255q6j3989J802R541j1849j4692J8264Q149J2448m375o014k672
$$ 5238 1410 5665 5579 -8410 -6608 2933 -8916 -23608 -5344 2805 15253 10878 4864 2192
17786B192J2750O198M723J3073K2941J4445K0191K08k1690k0050j8787k0316m718
$$ 2192 14942 21140 25863 38936 61877 76322 96513 96721 75031 54981 36194 15878 11160
17773A1160K6507M5935J4587r811j5289j8457p626j1878o113o708j2664K579m397
$$ 11160 37667 83602 98189 88378 73089 54632 47006 35128 29015 22307 9643 12222 7825
17760G825j505N283R838k969l298k298k1370j2602K620J9449J372P414P985n460
$$ 7825 6320 11603 21441 18472 15174 12876 -8494 -21096 -18476 973 2345 9759 17744 12284
17746A2284R828P320J7227N757k768M433O241P002O839J1751K1430r01r095p554
$$ 12284 22112 29432 46659 52416 49648 54081 60322 67324 74163 85914 107344 106443 97348 89794
17732H9794j1887J2290L1177N0365K0539k2511m9107m5823r75J4074K415J0496
$$ 89794 77907 90197 121374 171739 192278 169767 120660 74837 73862 87936 90351 100847
17720A00847J878l0137k8564M19q917j4540j0640N980K006M22n640n462L74R375
$$ 100847 102725 72588 44024 44443 35526 20986 10346 16326 18332 18754 13114 7652 8026 17401
17706A7401J93N656J794j604j6152l54R683l384q664R938r558k954N260J8751
$$ 17401 17594 23250 25044 23440 7288 6934 16617 13233 4569 14507 4949 1995 7255 26006
17692B6006K322m904L471J3212K1928K2618J6246J5718m642l8502l1429l903M906
$$ 26006 28328 23424 26895 40107 62035 84653 100899 116617 111975 73473 42044 38141 43047
17679D3047K3522K2586p37j9347p192M543j8207j9108k399j6158j5584P612j879
$$ 43047 66569 89155 88418 69071 61879 66422 48215 29107 26708 10550 -5034 2578 699
17666F99j1098n367l23l197P596j563j8156J2957J7954J1773K60j827M170J027
$$ 699 -10399 -15766 -16089 -19286 -11690 -13253 -31409 -18452 -498 11275 11535 9708 13878 14905
17652A4905l355j2133j3344n143R578O433n487k847J0106Q741n044M34j4970M79
$$ 14905 11550 -583 -13927 -19070 -9492 -3059 -8546 -11393 -1287 7454 2410 2844 -12126 -11647
17638a1647J0342Q135k0664j9007K294J2910J7813Q4K167L807j984l078l543j4028
$$ -11647 -1305 6830 -13834 -32841 -30547 -17637 176 260 2427 6234 4250 1172 -2371 -16399
17624a6399j5991R142J3946J7378L352n298n146Q015q262q343j24p676J425O283
$$ -16399 -32390 -23248 -9302 8076 11428 6130 984 8999 737 -7606 -7730 -15406 -13981 -7698
17610g698J4176O532r202j6215j5437n142K3936M883N088O609j3353o175j3298
$$ -7698 6478 13010 3808 -12407 -27844 -32986 -9050 -4167 921 7530 -5823 -11998 -25296
17597b5296R837K0784P939j2880j4o837n021J0439j451k319P073J276r437J1060
$$ -25296 -15459 5325 13264 384 370 -6467 -11488 -1049 -2500 -4819 2254 3530 -5907 5153
17583E153l429j7917p808M15M116m576K895J3978Q540J395M835N631J112O648
$$ 5153 1724 -16193 -24001 -23586 -19470 -24046 -21151 -7173 1367 2762 7597 13228 14340 20988
17569B0988o005j699q457p153l520l400J3950P069p061j1728Q946J4635p907m273
$$ 20988 14983 13284 4827 -2326 -5846 -9246 4704 11773 4712 -7016 1930 16565 8658 4385
17555D385l850n340q866M294p7J662J2718k52j2229J874K808O779N386n885N665
$$ 4385 535 -4805 -13671 -9377 -9454 -7792 4926 4674 -7555 -5681 -2873 3906 9292 3407 9072
17540I072J4285j2116j2137R841Q807r72k0852j2430j8169J0191J9198M702r550
$$ 9072 23357 11241 -896 8945 17752 16780 -4072 -16502 -34671 -24480 -5282 -580 -10130
17527a0130j0294N752O750j2252J8667Q14r998O575J3759Q382k587j868R79r594
$$ -10130 -20424 -14672 -7922 -20174 -1507 -693 -10691 -4116 9643 18025 15438 13570 14549 4955
17513D955r60n308J1175L444l904l035J3031P042j0230j6432r556L773J9630J3280
$$ 4955 3995 -1313 9862 13306 9402 6367 19398 26440 16210 -222 -9778 -6005 13625 26905
17499B6905p736J894l040r22k415J47o331N833N076k2246j8218k137K780J6577
$$ 26905 19169 21063 18023 17101 14686 14833 8502 14335 19411 -2835 -21053 -23190 -20410 -3833
17485c833P75l443r422L589j5766m516J5426J3551r471n126J789m019L347K1687
$$ -3833 -3058 -6501 -15923 -12334 -28100 -32616 -17190 -3639 -13110 -18236 -16447 -20466 -17119 4568
17471D568L527L517j5470p936k364O385J3960M560j0598o761J5270Q390l556m700
$$ 4568 8095 11612 -3858 -11794 -14158 -7773 6187 10747 149 -6612 8658 17048 13492 8792
17457H792m329J412q990k142Q588J090l589j4785J7257J5245j135O212J3157K4176
$$ 8792 4463 5875 -3115 -5257 3331 4421 832 -13953 3304 18549 17414 23626 36783 60959
17443F0959N8507O9560J7681p1927m4076k1811k1687k4852j5882j0366j0090J1483
$$ 60959 119466 189026 206707 134780 90704 68893 47206 22354 6472 -3894 -13984 -2501
17431b501K8402O688L03n158p061j7259j1254M398J3534o340j6934K800N014L438
$$ -2501 25901 32589 32892 27734 20673 3414 -7840 -3442 10092 3752 -13182 -10382 -5368 -1930
17417a930M223K782n956k2481N56J480R970K375j5690o680N907n91M063j2708
$$ -1930 2293 5075 -881 -23362 -22806 -21326 -11356 -8981 -24671 -31351 -25444 -26035 -21972 -34680
17403c4680o714J5075K0944o62m512n292o542O551j6213O938K798J5643J3333
$$ -34680 -41394 -26319 -5375 -6037 -10549 -15841 -22383 -15832 -32045 -25107 -22309 -6666 6667
17390F667j526j5018q802n968P094M626J0694q584n185J2550P340J1385j556j3848
$$ 6667 5141 -9877 -18679 -24647 -17553 -12927 -2233 -10817 -16002 -3452 3888 15273 13717 -131
17376a31J164Q580N300j7236P93K380L980l936j3761J2054J2336J0466k451k0367
$$ -131 1033 9613 14913 -2323 -1530 850 4830 894 -12867 -813 11523 21989 19538 -829
17362h29k095P502J175j6086j0962O641M316j2854j0621N494P681J3438P613M27
$$ -829 -2924 4578 5753 -10333 -21295 -14654 -10338 -23192 -33813 -28319 -20638 -7200 413 840
17348H40L441j2320j782L034j9393K79J0252J3974L925N362r672j8108l703O354
$$ 840 4281 -8039 -9821 -6787 -26180 -25901 -15649 -1675 2250 7612 -2060 -20168 -23871 -17517
17334a7517K534J5519K0058j6605k474o30n839J179J3676J1490j1166j5452j000
$$ -17517 -14983 536 20594 3989 1515 885 -4954 -3775 9901 21391 10225 -5227 -6227
17321f227M170k374J3852n387m172o656K019o91M33l606o129M997P720J501O637
$$ -6227 -2057 -4431 9421 4034 -138 -6794 -4775 -5466 -5033 -8639 -14768 -9771 -2051 -550 6087
17306F087J4699K86j389J0794q300j0178k2516j4728R016P487O19M031J813O552
$$ 6087 20786 21072 19683 30477 22177 11999 -10517 -25245 -16229 -8742 -8123 -4092 -2279 4273
17292D273P535J1620Q42j2379R334P56j2942j290j773k586J8706J4547o974o780
$$ 4273 11808 23428 24270 11891 21225 21981 9039 7749 5976 3390 22096 36643 29669 22889
17278B2889j0423j3952J3506J5122k4993J346p156J0671J300j6008M500n803j1203
$$ 22889 12466 -1486 12020 27142 2149 3495 -3661 7010 8310 -7698 -3198 -9001 -20204
17265b0204N969j981M29Q520J2952k815j1013o06J1670O381q621K822q52O822
$$ -20204 -14235 -16216 -15787 -7267 5685 2870 -8143 -8749 2921 9302 681 3503 2651 9473
17251I473r89K3300L6689O50l1525p099j0235j7571j3212O69M595l882L598L434
$$ 9473 8484 31784 68473 69123 37598 30499 20264 2693 -10519 -9850 -5255 -9137 -5539 -2105
17237b105K134j2290K191Q810j2143o757P436Q125P784l055j0811j257Q673R630
$$ -2105 29 -12261 -10070 -1260 -13403 -20160 -12724 -4599 3185 130 -10681 -11938 -3265 6365
17223F365j9294j5898Q4J1886J5777j3544j2115K206Q779k056J687Q521n878o80
$$ 6365 -12929 -28827 -28743 -16857 -1080 -14624 -26739 -24533 -15754 -17810 -16123 -7602 -13480 -14160
17209a4160n41j7188q221K273j528P218J7380L034k074Q53J2462K1l639O546k857
$$ -14160 -14701 -31889 -40110 -37837 -39365 -32147 -14767 -11733 -13807 -12954 -492 -471 -4110 2436 -421
17194d21o418n831l901j2804P929J0580l692N132R432k28p635O179J224j1314
$$ -421 -6839 -12670 -16571 -29375 -21446 -10866 -14558 -9426 6 -222 -7857 -1678 -454 -11768
17180a1768j330M697J4135J3550l912j9657j2539J5750J893n712L391P150O01
$$ -11768 -13098 -8401 5734 19284 15372 -4285 -16824 -1074 819 -4893 -1502 5648 6249
17167F249M574o473L114j768l618N029Q25p800k928P215j1513m390n363J402O437
$$ 6249 10823 4350 7464 5696 2078 7107 7932 132 -2796 4419 -7094 -11484 -16847 -15445 -9008
17152i008j8694q562P432J2530J0970j832J5023r176j475N421o692k404J272m66
$$ -9008 -27702 -36264 -28832 -16302 -5332 -7164 7859 -1317 -2792 2629 -4063 -6467 -5195 -5661
17138e661k283j0939Q05N512J1479m301l505r910m211R754L508J0666q024j3876
$$ -5661 -7944 -18883 -18078 -12566 -1087 -5388 -8893 -18803 -23014 -13260 -9752 914 -7110 -20986
17124b0986P026J504j927k010n804m673j3704Q030J4915n821j1676N444L375r488
$$ -20986 -13960 -12456 -14383 -16393 -22197 -26870 -40574 -32544 -17629 -23450 -35126 -29682 -26307 -35795
17110c5795K668M956J508L252O294K297m053J686J0050J0767j2160P841m413K923
$$ -35795 -33127 -28171 -26663 -23411 -17117 -14820 -18873 -17187 -7137 3630 -8530 -689 -5102 -2179
17096b179o661p036m997n285R063J5939K202j0526J1490L081k1874j08j783o365
$$ -2179 -8840 -15876 -20873 -26158 -17095 -1156 1046 -9480 2010 5091 -16783 -16891 -18674 -25039
17082b5039R531q3p396l495K476J1452P872q21p430j4888L663J5324J2225K816
$$ -25039 -15508 -15591 -22987 -26482 -24006 -12554 -4682 -5503 -12933 -27821 -24158 -8834 3391 6207
17068F207j3128j3090q383R760J590R353P216m97N71j6187l777J1185m931J330
$$ 6207 -6921 -20011 -28394 -18634 -17044 -7691 -475 -972 -401 -16588 -20365 -9180 -14111 -12781
17054a2781J1867J0809r524L473L03R303J2931N839j6268j3340M066P6l420j3472
$$ -12781 -914 9895 371 3844 4147 13450 26381 32220 15952 2612 6678 6754 3334 -10138
17040a0138m993K817M872J7207l590k2205p893J447Q522J545J2646P639r02J508
$$ -10138 -15131 -12314 -7442 9765 6175 -16030 -23923 -22476 -13954 -12409 237 7876 6974 8482
17026H482o6j2125k283K3766J2209m586j5299lJ676n403K929j983m044j770k704
$$ 8482 8416 -3709 -5992 17774 29983 25397 10098 10095 11771 6368 9297 7314 3270 1500 -1204
17011a204L890K500O410p306q42n375L020j0691r077L864J3037j0195k603j3640
$$ -1204 2686 5186 11596 4290 3448 -1927 1093 -9598 -18675 -14811 -1774 -11969 -14572 -28212
16997b8212J3769J4176p369n896l956P706N795p201O23J6108R87l343o71m752
$$ -28212 -14443 -267 -7636 -13532 -17488 -9782 -3987 -11188 -10565 5543 6530 3187 2516 -2236
16983b236q6P4N935j292j5984j2217M698j0277k249K661o58J642K234J1417J6209
$$ -2236 -2322 -2248 3687 2395 -13589 -25806 -21108 -31385 -33634 -30973 -31631 -29989 -27755 -16338 -129
16968a29J4050R241r70L328j1591k832l912k3700J6213k480j6512O075J4393L286
$$ -129 13921 23162 22192 25520 13929 11097 7185 -16515 -302 -2782 -19294 -13219 1174 4460
16954D460o223j028m920J280M016J8088r513o906O041o555r844J7797K8475M625
$$ 4460 -1763 -2791 -7711 -6431 -2415 15673 6160 -746 5295 -1260 -11104 6693 35168 39793
16940C9793r887l142p425k2309p662M425K499n343m6q067Q732J6098m148k735
$$ 39793 29906 26764 19339 -2970 -10632 -6207 -3708 -9051 -9097 -17164 -8432 7666 3518 783
16926G83O662l678Q772m50k0756p270J5560m39l1009p977O889J3565N5j4119q52
$$ 783 7445 3767 12539 12089 -8667 -15937 -377 -816 -31825 -39802 -32913 -19348 -19293 -33412 -34264
16911c4264R257K4688R017q672P574Q868L15o360j5218q144j0909N419P8q053
$$ -34264 -25007 -319 8698 26 7600 16468 16783 10423 -4795 -12939 -23848 -18429 -18351 -26404
16897b6404J7571J0375P91j0670j0752o363K882J681n083J84P404J300J2653L769
$$ -26404 -8833 1542 2333 -8337 -19089 -25452 -22570 -20889 -25972 -25788 -18384 -17084 -4431 -662
16883f62J929Q926O710j2869j0510j0740o048L993k803m600J1720R361N802P487
$$ -662 1267 10193 16903 4034 -6476 -17216 -23264 -19271 -22074 -26674 -14954 -5593 209 7696
16869G696n449n555M106J1146o598j5369K914O969r647J0043N082l466N444J387
$$ 7696 2247 -3308 798 11944 5346 -10023 -7109 -140 -9787 256 5338 1872 7316 8703
16855H703j9274q514P246Q140j5516r438L989L517N280P812r21R933J4440q462
$$ 8703 -10571 -19085 -11839 -3699 -19215 -28653 -24664 -21147 -15867 -8055 -8976 957 15397 6935
16841F935j5619k535k917J0853L640q896m13M548J523p27j3241j2657L610K0134
$$ 6935 -8684 -11219 -14136 -3283 357 -8539 -8952 -4404 -2881 -3608 -16849 -29506 -25896 -5762
16827e762M808o009j981o756j4152l080J1441J1155K805L185Q421j1176j0030
$$ -5762 -954 -6963 -8944 -15700 -29852 -32932 -21491 -10336 -7531 -4346 4075 -7101 -17131
16814a7131J0380J7600J068j4059q812j1690O478K1906J461m44J567N397O763
$$ -17131 -6751 10849 11917 -2142 -10954 -22644 -16166 5740 7201 6757 8324 13721 20484
16801B0484K530o631o800j1677o888p655O451j3003K060o373m765R715J6239J2227
$$ 20484 23014 16383 9583 -2094 -8982 -16637 -10186 -23189 -21129 -27502 -32267 -22552 -6313 5914
16787E914O526q082m483N80M671l927n42m069j6482O485N824J0354K011m358p663
$$ 5914 12440 4358 -125 455 5126 1199 657 -3412 -19894 -13409 -7585 2769 4780 422 -7241
16772g241j6699r40Q610o840J276L586P970J9235J4689j0576n161N197n428j7302
$$ -7241 -23940 -24880 -16270 -23110 -21834 -18248 -10278 8957 23646 13070 7909 13106 7678 -9624
16758i624p786j0940L680K3530N968j624j180J4550j175k233j0799j0967N07M848
$$ -9624 -17410 -28350 -24670 -1140 4828 3204 2024 16574 15399 13166 2367 -8600 -8093 -3245
16744c245J1371j2182m09J045q444m887Q78j1902R400N917k540J305q732R93M67
$$ -3245 8126 -4056 -4465 -3420 -11864 -16751 -15873 -27775 -18375 -12458 -14998 -13693 -22425 -21432 -20965
16729b0965N284N362r568k564m280J911J079r664r710P687J7417n542J3156J0649
$$ -20965 -15681 -10319 -19887 -22451 -26731 -24820 -23741 -33405 -43115 -35428 -18011 -23553 -10397 252
16715B52K3563N352k8678l69l69r553l724J3456Q029k445j9191m484O885q343
$$ 252 23815 29167 489 120 -249 -9802 -13526 -70 7959 5514 -13677 -18161 -11276 -19619
16701a9619L755L0590N773o574j1830M088r39j5027j3913K935o164l666J283N57
$$ -19619 -15864 14726 20499 13925 2095 6183 5244 -9783 -23696 -20761 -26925 -30591 -29308 -28751
16687b8751N255N102J6014K2478m586r742j3100N034N991j3262P294O267J02L596
$$ -28751 -23496 -18394 -2380 20098 15512 5770 -7330 -2296 3695 -9567 -2273 3994 4096 7692
16673G692R835O721j601j1557l0901K432J5706J3421n590Q052o678j1223m883
$$ 7692 17527 24248 22647 11090 -19811 -17379 -1673 11748 6158 14210 7532 -3691 -8574
16660h574o366L359J1172Q612K793N040N754n709j250q931j6624M262K703J1801
$$ -8574 -14940 -11581 -409 8203 10996 16036 21790 16081 14831 5900 -10724 -6462 -3759 8042
16646H042r287o221J8235J0605R222j7618j2465j5370R815J4022M26K50N179l369
$$ 8042 -1245 -7466 10769 21374 30596 12978 513 -14857 -5042 8980 9406 9656 14835 11466
16632A1466k6349N10J4180j274N063K637r447j2982K125M555R686J1294k868J3239
$$ 11466 -14883 -14373 -193 -1467 3596 6233 -3214 -16196 -14071 -9516 170 11464 8596 21835
16618B1835M177m663K86j0618j962l983j2859N255L571K83M010J2639j2418j2501
$$ 21835 26012 21349 21635 11017 9055 5072 -7787 -2532 1039 1322 5332 17971 5553 -6948
16604f948N05q70J3486J2619m231j0253Q126n869l214k122O189n495j4259n403
$$ -6948 -6443 -7313 6173 18792 14561 4308 12434 6565 3351 1229 7418 1923 -12336 -17739
16590a7739O873J7420N296o280j7069J2612R834K127j0177j7979k962M147P595
$$ -17739 -10866 6554 11850 5570 -11499 1113 10947 13074 2897 -15082 -18044 -13897 -6302
16577f302j936j00j133p843j564K745j9J8257J5961R212o758j4724o222p921j8451
$$ -6302 -8238 -8338 -9471 -17314 -18878 -16133 -16152 2105 18066 27278 20520 5796 -426 -8347 -26798
16562b6798j3911L4406K4014j744k0454j3782j46j583o047J91L051K0720m69j4737
$$ -26798 -40709 -6303 17711 15967 -4487 -18269 -18415 -19998 -26045 -25854 -22803 -2083 -2552 -17289
16548a7289P438J8207K126l635j2978j9908N021N857l319P711N988L352m770j439
$$ -17289 -9851 8356 10482 6847 -6131 -26039 -21018 -15161 -18480 -10769 -4781 -1429 -6199 -7638
16534g638p72j3149n121N860J5410J2903O86l007r601L879j579O884J0909p327
$$ -7638 -8410 -21559 -26680 -20820 -5410 7493 8179 5172 -4429 -550 -2129 4755 15664 8337
16520H337n353q207Q992P4L446J0550L244j2313j541p997k9994O013J6592Q904
$$ 8337 2984 -5223 3769 3843 7289 17839 21083 8770 7229 -768 -30762 -24749 -8157 747
16506G47L548j948P151n033j188l641K084q484j8540l9J4694j572o299P614J3528
$$ 747 4295 2347 9498 4465 3277 -364 1720 -6764 -25304 -25343 -10649 -12221 -18520 -10906 2622
16491B622j295K245J654l269R779j111J9258P915j2746j0403j270R126j9262j4152
$$ 2622 1327 3572 5226 1957 11736 10625 29883 37798 25052 14649 13379 22505 3243 -10909
16477a0909l535M793l180K492j639Q704J8035R678j5784j4677n433J1071r667
$$ -10909 -14444 -9651 -12831 -10339 -11978 -3274 14761 24439 8655 -6022 -11455 -384 -10051
16464a0051N941N885P619r422j6132j0513K64J0473J0078p363j0707m827o832
$$ -10051 -4110 1775 9394 -28 -16160 -26673 -26409 -15936 -5858 -13221 -23928 -28755 -35587
16451c5587O787J6779O245k683m818m180R938L684P839j898K685j607l09n355
$$ -35587 -28800 -12021 -5776 -8459 -13277 -17457 -7519 -3835 4004 2106 4791 3184 2875 -2480
16437b480J0833J2838q338k2729L160R718n704R48p209n627j190j2372M807m877
$$ -2480 8353 21191 12853 -9876 -6716 3002 -2702 -1754 -8963 -14590 -15780 -28152 -23345 -28222
16423b8222O515O830K0849R300L781K961n152j3120N65k630K360k271n920N819
$$ -28222 -21707 -14877 5972 15272 19053 22014 16862 3742 4307 1677 4037 1766 -4154 1665
16409A665J2060J2117M089K826j1972p440J763J9197m319k2449n903j0352j1609
$$ 1665 13725 25842 29931 32757 20785 13345 15108 34305 29986 7537 1634 -8718 -20327
16396b0327q301j3680n030L722P980J2029l757j429R136P717j70k262j118J744
$$ -20327 -28628 -42308 -47338 -43616 -35636 -23607 -27364 -28793 -19657 -11940 -12110 -14372 -15490 -13746
16382a3746J2576k341L803J0519j2857j99j0503J0677j228J479Q578P431J119
$$ -13746 -1170 -3511 292 10811 -2046 -2245 -12748 -2071 -3299 -1820 6758 14189 15308
16369A5308j597j1024j5936L869j214j1016n808J2530R04j0638j4922P52J4731
$$ 15308 13711 2687 -13249 -9380 -10594 -21610 -27418 -14888 -13984 -24622 -39544 -38792 -24061
16356b4061J1050O013N656k300n202L460P511j0341j43K036Q190k064l496k561
$$ -24061 -13011 -6998 -1342 -3642 -8844 -5384 2127 -8214 -8357 -6321 1869 -195 -3691 -6252
16342f252M000n206j438O526j0162o706m098P6p48J4316P334N50n527j0586P611
$$ -6252 -2252 -7458 -8896 -2370 -12532 -19238 -23336 -23260 -24008 -9692 -2358 -1808 -7335 -17921 -10310
16327a0310M719P378J124R480J379l095J4578r909j2077n401k4615l140K043L859
$$ -10310 -5591 1787 2911 12391 13770 10675 25253 15344 3267 -2134 -26749 -29889 -27846 -23987
16313b3987N459J7239o24p003j94K111r199j2499P820J7536J7645j7580m728p204
$$ -23987 -18528 -1289 -1913 -8916 -9110 -6999 -16198 -28697 -20877 -3341 14304 -3276 -8004 -15208
16299a5208l486J0874J1433j63L013j494O027q338n750k870j7265O49K5377O089
$$ -15208 -18694 -7820 3613 3450 6463 4969 10996 2658 -3092 -5962 -23227 -22578 2799 8888
16285H888k986K349L385l512j5061j2177q860R214k365k656p074l861Q875P330
$$ 8888 5902 8251 11636 8124 -6937 -19114 -27974 -18760 -21125 -23781 -30855 -34716 -25841 -18511
16271a8511l966m550p75J6077j200j489P397K38Q345J3024n14p955M861m543l834
$$ -18511 -22477 -27027 -27802 -11725 -12925 -14414 -7017 -6779 1566 14590 14076 6121 10982 6439 2605
16256B605k1488j6879J5950J2805J5071r28q187j82l094Q248J6195o076m662k773
$$ 2605 -18883 -35762 -19812 -7007 8064 7136 -1051 -1233 -4327 3921 20116 14040 9378 6605
16242F605o404n135m992R225J557l140k621J2253J0595J506J62j1471K408J1482
$$ 6605 201 -4934 -9926 -701 856 -2284 -4905 7348 17943 19449 19611 8140 10548 22030
16228B2030m182J688M853m653j2743k96k654k380m548k191Q545J647o247p118
$$ 22030 17848 19536 24389 19736 6993 6697 4043 1663 -2885 -5076 3469 5116 -1131 -8249
16214h249Q009P918J5626o634O24q593j4565N749K38j2470q28q866J3072J356
$$ -8249 -240 7678 23304 16670 17294 8701 -5864 -115 123 -12347 -13175 -22041 -8969 -7613
16200g613R07O074k259l726K994K042o816l445j815Q675J456M232O685K2103o671
$$ -7613 -6706 -632 -2891 -6617 -3623 -1581 -8397 -11842 -13657 -4982 -3526 706 7391 29494 22823
16185B2823j2172j7658k0510l692J4490o497N196J0797j2379J695J131P758L383
$$ 22823 10651 -7007 -27517 -31209 -16719 -23216 -18020 -7223 -19602 -17907 -16776 -9018 -5635
16172e635J4976O956m257j4112q812j504Q452M85J6366Q470j7665n726P007o222
$$ -5635 9341 16297 12040 -2072 -10884 -12388 -3936 -3451 12915 21385 3720 -2006 5001 -1221
16158a221r562M371K1187j716r42k2245k856M237l729j100k001J3014J69J5674
$$ -1221 -10783 -6412 14775 13059 12117 -10128 -12984 -8747 -12476 -13576 -15577 -2563 -2394 13280
16144A3280p534j5562O61Q904N271L932M621j313l468J538K41j915N951p728r109
$$ 13280 5746 -9816 -9155 -251 5020 8952 13573 12260 8792 10330 10571 8656 14607 6879 -2230
16129b230K807l073M774R976R27q159j4373J538L40N806q694K650R885m653j9863
$$ -2230 577 -2496 2278 12254 13181 5022 -9351 -7813 -7473 -1667 -10361 -7711 2174 -2479 -22342
16114b2342j962J946J9718J8838P744n077J5455j1638j9685j0264N177o978q493
$$ -22342 -24304 -22358 -2640 16198 23942 18865 34320 22682 2997 -7267 -2090 -9068 -17561
16101a7561r374M221N725n329J8524K1679j102P035j830n147K927l32m129k884
$$ -17561 -26935 -22714 -16989 -22318 -3794 17885 16783 23818 21988 16841 19768 19436 15307 12423
16087A2423j8274p936l743r674L862J066Q436J0043K35N902M391j645P239O882
$$ 12423 -5851 -13787 -17530 -27204 -23342 -22276 -13840 -3797 -3562 2340 6731 5086 12325 19207
16073A9207r081M650n29K966j3482n586J5068N686j470J0293l941j1167K230R200
$$ 19207 10126 14776 14247 17213 3731 -1855 13213 18899 17429 27722 23781 12614 14844 24044
16059B4044l933o489j3779q552k990J569j2672l460K747L404O270M948J308m384
$$ 24044 20111 13622 -157 -8709 -11699 -10130 -22802 -26262 -23515 -20111 -13841 -8893 -7585 -11969
16045a1969k1249R165R492J47r295n71J0977J264m51J2035N182k008j7258j3932
$$ -11969 -33218 -24053 -14561 -14414 -23709 -24280 -13303 -12039 -12490 -455 4727 2719 -14539 -28471
16031b8471J8398J6912R542O062K249K942k3137r653k651J417j4786j0147R715
$$ -28471 -10073 6839 16381 22443 24692 27634 4497 -5156 -7807 -6390 -21176 -31323 -21608
16018b1608K1955J2620J165p603M97J9748J4297P93j2474j0047l669p822L586
$$ -21608 347 12967 14132 6529 7026 26774 41071 41864 29390 19343 15674 7852 11438
16005A1438o818o642P618J1695l972j0162k368Q735n562o311J65r214j7982K060
$$ 11438 4620 -2022 5596 17291 13319 3157 789 9524 3962 -2349 -2184 -11398 -29380 -27320
15991b7320J9530j1676j2410n275j976M005O342P520O553r404j1167J648N417
$$ -27320 -7790 -19466 -31876 -37151 -39127 -35122 -28780 -21260 -14707 -24111 -35278 -33630 -28213
15978b8213P383N969K032n81j2902M026J8194R361p038j729p795J811J854Q63
$$ -28213 -20830 -14861 -12829 -13410 -26312 -22286 -4092 5269 -1769 -3498 -11293 -9482 -7628 -6765
15964f765o592J3874J2255j2952j3521j5247j0777k557J0144M903J6971L608p538
$$ -6765 -13357 517 12772 -180 -13701 -28948 -39725 -42282 -32138 -27235 -10264 -6656 -14194
15951a4194k2486o052K9963J9542j5347L701n059j8190o138K3488J5952K194m522
$$ -14194 -36680 -42732 -12769 6773 -8574 -4873 -9932 -28122 -34260 -10772 5180 7374 2852
15938B852K617m609j101q24r848N899J3173J311R98L973j6913K76j89k0476O563
$$ 2852 5469 860 -241 -1065 -10913 -5014 8159 9470 10468 14441 -2472 -2196 -2385 -22861 -16298
15923a6298K8476r836j398J4468J829r610l62R00l019n902o229K591n883J4589
$$ -16298 12178 2342 944 15412 17241 7631 7269 8169 5150 -752 -6981 -4390 -10273 4316
15909D316n18r655J109m561O208Q576l418r769q872L350N148o674P63j443P251
$$ 4316 3798 -5857 -4748 -9309 -3101 5475 2057 -7712 -16584 -13234 -8086 -14760 -13997 -15440 -8189
15894h189N136O988k552r632N884p457j1196J7363J6644O38L278O707p715j1910
$$ -8189 -3053 3935 1383 -8249 -2365 -9822 -21018 -3655 12989 13627 16905 23612 15897 3987
15880C987K416K502J711j177P933M01r870M73Q978q804j4129L872N561O551j0242
$$ 3987 6403 8905 10616 9439 17372 17773 7903 8376 17354 8550 -5579 -1707 3854 10405 163
15865A63m508m261N111o168l203j1770n015o470K328J1920K967p287O118L137
$$ 163 -4345 -8606 -3495 -9663 -12866 -24636 -29651 -36121 -33793 -21873 -18906 -26193 -20075 -16938
15851a6938K450J904J849k494j5730Q646K2789N534o515M844K806j3211p673R137
$$ -16938 -14488 -12584 -10735 -13229 -28959 -20313 2476 8010 1495 6339 9145 -4066 -11739 -2602
15837b602N940N472K809l442o85q87J0958r303k3376j1867N686O535q298L854
$$ -2602 3338 8810 11619 8177 7492 6605 17563 8260 -15116 -26983 -21297 -14762 -23060 -19206
15823a9206j343R650K0318l185j2139M88J508J616O24p716K1587l534j2156n315
$$ -19206 -20549 -10899 9419 6234 -5905 -5417 -3909 -2293 -1669 -9385 12202 8668 -3488 -8803
15809h803n02K3177K428K155r439j3372Q006N587N237J5591k010r108J70Q546
$$ -8803 -9305 13872 16300 18455 9016 -4356 3650 9237 14474 30065 28055 18947 19117 27663
15795B7663n398p353q395K144O960n08j8594k6221M937Q932Q119j80r213K0316
$$ 27663 22265 14912 6517 8661 15621 15113 -3481 -29702 -24765 -15833 -7714 -7894 -17107 3209
15781C209r794j280m935q190N167M544n744j1594N909J7836J1217j0772p636J4432
$$ 3209 -6585 -7865 -12800 -20990 -15823 -11279 -17023 -28617 -22708 -4872 6345 -4427 -12063 2369
15767B369P954q989k526j6562j6163R469J222%M454P563M66K123O60J0141k4113
$$ 2369 10323 1334 -1192 -17754 -33917 -24448 -23226 -23226 -18772 -11209 -10743 -8620 -7960 2181 -21932
15752b1932j5106J9012J0037K702m331M385l660p025J0273N972L2m339k660M609
$$ -21932 -37038 -18026 -7989 -5287 -9618 -5233 -8893 -15918 -5645 327 359 -3980 -6640 -2031
15738b031n225r377j2158P70K3592J9704P885r702k5137k743l577P174m904L523
$$ -2031 -7256 -16633 -28791 -28021 -4429 15275 23160 13458 -11679 -14422 -17999 -10825 -15729 -12206
15724a2206M047Q760j4715j0760R680K0117K1695o469q797n75p425J2445M064
$$ -12206 -8159 601 -14114 -24874 -15194 4923 26618 20149 11352 10777 3352 15797 19861
15711A9861j4492k994J1653R257k2010r10J1627m495l564j3454j43K952o118r94
$$ 19861 5369 2375 14028 23285 1275 365 11992 7497 3933 -9521 -9664 -6712 -12830 -13824
15697a3824m774j49j0474L575J0686J931P898J5265q576k5430k175R881M459o470
$$ -13824 -18598 -18747 -29221 -25646 -14960 -13029 -5131 10134 1558 -23872 -26047 -16166 -11707 -18177
15683a8177n498J646J3044J040J086J1639Q561j6940j2790n538J1004J5208J5988
$$ -18177 -23675 -22029 -8985 -7945 -6859 4780 13341 -3599 -16389 -21927 -10923 4285 20273
15670B0273K2891r253r993p191r453j1802q132j5320Q601J1850R616J5240M27
$$ 20273 43164 33911 23918 16727 7274 -4528 -12660 -27980 -19379 -7529 2087 17327 17754
15657A7754k29o595k201P104M913J335j423n66J1193j4815K529P664L611n78p771
$$ 17754 17525 10930 8729 15833 20746 22081 20658 20092 31285 16470 18999 26663 30274 29696 21925
15642B1925j6535k5961R415J3638o213m281O763J9164o237O730L708j5058o377
$$ 21925 5390 -20571 -11156 2482 -3731 -8012 -1249 17915 11678 18408 22116 7058 681
15629F81j4409j022Q675J5377L903j1649P241j805j0669q655J402l603k101R820
$$ 681 -13728 -14750 -6075 9302 13205 1556 8797 6992 -3677 -12332 -10930 -14533 -16634 -6814
15615f814J5567N235O74q538J793J063j2632r065K332j0118p809P011J6154j597
$$ -6814 8753 13988 14662 6124 7917 8980 -3652 -12717 -10385 -20503 -28312 -21301 -5147 -6744
15601f744K377J109k851q129n517k355K749l579J3009K314Q643m880N383J2850
$$ -6744 -4367 -3258 -6109 -14238 -19755 -22110 -19361 -22940 -9931 -7617 1026 -3854 1529 14379
15587A4379J817k1197r581r070M484J5219R547l580O201j1928k496k044q042r32
$$ 14379 16196 -5001 -14582 -23652 -19168 -3949 5598 2018 8219 -3709 -6205 -8249 -16291 -17223
15573a7223jO10n881J0461K4031M598j1692k746j030l818J8075p372j2560j1437
$$ -17223 -17224 -16614 -22495 -12034 11997 16595 4903 2157 1127 -2691 15384 8012 -4548 -15985
15559a5985L039K013o615l043L199L177Q717J65J9494l314k3944n913O387L221
$$ -15985 -12946 -10933 -17548 -20591 -17392 -14215 -5498 -5333 14161 10847 -13097 -19010 -12623 -9402
15545i402P567p679k569j94n190Q685J9325N083j8826j6407N290N570M644L86
$$ -9402 -1835 -9514 -12083 -12277 -17467 -8782 10543 15626 -3200 -19607 -14317 -8747 -4103 -3717
15531c717k804J0563q010Q469J668p065r418n000j839K261K734M25l365O108j628
$$ -3717 -6521 4042 -3968 4501 6169 -896 -10314 -15314 -17153 -14892 -12158 -11733 -15098 -8990 -10618
15516a0618J7640q369j333n446R442N612P83k823M926j6323k4923m877J7705J9882
$$ -10618 7022 -1347 -2680 -8126 1316 6928 7711 4888 9814 -6509 -31432 -36309 -18604 1278
15502A278J787o364J299Q19n789J0841R22j1995j1671j15l416k709J1021J2254
$$ 1278 3065 -3299 -2000 -1181 -6970 3871 4793 -7202 -18873 -18988 -22404 -25113 -14092 -1838
15488a838j4852j1486K0643j721m070P759m847j4151j0203J6588K1149n387p630
$$ -1838 -16690 -28176 -7533 -9254 -13324 -5565 -10412 -24563 -34766 -18178 2971 -2416 -10046
15475a0046j5028n007J8484J4370J5761J6284j1448j5070j835J1592n073p305
$$ -10046 -25074 -30081 -11597 2773 18534 34818 23370 8300 6465 18057 12984 5679
15463E679J2943o297k5335Q970N787m140K917K496j1599k165J6488N949j0761
$$ 5679 18622 12325 -13010 -4040 1747 -2393 524 3020 -8579 -10744 5744 11693 932
15450I32p777j1540K205J4449k026K097o537j3362p76o63p879L59k22J0105K0308
$$ 932 -6845 -18385 -16180 -1731 -3757 -1660 -8197 -21559 -22335 -22998 -30877 -30518 -30740 -20635 -327
15435c27m794k47J0960q070j1438m164K51M21J5181k690Q749L40o661j3878j4340
$$ -327 -5121 -5368 5592 -2478 -13916 -18080 -17829 -17408 -2227 -4917 3832 4172 -2489 -16367 -30707
15420c0707k802J577J3256J1579%L116l229L572L19l331J0432P786J2197J0885
$$ -30707 -33509 -31932 -18676 -7097 -7097 -3981 -7210 -3638 -3319 -6650 3782 11568 23765 34650
15406C4650k5432j5026j3611n502R860N583m091J1916J316O166L322P39K57J1097
$$ 34650 9218 -5808 -19419 -24921 -15061 -9478 -13569 -1653 -337 5829 9151 9890 10147 21244
15392B1244J0246j5583J522N606n332j8687m710J6439O826j1585j5061j3587j462
$$ 21244 31490 15907 17429 23035 17703 -984 -5694 10745 17571 5986 -9075 -22662 -24124
15379b4124J1987R058n142k412J1667L093N419Q002M9j2851L111o344j424p458
$$ -24124 -12137 -3079 -8221 -10633 1034 4127 9546 17548 17597 4746 7857 1513 89 -7369
15365g369J655J770N687l795J150J1799k825p576K631J3569J5247q828q253N268
$$ -7369 -5714 -3944 1743 -2052 -902 10897 8072 496 3127 16696 31943 23115 14862 20130
15351B0130k4309o650M679l784J707Q400J2468l024j5329N357M092P010N110p284
$$ 20130 -4179 -10829 -6150 -9934 -8227 173 12641 9617 -5712 -355 3737 10747 15857 8573
15337H573P79J0178m896L835j3474q299j1305R542J0103J3591J981k2327p848
$$ 8573 9352 19530 14634 18469 4995 -3304 -14609 -5067 5036 18627 20608 -1719 -9567
15324i567J9531j769p263K375R521N526J3239j0940j6979q435J4007O379p286
$$ -9567 9964 8195 932 3307 12828 18354 31593 20653 3674 -4761 9246 15625 8339
15311H339l69K803M017o699J612R390q555j4826m758J78j1107j0689O795P276
$$ 8339 7970 10773 14790 8091 9703 19093 10538 -4288 -9046 -8868 -19975 -30664 -23869 -16593
15297a6593j0651k715J3801q836j656K0033L631r633N541J0550J6091m459j5856
$$ -16593 -27244 -29959 -16158 -24994 -26650 -6617 -2986 -12619 -7078 3472 19563 15104 -752
15284g52q283L294j0585L19k689p715m180M594J537M364J560Q273J4307J0373
$$ -752 -9035 -5741 -16326 -16007 -18696 -26411 -30591 -25997 -24460 -20096 -18536 -10263 4044 14417
15270A4417j4322j2731K10Q948Q548n000j0560j8505j4765J7978K5717K5337r726
$$ 14417 95 -12636 -12426 -3478 5070 70 -10490 -28995 -43760 -25782 -65 25272 15546
15257A5546o490j0120p214q65k37Q290r727M213L954M577N720K403o673j7284
$$ 15546 9056 -1064 -8278 -9143 -9380 -1090 -10817 -6604 -2650 1927 7647 10050 3377 -13907
15243a3907j7058Q137J0008p290J0246m320P900J8662L410r330O73j1446m483
$$ -13907 -30965 -22828 -12820 -20110 -9864 -14184 -6284 12378 15788 6458 7131 -4315 -8798
15230h798k81n026n214l580R177L444l773N159J0625L158k41J871j3366j405J771
$$ -8798 -9079 -14105 -19319 -22899 -13722 -10278 -14051 -8892 1733 4891 4650 6521 -6845 -8250 -6479
15215f479P028M098K026O553J045K742q954j3684j0133N267J3687N996N90O679
$$ -6479 549 4647 6673 13226 14271 17013 8059 -5625 -15758 -10491 3196 9192 9782 16461
15201A6461L974k368O033K466n815Q677o795j0673N280M318j26m13j0340j755
$$ 16461 20435 18067 24100 26566 20751 29428 22633 11960 17240 21558 21432 21019 10679 8924
15187H924M050n434J2028r75j6973o198j1024J674j854J596K533j956R929N131
$$ 8924 12974 7540 19568 18593 1620 -4578 -15602 -13928 -15782 -14186 -11653 -13609 -3680 1451
15173A451K053n119P058L24k798r980o246K721k857J2511n055k301K502m90Q41
$$ 1451 3504 -1615 5443 5767 2969 -7011 -13257 -10536 -13393 -882 -5937 -8238 -5736 -6226 -5385
15158e385R648J4759k706j0486P193n241l085m892j545M173m710Q031P393K54
$$ -5385 4263 19022 16316 5830 13023 7782 4697 -195 -1740 2433 -2277 5754 13147 13401
15144A3401o703r374L243j378j6488j0542J7857J1943M622j1451j0106j235J2896
$$ 13401 6698 -2676 567 -811 -17299 -27841 -9984 1959 6581 -4870 -14976 -16211 -3315
15131c315r362j0469J1091p479j293Q074K2918O685j825j2543j0749O358Q427
$$ -3315 -12677 -23146 -12055 -19534 -20827 -12753 10165 16850 15025 2482 -8267 -1909 6518
15118F518o900j1463P038J7685p05k657j2404l706Q399J0213P46j3948J494L705
$$ 6518 -382 -11845 -4807 12878 12173 9516 -2888 -6594 1805 12018 12764 -1184 310 4015
15104D015p751P423r215N167K0282N123p340p192K145j1910K598Q672n974k311
$$ 4015 -3736 3687 -5528 -361 19921 25044 17704 10512 12657 747 3345 12017 6043 3732
15090C732m43j62K126J3442J091n07n084k935m629J162P226K014m859j4651j6418
$$ 3732 3289 3127 5253 18695 19786 19279 14195 11260 6631 7793 15019 17033 12174 -2477 -18895
15075a8895O144P952m137K07L598J1569Q867p622j1039q441m32J8087L300J444
$$ -18895 -12751 -4799 -8936 -8729 -5131 6438 15305 7683 -3356 -11797 -12229 5858 9158 10602
15061A0602p492J911j833Q310L684L073k936n108N201Q576J0179k5047l4015J7234
$$ 10602 3110 5021 3188 11498 15182 18255 15319 10211 15412 23988 34167 9120 -24895 -7661
15047g661K6088O860k041n464j0481R696K867m848P44o191j1511o196J5358K445
$$ -7661 18427 25287 23246 17782 7301 16997 19864 15016 15760 9569 -1942 -8138 7220 9665
15033I665k0711j6965L236J4882K926Q458j274j8137K414R151j5452j7649j1634
$$ 9665 -11046 -28011 -24775 -9893 -6967 1491 217 -17920 -15506 -6355 -21807 -39456 -51090
15020e1090K2357J6268R962n348J0533R903N529o246j216N287j0831o378L076
$$ -51090 -28733 -12465 -2503 -7851 2682 12585 18114 11868 10652 15939 5108 -1270 1806
15007A806n577J162L910n812R573K6342M6817M4010N2451l0987m8591l0345k7279
$$ 1806 -3771 -2609 1301 -4511 5062 31404 78221 122231 174682 143695 95104 64759 37480
14994C7480j4257j5590p851j2765j2159J897J2132l439l042J0933J1615J262j3825
$$ 37480 23223 7633 -218 -12983 -25142 -23245 -11113 -14552 -17594 -6661 4954 6216 -7609
14981g609m147J1200J2339J6166j4509j5259m659k058q75N992J844L9J062k52
$$ -7609 -11756 -556 11783 27949 13440 -1819 -6478 -8536 -9411 -3419 -1575 -1536 -474 -726
14967g26m850k154L274M449k302J0070J5272j2031j1983l502M459q911J3432Q633
$$ -726 -5576 -7730 -4456 -7 -2309 7761 23033 11002 -981 -4483 -24 -8935 4497 13130
14953A3130J307j869J65n679J621R238o243n345J2147m675r190R610O983n908
$$ 13130 14437 12568 12733 7054 8675 17913 11670 6325 18472 13797 4607 14217 21200 15292
14939A5292j0975J745R349n374n179m941m007p357l476l716M265J3201j2189M706
$$ 15292 4317 6062 15411 10037 4858 -83 -4090 -11447 -14923 -18639 -14374 -1173 -13362 -8656
14925h656K9608Q653k9097k9895R812J7078J4991J0317P26q776k404q05o516K044
$$ -8656 20952 29605 508 -29387 -19575 -2497 12494 22811 23537 14761 12357 11552 5036 7080
14911G080k417p873R123K43o212k0412j0867j919O971J0285K3973N962r263l486
$$ 7080 4663 -3210 5913 6156 -56 -20468 -31335 -33254 -26283 -15998 7975 13937 4674 1188
14897A188j5589n096K186J6992J5487J0582J709j8142j740L350N909m654p301
$$ 1188 -14401 -19497 -17311 -319 15168 25750 27459 9317 7577 10927 16836 12182 4881
14884D881p540r391l866Q089n036j1727R463J0523J4504L540j0716R54M353o400
$$ 4881 -2659 -12050 -15916 -7827 -12863 -24590 -15127 -4604 9900 13440 2724 3678 8031 1631
14870A631q245J379l075O345K5144K042m135k669p136n140n821O201q18n24O80
$$ 1631 -6614 -5235 -8310 -1965 23179 25221 21086 18417 11281 6141 320 6521 5703 5179 5859
14855E859k718k504O668J7277j2140k459m272K393O077k221l019q37N929p296
$$ 5859 3141 637 7305 24582 12442 9983 5711 8104 14181 11960 8941 8104 14033 6737
14841F737r394J006J4485K0853l80l419j3457j2274o089j6673K5o477j643Q705
$$ 6737 -2657 -1651 12834 33687 33307 29888 16431 4157 -1932 -18605 -18580 -25057 -26700 -17995
14827a7995J9041m718n678L191O492j495J4228q52N597J0267j913k620r185p946
$$ -17995 1046 -3672 -9350 -6159 333 -1162 13066 12214 17811 28078 26165 23545 14360 6414
14813F414k5o743o416n008N646M019L65O227j434q162O442k4034J642L613M639
$$ 6414 6389 -354 -6770 -11778 -6132 -2113 -1748 4479 3045 -5117 1325 -22709 -21067 -17454 -12815
14798a2815J312L195M398J6150l478j4704J529n925R362J7186r748K518r857j6003
$$ -12815 -11503 -8308 -3910 12240 8762 -5942 -4413 -10338 -976 16210 6462 8980 -877 -16880
14784a6880N331J5888j1147q511P903J8380J1964K827j8704J860J0997L320n596
$$ -16880 -11549 4339 -6808 -15319 -7416 10964 22928 25755 7051 8911 19908 23228 17632
14771A7632j9821j4043J2911L5O86O245J653j1067n976M255n080J0862O865n848
$$ 17632 -2189 -16232 -3321 -3286 -2600 3645 5298 -5769 -11745 -7490 -12570 -1708 5157 -691
14757f91N386M696L733l732n00j3767o390N573P868J0911Q21p330n339Q653o924
$$ -691 4695 9391 13124 9392 8892 -4875 -11265 -5692 2176 13087 13908 6578 1239 9892 2968
14742B968q476n705m620J3517J0136K623r7p374L839m397j771M601J6116M253
$$ 2968 -5508 -11213 -15833 -2316 7820 10443 10346 2972 6811 2414 643 5244 21360 25613
14728B5613j0237k6275n741j785Q380J9238mp010m631o957l398J7615Q631j892
$$ 25613 15376 -10899 -16640 -18425 -10045 9193 9189 2179 -2452 -9409 -12807 4808 13439 11547
14714A1547M324J668K35j2231m595l505k909L443O760k531J0593J6135j4943j5747
$$ 11547 15871 17539 17774 5543 948 -2557 -5466 -2023 4737 2206 12799 28934 13991 -1756
14700a756J1858L907j544j5710n19O616Q942j456L094M622p514m738m754m752
$$ -1756 10102 14009 12465 -3245 -3764 2852 11794 10338 13432 18054 10540 5802 1048 -3704
14686c704L334N973j605j0309J0599n870K555J5824J326N58j1759n878p51j09
$$ -3704 -370 5603 3998 -6311 4288 -1582 973 16797 18123 18681 6922 1044 293 184
14672A84Q300J1370j3869k230j1635K3305J4945j9354m707J7265J657m375O866
$$ 184 8484 19854 5985 3755 -7880 15425 30370 11016 6309 23574 25231 20856 27722
14659B7722j3451p064l329J9026m359m884l085J2658j4355K347j4985j2289k356
$$ 27722 14271 7207 3878 22904 18545 13661 10576 23234 8879 11226 -3759 -16048 -18404
14646a8404L900J2828L058j5428p489N661k478M110J0955j656m675p932j164K5223
$$ -18404 -14504 -1676 1382 -14046 -21535 -15874 -18352 -14242 -3287 -4943 -9618 -17550 -18714 6509
14632F509J1312l309j811j9636j0748N938P28M805o90J3221R397Q329q90p195
$$ 6509 17821 14512 12701 -6935 -17683 -11745 -11017 -6212 -6902 6319 15716 24045 23155 15960
14618A5960m708j044N654J2499K6803J1019k712m002j8631k1330l2973P270J4928
$$ 15960 11252 10208 15862 28361 55164 66183 63471 59469 40838 19508 -13465 -6195 8733
14605H733N391k752k927l19N164K486j8697k2245l529N560K070O377k338o775
$$ 8733 14124 11372 8445 8126 13290 15776 -2921 -25166 -28695 -23135 -21065 -14688 -17026 -23801
14591b3801R775R608j1345L373M049J1467N386L559N154j3710l024K603J952L258
$$ -23801 -14026 -4418 -15763 -12390 -8341 3126 8512 12071 17225 3515 491 3094 5046 8304
14577H304j3280j0837K77J130j7961N762O944L425k248J1332O317J097o593J4969
$$ 8304 -4976 -15813 -15536 -14406 -32367 -26605 -19661 -16236 -18484 -7152 -835 262 -6331 8638
14563H638Q740M458k107M840j2204j972j2598j5494j3829L1824J9217j4625k440
$$ 8638 17378 21836 19729 24569 12365 10393 -2205 -17699 -31528 296 19513 4888 2448
14550B448j1212j0573J2502J7616P132p337q609k132J0462P009M342Q339q54p573
$$ 2448 -8764 -19337 -6835 10781 17913 10576 1967 -165 10297 17306 21648 29987 29133 21560
14536B1560j6471j6198k122M845M251j662K973J2358J1978K968q96o083p914j0782
$$ 21560 5089 -11109 -13231 -8386 -4135 -5797 -2824 9534 21512 24480 23584 17501 9587 -1195
14522a195j046l947j4440l328J7684K3229O550q088m286M866P514O085n872k4957
$$ -1195 -2241 -6188 -20628 -23956 -6272 16957 23507 15419 11133 15999 23513 29598 23726 -1231
14508a231j0740M059O436Q464n672R730Q821n977J284p05o93m508L207O164n248
$$ -1231 -11971 -7912 -1476 6988 1316 11046 19867 13890 15174 14469 13776 9268 12475 18639 13391
14493A3391r945N226j66k1080k276J2860M704j696J707p117m019M115O382O099
$$ 13391 3446 8672 8506 -12574 -14850 -1990 2714 1018 2725 -4392 -8411 -4296 2086 8185
14479H185r247K946q407Q468n235m260L848L310M453j8079q812K4888K1471J0375
$$ 8185 -1062 1884 -6523 1945 -3290 -7550 -3702 -392 4061 -14018 -22830 2058 23529 33904
14465C3904j2429r71K5K970j167j3419n573J0011j0940j1538J6877K4607m581
$$ 33904 21475 20504 20529 23499 22332 8913 3340 13351 2411 -9127 7750 32357 27776
14452B7776k5635j9603l507K5041J3285n753J0854O521j066q367o836q005J803
$$ 27776 2141 -17462 -20969 4072 17357 11604 22458 28979 27913 19546 12710 4705 6508
14439F508p409j70N950q188J2145K440P602j8103P542Q348p155j4711o072n013
$$ 6508 -901 -1071 4879 -3309 8836 11276 18878 775 8317 16665 9510 -5201 -11273 -16286
14425a6286l929J716J9447J6243j309j9569j4230J2525M822p443r127R034J2463
$$ -16286 -20215 -18499 948 17191 15882 -3687 -17917 -5392 -570 -8013 -17140 -8106 4357
14412D357k567J1095Q951m089o295N211L002J0628q985k982m946j3969j3784q39
$$ 4357 1790 12885 21836 17747 11452 16663 19665 30293 21308 18326 13380 -589 -14373 -15212
14398a5212P783N663O420P185L06k4423j5837P486O512J2189J4002Q795j2422
$$ -15212 -7429 -1766 4654 11839 12145 -12278 -28115 -20629 -14117 -1928 12074 20869 8447
14385H447k4183r260J8527L907p240R305J3165j537L98L472O070o538l778N386
$$ 8447 -15736 -24996 -6469 -2562 -9802 -497 12668 11131 11529 15001 21071 14533 10755 16141
14371A6141n981n986q305P141L14K167Q847M834j4901r969o527J5322O147k72
$$ 16141 10160 4174 -4131 3010 3324 5491 14338 19172 4271 -5698 -12225 3097 9244 8972
14357H972j4749J0406M803j641R705M004k6274r965P095J9947n84l345L940P131
$$ 8972 -5777 4629 9432 7791 17496 21500 -4774 -14739 -7644 12303 11719 8374 12314 19445
14343A9445j0785j4506P853r110j546R922J4197O752n371p721O508p570j2692
$$ 19445 8660 -5846 2007 -7103 -8649 1273 15470 22222 16851 9130 15638 8068 -4624
14330d624J4206n937L22k791o359J062Q244J4875k346m009m871k934N529n178
$$ -4624 9582 3645 3967 1176 -5183 -4121 4123 18998 16652 12643 7772 4838 10367 5189
14316E189l525J0007N769n346P634j4706j7234J0656K0601r430j7174j7119k16
$$ 5189 1664 11671 17440 12094 19728 5022 -12212 -1556 19045 9615 -7559 -24678 -24894
14303b4894J79M861P469J3679p631K273R066R372j011r200J110L12M48n263R5
$$ -24894 -24715 -19854 -12385 1294 -6337 -4064 5002 14374 13363 4163 5273 5585 6033 770 865
14288H65J434J1760K098j4362J4201O592p441K945O149K445J484k717j7372K593
$$ 865 2299 14059 16157 1795 15996 22588 15147 18092 24241 26686 28170 25453 8081 10674
14274A0674J2877j852r675p179M72J8436J2044l401j7558n979J5089p674j337
$$ 10674 23551 21699 12024 4845 5317 23753 35797 32396 14838 8859 23948 16274 14937
14261A4937M111p446r917k412N188P081R420q064R07j607q683J203m78j4570q882
$$ 14937 19048 11602 1685 -727 4461 11542 20962 12898 13805 12198 3515 4718 4240 -10330 -19212
14246a9212L383R543J4770m8p569j910q401K454Q139J2928J715K310o872l967
$$ -19212 -15829 -6286 8484 8436 867 -1043 -9444 -6990 1149 14077 15792 18102 11230 7263
14232G263j765Q084O738l780pn460p472m178o295M567Q367L677N323M932n776
$$ 7263 5498 13582 20320 16540 16533 11073 3601 -577 -6872 -2305 6062 9739 15062 19994 14218
14217A4218p69M200O253m537L98M550J4471Q564j6485j7571Q93O612R619j0278
$$ 14218 13449 17649 23902 19365 19763 24313 38784 47348 30863 13292 14185 20797 30416 20138
14203B0138p617N159j3771j687L960J0793j29m922l268J1056j4874m583j6800
$$ 20138 12521 17680 3909 2222 6182 16975 16846 11924 8656 19712 4838 255 -16545
14190a6545j3566L467K1083K7159M331k583j3308J5780P088Q57M202J6037j4082
$$ -16545 -30111 -26644 -5561 21598 25929 23346 10038 25818 32906 33763 37965 54002 39920
14177C9920j926j87n293k957q712j5436q516M17n343M312J42N241k623o137O782
$$ 39920 37994 37807 32514 29557 20845 5409 -3107 -2690 -8033 -3721 -3579 1662 -961 -7098 -316
14162c16K1607k65o844j7411j0388K2943J6294J0075J816j5796n0K278K2004K0921
$$ -316 21291 21026 14182 -3229 -13617 9326 25620 35695 37511 21715 21665 23943 45947 66868
14148F6868J2966M954K1122L8597L8298O2267J19277J95456L31162N04914L75190
$$ 66868 79834 84788 105910 144507 182805 245072 364349 559805 890967 1395881 1771071
14137A771071k46921n39875l71639j96099j32899p7994m3106k2004k1278m333
$$ 1771071 1524150 984275 612636 416537 283638 205644 162538 140534 119256 114923
14127A14923j0268j3773k3331j2801K032o108l853j5228m193P838n479O81m726
$$ 114923 104655 90882 67551 54750 56782 50674 46821 31593 27400 35238 29759 30440 25714
14114B5714j9644j3975J3016J6732l384Q800R673j8584j4900M827j3293P724J7097
$$ 25714 6070 -7905 5111 21843 18459 27259 36932 18348 3448 8275 -5018 2706 19803
14101A9803Q485o764K826L528J4384p147p130L313J2327j0282k110q01K962J113
$$ 19803 28288 21524 24350 27878 42262 35115 27985 31298 43625 33343 31233 30432 33394 34507
14087C4507j1115m395q706M244K37o348j2192q86N236O854Q190n568J725j906
$$ 34507 23392 18997 10291 14535 14772 8424 -3768 -4654 582 7436 15626 10058 11783 9877
14073I877q64r756m073L380R628p151k029J7406j0460o137Q214J9190O473p843
$$ 9877 9013 -743 -4816 -1436 8192 1041 -988 16418 5958 -179 8035 27225 33698 25855
14059B5855r666n732J2204Q50N890Q032L180j2854M238k1915k2989K018J7114
$$ 25855 16189 10457 22661 23511 29401 37433 40613 27759 31997 10082 -12907 -10889 6225
14046F225P220O673o442j408m224O020K360m085j6386M71J6311M466P815P161
$$ 6225 13445 20118 13676 12268 8044 14064 16424 12339 -4047 -3576 12735 17201 25016 32177
14032C2177k1315j3456L668Q432l264j3870q201r157M179O412P462L116P077Q702
$$ 32177 10862 -2594 1074 9506 6242 -7628 -15829 -24986 -20807 -14395 -6933 -3817 3260 11962
14018A1962J1729M44Q166P522J600k487o338j0934j4640j581m205P994Q630n40
$$ 11962 23691 24135 32301 39823 41423 38936 32598 21664 7024 5443 1238 9232 17862 17322
14004A7322J9o947j3015J6639L870J6223O542m596k85k9093K520Q665m847K0013
$$ 17322 17341 10394 -2621 14018 17888 34111 40653 36057 35772 6679 9199 17864 13017 33030
13990C3030R63j5377m664N497Q617m726n327Q273Q62J629M867p265P811J6574
$$ 33030 33993 18616 13952 19449 28066 23340 18013 26286 27148 28777 33644 26379 34190 50764
13976E0764Q883j1970o347J5129k1439k7376m880K3033K147r189q72Q292m978
$$ 50764 59647 47677 41330 56459 35020 7644 2764 25797 27944 18755 17883 26175 21197
13963B1197j3840j073m512j233N628j7l968J693K507J0157R726J0063p65r574
$$ 21197 7357 6284 1772 539 6167 6150 2182 3875 6382 16539 26265 36328 35563 25989
13949B5989j6776K144L880k695J4944q79j4093n388L292M818o759n762P947J88
$$ 25989 9213 11357 15237 12542 27486 26607 12514 7126 10418 15236 8477 2715 10662 10850
13935A0850J785M304o074J162l976k689l419j2297j4036J4650P932O722j974j1841
$$ 10850 12635 16939 10865 12027 8051 5362 1943 -10354 -24390 -9740 -1808 4914 2940 -8901
13921h901p82J9360K3213J5147P083J348M5589Q0949O3368K5201n4664p9462o1398
$$ -8901 -9683 9677 32890 48037 55120 56468 102057 183006 246374 271575 216911 137449 76051
13908G6051l0563j5342j9394o615p84J0522J4981R511J4833O342j2062j9309j6277
$$ 76051 45488 30146 10752 4137 3353 13875 28856 38367 53200 59542 47480 28171 11894
13895A1894J03Q072N143R225K784n036O29j0666q336j4760j1638R133J3342P661
$$ 11894 11997 20069 25212 34437 37221 32185 32814 22148 13812 -948 -12586 -3453 9889 17550
13881A7550j0892p092K530J5205Q026J025M578P343Q802J4199l19l5011j039q870
$$ 17550 6658 -434 2096 17301 25327 26352 30930 38273 47075 61274 60955 25944 24905 16035
13867A6035L868J5200j260r871j8220N387K1914J2654Q096j3534Q056N239L649
$$ 16035 19903 35103 33843 23972 5752 11139 33053 45707 53803 40269 48325 53564 57213
13854E7213K463N429O721J4943k420m4402m0176j3216J665K7768K1755J945k2004
$$ 57213 59676 65105 71826 86769 84349 39947 -229 -13445 -11780 15988 37743 39688 17684
13841A7684j8173o805J0391J827k2081P488K4974L5699J2380J912l642m391N559
$$ 17684 -489 -7294 3097 4924 -17157 -9669 15305 51004 63384 65296 61654 57263 62822
13828F2822j4038N12P732K077N384o83J5027J2230P994m170N6Q221J0265j60N134
$$ 62822 48784 49296 57028 59105 64489 63806 78833 91063 99057 94887 94943 103164 113429 113269 118403
13813A18403l435j6169m3487o3668k5129q113P730J9335K5647k89J135J2806J0169
$$ 118403 114968 98799 55312 -8356 -33485 -41598 -33868 -14533 11114 10825 11960 24766 34935
13800C4935l721Q51O313m351K407K2274J7327J5542J1325L5906N1183N5351P0437
$$ 34935 31214 32065 38378 34027 36434 58708 76035 91577 102902 138808 189991 245342 315779
13787C15779M6934m4187j00790j23580p2906j1499J4094J4626O631Q351k836j5119
$$ 315779 362713 318526 217736 94156 21250 9751 23845 38471 45102 53453 50617 35498
13775C5498l886J0001Q158M509J0784K258K833J4865J0427M801j1542k059r321
$$ 35498 31612 41613 49771 54280 65064 67322 70155 85020 95447 100248 88706 86647 77326
13762G7326j7180k1534N188L527L0304K2571k577l3265r415l20l461J1966J6613
$$ 77326 60146 38612 43800 47327 77631 100202 97625 64360 54945 54625 51164 63130 79743
13749G9743Q789p160J3205K7601j1310r665J4339n161j4359j2010k4227P13J9754
$$ 79743 88532 81372 94577 122178 110868 101203 115542 110381 96022 84012 59785 60498 80252
13736H0252L1734K2480O238J0168J9555j898j3614k0204q38K7303K0333Q680Q363
$$ 80252 111986 134466 140704 150872 170427 168529 154915 134711 133873 161176 181509 190189 198552
13723A98552j4502q566K3864N4674L5429j0378k5530J2337N2933K3667K5292N2844
$$ 198552 184050 175484 199348 254022 289451 279073 253543 265880 318813 342480 367772 420616
13711D20616L1155m497j6669p786l125l228J6522K4407p65O208K4863J3659M319
$$ 420616 451771 447274 430605 422819 419694 416466 432988 457395 456630 462838 487701 501360 505679
13698E05679L5239O0770O9450O1082P2910N0437K076J0325L6973P6737N4795O3644
$$ 505679 540918 601688 671138 732220 805130 855567 857643 867968 904941 981678 1036473 1100117
13686A100117J41643K24514K30617J91479J52397J50108K12664K87047L24907
$$ 1100117 1241760 1466274 1696891 1888370 2040767 2190875 2403539 2690586 3015493
13677C015493L93101N26324P68841R71141J227958J528634J691782J351858J447835
$$ 3015493 3408594 3934918 4703759 5674900 6902858 8431492 10123274 11475132 12922967
13668A2922967K636782M243531O486177J0331741J7307538L0051772N3445010
$$ 12922967 15559749 19803280 26289457 36621198 53928736 83980508 137425518
13661A37425518R0863158J07847498K817074j13163553r2631457n0344720k7213602
$$ 137425518 228288676 336136174 338953248 225789695 133158238 82813518 55599916
13654E5599916j6149876r997051o541043m496160l157902k199781j523965j179467
$$ 55599916 39450040 29452989 22911946 18415786 15257884 13058103 11534138 10354671
13646A0354671j499199j463060j039822p34215o48366n72586m50546l86236l47390
$$ 10354671 8855472 7392412 6352590 5618375 4970009 4397423 3946877 3560641 3213251
13637C213251l25861k83402j99935r7264o9424j07019j26529j38698j20541j15991
$$ 3213251 2887390 2603988 2404053 2306789 2237365 2130346 2003817 1865119 1744578 1628587
13627A628587j54045j46555r7901k8802k5957m2856n4330o3274n3522m3669l7397
$$ 1628587 1474542 1327987 1230086 1201284 1175327 1132471 1078141 1014867 961345 917676 880279
13616H80279l7914l0668k0466m5853n5447l0000n8374p5524m3562n749O52n031
$$ 880279 842365 811697 791231 745378 689931 659931 601557 526033 482471 476722 477374 472343
13604D72343l0J2373P275j9633k7449j6496m257j289j8980k0773n526lN562j3956
$$ 472343 472313 484686 491961 472328 444879 428383 424126 422837 403857 383084 377558 377555 383117 369161
13590C69161k6455j8981j8329j5004O267o052p185J3741M340Q663p174l5625k7110
$$ 369161 342706 323725 305396 290392 296659 290607 283422 297163 301503 310166 302992 267367 240257
13577B40257r507n573j3191k9387q201K9396J5450O474j0219P28P333J205O478
$$ 240257 230750 225177 211986 182599 174398 203794 219244 225718 215499 216227 223560 224765 231243
13564B31243L279l1122k5429R057Q347N017J320j9791j2774j3186k5825l0656
$$ 231243 234522 203400 177971 187028 195375 200392 201712 181921 169147 155961 130136 99480
13552I9480n603K848J1628J8028k136R409p02M557M981K013k396N817L853P012
$$ 99480 93877 96725 108353 126381 124245 133654 132952 137509 142490 144503 142107 147924 151777 158789
13538A58789J6159K4160R288m973L657o3004m5280n397r572J9864R047J0911r192
$$ 158789 174948 199108 208396 203423 207080 144076 98796 93399 83827 103691 112738 123649 114457
13525A14457n080N870J4036P045l058j3761P560n166k110N96P9J3680O57R711
$$ 114457 109377 115247 129283 136328 133270 119509 127069 121903 119793 120389 120468 134148 134805 144516
13511A44516J6343m518m7883o6525m9141j805j1710Q60K9185K4639J0778k131
$$ 144516 160859 156341 108458 41933 -7208 -9013 -20723 -19863 9322 33961 44739 42608
13499D2608J1241M30L688j2178j050J2672N411k161J013j4592l589K605M814K0778
$$ 42608 53849 54279 57967 45789 44739 57411 62822 60661 61674 47082 43493 46098 50912 71690
13485G1690O069J503m27j537k118j392n663K196j9103q070J9185L2905L4803j922
$$ 71690 77759 79262 78835 77298 75180 73788 68125 70321 51218 43148 62333 95238 130041 128119
13471A28119j6628l2314n5446l8579n829J0112J3075R691J0857O356j4549q881
$$ 128119 111491 79177 23731 -14848 -20677 -10565 2510 12201 23058 29414 14865 5984
13459E984n497K2996J9749J0877k0094j5308J6517M326j6316k128J0313j0390
$$ 5984 487 23483 43232 54109 34015 18707 35224 39550 23234 21106 31419 21029
13447B1029q458m683J6223J093j397O545O131P006K2274j799q297j0521m152J1104
$$ 21029 12571 7888 24111 25204 23807 30352 36483 43489 65763 63964 55667 45146 40994 52098
13433E2098J3460Q148j4502j293j2631l374O807j0585J840K0790o991j2770n320
$$ 52098 65558 73706 59204 57911 45280 41906 48713 38128 39968 60758 53767 40997 35677
13420C5677M480j35j1060P834m775j105R039Q527n392j33l507j0197L98q495o492
$$ 35677 40157 40022 28962 36796 32021 30916 39955 48482 43090 42957 39450 29253 29651 21156 14664
13405A4664j0591J7797J7236k360n211L96J225M929P180j593k584R044j775j7765
$$ 14664 4073 21870 39106 36746 31535 31931 33156 38085 45265 43672 41088 50132 48357 30592
13391C0592j5276r013l997P814J0843J0094o712k4579j4609J6974J6832P448K103
$$ 30592 15316 6303 2306 10120 20963 31057 24345 -234 -14843 2131 18963 26411 28514
13378B8514L293k3229j2424J3433J5239M539N929L946r297p018J6599J3870q101
$$ 28514 31807 8578 -3846 9587 24826 29365 35294 39240 29943 22925 39524 53394 45293
13365D5293j5073J8Q375J4318J2966o043p771l376j0589K153j5474j2710J589
$$ 45293 30220 30238 38613 52931 65897 59854 52083 48707 38118 40271 24797 12087 13676
13352A3676j6799R510K5816J7081P417k1637k3255r171o102L716j195N948O415
$$ 13676 -3123 6387 32203 49284 56701 35064 11809 2638 -3464 252 -943 5005 11420
13339A1420m500j3255J6794N69R18O050M27j0113P893K3013K6126j6644j5782
$$ 11420 6920 -6335 10459 11028 11946 17996 18423 8310 16203 39216 65342 48698 32916
13326C2916j1967o333J736M548J1021k1966k787l404J6163l876j1665M384P095
$$ 32916 20949 14616 16352 20900 31921 9955 7168 3764 19927 16051 4386 8770 15865
13313A5865K909j766j8872j6646N137q254L702M598N309P151J2633P619p669P952
$$ 15865 18774 17008 -1864 -18510 -13373 -21627 -17925 -13327 -8018 -867 11766 19385 11716 19668
13299A9668K275m505K191J320j181J815l02Q294p580j7893J557M022K31M2o320
$$ 19668 21943 17438 19629 20949 19768 21583 21281 29575 21995 4102 5659 9681 9912 9954 3634
13284C634j3155K837O978Q269l096Q803q927n086p954l435Q606N240Q837R976
$$ 3634 -9521 -6684 294 8563 5467 14270 5343 257 -7697 -11132 -2526 2714 11551 21527
13270B1527J053j5740j704j0385L684p903N017K0805L604o798J2083Q408p84P22
$$ 21527 22580 6840 5136 -5249 -1565 -9468 -4451 16354 19958 13160 25243 33651 32867 33589
13256C3589O926j0368q736q780P778O651p482J334P153q934O054O518R507o29
$$ 33589 40515 30147 21411 12631 20409 27060 19578 20912 28065 19131 25185 31703 41210 40581
13242D0581j0024Q120N186k0220p671M382J5557K941j221q219k0567r789J7269
$$ 40581 30557 38677 43863 23643 15972 20354 35911 38852 37631 29412 8845 -944 16325
13229A6325P998M904j7112P58K375N501k59o429m955o776p482m69J2435k570K2836
$$ 16325 24323 29227 12115 12873 15248 20749 20490 14061 9106 2330 -5152 -5621 6814 4244 27080
13214B7080M025r167j2813n241J5577K1856R244M637r201q383l362P566P967N33
$$ 27080 31105 21938 9125 3884 19461 41317 50561 55198 45997 37614 34252 41818 49785 50318
13200E0318J0151j601j1614p169o979r492k994O506J1193p825R778J4186M740
$$ 50318 60469 58868 47254 40085 33106 23614 20620 27126 38319 30494 40272 54458 59198
13187E9198Q233K5038P131n310J2423J5422N3014M9953Q4326J60339K70578M24728
$$ 59198 67431 92469 99600 94290 106713 122135 175149 225102 309428 469767 740345 1165073
13175A165073N21092R1273n00010m80192k87130j50370r1956n4577m3524n0097
$$ 1165073 1686165 1777438 1277428 797236 510106 359736 267780 213203 169679 119582
13165A19582l3050k777N90J0163J145n123j4867p000K2548J0138L1629K639j198
$$ 119582 86532 83755 84345 94508 95653 90530 75663 68663 91211 101349 132978 135617 134419
13152A34419j9813m3623k6164j2183p991q075j162p856l284l34J0069J3103k515
$$ 134419 114606 70983 44819 32636 24645 16570 15408 7552 4268 3934 14003 27106 24591
13139B4591K949L684k618q663k3032r695l36J2419J2477L831r238j5204J1019
$$ 24591 27540 31224 28606 19943 -3089 -12784 -13120 -701 11776 15607 6369 -8835 2184
13126B184q679Q632J4901K246M700l856j2843o209J303k478J2012R547O025K4460
$$ 2184 -6495 2137 17038 19284 23984 20128 7285 1076 2379 -99 11913 21460 27485 51945
13112E1945J6619J7850L1470J3524k2359l2237l2248k2550K522l343J060j664
$$ 51945 68564 86414 117884 131408 109049 76812 44564 22014 24536 21193 22253 20589
13100B0589j242j0935K0771J5887j5689k6018O27J0486J1707m178m632J238N669
$$ 20589 19347 8412 29183 45070 29381 3363 3990 14476 26183 22005 17373 18611 24280
13087B4280J7663l179l338j1151j1325j4275j1037K316%J2669J8645K482K356
$$ 24280 41943 38764 35426 24275 12950 -1325 -12362 -10046 -10046 2623 21268 23750 26106
13074B6106j5208o468l916n995J550o997J2503R160j0033Q289J1648M503k609
$$ 26106 10898 4430 514 -5481 -3931 -10928 1575 10735 702 8991 20639 25142 22533
13061B2533p571Q082L292j531k280p696L17p126j434K477l660O350Q329p632j9700
$$ 22533 14962 23044 26336 24805 22525 14829 15146 8020 6586 9063 5403 11753 20082 12450 -7250
13046g250J5869J3905J2228k74J653K99j4665L450l938k0970n198P358n968O223
$$ -7250 8619 22524 34752 34478 36131 36430 21765 25215 21277 307 -4891 2467 -3501 2722
13032B722J6082o050J583O874j690j447j3740j2404O768J6993Q517l834n296L607
$$ 2722 18804 12754 14337 21211 19521 18074 4334 -8070 -1302 15691 24208 20374 15078 18685
13018A8685q065j5917J0398R611N283q362r067N705m753j1783P095N616J3688
$$ 18685 10620 -5297 5101 14712 19995 11633 2566 8271 3518 -8265 -1170 4446 18134
13005A8134R564J5835R544j6333j8276j9123k435N610k44r583n101J1998N744
$$ 18134 27698 43533 53077 36744 18468 -655 -3090 2520 2276 -7307 -12408 -410 5334
12992E334j4637J2291N072q587r12p915k696k314M936J4192O025Q79j8456j2484
$$ 5334 -9303 2988 8060 -527 -1439 -9354 -12050 -14364 -9428 4764 10789 11668 -6788 -19272
12978a9272N753N624J223R555J939M068O380M292J1848P688j9674r616L430N039
$$ -19272 -13519 -7895 -6672 2883 4822 8890 15270 19562 31410 39098 19424 9808 13238 18277
12964A8277l300q557J899j366N206K6072J042k5118m465K451j340O028J4861M882
$$ 18277 14977 6420 8319 6953 12159 38231 39273 14155 9690 12141 10801 16829 31690 36572
12950C6572j140k710j2011r082M059p957m517K531j3520K432J8590J5767L355
$$ 36572 35432 32722 20711 11629 15688 7731 3214 5745 -7775 -5343 13247 29014 32369
12937C2369m946k1303q688P944J3493J5050M334K937j3598q934K951O534J053
$$ 32369 27423 6120 -2568 5376 18869 33919 38253 41190 27592 18658 21609 28143 29196
12924B9196L271J6048M021r993j1360k1492j8453K738p523K4066K2769j3118j1151
$$ 29196 32467 48515 52536 42543 31183 9691 -8762 -6024 -13547 10519 33288 20170 9019
12911I019R567L508j0725k0050k068K2448J0759N906j1801j1684J983r25o835
$$ 9019 18586 22094 11369 -8681 -10749 11699 22458 28364 16563 4879 6862 5937 -898
12898h98J562J1300R877j1931l605r474j8079O3O633l492J0749O125n22O557O337
$$ -898 664 11964 21841 9910 6305 -3169 -21248 -21185 -14552 -18044 -7295 -1170 -1692 4865 11202
12883A1202p179q752q681m65J5550N362P451N707j192j3798p965m099p575J3474
$$ 11202 4023 -4729 -13410 -13875 1675 7037 14488 20195 19003 5205 -2760 -6859 -14434 -960
12869i60J638L016m473q220R33Q853J0563P57k377M290L486K850q769k0274l425
$$ -960 678 3694 -779 -8999 -8066 787 11350 12107 9730 14020 17506 20356 11587 -8687 -12112
12854a2112K1235J386L740J1180M201p161M098Q400j0533n590k4246n968j191
$$ -12112 9123 10509 14249 25429 29630 22469 26567 34967 24434 18844 -5402 -11370 -12561
12841a2561J0127K5506k407j2497j1103k1691j754J6336J1272J4086M078l330
$$ -12561 -2434 23072 20665 8168 -2935 -24626 -26380 -10044 1228 15314 19392 16062
12829A6062j1573j1575l176J2366L067o851l145K042j4300P258K835o440N195
$$ 16062 4489 -7086 -10262 2104 5171 -1680 -4825 -2783 -17083 -9825 -6990 -13430 -8235
12816h235M346n390p541P816K509J3687J1280j5269q341N530M728r28L769j0981
$$ -8235 -3889 -9279 -16820 -9004 -6495 7192 18472 3203 -5138 392 5120 4192 7961 -3020
12802c020o009M143J1329p211J89K681m614J2530o224N290k260N984K617r150
$$ -3020 -9029 -4886 6443 -768 -579 2102 -2512 10018 3794 9084 6824 12808 15425 6275
12788F275l522J808o004N437n646K920M563j060o767j4503J0851J417K720r68
$$ 6275 2753 4561 -1443 3994 -1652 1268 5831 4771 -1996 -16499 -5648 -4231 -1511 -2479
12774b479M89J6990j642P034j6305j7462p25j4679L758J8369N54j5287J9280J6360
$$ -2479 -1990 15000 13358 20392 4087 -13375 -14100 -28779 -25021 -6652 -6098 -21385 -2105 14255
12760A4255R937j932r659R869m877k311M027j054q40N33K064r099K75P0r645r646
$$ 14255 24192 22260 12601 22470 17593 15282 19309 18255 17415 17948 20012 10913 11188 11258 1613 -8033
12744h033j0744N486m806k879J0117J2168j708M019j3619j1458L399J7878L945
$$ -8033 -18777 -13291 -18097 -20976 -10859 1309 -399 3620 -9999 -21457 -18058 -180 3765
12731C765J664Q18L302q435J866m34l517j3668m77N645J0361O645n348k420o337
$$ 3765 5429 6247 9549 1114 2980 2546 -971 -14639 -15116 -9471 890 7535 2187 -233 -6570
12716f570j631P427J1101Q700j1990l083p758p358R842p611P70J248O398M110
$$ -6570 -8201 -774 10327 19027 7037 3954 -3804 -11162 -1320 -8931 -8161 -6913 -515 3595
12702C595l592K717O922P384R805R278n626r671N840n926P6j3377N68R194l95
$$ 3595 3 2720 9642 17026 26831 36109 30483 20812 26652 20726 20802 7425 7993 17187 16792
12687A6792j5815k0762J5789J3983j4395m800m478O523L291m323j618O55l836
$$ 16792 977 -19785 -3996 9987 -4408 -9208 -13686 -7163 -3872 -8195 -9813 -9158 -12994
12674a2994P988l731J3872Q078j138q033r7N450j558N025J0336k617j1420o420
$$ -12994 -5006 -8737 5135 13213 12075 4042 3945 9395 7837 12862 23198 20581 9161 2741
12660B741N895q965j5069Q734n00m222N158n628n314P09J1231J2498O809r310
$$ 2741 8636 -329 -15398 -6664 -7164 -11386 -6228 -11856 -17170 -16461 -5230 7268 14077 4767
12646D767n918j2433q706P879J2896P576n132J116J0113o909n876q944J1136o290
$$ 4767 -1151 -13584 -22290 -14411 -1515 6061 929 2045 12158 5249 -627 -9571 1565 -4725
12632d725p081j0244q862P350K4850J5957O99m734q995q947L464p347l848P228
$$ -4725 -11806 -22050 -30912 -23562 1288 17245 17944 13210 4215 -4732 -1268 -8615 -12463 -5235
12618e235k333n765k297K2087j248O700L990J332q969J6291l902j2547j528L666
$$ -5235 -7568 -13333 -15630 6457 5209 11909 15899 17231 8262 24553 20651 8104 6576 10242
12604A0242j6770l422j012l064Q576n053Q351K7287Q200j7680j0963j5056P529
$$ 10242 -6528 -9950 -10962 -14026 -5450 -10503 -2152 25135 33335 15655 4692 -10364 -2835
12591b835N749l692j6896p010O80J1948J1597J1775M395j7929m312L099N391N41
$$ -2835 2914 -778 -17674 -24684 -24004 -12056 -459 11316 15711 -2218 -6530 -3431 1960 2501
12577B501r180m6J2875J1693J5681k324q434O697M426j8068q569M892j0791k1758
$$ 2501 -6679 -6725 6150 17843 33524 31200 22766 29463 33889 15821 7252 12144 1353 -20405
12563b0405l427N295j159k77K5166N044n369K861L718n703l182q331p709J5768
$$ -20405 -23832 -18537 -19696 -19973 5193 10237 4868 7729 11447 5744 2562 -5769 -13478 2290
12549B290O670p092N582Q877O617k309p459j1517L548P787M321m508j7532j503
$$ 2290 8960 1868 7450 16327 22944 20635 13176 1659 5207 12994 17315 12807 -4725 -6228
12535f228J1619J721J088j5259R897r062P223J9368J0845k2778J439J0806O952
$$ -6228 5391 7112 8200 -7059 2838 -6224 999 20367 31212 8434 9873 20679 27631
12522B7631j2576j155J981o736r323q89L889R637J696K812m28j897L963o801j6244
$$ 27631 15055 13900 15881 9145 -178 -1067 2822 12459 14155 16967 16539 14642 18605 11804 -4440
12507d440L24k558J416J158M852L967j171l716r027j747J124J3772J6305j2103
$$ -4440 -4116 -6674 -5258 -4100 752 4719 3548 -168 -9195 -10942 -9818 3954 20259 8156
12493H156J0435p775j2718K659J4608J0149j2495j8571J4074J8415K2402P487
$$ 8156 18591 10816 -1902 757 15365 25514 13019 -5552 8522 26937 49339 56826
12481E6826q573j6720r301j3428o572j4025p066k509J0391Q062m133J530l813
$$ 56826 48253 31533 22232 8804 2232 -11793 -18859 -21368 -10977 -2915 -7048 -5518 -9331
12468i331K865O446P896J1297O280r919k249o727j0196j1842J2395k657J1487
$$ -9331 -6466 -20 7876 19173 25453 15534 13285 6558 -3638 -15480 -3085 -5742 5745
12455E745j826k446m576j7274M796m609m374K8280J3360K0783O034k994o479k7209
$$ 5745 3919 1473 -3103 -20377 -15581 -20190 -24564 3716 17076 37859 43893 40899 34420 7211
12441G211j8267j360R084N902M647q702p839O220J3703M168L225k3217j4853J8226
$$ 7211 -11056 -12416 -3332 2570 7217 -1485 -9324 -3104 10599 14767 17992 -5225 -20078 -1852
12427a852L615j1284p579J8723Q533n517o574q737k909k236K730l88K0515J6966
$$ -1852 1763 -9521 -17100 1623 10156 4639 -1935 -10672 -13581 -15817 -13087 -13475 7040 24006
12413B4006n234K23N4j8404P037K171k913q359N776o05o526L855P092p282J3012
$$ 24006 18772 18995 19049 645 7682 9853 6940 -1419 4357 3752 -2774 1081 8173 891 13903
12398A3903k877q438q344q323J8409J3375j3299Q104J434P65n243o230K60r462
$$ 13903 11026 2588 -5756 -14079 4330 17705 4406 12510 13944 14709 9466 3236 3496 -5966
12384e966r366M907J3620o349j5266J7326N386n65R822n691m839m022J522R480
$$ -5966 -15332 -10425 3195 -3154 -18420 -1094 4292 3727 13549 7858 3019 -1003 519 9999
12370I999R69m754j368j1760K451m68j3914J3168J033k305P846J3827j0934n857
$$ 9999 10968 6214 4846 -6914 -4463 -4931 -18845 -5677 -4644 -6949 897 14724 3790 -2067
12356b067N667N982m494L237M938Q756j260k52j9721j2480J442P401J1311q83
$$ -2067 3600 9582 5088 8325 13263 22019 20759 20507 786 -11694 -10252 -2851 8460 7577
12342G577j6557j0584j171k268R608l8r422o507m768J3674N87J0914J5735q945
$$ 7577 -8980 -19564 -20735 -23003 -13395 -13433 -22855 -29362 -34130 -20456 -19869 -8955 6780 -2165
12328b165m691m942k981m291R117J3173q158m27l409M127N209R737j6839k236
$$ -2165 -6856 -11798 -14779 -19070 -9953 3220 -4938 -5365 -8774 -4647 562 10299 -6540 -8776
12314h776J0031M491j056p867r52N97o161j159k653O026Q055o491K74l829j2108
$$ -8776 1255 5746 4690 -3177 -4129 -3532 -9693 -10852 -13505 -7479 576 -5915 -5641 -9470 -21578
12299b1578R819J3419p12l465m049M566O966Q95J0228N300R416N181j9975r059
$$ -21578 -11759 1660 948 -2517 -6566 -2000 4966 5861 16089 21389 30805 35986 16011 6952
12285F952q786r739M571L170O830n383O512N58k144m869j1833l417O883L207n059
$$ 6952 -1834 -11573 -7002 -3832 2998 -2385 4127 4685 2541 -2328 -14161 -17578 -10695 -7488 -12547
12270a2547P701j87j9284p968J4434O266j955K255j978P864j0475J3600L930K442
$$ -12547 -4846 -5033 -24317 -32285 -17851 -11585 -13540 -11285 -13263 -5399 -15874 -2274 1656 4098
12256D098M527J0457J3308r352j281K392k770q40k21j3494j2214O095l939k886
$$ 4098 8625 19082 32390 23038 21757 24149 21379 20539 20318 6824 -5390 705 -3234 -6120
12242f120P745N681j6663j4898J2735J0625Q45q254J0245N347j0758l583R252
$$ -6120 1625 7306 -9357 -24255 -11520 -895 -50 -8304 1941 7288 -3470 -7053 2199
12229B199P237j7906P452J689N176r403J0464J3813j1890m966j7162P953J1842
$$ 2199 9436 -8470 -1018 671 5847 -3556 6908 20721 8831 3865 -13297 -5344 6498
12216F498J5243J6276p159j6760j2856k896N025M270J431M617j0443Q677r729
$$ 6498 21741 38017 30858 14098 1242 -1654 3371 7641 9072 13689 3246 11923 2194
12203B194k0746K568M075P909J1334o56j2800q315j882J4363P514j1392k510O476
$$ 2194 -18552 -15984 -11909 -4000 7334 6678 -6122 -14437 -16319 -1956 5558 -5834 -8344 -1868
12189a868l577N788n30p658O601K261J3976J314j1634M08J3667L256p687J771
$$ -1868 -5445 343 -187 -7845 -1244 1017 14993 16307 4673 5081 18748 22004 14317 16088
12175A6088L175Lr694J294O355j3953k6033p571J751J1462L0116K0380M95J0032
$$ 16088 19263 19266 9572 10866 17221 3268 -22765 -30336 -28585 -17123 12993 33373 33868 43900
12161D3900m229j7573m027J039K865q303k336q974j0621Q22L543P542J1513q691
$$ 43900 39671 22098 18071 19110 21975 13672 11336 2362 -8259 -7437 -3894 3648 15161 6470
12147F470r815N289J49q376L087k644R173J7543m085j898J098q779r255o009n727
$$ 6470 -3345 1944 2093 -6283 -3196 -5840 3333 20876 16791 14893 15991 7212 -2043 -8052 -13779
12132a3779l75J1190J476m089o023J328p889r988J3402P947l220j129J1931k158
$$ -13779 -14154 -2964 -1488 -5577 -11600 -10272 -18161 -28149 -14747 -6800 -10020 -11149 782 -1376
12118a376j4340L313K1265J975l992K90j9322k006R415o340l020R006O049R096
$$ -1376 -15716 -12403 8862 10837 6845 7135 -12187 -14193 -4778 -11118 -14138 -5132 917 10013
12104A0013K275j0942K450M22n324L686j2903j4790J1742P373J7524J3014O205
$$ 10013 12288 1346 3796 4218 -1106 2580 -10323 -25113 -13371 -5998 11526 24540 30745
12091C0745q852k1069k1532R219K1732R784J994q62l0349p179J52k293J2265M589
$$ 30745 21893 824 -20708 -11489 10243 20027 22021 21159 -9190 -16369 -16217 -18510 -6245 -1656
12077a656m788o861l977J808k768m22J1826P500M498J59M484m124J7490J921K630
$$ -1656 -6444 -13305 -17282 -15474 -18242 -18664 -6838 662 5160 5319 9803 5679 23169 25090 27720
12062B7720P232j9161k0797k0193J0244R588Q185q756l082L361j4543l520J3105
$$ 27720 34952 15791 -5006 -25199 -14955 -5367 2818 -5938 -9020 -5659 -20202 -23722 -10617
12049a0617l879O820P434J3021J1691N108j1458m034J5L115p019r041O567j3784
$$ -10617 -14496 -7676 -242 12779 24470 29578 18120 14086 14101 17216 10197 1156 7723 -6061
12035f061n390j0546m002o710M694J5096M733j370j1281O773J0363R432J0524
$$ -6061 -11451 -21997 -25999 -32709 -28015 -12919 -8186 -9556 -20837 -14064 -3701 5731 16255
12022A6255N495K173K459l353N626q737j9378j4644m995L981J2709P435q911p739
$$ 16255 21750 23923 26382 23029 28655 19918 540 -14104 -19099 -15118 -2409 5026 -3885 -11624
12008a1624L284R508l626q3o100m508L306J125j0847J2042Q347l567N94j3735
$$ -11624 -8340 1168 -2458 -2541 -8641 -13149 -9843 -8718 -19565 -7523 824 -2743 -2149 -15884
11994a5884r0m200j0850N810K3695N328K615j40o249p107j837O128Q623j1219
$$ -15884 -15974 -20174 -31024 -25214 -1519 3809 6424 6284 35 -7072 -8909 -2781 5842 -5377
11980e377n066M821Q576j6298k4713k470J6459K0985J2816j3821j2958J4581J2499
$$ -5377 -10443 -5622 2954 -13344 -38057 -40527 -24068 -3083 9733 -4088 -17046 -2465 10034
11967A0034P68k041k414N835L816J461k516Q500j599r995k722m863Q171k498p346
$$ 10034 10802 8761 6347 12182 15998 17459 14943 23443 21844 11849 9127 4264 12435 9937 2591
11952B591m535r31M162K301O73k282q182j6081J0522n982m228o358R475J204N298
$$ 2591 -1944 -2875 1287 3588 4261 1979 -6203 -22284 -11762 -17744 -21972 -28330 -18855 -17651 -12353
11937a2353p873J0948R901R605L444j936m476j4933j1571J1852M152N263q15q543
$$ -12353 -20226 -9278 623 10228 13672 11736 7260 -7673 -19244 -7392 -3240 2023 1208 -7335
11923g335j1698Q52M103J418L988N935Q12L382L559q435m303J6411j695k901R724
$$ -7335 -19033 -18181 -14078 -12660 -8672 -2737 -1925 1457 5016 -3419 -7722 8689 6994 4093 13817
11908A3817l424k404N220l199l341l951K969O727l676R084l585j531j441j8939
$$ 13817 10393 7989 13209 10010 6669 2718 5687 12414 8738 17822 14237 12706 11265 -7674
11894g674j2246J4402N047r176l688R489Q243l16P318k012k876j769o943n077
$$ -7674 -19920 -5518 -471 -9647 -13335 -3846 4397 4081 11399 9387 6511 4742 -2201 -7278
11880g278O896L453O83K972n258p764R845R74l915j422J3675O486n257p698j8179
$$ -7278 -382 3071 3754 6726 1468 -6296 3549 4523 608 -814 12861 19347 14090 6392 -11787
11865a1787q170M430J6304Q297p937j1417J8465m586j5427q953J64O142j096N16
$$ -11787 -19957 -15527 777 9074 1137 -10280 8185 3599 -11828 -20781 -20617 -14475 -15571 -15055
11851a5055J0423N070P330K809J113r202j3727r557Q103j302N218R565j577J292
$$ -15055 -4632 438 7768 10577 11690 2488 -11239 -20796 -12693 -13995 -8777 788 -789 503
11837E03O03J482k966M701O578p759R41J5292L036m488m91l69j1528l325o256
$$ 503 1106 2588 -378 4323 10901 3142 4083 19375 22411 17923 17432 17063 5535 2210 -4046
11822d046k3471N446l202K114j988J0564R039P859j52O327j0891k57j1012q052
$$ -4046 -27517 -22071 -25273 -23159 -25147 -14583 -5544 2315 2163 8490 -2401 -2658 -13670 -21722
11808b1722o283n072J5359J4301J0380K0593O862l188k159N705M613q719k3026
$$ -21722 -28005 -33077 -17718 -3417 6963 27556 34418 31230 29071 34776 39389 30670 7644
11795G644n543M142n935k23o042o832J8491J2859j4532j2034k007j8383k533J1364
$$ 7644 2101 6243 308 85 -5957 -12789 5702 18561 4029 -8005 -10012 -28395 -30928 -19564
11781a9564J2665j0328n187P734R124k17J266O292K5385K1646j079j3075q304
$$ -19564 -6899 -17227 -22414 -14680 -5556 -5773 -4507 1785 27170 48816 47737 34662 26358
11768B6358j1968J787k071n445Q775M753p153l402n100m981M190K22K477M270
$$ 26358 14390 16177 14106 8661 17436 22189 15036 11634 6534 1553 5743 5965 8442 12712
11754A2712j73j0446j8272k352P613Q514M374J1455m101J655L634p131K114K276
$$ 12712 12539 2093 -16179 -18531 -10918 -2404 1970 13425 9324 10979 14613 7482 9596 11872
11740A1872k497O089n292r648N011N866R392j7392j0953k822K255R678K410j6988
$$ 11872 9375 15464 10172 524 5535 11401 20793 3401 -7552 -10374 -8119 1559 3969 -13019
11726a3019K894j393o362j227J2141Q812L830R762L108q551k1728j905L818j2321
$$ -13019 -10125 -11518 -17880 -19107 -6966 1846 5676 15438 18546 9995 -11733 -13638 -9820 -22141
11712b2141l31Q301l933L417K909m305J208L289n628J694m862j785J3866J7589
$$ -22141 -22472 -14171 -18104 -14687 -11778 -16083 -14875 -11586 -17214 -15520 -20382 -22167 -8301 9288
11698I288K978L688j158R374r044j7115j703m804K351m502j3117P029O795J1884
$$ 9288 12266 15954 14796 24170 15126 -1989 -3692 -8496 -6145 -10647 -23764 -16735 -9940 1944
11684A944l520o111l82L028K350K253P981l913n236k171Q694N035o422j1335q545
$$ 1944 -1576 -7687 -8069 -5041 -2691 -438 7543 3630 -1606 -3777 4917 9952 3530 -7805 -16350
11669a6350N159j1674J2977J5224j0869l575K939J0062n095Q824K845j0221N628
$$ -16350 -11191 -22865 -9888 5336 -5533 -9108 -6169 3893 -1202 7622 10467 246 5874
11656E874K100J9151N056j7830l507R609N48j7449j8389J4947J4458n756r847
$$ 5874 7974 27125 32181 14351 10844 20453 21001 3552 -14837 110 14568 8812 -1035
11643a035j242R759j0729k3799q93J0911m065M065L898K45j281N402L546J2661
$$ -1035 -2277 7482 -3247 -27046 -27939 -17028 -21093 -17028 -13130 -12885 -14166 -8764 -5218 7443
11629G443o168o788N558n57O801M242m942j5010q848o064J2658K9209j160p777
$$ 7443 1275 -5513 45 -512 6289 10531 5589 -9421 -18269 -24333 -11675 17534 16374 8597
11615H597j5032k969L036J0694N520r86M014j5363Q129J3487n430M860K462j2451
$$ 8597 -6435 -9404 -6368 4326 9846 8860 12874 -2489 5640 19127 13697 18557 21019 8568
11601H568m775n76p011J7497J4604j3842j2073p357q69n128J3604p42j6706J9395
$$ 8568 3793 3217 -3794 13703 28307 14465 2392 -4965 -5834 -10962 2642 1900 -14806 4589
11587D589J2450m758P343L88m732k266j4670j5679J822O550J5406k641M368L780
$$ 4589 17039 12281 19624 20012 15280 13014 -1656 -17335 -15513 -8963 6443 3802 8170 11950
11573A1950Q795k609j3399p285J9145J7709K33j0588o212k2302j6429q507j674
$$ 11950 20745 18136 4737 -2548 16597 34306 34539 23951 17739 -4563 -20992 -29499 -31173
11560c1173J5900J3718j046M939j0452m712l007j716K764l976P217O19j0142J7684
$$ -31173 -15273 -1555 -2601 2338 -8114 -12826 -15833 -17549 -14785 -18761 -11544 -10925 -21067 -3383
11546c383Q609o021l104m290M104O411n539n706o851N176P350k171j5923O859
$$ -3383 5226 -795 -3899 -8189 -4085 2326 -3213 -8919 -15770 -10594 -3244 -5415 -21338 -14479
11532a4479K1488O157o521p697n404o110L273M782N225r167R96J0104l808j4834
$$ -14479 7009 13166 6645 -1052 -6456 -12566 -9293 -4511 714 -8453 -7457 2647 -1161 -15995
11518a5995P813m256q632o109J6888J0231m555Q165R460j3245m724J050K408o223
$$ -15995 -8182 -12438 -21070 -27179 -10291 -60 -4615 3550 13010 -235 -4959 -3909 -1501 -7724
11504g724j5135K958O673J6184K722J1209l699j4939n846R705j3598P301J9339
$$ -7724 -22859 -19901 -13228 2956 5678 16887 13188 -1751 -7597 2108 -11490 -4189 15150
11491A5150J0205k203j2320j6921r729J6508R480l749j4043R173l135o61m691
$$ 15150 25355 23152 10832 -6089 -15818 690 10170 6421 -7622 1551 -1584 -2245 -6936
11478f936R314O097k6926n869K4183L899Q425l162j1168m809J830n408m316j135
$$ -6936 2378 8475 -18451 -24320 -137 3762 12187 9025 -2143 -6952 -5122 -10530 -14846 -15981
11464a5981j0171M760R341k872K884J1344P545j5786L928Q509P918j691r041k681
$$ -15981 -26152 -21392 -12051 -14923 -12039 -695 6850 -8936 -5008 3501 11419 9728 687 -1994
11450a994q526r500P759L876k914m155j1875L369q61M893n090k384P024j624K094
$$ -1994 -10520 -20020 -12261 -8385 -11299 -15454 -27329 -23960 -24821 -19928 -25018 -27402 -20378 -22002 -19908
11435a9908j492N012O236p868L922j937k220o768J2617J3465M684m813n491m41
$$ -19908 -21400 -16388 -10152 -18020 -14098 -16035 -18255 -25023 -12406 1059 5743 930 -4561 -5002
11421e002Q582r264j2337P407J985K817l237o879P230M137j4365K389J9816p510
$$ -5002 3580 -5684 -18021 -10614 -8629 -5812 -9049 -15928 -8698 -4561 -18926 -16537 3279 -4231
11407d231o504n824J791M956n389J1606l813N439L941J0523P294r351J0481o250
$$ -4231 -10735 -16559 -14768 -9812 -15201 -3595 -7408 -1969 1972 12495 19789 10438 20919 14669
11393A4669j5848j663J5079j960k304m616m769n511n664m339J2308J0719j7600
$$ 14669 -1179 -2842 12237 10277 7973 3357 -1412 -6923 -12587 -16926 -4618 6101 -11499
11380a1499J2433K48N209N032O66j2916P968R595p431p020j0265p226m855L364
$$ -11499 934 1182 6391 11423 12089 -827 7141 16736 9305 2285 -7980 -15206 -20061 -16697
11366a6697j327K0270J8374m51j563n060k3932K810p05r41M542L784P393J3569
$$ -16697 -18024 2246 20620 20169 18606 13546 -10386 -7576 -8281 -9222 -4680 -896 6497 20066
11352B0066N708k794q950p11J2332n242j6751j7580J876j081K82J2730j564J0653
$$ 20066 25774 22980 14030 13319 25651 20409 3658 -13922 -12046 -13127 -12845 -115 -1679 8974
11338H974l348j810j5164j3726J1776l05N292Q299K923J039q134L63J0533j6085
$$ 8974 5626 3816 -11348 -25074 -13298 -13603 -8311 -12 2911 3950 -4184 -3821 6712 -9373
11324i373j6362j6310Q870P129K4180J3630p640j1232K81j1722O621J0775J0340
$$ -9373 -25735 -42045 -33175 -26046 -1866 11764 4124 -7108 -6827 -18549 -11928 -1153 9187
11311I187J2478M761p520r369J688j422m964M111J4416o462o794j1157l398o344
$$ 9187 21665 26426 18906 9537 11225 9803 4839 8950 23366 16904 10110 -1047 -4445 -10789
11297a0789R236J0760j80Q972l553J78l265M339j821j0826k72J2172j0678K365
$$ -10789 -1553 9207 9027 17999 14446 14624 11359 15698 13877 3051 2779 14951 4273 6638
11283F638J1891p28o455j2930j077P764n884j4306J289j658p628J4317K930O567
$$ 6638 18529 17801 11346 -1584 -2661 5103 -781 -15087 -13798 -15456 -23084 -8767 -5837 730
11269G30r656L15J1164O373r08k574j0997j573k885L955J3306J0965M838j556
$$ 730 -8926 -8611 2553 8926 8018 5444 -5553 -7126 -10011 -6056 7250 18215 23053 21497
11255B1497m14o167j4362o19P095o642O625J2787o786j0094q770P804J5393M212
$$ 21497 21083 14916 554 -65 7030 388 7013 19800 13014 2920 -5850 1954 17347 21559
11241B1559n474j1468o130N13m085n771q721R287M724j081j1837l391m039q528
$$ 21559 16085 4617 -1513 -1000 -5085 -10856 -19577 -10290 -5566 -6647 -18484 -21875 -25914 -34442
11227c4442O241J5151O707L390L240M748J6144L059j4176P495l562O451j0398
$$ -34442 -28201 -13050 -6343 -2953 287 5035 21179 24238 10062 17557 13995 20446 10048
11214A0048j9568m684k74J672J1412N908k444p220n346p977j525M110l983Q025
$$ 10048 -9520 -14204 -14478 -12806 -1394 4514 2070 -5150 -10496 -18473 -19998 -15888 -19871 -11846
11200a1846Q007l079K783R347j968o80N816R067N217j9878j1541j4993n138J1341
$$ -11846 -3839 -6918 -4135 5212 3244 2564 8380 17447 22664 2786 -8755 -23748 -28886 -17545
11186a7545J2277J4656P21o378K580j197q187j250J8193M50r412n525M057N567
$$ -17545 -5268 9388 10109 3731 6311 5114 -3073 -4323 13870 14320 4908 -617 3440 9007
11172I007R906O094p097o174m494l500J2884N057q004M94o033k965J133J206j3119
$$ 9007 18913 25007 17910 11736 7242 3742 16626 21683 13679 14173 8140 5175 6308 7514 -5605
11157e605o522J7017R738k064L661P719k986n477q89J2224n097j674k3257o742
$$ -5605 -12127 4890 14628 12564 16225 23944 20958 15481 14592 26816 21719 20045 -3212 -9954
11143i954j947l612L987M153J3173p756j897M272N5O294J4550k899p583p857j1530
$$ -9954 -11901 -15513 -11526 -7373 5800 -1956 -3853 419 474 6768 21318 18419 10836 2979 -8551
11128h551J8167N520j383J109j1169l44j2153J205j083p44R002J0032r165l958
$$ -8551 9616 15136 13753 14862 3693 3349 -8804 -7599 -8682 -9426 -424 9608 443 -3515
11114c515J4354Q427j0282k353k052R672j104j105j4833o398J2931O075l950l8
$$ -3515 10839 19266 8984 6631 4579 14251 13147 12042 -2791 -9189 3742 9817 5867 5829
11100E829l783j0188O314L578k747j3699L493o652Q430L628k641r232j444L2101
$$ 5829 2046 -8142 -1828 1750 -997 -14696 -11203 -17855 -9425 -5797 -8438 -17670 -19114 12987
11086A2987J0895k0313o169J0453j5412J054Q788j4742n023J8136p11q868l908
$$ 12987 23882 3569 -2600 7853 -7559 -6505 2283 -12459 -17482 654 -57 -8925 -12833
11073a2833j3179j3862K642J6226J0521p65J456j2986M933J4470K412K830M548
$$ -12833 -26012 -39874 -37232 -21006 -10485 -11250 -9794 -22780 -17847 -3377 -965 1865 6413
11060F413K844J236p823r943l278j3623l977J3477Q206J0993K506Q915j806j5574
$$ 6413 9257 10493 2670 -7273 -10551 -24174 -28151 -14674 -6468 4525 7031 15946 14140 -1434
11046a434J200N673K800K598j0476j4883j0842l896j827M269j576k875L0316O697
$$ -1434 -234 5439 8239 10837 361 -14522 -25364 -29260 -31087 -26818 -28394 -31269 -953 5744
11032E744J1210p548r838q143j0615j600K4435M360j330O547n311J0505N112o76
$$ 5744 16954 9406 -432 -8575 -19190 -20790 3645 8005 6675 13222 7911 18416 23528 22852
11018B2852N84j110j1269N099N601q242M275l000k3723j5661J2008J7470k903
$$ 22852 23436 22326 11057 16156 21757 13515 17790 14790 -8933 -24594 -12586 4884 1981
11005A981R176K820j3659q393l083N533Q503q09Q515O032j792j727n311J20j2458
$$ 1981 11157 13977 318 -8075 -11158 -5625 2878 2069 10584 16616 14824 13097 7786 7906 -4552
10990d552N325J122L885m065L417p762Q403N260p076m393Q488j3261o291J1548
$$ -4552 773 1895 5780 1715 5132 -2630 5773 11033 3957 -436 8052 -5209 -11500 48
10976D8Q756q106m991l391m779n931M120Q991J2846M249n63j6065j2168N143R141
$$ 48 8804 698 -4293 -7684 -12463 -18394 -14274 -5283 7563 11812 11249 -4816 -16984 -11841 -2700
10961b700n34j7210J0165L498p85M131o018o965K363P823J6296R977K939k158
$$ -2700 -3234 -20444 -10279 -6781 -7566 -3435 -9453 -16418 -14055 -6232 10064 20041 22980 20822
10947B0822j963J5538N553k7515j1740N901p753M650K45k379L373L464o915j1689
$$ 20822 18859 34397 39950 12435 695 6596 -1157 3493 3738 1359 4732 8196 1281 -10408
10933a0408K660r138o488n340J3779K1357K150p115J551R254j8767m266j049P758
$$ -10408 -7748 -16886 -23374 -28714 -14935 6422 8572 1457 3008 12262 -6505 -10771 -11820 -4062
10919d062l65r073k141L485R475m175o383j163l429O599R340J0324L033n643m025
$$ -4062 -4427 -13500 -15641 -12156 -2681 -6856 -13239 -14402 -17831 -11232 -1892 8432 11465 5822 1797
10904A797J014P076j1793j6878o437K796O491O48j3766k581k591m935J424O877
$$ 1797 2811 9887 -1906 -18784 -25221 -22425 -15934 -15286 -29052 -31633 -34224 -39159 -37735 -30858
10890c0858M147P537L333J4099J5441j4070k4511M663O712M869r09N431Q649J0363
$$ -30858 -26711 -19174 -15841 -1742 13699 -371 -24882 -20219 -13507 -8638 -9547 -4116 4533 14896
10876A4896o659j3751N265p530j1149J1622l929J025o777n789m19P525J4419O961
$$ 14896 8237 -5514 -249 -7779 -18928 -7306 -11235 -10210 -16987 -22776 -23195 -15670 -1251 5710
10862E710K517j0507R015M520J4019M823j1688o196P805N680j434o193r647o690
$$ 5710 8227 -2280 6735 11255 25274 30097 18409 12213 20018 25698 24264 18071 8424 1734
10848A734j820J2274j0136j8306l120j5895J8678p367m882R459J5016q939j534
$$ 1734 -86 12188 2052 -16254 -19374 -35269 -16591 -23958 -28840 -19381 -4365 -13304 -14838
10835a4838Q383n182j1272K05k0134m753L2975K0314J2785j0527j2702L816p645
$$ -14838 -6455 -11637 -22909 -22704 -42838 -47591 -14616 5698 18483 7956 -4746 -930 -8575
10822h575q854J1221J160N46n803k314J0802O967k647K48P24N313O106r605k5015
$$ -8575 -17429 -6208 -5048 -4502 -10305 -12619 -1817 5150 2503 2751 3475 8788 14894 5289 -19726
10807a9726O16P141N031j753O955N174q966L921L218l473m027J984M168k362K0057
$$ -19726 -19110 -11969 -6938 -8691 -1736 3438 -5528 -1607 1611 -1862 -5889 -3905 263 -2099 17958
10792A7958l092k841j85n040Q008J8058o088l264j672k564k2053q905R781J1647
$$ 17958 14866 12025 11840 6800 14808 32866 26778 23514 21842 19278 -2775 -11680 -1899 9748
10778I748n803k1028J2520J0691R216J0120j6409r669p268K806K3831Q076K692
$$ 9748 3945 -17083 -4563 6128 15344 25464 9055 -614 -7882 -5076 18755 26831 29523
10765B9523Q937N457J4496K1312L5735N9386Q6131J34864K44120M34387N97288
$$ 29523 38460 43917 58413 79725 115460 174846 260977 395841 639961 1074348 1671636
10754A671636J45495n81035n16905k75830j55834r6914p1947l4332k1942k487
$$ 1671636 1817131 1236096 719191 443361 287527 190613 118666 84334 62392 59905
10744E9905K798j3033p478j0678L245J1438p504j0602j1859Q816L65j0860l235
$$ 59905 62703 49670 42192 31514 34759 46197 38693 28091 16232 25048 25413 14553 11318
10731A1318n687j6395j5261L963K1777m710n87K788Q381j432O111K0212j619j9700
$$ 11318 5631 -10764 -26025 -22062 -285 -4995 -5582 -2794 5587 4155 10266 30478 28859 9159
10717I159o947j1342j2773L232P685n843m37J0121J2069n952L308j1863p063l9
$$ 9159 2212 -9130 -21903 -18671 -10986 -16829 -17266 -7145 4924 -1028 2280 -9583 -16646 -16685
10703a6685j694O615N039P822n400j1341m661J0342J6236J1477n789j3433n488
$$ -16685 -18379 -11764 -6725 1097 -4303 -15644 -20305 -9963 6273 17750 11961 -1472 -6960
10690f960K878O712r736k480J0097J508N34j2185k137J2004P062q49j1700n543
$$ -6960 -4082 2630 -7106 -9586 511 2019 2553 -9632 -11769 235 7297 6448 -5252 -10795
10676a0795M662m59k194q358p484O508K301Q279k324L752J4096L227J2649m020
$$ -10795 -6133 -6592 -8786 -17144 -24628 -18120 -15819 -7540 -9864 -6112 7984 11211 23860 19840
10662A9840j4196j1501M835M065j0112L177J2758o192j5401N730P160n141j173
$$ 19840 5644 -5857 -1022 3043 -7069 -3892 8866 2674 -12727 -6997 163 -4978 -6151
10649f151J4439q136j4320N365R825O320J36j6452r431K316N197p511M733M945
$$ -6151 8288 152 -14168 -8803 1022 7342 7478 -8974 -18405 -16089 -10892 -18403 -13670 -8725
10635h725j869M603Q357J5352O091q878n000j0569j7179K231J3191J8004J561
$$ -8725 -10594 -5991 2366 17718 23809 14931 9931 -638 -17817 -15586 -2395 15609 17170
10622A7170j1128j5886p117Q183P28n910j791M466r78M665J348O415q340O505
$$ 17170 6042 -9844 -16961 -8778 -8050 -13960 -15751 -11285 -12263 -7598 -6250 165 -8175 -1670
10608a670j278l366Q030j3449p889Q913j1077J0572J5832k565P722k119K619J4598
$$ -1670 -2948 -6314 1716 -11733 -19622 -10709 -21786 -11214 4618 2053 9775 7656 10275 24873
10594B4873l213j3445n879r60k489q136j0525M328m249O915J7198j0072j0840
$$ 24873 21660 8215 2336 1376 -1113 -9249 -19774 -15446 -19695 -12780 4418 -5654 -16494
10581a6494n334J93J2783J1898j9416r857J7064J0588l307N461k95j8904l00J1770
$$ -16494 -21828 -21635 -8852 3046 -16370 -26227 -9163 1425 -1882 3579 3284 -15620 -15920 -4150
10567d150k630J877N518o622n202K5108j6248j4915Q418O116j429j1371J2302
$$ -4150 -6780 -4903 615 -6007 -11209 13899 -2349 -17264 -8846 -2730 -4159 -15530 -3228
10554c228j185o107L290N642r761l210Q728k469K426P612k878q275Q483j4174
$$ -3228 -4413 -10520 -7230 -1588 -11349 -14559 -5831 -8300 -5874 1738 -1140 -9415 -932 -15106
10540a5106O582J6817k863L496J1709J3418r179j5010P524l317j8623k858N352
$$ -15106 -8524 8293 5430 8926 20635 34053 24874 9864 17388 14071 -4552 -7410 -2058
10527b058R649J9231J2544J494p668j1499l187j93K61Q178Q534l290J345n909
$$ -2058 7591 26822 39366 40860 33192 21693 18506 18313 18574 26752 35286 31996 33341 27432
10513B7432j3766k1891R320J7097j1050j8208l895O684R067q447q294j2419p54
$$ 27432 13666 -8225 1095 18192 7142 -11066 -14961 -8277 790 -7657 -15951 -28370 -29124
10500b9124J3830Q582m56j3469l346j85M032j0150J635K2233M086M423m21p041
$$ -29124 -15294 -6712 -7168 -20637 -23983 -24168 -20136 -30286 -28651 -6418 -2332 2091 1670 -5371
10486e371n665j347l883o356p995o483R515K516M540K109j565R878o384L298N522
$$ -5371 -11036 -12383 -16266 -22622 -30617 -37100 -27585 -25069 -20529 -18420 -19985 -10107 -16491 -13193 -7671
10471g671N58o048n509j0403m609J9372J8087J975j4606K062R413P596j1228j1070
$$ -7671 -7113 -13161 -18670 -29073 -33682 -14310 3777 5752 -8854 -6792 2621 10217 -1011 -12081
10457a2081M139o748j3539J2866J7490N433j2448k320P819J7475r16q437j7724
$$ -12081 -7942 -14690 -28229 -15363 2127 7560 -4888 -7208 611 18086 17170 8733 -8991
10444h991q949j063J6164K747R970k626l346r954o534Q625J7867k033j21j5432
$$ -8991 -17940 -19003 -2839 -92 9878 7252 3906 -6048 -12582 -3957 13910 11877 11756 -3676
10430c676p043k15k940j3030O130j618p453R647J7503R771n836j1398j075l510
$$ -3676 -10719 -10934 -13874 -26904 -20774 -22392 -29845 -20198 -2695 7076 1240 -10158 -11233 -14743
10416a4743j0769r809K4479O308Q383k180j410J7069j381j911J5279j1956k2427
$$ -14743 -25512 -35321 -10842 -4534 3849 1669 259 17328 15947 14036 29315 17359 -5068
10403e068J1492K927L280r006j0062P029J5345j0212j5579q264J3432J5115n936
$$ -5068 6424 9351 12631 3625 -6437 592 15937 5725 -9854 -18118 -4686 10429 4493
10390D493o650J1883L225j4507j8021o541K1079O245J7j4894j2320k016O784J2036
$$ 4493 -2157 9726 12951 -1556 -19577 -26118 -5039 1206 1223 -13671 -25991 -28007 -21223 -9187
10376i187q231O257O383O779p943q207l842L246O467P421m349o682k182j1292
$$ -9187 -17418 -11161 -4778 2001 -5942 -14149 -17991 -14745 -8278 -857 -5206 -11888 -14070 -25362
10362b5362o440J6691P996p587N964O588M243o85j4530j3271O022j981K5514R431
$$ -25362 -31802 -15111 -7115 -14702 -8738 -2150 2093 1408 -13122 -26393 -20371 -22352 3162 12593
10348A2593J709K360j803m912p397p84n648J98M96q326j2047J5120N796K1963
$$ 12593 14302 16662 14859 9947 2550 1766 -3882 -3684 -3188 -11514 -23561 -8441 -2645 19318
10334A9318J605k4467j1596J0608p766L94R215j1148o269m834L395j3354O090
$$ 19318 20923 -3544 -15140 -4532 -12298 -11904 -2689 -13837 -20106 -24940 -21545 -34899 -28809
10321b8809p5m993K1275R771p256J1016k042r484R131O255l025j0640j2434J431
$$ -28809 -28884 -33877 -12602 -2831 -10087 929 -1113 -10597 -1466 4789 1764 -8876 -21310 -19879
10307a9879M710R110j1128L747J8169m224n479P353J5436k831P47M172R4j0989
$$ -19879 -15169 -6059 -17187 -13440 4729 505 -4974 2379 17815 14984 15731 19903 19997 9008
10293I008n359p058Q151O769N291O29j1559Q07p281J408K09p43o10k54J622J1682
$$ 9008 3649 -3409 4742 11511 16802 17431 5872 6679 -602 806 1015 272 -338 -592 1030 12712
10277A2712K715J278m48j6602k0989L911O435Q837J395o980p188n331K498J5951
$$ 12712 15427 16705 16257 -345 -21334 -17423 -10988 -2151 -756 -7736 -14924 -20255 -17757 -1806
10263a806J3362n606k012J720m837K49p465k649r118J2660J922k308M41J0726
$$ -1806 11556 5950 3938 5658 821 1070 -6395 -9044 -18162 -5502 -3580 -5888 -5447 5279
10249E279K239l645j908R673K56r179q456j635j1842j086J5256k684P416L029
$$ 5279 7518 3873 1965 11638 11894 2715 -5741 -7376 -19218 -20304 -5048 -7732 -316 2713
10235B713j2637j3948K77R623J4577j130N437O895l056j1244O476P714J0573j3366
$$ 2713 -9924 -23872 -23595 -13972 605 -525 4912 11807 8751 -2493 3983 11697 22270 8904
10221H904j0801K740K821M672q214L950J14r787j8826R791Q051l941j9306j0447
$$ 8904 -1897 843 3664 8336 122 4072 4186 -5601 -24427 -14636 -6585 -10526 -29832 -40279
10207d0279Q316J4494J3530J5090J3677r589j0354k116P974p805j0078n583P475
$$ -40279 -31963 -17469 -3939 11151 24828 15239 4885 2769 10743 2938 -7140 -12723 -5248
10194e248O69K5086K607k1836k623P708K571r012m33j4208j1697p226O695J4399
$$ -5248 -4579 20507 23114 1278 -1345 6363 8934 -78 -511 -14719 -26416 -33642 -26947 -12548
10180a2548O62O898k358o491l468o591j6062O019Q357q4l729J6361M239j5140
$$ -12548 -11886 -4988 -7346 -13837 -17305 -23896 -39958 -33939 -25582 -25666 -29395 -13034 -8795 -23935
10166b3935j0345r089n50J3304J3226O531K299n222r161o982n197J5101Q106n285
$$ -23935 -34280 -43369 -43919 -30615 -17389 -10858 -8559 -13781 -22942 -29924 -35121 -20020 -11914 -17199
10152a7199R400J1872N780k1414J357O396q083l740N157p9k368J3101o393p99
$$ -17199 -7799 4073 9853 -11561 -10204 -3808 -11891 -15631 -10474 -10553 -12921 180 -6213 -7012
10138g012J742L575L204m317j1281j0146j0327J0206J1173J3201P764n857k820
$$ -7012 -5270 -1695 1509 -2808 -14089 -24235 -34562 -24356 -13183 18 7782 1925 -895
10125h95p051J0542O232p492q254P932m469r845j450J579Q247j701j0214O953
$$ -895 -7946 2596 8828 1336 -6918 1014 -3455 -13300 -14750 -13171 -4924 -6625 -16839 -9886
10111i886J530O905L396m207Q740m055p954j3029j0765J625r389P615K724J3426
$$ -9886 -8356 -1451 1945 -2262 6478 2423 -5531 -18560 -29325 -27700 -37089 -29474 -26750 -13324
10097a3324O342K44K315J1555p098p320O340r58n88N311j8537M536J9296K053
$$ -13324 -6982 -6738 -4423 7132 34 -7286 -946 -1904 -2492 2819 -15718 -11182 8114 10167
10083A0167r454j7590j4524J0148M846Q633K109j3437o54J9968N771m410N32J1009
$$ 10167 713 -16877 -31401 -21253 -16407 -7774 -5665 -19102 -19756 212 5983 1573 2105 13114
10069A3114J15L416n741p320P441n827j296q884O044M645M067J1332J5924K458
$$ 13114 13229 16645 10904 3584 11025 5198 3902 -4982 1062 5707 9774 21106 37030 39488
10055C9488k578N524k2546o293j1227j2917o590J5865R131J8532N867q810j6914
$$ 39488 36910 42434 19888 13595 2368 -10549 -17139 -1274 7857 26389 32256 23446 6532
10042F532j4897N778J2926J2223k610k0181L672J6097l407p936k3180Q209J0030
$$ 6532 -8365 -2587 10339 22562 19952 -229 3443 19540 16133 8197 -14983 -6774 3256
10029C256j526m903m914J1185J316q242n489L203m405K456P351o675J1120P831
$$ 3256 1730 -3173 -8087 3098 4414 -3828 -9317 -6114 -10519 -8063 -712 -7387 3733 11564
10015A1564J402k623P046l254p610p866L442R1q586o054o245L436q72l993J298
$$ 11564 12966 10343 17389 14135 6525 -1341 2101 2192 -6394 -12448 -18693 -15257 -16129 -20122 -18824
10000a8824j4540j3398K616J0847J0093K1816K107k444k517j156J029Q101q730
$$ -18824 -33364 -46762 -44146 -33299 -23206 -1390 717 -1727 -4244 -5400 -4371 3730 -5000
9987e000N974O672k785J4261p246k0374P544m373j7375k844J941O190N144N48
$$ -5000 974 7646 4861 19122 11876 -8498 -954 -5327 -22702 -25546 -23605 -17415 -12271 -11723
9973a1723J4964J956j5920J588L532J5488P503k751L969l760l106J1714L034J382
$$ -11723 3241 5197 -10723 -9135 -5603 9885 17388 14637 18606 14846 11740 23454 26488 27870
9959B7870j0383j1405R363k406k89Q31Q918k944q189J238r187L727J8723J0593
$$ 27870 17487 6082 15445 13039 12750 13581 22499 19555 11366 12604 3417 7144 25867 36460
9945C6460L189P54J6132L6395L5768k1360m4707k5625l152m860N240j2464j8814
$$ 36460 39649 40403 56535 92930 128698 107338 62631 37006 33854 28994 34234 21770 2956
9932B956m243n051J8417J1353J1003j0642j3636n329j43J582O238l149j1044Q711
$$ 2956 -1287 -6338 12079 23432 34435 23793 10157 4828 4685 6267 12505 9356 -1688 7023
9918G023J0207j6432O134J4773j1972l119k95k7415j117J2877J3116R980q753
$$ 7023 17230 798 6932 21705 9733 6614 6319 -21096 -22213 -9336 3780 13760 5007
9905E007K78J0378r413j57O271J261R023L614M503p480j5907n92m416r059K795
$$ 5007 5285 15663 6250 6093 12364 13625 22648 26262 30765 23285 7378 6786 2370 -6689 -3894
9890c894m411n862J032M173N777O454N018k13j3721k418Q993J0348j655n486p014
$$ -3894 -8305 -14167 -13135 -8962 -3185 3269 8287 8074 -5647 -8065 928 11276 9621 4135 -2879
9875b879M916O385J5509O985k3886k1977M148J9051M384n178k475O737J694J4137
$$ -2879 2037 8422 23931 30916 7030 -14947 -10799 8252 12636 7458 4983 11720 13414 27551
9861B7551k376q727M052o753j948q774P925J5873N217J6618L3727O0853J17141
$$ 27551 25175 16448 20500 13747 11799 3025 10950 26823 32040 48658 82385 143238 260379
9848B60379J30258N7645p0474j35088q9649m5626k5169k6658J955K229j5775j7412
$$ 260379 390637 448282 377808 242720 153071 107445 82276 55618 57573 59802 44027 26615
9836B6615r07j2811q185J8355j043j1903J662L452L368m352M354j270k333J062
$$ 26615 25708 12897 4712 23067 22024 10121 11783 15235 18603 14251 18605 17335 15002 16064
9822A6064m506o485O47q228J2770J4218K791j1034k4004j8703J4188P160j0325
$$ 16064 11558 5073 5720 -2508 10262 24480 27271 16237 -7767 -26470 -12282 -5122 -15447
9809a5447N746q62O290n255n318P108J4090J2777K910J983J801j2009o285j3501
$$ -15447 -9701 -10563 -4273 -9528 -14846 -7738 6352 19129 22039 24022 25823 13814 7529 -5972
9795e972o001j2279J7726J9323O809O970j9664j4990m562R641j242P800O932j7545
$$ -5972 -11973 -24252 -6526 12797 19606 26576 6912 -8078 -12640 -2999 -4241 3559 10491 -7054
9781g054j9787N898m262J121Q927k53l373l357L002R877K507O503q834j2065j752
$$ -7054 -26841 -20943 -25205 -24084 -15157 -15410 -18783 -22140 -19138 -9261 -6754 -251 -9085 -21150 -22902
9766b2902K70K899k257P97O240N463O288J117K010P300R327j4602j3362m496J170
$$ -22902 -22632 -19733 -21990 -21193 -14953 -9490 -3202 -2085 -75 7225 16552 1950 -11412 -15908 -14738
9751a4738j703J2259K800K449q80O944k155n590o447L25L995K893K890M659r151
$$ -14738 -16441 -4182 -1382 1067 187 7131 4976 -614 -7061 -6736 -2741 152 3042 7701 -1450
9736a450P850l675O942r373j0712q877Q768J327j0389Q223p470J507J2608L427
$$ -1450 6400 2725 9667 294 -10418 -19295 -10527 -9200 -19589 -11366 -18836 -17329 -4721 -1294
9722a294k094J3101N800J0192j1078r210L711p75m576k965Q616r42j4097l182
$$ -1294 -3388 9713 15513 25705 14627 5417 9128 8353 3777 812 9428 8486 -5611 -8793
9708h793L475m405j5664J1407J1390j1453J0590K0300P348j6178j5954o440P936
$$ -8793 -5318 -9723 -25387 -13980 -2590 -14043 -3453 16847 24195 8017 -7937 -14377 -6441
9695f441L550K3942J0362l1599p521Q260o152M38O848m28L591j9528l791K275
$$ -6441 -2891 21051 31413 -186 -7707 553 -5599 -5161 1687 1259 4850 -14678 -18469 -16194
9681a6194o766O49J1641J4713n014J3379n683q630m248k897J8755p545k2502J109
$$ -16194 -22960 -22311 -10670 4043 -971 12408 6725 -1905 -6153 -9050 9705 2160 -20342 -19233
9667a9233J1535K918n7n833j1605M519J9069J5507j0837n00l12j7440j0342M1
$$ -19233 -7698 -4780 -4837 -10670 -22275 -17756 1313 16820 5983 5483 5171 -12269 -22611 -22570
9653b2570J454L077m174n11M718K1298J6337j1752j2510j0253L655R289r921J1891
$$ -22570 -21116 -18039 -22213 -22724 -18006 3292 19629 7877 -4633 -14886 -11231 -1942 -11863 28
9639B8J0781k362j1943j0305M87J0788j357M141R314p641q655j882J664n409K122
$$ 28 10809 8447 -3496 -13801 -13314 -2526 -3883 258 9572 1931 -6724 -8606 -6942 -12351 -10229
9624a0229Q81j46L207Q625R763N350J866n089j1224N83K3993j4318k8329M770
$$ -10229 -9348 -9494 -6287 2338 12101 17451 19317 14228 3004 3587 27580 13262 -15067 -10297
9610a0297J4952L447m225J3509J301j0639j686Q39q219J0271P305j9450J142J1593
$$ -10297 4655 8102 3877 17386 18687 8048 6362 7201 -1018 9253 16558 -2892 -1750 9843
9596I843P696j9203q770q023m48L317k64J2940R481J515j2911l287j2751J1036
$$ 9843 17539 -1664 -10434 -18457 -18905 -15588 -15852 -2912 6569 8084 -4827 -8114 -20865 -9829
9582i829J2875J4336O837q583j2388k59m882M477Q375N88j2229j1234l142K214
$$ -9829 3046 17382 24219 15636 3248 2989 -1893 2584 10959 11547 -682 -11916 -15058 -12844
9568a2844J0165K0326J4408k263k1263j7398j215J031K167j0045J5466M684P431
$$ -12844 -2679 17647 32055 29792 8529 -8869 -10084 -9053 -6886 -16931 -1465 3219 10650
9555A0650j1932J827J70J421M398K861o712J0183l691o659p899p856P36N002O109
$$ 10650 -1282 545 715 2136 6534 9395 2683 12866 9175 2516 -5383 -13239 -12503 -7501 -1392
9540a392R35P736l39K222o526n539N716J4110j4755n062P085J0992J780j1303
$$ -1392 -457 7279 6940 9162 2636 -2903 2813 16923 2168 -2894 4191 15183 16963 5660
9526E660r489L730j416K614j0308L703Q889k501k364L18o514j4538K126J6423
$$ 5660 -3829 -99 -1515 1099 -9209 -5506 3383 882 -1482 -1164 -7678 -22216 -20090 -3667
9512c667J2762J3517o262k5192j768J709K960p089R199R782P51o835L401j0133
$$ -3667 9095 22612 16350 -8842 -10610 -8901 -5941 -13030 -3831 5951 6702 -133 3268 -6865
9498f865j1219J7000J026o010O486J0205M409Q34p623J2461Q547o318q992o347
$$ -6865 -18084 -1084 -58 -6068 418 10623 15032 15866 8243 20704 29251 22933 13941 7594
9484G594o250j3734l683K155r969m637P335J1326K432M751k495P129n188j2481
$$ 7594 1344 -12390 -16073 -13918 -23887 -28524 -21189 -9863 -7431 -2680 -5175 1954 -3234 -15715
9470a5715p379M069l483J868J0408J6328J7325m115K007m349k537j0466j1363
$$ -15715 -23094 -19025 -22508 -20640 -10232 6096 23421 19306 21313 16964 14427 3961 -7402
9457g402m380k4815k44K959J823J2485J5416N681Q481o624j5871r465O407P200
$$ -7402 -11782 -36597 -36841 -33882 -32059 -19574 -4158 1523 10004 3380 -12491 -21956 -15549 -8349
9443h349J6775l545j6145J0966O688J085P586p874p620j2083k962J5869j9472
$$ -8349 8426 4881 -11264 -298 6390 7475 15061 7187 -433 -12516 -15478 391 -19081
9430a9081L793K3042J7860j9882k1o210J776Q55l708o652j8374q906Q197J0758
$$ -19081 -15288 7754 25614 5732 5711 -499 1277 2132 -1576 -8228 -26602 -35508 -27311 -16553
9416a6553J3008J7585K676j5111K600R424p628j5539J6616n535o353n638m980
$$ -16553 -3545 14040 16716 1605 4205 13629 6001 -9538 7078 1543 -4810 -10448 -15428
9403a5428O92R114M529o636J5818L761m448j0683j0014k416j113l476M163J0728
$$ -15428 -14736 -5622 -1093 -7729 8089 11850 7402 -3281 -13295 -15711 -16824 -20300 -16137 -5409
9389e409K176P498J3310r008n083L661o699q000k535K3647M791j2800j017K136
$$ -5409 -3233 4265 17575 8567 3484 7145 446 -7554 -10089 13558 18349 5549 4532 6668
9375F668m122j6536j251K123L129J7861N538n067j0199o635J3181J1488n06J1030
$$ 6668 2546 -13990 -15241 -13118 -9989 7872 13410 8343 -1856 -8491 4690 16178 15672 26702
9361B6702N430j5105p507Q459Q30L835k078o702N668j4953l636Pq770P171k538
$$ 26702 32132 17027 9520 17979 18809 22644 20566 13864 19532 4579 943 950 -7820 -649 -3187
9346c187J5706j3591m041N550r24N56J1575N671j0367n788L757m254j912o801
$$ -3187 12519 -1072 -5113 437 -487 69 11644 17315 6948 1160 4917 663 -1249 -8050
9332h050j4744O891K288L102J1687j157N430J5291r529j4141M918J111l367K4286
$$ -8050 -22794 -15903 -13615 -10513 1174 17 5447 20738 11209 -2932 1986 3097 -270 24016
9318B4016J2380j1330j3496j3691j659j2395K705J0349p118Q095O086j3392M246
$$ 24016 36396 25066 11570 -2121 -3780 -16175 -13470 -3121 -10239 -2144 3942 -9450 -5204
9305e204K49O47P248q718k801K415N611J1728J3341N793k7098j2286J596r62L031
$$ -5204 -4955 -4308 2940 -5778 -8579 -6164 -553 11175 24516 30309 3211 -9075 -7479 -8441 -5410
9290e410J0925L885N501L975l583l858p078j3361j1713N355L486N587M437J2018
$$ -5410 5515 9400 14901 18876 15293 11435 4357 -9004 -20717 -15362 -11876 -6289 -1852 10166
9276A0166j547l283o568j2682N083P285n93j2725R992J7832K746j2684q409M619
$$ 10166 8619 5336 -1232 -13914 -8831 -1546 -2139 -14864 -4872 12960 15706 3022 -5387 -768
9262g68P548l256j2098R397Q010K491N823j781m500P388m925q160n544q676q478
$$ -768 6780 3524 -8574 823 8833 11324 17147 15366 10866 18254 13329 5169 -375 -9051 -17529
9247a7529k662J6890K0143R093k1124j3630J5191J731j2776J396m185J3944k079
$$ -17529 -20191 -3301 16842 25935 4811 -8819 6372 8103 -4673 -3277 -7462 6482 4403
9234D403k502k559m471r004J0535j0103k141R883M971J4560n947m143n065r826
$$ 4403 1901 -658 -5129 -14133 -3598 -13701 -15842 -5959 -988 13572 7625 3482 -1583 -11409
9220a1409L740Q311J2510p033j9879m666N926k417J1962K0309K067j2567q107
$$ -11409 -7669 642 13152 6119 -13760 -18426 -12500 -14917 -2955 17354 19421 6854 -1253
9207a253R1p832n608K3476K1568k0507j2345l511j4421n413J0071J7615J6951
$$ -1253 -1162 -8994 -14602 8874 30442 9935 -2410 -5921 -20342 -25755 -15684 1931 18882
9194A8882m503j618R2j366K694j2899K685K06k633J6419k931j2882J0392J691
$$ 18882 14379 12761 12853 11487 14181 1282 3967 4173 1540 17959 15028 2146 12538 14229
9180A4229n643p157P466J420K1959L144j647o468p030J1690n341r709N337J534
$$ 14229 8586 1429 8895 10315 32274 35418 33771 27303 20273 31963 26622 16913 22250 23784
9166B3784N199m752m762K4552q631k859J3005J2203P618k004j5362j0157j115
$$ 23784 28983 24231 19469 44021 35390 32531 45536 57739 65357 63353 47991 37834 36719
9153C6719Q805J7462J3625P80K206J9314L1746J8899J56N010L9325M1788M7938
$$ 36719 45524 62986 76611 77391 79597 98911 130657 149556 149712 154722 194047 235835 283773
9140B83773M8642M6366N7265Q7691J29902J69902K33833L40765N60679R45638
$$ 283773 332415 378781 436046 523737 653639 823541 1057374 1398139 1958818 2904456
9130B904456J571667K441709L017516J498768j911003l078703k242075j353734
$$ 2904456 4476123 6917832 9935348 11434116 9523113 6444410 4202335 2848601
9122B848601q15318n24175l52816k37396j48344j25075j07870r5947n9401m0058
$$ 2848601 2033283 1509108 1156292 918896 770552 645477 537607 441660 382259 342201
9112C42201l7595m1336k6376j9269k8121k5139j5306j9609m285p825n696O494
$$ 342201 304606 263270 236894 217625 189504 164365 149059 129450 125165 117340 111644 118138
9100A18138M594j6274j2459p571Q58p995q579j0946O19P380Q096N036j1428n832
$$ 118138 122732 106458 93999 86428 87286 79291 70712 59766 60385 67765 75861 80897 69469 63637
9086F3637J844O086l077M187j317l482M315k766j9154k5173j3956r11j275R344
$$ 63637 65481 71567 68490 72677 71360 67878 72193 69427 50273 25100 11144 10233 8958 18302
9072A8302K976j7814o503P586j248o507P675J739l178J038l584o651R225R897
$$ 18302 21278 3464 -3039 4547 3299 -3208 4467 6206 3028 4066 482 -6169 3056 12953
9058A2953J039R693j078j200J274k722J621k379n732Q741Q241j2982m892l376
$$ 12953 13992 23685 22607 21407 22681 19959 21580 19201 13469 22210 30451 17469 12577 9201
9044I201J9851j438r37j4910N525L565J065n619P145q992j0269J0336J7441q140
$$ 9201 29052 27614 26677 11767 17292 20857 21922 16303 23448 14456 4187 14523 31964 23824
9030B3824k984J5136j730j1857j0072L020J936p77R556N516K012J805R042J3999
$$ 23824 20840 35976 34246 22389 12317 15337 17273 16496 26052 31568 33580 35385 44427 58426
9016E8426M848j2597r778n901j1456k687p841L798m598o477m730K845L167K193
$$ 58426 63274 50677 40899 34998 23542 20855 13014 16812 12214 5737 1007 3852 7019 9212
9002I212o534j1422n835J3359M558P535Q258m183k544O031O704j3998j414J880
$$ 9212 2678 -8744 -14579 -1220 3338 10873 19131 14948 12404 18435 25139 11141 9727 11607
8988A1607K374J2051P064N788j0537j0146l224J1202M267j6836r422J3984o6K889
$$ 11607 13981 26032 33096 38884 28347 18201 14977 26179 30446 13610 4188 18172 18106 20995
8974B0995o009j0072k597r137r312n444K0188J2991k348J2122r489m138L190m463
$$ 20995 14986 4914 2317 -6820 -16132 -21576 -1388 11603 9255 21377 11888 7750 10940 6477
8960F477n059j91J971r61k368q384q923J2036O384q37p351j8814l84N157K2378
$$ 6477 1418 1227 3198 2237 -131 -8515 -17438 -5402 982 145 -7206 -26020 -26404 -21247 1131
8945A131R446p248q310l034J3288p035q767o223j0056j2707J2056J2854P073k622
$$ 1131 10577 3329 -4981 -8015 5273 -1762 -10529 -16752 -26808 -39515 -27459 -14605 -7532 -10154
8931a0154j4488K978J577r548J5530K0557J6800p713k835l978k0097l298J8677
$$ -10154 -24642 -21664 -20087 -29635 -14105 6452 23252 15539 12704 8726 -11371 -14669 4008
8918D008p767n292J531m403l420N269q791J5358K7177O961k1521o327j940m01
$$ 4008 -3759 -9051 -7520 -11923 -15343 -10074 -18865 -3507 23670 30631 9110 2783 843 442
8904D42P49J089q404j660K193J0809q299m649J0419J0190L340L575o666j0052
$$ 442 1191 2280 -6124 -7784 -5591 5218 -3081 -7730 2689 12879 16219 19794 13128 3076
8890C076o660j2600M664N157l195j8156J3918J9129j8173k600J7890K2566p000
$$ 3076 -3584 -16184 -11520 -6363 -9558 -27714 -13796 5333 -12840 -15440 2450 25016 18016
8877A8016p158k848j3356P851K903j906K177o618K878J0762m573q851q23N215
$$ 18016 10858 8010 -5346 2505 5408 3502 5679 -939 1939 12701 8128 -723 -1546 3669
8863C669n700m424O04k025j1449m883l042Q018J7243J4613M831M355n813n536
$$ 3669 -2031 -6455 -5851 -7876 -19325 -24208 -27250 -19232 -1989 12624 17455 21810 15997 10461
8849A0461j1706k842m956J1047K375J3768P92o046q436j5114J0900J0711Q960
$$ 10461 -1245 -4087 -9043 2004 4379 18147 18939 12893 4457 -10657 243 10954 19914
8836A9914J985M5N482j3759R171o510k1653r843k052J6339j168r274m138n74N859
$$ 19914 21899 21944 27426 13667 22838 16328 -5325 -15168 -17220 -881 -2049 -11323 -15461 -16035 -10176
8821a0176J2274J0977j0370L800J2520o648j9618L792J4799r458q029n706l236
$$ -10176 2098 13075 2705 6505 19025 12377 -7241 -3449 11350 1892 -6137 -11843 -15079
8808a5079Q538n990n381L54J1715J0455k543L685L207l899l3360M93K5314M788
$$ -15079 -6541 -12531 -17912 -17558 -5843 4612 2069 5754 8961 5062 -28298 -27805 -2491 2297
8794B297J658m747J3361N560j375L99o387j0534q226j078K939J4368J2756P802
$$ 2297 3955 -792 12569 18129 16754 17153 10766 232 -7994 -9072 -6133 8235 20991 28793
8780B8793M30k0543j7337p732P068O954N556r80K553l159R943R131p05p89o428
$$ 28793 29223 8680 -8657 -16389 -9321 -2367 3189 2209 4762 1603 11546 20677 19972 19183 12755
8765A2755j0492o440J687L373K483n385P144M344j2644k851J6458o408P471M935
$$ 12755 2263 -4177 -2490 883 3366 -2019 5125 9469 -3175 -6026 10432 4024 11495 16430
8751A6430n165J2134N437q320k1428p185N595n906k2111L011L076L293P849J3553
$$ 16430 11265 23399 28836 20516 -912 -8097 -2502 -8408 -30519 -27508 -24432 -21139 -13290 263
8737B63N109M573l09q287j8933k126J2461J031P26L964P673O720J991r492L99
$$ 263 5372 9945 9636 1349 -17584 -19710 -7249 -6218 -5492 -1528 6145 12865 14856 5364 5763
8722E763R63J324q704m352l199Q02M865J589k781P915K019J018j3834R203M418
$$ 5763 6726 8050 -654 -5006 -8205 -7403 -2538 -949 -3730 4185 6204 7222 -6612 2591 7009
8707G009L49p610j6645J8612J0583R930p803L748l642J6837J6527P71o12l94o867
$$ 7009 7358 -252 -16897 1715 12298 22228 14425 18173 14531 31368 47895 48666 48054 47660 40793
8692D0793m095o823R38j5224K786p599l341L265j686J0577J0121o298n77O344
$$ 40793 36698 29875 30813 15589 18375 10776 7435 10700 9014 19591 29712 23414 22837 29181
8678B9181j5170K024l501j4881j65J7696n298Q885O634j8123j0960P040J8899
$$ 29181 14011 16035 12534 -2347 -2512 15184 9886 18771 25405 7282 -3678 3362 22261
8665B2261p538M473K934p079j4438Q398p145q383K901J5329P195O483n045J4929
$$ 22261 14723 19196 22130 15051 613 9011 1866 -6517 -3616 11713 18908 25391 20346 35275
8651C5275N143k463p716J9884L0973M7214K8422l7233m4080k4778L496m637j3080
$$ 35275 40418 37955 30239 50123 81096 128310 156732 119499 75419 50641 54137 49500 36420
8638C6420K475j8301j8736O934K091n578R07k931J0024J5097j89J918j0346P902
$$ 36420 38895 20594 1858 8792 10883 5305 6212 3281 13305 28402 28213 30131 19785 27687
8624B7687N613J3989J9576j364p346J258j7199r254P261Q768O068Q86J497n484
$$ 27687 33300 47289 66865 65501 58155 59413 42214 32960 40221 48989 55057 55943 57440 51956
8610E1956k2126R97P828Q122K0981J7413K1612K6833N0696O6580L4670n8430q8414
$$ 51956 29830 30827 38655 46777 67758 85171 106783 133616 184312 250892 285562 227132 138718
8597A38718m4861k1037p894l75l49q993J41J1658O492j4359r68r8o675k0606k0543
$$ 138718 93857 72820 64926 64551 64202 55209 55350 67008 73500 59141 58173 58075 51400 30794 10251
8582A0251o139K4410K589J731L6038K7785j9707k2544k394m411N59J5353p614
$$ 10251 4112 28522 31111 32842 68880 96665 76958 54414 52020 47609 48168 63521 55907
8569E5907k3023j5314m333K926q86q21m487p736N163J5522J6991J1410K1816L8178
$$ 55907 32884 17570 13237 16163 15277 14456 9969 2233 7396 22918 39909 51319 73135 111313
8555A11313K9704o069m3657m0591k5220k2272O084O968K026m998j9883N21P819
$$ 111313 141017 134948 91291 50700 25480 3208 9292 16260 18286 13288 -6595 -6074 1745
8542A745P3O973P752j541N548M161m752k0592O900J2945J198j6084o435J1701
$$ 1745 1818 8791 16543 15002 20550 24711 19959 -633 6267 19212 20410 4326 -2109 9592
8528I592o861j0959l62M709M674O406J5809J3397j5414j4551j8087N267K924O473
$$ 9592 2731 -8228 -8590 -3881 793 7199 23008 36405 20991 6440 -11647 -6380 -3456 3017
8514C017J4369Q975m843J234j1974r491o347j045k404L801l985l605P770L886
$$ 3017 17386 26361 21518 22752 10778 1287 -5060 -6105 -8509 -4708 -8693 -12298 -4528 -642
8500f42m218n166j0462o887J5693N020j806Q699L97n22q38j0152J708R956k025
$$ -642 -4860 -10026 -20488 -27375 -11682 -6662 -8468 231 628 106 -732 -10884 -9176 780 -1245
8485a245L740Q199R347q707n453J1373K600n266k2211j3960J7362J1618j0390
$$ -1245 2495 10694 20041 11334 5881 17254 19854 14588 -7623 -21583 -4221 7397 -2993
8472b993j296N832N304j3952j0120n536P437J450J959K0982r190L579J2012m729
$$ -2993 -4289 1543 6847 -7105 -17225 -22761 -15324 -13874 -11915 9067 -123 3456 15468 10739
8458A0739j5195o276J1483J0201m385J553J260p869j7887l47M76L591J9732j4201
$$ 10739 -4456 -10732 751 10952 6567 8120 9380 1511 -16376 -16723 -16247 -12656 7076 -7125
8444g125j2937m160R298q030K161n776P193J5574k486q611Q23J7098l945k372
$$ -7125 -20062 -24222 -14924 -22954 -20793 -26569 -19376 -3802 -6288 -14899 -14076 3022 -923 -3295
8430c295J5244R321N673l830j9391l075K933K0659l706k993Q959n673k5510r091
$$ -3295 11949 21270 26943 23113 3722 647 3580 24239 20533 17540 26499 20826 -4684 -13775
8416a3775n315n136n643K041J3128J3258M870J73J921L740k897j4348p455j3468
$$ -13775 -19090 -24226 -29869 -27828 -14700 -1442 3428 3601 5522 9262 6365 -7983 -15438 -28906
8402b8906l886R20J3921m59K940O419J6078l525k539r07l672k3046q477L022L258
$$ -28906 -32792 -31872 -17951 -18410 -15470 -9051 7027 3502 963 56 -3616 -26662 -35139 -32117 -28859
8387b8859L1748J1660j1250m085K132J823o188J065Q297q448J4748j1472k940
$$ -28859 2889 14549 3299 -786 1346 3169 -3019 -1954 6343 -2105 12643 1171 -1769
8374a769O07n057N489K311K496K344L336J244Q01p397J45p162J535r03J1123M110
$$ -1769 -1162 -6219 -730 1581 4077 6421 9757 11001 11802 4405 4550 -2612 -1077 -1980 9143 13253
8358A3253p939J178K536k895j4310j3227j0245O963J526m866J122K4039J2446
$$ 13253 5314 6492 9028 6133 -8177 -21404 -31649 -24686 -23160 -28026 -26904 -2865 9581
8345I581l507p800O842J3863N78o539p917J311j157j58J162J678j0334P967J2699
$$ 9581 6074 -1726 5116 18979 19557 13018 5101 6412 5255 5097 6259 7937 -2397 5570 18269
8330A8269K203k731n681j2118R638m72n819j0035j1352q754J1853J4660J6357
$$ 18269 20472 17741 12060 -58 9580 9108 3289 -6746 -18098 -26852 -14999 -339 16018
8317A6018K941j8052J3923Q668j8544K801J4182O058O347k550j225N441m887k4036
$$ 16018 18959 907 14830 23498 4954 7755 21937 27995 34342 31792 30567 36008 31121 7085
8303G085p393m353P205L826k144K469j0550j5917k1648J7345J1169l444q699J5713
$$ 7085 -308 -4661 2544 6370 4226 6695 -3855 -19772 -41420 -24075 -12906 -16350 -25049 -9336
8289i336O848O0L484m63L551q716j2435O478L699j514L74L301m41L710N001P121
$$ -9336 -2488 -2428 1056 593 4144 -4572 -17007 -10529 -6830 -8344 -7970 -4669 -5110 -1400 3601 10722
8273A0722N46J026j1671k1229J0770L0116o350k4074l628J430n244O893K072k550
$$ 10722 11268 12294 623 -20606 -9836 20280 13930 -10144 -13772 -12342 -17586 -10693 -8621 -11171
8259a1171p348L207K549J0789K3483Q235j5909k76L112m361j1990N346P699j4293
$$ -11171 -18519 -15312 -12763 -1974 21509 29744 13835 13559 16671 12310 320 5666 13365 -928
8245i28o912J6890J019r649q485n296j1323J1589R438J0828m051n608k855L733
$$ -928 -7840 9050 10069 420 -8065 -13361 -24684 -13095 -3657 7171 3120 -2488 -5343 -1610
8231a610k939p644O50J8147O935P943j4K2097o435k3318l483N329r481m22L926
$$ -1610 -4549 -12193 -11543 6604 13539 21482 21468 43565 37130 13812 10329 15658 6177 5755 9681
8216I681R68J824k311R388j17m129j1121k269J0495m738j6155l562k296j3098
$$ 9681 10649 12473 10162 19550 19433 15304 4183 1914 12409 7671 -8484 -12046 -14342 -27440
8202b7440O090j099O193J2986J684Q478k087n028q763m984r072O896K0677J5868
$$ -27440 -21350 -22449 -16256 -3270 -1586 6892 4805 -223 -8986 -13970 -23042 -16146 4531 20399
8188B0399P474k1350j7331N303p4L999J0153q840j2899L558J060P516J0896P879
$$ 20399 27873 6523 -10808 -5505 -5579 -1580 8573 -267 -13166 -9608 -8548 -1032 9864 17743
8174A7743n286o332J2338l209J4042M440n106j0930l363M881N00k835L182n356
$$ 17743 12457 6125 18463 15254 29296 33736 28630 17700 14337 19218 19718 16883 20065 14709
8160A4709j5948l764N194L279k534K559m568J335R92R774n762L019Q425o974j4523
$$ 14709 -1239 -5003 191 3470 936 3495 -1073 262 1254 11028 5266 8285 16710 9736 -4787
8145d787J879p40q577k692O896J5666q024j039J4658J3366Q930j1954j3733j3375
$$ -4787 -2908 -3648 -12225 -14917 -8021 7645 -379 -1418 13240 26606 35536 23582 9849 -3526
8131c526L689m530k2280L002Q329R7J1432J6561J0450r536M281O90l430q17k1765
$$ -3526 163 -4367 -26647 -23645 -15316 -15219 -3787 12774 23224 13688 17969 18659 15229 14412 -7353
8116g353n048M733R00o420J6844m995k646P081q924j2231P184n979N508M042J1119
$$ -7353 -12401 -7668 -6768 -13188 3656 -1339 -3985 3096 -5828 -18059 -10875 -16854 -11346 -7304 3815
8101C815P941J337p380l166J1095P187k443o177l055m001j426n519q045m812k1
$$ 3815 11756 13093 5713 2547 13642 20829 18386 12209 9154 5153 3727 -1792 -9837 -14649 -14670
8086a4670P267M206r63m427J1214k844k60l785j4313J6820N920O934q532q434
$$ -14670 -7403 -3197 -4160 -8587 2627 -217 -477 -4262 -18575 -1755 4165 11099 2567 -5867
8072e867N020o447l739j753l333J0200J1326O517r554j1680J39M549K148O082
$$ -5867 -847 -7294 -11033 -12786 -16119 -5919 5407 11924 2370 -9310 -9171 -4622 -2474 3608
8058C608K740O539q160J838M241J9509j0737k3540K0051J3604o40J2449n780l377
$$ 3608 6348 12887 4727 6565 10806 30315 19578 -3962 16089 29693 29053 41502 35722 32345
8044C2345O670J857m763j1604p328M784L701l850J5405Q36n912n491j565N772
$$ 32345 39015 40872 36109 24505 17177 21961 25662 21812 37217 38053 32141 26650 25085 30857
8030C0857j398k374J702n151n047m33mk490P842l020k5986j392N646J288j3188
$$ 30857 29459 27085 28787 23636 18589 18156 18152 15662 23504 20484 -5502 -6894 -1248 40 -13148
8015a3148R179l510k202J1462J6719J1276o12J1587J441K788K5626K0617q008
$$ -13148 -3969 -7479 -9681 1781 18500 29776 29164 40751 42192 44980 70606 91223 83215
8002H3215R43k2852j9189o223J796J937Q95J3912L1836N0939L3885P720k1158
$$ 83215 84158 61306 42117 35894 37690 39627 40522 54434 86270 137209 171094 178814 157656
7989A57656m5866m2786k5249j0731r941j7739j265L639J2890K728k999J477l417
$$ 157656 111790 69004 43755 33024 23083 5344 4079 7718 20608 23336 20337 21814 18397
7976A8397m327J2136q12p120r43J447m039R338J3473L952P600L460n244J6783
$$ 18397 14070 26206 25394 18274 17331 18778 14739 24077 37550 41502 49102 52562 47318 64101
7962F4101J2775K6573L5255O677p153r115j7980k1172o051J7295J8491K7321M1752
$$ 64101 76876 103449 138704 145381 138228 129113 111133 89961 83910 101205 119696 147017 188769
7949A88769K4907l4153l8809k7084l1105j7967n406p201j4184j0711j1970o457
$$ 188769 213676 179523 140714 113630 82525 64558 59152 51951 37767 27056 15086 8629
7937H629j3797J8130J3633N276r324o246j0210k02J2827Q833J2474n019j4688
$$ 8629 -5168 12962 26595 31871 22547 16301 6091 5889 18716 27549 40023 35004 20316
7924B0316K705k857j846J7065J4465J3002J0263j388q296o75j3218j1299j3885
$$ 20316 23021 20164 18318 35383 49848 62850 73113 71725 63429 62754 49536 38237 24352
7911B4352J2621q563m27J3477Q399j1692j0342k3967m980j4212k075K0838L172
$$ 24352 36973 28410 27983 41460 49859 38167 27825 3858 -1122 -15334 -17409 3429 6601
7898F601m517p884J33N711m789L604L149k67o27P947J2526p420j6174M235j09
$$ 6601 2084 -5800 -5667 44 -4745 -1141 2008 1741 1114 9061 21587 14167 -2007 2228 2119
7883B119Q968N926o642l938r10J638P22N134o292k388k348m71m482m020p168j402
$$ 2119 11087 17013 10371 6433 5523 7161 7883 13017 6725 4337 1989 1518 -2964 -6984 -14152 -15554
7867a5554K244J8461O971J8588R236r5J681l310j9655p233o957p612n230R625
$$ -15554 -13310 5151 12122 30710 39946 39851 41532 38222 18567 11334 4377 -3235 -8465 1160
7853A160r29r772Q634Q767m781j674k719J0487R884J037o310K689r105N841j1981
$$ 1160 231 -9541 -907 7860 3079 1405 -1314 9173 19057 20094 13784 16473 7368 13209 1228
7838A228j879O584p65j6330J3668J908m031L707N166M937j2715j559j227j98P891
$$ 1228 -651 5933 5168 -11162 2506 4414 383 4090 9256 14193 1478 -81 -1308 -1506 6385
7823F385K808J049k3980n909N605l779P062J8677p797r723j057N731o99N055P170
$$ 6385 9193 10242 -13738 -19647 -14042 -17821 -10759 7918 121 -9602 -10659 -4928 -5627 -572 6598
7808F598l693o733m97J8491O861o689J585n004P342O410p59L610o493j9586p343
$$ 6598 2905 -3828 -4325 14166 21027 14338 15923 10919 18261 24671 23912 27522 21029 1443 -5900
7793e900J2677O598l659m807j2921p926M997L910J6956j0901p502l710N871j1562
$$ -5900 6777 13375 9716 4909 -8012 -15938 -10941 -7031 9925 -976 -8478 -12188 -6317 -17879
7779a7879r549L538M112J0966j935o165J1878J1357R526o947k0923j5449K639
$$ -17879 -27428 -23890 -19778 -8812 -10747 -16912 -5034 6323 15849 8902 -12021 -27470 -24831
7766b4831R559J1672o6N504N194m763n426J4283M481j4256L214l536k5R558L775
$$ -24831 -15272 -3600 -3666 1838 7032 2269 -3157 11126 15607 1351 4565 1029 1004 10562 14337
7751A4337Q761j3136l779J572j742j7631l67R30K209o192J6475J0324N31j0746
$$ 14337 23098 9962 6183 7755 6013 -11618 -11985 -11055 -8846 -15038 1437 11761 12292 1546
7737A546j9389q2P549J024j438Q828Q57q77r857j0988m756J8267P201Q207J2174
$$ 1546 -17843 -17925 -10376 -9352 -10790 -1962 -1105 -1982 -11839 -22827 -27583 -9316 -2115 6092 18266
7722A8266r443j9467N185j954j716O412M070m46k1211P127R950k711J4773k633
$$ 18266 8823 -10644 -5459 -7413 -9129 -2717 1353 907 -20304 -13177 -3227 -5938 8835 6202
7708F202k0668J027K993o858M919J1306M413k398K0142l811P14M403M847j1751
$$ 6202 -14466 -13439 -10446 -17304 -12385 -1079 3334 936 21078 17267 17981 22384 27231 15480
7694A5480k4122N004N078N517J81R865l080k476j0381j1300p892j0852J3696J2734
$$ 15480 -8642 -3638 1440 6957 7138 17003 13923 11447 1066 -10234 -18126 -28978 -15282 -2548
7680b548K459M486K010m351q656p49r447M375J3136J5170K878k4400k680J0826
$$ -2548 -89 4397 6407 2056 -6600 -7349 -16796 -12421 715 15885 18763 -5637 -8317 2509
7666B509M552o414o715j352Q135J945J0900L598j4215N320L079j3485k0364J0785
$$ 2509 7061 647 -6068 -7420 715 2660 13560 17158 2943 8263 11342 -2143 -22507 -11722
7652a1722L334k279N158n35k251p697M72L487l41r709K355O25K64Q990J5603o234
$$ -11722 -8388 -10667 -5509 -6044 -8295 -15992 -15520 -12033 -12374 -22083 -19728 -19103 -18839 -9849 5754 -480
7636d80j0570Q276m562J2399j464o697n971l396j871Q426O846q594Q434R921M015
$$ -480 -11050 -2774 -7336 5063 3599 -3098 -9069 -12465 -14336 -5910 936 -7658 776 10697 14712
7621A4712k371r659O86Q514q474j3592o400j0369J1410L5865l330L55M691P293
$$ 14712 12341 2682 3368 11882 3408 -10184 -16584 -26953 -15543 20322 16992 17347 22038 29331
7607B9331l645p961k208n436j6337J9744J0192M21k677j5641O334O699j9069J252
$$ 29331 25686 17725 15517 10081 -6256 13488 23680 24101 21424 5783 12117 18816 -253 999
7593I99P521L642j1863n419O102J8569l968j3076Q063Q101p93q416r92m028L797
$$ 999 8520 12162 299 -5120 982 19551 15583 2507 10570 18671 17878 9462 8470 4442 8239
7578H239q174L274k627m743J39j0924Q225j35J2007O921j179M889m611l477P789
$$ 8239 65 3339 712 -4031 -3892 -14816 -6591 -6726 5281 12202 11023 15912 11301 7824 15613
7563A5613J982j1404k833p500j3982M559J5729K972r721J0736Q858o227P424J1012
$$ 15613 17595 6191 3358 -4142 -18124 -13565 2164 5136 -4585 6151 15009 8782 16206 27218
7549B7218K845n047J803j3847j6788L362J2086N833r701q233j3275N750M860P721
$$ 27218 30063 25016 26819 12972 -3816 -454 11632 17465 7764 -469 -13744 -7994 -3134 4587
7535D587N491k887Q001K103o247p954n484O441R933j1415K063O746L4L022N323
$$ 4587 10078 7191 15192 17295 11048 3094 -2390 4051 13984 2569 4632 11378 11412 14434 19757
7520A9757q178j6197N54l509q826j839m371J6648Q64l679j0369Q527N823J672
$$ 19757 11579 -4618 -4064 -7573 -16399 -18238 -22609 -5961 -5097 -8776 -19145 -10618 -4795 -3123
7506c123r16J67K27J5275l785j9904M801J1378m430j2948J1796o522J5725n959
$$ -3123 -4039 -3872 -3645 11630 7845 -12059 -7258 4120 -310 -13258 -1462 -7984 7741 1782
7492A782k384J652M320J8209j1341p063l781j0973j1118N38J0228p357J13P809
$$ 1782 -602 1050 5370 23579 12238 5175 1394 -9579 -20697 -20159 -9931 -17288 -17175 -9366
7478i366J4702j3048j9710Q324J7417j070K118P291P129k386R67m23j1457j1970
$$ -9366 5336 -7712 -27422 -19098 -1681 -2751 -633 6658 13787 11401 12368 11945 488 -11482
7464a1482r904L769J7683j027q098J0798J214j6103r312p061q037K536Q811M504
$$ -11482 -21386 -17617 66 -961 -9059 1739 2953 -13150 -22462 -29523 -37560 -35024 -26213 -21709
7450b1709J0682L185R749N182l865m382P913J841j1733q338M07n103l392K145
$$ -21709 -11027 -7842 1907 7089 3224 -1158 6755 8596 -3137 -11475 -11068 -16171 -19563 -17418
7436a7418l934P108K3229O556j8439j7793P001J2241O399M943j3133M098l234
$$ -17418 -21352 -14244 8985 15541 -2898 -20691 -13690 -1449 4950 9893 -3240 858 -2376
7423b376n168Q563Q358Q502K817M150j0119Q47L667q583j6977L206k818N374L145
$$ -2376 -7544 1019 9377 17879 20696 24846 14727 15574 19241 10658 -6319 -3113 -5931 -557 2588
7408B588N760M980J667o66j464K764o59J826q765q749p59r674O723k239J904N454
$$ 2588 8348 13328 14995 14329 12865 15629 14970 16796 8031 -718 -1477 -11151 -4428 -6667 -4763 691
7392F91j713K62L933J8161N428j057n380j5965J674n065Q807J3367J1652j1265
$$ 691 -1022 -760 3173 21334 26762 25705 20325 4360 6034 969 9776 23143 34795 23530
7378B3530k217j250k5474j0261r07R720j0179L983M022J3306N230j967j2062q824
$$ 23530 21313 20063 -5411 -15672 -16579 -6859 -17038 -13055 -9033 4273 9503 7536 -4526 -13350
7364a3350N869M41Q163Q015m57j0526j0264J428L003n944n491k071P379L295J1044
$$ -13350 -7481 -7040 1123 9138 8681 -1845 -12109 -10681 -7678 -13622 -19113 -21184 -13805 -10510 534
7349E34K937p999J2210J4806j2842j4133j1706k547N384r112l479J5657J6189
$$ 534 3471 -4528 7682 22488 9646 -4487 -16193 -18740 -13356 -22468 -25947 -10290 5899
7336E899P459n761M107M722k1033j3061P453J0018o027q373q696k081J3882M062
$$ 5899 13358 7597 11704 16426 -4607 -17668 -10215 -197 -6224 -14597 -23293 -25374 -11492 -7430
7322g430p007J2758J2189J4656q220P50Q209n180o671j0482p218J0212J3925q84
$$ -7430 -14437 -1679 10510 25166 16946 17696 25905 20725 14054 3572 -3646 6566 20491 19607
7308A9607o125j1720p172k131K1273O111k4526q700L234q084k782K666M903M825
$$ 19607 13482 1762 -5410 -7541 13732 19843 -4683 -13383 -10149 -18233 -21015 -18349 -13446 -8621
7294h621o76j2522l491J1577P558p57N409K872j4455p686l306J132N378J8686
$$ -8621 -9297 -21819 -25310 -13733 -6175 -6932 -1523 1349 -13106 -20792 -24098 -22966 -17588 1098
7280A098N976K398q862m982n808K718J5912n331j905L514j4887j8536j579K989
$$ 1098 7074 9472 610 -4372 -10180 -7462 8450 3119 1214 4728 -10159 -28695 -30274 -27285
7266b7285J4185m506N852J2894r814j3111p665J5019R453m683K482N238L973p809
$$ -27285 -13100 -17606 -11754 1140 -8674 -21785 -29450 -14431 -4978 -9661 -7179 -1941 2032 -5777
7252e777L854q059R51O70j1511p608J639J922P901K872J752P329J4972m351q285
$$ -5777 -1923 -9982 -9031 -8361 -19872 -27480 -25841 -23919 -16018 -13146 -11394 -4065 10907 6556 -1729
7237a729l706J5163J0037O086j7235p080k006J1197J0305j3416j1398j0210K163
$$ -1729 -5435 9728 19765 25851 8616 1536 -470 10727 21032 7616 -3782 -13992 -11829
7224a1829r479O202N372J88j503m057m516m211J0808L0425N978k1889q644K956
$$ -11829 -21308 -15106 -9734 -9546 -11049 -15106 -19622 -23833 -13025 17400 23378 1489 -7155 -4199
7210d199P395q462j6406k71J9160N910n140j2747j7493k7O590R122M186l885J3087
$$ -4199 3196 -5266 -21672 -21943 -2783 3127 -2013 -14760 -32253 -32280 -25690 -16568 -12382 -16267 -3180
7195c180l049J1466o56j2664M629J6112R205k289q819j351J3743Q157j7288j9578
$$ -3180 -6229 5237 4581 -8083 -3454 12658 21863 19574 10755 9404 23147 31304 14016 -5562
7181e562o528L622J2272J330N13q521j1843l706k642K1796J0386r989j3445N072
$$ -5562 -12090 -8468 3804 5134 5647 -2874 -14717 -18423 -21065 731 11117 1128 -12317 -7245
7167g245K2543j1033o92J7543K757J5232l935j9737j1146j2485m776k262J5909
$$ -7245 15298 4265 3573 21116 23873 39105 35170 15433 4287 -8198 -12974 -15236 673
7154F73J1184k0964m66J4717J8579M880j8578k953K361q248k793O089N762J3868
$$ 673 11857 -9107 -9573 5144 23723 28603 10025 7072 9433 1185 -1608 4481 10243 24111
7140B4111l248r415J7N55r276N835l835O703J8376M835o52j3609j8770j3815K875
$$ 24111 20863 11448 11465 12020 2744 8579 4744 11447 29823 34658 34006 20397 1627 -12188 -9313
$$ [...]
##END NTUPLES=NMR SPECTRUM
##END=
