##TITLE=Analysis number 312412
Compound Code cc 09051
Book Reference 302/190
Project Code adrs
Chemist Name toml
##JCAMPDX= 6.0         $$ Bruker NMR JCAMP-DX V2.0
##DATA TYPE= NMR SPECTRUM
##DATA CLASS= NTUPLES
##ORIGIN= Bruker BioSpin GmbH
##OWNER= NMR
$$ XWIN-NMR		Version 3.5
$$ Wed Aug  3 14:45:33 2005 GMT Daylight Time (UT+1h)  MAYBRIDGE\NMR@NMR_250MHZ
##.OBSERVE FREQUENCY= 250.131544655141
##.OBSERVE NUCLEUS= ^1H
##.ACQUISITION MODE= SIMULTANEOUS (DQD)
##.ACQUISITION SCHEME= undefined
##.AVERAGES= 16
##.DIGITISER RES= 18
##SPECTROMETER/DATA SYSTEM= dpx250
##.PULSE SEQUENCE= zg30
##.SOLVENT NAME= TFA
##.SHIFT REFERENCE= (INTERNAL, TFA, 0, 17.5)
##AUDIT TRAIL= $$ (NUMBER, WHEN, WHO, WHERE, WHAT)
$$ ##TITLE= Audit trail, XWIN-NMR		Version 3.5
$$ ##JCAMPDX= 5.01
$$ ##ORIGIN= Bruker BioSpin GmbH
$$ ##OWNER= NMR
$$ C:\u/data/dgb/nmr/ADRS/7140/pdata/1/auditp.txt
$$ ##AUDIT TRAIL=  $$ (NUMBER, WHEN, WHO, WHERE, WHAT)
(   1,<2005-08-03 14:44:55.37 +100>,<MAYBRIDGE\NMR>,<NMR_250MHZ>,
      <created by zg, POWCHK disabled, PULCHK disabled
       configuration hash MD5:
       62 19 C7 07 E1 42 D1 B7 37 6C 3D D0 77 39 F9 E6
       data hash MD5: 64K
       BD D5 E8 F2 8C E3 7F 4F 31 DC 12 D3 88 AA E5 63>)
(   2,<2005-08-03 14:45:12.35 +100>,<MAYBRIDGE\NMR>,<NMR_250MHZ>,
      <Start of raw data processing
       ef LB = 0.3 FT_mod = 6 PKNL = 1 SI = 32K 
       data hash MD5: 32K
       0A 08 AC 45 0C D0 E8 5F D5 53 13 F5 42 E6 26 0A>)
(   3,<2005-08-03 14:45:18.20 +100>,<MAYBRIDGE\NMR>,<NMR_250MHZ>,
      <apk 
       data hash MD5: 32K
       DE 91 38 24 B2 3D E9 A4 C1 B9 2E 5B EB 4B A4 B6>)
(   4,<2005-08-03 14:45:19.01 +100>,<MAYBRIDGE\NMR>,<NMR_250MHZ>,
      <abs ABSG = 5 
       data hash MD5: 32K
       EF E6 B6 9D 35 51 BB A7 04 E7 76 B8 D8 71 78 3F>)
$$ ##END=
$$ 
$$ hash MD5
$$ 71 17 35 68 72 94 58 95 3A 6C F2 66 6C 23 B1 06
##$RELAX= 
##$RELAX= 
##$RELAX= 
##$RELAX= 
##$RELAX= 
##$RELAX= 
##$RELAX= 
$$ Bruker specific parameters
$$ --------------------------
##$DU= <C:\u>
##$EXPNO= 7140
##$NAME= <ADRS>
##$PROCNO= 1
##$TYPE= <nmr>
##$USER= <dgb>
##$AMP= (0..31)
100 100 100 100 100 100 100 100 100 100 100 100 100 100 100 100 100 100 
100 100 100 100 100 100 100 100 100 100 100 100 100 100 
##$AQSEQ= 0
##$AQ_mod= 3
##$AUNM= <au_zg>
##$AUTOPOS= <37 >
##$BF1= 250.13
##$BF2= 250.13
##$BF3= 250.13
##$BF4= 250.13
##$BF5= 500.13
##$BF6= 500.13
##$BF7= 500.13
##$BF8= 500.13
##$BYTORDA= 1
##$CFDGTYP= 0
##$CFRGTYP= 5
##$CHEMSTR= <none>
##$CNST= (0..31)
1 1 145 1 1 1 1 1 1 1 1 1 1 1 1 1 1 1 1 1 1 1 1 1 1 1 1 1 1 1 1 1 
##$CPDPRG= <>
##$CPDPRG1= <>
##$CPDPRG2= <>
##$CPDPRG3= <>
##$CPDPRG4= <mlev>
##$CPDPRG5= <mlev>
##$CPDPRG6= <mlev>
##$CPDPRG7= <mlev>
##$CPDPRG8= <mlev>
##$CPDPRGB= <>
##$CPDPRGT= <>
##$D= (0..31)
0 1 0 0 0 0 0 0 0 0.06 0 0 0 0 0 0 0.0002 0 0 0 0 0 0 0 0 0 0 0 0 0 0 
0 
##$DATE= 1123076693
##$DBL= (0..7)
120 120 120 120 120 120 120 120 
##$DBP= (0..7)
150 150 150 150 150 150 150 150 
##$DBP07= 0
##$DBPNAM0= <>
##$DBPNAM1= <>
$$ [...]
##$SUBNAM7= <"">
##$SUBNAM8= <"">
##$SUBNAM9= <"">
##$SW= 20.6930455092707
##$SWIBOX= (0..15)
0 0 3 0 0 0 0 0 0 0 0 0 0 0 0 0 
##$SW_h= 5175.983436853
##$TD= 65536
##$TD0= 1
##$TE= 295.16
##$TE2= 300
##$TE3= 300
##$TEG= 300
##$TL= (0..7)
0 120 120 120 120 120 120 120 
##$TP= (0..7)
150 150 150 150 150 150 150 150 
##$TP07= 0
##$TPNAME0= <>
##$TPNAME1= <>
##$TPNAME2= <>
##$TPNAME3= <>
##$TPNAME4= <>
##$TPNAME5= <>
##$TPNAME6= <>
##$TPNAME7= <>
##$TPOAL= (0..7)
0.5 0.5 0.5 0.5 0.5 0.5 0.5 0.5 
##$TPOFFS= (0..7)
0 0 0 0 0 0 0 0 
##$TUNHIN= 0
##$TUNHOUT= 0
##$TUNXOUT= 0
##$USERA1= <user>
##$USERA2= <user>
##$USERA3= <user>
##$USERA4= <user>
##$USERA5= <user>
##$V9= 5
##$VALIST= <valist>
##$VCLIST= <CCCCCCCCCCCCCCC>
##$VD= 0
##$VDLIST= <DDDDDDDDDDDDDDD>
##$VPLIST= <PPPPPPPPPPPPPPP>
##$VTLIST= <TTTTTTTTTTTTTTT>
##$WBST= 1024
##$WBSW= 4
##$XGAIN= (0..3)
0 0 0 0 
##$XL= 0
##$YL= 0
##$YMAX_a= 364486
##$YMIN_a= -367488
##$ZGOPTNS= <>
##$ZL1= 120
##$ZL2= 120
##$ZL3= 120
##$ZL4= 120
##$ABSF1= 17.5
##$ABSF2= -3.193193
##$ABSG= 5
##$ABSL= 3
##$ALPHA= 0
##$AQORDER= 0
##$ASSFAC= 0
##$ASSFACI= 0
##$ASSFACX= 0
##$ASSWID= 0
##$AUNMP= <proc_1d>
##$AZFE= 0.1
##$AZFW= 0.1
##$BCFW= 0
##$BC_mod= 0
##$BYTORDP= 0
##$COROFFS= 0
##$CY= 12.5
##$DATMOD= 1
##$DC= 0
##$DFILT= <>
##$DTYPP= 0
##$F1P= 14.0000005364418
##$F2P= -0.99999901652339
##$FCOR= 0.5
##$FTSIZE= 32768
##$FT_mod= 6
##$GAMMA= 0
##$GB= 0
##$INTBC= 1
##$INTSCL= 1
##$ISEN= 128
##$LB= 0.3
##$LEV0= 0
##$LPBIN= 0
##$MAXI= 10000
##$MC2= 0
##$MEAN= 0
##$ME_mod= 0
##$MI= 0
##$NCOEF= 0
##$NC_proc= -4
##$NLEV= 6
##$NOISF1= 0
##$NOISF2= 0
##$NSP= 0
##$NTH_PI= 0
##$NZP= 0
##$OFFSET= 17.5
##$PC= 1
##$PHC0= -76.05373
##$PHC1= 0.932901
##$PH_mod= 1
##$PKNL= yes
##$PPARMOD= 0
##$PSCAL= 4
##$PSIGN= 0
##$REVERSE= no
##$SF= 250.129755375314
##$SI= 32768
##$SIGF1= 0
##$SIGF2= 0
##$SINO= 400
##$SIOLD= 32768
##$SREGLST= <1H.TFA>
##$SSB= 0
##$STSI= 32768
##$STSR= 0
##$SW_p= 5175.98343685301
##$SYMM= 0
##$S_DEV= 0
##$TDeff= 65536
##$TDoff= 0
##$TI= <Analysis number 999999
Compound Code 99
Book Reference 9
Project Code 9>
##$TILT= no
##$TM1= 0
##$TM2= 0
##$TOPLEV= 0
##$USERP1= <user>
##$USERP2= <user>
##$USERP3= <user>
##$USERP4= <user>
##$USERP5= <user>
##$WDW= 1
##$XDIM= 32768
##$YMAX_p= 439174656
##$YMIN_p= -336981
$$ End of Bruker specific parameters
$$ ---------------------------------
##NTUPLES= NMR SPECTRUM
##VAR_NAME=  FREQUENCY,     SPECTRUM/REAL,   SPECTRUM/IMAG
##SYMBOL=    X,             R,               I
##VAR_TYPE=  INDEPENDENT,   DEPENDENT,       DEPENDENT
##VAR_FORM=  AFFN,          ASDF,            ASDF
##VAR_DIM=   32768,         32768,           32768
##UNITS=     HZ,            ARBITRARY UNITS, ARBITRARY UNITS
##FACTOR=    0.157963299565203, 1,           1
##FIRST=     4377.27071906799, 0,            0
##LAST=      -798.712717785015, 0,           0
##MIN=       -798.712717785015, -336981,     0
##MAX=       4377.27071906799, 439174656,    0
$$ Real data points
##PAGE= N=1
##DATA TABLE= (X++(R..R)), XYDATA
32767 -84758 -21096 67921 88301 77599 73288 46312 68482 62233 53145 61710 68549 45232 45670
32754 45670 -29091 -56258 -82173 -84867 -80315 -54837 48732 106067 40450 -11269 22800 40691
32742 40691 80107 99089 141037 133534 68962 75844 90353 67642 121347 114523 52854 40436
32730 40436 23225 43746 107336 92546 71852 28784 32644 30329 50217 55271 26849 42146
32718 42146 74710 60940 82449 52397 46813 114115 107269 30570 60327 70448 33581 -20346
32706 -20346 17556 10870 29962 67999 59225 6553 31803 42599 23662 63614 113128 91081
32694 91081 87020 92954 74738 159268 173786 109205 34385 2669 68685 56434 7107 -17561
32682 -17561 -315 7280 1167 24207 35819 98531 89224 9489 -31072 -37444 -4813 -3372 8968
32669 8968 42686 49056 85818 101988 106357 114560 84524 85017 139394 175033 52598 3495 2817
32656 2817 7132 -48271 -50338 -51869 -40016 -1212 4529 6550 25334 22452 22563 36426 -9794
32643 -9794 -20393 11274 58063 73089 79182 35846 22179 16093 14832 -18355 17124 36742
32631 36742 -35559 -61297 -46770 -62566 -102537 -113332 -127527 -76908 42800 105756 98116 45589
32619 45589 7204 50974 86000 72420 -14028 -6477 33374 47070 57930 103192 138609 114964
32607 114964 98646 78191 80847 32442 47400 78847 102004 109639 97512 54854 69244 85469
32595 85469 47589 36759 27593 35007 68338 143757 85265 52105 100261 34429 -24396 -37774
32583 -37774 -38525 -19570 -10188 -9624 -13112 42305 126405 60186 25583 74791 106969 92694 101834
32570 101834 56642 15996 26394 66380 78999 36276 36443 67841 98256 102095 25769 -13343
32558 -13343 48905 77433 59034 -3272 11075 18910 21070 25147 82043 92611 10648 9361
32546 9361 31477 40429 44102 47114 74427 143680 240386 221690 149349 112918 87313 90622 85173
32533 85173 104013 112593 49369 -8664 10459 8867 5433 28064 51165 50992 21867 -20433 -53620
32520 -53620 -85221 -77709 9407 23611 -39071 -4668 83025 78607 41433 108837 91564 67093
32508 67093 125127 92530 23155 -21357 -10754 32147 55200 57758 41470 13618 25940 -38939
32496 -38939 -12632 59110 21721 -64678 -9819 -8858 15283 65930 78884 131216 137007 109546
32484 109546 38670 278 49131 47955 -34511 6600 129735 133768 117028 162438 156637 88952
32472 88952 119053 113324 58205 11783 -30374 23319 -17759 -54856 2782 -20182 -18066 -18343
32460 -18343 -10975 47599 92258 21366 -29024 16590 78176 67340 8269 50907 58543 12966
32448 12966 1406 30484 69738 75142 163446 216958 163824 70805 92193 120206 132145 129453
32436 129453 84445 41564 -1321 -30835 11309 90120 112164 51143 46473 -1779 21192 26075
32424 26075 47501 77932 88152 80407 94650 128648 146729 133389 110468 117017 185227 231743
32412 231743 154267 105823 71290 19001 13490 -3668 -10217 -52347 -26466 2249 110955 125685
32400 125685 96182 102670 46945 88449 32461 -12449 4162 -54270 -21728 23149 -72122 -150827
32388 -150827 -173814 -156681 -152099 -70555 -38992 3736 13089 47755 32149 94525 128157 95125
32376 95125 71166 35731 23083 -15221 -4770 -1625 18100 1980 7968 75714 74374 69095
32364 69095 40953 -1727 36646 36928 74939 75682 40925 -3328 -5780 -47417 -23655 54409 99351
32351 99351 2397 51618 13305 -33323 47737 84240 95116 101540 89542 98063 57098 94168
32339 94168 142989 51655 69242 130468 114656 8212 -19510 -18089 1483 3906 -38255 45605
32327 45605 154838 145312 77554 58808 -60999 -9892 51181 60087 -11584 13969 67395 57630
32315 57630 45787 132706 171214 162631 127403 81411 14575 62592 109707 66495 115191 103723
32303 103723 108580 71124 1191 -88235 -32259 -5614 -14094 -15661 -37217 103 -19609 -5560
32291 -5560 65985 98050 104391 98155 136222 69092 110535 75641 -47339 -39701 -37352 -103594
32279 -103594 -17337 -12879 -11022 70244 76858 59242 55884 54065 36305 58973 84977 89296 149107
32266 149107 137116 94887 72472 60841 26432 5061 -11161 97915 217357 206545 181619
32255 181619 103771 23616 9961 45307 96723 75306 -36366 35232 149537 224685 153379
32244 153379 116477 79009 84792 94119 102682 53443 -59648 -42029 27821 63793 45452 11487
32232 11487 31448 28867 927 65321 62107 85154 114450 75690 63211 40130 5973 28153
32220 28153 59010 70935 44465 -4410 27737 69942 56999 60247 129449 102920 110331 131758
32208 131758 107928 56365 61422 54363 46906 13329 -2578 -41216 -24550 -52404 -59295 17734
32196 17734 -81422 -3369 -21756 -115429 -102590 7178 54355 27679 23105 -22528 -56131 -64707
32184 -64707 -40927 30406 38534 61723 71191 22866 12815 -24854 -30610 98401 76943 11573
32172 11573 40476 74292 58823 -2418 -14881 67733 122435 63704 71022 36333 98729 156085
32160 156085 118115 46096 86461 158742 140524 138365 4965 -105978 -139377 -113228 -68958
32149 -68958 -46472 40942 73059 33131 121689 159184 109127 16309 -4622 17005 37083 20126
32137 20126 -980 -52647 -78242 7901 42285 99094 99687 56948 51208 25141 30858 86273
32125 86273 126271 128003 85901 113477 143440 197885 181360 168401 163502 203077 159386 120562
32113 120562 119332 48282 43209 100822 127947 106067 13259 68632 99410 47089 -25277 -18923
32101 -18923 73736 161561 112403 9716 -32789 42129 9280 -117326 -116769 3429 16449
32090 16449 -13630 -57072 -17872 21221 15463 -4188 60442 97301 96945 102829 152173 58394
32078 58394 24558 45551 -28106 -14425 65312 101795 156707 183542 122118 7509 -34012
32067 -34012 39773 80596 80621 72998 89020 19580 -7374 -21618 -48977 -70342 -124142 -90850
32055 -90850 -36568 44391 133272 77527 11353 37541 114787 105401 87854 109812 110494 157444
32043 157444 120499 105128 79238 71368 25053 84425 110474 168533 161456 116438 55928 -4460
32031 -4460 -94261 -126991 -59898 75786 108255 105789 21827 -73583 -65175 -20779 1626 20904
32019 20904 87710 104776 71216 42612 25306 78069 102867 85783 98938 76096 22672 55264
32007 55264 49476 32955 126305 106251 69873 59362 122767 93749 26038 73012 42989 3617
31995 3617 15167 -36823 -80497 -58869 -27485 -11146 9629 94839 122855 141987 56563 38846
31983 38846 47413 45193 144381 155258 184355 129856 47421 104506 111282 88869 108307 107667 -1601
31970 -1601 -79029 -117240 -63328 59634 102834 64068 39249 38599 104265 138081 74786 32868
31958 32868 41489 -8259 -18624 85325 86547 19621 2655 1414 -9134 38651 64242 127787
31946 127787 94908 -2871 5701 73331 86728 64539 33913 -29837 -69330 -55012 17575 -2983
31934 -2983 -45476 29933 58634 67278 14776 -102622 -91104 -27469 9093 8688 -916 20679
31922 20679 -5980 -30285 55291 62566 69074 66065 67169 19310 48656 73862 33256 24544 -46779
31909 -46779 -70763 19093 88400 129267 128237 86112 103979 75052 48290 88529 35580 21777
31897 21777 18640 17424 41262 24868 38161 86601 80859 45385 5608 25847 -18634 -24846
31885 -24846 -21850 -78654 -74929 -94887 -53252 -18450 -47104 -32142 -44713 -42104 -85201 -60130
31873 -60130 -100959 -122701 -121182 -125250 -124466 -83674 -48078 -46684 -53683 -11150 -33472 -64546 -36762
31860 -36762 56735 77679 -88861 -135390 -170687 -155547 -147405 -120838 -103430 -35568 -7090 2144
31848 2144 -1850 -7681 12533 -5767 -4527 -85839 -142374 -93274 -43432 2579 53657 41509
31836 41509 13326 9642 -55436 578 62850 16723 34397 85402 64855 2280 -14818 -23464
31824 -23464 15070 13735 1354 -69818 -58097 32081 145681 95701 49915 56804 39118 3829
31812 3829 -83626 -72182 -52315 -24612 9581 52544 64924 59719 25458 34845 46889 11820
31800 11820 -48261 -72249 -11376 -98251 -59950 38794 111688 136182 160118 63113 31736 80124
31788 80124 145467 162631 177336 110901 38392 -76648 -54128 5389 23508 -26420 -35661 -72650
31776 -72650 -75058 -19478 -25281 9068 85988 46040 -43731 -95618 -35192 24243 39837 -61760
31764 -61760 -128758 -60796 -38450 7373 12968 -7214 -22856 -43664 -96116 -133644 -154249 -102755
31752 -102755 -98596 -133094 -151503 -107276 -93731 -127004 -84951 -65197 -4117 42910 9285 -33878
31740 -33878 -24694 -36980 56872 149758 124096 180441 127491 151694 155041 103104 19883 -15839
31728 -15839 -9567 60834 109381 80578 18770 -27232 -1098 8070 105025 223881 206553 188218
31716 188218 168939 85415 27066 -21124 -33894 -52822 -34960 30565 112072 123656 79032
31705 79032 123714 121899 95858 107967 65621 46889 -22712 -36528 8560 -33893 -34333 7087
31693 7087 3728 40069 45261 81974 82767 -36179 -158859 -85877 19748 36590 987 27393
31681 27393 7988 -42127 -79634 -11947 86200 131341 58843 -56854 -109427 -80490 -32768
31670 -32768 24614 91573 51614 -74534 -115323 -32808 91903 63577 61450 60009 59344 -4919
31658 -4919 28736 39853 27660 42060 98393 89135 157771 180495 59576 60861 105596 130048
31646 130048 98965 35874 11727 97395 135473 138390 66783 62689 79023 65963 48579 75656
31634 75656 117363 104768 22907 33323 134940 189034 239643 207981 103224 74852 93503
31623 93503 113843 62180 6022 4528 36158 38067 47283 42323 31879 68198 144615 204239
31611 204239 92734 14247 -40102 -36054 -26946 -63834 33888 116426 124975 -18449 -55482 -68573
31599 -68573 -33715 53467 102139 63229 -19418 28095 33355 -10786 -69121 -88772 -68900 86484
31587 86484 110388 38975 -10621 -50370 -48840 -31969 39057 90302 46467 32005 52224 106589
31575 106589 141814 209794 196052 33758 -1073 17969 -30868 -51800 -20104 -75686 -32170
31564 -32170 82643 52982 -18450 -19351 27926 20913 -8768 -62207 -2790 51425 49887 66734
31552 66734 81657 32285 62889 52374 28741 10507 2629 25777 -56434 -112444 -14527 23889
31540 23889 -3709 -25988 -3457 38547 46580 18505 -15913 -32573 -10345 54475 119456 102036
31528 102036 22984 17326 42113 79884 36671 3015 26844 40736 26820 29243 72772 33860
31516 33860 -20252 10268 -19289 -1474 54972 105582 139463 28469 8248 1974 7485 -51797
31504 -51797 -99443 -28778 36480 88702 110384 53063 11596 -32523 -10305 -40286 25820 -33378
31492 -33378 -73262 -35251 -35834 -91398 -75119 1158 -61364 -100087 -69986 -69239 -23967 -38304
31480 -38304 -13935 20748 31862 108 94699 224503 168529 100762 35282 -31248 -62567
31469 -62567 70656 147669 137718 64167 7595 44458 -31130 -59397 -81085 -139641 -133526 -9036
31457 -9036 38821 8812 -33673 -46279 -32588 25619 26909 55045 102112 112187 58463 11530
31445 11530 71565 170508 87432 33792 88450 96909 124827 108021 47951 53026 115005 74521
31433 74521 83278 67274 42111 403 -804 -35720 -138120 -161349 -260993 -226959 -179863 -116532
31421 -116532 -46048 6860 46266 92214 85850 64217 -31142 -53977 -149491 -142177 -91476 -85473
31409 -85473 -35426 -3828 -102 -13867 -59213 -105964 -123471 -67070 2123 -46352 -81727 -115359
31397 -115359 -57954 -21974 1097 -9528 5295 -5406 -54550 14072 75765 5267 -97928
31386 -97928 -59444 -3464 56919 68795 27357 -70026 -11962 9884 12933 31375 24559 66200
31374 66200 81461 108908 74775 65974 11802 -60279 -145247 -144185 -43268 -27197 48481 7690
31362 7690 -46431 -96542 -83381 -53615 -47974 -91616 -115841 -211993 -116223 -46719 -36319 -25665
31350 -25665 3940 22566 8150 -28338 -61563 -34957 57245 49778 14779 -44250 -29217 1567
31338 1567 118506 144131 128310 154010 137188 110269 57574 86645 123817 104277 47808 29059
31326 29059 -51645 13895 45652 43062 68118 20823 -6761 -39605 18395 111537 108156 110419
31314 110419 160627 187579 117290 67064 56061 31028 -31496 23745 170243 183692 74127
31303 74127 22588 14975 -48827 -110813 -111729 -141326 -109537 -80417 -55301 -24810 20600 37654
31291 37654 74690 -31515 -111345 -65364 48111 66032 13543 -14735 17474 64083 112920
31280 112920 122944 60590 55095 108978 94931 17784 2076 56742 109076 74075 127453 103371
31268 103371 17421 -68755 -101619 -42567 -4795 55717 57599 87142 151729 79477 66725 85366
31256 85366 76213 95102 65690 -4648 -65677 -42701 -18928 -47207 -57192 -30407 14491 38232
31244 38232 -64185 -109079 -81883 -111495 -26983 11292 13988 21080 16709 7756 8749 -52121 -69824
31231 -69824 -48956 -79958 -126533 -31249 -21693 -29087 51496 52369 -35677 -93914 -33165 18466
31219 18466 17919 -1621 -58154 -4062 72264 100403 96325 32508 -1310 24365 25168 58600 58926
31206 58926 92766 93827 17481 -49463 15294 62551 96813 23590 -4120 4043 -18174 -17450
31194 -17450 22788 47653 51766 55483 65228 39455 -5225 587 33494 172376 130539 3558
31182 3558 -55284 -64430 -54848 -57271 -103120 -16906 64156 100807 106106 116932 142601 64452 -8204
31169 -8204 -47845 -37952 14549 94116 54999 -9634 1078 16166 18221 46477 108186 103984
31157 103984 25325 -10647 25768 83546 80488 -15947 -54503 -26466 -36317 -48776 -12229 -14371
31145 -14371 31816 23650 -46825 -90221 -155450 -73288 24602 84868 -29609 -75625 44432
31134 44432 80301 143053 68079 47286 87099 34930 5258 -82038 -143838 -111554 -57964 -24026
31122 -24026 -6412 -23615 -41458 -56301 -3057 94548 60249 38103 15047 -11818 -40147 -29787
31110 -29787 6954 42351 37570 -18424 61081 158946 154899 94326 125211 141838 109344 85561
31098 85561 41109 62440 43328 19954 -38271 -49905 -52441 -28376 50549 7650 -23523 -2037
31086 -2037 85181 32589 -19487 -55319 -7243 -10126 -14531 -13298 -39966 -51869 -58208 -110906 -17677
31073 -17677 -22966 87032 121188 78827 18150 -808 -10135 25700 -4822 -41748 -56847 -40075
31061 -40075 8462 58625 91161 72013 40885 89217 84187 45349 -14811 -59149 -47270 -16494
31049 -16494 33776 56021 61195 31680 48773 46764 -29920 -9793 -77479 -140296 -15757 63009
31037 63009 39967 13352 45739 18385 -44603 -49965 -123209 -127281 -177561 -217017 -173119 -147287
31025 -147287 -79563 -49759 -60621 -21864 28495 57206 -2636 -36258 -106555 -119784 -97499
31014 -97499 -65645 -50941 -89948 -74389 -58544 -70420 -49582 -24991 39394 55764 45636 17513
31002 17513 52056 45652 69587 96319 114085 136862 184193 168175 128384 115724 140409 117567
30990 117567 46428 14489 16537 35828 58515 72745 55462 43046 -14518 -34761 -9054 18226
30978 18226 35475 16211 25039 48191 94906 63998 7246 -51378 -25658 -48782 -48611 -81659
30966 -81659 -72415 -49191 -131372 -116578 -35024 -17227 -55589 -69601 -50584 -20213 -15432 10201
30954 10201 -20942 849 70283 60937 41608 83337 82057 32793 -13985 -17622 18506 43363
30942 43363 48774 25317 -33815 -38281 40958 121460 141757 144232 146584 11958 -26955 -16879
30930 -16879 -6353 35523 26754 15748 35621 15707 -71333 -108648 -82486 -25077 21792 -11268
30918 -11268 -62390 13641 32871 7744 -28640 43422 6301 27612 86002 36303 -48051 -111297
30906 -111297 -63333 -89716 -109048 -45107 -2782 -2584 9952 -10612 6076 -20554 87147 16330
30894 16330 -27432 9688 -33894 -45355 -37065 22084 6387 -67188 -106956 -65439 -35264 -22335
30882 -22335 -4124 -3514 -42881 -2918 73529 144910 98357 115030 143004 61088 -2956 -800
30870 -800 10109 -55778 -100912 -22619 28591 76007 61846 -17003 34100 115342 48645 -31594
30858 -31594 -144783 -138758 -89098 -83013 -63228 -22098 -18086 -16004 49022 52939 -35122 -25238 -13100
30845 -13100 35468 -23113 -85698 -56573 -22881 58138 105497 66342 72979 86241 80155 114250
30833 114250 117315 67221 29920 -86075 -98448 -47317 -87524 -157273 -150691 -117313 -49202 5261
30821 5261 19826 20565 50658 75758 3994 7266 28864 -33218 -54606 -110447 -153114 -145842 -85122
30808 -85122 -34585 -40259 -5899 23679 36680 22869 7225 14906 -50289 -36087 -2949 -38939
30796 -38939 -10038 22831 7969 29848 73066 79837 30040 -31972 -89007 -85981 -70540 -131661
30784 -131661 -170301 -112485 4860 46571 17596 -63817 -46655 -28384 -67809 -144094 -32932
30773 -32932 11894 -3246 -6236 -41727 -20363 -54531 -116990 -80361 -10452 95171 148673 5423
30761 5423 -65095 -41001 -29301 11730 -33416 -18390 -6463 3265 22882 9566 46614 30700
30749 30700 5194 47778 47398 51100 -31014 -63748 -144632 -117931 32331 -22513 -115712 -116935
30737 -116935 -22075 50699 74265 -4137 -28782 -4288 -68223 -38422 38257 54853 9392
30726 9392 22480 -6718 38966 78524 63613 51615 -4528 -99258 -117261 -68776 -66137 -78643
30714 -78643 -74996 -1611 16720 45961 95202 107214 90819 -11419 21225 11153 62909 77853
30702 77853 104433 112876 97748 103311 24912 -36998 -137047 -194937 -152823 -77663 -180403 -197041
30690 -197041 -210214 -115825 -59289 -8806 -64195 -20860 -12687 -306 -3610 96673 119993 13697
30678 13697 -30622 -65261 -769 33909 27072 -15460 -63274 -68844 -16170 -24727 -54223 -112489
30666 -112489 -2907 75803 154727 118148 108986 117102 156867 132876 100526 12913 25626 81292
30654 81292 -15488 -122531 -135380 -106846 -9171 -62539 11461 77220 69259 -33693 -65730
30643 -65730 -106030 -145761 -110392 -74092 13052 56905 12523 -50255 -13597 39771 102695 75357
30631 75357 27886 -66985 -90876 -43891 -21418 -9525 -20382 -10802 63917 108002 151594 111409
30619 111409 109994 83771 2081 -13739 -49099 -27008 -6370 -67840 -72407 -74988 -33027 15568
30607 15568 39052 -60186 -46750 79332 89030 87879 848 -25103 -1527 58798 35904 13707
30595 13707 -92777 -101552 22841 41353 32136 20129 -9796 -16059 -29496 7940 51531 -32361
30583 -32361 -46489 9183 -13143 29508 71899 34008 53546 118053 50196 -35239 -87853 -95729
30571 -95729 -100870 -38318 60506 115581 46976 48923 25158 22032 2359 63026 70685 -18129
30559 -18129 -51647 -6008 63488 150369 134448 50571 16687 37904 59109 1053 9412 42042
30547 42042 15794 29067 87779 64972 -6407 -30342 -44835 -29883 -31631 -67296 -77 68328
30535 68328 68752 120870 143967 80598 17623 -15996 -33954 -18708 13412 33106 -28686 1640
30523 1640 17035 -43141 -52108 -33434 -32876 -26195 -46954 13036 13538 -16887 2149 -39617 -87930
30510 -87930 -121261 -140842 -106166 -75318 -6895 -609 -36848 38309 8210 -18144 -86834 -65283
30498 -65283 -71935 -23198 -40272 37217 110875 89786 33225 50581 22444 -119271 -161268 -164813
30486 -164813 -197151 -184363 -99831 -101608 -184183 -202397 -139894 -94228 -69230 -89961 -143798 -144131
30474 -144131 -112381 -101416 -92971 -111167 -112281 -136927 -142634 -152531 -121609 -10134 -52083 -87591
30462 -87591 -57291 29740 33046 34831 49036 -3456 -89639 -70071 -67792 -6832 20508 15184
30450 15184 -96428 -164062 -159812 -93514 -26461 25168 12960 6127 67286 101901 99012 106056
30438 106056 97214 35336 48623 75669 15289 -7397 -78781 -75201 -21371 -39904 -15149 16548
30426 16548 66821 110186 4469 -44842 -7526 -29852 -35541 7244 -35848 -15319 -39709 -70375
30414 -70375 -47045 -71814 -111214 -73935 -74224 -8200 98222 146132 164250 154847 110057 114419
30402 114419 86429 121527 137835 181757 108806 -13216 -108075 -85596 -95802 -158397 -102065
30391 -102065 -130277 -124931 -143736 -82069 45536 95933 48489 -30636 -24415 3106 -13071 -17630
30379 -17630 45381 16037 44589 -5597 -123249 -96597 10405 30554 -24179 -5460 18447
30368 18447 -44933 -134232 -144402 -187206 -90696 -12353 -79918 -193422 -97453 -60120 -91764
30357 -91764 -15839 -1044 -56349 -24206 -15524 11504 34475 -1071 -8936 81489 93034 118959
30345 118959 55852 -6203 79 -12196 46423 113031 111222 92330 120774 78569 105746 40561
30333 40561 -3791 36354 65627 65678 72696 74704 153567 112422 86895 4862 16932 -29030 48959
30320 48959 135142 126878 173183 119034 89473 64092 43425 15046 -32766 -80735 -64225 -48660
30308 -48660 3262 47367 46853 2695 -18282 -24556 -74478 -79811 -22374 83177 95811 -3637
30296 -3637 -112210 -157469 -133341 -122836 -42507 17455 5678 30483 67538 -1539 -76568 -33509
30284 -33509 -22952 -55332 -54868 -64433 -8984 42226 50539 27247 12219 41033 38010 45184 -13547
30271 -13547 -95220 -75573 -66772 -15490 48183 69586 94043 141019 17510 -6832 -18751 37487
30259 37487 120623 84310 -61055 -87258 -85659 -42467 -13030 -48625 -78060 8191 65981 122135
30247 122135 52093 31677 76831 80885 61179 41328 -44866 -38505 -36428 -85743 -114883 -94776
30235 -94776 -83955 -6392 82236 64993 60487 30938 -34539 9549 38931 25498 -8154 -35629
30223 -35629 30399 74084 39320 34911 105654 136482 141889 124163 30362 -35312 11600 47011
30211 47011 116590 140621 94821 117824 111389 55291 11610 -82331 -116450 -57000 -17985 -60192
30199 -60192 -55990 47287 70008 54025 87544 100500 168223 107799 26576 -29299 -41110 -56935
30187 -56935 -60235 -153587 -160923 -137914 -96604 -83399 7251 -1399 -26111 -19065 -12416 19558 27816
30174 27816 21052 -25323 -41873 -10338 -21097 28319 28153 -15978 -57841 -30688 -39978 -102325
30162 -102325 -161743 -184414 -120848 -88846 -31993 27256 -757 -58702 -8005 29847 64575
30151 64575 146241 149876 134914 76636 -2230 10733 49026 18656 -42527 -24283 -36493 -49051
30139 -49051 -91070 -178428 -129158 -106108 -62707 -56304 -97723 -76678 -66222 -73748 -309 -18869
30127 -18869 20198 71802 92540 76263 50791 40914 15626 18902 38 58611 123637 160744
30115 160744 258837 196521 159994 166800 78738 69003 144743 137674 55664 -28919 -6810 -32635
30103 -32635 -150376 -130218 -72033 -76609 -59551 -45039 33241 13642 4612 22739 -18152 -68812
30091 -68812 -66913 -26807 -34081 -19537 75852 96082 7521 42835 38291 3087 -9074 9041
30079 9041 -2643 15095 68946 -23687 -77622 -125101 -145725 -25086 105474 43788 -39211
30068 -39211 -55751 -79357 -148505 -174116 -134667 -56268 36842 12894 25935 11268 28258 36263
30056 36263 11944 9060 -6240 -55237 -68152 -82926 -63589 -38403 -35484 -41155 -120243 -119488 -76059
30043 -76059 -44343 -39314 -54074 -168310 -242455 -217105 -142476 -95748 -103784 -61938 -44166 -45815
30031 -45815 -56677 26860 88562 116896 69636 35223 58944 67416 62112 63223 3701 11738
30019 11738 -20576 57385 33571 -59136 -127380 -72572 -60844 -154103 -142962 -120941 -116926 -100122
30007 -100122 -85010 -88202 -77325 -19857 73589 -13836 -76548 -56744 5870 61457 23503 -23964
29995 -23964 -52788 6514 25850 37936 57773 14715 43926 21136 13013 -18202 64645 84828
29983 84828 106532 137033 129222 135866 153527 140258 93629 51471 49446 36313 85883 108526
29971 108526 75304 63920 45472 9645 21826 25893 7793 -52498 -58373 10149 -18445 48975
29959 48975 60743 37917 59094 57371 130977 162508 95797 -1739 -71550 -44348 -24050 -36587
29947 -36587 -12805 -51338 -78533 -164482 -189548 -170876 -133821 -79780 -98038 -64480 5192 18926
29935 18926 38155 -58188 -112231 -14335 -4623 -36390 -59484 -48737 77735 105370 7535 11387
29923 11387 29983 27780 103694 165393 143896 142018 117546 121253 76745 20054 -83777 -118975
29911 -118975 -132127 -155751 -143968 -105040 -111665 -145607 -173143 -169912 -25448 -134474 -170460
29900 -170460 -178449 -188700 -125939 -125507 -146542 -72962 -9302 19763 -125389 -143811 9137 139262
29888 139262 160491 127914 103647 79793 18576 16538 95502 40755 20383 64823 52458 87436
29876 87436 104679 101542 106197 82514 106230 78434 -57645 -105179 -162308 -156315 -78623 -107606
29864 -107606 -125484 -83495 -65 -6029 34555 58227 13272 -43383 -6133 -1379 5479 36081
29852 36081 107530 59718 -11764 -59743 -31647 24475 83769 81842 46272 38521 -2590 -20699
29840 -20699 -66379 -149286 -108864 -99879 -75919 -2203 62351 99922 78395 118506 157910 209834
29828 209834 137628 76921 106383 57557 76708 26981 -363 12366 7815 42806 43219 -18578
29816 -18578 -47015 99218 157163 75914 3648 29290 131020 174538 110224 78145 37263
29805 37263 38077 57796 -3913 36213 53514 -11244 -120372 -200515 -133648 27056 83143 -11653
29793 -11653 -122468 -96148 -44508 -124129 -137745 -99484 -26483 -84497 -76282 -38788 -133166 -99840
29781 -99840 -91497 -41851 7389 -245 -25214 2076 16395 10295 -44529 -103424 -157808 -119315
29769 -119315 16229 28059 -49926 -38638 -26241 41581 100953 84665 -27960 -147874 -96966
29758 -96966 -57706 -40298 58500 44460 -9995 70886 122520 79806 -71692 -95312 -139143
29747 -139143 -118951 -54639 -85151 -113540 -114535 -197115 -197218 -88987 22013 13664 -3781 -59815
29735 -59815 -43384 24267 -25711 -44315 -34305 -21443 38595 38999 -38311 -144912 -226618 -209206
29723 -209206 -115593 -78683 -33868 -36554 -175066 -228037 -180188 -20542 15413 -13769 -124439
29712 -124439 -172178 -104253 -34054 -27291 -36389 -42623 -64974 -68497 -4326 27005 19163 2409
29700 2409 -60964 -131313 -158887 -140368 -133776 -71354 -74076 -30701 28103 19630 -49414 -49997 -18138
29687 -18138 55255 114041 95754 51301 10000 7904 -45041 -47271 6507 -38633 -156419 -130294
29675 -130294 -117342 -147081 -159690 -134350 -129392 -154457 -165276 -131018 -163300 -164097 -110486 -66857
29663 -66857 -112361 -135199 -159509 -163017 -161182 -210867 -175139 -35368 37866 -74291 -60124 -3492
29651 -3492 36024 117354 50286 4118 7430 -30069 -91136 -56847 -10809 -66130 -33401 -49335
29639 -49335 -38078 25291 41128 47642 65337 16829 21693 -16842 13042 54139 33852 30845
29627 30845 -34597 20932 19858 -66978 -64523 -61161 -21522 -5302 -7854 -30413 -6076 2008 -16133
29614 -16133 -148465 -85752 13486 38741 -27550 -52581 4082 -406 28669 81947 58245 12315
29602 12315 -97443 -207763 -171771 -88674 -65889 -83018 -30241 -19597 -101701 -106258 -47596
29591 -47596 -45512 -47729 -24963 -51921 -15049 94978 7294 6768 79583 10147 -53495 46263
29579 46263 40336 -44579 -124161 -154578 -137994 -11622 -46888 -41350 232 -44626 -23508 40135
29567 40135 58696 41460 42581 102441 117792 89427 122371 41590 15934 -53713 843 84729
29555 84729 63467 -269 -24031 -56001 -115854 -62900 -82474 -100058 -122741 -115792 13979 78038
29543 78038 141 2376 -18547 -110446 -40376 47365 46939 59576 11586 62470 103647 53171
29531 53171 -59467 -19593 71650 68730 109559 103316 63617 -4459 21501 91450 18258 28643
29519 28643 86062 83154 42599 -38642 -73720 -48874 -490 58760 65717 36691 -4573 16026
29507 16026 43397 41462 -9612 -76346 -85167 10727 63657 119865 120481 82753 28922 67796
29495 67796 16225 -38871 -36205 -39583 -56421 -29921 18592 -53029 -68888 -81122 -19173 26703
29483 26703 105643 154735 136352 123522 78575 -28201 -27182 -19580 -87672 -54534 -76656 -96227
29471 -96227 -76222 7271 102919 124644 40356 -35950 -18380 -1240 23649 6517 4059 58832
29459 58832 37688 -23124 15540 43116 74866 18423 -628 -40202 -22477 -34957 -66541 -95024
29447 -95024 8794 63849 54471 -23268 -25750 -28452 -73336 -169831 -74771 -33367 -21890 -80118
29435 -80118 -80305 -67090 -39918 -70506 -56067 -57906 -126289 -144774 -64514 -64510 -98841 -22676 37954
29422 37954 1664 35989 29594 4242 9580 -30394 -12178 42277 114811 137257 99247 35031
29410 35031 -68015 -114546 -33752 -31531 -60046 -7050 15817 7271 24894 67468 53435 -5533
29398 -5533 8987 -70000 -120714 -90895 -42172 -46616 -33847 61983 -47296 -89505 -17400 -42369
29386 -42369 3711 -68981 -132167 -190049 -186479 -167638 -210580 -167538 -8009 21944 80911 53714
29374 53714 55218 132669 164074 133199 38826 25108 -29515 -31934 -38639 -83409 -4494 72009
29362 72009 96803 56259 -35494 -32591 -6882 43749 55642 -3866 -13828 85200 90944 146470
29350 146470 180965 262594 227142 59781 68775 40421 14293 125287 117939 16827 -24293
29339 -24293 18236 112642 143849 117838 141428 142048 108813 120049 121632 58619 -32228 -55670
29327 -55670 -39751 -79581 -150623 -156295 -114011 -184192 -189580 -110316 -46238 -65403 -31030 17847
29315 17847 -62006 -44208 -49669 -55168 19516 136846 133246 114339 60498 -74330 -127413 -60257
29303 -60257 41468 71964 132781 146253 88262 67377 12747 -40736 -43274 14076 48111 55822
29291 55822 56028 45519 24580 11290 -44380 -45021 -68168 -124476 -118883 -62298 -74889 7318 -42587
29278 -42587 -111053 -100387 -107865 -47214 21643 43925 2567 39349 162376 206094 166958 111149
29266 111149 152784 197563 117904 -81123 -127022 -102318 -84971 -35452 -14856 3227 -18162
29255 -18162 -79696 -52632 21888 -2669 -1919 -2981 -4065 3373 -7628 -76025 -90625 -33588 -56655
29242 -56655 -53943 11063 88809 108596 57959 19256 -22197 -56502 3599 -42287 -105374 -60780
29230 -60780 25074 42211 10470 -3189 69668 46058 4062 10250 66165 53917 4656 -12839
29218 -12839 -38247 -45124 13159 22240 17947 -93832 -75173 -53783 -99437 -105673 -109342 -60872
29206 -60872 -16377 -63784 -76757 -46346 -35638 -25397 -44841 -42845 88865 144701 74517 106262
29194 106262 99146 89614 94530 98154 53791 25521 25570 -19369 -26628 -46264 10313 11996 15422
29181 15422 -4299 44014 33884 76554 113987 66622 -85307 -108227 -57281 32372 11454
29170 11454 -79867 -138670 -125066 -72036 -78126 -138213 -107147 -31351 -39240 26107 65414 -26486
29158 -26486 61849 144854 55227 42360 734 -225 31942 -34403 -11536 -44900 13252 61401
29146 61401 89501 27980 -26042 21409 91347 128022 68159 35322 7310 -41957 5928 38146
29134 38146 72441 41065 32714 10984 -11160 17204 38283 22752 19520 47619 67322 28366
29122 28366 14044 66110 68710 -3107 -56056 6550 21114 102117 113786 101725 67128 44982
29110 44982 18631 -24524 -44191 20542 72107 -118 -16974 7311 6149 -17389 40855 70122
29098 70122 111657 105101 51739 -10045 23959 105153 53561 36523 35714 -8865 -12984 113763
29086 113763 199843 133101 55767 3910 13502 33616 -7382 -62203 -69999 27026 23740 -38648
29074 -38648 -43149 -3449 35785 -6662 -74398 -110629 -110908 -70921 -158311 -181669 -127136 -142126
29062 -142126 -115468 -156100 -154047 -109663 -90266 -89459 -21708 59552 -10405 -16135 9218 40471
29050 40471 81314 63815 19405 19761 -25143 -116586 -72133 2534 -39968 -94809 -50340 -45302
29038 -45302 -103472 -130553 -105660 -46320 -17894 8712 53775 -19183 -66726 -84561 -102200 -106136
29026 -106136 -71024 -36923 9431 45631 -82 -18387 -36482 -55186 -70914 -9075 -59223
29015 -59223 -78946 -43775 -20714 10190 -40091 -80311 -98698 -63549 50254 65606 -36265
29004 -36265 -16438 -13529 -154979 -190497 -98182 -59771 2941 -29438 -58504 -83208 -19739 -6419
28992 -6419 52345 97098 123099 52789 26432 54133 18932 56631 71463 44447 69840 7872
28980 7872 -39050 -92642 -105164 -50647 -22095 37419 39707 50198 13904 -30994 23622 35926
28968 35926 4935 -54448 35788 120183 95894 69196 91307 99734 151176 157839 90381 4572
28956 4572 -80162 -134924 -138145 -104961 -110074 -81948 -74574 -48291 -91206 -93510 -51973 -67395 -18588
28943 -18588 13626 20666 62448 48116 58849 30855 -18908 19416 -28546 -89263 -46605 -67978
28931 -67978 -110151 -100883 -131542 -108652 -55091 -67176 -30827 -57037 -13911 13374 64798 32264
28919 32264 -55324 -108730 -131024 -63511 14636 14716 30595 -12628 -55769 -42200 -48631 -1715
28907 -1715 66924 2831 -30661 2833 -99674 -131292 -156455 -105279 -77218 -72233 -76332 -67273
28895 -67273 -4026 2645 -46065 -83151 -124415 -146435 -145227 -112683 -56573 -87546 -52202 -6520
28883 -6520 -17993 30330 -12564 -6972 61099 14885 5498 51316 86461 -57202 -59560 51831
28871 51831 53414 23946 -58464 -48989 25855 76318 87606 42307 -5432 -64058 -12431 89039
28859 89039 153596 49676 49781 66125 -15314 -63015 -21570 -28228 -28122 31797 80204 49059
28847 49059 23840 38921 76266 120007 142188 194129 76976 17424 4632 -12244 52798
28836 52798 73772 -15790 -24483 67098 -27528 -78720 -76129 -32229 -25480 -31731 -60526 -116205
28824 -116205 -227947 -253179 -191038 -130212 -16802 139896 182941 105529 35531 -21531 -85064
28813 -85064 -193341 -156889 -88293 -31203 22049 -6061 -13497 8843 36835 70783 109037 93342
28801 93342 43286 13403 12364 -66199 -99496 -47498 -24750 -40265 -57192 -139467 -139976 -83828
28789 -83828 -80888 -102176 -125782 -44140 39815 -23563 -71974 -34290 -17808 -2550 -46485 -96197
28777 -96197 -104088 -113246 -89165 -66193 -36346 -53740 -41746 -22711 -114251 -202542 -151064 -78616
28765 -78616 -58944 -20589 70269 129575 117703 81016 44728 43893 -10359 -98778 -169157 -122187
28753 -122187 -73897 -45415 -104527 -72020 -2027 -38540 -11955 -45557 -82316 -93289 -87568 -33222
28741 -33222 -88484 -87404 -17389 4377 -472 33865 85774 64307 3523 -21286 -28707 29690
28729 29690 -5065 -43378 -70497 -51378 4022 -6738 -12866 25946 -24874 -83185 -47724 -80769
28717 -80769 -127841 -113564 -178765 -162674 -140154 -147369 -128544 -31683 55128 57408 -29848 -82853
28705 -82853 -61836 -72893 -34422 -5563 -84545 -75516 -37368 16144 112266 113966 108453 104514
28693 104514 57087 -8335 -6709 27781 108265 13026 66635 143505 114793 85608 48881 77727
28681 77727 108208 82667 131695 120484 89271 142602 162114 94995 16995 51825 37453 -22782
28669 -22782 -65138 -41975 -24403 -5452 -9172 -74580 -53257 22878 4397 -22462 39349 -12506
28657 -12506 1186 63879 85397 59610 62982 58594 -20313 -119469 -88238 -30303 44868 67568
28645 67568 75633 27239 15308 -31464 -47445 15568 48246 -362 -53884 -2533 -30927 -21142
28633 -21142 1489 8486 7621 15765 -22944 32284 -46128 -130892 -129156 -11872 -10033 -20406 -54337
28620 -54337 -67113 -116296 -102122 -8308 50630 37679 82638 -27342 -29150 -28307 -32181 775
28608 775 -85338 -164115 -149387 -85056 -78766 -114698 -97734 -58151 -61729 -98498 -115402 -90908
28596 -90908 -127384 -144507 -127228 19629 83479 18528 -58907 -122621 -103929 -84271 -9828
28585 -9828 44979 26280 -34556 -55317 -1445 -2724 -69158 -94425 -98501 -30358 -5102 -38185
28573 -38185 -86217 -102053 -23890 41346 -61994 -43467 -99719 -125294 -29613 23743 -47476
28562 -47476 -47878 -16652 -64355 -119868 -203366 -178789 -137553 -133511 -119108 -179132 -219653 -154391
28550 -154391 -43729 49219 24597 -55166 -109246 -73296 -63020 -72543 -36582 -131247 -107286
28539 -107286 -116910 -13844 -36350 -6043 66244 63372 -24361 -74591 -58691 17951 -69737 -120889
28527 -120889 -162804 -99471 49189 157721 129463 -37884 -70924 -88167 -154639 -171484 -96769
28516 -96769 -67492 -69074 -75632 -90395 -117588 -125652 -128072 -85061 -30908 -51223 -31713 -71916
28504 -71916 -5896 -2564 -13588 -31396 -97574 -184401 -82867 53520 20072 -15945 -25069 -67714
28492 -67714 -91672 -66848 -79732 -90832 -19428 29736 44526 35011 -51395 -82076 33293 66985
28480 66985 2996 -133028 -220924 -149773 -62354 47876 68270 37823 -40278 -169166 -180744
28469 -180744 -120369 -50620 -42330 -98820 -68383 -10941 -3506 -4676 -9441 -52668 -67541 -54553
28457 -54553 -63724 -27170 33328 36063 -59819 -145894 -168817 -77055 31718 26089 67309 108925
28445 108925 141702 83415 59505 85798 83589 82560 77955 31857 18742 -2867 -26649 27664
28433 27664 88131 176471 178284 138761 189873 252127 187571 123683 56626 18117 -47033 5651
28421 5651 -34849 -36874 16656 8047 -120109 -81458 -32039 -3379 -25401 -22097 -13438 7730
28409 7730 682 -38134 -22167 -25583 -84109 -99290 -96856 -45337 -25037 -14838 3357 -25949
28397 -25949 -53986 -41779 -76671 -24543 -18570 -70175 -102404 -113555 -139787 -153662 -134377 -136187
28385 -136187 -166525 -76052 -19103 -37660 -31412 -34443 39561 51627 81042 16210 38778 54566
28373 54566 -700 -52852 -57014 -46305 -41330 -42363 -66567 -111583 -146419 -83704 -27412 9256
28361 9256 -20815 -75837 8571 9372 12606 -31647 -46822 -10765 -3329 4508 -23298 -9189 69926
28348 69926 89249 19696 -27440 1866 90951 152805 48565 35643 36409 20008 -38554 -55363
28336 -55363 18414 114699 161048 73331 -13459 -71573 -84097 -20370 10871 46803 19265 -4544
28324 -4544 11336 -30323 -81333 -139408 -84126 -57321 -65733 -78770 -74999 -14134 35473 -20978
28312 -20978 -51337 -15545 67856 97490 85827 90216 131004 102143 53328 -33339 -73745 -92856
28300 -92856 -47270 -7630 -92538 -150995 -94764 -31270 19755 21226 38819 9074 -2139 19622
28288 19622 40388 -48482 -111890 -135336 -54379 49683 73357 93342 39335 -27317 -51710
28277 -51710 -54084 -50263 -131182 -99130 -72652 11468 -50048 -103568 -79148 -98954 -167661 -134109
28265 -134109 -18755 6851 -98273 -112200 -88546 -12442 -20409 -130769 -177080 -146300 -117053
28254 -117053 -110096 -49406 -82906 -72258 -48609 -24647 -51998 -91113 -87868 10041 93447 83665
28242 83665 48543 54992 87209 110160 -1716 -104017 -90706 -80926 -27213 25193 21563 19019
28230 19019 -17734 -27292 8469 95455 1281 -11178 -22129 -17645 -43122 -70537 -12319 -75263
28218 -75263 -171890 -144845 -57194 -9815 -26597 -89943 -100505 -151333 -149261 -168029 -79926 24622
28206 24622 9622 58929 1482 -55261 -41232 -61616 -9611 -21755 -24864 -11141 -66340 -85349
28194 -85349 -116253 -160324 -73677 -72551 -122093 -40443 13345 -40851 -164551 -151995 -119854 -81907
28182 -81907 -95331 -98391 -55172 1044 -3069 16656 -61964 -180271 -120657 -52157 -26300 -21695
28170 -21695 8494 -17225 -42137 -24948 40793 26916 79579 76331 -12754 35208 16464 -19519
28158 -19519 9645 23521 39709 31742 2431 23514 -40253 -98100 -86699 -5978 45066 4313
28146 4313 -443 -74804 -22028 74491 120883 79370 -32512 -47787 -59174 -54697 4578 -4594
28134 -4594 9569 -55258 -16615 15872 2271 -7391 -49163 -178675 -137463 -59283 -17739 -86560
28122 -86560 -84072 -16394 2126 -2219 3547 6397 32462 97005 90262 54965 -54536 -28770
28110 -28770 83589 81253 45877 -73143 -107167 -77521 -6232 50137 -13374 -58077 -115750
28099 -115750 -221100 -206628 -92585 7426 20817 -28561 -56635 -27895 -95985 -89613 -51435
28088 -51435 76217 108089 89572 65313 19066 36182 20422 -27082 -11050 -28065 -49115
28077 -49115 -10209 -6054 -65542 -93496 -50534 -59206 -93502 -115173 -59370 -28477 -73616 -121525
28065 -121525 -185679 -192606 -126966 -90939 -109266 -45823 510 -46334 -61812 -123553 -135965 -56586
28053 -56586 22527 64732 18917 -20083 -91412 -120153 -66771 -52049 -5375 31509 -11266 -50817
28041 -50817 -22423 55917 164480 147204 78531 98019 150301 125130 22106 34382 13883
28030 13883 -110674 -105092 -27025 58734 39002 -26237 -34700 -12573 -40177 -36971 19480 58269
28018 58269 -7837 -14925 -17593 -7847 20094 45446 107127 122157 106242 112465 131889 46587
28006 46587 31208 -37788 23865 89724 107783 79615 121050 73904 35850 38446 29333 46796
27994 46796 66533 118366 128796 30295 -23544 -18971 -3541 -91715 -144182 -159683 -70597 -62515
27982 -62515 36833 86565 -25805 -45658 -14842 55536 23596 -64362 -84272 -100085 -147190
27971 -147190 -91827 29471 10607 -106461 -47952 51746 90218 22835 -28958 -24648 33655
27960 33655 -762 -4310 -25262 -31295 13385 -995 15514 30043 54845 88537 42606 1435
27948 1435 -12687 71140 94729 143396 136697 -4235 -41298 56160 32715 -57692 -85326 -121214
27936 -121214 -52770 54994 73595 29510 -17576 -20275 -9837 -73032 -79675 -84657 -116426 -108414
27924 -108414 -84342 36424 33570 17339 20359 71189 53757 -3956 3676 14725 -68363 -126281
27912 -126281 -34500 33990 70671 39997 -13382 -56963 -36808 -133141 -246964 -254208 -130298
27901 -130298 -86702 -127222 -66876 7912 37111 -6198 -40240 -48524 18309 112 -2302 25332
27889 25332 70710 50133 72457 75250 14307 -4776 -45987 -62551 -78469 -65355 -75755 -82769
27877 -82769 -77480 -41960 -1815 -12825 -33809 -3863 3469 -62884 -33875 -918 69235 57640
27865 57640 15152 -17297 -80633 -24168 17855 -10112 -15584 41465 26941 29736 1665 85111
27853 85111 101876 89205 -28185 -124805 -137476 -36649 -34285 -46396 -81819 -83269 -43981 -73984
27841 -73984 -152808 -102276 34269 24703 49794 69392 73214 14341 -832 -10633 -54216 -92092
27829 -92092 -21933 25891 87044 100973 92619 12003 15187 25892 91643 92388 98270 117258 190238
27816 190238 102686 -3787 -83233 -70721 -76217 -108252 -78538 -52466 36856 90519 100240 118536
27804 118536 70956 61139 59456 -49 -48026 -94229 -33236 38313 101048 117343 69108 -5444
27792 -5444 8418 671 13545 -17018 -6421 -20113 -76385 -22716 -50218 -60506 -10047 34284
27780 34284 5574 -9238 313 46774 69697 73997 -12335 5486 79572 41976 8142 -18625
27768 -18625 8151 -63329 -150490 -115053 -185350 -192132 -142743 -90424 -29011 -87098 -148633 -117648
27756 -117648 -116495 -55027 4131 49226 33958 -31872 -59566 -77388 -117102 -77748 -126726 -193921
27744 -193921 -153576 16473 75806 28418 -68395 -10379 -26255 -45471 67030 115736 87069
27733 87069 97212 53850 -2105 77307 33505 41256 37070 67325 74783 49962 73477 84492
27721 84492 -25994 -25281 -35738 2432 4982 16788 -22122 -8574 -8224 6737 31808 96098
27709 96098 167631 144376 146399 24882 -59556 12153 32191 64277 83491 95825 133586 144068
27697 144068 126006 47034 24235 3400 -14068 -2813 24195 -7434 -24530 -776 -17851
27686 -17851 21952 85494 129610 112349 113753 59946 54880 23813 23158 78467 109189 85983
27674 85983 -45429 -76703 -101716 -175444 -209728 -156614 -77651 -83166 -85549 -37972 -39530 11703
27662 11703 2193 -81525 -100547 -78313 -62711 -64467 -45230 -76267 -68300 -44635 1646 59860
27650 59860 -54850 -57885 12024 3623 18667 44220 31717 18681 48961 98114 128674 148139
27638 148139 96127 47532 -35753 -158689 -120101 -30129 -22977 -39421 -33832 -8049 -21645 118785
27626 118785 80378 36641 5430 -67728 -61462 -27750 11358 -13914 -2636 -27420 -63095 -3716
27614 -3716 148 -41519 -47942 1334 44214 76924 91870 68213 61953 70618 -8338 -91195 -48482
27601 -48482 73187 150902 145186 94556 115321 65966 24794 14404 -43862 -62914 -26979 43089
27589 43089 -34237 -79004 -74934 12955 24216 -17065 -77452 -23524 14427 -18079 8916 -9514
27577 -9514 -20056 -116180 -77039 -64155 -68887 -114495 -147959 -35539 -10523 -25908 -41002 8989
27565 8989 -3673 -20333 -34547 -97881 -23855 41023 28225 22436 72904 97753 82002 -6586
27553 -6586 -17922 -32843 -52602 -79745 -91894 -85754 -115705 -49402 -78965 -26647 25327 -51359
27541 -51359 -65192 -32599 -38168 -23026 -41318 -45761 -123401 -126793 -97079 -3036 12732 -36990
27529 -36990 21310 -3511 11603 -20303 -123402 -116903 -60290 10219 6351 51325 74220 49875
27517 49875 110505 67252 22757 -20969 -30414 -40522 -30701 9538 29477 -24786 -40261 13845
27505 13845 10857 -26416 -112152 -180615 -80821 -30376 -56742 18075 25056 -66976 -114297 -78717
27493 -78717 -20519 79522 55556 22991 62289 33912 56987 91978 89589 -1318 76871 131580
27481 131580 86132 56300 122815 142421 142942 93745 -28902 -45871 -19885 -63179 -110666 -53804
27469 -53804 25509 51368 89891 72320 -12070 -88231 -34787 63741 97065 58198 -40976 -58656
27457 -58656 -77049 -146671 -179118 -136692 -62169 -18393 -56808 2873 -44814 -29961 15759 17185
27445 17185 35197 11387 1047 44518 94233 59466 -28574 3060 23254 36620 27992 -3969
27433 -3969 -12215 10611 -26594 8812 -47860 -18313 48536 36323 5015 89612 101149 37531
27421 37531 -54201 -90075 -113508 2016 -41631 -106336 -127206 -107644 2026 14039 47542
27410 47542 91186 34646 -25806 -74731 -111594 -80146 -32058 -60240 -88391 -129638 -149631 -30341
27398 -30341 13443 -76067 -79935 -42121 -30253 -36968 -63195 -61111 -63421 -114859 -104411 -45300
27386 -45300 -23883 8859 -38436 -38921 -497 2900 33354 92259 38074 -12926 -143377 -124048
27374 -124048 -12297 1740 1964 -33525 -35929 -17224 -52040 -78532 -163129 -156993 -113053 -164232
27362 -164232 -215035 -178914 -131058 -61408 -24866 -54594 -40801 -4049 46411 46387 21206 32580
27350 32580 2382 -44730 -26686 -41012 -55186 -124691 -140509 -42596 35407 -20627 -72716 -74430
27338 -74430 -21216 40366 53741 -8896 -94156 -81090 -58656 -33060 -3864 -27873 -96356 -44025
27326 -44025 7879 -30197 -9353 4482 -59929 4095 30050 -22341 -28705 -25949 -31341 -38148
27314 -38148 -16247 -34336 -125349 -190094 -130350 -105355 -189454 -142369 -67767 -43218 -1437 -27546
27302 -27546 -41669 38138 32822 -56106 -130601 -117563 -48900 -21570 -74329 -56073 -71308 -71355
27290 -71355 -51249 872 111458 84496 51167 -39187 -88392 -50707 -53632 -41823 -51303 -30375
27278 -30375 -73344 -2416 -46667 -123833 -106173 -46142 -122657 -161319 -69278 -122565 -172029 -74651
27266 -74651 -56292 -64590 -57469 71783 54312 52030 23288 -15631 52845 133686 99837 -15171
27254 -15171 -50568 -24049 -65181 -67356 -36948 6518 69420 133999 38811 -54545 -164171 -295100
27242 -295100 -187160 -98663 -8267 85962 88063 125948 134734 21458 29568 165840 80396
27231 80396 -66819 -96062 -88116 -70925 -69135 -54938 2677 -15423 60900 63048 100369 88882
27219 88882 58885 127641 105341 82822 53352 36692 9195 2501 -15966 54310 129560 35408
27207 35408 3377 33900 -15624 -21625 -30934 -81195 -40756 -50868 -21107 9835 -61838 -30416
27195 -30416 72643 129911 102906 88886 72182 23524 2578 -40563 -65858 -7284 6239
27184 6239 -44476 10825 73540 151871 155410 132757 159575 144376 152954 118964 44483 -29176
27172 -29176 -35984 55667 -4558 -67298 -95793 -48628 -83684 -77254 -139137 -85422 1354 -35879
27160 -35879 -66988 -15268 125389 66528 -66267 -107836 -99504 15921 98996 87328 101587
27149 101587 42439 -51350 -102823 -122732 -160817 -149240 -78551 3218 -55 73295 114035 111543
27137 111543 79319 27203 -21096 42668 65192 65109 25898 17230 -37055 -5807 24485 12522
27125 12522 -46370 -22864 29340 -10649 -50886 -26772 44222 2665 -24282 -30356 -37016 -54529
27113 -54529 -30594 -40231 -17622 -10779 -35436 11885 16041 13282 8760 -43312 -117586 -82375 31070
27100 31070 137417 155485 156088 82580 -70043 -91777 12293 32550 38068 44454 85885 76512
27088 76512 52939 60427 46534 125043 98427 71324 87809 49977 32020 78061 44706 35884
27076 35884 78783 124294 255062 175248 -2543 -105994 -64902 9585 25878 -19022 -3431
27065 -3431 16302 14520 63997 -13761 -147816 -181782 -80303 15370 85000 27368 16336 1571
27053 1571 14316 -28734 -69466 -52749 -42245 -36286 33454 74507 95065 78191 95759 107940
27041 107940 48977 -36411 -44879 20909 -3988 -111929 -108807 -98786 -111185 -90835 -83637 -102642
27029 -102642 -87787 -49413 -12068 -58901 -132130 -108690 -157188 -182770 -119015 -140289 -155153
27018 -155153 -121642 -67433 -127739 -95797 -38192 -30759 49353 57662 32818 -28198 -67447 -50018
27006 -50018 -81505 -187613 -217749 -229333 -95154 -666 94488 128213 85477 2539 -77852
26995 -77852 -21309 72601 40692 -10728 -8410 -21457 -124379 -75741 -4855 20661 14200 -42339
26983 -42339 -106853 -41703 35337 87988 130579 128179 34596 -90330 -110579 -169278 -120478 -103687
26971 -103687 -123844 -110711 -30224 -52167 -20684 -41070 74295 173931 186835 68873 2078
26960 2078 6832 36944 72028 49346 11555 49016 6346 -94107 -163717 -45993 -14074 -66939
26948 -66939 -142338 -177503 -63536 20211 68531 120737 123732 117799 98672 121336 134952 56513
26936 56513 -27888 -59414 8134 -6386 3664 58278 99521 68663 18218 125576 155718
26925 155718 100145 61460 15362 61861 53706 25357 -17518 -6499 28264 -12082 -60501 -76576
26913 -76576 -121399 -118889 -90943 -51554 -19969 23949 89276 68032 14707 5140 20246 96586
26901 96586 150894 117466 114661 67257 10170 -66698 -37349 -12398 -39715 -55647 -12366 -4474
26889 -4474 71738 94399 20619 -5522 -8312 9389 105597 146662 122376 86092 71045 98565
26877 98565 90350 6453 -69852 -12121 2608 406 5122 24570 18482 -19120 -44082 -80775
26865 -80775 39107 91688 32312 -4292 24768 77240 100168 96746 124256 152128 62558 33100
26853 33100 36814 61862 29366 91116 180408 15798 -8951 114044 93659 53396 26660
26842 26660 61221 97645 61938 22369 73505 155411 120165 32801 12515 -6073 -48295 -40141
26830 -40141 -24159 12569 12900 23094 44123 43329 -23913 -47866 41456 136438 106884 43750
26818 43750 19230 -48690 -37855 -65698 -25909 -39685 -64354 -85617 -32323 -32877 -73082 -119645
26806 -119645 -73023 -37422 49728 91942 48632 39850 -28269 -106786 -111298 -33671 22478 43931
26794 43931 111887 88843 34502 6272 27133 8718 6009 -31677 -56718 -77497 -53016 24516
26782 24516 69674 67882 -344 2503 13013 50296 85563 81094 -8063 -57695 -59742 27634
26770 27634 86434 -33812 17827 36383 38066 110944 51509 -47092 -85938 -29667 16371 91813
26758 91813 114640 101188 124891 146983 168632 16075 -134258 -68582 -30020 38786 101120
26747 101120 63509 111821 81160 44255 2890 -1856 10920 80883 102657 56578 48235 111167
26735 111167 177551 95976 92164 182358 125518 -3074 -3400 -33679 4683 46099 22331 74328
26723 74328 121728 71640 19370 75550 127493 92020 36692 -12416 -107902 -85789 -119734 -148837
26711 -148837 -165514 -139075 -113925 -142635 -38704 44478 46943 78861 66067 37002 3341
26700 3341 10274 -36086 -77316 -81101 -165358 -188377 -167560 -121244 -124261 -43496 11640 21175 29110
26687 29110 13603 57660 61371 -10575 -39507 -7944 68976 136432 178454 146569 72009 -3675
26675 -3675 32547 15173 41301 21645 39182 24863 47154 107980 94762 60903 -9456 -51569
26663 -51569 2680 41934 7612 -20855 5305 36501 32181 -34759 -103572 -129604 -66221 -35794
26651 -35794 113248 50532 64727 64881 37631 -38298 -54074 -9136 22893 -49171 -58286 -9110
26639 -9110 56687 42831 -35193 -764 51469 65475 49341 74931 107643 82634 63355 33079
26627 33079 18969 60097 -11851 -44432 45737 85139 31329 15556 14634 64899 106007 114068
26615 114068 109018 -41502 -76698 -51956 -63380 -80349 25607 150928 82506 4034 -27186
26604 -27186 15817 67900 71913 92111 41780 44688 47263 22571 20036 -72813 -69515 -49094 -48064
26591 -48064 -47037 67899 97992 88673 49563 13550 64982 83756 52004 7578 21544 54774
26579 54774 -30520 -60707 -94506 -42260 48496 28844 10297 -49211 -95419 -46775 -20916 17857
26567 17857 -16184 -6520 22802 -25905 12639 109686 137909 80385 18709 438 -40054 20079
26555 20079 16729 116638 106733 41647 30793 -61522 -45759 -65932 -34951 -16820 -45120 -34470
26543 -34470 83661 73489 76809 103336 62662 110794 183081 122877 91949 64984 64127 82940
26531 82940 116223 125697 93456 104273 155120 181323 180219 8602 -30621 -45292 4547 42140
26519 42140 39439 89982 89574 29770 14375 -14211 8251 11209 -36735 -71504 -31124 -27354 103401
26506 103401 20924 -76457 -31365 22618 58604 89413 99163 31131 19594 22460 -39495 -34297
26494 -34297 -45487 -45188 19496 69433 51811 59029 74911 -77486 -106846 -103716 -20411 49000
26482 49000 60970 51209 -60404 -161198 -112911 -108261 -126701 -99289 -26000 65205 86511 46599
26470 46599 41434 115291 95962 58150 -14230 9119 31569 11100 -38421 -75144 -69824 -47952
26458 -47952 30413 10390 37919 39775 93392 143457 194907 180169 118289 136599 103135 90102
26446 90102 105737 74678 115402 93642 52369 95152 69378 16822 -37660 11190 58947 68220
26434 68220 -8381 -42262 -67457 -70561 -104336 -75346 -71950 -42138 63522 113205 109254 155072
26422 155072 197557 144832 23504 -56084 -110853 -98814 -9652 -33583 -70939 18403 108880
26411 108880 65634 16031 -36021 -93381 -105745 -28596 43812 76835 93288 161788 284111
26400 284111 176115 44347 -5009 -18361 16137 56788 -2626 33964 74968 49013 -82736
26389 -82736 -138524 -98087 24307 52702 24909 35639 62452 87571 7166 -26155 -73917
26378 -73917 -99456 -12216 56146 71065 75156 97634 -5070 -4634 -10828 -25222 -43733 2750
26366 2750 30992 8569 -36778 -5016 -3756 -41392 -43778 -58041 -69520 -11614 57865 125928
26354 125928 159899 81243 -60227 -88962 -33425 -48664 -60318 25414 97162 33345 -81115
26343 -81115 -180175 -146207 -76974 -15382 27082 6412 -15915 -13623 33782 26573 19907 11774
26331 11774 30552 -41843 -46516 38231 -9084 -110109 -168277 -108801 -9198 17043 42978 3462
26319 3462 -31018 -61152 -45621 27039 52040 18234 46176 91959 55868 25326 3767 -147207
26307 -147207 -316295 -275073 -194460 -110155 -17177 -16894 42060 142619 136505 120677 101197 34799
26295 34799 29526 39228 66858 142165 142572 133391 161290 189288 180552 127365 139331 182176 157404
26282 157404 132003 45262 -59421 -113953 -74480 -38683 18444 92845 134007 102681 74971
26271 74971 6000 9338 31801 -66596 -59233 -60530 -40602 22918 4620 14135 142052 149416
26259 149416 60494 -15440 -87224 -124398 -84892 75 89537 75049 -16677 -39965 4629
26248 4629 32916 53329 6575 16453 66221 12178 -17534 -90618 -31747 -26624 -9005 -6632
26236 -6632 87585 161929 114703 21752 -27474 -32251 -74806 -120818 -29329 51849 36529 2631
26224 2631 -15945 -21144 -93351 -71906 -6466 48444 89137 214618 124922 127378 113594 125815
26212 125815 79897 43276 25542 70345 125873 180952 132817 103657 29559 96405 153313
26201 153313 133097 58344 38200 29485 301 2941 59826 69313 60571 31774 -33260 -46624
26189 -46624 -36573 -53909 -38377 -47292 -43722 -43381 -47444 -108716 -90026 2098 31357 51624 26755
26176 26755 31577 126842 126779 95704 55589 -22410 -51039 -189653 -123746 -108216 -126976 -130486
26164 -130486 -105391 -43256 20142 70207 88803 90089 46803 -24491 34256 -18374 27483 89805
26152 89805 909 -52073 -12108 -53985 -124898 -31236 62354 145133 105571 51360 -21949 -66179
26140 -66179 47380 71640 109745 77523 65432 47738 -3784 -42168 -50781 -47843 -29993 -81644
26128 -81644 -114967 -109413 -76717 -76105 -60060 -73510 -20471 -32781 -58817 -61045 -69587 -105535 -68581
26115 -68581 -18838 -11060 -16502 -85593 -118607 -46512 35421 61539 35573 79706 131605 81605
26103 81605 80692 105316 152047 196550 158034 128242 137370 110992 109403 19209 -49002 -26692
26091 -26692 -47774 4274 103644 98700 71226 185901 194681 187850 155681 123700 105530 64327
26079 64327 2669 2895 -14862 27201 -11459 -44314 -58201 -95181 -96146 -15171 99841 145496
26067 145496 130195 146302 157969 206822 166438 107926 50367 14769 52039 63490 350
26056 350 54450 97376 92777 59191 97634 148760 99730 69642 39196 -5841 39885 94803
26044 94803 69368 -58675 -7730 82194 58617 102362 118406 42014 78302 80666 110210 168731
26032 168731 172433 150334 127768 80486 144441 111421 65721 47889 21651 -37366 -83011 -63377
26020 -63377 -10416 21971 45971 43684 56962 54009 51751 82281 -6633 -23370 24345 21731
26008 21731 26067 18657 24843 -31430 24956 35746 7025 -25715 -39219 -63754 -40751 -48259
25996 -48259 2192 87442 118514 99451 46106 28354 61642 59751 120389 169854 133707 125743
25984 125743 121559 152412 166579 129934 82775 123405 103057 138224 104707 125074 155756 161492
25972 161492 178752 41410 -13132 13962 53731 2221 -10628 39805 62899 53369 24896
25961 24896 7068 14784 45739 -24406 -115006 -120053 -73310 20323 69956 8047 39768 47213
25949 47213 58783 20004 9835 27051 35837 67011 118469 138745 168413 66442 27716 3931
25937 3931 -51857 -74637 -81941 -74064 -90579 -5880 48874 32478 20417 92331 118814 112324
25925 112324 12672 -39358 -12558 -20575 -4460 118592 125217 86766 10032 -3985 -4735 25699
25913 25699 66254 123203 117354 88669 151768 151721 101677 98718 133764 188786 250084 220797 118467
25900 118467 17556 63102 99939 102024 76311 77905 78098 59044 71423 106586 88438 102753
25888 102753 115016 97731 53077 -27184 -27162 -18639 -16691 -43114 -14896 113392 142391 64058
25876 64058 48656 84271 16368 28807 62334 73767 46935 49286 68489 146120 212245 198571
25864 198571 191530 182518 135814 108330 161326 153046 95456 54939 108401 119978 45994 105403
25852 105403 136649 151321 187916 116215 80771 172780 141050 105200 148198 251722 228174
25841 228174 172506 187708 225530 191877 176709 209003 207387 139688 100035 96886 34586 51139
25829 51139 60278 110296 186205 185555 114399 77613 59781 52628 103218 78918 20042 15037 117763
25816 117763 187577 104740 -4050 -27658 -610 82742 151256 136867 104849 123953 188285
25805 188285 149631 63455 81353 121880 97511 5646 -35768 -16473 -8641 56724 174590
25794 174590 186432 94082 14661 -5044 20994 13336 57853 87572 123297 145799 191272 249512
25782 249512 310380 285828 230796 171671 180352 231307 214522 161142 126563 90966 119597 134689
25770 134689 89190 89434 111975 95453 122227 102943 38195 64316 147641 258760 245625 90812
25758 90812 79393 161119 180656 240646 216036 138977 50764 59321 75970 31392 22259 11605
25746 11605 38278 88200 181856 128032 71249 121490 164018 143283 46705 30967 34446 -2353
25734 -2353 -31498 -29791 45349 122525 155767 156535 174198 244701 278334 204096 177191 135082
25722 135082 112681 152032 108674 55577 55282 96134 106912 78467 -580 -107990 -103237 22520
25710 22520 92777 112688 58608 51094 144164 171785 120962 182327 179750 100371 123799 93906
25698 93906 134076 192899 288844 266523 145085 74301 139085 248588 277757 247379 167492
25687 167492 96654 174471 199229 178509 106442 22641 48421 6697 18399 85515 109639
25676 109639 78213 77909 108068 81466 46004 19088 -22786 4400 37765 20959 50361 104678
25664 104678 200258 173259 119360 114267 110406 115774 139269 142700 101537 75543 78632 48461
25652 48461 72370 74006 154441 108549 -7732 -23015 -9265 13705 -11529 -46550 7313 100333
25640 100333 98141 45488 27650 -42775 -100040 -105159 -13063 19854 10798 32871 75169 48440
25628 48440 -20241 -44991 -59655 5098 21870 12806 63742 88269 64952 52761 40400 22292
25616 22292 77889 46554 15982 25970 63339 68865 120678 139491 158712 150767 103115 67167
25604 67167 93373 108272 135175 148276 146114 147011 83287 66497 157860 191166 229350 150797
25592 150797 159619 211082 233240 149073 128188 184748 246772 334220 314459 257941 191411 179978
25580 179978 174288 147564 139967 209790 249439 244891 301311 313974 288258 274674 223686 182498
25568 182498 159261 205441 255097 243925 295987 357270 393900 362278 365275 356929 312462 312589
25556 312589 321628 247088 206006 264059 302884 295812 396917 423510 357873 368691 396055 364369
25544 364369 365932 317319 259661 213140 263955 332859 279647 247200 266765 206790 73784
25533 73784 117723 232815 358917 364804 312418 245402 251901 281105 296641 282545 339990 379673
25521 379673 415894 483870 518363 552243 537833 450671 350206 268935 335799 404472 426726
25510 426726 413549 463029 544627 556224 549124 560276 539089 458853 442238 413048 393974 375886
25498 375886 336122 365797 363245 311216 293940 264039 210929 165440 149828 137840 236185 298952
25486 298952 326413 378879 325475 318483 291105 276789 284891 259406 262114 231246 150963 270582
25474 270582 345569 337630 331990 310311 288791 257385 241777 231152 354290 329961 281575 234586
25462 234586 211768 284422 400383 420932 357992 409467 417611 381195 355520 417976 476942
25451 476942 503219 489119 435043 424917 418940 400105 387050 394757 379797 378198 378386 355736
25439 355736 196213 103656 80074 155078 212485 211481 245749 216620 174069 146202 193695
25428 193695 218646 221643 227561 246999 222623 272633 265630 297489 340792 289476 316421 369808
25416 369808 390647 375261 440460 418679 381275 336506 250028 309577 332216 344970 449267
25405 449267 532724 568167 609722 616753 504373 500961 538239 610698 625682 603348 626646 593089
25393 593089 512925 592179 579170 544096 580976 532060 510356 584182 602496 563668 527175
25382 527175 520666 570698 570634 487463 474933 535432 545908 464077 467210 498609 508489 495285 476951
25369 476951 426175 413101 450603 488317 461376 552534 499548 496989 578698 539479 530922 538808
25357 538808 538538 570536 537079 502203 457567 511397 557929 565615 572724 581538 588514 620053 576463
25344 576463 590880 655952 601942 545000 560370 560561 561316 576369 554384 547626 557163 511428 400927
25331 400927 429014 396978 433496 545639 531432 506519 528656 445298 271323 245082 296165
25320 296165 365536 330609 313347 321356 377846 434096 469230 447574 480710 491102 430356 458080
25308 458080 445866 350055 271613 260580 289693 328564 414544 372043 449549 488445 498175 536354
25296 536354 593323 588235 586441 591820 630893 710057 788318 793887 889757 899554 958823 879087
25284 879087 782139 698806 588532 573240 577056 608731 721431 761644 696648 664417 732746
25273 732746 826126 785849 739005 744839 718166 755602 881732 895988 853504 881796 912493
25262 912493 884603 885155 838078 828353 778872 700279 691333 753840 651248 547949 544812 528648
25250 528648 511053 432009 509822 562718 578371 595146 604059 696421 771140 794405 772815 790089
25238 790089 828552 871578 903235 989503 1005299 986676 1106469 1166101 1204379 1219369 1258175
25227 1258175 1226802 1199590 1165823 1180984 1238487 1294207 1316856 1295186 1263112 1307716 1271072
25216 1271072 1281428 1260207 1240940 1274362 1252275 1222570 1146914 1182598 1181082 1175088 1160784 1220539
25204 1220539 1354351 1361202 1352173 1460013 1536072 1520957 1615987 1672746 1715316 1819374 1848058
25193 1848058 1769435 1780075 1827473 1871642 1861680 1920258 1931848 1861350 1809867 1760995 1675374
25182 1675374 1642242 1683899 1731137 1793854 1810838 1804906 1828136 1809064 1777579 1809370 1817019 1860353
25170 1860353 1949035 2029108 2122198 2247885 2301464 2461093 2531671 2570037 2591209 2586666 2711536
25159 2711536 2765279 2797890 2812673 2851735 3027128 3072143 3059347 3129330 3239950 3245745 3225451
25148 3225451 3360725 3533835 3611511 3616831 3730595 3887041 3941831 4061872 4242522 4328606
25138 4328606 4372070 4512415 4599384 4693224 4734043 4707441 4706204 4681059 4623600 4467343 4500842
25127 4500842 4466937 4456391 4465042 4435210 4356661 4212515 4158461 4212023 4187731 4127613 4063170
25116 4063170 4033395 4001068 4081773 4158627 4138829 4158831 4226917 4334422 4352740 4398146 4489113
25105 4489113 4644373 4806813 4825181 4783505 4760564 4790887 4799205 4776276 4751961 4777438 4766119
25094 4766119 4683921 4658189 4666207 4666419 4681151 4744141 4825011 4914639 5080714 5281012 5529825
25083 5529825 5784182 6056817 6287338 6530123 6799719 7244663 7692142 8017150 8330724
25074 8330724 8731987 9130416 9551269 9802386 10073628 10298034 10544393 10825692 11123023
25065 11123023 11353773 11586469 11735407 11902872 12154293 12395548 12713930 12977587 13291662
25056 13291662 13610855 13905994 14230453 14591208 14852088 15012685 15257849 15433528 15640594
25047 15640594 15850188 16078706 16234407 16312409 16378801 16357531 16404688 16514694 16783470 16985035
25037 16985035 17043313 17130080 17373339 17608681 17795322 18112331 18485783 18874729 19250196 19716512
25027 19716512 20158174 20635048 21089911 21637798 22235362 22971548 23886622 24829740 25751105
25018 25751105 26642296 27813824 29181596 30678312 32300941 34079014 36055934 38203253
25010 38203253 40673191 43458470 46396087 49598373 52969347 56590548 60533623 64695352
25002 64695352 68975859 73365603 77844313 82586267 87498208 92575419 97932549 103660911
24994 103660911 110002800 116994316 124712724 133353932 143108844 154116842 166634927 180911264
24986 180911264 197014319 215031498 235030048 256969765 280614655 305411476 330768050
24979 330768050 355776704 379406316 400385780 417745117 430356839 437561395 439174656
24972 439174656 435098288 425859547 412160985 394690348 374459566 352369347 329335829
24965 329335829 305998747 283099223 260924466 239720951 219869415 201455921 184323234
24958 184323234 168460180 153897648 140657215 128569451 117677135 107669606 98571116
24951 98571116 90371616 83103971 76708391 71078566 66084713 61706107 57924293 54607453
24943 54607453 51647623 49130089 46970329 45093181 43320263 41673091 40181271 38811059
24935 38811059 37445891 36067300 34708456 33313864 31980999 30765178 29518930 28339045
24927 28339045 27230949 26152129 24944234 23889099 22851570 21785607 20734828 19733203
24919 19733203 18690649 17675426 16747188 15915909 15085655 14241077 13475510 12822728 12147153
24910 12147153 11482968 10870475 10313096 9744271 9118367 8528209 8042527 7600942 7217721
24901 7217721 6832296 6428700 6073199 5669139 5358925 5175339 5033757 4900482 4808716 4690972
24891 4690972 4453094 4173902 4081506 3991762 3852535 3726200 3576180 3359153 3159284 2991535
24881 2991535 2855383 2885348 2878403 2925465 3032688 3150612 3232282 3429771 3651243 3817277
24871 3817277 3997820 4054431 4187118 4297178 4346902 4437458 4483604 4564596 4635788 4708262 4759466
24860 4759466 4763444 4702279 4686811 4569019 4525435 4490221 4378413 4271662 4096980 3993593
24850 3993593 3894846 3783795 3651971 3547154 3451071 3256584 3130904 3075330 3014394 2938375
24840 2938375 2829441 2795478 2734942 2746498 2664437 2561768 2447448 2351609 2310667 2166507
24830 2166507 2030701 1931865 1856005 1703886 1535269 1466258 1345628 1242090 1134568 1030536
24820 1030536 917131 863050 824763 754979 630283 499266 390502 340572 404943 473959
24810 473959 569123 636778 749700 822437 837162 926842 921974 872063 901049 1004996 1018152
24799 1018152 1005538 951041 941658 990614 1020882 926272 975343 1019485 911987 840280 825531
24788 825531 839250 853961 810942 845848 880406 777140 705542 694335 764121 781955 774446
24777 774446 855266 906987 978923 1013266 1001158 1005019 971207 953357 1030493 1020680 1059630 1040131
24765 1040131 993794 992739 1069583 1065181 1049684 1035672 946583 937657 1001702 931270 833161 893313
24753 893313 946811 970646 1066567 1086868 1114532 1194247 1194491 1263382 1306137 1289787 1309504 1285038
24741 1285038 1279748 1341177 1396603 1423421 1488168 1555954 1545539 1480582 1444842 1408104 1249023
24730 1249023 1120649 1057793 1055694 1016541 976879 984148 991628 930024 943373 1019822 1017329 979559
24718 979559 940679 945086 918229 935681 989167 897124 852167 948458 929955 945211 1037258 1067426
24706 1067426 1104111 1125273 1037624 1054304 1095824 1115036 1083954 1073736 1094229 1047219 1026945
24695 1026945 989202 877029 746842 759174 742928 660495 638462 648155 593465 480742 386903
24684 386903 402619 370498 311592 315980 332990 378749 372814 307452 265322 243736 211046 215045
24672 215045 182456 114160 151525 208478 228280 198465 217565 244367 248623 235012 215336 207563
24660 207563 96279 48612 100823 179202 137859 216533 261786 274517 312488 375463 419619
24649 419619 472189 551800 547010 562682 594649 581986 639306 783632 847325 935130 984847
24638 984847 1001684 946566 896019 832664 805132 842060 888280 1027578 1051989 939058 896287
24627 896287 898205 888144 856095 890818 868790 764068 712997 715836 653136 592302 615025 646993
24615 646993 549523 489888 487624 383526 326509 362732 417882 461756 450317 477521 416433
24604 416433 266248 325053 377330 335306 316218 238913 218841 313493 400613 399208 387195
24593 387195 444071 437612 422055 378444 387593 414116 440776 438226 380681 332531 390538 432719
24581 432719 391929 416947 470597 452528 407957 341152 247295 201565 203973 258095 262278 274429
24569 274429 310553 338993 326321 238395 160877 65071 62455 22987 -63216 -66022 -88450 -135702
24557 -135702 -205691 -208835 -180543 -219358 -256234 -195042 -99321 -10313 12117 20712 90829 136917
24545 136917 133045 -770 -45539 -7171 67127 188071 191967 92754 131893 189770 285401
24534 285401 305638 364377 397966 357362 297318 334653 375751 424353 473721 514039 550455
24523 550455 495037 402558 471119 533465 571524 521627 476592 400237 340182 311446 289975
24512 289975 354194 418459 478318 445671 375735 315440 299173 266907 195185 187044 155253 145417
24500 145417 128938 -1392 -80839 -36173 -3055 8233 26278 81721 115057 147911 207861
24489 207861 186639 175364 142359 144847 188010 133261 8151 248 85340 115913 64235 20203
24477 20203 -10258 11916 73932 119797 99638 136183 218357 239852 278065 243727 147470 111975
24465 111975 232211 266234 237832 186483 140117 73100 13035 33501 131876 161147 126156
24454 126156 160121 158818 185445 225640 196963 151024 178295 206877 196974 118628 95795 70027
24442 70027 82589 48319 10218 -1771 62133 99436 106602 86625 10749 -47981 -102290 -94389
24430 -94389 -74943 -48930 -19554 12273 56346 101630 138507 93068 47626 47967 65787 83056
24418 83056 151963 91446 22983 31890 70066 114449 162083 149665 117693 22262 42562 88007
24406 88007 112763 57527 -24598 -10440 95249 140865 123861 126126 180378 155641 160093 88200
24394 88200 78481 28491 -6464 -64988 -47514 -72211 -11442 -106012 -171730 -120285 -79527 -66982
24382 -66982 -22067 18449 -18091 22354 101581 153251 86079 92058 75320 56446 -24279 36791
24370 36791 95527 121368 201521 288345 252099 187698 191096 161762 134510 92553 71552 13338
24358 13338 -11684 -22345 -45333 -13496 71222 74207 20804 64809 89547 120776 169344 192286
24346 192286 215148 180993 223187 216121 217178 212729 126993 123440 135075 107270 131083 134027
24334 134027 108476 142699 143457 171088 183878 238085 269172 290281 330484 250101 172362 132496
24322 132496 146358 187522 237284 238133 222454 266064 232246 219681 231829 268945 257838 219591
24310 219591 208338 142045 81753 132545 163284 164850 147404 144653 192298 213810 164022 113801
24298 113801 16948 -12386 -20516 -16342 70568 66092 78488 64335 48863 148324 156239 48052
24286 48052 11788 49380 -7567 680 -11504 57318 178241 166313 58799 68075 73628 69887
24274 69887 97475 102573 48807 60284 110665 183589 175650 114091 96411 71649 159511 196819
24262 196819 200530 151776 104811 45928 3763 80881 57475 7692 -21205 -4734 -40222 -48604
24250 -48604 -93347 -35675 18030 -18302 6204 -26730 -88161 -96863 -31366 -3993 21239 14248
24238 14248 -26699 -2756 293 -4621 -53420 -29259 83293 170681 177621 201473 173028 57852
24226 57852 55929 126000 57754 78472 98045 103459 80496 86454 49278 87071 114556 78784
24214 78784 28561 28832 94929 201944 182032 117022 70661 112096 127226 181508 241657 172459
24202 172459 66071 66741 117693 201972 165840 119246 108214 75506 63835 51989 10481 71261
24190 71261 152235 151435 108239 46903 -20910 -1275 35706 51115 79851 50861 8995 32401
24178 32401 59799 84165 70623 -26773 -922 15360 5013 26600 65202 87291 75269 105586
24166 105586 119072 40331 32699 71190 179114 163935 86240 134977 153408 237100 236143 213889
24154 213889 181969 64279 44712 84338 133938 134249 102631 105208 132852 174781 155884 144665
24142 144665 75490 57665 -1870 3340 59104 17563 -42104 -116142 -73341 -19906 -16854 46679
24130 46679 127072 133838 82318 119103 97563 81264 56442 -11639 -25697 72854 56243 70838
24118 70838 30617 -97621 -78169 5556 5023 8737 -49904 -15584 51234 13659 -65567 -31249
24106 -31249 -97739 -96556 -74028 -104272 -136174 -111935 -61185 -41361 8661 14497 253 22844
24094 22844 82043 70313 73526 56931 123897 164782 89875 69920 53619 41863 78805 78319
24082 78319 78066 98755 114718 139730 79076 95989 133808 152774 189455 239675 217121 172221
24070 172221 79626 70298 132866 112913 74584 46485 48276 40690 -24592 -29671 -58706 -112089
24058 -112089 -186441 -240267 -160914 -139504 -96506 -86239 -96903 -129365 -173364 -65080 -59184
24047 -59184 -128849 -123485 -102217 -91659 -64394 -31220 -7454 25709 15842 -91827 -4186 43127
24035 43127 20425 25012 84233 12906 -17950 -12910 22248 77372 81703 33742 53597 71080
24023 71080 41550 72527 90349 74035 -1694 20654 96412 62797 112225 155289 117090 64362
24011 64362 59724 28330 -36620 -51208 4476 -28458 19950 63667 12149 1354 25932 106599
23999 106599 95865 81938 64240 3444 -5498 64363 75140 145111 204811 202470 165446 183442
23987 183442 161940 120171 179701 209784 202111 193598 62288 21924 28677 11244 -46193 -65861
23975 -65861 -97935 -128357 -166141 -139062 -53080 -20515 12990 60924 68112 87900 -13044 -85226
23963 -85226 -49898 56230 73200 106337 99373 100175 104994 40042 18633 -1281 42046 55262
23951 55262 21607 19760 61843 57420 118439 216106 187833 143250 90234 56951 28458 66954
23939 66954 134362 124457 140651 112132 37213 -26700 -58181 -123586 -37180 57623 89726 -41
23927 -41 3500 27265 58915 39876 17550 -49141 -51566 -26187 24667 67120 38312 4587 -5589
23914 -5589 -20102 -21523 -43185 -91327 -135050 -113652 -4015 49116 45923 9346 -29236 -40335
23902 -40335 -34752 26662 -54845 -110978 -60826 -29562 16529 8993 -33431 -42274 -83798 -132278
23890 -132278 -103942 -36037 -62522 -74571 -25531 -19912 -65031 -44174 -66022 -57509 -16699 1155
23878 1155 10797 52259 7169 -3534 -71598 -121002 -79766 -85196 -75075 -69420 -55749 -75965
23866 -75965 -69237 -90132 -144380 -168021 -81466 11218 30503 -52456 -5392 -5443 -13857 -82984 -97719
23853 -97719 -46909 5104 5729 70083 34342 18101 101011 97993 86412 95971 40960 36804 70845
23840 70845 46828 33260 30692 -40727 -49309 123423 177616 103524 49067 14214 18383 53820
23828 53820 101778 162477 216672 211061 147793 59092 74029 113339 101772 80663 55410 63914
23816 63914 32461 28366 -42195 -8795 38623 3306 24111 67396 132858 165547 90026 76730
23804 76730 76152 73879 107965 103721 94392 6322 -35255 -16796 8917 -25083 -4275 -24039 -4277
23791 -4277 -26042 -45566 -31725 -66658 -26243 -48300 -74199 -6204 -22278 -69748 -91884 -107801
23779 -107801 -66376 -75235 -97312 8002 106192 148879 140931 140691 126183 155871 170720 125396
23767 125396 80083 -17817 -114415 -55864 80868 155640 118829 17024 -24279 -4727 55102
23756 55102 44325 -3867 -4574 71374 56593 8667 50929 67895 86789 153807 124806 150078
23744 150078 107544 104113 108122 114379 124353 154772 207057 157441 56673 30350 33725 52779
23732 52779 65138 1529 -85228 -117419 -102705 -107448 -58911 30455 56180 17623 43430 95117
23720 95117 101828 105665 70816 23719 32085 96402 84967 52439 417 25461 20143 55177
23708 55177 51330 37523 113625 81943 31482 43164 -21864 -94745 -65103 5438 14908 -38679
23696 -38679 47811 145680 106068 117748 42866 -15196 12554 30317 -14425 31306 -25158 -94202
23684 -94202 -64943 6739 26268 10925 29508 62968 56834 59676 42258 -31744 -17038 -19830
23672 -19830 -111634 -75592 -103648 -49032 20147 72647 50684 -21404 -23995 20319 42543 31624
23660 31624 4814 65957 122575 98141 44787 -21294 -68283 17582 50106 84277 55794 64913
23648 64913 78916 20835 13691 52855 50141 -56320 -36447 55412 142505 179761 153207 46545
23636 46545 -3191 7370 83105 88550 146888 193314 134312 11850 -89411 -60221 14339
23625 14339 26267 104483 91098 92693 22237 48367 135147 104374 94437 109657 96078 89043
23613 89043 27992 -41475 -1097 -40508 -67071 -79696 -90455 -96688 -14031 33280 76421 17906
23601 17906 -40136 -23724 -62860 -87078 -131946 -135478 -38759 45519 59771 61102 64325 -1551
23589 -1551 -25262 -4941 42859 106966 151696 135106 100678 95608 63251 100809 45991 -113832
23577 -113832 -142481 -125263 -77565 -2163 -84991 -171872 -200322 -109430 -61947 -80364 -52076
23566 -52076 -31290 -2934 28869 2456 22055 69226 81897 57358 13726 43866 66790 93549
23554 93549 -4870 -38821 70420 15246 -89001 -130355 -17882 31983 -24660 -63269 -51265
23543 -51265 -36850 -40944 21860 42173 85889 67173 -47930 -108232 -168828 -124530 -129866 -107099
23531 -107099 -58422 -81410 -117470 -106630 -147552 -90843 -33499 34169 39559 10141 58663 37535
23519 37535 29838 25741 13826 -33941 -50222 51947 35968 -76368 -82193 -90024 -131535 -86212
23507 -86212 -24147 -14849 77885 99849 22427 53530 6696 24326 -43094 -25148 36635 22415
23495 22415 -16236 -18932 3952 10934 -26746 21957 8640 -76713 -62129 -26873 -17365 -74280
23483 -74280 -155088 -87163 -6993 1695 -2592 47138 32827 60201 28470 6191 -64337 -16253
23471 -16253 -53851 -50322 -46138 -36671 9503 -5448 -22288 -50192 56281 70890 50313 15663
23459 15663 -7244 29042 84395 29724 -33363 6173 -4422 10880 22161 -117261 -222434
23448 -222434 -203537 -160391 -112585 -8537 -49812 -54023 -63170 -37236 -55574 -55030 -62219 -44783
23436 -44783 -11615 78084 93974 24787 40965 18609 -32074 -75612 4255 115950 109129 43647
23424 43647 -33034 -70992 -22708 -100451 -180605 -128064 -80236 -16134 1002 -25748 -60558 -58279
23412 -58279 -65877 -3199 -21501 -29152 7386 38349 -26079 -109970 -143982 -88061 2583 30872
23400 30872 28805 12511 73452 101154 88238 50455 12262 20887 -13007 -85650 -100619 -103580
23388 -103580 -131116 -84642 -40009 -20989 -15681 -31931 -95467 -21454 15539 33624 -12245 -66683
23376 -66683 -44144 -29070 29401 9953 23746 -69700 -100754 -118278 -162762 -162092 -138856 -20579
23364 -20579 -44022 -53413 45510 7974 -45814 92122 75864 8940 -24048 61575 73209 101442
23352 101442 102600 137913 110897 66419 114356 115954 105914 43069 -22029 31776 71740 69596
23340 69596 -1510 -39671 -92600 -104055 -107765 -104992 -49432 44409 41942 -71717 -93354 -74847
23328 -74847 -19381 -32859 32862 -12169 -22968 -15620 4928 65631 33528 21087 -32332 -21767
23316 -21767 48265 81739 87457 54947 -44140 -56870 -30686 41553 30510 -70944 -72133 -133705
23304 -133705 -209908 -160251 -70741 -37278 -42017 -36693 -13354 18865 -15328 -12183 -43744 3727
23292 3727 117089 121144 -20118 -137438 -13714 5464 -125188 -111875 -32561 -49236 -109016
23281 -109016 -61821 10776 -73384 -64149 -52592 -65648 -30835 -13359 -71103 -140649 -170166 -153920
23269 -153920 -72127 -8020 -7392 -42959 -39789 -37791 2486 -68992 -92898 -60985 3814 -30152
23257 -30152 -7978 31518 39944 81291 45485 -10771 32482 54344 66552 51524 69974 90523
23245 90523 98308 -21113 -45244 -60915 -106945 -25246 17475 -34854 -36193 -90264 -40406 -18477
23233 -18477 44207 25587 -74472 -358 50943 98989 92188 77909 -4222 -130372 -94261
23222 -94261 -57045 -79532 -147079 -159069 -96605 -67435 -13081 49291 21961 26849 39688 84137
23210 84137 31289 -17877 -95777 -33453 49000 54339 51385 27261 -43219 -64772 -35909 -9738
23198 -9738 46999 122625 164170 97320 13688 -6760 -49730 -39545 -29980 -9171 -23642 -79488
23186 -79488 -97944 -88730 -695 -21942 -47671 -46774 -71809 -121731 -83420 -56884 -82835 -92178
23174 -92178 -44083 -33651 -92578 -97263 -48665 -31930 -28089 -60404 -91717 -68667 -32382 -59629
23162 -59629 -97828 -118384 -34559 13695 -102221 -163905 -146490 -138593 -170379 -34573 -22204
23151 -22204 -68218 -14653 63716 71192 94743 55773 31048 42420 -11944 -23439 18806 -6636
23139 -6636 -13586 -84390 -178640 -160582 -98552 -112515 -64834 44352 37329 -28901 -66926 -44490
23127 -44490 -11258 50464 26773 819 -33434 3735 -37633 -66136 -50475 -77395 -165362 -136990
23115 -136990 -105460 -50188 -37458 -58936 -166798 -189400 -139472 -128912 -100648 -91454 -110568
23104 -110568 -127426 -148206 -137937 -206497 -187992 -142229 -98248 -111368 -189835 -170475 -110178
23093 -110178 -142061 -128247 -65585 -68339 -36848 -17590 -54362 -59074 -64164 -70846 -90621 -96950
23081 -96950 -55542 -126629 -119254 12816 12759 -41672 -35869 90726 130237 71424 83781 115429
23069 115429 129037 93045 19208 5641 -9014 -40465 -84554 -25327 -22597 -85039 -22882 33777
23057 33777 17138 43099 35939 17240 -32589 -42094 -48281 -49584 -49637 -23317 60285 57398 -10496
23044 -10496 -26448 -43226 -40349 -53045 -125622 -147250 -59547 -53395 -60840 -107770 -106080 -62492
23032 -62492 -51816 -24204 9597 76944 83583 32958 -78561 -149783 -159732 -57722 -979 13225
23020 13225 -44917 -73211 -117507 -65378 -12281 27194 16151 -46963 -96602 -26428 32656 78395
23008 78395 112345 58666 18791 21603 51519 -77394 -129376 -78803 -7540 21086 29753 25628
22996 25628 98808 110574 77644 -6974 -134858 -153551 -77524 14844 73494 79945 53484 -11211
22984 -11211 -39745 -96030 -100972 -62930 5084 67789 23049 -30102 -67308 -47211 -66731 -85766
22972 -85766 -38400 -1152 -16143 -4909 61014 4750 -9487 64627 1175 -70357 -53755 -58653
22960 -58653 7753 5034 6475 -43793 -75311 7216 -2328 -63381 -56658 -40680 -21628 44399
22948 44399 14494 20180 8707 81779 109142 -2357 -75670 -53680 14130 -6082 -57629 -31802
22936 -31802 -27638 -90075 -126281 -110632 -129582 -92411 -81671 -61032 23077 44491 43971 -1799
22924 -1799 -3027 13883 29973 -71796 -86432 25482 61804 106500 102709 120554 91894 70153
22912 70153 32581 -43981 -123970 -56884 -2753 -37400 -4350 48370 70408 78493 -10211 -120826
22900 -120826 -54776 1502 45606 93786 53419 -18516 -115063 -95445 -34651 -58705 -101106
22889 -101106 -53796 -2510 -7777 -86801 -110541 -102544 -54928 26097 78336 58486 -1691 30487
22877 30487 41194 42445 59100 42130 55848 49978 37332 32782 48224 -6717 -38082 -30450
22865 -30450 -15914 -37529 -22002 -6268 -8773 18073 -32998 -75690 -24806 15248 -99134 -136821
22853 -136821 21512 10782 -56124 -27140 45010 38811 -67532 -144894 -209986 -213249 -120320
22842 -120320 -89609 -8538 -12246 -105716 -63073 8479 36166 -34073 -78086 -26160 -22457 3196
22830 3196 66704 54184 87272 124608 72102 65769 -1046 -71274 -107693 -115788 -76616 -156042
22818 -156042 -190820 -136682 -131511 -97490 -75766 -92856 -132587 -77211 14139 46801 -24011 -103312
22806 -103312 -119894 -107697 -81236 -68389 -91786 -65151 -61063 -3479 -13436 -47071 17063 54405
22794 54405 -2241 -48861 -54308 -100214 12003 62001 -47572 -149342 -89765 -64469 21784
22783 21784 51468 70066 15949 -38065 -37712 -21127 -45354 -18124 -6140 -10776 -17562 -10650 36459
22770 36459 95831 88365 54507 -6757 -60245 -43764 -58323 -108325 -101060 -77054 -128896 -129129
22758 -129129 -88376 -74763 -13976 -1633 -62349 -107329 -76745 -138506 -207535 -255564 -209275
22747 -209275 -157657 -118650 -107617 -152578 -173651 -137578 -93806 -114940 -118236 -125872 -52029 -66090
22735 -66090 -65983 23405 125079 162647 156664 144041 65362 -38350 -76120 -8730 55465 13843
22723 13843 74047 67444 106631 149693 143891 93892 108205 99025 57385 18413 1431 -5163
22711 -5163 21787 -40512 -68314 -68972 -27751 -68515 -155224 -103240 -151550 -90269 -71101 9051
22699 9051 126671 148601 111963 108587 24904 -45657 -95055 -16073 81474 91235 82244 97380
22687 97380 70434 45568 -5381 53563 121521 126032 59335 -23225 54161 171169 127261 32661
22675 32661 45819 -30887 -82107 -164532 -161785 -138291 -184520 -212886 -145394 -60461 35077 23185
22663 23185 98809 184050 122344 98781 46110 2599 -31115 -35753 51174 70172 132236 124354
22651 124354 97053 67371 89271 93803 86710 67820 29726 8603 23928 96595 63569 37651
22639 37651 -8974 -78911 -101658 -166067 -153532 -129051 -74525 -46470 -26850 -29970 -34190 58869
22627 58869 77858 54776 -44416 -92936 -133211 -74800 26254 68532 45910 6598 -56678
22616 -56678 -54350 31217 128522 95517 90598 81746 108468 70773 51041 61242 23258 -39658
22604 -39658 -125652 -172222 -184075 -198591 -199944 -138924 -95764 -82443 -71416 -54146 -64590 -60263
22592 -60263 4115 14990 -30141 -36651 -22638 43163 160665 160110 140840 217918 207646 58288
22580 58288 -16546 -5621 47227 37245 -67040 -118759 -90221 -27758 25493 -23764 -52641 -3876
22568 -3876 -22449 -50939 38832 15129 -57272 -126405 -148462 -61183 -104573 -155686 -152595 -151992
22556 -151992 -74619 -49590 -44001 -77181 -41929 50147 16988 22959 48473 115928 114667 70954
22544 70954 7569 21669 -8071 -69597 -63787 -48176 -6180 -5780 -24809 -19354 -11060 1311 36781
22531 36781 82199 102614 115316 18120 -50949 -56999 -88760 -15546 30643 80880 82054 48687
22519 48687 -26352 -60983 29245 -11010 -14940 -45451 -58683 -71910 33189 81666 98632 105133
22507 105133 96069 72784 30675 -56791 -45246 28707 40964 -13072 -3856 18858 2104 54060
22495 54060 -6886 -86273 -87759 -51466 14780 98921 48963 93242 167513 117014 89891 -7328
22483 -7328 -9319 67287 -2301 -61369 -6813 43031 22986 -17809 -75611 -91173 -100626 -61920
22471 -61920 -49737 3343 -4507 -36136 -37622 20150 50557 -13511 -97952 -18741 62206 -14220
22459 -14220 -41032 49904 113656 -4561 -138637 -100816 -54414 -87705 -41788 -63380 -97400
22448 -97400 -59946 -7235 28933 113914 102669 60890 63230 85112 79099 29140 -50537 -73678
22436 -73678 -122521 -135907 -118584 -110105 -105690 -104411 -68998 -22072 64955 141480 91203 39539
22424 39539 79700 96196 -10486 -7444 48039 99230 -47517 -53632 32006 63376 71835 47413
22412 47413 54498 72685 56363 -60804 -159941 -174199 -118088 7587 8651 56439 126770 30087
22400 30087 -76895 -167808 -181672 -153582 -86579 -58870 -5897 80975 82841 13663 -15920 -16833
22388 -16833 -52530 -51425 -72251 -159331 -103417 -34958 -3029 58730 63110 61552 14116 37701
22376 37701 87569 109182 174234 100127 49282 12249 -29051 -41474 38902 97529 152727 111287
22364 111287 114416 98583 58322 122836 125482 72423 34899 80468 89892 65011 -6001 26211
22352 26211 65740 44459 69161 48826 -11946 -66448 -13259 -1554 -50022 -77459 7350 73389
22340 73389 30357 -84690 -162050 -130738 -71484 19941 49571 61533 81396 50709 -65170
22329 -65170 -144914 -87616 -46424 -42638 -76847 -80583 -141346 -89523 -31697 -74365 -120497 -80133
22317 -80133 -73507 -104009 -161103 -176979 -84616 -76782 2679 89064 64061 12709 -2963 -33943
22305 -33943 -122660 -62452 -20988 -33943 52830 34513 11565 -18209 -27950 -60401 -16509 31034
22293 31034 -29412 -57124 -56013 -12715 47753 38321 51291 56060 25076 -34631 31287 61006
22281 61006 16603 -14067 -110361 -102367 -105979 -76128 -27221 -99746 -105160 -43635 12037 13766
22269 13766 -672 -66449 -81638 -75157 -52687 32115 20032 71545 24606 -15442 -35734 47608
22257 47608 43765 18270 -17338 10786 61200 6281 -27879 -22085 23102 127593 108473 76397
22245 76397 74556 10183 -37356 -49262 -48707 -98515 -100466 -57242 -14408 73600 95074 72159
22233 72159 11085 -64983 -115182 -66579 -66191 -64922 -17004 38589 39971 32526 33587 84505 208531
22220 208531 249518 75218 42794 21432 -49283 -51042 -66610 -52060 -18473 -15827 -14045 -38106
22208 -38106 21618 -513 25628 110845 119791 133919 143654 84839 75736 92083 40898 -4425
22196 -4425 -57641 -173326 -118837 -59079 -15363 -64042 -76827 -27013 -43253 -49797 -23411 -44130
22184 -44130 9062 57881 117809 70253 -37672 57445 77568 39380 31197 -20068 -73344 -53719
22172 -53719 11354 -25283 -105026 -130966 -125713 -168912 -191853 -134547 -55776 -20541 28014 -4415
22160 -4415 16900 41060 11780 -73066 -90291 -74943 -46212 -37703 17550 11999 -67090 -49661
22148 -49661 38376 19521 -84312 -169442 -170839 -158210 -146364 -186748 -87428 -3422 -23050 -92667
22136 -92667 -148113 -157780 -48174 -16196 -124653 -59934 70603 67010 85362 70104 25670
22125 25670 -21228 -25225 -13716 7364 64026 152434 130318 26312 10956 -10017 -34303 -49493
22113 -49493 -88491 -121280 -76878 -5412 -14221 5792 97004 150147 154678 172989 50546 60220
22101 60220 52564 22004 30624 53939 42541 -21261 -53821 -78174 -20900 16615 -21369 -45860
22089 -45860 25464 42666 82532 54879 23270 -50026 -120039 -152728 -37492 92148 103063
22078 103063 -9602 -54689 -70708 -62255 -78198 -104774 -115493 -79466 -22878 18841 -61594
22067 -61594 -111873 -41564 -107563 -82471 -15725 78364 86176 35092 -832 39090 83953 51868
22055 51868 -43904 -62549 -28293 -40968 -56788 29433 -60694 -111512 -35436 11760 87069 113991
22043 113991 31502 7852 1504 -47627 1453 -3783 -38086 -61436 -120295 -184259 -227488 -170827
22031 -170827 -93024 -66349 -96803 -76681 -83306 -123847 -111669 -82173 -147524 -187936 -121352 -69917
22019 -69917 -120930 -179003 -175518 -58653 -40524 69775 140519 74090 47059 93449 77491
22008 77491 21182 -45379 -35938 69245 68169 43987 38189 -37785 -48952 4784 60853 113813
21996 113813 73920 77583 55291 64298 -21864 -53366 -28345 34673 27404 11802 -33389 -39603
21984 -39603 -112172 -131284 -104878 -36894 -50684 -55957 -88334 -137396 -94621 -53419 -2612 33011
21972 33011 53758 -61659 -175794 -202321 -190203 -103497 -93584 -168578 -121494 -130892 -151717 -135456
21960 -135456 -56818 27167 62639 41720 -70882 -107695 -52659 18327 61717 44436 -37857
21949 -37857 -140809 -56839 9411 65101 60437 10356 -76662 -118870 -72982 -17644 32006 22006
21937 22006 -83012 1652 75187 72263 -9171 -34889 -32821 -44978 -39848 -24797 -26736 -57292
21925 -57292 -62234 1383 30443 -71425 -58864 -52646 -41337 -47335 -30020 -39619 -37704 -27888 -61363
21912 -61363 -43701 8984 101268 40626 -117738 -137937 -117867 -83380 -22771 -88017 -179474
21901 -179474 -142052 -47882 -10242 41625 81114 98937 -4434 -38855 -32197 -29654 -119618 -153576
21889 -153576 -174386 -110522 -91528 -40931 -70600 -24742 74062 60706 43232 35055 50738 -32771
21877 -32771 -116562 -138439 -180153 -154913 -97279 -103799 -78518 -140928 -56149 7022 9766 -10873
21865 -10873 -31728 -43181 11503 56927 91374 58573 87733 43873 14671 -32801 -74636 -92475
21853 -92475 -109044 -5489 60007 63063 80966 42120 -74522 -101799 -144466 -82746 -54134
21842 -54134 -82542 -17443 93085 121041 92547 105305 86369 63414 51137 31829 1879
21831 1879 18318 64194 74085 40277 71420 76901 87133 50392 57714 84781 60459 -21344
21819 -21344 -50737 -14930 -9760 -53939 1169 73153 36078 -53573 -40313 -101772 -94397 -82520
21807 -82520 -41536 -4466 -26028 -12687 -47079 -26930 -73938 -63922 -112816 -123661 -113385 -7248
21795 -7248 -20607 -33774 -39830 8996 120952 59308 -36157 -69841 -60454 -40360 3475 -45400
21783 -45400 -50534 -6753 22856 62896 96373 46510 24913 61884 75271 46041 20088 6580
21771 6580 -47176 -62744 -55213 -43117 -36976 -31068 5694 684 -41502 -83453 -57502 -66850 -55969
21758 -55969 -20542 -26072 -189915 -200362 -49195 -20908 -101267 -120300 -99617 -46799 -58587
21747 -58587 -24416 -6933 13046 37407 121432 183231 128967 121416 96598 56033 52018 -27406
21735 -27406 -34222 9099 48461 41149 -7835 -10735 -64050 -17742 -45787 -6292 -105186 -213781
21723 -213781 -243212 -186344 -75646 -72339 -123623 -89105 -167232 -138353 -62478 22932 -50536
21712 -50536 -92796 -100263 -89216 -103912 -136333 -77977 -58918 -72608 -25668 30092 -19779 -52672
21700 -52672 -54441 -25269 -41606 5099 96814 69998 65166 31184 24182 -60470 -38627 -32891
21688 -32891 23192 45565 81875 121514 105062 -22334 -52186 -64274 -20529 29635 35531 56643
21676 56643 17510 -61776 6886 21972 -60575 -72931 -13949 65543 -19983 -61787 -54315 28753
21664 28753 56445 20382 21541 -45091 -60360 -68517 -71284 -74155 -84637 -24374 -42600 -32400
21652 -32400 -135383 -180365 -114886 -25887 31052 20677 -1698 3617 -30873 -47860 -135260 -115671
21640 -115671 -60303 -36069 -47122 -61130 -16676 4007 14122 -14804 -24773 -34969 -61480 -59847
21628 -59847 1371 76849 -5632 -83701 -159124 -186803 -116438 -58012 -87341 -69201 -908 23076
21616 23076 30511 -14468 -58060 -80847 -40437 -36370 -27759 -18438 -29046 2655 22529 29386 -9898
21603 -9898 -5148 -1646 -47341 -50981 -29096 6515 21061 43517 -30043 -82823 15831 24372 29024
21590 29024 59693 44370 83098 84722 76500 132168 105362 43182 4981 1742 25374 47942
21578 47942 -1958 -74895 -62743 -39764 36693 30422 20991 -20379 -93437 -42822 -81423 -134405
21566 -134405 -84499 -72906 -148627 -196179 -172008 -112091 -51014 12261 -2354 -94598 -104775
21555 -104775 -30234 -3032 -82433 -59440 -51715 -100315 -126119 -98874 -42464 -15045 13401 28933
21543 28933 25029 -222 27206 72319 423 15034 33784 63148 -5213 28582 -20292 -64895
21531 -64895 -114 -40309 -72621 -90270 -54745 21390 -66954 -72490 -17934 -31058 -34921 -31519
21519 -31519 -85581 -117812 -129196 -123489 -136838 -97306 -71198 -69898 -65395 -58525 -98990 -88015
21507 -88015 -89279 -172393 -113793 -27975 -8842 -2853 4118 343 2412 59294 12900 -10420 32813
21494 32813 -10006 -80080 -102339 -73302 -33113 -29404 -90563 -177519 -187024 -110316 -29811 -27277
21482 -27277 -26394 3430 72002 69542 29195 44666 28512 31666 18419 -11030 33102 66032
21470 66032 -34104 -128066 -69606 -30430 -65617 -77660 21873 57249 40318 -34029 -126449
21459 -126449 -42635 -22146 37936 87119 54144 8062 -41759 -107388 -35467 -15442 62100
21448 62100 23928 -10541 -35779 -1299 68477 65891 134794 102153 23049 17368 5691 -48221
21436 -48221 -69097 -69996 -37576 -10950 41008 82017 42704 4170 37221 16318 40924 66335
21424 66335 -7435 -140 -19637 -72674 -121019 -116561 -6699 32552 -132032 -147966 -15701
21413 -15701 119976 124755 88980 32479 -43913 -58626 14652 1975 -69172 -107394 -94550 -88323
21401 -88323 -65505 -12423 -23944 63151 118291 68935 40250 60743 139476 186892 172504 93033
21389 93033 68205 5165 -747 -17539 -64465 -14475 -93326 -82038 -36109 -48312 -137704 -79813
21377 -79813 -43715 29603 109441 93936 45370 -3112 -2707 22812 10641 -27464 -71464 -135442
21365 -135442 -100953 -51717 -49066 -70960 -32128 -67858 -92758 -104206 -18542 -822 -82835 -106847
21353 -106847 -99138 -97385 -149324 -129158 -108573 -151182 -120172 -69558 57909 89955 76665 60879
21341 60879 -83226 -124398 -52156 -33411 6057 138217 65759 -35708 34011 23508 -14368
21330 -14368 -12800 45427 25763 41270 3525 33332 21543 -25572 46928 50810 86744 74671
21318 74671 -5466 -82469 -31459 -15461 -39327 30546 2164 -76731 -111611 -71443 48378
21307 48378 99133 29212 -33889 -95247 -87329 -2487 -16237 -88726 -97478 -29283 38997 74970
21295 74970 54143 -67940 -117294 -50012 16148 23925 -5279 -241 -38291 -71394 -124292 -124781
21283 -124781 -92998 -90613 -72952 -120737 -174860 -204959 -242165 -194465 -117101 -73146 -36631 -89300
21271 -89300 -35784 73069 63728 43764 20574 -27903 1896 24576 53206 58640 15257 -63772
21259 -63772 -29502 -75190 -64297 -11837 1127 -80173 -111316 -56711 25380 100538 101716 -4663
21247 -4663 -22876 102138 65979 30111 23478 130076 186288 70116 28903 49185 67689
21236 67689 -21168 -41884 -24149 -27419 3505 16043 34805 98465 52102 -86122 -88135 -977
21224 -977 -24287 -44789 47861 79103 8942 -23951 11551 48466 15635 31746 -96979 -241209
21212 -241209 -252537 -127633 -28632 -11606 -3243 13093 -74170 -63936 -114647 -180215 -185592 -83349
21200 -83349 73636 93312 50918 -53116 4573 23881 10384 49026 -15806 -111760 -113195
21189 -113195 -102220 -45478 64061 72884 32435 52837 4793 3856 54164 19318 -42452 3854
21177 3854 142740 93592 -33250 7325 60223 46491 23000 108118 165163 98988 -7081
21166 -7081 -25566 -45271 -11232 -16466 -18074 -73354 -32354 -34682 -58372 -68133 -533 20536 11698
21153 11698 1168 -8637 105131 110169 8083 19419 56010 37833 22465 15935 27887 6855
21141 6855 -22259 -15941 -17379 13805 -23838 -51554 -45701 -39298 -284 -1684 -9717 87309 200452
21128 200452 125588 3538 4522 1341 439 -1140 -60579 -83757 -55248 -62008 -48048 -14760 -2491
21115 -2491 -1106 8392 6781 67947 27769 -32615 -47391 -43227 -51617 -50342 -51904 -101398 -114566
21102 -114566 -43678 62025 38747 -19241 -51605 -51047 -57031 -5050 -36544 -81468 -70660 -49646
21090 -49646 -43918 -92342 -96410 -17285 -21692 -37184 -7213 -23884 -5058 -21709 -57544 -46281
21078 -46281 -63138 -48685 -4844 -22553 -117682 -148790 -126388 -18223 39492 -60534 -102222
21067 -102222 -118045 -59012 65092 84939 111940 6284 -10100 -6937 -8076 37462 23916
21056 23916 6782 5468 -29395 -96886 -88804 25105 -26227 -53057 -80034 -109560 -62191 -100820
21044 -100820 -131753 -47575 12488 -49257 -7012 43931 71825 62637 5807 -49815 -13168 -20987
21032 -20987 41315 43722 15002 -20553 -50519 -76185 -25864 48150 70181 40186 33834 94021
21020 94021 93445 12588 -55247 -8828 21369 3040 -20009 -77708 -86321 -38425 -16907 32216
21008 32216 -47849 -65036 -64331 39806 79581 51204 60403 124328 100371 16470 52350 66699
20996 66699 27871 49199 40840 -3531 -21974 31180 46482 -13512 -80302 -29600 24247 -38134
20984 -38134 -107485 -88360 -42009 -8001 15506 10471 9091 43185 13376 6011 67177 122215
20972 122215 86315 -46367 -103572 -20638 44811 70293 48746 35877 -2044 4880 51133
20961 51133 78875 67429 14827 -2087 -21277 -32541 -33471 -61812 -97337 -64417 26865 77634
20949 77634 94063 66494 91269 72278 29933 -20364 -30143 -63966 -137272 -178057 -135876 -163414
20937 -163414 -102544 -41275 -35648 -81905 -84157 -106598 15456 112529 118053 121131 77672 72095
20925 72095 55111 50120 117852 56221 36931 60981 53487 68114 78157 60310 -45030 -52273
20913 -52273 -25957 -26044 -29861 -41896 45826 23678 -64536 -84490 -75473 -51913 -44168 -54887 -32550
20900 -32550 -35022 -28389 -4225 -28803 -48583 -62747 -47547 53772 103485 164472 202109 97122
20888 97122 72931 125629 83274 28807 16084 12836 46924 101401 131226 97228 -1089 -55497
20876 -55497 -142638 -31771 136754 90449 36929 37022 -10847 32384 41040 69437 88795 72977
20864 72977 10595 -63157 -67783 -32065 25340 -23171 -47405 -33234 -85995 -103017 -86726 -65657
20852 -65657 -121661 -43824 -34979 -40012 3734 -38559 29375 87877 175415 121283 29136 -71329
20840 -71329 -98434 -35452 -9176 48714 86888 114310 220455 297287 252840 138723 44689
20829 44689 9374 4009 -35509 25333 52863 -21648 -81594 -97204 -65805 44177 72091 53149
20817 53149 19835 16864 -6477 -34553 -10891 51515 54664 -9427 -53279 -73246 -127087 -73851
20805 -73851 -83812 -97035 -34405 -11203 -30939 -24192 28024 -18150 -58173 -67833 -72553 -127763
20793 -127763 -155216 -173937 -135224 -46264 -71809 -65990 27436 84287 58775 46944 175062
20782 175062 221276 59967 8854 28819 88658 84838 53525 55219 132000 86202 87543 79890
20770 79890 83934 58355 23291 8390 -24056 -28826 -59451 -127295 -120417 -43313 -30480 16541
20758 16541 -2084 -24660 -20453 35786 62561 14866 39551 25943 45478 38352 28870 75417
20746 75417 27751 19321 132783 104956 50485 -35962 -73401 -57684 -6396 -10761 -44841 -24626
20734 -24626 -30201 -90736 -80289 -74615 -44978 -50798 -5051 6097 4068 -29507 -108191 -124245
20722 -124245 -78711 -14363 5629 81951 80735 -34580 -90655 -60842 -70183 -51583 -24799 19164
20710 19164 -16629 -33833 -2589 -84127 -33586 17956 90394 180252 199153 135391 102619 141959
20698 141959 138561 72300 50866 24786 21508 9649 -47566 -46856 -2208 5734 -53282 -44841 -12461
20685 -12461 14436 -52144 -54150 10343 25506 24252 -36041 -63098 -77006 -106477 -113250 -76419
20673 -76419 -54345 29711 74544 101198 127649 127911 37196 -11658 -39392 -76367 -60542 -85896
20661 -85896 13132 87091 107121 110566 100457 94233 109409 111346 60150 -32200 -21845 -37251
20649 -37251 46369 106028 62328 -56687 -62376 -78290 -107319 -87634 -95237 -57234 -19419 -13831
20637 -13831 -176923 -138196 -114941 -58018 -11242 -33878 -59225 -1133 88063 105401 54963
20626 54963 -20211 -59758 -15149 86376 125992 133791 97448 62703 12749 -25557 9276 25453
20614 25453 61210 112441 95029 33949 -12423 23025 52450 2086 -26041 44910 107103 124233
20602 124233 109044 -16496 -113008 -68383 -30171 -25088 -49472 199 81518 92678 63020
20591 63020 33874 55183 171559 199109 86575 43923 35731 80595 22481 -28422 -1299
20580 -1299 19207 91930 170610 66789 -14814 -32730 -32475 11949 -7775 -3985 -15653 11556
20568 11556 40844 -36821 -49846 -75456 -31274 81864 68248 -13161 65650 85375 127066
20557 127066 116830 70596 24807 -15940 -107515 -67475 -101313 -117824 -55788 66858 34430
20546 34430 -36801 -32100 -37018 -69870 -81460 -4333 44707 55023 58120 34660 48189 33998
20534 33998 14603 -32195 -51050 -6416 126 73291 111352 50462 18897 22858 107894 132222
20522 132222 96651 98365 41225 68317 24527 13855 -2645 57675 110579 123588 184271 93823
20510 93823 86 -27318 631 16130 1400 -29864 -53261 -54795 147 44798 -21239 -3823
20498 -3823 27666 112846 149441 165561 25147 -78755 -105658 -46650 36871 99797 123301
20487 123301 140146 65575 -12931 -705 28079 12408 69471 79353 54040 97021 123672 125790
20475 125790 72107 51013 48973 109089 65023 10240 21926 10275 37682 -3575 -24270 -21184
20463 -21184 -46518 -2175 7517 -10782 -80270 -155995 -128017 -77370 -76600 -98668 -71603 -7997
20451 -7997 34105 81980 12797 -60618 -43364 -14592 21672 34283 -28942 -78462 -73755 -69477
20439 -69477 72691 190369 170437 132081 80608 51807 95819 58436 -65104 -47443 -9419
20428 -9419 66672 33492 40215 149072 182345 105243 -6056 -33749 8929 26230 36172 56031
20416 56031 43828 -22075 -85171 -101037 -27481 -1971 58555 156571 88593 69904 40 -17636
20404 -17636 55628 65787 43233 55561 39049 65351 85642 94028 61106 -1442 2809 25638
20392 25638 80241 98853 117271 109987 120280 48228 -24949 -80495 -102210 -61430 -48897 3911
20380 3911 43179 86934 104681 85988 59155 23324 40624 47136 57910 15297 -19112 -19681
20368 -19681 -40662 6801 60821 46532 -23856 -124041 -155664 -74740 -28300 -20903 72967 109935
20356 109935 48225 -9591 -55834 -771 23864 -59207 -13269 53984 41410 11165 33552
20345 33552 54099 2894 -47630 -19660 -9495 8350 75201 38808 -20643 -65523 -55812 -63252
20333 -63252 -25008 59967 126408 155558 183682 186003 149333 155893 14937 -89946 -92904 -104735
20321 -104735 -32057 6852 11754 11017 23251 -5855 -24726 -2673 67197 59977 -49894 -12664
20309 -12664 104419 158020 216162 160249 217178 149200 13554 60704 158921 184817 85847
20298 85847 42023 -25072 45637 61000 78898 21464 156 -13939 77647 188242 271365
20287 271365 192434 115843 116706 78990 94566 137075 157368 214706 205711 232873 201833 130891
20275 130891 54440 83196 105616 102128 65605 36264 108668 97717 24597 8545 -14774 9023
20263 9023 -21387 -17807 58354 130452 148244 130316 111861 128943 122830 41409 7921 64298
20251 64298 100067 53942 107376 140127 115096 17441 14255 18892 21903 -65171 -87358 -8764
20239 -8764 52735 77430 -44549 -99441 -106898 -138712 -138729 -91037 -67806 8394 51364 48351 80521
20226 80521 174688 126449 28778 40271 17491 37158 40544 31254 103017 131825 40462 -54204
20214 -54204 -37734 -4090 -86638 -98036 -2744 22740 21891 49648 87624 154776 134179 94208
20202 94208 59284 44480 44891 11978 45338 103759 113636 95254 87091 105346 93636 32684
20190 32684 -16821 36319 32511 48630 137200 140553 43674 -15381 -22482 46638 140677 144914
20178 144914 70837 75764 62559 80144 37534 -49856 -55622 -62004 -83125 23633 118245 112656
20166 112656 16695 -83403 -65374 18184 30461 -85779 -93483 18796 37380 102611 166768
20155 166768 93687 15311 51010 138564 154888 117242 18031 -79648 -97051 -62860 -9443
20144 -9443 72570 121726 80048 82042 72278 102161 -24126 9743 23900 -38812 -7649 27237
20132 27237 44596 -1210 -58806 -65951 -7571 582 -47281 -29375 -47811 -27969 27706 -13362
20120 -13362 -41963 -51338 -83638 -61298 -79388 -83860 -56025 -44750 6691 57370 123277 160162
20108 160162 190265 59373 73195 121186 201936 193347 113307 42611 115314 128907 120618 138321
20096 138321 133742 183002 220022 193134 179059 146192 106285 60621 112919 82346 104143 154700
20084 154700 106940 10948 -35430 -83021 -33028 68150 53648 132041 122512 119692 94296 18364
20072 18364 -6665 -29009 -80876 -77991 -40533 29937 145534 172844 138177 95315 75593 81771
20060 81771 58565 27202 -67387 -58810 14145 96733 152288 212066 169592 70603 -48646 -67198
20048 -67198 -45379 -41152 -13324 -55092 -2058 4435 -49451 -62183 10564 56540 23734 -19670
20036 -19670 26049 32234 16808 35089 153718 202037 217260 284972 188585 153384 225944 234749
20024 234749 219416 187670 90621 110586 135999 91700 98317 122110 188356 282680 248295 152060
20012 152060 9527 -806 14978 -24472 24041 21354 -94279 -110024 -10198 7542 -6503
20001 -6503 -49707 26040 124179 117634 108499 133464 76634 10616 60584 23603 33600 45009
19989 45009 80900 64056 -62179 -81117 -2185 5691 42705 43681 120990 156898 90811 47034
19977 47034 -41571 -104697 -38980 39612 84409 56781 -17711 -11613 -46107 -76426 -123751 -23980
19965 -23980 75488 99142 130071 183344 177891 126644 135653 96777 152057 145493 133380 127775
19953 127775 97328 178941 206338 140419 97732 88905 111469 117031 175778 168901 159916 149610
19941 149610 36157 -22416 -93686 -88906 -52701 -14116 29966 29378 81877 95393 96810 48260
19929 48260 -118810 -95251 78788 104564 93398 154917 173896 141542 27808 -25841 67076
19918 67076 69665 66234 86473 126118 15900 -16561 17514 92256 87692 13285 -12831 45767
19906 45767 114416 182106 219503 194536 207200 176563 113857 120520 185570 258048 284941 317118
19894 317118 407558 331153 183894 275386 389200 446242 391723 370492 430390 403794 382899
19883 382899 349195 311444 330498 384614 408949 410544 428680 382033 245185 253785 335075 365382
19871 365382 262605 211098 292406 286996 237732 230831 269702 310927 265793 219312 218481 264438
19859 264438 234008 207552 201114 150703 172869 207755 325876 390611 414482 476589 449835
19848 449835 450117 440243 483178 479573 435642 438622 376935 315323 337061 343558 372330 407067 415160
19835 415160 443119 457603 433684 416125 368905 293722 244598 253427 256855 239577 318915 342126
19823 342126 400113 429116 428529 372189 302793 394903 455943 404746 358124 300011 262752 279333
19811 279333 223498 183963 257200 197774 243047 244549 163415 174532 175700 168378 123931 114125
19799 114125 158932 220620 219116 162785 107906 168399 251765 225544 154628 90821 132915 120269
19787 120269 108141 100188 88573 45190 74674 78134 77877 89416 87640 -7651 -54658 10695
19775 10695 12046 -28528 -17484 31740 25514 20102 51511 106223 54502 57488 100888 130752
19763 130752 125845 138614 155554 155230 161995 117508 190513 244058 243982 210881 179541 237851 292995
19750 292995 180665 90390 113137 163233 253802 139213 43607 104229 76478 86512 105442
19739 105442 35862 92428 186034 173000 73715 141578 229767 292719 191019 175808 286266
19728 286266 399118 502723 573446 586851 523920 502466 445236 425352 434499 386980 280468
19717 280468 266219 355436 373652 345346 271976 223416 281838 310962 297981 298560 296416 339631
19705 339631 351202 344261 221616 145549 225649 293297 305426 251940 246743 219833 220289 252755
19693 252755 338435 246557 201175 161261 170582 211699 259675 335753 313156 294654 374877 413986
19681 413986 474219 512505 539047 524810 367494 377759 410048 496867 539191 532033 547460
19670 547460 622898 641101 666868 709216 698159 593548 547108 493940 462437 438055 452777
19659 452777 436525 362848 380779 382146 270660 302260 319608 268774 239730 134859 141302
19648 141302 162558 200729 317336 306452 290353 285255 276079 219781 188559 191589 257628 262536
19636 262536 192548 144480 162718 283825 381687 424284 386197 325653 355130 423569 459604
19625 459604 505765 468887 394739 361237 371362 350002 365415 428761 460833 422621 347778
19614 347778 303012 251543 149443 90104 82974 133182 188173 151592 156550 243155 268011 273104
19602 273104 229032 256539 260353 182137 122303 152301 201586 195753 220800 209698 193221 164376
19590 164376 105529 75659 111332 189794 247371 226050 314255 400704 365586 327042 300467
19579 300467 261099 232544 276340 223974 164039 186514 203349 282936 332327 349378 306167
19568 306167 259457 277549 281517 271161 265972 363437 401607 343479 303312 280211 368909 403124
19556 403124 379962 366159 431961 451352 334960 341021 314772 366652 373956 361539 402138 416649
19544 416649 305216 301134 370258 404942 375209 340302 350969 364317 246515 279026 344226
19533 344226 385322 347518 289123 294910 314505 298540 375199 433950 462434 450774 466237 525690
19521 525690 519057 468641 446515 368134 369294 377208 302792 319909 411772 504380 535914 517694
19509 517694 524217 561352 580885 653566 730181 689189 693552 720252 756098 783218 774153 783831
19497 783831 761832 810518 896670 879211 809410 694016 620485 601192 606621 641628 599893
19486 599893 652389 653240 666931 669359 647270 581018 618672 753448 708443 704759 693250 725067
19474 725067 794058 875044 968103 927343 835659 769155 750872 871168 837493 720199 651644
19463 651644 660550 694503 743431 773675 767481 704360 681065 757067 881690 872666 877312 823303
19451 823303 843005 938977 940007 1023107 1245329 1265523 1203140 1198617 1208968 1232818 1265481 1297205
19439 1297205 1277597 1331258 1310864 1290390 1254102 1221730 1275276 1233959 1188321 1211121 1236386
19428 1236386 1263343 1316967 1376139 1454720 1475161 1526097 1509569 1491597 1547068 1592548 1589504
19417 1589504 1577278 1533263 1557615 1612927 1595538 1630764 1636172 1541113 1509180 1591852 1629555
19406 1629555 1718853 1818952 1844020 1873439 1876753 1829535 1811399 1806405 1813890 1880263 1963151 2016946
19394 2016946 2037426 2054163 2013603 2102974 2146261 2190290 2228168 2293052 2404605 2643987 2724440
19383 2724440 2873042 3101885 3388736 3730589 4144959 4634449 5144770 5618686 6160374
19374 6160374 6690163 7150735 7637617 8112054 8571572 9007531 9364345 9646062 9755107
19365 9755107 9795108 9730671 9538768 9248413 8823442 8401860 8151770 8253072 8651867 9214067
19355 9214067 9980129 11302413 13475115 16604913 21033598 26887149 33808425 40902751
19347 40902751 46809140 50561449 52142144 51776505 49815175 46206841 41493381 36567851
19339 36567851 32166382 28588171 25679847 23550480 22361939 22004912 22585280 24276284
19331 24276284 27383182 32033680 37805847 43947170 49401026 53243073 55141573 55245996
19323 55245996 53684452 50636713 46459563 41797839 37377468 33636668 30821660 28899263
19315 28899263 28046412 28453691 30147420 32834733 36349524 40428265 44587624 48675478
19307 48675478 52611421 56566147 60411809 63335865 64221979 63173964 60537666 56809707
19299 56809707 52547063 47767057 42884430 38600257 35533370 33845394 33714540 35385493
19291 35385493 39292913 45974894 55454793 67153942 79596304 90863722 99080939 103254717
19283 103254717 103384613 99682528 92790779 83520228 73121466 62715056 53189736 44960453
19275 44960453 38002316 32375204 27894146 24393207 21741739 19789133 18586364 18166769
19267 18166769 18347038 19018385 19858396 20602503 21291373 21903575 22419318 22755760 22707184
19258 22707184 22224858 21225838 19891377 18393553 16810340 15166328 13498930 12002295
19250 12002295 10804285 9853216 8974102 8047427 7280481 6696179 6158225 5745443 5343454
19241 5343454 4911394 4540584 4263331 4142796 4104446 4030862 3902091 3795177 3619627 3607726
19231 3607726 3536473 3469514 3422968 3412403 3409569 3469448 3452382 3431511 3590775 3603665 3566538
19220 3566538 3593217 3712193 3790822 3890658 3980392 4033663 4276957 4589848 5064158 5988694
19210 5988694 7373799 9319107 11609699 14050496 16647280 19139469 21432679 23578314
19202 23578314 25515617 26989660 27608010 27395494 26644596 25507899 23995411 22216973
19194 22216973 20300775 18613748 17327567 16452027 16147184 16465829 17343476 18915024 21563957
19185 21563957 25564100 31319157 39414666 49942004 62107594 74686649 86000301
19178 86000301 94333099 98774342 99266652 96270436 90367725 82412016 73424325 64511002
19170 64511002 56540937 49968779 44906309 41381354 39570017 39437812 40845853 43480472
19162 43480472 46883965 50373005 53470454 56137325 58193585 59377666 59342991 57837694
19154 57837694 55177883 51673786 47525153 43227652 38966799 34948792 31565608 29071086
19146 29071086 27262913 26531173 26948163 28504246 31385329 35571393 40568990 45631006
19138 45631006 50065965 52999560 54071036 53460582 51290255 47790537 43373442 38569568
19130 38569568 33879875 29735650 26202371 23326336 21178547 19877516 19509929 20154385
19122 20154385 22004537 25479441 30511861 36455403 42326882 46766905 49075693 49308151
19114 49308151 47857878 44743862 40337052 35028454 29755367 25062974 21090989 17845680
19106 17845680 15085087 12838858 11096149 9830015 8980884 8436926 8065029 7959172 7922669
19097 7922669 7824321 7479988 7100580 6701625 6301800 5853359 5441465 5117386 4856700 4555298
19087 4555298 4224585 3986136 3731872 3365031 3026023 2780055 2539011 2279803 2155702
19078 2155702 2043111 1879001 1723034 1568266 1435261 1283854 1118162 1066857 1013776 1009873
19068 1009873 948633 880310 835183 731521 604445 547896 542171 582879 586244 575244 613324
19057 613324 545334 571691 473296 402062 445745 468492 399689 375429 387371 323052 288079
19046 288079 226404 167310 160831 85259 121323 143965 120905 147848 231547 286094 311612 328188
19034 328188 323588 381722 414392 319467 259250 181689 160728 148116 24021 45005 23737
19023 23737 83205 137947 203111 170918 189617 259077 270380 276577 245340 314488 269249 240706
19011 240706 180886 56232 -2301 25117 52476 86476 80258 -4741 -77584 -34151 51221
19000 51221 146000 187336 179028 141410 156377 147650 77126 -27451 -94758 -79349 6424 -32474
18988 -32474 -76922 -39846 -22724 -83486 -59483 -116412 -173222 -159177 -161680 -120912 -22757 37211
18976 37211 53564 32547 6073 12787 -25894 -101588 -107151 -98334 -104297 -131572 -113177 -93700
18964 -93700 -106930 -72553 -105924 -120518 -91700 -123331 -220747 -171337 -173416 -245756 -164945 -103151
18952 -103151 -104196 -67767 11144 77127 95949 70202 137047 193812 176184 165030 21830
18941 21830 -51437 -17593 45623 47851 59100 149086 194880 232110 205440 192949 174742 133584
18929 133584 105723 22907 4810 40030 133680 112641 135668 221760 196705 168198 218391
18918 218391 177187 137646 79314 57205 175755 216402 140353 79615 124905 201850 262565
18907 262565 291082 243875 147579 121877 201680 230663 204209 165602 176091 132203 119446
18896 119446 105552 148149 208123 326365 440804 560994 611006 641847 643863 579577 503929
18885 503929 435087 324011 214085 178832 248933 207512 202537 106418 100767 151338 180426
18874 180426 198607 241382 260442 289680 351551 356036 338450 348282 316244 287524 295043 305236
18862 305236 236370 212009 226088 97303 53035 88605 48029 123960 212535 183727 201358
18851 201358 307010 436249 505038 543773 520160 383398 265598 230606 224511 240832 180327
18840 180327 176428 156283 120996 176729 233437 238184 301950 371100 438506 417006 407577 384855
18828 384855 423805 400464 414694 432162 391465 383879 321591 281703 260338 215703 150651 158091
18816 158091 153856 189696 147594 10437 40286 83130 39707 39979 35408 91342 208889 231301
18804 231301 199968 166727 217143 168099 -7112 31958 138440 233861 256356 229488 279913
18793 279913 324902 373188 396165 348249 368221 339944 302137 249857 179197 171505 180493 215037
18781 215037 213022 75165 102320 155081 187384 234420 243967 239030 247577 231177 155909 161607
18769 161607 153344 135222 121079 232441 173203 131825 143812 117702 90709 106445 117732
18758 117732 145356 154857 145765 112912 5058 -27629 -50979 -50936 12708 5879 31464 90973
18746 90973 175670 180776 147584 101607 82511 108769 204126 234575 201561 187851 190308 215160
18734 215160 156707 101207 111894 190979 202588 153123 90528 129401 188135 153699 30469
18723 30469 -35714 -92824 -49361 -31246 17806 131773 191792 113318 -37260 -66325 -105676
18712 -105676 -37653 -3190 -43885 -85865 -118889 -60278 -35101 -143479 -160283 -115881 -92893
18701 -92893 -59932 5254 -63426 -50654 41579 56553 41886 24386 -14568 -32974 -78636 -90748
18689 -90748 -53043 -34941 -8464 -45828 74823 109008 60673 68605 113661 221097 297956
18678 297956 271596 331135 338568 269090 353967 275564 141345 40789 80874 198539 220789
18667 220789 264525 301964 290602 213609 220451 204045 88619 56017 27222 -38179 -71618
18656 -71618 -6226 57440 -20324 -67899 5811 13101 27700 1544 5754 4764 -19012 -4036
18644 -4036 92534 91483 118273 215822 197638 177281 222694 212826 116941 116670 197453 233584 166655
18631 166655 105866 107237 122318 218357 280475 379548 420059 400510 314220 328060 314174 313429
18619 313429 340313 311789 297064 362231 370159 298476 273351 308787 247405 280799 254419 186664
18607 186664 154040 116968 80221 88914 56643 20168 -49710 -73162 -77564 -56606 -39032 -16453
18595 -16453 -55945 -115614 -115680 -52501 -16766 -38975 -66046 -28620 -78003 -101513 -97565 -122387
18583 -122387 -101891 -55408 50326 96025 77250 40519 78882 129704 73640 -73480 -92363
18572 -92363 9916 155586 185838 170870 152116 129668 56606 89319 156996 152726 137201
18561 137201 20695 -69071 -66555 -21084 -70298 -133967 -140297 -190711 -139629 -52634 -66002 -92735
18549 -92735 -36678 37844 38190 -31938 -160474 -172193 -154734 -172474 -129744 -131377 -119086 -94382
18537 -94382 -111588 -99578 -149512 -118066 -94866 -27464 45629 14892 -5396 -29853 -23783 22326
18525 22326 81137 54423 73902 83126 62213 57014 86505 35831 23945 35219 -25642 -23606
18513 -23606 76196 55403 67853 9147 -41754 -30752 -80000 -136019 -178530 -92762 -58709 -34174
18501 -34174 4461 25729 71955 39560 -10935 -41030 -75046 -78339 -36842 -15589 -24959 -44716
18489 -44716 -16918 11026 37966 68973 60357 18562 4708 8989 -33856 -139571 -170948 -98659
18477 -98659 -18190 29114 9140 29053 33836 37206 -16042 -517 -218 -20995 -18959 40282 34536
18464 34536 53199 72906 4149 -71066 -29809 -10383 -27272 -113775 -92519 -810 -8769 -103747
18452 -103747 -111640 -64761 1324 60123 33794 36180 13445 6645 -58905 -105369 -83436 -267
18440 -267 39883 73418 22892 -57775 -23598 -7204 6798 -34005 -113451 -76272 11119 -15138
18428 -15138 -45109 -139141 -207948 -221162 -162442 -89138 -85147 -58838 -17471 -75395 -130340 -135588
18416 -135588 -124612 -93550 -40918 -8898 -29143 -75018 -68676 -7696 33353 25877 -14105 -83238
18404 -83238 -120790 -50074 8731 22384 -20147 -3216 68489 72681 61302 41577 -7052 -31360
18392 -31360 -3474 16325 84096 79605 95218 133600 134805 158617 86390 72945 145667 137764
18380 137764 115689 113581 69869 95950 66395 29544 17102 23604 38418 79102 130279 115313
18368 115313 101309 145977 184561 141979 149438 241779 192093 183694 204108 217241 250436 179027
18356 179027 139224 215518 270934 277611 228857 164452 105085 118840 89983 94174 137872 82804
18344 82804 98680 153713 160480 153758 232543 206743 134025 111449 194978 212622 156164 182543
18332 182543 253262 340556 379345 421086 395472 423947 443673 429593 372108 245685 197362
18321 197362 142313 150535 149450 194246 201371 129580 119156 66596 -36451 -31762 57330 151101
18309 151101 138979 155147 179949 116484 76695 67497 46695 111416 120487 112005 66327 80869
18297 80869 72114 86161 -2173 -21109 63375 55600 24861 48184 53302 50235 106306 108800 99850
18284 99850 39080 26874 71549 85954 102379 25151 98147 47703 -14656 27570 -6420 -133401
18272 -133401 -110746 -79565 -89479 -27725 -5974 -15267 -10036 -31819 -15949 23449 -5299 20566
18260 20566 95665 97849 164960 228605 216475 165520 168621 271348 390311 474363 416853 315282
18248 315282 207377 153268 176903 172803 99004 47711 121501 120187 51803 4752 14263 40295
18236 40295 60370 101515 67985 201570 256625 200225 156449 125346 100132 25043 -25756
18225 -25756 7168 72830 114743 115517 98821 103008 92754 86576 138178 207936 234761 187653
18213 187653 131073 73829 83235 81193 91311 94025 78441 43161 -19962 -50752 -98655 -97564
18201 -97564 -495 20806 83975 136344 132098 73919 48341 33091 36318 94051 72388 41804
18189 41804 68903 88068 110674 114591 125433 19504 5199 28248 95289 37326 -17575 44335
18177 44335 53120 53352 56110 25591 -33885 -55687 -41573 -13415 -76350 -61404 -11509 -49105
18165 -49105 -59596 15641 59393 73458 30970 30499 13239 -29501 -32422 -84568 3094 66443
18153 66443 -10315 -69554 -107484 -77238 -17044 -23518 -99854 -149714 -119157 -47038 -8583 54220
18141 54220 -26629 -82150 -77427 -110895 -88934 -102900 -93996 -167064 -163774 -71067 -46811 -30433
18129 -30433 11705 2447 -38498 5271 87744 -10321 -7434 18309 25881 46089 70249 119001
18117 119001 99604 62756 73088 108205 85487 59634 93957 82457 -30406 -95349 -61331
18106 -61331 -49806 -50391 20116 20714 -114375 -133420 -97702 -67150 -4670 -16667 45233 80325
18094 80325 63664 -35503 -68710 -67730 -81226 -95107 -65713 -109612 -84871 -39862 -14171 -21892
18082 -21892 13232 30115 49898 87364 84723 19426 1584 33078 46392 4935 -45123 -49854
18070 -49854 -66659 -43941 -44041 -107582 -124872 -4157 -9834 20263 42477 3578 -42297 -25599
18058 -25599 -52895 -26057 -14148 -28012 -52392 -73956 -53090 -32099 -86822 -79770 464 6516
18046 6516 -38556 -28336 -22155 12288 18558 37034 11498 -66681 -28753 -69680 -104167 -122298
18034 -122298 -141188 -116182 -76905 28888 1387 -60892 -52151 29793 48527 133921 203491
18023 203491 127056 40640 -38198 -129125 -122216 -127600 -45162 34489 47082 37690 48734 24919
18011 24919 -7720 -37801 5558 51204 -63267 -164071 -162484 -71671 -67232 -33863 -43064 -64100
17999 -64100 -60512 -22822 -105642 -172397 -149688 -14855 72503 17160 -30049 -27196 -70586 -4298
17987 -4298 13861 -41205 -3522 -50829 -135436 -152600 -152249 -115941 -110670 -164059 -169189 -157104 -161069
17974 -161069 -87983 -24882 -107970 -122406 -108055 -122363 -184790 -137041 -68574 -33613 -119472
17963 -119472 -105791 -54220 -82617 -125161 -17248 -15385 -75498 -89717 -63423 -24796 16088
17952 16088 -31318 -20496 71998 156579 186980 70207 40703 69625 88012 36637 -15320
17941 -15320 65852 58279 -25617 -18910 -16449 21224 37103 38732 -31453 -23746 -126 8591 10278
17928 10278 2393 34520 108761 67624 22049 13661 15670 5766 -2001 -14639 -15002 -47927 -83713
17915 -83713 -46990 50801 86013 44374 43653 122913 96103 -35468 -41634 -52527 -90437 -74124
17903 -74124 -93958 -144539 -147389 -80289 -102531 -105128 -125778 -58330 14030 -20403 -18588 13875
17891 13875 55584 62393 31774 24560 -12133 -6141 35567 19058 3362 2400 -73460 -95546 -39460
17878 -39460 -26192 -75359 -57951 -16233 -60789 -95493 -97447 -81280 -174308 -76003 35723 60226
17866 60226 17140 18835 -479 44065 53139 16510 11002 -59751 -31320 -52875 -121929 -106300
17854 -106300 -27810 -50251 -53576 -66984 -81766 -34205 -18677 -67047 -54124 -24223 409 -32987
17842 -32987 -54385 -58148 -23417 -67161 -72264 45262 75396 494 -102945 -101392 -91455 -131415
17830 -131415 -163056 -182832 -100643 -25801 58753 103805 102838 103323 124154 153432 136429 28578
17818 28578 -11246 34213 30721 3341 -68515 -74378 -54212 29207 5079 -39687 -14473 -24853
17806 -24853 -153318 -202426 -187013 -143678 -19049 -201 -54026 -97601 -122178 -100599 -77547
17795 -77547 -76117 -38426 32878 -50107 -111703 -137551 -58911 -2837 -30968 -131923 -98886 -161828
17783 -161828 -181428 -56448 -27790 -33555 -63651 -46412 -106120 -105184 7077 55994 3199 -32549
17771 -32549 -22699 35413 -6617 106168 128852 78318 53570 18314 9666 5268 13691 -76848
17759 -76848 -173405 -147345 -126488 -134102 -103828 -69411 -13848 -5733 -35644 -22717 -9647 -17498
17747 -17498 -81402 -172103 -197305 -181343 -86616 23885 29559 -28996 -13645 -42749 -82446 -94372
17735 -94372 -61560 29291 53348 56676 119130 132522 35761 -38846 -2228 -36098 -51870 10640
17723 10640 78108 56678 79193 33815 48709 68693 95975 118277 22171 -7866 92583
17712 92583 119713 125109 55365 13419 40706 49443 9145 -73438 -149739 -108160 -46851 -13841
17700 -13841 -903 21403 -76023 -150673 -144201 -91776 -47837 -49475 21157 111439 107582 65567
17688 65567 36993 -65963 -114837 -80750 -29039 20258 18663 26292 43220 18510 -52497 -105502
17676 -105502 -32314 11211 49639 102537 138013 104803 83442 105123 50658 53285 -20028 -103733
17664 -103733 -72587 -1333 4284 -63282 -78594 11053 59560 7632 61713 85561 48386 69498
17652 69498 12842 -50547 -32212 53401 70000 -36457 -109355 -127092 -58121 -16557 -72402
17641 -72402 -70513 -52691 -106475 -221506 -228431 -200206 -73644 -22149 10822 41511 4776 -22796
17629 -22796 -6538 195 36993 5090 -24260 -95729 -108347 -80916 12106 173030 221370 180333
17617 180333 136273 175254 91893 30970 -11631 -38909 -45801 -60612 -123287 -81667 1851 5596
17605 5596 -25785 16725 -21342 17793 -29552 -266 44558 -12812 6339 59985 50680 81079
17593 81079 99355 143824 215967 182714 132218 91931 36156 65308 46718 -73577 -56765
17582 -56765 70162 124896 140576 75893 109443 84868 58081 47267 29359 23111 4218 -33728
17570 -33728 -49364 -103982 -174564 -139013 -11319 1245 15683 -16002 -68192 -129768 -144882
17559 -144882 -115071 -100424 -92018 -107800 -175575 -209613 -114137 8439 39734 23660 25538 36042
17547 36042 19214 -21219 2787 2770 392 31568 26957 41629 120861 125414 57138 31011 -33381
17534 -33381 -49980 -122295 -187812 -132715 -156264 -149647 -51449 -1349 3560 -20813 -88183 -90318
17522 -90318 -74446 -73680 -46677 -54442 -59501 -12387 -56023 -46236 -7677 8472 27349 -1185 -13360
17509 -13360 -83458 -5012 67559 91311 78075 23805 10813 32532 70721 163113 189981 179043
17497 179043 170217 125425 66658 -13498 -56161 2006 61247 33634 -15439 -15400 29341 64103
17485 64103 72676 2947 7543 -58281 -124749 36570 170728 147096 104600 139771 133602 76473
17473 76473 -32140 -90712 -49570 -41760 -26953 -4253 -22004 -20670 -25452 -49131 -47818 -1936
17461 -1936 18741 -3952 20291 59920 29962 -31011 -52740 -117055 -92228 -123192 -166087 -115232
17449 -115232 -74534 -191728 -212320 -167380 -148543 -167521 -146901 -169301 -140228 -100068 -116362
17438 -116362 -79257 -69410 -87296 -128927 -90447 -126771 -179221 -149803 -74175 -71013 -130470 -48825
17426 -48825 43935 6741 6606 52718 70290 13877 -36148 21499 99305 85873 46121 4214
17414 4214 848 41427 42989 88554 132624 65482 40537 7089 -32243 -60463 -109659 -63133
17402 -63133 -32885 -169219 -178430 -107791 -72845 67958 175090 63755 -115877 -170039 -179468
17391 -179468 -144518 -78706 -8733 15368 4867 -8921 -68178 -61709 -76390 -109381 2595
17380 2595 40463 89362 125940 44390 29930 -24473 -44156 40947 86765 105925 3888 -89752
17368 -89752 -126640 -241396 -194227 -52947 24557 94120 163783 62219 21560 45432 7417
17357 7417 -79216 -135979 -110544 -100614 -31743 -5577 -122043 -151503 -103978 -83572 -140951 -123343
17345 -123343 -154130 -120391 -67954 -53456 -11691 84629 107437 24025 -66793 -98402 -113469
17334 -113469 -75700 -30889 -2406 -8305 -83197 9938 62973 112131 107355 77268 49130 64037
17322 64037 64433 43869 -9709 -46493 -38637 -51593 -163963 -134996 -113867 -84735 -47235 -8235
17310 -8235 57527 56474 -25616 -152178 -129419 -97711 -123798 -102345 -55837 -16847 20886 -47926
17298 -47926 -64071 -55925 -32262 -118763 -152215 -62305 -54304 -56802 -36361 -99884 -89998 -33454
17286 -33454 -3061 -5787 -34325 -59524 -51585 -112589 -136012 -102512 -61601 -50384 -51855 -51938 -27534
17273 -27534 51079 -28708 -88074 8671 13195 -35704 -1254 3725 -42617 -5730 49219 33274
17261 33274 -6984 -38558 -96709 -84744 14078 74301 59872 13242 -2556 6599 120742 133259
17249 133259 137306 39246 33800 103288 67316 -6655 38000 107449 144720 8732 -117302
17238 -117302 -12272 18929 18357 17579 1365 -4528 14128 -27041 -30017 -9617 -51028 -87400
17226 -87400 -126955 -124388 -87004 -66823 -19290 -25604 -8422 -23049 -69031 -70498 2183 11702
17214 11702 -13896 47894 45917 -25600 -37446 -40460 -99735 -135382 -111209 -87722 -45177 -67256
17202 -67256 -83932 -73427 -61310 -36264 92228 41680 6094 49840 84547 62450 68288 74190
17190 74190 54928 53564 22922 -62703 -65529 2449 72128 61022 78630 70146 -30322 -22278
17178 -22278 -2953 -6848 25406 69176 -3767 -49296 -91053 -91769 -115181 -83006 -51127 -45715
17166 -45715 -60367 -132798 -154249 -166905 -123903 -64257 -117432 -87952 5543 7605 -36783 -86692
17154 -86692 -74210 -20716 -3752 -33827 -20136 21041 11535 -19211 12076 28386 -23483 -103205
17142 -103205 -117938 -134572 -145185 -128336 -88530 -82577 -103856 -40269 -45959 9261 59681 87621
17130 87621 18454 -77076 -86927 -126276 -121044 -64297 -66277 -31805 -42369 -112758 -183850 -203960
17118 -203960 -191356 -141524 -112641 -28438 -27470 -77245 -131295 -145036 -220777 -181718 -173754 -206939
17106 -206939 -166493 -109672 -97749 -75756 -46574 -87472 -50981 -50097 -49132 -134470 -148985 -130803
17094 -130803 -173378 -154726 -116632 -98041 -144272 -82704 3961 39736 4694 -100256 -87548
17083 -87548 -67633 -48108 -9632 -51860 -93274 -35524 30939 46477 10120 -40604 -75992 -46731
17071 -46731 29043 29694 -33510 -65760 -14443 62624 79337 31940 37145 37668 -15414 -39647 -37203
17058 -37203 -26055 -754 4302 -12457 -3114 -30844 -22128 -65852 -96443 -80834 -59015 -21807
17046 -21807 -91776 -106708 -104041 -1186 43818 8341 10367 12932 20486 -17434 6848 85242
17034 85242 178032 158047 105545 11655 11791 -4940 -59958 -89156 -39323 -11494 29268 103533
17022 103533 127936 182622 153087 56337 22155 -37613 -31749 -13126 19035 -50521 -55175 -106098
17010 -106098 -142497 -114201 -78079 -63576 -99908 -77640 -70302 -155721 -166039 -161355 -137140 -157241
16998 -157241 -121208 -105478 -101952 -70864 25823 78687 31815 -23288 13284 -8880 -99870 -73417
16986 -73417 -147696 -118844 -86590 -117236 -46317 -26812 -34185 -54432 -67399 -120020 -77703 -23978
16974 -23978 -19542 -8877 50984 92982 9965 -38947 -56710 -129061 -149940 -120176 -161336 -155555
16962 -155555 -152350 -85198 -39515 -42521 -8304 -20414 -27584 -30150 -28693 -77081 -61404 54508
16950 54508 115477 969 -84842 -106846 -162012 -163298 -109137 -58112 -54087 -39528 21114 48129
16938 48129 55748 41845 68204 80966 38390 63378 97361 115809 70734 81233 70145 52653
16926 52653 49533 25584 -28147 -15461 83327 114042 96898 88164 125225 34398 -37443 -7257
16914 -7257 -61499 -60219 -79183 -142735 -91572 -38808 -93231 -118645 -45280 -60203 -112769 -82321
16902 -82321 -38513 -21229 7260 10382 73474 8712 -12372 -4476 -1481 16321 12169 -77984
16890 -77984 -82019 -35494 -88668 -133557 -92962 -5954 34438 55580 36845 -23233 -20518 10244
16878 10244 19282 -97167 -135411 -143713 -127773 -50949 -89728 -144055 -99679 -22819 3824 26569
16866 26569 12996 -33118 -12171 44693 19960 -39620 -101748 -216919 -251530 -212321 -108977
16855 -108977 12979 -23287 -136767 -265181 -187113 -80911 -27012 -35241 -14560 -118324 -108731
16844 -108731 -48590 28905 6442 1415 -81797 -64479 -52176 -20653 -51807 -63259 -45811 -91243
16832 -91243 -114519 -27926 86829 46087 -57662 -137262 -234144 -188506 -91320 -96294 -139114
16821 -139114 -170185 -116932 -82640 -35742 -65599 -6940 91054 106326 94531 46627 2704
16810 2704 8130 -66957 -161207 -124970 -39384 49790 44754 19227 -56787 -74917 -24876 7708
16798 7708 20537 48373 59420 71750 -72954 -86894 32829 13337 -66533 -114028 -75076
16787 -75076 -123708 -121459 -102812 -95324 -91213 -152625 -186233 -167242 -174707 -139385 -123767 -64256
16775 -64256 -37069 -64202 -34094 648 -104896 -171200 -196236 -115821 -56960 -44266 1514
16764 1514 4585 27399 61407 15310 12612 -16885 -57462 -19693 7655 58302 92088 109393
16752 109393 87472 98869 84155 31234 -2718 -78623 -84531 -51649 19766 3625 -93233 -121920
16740 -121920 -29255 100118 141751 157251 97819 13446 -59205 -55512 -37752 -60211 -43628
16729 -43628 -89694 -120041 -88145 -22248 17034 -6529 -33154 42961 -15202 -42025 -50488 13958
16717 13958 34007 144731 205716 166665 168214 118710 58448 -3434 -64840 -87553 -41831 6291
16705 6291 67323 34169 -5490 -13336 -43322 -8424 48513 20477 -88543 -65266 -105881 -80505
16693 -80505 -14223 -20149 -25602 92580 64315 -33393 20643 -9112 -68977 -63676 -35425 -55504
16681 -55504 -55576 -26836 6255 55159 114920 99382 96978 49698 11199 -25592 -73053 -60651
16669 -60651 -38646 10264 2150 -40051 -71575 -89927 -116742 -121828 -72403 -46393 5394 32067
16657 32067 -13024 21718 43004 20272 -29232 -36025 -37295 -11738 -11654 -71633 -61069 -4613 106696
16644 106696 149760 57459 34247 18602 37389 92295 160159 139934 -6859 -76775 -92320
16633 -92320 -109768 -96968 -120442 -104156 -101545 -89724 -109458 -132818 -57019 -22052 3234 -75713
16621 -75713 -81282 -43855 -64689 -79857 -110555 -137544 -90159 -46036 25262 95370 145149 57044
16609 57044 -28660 -55826 64497 107797 20473 27127 -71015 -90212 -127115 -162064 -109984 -43134
16597 -43134 1509 8161 45134 48921 57392 76802 39075 38880 68341 62842 51263 5181 12056
16584 12056 28767 38285 -42948 -21177 22398 27479 -22493 28682 50700 -4858 -33346 -44711
16572 -44711 -20357 41220 125442 66635 57544 98669 102361 66968 80671 173778 184530 78955
16560 78955 8424 -25894 -61771 -82106 -112578 -52036 -100744 -148991 -112583 -67723 -53393 -90784
16548 -90784 -50296 27929 23243 -13775 -7459 -10967 -4312 -44966 -29506 -37247 -38546 -70852 -30515
16535 -30515 -64385 -121444 -134337 -70723 -43912 -35891 18229 67732 21019 -5584 24658 11017
16523 11017 -46790 -24942 -58487 -80523 -135438 -189248 -166385 -136599 -115836 -64849 -59106 -83863
16511 -83863 -20376 50077 83948 89636 15234 -7425 20597 -29047 -50423 -27662 -60387 9125
16499 9125 94017 115042 2829 4616 45169 81502 166524 84796 9229 4240 -84378 -55571
16487 -55571 -15008 -27318 -35469 55375 107120 13591 -36186 -48104 -42422 -30239 -85530 -128316
16475 -128316 -107539 -102574 -86923 -54942 42805 42730 19802 27857 74978 98312 137713 87996
16463 87996 -41456 -86619 -11199 9142 -17931 -77208 -28933 -136 70393 203987 83511
16452 83511 -15496 1990 34493 102801 101985 100295 54654 8276 44793 6015 -24112 56928
16440 56928 96755 56229 -8359 -1776 -23842 58180 130372 122557 100711 51571 -35364 -53563
16428 -53563 -71313 -55546 -11405 -6174 -29998 6167 -8667 -25217 -57854 -104028 -10457 -32670
16416 -32670 -37419 -55898 -67026 -104993 -132623 -192615 -98137 5034 17791 -7779 -6434 80264
16404 80264 31148 43495 69609 46248 5638 4167 -20884 36928 66840 65066 80725 47924
16392 47924 -11703 -21488 47007 48072 19075 -61425 -124649 -67145 -28279 -11382 -3136 5943
16380 5943 36137 27009 3557 -8524 -23958 -88992 -22062 -19440 -55649 -1194 18136 -81658
16368 -81658 -59423 22140 6025 45488 33740 22290 -39852 -101291 -94668 -24857 71775 82879
16356 82879 89518 121417 97739 169056 220983 115472 98944 68512 83618 97051 75231 26098
16344 26098 28406 96257 160132 225305 168183 57481 763 2116 56249 12183 -91530 -37903
16332 -37903 -75042 -49489 71623 77117 30353 101125 70240 -40470 15351 -30492 -46917
16321 -46917 -59331 -79243 -176821 -198989 -127427 -56796 -31696 -153365 -155084 -132716 -122563 -94994
16309 -94994 -80662 -30018 -48994 -105145 -102157 30565 53486 -390 44583 -21478 -4048 28137
16297 28137 17114 14737 59355 102798 45960 16819 -75431 -136278 -160413 -79674 35504 38694
16285 38694 20766 -14509 45511 133006 20257 -4127 59935 30071 16609 22953 -47340 -66800
16273 -66800 -10278 -30899 21419 12586 -6598 -26248 -35556 48181 7913 -15914 32357 110727
16261 110727 108070 92404 62842 78688 68207 80007 92396 118460 43978 -65419 -85385
16250 -85385 9150 31435 39746 33862 -14498 -131131 -130813 -148211 -117708 -65478 -72417 -43666
16238 -43666 -38879 -5479 6249 -7373 -17425 -46978 -58222 -101585 -54122 -128547 -129455 -70315
16226 -70315 -105100 -99241 -84598 -55006 -25476 -31132 -60481 -18921 35888 53141 -11809 -47040
16214 -47040 64073 78065 -216 -14948 124067 155406 -157 -23701 -98699 -86960 -99674
16203 -99674 -109207 -74538 -55335 -39612 -96480 36070 124931 166196 88315 68362 -9701 -53892
16191 -53892 -50003 -10010 -24403 -91176 -41030 -69907 -111006 -84285 9690 -15951 -122685 -107331
16179 -107331 -32105 -21723 26941 60163 45836 -4431 -146851 -111083 -44920 -39977 -117856
16168 -117856 -93625 -82515 -130709 -110565 -67997 -42471 5585 -44669 -28083 -33000 -106594 -82685
16156 -82685 -15870 84882 84689 113761 24235 -20590 73785 99811 134988 94749 69381 86161
16144 86161 31508 12431 40743 32801 13721 18022 -28822 -2834 -579 -91509 -161222 -102527
16132 -102527 -4210 107734 52460 32264 68938 75794 67717 -5142 3958 -59339 -60321 -37277
16120 -37277 43690 72363 38525 101138 118216 108304 76400 28365 53719 33238 -14311 -63100
16108 -63100 -15976 2445 -34134 -20628 -38422 -10233 73008 71255 77314 12823 69232 97981
16096 97981 92260 129901 171597 85933 28698 32252 -39269 -53075 99290 89992 -18052 18299
16084 18299 59737 22764 52903 87110 142338 47093 697 38203 4450 -51208 -32918 96100
16072 96100 98017 88305 63982 41184 -32318 -52507 -155744 -213160 -158331 -35931 -5462 35915
16060 35915 39665 -10395 -45074 -24028 -13902 75371 82495 -30645 -72954 -30036 8157 23957
16048 23957 -58318 -92964 -79828 -106900 -95706 -78648 -88120 -103622 -127441 -75952 -59730 2458
16036 2458 64633 94276 35713 -60922 -62489 31858 127864 144944 138652 89621 97555 138963
16024 138963 79663 -8639 53853 98802 73602 28464 30768 62859 31807 -11972 1915 3973
16012 3973 24376 -2090 2176 54295 85527 54654 32313 23804 -50995 -102499 -124860 -147087
16000 -147087 -80553 -23846 -93368 -161757 -132939 -72600 -49810 -95664 -130696 -93425 3961
15989 3961 83959 20031 -2972 -85844 -160205 -161929 -150375 -112640 -40967 -9557 31801 -25575
15977 -25575 -42220 -39209 -30224 7831 -6036 -68899 -57356 -79275 -24593 81434 89438 59817
15965 59817 28555 47440 59008 -12682 -26945 -36000 40229 69188 40376 -58129 -49299 70764
15953 70764 97692 37554 30085 85639 158055 227637 204751 146158 47139 -22000 -14715 -17576
15941 -17576 -4537 -28305 2098 35280 18445 -17230 -14611 42568 106937 51331 -3985 -19604
15929 -19604 6350 -46176 53458 127786 73452 11660 -54163 -40239 -32948 -79861 -86137 -68924
15917 -68924 -17404 3639 26079 -4167 27937 29406 -36647 -22580 14819 66741 182759 180435
15905 180435 95299 3299 18213 97298 138671 62292 -11412 33275 113703 142646 77555
15894 77555 -38764 -97877 -40850 1717 57370 131483 -610 -16998 -21006 61611 87131
15883 87131 52099 35202 34674 -5618 35967 18633 58709 167908 143365 79641 62588 52108
15871 52108 45677 37996 91068 83521 75385 30558 25163 12636 -2458 75133 133585 159358 64270
15858 64270 2225 33573 31071 -1129 12007 26853 16658 -66600 -32277 -19073 -62569 -8131
15846 -8131 28539 -93080 -164712 -103826 -85482 -94808 -132683 -76186 -47563 -58209 -119025 -135087
15834 -135087 -146029 -109334 -21951 37534 39326 50664 20755 33757 40040 42272 67985 101757
15822 101757 8709 -62915 -62767 -5720 27326 65253 66000 47434 -17794 27921 147963 205426
15810 205426 151701 78357 53270 6135 35299 144684 173581 58302 11360 23125 75010
15799 75010 140533 129115 70699 65235 110998 77453 3826 -65242 -118266 -62688 30646 24982
15787 24982 7627 -21831 -84709 -124105 -188856 -156172 -133770 -135206 -123331 -86429 -115587 -85079
15775 -85079 14987 24417 -30259 -63279 -139148 -122797 -69874 -42095 -89704 -61935 -12233 -10209
15763 -10209 -79592 -61635 24685 52739 24215 45059 3036 28190 315 -42034 -80014 -43467
15751 -43467 57394 -24785 -107742 -100683 -87564 -36253 -48179 -12562 -15711 52623 -14661 -74583
15739 -74583 -90760 -98013 -98632 -90197 -29758 10972 -25893 -10626 -69611 -145737 -119462 -176275
15727 -176275 -37358 30161 -11718 -47190 -30362 -12936 82895 131096 153047 115952 32459
15716 32459 6070 -17221 13799 90474 130777 96169 89199 87149 58210 3701 -73153 -58449
15704 -58449 -64093 -132905 -122273 -93421 -155399 -124872 -58800 7633 58552 8661 -38043 -52595
15692 -52595 -84828 1077 19023 9968 -12007 1623 79727 16421 -2647 -1899 2440 57538
15680 57538 -43365 -89910 -85342 -45014 -30337 -86041 -160427 -121962 -61864 -77892 -110637 -70239
15668 -70239 -17600 26415 71171 88784 47373 3100 -20360 28301 -10475 -4199 74275 80897
15656 80897 37213 14949 100887 142334 94499 -51970 -95945 -50857 -33832 -92602 -108830
15645 -108830 -55609 -21897 -1720 -90719 -127116 4584 78726 128309 128802 78421 15348 31760
15633 31760 52736 52220 -3214 -92974 -49684 100998 112060 73046 90641 83632 122705 97794
15621 97794 -32008 -86521 -72203 -22350 -98724 -104499 -62560 -97982 -65938 41997 58097
15610 58097 36719 2206 -13590 -28449 -75433 -103073 -50717 3296 17011 -10883 -25618 70340
15598 70340 41295 43078 80169 105148 44940 69957 3389 -149340 -82049 -8450 51373 84093
15586 84093 124955 117836 66731 29356 25317 32857 24198 16817 2584 -112946 -130478 35196
15574 35196 123223 64404 -789 -64319 -121576 -79538 -95651 -88905 -20152 2007 4329 -8387
15562 -8387 -56127 -111448 -156672 -169150 -172098 -98720 13274 -39124 -120650 -2009 90946 17530
15550 17530 -91453 -84101 -74139 -24858 -4685 27759 -34899 -47708 -128039 -227722 -131848 -31421
15538 -31421 47585 15959 -31428 -92342 -28968 24686 -37036 -89159 -127711 -91884 -29818 -45151
15526 -45151 -40728 44041 111351 94100 38377 -5119 -2062 -12186 59156 95844 103741 66125
15514 66125 -12466 -61839 -49205 23835 80507 92513 139812 79227 33511 5265 -7799 -80228
15502 -80228 -87201 -53720 -33258 -31387 -57304 -22772 82145 125955 157512 123590 68495 11121
15490 11121 29084 32647 -15771 -4032 56590 -17771 -76220 -64613 -54218 -37253 16958 57911
15478 57911 110167 121152 94667 21916 67610 62723 62277 101250 95240 26930 -55382 -82433
15466 -82433 -6422 60645 144717 157957 96107 113709 176540 103934 46730 -16934 -6591 27910
15454 27910 99210 93990 35504 35097 77282 86318 38470 53623 58097 43734 66892 88519 142007
15441 142007 241307 157449 82764 118807 69147 -53239 -72158 -51694 -47452 -124866 -146769
15430 -146769 -169514 -55283 81866 87618 96751 94534 146213 127068 53286 112928 99026 46601
15418 46601 -38641 -75522 -51730 -4886 -34684 -18348 28556 113786 157928 119679 150980 154597
15406 154597 131473 95041 100416 160324 161952 81374 81573 96661 96670 115291 126444 133062 98005
15393 98005 140687 155705 87715 32176 -8959 20409 9280 21722 -10858 55040 17043 -1885
15381 -1885 47624 31750 -26002 -13610 -59005 -63098 -23237 41463 -7401 -24150 -22667 7058
15369 7058 -17471 1680 28285 10958 -25902 -38343 -7624 -74504 -63283 -48691 -10655 -17770
15357 -17770 -2564 56168 113057 127572 137450 153357 118482 85324 134440 123554 166104 141439
15345 141439 108232 107367 59716 15602 13585 53569 133797 191311 244712 243263 255004 376591
15333 376591 585370 805341 986761 1108791 1255579 1517037 1567222 1517689 1441972 1287213
15323 1287213 1117947 957976 833452 728317 623882 551031 478198 416528 264031 224452
15313 224452 176857 166850 167044 171480 179980 134886 166318 100872 -43230 -128989 -80642 -43225
15301 -43225 41063 1792 47157 66954 35925 21490 70068 115290 63301 4447 41847 132399
15289 132399 152246 125931 109801 148242 160444 123134 38955 27171 71253 60002 70407
15278 70407 96087 39184 31088 50878 84532 96355 88123 18620 -29379 -18682 54370 17973
15266 17973 1463 9723 -10120 -38705 -109757 -116031 -119682 -103641 -9079 11918 33123 -2089
15254 -2089 -77632 -71577 -92496 -56849 -65160 -33303 8398 -26512 -12212 -16937 -41774 50864
15242 50864 45798 -51061 -124973 -128412 -14992 -110721 -95811 29140 74541 84777 77417 123668
15230 123668 69596 1389 -7042 9575 17959 -6046 36164 70460 158191 158874 125051 110001
15218 110001 142190 128310 31346 58900 37527 45992 -22180 17796 55949 18942 32177 29045
15206 29045 44527 -17570 -99246 -118509 1681 105635 58283 11725 -55247 -82114 -148067
15195 -148067 -160091 -90984 -16655 18113 57672 58599 19977 -55158 -32390 -41320 -13753 50659
15183 50659 120392 145244 135249 102787 67614 -15131 -10899 33095 36102 -48355 -33258 -38901
15171 -38901 -101509 -73646 -90524 -107520 -60446 -50300 -90765 -102868 -153959 -162829 -108742 -121375
15159 -121375 -132818 -67500 -37131 -93861 -55808 -56016 -51892 -13368 -18461 -102537 -100272 -27737
15147 -27737 52564 -17760 -27528 47525 -6739 29859 80316 8572 -42329 -157198 -212890 -138680
15135 -138680 -118988 -63012 -1160 59941 155364 153205 93158 38551 50447 41060 12314 -31295
15123 -31295 -84539 -63244 50881 112465 101976 80607 -14631 -13836 -99442 -95344 -95586 -132490
15111 -132490 -142898 -83405 -5001 29714 36174 102317 80857 44751 117066 148598 113314 131469
15099 131469 89619 34119 93630 75443 12135 -21124 35336 4676 13924 50148 44049 56991
15087 56991 18646 13218 64983 141381 161339 131756 67368 39646 72698 2122 -26084 10386
15075 10386 41278 -45410 -84551 -53778 -21320 -24404 -11687 -19254 -6639 -17833 -6050 8655
15063 8655 -32250 -119432 -140041 -144702 -151278 -165913 -96612 -91296 -42015 -91472 -51570 -9920
15051 -9920 -12687 -57991 -23532 10012 16934 -47198 -145763 -115026 -32326 19708 -17790 45835
15039 45835 62734 -36758 -80146 -116200 -116929 19261 86482 29184 -42663 -23237 -23851 -90589
15027 -90589 -87190 38965 25109 120792 215899 232168 106226 52868 55552 51333 89391 169846
15015 169846 175440 130373 110009 126024 90297 38546 100554 156273 168902 133131 82689 135435
15003 135435 126122 41231 -27532 -6626 7882 -14120 41444 -34486 -135006 -99188 -16456
14992 -16456 -16876 -21071 24219 18024 87548 2593 15457 -13151 -36753 -55861 -52309 14004 67374
14979 67374 58173 54069 6665 -16394 -12759 2241 -35750 -89081 -30457 -8270 7076 32420
14967 32420 -8279 -18554 852 56866 140412 151483 94415 -32856 -84518 -23190 -38349
14956 -38349 -66985 -82555 -81838 -38152 24589 7801 -11420 -30529 -70535 -33262 -61620 -87968
14944 -87968 -116308 -20351 55346 66716 6977 24569 70661 32257 58258 70488 159449 149850
14932 149850 71724 4811 -77549 -126130 -120500 -105223 -37088 87522 71730 -50482 -116512
14921 -116512 -100494 -54566 -7078 -3507 -72760 -127182 -167313 -137721 -80291 -71038 -78768 662
14909 662 29905 -17048 -22473 -17102 -52251 -62824 -29606 16992 -3881 -95403 -52464 70951
14897 70951 86300 73962 98938 75628 73214 85172 47232 272 -3331 7136 -20922 -90731
14885 -90731 -37887 27619 -92673 -60342 19812 107401 133272 121224 108686 59927 -65229
14874 -65229 -91293 -85892 -89761 -29895 23780 50329 36072 10660 96595 94093 44617 -471
14862 -471 -13656 -57233 -58268 -73493 -68624 -76988 -19775 -45556 -56199 -20471 -1349 10931 50436
14849 50436 80350 79266 124223 126154 109938 106990 59686 75980 81496 49345 31362 85430
14837 85430 70403 36360 101045 74947 69113 63147 -5700 -32039 73233 88160 70329 55434
14825 55434 60367 142016 161766 42537 23821 53150 56719 64288 58819 40733 112974 56358
14813 56358 31050 93189 62658 26936 24509 18316 47945 -6419 5994 26459 66969 36593
14801 36593 -45453 -124197 -112793 -35048 18732 17064 -71961 -43133 19867 27015 2124 -30981
14789 -30981 -57920 -50829 -65249 -7749 479 -27882 -56813 -90087 -3546 54777 69277 96236
14777 96236 137901 95812 60844 -17562 -22478 -43869 -53702 -81408 -110176 -105918 -76557 -45948
14765 -45948 -8502 -58241 -9720 -1401 -50151 -73797 4199 41274 18617 -16867 -26397 -13729
14753 -13729 267 -15717 33717 70062 52068 24120 107986 74251 -9621 -18392 -14342 -52716
14741 -52716 -11164 -26828 -36984 -40970 -25473 -37332 83007 163931 69624 -45388 30281
14730 30281 89345 23864 -97219 -97275 -43898 29343 31764 8729 -83489 -49356 38271 83371
14718 83371 91658 35175 62818 32381 -20133 -41521 17756 61722 50477 23201 82110 130096
14706 130096 22181 -72896 -55515 -27617 2541 -40202 -9857 -107829 -78237 -27284 -37643
14695 -37643 74180 70049 40931 14017 21051 -39883 -74047 -19570 -4875 -120269 -159147 -73364
14683 -73364 -9797 26258 88893 89817 124101 127554 -5333 -108125 -78850 -51315 -27987 19067
14671 19067 -9519 -6038 50446 23866 48484 43180 50611 2162 2480 26985 -16457 -20521 32228
14658 32228 107427 81067 72381 106086 83521 175150 146716 103426 27174 17615 21811 -31334
14646 -31334 274 77260 51619 -16571 -32069 -44531 30898 15187 16644 40902 -671 -40055
14634 -40055 -46677 -66520 -128094 -122650 -50302 -41366 -72640 -116842 -51382 -16342 -17090 -32138 -41969
14621 -41969 -7889 -9380 -8635 77103 142687 114534 90518 87579 4975 -16282 -9704 -55123 -94524
14608 -94524 -49429 -40502 -17126 -49111 -71849 -52028 -44565 -42099 -20535 -51780 -52265 -2499 120590
14595 120590 116350 145070 118509 51419 53910 12965 -4417 -2927 -36139 -100743 -107217 -70773
14583 -70773 7608 19378 -74903 -139335 -66494 19448 64701 14631 -30651 -4705 -9606 30205
14571 30205 -42743 -65085 76371 132562 101137 102464 86060 43089 59661 80487 18211 22830
14559 22830 79596 78135 74365 96244 27857 -27602 22862 2267 -39665 -25721 -4478 -14686
14547 -14686 16156 60365 73013 5601 -30560 -92308 -75315 -43632 -111300 -85340 -37699 17759
14535 17759 44129 -54108 -139488 -143451 -109598 -49475 -39155 -104249 -134437 -96696 -56838 -46544
14523 -46544 -120222 -150099 -84207 -45312 -61386 -34118 6486 17899 107249 117403 90067 101213
14511 101213 87887 105445 99313 117654 108307 83375 77085 52273 56931 57680 -6919 -30173 -21071
14498 -21071 27671 28190 5639 15676 16569 -43474 36600 24326 43770 137032 60203 -83216
14486 -83216 -76979 -122789 -94696 -84480 -152272 -118403 -82843 -100727 -75517 -81089 -69398 49136
14474 49136 78643 46186 -43370 -89794 -58431 -25069 36695 99347 46402 -12632 -45621 50758
14462 50758 97342 71866 15598 39482 118225 98847 45281 19684 31353 34707 -13847 -8547
14450 -8547 43152 -55510 -79468 -97328 -97653 -98843 -85429 -48966 -4106 25863 29399 6699 -71034
14437 -71034 -108141 -134072 -52894 23597 38347 19243 17079 36996 8507 -56000 -92223 -87355
14425 -87355 -95981 -80396 -65080 -70937 -26437 -5481 -90915 -56077 -10993 -13686 -48981 -35852
14413 -35852 -17568 -15961 -5869 -16147 48233 17705 -13728 -56404 -54807 18430 -24175 -27956
14401 -27956 49315 69536 104580 100209 41795 7288 -26227 -19477 -62625 -32243 -11867 14693
14389 14693 44555 58210 -15876 -109543 -72917 -56226 34031 -1109 -42 46054 29630 49571
14377 49571 -16956 -31246 92947 118719 -17445 -63046 -4559 4256 -52698 -52431 -132 11314
14365 11314 39142 10556 -83976 -64798 -23054 -16830 31485 -7351 -8596 50817 10719 81562
14353 81562 71110 109869 104270 66853 26405 45661 -72231 -76696 -3232 -5380 50917 57507
14341 57507 62076 10493 -87305 -136825 -110643 -59286 -49028 7067 50487 32858 -4414 16165
14329 16165 78788 31080 -12827 37574 76361 57853 3330 -66719 28152 -20598 -106603 -89651
14317 -89651 -24746 15890 35445 42572 -33412 3354 17027 11539 -18353 -1150 -65897 -88666
14305 -88666 -23695 6121 23076 33809 27636 20723 -22443 -72068 -59561 -16134 23348 40776
14293 40776 -25505 4753 25122 -16494 1960 -30714 4650 -38385 -104009 -113295 -171469 -105977
14281 -105977 -82895 -106769 -133422 -109764 -55059 -65464 -88288 -74127 -8382 84961 72140
14270 72140 36364 -40601 -24398 101055 138074 94224 41580 -33921 -27247 21397 35181 84750
14258 84750 100667 17189 -89309 -112650 -106192 -83668 -37486 48949 49889 49965 50542 -36215 -98487
14245 -98487 -60390 -66742 -50157 -9790 -25231 -22096 76535 48774 -49164 -26336 -18736 38967
14233 38967 81427 89119 64110 -48361 -78043 -102007 -101215 -114969 -122495 -168136 -182495 -218003
14221 -218003 -214875 -140400 -78204 -86539 22676 86941 183867 240061 164246 133229 133078 39149
14209 39149 -43291 -48019 -32781 -20424 -84645 -109631 -119523 -45189 -75467 -126836 -76396 -80219
14197 -80219 -15182 84997 75493 -5593 -17144 -13113 -15561 -66024 15665 105392 84542 90010
14185 90010 62605 7397 41026 -14932 -36460 -11754 -3553 -59265 -27922 -54336 -87248 -73576
14173 -73576 -89203 -72333 -68659 -1516 72306 114100 12929 14167 45669 11801 -31046 -38176
14161 -38176 -4848 -44756 -65149 43323 67602 21728 6050 17499 115635 128542 87411
14150 87411 45290 36151 86721 60186 40057 7386 25733 59420 -1242 -33878 -38961 -65386
14138 -65386 -23254 4899 39611 -9833 -82595 -9083 -40658 -64615 -310 30487 37236 -64905
14126 -64905 -83528 6815 17048 -14418 -37472 -26590 -62208 -73925 -32332 10688 -9107 -4547
14114 -4547 12170 25198 -457 16490 13801 -62269 -57347 2623 52070 101089 49020 -49681
14102 -49681 -34883 42402 28596 -40144 -49216 22932 113198 121941 34323 22617 -17271 -80711
14090 -80711 -59823 -45065 -55175 29410 54357 118013 45506 2996 -68944 -144201 -150477 -144446
14078 -144446 -96192 -98217 -117405 -16550 85023 99623 92471 98515 44444 25070 -61183 -35777
14066 -35777 -57217 -34631 -57027 8499 92873 80358 77147 37588 37365 63072 25266 -8417
14054 -8417 -79883 -84313 -145315 -106729 -59818 -17692 9578 76131 73161 28026 31325 55729
14042 55729 -12839 -96309 -108561 -138288 -181474 -174240 -133105 -95453 -58028 -93873 -118889 -97156
14030 -97156 -100999 -39740 10443 -10172 8200 30924 -7867 -17966 -18534 -38055 -49930 -76112
14018 -76112 -35606 -56662 22229 157378 114309 105644 75376 38222 -10039 4836 17319 38258
14006 38258 -25809 -6403 22235 -35464 -156962 -208014 -228201 -136427 -26799 53868 72330
13995 72330 114080 59113 -19997 -3131 -23426 -107812 -35593 11259 3815 -69790 -136247 -137420
13983 -137420 -115620 -83582 -16851 77603 113065 22141 -73270 -119567 -52533 -53609 -174719
13972 -174719 -196299 -138233 -43043 20313 -13157 -33583 -30887 21817 28712 41599 2482 49964
13960 49964 52878 91936 68123 20891 55056 110403 120978 101609 76470 17240 -73400 -153224
13948 -153224 -158265 -112939 -61571 17002 47517 93711 64058 1268 -50155 -8076 30889 50432
13936 50432 43092 6947 71097 517 -50430 18643 51670 -201 -53544 -62720 -62515 -141102
13924 -141102 -171898 -70444 -30977 -27196 -108732 -86850 -66347 -46181 63857 33646 -87266
13913 -87266 -92499 -15996 -56805 -134404 -107410 -90625 -125759 -10617 182994 207058 83988
13902 83988 69296 101258 92015 58925 92938 126519 111620 84250 91589 159392 207763 184064
13890 184064 193039 157991 118766 63994 7062 49946 78819 141719 197482 178902 154614 11831
13878 11831 -62317 -119645 -130660 -85986 -48963 -59379 -33105 63855 6884 -53372 -68751 -97765
13866 -97765 -92802 -67209 -45041 -43204 -48883 -23404 -69392 -34571 -55447 -28863 -46553 -11870
13854 -11870 65465 85637 51693 43108 118439 109120 19065 29144 51366 8906 -40200 -18208
13842 -18208 25652 23208 69135 122935 73292 60233 83106 101329 115363 -3443 -7090 -14965
13830 -14965 -9863 -50647 -106323 -92229 -95466 -108424 -102460 -92011 -77814 -5428 -38251 -48126
13818 -48126 31600 45957 -1406 -5182 13472 11854 78736 72846 61722 30299 80952 74276
13806 74276 86594 29780 -6421 24563 35480 47877 -23671 -13990 16926 7974 -13579 -18669
13794 -18669 -37146 -58943 -64303 -20414 50232 79436 99796 104453 99659 78371 47694 28688
13782 28688 55833 101207 118713 140416 97407 45620 33499 91936 96551 126191 119132 101409
13770 101409 43100 79725 89587 159062 126599 95229 14641 73720 65076 54268 19644 -70256
13758 -70256 -58179 12473 35938 17758 18654 19051 -16910 49225 51337 103915 122389 106886 49057
13745 49057 -63060 -31572 15899 107179 132260 46335 -40630 -76842 24509 2710 21194
13734 21194 81585 74185 130242 152011 196964 112499 42352 73635 104689 34597 35355 55181
13722 55181 41787 -54454 -125644 -58602 17463 -20767 -99789 -179016 -147158 -115834 -104155 -69099
13710 -69099 -40822 16404 120684 139324 110286 139363 153573 118956 46378 -2197 -57485
13699 -57485 -29725 -54713 -99800 -196820 -150606 -97710 -95635 -30729 1098 -43135 -15472 -30838
13687 -30838 -119263 -70118 16411 48276 126437 72114 98941 56149 29283 46351 -18383 -100881
13675 -100881 -59895 12143 -32668 -32328 -38715 30061 31929 -6264 37202 62949 59676 97561
13663 97561 44068 22522 -20762 -43496 -22375 52850 -23338 -45900 -12707 -45380 -100812 -72231
13651 -72231 37280 100364 89902 32801 -11771 -60063 -104684 -80144 -19820 -21669 -33862 -28474
13639 -28474 59112 84262 42744 -15130 -63557 -53279 8122 29163 28548 -17360 -38675 5978
13627 5978 30630 49331 94685 97439 122036 161489 88140 67495 157343 106417 39421 108868
13615 108868 186433 119151 73799 33571 2175 43628 75234 76738 11468 -5918 -47979 -45639
13603 -45639 -59031 -31895 50859 54448 -11160 2805 13872 -24742 -25583 18986 30954 49423
13591 49423 66743 -37246 -94003 -57455 -55808 -61015 -51080 -127767 -44543 23838 58546 89739
13579 89739 79674 151842 193530 165762 2647 -62991 26412 74772 103403 154045 126755
13568 126755 13879 -43055 24945 74352 66706 58764 21880 57846 29959 64349 94456 114139
13556 114139 50119 71866 106584 103628 106068 73423 4388 -114186 -186384 -156555 -15689
13545 -15689 71519 122656 90292 58507 75319 44148 18366 -60882 -62852 -78266 -128750 -65785
13533 -65785 36417 111692 141598 24256 20756 98756 145792 142185 96778 102748 73479 -11446
13521 -11446 -37636 -34195 -31262 -129 -49531 -54619 -29936 -3133 -34603 18274 75294 171590
13509 171590 186074 110098 141967 179340 147309 106141 36518 -14713 -38122 -38158 -22591 -32930
13497 -32930 -13907 -43796 -14372 29217 50255 -29569 -31479 -29503 32874 51834 -42297 -98319
13485 -98319 -102303 -153801 -57150 52863 37081 61916 48781 32942 58943 71685 75978 121022
13473 121022 60861 26655 7037 1112 47886 24121 18401 37254 -2 9708 -68611 -121846
13461 -121846 -92145 -59448 -26236 -37767 -69273 -121423 -78841 -77026 -19516 -73888 -63576 -10185
13449 -10185 35924 120932 107035 73446 -40848 24965 69742 72228 39970 -15339 13809 71139
13437 71139 578 -91109 -141338 -22889 37923 -42277 37577 66170 40432 22442 53063
13426 53063 75798 69350 58541 30480 28011 78414 96511 114315 90018 -5900 -64010 -20920
13414 -20920 45765 -53832 -36619 62306 133793 110975 70426 -71228 -93728 16070 5121
13403 5121 99452 31202 -85626 -71479 -104976 -101924 15711 55919 73865 42435 -14804 -19087
13391 -19087 -70453 -52941 76809 224002 214210 212632 201331 99008 -8823 -67715 -17078
13380 -17078 22290 -34838 -4395 23752 53782 74224 124295 127215 49942 67291 77756 -22443
13368 -22443 -66438 -95816 -35208 9572 -9639 57653 168805 168824 161070 172112 119595 32233
13356 32233 8038 11817 -82828 -53635 31284 29049 62594 93143 79891 38877 5857 -26327
13344 -26327 -115653 -75005 947 -40524 -13583 55060 32924 -17342 36200 121937 55884 -44224
13332 -44224 -68046 -22406 17891 54707 64114 83630 49563 -2494 -39856 -13355 88830 124028
13320 124028 53228 -49563 -119335 -161239 -156954 -155978 -75185 -29882 -95614 -65697 10639 -384
13308 -384 -43771 -50752 -34818 -35152 -25789 -29109 16961 -77025 -40514 43537 5525 -50943 -49743
13295 -49743 -40677 -94765 -86843 -126526 -150169 -87606 -82207 -72623 -82964 -62100 35834 48702
13283 48702 -41455 -108503 -138085 -191771 -166537 -165352 -135352 -120400 -116643 -85707 -74962 -51430
13271 -51430 33615 50149 58220 77670 64330 33280 106657 166188 134424 28637 -59579 -101788
13259 -101788 -96042 -20027 32086 16511 -42020 -67562 46678 59126 71140 50236 -43909
13248 -43909 -71078 -53748 45051 134934 139956 87086 96904 44857 3600 -9670 258 26270
13236 26270 15079 -18894 -47853 -1315 58082 44982 68877 139244 143332 104133 14560 -84888
13224 -84888 -160455 -98579 -110851 -117427 -30932 -30052 19190 48084 40259 28950 82640 96129
13212 96129 36736 -8574 32707 57480 21531 72998 82347 8121 -15661 42313 27255 -2824
13200 -2824 44881 -117 -89616 -148153 -88457 40939 116866 129903 28244 -24635 -10632
13189 -10632 44480 106831 72315 42484 55523 38246 6514 -13735 -16988 -41656 -13684 -53861
13177 -53861 -19847 23794 96865 84202 -22472 -108224 -197218 -161175 -91717 -87488 -14920 56827
13165 56827 62510 111467 98791 87387 26489 -3372 29132 -810 51465 134425 40715 -24278
13153 -24278 21216 404 -59341 -81192 -25376 -16027 18674 30369 66798 24978 -71696 -107977
13141 -107977 -34954 8630 13216 26235 74903 83662 2049 -8774 27782 82058 -19677 -26691
13129 -26691 17567 14400 -97505 -100492 -84134 -26462 12147 -8027 -15607 -16897 -52725 -103996
13117 -103996 -67566 -52418 -63838 -36293 -20349 -8742 56647 -42787 -36645 -1029 103908
13106 103908 140843 107886 106177 159100 152900 189049 264922 185267 132059 84188 88981 88348
13094 88348 21945 -33844 -121481 -182966 -110404 -74566 -52756 -60551 -105223 -71920 3120 -43704
13082 -43704 -106964 -80805 -96835 -116485 -80903 -101719 -116781 -23075 4080 -79540 -44644 -39118
13070 -39118 -90735 -79054 -74549 -33897 39596 44532 117642 120310 92628 113848 96001 84956
13058 84956 70005 55972 10278 75218 36556 43915 75412 54314 25238 -31532 -37039 -96898
13046 -96898 -46287 14368 -10515 86209 69434 -1453 9782 -13751 -30254 -34419 -59056 -134386
13034 -134386 -100532 -21927 13975 35600 43293 98835 58958 90321 40525 42735 18137 22965
13022 22965 5268 52724 5243 59013 28654 -52160 -156241 -141381 -117095 -118011 -46077 12831
$$ [...]
##END NTUPLES=NMR SPECTRUM
##END=
