##TITLE=Analysis number 325391
Compound Code cc 09163
Project Code adrs
Chemist Name fudan
##JCAMPDX= 6.0         $$ Bruker NMR JCAMP-DX V2.0
##DATA TYPE= NMR SPECTRUM
##DATA CLASS= NTUPLES
##ORIGIN= Bruker BioSpin GmbH
##OWNER= nmr
$$ XWIN-NMR		Version 3.5
$$ Tue Jan  2 11:01:55 2007 GMT Standard Time (UT+0h)  MAYBRIDGE\nmr@NMR_250MHZ
##.OBSERVE FREQUENCY= 250.131544655141
##.OBSERVE NUCLEUS= ^1H
##.ACQUISITION MODE= SIMULTANEOUS (DQD)
##.ACQUISITION SCHEME= undefined
##.AVERAGES= 16
##.DIGITISER RES= 18
##SPECTROMETER/DATA SYSTEM= dpx250
##.PULSE SEQUENCE= zg30
##.SOLVENT NAME= DMSO
##.SHIFT REFERENCE= (INTERNAL, DMSO, 0, 16.522)
##AUDIT TRAIL= $$ (NUMBER, WHEN, WHO, WHERE, WHAT)
$$ ##TITLE= Audit trail, XWIN-NMR		Version 3.5
$$ ##JCAMPDX= 5.01
$$ ##ORIGIN= Bruker BioSpin GmbH
$$ ##OWNER= nmr
$$ C:\u/data/dgb/nmr/ADRS/70/pdata/1/auditp.txt
$$ ##AUDIT TRAIL=  $$ (NUMBER, WHEN, WHO, WHERE, WHAT)
(   1,<2007-01-02 11:01:32.78 +000>,<MAYBRIDGE\nmr>,<NMR_250MHZ>,
      <created by zg, POWCHK disabled, PULCHK disabled
       configuration hash MD5:
       49 4B E0 1D 92 C2 6B 37 9F E6 65 BC 52 41 86 1D
       data hash MD5: 64K
       4F 3F C1 C1 BE 5E DB 8B B8 AD CC 7C 3B ED 89 85>)
(   2,<2007-01-02 11:01:46.27 +000>,<MAYBRIDGE\nmr>,<NMR_250MHZ>,
      <Start of raw data processing
       ef LB = 0.3 FT_mod = 6 PKNL = 1 SI = 32K 
       data hash MD5: 32K
       58 5B FD CB D9 8C 14 8A 41 B4 A3 AA 7A 14 BF 6E>)
(   3,<2007-01-02 11:01:47.99 +000>,<MAYBRIDGE\nmr>,<NMR_250MHZ>,
      <apk 
       data hash MD5: 32K
       AF 8A 74 16 33 A0 71 5B BE 2A 81 38 4C C8 F3 50>)
(   4,<2007-01-02 11:01:48.91 +000>,<MAYBRIDGE\nmr>,<NMR_250MHZ>,
      <abs ABSG = 5 
       data hash MD5: 32K
       0E 90 40 65 80 E3 C7 A6 80 F1 CE 4F 45 0A 44 E6>)
$$ ##END=
$$ 
$$ hash MD5
$$ F3 97 99 B6 11 22 58 DA B9 ED 3A F5 8C 13 70 E9
##$RELAX= 
##$RELAX= 
##$RELAX= 
##$RELAX= 
##$RELAX= 
##$RELAX= 
##$RELAX= 
$$ Bruker specific parameters
$$ --------------------------
##$DU= <C:\u>
##$EXPNO= 70
##$NAME= <ADRS>
##$PROCNO= 1
##$TYPE= <nmr>
##$USER= <dgb>
##$AMP= (0..31)
100 100 100 100 100 100 100 100 100 100 100 100 100 100 100 100 100 100 
100 100 100 100 100 100 100 100 100 100 100 100 100 100 
##$AQSEQ= 0
##$AQ_mod= 3
##$AUNM= <au_zg>
##$AUTOPOS= <11 >
##$BF1= 250.13
##$BF2= 250.13
##$BF3= 250.13
##$BF4= 250.13
##$BF5= 500.13
##$BF6= 500.13
##$BF7= 500.13
##$BF8= 500.13
##$BYTORDA= 1
##$CFDGTYP= 0
##$CFRGTYP= 5
##$CHEMSTR= <none>
##$CNST= (0..31)
1 1 145 1 1 1 1 1 1 1 1 1 1 1 1 1 1 1 1 1 1 1 1 1 1 1 1 1 1 1 1 1 
##$CPDPRG= <>
##$CPDPRG1= <>
##$CPDPRG2= <>
##$CPDPRG3= <>
##$CPDPRG4= <mlev>
##$CPDPRG5= <mlev>
##$CPDPRG6= <mlev>
##$CPDPRG7= <mlev>
##$CPDPRG8= <mlev>
##$CPDPRGB= <>
##$CPDPRGT= <>
##$D= (0..31)
0 1 0 0 0 0 0 0 0 0.06 0 0 0 0 0 0 0.0002 0 0 0 0 0 0 0 0 0 0 0 0 0 0 
0 
##$DATE= 1167735691
##$DBL= (0..7)
120 120 120 120 120 120 120 120 
##$DBP= (0..7)
150 150 150 150 150 150 150 150 
##$DBP07= 0
##$DBPNAM0= <>
##$DBPNAM1= <>
##$DBPNAM2= <>
##$DBPNAM3= <>
$$ [...]
##$SUBNAM7= <"">
##$SUBNAM8= <"">
##$SUBNAM9= <"">
##$SW= 20.6930455092707
##$SWIBOX= (0..15)
0 0 3 0 0 0 0 0 0 0 0 0 0 0 0 0 
##$SW_h= 5175.983436853
##$TD= 65536
##$TD0= 1
##$TE= 294.16
##$TE2= 300
##$TE3= 300
##$TEG= 300
##$TL= (0..7)
0 120 120 120 120 120 120 120 
##$TP= (0..7)
150 150 150 150 150 150 150 150 
##$TP07= 0
##$TPNAME0= <>
##$TPNAME1= <>
##$TPNAME2= <>
##$TPNAME3= <>
##$TPNAME4= <>
##$TPNAME5= <>
##$TPNAME6= <>
##$TPNAME7= <>
##$TPOAL= (0..7)
0.5 0.5 0.5 0.5 0.5 0.5 0.5 0.5 
##$TPOFFS= (0..7)
0 0 0 0 0 0 0 0 
##$TUNHIN= 0
##$TUNHOUT= 0
##$TUNXOUT= 0
##$USERA1= <user>
##$USERA2= <user>
##$USERA3= <user>
##$USERA4= <user>
##$USERA5= <user>
##$V9= 5
##$VALIST= <valist>
##$VCLIST= <CCCCCCCCCCCCCCC>
##$VD= 0
##$VDLIST= <DDDDDDDDDDDDDDD>
##$VPLIST= <PPPPPPPPPPPPPPP>
##$VTLIST= <TTTTTTTTTTTTTTT>
##$WBST= 1024
##$WBSW= 4
##$XGAIN= (0..3)
0 0 0 0 
##$XL= 0
##$YL= 0
##$YMAX_a= 333281
##$YMIN_a= -456467
##$ZGOPTNS= <>
##$ZL1= 120
##$ZL2= 120
##$ZL3= 120
##$ZL4= 120
##$ABSF1= 16.522
##$ABSF2= -4.171173
##$ABSG= 5
##$ABSL= 3
##$ALPHA= 0
##$AQORDER= 0
##$ASSFAC= 0
##$ASSFACI= 0
##$ASSFACX= 0
##$ASSWID= 0
##$AUNMP= <proc_1d>
##$AZFE= 0.1
##$AZFW= 0.1
##$BCFW= 0
##$BC_mod= 0
##$BYTORDP= 0
##$COROFFS= 0
##$CY= 12.5
##$DATMOD= 1
##$DC= 0
##$DFILT= <>
##$DTYPP= 0
##$F1P= 14.0000005364418
##$F2P= -0.99999901652339
##$FCOR= 0.5
##$FTSIZE= 32768
##$FT_mod= 6
##$GAMMA= 0
##$GB= 0
##$INTBC= 1
##$INTSCL= 1
##$ISEN= 128
##$LB= 0.3
##$LEV0= 0
##$LPBIN= 0
##$MAXI= 10000
##$MC2= 0
##$MEAN= 0
##$ME_mod= 0
##$MI= 0
##$NCOEF= 0
##$NC_proc= -6
##$NLEV= 6
##$NOISF1= 0
##$NOISF2= 0
##$NSP= 0
##$NTH_PI= 0
##$NZP= 0
##$OFFSET= 16.522
##$PC= 1
##$PHC0= 212.7523
##$PHC1= 14.80093
##$PH_mod= 1
##$PKNL= yes
##$PPARMOD= 0
##$PSCAL= 4
##$PSIGN= 0
##$REVERSE= no
##$SF= 250.13
##$SI= 32768
##$SIGF1= 0
##$SIGF2= 0
##$SINO= 400
##$SIOLD= 32768
##$SREGLST= <1H.DMSO>
##$SSB= 0
##$STSI= 32768
##$STSR= 0
##$SW_p= 5175.98343685301
##$SYMM= 0
##$S_DEV= 0
##$TDeff= 65536
##$TDoff= 0
##$TI= <Analysis number 999999
Compound Code 99
Book Reference 9
Project Code 9>
##$TILT= no
##$TM1= 0
##$TM2= 0
##$TOPLEV= 0
##$USERP1= <user>
##$USERP2= <user>
##$USERP3= <user>
##$USERP4= <user>
##$USERP5= <user>
##$WDW= 1
##$XDIM= 32768
##$YMAX_p= 422560200
##$YMIN_p= -2232498
$$ End of Bruker specific parameters
$$ ---------------------------------
##NTUPLES= NMR SPECTRUM
##VAR_NAME=  FREQUENCY,     SPECTRUM/REAL,   SPECTRUM/IMAG
##SYMBOL=    X,             R,               I
##VAR_TYPE=  INDEPENDENT,   DEPENDENT,       DEPENDENT
##VAR_FORM=  AFFN,          ASDF,            ASDF
##VAR_DIM=   32768,         32768,           32768
##UNITS=     HZ,            ARBITRARY UNITS, ARBITRARY UNITS
##FACTOR=    0.157963299565203, 1,           1
##FIRST=     4132.6476996994, 0,             0
##LAST=      -1043.33573715361, 0,           0
##MIN=       -1043.33573715361, -2232498,    0
##MAX=       4132.6476996994, 422560200,     0
$$ Real data points
##PAGE= N=1
##DATA TABLE= (X++(R..R)), XYDATA
$$ [...]
27925 -58977 -154157 -216160 -377986 -361833 -188613 -28728 -59183 -80162 -252298 -436486 -507905
27914 -507905 -456063 -538115 -209372 26068 -26129 -60569 59371 -76243 -179541 -240473
27904 -240473 -51769 152296 106167 -5732 -11157 -107610 -90023 -6317 175793 246449 504258
27893 504258 458595 420283 508052 453467 494542 576487 617743 298835 -1669 -238367 -118284
27882 -118284 -96048 11781 81774 140474 -78968 -260752 -90889 -119646 -77221 28121
27872 28121 32279 80045 88256 220598 170878 95861 202562 167334 206458 252956 406358
27861 406358 349834 292249 248130 163264 173711 384518 285659 161183 113360 380863 216298
27850 216298 -55181 -220883 -307483 -40494 192244 423630 240359 -4440 -149671 -236037
27840 -236037 -44032 3315 95930 200909 199667 78983 -62727 103726 235162 102458
27830 102458 31077 -198009 -418855 -489776 -589022 -281777 -57671 -3056 -103555 -127805
27820 -127805 -214406 30279 37273 71315 72926 132915 286786 285568 190530 129187 -84415
27809 -84415 -13471 16419 -59043 63562 179173 258757 106839 20574 265546 293946 169060
27798 169060 27114 -26132 -69793 -123 292005 355019 202182 211064 208258 7559 -235530
27787 -235530 -72276 113008 110755 134195 235957 70968 -168813 -64113 58984 -1253
27777 -1253 -20960 197356 400657 280922 197354 162906 178027 246231 103445 113140 133805
27766 133805 108856 63893 53330 49280 36575 -26809 37271 237117 232468 97491 -84703
27755 -84703 -99596 -70964 15449 -31836 -138574 76434 122959 236685 291258 281515 153173
27744 153173 -91424 -71676 -62541 10927 49428 50999 60879 35499 -53432 -19988 296581 292446
27732 292446 -73655 -134377 49110 226718 201092 259496 325734 379252 261502 112806
27722 112806 73420 -516 8135 111767 120818 11663 -94714 -48279 100150 239513 213315
27711 213315 92178 26826 285721 452375 167783 137032 174423 237388 92384 73993
27701 73993 66120 189582 277823 213802 -5718 -304355 -292007 -106406 185213 180558 100095
27690 100095 74980 -69308 -144915 -150904 -336745 -441129 -523296 -205341 110577 -62969
27680 -62969 -62363 11556 60653 167978 129217 80145 51949 20229 181901 61718 -721
27669 -721 76478 -144851 -296631 -374297 -250914 -224017 -356785 -456369 -329895 -284990 -238271
27658 -238271 -314804 -311978 -320699 -151954 56987 163034 160547 158570 173274 58171 199729
27647 199729 356352 270825 35447 -117368 -258301 -108002 335015 452334 287048 151969
27637 151969 128247 212337 165145 36615 40892 88132 -11081 -45753 -52381 182395 93496
27626 93496 -30563 88986 210780 52023 44861 -15741 -167104 -313683 -185681 -136561
27616 -136561 -102296 135005 186482 106002 201259 511637 583736 472265 274982 102971
27606 102971 62053 -30425 49299 52888 -191521 -98221 102045 -125123 -306385 -276934 -195613
27595 -195613 17914 -56588 -268517 -209087 -54098 -107258 74547 79694 -18656 -261432 -299622
27584 -299622 29948 4006 -226783 -290962 -282169 -271435 -301875 -290515 -322088 -209315 -65011
27573 -65011 -132837 17864 22712 -119273 -161392 -44995 -4627 -20316 216259 354269 -6675
27562 -6675 -296189 -551252 -515243 -258131 -226936 -217752 -140597 88023 397955 402691 188211
27551 188211 -17360 -178004 -191178 -168041 -117369 47838 86404 234603 238027 179955 1050
27540 1050 -64093 -7499 318148 443401 399025 40052 60477 53315 83231 181665 62485
27529 62485 5747 32079 59137 244751 357186 393388 340932 233260 245731 290296 84297
27518 84297 142250 216564 108047 -57359 4298 94937 148280 454395 541902 325023 461844
27507 461844 587989 434564 212069 54298 69974 23823 102847 142234 79080 122263 35870
27496 35870 12683 -56266 -202403 -164444 -45773 52622 -9325 -7443 77793 122126 -22602
27485 -22602 131619 154015 -195508 -345878 -341762 -149629 93535 313494 388500 331355 293022
27474 293022 341301 285927 134321 271959 108136 -258 -114949 -142353 -93457 -138527
27464 -138527 -132872 -202478 -323230 -629857 -762082 -593193 -97316 111954 154034 -194315
27454 -194315 -139200 -108823 -147319 -30517 78557 -96796 -246336 -64803 172394 214674
27444 214674 134386 47938 85473 211410 101957 -13679 54509 173900 168531 228440 349397
27433 349397 129281 89907 81910 -214690 -159215 -98329 -21512 -121883 -157772 -89507 45440
27422 45440 208169 303048 223957 162866 66068 41327 -158990 -266087 -99651 -28794 73167
27411 73167 -137748 -242231 -213842 -209330 -129887 -106288 -87400 -18104 63991 59084 19828 -81085
27399 -81085 -140392 -81017 -16494 -94091 -105989 113373 161999 68289 72098 71816 141798 130398
27387 130398 121761 148827 208878 39971 -66609 -322890 -287366 -106994 104970 251488
27377 251488 408879 340378 424662 439829 273881 262389 263904 259129 106734 65185 -44406
27366 -44406 -121068 -164067 -38771 2768 232447 187068 114187 244714 240728 225512 305842
27355 305842 317376 76353 -147963 -258511 -208831 -370151 -348141 -169263 -114988 -174107
27345 -174107 -204152 -69901 168827 101118 -40627 132552 236235 211080 91445 87037
27335 87037 103882 147177 137679 16614 -183423 -221893 -261086 -167336 -178948 -68930 -40339
27324 -40339 -188262 -355969 -329197 -247965 -251711 -168832 -107438 -17303 154882 152457 42363
27313 42363 35392 -95356 -232414 -186775 -87034 266761 306874 193590 116006 172454 122634
27302 122634 -8660 102253 34847 174795 244952 300308 231991 80543 -46460 -180522
27292 -180522 -238986 -282651 -153224 183672 302129 432691 314655 275371 206107 179949
27282 179949 133773 43414 -62981 -177292 -150310 -146553 -106867 -243359 -324914 -226773 -149668
27271 -149668 -61264 28196 33352 93368 71305 173190 129682 190888 344244 179204 276
27260 276 142775 343073 244111 154134 168761 64350 -24388 -102689 36473 31357 24268 51439
27248 51439 121618 414157 202202 155891 -152741 -379330 -98121 -22509 30159 233567
27238 233567 137223 72457 8531 -36593 -38099 -209892 -236400 -254483 -98722 -202738 -414840
27227 -414840 -262937 -198745 -234446 -95723 -27848 64295 79859 22870 -23478 -35995 -105713
27216 -105713 -102402 -82357 -117179 27576 218654 372227 241884 296140 335406 182584 35699
27205 35699 -251058 -15926 190287 131774 194120 117317 296673 165190 4437 45599
27195 45599 169383 181313 69716 39156 -208273 -195674 -53725 -54379 -24744 158672 115120
27184 115120 307762 199619 81569 148560 -17282 -198727 -118152 23335 242981 110554
27174 110554 21201 61774 -21162 -58305 -79056 61996 36175 -30500 -204875 -9376 -43321
27163 -43321 -69961 -88281 -9727 -208731 -204295 -32459 -102466 -232052 -235934 -145189 -56374
27152 -56374 -223556 -322214 -217062 -170291 -123547 -149879 23880 210179 139716 -19205 -17781
27141 -17781 -163119 -210529 -218166 -112828 73239 59655 117061 144952 103388 38979 15044
27130 15044 71881 -183888 -218561 -196010 -110219 -100858 -280178 -238998 -87657 59070 15840
27119 15840 -47939 -22059 -212079 -75524 6678 -33811 -51552 -159105 -280655 -324127 -451814
27108 -451814 -345735 -107628 -61592 53768 28588 -21739 -34 -194335 -281682 -81565
27098 -81565 -60099 -106318 -85804 -8035 -40825 -101142 73239 185168 236186 219277 -41315
27087 -41315 -91341 -2492 43125 59078 90923 54638 183122 225954 276717 154245 -129218
27076 -129218 -181321 11423 7196 182843 136148 62086 41683 -27232 12535 191131 136738
27065 136738 26409 250663 299793 261252 58680 -104953 -117577 -109542 -58340 -76702 -125834
27054 -125834 -166662 -220063 -100095 28767 -62074 -280432 -360531 -416947 -427828 -365768 -232929
27043 -232929 -129792 95201 161674 165780 105864 9511 72134 -296163 -341821 -132503 118456
27032 118456 172917 245440 101355 -125323 -153490 -9102 54338 -82210 -20974 90816
27022 90816 251185 222607 103259 16975 -44960 -103293 -162945 -86261 36026 13349 15966
27011 15966 -194569 -217079 77899 173635 113749 16816 28791 105317 346956 328247 202213
27000 202213 79390 -105543 -102493 84207 231395 370941 131614 -174494 -264142 -288526
26990 -288526 -166795 -46481 -236146 -225912 -58898 335420 274933 53011 127464 90760
26980 90760 -87601 -82866 -115149 113370 120879 26962 -67003 -1359 35434 96378 195891 90956
26968 90956 -41041 -75417 -102726 -59147 12015 -102004 -138627 -34007 89084 137902 202744
26957 202744 -16522 108940 34077 -35959 -41281 146112 -50420 -132475 -10736 -297730
26947 -297730 -151714 185593 365103 526278 322114 73999 -52646 -167742 -197094 -124055
26937 -124055 18295 16780 3474 -8403 14788 -72577 12621 80432 102244 273897 441113
26926 441113 381239 315913 260179 182625 -79911 -179281 -102739 -104945 -19452 2190 63285
26915 63285 136838 163271 253992 81712 26314 -77654 -77476 -133876 -85144 74765 271405
26904 271405 238773 122879 -84154 -82014 -75511 -53945 85744 -107103 -135880 -54897 -208766
26893 -208766 -199643 -72490 52552 -83606 -240628 -297551 -4113 169429 153938 63720
26883 63720 128332 21906 -102272 -43638 -256546 -179338 -72926 20861 186285 227530 64754
26872 64754 27699 98447 91972 107790 195008 169358 246276 198611 100435 224338 212906 35564
26860 35564 178497 250771 262565 421943 468717 343986 277766 -28250 -210789 30504
26850 30504 228542 312312 46452 238134 145201 104229 137947 264184 249515 127193 154162
26839 154162 245153 143795 174216 182897 188258 17207 -205713 -154959 -113514 -160869 -165623
26828 -165623 -198269 -239488 -167494 -151518 -93684 -150586 -104682 16901 101823 246050 377178
26817 377178 343748 271342 294674 116370 -75561 -163720 -121633 -43253 -79761 -63559 -697
26806 -697 122044 -36971 -118090 -1908 -70619 27634 52949 -97587 -80710 304600 402724
26795 402724 299079 267133 317019 133510 80514 241461 242019 252935 180663 253266 303859
26784 303859 317367 436896 506712 90604 79312 206224 58255 39681 163421 327360
26774 327360 463602 560104 689260 542283 294382 235707 126395 173765 213271 272712
26764 272712 345405 317047 319787 224048 177763 144597 155874 242080 167285 -12366 17592
26753 17592 69047 47201 -76399 -88108 -14353 63385 207504 177409 150929 200278 148096
26742 148096 -144982 -77792 -27954 -302039 -527897 -432119 -305490 -215413 -278046 -240100 -20081
26731 -20081 -13847 -39145 -198530 -121342 -2136 -82769 6866 1920 -142642 -188664 -177639
26720 -177639 -206999 -90985 -38145 -129501 111599 33315 -51720 -102198 -121937 -162506 -248751
26709 -248751 -97838 -40928 75522 21988 61379 16628 74087 79824 -3116 13797 123679
26698 123679 126253 201788 85062 67060 82837 -57459 -54616 -229448 -314212 -355485 -242027
26687 -242027 -43747 -106040 -90447 -23239 -88030 -118803 -86717 -31011 -69498 -37511 -60101
26676 -60101 29216 293695 170443 90337 137395 194184 306273 17546 75003 -6909 -190214
26665 -190214 -464624 -584598 -449921 -373267 -348369 -61376 30394 119687 118729 141420 70222
26654 70222 103891 -138843 -185388 -176666 -156501 -215369 -212287 -227258 -280339 -327062 -259684 -5192
26642 -5192 -101554 -228005 -133046 -279688 -354402 -462636 -305664 -228851 -74761 -240740 -210215
26631 -210215 -109153 43842 139746 48587 -18388 8844 149244 152551 32841 -19940 -74728
26620 -74728 -19403 -118979 -204333 76276 -58432 -316306 -339712 -152589 6662 233155
26610 233155 135047 -50480 -183764 -187014 -165572 -13407 127070 359111 188425 311789
26600 311789 355620 154287 239559 162066 152704 398213 463541 291291 115640 -96145 110737
26589 110737 471914 488245 423008 429588 204769 185967 220549 180731 140626 68332 -48562
26578 -48562 -145532 -281926 -216703 -262324 -156404 -34045 184691 386471 245487 115770
26568 115770 -116909 -52596 82308 69724 -84255 -93602 -130878 -64170 75556 170374 140721
26557 140721 98673 -90387 -68185 42335 17342 -14923 105452 -66933 -132914 10219
26547 10219 72223 -78859 -99004 -200505 -309253 -330010 -126195 77180 99357 -15991
26537 -15991 89678 -19676 -83421 138989 274968 112895 86102 60619 95912 146715 98079
26526 98079 73388 91291 61341 17760 122870 260844 289567 249947 200914 130129 -13004
26515 -13004 -42707 165537 87875 98962 210466 82006 82186 124744 163210 198010 317852
26504 317852 354628 284928 209059 156220 97222 60675 66691 78600 48364 -13346 94012
26493 94012 -14759 -32592 100953 214941 50047 -88695 -189352 11442 43202 -93966
26483 -93966 -290706 -394805 -249744 -130668 66871 269851 403101 189346 -99888 -126796
26473 -126796 96549 281369 284290 147625 108356 184804 97202 30472 215890 311876 224720
26462 224720 260183 259132 45933 29884 105086 -121548 -169134 7127 382502 492402 217719
26451 217719 -14294 57163 110064 174362 170510 56712 -2123 -156140 -270736 -73392 -118356
26440 -118356 -12775 214743 132614 155916 318484 182331 117718 121610 153746 -7941 48856
26429 48856 98203 325815 274473 6098 -194453 -108048 155480 254195 41492 -136223
26419 -136223 -247773 -201766 -78927 -94981 13920 212348 258321 240802 158917 142686 131254
26408 131254 290322 234944 247364 315714 369081 334442 159740 115372 176261 82873 5178
26397 5178 -54070 -89352 -103148 -79845 -195461 -308295 -59244 -96382 -293593 -224171 -229132
26386 -229132 -125832 -99676 -71605 -93719 -118509 -128204 -179831 -275021 -398308 -255524 -128707
26375 -128707 -106161 11679 167550 214340 86175 55917 3025 16245 262344 242000 87107
26364 87107 119980 154256 173286 167298 245704 257192 338276 160363 -57765 -267770 -370756
26353 -370756 -246614 -67140 753 103221 63101 166266 261958 103267 -85314 66005
26343 66005 204471 125777 44050 -15283 98360 36941 82436 134398 171670 135269 58183
26332 58183 47596 56805 45080 -163236 -285509 -115933 76975 219447 323013 43358
26322 43358 -401701 -371319 -202811 -360738 -434533 -350782 -386749 -151033 -16041 27017 -55000
26311 -55000 23557 36549 91389 93936 5289 19602 -8912 247077 26464 -147673 -283054
26300 -283054 -334009 -402985 -411979 -350518 -439403 -411110 -267486 -229603 5133 226229 201978
26289 201978 234741 181865 48357 222068 273823 140700 -43926 -29208 120242 249581
26279 249581 328736 188563 -75561 -51453 -30867 123174 303637 215276 94575 125277
26269 125277 168645 41904 194597 223522 131358 -91037 -248853 -265748 -257809 -278495 -186057
26258 -186057 -108921 68946 189647 102355 -168817 -156933 -58708 -20589 -96400 47564 277995
26247 277995 235827 407272 405553 49748 31644 -119668 -119743 -182377 -133625 99174 422619
26236 422619 511606 443503 310413 318757 462608 350371 295368 193040 -56955 -292068
26226 -292068 -420181 -381105 -319030 -241266 -8561 216398 279546 247345 192791 64611 171923
26215 171923 74266 -49428 66255 22942 25890 -132887 -55068 -140310 -105081 19904 71992
26204 71992 -178995 -314648 -223910 -298149 -478303 -146860 61225 -47836 -147723 29743
26194 29743 161735 73373 77139 65195 10803 -63060 -196559 -59173 59865 -110412 -281254
26183 -281254 -244115 -101489 -74470 164722 251658 36930 87173 203605 83617 100272
26173 100272 165346 -71663 -5507 108393 205888 192357 165304 126731 128453 118428 187198
26162 187198 288361 79499 -51165 -97290 -222987 -24091 292233 301409 79182 136865
26152 136865 152095 -14618 -34484 -149820 -84553 190068 465015 479748 355478 146849
26142 146849 -57087 -104723 227216 230117 170369 331837 96115 -101283 -195207 -260897 -306706
26131 -306706 -224812 -104977 196021 251464 289316 201397 73580 -65961 180663 288734
26121 288734 327399 226110 154269 144860 133452 270215 30875 -199128 -246139 -190075 -21253
26110 -21253 254047 154189 159242 95057 11093 -86923 -57709 28810 -159330 -92850 137517
26099 137517 226469 210454 212709 157317 265777 291867 260483 173185 245015 191176 92249
26088 92249 231389 285018 162574 54415 365735 344593 173361 188252 141726 31394
26078 31394 -24432 -147388 -98345 -87899 -160997 14304 175581 171173 49305 -117399 -237747
26067 -237747 -404976 -433998 -239476 -332457 -289684 -231186 -143454 -181913 -223576 -233202 -260187
26056 -260187 -269776 -137004 177925 100276 129658 203873 165002 191047 52184 17200 4230
26045 4230 155815 175505 116708 -9389 -34877 -36891 50090 48418 167008 242788 293559 365125
26033 365125 384172 125880 -2713 -241256 32413 182570 158409 186379 122697 35282
26023 35282 -37339 1302 149522 375364 287533 -37299 -76126 -171230 -48490 -150977 -161266
26012 -161266 215 242495 249225 106638 223703 192708 -110690 -93550 -181773 -210350 -90193
26001 -90193 39390 50453 -112482 -56488 -83384 -259129 56530 124068 188811 198106 -109080
25990 -109080 -238298 -385681 -252187 -22622 -23958 -112806 -3362 -63832 -66039 25366 160206
25979 160206 349909 212280 255070 234616 209200 357805 283494 306240 196696 160380 20703
25968 20703 -260926 -371345 -387352 -389958 -148191 -62476 57782 106479 111705 88988 102649
25957 102649 3358 27989 226841 154309 50825 -105906 -13509 13248 -5919 56998 -46546
25946 -46546 -35294 -200471 -52402 42646 61379 19846 -82527 -375089 -199771 -181866 -301766
25935 -301766 -45026 -142313 -8962 172016 233847 195106 173110 175092 -39119 -123852 -54475
25924 -54475 -271005 -335560 -186193 -210353 -324794 -322811 -155267 -92744 -76256 -61151 -131106
25913 -131106 -128188 -79502 -112005 121724 238969 245164 110148 220198 334226 111784 1377
25902 1377 -27922 -78349 -230222 -205529 -232142 -309836 -274190 -291691 -169037 -52658 108969
25891 108969 149872 -57549 -277123 -144038 155874 280866 402357 360517 361884 58455
25881 58455 -118438 -326587 -305547 -225789 -145064 -207709 -150299 117000 78758 -18238 -172215
25870 -172215 -231235 -222026 -267355 -89564 -151289 -43122 -43872 -99149 -63663 77491 95783
25859 95783 -12980 -31839 -38057 -127529 91498 95895 -33286 -42994 -408771 -441640 -528868
25848 -528868 -317218 -114493 40338 86738 67527 -107803 -29926 -54743 -118825 -47824 -135906
25837 -135906 -198456 30209 6327 18873 161891 321496 273870 420501 379442 264927
25827 264927 367174 479031 231633 254487 107044 -593 106721 213940 179398 177104
25817 177104 171126 217034 116121 85672 217627 353648 291785 24375 -79991 -99201 -63449
25806 -63449 -13378 152765 318728 229947 -48468 -225726 -240979 -132081 -57758 11452 42437
25795 42437 206404 85357 -45678 -140364 -119993 203493 217182 168535 98107 84783 141012
25784 141012 189326 268503 395714 435279 234488 247194 351846 203050 79054 204698
25774 204698 39096 -227657 -296987 -133128 -120508 -23865 -7292 -5854 -194577 -183589 31422
25763 31422 33792 127560 208358 96060 -63363 -67230 -5695 13626 52934 152863 31168
25752 31168 -90576 -26822 -33827 51036 3814 -103061 -206954 -339236 -292431 -101738 30970
25741 30970 29766 6307 59927 57555 -122528 -221873 -263317 -195518 -165338 59152 185157
25730 185157 55680 17165 95963 115772 84217 45973 -41535 -270241 -198859 -154115 35990
25719 35990 48290 -63483 -33489 -56868 -227344 -444629 -460283 -56763 56142 -77481
25709 -77481 -194248 -193839 -194328 -92214 2288 46298 -29119 -209045 -196947 -117693 -121901 -14435
25697 -14435 -201601 -221264 -197167 -161429 -12623 147448 158898 74368 -67453 -113157 64509
25686 64509 -73026 -41761 -95267 71496 163648 225903 107334 20990 131505 129259 109407
25675 109407 34112 123796 99947 226732 358080 305977 159651 -164747 4113 -15497
25665 -15497 47458 201684 149906 43847 84045 3881 -38756 -129933 -164455 74342 180385
25654 180385 244619 246410 103663 138414 58616 -31431 96760 36992 56917 -100691 -235482
25643 -235482 -318105 -326827 -236063 -420265 -407050 -247215 5231 100773 57828 -144316 -199316
25632 -199316 67784 27168 144862 37954 18043 137126 317257 244752 48968 -13177
25622 -13177 -84747 -26739 206302 135625 38800 12294 -229334 -134166 -12257 -42996 80285
25611 80285 247634 308933 68420 127773 394418 565380 491670 217085 17628 -157677
25601 -157677 -395113 -339380 -106700 -296881 -631629 -580131 -414651 -415894 -449726 -290428
25591 -290428 -129092 -178154 -150129 -4961 12061 180236 148770 -14399 -169796 30845
25581 30845 25992 -106748 -44348 -11890 159552 138626 -42928 -143097 -208676 -156770 -28079
25570 -28079 111972 -46157 -264053 -154259 -78846 31836 152748 357171 283978 137045
25560 137045 47800 10424 27782 -2074 116671 171328 99575 59228 4854 116548 249058
25549 249058 221383 26154 103150 77247 -178 -103873 -175409 -251509 -114047 152242 350162
25538 350162 225775 19400 -57540 19393 155855 126833 -34644 37697 131065 -66543
25528 -66543 -148104 241918 400009 360205 269173 274285 191841 103171 62871 139706 54293
25517 54293 124323 -54057 121471 29555 17848 63924 151387 25425 -163961 -92771 -48071
25506 -48071 110452 272120 292831 117516 -76883 -231566 -121097 -88024 -26676 35365
25496 35365 -105552 -173011 -294333 -224336 -117204 -200382 -105038 -142907 -249857 13058 15760
25485 15760 -178085 -184433 -213963 -44751 135022 110627 5879 -100403 -80956 -16106 -109528
25474 -109528 -129988 -80319 -101095 -201427 -114380 9329 84300 31276 47481 75116 -119916
25463 -119916 -61842 52313 -47814 97928 148149 95098 98803 96331 11491 -7715 -118092
25452 -118092 -310339 -96559 -76956 -222907 -286984 -86452 -59262 -115516 -147679 -68799 -54951
25441 -54951 -68004 12989 359754 383140 157428 -6312 -93866 15998 -85684 12690 313866
25430 313866 204144 258807 368531 310343 319673 208851 345592 277378 119256 14367
25420 14367 158913 387849 281825 98881 94280 224275 244931 196797 84825 -103390
25410 -103390 -58084 -26309 31684 8912 41869 299631 408520 287799 275546 -40580 -137626
25399 -137626 55369 249517 239293 200411 271148 83427 -34685 15405 -4297 38204 24006
25388 24006 -6190 -74866 -125819 -266610 -132838 62648 -121855 -116928 -12438 221065 202930
25377 202930 258899 167500 3873 -20668 72862 195290 120993 -186564 -178387 32036 -120136
25366 -120136 -372698 -470763 -347697 -90930 -87585 -128199 -154549 -123650 -49150 31900 -35627
25355 -35627 -114456 8250 137558 330822 280169 -5989 -114617 -136102 -91928 -63704 6650
25344 6650 104284 60365 167460 229582 4431 -17862 168797 114351 -18014 -33467 -136402
25333 -136402 -114953 -66700 -168493 -134075 48909 262726 355245 437051 273328 154347
25323 154347 93900 269512 181136 -59929 -160245 -192016 5735 182842 265342 151562
25313 151562 100994 95841 -133903 -220933 -194272 7773 -66060 -88450 -134539 -160579 -95916
25302 -95916 -263272 -105358 18752 170617 40843 -19065 -157703 -87235 60177 -63438
25292 -63438 -150495 -26788 19322 -46789 -24769 -92462 -84875 -47479 25492 133349 24495
25281 24495 -29607 50763 175903 389517 422942 161429 16723 81683 253860 219535 126595
25270 126595 -22159 13488 74210 234740 -176132 -521102 -335527 -7289 47736 107188
25260 107188 -54180 -381968 -411635 -406364 -337719 -321936 -248091 -186384 -170958 -111965 27201
25249 27201 55290 -13366 -92007 -251651 -143350 -47005 -129291 18913 -86 -115238 -44490
25238 -44490 -180588 -73501 -34302 -98471 -151323 -261895 -348169 -301840 -190564 -217554 -177291
25227 -177291 -19939 -220367 -138686 -133652 -53536 -173460 -413005 -295816 -313463 -177051
25217 -177051 -244566 -267868 -103539 138710 38538 -77924 -129067 -100036 -409258 -222410
25207 -222410 6311 -138172 -47270 45026 -16755 7823 -175773 -144269 61399 116300 115161
25196 115161 141058 -28881 -87841 -54677 20572 66237 98100 318438 453205 345207 269965
25185 269965 344443 263015 -82476 -18304 151845 47215 -139329 -274618 -234163 -133007
25175 -133007 -26844 50234 49506 -15030 -37508 61734 68851 202491 81093 -73537 -194931
25164 -194931 -245367 -189305 175037 83286 -97940 105892 242499 -32218 -168816 -65989
25154 -65989 62915 94418 92669 5372 133211 286212 214349 133403 188384 -8564 -134813
25143 -134813 -143468 -74871 117662 144529 302436 138458 150914 98675 -66731 -96721 142878
25132 142878 70542 32214 277618 209423 -82841 -282995 -275415 -186579 -54353 226789 215575
25121 215575 48465 -77131 -167662 42052 13909 -70650 55130 126622 20812 52731
25111 52731 55653 41789 -112192 -174985 21038 192497 182082 153195 24859 -106454 -257080
25100 -257080 -307165 -73483 -106937 16257 -103963 -186131 -259909 -165829 -97930 -57702 12596
25089 12596 -148606 -220160 -74048 -31947 58657 18951 165249 182586 220940 260844 46422
25078 46422 -105771 -251856 -71696 184074 201577 105974 -59779 37421 119947 312421
25068 312421 222895 90522 -122653 -133972 115768 105326 -38940 -173506 -397111 -503510
25058 -503510 -584409 -486048 -325151 -166997 -244199 -350468 -290929 -189102 -207247 -42995
25048 -42995 20515 38376 -77177 -298215 -494136 -234640 -11829 -156719 -35248 78742
25038 78742 92878 14422 92286 11985 -103800 76962 -114068 -347129 -121090 -56958 -110121
25027 -110121 -102780 -9678 10521 32319 -34361 -119596 -95932 29866 -123431 -69698 -5457
25016 -5457 130481 210861 77315 193660 335151 321033 203804 225566 217699 -5699 -43776
25005 -43776 -83579 -16823 -71667 -74353 -9354 55958 -18599 -167216 -194828 -290618 -303169 -366512
24993 -366512 -335031 -173880 -277953 -281560 -207540 -248080 -231136 -269261 -360795 -529619 -464113
24982 -464113 -376638 -484489 -479393 -334193 -292579 -247699 -13114 -183181 -289717 -23380
24972 -23380 158385 73969 -410734 -547344 -506682 -361214 -134795 -157701 -134589 -161282 -271508
24961 -271508 -243524 -574 22797 9576 -21161 -141951 -197013 -184586 -117734 47645 101147
24950 101147 286837 202231 290563 277042 130174 -27722 -151271 -204719 -331690 -356574
24940 -356574 -95133 -64294 -141911 -118622 80233 52304 55475 -137043 -142484 2753 66870
24929 66870 -10454 -2934 -33396 6908 56465 89081 62324 -98414 -113488 111825 261876
24918 261876 95034 -83253 -8868 177336 199691 163339 31701 -38894 -37159 16480 24198
24907 24198 -51932 -46186 -113146 76625 211624 329868 407314 428113 532924 299199 -4932
24896 -4932 -92502 -99402 -54941 -101605 -46044 318362 532103 426044 285367 102751 48473
24885 48473 -25184 -47554 -95251 17325 60328 -14659 103996 232639 222922 130925 -18853
24874 -18853 -6539 -106900 -53372 -26762 -181095 -88839 81369 -58404 -143692 -130143 -120303
24863 -120303 -377895 -505069 -411928 -292518 -169909 -74565 57985 15739 -129307 -284713
24853 -284713 -226833 16350 18540 -109440 -92279 -155949 -276593 -228180 -187847 -173050 -227506
24842 -227506 -50137 -167570 -115913 -42382 -33539 -148205 -375441 -553359 -413359 -31944
24832 -31944 -17566 -24664 -170401 -79165 5627 40880 94461 153618 -80558 -319693 -218253
24821 -218253 -329219 -284392 -273996 -272631 -311696 -243950 -302877 -283172 -409836 -400619 -141737
24810 -141737 56959 87330 -71058 -141830 -99830 -108044 -174687 -207231 -251898 -211510 -170190
24799 -170190 -166296 32888 321475 378371 152279 38913 -70389 64634 121318 17283
24789 17283 -51915 -133000 -115939 -83218 -101692 -268724 -403249 -265241 -90557 -74501 -195047
24778 -195047 -301113 -248744 -131927 -90311 -352200 -517944 -382477 -188595 55867 137474
24768 137474 30361 5221 142875 179604 -41113 -213223 -261922 -225465 -114597 44472
24758 44472 -66016 -179389 173778 194951 7117 -203183 -365050 -371870 -306772 -165974
24748 -165974 -212516 -155339 -192695 -143538 -87462 -335060 -382227 -442344 -284892 -244014 -338075
24737 -338075 -249622 -89345 115505 282357 311520 143984 15049 -82470 -27237 -32783 44291
24726 44291 -45582 -122871 -146380 -133239 -127834 -232716 -270232 -113664 -78516 -72784 -105801 59879
24714 59879 298516 326633 70643 -214381 -140939 9619 137994 98481 94326 -771 -83150
24703 -83150 -12383 55541 79653 184089 269756 449582 293242 112950 -133607 -192679 -142736
24692 -142736 72096 136333 188573 79997 -171560 -235753 52528 121675 -75581 -214700
24682 -214700 -189680 -168455 -128501 -216387 -228181 -229969 -329482 -358839 -326993 -317421 -261901 -295686
24670 -295686 -305256 -98803 -45012 27525 42009 36950 68553 -76665 -113109 -128073 -254795
24659 -254795 -304146 -521895 -385746 -248546 -335215 -392341 -310299 -125165 -159442 -256798 -254776
24648 -254776 -167317 -83556 -123143 -55775 165287 109888 -179495 -295180 -155915 -76003 -126674
24637 -126674 -319932 -241977 -236416 -104772 3946 263146 428113 324223 205539 64062
24627 64062 -29360 -121659 -342173 -310963 -225268 -343739 -63666 82615 177150 170395 126369
24616 126369 200579 67102 48382 141241 252857 275165 464353 367146 58601 -32956 37358
24605 37358 -17077 -251952 -447054 -426601 -294232 -326196 -550745 -499698 -307684 -184364
24595 -184364 34927 -17658 -153983 -114656 1127 -173320 -324477 -412547 -264445 -292955
24585 -292955 -250525 79274 113366 -245982 -205392 -140395 -210276 -359013 -320071 -198564 -197664
24574 -197664 -64960 -56704 -297846 -88714 141134 201107 -150697 -198213 -220406 -321016
24564 -321016 -400631 -360837 -262322 -64266 -43610 42478 11144 18044 122367 -56517 -45020
24553 -45020 -159604 -46050 151505 167460 18234 -43615 25453 86036 -96363 -336008
24543 -336008 -468769 -440416 -310343 -181764 -173935 -64172 100099 328298 339937 332667 538417
24532 538417 635529 414487 267226 159276 -150647 -263770 -146232 24085 89306 -167004
24522 -167004 -426200 -285593 -90407 -180105 -127239 1924 -54331 -41846 -132871 -117034 148106
24511 148106 -7933 -81100 -130483 -267269 -4427 141573 158600 -24276 -61283 52006
24501 52006 -72015 -177436 -276085 -379962 -364588 -105874 -129066 -202336 -38468 86861
24491 86861 50316 -71160 -178967 -296296 -337572 -317565 -205509 -19510 113547 220453
24481 220453 287674 503681 540163 502482 322529 287781 76481 -50843 98895 164147
24471 164147 595 -4426 42216 -2747 28297 162619 282028 206977 82851 91276 -69976
24460 -69976 -104555 -132680 -190648 -239631 -87137 23260 118644 341536 453411 417260 242954
24449 242954 159347 38750 116170 253414 265078 247709 209116 143347 3322 -256913 -343876
24438 -343876 -490270 -447745 -234768 -28652 -18599 -45108 -112868 -78095 -68781 -247081 -242137
24427 -242137 -349107 -267024 -171233 -62466 54320 44589 -155558 -261259 -14947 115160
24417 115160 174105 531573 614211 373030 87259 41737 117291 40281 -210778 -243362 -165436
24406 -165436 -48970 -1290 -109351 -149661 -120312 -91896 -39559 16618 84749 180454 96206
24395 96206 -22494 -219079 -304652 -161182 -155213 -358726 -333415 -174863 -284276 -200616 -71395
24384 -71395 -99948 72321 256025 221326 114228 -105786 -326440 -288945 -249701 -86321
24374 -86321 58848 -102577 -236121 -242626 -350802 -294460 -182948 -131277 27803 -82659
24364 -82659 -220509 -319872 -323577 -289282 -34486 68525 90413 -19464 -113627 -150104 -109740
24353 -109740 -32987 -153087 -365588 -396399 -303846 -249356 -129118 -146465 -14963 -14137 19562
24342 19562 89644 -150 95247 108568 61496 31476 133748 3166 287237 513327 410128
24331 410128 236487 -90115 -385588 -366920 -339414 -537926 -299761 158210 154490 7663
24321 7663 -87043 -131580 -80163 -77215 -50859 -82577 -52178 -266365 -221483 109936 74702 178766
24309 178766 183531 27549 -16740 66266 -9853 -257717 -317981 -265705 -9935 34329 -24690
24298 -24690 -8112 67559 -51915 -36121 161527 14340 -112950 -275756 -108684 -107410 61839
24287 61839 -3421 -55171 -1275 -45885 -81805 82567 -11352 -6917 -95499 -221385 -163165
24276 -163165 -153762 12429 274213 265106 101241 -183591 -340726 -164973 -300425 -199570
24266 -199570 10998 132050 396013 363108 148542 -9635 34604 -109990 -148053 -47372
24256 -47372 -64145 -87749 -15000 115121 94477 21672 -54338 -152193 -155400 192946 338501
24245 338501 192575 -14740 -271716 -274173 -200020 -125932 96364 215944 90059 115480
24235 115480 245899 300058 -55454 -137753 104305 106266 171550 102176 23449 -97440 40147
24224 40147 91650 55441 -218452 -318379 -170365 -215443 -309369 -34597 175952 112733 131631
24213 131631 180678 40291 57778 52104 -84893 -104931 -136123 -96805 81649 207796 97639
24202 97639 -131789 -305665 -499127 -555321 -388939 -171049 14345 45673 -89719 -56852
24192 -56852 34201 159414 137314 127935 202997 127796 -35123 101639 -23950 -118130 184964
24181 184964 280815 240552 100214 -66176 -96804 -133580 110667 221663 91227 171834
24171 171834 306580 110500 72873 84972 212595 346087 484442 522298 198461 -114968
24161 -114968 -135723 127688 -43038 -126474 -276432 -219358 41212 29900 -37192 44718 173269
24150 173269 57050 -67249 181 -139152 -219661 -30095 47374 -16169 -46780 -163942
24140 -163942 -219468 -167775 -310835 -162337 148093 207985 334462 158261 91373 160291
24130 160291 126663 -105519 -443206 -271230 81369 476351 485551 251757 92776 -41485
24120 -41485 -1762 -137517 -353037 -163927 -109187 -70488 -136421 -205041 -61719 -55129 -153052
24109 -153052 -174498 -160767 -98928 90485 257087 315916 291943 141829 59865 89595 -82286
24098 -82286 -242966 -369053 -270548 -298768 -260215 -8023 162952 172415 81858 88427 205928
24087 205928 38560 -120969 -233269 -245086 -250911 14022 322809 306954 -78564 -361033
24077 -361033 -387034 -264175 -38034 -190080 -20647 65437 -133643 -144211 -34553 111176
24067 111176 226774 239069 86430 111179 29268 31266 63462 3419 105042 -14943 -73864
24056 -73864 -43333 -53479 133307 258192 171576 78916 103787 41974 -122465 -205692 -9052
24045 -9052 -39236 113562 3635 -65344 -171111 -195237 69733 -35251 -75080 95355 134568
24034 134568 -133423 -18121 -106794 -323102 -315030 -126666 16308 88678 -141043 -162915
24024 -162915 110297 229869 152602 34731 -147305 -199529 -122605 -121600 -37967 -41973 -285763
24013 -285763 -322114 -327450 -527841 -523557 -269347 5715 111717 109849 94184 -87818 -174351
24002 -174351 -324590 -391308 -271730 87970 171222 -21448 -107849 -270208 -245089 -134278
23992 -134278 77958 204723 -4939 -248085 -81414 88065 145108 260449 217299 16789
23982 16789 -20420 -18430 -81735 -207419 -487109 -534549 -447511 -294322 -225641 -16441 188215
23971 188215 134697 -128496 -94287 -223060 -284419 -356255 -449224 -563848 -483060 -368365 -328973
23960 -328973 -556572 -442283 29187 198240 12648 -261185 -378193 -298188 -197029 -137681
23950 -137681 -9309 115933 122943 -1987 -199130 -163283 28310 148331 284565 354996
23940 354996 185377 230353 121053 19249 38239 78203 -104631 -167368 -223885 -250914 33167
23929 33167 289850 268067 165849 -107942 -245973 -253568 -336860 -211356 -91695 -293389
23919 -293389 -422750 -324127 -259309 -126207 -91215 -202925 -126072 -154140 -177619 -250043 -189673
23908 -189673 -118478 -282851 -277067 -333730 -319965 -429963 -362628 -307955 -105443 -41192 -5658
23897 -5658 144906 47759 -41209 -52377 -213332 -152697 -85878 -59679 173629 172610 334323
23886 334323 112515 14284 35695 263699 87741 -53098 17774 -139221 -336985 -231616
23876 -231616 -234191 -256466 -174022 -189028 -292299 -320145 -166990 -106346 1304 -36376 8000
23865 8000 -38080 -144419 -112105 206680 129392 53714 28161 -25000 8814 2199 26764 106987
23853 106987 138559 271909 156804 -177826 -30468 66459 -52408 80652 361429 152042
23843 152042 -247 -263030 -203111 -18259 64511 99395 85034 70758 68746 96818 133732
23832 133732 139229 43730 19050 -118652 -72645 -240605 -155748 -130271 -142552 -54837 43104
23821 43104 31435 -66569 -111423 -213050 -140475 -33384 -108594 -287492 -427958 -375742 -160679
23810 -160679 -144561 -279721 -124934 193097 210235 152422 125304 44922 -129450 -210000 -157334
23799 -157334 -127112 -33419 -150748 -125325 -300739 -420814 -477177 -429922 -314721 -118898
23789 -118898 24017 105267 159886 125700 -101845 -223008 -131972 -135779 -129029 -119878 -53690
23778 -53690 -190302 -223065 15523 91880 8355 -332171 -286907 -178287 -49680 172426
23768 172426 223841 214279 -42408 -234708 -629011 -552611 -465687 -458264 -217194 -72317 96329
23757 96329 119804 -156259 -193960 -66783 58476 83990 -137323 -403334 -537485 -502923
23747 -502923 -429435 -342937 -293660 -365336 -517122 -561274 -450336 -295346 -303908 -347346 -210925
23736 -210925 -120711 -128388 -125619 -23130 -99935 -92863 -18595 -262351 -161427 -93681 53639
23725 53639 109295 46429 123848 301975 184026 74278 211958 61535 -52107 -23419
23715 -23419 23684 -23934 126055 81686 -149986 -277693 -272560 -190895 -169028 46444 55782
23704 55782 52337 148883 139980 66194 -95478 32369 135091 172576 139831 178068 163628
23693 163628 -129855 -200000 -173857 -103675 -266553 -248476 -5489 305711 283407 414676
23683 414676 270927 42443 -154249 -215598 -12825 81741 178852 187329 38877 -151922
23673 -151922 -99087 209363 255365 222557 -78350 -61425 101142 105826 -21786 -83981 -134930
23662 -134930 -263296 -266093 -410356 -484031 -310186 -73305 -21587 -124639 -108374 -207102 -341514
23651 -341514 -352243 -446580 4815 135692 111603 114471 78679 -22612 -246515 -461295 -49524
23640 -49524 5970 -171049 -142500 -126880 -281459 -459250 -448884 -342924 -187162 -62031
23630 -62031 -139726 -18160 211230 218717 -47500 -84359 21068 -2567 -18483 -68342 21282
23619 21282 89890 -11048 -129269 -23370 -41719 -20911 52832 152869 208070 184826 407144
23608 407144 314672 391327 181414 219320 460942 374882 256281 581 -118129 -3784
23598 -3784 -71983 -70591 -74971 -111254 -23835 158945 27670 -145591 -72265 42002 -33135
23587 -33135 -155878 -69981 -204799 -389787 -283579 -48376 171364 -25675 -23126 22509
23577 22509 167678 376044 347410 119062 -29703 -128801 -183523 -70264 214494 6811
23567 6811 47436 135556 62659 -145744 -204637 -233455 -291630 -370022 -377493 -434667 -551807 -594501
23555 -594501 -391406 1639 -43725 -246249 -307997 -322871 -344650 -338188 -380747 -488693 -449749
23544 -449749 -255567 -114329 46470 4984 -23339 -7080 -76863 -232315 -180830 -96958 -167684
23533 -167684 -180725 -155988 -357162 -315570 -322297 -190215 -87670 -265397 -89325 37836
23523 37836 -174537 -134393 -71603 -174394 -429549 -452462 -406200 -311600 -135452 -83889 -56822
23512 -56822 39360 -159792 -176267 -227921 -417710 -433114 -269000 -276905 -322645 -248944 -275406
23501 -275406 -174238 -204146 -144228 -10827 -4737 -24093 14704 179737 116558 -57714 -80062
23490 -80062 10143 -137999 -262310 -105696 16721 12126 28308 98604 185844 234691 160662
23479 160662 136904 147691 126222 -158202 -514522 -560139 -378037 -368600 -128369 151126 137065
23468 137065 166146 46245 13170 -15243 -190057 -216607 -82241 -32908 -110485 -200693 -267813
23457 -267813 -96158 -109195 -281900 -284402 -422752 -301611 -99665 170459 414924 565648
23447 565648 581050 326475 -85735 -308216 -250285 -225956 -271052 -200981 56944 312545
23437 312545 181965 48630 159692 190264 140272 -52666 -35804 149297 -76072 -295981
23427 -295981 -61696 -87081 -262031 -121063 -69468 -287215 -327543 -314796 -176538 -205889
23417 -205889 -266569 -123273 132407 -83147 -214603 -20242 236317 110294 -57151 -212736
23407 -212736 -299093 -341174 -311339 -311926 -244395 -246179 -207739 -364983 -407565 -182809 -20524
23396 -20524 -41802 -287461 -414781 -220704 -194980 -162271 -3916 -82117 40769 -31977 -300607
23385 -300607 -344081 -12409 440210 301436 14979 -70930 -94619 -82692 108694 102768 -48576
23374 -48576 72463 290746 253916 76720 79789 196521 103201 94973 -56258 -207787 -94138
23363 -94138 -83979 -4379 -50067 6433 74681 -157721 -66028 107741 28995 -125598 -174698
23352 -174698 -150957 -108542 18399 230812 107647 -191613 -303822 -28674 94081 -67255
23342 -67255 -3205 -48397 -121819 52978 81215 -160705 -278010 -241094 -345502 -90062 111581
23331 111581 136155 -40048 -80893 -68599 -81488 -138565 -63280 -40090 45708 129099 283577
23320 283577 245679 87171 71917 10813 -32353 -65473 -10555 75415 23121 11517 113883
23309 113883 153941 143421 23531 -149260 -107464 -130963 -328955 -465975 -306527 -124995
23299 -124995 -144451 -102640 -45162 -91898 -219814 -183678 -79412 -110490 -220943 -80004 -44285
23288 -44285 -177626 -234831 -81513 89153 -52147 85415 43636 -106290 37823 -6841
23278 -6841 -5132 -138301 -87541 10756 -22342 -83092 -190234 -277437 -181240 29059 73110
23267 73110 -58861 -146019 -48479 172626 -19640 -119009 -134230 -214968 -137165 -170894 -244027
23256 -244027 -107867 -57493 83593 194449 207759 266990 82232 -32305 -146931 -339842
23246 -339842 -364376 -156340 38464 46460 283183 139529 171054 25901 -100824 216558
23236 216558 309936 120816 78613 170271 327173 497048 216561 192539 -19564 9221
23226 9221 62375 89046 157225 230667 116477 -81559 -145042 -180308 -95593 -242827 -298405
23215 -298405 -236005 -274099 -410979 -240656 -230915 -294476 -313452 -337618 -291184 -98587 -61060
23204 -61060 -138922 -170421 -178993 -102756 -83506 -112877 -274912 -249653 -319905 -509627 -437056
23193 -437056 -379488 -257928 -253421 -257715 -207797 -108015 198 -208810 -175924 -3113 -145578
23182 -145578 -401899 -449297 -426392 -273957 -366148 -240216 -6659 -34354 -381665 -381995 -344863
23171 -344863 -439923 -485435 -623612 -460071 -248408 -182386 -271125 -200523 -187190 -269596 -359159
23160 -359159 -465114 -362560 -202872 -371167 -565552 -508083 -299848 -107666 -290428 -449981
23150 -449981 -281973 -56840 12210 -53204 -21974 39775 204383 182095 12134 92035 113816
23139 113816 -216362 -346174 -200983 -48162 -152314 -27980 82715 24859 -89969 -409392
23129 -409392 -350323 -467822 -486968 -351372 -223296 -97719 -100021 -201960 -213128 53086
23119 53086 86852 -11933 -190693 -16113 21361 50675 170806 170544 -13172 -146262 -53959
23108 -53959 -356584 -391640 -58260 -238461 -306923 -416502 -349392 -154143 -150873 -233135 -86876
23097 -86876 -9681 12068 133910 310885 292945 243142 48684 -46485 -49329 -177388 -353800
23086 -353800 -383897 -170664 -74514 -170724 -233609 -118053 37265 102485 -4267 -236186
23076 -236186 -403546 -215647 -9539 -206550 -209047 -207850 -108803 -29230 37467 37573 -294854
23065 -294854 -369272 -233819 -96205 -17078 -63945 -17885 -87397 -334770 -270662 -94178 -35546
23054 -35546 15396 86410 169893 79994 -134563 -98670 -194344 -161426 -233095 -325484 -289722
23043 -289722 -262749 26760 109374 11720 73802 123063 222616 166895 212427 257105 210067
23032 210067 120507 -142801 -176008 -190772 -213574 -173879 7982 -26742 31786 18906 -108004
23021 -108004 -296120 -345282 -158543 -56100 -121966 -106144 -131762 -87909 -309333 -214962 -7356
23010 -7356 253066 204216 102189 -193256 -199737 -102334 -4624 51400 98257 104188 74783 204239
22998 204239 -40950 -70893 21257 -133390 -408131 -346616 -53062 157562 268047 324372
22988 324372 182882 11697 -104236 8218 85176 204318 76041 -59858 123189 51018
22978 51018 190977 124204 -100607 -72272 232783 222610 106087 44919 59074 57023 205949
22967 205949 331269 53487 -10104 -33226 -69809 -48083 -74672 -70375 -129644 -93941 -208650
22956 -208650 -429345 -189202 -9177 -60507 -145093 -159419 -8645 98695 -82828 -142627
22946 -142627 -64529 -220355 -516160 -499585 -325153 -158850 44988 -32459 -31140 84941
22936 84941 157417 47702 11162 -94228 -366526 -368152 -277959 -456479 -586197 -476353 -187211
22925 -187211 12025 15991 14400 -32669 -87855 -268927 -193262 -6995 67310 27577 160375
22914 160375 27779 -181345 -67188 -7443 -316 61665 -10426 -240525 -353458 -339136 -142414
22903 -142414 -112976 -171089 -45211 -16628 150511 -25131 -382382 -492416 -328259 -502449
22893 -502449 -617184 -603248 -426405 -256499 -223391 -110845 -74602 55829 -27511 26898
22883 26898 -76545 -134089 -53974 -4055 -173147 -199702 -11179 175640 76553 76161 269478
22872 269478 184930 -167876 -283683 -138133 -17078 -38545 94756 130416 -108910 -303649
22862 -303649 -299950 -259422 -298013 -332439 -159712 -92993 -115563 -49806 29014 -200683 -180716
22851 -180716 -129878 -324316 -412202 -263973 -20637 -3669 298442 167962 -99551 86837
22841 86837 233294 155762 138842 61249 -46899 264629 142438 -58267 -244467 -310286
22831 -310286 -194609 -335299 -426907 -191265 75170 40840 156721 646324 588124 354153
22821 354153 396230 122790 -16681 -186670 -300058 -92854 12413 -92957 -239258 -331946
22811 -331946 -195547 121131 99406 -15531 40375 64109 13286 7119 217185 148290 77107
22800 77107 -42948 -203610 -275110 -322089 -473506 -307239 -212392 107166 255602 288164
22790 288164 172899 -65493 -23636 106532 131626 245094 344181 204483 -30595 29448
22780 29448 174706 80533 -285738 -281003 -165796 -114543 -29645 -6914 -82631 -145555 -202525
22769 -202525 -180796 -148732 -102315 -78761 -150824 -231163 -127188 -94305 -247820 -314640 -506160
22758 -506160 -535593 -478922 -378025 -325261 -303124 -339724 -233616 -131876 -214876 -316798 -380900
22747 -380900 -202633 -39023 -129559 -294395 -383136 -258128 -211898 -279406 -414259 -420243 -393207
22736 -393207 -185220 67860 189858 -40479 -127010 -44970 224478 205502 32361 -219094
22726 -219094 -304421 -70158 7611 151860 172859 123504 130501 28158 -95788 151849 123738
22715 123738 64641 121979 189815 123292 -53686 -146025 -120843 -83079 281024 230058 46228
22704 46228 -39456 24059 -20975 -112128 -251197 -349002 -151932 141459 206117 143551 -23923
22693 -23923 -179463 -228796 -73515 103409 173131 -11961 37870 54177 160220 97180 249693
22682 249693 200170 98440 -65787 140589 99903 -57180 22587 76337 152131 241483 291330
22671 291330 236798 130712 66765 113229 114794 94208 142508 24560 -228571 -210451 -24519
22660 -24519 -32841 -6807 29580 -62717 -339894 -403570 -150809 31148 -99629 -308445 -369092
22649 -369092 -422706 -339575 -135791 264286 498377 461781 194787 -253280 -255878 -196539 -58722
22638 -58722 -10404 124105 222669 -1963 -86333 -189561 -322658 -242492 -96655 64770
22628 64770 -140793 -155025 -56392 -78245 -292122 -361178 -256220 -60394 103783 220212
22618 220212 242772 350201 250121 109724 -102507 -134670 3232 130568 160724 -21820
22608 -21820 -115273 -257835 -384048 -383128 -82718 -128264 4208 54872 -122395 -23400 122858
22597 122858 102859 66674 -158737 -129071 -261835 -237122 -102529 -42709 -166028 -167800 -167869
22586 -167869 -197806 -24040 -14196 -69406 296290 314912 146903 104737 188849 104722 59257
22575 59257 32737 263006 124610 40642 -299 -187473 -146924 -229488 -173200 -240234 -141153
22564 -141153 -35452 -52764 -153966 -116404 56226 165071 326054 147091 -241 -88182
22554 -88182 -28674 103121 26668 -80364 -133479 -176754 -355570 -343479 -187685 -52360 20462
22543 20462 115376 114871 6404 -139679 -258237 -271624 -261753 -150041 -188959 -107311 14884
22532 14884 49235 215286 317875 77963 -53206 29344 -57578 -128123 -146804 -167669 -151700
22521 -151700 -286194 -272106 -140780 -130897 -135186 -188070 -185234 -112765 -128084 -155764 -123066 10886
22509 10886 236518 179476 30981 12495 -42010 -277332 -407315 -355362 -155987 -173073 -355951
22498 -355951 -174143 -200509 -141566 76129 321007 18063 -268864 -283557 -248005 -206587
22488 -206587 -116473 -228072 -343793 -15170 -116494 4595 -28032 -13032 -36593 -277612
22478 -277612 -207123 8194 45526 132429 133595 -81053 37469 -84358 -33750 5189 154427
22467 154427 288661 292749 212773 16740 -93365 -103038 51783 43722 129455 -19865 -193206
22456 -193206 -325800 -113411 163906 151761 119168 217226 138675 -36344 -128062 -259744
22446 -259744 -179320 -8135 142895 131494 71564 69225 157759 210367 135510 321643 320611
22435 320611 73363 -140853 -3998 -17786 94828 229677 110938 -117594 -64275 -217399
22425 -217399 -128973 -68903 27303 157224 172889 192169 -8898 -182174 -41490 108373
22415 108373 -188582 -254038 -20623 71426 153858 39760 131776 149241 -7535 -166060
22405 -166060 -268895 -388861 -375825 -262413 -172334 -145984 -78797 76929 -89337 -116327
22395 -116327 -5423 -82171 -149036 -66388 -78853 -206764 -219812 -236760 -446696 -327321 -101626
22384 -101626 46207 174660 123386 191300 187068 259985 187581 35425 13648 -12362 13240
22373 13240 -160901 -288577 -168033 -208140 -310778 -435864 -477168 -256165 -327201 -481086
22363 -481086 -429856 -412496 -329830 -255249 -399600 -498530 -389116 -217648 -118160 -52198 -27386
22352 -27386 20643 -1749 96444 105493 188271 47427 42909 7138 39882 42638 32554 137504
22340 137504 195097 61498 173868 -67916 -354021 -96353 -213829 -282398 23475 92106
22330 92106 -9541 -37569 -225805 -213798 -19755 9845 184234 307246 167484 91251
22320 91251 -77699 -210648 -90244 138292 29179 -81652 -151156 -24740 14051 -139464
22310 -139464 -63651 -60877 -70182 -204242 -281065 -234929 14629 -125825 -146637 -150180 -265465
22299 -265465 -470445 -237650 21075 103607 150659 -3222 104599 169354 279314 302975
22289 302975 113442 216431 150380 172438 118259 239859 186068 40915 -180213 -79413
22279 -79413 -112325 -150715 -49230 -8421 175210 245993 295092 197189 -129578 -326733 -146461
22268 -146461 -304609 -407292 -244561 -153800 114483 26130 -24238 -136553 -196931 -159236
22258 -159236 -257474 -305541 -375563 -415209 -625073 -571234 -392210 -136892 -50972 -228851 -206009
22247 -206009 -159282 -206654 -103650 -86329 -169443 -178187 -166781 -108377 -120575 -237994 -61866
22236 -61866 41752 116055 201291 272701 171807 -64497 -35438 -53070 -120566 -119857 -35241
22225 -35241 -111810 -264350 -394267 -378272 -478345 -265477 -210412 -143497 223767 189007 266377
22214 266377 247338 132108 109475 186110 153647 53377 83841 140470 285625 283901 101252
22203 101252 172781 96268 202500 394150 198082 42660 101672 37206 -65284 3023
22193 3023 45624 -72422 -43950 -165539 -143142 159005 244671 -135581 -337433 -121884 126734
22182 126734 336813 319821 150156 269227 294616 110588 197796 179238 148475 -144977
22172 -144977 -172512 -304242 -457279 -543366 -503969 -184926 90845 -89513 -92871 -87585 -169028
22161 -169028 -217517 -303008 -309744 -144146 -85155 -99295 -90493 -173712 -182372 -164956 -14239 116748
22149 116748 -12739 -125020 -282766 -317328 -236073 -7066 34348 33973 142661 164580 150754
22138 150754 14156 -56861 -40266 -60751 -203571 -296766 -216284 -332839 -308769 -319972 -240505
22127 -240505 -194570 28110 -40715 -185815 -139089 -17326 -103705 -141403 -205123 63261 -95281
22116 -95281 -259336 -135782 108718 189385 135112 276633 225161 114456 84930 319180
22106 319180 289395 168382 71289 67197 -91508 -153293 74959 -9743 -171774 -175224 -119495
22095 -119495 -1032 226360 200462 284403 210061 -477 -3249 -96327 -241040 -186021 -41641
22084 -41641 86685 106737 -47085 -142695 -387878 -406151 -290605 -265007 -133032 749
22074 749 80276 88765 202812 89807 6294 100405 444072 506949 376371 44746 94973
22063 94973 -26144 -166013 -381646 -326072 83782 79827 142664 265446 211322 386921 466275
22052 466275 370056 300823 307975 228308 354853 307357 72422 -60631 87637 213591 128624
22041 128624 -73066 -119547 -121067 -308995 -104102 -18041 16355 -163054 -342090 -318895 -371023
22030 -371023 -158801 -70483 -196659 -24722 284037 439561 480742 326673 54589 -133481
22020 -133481 -176872 -160050 -39545 109233 197816 -16343 -187083 -308449 -11081 309405
22010 309405 259149 119495 95661 85244 176175 185191 233655 44306 -127852 -484827 -470611
21999 -470611 -408153 -390582 -530703 -484747 -206424 17966 140322 167313 165431 48920 64772
21988 64772 43721 -43978 -303416 -296116 -210952 -138664 -8697 -63262 -137603 -88125 -150788
21977 -150788 -156266 -20774 -20607 50353 -264985 -492082 -205634 46764 120222 198620 265637
21966 265637 -64560 -159046 180700 345774 445585 393313 299605 252696 135202 -27567
21956 -27567 115640 106156 403694 389441 178495 182462 276031 360826 344376 280545 49516
21945 49516 -19505 117127 112426 85970 149874 155527 47675 91002 71400 -40520 -7765
21934 -7765 153934 314555 376662 291152 376172 445371 404340 316867 239927 392255 296852
21923 296852 438748 369917 124894 -21379 -191323 -190685 -193359 -278987 23833 314168 437697
21912 437697 235214 295380 235496 135106 12097 -13262 50635 32724 -54552 -33453 114124
21901 114124 391024 617607 401314 118940 148619 252128 131687 199274 155527 78647
21891 78647 -19214 92421 214318 217242 29306 9661 -123703 -293631 -154041 -342158
21881 -342158 -201006 32811 105651 -49383 32515 94787 167211 200180 159683 190201 295176
21870 295176 138324 145197 291362 438506 424354 318963 421723 303670 168091 135009
21860 135009 153663 346419 549715 377664 115146 113717 183612 52505 112770 164406 99959
21849 99959 92986 38884 59353 118401 96955 77673 227715 174739 -192879 -344126 -243449
21838 -243449 -3022 307615 605384 661635 433432 198813 280996 138215 57529 198329
21828 198329 294503 465783 469034 333211 295136 101603 -201258 -102834 109737 272509
21818 272509 161709 -145705 -161969 -115487 31606 155611 267435 334427 300518 267165
21808 267165 81300 22439 297832 315416 325931 244952 108954 -39102 -119987 -65680 -210926
21797 -210926 -159983 -27558 -17958 -57143 -104925 45758 311751 489931 285301 303666 514837
21786 514837 499677 311986 151249 247411 239987 199261 124627 305033 583123 682523 594577
21775 594577 275069 156542 229512 329918 485560 579165 769939 792002 813793 635495
21765 635495 590645 509034 279547 111327 174801 25015 46187 187404 336758 138818
21755 138818 -62622 -15448 190619 188498 -8775 119929 259737 271377 351437 112892
21745 112892 161676 95649 104226 174314 149208 242590 207340 36973 110321 240360 311165
21734 311165 429045 226174 13629 159731 137731 178999 320768 376377 513652 416770
21724 416770 210073 341904 271274 231391 226822 258820 176168 55312 68777 164136 404231
21713 404231 670977 424434 170304 -144199 -150067 -133977 -186077 -60605 143115 268626
21703 268626 193437 47807 -155848 -94131 218272 100749 60735 59720 134746 308132 157141
21692 157141 88541 156784 205655 349254 246377 114629 160180 342484 150763 -6667
21682 -6667 57515 124980 237867 246508 346707 249756 357944 437419 369375 212075 240676
21671 240676 432325 684210 725435 682743 675250 558021 435137 374638 331356 461326 501180
21660 501180 459484 471791 499835 356506 292163 305263 387835 513290 551651 393878 155556
21649 155556 -77898 97239 395183 260023 213291 183949 -99758 -44235 412661 454750
21639 454750 244905 207603 246103 336730 523318 628367 579800 420017 430584 483134 446221
21628 446221 453251 418921 268488 479033 563811 447926 405499 279936 594019 655926 475504
21617 475504 517267 557727 540756 385758 341578 494840 471019 302896 157434 135275 50754
21606 50754 57470 -3222 -66093 40611 214570 79490 -4280 148993 303465 244520 221883
21595 221883 299260 257228 238115 246177 325672 656954 643188 658436 693022 589975 569294
21584 569294 538378 381737 453720 293589 141904 270976 393846 472479 347834 123905
21574 123905 365783 582021 600214 428090 329687 435071 574657 513144 480463 462988
21564 462988 324055 269195 328421 361707 375939 401007 461806 511886 210082 43440 387582
21553 387582 579094 262341 172288 267298 318570 474579 642539 774711 676685 625969
21543 625969 688702 778904 676845 562902 713674 851806 799416 725331 777946 522408
21533 522408 532170 514415 449994 572591 724985 735426 607571 492033 351476 386855 410212
21522 410212 459567 516374 675442 682414 494432 232595 228398 438592 650635 697412 533350
21511 533350 482031 492323 479980 469049 665070 635750 565444 492890 471815 502265 492554
21500 492554 525537 686469 709844 805720 579481 584377 822276 832660 604136 517223 452542
21489 452542 301581 358498 325665 235316 310820 377057 591146 568640 702829 613291 582998
21478 582998 468890 570783 496528 397610 447319 484409 450436 426946 633173 701897 513061
21467 513061 270397 438461 504934 336005 321525 466770 675760 808487 944943 770684
21457 770684 619504 602332 812374 1120414 1054514 644389 219692 158615 376026 442393
21447 442393 448726 729494 782462 682590 599651 489436 515637 633960 488527 416832 497668
21436 497668 475297 377408 426836 486283 536166 550435 568916 546084 552001 531981 415645
21425 415645 381038 360802 587871 607160 539617 625291 903089 1117351 1096527 986944 783707
21414 783707 568306 645106 756987 738281 592226 434244 500257 675010 757301 709192
21404 709192 818634 975317 863540 644943 364111 303797 559712 891537 955904 869741
21394 869741 731113 884725 838360 560231 585175 739522 652322 665862 795355 756106
21384 756106 716922 756374 624290 546177 436104 370725 698189 731768 658483 708569 898695
21373 898695 926113 899696 869011 698872 939578 886572 919480 995523 701267 560718 530131
21362 530131 552062 643652 734653 671911 858837 876445 875084 650478 683167 712851 970517
21351 970517 942934 709169 642593 678024 640442 600119 723557 828247 877242 845233 756554
21340 756554 892832 949200 943634 1007327 844559 841502 641887 777453 885962 769200 641277
21329 641277 582718 780278 879940 757625 867713 841434 996906 1056592 1188615 1244408
21319 1244408 1025269 1037051 1101233 988890 868793 850240 914481 937949 1054385 1047838 909241
21308 909241 895978 821734 761811 766547 627109 919710 1091366 1052124 1101389 1246120 1257959
21297 1257959 1091890 1001850 841158 856862 854807 1093686 1090910 985219 996179 1185346 1422766
21286 1422766 1518497 1551631 1369734 1557507 1650121 1394011 1263873 1208183 1088703 1031311
21276 1031311 920631 909687 901197 997483 1131478 1147017 1087413 1125076 1167845 1243370 1133318
21265 1133318 1182406 1202702 1016244 988892 1366646 1446349 1312398 1369848 1407946 1185628
21255 1185628 1015990 851961 971243 1022600 948574 1109113 1442797 1420330 1306558 1190362
21245 1190362 1216705 1308766 1439636 1434068 1175326 1124661 1308310 1470497 1546590 1533437 1491444
21234 1491444 1452743 1332444 1470988 1793127 2059401 1799902 1524857 1585176 1759587 1850445
21224 1850445 2002892 1965783 1727673 1682120 1811635 1838058 1615034 1686691 1766386 1791336
21214 1791336 1725437 1520842 1364455 1252578 1252857 1428011 1343903 1306648 1525341 1538012 1366779
21203 1366779 1241722 1249051 1600090 1722090 1623643 1694507 1841562 1800004 1542307 1343456
21193 1343456 1234638 1237569 1377700 1668921 1660552 1440431 1352268 1226050 1378536 1309476
21183 1309476 1266612 1557468 1631724 1625801 1613116 1507292 1670595 1812610 1793651 1904941
21173 1904941 2043693 2156624 2118423 1989640 1948108 1965951 1672010 1507782 1506253 1548488
21163 1548488 1576653 1639209 1713454 1723035 1791580 1962606 1866033 1742762 1695496 1628120 1643876
21152 1643876 1703985 2012600 2145970 1967300 1895315 1828096 1829996 2026008 2104210 2139924 2305780
21141 2305780 2337747 2280244 2264680 2233949 2276699 2249335 2221427 2221896 2369031 2594878 2539056
21130 2539056 2367610 2373327 2444171 2333961 2203850 2077864 2116818 2297015 2394355 2413416
21120 2413416 2278166 1985256 1811928 1882915 1970635 2224356 2294393 2280312 2251107 2131980
21110 2131980 2165178 2099976 2121957 2393275 2656384 2759699 2692678 2599705 2697470 3000662
21100 3000662 2991632 2823700 2858823 2861150 2786533 2581887 2458717 2475716 2639408 2595596 2704654
21089 2704654 2755474 2786176 2806086 2634281 2738254 2862851 2810191 2724063 2622510 2648335
21079 2648335 2706809 2783651 2686185 2602035 2687294 2798105 2646039 2732670 2870892 2724339
21069 2724339 2979170 3256958 3378543 3219035 2976967 3224332 3363100 3295247 3219580 3061786
21059 3061786 3031371 2974027 3018343 2938424 2811063 2914375 3323570 3390150 3183712 3093965
21049 3093965 3142922 3228931 3220557 3306737 3529993 3716986 3730116 3708758 3743574 3674017 3485070
21038 3485070 3679583 3824614 3735489 3818078 4092059 4067036 3946932 3981365 3734900 3814374
21028 3814374 3955222 4076370 4217515 4325834 4326561 4165688 4311169 4506926 4454684 4353073
21018 4353073 4278012 4217390 4079203 4293491 4348417 4197266 4184160 4197304 4207878 4024875
21008 4024875 3940343 3909115 3792514 3977587 4024204 4123630 4146345 4431032 4357689 4123167
20998 4123167 4035818 4083257 4133382 4209863 4409646 4734259 4830666 4763948 4702901 4921265 4996839
20987 4996839 4766449 4622470 4677290 4794380 4978853 5117702 5239688 5361708 5220587 5336574
20977 5336574 5341023 5351340 5387731 5596599 5799860 5682852 5688144 5835210 5690380 5482786
20967 5482786 5586597 5753965 5706568 5571910 5520657 5659374 6032946 5996168 5948601 5952848
20957 5952848 5968793 6101565 6251033 6217578 6167979 6251122 6355144 6452524 6639955 6654077
20947 6654077 6628037 6703992 6696037 6612987 6433358 6285503 6305381 6542911 6783072 7007286
20937 7007286 7347232 7178726 7328192 7343919 7295255 7335553 7378729 7613745 7730802 7801013
20927 7801013 7879017 8091253 8079518 8135576 8056675 8119850 8160461 8267343 8274621 8667870 8897837
20916 8897837 8804373 8771421 8725729 8787219 8908584 8959518 9078594 9213764 9162272 9314411
20906 9314411 9312598 9262237 9154932 9197517 9195114 9189604 9605355 9761374 10007086 10131508 10189448
20895 10189448 10305739 10457260 10556137 10617417 10792038 10594889 10510605 10648846 10850178 11249283
20885 11249283 11376464 11551436 11657976 11644731 11766560 11655791 11752307 12225696 12235705 12211529
20875 12211529 12081203 12153406 12367041 12536292 12697370 12784598 12975864 12889677 12929871 13077009
20865 13077009 13072513 13321297 13543560 13555237 13460729 13554446 13748243 13875241 14039436 14053695
20855 14053695 14193969 14524016 14694637 14818793 14965905 15152258 15530924 15780477 15714493
20846 15714493 15681191 15916397 16014799 16195117 16489154 16632840 16746640 17037860 17246262 17460321
20836 17460321 17636136 17835371 18005815 18071298 18030576 18161166 18300827 18512474 18633693 18728191
20826 18728191 18898980 19199604 19493941 19788798 19958968 20164923 20345023 20669358 21058124
20817 21058124 21382654 21372265 21396942 21817286 22155528 22540493 22992534 23108753 23246430 23570927
20807 23570927 23760343 24136768 24444885 24742632 25151955 25471899 25669930 25895447 26372356
20798 26372356 26771377 27200839 27664909 28035182 28357444 28825907 29106259 29298342 29776826
20789 29776826 30258957 30637215 31077358 31584813 32031059 32359808 33030694 33703956 34102291
20780 34102291 34531546 34998802 35568525 35981197 36361033 37004881 37685071 38286831 38898334
20771 38898334 39606802 40550489 41401200 41962392 42381475 43220679 43954770 44588509 45389592
20762 45389592 46133518 46765746 47375915 48249253 49343135 50348710 51151921 52150858 53052312
20753 53052312 54017672 54889916 55745417 56789860 58074460 59174290 60276325 61001486 62074564
20744 62074564 63428633 64841746 65850493 67057069 68284546 69512538 70790191 72257836
20736 72257836 73921823 75442154 76875200 78142575 79545990 81230799 82996326 84606560
20728 84606560 86198506 87762630 89597880 91415721 93230554 95195033 97208084 99199758
20720 99199758 101007330 102698187 104788416 106957192 108924456 110976384 113274288 115485868
20712 115485868 117532740 119806836 122090430 124460507 126803369 129079494 131308966 133585162
20704 133585162 135937303 138429565 140775137 143090032 145573230 148152835 150529160 152919511
20696 152919511 155323914 157390914 159649825 162171839 164664275 167137312 169524178 171793710
20688 171793710 173956544 176066579 178296422 180486176 182904937 185398581 187619800 189625129
20680 189625129 191611084 193700443 195726123 197625021 199881068 201897191 203713616 205683066
20672 205683066 207610290 209265856 210872733 212678139 214165304 215515868 216805305 218269873
20664 218269873 219668165 220907562 222168998 223210705 224225500 225227170 226107593 226858220
20656 226858220 227439753 228023849 228560882 228912281 228983546 229187217 229439836 229425746 229174073
20647 229174073 228786432 228411408 227979919 227371943 226866580 226076859 225229169 224468201 223622792
20638 223622792 222451844 221184887 219989222 218584642 217064169 215663077 214058378 212442640
20630 212442640 210795519 209291420 207729674 206207669 204462866 202688893 200678863 198632827
20622 198632827 196734610 194659148 192612362 190529786 188247716 186019007 183877529 181801914
20614 181801914 179656994 177250659 174758368 172432696 170158341 168044820 165858362 163585897
20606 163585897 161107690 158699902 156359915 154261688 151892888 149376629 146902109 144427805
20598 144427805 142140758 139804508 137196898 134923491 132530674 130023569 127891204 125882823
20590 125882823 123639710 121385887 119261231 117253341 115029675 112916490 110559386 108611526
20582 108611526 106980996 105044048 102980597 100988448 99001435 96995471 94990074 93162439
20574 93162439 91505899 90045630 88354309 86630056 84962105 83198308 81581918 80161543
20566 80161543 78811805 77599052 76317476 74844280 73456115 71941439 70464254 69298118
20558 69298118 68225565 66864007 65621837 64414536 63208288 62103674 61040505 59827212
20550 59827212 58810449 57919658 57127832 56140181 55067287 54163506 53426066 52513745 51567059
20541 51567059 50689624 49828010 49048983 48342810 47592267 46763356 45990412 45258502 44306794
20532 44306794 43435215 42976740 42354057 41697082 41254436 40703615 39918226 39199561 38576093
20523 38576093 38070979 37565294 37066562 36354779 35933537 35492042 34854291 34079355 33662385
20514 33662385 33226703 32780554 32209555 31873281 31728012 31522481 30865150 30369746 29924802
20505 29924802 29523807 29184609 28687099 28287291 27917660 27603809 27211449 26785994 26533026
20496 26533026 26396195 26163277 25724206 25162656 24679500 24452971 24130208 23980032 23732948
20487 23732948 23736311 23492262 23113882 22831443 22697653 22280455 21884577 21629808 21266714 21004098
20477 21004098 20857883 20569499 20311660 20119715 19961047 19958537 19847011 19516023 19227910 18979000
20467 18979000 18813751 18769044 18868792 18748071 18609601 18503958 18015235 17657610 17475616 17246620
20457 17246620 17042893 16966335 16971320 16654955 16442792 16183834 15967739 15755515 15568817 15596904
20447 15596904 15343590 15179279 15170597 14939623 14875138 14649884 14604959 14487867 14360322 14422150
20437 14422150 14208702 13893592 13811233 13726713 13701256 13610572 13539296 13498781 13524551 13611742 13726889
20426 13726889 13832634 13629079 13263027 13194969 13138420 12874598 12821251 12903637 12724429 12473774
20416 12473774 12173640 12096497 12052517 11823647 11596980 11547410 11251611 11011883 10875976 10830482
20406 10830482 10617087 10547851 10618973 10418479 10152930 10103842 10123015 10253942 10199939 10295347
20396 10295347 10329537 10196193 9991774 9841617 9550988 9421310 9681606 9748663 9487013 9247033
20386 9247033 9174979 8965805 8943327 9160574 9438279 9617776 9408904 9272494 8966079 8824892
20376 8824892 8728753 8580880 8411616 8130575 8126512 7877092 7668579 7818107 7722287 7575417
20366 7575417 7360542 7272456 7417493 7461924 7398293 7316542 7240691 6960776 6851526 6908538
20356 6908538 7247836 7250682 6975340 6826746 6917541 6861140 6735427 6709883 6490275 6306310
20346 6306310 6562507 6561392 6511817 6690124 6903490 6919459 6642777 6298084 6328786 6466281
20336 6466281 6315685 6301619 6404208 6126895 5938777 6105871 6058607 6003722 5860655 5735045
20326 5735045 5700155 5692322 5842505 5952574 6133574 6076659 5852827 5602544 5479011 5490192
20316 5490192 5572949 5418122 5567312 5657565 5566798 5521049 5529795 5591878 5561931 5428190 5315818
20305 5315818 5185647 4982970 4834765 4841466 4587305 4621703 4761005 4883382 4948911 4863773
20295 4863773 4679347 4434615 4387503 4593542 4808206 4683391 4630649 4604267 4605000 4617508 4593152
20284 4593152 4461766 4307392 4305902 4354552 4269204 4285338 4316287 4280155 4304271 4497563 4813580
20273 4813580 4722471 4746259 4756850 4578056 4374903 4077665 4014867 4013138 4162211 4382072
20263 4382072 4410428 4195541 3969483 3741174 3864677 3927374 3870354 3850951 3992193 3979729
20253 3979729 3835629 3624422 3556018 3477545 3507361 3412154 3458357 3515819 3606241 3620218 3547930
20242 3547930 3442732 3450997 3441822 3524458 3501298 3401765 3360581 3314999 3289380 3403882 3399679
20231 3399679 3089320 2931612 3004761 3262296 3387481 3264269 3219038 3376560 3452056 3221840
20221 3221840 2926135 3039658 3253690 3288655 3155412 2931240 2702912 2908689 3049372 3046244
20211 3046244 3093746 3005030 2980939 2924344 2892241 2971420 2955778 2747871 2521995 2500929 2657142
20200 2657142 2707774 2760684 2630285 2614483 2823196 3066166 3053346 2919975 2913440 2856830 2895515
20189 2895515 2825102 2732613 2483210 2649183 2877013 2746367 2679841 2550467 2375042 2498058
20179 2498058 2404619 2454806 2384435 2562069 2692216 2590658 2726473 2743424 2637228 2474126
20169 2474126 2439081 2560383 2543645 2400632 2486781 2431192 2351763 2319648 2267634 2281387 2301747
20158 2301747 2195185 2078802 2113886 2121615 2047050 2188185 2267155 2007137 2130241 2179693
20148 2179693 2093980 2173329 2110787 2162238 2078697 2300182 2543908 2609664 2583713 2202582 1758885
20137 1758885 1924290 2029302 2061248 2141761 2141278 2239710 2256602 2044922 1971799 1739216 1746163
20126 1746163 1972286 2033752 1903479 1753694 1723326 1687528 1628159 1788258 2025095 1971018
20116 1971018 1835578 1810751 1955862 1903988 1854210 1789118 1800940 1914511 1769946 1481179
20106 1481179 1594438 1800231 1801725 1786540 1740755 1571044 1496303 1519468 1704902 1814386
20096 1814386 1839734 2004711 2006083 1777214 1588498 1397847 1322771 1329321 1606481 1838875
20086 1838875 1686212 1607468 1512358 1648962 1654995 1483986 1649066 1707547 1495434 1566041
20076 1566041 1750890 1801141 1710971 1707737 1607305 1230838 1179475 1258255 1235673 1045945 1180769
20065 1180769 1558825 1591801 1619592 1755979 1724312 1699512 1553898 1653209 1888707 1899915
20055 1899915 2024473 2223132 2194091 2229982 2592331 2863200 3029046 3043156 3069034 3084846
20045 3084846 3064923 2728609 2669073 2569722 2585165 2469711 2293601 2253492 2216589 2173601 1978606
20034 1978606 1800981 1788472 1736052 1786665 1813245 1879158 1719529 1824303 1651367 1540315
20024 1540315 1478838 1298124 1355218 1332757 1282154 1357012 1413229 1457261 1232526 912520 1060841
20013 1060841 1178150 1279747 1467010 1711144 1816049 1683918 1786981 1634197 1475235
20004 1475235 1494548 1333251 1533262 1883611 2030077 2170283 2182831 2021986 2213611 2477367
19994 2477367 2851515 2859373 2693004 2809105 2950865 2808894 2669124 2419281 2418964 2323082
19984 2323082 2224778 2421707 2543046 2504498 2151985 1780481 1785361 1703803 1537238 1474348
19974 1474348 1353965 1283366 1267662 1456873 1397016 1313111 1199014 1056763 1050699 1153136
19964 1153136 1264362 1163776 1122259 1103530 1133250 1102310 1174392 1108864 1094207 1217604 1161511
19953 1161511 1206373 1299907 1257905 1069429 1073496 1152132 1109811 836399 759539 740369 681560
19942 681560 608692 774539 983880 1060164 1130545 852500 514245 438629 503487 435876 311533
19931 311533 346983 446159 687119 860662 754253 907999 1009770 1178172 1024682 608669
19921 608669 592774 778672 866920 1062687 1053085 873017 734769 702014 609946 445862 399368
19910 399368 362129 516111 733925 796118 627560 567935 472963 635043 791090 859219
19900 859219 847330 771998 795556 966905 1111072 827988 615910 475580 710505 919953
19890 919953 889931 1070818 1154523 1006835 826719 827499 774702 831247 726651 790365 866915
19879 866915 798459 858310 872741 765482 480673 545457 415239 579247 496419 507511 784888
19868 784888 963249 985907 788518 511231 540224 637195 503644 578166 475071 382399
19858 382399 369855 349105 281669 362312 410097 257636 401579 406095 315457 418370 635410
19847 635410 887271 760509 583290 549012 454436 448970 401138 470973 533612 542894 579466
19836 579466 574781 472985 252618 293142 350606 476687 625212 779343 687605 546003
19826 546003 500482 450299 243681 169321 341509 402263 361868 261158 583487 783631
19816 783631 597776 594357 605456 513463 433120 549529 585463 690073 943291 789395 401798
19805 401798 263821 239886 543722 693196 906500 892661 718342 498118 404852 304234
19795 304234 255977 305988 367826 598745 654371 585021 489716 513237 357350 136505 176998
19784 176998 247778 365792 389475 245694 105052 246594 368710 304985 201620 423775
19774 423775 642566 627674 415599 420000 624134 662774 714207 972563 918361 491068 323471
19763 323471 282219 331964 324272 353155 373858 280022 335905 415920 141372 313331 446774
19752 446774 406825 436754 445230 437501 408718 482060 410401 668120 816408 638151 587619
19741 587619 578673 567582 520736 183431 66242 393347 323205 327996 500955 642727 663995
19730 663995 601610 547579 579522 440451 695407 816696 593061 521162 562412 790137
19720 790137 780597 615910 675184 741242 717624 706156 718140 709920 648262 750374 694086
19709 694086 680430 639747 572617 593394 538110 417266 583928 561052 529100 467830 487801
19698 487801 613281 583754 618880 623991 627337 393095 270569 236529 189501 266093 372742
19687 372742 129331 -89029 9306 273450 412085 472060 297527 59411 128003 385749
19677 385749 551356 784509 790872 802640 737526 739508 911580 996293 1040672 1216996 1289838
19666 1289838 1349187 1357081 1335238 1609429 1505076 1371734 1682838 1693594 1571493 1602072
19656 1602072 1598017 1587030 1515517 1530770 1520233 1686705 1561519 1212694 942308 1000575 919185
19645 919185 939470 1139788 1132901 1117310 1087125 861587 714338 567001 518487 690711 859677
19634 859677 873137 774560 646900 907707 1066108 1234142 1324608 1265734 1497164 1730608
19624 1730608 1859925 1930905 2022345 2008510 1880692 1824003 1745977 1795940 1897099 1853104 1643207
19613 1643207 1539929 1492583 1578375 1535847 1354861 1278371 950604 695899 635760 661816
19603 661816 743121 840880 793427 775083 680170 563359 649936 772002 879037 698131 548976
19592 548976 602248 643024 734993 897064 740731 616754 619186 555934 447700 454756 726791
19581 726791 830791 783147 764083 718884 736066 860144 1011163 1043704 1003088 1212669 1174528
19570 1174528 880625 700162 880819 903307 830342 848810 957794 1306362 1390256 1477867
19560 1477867 1546493 1590211 1599204 1685431 1629283 1504843 1695717 1904465 2177078 2453959
19550 2453959 2506070 2599820 3078044 3517876 3820508 4038020 4286139 4531230 4945808 5233792
19540 5233792 5641743 6020365 6585717 7050781 7692781 8319456 8971396 9740090 10731489
19531 10731489 12358852 14100200 16327349 19612485 24023924 30427322 39602493 53430199
19523 53430199 73073904 98596739 130140833 167352593 205952882 237436324 260023334
19516 260023334 274589285 279711803 280470363 285317479 295909925 303644693 301315719 290366732
19508 290366732 267888088 232269752 193725983 159535624 129824651 105139656 86136104
19501 86136104 72316532 62027178 54334651 48313234 43447307 39414636 36040291 33405233
19493 33405233 31318210 29547639 28036401 26841727 25874228 24917661 24250360 23744486 23091270
19484 23091270 22649613 22443647 22552271 23078462 23677710 24574700 26015508 27766156 29521085
19475 29521085 31280796 33162628 35737937 39459251 45508993 55231846 70455108 92693396
19467 92693396 123502027 162576162 209479208 260244886 303401971 333856266 352863738
19460 352863738 358449816 355863882 357076615 365228062 372777382 370699401 357730614 331307156
19452 331307156 289780526 242769806 199356972 161299817 129876947 105684801 87815559
19445 87815559 74438669 64067515 56060055 49643147 44468605 40327831 37148261 34344177
19437 34344177 31809213 29534727 27724845 25871173 24062489 22618263 21157108 19813493
19429 19813493 18763157 17690468 16621522 15399679 14335156 13450232 12759855 12163335
19421 12163335 11736842 11249367 10609315 10061499 9665812 9380523 8773452 8512731 8185756
19412 8185756 7858377 7564210 7243573 6856881 6553461 6434618 6424962 6133593 5916303 5878249
19402 5878249 5667242 5395809 5126513 4797397 4279463 4083073 3944300 3862896 3880226 3773152
19392 3773152 3581399 3630881 3591971 3401366 3241210 3372695 3528204 3496692 3414193 3284005
19382 3284005 3025749 2850522 2870887 2881982 3002015 3137355 3057485 3009654 2777544 2568822
19372 2568822 2649619 2646065 2282912 2261249 2424235 2355580 2360505 2523560 2565899 2410257 2300614
19361 2300614 2231386 2240736 2102972 2200669 2164307 1974258 1900229 1625096 1725895 1809397 1724704
19350 1724704 1627757 1595560 1512255 1487167 1226322 961582 1051968 1125397 1101878 1265878 1289950
19339 1289950 1262285 1347401 1210623 1139744 994875 1029072 1015915 1182001 1328587 1602152
19329 1602152 1848017 2114316 2158883 2227196 2352092 2325382 1947464 1610879 1437416 1604708
19319 1604708 1634877 1527189 1377662 1207098 1108875 1244295 1221997 1146005 1062517 1155798
19309 1155798 1385145 1277253 1013864 870091 888629 845176 743779 517135 539910 596696
19299 596696 374846 259612 210412 424770 602946 585467 807628 958629 929998 907724
19289 907724 912754 743594 707446 707725 736510 942151 1012143 1040146 977733 885260 1164868
19278 1164868 1538740 1551611 1371567 1235391 1161928 1174147 1243828 1137359 1127938 885576
19268 885576 625567 481533 478397 484582 648051 857371 935733 871161 807384 745221 796834
19257 796834 824045 936418 1032309 779305 691393 550233 693431 467324 260759 387260
19247 387260 558295 673725 692929 582012 715039 907800 1156169 1168394 1163757 1024470
19237 1024470 953700 1098922 1193642 966124 1000666 936616 1056195 1106877 1008420 928378 885857
19226 885857 1069181 1177122 1210090 1264282 1462570 1598053 1657743 1608237 1680837 1487626
19216 1487626 1529579 1557447 1491789 1467012 1476540 1646034 1502634 1245787 1255512 1374877 1595163
19205 1595163 1617663 1643885 1751554 2120945 2437266 2188682 2068091 2245084 2558531 2742819
19195 2742819 2888010 3229187 3460917 3627420 4040105 4318518 4336440 4595020 4789783 5105785
19185 5105785 5626502 6323411 6772539 7019748 7406537 7786959 8556979 9470653 10259781
19176 10259781 11232137 12537013 14109988 16123512 19199402 23435351 29151400 36691519
19168 36691519 46238068 56924995 68534138 81821550 97690687 116364975 136607033
19161 136607033 154975222 170419933 185159675 199408243 211119674 216715254 218047985
19154 218047985 218152138 215321032 210980248 206592551 199889088 185973543 164070938 141553714
19146 141553714 123795759 110352957 98810575 87101712 75118930 64169159 55603899
19139 55603899 49701959 45710381 42808012 40717162 39284957 38756963 38733685 39337776 40747212
19130 40747212 43186490 46887117 52355630 60373225 71963688 87396537 105876772 125817629
19122 125817629 147856719 174065238 205787192 242127131 277644362 306368018 330652165
19115 330652165 354896610 376784581 388969226 387176625 380251457 372422634 362420814
19108 362420814 351665641 337918512 316303815 283676724 245266927 211356248 184938198
19101 184938198 163467127 143442967 122915552 103039004 85697715 72066237 62017107
19094 62017107 54323455 48386255 43524995 39582155 36490867 33907506 31455381 29306694
19086 29306694 27596575 26247564 24920519 23449121 21981677 20921176 19955086 18811906
19078 18811906 17658769 16752525 15958125 15244599 14524774 13679235 13043553 12552082 12015400
19069 12015400 11447981 10933264 10703518 10175165 9540987 9390894 9126922 9013657 8819522
19060 8819522 8847866 8650964 8682783 8855337 9426106 10055547 10254594 10132497 10027633 9827911
19050 9827911 9491385 9434727 9418941 9834591 10294430 10771909 11182697 11381226 11436775 11290392
19040 11290392 11376630 11695714 12016074 12649147 13447286 14892188 16621863 18714978 21504886
19031 21504886 25088472 29688911 35983387 45097620 58260074 78120929 108635928 154795648
19023 154795648 219078156 296062322 366968437 412305548 422560200 392352192 327694790
19016 327694790 253365758 191166898 146004080 114686736 93002413 77704116 66260684
19009 66260684 57537269 50627376 45085451 40288514 36810063 34177307 31951448 30447146
19001 30447146 29159143 28007419 26769222 25964448 25343501 25016769 24622651 24333590 24204211
18992 24204211 24351964 24592058 25320916 26299140 27883223 30066444 32727993 36346325 41574646
18983 41574646 49440760 62110897 82295727 112965282 154024741 198856977 234846658
18976 234846658 254007607 252570659 229447203 194825252 165092398 149407343 150399155
18969 150399155 169029558 205886126 256813419 307678578 342466090 352232126 331785213
18962 331785213 283329368 224117482 172225456 133419893 106408443 87823586 74417131
18955 74417131 64346091 56517053 50450579 45430285 41439842 38444053 35987127 34185302
18947 34185302 32966802 31815761 30993507 30144105 29018859 27574568 26163036 25162467
18939 25162467 24029699 22974358 22080476 21526874 21273560 21607121 22509247 24129335 26143339
18930 26143339 28944263 33234550 39751044 49924840 65924118 90460671 124043125
18923 124043125 161914256 193137084 209808675 208014359 185955923 150242296 114860108
18916 114860108 87208726 67627553 53825148 44241622 37362002 32323966 28266330
18909 28266330 25243030 22677301 20386531 18746489 17237422 16046745 14976940 13865777
18901 13865777 12871385 12475730 12041789 11410480 11099959 10681159 10063830 9595404 9361672
18892 9361672 8750744 8504199 8434125 8224627 8104609 7799816 7540900 7049295 6632502 6369315
18882 6369315 5930396 5594660 5706432 5603873 5279758 4864184 4829487 4745831 4623466 4593365
18872 4593365 4407278 4187801 3896062 3877611 3917662 3869884 3978930 4050552 4138487 4047141
18862 4047141 3736093 3522424 3331244 3303120 3196436 2940100 3021540 2965975 2863677 2757782
18852 2757782 2659328 2603800 2465320 2444230 2598561 2609341 2593786 2337828 2262334 2442189
18842 2442189 2442809 2186730 2139542 2205687 2304069 2339964 2316621 2091295 2023449 2116553 2137290
18831 2137290 2032961 1905040 1815545 1682207 1724911 1930981 1983587 1872317 1756334 1723003
18821 1723003 1749530 1889628 1938196 1798198 1677196 1451892 1222875 1494717 1865409 1910651
18811 1910651 1688954 1437445 1327029 1578793 1701724 1615461 1477608 1544302 1370738 1259476
18801 1259476 1272189 1254589 1197770 1139114 1125248 1358701 1330229 1447832 1506009 1476347 1309087
18790 1309087 1188180 1194987 1189864 1292830 1353123 1251990 1152990 1084947 1231422 1438009 1420693
18779 1420693 1337380 1443954 1418930 1224867 1103848 1055074 1231504 1244158 1177890 1118229
18769 1118229 1093551 1220281 1384805 1464516 1174805 812291 394667 544077 834728 879725
18759 879725 866783 793488 655199 740080 864216 1017363 667682 634337 577012 686218
18749 686218 869594 870172 939233 877939 1066031 1115009 1010145 919731 658104 596518 907665
18738 907665 927834 794941 748136 703044 731703 655721 466030 493416 554095 543172 587877
18727 587877 600841 648096 704337 674541 533220 547846 802804 814273 604737 562267 568321
18716 568321 581058 632159 688345 842418 807078 754909 884484 1038578 941381 1075878 964349
18705 964349 848857 859789 799242 642114 576816 649828 751007 940981 987446 1026930 957664
18694 957664 717251 543584 470341 553499 454237 417110 390257 246590 297271 233418 323196
18683 323196 321292 237701 192730 168783 53288 291275 486311 614896 675176 722592 757238
18672 757238 749640 844758 634270 527331 725773 752646 756366 811512 752090 811253 812607
18661 812607 752980 620376 623210 671279 624833 732193 629730 856401 840347 618095 483897
18650 483897 727112 870799 1100368 1058678 967488 1127086 1050497 1140929 1340155 1521364
18640 1521364 1997861 2291507 2274835 1973581 1733603 1860768 2100332 2192721 2137477 1990870
18630 1990870 1774993 1569522 1357358 1391136 1398333 1089546 975884 1042691 1084569 1080329 736805
18619 736805 563751 564780 822849 710723 543271 403649 477767 755698 558716 502807
18609 502807 422899 199036 415880 571253 813400 787484 457526 505700 854810 1173595
18599 1173595 1143067 1301175 1415254 1440567 1444788 1458822 1506210 1607904 1735408 1679848 1567747
18588 1567747 1546918 1605143 1347268 1223113 1112564 936882 1085248 1233163 1065367 999278
18578 999278 944155 862660 753874 737789 677815 530487 553040 578733 545024 414061 466312
18567 466312 379663 343994 272872 213659 154512 379007 562355 562763 580086 444453 401600
18556 401600 544777 448254 244446 243476 266655 368714 479101 743579 784998 876004 848029
18545 848029 693320 390299 427698 321354 177052 162217 44351 67226 212795 332526
18535 332526 166652 148905 154085 171912 206221 261144 200200 287131 302178 285138 403747
18524 403747 562675 442773 398312 338375 372010 224703 153111 45369 118657 230839
18514 230839 211359 482017 367338 372358 408902 461566 596157 813965 952286 1012246 1360265
18503 1360265 1700924 1755068 1723021 1602933 1505388 1308600 1073030 1056209 1071275 982822
18493 982822 995324 911286 803389 762647 615827 540401 463888 508676 389586 106084 76811
18482 76811 199521 288648 407225 225398 275229 425413 505548 596003 693985 683281 437399
18471 437399 461423 339832 327572 237889 231488 291062 444129 690150 994603 1232970 1360653
18460 1360653 1405163 1586894 1489856 1469245 1182634 984579 805440 778303 742046 747533 954078
18449 954078 1366975 1628193 1753419 1707562 1860096 1635120 1335644 1340920 1186387 1051989
18439 1051989 809923 756744 788627 772745 637954 694556 859765 689249 492131 409169
18429 409169 603962 652991 536483 475675 516793 438961 556812 758881 709663 577309
18419 577309 584896 525622 465639 423714 276696 315847 337846 328337 231606 178570 358085
18408 358085 624924 641196 918492 1097726 1240390 1172038 940719 1006341 1120519 981004
18398 981004 1041526 1015917 937845 809879 653215 386424 247748 322146 337171 195471
18388 195471 311048 298308 199399 259627 229168 84724 86358 305196 358151 457698 304946
18377 304946 203750 220102 331843 416241 301928 303618 353455 113344 153660 262248 173959
18366 173959 -13938 195007 237771 302839 407669 466064 350005 264608 399304 300705
18356 300705 314404 396364 453658 482423 474627 273889 226817 196955 274936 440441 442669
18345 442669 258321 185952 227810 335319 486002 605961 711564 597168 373890 466269
18335 466269 595949 583333 567200 629456 535993 303455 124532 288885 458102 576381
18325 576381 561773 342419 149659 199964 251620 356923 349815 313486 13981 -53882 -170350
18314 -170350 -20041 116783 96865 41672 71051 84575 100649 -113400 47127 288500
18304 288500 504038 617650 424964 299928 153933 331383 480663 480896 333332 27763
18294 27763 -211449 -149400 -58042 -110624 -173777 -47190 293566 440578 386186 580380 632980
18283 632980 434140 233690 219610 83660 62167 223436 264043 272508 213437 269005 252405
18272 252405 178964 221154 147951 106668 193602 187494 222474 144619 49166 -84102 -29263
18261 -29263 8093 -9613 93635 -58082 -201474 -280371 -384042 -363535 -276564 -336900 -105978
18250 -105978 -46898 -62735 115416 201157 17007 84739 38722 95668 156390 151321 319097
18239 319097 93953 -21866 112834 275005 397127 556275 710561 615465 517957 512186
18229 512186 372996 214907 93754 36120 100731 68921 -72984 -99481 -53380 -166925
18219 -166925 -136328 -385033 -247345 27669 -45037 -102931 34358 -17643 -74965 53687
18209 53687 234722 350769 476955 598505 395595 46670 -113507 31353 352664 366453
18199 366453 99333 -20352 -19905 91476 205771 94256 60530 68799 23688 61142 147213
18188 147213 134957 181706 175257 186118 -28450 -91540 -40985 102709 65107 -3762 21214
18177 21214 -203148 -77371 177148 38313 -41351 59082 -68452 13508 213650 286185
18167 286185 20067 -297722 -439984 -431441 -263627 -111925 135186 361664 217334 284450
18157 284450 155438 139995 30142 132358 120887 246110 406892 438069 244595 112807
18147 112807 -68957 -9731 160336 311535 318692 163767 -42743 -87922 12788 162152
18137 162152 42706 115003 200785 212951 279024 147703 203619 284456 145357 84827 -45864
18126 -45864 -80879 -88431 3010 -8633 -27214 36555 183921 269205 128331 111227 -98924
18115 -98924 -226988 -84258 129823 139877 152132 109382 168152 25274 -62602 12784 67736
18104 67736 87603 56747 120478 339571 296924 273383 419001 210373 79714 116884 82987
18093 82987 119920 -14288 -152762 -226392 -41697 7188 86302 157941 -42803 -113156 -195908
18082 -195908 -312414 -434422 -354301 -238545 -392394 -426137 -311746 -392720 -272800 -239081
18072 -239081 -207125 -226991 -490290 -560906 -223921 -170670 -308370 -220332 62299 131624 50015
18061 50015 51389 187073 154132 -165838 -195328 -21788 -109185 -137797 -3459 -82752 -216723
18050 -216723 -109987 -144962 -153199 -138870 -8150 105360 108886 13863 44404 264600 291211
18039 291211 19035 99271 62612 184147 77777 46314 46212 -99327 -215104 -46060 -154569
18028 -154569 -303954 -164239 66520 83596 22891 -90247 -107190 -73649 -1187 23011 -77295
18017 -77295 -224233 -414218 -399952 -162106 -44370 332928 252652 257710 287531 136776 -14471
18006 -14471 -245634 -253852 -31073 118788 266482 352573 307770 342552 280824 215137 333316
17995 333316 146605 -26974 -24273 -158351 -73900 -24246 120824 91456 -7990 97498 76402
17984 76402 -61852 -74817 190577 370741 345322 315507 60484 65148 106711 82947 14030
17973 14030 32089 16665 136989 31806 -63139 -226711 -219504 -16486 24888 148178 248877
17962 248877 289359 165219 185070 58516 181138 402469 228083 129334 -9363 -408695
17952 -408695 -375316 -224731 -170435 3132 -4165 107630 169833 222371 223100 187469 199483
17941 199483 248997 -51599 -87367 -98136 -75188 48678 -42549 -152999 -299264 -530716
17931 -530716 -530541 -108814 98526 74098 -51046 -215802 -247449 -17267 -6156 -68622 57668
17920 57668 155731 84430 91367 56291 176856 52030 -83851 -90517 -34268 -295753 -132527
17909 -132527 10998 10049 -50487 -45433 -28400 -219719 -176553 -152763 -60519 45349 92139
17898 92139 294453 353969 63465 83120 220395 -18860 172390 427130 369952 275092
17888 275092 150958 235228 268799 406918 605823 420751 293267 179371 131746 222707
17878 222707 349874 270426 50447 -22040 -17220 -36736 -54454 35583 -168081 -103187 -187576
17867 -187576 -192056 -33931 -67608 210488 282914 133620 151753 114510 76368 122859 194268
17856 194268 273482 121051 -13133 21920 140353 100408 74662 92330 154140 123086 212187
17845 212187 122475 -16876 26152 -22545 -38897 78441 78710 -28946 117823 225094 159679
17834 159679 138258 144793 285240 308391 49727 -179266 -252766 -258146 -425800 -273381 -92135
17823 -92135 -24178 20631 23051 79737 172779 110467 137484 115837 27748 -90027 -334229
17812 -334229 -252094 -138738 -75114 -20825 -6925 115193 68419 -55963 -55209 55489 128169
17801 128169 323903 298572 182512 307337 114096 41427 -152151 -176131 -70772 -58647
17791 -58647 -76013 35686 97969 1861 91167 114034 56745 -40245 35862 21711 -83459
17780 -83459 -77706 55097 -1608 26094 209966 112759 121784 -37057 -45620 -22582 -98189 12495
17768 12495 114251 -77721 -75751 -80447 -136317 -47713 122589 51501 -56127 -137890 -79745
17757 -79745 30564 89188 10471 -59626 24696 -58595 -102080 -61194 -33469 -131107 38743
17746 38743 87511 69873 57523 -57122 29053 111547 -44847 -22078 33865 19610 -149376
17735 -149376 -303428 -107203 96675 241120 72666 -40463 112900 278790 193344 27150
17725 27150 172836 143823 97841 240697 62376 -69404 -86891 -213855 -364748 -279394
17715 -279394 -174090 -3772 -86885 -230605 -214488 -230588 -170374 95134 58091 78328 116409
17704 116409 52130 -202213 -186847 -302115 13879 88474 128129 257572 478897 574168
17694 574168 296422 69808 96074 380914 315947 126246 -4784 -203555 -132327 -112830
17684 -112830 -208081 -400914 -327434 -119572 -191621 -410182 -144851 -73993 -134788 -69258 -14571
17673 -14571 -27311 73776 170856 -88265 -163173 -79884 141569 161672 94806 31059 -115889
17662 -115889 -130796 -42716 29522 75875 2169 11110 -124816 -114120 -63861 103956 152021
17651 152021 200792 218674 -34904 74691 188374 -49864 -99048 -49737 19406 -6314 -51416
17640 -51416 169774 322514 291102 -47050 -210881 -452213 -297544 -212247 -226611 -107726
17630 -107726 -140624 -328892 -365999 -544714 -484789 -410542 -425976 -400926 -324698 -291147 -181685
17619 -181685 -12397 103356 26292 -189554 -67766 194634 217048 211137 151089 95595 161006
17608 161006 171224 288593 221992 87933 -147989 -246956 -148817 71536 46125 -112876
17598 -112876 133638 316178 298998 270275 123346 96364 -378 53142 164390 212243 246514
17587 246514 125910 189714 191231 31872 -90363 -45100 108110 216958 158643 123950 267803
17576 267803 227860 77397 340752 469007 130098 -287054 -129712 66598 188579 85551
17566 85551 -173033 -312869 -429957 -402739 -370899 -116472 19591 -11826 -55968 -338770
17556 -338770 -316108 -373261 -380248 -390460 -365859 -349465 -248606 -98671 -42959 -44830 -100439
17545 -100439 -266625 -261722 -265210 -112805 -178167 -283258 -149839 -84113 -202591 -56324 105084
17534 105084 -238 -202119 -142429 3647 -50506 20047 -58267 -353688 -288842 -187236
17524 -187236 -152737 -237558 -222982 -372766 -257553 -209381 -208440 -5930 26184 -11106 -25760
17513 -25760 3636 -78574 -130927 14350 62241 245710 156020 76456 230506 311489 282979
17502 282979 2148 -88626 -195793 -275445 -231493 -155415 -124244 -5461 34401 94732 -31680
17491 -31680 -149696 78137 41511 -17412 -190874 -236654 -319263 -313029 -442954 -620385 -543915
17480 -543915 -439836 -312115 -422424 -215193 70418 314826 23444 -215071 -270171 -260431
17470 -260431 -146052 105946 215105 227625 132461 140838 197284 190728 257900 80796 -198975
17459 -198975 -303299 -310877 -197173 -37906 190080 156431 2650 14392 26137 -15888 11323
17448 11323 -108302 -137152 -54704 33956 155101 57906 76072 67223 9846 34830 64879
17437 64879 -28078 -114481 -81136 -219865 -380598 -457414 -334585 -327411 -326924 -143670 -9649
17426 -9649 77098 116254 102545 402727 326195 104369 214612 57504 43220 -139321 -412005
17415 -412005 -341456 -134463 -155323 -358156 -241313 -102783 -133532 -59753 16409 57022 -99738
17404 -99738 -164324 -298546 40940 54511 -90744 -243035 -477383 -385060 -105365 -180065
17394 -180065 -270382 -200620 -79847 58536 118869 -13582 -261062 -367819 -409307 -464198
17384 -464198 -376781 -185753 -338686 -371644 -273563 -254667 -243838 -542616 -411327 -327335 -388369
17373 -388369 -329363 -408503 -351561 -386754 -374424 -252610 83183 171203 131530 236983 155566
17362 155566 57889 -53456 -323065 -330496 -215739 -238198 11907 214205 -38063 -106005
17352 -106005 -284396 -134662 155221 -11931 -113202 34266 105741 -58485 -289807 -313376
17342 -313376 -151939 -86688 60978 3717 -194729 -119825 -32501 179156 110734 -183203
17332 -183203 -240525 -104831 -58871 5062 -246628 -499953 -347532 -231022 -178650 -136769
17322 -136769 -48484 2947 -14405 -43950 52752 182018 129179 -8708 -192451 -95850 109473
17311 109473 189769 37474 145432 151397 97094 190876 310498 160982 114747 24915 17733
17300 17733 -26238 -209495 -314421 -352057 -401462 -373135 -305481 -291710 -332274 -152866 -57958
17289 -57958 -30289 28019 -27758 -174523 -86014 -336353 -588769 -689261 -634266 -439400 -174383
17278 -174383 97093 -20774 -80709 -200688 -174421 -81308 -3378 -92902 -40900 13629 79289
17267 79289 -598 -38002 -45026 -74882 9719 12285 -44185 -138932 -256475 -247808 -61124 9052
17255 9052 86072 45168 63894 152811 106909 50053 92103 216196 224647 47946 -37533 -16447
17243 -16447 -122281 61912 264752 183531 -55203 -101782 -13045 89732 194272 469694
17233 469694 439488 245412 -57910 -60909 1875 58381 28738 3158 75156 148379 177334
17222 177334 140348 -46077 -190656 -56221 -65514 -181341 -372661 -475427 -296488 -251952
17212 -251952 42733 28658 -86932 -130056 -109055 -131420 -112172 -156479 -93122 124364 92491
17201 92491 316321 461967 160447 -38744 -16718 13858 27169 85522 -52785 -113512 -120896
17190 -120896 -214642 -361142 -341247 -309352 -605866 -574765 -400352 -337000 -259229 -109783 -103961
17179 -103961 -95791 -77175 -43811 -167936 2173 92059 -106444 -15532 -51087 -125379 -265680
17168 -265680 -165096 -219378 -355041 -523464 -341465 -191715 -212025 -77097 -30965 -22507
17158 -22507 -69457 -77329 105754 216302 128966 -68244 -329790 -317274 -359061 -502048 -500814
17147 -500814 -278663 4034 96258 -13768 -104266 -145472 -70999 -269217 -164775 -221573
17137 -221573 -149533 -41058 116154 121741 63524 -150122 -60399 -44727 -94827 29329 44793
17126 44793 39092 -189540 -184844 -198066 -140145 -201440 -325471 -201163 -191937 -256205 -116559
17115 -116559 -132552 -269039 -201948 -332702 -565730 -399120 -31731 -7754 -26640 -94004
17105 -94004 -171947 -140470 39853 88335 -49835 -62073 109916 58712 -65093 -20050 54231
17094 54231 -133023 -242978 -186179 -156643 -125552 -6152 -116096 -30541 -52373 -6802 -167517
17083 -167517 -195123 93520 140834 178460 207285 32827 -25267 103263 -393738 -532950
17073 -532950 -519738 -331509 -78249 -9437 27184 23597 -69120 -236283 -394681 -521493 -485336
17062 -485336 -340714 -104821 -75433 -86426 -14003 -125238 -90208 40061 9293 -140103
17052 -140103 -304315 -394376 -228073 -83899 -175901 -262766 -194579 -68122 -89167 -20001 162853
17041 162853 317455 -19649 -92735 54470 104154 200113 255138 280945 445076 438082 292439
17030 292439 18565 -60619 -78876 -76129 -231773 -285915 -364312 -352053 -179394 -57340 62817
17019 62817 -198141 -111558 -73420 -83470 34421 129222 275280 309287 358771 262781 25090
17008 25090 -169791 110046 279041 318769 169371 -67537 -125767 -53706 -99761 -76651 -17802
16997 -17802 -115477 -201994 -215476 -282881 -138420 -123071 -131236 -244941 -303531 -124511 -517
16986 -517 177699 175749 36401 -87426 -98299 51155 214615 230076 235959 284543 418583
16975 418583 285923 164143 297142 161084 -71969 -170588 -141528 -101472 -159778 -2483
16965 -2483 25093 -209927 -559846 -569113 -322379 -155842 -46695 -58280 -177017 -208927 -167979
16954 -167979 -194208 -82397 -134012 -169270 -353524 -164612 92781 38838 88405 331922
16944 331922 250189 68281 -83767 -188948 -107061 -337609 -315473 -297074 -245710 -327750 -265908
16933 -265908 -260663 -229217 -77575 -33421 -83406 3804 9205 102920 903 1317 -100990 -246640
16921 -246640 -403518 -512486 -476794 -384857 -215122 -14063 -86321 -213171 -372503 -423335
16911 -423335 -319392 -105434 88798 48940 -184655 -74221 65571 178106 144914 176730
16901 176730 157524 59816 -24568 -114373 -244928 -258887 -238681 -243087 -252043 -312936 -566378
16890 -566378 -479433 -311735 -92184 -90541 7446 114067 -353957 -568562 -430672 -222356
16880 -222356 13390 -43783 -38613 -112027 30612 -95402 -155044 -149357 15309 279071 49102
16869 49102 -13346 65831 253991 189688 -58302 -67134 136386 55938 -253398 -406600 -338461
16858 -338461 -235227 -210116 -200136 -106294 -93852 -95223 -14629 -6887 -107154 -345145 -75177
16847 -75177 145916 204641 234528 234044 -56626 -144529 -320569 -288656 -360993 -209110 -56143
16836 -56143 -104960 -8395 146785 56868 22704 15035 -73361 -116875 -169135 -400577 -317638
16825 -317638 -35642 -156394 -256023 -151963 -34476 -30883 38728 -194277 -395261 -385530 -347644
16814 -347644 -295269 -324346 -7106 194919 58633 -174176 -90700 92389 154462 -24404
16804 -24404 -112649 32874 -60845 -253728 -363390 -247997 -216402 -147495 97919 -21770
16794 -21770 -137485 -263569 -488884 -406591 -164635 -236518 -314109 -254965 -453984 -469314 -516658
16783 -516658 -519678 -512534 -592940 -492365 -367916 -93119 136515 26150 186391 205157 -37187
16772 -37187 18252 -43834 29105 35649 -45936 80397 141573 -54216 -155061 -147049 -307250
16761 -307250 -230671 -243222 -239033 -36460 -128259 -341518 -125914 127071 98040 -150494 -148804
16750 -148804 -224213 -170025 -70357 -159 124899 185926 278015 324313 227415 196605 303188
16739 303188 380224 203282 24313 54996 151931 101970 99686 -35764 -156247 -108407 -111602
16728 -111602 -16851 117926 178040 59111 90815 111453 -5990 9141 -6808 59874 -27976
16717 -27976 -150767 -142191 -20799 46747 -160484 -143154 -363307 -649333 -468691 11948
16707 11948 295670 268452 13470 10412 61433 -122240 -270571 -223156 -247118 -333772 -153729
16696 -153729 -156443 -234483 -196423 -103704 -100015 -41929 -101136 -224000 -565266 -480687 -269962
16685 -269962 -183098 -387906 -220819 -66737 -5052 -55063 -154446 -172179 -106357 -134214 -239674
16674 -239674 -329590 -180259 17966 -7551 -289656 -362340 -234929 -73033 -48558 -62258
16664 -62258 15965 53503 262097 261147 103594 -128356 -316750 -262167 -170352 -213486 -207185
16653 -207185 -194096 -240783 -145222 -266762 -528616 -323685 -197713 -126192 49252 265721
16643 265721 254258 80363 88291 199728 100430 -138512 -140760 -92802 -217970 -379922 -379017
16632 -379017 -146044 92513 114200 44781 -33192 -1579 146602 186866 6349 -282239
16622 -282239 -349663 14119 205864 60249 -82147 -184431 -231904 -210734 -147401 -48561
16612 -48561 -92915 47313 13122 13472 77818 -139162 -361975 -406667 -389917 -446082 -405494
16601 -405494 -327242 -245249 -35325 39989 -48592 8140 32594 -101373 132363 170920 134073
16590 134073 127904 212074 246894 353229 417696 278822 -65700 142261 258376 12338
16580 12338 -218430 17969 323785 131395 -148142 -161307 -308559 -391792 -501292 -323588
16570 -323588 -198868 -60309 -99583 -105469 -212878 77077 261921 232368 -99515 -176045
16560 -176045 -216844 -381629 -450064 -277872 -218738 -268509 -197268 -85255 -155251 -308543 -288340
16549 -288340 -190245 -58757 -65861 -190105 -193722 -179263 -161508 -202844 -355929 -378345 -301983
16538 -301983 -239234 15357 112818 172086 82013 -147223 -333637 -451602 -362575 -266541 -292550
16527 -292550 -265015 -334222 -37366 33576 -229038 -441711 -270688 -138580 -53921 -59146 -126189
16516 -126189 -6948 -89771 -267061 -239209 -99835 -54936 131420 95312 56033 -185625
16506 -185625 -345270 -92760 -2315 -231931 -327710 -150986 -121828 -195022 76513 65612
16496 65612 97200 29741 -77943 132354 178422 -36676 -34795 94369 -17106 17921 100016
16485 100016 -97159 -350866 -385504 -341510 -340668 -186460 -159362 -235874 -238190 -237726 -317882 -268707
16473 -268707 129938 275747 372690 117892 16747 334542 384846 234306 87909 -96423
16463 -96423 -15836 19222 24869 -146585 -372075 -422831 -342832 -373648 -312599 -230462 -203513
16452 -203513 -225845 -144823 -154844 -369650 -545970 -308144 -117535 -407393 -412172 -321288 -278147
16441 -278147 -288099 -345826 -159411 -171347 -402117 -571247 -777615 -754472 -411041 -105902
16431 -105902 99692 84912 87897 -102618 -185021 -181324 -363256 -345706 -203566 -331688 -212585
16420 -212585 -210708 -354820 -334586 -200679 -33548 -47541 -328264 -338247 -157557 -153423 -261068
16409 -261068 -318731 -282399 -178836 -234472 -245064 19094 418822 423988 197429 -132256 -150146
16398 -150146 -141590 -268306 -385473 -321732 -210584 -147853 -277465 -132028 -367834 -322585
16388 -322585 -499198 -510890 -342134 -45643 -17201 -125675 100943 124235 -177047 -299464
16378 -299464 -396386 -451926 -432809 -423382 -356960 -130573 -9645 -185321 -158830 -103413 78126
16367 78126 106253 188559 -128828 -284575 -264868 -224228 -263344 -365646 -678663 -732017 -415048
16356 -415048 -299193 -225285 -145290 -205772 -106628 -119230 -266862 -338100 -152995 95019 149510
16345 149510 73846 86367 310758 427565 364733 307951 82091 -255589 -270394 -201011 -311193
16334 -311193 -534768 -666840 -604349 -511307 -295171 -24357 -131396 -362786 -475515 -626275
16324 -626275 -637767 -519315 -395249 -245052 -174588 -86111 -87600 -69575 180186 260383 249544
16313 249544 53752 -144268 -160722 -96163 111374 167688 234941 182677 135773 182713 176963
16302 176963 197717 191066 107446 34382 -73215 -283202 -224021 -124606 -469798 -423056 -320308
16291 -320308 -475942 -422715 -45849 263106 106721 -262503 -400454 -298740 -318371 -188358
16281 -188358 -4532 59110 -7437 -123778 -222803 -160612 -281832 -357404 -136885 -35052
16271 -35052 143215 -34240 -70955 14404 12585 -171361 -222479 -234401 -371701 -303406 -170022
16260 -170022 -64792 -36008 69641 68563 65947 201002 49637 -196105 -222479 -156309 -342803
16249 -342803 -22838 74989 -58887 -218301 -166030 -12085 -9320 -136482 -90729 -386545
16239 -386545 -337037 -237096 -380275 -291993 -180884 -133623 -87173 -125242 -252170 -104000 -27911
16228 -27911 -4568 324488 257711 -19890 -560 107636 117266 72368 166907 62147 17721
16217 17721 -34418 -86167 -374214 -458830 -513590 -412084 -151571 -40818 9069 -22203 -39841
16206 -39841 -18347 -130237 -266617 -368599 -253533 -265515 -287015 -316212 -428706 -271389
16196 -271389 -125031 -212873 -358798 -256898 -172351 50629 134809 49956 -68465 -135976
16186 -135976 12974 -203173 -247465 -20788 -151631 -164286 -16075 -160071 -198518 -144466
16176 -144466 19086 -35306 33307 220474 285462 272327 91931 61424 249845 353431
16166 353431 340590 155691 -40005 -321942 -201165 -256205 -277423 -115255 -231562 -276252
16156 -276252 -71638 -2513 -215896 -247323 -225847 -355385 -308326 -101051 -356194 -500967
16146 -500967 -496335 -398061 -27920 -59375 -193006 -158168 -53790 -322458 -328738 -229008 -295841
16135 -295841 -320866 -121416 -127675 -122669 -118897 -170411 -173065 -146215 -196773 -289723 -317200 -253625
16123 -253625 -236516 -390277 -385623 -336507 -237950 -104793 -68444 -219343 -215173 -86139 -67983
16112 -67983 -92394 -68613 -14926 30591 185531 196270 91555 8766 -60888 -23960 47362
16101 47362 44832 25116 -58884 -24933 -270371 -407815 -316990 -204829 67965 55642 239748
16090 239748 440030 291657 56684 -64786 7225 -99164 -227006 -258238 -11855 -26477
16080 -26477 45866 191607 122693 11206 -121307 -10240 -10051 -292408 -166100 -84325 125250
16069 125250 -26515 -271660 -268550 -205435 81309 138828 -40084 28316 111739 58095 -59852
16058 -59852 -356329 -574039 -536171 -99251 297375 196050 -144384 -161123 -19747 49863
16048 49863 161956 -55734 -183163 9254 107126 -25867 96962 45927 -192593 -365152
16038 -365152 -228795 -56704 19870 -319576 -450078 -241464 37636 99612 42576 -67846
16028 -67846 -154221 -59390 -125104 -43514 52035 57174 -38933 -199154 -305491 -203728 -82151
16017 -82151 -6153 -105788 -9407 27613 81277 128779 114309 -144632 -166448 -199909 -142700
16006 -142700 78694 49792 -118322 -16040 83436 132489 -29311 -174620 -207396 -140025
15996 -140025 -166674 -124646 37476 129007 -50035 -62230 10989 -9051 -141836 -22308 80706
15985 80706 -51600 63803 231781 212637 211995 204858 -127789 -138734 -212693 -34941 117192
15974 117192 140359 86481 294680 271682 93359 -152458 -296902 -114608 -111252 -233232
15964 -233232 -193018 -131078 -73186 -283995 -293150 -210773 -138240 -197850 -159400 -236758 -216042
15953 -216042 -83891 365172 265967 -49933 3557 121452 -89033 -248917 -176574 -173006
15943 -173006 -68682 -63639 -75662 -102377 -99971 -253193 -396457 -355883 -280347 -181499 -144071
15932 -144071 165921 186798 14421 -210378 -207917 -130077 10809 216496 164273 146571 37346
15921 37346 -66611 -14849 144819 143272 -6614 -77761 -186826 -160839 -77156 94855 192782
15910 192782 -113051 -476212 -420945 -188169 -111008 -201992 -222097 -47679 -6666 -148420
15900 -148420 -282614 -296602 -211892 -252168 -316823 -141120 158731 331240 64400 -80019
15890 -80019 -166178 -326432 -373899 -444276 -398862 -224066 -153322 -258301 -245301 -94084 -126552
15879 -126552 8429 -87871 -140845 -180583 -164438 -38216 -131739 -215657 -169380 70258 145552
15868 145552 -90516 -194747 110769 17785 -58131 -1044 -198750 -256852 127487 -33954
15858 -33954 -293884 -308524 -186939 -61961 2528 -854 -360033 -551835 -375615 -208941
15848 -208941 -2986 83724 11781 -91719 -114149 -128132 35991 146287 172101 -11568
15838 -11568 -51466 -94977 -32516 23566 -77524 -168183 -273350 -522389 -583664 -260652 -248952
15827 -248952 -376431 -247126 -61461 10931 24140 -20306 -101112 -293274 -414493 -189737
15817 -189737 -209412 -349845 -218487 -151603 -313361 -199355 -260320 -290516 -593960 -478438
15807 -478438 -305325 -208730 -191670 -190040 26117 -12437 -193029 -484768 -322305 -284109 -174612
15796 -174612 107003 264890 265081 5657 -109228 5008 2516 -200297 -299678 -233383 -439350
15785 -439350 -475128 -273752 -226931 -227788 -131618 12405 74673 48960 59127 26942 91473
15774 91473 -142126 -23131 169440 196421 116500 282170 232207 160042 74938 -153626 -184214
15763 -184214 -68121 164095 127802 68166 101361 -88522 -180114 -180945 4970 -48274 -92300
15752 -92300 -35083 87977 -99260 -195536 -368136 -445864 -303328 -293813 -150495 58304 18014
15741 18014 134639 188494 145796 51089 194120 241747 173822 73685 97316 63527 -210779
15730 -210779 -220396 -173060 10706 78679 107907 -175098 -342011 -450237 -499984 -411481 -294051
15719 -294051 -245220 -189095 -144382 -7622 47457 48717 -12692 5254 58561 -115992 -199171
15708 -199171 -282381 -210867 72160 115934 -23326 58053 119326 132556 -22945 58275 87641
15697 87641 25668 -494 -99991 -46321 -156908 -78629 -19597 -109365 -168762 -119300 -254486
15686 -254486 -283272 -510445 -438193 -333150 -199457 -178393 -262567 -101562 103494 298783
15676 298783 220532 62131 -139385 -174166 -301715 -325728 -137555 -52846 -188043 -250877
15666 -250877 208266 216033 128915 218205 164623 -82702 -273568 -58388 64744 -13595 -9850
15655 -9850 91888 21441 -76339 76071 103206 87677 116383 101288 158421 188228 137376
15644 137376 246804 340353 365614 421741 246068 -6362 -186856 -276314 -312840 -464915
15634 -464915 -513338 -284792 -216351 -21378 -139667 -45393 39701 -59816 -101693 31835 -136554
15623 -136554 -252245 -501842 -386420 -301007 -351263 -335317 -374557 -163622 -92338 -258678
15613 -258678 -183313 -90379 -79898 -146484 -98813 -236989 -379901 -316011 -152319 -159627 -115306
15602 -115306 -132982 -40575 -68753 -217599 -357636 -293967 -13786 68143 166899 118180 176710
15591 176710 44077 11993 59740 37372 157599 203221 160190 18627 -8062 -64183 -48174
15580 -48174 -154466 -42243 50566 -76587 -293937 -449309 -480445 -455390 -355594 -270019 -403305
15569 -403305 -414445 -171248 -226032 -418501 -305849 -246616 -57488 24535 110080 -100798
15559 -100798 -298058 -265985 -261561 -114449 -41582 -86150 -208082 -271720 -112235 -122183 -371959
15548 -371959 -498562 -378507 -361403 -147026 -102065 -390646 -395852 -222713 -48574 115708
15538 115708 162665 36841 106493 -36555 -78469 -68269 -182026 -450522 -480710 -398295 -213039
15527 -213039 -174409 -98694 -20026 113936 216780 135864 68735 254261 315300 -103327 -120797
15516 -120797 -49318 -15117 79912 -52622 29124 -18809 -30046 -248165 -467210 -212499 -107227
15505 -107227 -117147 -187023 -425182 -274178 -227860 55137 360897 155913 -88260 -136411
15495 -136411 -298611 -279428 -82786 -239472 -289537 -223336 -227383 -383465 -309883 -78288 -3439
15484 -3439 11136 -3172 -101104 -142853 52537 132836 -231044 -346446 -112372 -99582 -22739
15473 -22739 86084 -40156 -196537 -332329 -492493 -386314 -177375 49320 68604 -147308
15463 -147308 22782 64270 116852 209216 222871 -14936 -91905 -143146 -56866 -58474 -32996
15452 -32996 194557 279546 84985 -141330 -136696 -181293 -157255 52207 89755 -720 4616
15441 4616 157043 15961 -269260 -229823 -134623 -1430 335410 434490 204644 112382 157637
15430 157637 69094 96508 79554 -65532 56834 -81615 99577 78304 -99090 -156132
15420 -156132 -198056 -330729 -278091 -213170 -7260 150448 327874 147389 88220 153752
15410 153752 281805 229419 68862 54392 47706 27090 139379 213619 392871 381358 114980
15399 114980 -86730 99859 68901 -38613 -270218 -131179 22563 -98682 -231809 -265068
15389 -265068 -68405 -35656 49488 -243671 -408316 -142622 83175 100926 38976 1906
15379 1906 -38763 -50224 -119238 -342723 -391662 -185037 -100430 -95182 -129546 -168908 -116745 18213
15367 18213 214677 473117 455215 249171 -181504 -169531 -16200 -51710 49987 182951
15357 182951 209518 120571 105039 198803 283375 15762 -228702 -135866 -32629 -139316 -137680
15346 -137680 -326763 -251363 -36264 -163440 -73466 31005 29881 99398 70219 122992 105790
15335 105790 11451 66245 16705 174436 92068 -80075 -81375 10493 -23856 87093 -73739
15324 -73739 -259840 -178092 -272017 -291114 -137742 -50173 -104102 40467 194056 43390 59280
15313 59280 -152921 -322825 -50693 -101961 -201778 -43784 27194 3252 -27945 -74216 -66173
15302 -66173 -234477 -294144 -190267 -105050 -61912 -133939 -274352 -215992 -111241 -31600 12753
15291 12753 61368 135232 173159 307909 141438 -39792 -19797 57016 81908 39626 55069
15280 55069 210596 159856 -16573 -79169 -11341 -168806 -356692 -356426 -180418 -259044 -172020
15269 -172020 -119240 -174534 -100413 849 -158568 51626 157754 105518 -17184 -126043
15259 -126043 6038 139794 57713 128823 -64577 16802 230205 308032 428261 274219
15249 274219 108456 207349 205393 71870 -80600 -179012 -181436 5211 -156843 -139189 93365
15238 93365 150546 150735 57897 -87560 -15697 80409 313634 445250 220271 149986 136933
15227 136933 81557 202190 199532 32097 153127 118478 -17808 48376 150875 213735 172861
15216 172861 106664 -14905 60994 55852 131886 80324 254623 234932 120671 -2589 131224
15205 131224 56276 -57780 -73752 26333 -49463 -287358 -97751 102326 -46428 -31229
15195 -31229 242570 230222 54958 195758 256304 257695 376062 470166 323066 220221 42792
15184 42792 -93930 -63122 53800 257038 291300 347265 206833 287174 308673 -58210 -189432
15173 -189432 -224600 -200503 -125868 -122768 -231739 -155918 -32673 50361 201666 172813 32306
15162 32306 -22356 -18590 21876 116029 -76258 -104769 -69088 -165953 -129528 -41106 127612
15151 127612 220399 61539 -113006 -41347 158895 260938 294264 158669 89731 256061
15141 256061 562736 366003 -56765 -313452 -349219 -363318 -222273 -90437 67033 -96842
15131 -96842 -198554 -87861 46665 -46280 -159362 -64318 -27201 -18738 -142072 -236445 -222044
15120 -222044 -284066 -29349 -26176 -115030 -172576 -46857 37977 203028 101326 -92488 39490
15109 39490 -18386 14404 167697 262786 121586 42072 -56133 124267 244198 182810 66124
15098 66124 29998 108369 22593 -253330 -249086 -131815 -294329 -412279 -333201 -44156 39469
15087 39469 108587 219083 162654 41723 124033 -32181 -98631 -106280 -116962 -148607 -157893
15076 -157893 -166896 -239812 -107780 158995 80712 -142467 -62612 -158838 1837 5501 114084
15065 114084 8551 160761 282652 244679 53596 98278 118455 107227 128046 27243
15055 27243 105692 56040 -16091 87035 321020 275349 94986 -183998 27334 198577
15045 198577 145475 51879 71909 215757 428292 371890 372682 467981 251096 120809 193932
15034 193932 60634 -125408 74241 203556 1669 -30401 -156474 -116306 38271 21544
15024 21544 19205 36654 206383 254163 353536 141945 57804 -74670 -99037 -183276 -185215
15013 -185215 -24108 -95252 -88294 2581 66518 -132351 -170944 76779 175937 112293 51924
15002 51924 -40795 -109906 -114264 -129399 -171051 -224139 -382911 -387641 -173728 -128995 -64631 21579
14990 21579 141388 111454 21183 56079 -100721 -174556 -221682 -191003 -236676 -107714 -48802
14979 -48802 -185486 -140159 14804 299709 215506 208834 248209 125590 85516 -138301 42987
14968 42987 96574 64630 56017 114961 172530 112602 -15876 -3188 27882 -40123 -136820 -66730
14956 -66730 79011 122455 48038 141576 258655 199036 -73210 -71531 146434 184535 229494
14945 229494 124910 206374 66123 -181453 -121124 50180 170281 297988 409377 485894
14935 485894 229020 103143 85675 -20257 -171849 -130741 -87663 84180 9996 -65771
14925 -65771 43405 -68829 -7810 66586 -168657 -190262 -41305 138960 147268 65275 -50201
14914 -50201 50285 80688 120153 62704 110066 62783 161747 253532 95780 104829 108301 123108
14902 123108 -76065 -155569 -7037 159630 195067 363479 284738 216525 257321 54996
14892 54996 17916 -394 -1397 -110846 -231280 -116338 38705 -111918 100238 71456 -52154
14881 -52154 -192569 -210518 -14957 -45937 -220956 -298695 -407970 -197478 38715 63697
14871 63697 123935 194913 116384 12777 -34943 -45069 -164965 -211696 -84413 48423 261823
14860 261823 244706 35221 31913 225569 349814 194626 -31973 -149594 5145 -110807
14850 -110807 -325472 -473564 -199683 135732 162062 388401 320188 81856 -65668 58603
14840 58603 209848 184458 205409 135390 240847 200506 203660 -41002 -179496 -151921 -231745
14829 -231745 -186355 -300774 -353555 -259513 -126017 -161224 108137 360517 238698 105881
14819 105881 -50259 -68728 39097 286190 466622 520145 293562 60963 35468 127353
14809 127353 163111 -2408 -57969 4612 -77126 -99170 26001 80632 78459 120012 159894
14798 159894 261550 67690 -28485 -52236 -54121 -94143 -268137 -36233 -111799 4656 184643
14787 184643 360173 525583 578137 315041 -12920 -31023 112678 134850 -115774 -224597
14777 -224597 -264115 -3192 48273 77041 74385 -26156 -233757 -359598 -101733 145566
14767 145566 199102 181235 66119 -214070 -106406 -5430 -85909 -57758 22461 123112
14757 123112 101238 131997 201406 290429 287470 426598 363161 230087 280192 116944 88353
14746 88353 16685 85144 101723 -12632 -126880 -95337 -120761 7964 -167677 -160083 -302802
14735 -302802 -228155 118813 284271 179255 -127932 -193440 -101662 -59018 123911 72344
14725 72344 24355 142455 139344 -96509 -62027 -72404 -87679 -100246 -41813 100836 -130735
14714 -130735 -270810 -378186 -463473 -306078 -121939 -16772 131176 18780 254653 47354
14704 47354 -104170 172618 416844 386110 242696 220464 176738 198279 221444 324511 284985
14693 284985 252496 221342 143339 64031 196777 45186 58052 -16054 -82653 -1737 -33428
14682 -33428 77002 96401 36515 -136575 189528 402206 198781 166965 -5149 -57629
14672 -57629 131144 339230 219535 17806 68665 -48537 -6176 188690 259853 98378
14662 98378 -24877 44610 47878 42582 45851 -79126 -268406 -411679 -374265 -59915 -44591
14651 -44591 -108769 -38300 -83049 -157639 16274 127166 256958 244174 93490 -87595 -128228
14640 -128228 -15776 155171 110468 43975 -51180 -54560 78054 292197 186764 63002
14630 63002 -3500 58234 161234 234964 62885 21309 -58550 -140229 -242169 -313976 -387630
14619 -387630 -230167 -45336 -14040 73940 105547 78034 102898 -19544 18773 23824 33754
14608 33754 6966 120402 95601 141249 349990 141670 184121 86410 -1550 -29076 -165378
14597 -165378 -250978 -244481 -30175 37849 99044 -54972 -162033 12988 89406 190353 189881
14586 189881 258508 204790 211526 -59936 -354875 -195480 75957 229746 239691 135761 126305
14575 126305 -195886 -320853 -133310 -120677 -78819 183610 298734 260744 386441 438545
14565 438545 360661 143297 18304 61270 118981 35160 -26480 219189 273213 152147 143326
14554 143326 279062 452377 426320 120389 -55107 -163554 -275617 -250207 26845 16805
14544 16805 -237622 -180395 13061 -4452 174470 314141 256604 148382 218513 173446 247054
14533 247054 208079 216145 178214 230489 203975 293563 418130 557118 370626 169830 165412
14522 165412 149478 219671 268750 196923 -24028 -91353 -2615 143527 204202 161738 365344
14511 365344 386510 248358 343603 216860 34751 87479 102757 150938 322677 424556
14501 424556 157091 -43595 36004 88910 -13220 -122886 -190504 -214300 -199174 -163256 -63080
14490 -63080 2522 7690 51861 212318 452500 473387 248434 33987 -4250 52046 189368
14479 189368 230719 84405 65084 140243 17164 45177 -7784 92445 189807 243521 218381
14468 218381 409866 422442 418305 376637 471845 412006 186690 148342 32676 29287 -2090
14457 -2090 -57463 10023 196326 278647 201858 331468 391294 356258 485336 448068 334792
14446 334792 248579 419625 325846 129150 106226 188951 141967 309813 428419 476232 576963
14435 576963 472329 421363 123421 -29711 63417 155192 116099 61339 136192 211994 25584
14424 25584 -165348 -282173 -138173 63106 147619 -17760 65260 362875 618087 533304
14414 533304 445748 482990 395427 183109 161643 159440 208694 244689 101030 8598 42796
14403 42796 166977 156435 -5977 -89248 -7567 -140162 -216468 -179419 31478 277142 291870
14392 291870 313244 254064 285994 223619 154901 247077 163876 -38037 -382576 -371422 -111698
14381 -111698 384083 730577 666173 495151 511874 473893 454142 242247 71286 21029
14371 21029 178375 213415 61250 -119649 -279828 -200575 -119936 -169581 228160 434865
14361 434865 323952 99239 12181 -36568 -105765 -64738 20574 106197 130581 147055 274605
14350 274605 209430 -205448 -155770 9793 67617 69819 107948 161954 22420 -46878 -159021
14339 -159021 -146235 -67327 -39911 125616 235694 69601 14326 105692 367878 326796 138732
14328 138732 126709 -1068 93358 130811 337163 453200 247304 254771 326782 449814 548961
14317 548961 528370 430921 294847 271717 356104 153740 72918 97721 296140 308984 406592
14306 406592 344133 438516 562975 398423 485063 628961 713010 609757 508337 602452
14296 602452 672990 747727 614992 362881 314316 579916 707569 987627 1050409 727553
14286 727553 378444 341402 646982 917884 788015 444087 280363 292439 507524 580598
14276 580598 661927 631175 787525 853546 988262 1123245 1226377 1272995 1335663 1513415
14266 1513415 1672467 1685544 1613042 1735308 1879662 1951217 1732225 1634795 1872496 2036714
14256 2036714 1973170 1855832 1897557 1846051 1778316 1733627 1501245 1291092 1220011 1273942 1403342
14245 1403342 1579083 1399771 1219992 1102729 1073324 1223158 1519959 1507307 1552771 1675077
14235 1675077 1671925 1637069 1594565 1466430 1581712 1700782 1899112 2006604 2096907 2068383
14225 2068383 1837184 2003413 1915333 1933149 2191987 2336357 2184679 1821859 1753047 1634318
14215 1634318 1483749 1416293 1478181 1448308 1499393 1536255 1444449 1322534 1303649 1295669 1320899
14204 1320899 1024402 791895 794280 645591 510060 666698 892977 858755 899701 899279 992086
14193 992086 904988 878979 785361 702425 703289 676056 702672 501910 695834 797002 885869
14182 885869 951778 1049808 1034658 1111369 901867 838244 753271 662982 741546 533746 488726
14171 488726 514716 572891 692015 709100 668323 539023 309491 200917 394115 637822
14161 637822 802092 825089 689059 707402 633666 548039 483460 292126 222872 377076 441560
14150 441560 524703 639966 625295 468068 252781 230477 230110 290538 471481 342249 252421
14139 252421 380735 340169 56423 -52450 -23055 -31256 -27567 -98279 -55052 227199 357966
14128 357966 468124 514567 327299 236813 243691 369835 457806 294137 410673 611886
14118 611886 618423 527077 327497 43320 8161 249382 118989 4077 131286 330966
14108 330966 166525 -8779 26571 44268 50784 218343 520167 525188 630845 831656 742143
14097 742143 480738 424579 439309 344806 294459 361396 340791 370154 383005 359409 228008
14086 228008 72612 302327 605617 573995 371372 177012 213428 132536 162359 -11102
14076 -11102 -1009 160196 169112 273561 503192 450529 322659 378695 360347 237245 308170
14065 308170 173541 531890 706382 517078 491027 636668 658081 614448 478665 578248
14055 578248 435215 149304 112651 145945 291445 427570 337031 321557 87549 134606
14045 134606 464300 710523 759945 528147 539060 417214 384782 347273 432137 638208
14035 638208 657210 755112 810089 907969 815514 494424 203304 86823 169257 231933 449200
14024 449200 679468 545913 409406 554635 632028 663879 410632 74287 -190609 -63983
14014 -63983 300235 322987 245801 381818 668198 632157 463115 288333 151432 374381
14004 374381 564947 559588 576759 400501 535671 853530 928420 1025013 1043277 994405 889298
13993 889298 768313 679915 635890 608117 600157 718559 608285 492708 469866 444121 384468
13982 384468 352758 468648 613041 702641 467880 215216 303030 449156 293689 257130
13972 257130 507778 616337 765406 517242 250929 368178 370284 441175 488197 537451
13962 537451 365198 406276 450019 373376 161607 266625 234939 141683 179327 351450 158079
13951 158079 192887 220856 124050 77374 132497 113522 182580 226863 401444 479884 566560
13940 566560 463527 492268 538122 662885 566500 410974 369744 611076 648215 567397 464166
13929 464166 583225 616568 656109 656929 817307 916309 768154 662946 447027 393610 447054
13918 447054 624694 862542 989865 810501 688477 655238 645615 615010 678701 880194
13908 880194 897401 1318917 1448937 1423170 1582215 1897225 1991257 1930797 2108070 2251276
13898 2251276 2321118 2304530 2399351 2478589 2666209 2777897 2915074 3018929 3226177 3212369
13888 3212369 3120802 3245484 3449568 3549221 3903034 4255020 4575617 5043252 5522281 5755475
13878 5755475 6136955 6636293 7274047 7885690 8552173 9270386 10049871 10966473 12046735
13869 12046735 13267155 14495919 15730595 17199323 19038863 20986354 23084196 25483064
13861 25483064 28057695 31006406 34497220 38138325 42259543 46423503 50755456 55544592
13853 55544592 60706857 65611776 70663411 75722042 80559909 85106828 89384816 92907192
13845 92907192 95861578 98220944 100068308 101580546 102512234 102829484 102957430 102836951 102675375
13836 102675375 102591195 102724500 103071959 103537774 104319805 105676263 107704467 110530412 113942000
13827 113942000 118103323 123217209 129037346 135941196 144267408 153762804 164622605 176883189
13819 176883189 190337073 205190104 220682195 236745684 253058363 268995900 284269515
13812 284269515 298195782 310236230 320151608 327308520 331546319 332962837 331732304 327761103
13804 327761103 321257234 313076097 303624610 293251300 282677775 272179974 262111086
13797 262111086 252960710 244907272 237883515 231903807 227189686 223570677 221276445 220051256
13789 220051256 220240662 222067269 225151155 229477593 235484460 242818007 251206050 260906810
13781 260906810 271950635 283720286 295654201 307572881 318743574 328520797 336404045
13774 336404045 342279688 345341014 345787121 343322474 337994997 330064530 319574151 306966596
13766 306966596 293068596 277984533 262632432 247415698 232598986 218425521 205269010
13759 205269010 193117871 182171886 172529696 164072868 156496451 149931475 144495305 139830492
13751 139830492 135705594 132380990 129897258 127825936 126392952 125488622 125077052 124902788
13743 124902788 124716412 124834061 124959777 125054404 124749391 124253279 123070367 121478532 119248899
13734 119248899 116517995 113354784 109578847 105340494 100745176 95957740 90895887 85557603
13726 85557603 80348250 75374570 70678374 66193318 61936742 57798252 54028841 50757252
13718 50757252 47722429 45009037 42260518 39798332 37614676 35795107 33921718 32254217
13710 32254217 30719646 29205448 27826354 26417191 24947808 23877541 23147825 22364541
13702 22364541 21736642 20883849 20265132 19557323 18730005 18034840 17649870 17158319 16521851
13693 16521851 16214518 15836683 15458974 14850168 14517419 14407679 14179133 13666409 13409686
13684 13409686 13104268 12792137 12443164 11960563 11785443 11646543 11386784 11221196 11123609
13675 11123609 11010613 11005116 10921453 10670929 10548216 10302099 10116504 9983366 9887585 9676870
13665 9676870 9368452 9201003 9126683 8999265 8963776 8787509 8674253 8746311 8797439 8651903
13655 8651903 8331854 8021221 8109494 8101553 7976725 7918425 7805550 7569206 7327911 7109714
13645 7109714 7217665 7196653 6994180 6957246 7010570 7151692 7005501 6886335 6771862 6673447
13635 6673447 6617362 6528049 6447513 6570120 6691345 6658891 6438410 6157757 5941663 5981488
13625 5981488 6075673 6093612 5894776 5800003 5819672 5647303 5566188 5775640 5830766 5792595 5610831
13614 5610831 5618949 5741484 5721938 5764804 5482023 5451315 5494057 5380037 5142936 5076569 5358548
13603 5358548 5403187 5073625 4980622 5072017 5240874 5347202 5160831 4964397 5004703 5153978
13593 5153978 5076051 4809943 4607807 4686451 4950492 4851454 4888245 4913973 4899600 4876839 4799183
13582 4799183 4805542 4823985 4874587 4910953 4711865 4710143 4814670 4850167 4882133 4768230 4638469
13571 4638469 4551561 4394017 4389004 4497264 4486794 4373130 4381220 4590990 4594817 4580958 4536094
13560 4536094 4310831 4121267 4057449 4209196 4431806 4515811 4512854 4608684 4559381 4699220
13550 4699220 4872114 4644535 4454115 4346226 4085906 4090817 4339402 4291149 4049113 3988997
13540 3988997 3968469 4120589 4187911 3970512 3893558 3881644 3921636 4137097 4253962 4404125
13530 4404125 4451223 4447141 4327027 4285002 4215152 4202299 4425210 4452246 4484930 4257278 4107008
13519 4107008 4100519 4153148 4119332 4022518 4078140 4021757 4111524 4062445 4040841 3966061 4101961
13508 4101961 4120790 4142189 4146234 3937367 3879146 4010831 4092292 4070953 4124344 4084914 3868942
13497 3868942 3839315 3814531 4005671 4138490 3973319 3902032 3970553 4210463 4272355 4234733
13487 4234733 4283549 4255952 4272102 4359549 4356553 4294651 4352376 4451313 4272777 4096684 4006427
13476 4006427 3853102 3894052 3957389 3940586 3772005 3701633 3928295 3978975 3775484 3696115
13466 3696115 3879605 4057291 4019984 3988733 3944930 4090478 4055636 3957660 3914868 3953254 4195384
13455 4195384 4090505 4014258 4064839 4072809 3691976 3891640 4186204 4084950 4017705 4179591
13445 4179591 4314784 4215895 4030599 3949099 3774771 4070957 4103922 4087267 4189950 4255099
13435 4255099 4130616 4130055 4117200 4092955 4131663 4259367 3974758 3831241 3994545 3971010 3888404
13424 3888404 3944096 3997980 4107374 3981245 3805020 3895077 4020721 4060809 3769544 3718351
13414 3718351 3745403 3773365 3894659 3863036 4065977 4222236 4295620 4234061 4223136 4247464 4123647
13403 4123647 4114616 4011688 3960910 4036018 4244358 4213480 4280791 4343226 4710186 4652412 4553176
13392 4553176 4568446 4459632 4442022 4728109 4944171 5001647 4828544 4649599 4517312 4607317
13382 4607317 4636823 4559683 4446098 4416108 4422039 4706053 4675409 4568806 4766866 4739137 4761874
13371 4761874 4715960 4682583 4735310 4664472 4641358 4546694 4817823 4920873 4895031 4769568 4828269
13360 4828269 4884464 4983385 5222545 5217387 5101201 5169938 5152836 5094403 5214338 5334661 5659638
13349 5659638 5662459 5803145 5735128 5725371 5853060 5850909 5928916 5753830 5541337 5490065 5390178
13338 5390178 5407484 5598199 5656144 5354097 5183035 5316751 5262991 5167699 5192416 5447820
13328 5447820 5757257 5622872 5492930 5520318 5662872 5501296 5665857 5953952 5999986 6016303
13318 6016303 5948488 5890633 5928712 5906321 5933162 5831851 5819992 5828159 5842050 5858804 5652687
13307 5652687 5320249 5370211 5596632 5639774 5407896 5378699 5323997 5416009 5404163 5196576
13297 5196576 5254290 5387358 5475326 5318971 5196550 5034213 4798364 4861861 4770699 4799725
13287 4799725 4930811 4895320 4935569 5195980 5122124 5080353 5094338 5067142 4954820 4960501 4843965
13276 4843965 4855480 4812903 4687043 4709245 4755684 4643934 4633893 4624955 4582622 4458089 4513408
13265 4513408 4700952 4446791 4304483 4454707 4490693 4534635 4426491 4250051 4133595 4103207
13255 4103207 4126658 4338427 4462460 4381441 4367254 4298447 4367221 4517075 4501527 4327313
13245 4327313 4584122 4516105 4403762 4237320 4191610 4292564 4420579 4429898 4553081 4409969
13235 4409969 4465871 4446967 4505327 4520195 4409542 4305790 4058591 4196450 4246733 4185727
13225 4185727 3979790 4081762 4126815 4249846 4220317 4246469 4384231 4239401 4456786 4612778
13215 4612778 4376693 4092890 3893441 3910114 4055186 4177106 4113787 4222881 4452215 4777786
13205 4777786 4806531 4694978 4618767 4540996 4463763 4388753 4518605 4460505 4268063 4272332 4415597
13194 4415597 4697557 4768392 4488274 4209419 4235407 4236020 4296447 4443308 4476012 4477436 4391985
13183 4391985 4324057 4378673 4565126 4630300 4640093 4479190 4398569 4610504 4586855 4584490 4517526
13172 4517526 4506329 4466951 4502320 4437908 4334307 4260061 4491729 4878453 4875069 4664647 4649900
13161 4649900 4709702 4937062 4930700 4792181 4535966 4544697 4578069 4551850 4621775 4891336 4850949
13150 4850949 4761140 4637446 4662399 4513642 4428205 4497017 4494501 4498269 4645812 4655953 4596885
13139 4596885 4516008 4517685 4426250 4465891 4468315 4675180 4845243 4795293 4617867 4635527 4588402
13128 4588402 4417348 4406724 4312566 4245184 4420168 4825268 4729502 4650431 4712475 4586183
13118 4586183 4630367 4659048 4503316 4524080 4522686 4652113 4871423 5020484 4897507 4839333
13108 4839333 4771533 4797606 4838996 4944535 4842300 4897392 5068577 4871830 4604575 4793244
13098 4793244 4894988 4599966 4454344 4488115 4481496 4473219 4527008 4507651 4436337 4498270 4575339
13087 4575339 4664056 4894752 4910539 4871018 4822690 4739999 4712744 4983409 4879819 4894490 5053413
13076 5053413 5061867 5076358 4972428 4898686 4889862 4856518 4967325 4929280 4954632 4995517 4925396
13065 4925396 4893243 4996114 4880585 4693945 4702673 4864300 4884229 4772959 4934761 5045793
13055 5045793 5013727 5011574 5231951 5147065 4801540 4644378 4748469 4766934 4795474 4789946 4869553
13044 4869553 4890464 4784712 4737276 4736702 4688858 4618402 4974875 5131769 5075263 5033775 5000117
13033 5000117 4962080 4834246 4792987 4782194 4661422 4680689 4630139 4632353 4719999 4814760 4908859
13022 4908859 4988782 4838464 4912943 4921099 5003354 5142145 5289807 5137637 4982073 4888212
13012 4888212 4947256 4849159 4823541 4734541 4730573 4695488 4732847 4787857 4771867 4837661 4886216
13001 4886216 4794211 4564893 4474792 4786875 4857573 4740415 4516787 4639204 4817321 4775483
12991 4775483 4816968 4882838 4962769 5110713 5171965 5079757 4958646 4840612 4767726 4956700
12981 4956700 4834185 4776813 4805168 4909097 4801031 4614919 4506299 4706163 4942180 4784585
12971 4784585 4803284 4888131 4990355 5007122 5032480 4842825 4910863 5207563 5174423 5040652
12961 5040652 5017371 5003093 4925897 4870331 4823233 5034805 4966073 4820181 4867784 4877460 5004852
12950 5004852 5052355 5122022 4778433 4668599 4843361 4917916 4941755 4956767 4932970 4907116 5148715
12939 5148715 5419934 5177389 5074023 4883366 4915888 4958033 4967993 5013248 5040704 5047045 4966540
12928 4966540 4848429 4868391 4975938 5197561 5003155 4874934 4973225 4866539 4847464 4818730
12918 4818730 4545869 4627283 4926270 4909274 4906873 5057147 4950376 4795741 4800181 5020560
12908 5020560 5025256 4944818 4935401 4926891 4940748 4774634 4676319 4752827 4792311 4881038 4812836 4814703
12896 4814703 4893793 4873281 4815946 4724211 4632632 4715970 4757353 4877495 4843762 4820903 4991797
12885 4991797 4857333 4680139 4531509 4412284 4373078 4467907 4638306 4635581 4543273 4568008
12875 4568008 4630691 4714642 4730295 4765636 4870865 4808532 4767033 4764259 4752054 5039637 4912471
12864 4912471 4568143 4470835 4505782 4628685 4518281 4471399 4610237 4689440 4747820 4534134
12854 4534134 4497076 4547875 4571290 4622472 4749594 4769155 4772031 4891845 4726559 4556947 4432666
12843 4432666 4428345 4487066 4399492 4559853 4519428 4477482 4420580 4472609 4776674 4988434 4863553
12832 4863553 4613237 4497706 4509223 4543383 4703242 4723441 4721291 4597331 4715071 4699533
12822 4699533 4631813 4714607 4594090 4502908 4415843 4260652 4338715 4448623 4374154 4384647 4432703
12811 4432703 4398657 4289798 4415849 4427971 4469797 4512064 4597858 4476542 4660537 4759394
12801 4759394 4857507 4790553 4745533 4764198 4547021 4493844 4522703 4474242 4612274 4734822 4692033
12790 4692033 4674984 4671048 4316384 4258223 4306050 4356071 4214591 4155649 4251349 4336267 4236564
12779 4236564 4419885 4485044 4468796 4482880 4479713 4610576 4328076 4241949 4544463 4679773
12769 4679773 4676338 4710540 4623434 4510882 4545531 4518091 4481572 4475986 4425100 4534420 4369246
12758 4369246 4318742 4234139 4191163 4211215 4420005 4605502 4485172 4282861 4333515 4248111
12748 4248111 4336716 4552808 4717265 4512128 4176862 4178473 4391787 4301378 4327485 4474651
12738 4474651 4512632 4331565 4340550 4229763 4051302 4167444 4125853 4082313 4144181 4473265
12728 4473265 4560684 4534878 4418695 4189326 3964176 3933005 4108047 4206534 4077995 3950457
12718 3950457 4125908 4168184 4195315 4234749 4190346 4209769 4136335 3871745 3836738 3746981 3770426
12707 3770426 3810815 4020792 3924003 3830995 3847857 3920884 3959018 3985977 4143338 4209847 4007377
12696 4007377 3916169 4175351 4456571 4443654 4348990 4267280 4036477 3913317 3786704 3817880
12686 3817880 3827116 3858868 4024909 3953052 3622117 3560665 3779476 3921179 4100360 3980138
12676 3980138 3765312 3797670 3846468 3855413 4041574 4056245 3859390 3895707 3831670 3688666 3588271
12665 3588271 3809845 3947042 4001435 4108449 4233982 4176026 4101469 4095664 3997767 4035430 3841361
12654 3841361 3713711 3780080 3838725 3719100 3784422 3864855 3832671 3823936 3794738 3681403 3773787
12643 3773787 3751698 3843327 3749073 3409036 3236925 3282262 3602032 3688108 3680751 3713743 3752947
12632 3752947 3891076 3884288 3870684 3747103 3649616 3690154 3701617 3646959 3519963 3347883 3207139
12621 3207139 3438754 3444559 3466239 3507144 3442199 3469234 3496401 3405819 3424544 3512414 3470221
12610 3470221 3476940 3541070 3354721 3218092 3441564 3678175 3519317 3375472 3392078 3456795
12600 3456795 3654270 3706132 3518139 3598638 3631834 3472583 3551225 3569770 3510859 3534308 3489150
12589 3489150 3173557 3253111 3316641 3390053 3411776 3408800 3369579 3390940 3341044 3404798 3535815
12578 3535815 3449120 3264420 3253634 3249620 3273755 3284776 3305084 3025000 3089607 3313657 3236434
12567 3236434 3105019 3259079 3393757 3489430 3630699 3574437 3250299 3089511 3155118 3014378
12557 3014378 3218936 3391510 3458718 3515853 3462369 3362117 3337105 3381078 3481634 3476400 3341474
12546 3341474 3460452 3252345 3011085 3166447 3211075 3253668 3375375 3700604 3679674 3323589
12536 3323589 3243271 3266445 3413486 3306201 2967078 2966132 2921263 3075930 3282250 3193329 3154094
12525 3154094 3159855 3203615 3053344 3035862 2903253 3056938 3110104 3216240 3383147 3108932
12515 3108932 2952183 2909929 2823187 2829958 2752245 2660803 2681290 2707421 2809535 2941364 2871351
12504 2871351 2809643 2681315 2582855 2583456 2488851 2596004 2799208 2884933 2981146 2921331 2714970
12493 2714970 2859719 3013842 2956437 2738159 2781642 2703495 2731000 2789859 2808425 2710794 2676432
12482 2676432 2598685 2513829 2741574 2793128 2821533 2847608 2649085 2542500 2585770 2505007 2377722
12471 2377722 2449799 2482728 2775759 2798612 2700512 2570009 2404155 2378819 2513554 2645223
12461 2645223 2498674 2499887 2392034 2379991 2474668 2619793 2637113 2414536 2402640 2378242 2387918
12450 2387918 2297043 2154240 2201168 2416374 2376669 2266237 2353229 2314359 2244608 2462861
12440 2462861 2535412 2732515 2695521 2793024 2692425 2530518 2440901 2402195 2423746 2367234 2629872
12429 2629872 2745599 2762289 2830719 2686628 2555431 2344721 2263307 2257415 2124669 2188712
12419 2188712 2327036 2297748 2439067 2552107 2449643 2271665 2361228 2453697 2534489 2481801
12409 2481801 2446149 2268434 2095354 2157606 2367421 2622777 2516358 2613936 2504891 2387316
12399 2387316 2454795 2594071 2499029 2386632 2387580 2318386 2384970 2342473 2367803 2452785 2460311
12388 2460311 2336129 2099188 2126563 2204849 2078708 2061810 2218485 2329083 2110291 1955784
12378 1955784 1978620 2127762 2274015 2453436 2338268 2247513 2259738 2251169 2149336 2271371
12368 2271371 2459441 2523563 2533682 2426283 2207217 2193775 2101823 2074899 2155554 2284858
12358 2284858 2066080 2202738 1990693 1776643 1778452 1918278 2052233 2058195 2162658 2221064
12348 2221064 2302959 2430627 2428346 2284938 2235802 2068145 1780484 1870519 1902141 2039398
12338 2039398 2105219 2026922 1955999 1829373 1673012 1641408 1604828 1461781 1402143 1395031 1767115
12327 1767115 2099423 1987579 2091141 2043169 2071745 2136808 2165822 2359742 2263569 2093720
12317 2093720 1932001 1964564 2000301 2068908 2101040 2089486 2063690 1869061 1730584 1621514
12307 1621514 1537119 1806196 2107656 2223263 2209118 2053784 2022455 2033384 1964125 1723320
12297 1723320 1723359 1825676 1903669 2023587 1880301 1676144 1876093 2167819 2269175 2005843
12287 2005843 1903474 1916537 1680648 1541955 1760535 1769104 1805904 1949270 1949096 1632469 1560228
12276 1560228 1581704 1718849 1849376 1631956 1560898 1646654 1629108 1840474 1909333 1862219
12266 1862219 1897984 2061925 2201087 2276321 2108673 1997531 1992166 1814645 1772880 1825464
12256 1825464 1852656 1869608 1865622 1797407 1667641 1711551 1645017 1690808 1642231 1581541 1449498
12245 1449498 1591236 1693504 1791971 1928755 2088927 2363511 2093588 2014786 1947745 1815459
12235 1815459 1793515 1543605 1369204 1259869 1228932 1465434 1668342 1747756 1738687 1695769
12225 1695769 1597529 1557226 1672371 1458230 1471376 1523755 1439337 1275788 1103181 950058
12215 950058 1006572 1124471 1161240 1208803 1357184 1323022 1479017 1464857 1611360 1589316 1501420
12204 1501420 1509152 1355417 1364811 1284076 1328020 1503819 1636628 1592778 1532137 1528362 1774936
12193 1774936 1861209 1781795 1764556 1502734 1284132 1126233 1241789 1540210 1480096 1589997
12183 1589997 1480435 1170831 1141195 1210952 1314891 1402150 1322146 1362817 1224456 1503675
12173 1503675 1608991 1612015 1582572 1587696 1632531 1677266 1645805 1887050 1699047 1519277 1461220
12162 1461220 1487760 1576871 1402551 1337194 1383569 1319131 1412711 1352777 1109626 1052468 1168789
12151 1168789 1214362 1116061 1030515 1176615 1413624 1678976 1895967 1739910 1670415 1652034
12141 1652034 1477618 1407459 1434089 1240699 1016139 1178090 1417850 1381506 1285757 1113776
12131 1113776 1066556 937183 1195015 1380636 1314462 1272054 1329199 1243183 964239 1007352
12121 1007352 1090830 1083115 1248502 1387091 1598854 1475081 1190763 1176280 1240078 1130492
12111 1130492 1216679 1326344 1456130 1529859 1510267 1395762 1297317 1172083 1224133 1333399
12101 1333399 1393675 1386526 1398531 1296515 1154983 1066246 1189542 1336856 1391417 1386814 1079305
12090 1079305 1009727 1332397 1369372 1256106 1188517 995836 894027 848809 864170 737820
12080 737820 828898 1100057 1197811 1163227 1225084 1200619 1240599 1360982 1330228 1206710 1298067
12069 1298067 1414925 1430185 1306935 1115331 1088295 1130621 1269038 1513320 1451772 1431669
12059 1431669 1376197 1418498 1224814 1191178 1163084 1163417 1324232 1299361 1182190 1129335 1181862
12048 1181862 1426454 1381572 1239134 1337855 1494572 1350092 1189293 1160264 1076620 1056477
12038 1056477 1081025 1268254 1485647 1291984 975543 969355 845768 766734 971077 1154239
12028 1154239 949479 723753 687875 784943 969373 941030 797912 815052 916615 1193267
12018 1193267 1199401 1250167 1312981 1099325 998867 1168135 1035454 1041215 1045976 1054845 966366
12007 966366 856429 792692 1032862 1013929 983025 991621 997112 1059428 954014 1004776 1096121
11996 1096121 1042387 1137252 987289 842601 909111 1130084 1279033 1303458 1221143 1277197
11986 1277197 1238598 1051201 767824 596900 703556 944008 922880 903567 859324 690107
11976 690107 581996 599553 613713 870399 1018909 1012527 954017 1009335 924553 719676 722193
11965 722193 771627 704023 623095 733614 629000 542792 685504 776331 904460 931817 968248
11954 968248 1095898 1108481 1087374 972796 1100727 1021061 1011553 982859 907003 957866 1161111
11943 1161111 1208706 1206270 1157042 1055130 999535 866369 831401 799158 859398 911004 1044583
11932 1044583 1104017 1069029 1026022 1010475 908768 1031477 1022695 917161 843294 824998 812893
11921 812893 734910 691206 722564 940880 1146559 1043543 946366 957643 896317 768112 599995
11910 599995 594740 522640 500827 672889 662367 759492 954742 916036 907348 998364 942013
11899 942013 595140 628750 726588 611888 585101 613619 718446 729040 828690 800710 646080
11888 646080 714858 944149 766642 735133 883278 1048459 1068847 940451 816318 945413
11878 945413 895230 1007286 1060170 829602 665936 518228 654390 806840 898750 1012497
11868 1012497 1192363 1127529 958168 840553 780674 758278 624531 628010 750770 721511
11858 721511 713069 1061249 1032223 905096 783131 641574 795723 1077140 1003239 864029
11848 864029 782270 925656 1058047 859497 721332 756938 759339 896455 991239 894244 651266
11837 651266 514894 507299 535424 311598 205923 375316 275308 349070 245553 312606
11827 312606 343738 519748 480828 549253 412566 409436 478422 657929 660944 475679 375251
11816 375251 502183 566185 729376 761988 770719 814931 700871 657033 454161 641205 692098
11805 692098 779016 821894 770999 717043 547658 463328 349474 385980 372978 406989 512175
11794 512175 554881 492163 563428 610850 493946 250864 301533 480889 756868 844842 572946
11783 572946 451546 547115 729393 596051 374879 306832 433245 439559 562303 629378
11773 629378 758308 817984 706502 675103 529722 514132 708682 737000 574838 450542
11763 450542 385201 416653 472408 680348 858052 882049 709093 514214 680368 493933
11753 493933 195319 39172 18742 -13731 78532 311220 358085 292828 245965 304700 395532
11742 395532 428123 316619 373461 405126 356231 359005 476631 404029 437682 508546 546659
11731 546659 518315 431417 326526 629521 769640 516610 535852 423559 236812 415434
11721 415434 645014 635748 450844 385323 473892 533513 433489 406081 295283 301884 448969
11710 448969 358494 432737 361625 316864 428966 335273 363782 382355 307177 330888 374020
11699 374020 575559 735910 809434 670299 412413 398148 674629 788007 720839 467357
11689 467357 354052 250365 352516 266930 256869 361568 427565 449060 363604 440709 305646
11678 305646 350674 637176 871213 634024 470054 434337 445701 306677 281126 267250
11668 267250 383687 339291 353301 485877 384198 233291 188468 365970 225196 34846
11658 34846 87954 205344 470336 690204 459155 233795 106322 182336 393552 526787
11648 526787 532414 402325 112195 56264 238378 236336 183443 222800 504594 715468 891722
11637 891722 1285400 1843503 2487418 4124513 6450551 9846995 12809166 14798671 15509762
11628 15509762 14047395 9910394 6477396 4698016 3494323 2670496 2279815 2082058
11620 2082058 1834181 1649713 1369810 1195361 1119544 1146604 1200452 1157813 1044823 1029759
11610 1029759 1085648 1085256 905906 711488 598392 681282 877752 728788 609606 501748
11600 501748 304211 339171 384644 654742 551970 470682 360166 213237 337289 462301
11590 462301 532648 478625 457961 591868 555609 465820 355212 233381 248721 378254 514632
11579 514632 581030 696369 622924 397852 258743 315806 263694 437029 411268 502713 533339
11568 533339 599859 819153 766099 779747 932116 1077745 1035893 721247 583386 552157
11558 552157 588550 460577 325255 487540 685091 691023 665966 477315 432076 403110 507390
11547 507390 433134 274910 278189 385021 315467 234173 401903 766956 962616 745672
11537 745672 679097 641797 498495 319710 197977 232345 180387 329471 295814 242800 370022
11526 370022 330221 200132 199305 180144 158700 240310 399571 242446 223787 337143 497778
11515 497778 548289 529806 804753 648659 420768 277769 192316 70002 233026 233280 -32018
11504 -32018 95272 52228 79399 348757 518951 511014 399908 176091 197184 268655 305855
11493 305855 262929 121538 219135 247202 266241 7779 -202129 -252631 -37918 -70866 -24199
11482 -24199 69687 17021 6907 -567 56597 393297 269320 243342 351915 446226 397316
11471 397316 562249 543391 631164 548591 467670 543515 377136 123199 -130581 36170
11461 36170 222291 188828 88457 59508 171375 258167 285564 39845 -69228 89092
11451 89092 145676 133128 313802 451847 470637 297620 355977 400864 526500 490501 296352
11440 296352 130056 -94934 -79303 122081 300256 606910 910505 647042 467009 329254
11430 329254 255733 279646 470836 649091 587168 329282 197766 290442 257255 373276
11420 373276 219384 201010 325567 500889 683777 795707 547197 234896 168801 111758
11410 111758 204095 7059 -116820 -269511 -170934 53025 167846 242511 303827 93577
11400 93577 27130 3476 -56374 38624 261721 285910 169563 216358 139230 85666 10080
11389 10080 -108343 -340647 -398753 -233448 50066 240605 278701 241284 111476 -61621
11379 -61621 90583 179424 31441 156174 166712 171301 138820 276296 205237 263276 82181
11368 82181 371811 488002 344523 273910 188700 389355 478942 224566 -127318 36071
11358 36071 77627 -83422 52282 127781 105487 213480 240238 206760 227948 121458 103343
11347 103343 275827 228232 271400 139404 161829 136441 -6770 -100461 -28323 23919 -133135
11336 -133135 -290583 -335421 -311661 23772 284820 137088 143744 152748 257470 -10958 -187302
11325 -187302 -216765 -284532 -156098 -123482 -27959 -84828 136581 144740 121431 248110 166910
11314 166910 61129 104164 329069 382114 314103 138186 -238900 -357221 -206523 -68626
11304 -68626 -45303 -166646 76526 313584 404683 216400 199935 62129 171413 228792
11294 228792 145765 4410 -124455 -81354 73856 227705 234640 224258 249166 31623 29269
11283 29269 -211876 -294468 -205208 40475 72370 -37851 -53778 -11377 23382 -96823 -129685
11272 -129685 -188694 -173546 40960 260230 139356 137066 260551 144516 -52037 -179496
11262 -179496 -102428 -78798 34692 -106819 -150423 8203 210873 269156 300162 185993
11252 185993 77557 -6031 40487 -47151 13761 -75887 -93983 -25803 -1925 172143 163752
11241 163752 213072 296745 444314 276799 130967 168600 -14763 -250465 -225458 170157
11231 170157 465874 591853 472393 271219 130877 141373 126736 61405 65197 150433 118912
11220 118912 238886 187388 148719 149614 158333 92907 102130 15684 -140169 -112796 -110290 -184275
11208 -184275 -114767 52685 36457 41096 -3849 -140704 -356067 -206761 -48304 40969 46859
11197 46859 101460 126717 -10089 -104362 -59886 -82668 -147940 -67285 43950 -64578 -188096
11186 -188096 19073 60722 107507 -102110 -161268 46654 187781 82287 -35004 -195135
11176 -195135 -421701 -417493 -375275 -195979 -72476 108724 11852 20502 208459 169742 208772
11165 208772 82649 6290 -108571 -249851 -354190 -349638 -292795 -135443 16320 -116547
11155 -116547 -307154 -295010 -344788 -614487 -749820 -459422 -339882 -320189 -291845 -241164
11145 -241164 -248644 -291184 -472202 -402524 -312102 -419815 -381459 -168504 -28370 -203144 -385851
11134 -385851 -206833 -105181 -128416 120113 55781 -81134 -189668 -231433 -345801 -366532
11124 -366532 -146751 -86423 38137 107009 -169676 -241333 -149984 -343479 -162738 22039
11114 22039 -44354 56039 -117136 -29125 74776 -110529 -313271 -465515 -445573 -275182
11104 -275182 -69582 8820 25026 89704 -32527 -213085 -192224 -75699 -200900 -444733
11094 -444733 -302050 -244983 -130542 5905 1857 36993 129610 -50296 -99607 4807 46493
11083 46493 -36558 40758 -217675 -390477 -522765 -652735 -667513 -508783 -439364 -346615 -398164
11072 -398164 -311683 -131256 -99912 -283855 -264653 -381199 -385886 -410980 -378639 -159266 -64319
11061 -64319 -199390 -365046 -298770 -262171 -281463 -448639 -435092 -376016 -341618 -205535 28163
11050 28163 219764 188452 188852 112439 300937 287162 283768 153629 202032 189400 281448 269734
11038 269734 202452 387489 708482 670668 873981 974058 1123217 1134617 1155534 1113913
11028 1113913 904696 971225 1179871 1411031 1313723 1393172 1463397 1563818 1464592 1293000
11018 1293000 1029148 961571 704420 684719 604071 742203 1195840 1498692 1466279 1410978
11008 1410978 1387104 1051752 762848 627854 523833 585717 555065 519665 615232 400369
10998 400369 373539 364608 350003 300721 226970 296931 82430 -265536 -245866 -2212 -29418
10987 -29418 -129702 -282899 -397792 -321914 -341245 -436668 -415464 -598067 -539960 -440183 -479838
10976 -479838 -420102 -218027 -34425 -112647 -239541 -386845 -635555 -745989 -545482 -539517
10966 -539517 -461098 -305954 -339185 -171023 -279633 -255238 -248676 -353485 -361528 -211461 -376060
10955 -376060 -611245 -614091 -433248 -508411 -451689 -381966 -398477 -609251 -763054 -659275 -662204
10944 -662204 -632726 -574687 -528342 -400583 -255846 -59131 -69012 -21547 77979 -135459 -184542
10933 -184542 -381141 -444645 -269070 -323614 -398499 -334201 -103455 -25646 -123239 -66851 56385
10922 56385 -146315 -154724 -204095 -289607 -403001 -416867 -245596 -129298 -202075 -345518 -388749
10911 -388749 -403611 -455527 -368996 -479753 -616339 -673019 -693779 -633294 -616582 -338619 6763
10900 6763 -64644 -47966 148012 -65512 -213155 -335353 -254976 -236809 -420065 -421267 -356063
10889 -356063 -480076 -560850 -650035 -631807 -771612 -854442 -731984 -579613 -615639 -710697 -777344
10878 -777344 -785621 -707321 -589091 -266749 -124525 -310009 -425004 -377145 -206539 -230345
10868 -230345 -272581 -165430 -204604 -367234 -200818 -223927 -310409 -486197 -652154 -547576
10858 -547576 -347648 -476193 -486697 -468452 -437144 -331770 -471952 -490393 -444109 -513538 -503798
10847 -503798 -399144 -415069 -409739 -423631 -456623 -419443 -361001 -295306 -245448 -514719 -523468
10836 -523468 -511768 -554635 -457144 -178391 -125130 -166715 -344199 -368245 -232727 -228657 -280475
10825 -280475 -399634 -735138 -829995 -863653 -826032 -793156 -793371 -752582 -560785 -276678 -434248
10814 -434248 -453510 -528158 -511972 -686993 -725397 -526379 -508788 -565403 -531749 -650084 -851110
10803 -851110 -799912 -464621 -281254 -256886 -161402 -356527 -694096 -808908 -656821 -693368
10793 -693368 -623605 -531428 -473907 -519618 -521285 -269144 -416824 -546758 -672347 -852796 -624789
10782 -624789 -280382 -290592 -412878 -440244 -480294 -629194 -880800 -1086404 -954289 -1035596
10772 -1035596 -1017478 -1086517 -904942 -773131 -776677 -875607 -958202 -903372 -692249 -579591 -645590
10761 -645590 -691182 -490419 -541310 -651140 -754821 -689711 -564813 -639598 -846151 -905917
10751 -905917 -846167 -884863 -1109899 -1068008 -824361 -741784 -607942 -704293 -802197 -966356 -1214458
10740 -1214458 -961440 -701158 -690735 -497114 -394800 -338651 -542841 -897943 -1209344 -1089267
10730 -1089267 -992988 -896124 -1072853 -1042414 -928289 -969271 -914544 -806447 -1024725 -1246239
10720 -1246239 -1163718 -1219001 -1383954 -1339394 -1144509 -1017939 -808690 -1015724 -1081340 -1053344
10710 -1053344 -950012 -1033242 -1031487 -828346 -923436 -1286724 -1505143 -1613788 -1545560 -1445410
10700 -1445410 -1458262 -1408405 -1565107 -1646597 -1518212 -1242212 -1070403 -1152657 -1113960 -1091674
10690 -1091674 -1205849 -1290314 -1238563 -1348456 -1665862 -1573523 -1483184 -1415921 -1288288 -1220859
10680 -1220859 -1242699 -1257651 -1104135 -1209807 -1324649 -1616864 -1634949 -1600746 -1756852 -1747529
10670 -1747529 -1819465 -1742158 -1789635 -1689503 -1628364 -1729153 -1827427 -2035388 -2232498 -2067767
10660 -2067767 -1794058 -1547687 -1404245 -1256048 -1129197 -1004189 -985098 -572110 -354021 -168178
10650 -168178 70676 89937 -51340 -239538 -377825 -558565 -730816 -899032 -655773 -580980
10640 -580980 -545453 -302199 -46306 141718 422203 802702 1393284 1968103 2392680 2728914
10630 2728914 3098399 3765682 4283034 4959366 6172892 7763726 10183058 13312559 17856635
10621 17856635 24044579 32153614 42753602 55534549 69144608 81751625 91869057
10614 91869057 97968026 100138578 99083245 97468872 98291656 103606754 115129328 133641338
10606 133641338 158018712 184352582 207732207 223908541 229715365 224331815 211446022
10599 211446022 198164429 190484585 192000088 204333809 227283703 257636282 288968193
10592 288968193 313927556 326963535 323945802 304595265 274936471 245249954 223021432
10585 223021432 210928515 209399487 216607013 229177056 242593955 251273326 251517302 241071293
10577 241071293 220357791 193984609 169384947 150628319 138318670 131882061 130117818
10570 130117818 131083618 131997838 130930503 126117507 116902523 104359074 90036610 76273051
10562 76273051 64772301 55865494 48664872 42721803 38221888 34513475 31601129 29098078
10554 29098078 26920506 25091746 23380720 21848827 20445709 19168178 18146012 17152499
10546 17152499 16245572 15377524 14779412 14352190 13846540 13023626 12559179 12262817 11798777
10537 11798777 11043288 10442046 10225751 9860166 9644252 9453693 9125180 8738216 8282666
10528 8282666 8189744 8041038 7693291 7450010 7204867 7081786 6877366 6568518 6557071 6396861
10518 6396861 6169627 5928888 5711305 5717603 5913251 5899318 5546128 5228573 5114843 4988302
10508 4988302 4741939 4790321 4805511 4666648 4565483 4462210 4341154 4476491 4322091 4158317
10498 4158317 3943969 3983849 4129596 3990833 3885262 3835528 3760121 3550605 3305947 3262161
10488 3262161 3219792 3157002 3234277 3086738 3118437 3117239 3136272 3286272 3423563 3246716 2937256
10477 2937256 2769744 2686965 2727797 2878043 3038585 2939958 3047931 2977234 3018771 3019307 2873087
10466 2873087 3012935 3002782 2954485 2817314 2585057 2377133 2209195 2165724 2285761 2473530
10456 2473530 2445526 2218086 2146155 2097083 2279518 2251401 2255096 2368618 2345618 2152154 2075694
10445 2075694 2256525 2202675 1991666 1972124 1785881 1755977 1963972 2089108 2262335 2180469
10435 2180469 2129589 2175963 2217600 2234053 2155013 1806668 1737333 1799367 1695743 1614212 1829461
10424 1829461 1994600 1960810 1875917 1908121 1843404 1792411 1877105 2011689 1790873 1601056
10414 1601056 1648105 1542873 1413783 1447759 1451380 1695579 2028481 1912810 1832675 1823861 1574872
10403 1574872 1552913 1660906 1662840 1492591 1460200 1474649 1418455 1471192 1655264 1435407 1231374
10392 1231374 1249303 1497131 1689730 1584422 1509961 1423750 1327732 1285463 1304367 1414557
10382 1414557 1362764 1328255 1242118 1419040 1418278 1443170 1259455 1130894 1106345 1131896 1073849
10371 1073849 1204572 1057559 1020456 1033984 1092372 1105075 1053883 986409 1025664 1167629 1072640
10360 1072640 1117820 1222326 1146319 1290465 1514210 1485696 1395860 1178040 1010017 972712
10350 972712 933725 951925 776373 873307 824066 911353 1158976 1405365 1306293 1255811 1173860
10339 1173860 947429 802638 819942 820205 822838 942393 899282 1089544 1169018 973151 857422
10328 857422 768692 908672 885375 800477 792025 784625 680945 672884 819697 795553 653724
10317 653724 566433 528762 592301 629011 905552 1078460 1072196 951751 985083 908013 597144
$$ [...]
##END NTUPLES=NMR SPECTRUM
##END=
