##TITLE=Analysis number 325649
Compound Code cc 12409
Book Reference 276533
Project Code adrs fraglib
Chemist Name jom
##JCAMPDX= 6.0         $$ Bruker NMR JCAMP-DX V2.0
##DATA TYPE= NMR SPECTRUM
##DATA CLASS= NTUPLES
##ORIGIN= Bruker BioSpin GmbH
##OWNER= nmr
$$ XWIN-NMR		Version 3.5
$$ Fri Jan  5 15:49:54 2007 GMT Standard Time (UT+0h)  MAYBRIDGE\nmr@NMR_250MHZ
##.OBSERVE FREQUENCY= 250.131544655141
##.OBSERVE NUCLEUS= ^1H
##.ACQUISITION MODE= SIMULTANEOUS (DQD)
##.ACQUISITION SCHEME= undefined
##.AVERAGES= 16
##.DIGITISER RES= 18
##SPECTROMETER/DATA SYSTEM= dpx250
##.PULSE SEQUENCE= zg30
##.SOLVENT NAME= CDCl3
##.SHIFT REFERENCE= (INTERNAL, CDCl3, 0, 16.5191)
##AUDIT TRAIL= $$ (NUMBER, WHEN, WHO, WHERE, WHAT)
$$ ##TITLE= Audit trail, XWIN-NMR		Version 3.5
$$ ##JCAMPDX= 5.01
$$ ##ORIGIN= Bruker BioSpin GmbH
$$ ##OWNER= nmr
$$ C:\u/data/dgb/nmr/ADRS/650/pdata/1/auditp.txt
$$ ##AUDIT TRAIL=  $$ (NUMBER, WHEN, WHO, WHERE, WHAT)
(   1,<2007-01-05 15:49:32.70 +000>,<MAYBRIDGE\nmr>,<NMR_250MHZ>,
      <created by zg, POWCHK disabled, PULCHK disabled
       configuration hash MD5:
       49 4B E0 1D 92 C2 6B 37 9F E6 65 BC 52 41 86 1D
       data hash MD5: 64K
       34 F9 23 AC 85 3F C0 02 67 F6 50 AD 79 BD 31 25>)
(   2,<2007-01-05 15:49:45.11 +000>,<MAYBRIDGE\nmr>,<NMR_250MHZ>,
      <Start of raw data processing
       ef LB = 0.3 FT_mod = 6 PKNL = 1 SI = 32K 
       data hash MD5: 32K
       BC A0 7A FF E2 86 3F 9F 09 FA FD 14 57 73 32 BD>)
(   3,<2007-01-05 15:49:46.86 +000>,<MAYBRIDGE\nmr>,<NMR_250MHZ>,
      <apk 
       data hash MD5: 32K
       3A C7 EF D3 06 3B AB 47 6C D5 6C 45 BF 59 38 94>)
(   4,<2007-01-05 15:49:47.55 +000>,<MAYBRIDGE\nmr>,<NMR_250MHZ>,
      <abs ABSG = 5 
       data hash MD5: 32K
       2E A6 09 47 4C 4C 3D 91 C8 F9 91 D7 F3 DE 03 44>)
$$ ##END=
$$ 
$$ hash MD5
$$ 9F 1C 2D 39 DF A2 D9 AC 28 FE 6F 22 14 E8 54 71
##$RELAX= 
##$RELAX= 
##$RELAX= 
##$RELAX= 
##$RELAX= 
##$RELAX= 
##$RELAX= 
$$ Bruker specific parameters
$$ --------------------------
##$DU= <C:\u>
##$EXPNO= 650
##$NAME= <ADRS>
##$PROCNO= 1
##$TYPE= <nmr>
##$USER= <dgb>
##$AMP= (0..31)
100 100 100 100 100 100 100 100 100 100 100 100 100 100 100 100 100 100 
100 100 100 100 100 100 100 100 100 100 100 100 100 100 
##$AQSEQ= 0
##$AQ_mod= 3
##$AUNM= <au_zg>
##$AUTOPOS= <6 >
##$BF1= 250.13
##$BF2= 250.13
##$BF3= 250.13
##$BF4= 250.13
##$BF5= 500.13
##$BF6= 500.13
##$BF7= 500.13
##$BF8= 500.13
##$BYTORDA= 1
##$CFDGTYP= 0
##$CFRGTYP= 5
##$CHEMSTR= <none>
##$CNST= (0..31)
1 1 145 1 1 1 1 1 1 1 1 1 1 1 1 1 1 1 1 1 1 1 1 1 1 1 1 1 1 1 1 1 
##$CPDPRG= <>
##$CPDPRG1= <>
##$CPDPRG2= <>
##$CPDPRG3= <>
##$CPDPRG4= <mlev>
##$CPDPRG5= <mlev>
##$CPDPRG6= <mlev>
##$CPDPRG7= <mlev>
##$CPDPRG8= <mlev>
##$CPDPRGB= <>
##$CPDPRGT= <>
##$D= (0..31)
0 1 0 0 0 0 0 0 0 0.06 0 0 0 0 0 0 0.0002 0 0 0 0 0 0 0 0 0 0 0 0 0 0 
0 
##$DATE= 1168012171
##$DBL= (0..7)
120 120 120 120 120 120 120 120 
##$DBP= (0..7)
150 150 150 150 150 150 150 150 
##$DBP07= 0
##$DBPNAM0= <>
##$DBPNAM1= <>
$$ [...]
##$SUBNAM7= <"">
##$SUBNAM8= <"">
##$SUBNAM9= <"">
##$SW= 20.6930455092707
##$SWIBOX= (0..15)
0 0 3 0 0 0 0 0 0 0 0 0 0 0 0 0 
##$SW_h= 5175.983436853
##$TD= 65536
##$TD0= 1
##$TE= 294.16
##$TE2= 300
##$TE3= 300
##$TEG= 300
##$TL= (0..7)
0 120 120 120 120 120 120 120 
##$TP= (0..7)
150 150 150 150 150 150 150 150 
##$TP07= 0
##$TPNAME0= <>
##$TPNAME1= <>
##$TPNAME2= <>
##$TPNAME3= <>
##$TPNAME4= <>
##$TPNAME5= <>
##$TPNAME6= <>
##$TPNAME7= <>
##$TPOAL= (0..7)
0.5 0.5 0.5 0.5 0.5 0.5 0.5 0.5 
##$TPOFFS= (0..7)
0 0 0 0 0 0 0 0 
##$TUNHIN= 0
##$TUNHOUT= 0
##$TUNXOUT= 0
##$USERA1= <user>
##$USERA2= <user>
##$USERA3= <user>
##$USERA4= <user>
##$USERA5= <user>
##$V9= 5
##$VALIST= <valist>
##$VCLIST= <CCCCCCCCCCCCCCC>
##$VD= 0
##$VDLIST= <DDDDDDDDDDDDDDD>
##$VPLIST= <PPPPPPPPPPPPPPP>
##$VTLIST= <TTTTTTTTTTTTTTT>
##$WBST= 1024
##$WBSW= 4
##$XGAIN= (0..3)
0 0 0 0 
##$XL= 0
##$YL= 0
##$YMAX_a= 290450
##$YMIN_a= -347045
##$ZGOPTNS= <>
##$ZL1= 120
##$ZL2= 120
##$ZL3= 120
##$ZL4= 120
##$ABSF1= 16.51905
##$ABSF2= -4.174122
##$ABSG= 5
##$ABSL= 3
##$ALPHA= 0
##$AQORDER= 0
##$ASSFAC= 0
##$ASSFACI= 0
##$ASSFACX= 0
##$ASSWID= 0
##$AUNMP= <proc_1d>
##$AZFE= 0.1
##$AZFW= 0.1
##$BCFW= 0
##$BC_mod= 0
##$BYTORDP= 0
##$COROFFS= 0
##$CY= 12.5
##$DATMOD= 1
##$DC= 0
##$DFILT= <>
##$DTYPP= 0
##$F1P= 14.0000005364418
##$F2P= -0.99999901652339
##$FCOR= 0.5
##$FTSIZE= 32768
##$FT_mod= 6
##$GAMMA= 0
##$GB= 0
##$INTBC= 1
##$INTSCL= 1
##$ISEN= 128
##$LB= 0.3
##$LEV0= 0
##$LPBIN= 0
##$MAXI= 10000
##$MC2= 0
##$MEAN= 0
##$ME_mod= 0
##$MI= 0
##$NCOEF= 0
##$NC_proc= -4
##$NLEV= 6
##$NOISF1= 0
##$NOISF2= 0
##$NSP= 0
##$NTH_PI= 0
##$NZP= 0
##$OFFSET= 16.51905
##$PC= 1
##$PHC0= 224.8956
##$PHC1= 6.912323
##$PH_mod= 1
##$PKNL= yes
##$PPARMOD= 0
##$PSCAL= 4
##$PSIGN= 0
##$REVERSE= no
##$SF= 250.130000737386
##$SI= 32768
##$SIGF1= 0
##$SIGF2= 0
##$SINO= 400
##$SIOLD= 32768
##$SREGLST= <1H.CDCl3>
##$SSB= 0
##$STSI= 32768
##$STSR= 0
##$SW_p= 5175.98343685301
##$SYMM= 0
##$S_DEV= 0
##$TDeff= 65536
##$TDoff= 0
##$TI= <Analysis number 999999
Compound Code 99
Book Reference 9
Project Code 9>
##$TILT= no
##$TM1= 0
##$TM2= 0
##$TOPLEV= 0
##$USERP1= <user>
##$USERP2= <user>
##$USERP3= <user>
##$USERP4= <user>
##$USERP5= <user>
##$WDW= 1
##$XDIM= 32768
##$YMAX_p= 435547326
##$YMIN_p= -231465
$$ End of Bruker specific parameters
$$ ---------------------------------
##NTUPLES= NMR SPECTRUM
##VAR_NAME=  FREQUENCY,     SPECTRUM/REAL,   SPECTRUM/IMAG
##SYMBOL=    X,             R,               I
##VAR_TYPE=  INDEPENDENT,   DEPENDENT,       DEPENDENT
##VAR_FORM=  AFFN,          ASDF,            ASDF
##VAR_DIM=   32768,         32768,           32768
##UNITS=     HZ,            ARBITRARY UNITS, ARBITRARY UNITS
##FACTOR=    0.157963299565203, 1,           1
##FIRST=     4131.91013829481, 0,            0
##LAST=      -1044.0732985582, 0,            0
##MIN=       -1044.0732985582, -231465,      0
##MAX=       4131.91013829481, 435547326,    0
$$ Real data points
##PAGE= N=1
##DATA TABLE= (X++(R..R)), XYDATA
$$ [...]
$$ plain form
23998 7310 13835 -27531 -28103 -10312 -11447 -7958 26321 40090 36253 10207 -50732 -61051 -2185
23985 -2185 43635 14839 7467 16147 479 4800 29994 52572 71126 124600 93474 37581
23973 37581 -3160 -40109 -64670 -100462 -137984 -149734 -88865 -24115 -36637 -56633 -23480 -8876
23961 -8876 -94765 -44443 4104 8093 40160 84224 156439 155597 111648 72686 71030 81427 90021
23948 90021 87973 53046 80935 104761 99753 75547 -13311 -68529 -86017 -69543 -45376 -8165
23936 -8165 32055 -6700 -17750 -60795 -105113 -114106 -119719 -67567 -50679 -61646 -27219 26894
23924 26894 4733 -20 39149 9342 48174 19296 13653 -2991 -31423 -39502 -11512 28986
23912 28986 62629 65866 56777 15316 -373 1193 -22082 -50622 -77285 -111093 -125226 -101860
$$ packed form
23998G310O525m1366n72J7791j135L489L4279J3769l837k6046o0939j0319N8866
23985b185M5820k8796p372Q680j5668M321K5194K2578J8554N3474l1126n5893
23973C7581m0741l6949k4561l5792l7522j1750O0869O4750j2522j9996L3153J4604
23961h876q5889N0322M8547L989L2067M4064P2215q42m3949l8962j656J0397Q594
23948I0021k048l4927K7889K3826n008k4206q8858n5218j7488J6474K4167L7211
23936h165M0220l8755j1050m3045m4318q993n613N2152J6888j0967L4427N4113
23924B6894k2161m753L9169k9807L8832k8878n643j6644k8432q079K7990M0498
23912B8986L3643L237r089m1461j5689J566k3275k8540k6663l3808j4133K3366
$$ plain form
23900 -101860 -93456 -103264 -60935 21572 64691 48832 91253 44042 7649 -12022 -6059 -21745
23888 -21745 -54003 -63301 -29587 -29316 -15888 -26333 -57987 20843 58775 74092 31881 24168
23876 24168 37570 49528 64186 25615 15205 30474 -28511 -541 46017 49257 42296 14740
23864 14740 -58287 -61346 -10669 74619 91416 119925 91283 12743 -11913 -24242 -35111 -17615
23852 -17615 -34554 -41597 -51808 -46015 5916 13645 51531 95450 -4934 -68071 -73277 -28354
23840 -28354 18671 -15916 -56067 -51143 -45371 -27256 26262 22236 -70060 -100026 -94951 -73535
23828 -73535 14028 -29545 -42449 9424 70682 48628 36672 37567 5637 -49485 -47359 -46769 -54403
23815 -54403 684 1663 -78054 -80855 -49831 -22106 10180 51868 105431 97761 74365 -12068
$$ packed form
23900a01860Q404r808M2329Q2507M3119j5859M2421m7211l6393j9671N963j5686
23888b1745l2258r298L3714K71J3428j0445l1654P8830L7932J5317m2211p713
23876B4168J3402J1958J4658l8571j0410J5269n8985K7970M6558L240o961k7556
23864A4740p3027l059N0677Q5288J6797K8509k8642p8540k4656j2329j0869J7496
23852a7615j6939p043j0211N793N1931P729L7886M3919j00384o3137n206M4923
23840b8354M7025l4587m0151M924N772J8115N3518m026r2296k9966N075K1416
23828g3535Q7563m3573j2904N1873O1258k2054j1956Q95l1930n5122K126N90p634
23815e4403N5087R79p9717k801L1024K7725L2286M1688N3563p670k3396q6433
$$ plain form
23803 -12068 -21635 22016 22247 -29805 -20229 34076 70010 108193 98192 90445 30256 72011 136864
23790 136864 143957 19506 -24797 -14926 33076 44537 -15459 8173 27648 -13788 -48136 -85095
23778 -85095 -76789 -95499 -81965 -114272 -125855 -88762 -36611 3676 -47500 -80142 -95026 -81621
23766 -81621 -61151 -16935 -22025 -33071 -39378 -48300 -38518 7079 91098 84845 -18905 -9273 53685
23753 53685 53581 55882 -11730 -73585 -100282 -122320 -189275 -193924 -160544 -123898 -71897 -24327
23741 -24327 21260 44064 11538 -13640 -28879 -34764 -41294 -89372 -105614 -50024 -44306 -26082
23729 -26082 -5857 -40814 -53199 42012 93739 8301 73447 94331 43689 27113 -21040 -17877
23717 -17877 -5021 -10059 4437 23451 43473 32577 63871 35743 41541 31158 12125 -37661
$$ packed form
23803a2068r567M3651K31n2052R576N4305L5934L8183j0001p747o0189M1755O4853
23790A36864P093j24451m4303R871M8002J1461n9996K3632J9475m1436l4348l6959
23778h5095Q306j8710J3534l2307j1583L7093N2151M0287n1176l2642j4884J3405
23766h1621K0470M4216n090j1046o307q922R782M5597Q4019o253j03750R632O2958
23753E3685j04K301o7612o1855k6697k2038o6955m649L3380L6646N2001M7570
23741b4327M5587K2804l2526k5178j5239n885o530m8078j6242N5590N718J8224
23729b6082K0225l4957j2385R5211N1727q5438O5146K0884n0642j6576m8153L163
23717a7877J2856n038J4496J9014K0022j0896L1294k8128N798j0383j9033m9786
$$ plain form
23705 -37661 -92709 -75795 -40908 31721 70475 44692 -6581 49139 56033 -59109 -73110 -53726
23693 -53726 -64263 -70856 -78539 -50884 -61229 -54059 -50072 -40006 -22268 -1459 1226 -8764 -40334
23680 -40334 -77033 -35545 -11349 -39845 -52255 -50082 -58139 -46973 -65197 29751 85461 -4518
23668 -4518 -9008 -1789 -47174 -77132 -81816 -108821 -105108 -135196 -99670 -95663 -55271 -15052 -24545
23655 -24545 -31235 -21268 22137 53795 -17802 -37596 5066 20089 10158 -15563 -17501 -23359 -47214
23642 -47214 -45523 -49754 -43071 -31542 8032 -15671 -46652 -3039 25222 54474 46731 3973
23630 3973 -94233 -97205 -85339 -51898 -43570 -31453 22263 24954 29031 37491 43793 59055 20815
23617 20815 -58846 -95064 -85583 -62264 -29500 -2955 -13451 -55119 -47535 -28787 -1448 -27397
$$ packed form
23705c7661n5048J6914L4887P2629L8754k5783n1273N5720O894j15142j4001J9384
23693e3726j0537o593p683K7655j0345P170L987J0066J7738K0809K685r990l1570
23680d0334l6699M1488K4196k8496j2410K173q057J1166j8224R4948N5710q9979
23668d518m490P219m5385k9958m684k7005L713l0088L5526M007M0392M0219r493
23655b4545o690R967M3405L1658p1597j9794M2662J5023r931k5721j938n858k3855
23642d7214J691m231O683J1529L9574k3703l0981M3613K8261K9252p743m2758
23630C973r8206k972J1866L3441Q328J2117N3716K691M077Q460O302J5262l8240
23617B0815p9661l6218R481K3319L2764K6545j0496m1668P584J8748K7339k5949
$$ plain form
23605 -27397 -10344 -4114 -19482 -14941 -41869 -113590 -98803 -62886 -65503 -23000 -49489 -31032
23593 -31032 -3477 35412 41876 31061 27291 13261 -11415 -2270 40555 85147 81169 58908
23581 58908 35802 -15408 7369 55593 56134 -12684 -16091 -10495 19686 26689 24007 6749 52160
23568 52160 45923 27864 93966 114765 60766 -11914 -89483 -113043 -117101 -112783 -116554 -27205
23556 -27205 19763 56999 22553 24833 -2194 9425 -18229 4309 27826 14454 -35133 -53598
23544 -53598 30127 79110 32691 17337 43952 52032 52789 30732 -9684 -56606 -34688 -33955 30841
23531 30841 31453 -8572 -57794 -32231 58706 44611 -14234 -5909 7481 50339 38967 12816
23519 12816 20391 56348 10667 26733 95552 84638 37802 8195 36471 42819 73868 -3714
$$ packed form
23605b7397J7053O230j5368M541k6928p1721J4787L5917k617M2503k6489J8457
23593c1032K7555L8889O464j0815l770j4030k4676R145M2825M4592l978k2261
23581E8908k3106n1210K2777M8224N41o8818l407N596L0181P003k682j7258M5411
23568E2160o237j8059O6102K0799n3999p2680p7569k3560m058M318l771Q9349
23556b7205M6968L7236l4446K280k7027J1619k7654K2538K3517j3372m9587j8465
23544e3598Q3725M8983m6419j5354K6615Q080P57k2057m0416m6922K1918P33O4796
23531C0841O12m0025m9222K5563R0937j4095n8845Q325J3390M2858j1372k6151
23519A2816P575L5957m5681J6066O8819j0914m6836k9607K8276O348L1049p7582
$$ plain form
23507 -3714 -21812 2091 -62813 -63629 -33588 -18142 20088 30587 42619 21370 33566 -14875
23495 -14875 -33321 -42480 -50418 -49907 -18312 39328 45364 62936 30479 -16923 8345 -26624 1440
23482 1440 43652 23287 41608 52119 33203 23021 -16594 -50885 -20631 -20021 19742 50766
23470 50766 31024 16331 -16387 -26690 -10385 -1551 -14784 -2822 -45889 -78927 -62266 -83268
23458 -83268 -92715 -64130 -17607 46502 93596 155881 95431 48655 41556 25232 49674 47005
23446 47005 -24259 -28327 -10969 -21780 -8540 11232 -10192 11669 8448 -15621 -34920 -4131
23434 -4131 -863 58726 88840 57741 -87856 -112555 -54367 -17172 156 37852 21729 -6300
23422 -6300 -12390 4384 -17018 22102 110608 81453 -5243 -21919 -13302 -44372 -74425 -24693
$$ packed form
23507c714j8098K3903o4904q16L0041J5446L8230J0499J2032k1249J2196m8441
23495a4875j8446r159p938N11L1595N7640O036J7572l2457m7402K5268l4969K8064
23482A440M2212k0365J8321J0511j8916j0182l9615l4291L0254O10L9763L1024
23470E0766j9742j4693l2718j0303J6305Q834j3233J1962m3067l3038J6661k1002
23458h3268r447K8585M6523O4109M7094O2285o0450m6776p099j6324K4442k669
23446D7005p1264m068J7358j0811J3240J9772k1424K1861l221k4069j9299L0789
23434d131L268N9589L0114l1099j45597k4699N8188L7195J7328L7696j6123k8029
23422f300o090J6774k1402L9120Q8506k9155q6696j6676Q617l1070l0053M9732
$$ plain form
23410 -24693 -2118 -39139 -63936 -70164 -32092 -34240 -71399 -102653 -135666 -135262 -83159 -25439
23398 -25439 11287 75571 70989 74131 60466 -20514 -6842 -9516 -56706 -91806 -115283 -64126
23386 -64126 -28653 30418 14142 33182 32002 -873 -36244 -21510 -6810 -46084 -82852 -104088
23374 -104088 -104732 -71695 -51063 -24126 -38072 -13797 14348 777 1788 28464 41090 20119
23362 20119 3385 -44711 -27931 13773 15051 18618 18567 -8055 26174 24895 -11438 -43382 -52606
23349 -52606 -35014 -56899 -84172 -53828 42501 56718 17519 7348 28061 -21604 -15196 -14312
23337 -14312 -6941 -9460 -29172 -38071 -56166 -16947 16701 33079 65550 9273 771 5721 8147
23324 8147 9393 7187 -20294 -20510 -47389 -63099 -26782 -22750 1637 11115 29461 56723 31389
$$ packed form
23410b4693K2575l7021k4797o228L8072k148l7159l1254l3013M04N2103N7720
23398b5439L6726O4284m582L142j3665q0980J3672k674m7190l5100k3477N1157
23386f4126L5473N9071j6276J9040j180l2875l5371J4734J4700l9274l6768k1236
23374a04088o44L3037K0632K6937j3946K4275K8145j3571J011K6676J2626k0971
23362B0119j6734m8096J6780M1704J278L567n1k6622L4229j279l6333l1944r224
23349e2606J7592k1885k7273L0344R6329J4217l9199j0171K0713m9665O408Q84
23337a4312P371k519j9712q899j8095L9219L3648J6378L2471n6277q502M950K426
23324H147J246k206k7481k16k6879j5710L6317M032K4387R478J8346K7262k5334
$$ plain form
23311 31389 -30816 -64252 334 36510 35618 28281 35304 49859 48240 19699 32849 80552 26699
23298 26699 -44024 -44992 -28952 -51329 -56979 -46192 20444 68303 108852 74419 45237 853
23286 853 28427 -25912 -28867 29797 109240 126701 71479 32121 -12224 -68175 -91091 8578
23274 8578 66130 34197 1548 25525 27915 7901 28991 50543 11125 -22434 -15602 4015
23262 4015 7281 -7109 -24481 -101172 -101495 -58356 -103056 -75040 -61464 -61622 -30093 -11185 28516
23249 28516 70560 122103 105592 84771 53169 23718 8430 14465 7318 3192 94754 106672
23237 106672 60900 8877 -27578 -46362 -72450 -92102 -102960 -85872 -84685 -76317 -69751 -67056
23225 -67056 -6375 55896 72323 73982 -401 -89293 -84938 -70829 -99540 -49968 2192 21415
$$ packed form
23311C1389o2205l3436O4586L6176q92p337P023J4555j619k8541J3150M7703n3853
23298B6699p0723r68J6040k2377n650J0787O6636M7859M0549l4433k9182m4384
23286H53K7574n4339k955N8664P9443J7461n5222l9358m4345n5951k2916R9669
23274H578N7552l1933l2649K3977K390k0014K1090K1552l9418l3559O832J9617
23262D015L266j4390j7372p6691l23M3139m4700K8016J3576j58L1529J8908L9701
23249B8516M2044N1543j6511k0821l1602k9451j5288O035p147m126R1562J1918
23237A06672m5772n2023l6455j8784k6088j9652j0858J7088J187Q368O566K695
23225f7056O0681O2271J6427J659p4383q8892M355J4109k8711M9572N2160J9223
$$ plain form
23213 21415 -4344 -27608 -1963 14308 10123 34742 69674 53199 31277 1145 6426 79954
23201 79954 95674 69066 16423 -8428 59996 72280 78049 77195 60959 19738 29499 33027 22066
23188 22066 -6086 -62890 -83695 -75373 -39390 -6033 31861 95385 97721 72147 35367 -8245
23176 -8245 -32462 -28671 -37297 -6580 25295 39943 115536 98996 12058 -15483 3066 -15241
23164 -15241 -5426 -13989 -17920 -37529 -89597 -45083 -35373 -18808 -20953 -32724 24579 69930 98128
23151 98128 57683 -10493 -27374 26595 21738 -27213 -46655 -21629 2449 -1422 -21378 -10335
23139 -10335 -32545 -60064 -133658 -185394 -132530 -38289 -21335 -40732 -23748 -17672 49012 88778
23127 88778 86618 46958 31562 24315 28927 19362 655 -22916 -9945 -61479 -59995 -11727 -29422
$$ packed form
23213B1415k5759k3264K5645J6271m185K4619L4932j6475k1922l0132N281P3528
23201G9954J5720k6608n2643k4851O8424J2284N769q54j6236m1221R761L528j0961
23188B2066k8152n6804k0805Q322L5983L3357L7894O3524K336k5574l6780m3612
23176h245k4217L791q626L0717L1875J4648P5593j6540q6938k7541J8549j8307
23164a5241R815q563l931j9609n2068M4514R710J6565k145j1771N7303M5351K8198
23151I8128m0445o8176j6881N3969m857m8951j9442K5026K4078l871j9956J1043
23139a0335k2210k7519p3594n1736N2864R4241J6954j9397J6984O076O6684L9766
23127H8778k160l9660j5396p247M612r565j8707k3571J2971n1534J484M8268j7695
$$ plain form
23114 -29422 -47489 -2537 -14484 -43986 -76807 -72207 -72403 811 41328 33164 19055 -22188
23102 -22188 -17566 -13553 -64251 -5701 42722 57402 48702 19028 -28447 -15876 -36853 -47356
23090 -47356 -3670 45183 42895 -11478 4797 21270 38484 78922 33496 9827 -25207 -87147
23078 -87147 -60892 -36443 -2117 755 -1177 26529 -15 33227 29241 62885 30865 7303
23066 7303 24275 108749 140090 141030 88117 -27392 -21698 58134 93624 117240 96265 19396
23054 19396 14643 21074 -27870 -32914 -29302 8931 38762 64267 93200 77464 88370 90369 97749
23041 97749 94854 75265 -19936 -72448 -7374 -8762 -29749 -13131 29260 30990 11002 -18394
23029 -18394 -12596 31383 49371 61911 40518 -24217 -41703 -47547 -21147 -43655 -20716 30614
$$ packed form
23114b9422j8067M4952j1947k9502l2821M600j96P3214M0517q164j4109m1243
23102b2188M622M013n0698N8550M8423J4680q700k9674m7475J2571k0977j0503
23090d7356M3686M8853k288n4373J6275J6473J7214M0438m5426k3669l5034o1940
23078h7147K6255K4449L4326K872j932K7706k6544L3242l986L3644l2020k3562
23066G303J6972Q4474L1341R40n2913j15509N694P9832L5490K3616k0975p6869
23054A9396m753O431m8944n044L612L8233K9831K5505K8933j5736J0906J999P380
23041I7749k895j9589r5201n2512O5074j388k0987J6618M2391J730j9988k9396
23029a8394N798M3979J7988J2540k1393o4735j7486n844K6400k2508K2939N1330
$$ plain form
23017 30614 54961 58132 66621 82804 78268 52199 50803 47417 61640 15518 -43499 4000 49284
23004 49284 52711 26624 -379 51439 13666 -44818 -88234 -99174 -124604 -118862 -68856 -75638
22992 -75638 -105529 -111617 -95808 -19218 13541 -1095 -64469 -54775 -34263 -59090 -67473 -48714
22980 -48714 -54825 -8907 20545 40728 15973 -47276 -63045 -70567 -73619 -66395 -15594 -34033
22968 -34033 -68125 -30180 -70857 -83725 -40916 16393 18594 15702 59463 93826 26753 28012
22956 28012 30140 -41334 -83496 -31508 -17788 -32928 -19545 2449 6194 -5844 -47459 -94863
22944 -94863 -92544 -65445 -50977 -86164 -45203 -18384 1089 6351 -10133 -52817 -54711 -25407
22932 -25407 38464 49337 92241 100062 80186 23962 11367 -27219 -57788 -47323 -18743 -31138
$$ packed form
23017C0614K4347L171Q489J6183m536k6069j396l386J4223m6122n9017M7499M5284
23004D9284L427k6087k7003N1818l7773n8484m3416j0940k5430N742N0006o782
22992g5638k9891o088J5809P6590L2759j4636o3374R694K0512k4827q383J8759
22980d8714o111M5918K9452K0183k4755o3249j5769p522l052P224N0801j8439
22968c4033l4092L7945m0677j2868M2809N7309K201k892M3761L4363o7073J259
22956B8012K128p1474m2162N1988J3720j5140J3383K1994L745j2038m1615m7404
22944i4863K319K7099J4468l5187M0961K6819J9473N262j6484m2684j894K9304
22932b5407O3871J0873M2904P821j9876n6224j2595l8586l0569J0465K8580j2395
$$ plain form
22920 -31138 35117 74836 46134 85094 115204 41168 3068 3888 6710 -42812 -2953 -3292 980
22907 980 25509 84064 89583 30516 11774 -1229 156 416 -38473 -57011 25699 32234 20747
22894 20747 82886 74263 36229 56092 103092 156203 122603 59156 63962 23093 -13148 16801
22882 16801 18161 8022 40988 61116 18038 34102 54989 13413 -14427 -64712 -86751 -84158
22870 -84158 -56471 -38310 20608 28448 6009 -60558 -91469 -67625 -83882 -144197 -100646 -42764
22858 -42764 -30856 -122309 -113808 -32204 3014 5064 -66511 -145123 -67815 -46162 -10515 -43675
22846 -43675 -84569 -33214 4192 -25886 -3503 51278 46126 16547 24440 4788 -3089 -36987
22834 -36987 -52413 -7021 33071 16838 33109 92724 27269 -3639 10745 25933 118531 123693
$$ packed form
22920c1138O6255L9719k8702L8960L0110p4036l8100Q20K822m9522L9859l39M272
22907I80K4529N8555N519n9067j8742j3003J385K60l8889j8538Q2710O535j1487
22894B0747O2139q623l8034J9863M7000N3111l3600o3447M806m0869l6241K9949
22882A6801J360j0139L2966K0128m3078J6064K0887m1576k7840n0285k2039K593
22870h4158K7687J8161N8918P840k2439o6567l0911K3844j6257o0315M3551N7882
22858d2764J1908r1453Q501Q1604L5218K050p1575p8612P7308K1653L5647l3160
22846d3675m0894N1355L7406l0078K2383N4781n152k9579P893j9652p877l3898
22834c6987j5426M5392M0092j6233J6271N9615o5455l0908J4384J5188R2598N162
$$ plain form
22822 123693 102994 96465 84133 53890 13935 -5022 26721 16828 -66796 -47792 -60513 -49101
22810 -49101 -39626 -5994 -24086 -68205 -32073 6255 9044 -1414 -6299 -10238 16544 -27251
22798 -27251 -73875 -113741 -100225 -118016 -105818 -69503 -41172 -22910 -32035 -37621 -48020 -66440
22786 -66440 -73057 -123663 -98576 -129802 -125593 -71612 -57032 -79204 -93188 -102199 -135485 -106063
22774 -106063 -89813 -125705 -176827 -161421 -72361 38642 92113 101521 107051 29179 -27255 -57795
22762 -57795 -17537 18513 52320 -10641 -47772 -29946 -11396 -5511 8906 -24939 -70750 -85932
22750 -85932 -84020 -67291 -68977 -29522 -73288 -32910 -30183 -28884 -7424 -34905 -61378 -35484
22738 -35484 -28315 -38271 -45903 -7533 15053 -18525 -23515 4105 46170 57708 50317 71923 97990
$$ packed form
22822A23693k0699o529j2332l0243l9955j8957L1743r893q3624J9004j2721J1412
22810d9101R475L3632j8092m4119L6132L8328K789j0458m885l939K6782m3795
22798b7251m6624l9866J3516j7791J2198L6315K8331J8262r125n586j0399j8420
22786f6440o617n0606K5087l1226M209N3981J4580k2172j3984r011l3286K9422
22774a06063J6250l5892n1122J5406Q9060J11003N3471R408N530p7872n6434l0540
22762e7795M0258L6050L3807o2961l7131J7826J8550N885J4417l3845m5811j5182
22750h5932J912J6729j686L9455m3766M0378K727J299K1460k7481k6473K5894
22738c5484P169r956p632L8370K2586l3578m990K7620M2065J1538p391K1606K6067
$$ plain form
22725 97990 73247 17193 -36579 15432 54387 46641 66237 69737 42911 48630 18245 2542
22713 2542 5640 41780 23403 -23336 -34281 -27137 -70793 -48445 -29600 -34630 -55440 -51806 -51243
22700 -51243 -17925 39577 23034 -55304 -24745 28072 68074 89633 74729 -8241 63830 25722
22688 25722 24433 78028 76895 54727 -52341 -75619 -6310 -14678 -80688 -94167 -83778 -151138
22676 -151138 -177576 -142356 -97537 -95522 -47252 -91599 -86564 -49319 -50127 -40544 -22890 54190
22664 54190 53625 68291 99753 92208 26266 42705 -11164 -48614 -28274 -56606 -78553 -66098
22652 -66098 -83584 -79677 -65236 -50967 -29487 -40315 -59179 -37354 9365 26417 13942 -13689
22640 -13689 2462 151 -36586 -76580 -63443 -29713 14817 -16630 -36815 -33260 -45662 -15868
$$ packed form
22725I7990k4743n6054n3772N2011L8955p746J9596L500k6826N719l0385j5703
22713B542L098L6140j8377m6739j0945P144m3656K2348J8845n030k0810L634N63
22700e1243L3318N7502j6543p8338L0559N2817M0002K1559j4904q2970P2071l8108
22688B5722j289N3595j133k2168j07068k3278O9309q368o6010j3479J0389o7360
22676a51138k6438L5220M4819K015M8270m4347N035L7245q08R583J7654P7080
22664E4190n65J4666L1462p545o5942J6439n3869l7450K0340k8332k1947J2455
22652f6098j7486L907J4441J4269K1480j0828j8864K1825M6719J7052j2475k7631
22640a3689J6151k311l6737l9994J3137L3730M4530l1447k0185L555j2402K9794
$$ plain form
22628 -15868 -2499 54437 60036 48926 61596 85262 70247 80643 86623 95942 14634 -50539
22616 -50539 -93958 -140685 -141782 -166129 -158154 -56373 -29348 -17765 41165 127860 110419 57570
22604 57570 25394 -14922 -54598 5329 18125 -29098 -66244 -56051 -64886 -65932 -42076 -79827
22592 -79827 -139810 -163169 -128924 -145618 -70457 -43551 -11178 3215 -2666 -23407 -81172 -54603
22580 -54603 32553 82219 28387 901 20641 25513 -39078 -99281 -60973 -14621 34758 99028
22568 99028 59716 12864 13951 12776 55124 50493 4667 -5144 -27215 -41188 -8386 -21127
22556 -21127 -85267 -12327 73591 32396 -69 -815 -1251 12464 5693 -37140 -75440 -88990 -86021
22543 -86021 -123605 -68652 -63223 -65327 -45932 1777 75243 55252 56345 26771 -16975 -44561
$$ packed form
22628a5868J3369N6936N599j1110J2670K3666j5015J0396N980R319q1308o5173
22616e0539m3419m6727j097k4347P975J01781K7025J1583N8930Q6695j7441n2849
22604E7570l2176m0316l9676N9927J2796m7223l7146J0193q835j046K3856l7751
22592g9827n9983k3359L4245j6694P5161K6906L2373J4393n881k0741n7765K6569
22580e4603Q7156M9666n3832k7486J9740M872o4591o0203L8308M6352M9379O4270
22568I9028l9312m6852J087j175M2348m631m5826r811k2071j3973L2802j2741
22556b1127o4140P2940Q5918m1195l2465p46m36J3715o771m2833l8300j3550K969
22543h6021l7584N4953N429k104J9395M7709P3466j9991J093k9574m3746k7586
$$ plain form
22531 -44561 14298 85842 26330 -469 15738 15580 -6883 -34698 -35237 -9430 1473 -29937
22519 -29937 -17224 -90172 -162692 -124204 -114562 -81246 -42769 -13074 45213 27701 -15677 -61839
22507 -61839 -23252 18315 37771 115550 51164 -32288 -76104 -83619 -61592 -57549 -27337 11383
22495 11383 53783 62540 -10916 -8540 -41322 -144065 -157365 -121974 -23250 8932 -74984 -45137
22483 -45137 -35958 -67984 -70080 -11344 16598 17721 23089 46739 18530 40015 37774 46970 76774
22470 76774 47303 20049 11108 11489 19761 10703 41833 53020 42126 36662 19725 3365 11714
22457 11714 65247 126584 100890 54292 59768 48890 51658 61746 61911 69612 17625 -22823 -35796
22444 -35796 2898 16039 19463 18708 24293 35377 38604 -3793 23295 39628 2503 -5738 34856
$$ packed form
22531d4561N8859P1544n9512k6799J6207j58k2463k7815n39K5807J0903l1410
22519b9937J2713p2948p2520L8488R642L3316L8477K9695N8287j7512m3378m6162
22507f1839L8587M1567J9456P7779o4386q3452m3816p515K2027M043L0212L8720
22495A1383M2400Q757p3456K376l2782j02743j3300L5391R8724L2182q3916K9847
22483d5137R179l2026k096N8736K7942J123N368K3650k8209K1485k241R196K9804
22470G6774k9471k7254q941L81Q272r058L1130J1187j0894n464j6937j6360Q349
22457A1714N3533O1337k5694m6598N476j0878K768J0088J65P701n1987m0448j2973
22444c5796L8694J3141L424p55N585J1084L227m2397K7088J6333l7125q241M0594
$$ plain form
22431 34856 6537 -52317 -99336 -100342 -50841 -62833 -114553 -38136 52342 99007 106577 81823
22419 81823 50434 52371 56503 21864 30191 -15086 -70547 -79648 -30346 -20062 -13724 14434 27
22406 27 10939 43255 42624 12413 8764 31662 24706 31194 43732 43943 32388 -3760 -56123 -33944
22392 -33944 -33091 -37327 -40359 -2772 -3850 2481 28274 37613 50651 45087 -13021 17775 43125
22379 43125 104210 140025 116447 75046 50886 -4225 18105 8614 -75361 -50826 -67186 -87637
22367 -87637 -53421 -4215 625 7876 47160 64347 70965 41912 17388 25564 -30618 -38973 14101
22354 14101 18127 15231 1919 -64463 -42313 -14548 -29345 -107739 -117404 -33152 52568 33068
22342 33068 72376 61890 -592 -48616 -37468 -17690 -25838 -44296 -29538 -20179 -65078 -63714
$$ packed form
22431C4856k8319n8854m7019j006M9501j1992n1720P6417R0478M6665P570k4754
22419H1823l1389J937M132l4639Q327m5277n5461r101M9302J0284O338K8158j4407
22406B7J0912L2316o31l0211l649K2898o956O488J2538K11j1555l6148n2363K2179
22392c3944Q53m236l032L7587j078O331K5793R339J3038n564n8108L0796K5350
22379D3125O1085L5815k3578m1401k4160n5111K2330r491q3975K4535j6360k0451
22367h7637L4216M9206M840P251L9284J7187O618k9053k4524Q176n6182q355N3074
22354A4101M026k896j3312o6382K2150K7765j4797p8394r665Q4252Q5720j9500
22342C3068L9308j0486o2482m8024J1148J9778q148j8458J4758R359m4899J364
$$ plain form
22330 -63714 27149 60691 99015 48133 -67061 -106737 -66414 -64805 -65114 -77362 -46045 -36496
22318 -36496 2005 -3519 -71547 -63042 -21617 -1957 -10961 25117 34794 -69309 -57541 21034
22306 21034 7532 -47460 -35131 -72163 -47438 -51322 -57649 -8391 -2295 10392 14211 -34724
22294 -34724 -20963 40950 59169 46204 15468 -7794 -35561 -67804 -6545 3257 -4324 -14865
22282 -14865 -18687 -38879 -40381 -111073 -139192 -91838 -97871 -137877 -70009 -58497 -41873 -15248
22270 -15248 -32996 -27399 2905 13919 24768 -1758 2168 34745 30130 17118 26225 45660
22258 45660 76600 98838 95439 91676 70855 59943 22026 -34111 -49138 13159 19223 17705
22246 17705 -3294 -3220 -16009 12670 40435 42238 -45922 -26767 -21286 -12830 23276 50098 37704
$$ packed form
22330f3714R0863L3542L8324n0882j15194l9676M0323J609l09j2248L1317R549
22318c6496L8501n524o8028Q505M1425J9660r004L6078R677j04103J1768P8575
22306B1034j3502n4992J2329l7032K4725l884o327M9258O096J2687L819m8935
22294c4724J3761O1913J8219j2965l0736k3262k7767l2243O1259R802p581j0541
22282a4865l822k0192j502p0692k8119M7354o033m0006O7868J1512J6624K6625
22270a5248j7748N597L0304J1014J0849k6526L926L2577m615j3012R107J9435
22258D5660L0940K2238l399l763k0821j0912l7917n6137j5027O2297O064j518
22246A7705k0999P4j2789K8679K7765J803q8160J9155N481Q456L6106K6822j2394
$$ plain form
22233 37704 -35676 3893 -2552 3869 6923 -14342 -25830 -45259 -11026 42050 52825 -10839
22221 -10839 -17154 26664 5512 17152 61721 85733 49117 -27767 -61305 -47612 -90185 -65263
22209 -65263 -44161 -28493 -4978 12981 -33860 -79106 1943 64525 -7863 15561 22557 -3712
22197 -3712 24365 6986 9753 -24585 -47564 -34871 16239 20780 -35909 -35054 -3903 -16849 -61559
22184 -61559 -55905 6360 23009 25142 32273 42780 29947 -5002 6903 19329 22547 7164
22172 7164 30668 51457 28438 -6902 -58942 -112374 -30608 47100 74432 51802 25193 35599
22160 35599 58057 71094 79054 63449 74882 56481 18222 35044 17566 -9445 -50019 -69801
22148 -69801 -24334 -7877 20706 -39088 -62801 -68408 -110630 -142295 -147339 -112991 -122118 -130863
$$ packed form
22233C7704p3380L9569o445O421L054k1265j1488j9429L4233N3076J0775o3664
22221a0839o315M3818k1152J1640M4569K4012l6616p6884l3538J3693m2573K4922
22209f5263K1102J5668K3515J7959m6841m5246Q1049O2582p2388K3424O996k6269
22197c712K8077j7379K767l4338k2979J2693N1110M541n6689Q55L1151j2946m4710
22184f1559N654O2265J6649K133P131J0507j2833l4949J1905J2426L218j5383
22172G164K3504K0789k3019l5340n2040n3432Q1766P7708K7332k2630k6609J0406
22160C5599K2458J3037P960j5605J1433j8401l8259J6822j7478k7011m0574j9782
22148f9801M5467J6457K8583n9794k3713n607m2222l1665n044L4348r127q745
$$ plain form
22136 -130863 -106377 -55510 -59738 -17864 -11537 -33704 -1412 536 390 40468 71251 54159
22124 54159 -2817 -18091 5177 -978 27333 82601 29089 -3802 35369 1362 -4327 37350
22112 37350 26759 5682 17469 20505 9936 -4292 -12986 -61919 -119086 -110915 -93538 -77315
22100 -77315 -77307 -66378 -54362 -93158 -91455 -111345 -22169 27003 -44142 -27325 36992 22801 -5511
22087 -5511 38476 43855 32234 18284 -44013 -35320 -35877 -45018 -74139 -62085 2175 43604 37454
22074 37454 43066 -68627 -156274 -128776 -113984 -127739 -101512 -81223 -78267 -88858 -115861 -90301
22062 -90301 -29333 35189 43475 -9097 -42309 -52018 -22767 -1065 -69631 -115001 -85232 -83407
22050 -83407 -51756 -63197 -40783 -50348 -62043 -56837 -36846 -44078 -63173 -44792 -30292 -6930
$$ packed form
22136a30863K4486N0867m228M1874O327k2167L2292J948j46M0078L0783j7092
22124E4159n6976j5274K3268o155K8311N5268n3512l2891L9171l4007n689M1677
22112C7350j0591k1077J1787L036j0569j4228q694m8933n7167Q171J7377J6223
22100g7315QJ0929J2016l8796J703j9890Q9176M9172p1145J6817O4317j4191k8312
22087e511M3987N379j1621j3950o2297Q693n57r141k9121J2054O4260M1429o150
22074C7454N612j11693q7647K7498J4792j3755K6227K0289K956j0591k7003K5560
22062i0301O0968O4522Q286n2572l3212r709K9251K1702o8566m5370K9769J825
22050h3407L1651j1441K2414r565j1695N206J9991p232j9095J8381J4500K3362
$$ plain form
22038 -6930 -3999 -23982 -56854 -110297 -118701 -149269 -110786 -36517 -6491 -28298 5205 37740
22026 37740 4311 -21390 -40888 -22319 4723 56943 32908 42176 59905 30131 23447 40753
22014 40753 45958 20530 26395 18345 13104 25847 48568 38652 -16941 7847 9978 -20773 -16018
22001 -16018 21310 32146 43790 69278 67882 38940 -39430 -41569 -5548 -15882 -12153 -13556
21989 -13556 -31276 -43063 927 4875 -78671 -94740 -119532 -102252 -50622 -2111 -1415 -19270
21977 -19270 -14483 -25165 -23735 -8381 -17385 -23066 -38310 -31587 -32847 -106671 -58137 -8501 25122
21964 25122 34227 29521 11916 -34358 14054 19708 -3687 -32118 -53589 -50173 -78626 -153633
21952 -153633 -170406 -187230 -231465 -173991 -108105 -95812 -56445 -58605 -54670 -42560 26639 88400
$$ packed form
22038f930K931j9983l2872n3443q404l0568L8483P4269L0026k1807L3503L2535
22026C7740l3429k5701j9498J8569K7042N2220k4035R268J7729k9774o684J7306
22014D0753N205k5428N865q050n241J2743K2721r916n5593K4788K131l0751M755
22001a6018L7328J0836J1644K5488j396k8942p8370k139L6021j0334L729j403
21989a3556j7720j1787M3990L948q3546j6069k4792J7280N1630M8511O96j7855
21977a9270M787j0682J430J5354r004n681j5244O723j260p3824M8534M9636L3623
21964B5122R105m706j7605m6274M8412N654k3395k8431k1471L416k8453p5007
21952a53633j6773j6824m4235N7474O5886J2293L9367k160L935J2110O9199O1761
$$ plain form
21940 88400 87961 58123 31343 -15865 6016 41156 58317 25948 35991 62703 28363 39404
21928 39404 45833 96938 140400 150998 147349 131868 91770 52659 -19633 -22093 -30990 1531
21916 1531 -30325 -64033 -85936 -99327 -71380 -49207 -5400 -10483 -49164 -75142 -109308 -152365
21904 -152365 -178540 -190682 -173952 -86603 -64208 -58786 -45574 -57144 -91880 -17616 72027 77331
21892 77331 -10205 32260 85734 42178 1845 636 -3633 -54956 -67705 -15448 -13140 6858
21880 6858 6752 74110 61938 5905 -54313 -17618 2489 -17942 -26368 -6330 -55028 -61684 18838
21867 18838 20842 -6290 -4635 -40301 -16099 -14076 -18514 206 -8882 -39535 -4876 -23806 -49175
21854 -49175 -61260 -69442 1721 3171 -2558 15823 45912 42498 9097 -35122 -45133 -18577
$$ packed form
21940H8400m39k9838k6780m7208K1881L5140J7161l2369J0043K6712l4340J1041
21928C9404O429N1105M3462J0598l649j5481m0098l9111p2292k460q897L2521
21916A531l1856l3708k1903j3391K7947K2173M3807n083l8681k5978l4166m3057
21904a52365k6175j2142J6730Q7349K2395N422J3212j1570l4736P4264Q9643N304
21892G7331q7536M2465N3474m3556m0333j209m269n1323j2749N2257K308J9998
21880F858j06O7358j2172n6033o0218L6695K0107k0431q426K0038m8698o656Q0522
21867A8838K004k7132J655l5666K4202K023m438J8720r088l0653L4659j8930k5369
21854d9175j2085q182P1163J450n729J8381L0089l414l3401m4219j0011K6556
$$ plain form
21842 -18577 -44365 -18731 92057 53431 7940 19840 -24845 -59235 -93595 -145190 -157003
21831 -157003 -166188 -169270 -121572 -87479 -53495 -72939 -46107 -116813 -102386 -50598 -53559 -59282
21819 -59282 -12786 -33704 -48971 -70399 2043 59648 50718 43579 46207 81699 42044 7631
21807 7631 -42522 -74048 -45908 -70559 -60014 -21627 29308 -22337 -1242 -39208 -103264 -63620
21795 -63620 -1118 -36459 -12423 34405 64965 43755 1394 -72686 -78827 -100823 -76170 -9765
21783 -9765 37135 7424 27787 51131 95563 129605 123292 46075 -27957 -38295 -82487 2152
21771 2152 18064 -15216 34678 38466 2960 -28533 -39730 -11343 26559 99815 100027 92116 104265
21758 104265 69998 14070 18107 6524 12760 31028 48066 18584 -82991 -90992 -61380 -57123
$$ packed form
21842a8577k5788K5634J10788l8626m5491J1900m4685l4390l4360n1595j1813
21831a57003r185l082M7698L4093L3984j9444K6832p0706J4427N1788k961n723
21819e9282M6496k0918j5267k1428P2442N7605q930p139K628L5492l9655l4413
21807G631n0153l1526K8140k4651J0545L8387N0935n1645K1095l7966o4056L9644
21795f3620O2502l5341K4036M6828L0560k1210m2361p4080o141k1996K4653O6405
21783i765M6900k9711K0363K3344M4432L4042o313p7217p4032j0338m4192Q4639
21771B152J5912l3280M9894L788l5506l1493j1197K8387L7902P3256K12p911J2149
21758A04265l4267n5928M037j1583O236J8268J7038k9482j01575q001K9612M257
$$ plain form
21746 -57123 -30966 2216 -36028 -34225 -68937 -39061 -13466 -33639 -11986 51773 60781 72658
21734 72658 66486 50470 7853 31676 73200 90269 75588 101096 113480 86897 104469 108700
21722 108700 93058 45123 48550 46755 8798 -1020 64306 86075 108796 89126 17708 15178
21710 15178 54294 98590 89050 60787 45725 -31524 8639 45935 -25186 -64351 -99007 -93063
21698 -93063 -52000 -86039 -62829 -12753 44617 75463 34678 19969 54359 59263 -13897 -14173
21686 -14173 11778 -29402 -68486 -102837 -64517 -63297 -8849 16662 -14895 -11434 -34444 -31134
21674 -31134 -31293 -15010 52286 83530 39331 39006 82381 85915 50388 34374 31707 36306 53343
21661 53343 101657 48813 -9807 -3550 34198 60411 81766 39153 35091 29210 -51832 -95905
$$ packed form
21746e7123K6157L3182l8244J803l4712K9876K5595k0173K1653O3759R008J1877
21734G2658o172j6016m2617K3823M1524J7069j4681K5508J2384k6583J7572M231
21722A08700j5642m7935L427j795l7957r818O5326K1769K2721j9670p1418k530
21710A5178L9116M4296r540k8263j5062p7249M0163L7296p1121l9165l4656N944
21698i3063M1063l4039K3210N0076N7370L0846m0785j4709L4390M904p3160k76
21686a4173K5951m1180l9084l4351L8320J220N4448K5511l1557L461k3010L310
21674c1134j59J6283O7296L1244m4199l25M3375L534l5527j6014k667M599J7037
21661E3343M8314n2844n8620O257L7748K6213K1355m2613m062n881q1042m4073
$$ plain form
21649 -95905 -76615 -63284 -73291 -16045 37463 15944 -20619 -34496 -55254 -59197 -48552 -40733
21637 -40733 -24952 -19639 -41537 -109783 -135224 -149428 -224475 -207404 -101971 -66907 -33979 -54057
21625 -54057 -36898 -28232 1776 8252 1612 33988 25174 4891 5746 7684 -22683 -45928 -20198
21612 -20198 -13982 -28396 -44310 -94688 -95423 -72662 -54341 3354 13385 5900 4775 -16413 -41464
21599 -41464 -2688 96679 142247 67917 14347 9896 -17820 -31964 10897 27510 88273 104066
21587 104066 43417 -15647 -49632 -652 43584 8803 372 66697 28172 -1737 -40360 -3830
21575 -3830 15347 -38880 -89165 -90263 -125116 -72299 -8898 -6994 9440 3532 -33978 -68450
21563 -68450 -104035 -60266 -719 105388 106970 49671 -5387 -39194 -47868 -82729 -45493 -69197
$$ packed form
21649i5905J9290J3331j0007N7246N3508k1519l6563j3877k0758l943J0645P819
21637d0733J5781N313k1898o8246k5441j4204p5047J7071J05433L5064L2928k0078
21625e4057J7159Q666L0008O476o640L2376q814k0283Q55J938l0367k3245K5730
21612b0198O216j4414j5914n0378p35K2761J8321N7695J0031p485j125k1188k5051
21599d1464L8776R9367M5568p4330n3570m451k7716j4144M2861J6613O0763J5793
21587A04066o0649n9064l3985M8980M4236l4781q431O6325l8525k9909l8623L6530
21575c830J9177n4227n0285j098l4853N2817O3401J904J6434n908l7510l4472
21563f8450l5585M3769N9547J06107J582n7299n5058l3807q674l4861L7236k3704
$$ plain form
21551 -69197 -94192 -110774 -136637 -102596 -76598 -51386 -20730 -11355 -31987 3898 89149 100377
21539 100377 75696 33035 18300 19311 39513 60157 28558 -66799 -77209 -77373 -108112 -48017
21527 -48017 -48923 -54996 -46201 -26777 -14952 -7392 -40374 -34892 4087 25652 12603 -30049 -23239
21514 -23239 -33025 -100729 -54244 -44749 -24983 -25238 -51314 -93591 -66760 -63609 -62004 -6823 -11249
21501 -11249 -24589 -20203 -3806 -31532 -19491 21521 -35329 -18180 -4835 -53155 -94627 -135457
21489 -135457 -88215 -48475 -51141 -45029 -51312 -21376 -36996 -75028 -49455 -28927 -10641 -58792
21477 -58792 -76493 -68053 -17700 -44914 -14952 49215 36455 -28454 -21631 -30900 -5097 56262
21465 56262 52073 78314 137150 109757 75039 52972 9922 47921 38465 40854 61552 71329
$$ packed form
21551f9197k4995j6582k5863L4041K5998K5212L0656R375k0632L5885Q5251J1228
21539A00377k4681m2661j4735J011K0202K0644l1599r5357j0410j64l0739O0095
21527d8017r06o073Q795J9424J1825P560l2982N482L8979K1565j3049m2652O810
21514b3239r786o7704M6485R495J9766k55k6076m2277K6831L151J605N5181m426
21501a1249j3340M386J6397k7726J2041M1012n6850J7149J3345m8320m1472m0830
21489a35457M7242L9740k666O112o283K9936j5620l8032K5573K0528J8286m8151
21477e8792j7701Q440N0353k7214K9962O4167j2760o4909O823r269K5803O1359
21465E6262m189K6241N8836k7393l4718k2067m3050L7999r456K389K0698R777
$$ plain form
21453 71329 43779 88264 25597 -3612 15241 41666 36392 50275 84236 67640 6887 -38914
21441 -38914 -67381 -78755 -87524 -53399 -46006 -70495 -32286 -9284 -42893 -58330 -8433 31499
21429 31499 14779 -21904 -23081 59012 78201 82153 31652 -32598 -53777 -110242 -93246 -2313
21417 -2313 36676 -24203 -44872 -47430 -13052 37234 11490 11544 47022 13572 11259 29460 -21174
21404 -21174 -75791 -55977 -27041 -28132 4050 54671 31233 11235 30424 38842 92958 46627
21392 46627 17556 -33195 -90804 -4093 24581 -1823 -3352 6765 -4090 -28448 -7695 75602
21380 75602 94596 38233 31386 14919 -9412 35348 45128 29034 -44195 -29038 -68600 -63124
21368 -63124 -66553 -63154 -39251 -14006 18426 80022 97518 -17432 -114667 -41350 -18495 -48449
$$ packed form
21453G1329k7550M4485o2667k9209J8853K6425n274J3883L3961j6596o0753m5801
21441c8914k8467j1374q769L4125P393k4489L8209K3002l3609j5437M9897L9932
21429C1499j6720l6683j177Q2093J9189L952n0501o4250k1179n6465J6996R0933
21417b313L8989o0879k0669k558L4378N0286k5744N4L5478l3450k313J8201n0634
21404b1174n4617J9814K8936j091L2182N0621k3438j9998J9189Q418N4116m6331
21392D6627k9071n0751n7609Q6711K8674k6404j529J0117j0855k4358K0753Q3297
21380G5602J8994n6363o847j6467k4331M4760R780j6094p3229J5157l9562N476
21368f3124l429L399K3903K5245L2432O1596J7496j14950r7235P3317K2855k9954
$$ plain form
21356 -48449 10811 122478 82774 -24858 -56909 6271 36632 -68 -40985 -49577 -109660
21345 -109660 -131119 -48270 7353 33911 72641 76832 67416 87021 23080 -42630 -39414 -12119
21333 -12119 -11164 40460 34945 3594 -18515 -55966 -99536 -125395 -75602 -89737 -52875 5107
21321 5107 45717 52668 66038 69962 1375 -15539 27062 33692 47847 602 -13009 -16503 -1951
21308 -1951 -65806 -127802 -91958 -119382 -135603 -108650 -49878 -28252 -8355 -48619 -65075 -40123
21296 -40123 -28252 -48505 -93110 -80973 -21235 -86 -19476 -41184 -45930 -70818 -71264 -80886
21284 -80886 -79206 -70692 -59865 -39281 326 -5923 -39543 -57069 -30697 43714 27909 -5852
21272 -5852 -18219 -81169 -83873 -89971 -66772 -71447 -80039 -87894 -125269 -137183 -157489 -178642 -142745
$$ packed form
21356d8449N9260J11667l9704j07632l2051O3180L0361l6700m0917q592o0083
21345a09660k1459Q2849N5623K6558L8730M191r416J9605o3941o5710L216K7295
21333a2119R55N1624n515l1351k2109l7451m3570k5859M9793j4135L6862N7982
21321E107M0610O951J3370L924o8587j6914M2601O630J4155m7245j3611l494J4552
21308a951o3855o1996L5844k7424j6221K6953N8772K1626J9897m0264j6456K4952
21296d0123J1871k0253m4605J2137N9738K1149j9390k1708m746k4888m46r622
21284h0886J680Q514J0827K0584L9607o249l3620j7526K6372P4411j5805l3761
21272e852j2367o2950k704o098K3199m675q592p855l7375j1914k0306k1153L5897
$$ plain form
21259 -142745 -79053 -21888 -75231 -36542 -74308 -116035 -98200 -110969 -96960 6063 30513
21248 30513 4432 -17009 -70657 -51215 33929 98678 143563 198622 196257 115854 58356 -4719
21236 -4719 -61346 -65000 33530 58695 49369 13780 -17055 -10111 -85896 -54684 -26158 -98497
21224 -98497 -116006 -78063 -84170 -37027 -32102 -25312 -26209 -44667 -41403 4784 36761 60810 113588
21211 113588 81527 1900 -19643 -33987 -32418 -33699 -6174 5459 -28049 -88838 -103705 -84565
21199 -84565 -23006 4517 -9337 -36846 -81427 -68183 -53043 -45719 -32068 -20917 -13656 -5152
21187 -5152 -27354 -58258 -45238 -47634 -47415 1996 -34478 -81113 -110231 -106295 -150271 -125051 -72435
21174 -72435 -24666 -25844 5120 87140 25137 -35677 -107357 -64163 -7349 -921 45565 58860
$$ packed form
21259a42745O3692N7165n3343L8689l7766m1727J7835j2769J4009J03023K4450
21248C0513k6081k1441n3648J9442Q5144O4749M4885N5059k365q0403n7498o3075
21236d719n6627l654R8530K5165r326l5589l0835O944p5785L1212K8526p2339
21224i8497j7509L7943o107M7143M925O790q97j8458L264M6187L1977K4049N2778
21211A13588l2061p9627k1543j4344J569j281K7525J1633l3508o0789j4867J9140
21199h4565O1559K7523j3854k7509m4581J3244J5140P324J3651J1151P261Q504
21187e152k2202l0904J3020k396K19M9411l6474m6635k9118L936m3976K5220N2616
21174g2435M7769j178L0964Q2020o2003o0814p1680M3194N6814O428M6486J3295
$$ plain form
21162 58860 14269 28742 -22436 -17156 -37919 -6879 41625 -3854 13679 43044 17416 -1158
21150 -1158 7832 33083 70581 -3761 -57830 18374 13943 33488 -2234 -20065 -13405 -44935
21138 -44935 -60826 9618 -11014 -31917 -31305 -35137 -18656 -41651 -41310 -24514 -2907 37255 44792
21125 44792 79186 60952 -36576 -60334 -32236 823 9608 43999 74453 101585 117416 81534
21113 81534 1064 -62561 -65496 -28679 4816 -52528 -149554 -121010 -42629 -26631 -88349 -96189
21101 -96189 -117884 -101106 -126329 -137467 -143997 -105696 -17993 -40596 -27791 4024 -19151 -35946
21089 -35946 -67051 -79444 -59950 -36915 -11630 -32454 -26636 -26621 -12831 11132 42995 62418
21077 62418 44516 8327 -32490 16860 27718 60245 24588 26410 94107 88282 42932 9722
$$ packed form
21162E8860m4591J4473n1178N280k0763L1040M8504m5479J7533K9365k5628j8574
21150a158Q990K5251L7498p4342n4069P6204m431J9545l5722j7831O660l1530
21138d4935j5891P0444k0632k0903O12l832J6481k2995L41J6796K1607M0162P537
21125D4792L4394j8234r7528k3758K8098L3059Q785L4391L0454K7132J5831l5882
21113H1534q0470o3625k935L6817L3495n7344r7026K8544P8381J5998o1718p840
21101i6189k1695J6778k5223j1138o530L8301Q7703k2603J2805L1815k3175j6795
21089c5946l1105j2393J9494K3035K5285k0824N818J5J3790K3963L1863J9423
21077F2418j7902l6189m0817M9350J0858L2527l5657J822O7697n825m5350l3210
$$ plain form
21065 9722 -9920 -11657 -33759 -36783 -29473 -73011 -22949 -10777 -76146 -72794 -26914 -29748 -30202
21052 -30202 -8625 18256 -22252 -92552 -103984 -70266 -54226 -132806 -129191 -122369 -55213 -33747
21040 -33747 -56456 -56469 -36890 -69593 -80181 -33444 11028 -37548 -59836 -58158 -40931 -50481 -83625
21027 -83625 -17636 -45235 -48270 -219 814 30151 33124 -12202 17025 26766 -89731 -96909
21015 -96909 -20350 -472 -46001 -112413 -72379 24794 51982 27993 32602 39471 -16744 -53673
21003 -53673 -57304 -59891 -94803 -116756 -84560 -77900 -58596 -27398 -9091 -36015 -112035 -100984
20991 -100984 -105062 -131323 -156038 -103123 -132974 -100318 -39438 -61480 -115507 -71935 -18631 12675
20979 12675 39297 23405 -30314 -102016 -23068 3828 -5687 -12539 64971 70185 -22908 -19517
$$ packed form
21065I722j9642j737k2102l024P310m3538N0062J2172o5369L352M5880k834m54
21052c0202K1577K6881m0508p0300j1432L3718J6040p8580L615O822O7156K1466
21040c3747k2709j3J9579l2703j0588M6737M4472m8576k2288J678J7227r550l3144
21027h3625O5989k7599l035M8051J033K9337K973m5326K9227R741j16497p178
21015i6909P6559J9878m5529o6412M0034R7173K7188k3989M609O869n6215l6929
21003e3673l631k587l4912k1953L2196O660J9304L1198J8307k6924p6020J1051
20991a00984m078k6261k4715N2915k9851L2656O0880k2042n4027M3572N3304L1306
20979A2675K6622j5892n3719p1702P8948K6896r515o852P7510N214r3093L391
$$ plain form
20967 -19517 13792 -3122 15100 67321 14523 -29703 37148 97616 104485 71368 73610 63224
20955 63224 8980 -6166 -21242 -11592 -62721 -61908 -52999 -55115 -76201 -102790 -8028 30802 144
20942 144 12845 -5641 -12791 23607 -34959 -58879 -49184 -89130 -98459 -55177 -16088 -16937 -17021 -9120
20928 -9120 34704 -15326 -11875 -9398 -46089 -37349 46874 101177 143931 153512 101541 62183 73000
20915 73000 107267 53522 -67139 -147171 -140998 -108149 -61793 -56280 -45800 46906 97322 72255
20903 72255 14229 -20574 -16010 8699 -29069 11367 94653 28142 -47081 -69479 -70647 -91151
20891 -91151 -28083 9280 18522 28510 13615 33117 24924 16833 7014 7323 -23014 -5626 -28568
20878 -28568 -87062 -91828 -89980 -81110 -63854 -56465 -67118 -61534 -61652 -32197 -17472 -7278 26723
$$ packed form
20967a9517L3309j6914J8222N2221n2798m4226O6851O0468O869l3117K242j0386
20955F3224n4244j5146j5076R650n1129Q13Q909k116k1086k6589R4762L8830l0658
20942A44J2701j8486p150L6398n8566k3920R695l9946r329M3282L9089q49q4P901
20928i120M3824n0030L451K477l6691Q740Q4223N4303M2754R581n1971l9358J0817
20915G3000L4267n3745j20661q0032O173L2849M6356N513J0480R2706N0416k5067
20903G2255n8026l4803M564K4709l7768M0436Q3286o6511p5223k2398j168k0504
20891i1151O3068L7363R242R988j4895J9502q193q091r819L09l0337J7388k2942
20878b8568n8494m766J848Q870J7256P389j0653N584j18K9455J4725J0194L4001
$$ plain form
20865 26723 14584 1699 -25744 -22951 -22301 -21165 -11394 -38551 15021 50392 32320 57372 28320
20852 28320 31762 38380 10436 -23424 9826 45991 103261 103428 21719 -21993 -86912 -84644 -34982
20839 -34982 28148 61571 36635 9415 -52571 -59962 -57020 -41732 -23508 -23597 21473 27328 40519
20826 40519 -12556 -36209 -50826 -23162 8925 -18658 -81915 -28196 -40676 -1343 -13400 -66838
20814 -66838 -26677 -27745 -46215 -23179 -768 -25679 -14823 17772 11431 -80376 -102202 -19543
20802 -19543 17924 20052 21187 -17039 -30584 -263 40300 30787 50342 101000 102844 57711
20790 57711 70081 49957 -14633 -72347 -93821 -85392 -116920 -53482 -15591 -5669 -1982 -44109
20778 -44109 6122 41133 -2624 -60031 -73735 -49681 3607 58689 -5048 -25961 40005 56549
$$ packed form
20865B6723j2139j2885k7443K793O50J136R771k7157N3572L5371j8072K5052k9052
20852B8320L442O618k7944l3860L3250L6165N7270J67q1709m3712o4919K268M9662
20839c4982O3130L3423k4936k7220o1986p391K942J5288J8224q9M5070N855J3191
20826D0519n3075k3653j4617K7664L2087k7583o3257N3719j2480L9333j2057n3438
20814f6838M0161j068j8470K3036K2411k4911J0856L2595o341r1807k1826Q2659
20802a9543L7467K128J135l8226j3545L0321M0563r513J9555N0658J844m5133
20790E7711J2370k0124o4590n7714k1474Q429l1528O3438L7891R922L687m2127
20778d4109N0231L5011m3757n7407j3704K4054N3288N5082o3737k0913O5966J6544
$$ plain form
20766 56549 33164 -36263 -15790 -26866 -24136 44540 70483 48424 51677 46011 -24488 -59721
20754 -59721 -39561 16240 17382 -23501 -61741 -98832 -112001 -47199 -43099 -15544 -22278 -69269
20742 -69269 -69391 -73957 -75990 -85152 -37822 -1984 -2084 2411 -8060 -40246 -86512 -48324 19860
20729 19860 94394 74500 -4746 -27766 -42165 -48006 -31900 6302 10206 15440 -37958 -106994
20717 -106994 -107166 -135155 -134241 -96064 -27148 -29881 -46430 -55278 -44483 -40221 -53227 52010 79747
20704 79747 27938 -32162 -16233 11280 13865 18391 6441 -42851 -97700 -86521 -118202 -153250
20692 -153250 -127121 -86156 -6542 46858 34107 12218 -3271 -6447 -5829 -5079 -22594 -31345 -53537
20679 -53537 1351 33929 21692 42484 68967 15598 -11213 -49770 -59433 -106749 -168582 -123895
$$ packed form
20766E6549k3385o9427K0473j1076K730O8676K5943k2059L253n666p0499l5233
20754e9721K0160N5801J142m0883l8240l7091j3169O4802M100K7555o734m6991
20742f9269j22m566k033r162M7330L5838j00M495j0471l2186m6266L8188O8184
20729A9860P4534j9894p9246k3020j4399n841J6106L8202L904N234n3398o9036
20717a06994j72k7989R14L8177O8916k733j6549q848J0795M262j3006J05237K7737
20704G9747n1809o0100J5929K7513K585M526j1950m9292n4849J1179l1681l5048
20692a53250K6129M0965P9614N3400j2751k1889j5489l176O18P50j7515q751k2192
20679e3537N4888L2578j2237K0792K6483n3369k6811l8557r663m7316o1833M4687
$$ plain form
20667 -123895 -61356 7689 -30066 2554 19006 42845 32265 21822 18790 59868 34436 -4122
20655 -4122 -41682 -51008 -75746 -36549 -83475 -115261 -62781 14727 46912 -31023 -63637 -44548
20643 -44548 -30349 15167 3248 29404 -36600 -38897 -13465 15342 10018 -6608 -36460 -47832
20631 -47832 -78340 -113937 -67918 -46735 -57532 -41098 -23185 30096 66430 -1392 -72787 -35623
20619 -35623 -11689 -25293 -44812 -63214 -36740 -46210 -60077 -34750 -11754 -4555 -24532 -10242
20607 -10242 -4147 -38033 -32946 18840 19323 -7859 -18411 -29630 -58092 -17252 -6236 -105458
20595 -105458 -184082 -210118 -146604 -31051 83600 89205 -5788 -39914 -44007 -27632 -3326
20584 -3326 4939 15496 21815 67300 27554 10488 -64154 -75726 -61559 -85774 568 88484
$$ packed form
20667a23895O2539O9045l7755L2620J6452K3839j0580j0443l032M1078k5432l8558
20655d122l7560r326k4738L9197m6926l1786N2480P7508L2185p7935l2614J9089
20643d4548J4199M5516j1919K6156o6004k297K5432K8807n324j6626k9852j1372
20631d7832l0508l5597M6019K1183j0797J6434J7913N3281L6334o7822p1395L7164
20619c5623K3934j3604j9519j8402K6474r470j3867K5327K2996P199j9977J4290
20607a0242O095l3886N087N1786M83k7182j0552j1219k8462M0840J1016r9222
20595a05458p8624k6036O3514J15553J14651N605r4993l4126m093J6375K4306
20584c326Q265J0557O319M5485l9746j7066p4642j1572J4167k4215Q6342Q7916
$$ plain form
20572 88484 73978 27327 11618 -15035 -24764 12262 30439 -32168 -11194 -23061 -71757 -54720
20560 -54720 -30111 -30101 -77461 -88100 -46931 -20413 47044 44834 -41837 -2994 29888 3781
20548 3781 -49479 -66124 -29524 -68967 -83715 -39352 19896 75435 66592 -41962 -78184 -91669
20536 -91669 -49070 8872 -10616 -19946 10102 50868 25890 11460 -24597 -34035 -9371 -19475
20524 -19475 -27995 -57863 -43875 -29231 27933 71618 73837 22310 -47910 -87832 -42761 -22045
20512 -22045 62712 136701 125284 36244 -22372 -68626 -95140 -123441 -92387 -14990 26541 15745
20500 15745 -68795 -89130 -68220 -21033 -14535 -47269 -107486 -74571 -10381 -51695 -60274 29359
20488 29359 51419 24181 -31787 -28146 5033 60757 -7593 -104284 -107700 -69657 -61030 -66940
$$ packed form
20572H8484j4506m6651j5709k6653r729L7026J8177o2607K0974j1867m8696J7037
20560e4720K4609J0m7360j0639M1169K6518O7457k210q6671L8843L2882k6107
20548C781n3260j6645L6600l9443j4748M4363N9248N5539q843j08554l6222j3485
20536i1669M2599N7942j9488r330L0048M0766k4978j4430l6057r438K4664j0104
20524a9475q520k9868J3988J4644N7164M3685K219n1527p0220l9922M5071K0716
20512b2045Q4757P3989j1417q9040n8616m6254k6514k8301L1054P7397M1531j0796
20500A5745q4540k0335K0910M7187O498l2734o0217L2915O4190m1314q579Q9633
20488B9359K2060k7238n5968L641L3179N5724o8350r6691l416L8043Q627n910
$$ plain form
20476 -66940 -22184 25665 -36285 -66837 -45396 -9150 36011 75828 46795 -14217 -16077 -49828
20464 -49828 -31987 -9855 -93442 -115346 -108438 -113433 -134448 -77769 -31687 8488 -50134 -58796
20452 -58796 -8027 -36394 -31771 -22938 -50881 -24215 -41903 -92763 -65701 -4046 19171 2775
20440 2775 -46657 -91475 -91357 -56298 -69018 -88226 -27048 12406 51742 60544 -383 -12210
20428 -12210 -55203 -111366 -77646 -28910 -56151 -52667 -2925 -17924 -17159 -1383 18430 44901
20416 44901 67972 44811 26238 93217 130898 69714 40148 -9868 -40253 1176 -20343 -136505
20404 -136505 -140134 -54981 -42329 15602 36489 -5363 -64859 -94166 -108871 -92023 -29860 -50420
20392 -50420 -11320 12397 -1595 23918 16342 28160 29538 22746 53885 79784 71946 43566
$$ packed form
20476f6940M4756M7849o1950l0552K1441L6246M5161L9817k9033o1012j860l3751
20464d9828J7841K2132q3587k1904O908m995k1015N6679M6082M0175n8622q662
20452e8796N0769k8367M623Q833k7943K6666j7688n0860K7062O1655K3217j6396
20440B775m9432m4818J18L5059j2720j9208O1178L9454L9336Q802o0927j1827
20428a2210m2993n6163L3720M8736k7241L484M9742j4999P65J5776J9813K6471
20416D4901K3071k3161j8573O6979L7681o1184k9566n0016l0385M1429k1519j16162
20404a36505l629Q5153J2652N7931K0887m1852n9496k9307j4705J6848O2163k0560
20392e0420L9100K3717j3992K5513p576J1818J378o792L1139K5899p838k8380
$$ plain form
20380 43566 10833 -71582 -86428 -58662 -55780 -38766 -34721 -65814 -147967 -132681 -74680 -39607
20368 -39607 -33919 -20514 -22627 -44713 -51200 -42440 -49380 -23121 -5404 33599 10603 -651 46031
20355 46031 39054 -23247 23388 44118 51871 60237 24766 -51864 -66520 -42974 -57851 -23438
20343 -23438 9554 8771 59832 87503 447 5173 21384 34678 -20360 -89164 -127830 -23150
20331 -23150 45886 32410 289 -3915 -26509 -39153 -51674 -21628 30497 101068 105327 60933
20319 60933 -21986 -17163 -38900 -70618 -59609 12554 26465 26136 43902 48404 44337 30063 20067
20306 20067 14600 -11781 -96142 -66413 -41739 -35230 -69214 -63271 -56227 -66776 -65964 -67698 -51661
20293 -51661 -68275 4169 16892 40456 46300 79386 141061 79786 42344 -34132 -70613 -91305
$$ packed form
20380D3566l2733q2415j4846K7766K882J7014M045l1093q2153J5286N8001L5073
20368c9607N688J3405k113k2086o487Q760o940K6259J7717L9003k2996j1254M6682
20355D6031o977o2301M6635K0730P753Q366l5471p6630j4656K3546j4877L4413
20343b3438L2992p83N1061K7671q7056M726J6211J3294n5038o8804l8666J04680
20331b3150O9036j3476l2121m204k2594j2644j2521L0046N2125P0571M259m4394
20319F0933q2919M823k1737l1718J1009P2163J3911l29J7766M502m067j4274r996
20306B0067n467k6381q4361K9729K4674O509l3984N943P044j0549Q12j734J6037
20293e1661j6614P2444J2723K3564N844L3086O1675o1275l7442p6476l6481k0692
$$ plain form
20281 -91305 -120161 -130348 -45234 -6718 89428 175073 121890 120681 85493 51580 25862 20871
20269 20871 -34612 -82524 -48683 -34473 -13543 -6307 4297 25525 33515 774 -25872 -39480
20257 -39480 -54668 -64034 -23752 -22561 -35119 -39365 -903 27364 -10657 9208 -16245 -93562
20245 -93562 -72498 -63894 -9686 32197 -12773 -104093 -117003 -82130 -167275 -142955 -99443 -82837
20233 -82837 -64308 -106467 -99952 -42193 -69921 -63156 -62006 -46048 -12907 -27858 -56965 -19248
20221 -19248 27184 28648 14681 -9232 -12181 2417 63062 56835 58447 -29308 -41294 19371
20209 19371 35342 51655 64659 119416 103054 35529 1323 46143 49611 12258 23596 7446
20197 7446 51882 79015 56762 33531 -9639 -47961 -77531 -73755 -118069 -145403 -66341 -31923
$$ packed form
20281i1305k8856j0187Q5114L8516R6146Q5645n3183j209l5188l3913k5718m991
20269B0871n5483m7912L3841J4210K0930P236J0604K1228P990l2741k6646j3608
20257c9480j5188r366M0282J191j2558m246L8462K8267l8021J9865k5453p7317
20245i3562K1064Q604N4208M1883m4970r1320j2910L4873q5145K4320M3512J6606
20233h2837J8529m2159O515N7759k7728O765J150J5958L3141j4951k9107L7717
20221a9248M6432J464j3967k3913k949J4598O0645o227J612q7755j1986O0665
20209A9371J5971J6313J3004N4757j6362o7525l4206M4820L468l7353J1338j6150
20197G446M4436K7133k2253k3231m3170l8322k9570L776m4314k7334P9062L4418
$$ plain form
20185 -31923 -40139 -55074 -51058 -64038 -30465 -13815 -2520 -13083 -18242 21811 10482 -5106
20173 -5106 19120 38622 -47911 -107076 -146024 -129798 -109026 -115129 -30500 -4428 7755 -33438
20161 -33438 -47430 -24208 -26305 -57523 731 73650 58155 41279 -808 -22621 10161 10409
20149 10409 976 -62720 -47648 -10765 -15732 -100316 -106226 -38569 -22024 -19882 -36774 3040
20137 3040 26931 27611 72093 61795 65097 39312 -21690 -722 -16646 -39953 -39678 -65523 -75641
20124 -75641 -20826 -1307 -6490 -51084 -76826 -39247 -63139 -96346 -104911 -44024 30849 12015
20112 12015 -49430 -96986 -67083 -37616 -86780 -101022 -48853 20010 29409 14751 11731 32348
20100 32348 -5006 -22305 -77054 -73727 -42230 25119 15752 -9533 -23230 -73778 -85706 -102199
$$ packed form
20185c1923q216j4935M016j2980L3573J6650J1295j0563n159M0053j1329j5588
20173e106K4226J9502q6533n9165l8948J6226K0772o103Q4629K6072J2183m1193
20161c3438j3992K3222k097l1218N8254P2919j5495j6876m2087k1813L2782K48
20149A0409r433o3696J5072L6883m967q4584n910O7657J6545K142j6892L9814
20137C040K3891O80M4482j0298L302k5785o1002K0968j5924k3307K75k5845j0118
20124g5641N4815J9519n183m4594k5742L7579k3892l3207q565O0887P4873j8834
20112A2015o1445m7556K9903K9467m9164j4242N2169O8863R399j4658l020K0617
20100C2348l7354j7299n4749L327L1497O7349r367k5285j3697n0548j1928j6493
$$ plain form
20088 -102199 -61800 -12217 5413 3176 -14472 -41628 -15000 -7078 3620 -2348 -632 -10563
20076 -10563 -30792 -41438 13441 32038 -6379 -52958 -28408 36827 46731 30988 24258 78623
20064 78623 72021 -9472 -23045 -3784 15950 12755 -15017 -7172 -27988 -50881 -32144 6105
20052 6105 18915 -9894 12862 49577 75932 80406 7349 -78822 -34555 -27363 -12640 11650
20040 11650 20019 15821 29450 62687 30904 20081 -22989 -43141 5178 37802 32554 1291
20028 1291 41273 76870 49249 -3125 -98880 -54158 8982 -52133 -80204 -75324 -62800 -97767
20016 -97767 -101749 -51699 -14541 -21106 -11188 -38426 -16713 -860 25836 9506 -72819 -78446
20004 -78446 -50295 -13560 9709 -15796 29982 20421 -14765 -37331 -119841 -100622 -82830 -86697
$$ packed form
20088a02199M0399M9583J7630k237j7648k7156K6628P922J0698n968J716r931
20076a0563k0229j0646N4879J8597l8417m6579K4550O5235R904j5743o730N4365
20064G8623o602q1493j3573J9261J9734l195k7772P845k0816k2893J8737L8249
20052F105J2810k8809K2756L6715K6355M474p3057q6171M4267P192J4723K4290
20040A1650Q369m198J3629L3237l1783j0823m3070k0152M8319L2624n248l1263
20028A291L9982L5597k7621n2374r5755M4722O3140o1115k8071M880J2524l4967
20016i7767l982N0050L7158o565R918k7238K1713J5853K6696j6330q2325n627
20004g8446K8151L6735K3269k5505M5778r561l5186k2566q2510J9219J7792l867
$$ plain form
19992 -86697 -115577 -78209 -48008 -14871 10992 -298 -17314 -53734 -48406 -77558 -140477 -138287
19980 -138287 -93693 -56945 -64689 -151698 -159836 -132419 -147188 -98188 -10356 -44180 -115525 -146888
19968 -146888 -141533 -128909 -81281 -155438 -154491 -50867 -36515 -59613 -55864 -52531 -45478 -58208
19956 -58208 -22654 -60389 -53659 -11319 4067 35062 23778 32910 72226 71365 49859 72498
19944 72498 42330 -67532 -85553 -83959 -65316 -77197 -87892 -45129 -109411 -82437 -38296 8540
19932 8540 34148 44246 9473 2399 -14849 -25419 -28750 -5268 -42424 -93003 -48710 -28475
19920 -28475 -18125 -56347 -62096 -61196 -69652 -27044 -61277 -73553 -131966 -154423 -119192 -100007
19908 -100007 -75741 -27876 -41524 -21666 -948 -2464 -15771 -37618 -98304 -96566 -18775 23872
$$ packed form
19992h6697k8880L7368L0201L3137K5863j1290j7016l6420N328k9152o2919K190
19980a38287M4594L6748p744q7009q138K7417j4769M9000Q7832l3824p1345l1363
19968a46888N355J2624M7628p4157R47J03624J4352k3098L749L333P053j2730
19956e8208L5554l7735O730M2340J5386L0995j1284R132L9316q61k1506K2639
19944G2498l0168j09862j8021J594J8643j1881j0695M2763o4282K6974M4141M6836
19932H540K5608J0098l4773p074j7248j0570l331K3482l7156n0579M4293K0235
19920b8475J0350l8222n749R00q456M2608l4233j2276n8413k2457L5231J9185
19908a00007K4266M7865j3648J9858K0718j516j3307k1847o0686J738P7791M2647
$$ plain form
19896 23872 45192 -12050 -66397 -46024 -14238 -32616 -32559 -20447 -23418 -10123 24808 -26375
19884 -26375 -55669 -31488 -17763 -41281 -31756 -1940 -13973 -42268 -14992 71957 68748 -23700
19872 -23700 -96529 -106581 -55503 -35480 11803 35014 6123 25138 72695 10159 -9592 -32523
19860 -32523 -26306 -57828 -22569 -31129 -7116 10531 65476 79804 77200 148216 178485 225261
19848 225261 187951 63108 -36238 -43124 -65256 -59254 -38302 -67236 -36997 -5865 41001 18769
19836 18769 -126 -16234 -59234 -90698 -29512 3964 -52279 -45637 -13565 -39678 -5021 38234
19824 38234 34527 -14487 -46940 -26307 -34032 -34941 -24382 -5482 -17169 -13957 1036 -38136 -51026
19811 -51026 -44611 -71698 -85812 -82809 -14612 -59046 -68235 -60114 -42808 -11756 -44552 -49876 -69291
$$ packed form
19896B3872K1320n7242n4347K0373L1786j8378N7J2112k971J3295L4931n1183
19884b6375k9294K4181J3725k3518R525K9816j2033k8295K7276Q6949l209r2448
19872b3700p2829j0052N1078K0023M7283K3211k8891J9015M7557o2536j9751k2931
19860c2523O217l1522L5259q560K4013J7647N4945J4328k604P1016L0269M6776
19848B25261l7310j24843r9346o886k2132O002K0952k8934L0239L1132M6866k2232
19836A8769j8895j6108m3000l1464O1186L3476n6243O642L2072k6113L4657M3255
19824C8234l707m9014l2453K0633p725r09J0559J8900j1687L212J4993l9172j2890
19811e1026O415k7087j4114L003O8197m4434r189Q121J7306L1052l2796n324j9415
$$ plain form
19798 -69291 -90631 -84353 -76952 -69802 -68253 -14386 11707 -3142 -3264 12309 -22093 -29662 -17852
19785 -17852 -42881 -11093 25867 -29824 -53178 39485 38688 13476 -32556 -27667 -3816 -49219
19773 -49219 -99542 -69533 9875 77941 76454 39472 -34565 -63161 -24181 -39929 -65226 -40844
19761 -40844 7105 -9472 -19497 -49674 -78891 -86257 -50920 -19893 -36895 -75101 -17977 -36797
19749 -36797 -103814 -101870 -78011 -59680 -4448 47765 71822 102606 123933 153289 210205 210740
19737 210740 191604 273933 223950 222195 265121 223549 228740 231449 220255 175690 204251 203436
19725 203436 217907 201695 200510 173852 91999 127322 115785 177513 205580 175232 133727 100121
19713 100121 107939 64647 49177 45775 7062 -21767 3016 41247 138147 211500 168063 124351
$$ packed form
19798f9291k1340O278P401P150J549N3867K6093j4849j22J5573l4402p569J1810
19785a7852k5029L1788L6960n5691k3354R2663p97k5212m6032M889K3851m5403
19773d9219n0323L0009P9408O8066j487l6982p4037k8596L8980j5748k5297K4382
19761d0844M7949j6577j0025l0177k9217p366L5337L1027j7002l8206N7124j8820
19749c6797o7017J944K3859J8331N5232N2213K4057L0784K1327K9356N6916N35
19737B10740j9136Q2329m9983j755M2926m1572N191K709j1194m4565K8561q15
19725B03436J4471j6212j185k6658q1853L5323j1537O1728K8067l0348m1505l3606
19713A00121P818m3292j5470l402l8713k8829K4783L8231R6900P3353m3437m3712
$$ plain form
19701 124351 66362 96522 87887 74837 82189 69683 37952 19862 3935 -2895 -15240 -8248
19689 -8248 -2172 -45182 -65433 -70822 -57405 -28939 19809 59604 63119 80460 79660 44535 36512
19676 36512 27765 38141 74585 88494 126733 107014 94309 147029 99214 28093 -2419 46387
19664 46387 47388 74190 73199 59915 49083 112681 119603 109012 85293 70811 -12317 -79676
19652 -79676 -75782 -86180 -71122 -95100 -22611 71902 84869 37943 -6168 20345 60475 9237
19640 9237 -46377 -81603 -98918 -139952 -67710 -37368 -63562 -109294 -89361 -867 32699 3861
19628 3861 -26409 -92234 -76814 -53442 -117985 -59165 -1099 243 -284 -33856 -32210 -2906 29907
19615 29907 40600 43575 34916 -17289 -55029 -37557 -44697 -21329 -109216 -99233 -76958 -55871
$$ packed form
19701A24351n7989L0160q635j3050P352j2506l1731j8090j5927o830j2345O992
19689h248O076m3010k0251n389J3417K8466M8748L9795L515J7341q00l5125q023
19676C6512q747J0376L6444J3909L8239j9719j2705N2720m7815p1121l0512M8806
19664D6387J001K6802r91j3284j0832O3598O922j0591k3719j4482q3128o7359
19652g9676L894j0398J5058k3978P2489R4513J2967m6926m4111K6513M0130n1238
19640I237n5614l5226j7315m1034P2242L0342k6194m5732J9933Q8494L3566k8838
19628C861l0270o5825J5420K3372o4543N8820N8066J342n27l3572J646K9304L2813
19615B9907J0693K975q659n2205l7740J7472p140K3368q7887R983K2275K1087
$$ plain form
19603 -55871 -35636 5512 64077 51558 544 20617 5735 49638 68863 72939 88920 41047
19591 41047 380 32664 73960 51671 54485 66386 99544 134361 115343 117326 100669 20268
19579 20268 42859 52356 11879 7346 65835 146416 139421 123858 106346 145476 182862 187427
19567 187427 104333 72281 64573 40451 -4904 43505 39455 54999 125033 90267 78075 52617
19555 52617 41777 12858 -17298 -30644 -6512 -36147 -25010 -70284 -86902 -71929 -63296 -66138
19543 -66138 -71257 -60450 10638 15796 -47288 -25447 11266 47688 31701 -45718 -71543 -19068
19531 -19068 48120 82293 -6688 16892 15289 53307 120114 147551 81188 59511 27865 26815
19519 26815 48734 38900 1279 -30011 -60134 -72000 -43827 35429 48393 22047 15171 13648
$$ packed form
19603e5871K0235M1148N8565j2519n1014K0073j4882M3903J9225M076J5981m7873
19591D1047m0667L2284M1296k2289K814J1901L3158L4817j9018J983j6657q0401
19579B0268K2591R497m0477m533N8489Q0581o995j5563j7512L9130L7386M565
19567A87427q3094l2052p708k4122m5355M8409m050J5544P0034l4766j2192k5458
19555E2617j0840k8919l0156j3346K4132k9635J1137m5274j6618J4973Q633k842
19543f6138n119J0807P1088N158o3084K1841L6713L6422j5987p7419k5825N2475
19531a9068O7188L4173q8981K3580j603L8018O6807K7437o6363k1677l1646j050
19519B6815K1919r834l7621l1290l0123j1866K8173P9256J2964k6346o876j523
$$ plain form
19507 13648 17666 7296 34743 51617 17757 -28138 -39353 -67421 -79734 -66856 -63383 -22917
19495 -22917 49901 38923 81906 51923 12695 -15189 -7869 32143 15745 -30142 -12315 -13522
19483 -13522 -39494 5246 -9086 -2697 54894 63422 41056 -20436 -96615 -131670 -106107 -121805
19471 -121805 -143053 -100896 -27522 20586 8620 20507 59521 128585 105463 40084 -19252
19460 -19252 27745 41778 37215 2733 -47527 -91928 -52967 -12387 26160 55212 43431 -17896
19448 -17896 -52722 -31777 -42640 -109590 -114760 -54276 26019 57620 46296 31022 39540 42941
19436 42941 35026 16540 -50253 -10738 60599 70641 31406 43228 20855 -12176 -15551 -2160
19424 -2160 17179 -19307 -58344 -6434 -18750 -88627 -70912 6520 49317 47989 24955 13483
$$ packed form
19507A3648M018j0370K7447J6874l3860m5895j1215k8068j2313J2878L473M0466
19495b2917P2818j0978M2983k9983l9228k7884P320M0012j6398m5887J7827j207
19483a3522k5972M4740j4332O389N7591Q528k2366o1492p6179l5055K5563j5698
19471a21805k1248M2157P3374M8108j1966J1887L9014O9064k3122o5379n9336
19460a9252M6997J4033m563l4482n0260m4401L8961M0580L8547K9052j1781o1327
19448a7896l4826K0945j0863o6950n170O0484Q0295L1601j1324j5274Q518L401
19436D2941p915j8486o6793L9515P1337J0042l9235J1822k2373l3031l375J3391
19424b160J9339l6486l9037N1910j2316o9877J7715P7432M2797j328k3034j1472
$$ plain form
19412 13483 1980 20061 31143 17213 21778 30288 51290 53606 21888 -66367 -94780 -82354
19400 -82354 -118132 -79905 -85493 -67299 -47601 -19725 -26477 -43968 -55227 -65517 -7673 25181
19388 25181 17663 30897 18145 21909 -9247 -15169 25531 10579 -69385 -51260 12536 -17167
19376 -17167 -59293 -31637 -55405 -38357 -37098 -18475 -845 -4097 -55545 -88606 -21020 41287
19364 41287 -4833 -31015 -31685 -18925 -39266 -79463 -118638 -142064 -106019 -55151 -23821 9542
19352 9542 10008 -17122 -22754 -8658 -5536 -1724 41821 51508 32427 23988 37456 -23939 -40852
19339 -40852 -80899 -85651 -47895 40327 31889 12878 37860 34326 33944 38995 96796 45756 -21869
19326 -21869 -20143 -5853 -24756 -38906 -114482 -129957 -68089 -1427 -8081 -46684 -78411 -70205
$$ packed form
19412A3483j1503J8081J1082j3930M565Q510K1002K316l1718q8255k8413J2426
19400h2354l5778L8227n588J8194J9698K7876o752j7491j1259j0290N7844L2854
19388B5181p518J3234j2752L764l1156n922M0700j4952p9964J8125O3796k9703
19376a7167m2126K7656k3768J7048J259J8623J7630l252n1448l3061O7586O2307
19364D1287m6120k6182o70J2760k0341m0197l9175k3426L6045N0868L1330L3363
19352I542M66k7130n632J4096L122L812M3545R687j9081q439J3468o1395j6913
19339d0852m0047m752L7756Q8222q438j9011K4982l534l82N051N7801n1040o7625
19326b1869J726J4290j8903j4150p5576j5475O1868O6662o654l8603l1727Q206
$$ plain form
19314 -70205 44549 82543 45027 54541 49971 18540 46319 79970 50199 38164 -13414 -81764
19302 -81764 -53922 12611 47149 12909 2266 39005 19445 -39261 -49536 -96619 -117709 -48293
19290 -48293 -12739 34414 56051 54794 69219 9304 -22343 -30382 -62366 -95005 -94383 -46860
19278 -46860 -31171 -60542 -77490 -30878 35967 23376 -17865 -34838 -25592 -72426 -142027 -120529
19266 -120529 -101285 -95338 -38387 43421 18679 -14356 -22199 -24507 -13746 -33764 -107370 -95564
19254 -95564 -38982 28309 45822 37227 -21435 -5982 -34279 -74649 -65746 -123462 -123096 -111729
19242 -111729 -101574 -96770 -89984 -101826 -85597 17244 12939 16172 -4971 35234 109258 70478
19230 70478 -9871 -37484 -58905 -88056 -76966 -60928 -70879 -65293 -55158 -74618 -91876 -44975
$$ packed form
19314g0205J14754L7994l7516R514m570l1431K7779L3651k9771j2035n1578o8350
19302h1764K7842O6533L4538l4240j0643L6739j9560n8706j0275m7083k1090O9416
19290d8293L5554M7153K1637j257J4425n9915l1647q039l1984l2639O22M7523
19278d6860J5689k9371j6948M6612O6845j2591m1241j6973R246m6834o9601K1498
19266a20529J9244N947N6951Q1808k4742l3035p843k308J0761k0018p3606J1806
19254i5564N6582O7291J7513q595n8662J5453k8297m0370Q903n7716L66J1367
19242a11729J0155M804O786j1842J6229J02841m305L233k1143M0205P4024l8780
19230G0478q0349k7613k1421k9151J1090J6038r951N586J0135j9460j7258M6901
$$ plain form
19218 -44975 7273 -11754 -42637 -37204 -39633 -58770 870 10093 -49260 -65158 -80716 -74360
19206 -74360 8704 80755 42270 31514 20846 -68772 -51398 15107 18041 -58482 -96811 -59447
19194 -59447 -49546 -80482 -64418 36125 62623 -7747 -54846 -97501 -40909 12272 -10534 20749
19182 20749 -5305 -29611 -23314 -30449 -8666 862 32265 18123 5925 39352 92560 64340
19170 64340 10875 -31704 -38953 -87155 -129957 -125191 -89070 -3405 22396 9956 -9794 -13543
19158 -13543 -2713 -32133 -52699 44619 55377 84263 116468 112919 48254 24527 8753 -8529
19146 -8529 -37701 -16355 -54581 -66170 -1046 17782 -46747 -87609 -104187 -55418 4755 4293
19134 4293 33174 87959 124753 123514 69810 44334 60396 68062 57428 74534 77238 125558
$$ packed form
19218d4975N2248j9027l0883N433k429j9137N9640R223n9353j5898j5558O356
19206g4360Q3064P2051l8485j0756j0668q9618J7374O6505K934p6523l8329L7364
19194e9447R901l0936J6064J00543K6498p0370m7099m2655N6592N3181k2806L1283
19182B0749k6054k4306O297p135K1783R528L1403j4142j2198L3427N3208k8220
19170F4340n3465m2579p249m8202m2802M766L6121Q5665K5801j2440j9750l749
19158a3543J0830k9420k0566R7318J0758K8886L2205l549o4665k3727j5774j7282
19146h529k9172K1346l8226j1589O5124J8828o4529m0862j6578M8769O0173m62
19134D293K8881N4785L6794j239n3704k5476J6062P666j0634J7106K704M8320
$$ plain form
19122 125558 135499 110867 51780 918 21267 55073 6734 -20106 -58275 -84793 -104743 -144218
19110 -144218 -73592 12240 18500 -20349 57797 101209 38952 35509 26489 46579 84425 71706
19098 71706 57752 64215 23062 -10780 -7685 -34815 17309 69354 11126 -11800 34911 40976
19086 40976 29694 -9451 -34356 10061 8112 35482 17113 -4105 -44584 -51513 -44819 -62803
19074 -62803 -5488 3463 23463 9825 37792 37442 19156 31482 132565 90086 19080 5787
19062 5787 -14229 20632 22441 57776 46939 -21630 -53385 -107303 -78898 1010 13597 -53400
19050 -53400 -74925 -53547 -26338 2971 79798 105966 119083 95441 30407 -15743 -33989 -2633
19038 -2633 14084 -1727 12163 -3996 2499 45552 70237 43993 19489 1821 -6284 -25491
$$ packed form
19122A25558R941k4632n9087n0862K0349L3806m8339k6840l8169k6518j9950l9475
19110a44218P0626Q5832O260l8849P8146M3412o2257l443r020K0090L7846j2719
19098G1706j3954O463m1153l3842L095k7130N2124N2045n8228k2926M6711O065
19086D0976j1282l9145k4905M4417j949K7370j8369k1218m0479o929O694j7984
19074f2803N7315Q951K0000j3638K7967l50j8286J2326J01083m2479p1006j3293
19062E787k0016L4861J809L5335j0837o8569l1755n3918K8405P9908J2587o6997
19050e3400k1525K1378K7209K9309P6827K6168J3117k3642o5034m6150j8246L1356
19038b633J6717j5811J3890j6159O495M3053K4685k6244k4504j7668q105j9207
$$ plain form
19026 -25491 -46953 -55787 -23050 -26237 -45695 -45815 -47076 -45440 -2621 27475 42984 46553 33442
19013 33442 7616 -26018 -24192 -54565 -26485 -21554 14486 -18817 -83198 -80954 -61618 -74753
19001 -74753 -110471 -40083 32868 476 -22603 -28826 -60634 -90359 -109690 -105280 -83213 -118008
18989 -118008 -90963 -104830 -141595 -120402 -115064 -109715 -36872 -49809 -77660 -63643 -38309 -82572
18977 -82572 -85320 -32666 7612 40582 41299 2919 -63789 -96885 -143918 -136275 -134546 -101923 -88503
18964 -88503 -104005 -151009 -155492 -98329 -30397 -48979 -68772 -65514 -25949 38387 31384 -19138
18952 -19138 261 28415 76872 91748 35770 -20410 5849 34586 50025 18928 -17742 -77588
18940 -77588 -26790 3812 13630 48464 687 -2850 -8141 -31315 8312 27767 59920 86221
$$ packed form
19026b5491k1462q834L2737l187j9458j20j261J636M2819L0096J5509L569j3111
19013C3442k5826l3634J826l0373K8080M931L6040l3303o4381K244J9336j3135
19001g4753l5718P0388P2951l2392k3079o223l1808k9725j9331M410K2067l4795
18989a18008K7045j3867l6765K1193N338N349P2843j2937k7851J4017K5334m4263
18977h2572k748N2654M0278L2970P17l8380o6708l3096m7033P643J729L2623J3420
18964h8503j5502m7004m483N7163O7932j8582j9793L258L9565O4336p003n0522
18952a9138J9399K8154M8457J4876n5978n6180K6259K8737J5439l1097l6670n9846
18940g7588N0798L0602R818L4834m7777l537n291k3174L9627J9455L2153K6301
$$ plain form
18928 86221 100712 61207 -11030 -7759 66158 42669 -4921 -8672 4137 14366 10623 108846
18916 108846 182119 158493 94850 106066 75103 13806 -21760 32839 52503 53105 15736 15372
18904 15372 42370 29144 -54406 -69594 -50687 -1194 13977 -24876 2001 48531 14522 13508
18892 13508 16852 2477 -1188 -23506 -53771 -111436 -73049 12283 -18634 -38020 31902 66614
18880 66614 48549 31323 -20732 -75630 -51814 -45652 -34130 -44965 -28229 -10340 10746 729
18868 729 8272 13303 3613 25184 72311 102160 84163 50449 42770 23903 -1047 38334 31829
18855 31829 29131 36217 30723 34769 11939 29301 -41356 -84401 -49028 -53920 -63930 3718 37114
18842 37114 71205 8629 50375 28474 14855 4413 -5369 -67 16897 30225 54116 45492
$$ packed form
18928H6221J4491l9505p2237L271P3917k3489m7590l751J2809J0229l743R8223
18916A08846P3273k3626o3643J1216l0963o1297l5566N4599J9664O02l7369l64
18904A5372K6998j3226q3550j5188J8907M9493J5171l8853K6877M6530l4009j014
18892A3508L344j4375l665k2318l0265n7665L8387Q5332l0917j9386O9922L4712
18880F6614j8065j7226n2055n4898K3816O162J1522j0835J6736J7889K1086j0017
18868G29P543N031r690K1571M7127K9849j7997l3714p679j8867k4950L9381o505
18855C1829k698P086n494M046k2830J7362p0657m3045L5373m892j0010O7648L3396
18842C7114L4091o2576M1746k1901j3619j0442r782N302J6964J3328K3891q624
$$ plain form
18830 45492 47804 3999 -40071 -79805 -40692 -14024 14130 -33284 -64165 -75516 -57553 -24649
18818 -24649 -47771 -14569 23830 52485 130421 163384 95653 84642 59266 46375 49058 122086
18806 122086 158774 92616 19116 -11162 -22788 -9415 7546 -49438 -35766 -11453 15262
18795 15262 44850 61955 31802 34747 18373 -42390 -100792 -95107 -49517 20855 27177 18993
18783 18993 83479 79736 117636 127664 113343 69274 73168 93680 85793 39497 24266 15513
18771 15513 89466 161253 238125 369943 701718 918247 669187 369195 191416 143308
18761 143308 184021 159887 196899 161503 105137 99339 85483 124263 165358 161234 151252 160174
18749 160174 106931 74749 65107 54546 58913 87004 144375 187706 155113 87519 11405 12298
$$ packed form
18830D5492K312m3805m4070l9734L9113K6668K8154m7414l0881j1351J7963L2904
18818b4649k3122L3202L8399K8655P7936L2963o7731j1011k5376j2891K683P3028
18806A22086L6688o6158p3500l0278j1626J3373J6961n6984J3672K4313K6715
18795A5262K9588J7105l0153K945j6374o0763n8402N685M5590P0372O322q184
18783A8993O4486l743L7900J0028j4321m4069L894K0512p887m6296j5231q753
18771A5513P3953P1787P6872J31818L31775K16529k49060k99992j77779m8108
18761A43308M0713k4134L7012l5396n6366n798j3856L8780M1095m124r982Q922
18749A60174n3243l2182r642j0561M367K8091N7371M3331l2593o7594p6114Q93
$$ plain form
18737 12298 37839 51996 80505 92554 41628 56840 126952 194792 198711 224667 221497 189388
18725 189388 155208 158904 211068 264041 302987 295325 317454 325332 401997 451155 449797 423458
18713 423458 462002 449473 449583 474389 542077 549028 579713 597556 577207 502321 423783 404141
18701 404141 311050 260095 240267 245436 323060 372879 412116 379344 369203 309116 263118 323829
18689 323829 343498 343615 374960 366332 326798 291035 247713 243289 231544 210378 331672 358937
18677 358937 380209 373697 359582 361545 318957 244187 308223 339900 347566 362489 402028 473305
18665 473305 486271 469977 533034 566298 555850 497323 555406 567631 444681 313498 323359
18654 323359 278947 259342 260580 211230 94865 38893 108527 113881 87509 145733 188995 188202
$$ packed form
18737A2298K5541J4157K8509J2049n0926J5212P0112O7840L919K5956l170l2109
18725A89388l4180L696N2164N2973L8946p662K2129P878P6665M9158j358k6339
18713D23458L8544j2529J10K4806O7688O951L0685J7843k0349p4886p8538j9642
18701D04141r3091n0955j9828N169P7624M9819L9237l2772j0141o0087m5998O0711
18689C23829J9669J17L1345q628l9534l5763m3322m424j1745k1166J21294K7265
18677C58937K1272o512j4115J963m2588p4770O4036L1677P666J4923L9539P1277
18665D73305J2966j6294O3057L3264j0448n8527N8083J2225j22950j31183R861
18654C23359m4412j9605J238m9350j16365n5972O9634N354k6372N8224M3262p93
$$ plain form
18642 188202 142054 93720 66664 84089 30015 18279 -29239 -16743 -11505 17473 54332 66355
18630 66355 125929 117018 148829 114481 47590 37801 96787 142763 151359 148490 89066 80345 116338
18617 116338 139747 93619 110135 121856 109799 106505 56969 104479 113569 67149 24193 36733
18605 36733 97118 69026 53283 77012 44870 85432 133770 174360 132084 68092 72241 59230
18593 59230 86104 45622 5108 -62 11027 102774 142104 169190 132424 76315 54036 39332
18581 39332 7143 34169 27212 70015 94424 98781 39108 -19142 -25376 10019 18583 16042 34491
18568 34491 54400 35924 43293 59594 109873 85334 95278 138158 137339 161660 121348 96767
18556 96767 45521 11583 -2773 -42151 -65035 -36496 5052 6628 11363 6634 46917 55798
$$ packed form
18642A88202m6148m8334k7056J7425n4074j1736m7518J2496N238K8978L6859J2023
18630F6355N9574q911L1811l4348o6891r789N8986M5976Q596k869n9424q721L5993
18617A16338K3409m6128J6516J1721j2057l294m9536M7510R090m6420m2956J2540
18605C6733O0385k8092j5743K3729l2142M0562M8338M0590m2276o3992M149j3011
18593E9230K6874m0482m0514n170J1089R1747L9330K7086l6766n6109k2279j4704
18581C9332l2189K7026o957M2803K4409M357n9673n8250o234L5395Q564k541J8449
18568C4491J9909j8476P369J6301N0279k4539R944M2880q19K4321m0312k4581
18556I6767n1246l3938j4356l9378k2884K8539M1548J576M735m729M0283Q881
$$ plain form
18544 55798 91988 133724 148732 146543 111414 41301 42148 21446 39212 44810 60079 31827
18532 31827 3983 -13492 -24476 66169 70356 85377 123781 126492 113618 66944 10034 22725
18520 22725 69192 53822 68043 65541 36617 42195 88166 112162 116904 88054 97136 106969 48454
18507 48454 58975 107464 122329 108446 67124 33500 26003 -5072 29879 58116 76435 101219
18495 101219 113893 81295 95607 109694 135559 122269 -14432 -66486 -41150 -1606 1074
18484 1074 -8603 35312 68433 139711 183670 136389 87506 71611 90425 91303 105322 114869 100074
18471 100074 129187 160098 154607 140185 113006 89324 92529 97578 118476 142298 134607 189713
18459 189713 132767 105095 130655 109323 77970 40932 46602 91007 158490 175260 181486 162032
$$ packed form
18544E5798L6190M1736J5008k189l5129p0113Q47k0702J7766N598J5269k8252
18532C1827k7844j7475j0984R0645M187J5021L8404K711j2874m6674n6910J2691
18520B2725M6467j5370J4221k502k8924N578M5971K3996M742k8850R082R833n8515
18507D8454J0521M8489J4865j3883m1322l3624p497l1075L4951K8237J8319K4784
18495A01219J2674l2598J4312J4087K5865j3290j36701n2054K5336L9544K680
18484A074r677M3915L3121P1278M3959m7281m8883j5895J8814Q78J4019R547j4795
18471A00074K9113L0911n491j4422k7179k3682L205N049K0898K3822p691N5106
18459A89713n6946k7672K5560k1332l1353l7038N670M4405O7483J6770O226j9454
$$ plain form
18447 162032 136391 139942 214587 255077 250826 209678 183787 173333 144130 112639 72240 42032
18435 42032 35034 43863 77430 87496 100409 56559 57285 122343 118280 114461 162509 127239 99044
18422 99044 72880 43451 89385 63721 63572 126630 109334 21212 259 -6640 16907 86653
18410 86653 149376 196048 156545 173796 144015 139715 159763 99838 63755 97073 137909 167370
18398 167370 167740 169610 191217 200262 160018 153686 184494 198502 172835 180329 195903 141403 71386
18385 71386 20225 -60515 -122798 -77657 11533 75708 130541 182623 185324 213412 226105 216519
18373 216519 220883 182391 129653 149936 141298 154008 170041 161210 243540 309940 324632 307955
18361 307955 355221 393542 411936 436064 410632 366153 290407 262265 231346 223679 236844 261656
$$ packed form
18447A62032k5641L551P4645M0490m251m1148k5891j0454k9203l1491m0399l0208
18435D2032o998Q829L3567J0066J2913m3850P26O5058m063l819M8048l5270k8195
18422I9044k6164k9429M5934k5664j49O3058j7296q8122k0953o899K3547O9746
18410H6653O2723M6672l9503J7251k9781m300K0048n9925l6083L3318M0836K9461
18398A67370L70J870K1607R045m0244o332L0808J4008k5667P494J5574n4500p0017
18385G1386n1161q0740o2283M5141Q9190O4175N4833N2082K701K8088J2693r586
18373B16519M364l8492n2738K0283q638J2710J6033q831Q2330O6400J4692j6677
18361C07955M7266L8321J8394K4128k5432m4479p5746k8142l0919p667J3165K4812
$$ plain form
18349 261656 242762 256227 241166 232924 259043 254008 257875 318709 432914 526554 465354 373097
18337 373097 342190 307738 227135 179979 189258 204663 208946 215792 297606 278010 261670 308594
18325 308594 391239 460138 466386 461845 447995 385029 309499 211605 136188 96819 75730 127195
18313 127195 188771 222374 251414 317483 304434 424618 460325 502532 551062 601147 597658
18302 597658 550978 574645 607902 697776 773477 834693 799366 797156 832239 847632 805355 735304
18290 735304 660463 670771 647939 658790 730795 755009 799459 936471 1072660 1241102 1433157
18279 1433157 1826850 2490855 3088256 3134021 2826365 2773596 2931949 3415050 4085563 4445591
18269 4445591 4413844 4273734 3744828 3078678 2613227 2355044 2327583 2398757 2473236 2656699
$$ packed form
18349B61656j8894J3465j5061q242K6119n035L867O0834J14205R3640o1200r2257
18337C73097l0907l4452q0603m7156R279J5405M283O846Q1814j9596j6340M6924
18325C08594Q2645O8899O248m541j3850o2966p5530r7894p5417l9369k1089N1465
18313A27195O1576L3603K9040O6069j3049J20184L5707M2207M8530N0085l489
18302E97658m6680K3667L3257Q9874P5701O1216l5327k210L5083J5393m2277p0051
18290G35304p4841J0308k2832J0851P2005K4214M4450J37012J36189J68442J92055
18279A433157L93693O64005N97401M5765l07656n2769J58353M83101O70513L60028
18269D445591l1747j40110n28906o66150m65451k58183k7461P1174P4479J83463
$$ plain form
18259 2656699 2981587 3169959 3057399 2784376 2558976 2450753 2408208 2411497 2390557 2417718
18249 2417718 2364834 2360465 2432623 2584916 2790007 2976251 3104037 3210954 3437135 3835819
18239 3835819 4374849 5136624 6124378 7532202 9740924 12655808 14839968 15042297 14901548
18230 14901548 16161727 19256492 23747897 29414525 36810686 45058327 55126953 66405067
18222 66405067 72972780 74806889 77938861 82628720 82486939 77518474 72089606 67394376
18214 67394376 65599784 68839033 76582477 81981765 75833819 65217916 60010161 60177437
18206 60177437 62088370 61419824 56530995 50679907 46089737 43343960 43177272 46606041
18198 46606041 55003537 70416998 96960561 140816673 208580543 299367257 389568218
$$ packed form
18259B656699L24888J88372j12560k73023k25400j08223m2545L289k0940K7161
18249B417718n2884m369P2158J52293K05091J86244J27786J06917K26181L98684
18239C835819N39030P61775R87754J407824K208722K914884K184160K02329j40749
18230A4901548J260179L094765M491405N666628P396161Q247641J0068626J1278114
18222F6405067O567713J834109L131972M689859j41781m968465n428868m695230
18214F7394376j794592L239249P743444N399288o147946j0615903n207755J67276
18206F0177437J910933o68546m888829n851088m590170k745777j66688L428769
18198D6606041Q397496J5413461K6543563M3856112O7763870R0786714R0200961
$$ plain form
18191 389568218 435547326 411204614 344447671 273367442 206586749 148583155 106835848
18184 106835848 80894982 65836833 57676440 53598319 51887642 52116470 51841039 48361956
18176 48361956 44104188 40815183 37792347 34928189 32168952 29533058 27661851 26215210
18168 26215210 24782394 24130646 23972791 22880012 21180812 20180260 20088895 20906453 23113551
18159 23113551 26870122 31770826 36926919 40907738 41802998 39062912 34528008 28726844
18151 28726844 22932493 18917849 16912912 16232591 15975797 15315168 14310472 13665149 14017359
18142 14017359 15998210 20082046 25631069 29740187 29351314 25948752 22875974 21312283
18134 21312283 20753737 20007569 19174141 19454427 20390706 20310192 19516639 19143669 19379992
$$ packed form
18191C89568218M5979108k4342712o6756943p1080229o6780693n8003594m1747307
18184A06835848k5940866j5058149q160393m078121j710677K28828k75431l479083
18176D8361956m257768l289005l022836k864158k759237k635894j871207j446641
18168B6215210j432816o51748j57855j092779j699200j000552r1365Q17558K207098
18159B3113551L756571M900704N156093L980819Q95260k740086m534904n801164
18151B8726844n794351m014644k004937o80321k56794o60629j004696o45323L52210
18142A4017359J980851M083836N549023M109118l88873l402562l072778j563691
18134B1312283n58546p46168q33428K80286R36279q0514p93553l72970K36323
$$ plain form
18125 19379992 20311278 21499911 21275129 19567635 17972072 16429562 14767093 13764683
18117 13764683 13564533 13870591 14811892 17131997 21874708 30860491 47997573 81762529
18109 81762529 140743909 180413037 134157628 77931693 49968632 38702346 34430096
18102 34430096 32533530 30465251 27712187 24769428 21830167 19290554 16855546 13966096
18094 13966096 11550733 10165321 9686516 9690713 10102232 10946937 11071704 9484951 7682171
18085 7682171 6543840 6000772 5808905 5890883 6132238 6185924 6014533 5959469 6187694 6653284
18075 6653284 6695153 6313508 6140503 6414728 7008741 7537620 8321389 9220368 9511884 8760670
18065 8760670 7224506 5516734 4239751 3437453 2881930 2575236 2283000 2081037 1974273
$$ packed form
18125A9379992R31286J188633k24782j707494j595563j542510j662469j002410
18117A3764683k00150L06058R41301K320105M742711Q985783J7137082L3764956
18109H1762529N8981380L9669128m6255409n6225935k7963061j1266286m272250
18102C4430096j896566k068279k753064k942759k939261k539613k435008k889450
18094A3966096k415363j385412m78805M197M11519Q44705J24767j586753j802780
18085G682171j138331n43068j91867Q1978K41355N3686j71391n5064K28225M65590
18075F653284M1869l81645j73005K74225N94013N28879P83769Q98979K91516p51214
18065H760670j536164j707772j276983q02298n55523l06694k92236k01963j06764
$$ plain form
18056 1974273 1870013 1825552 1913581 2165653 2523984 3099562 3732065 4193780 4151191 3675533
18046 3675533 3091300 2523106 2140235 1828572 1607577 1397076 1306428 1302074 1305661 1235585
18036 1235585 1158193 1080405 1017904 997561 1016793 1053167 1174040 1124162 1004280 995759 893402
18025 893402 834052 800336 730595 683843 664878 637314 616977 637487 591735 546782 581838
18014 581838 571084 522829 537146 569611 463105 353533 330865 295709 288657 254586 261591
18003 261591 281130 319054 377793 339771 307006 317264 281413 341336 339717 265586 265587 318553
17991 318553 294940 318934 352995 354834 318426 308575 331980 355502 369907 336806 296365 284980
17979 284980 324453 312972 264241 243712 213932 171863 181199 151474 134991 151804 210115 162456
$$ packed form
18056A974273j04260m4461Q8029K52072L58331N75578O32503M61715m2589m75658
18046C675533n84233n68194l82871l11663k20995k10501r0648m354L587p0076
18036A235585p7392p7788o2501k0343J9232L6374J20873m9878j19882q521j02357
18025H93402n9350l3716o9741m6752j8965k7564k0337K0510m5752m4953L5056
18014E81838j0754m8255J4317L2465j06506j09572k2668l5156p052l4071P005
18003B61591J9539L7924N8739l8022l2765J0258l5851N9923j619p4131JN2966
17991C18553k3613K3994L4061J839l6408r851K3405K3522J4405l3101m0441j1385
17979B84980L9473j1481m8731k0529k9780m2069R336k9725j6483J6813N8311m7659
$$ plain form
17967 162456 162107 143690 101627 70970 74627 103542 141009 118624 130649 92697 61173 96929
17955 96929 120585 111898 126425 108619 107435 128882 167832 174831 181963 172894 141751 117208 127010
17942 127010 174010 153536 171390 157493 124224 96474 52223 64137 117344 108411 134400 139930
17930 139930 139231 162734 152042 127084 73615 70560 89059 135181 120781 73647 109924 185595
17918 185595 223972 235683 206793 223816 248836 225677 168484 195354 118929 22539 -43583
17907 -43583 -88493 -2079 75743 68375 35541 21972 11345 50282 49808 20055 1020 15804
17895 15804 81305 109933 106895 102686 107453 101901 64483 89471 116002 76862 69021 49604 20337
17882 20337 -4918 32770 36394 -915 -24853 17636 65461 32208 -2497 -2355 9586 61921
$$ packed form
17967A62456l49j8417m2063l0657L657K8915L7467k2385J2025l7952l1524L5756
17955I6929K3656q687J4527j7806j184K1447L8950O999P132r069l1143k4543R802
17942A27010M7000k0474J7854j3897l3269k7750m4251J1914N3207q933K5989N530
17930A39930o99K3503j0692k4958n3469l055J8499M6122j4400m7134L6277P5671
17918A85595L8377J1711k8890J7023K5020k3159n7193K6870p6425r6390o6122
17907d3583m4910Q6414P7822p368l2834j3569j0627L8937m74k9753j9035J4784
17895A5804O5501K8628l038m209M767n552l7418K4988K6531l9140p841j9417k9267
17882B0337k5255L7688L624l7309k3938M2489M7825l3253l4705J42J1941N2335
$$ plain form
17870 61921 78991 138568 172608 178126 197233 148606 60463 42562 90880 131041 115677 61699
17858 61699 42044 97653 179295 155113 31168 44920 89287 80968 120732 109356 42586 42112
17846 42112 60719 22321 17688 49987 80522 18065 -6527 8569 37199 90449 109576 116213
17834 116213 30391 -48132 -29787 309 -10771 35495 75253 93120 121366 71461 15680
17823 15680 34122 54243 22577 34755 127223 162589 147993 184755 182071 124392 76149 63264
17811 63264 67432 139431 141622 179828 132618 84016 78086 124847 124866 99886 31128 47499 80806
17798 80806 82129 100477 69351 82533 77366 67300 40699 -4011 -8345 33296 46450 37479
17786 37479 11698 89546 129562 142012 130738 112252 148638 135961 134140 99475 73811 55620
$$ packed form
17870F1921J7070N9577L4040N518J9107m8627q8143j7901M8318M0161j5364n3978
17858F1699j9655N5609Q1642k4182j23945J3752M4367q319L9764j1376o6770m74
17846D2112J8607l8398m633L2299L0535o2457k4592J5096K8630N3250J9127O637
17834A16213q5822p8523J8345L0096j1080M6266L9758J7867K8246m9905n5781
17823A5680J8442K0121l1666J2178R2468L5366j4596L6762k684n7679m8243j2885
17811F3264M168P1999K191L8206m7210m8602n930M6761J9k4980o8758J6371L3307
17798H0806J323J8348l1126J3182n167j0066k6601m4710m334M1641J3154q971
17786C7479k5781P7848M0016J2450j1274j8486L6386j2677j821l4665k5664j8191
$$ plain form
17774 55620 18783 81665 60981 2608 18112 15908 35150 78025 86649 93532 111157 138959
17762 138959 121471 69365 77294 24948 49988 82105 52180 87341 126431 112021 181467 216552
17750 216552 209324 243358 218953 211078 223868 265195 275796 283145 241729 207456 233536 271401
17738 271401 261636 200404 164142 198591 257577 311531 345475 330373 356562 387500 349745 359797
17726 359797 328473 289739 263916 313504 349237 360815 420528 444846 376109 404383 480978
17715 480978 543267 477465 432871 406438 375216 323514 271558 243896 307334 382634 390168 429128
17703 429128 466782 468176 434384 452484 437738 420254 427834 457397 479713 450348 431128 431410
17691 431410 400307 391452 394723 368181 333647 304574 250606 286174 325911 330294 303498 310989
$$ packed form
17774E5620l6837O2882k0684n8373J5504k204J9242M2875Q624O883J7625K7802
17762A38959j7488n2106P929n2346K5040L2117k9925L5161L9090j4410O9446L5085
17750B16552p228L4034k4405p875J2790M1327J0601P349m1416l4273K6080L7865
17738B71401r765o1232l6262L4449N8986N3954L3944j5102K6189L0938l7755J0052
17726C59797l1324l8734k5823M9588L5733J1578N9713K4318o8737K8274P6595
17715D80978O2289o5802m4594k6433l1222n1702n1956k7662O3438P5300P534L8960
17703D29128L7654J394l3792J8100j4746j7484P580K9563K2316k9365j9220K82
17691D31410l1103q855L271k6542l4534k9073n3968L5568L9737M383k6796P491
$$ plain form
17679 310989 359509 285654 226406 175691 212202 253539 229523 280296 355125 442861 477971
17668 477971 475964 438340 369489 347404 352914 358521 304686 267064 263642 263051 291176 275878 260134
17655 260134 301680 313009 256257 197045 212885 143916 99413 86129 137426 126442 168665
17644 168665 216689 262576 322822 349433 295443 247989 194390 121580 99609 109294 115444 98642
17632 98642 155179 109530 102575 149366 164902 107727 36157 51558 42881 88565 121884 188235
17620 188235 208219 135375 82222 91102 97247 83386 93510 69421 76880 152316 170171 126946
17608 126946 137145 159620 175022 166277 199918 175934 130917 64107 53184 124370 115534 127693
17596 127693 75314 49463 83803 156617 188996 160185 187542 237624 285208 217729 191796
$$ packed form
17679C10989M8520p3855n9248n0715L6511M1337k4016N0773P4829Q7736L5110
17668D77971k007l7624o8851k2085N510N607n3835l7622l422n91K8125j5298j5744
17655B60134M1546J1329n6752n9212J5840o8969m4503j3284N1297j0984M2223
17644A68665M8024M5887O0246K6611n3990m7454n3599p2810k1971R685O150j6802
17632I8642N6537m5649o955M6791J5536n7175p1570J5401q677M5684L3319O6351
17620A88235J9984p2844n3153Q880O145j3861J0124k4089P459P5436J7855m3225
17608A26946J0199K2475J5402q745L3641k3984m5017o6810j0923P1186q836J2159
17596A27693n2379k5851L4340P2814L2379k8811K7357N0082M7584o7479k5933
$$ plain form
17585 191796 153627 78120 39613 67450 67046 6590 39104 48908 11083 -8782 61387 70234
17573 70234 103590 102573 149432 170738 195340 151993 127602 99157 57956 32248 55095 27736
17561 27736 -5328 -52910 -66364 -51882 24276 68692 124724 152611 131657 109142 63469 23546
17549 23546 39559 33175 89811 120397 109776 97272 40782 -16453 -12207 -11395 -74756 -65958 -45797
17536 -45797 -33659 -72335 -22266 17932 15462 53748 47933 69313 51885 19070 12165 9415
17524 9415 62968 105516 109822 119151 110850 81783 128548 126066 101028 32657 47139 53924 38215
17511 38215 64151 65159 98143 101681 75912 30206 -6849 33394 36433 6229 28097 -16438
17499 -16438 3549 31124 -5283 -99875 -125054 -94595 -59819 -1141 60425 76883 116686 122446
$$ packed form
17585A91796l8169p5507l8507K7837m04o0456L2514R804l7825j9865P0169Q847
17573G0234L3356j017M6859K1306K4602m3347k4391k8445m1201k5708K2847k7359
17561B7736l3064m7582j3454J4482P6158M4416N6032K7887k0954k2515m5673l9923
17549B3546J6013o384N6636L0586j0621j2504n6490n7235M246Q12o3361Q798K0161
17536d5797J2138l8676N0069M0198k470L8286n815K1380j7428l2815o905k750
17524I415N3553M2548M306R329q301k9067M6765k482k5038o8371J4482O785j5709
17511C8215K5936J008L2984L538k5769m5706l7055M0243L039l0204K1868m4535
17499a6438J9987K7575l6407r4592k5179L0459L4776N8678O1566J6458L9803N760
$$ plain form
17487 122446 106186 57198 43567 47652 37960 55213 28215 69569 86817 43734 10883 42506
17475 42506 47703 70797 32951 -34408 18826 58014 35198 65998 39078 38137 23792 14012
17463 14012 -6279 16622 24210 44876 33759 23703 11982 -22873 -57855 -76339 -60378 -3364
17451 -3364 35654 44974 70553 56517 69743 45277 119189 319242 578090 913038 798283
17440 798283 404652 109325 37525 75952 102124 126504 78126 98283 90545 16177 12986
17429 12986 57426 78764 76882 79829 49287 9216 -20054 -74353 -45194 -18466 -11668 -6815
17417 -6815 -9059 366 33563 60541 78132 76346 79858 40179 13985 29409 3179 -41181 -47625
17404 -47625 8916 22985 36287 23911 43514 33215 46630 57023 30214 97407 139662 108993
$$ packed form
17487A22446j6260m8988j3631M085r692J7253k6998M1354J7248m3083l2851L1623
17475D2506N197K3094l7846o7359N3234L9188k2816L0800k6920r41j4345r780
17463A4012k0291K2901P588K0666j1117j0056j1721l4855l4982j8484J5961N7014
17451c364L9018R320K5579j4036J3226k4466P3912K00053K58848L34948j14755
17440G98283l93631k95327p1800L8427K6172K4380m8378K0157p738p4368l191
17429A2986M4440K1338j882K947l0542m0071k9270n4299K9159K6728O798M853
17417f815k244R425L3197K6978J7591j786L512l9679k6194J5424k6230m4360o444
17404d7625N6541J4069J3302j2376J9603j0299J3415J0393k6809O7193M2255l0669
$$ plain form
17392 108993 64313 83532 72945 87877 111445 79183 62881 61520 47931 16584 35301 40120
17380 40120 35535 35986 52718 8653 -44048 -59636 25359 28283 -4865 12221 21587 10588 13665
17367 13665 44297 7452 7243 -25539 21081 43649 55014 43239 73220 97893 95937 6625
17355 6625 -64039 -81732 -25603 79056 48189 68107 84136 64440 69997 49019 15558 -47920
17343 -47920 -64158 -56845 -79029 -62927 -14774 39949 29342 -38433 -44272 -96162 -82176 -68597
17331 -68597 -73203 -103920 -97239 -85792 -51244 -47076 -75305 -51216 -74332 -51374 -36801 -21202
17319 -21202 13685 16005 20690 -17921 -7565 24946 43710 47675 49893 22741 19259 39142 66915
17306 66915 38535 -62848 -73846 -51088 -50389 -31704 -20993 -94093 -100625 -64447 -44931 -53989
$$ packed form
17392A08993m4680J9219j0587J4932K3568l2262j6302j361j3589l1347J8717M819
17380D0120m585M51J6732m4065n2701j5588Q4995K924l3148J7086R366j0999L077
17367A3665L0632l6845k09l2782M6620K2568J1365j1775K9981K4673j956q9312
17355F625p0664j7693N6129J04659l0867J9918J6029j9696N557k0978l3461o3478
17343d7920j6238P313k2184J6102M8153N4723j0607o7775n839n1890J3986J3579
17331f8597m606l0717O681J1447L4548M168k8229K4089k3116K2958J4573J5599
17319b1202L4887K320M685l8611J0356L2511J8764L965K218k7152l482J9883K7773
17306F6915k8380j01383j0998K2758O99J8685J0711p3100o532L6178J9516r058
$$ plain form
17294 -53989 -19365 10595 9208 47010 23843 25717 42236 68177 61529 63645 85400 113220
17282 113220 176245 129736 45587 30387 103262 85800 118988 104572 56546 79957 26720
17271 26720 -16322 -23419 44982 84976 89514 76113 71697 15775 17585 31059 7612 -64185
17259 -64185 -30508 -10198 42591 87417 69914 38573 -16998 -12265 -9675 -42434 -59497 -39106
17247 -39106 5790 18779 21953 59284 61388 85881 100099 151801 75997 13626 -20839 -32283
17235 -32283 -80570 -88995 -77008 -84459 -65047 -33636 25565 62160 95719 67315 60196 31795
17223 31795 10237 -59515 -56690 -56042 -48712 -25822 1210 42844 21647 -62081 -60259 -36649 -22666
17210 -22666 12606 62594 31217 56683 46047 44654 50268 -12834 -33340 -20233 31116 38704
$$ packed form
17294e3989L4624K9960j387L7802k3167J874J6519K5941o648K116K1755K7820
17282A13220O3025m6509q4149j5200P2875j7462L3188j4416m8026K3411n3237
17271B6720m3042p097O8401L9994M538j3401m416n5922J810J3474k3447p1797
17259f4185L3677K0310N2789M4826j7503l1341n5571M733K590l2759j7063K0391
17247c9106M4896J2989L174L7331K104K4493J4218N1702p5804o2371l4465j1444
17235c2283m8287q425J1987p451J9412L1411N9201L6595L3559k8404p119k8401
17223C1795k1558o9752K825O48P330K2890K7032M1634k1197q3728J822K3610J3983
17210b2666L5272M9988l1377K5466j0636j393N614o3102k0506J3107N1349P588
$$ plain form
17198 38704 20023 28649 12570 -16219 -67978 -111669 -89731 -44736 -71206 -86731 -90301 -61928
17186 -61928 -30842 1598 7620 1115 16698 -22696 34991 47380 3892 49512 11471 18324
17174 18324 17466 41943 19545 17185 20279 9072 55025 65333 72734 83368 26655 -36306 -67245
17161 -67245 2583 39272 35330 -10089 -45360 -13513 -12780 -19842 -3367 40990 80419 75929 27284
17148 27284 -4680 -36341 3492 -5861 -9698 43348 -2199 -39279 -11887 -39307 -21947 18953
17136 18953 46105 13355 21851 56044 21931 -21864 -51644 -6193 39880 -23045 -86524 -129638
17124 -129638 -92723 -70390 -55038 178 31712 22212 -11929 -45646 -56307 -59719 -50420 -8576
17112 -8576 1131 -1023 -19007 -30199 40734 95380 59674 -34699 -64503 -58687 -74762 -69199 -60014
$$ packed form
17198C8704j8681Q626j6079k8789n1759m3691K1938M4995k6470j5525l570K8373
17186f1928L1086L2440O022o505J5583l9394N7687J2389m3488M5620l8041O853
17174A8324q58K4477k2398k360L094j1207M5953J0308P401J0634n6713o2961l0939
17161f7245O9828L6689l942m5419l5271L1847P33p062J6475M4357L9429m490m8645
17148B7284l1964l1661L9833r353l837N3046m5547l7080K7392k7420J7360M0900
17136A8953K7152l2750Q496L4193l4113m3795k9780M5451M6073o2925o3479m3114
17124a29638L6915K2333J5352N5216L1534r500l4141l3717j0661l412R299M1844
17112h576R707k154j7984j1192P0933N4646l5706r4373k9804N816j6075N563R185
$$ plain form
17099 -60014 -100481 -98739 -38380 -101756 -72763 -29774 -22276 -37752 -50536 -18973 27617 20611
17087 20611 55693 62524 40498 62811 89322 55881 -70858 -97316 -85059 -44455 -44484 -20530
17075 -20530 -41454 -48504 -54361 -41277 -68287 -22502 -5162 -40592 -82905 -98607 -102062 -126490
17063 -126490 -96607 -52212 -40848 100 -44245 -136681 -85194 -48490 -30807 -50054 -16945
17052 -16945 32214 59786 16532 255 12818 15145 -8499 -21830 -26686 6594 35192 59906
17040 59906 65507 63035 12393 2881 222 -7079 -33970 -43615 -35614 -81058 -117686 -44999 -83
17027 -83 1815 -56579 -81442 -89263 -46758 3054 27160 -8565 3144 10989 -12445 -20392 -13820
17014 -13820 36979 61768 39836 -12275 -58421 5719 49590 33534 -3723 -72901 -120707 -91974
$$ packed form
17099f0014m0467J742O0359o3376K8993M2989P498j5476j2784L1563M6590p006
17087B0611L5082O831k2026K2313K6511l3441j26739k6458J2257M0604k9K3954
17075b0530k0924p050n857J3084k7010M5785J7340l5430m2313j5702l455k4428
17063a26490K9883M4395J1364M0948m4345r2436N1487L6704J7683j9247L3109
17052a6945M9159K7572m3254j6277J2563K327k3644j3331m856L3280K8598K4714
17040E9906N601k472n0642r512k659p301k6891r645Q001m5444l6628P2687M4916
17027h3J898n8394k4863p821M2505M9812K4106l5725J1709P845k3434p947O572
17014a3820N0799K4789k1932n2111m6146O4140M3871j6056l7257o9178m7806K8733
$$ plain form
17002 -91974 -51555 -49053 3118 6705 10069 -43932 -74983 -36605 -21927 -22406 22834 51219 78168
16989 78168 34075 -7769 -30881 -70811 -120953 -97643 -80147 -55812 -74787 -56585 -55251 17707
16977 17707 67763 3338 -19899 25801 32623 17635 -57209 -83179 -79128 -27518 3017 41591
16965 41591 67768 25270 -31551 -45572 -29660 -52343 -45219 -12396 31335 -1311 28432 56883
16953 56883 -22195 -26569 -49620 -60029 -86929 -63769 -47786 -64968 -116578 -69720 -91179 -113293
16941 -113293 -93085 -67934 -1902 -5930 -53530 -39785 4889 -26687 -23719 -2066 -24774 -18386
16929 -18386 -1012 25781 9011 -23006 -14983 26344 49233 55847 69572 90732 77030 45145
16917 45145 29767 5552 -44260 -93352 -104135 -87243 -51156 48900 133115 147320 139701 164862
$$ packed form
17002i1974M0419K502N2171L587L364n4001l1051L8378J4678m79M5240K8385K6949
16989G8168m4093m1844k3112l9930n0142K3310J7496K4335j8975J8202J334P2958
16977A7707N0056o4425k3237M5700O822j4988p4844k5970M051N1610L0535L8574
16965D1591K6177m2498n6821j4021J5912k2683P124L2823M3731l2646K9743K8451
16953E6883p9078m374k3051j0409k6900K3160J5983j7182n1610M6858k1459k2114
16941a13293K0208K5151O6032m028m7600J3745M4674l1576K968K1653k2708O388
16929a8386J7374K6793j6770l2017Q023M1327K2889O614J3725K1160j3702l1885
16917D5145j5378k4215m9812m9092j0783J6892L6087J00056Q4215J4205p619K5161
$$ plain form
16905 164862 108997 36794 -18294 -46666 -35135 -24823 7820 -32627 -20106 -13856 -63006 -43364
16893 -43364 -24741 -36154 -109516 -53090 15441 52215 57319 23749 -43916 -90314 -71814 -47115
16881 -47115 28235 106613 66661 -6660 2155 1614 -46301 -59133 -129848 -140926 -87924 -14646
16869 -14646 31456 6518 -12271 -43678 -53233 -56491 -74296 -50662 23164 3665 -50245 -43918
16857 -43918 -5946 36900 16045 -1978 15747 56669 11347 -30108 -61860 -92232 -99274 -42736
16845 -42736 3905 10152 36643 61002 39675 40374 38883 -11956 -72676 -39958 2966 -37847
16833 -37847 -11783 -970 -51135 -27960 -37225 -10558 -5255 25930 -6813 -29634 -63274 -70752
16821 -70752 -44927 -59661 -53647 -58087 -41180 -21405 40255 32584 5709 -22999 -33847 13782
$$ packed form
16905A64862n5865p2203n5088k8372J1531J0312L2643m0447J2521O250m9150J9642
16893d3364J8623j1413p3362N6426O8531L6774N104l3570o7665m6398J8500K4699
16881d7115P5350P8378l9952p3321Q815n41m7915j2832p0715j1078N3002P3278
16869a4646M6102k4938j8789l1407r555l258j7805K3634P3826j9499n3910O327
16857d3918L7972M2846k0855j8023J7725M0922m5322m1455l1752l0372p042N6538
16845d2736M6641O247K6491K4359k1327O99j491n0839o0720L2718M2924m0813
16833c7847K6064J0813n0165K3175r265K6667N303L1185l2743k2821l3640p478
16821g0752K5825j4734O014m440J6907J9775O1660p671k6875k8708j0848M7629
$$ plain form
16809 13782 92454 116992 112362 37468 -28206 -28110 -54331 -66628 -90744 -51974 -39573 -31560 -13729
16796 -13729 35667 -28426 -48362 7791 66703 79317 57975 70800 33100 -36555 -60769 -75953
16784 -75953 -94856 -92803 -108104 -93133 -95038 -81638 -15811 -23789 -53220 -77613 -73354 -90375
16772 -90375 -38785 -25812 3918 -6834 6258 61251 32675 69668 81103 77408 64552 46018
16760 46018 26551 42763 94832 125058 34976 -2366 10358 3691 -50346 -12364 -33685 -63527
16748 -63527 -82222 -97457 -19414 -14891 -38245 -5628 -38828 -55132 -12234 -43508 -36898 19746
16736 19746 1070 829 -30571 -37565 -10644 -23234 -25904 13510 24027 -31653 -63653 -77082
16724 -77082 -24466 -10303 2359 -3625 -3083 14142 31643 -70 -10395 37877 24578 -13262
$$ packed form
16809A3782P8672K4538m630p4894o5674R6k6221j2297k4116L8770J2401Q013J7831
16796a3729M9396o4093j9936N6153N8912J2614k1342J2825l7700o9655k4214j5184
16784g5953j8903K053j5301J4971j905J3400O5827p978k9431k4393M259j7021
16772i0375N1590J2973K9730j0752J3092N4993k8576L6993J1435l695j2856j8534
16760D6018j9467J6212N2069L0226r0082l7342J2724o667n4037L7982k1321k9842
16748f3527j8695j5235P8043M523k3354L2617l3200j6304M2898l1274O610N6644
16736A9746j8676k41l1400o994K6921j2590k670L9414J0517n5680l2000j3429
16724g7082N2616J4163J2662n984N42J7225J7501l1713j0325M8272j3299l7840
$$ plain form
16712 -13262 15424 46421 104310 39886 9064 28357 1206 -9804 -32670 -30539 52104 114337
16700 114337 54376 2260 -7655 -78227 -96374 -9172 29159 21641 -19336 -78297 -90464 -60521
16688 -60521 6725 46578 49655 58046 15610 4377 54497 85622 73102 32161 20066 38059
16676 38059 55248 78690 86570 71628 -16866 -44836 -15189 12373 35364 30577 -9704 -31303
16664 -31303 -25409 -12871 42030 74050 41056 3642 -41446 -52575 -32275 41824 79543 48746
16652 48746 -29918 -40908 -71807 -56041 -13592 8309 -43 -48327 -54850 -23424 -12738 47833
16640 47833 54077 35515 21102 -54089 -53483 -41424 -20468 9958 40668 76082 84834 20207
16628 20207 -890 3526 17059 68696 75490 44127 -21903 -58634 -38941 11389 35977 51836
$$ packed form
16712a3262K8686L0997N7889o4424l0822J9293k7151j1010k2866K131Q2643O2233
16700A14337n9961n2116r915p0572j8147Q7202L8331p518m0977n8961j2167K9943
16688f0521O7246L9853L077Q391m2436j1233N0120L1125j2520m0941j2095J7993
16676C8059J7189K3442P880j4942q8494k7970K9647K7562K2991m787m0281k1599
16664c1303N894J2538N4901L2020l2994l7414m5088j1129K0300P4099L7719l0797
16652D8746p8664j0990l0899J5766M2449K1901q352m8284o523L1426J0686O0571
16640D7833O244j8562j4413p5191O06J2059K0956L0426L0710L5414Q752o4627
16628B0207k1097M416J3533N1637O794l1363o6030l6731J9693N0330K4588J5859
$$ plain form
16616 51836 52220 52096 9044 -150 18995 38721 2163 -57119 -47266 -5064 57912 94084 150915
16603 150915 150842 99600 101258 122998 80448 -13700 -28240 -33079 -12187 -4521 57730 48628 -7121
16590 -7121 4329 36801 24462 67451 66217 65526 98683 73157 -5248 -70664 -11315 17877
16578 17877 18741 -36965 -19637 41027 23207 -13370 -23408 -14956 -53321 -100278 -63018 -48443
16566 -48443 -24953 -67113 -69173 -92532 -64306 35129 58278 12450 -28795 -28033 11058 -8413
16554 -8413 -56944 -9040 -24760 -84406 -115846 -129400 -65094 -33343 -27841 -63700 -103986 -66033
16542 -66033 -30516 -35864 -23726 -7324 -17234 -26712 -30143 -6800 -8961 -29872 -63692 -49910 -2518
16529 -2518 13625 23478 10065 -16476 5367 31698 41337 33127 -34031 -75405 -16229 46259
$$ packed form
16616E1836L84j24m3052r194J9145J9726l6558n9282R853M2202O2976L6172N6831
16603A50915p3n1242J658K1740m2550r4148j4540m839K0892P666O2251r102n5749
16590g121J1450L2472j2339M2989j234o91L3157k5526p8405o5416N9349K9192
16578A7877Q64n5706J7328O0664j7820l6577j0038Q452l8365m6957L7260J4575
16566d8443K3490m2160k060k3359K8226R9435K3149m5828m1245P62L9091j9471
16554h413m8531M7904j5720n9646l1440j3554O4306L1751N502l5859m0286L7953
16542f6033L5517n348J2138J6402r910r478l431K3343k161k0911l3820J3782M7392
16529b518J6143R853j3413k6541K1843K6331R639q210o7158m1374N9176O2488
$$ plain form
16517 46259 56670 10136 -56093 -44390 -21874 -48830 -81365 -962 -26044 -116013 -120050 -94739
16505 -94739 -49009 -76538 -98743 -69458 -76088 -3420 37531 41691 6240 6470 -23999 -5389
16493 -5389 -124 -32081 10396 29087 -9662 -75854 -104001 -122244 -95468 -43454 -39443 6271
16481 6271 47015 33419 -56012 -82282 -17379 -22999 48172 82444 28371 18236 51379 20225
16469 20225 -7634 -24771 -29018 9386 32590 -74998 -106962 -102400 -57313 -30256 -39322 -65399
16457 -65399 -77917 -59580 -32172 5495 26105 55029 92773 114502 44360 -62731 -60064 -40249
16445 -40249 -10869 3044 37938 26645 -75980 -148249 -171168 -117936 -83612 -36655 -39107 -47897
16433 -47897 -34642 15901 60263 34699 -23632 -82554 -60370 -120327 -95417 -109097 -89386 -28589
$$ packed form
16517D6259J0411m6534o6229J1703K2516k6956l2535Q0403k5082q9969m037K5311
16505i4739M5730k7529k2205K9285o630P2668M0951M160l5451K30l0469J8610
16493e389N265l1957M2477J8691l8749o6192k8147j8243K6776N2014M011M5714
16481F271M0744j3596q9431k6270O4903n620P1171L4272n4073j0135L3143l1154
16469B0225k7859j7137m247L8404K3204j07588l1964M562M5087K7057r066k6077
16457f5399j2518J8337K7408L7667K0610K8924L7744K1729p0142j07091K667J9815
16445d0249K9380J3913L4894j1293j02625p2269k2919N3232L4324M6957k452q790
16433d7897J3255N0543M4362k5564n8331n8922K2184n9957K4910j3680J9711O0797
$$ plain form
16421 -28589 28954 22048 25120 11876 -54460 -63112 -49387 -58525 -34020 -37298 -41101 27858 17723
16408 17723 27482 95415 66806 16324 50801 15023 10142 -10725 -43060 -18178 32419 20230
16396 20230 53177 45889 -13588 -59569 -85634 -80023 -87512 -67063 -52185 -64059 -68737 -79807
16384 -79807 -46048 -26877 -22530 -23060 -38496 -64789 -49588 -13097 -20986 -16401 -66763 -85279 -57699
16371 -57699 -24305 -65531 -84680 -123614 -62591 -49156 -76702 -127001 -140925 -121313 -107178 -81792
16359 -81792 -23621 -22570 20391 -8063 -31979 -64947 -50776 5203 -18093 -48453 -68002 -88387
16347 -88387 -69681 -23885 14943 9626 -5864 -42869 -31617 -38501 -19598 -4908 -33188 -42533
16335 -42533 -9851 79011 120934 113113 51197 -46609 15760 9200 -14628 -7284 -44788 -91036
$$ packed form
16421b8589N7543o906L072j3244o6336q652J3725r138K4505l278l803O8959j0135
16408A7723R759O7933k8609n0482L4477l5778m881k0867l2335K4882N0597j2189
16396B0230L2947p288n9477m5981k6065N611p489K0449J4878j1874m678j1070
16384g9807L3759J9171M347n30j5436k6293J5201L6491p889M585n0362j8516K7580
16371e7699L3394m1226j9149l8934O1023J3435k7546n0299j3924J9612J4135K5386
16359h1792N8171J051M2961k8454k3916l2968J4171N5979k3296l0360j9549k0385
16347h8387J8706M5796L8828n317j5490l7005J1252o884J8903J4690k8280r345
16335d2533L2682Q8862M1923p821o1916r7806O2369o560k3828P344l7504m6248
$$ plain form
16323 -91036 -99077 -56938 -61434 -77831 -59126 -33566 -6689 -19107 -51311 -73082 -118456 -74994
16311 -74994 -68014 -113626 -58775 50570 111328 50884 -28266 -43073 -29076 4791 -32698 1388
16299 1388 58353 59010 57477 121699 127710 82832 76825 13467 22911 21698 22221 52674 25497 39246
16285 39246 18432 -40098 -77422 -65149 -38057 -4550 30343 52424 63604 58385 -6205 -2756
16273 -2756 -27252 -107491 -57024 -43011 -27423 28880 18605 8766 62652 97653 41264 66477
16261 66477 33515 -20539 -91765 -123567 -69138 -35586 -67272 -91473 -46898 -70 2385 -5558
16249 -5558 20745 -9070 6789 91573 72035 42441 -29858 -45020 -3691 10475 14854 12613
16237 12613 -2483 33260 19954 -21602 -27123 -34059 9564 -40033 -102806 -111451 -132547 21688
$$ packed form
16323i1036q041M2139m496j6397J8705K5560K6877j2418l2204k1771m5374M3462
16311g4994O980m5612N4851J09345O0758o0444p9150j4807J3997L3867l7489L4086
16299A388N6965O57j533O4222O011m4878o007o3358R444j213N23L0453k7177J3749
16285C9246k0814n8530l7324J2273K7092L3507L4893K2081J1180n219o4590L449
16273b756k4496q0239N0467J4013J5588N6303j0275r839N3886L5001n6389K5213
16261F6477l2962n4054p1226l1802N4429L3552l1686k4201M4575M6828K455p943
16249e558K6303k9815J5859Q4784j9538k9594p2299j5162M1329J4166M379k241
16237A2613j5096L5743j3306m1556n521o936M3623m9597o2773q645k1096J54235
$$ plain form
16225 21688 76792 -25549 -51182 -85370 -67842 -72767 -74795 -60944 -34344 -61510 -83523 -38689
16213 -38689 -20293 17492 -20454 17684 46964 2272 -14569 -9910 -19681 17098 38402 49987
16201 49987 526 -33189 -48198 -98428 -69537 -14902 -75719 -108462 -81316 5447 15418 -7428
16189 -7428 -6269 19512 -16370 -29939 3333 24624 22065 13521 20211 10926 -11100 -19921 33409
16176 33409 19919 -17974 -43951 -79808 -131906 -110831 -53401 -12808 -28997 585 45189 60150
16164 60150 21022 -45590 -3105 35133 33162 57286 60414 85338 41076 -29112 -59524 -54044
16152 -54044 5359 8723 -39893 -84997 -61676 -41652 19872 9298 -60217 -116363 -105955 -98614
16140 -98614 -123149 -117439 -63811 867 72690 61988 53547 16366 26547 98536 128316 123972
$$ packed form
16225B1688N5104j02341k5633l4188J7528m925k028J3851K6600k7166k2013M4834
16213c8689J8396L7785l7946L8138K9280m4692j6841M659r771L6779K1304J1585
16201D9987m9461l3715j5009n0230K8891N4635o0817l2743K7146Q6763R971k2846
16189g428J159K5781l5882j3569L3272K1291k559q544O690r285k2026q821N3330
16176C3409j3490l7893k5977l5857n2098K1075N7430M0593j6189K9582M4604J4961
16164F0150l9128o6612M2485L8238j971K4124L128K4924m4262p0188l0412N480
16152e4044N9403L364m8616m5104K3321K0024O1524j0574o9515n6146J0408P341
16140i8614k4535N710N3628O4678P1823j0702q441l7181J0181P1989K9780m344
$$ plain form
16128 123972 75856 60235 19846 19072 67442 -5976 -113200 -113639 -143482 -88634 -16877 44644
16116 44644 61932 37236 9801 -6807 -4677 4640 -10618 -15891 1079 -12266 -2846 -32411
16104 -32411 -32251 -24717 -2699 23024 9572 -24105 -5569 14222 48154 41771 16258 4872
16092 4872 22223 22842 7999 16038 40880 20732 -23572 -3252 11600 1379 14274 1904
16080 1904 -24047 -73555 -62137 -63460 -8245 24810 32987 35523 43595 20153 18254 9274 8949
16067 8949 17743 63499 50863 42370 71581 29914 29188 36605 4438 -5700 -1093 -19392 -33257
16054 -33257 -51224 -67595 -56718 -32036 -25488 -47864 -65875 -92471 -74780 -17652 13859 62367
16042 62367 81758 76788 -2971 -21881 -24557 21606 45170 68012 29329 3668 6144 14229
$$ packed form
16128A23972m8116j5621m0389p74M8370p3418j07224m39k9843N4848P1757O1521
16116D4644J7288k4696k7435j6608K130R317j5258n273J6970j3345R420k9565
16104c2411J60P534K2018K5723j3452l3677J8536J9791L3932o383k5513j1386
16092D872J7351O19j4843Q039K4842k0148m4304K0320J4852j0221J2895j2370
16080A904k5951m9508J1418j323N5215L3055Q177K536Q072k3442j899q980l25
16067H949Q794M5756j2636q493K9211m1667p26P417l2167j0138M607j8299j3865
16054c3257j7967j6371J0877K4682O548k2376j8011k6596J7691N7128L1511M8508
16042F2367J9391m970p9759j8910k676M6163K3564K2842l8683k5661K476Q085
$$ plain form
16030 14229 35661 87524 72695 75152 84254 33626 -18473 39153 12854 -13600 -7843 15797
16018 15797 6559 42556 41656 54980 2303 -39904 -63834 -112518 -122881 -121520 -74664 -17815
16006 -17815 2610 28058 73294 52583 -45730 -59362 480 91615 32216 6823 49889 28135
15994 28135 -30036 -10925 31442 40251 39550 69892 79209 33549 20889 46221 36974 26701 55476
15981 55476 60278 81667 93429 43284 10963 -1455 -13081 -38688 -20730 53438 40657 17819
15969 17819 54321 76100 21682 3922 -16468 9222 2769 -32178 -33065 -28436 -862 3337 -17524
15956 -17524 -5209 43825 18178 -3533 -40739 -29488 -25640 7624 -15162 -66375 -83128 -121474
15944 -121474 -99508 -20199 60559 48059 65158 85440 66767 16360 9922 56487 38468 42592
$$ packed form
16030A4229K1432N1863j4829K457R102n0628n2099N7626k6299k6454N757K3640
16018A5797r238L5997r00J3324n2677m2207k3930m8684j0363J361M6856N6849
16006a7815K0425K5448M5236k0711r8313j3632N9842R1135n9399k5393M3066k1754
15994B8135n8171J9111M2367Q809p01L0342R317m5660j2660K5332r247j0273K8775
15981E5476M802K1389J1762n0145l2321j2418j1626k5607J7958P4168j2781k2838
15969A7819L6502K1779n4418j7760k0390K5690o453l4947q87M629K7574M199k0861
15956a7524J2315M9034k5647k1711l7206J1251L848L3264k2786n1213j6753l8346
15944a21474K1966P9309Q0758j2500J7099K0282j8673n0407o438M6565j8019M124
$$ plain form
15932 42592 33095 19280 -13923 -17258 -18646 34139 77080 64915 41622 87903 91679 66737
15920 66737 45198 55697 61077 39655 53299 74080 33351 -5345 -6593 -2747 -29909 -16333
15908 -16333 -71513 -54707 24598 88771 67046 66874 103550 64667 24673 52084 9655 -17819
15896 -17819 -47882 -43061 -30486 -59316 -38415 -4410 34913 42972 25098 -10241 -66256 -66984
15884 -66984 -43583 14202 2331 -30224 -28268 40349 89690 68140 16162 -48985 -44284 -25966
15872 -25966 -8562 -9476 -10538 -34056 -39417 -32664 17808 48280 33887 63973 106554 106714 48192
15859 48192 16585 17145 -11507 32394 48363 47482 67594 30192 3045 14724 45314 10276
15847 10276 -38907 -36006 -38740 6453 35597 20319 -10489 -18799 27712 35216 41890 1281 41281
$$ packed form
15932D2592r497j3815l3203l335j388N2785M2941j2165k3293M6281L776k4942
15920F6737k1539J0499N380k1422J3644K0781m0729l8696j248L846k7162J3576
15908a6333n5180J6806P9305O4173k1725j72L6676l8883l9994K7411m2429k7474
15896a7819l0063M821J2575k8830K0901L4005L9323Q059j7874l5339n6015p28
15884f6984K3401N7785j1871l2555J956O8617M9341k1550n1978o5147M701J8318
15872b5966J7404r14j062k3518n361O753N0472L0472j4393L0086M2581J60n8522
15859D8192l1607N60k8652M3901J5969q81K0112l7402k7147J1679L0590l5038
15847A0276m9183K901k734M5193K9144j5278l0808q310M6511P504O674m0609M0000
$$ plain form
15834 41281 70720 90529 62043 46142 11653 -4252 18342 5259 38161 -4915 -13495 58459
15822 58459 122341 103859 58875 78751 18499 -18205 -4721 40034 58427 51605 -64373 -57720
15810 -57720 -74093 -35776 -19559 -1011 9710 19078 57600 53981 52172 66493 55960 88459
15798 88459 133296 141968 62973 -57475 -65958 -14766 33903 34468 11836 -11798 -5444 -21632
15786 -21632 -63561 -49280 -24473 -6889 79268 120648 142309 64108 3335 -96886 -94673 10551
15774 10551 3856 -50358 -40624 23900 -38985 -15098 -20162 -56242 -22950 27066 85279 92992
15762 92992 83467 63683 41505 -22162 -90777 -92708 -75089 -22605 -25113 -49454 -33013 -89637
15750 -89637 -84420 -51316 -36581 -26902 16392 21160 -4486 -66297 -73206 -68553 -90494 -78240 -8023
$$ packed form
15834D1281K9439J9809k8486j5901l4489j5905K2594j3083L2902m3076q580P1954
15822E8459O3882j8482m4984J9876o0252l6704J3484M4755J8393o822j15978O653
15810e7720j6373L8317J6217J8548J0721R368L8522l619j809J4321j0533L2499
15798H8459M4837Q672p8995j20448q483N1192M8669N65k2632k3634O354j6188
15786b1632m1929J4281K4807J7584Q6157M1380K1661p8201o0773j00221K213J05224
15774A0551o695n4214R734O4524o2885K3887n064l6080L3292N0016N8213P713
15762I2992r525j9784k2178o3667o8615j931J7619N2484k508k4341J6441n6624
15750h9637N217L3104J4735R679M3294M768k5646o1811o909M653k1941J2254P0217
$$ plain form
15737 -8023 55433 8078 -30813 -53246 -66338 9820 42978 4444 12946 -7632 -24278 -15511
15725 -15511 -40066 -47879 16042 -2308 -11058 30822 27562 -30444 -39233 -26840 -50910 874
15713 874 28644 5912 -9046 -34643 2562 -9605 -11022 6506 46001 81148 97561 62173
15701 62173 69935 69322 56681 51882 47545 39817 44145 32198 80587 107456 67693 30553 3115
15688 3115 -54374 -72155 -44398 30098 62818 17804 7820 2688 -21105 -96104 -106746 -58217
15676 -58217 -36132 8129 16076 0 23819 27712 34686 24307 -22559 -37676 37151 51563
15664 51563 53073 39598 1665 -3269 -20906 -57386 -55612 -5138 72201 134272 147974 102512
15652 102512 56401 84338 33600 -43635 -67891 -113021 -106036 -119400 -62405 -9107 -35716 -10247
$$ packed form
15737h023O3456m7355l8891k2433j3092P6158L3158l8534Q502k0578j6646Q767
15725a5511k4555p813O3921j8350q750M1880l260n8006q789J2393k4070N1784
15713H74K7770k2732j4958k5597L7205j2167j417J7528L9495L5147J6413l5388
15701F2173P762o13j2641m799m337p728M328j1947M8389K6869l9763l7140k7438
15688C115n7489j7781K7757P4496L2720m5014r984n132k3793p4999j0642M8529
15676e8217K2085M4261P947j6076K3819L893O974j0379m6866j5117P4827J4412
15664E1563J510j3475l7933m934j7637l6480J774N0474P7339O2071J3702m5462
15652A02512m6111K7937n0738p7235k4256m5130O985j3364N6995N3298k6609K5469
$$ plain form
15640 -10247 -34128 -71651 -44485 -24497 -86266 -130487 -91340 -27112 -24879 -25085 -67151 -73807
15628 -73807 -7774 26463 17098 -10695 -7265 90119 112320 25119 8524 46879 63016 20864
15616 20864 62825 66681 -1690 19145 31472 38591 15656 -72181 -63435 -42845 -44000 -20232
15604 -20232 -55087 -84888 -120597 -116281 -68624 -50258 -29242 -24566 -6381 51857 81088 56480
15592 56480 32918 89162 93365 23749 -64719 -82292 -18227 24745 5172 5766 40515 25090
15580 25090 7885 -11590 -13217 -8567 -19354 47575 113219 41793 -8309 20525 37220 -27752
15568 -27752 -38078 -55676 -127451 -127549 -62881 -38378 -9985 -13182 2487 -23586 -7971 -4979 -9739
15555 -9739 -4881 -1607 -981 2534 -2450 11359 6621 -15664 32501 -43734 -111843 -43325 -12189
$$ packed form
15640a0247k3881l7523K7166J9988o1769m4221L9147O4228K233k06m2066o656
15628g3807O6033L4237r365k7793L430R7384K2201q7201j6595L8355J6137m2152
15616B0864M1961L856o8371K0835J2327P119k2935q7837Q746K0590j155K3768
15604b0232l4855k9801l5709M316M7657J8366K1016M676J8185N8238K9231k4608
15592E6480k3562N6244M203o9616q8468j7573O4065M2972j9573N94L4749j5425
15580B5090j7205j9475j627M650j0787O6929O5644p1426n0102K8834J6695o4972
15568b7752j0326j7598p1775r8O4668K4503K8393l197J5669k6073J5615K992m760
15555i739M858L274O26L515m984J3809m738k2285M8165p6235o8109O8518L1136
$$ plain form
15542 -12189 -7210 -4281 6247 32079 32896 39540 62866 25967 44166 86326 121633 54975 33041
15529 33041 11651 -46047 -64182 -83836 -30596 55030 54712 12330 24319 8174 -40553 -29853
15517 -29853 -38844 -25025 -15283 -24705 -37310 -12648 47062 61661 56085 -8378 -27362 21959
15505 21959 4243 2575 50639 79186 32427 -73051 -80311 16501 43691 -8469 -43849 -48245
15493 -48245 -89175 -4750 32049 -17708 -61887 -53052 -44749 -73065 -155613 -167981 -190231 -143282
15481 -143282 -82310 -44460 -39575 -17223 -23159 -23491 78911 129476 103610 49072 11715 -10583
15469 -10583 -79669 -108113 -68095 13302 22422 -64265 -98348 -115373 -158624 -96614 -98703 -164453
15457 -164453 -129197 -53556 -50130 -16799 -33528 7010 -21503 -21966 -52736 -51705 -14260 13056
$$ packed form
15542a2189M979K929J0528K5832Q17O644K3326l6899J8199M2160L5307o6658k1934
15529C3041k1390n7698j8135j9654N3240Q5626l18m2382J1989j6145m8727J0700
15517b9853q991J3819R742r422j2605K4662N9710J4599n576o4463j8984M9321
15505B1959j7716j668M8064K8547m6759j05478p260R6812K7190n2160l5380m396
15493d8245m0930Q4425L6799m9757m4179Q835Q303k8316q2548j2368k2250M6949
15481a43282O0972L7850M885K2352n936l32J02402N0565k5866n4538l7357k2298
15469a0583o9086k8444M0018Q1397R120q6687l4083j7025m3251O2010k089o5750
15457a64453L5256P5641L426L3331j6729M0538k8513m63l0770J031L7445K7316
$$ plain form
15445 13056 40000 18726 14774 -47873 -46467 -25062 18347 37077 34949 16358 9290 61193
15433 61193 84478 72335 68336 77597 79673 55823 100410 78167 41496 57301 80220 9225
15421 9225 -61588 -45944 -8831 -19586 -1305 -22987 -59900 -73613 -55331 -53428 -9860 -7350
15409 -7350 -40090 -77051 -94198 -45229 -36090 -50775 -32891 -88313 -94194 -21428 -30281 -12016
15397 -12016 -64211 -88367 -63654 -48084 -64643 -28619 -24661 -47219 -78495 -165406 -150448 -128336
15385 -128336 -93378 -3561 -38881 -81743 -49831 -4970 51964 27605 35911 -45715 -59898 -53112
15373 -53112 -92989 -76974 -49611 -51691 2177 54836 1248 -59871 -99761 -133014 -78591 -61804
15361 -61804 -82413 -58640 5712 27293 85293 28550 4726 27362 5558 -8002 40919 20932
$$ packed form
15445A3056K6944k1274l952o2647J406K1405M3409J8730k128j8591p068N1903
15433F1193K3285j2143l999R261K076k3850M4587k2243l6671J5805K2919p0995
15421I225p0813J5644L7113j0755J8281k1682l6913j3713J8282J903M3568K510
15409g350l2740l6961j7147M8969R139j4685J7884n5422n881P2766q853J8265
15397a2016n2195k4156K4713J5570j6559L6024L958k2558l1276q6911J4958K2112
15385a28336L4958Q9817l5320m2862L1912M4861N6934k4359Q306q1626j4183O786
15373e3112l9877J6015K7363k080N3868N2659n3588o1119l9890l3253N4423J6787
15361f1804k0609K3773O4352K1581N8000n6743k3824K2636k1804j3560M8921j9987
$$ plain form
15349 20932 74608 67964 26837 661 -31910 -29903 7848 47653 -27666 -46781 11515 53461
15337 53461 86985 83905 76017 63844 6405 -51298 -71843 -32416 -22640 -10993 -1798 3554 -11606
15324 -11606 -22773 -61455 -40961 -3253 -76155 -41891 -34351 -27860 11978 13275 -19556 -57309
15312 -57309 -35175 -6949 41165 63532 10043 8108 49421 45803 32201 14266 -25394 -78462
15300 -78462 -125148 -92832 -95497 -40762 -4385 -4078 10181 34469 21635 28254 47618 2815
15288 2815 -19983 -6017 17743 -13135 -80291 -45235 -47069 -76228 -102214 -90647 -102975 -70454
15276 -70454 -30721 -58161 -28792 -31528 -73995 -16114 59163 72491 38017 -25241 633 58063
15264 58063 49613 -30477 -60073 -18028 23121 36010 36332 34300 24205 44037 45389 18217 3211
$$ packed form
15349B0932N3676o644m1127k6176l2571K007L7751L9805p5319j9115N8296M1946
15337E3461L3524l080p888j2173n7439n7703k0545L9427R776J1647R195N352j5160
15324a1606j1167l8682K0494L7708p2902L4264P540O491L9838J297l2831l7753
15312e7309K2134K8226M8114K2367n3489j935M1313l618j3602j7935l9660n3068
15300g8462m6686L2316k665N4735L6377L07J4259K4288j2834O619J9364m4803
15288B815k2798J3966K3760l0878o7156L5056j834k9159k5986J1567j2328L2521
15276g0454L9733k7440K9369k736m2467N7881P5277J3328l4474o3258K5874N7430
15264E8063q450q0090k9596M2045M1149J2889L22k032j0095J9832J352k7172j5006
$$ plain form
15251 3211 -5742 -22817 -79928 -75510 -97873 -91939 -68517 -58864 4185 51535 8396 10162 -24846
15238 -24846 -58612 -102720 -129214 -55256 24681 100192 74531 9172 61586 89033 90256 70272
15226 70272 15004 1206 37576 123963 128792 112992 87235 60879 59783 82562 -19486 -116595
15214 -116595 -55909 -34852 -65411 -40340 11807 52683 58129 38565 -1965 -47295 -70029 23370
15202 23370 14831 28110 65336 45627 8547 5944 -12993 -6930 12906 -26603 -20844 29277
15190 29277 2767 -38329 -43251 -14928 -25329 -83604 -86746 -48149 -58084 -78895 -104851 -140961
15178 -140961 -127580 -96107 -92368 -100423 -62133 -35399 -34183 -2806 -4730 -25800 -45215 -35367
15166 -35367 5628 -15350 7632 1637 -15913 -15432 69100 23001 -27217 -34991 -38584 -28854 1541
$$ packed form
15251C211q953j7075n7111M418k2363N934K3422R653O3049M7350m3139J766l5008
15238b4846l3766m4108k6494P3958P9937P5511k5661o5359N2414K7447J223j9984
15226G0272n5268j3798L6370Q6387M829j5800k5757k6356j096K2779j02048r7109
15214a16595O0686K1057l0559K5071N2147M0876N446j9564m0530m5330k2734R3399
15202B3370q539J3279L7226j9709l7080k603j8937O063J9836l9509N759N0121
15190B9277k6510m1096m922K8323j0401n8275l142L8597r935k0811k5956l6110
15178a40961J3381L1473L739q055L8290K6734J216L1377j924k1070j9415R848
15166c5367M0995k0978K2982n995j7550M81Q4532m6099n0218p774l593R730L0395
$$ plain form
15153 1541 -77256 -106615 -19350 -2612 20914 7416 31810 68663 24368 -43676 -38154 -20602
15141 -20602 -30920 -75950 -24335 9180 680 35391 43423 55896 41578 45676 101930 98595
15129 98595 34470 -9365 -45476 -44805 1406 -9678 -18489 -27265 -17238 -36527 -48217 -43022 -8889
15116 -8889 40808 -1080 -44472 -51955 -30618 36524 69454 50299 21964 14016 -5489 -26389
15104 -26389 -30015 -26604 -14018 12333 -22722 -33355 -78198 -124444 -77745 -29121 -1238 71198
15092 71198 19134 -61358 -125087 -124758 -121865 -91169 -44305 -72734 -64673 -3869 10283 29729
15080 29729 12744 -27456 1457 49824 75518 104206 117921 54079 -36821 -58390 -45083 -115666
15068 -115666 -104951 -28056 49988 45380 4772 -3664 -43258 -18891 -14471 -2213 -37040 -38495
$$ packed form
15153A541p8797k9359Q7265J6738K3526j3498K4394L6853m4295o8044N522J7552
15141b0602j0318m5030N1615L3515q500L4711Q032J2473j4318M098N6254l335
15129I8595o4125m3835l6111O71M6211j1084q811q776J0027j9289j1690N195L4133
15116h889M9697m1888m3392p483K1337O7142L2930j9155k8335p948j9505k0900
15104b6389l626L411J2586K6351l5055j0633m4843m6246M6699M8624K7883P2436
15092G1198n2064q0492o3729L29K893L0696M6864k8429Q061O0804J4152J9446
15080B9729j6985m0200K8913M8367K5694K8688J3715o3842r0900k1569J3307p0583
15068a15666J0715P6895P8044m608m0608q436l9594K4367M420J2258l4827j455
$$ plain form
15056 -38495 8900 947 -41536 -54003 -44818 -34472 -27831 -40174 -12062 29381 28587 28603 26496
15043 26496 -7944 -35311 -71000 -82092 -17286 15873 -37145 -71725 -62394 -26493 -1779 9260
15031 9260 31271 55153 82316 89793 14751 -16198 -15264 -94678 -125990 -94706 -25114 -37772
15019 -37772 102 41918 40080 1176 -38366 -46281 -58663 -26934 52991 31280 -2667 1494
15007 1494 -44742 -92226 -88817 -15898 20070 126521 87270 13463 -318 139493 136394 143682
14995 143682 110253 34988 19467 32496 36136 19752 28712 -465 45542 -1090 -103297 -114148
14983 -114148 -14582 54823 106062 71326 -11539 -9923 -4917 17303 60137 5569 -74851 -86354
14971 -86354 -17817 6070 -42850 -70270 -155559 -172817 -142475 -84731 -48414 -68158 -84354 -13917
$$ packed form
15056c8495M7395p953m2483j2467R185J0346O641j2343K8112M1443p94J6k107
15043B6496l4440k7367l5689j1092O4806L3159n3018l4580R331L5901K4714J1039
15031I260K2011K3882K7163P477p5042l0949R34p9414l1312L1284O9592j2658
15019c7772L7874M1816j838l8904l9542p915j2382L1729P9925k1711l3947M161
15007A494m6236m7484L409P2919L5968J06451l9251p3807j3781J39811l099P288
14995A43682l3429p5265j5521J3029L640j6384Q960k9177M6007m6632j02207j0851
14983a14148R9566O9405N1239l4736q2865J616N006K2220M2834n4568q0420j1503
14971h6354O8537K3887m8920k7420q5289j7258L0342N7744L6317j9744j6196P0437
$$ plain form
14959 -13917 -2048 -11030 -51333 -27939 -3574 -20784 -35289 -84199 -104495 -44246 -20501 -8177
14947 -8177 -10159 -11255 31067 -16054 -5001 29921 2157 -87389 -60516 -72449 -55628 -50166
14935 -50166 -19634 83676 111344 89111 2925 -30962 -82242 -90758 -99655 -106837 -124282 -98906
14923 -98906 -55757 -12198 22181 33289 -22997 -51042 -19317 -30715 -41316 2108 -9254 -59881
14911 -59881 -35985 16385 73519 103090 65653 26768 58703 87886 54594 12108 11247 57129
14899 57129 80110 86355 85548 24757 -8552 58308 137733 83029 28950 -14110 -23123 -16488 -47553
14886 -47553 -45574 -56391 -74746 -47584 -80544 -78003 -3594 19006 -14443 -3678 72794 64244
14874 64244 28190 -47768 -49312 2516 114870 117072 63388 53353 77065 80049 52666 12077
$$ packed form
14959a3917J1869q982m0303K3394K4365j7210j4505m8910k0296O0249K3745J2324
14947h177j982j096M2322m7121J1053L4922k7764q9546K6873j1933J6821N462
14935e0166L0532J03310K7668k2233q6186l3887n1280q516q897p182j7445K5376
14923i8906M3149M3559L4379J1108n6286k8045L1725j1398j0601M3424j1362n0627
14911e9881K3896N2370N7134K9571l7437l8885L1935K9183l3292m2486q61M5882
14899E7129K2981O245q07o0791l3309O6860P9425n4704n4079m3060r013O635l1065
14886d7553J979j0817j8355K7162l2960K541P4409K2600l3449J0765P6472q550
14874F4244l6054p5958j544N1828J12354K202n3684j0035K3712K984k7383m0589
$$ plain form
14862 12077 58191 104065 106445 65059 -51178 -80322 -31191 9147 43503 68304 58639 20295
14850 20295 29447 41810 24099 38898 131380 136030 87907 86644 93559 88859 59516 141262 54598
14837 54598 -59701 -75008 -90764 -85190 -57306 -29028 -28019 -4008 -72903 -104890 -120707 -101764
14825 -101764 -88489 -83032 -74449 -55785 -71036 -14587 18445 26745 81856 40491 25742 18004
14813 18004 11131 4992 -19768 1663 -13855 6107 -8299 -2031 13326 -31850 29336 78331
14801 78331 96386 70171 28299 26216 72265 68014 21428 55801 68684 -1536 -33693 -8661
14789 -8661 53722 69592 41637 -5177 -17713 4917 4789 24746 59466 82268 88455 57465
14777 57465 58214 12136 17281 49137 64395 40082 66977 36896 17027 64212 83957 64772
$$ packed form
14862A2077M6114M5874K380m1386j16237k9144M9131M0338L4356K4801r665l8344
14850B0295R152J2363j7711J4799R2482M650m8123j263O915m700k9343Q1746q6664
14837E4598j14299j5307j5756N574K7884K8278J009K4011o8895l1987j5817J8943
14825a01764J3275N457Q583J8664j5251N6449L3032Q300N5111m1365j4749p738
14813A8004o873o139k4760K1431j5518J9962j4406O268J5357m5176O1186M8995
14801G8331J8055k6215m1872k083M6049m251m6586L4373J2883p0220l2157K5032
14789h661O2383J5870k7955m6814j2536K2630j28J9957L4720K2802O187l0990
14777E7465P49m6078N145L1856J5258k4313K6895l0081j9869M7185J9745j9185
$$ plain form
14765 64772 70095 81566 19788 -17808 -11273 56779 103958 80798 47261 22166 -31643 -35980
14753 -35980 -60278 -107140 -177300 -135638 -90686 -74809 -42860 -25599 10288 32474 58488 1123
14741 1123 -1396 -5174 -44911 -4670 8375 37074 27294 -29581 -83806 -36087 21244 -19788
14729 -19788 -41235 -51651 -63517 -64337 -63428 -43378 -5554 -95110 -160891 -84222 -34615 10588
14717 10588 4716 8329 23847 40485 115200 134964 80692 11464 8554 -10113 -31346 -59168
14705 -59168 -92774 -87391 -73190 -41895 48100 76386 12068 18971 -5683 -63693 -52534 -45385
14693 -45385 11041 27599 8602 -11118 -37572 -41941 -60532 -102947 -129668 -65979 14798 22895
14681 22895 -10852 -31261 -38878 -47642 -31919 -73794 -73793 -33567 -19591 -19801 -30246 -37473 -37875 -33355
$$ packed form
14765F4772N323J1471o1778l7596O535O8052M7179k3160l3537k5095n3809m337
14753c5980k4298m6862p0160M1662M4952J5877L1949J7261L5887K2186K6014n7365
14741A123k519l778l9737M0241J3045K8699r780n6875n4225M7719N7331m1032
14729a9788k1447j0416j1866q20R09K0050L7824q9556o5781P6669M9607M5203
14717A0588n872L613J5518J6638P4715J9764n4272o9228k910j8667k1233k7822
14705e9168l3606N383J4201L1295Q9995K8286o4318O903k4654n8010J1159P149
14693d5385N6426J6558j8997j9720k6454m369j8591m2415k6721O3689Q0777Q097
14681B2895l3747k0409p617q764J5723m1875JM0226J3976k10j0445p227m02M520
$$ plain form
14667 -33355 -22996 11370 41128 80396 51820 37304 -20292 -78630 -12422 -19238 -66478 -10596
14655 -10596 6442 -20530 107814 146710 88715 -14057 -56133 3387 22487 -8875 -29857
14644 -29857 5232 44923 42411 37714 1037 -22047 -22493 -39118 -41429 -47845 -57879 -34615 -33887
14631 -33887 -85884 -76787 -37443 -3307 20820 -17772 -6546 -6179 -62709 -61521 -11284 28692
14619 28692 -35277 -548 35081 69166 75055 14561 -27234 -14682 -19267 -25393 -3545 61824
14607 61824 92217 13973 -1966 10638 -23823 25653 14989 1493 51219 56772 35675 -56773
14595 -56773 -112252 -88234 -62935 -8389 -9312 -76305 -113704 -83065 -65268 39857 64751 -45549
14583 -45549 -72230 -20128 -52179 -54197 11455 75202 156393 113865 53745 40150 82042 29989
$$ packed form
14667c3355J0359L4366K9758L9268k8576j4516n7596n8338O6208o816m7240N5882
14655a0596J7038k6972J28344L8896n7995j02772m2076N9520J9100l1362k0982
14644b9857L5089L9691k512m697l6677k3084m46j6625k311o416j0034K3264P28
14631c3887n1997R097L9344L4136K4127l8592J1226L67n6530J188N0237L9976
14619B8692o3969L4729L5629L4085N889o0494m1795J2552m585o126K1848O5369
14607F1824L0393p8244j5939J2604l4461M9476j0664j3496M9726N553k1097r2448
14595e6773n5479K4018K5299N4546r23o6993l7399L0639J7797J05125K4894j10300
14583d5549k6681N2102l2051k018O5652O3747Q1191m2528o0120j3595M1892n2053
$$ plain form
14571 29989 21158 28381 49733 10716 -11768 59552 75542 85002 37822 4383 6802 -15836
14559 -15836 -52210 -60168 -70780 -62354 -57799 -84558 -76762 -39881 -26550 24677 48719 34890
14547 34890 42194 9562 -40743 -42064 -24973 -7496 48105 68952 8637 -33155 -146493 -132584
14535 -132584 -72257 -10245 7873 -62230 -81716 -45786 -53651 4520 -21572 -41528 -47569 -50840
14523 -50840 -100188 -92241 -38647 5967 32150 56044 66043 42240 -8428 -6658 -33821 -11960
14511 -11960 34016 72497 45731 86716 96752 56916 5363 23181 49592 28193 11658 -2997
14499 -2997 -27503 -49233 -5383 15820 54903 44517 58593 22127 -39906 -26712 19655 23966
14487 23966 20351 -42927 -41829 -9237 10614 24224 19464 -10257 -79616 -95397 -52793 -64236
$$ packed form
14571B9989q831P223K1352l9017k2484P1320J5990R460m7180l3439K419k2638
14559a5836l6374p958j0612Q426M555k6759P796L6881J3331N1227K4042j3829
14547C4890P304l2632n0305j321J7091J7477N5601K0847o0315m1792j13338J3909
14535a32584O0327O2012J8118p0103j9486L5930p865N8171k6092j9956o041l271
14523e0840m9348P947N3594M4614K6183K3894R999k3803n0668J770k7163K1861
14511a1960M5976L8481k6766M0985J0036l9836n1553J7818K6411k1399j6535j4655
14499b997k4506k1730M3850K1203L9083j0386J4076l6466o2033J3194M6367M311
14487B3966l615o3278J098L2592J9851J3610m760k9721o9359j5781M2604j1443
$$ plain form
14475 -64236 -21425 11352 54711 36590 38402 11656 1788 30556 88798 51581 27563 51845
14463 51845 15754 -17002 -40440 -53371 -69945 -117437 -180635 -169676 -47501 36679 17089
14452 17089 6250 43654 42394 19163 7704 -58956 -91537 -67913 -25772 -38778 -56465 -56681
14440 -56681 -39849 -23293 -30965 21224 -5757 33539 53911 32089 36120 67771 49608 -14670
14428 -14670 48490 18687 -37098 -9265 49919 45920 34066 5668 -12306 -52913 -24453 -4187
14416 -4187 -26352 -36124 3904 16058 22733 -50603 -43269 -28147 -48308 -68404 -91859 -78675
14404 -78675 -51506 -82012 -80736 -21048 75827 84144 48619 -5160 -28606 -63914 -39799 -34371
14392 -34371 12739 84529 85089 37071 -38549 -19241 -6370 31887 39829 22653 12311 -6786
$$ packed form
14475f4236M2811L2777M3359j8121J812k6746r868K8768N8242l7217k4018K4282
14463E1845l6091l2756k3438j2931j6574m7492o3198J0959J22175Q4180j9590
14452A7089j0839L7404j260k3231j1459o6660l2581K3624M2141j3006j7687k16
14440e6681J6832J6556p672N2189k6981L9296K0372k1822M031L1651j8163o4278
14428a4670O3160k9803n5785K7833N9184l999j1854k8398j7974m0607K8460K0266
14416d187k2165r772M0028J2154O675p3336P334J5122k0161k0096k3455J3184
14404g8675K7169l0506J276N9688R6875Q317l5525n3779k3446l5308K4115N428
14392c4371M7110P1790N60m8018p5620J9308J2871L8257P942j7176j0342j9097
$$ plain form
14380 -6786 -51454 -62127 -28182 -10155 -11578 16468 57312 78376 103405 79236 95569 90253
14368 90253 54547 21193 -52239 -49600 -62293 -35000 -27052 -34547 7755 3670 15901 -3491
14356 -3491 -4391 -19646 -55856 -95283 -151815 -125641 -17332 39739 105169 80112 23153 23686
14344 23686 35460 -2179 -5019 -16285 -18905 -30355 35663 28099 -7191 -68624 -90488 -62258
14332 -62258 -56270 -26895 2400 -2114 -47864 -61257 -22424 13122 -5309 26081 1719 -9766
14320 -9766 -32942 -58295 -38422 22891 76653 102477 75667 58045 50455 9146 -69552 -43661
14308 -43661 -13386 -58003 -138741 -109258 -74263 -29715 -38917 11144 86384 70045 -58683 -84965
14296 -84965 -26418 -26577 -31871 -8439 -13996 -19622 44744 76508 19922 -41590 -42571 -32709 2489
$$ packed form
14380f786m4668j0673L3945J8027j423K8046M0844K1064K5029k4169J6333n316
14368I0253l5706l3354p3432K639j2693K7293P948p495M2302m085J2231j9392
14356c491r00j5255l6210l9427n6532K6174J08309N7071O5430k5057n6959N33
14344B3686J1774l7639k840j1266k620j1450O6018p564l5290o1433k1864K8230
14332f2258N988K9375K9295m514m5750j3393L8833L5546j8431L1390k4362j1485
14320i766k3176k5353J9873O1313N3762K5824k6810j7622p590m1309p8698K5891
14308d3661L0275m4617q0738K9483L4995M4548r202N0061P5240j6339j28728k6282
14296h4965N8547j59n294K3432n557n626O4366L1764n6586o1512r81R862L5198
$$ plain form
14283 2489 17502 -3035 14358 -15951 -94175 -124927 -98358 -40717 -33257 -62955 -79949 -74983
14271 -74983 -2616 -8306 -976 48695 51838 53570 44448 2581 14295 23189 10603 13320 32189
14258 32189 70355 62738 68257 49749 28341 73095 67924 24615 51972 54131 11745 8761 15129
14245 15129 6191 -34805 -109482 -89050 -12554 -38962 -62667 -23878 -29380 -88168 -100966 -66266
14233 -66266 -31809 -25692 -16906 -14530 -34963 -47942 -64781 -28758 -59299 -65679 23346 56478
14221 56478 -4431 -30372 42745 20078 10991 6163 9523 -13319 -1503 -8104 -37156 -42149 -11171
14208 -11171 -18475 -64281 -2078 -15544 -31076 -36649 -41361 -312 50305 129928 97553 81549
14196 81549 99119 123113 96642 76456 34863 27483 78544 40553 -12911 -49652 -55673 -122729
$$ packed form
14283B489J5013k0537J7393l0309p8224l0752K6569N7641P460k9698j6994M966
14271g4983P2367n690P330M9671L143J732r122m1867J1714Q894j2586K717J8869
14258C2189L8166p617N519j8508k1408M4754n171m3309K7357K159m2386k984O368
14245A5129q938m0996p4677K0432P6496k6408k3705L8789n502n8788j2798L4700
14233f6266L4457O117Q786K376k0433j2979j6839L6023l0541o380Q9025L3132
14221E6478o0909k5941P3117k2667r087m828L360k2842J1816o601k9052m993L0978
14208a1171p304m5806O2203j3466j5532n573m712M1049N0617P9623l2375j6004
14196H1549J7570K3994k6471k0186m1593p380N1061l7991n3464l6741o021o7056
$$ plain form
14184 -122729 -120877 -99824 -93288 -96558 -59918 -32288 -36650 -44904 -3268 52768 75900 65940 94354
14171 94354 51694 -18985 -25587 -33166 -53993 -57802 -107728 -131987 -132696 -44634 -7524 4402 -26764
14158 -26764 -66705 -36211 7998 19684 20081 -3797 -27515 -31554 -6539 -25675 -84722 -86816
14146 -86816 -31766 5112 24855 34611 41253 30913 -12956 2083 65314 6474 -94453 -83277
14134 -83277 -72832 -109069 -90199 -84278 -70415 -55724 -65739 -108583 -78887 -55799 -84519 -56500
14122 -56500 -36339 7252 23113 41116 81246 65507 -28448 -76363 -75585 -106882 -49781 -96623
14110 -96623 -108567 -125648 -93519 2110 -21904 -51652 -56825 -26444 9625 46686 69014 -38713
14098 -38713 -56400 -27723 -17530 -131770 -138877 -134874 -126784 -55971 -2514 39833 45508 74277
$$ packed form
14184a22729J852K1053O536l270L6640K7630m362q254M1636N6036K3132r960K8414
14171I4354m2660p0679o602p579k0827l809m9926k4259p09Q8062L7110J1926l1166
14158b6764l9941L0494M4209J1686L97k3878k3718m039K5015j9136n9047k094
14146h6816N5050L6878J9743R756O642j0340m3869J5039O3231n8840j00927J1176
14134h3277J0445l6237J8870N921J3863J4691j0015m2844K9696K3088k8720K8019
14122e6500K0161M3591J5861J8003M0130j5739r3955m7915P78l1297N7101m6842
14110i6623j1944j7081L2129R5629k4014k9748n173L0381L6069L7061K2328j07727
14098c8713j7687K8677J0193j14240p107M003Q090P0813N3457M2347N675K8769
$$ plain form
14086 74277 40773 -44871 -75441 -46573 -35591 -47856 15473 45489 58129 52650 21714 -35901
14074 -35901 -60441 -331 49581 53059 81920 114807 136245 181082 162340 185883 183983 204306
14062 204306 336888 423052 472560 449710 452778 473575 446213 387118 326697 297657 185287
14051 185287 121029 114610 83716 90582 93362 75430 56521 70817 81109 22189 44980 87831
14039 87831 57238 12875 29065 -25345 -291 11902 58976 95750 62556 60487 8091 -22907
14027 -22907 -21026 -8288 30435 43473 45419 36382 20381 13850 39691 73369 95126 106220
14015 106220 52214 -9841 -62242 -16178 14998 -5607 23052 9275 -16848 29198 32314 27730
14003 27730 -17071 -17539 -29282 -36688 -31319 -50722 -31699 -89232 -57894 -41560 -13944 -900
$$ packed form
14086G4277l3504q5644l0570K8868J0982j2265O3329L0016J2640n479l0936n7615
14074c5901k4540O0110M9912L478K8861L2887K1438M4837j8742K3543j900K0323
14062B04306J32582Q6164M9508k2850L068K0797k7362n9095o0421k9040j12370
14051A85287o4258o419l0894O866K780j7932j8909J4296J0292n8920K2791M2851
14039H7831l0593m4363J6190n4410K5054J2193M7074L6774l3194k069n2396l0998
14027b2907J881J2738L8723J3038J946r037j6001o531K5841L3678K1757J1094
14015A06220n4006o2055n2401M6064L1176k0605K8659j3777k6123M6046L116m584
14003B7730m4801m68j1743p406N369j9403J9023n7533L1338J6334K7616J3044
$$ plain form
13991 -900 -4059 -17838 -80325 -121567 -77127 -65887 -40020 -49351 -35569 -1072 37769 2988
13979 2988 -12451 3715 42128 41622 23779 46684 100592 84639 59777 30554 -12862 -32106
13967 -32106 -29020 11634 -19884 -45148 -33404 -15705 -49173 -36904 -9877 54620 75754 3295
13955 3295 -27439 -93811 -64595 7992 31890 75611 99351 74294 28359 38920 68074 92990
13943 92990 93757 47477 84206 122510 88551 60476 77849 71219 69013 30979 53258 -13873
13931 -13873 -62259 -13809 7845 -17910 -26642 -47837 -61419 -118833 -113483 -58593 -38527 -43075
13919 -43075 -26474 -7347 -46063 -25794 -36311 -119703 -109389 -77980 -17776 59442 25623 16761
13907 16761 -32112 15054 71447 143197 136636 172580 182727 187783 192798 152963 50218 -987
$$ packed form
13991i00l159j3779o2487m1242M4440J1240K5867r331J3782L4497L8841l4781
13979B988j5439J6166L8413n06j7843K2905N3908j5953k4862k9223m3416j9244
13967c2106L086M0654l1518k5264J1744J7699l3468J2269K7027O4497K1134p2459
13955C295l0734o6372K9216P2587K3898M3721K3740k5057m5935J0561K9154K4916
13943I2990P67m6280L6729L8304l3959k8075J7373o630k206l8034K2279o7131
13931a3873m8386M8450K1654k5755q732k1195j3582n7414N350N4890K0066m548
13919d3075J6601J9127l8716K0269j0517q3392J0314L1409O0204P7218l3819q862
13907A6761m8873M7166N6393P1750o561L5944J0147N056N015l9835j02745n1205
$$ plain form
13895 -987 -48053 -67444 14198 66677 51223 60713 44661 26507 49478 85280 85389 97846 53836
13882 53836 28525 62054 56158 24608 -32310 -60141 -40427 6919 27450 -49402 -100099 -78031
13870 -78031 -2914 13549 92565 161443 147271 109433 120265 132512 86261 57572 79898 97628
13858 97628 -20154 -33829 3142 9024 -6944 -31918 -42121 -76305 -59093 -84050 -127209 -176613
13846 -176613 -147550 -118714 -132344 -104000 -58222 -25205 6122 32346 33803 44699 12003 -43098
13834 -43098 -95408 -88310 -75272 -41799 -19139 -13254 6905 20737 29467 60782 48309 61225
13822 61225 82148 127247 89115 49202 97951 91021 21917 -4170 29166 76021 118758 125996
13810 125996 109700 111114 63412 -16815 -9062 81164 71491 67730 10903 19388 50854 -9552
$$ packed form
13895i87m7066j9391Q1642N2479j5454R490j6052j8154K2971L5802J09J2457m4010
13882E3836k5311L3529n896l1550n6918k7831J9714M7346K0531p6852n0697K2068
13870g8031P5117J6463P9016O8878j4172l7838J0832J2247m6251k8689K2326J7730
13858I7628j17782j3675L6971N882j5968k4974j0203l4184J7212k4957m3159m9404
13846a76613K9063K8836j3630K8344M5778L3017L1327K6224J457J0896l2696n5101
13834d3098n2310P098J3038L3473K2660N885K0159J3832Q730L1315j2473J2916
13822F1225K0923M5099l8132l9913M8749o930o9104k6087L3336M6855M2737P238
13810A25996j6296J414m7702q0227P753R0226r673l761n6827Q485L1466o0406
$$ plain form
13798 -9552 -14014 35666 99481 91414 71312 8862 27103 50694 69416 33927 -12540 -10049
13786 -10049 -3313 32307 60757 108229 52487 28443 -3919 54571 48817 22905 28998 37090
13774 37090 48866 85632 96794 65876 76928 157276 198637 243078 348262 436638 455629
13763 455629 527168 529961 540370 604048 595563 533643 507278 426138 363157 245525 127061
13752 127061 103449 60095 30218 61253 107503 73126 79967 87430 73304 128291 163510 158717
13740 158717 216117 320705 368438 304308 259614 317212 286225 240311 288501 309279 328050
13729 328050 335707 358095 374176 429802 502389 581594 665777 623148 547959 479153 421338 317186
13717 317186 330021 282871 215684 132077 47755 20383 12791 42834 80386 29509 -54676 -7709
$$ packed form
13798i552m462M9680O3815q067k0102o2450J8241K3591J8722l5489m6467K491
13786a0049O736L5620K8450M7472n5742k4044l2362N8490n754k5912O093Q092
13774C7090J1776L6766J1162l0918J1052Q0348M1361M4441J05184Q8376J8991
13763D55629P1539K793J0409O3678q485o1920k6365q1140o2981j17632j18464
13752A27061k3612m3354k9877L1035M6250l4377O841P463j4126N4987L5219m793
13740A58717N7400J04588M7733o4130m4694N7598l0987m5914M8190K0778J8771
13729C28050P657K2388J6081N5626P2587P9205Q4183m2629p5189o8806n7815j04152
13717C17186J2835m7150o7187q3607q4322k7372p592L0043L7552n0877q4185M6967
$$ plain form
13705 -7709 51693 46007 -15102 -8833 -6322 14196 -12526 -5195 -29581 -85310 -70443 -69742 -101299
13692 -101299 -85319 -83789 -53373 -36457 -33039 -31914 -67423 -29029 -16763 27810 60906 6008
13680 6008 -48589 -68416 -53839 -3840 65110 34490 61446 87510 87430 77013 78548 84510 29649
13667 29649 51401 61682 39859 198 -6678 -10286 -69053 -53632 -80757 -60458 17357 49099
13655 49099 57185 83805 88134 77828 42378 -4370 -5845 7844 28987 42073 36455 6111
13643 6111 -6771 33714 67844 112859 112949 63816 37703 8436 30825 77620 93429 66111
13631 66111 5374 -28980 8542 25389 -17650 -16398 -68991 -62586 -61459 -87755 -34722 -30186
13619 -30186 -23738 -19891 -12724 2243 29451 57693 72269 62105 67376 77800 141460 181050
$$ packed form
13705g709N9402n686o1109O269K511K0518k6722P331k4386n5729J4867P01l1557
13692a01299J5980J530L0416J6916L418J125l5509L8394J2266M4573L3096n4898
13680F008n4597j9827J4577M9999O8950l0620K6956K6064q0j0417J535N962n4861
13667B9649K1752J0281k1823l9661o876l608n8767J5421k7125K0299P7815L1742
13655D9099Q086K6620M329j0306l5450m6748j475J3689K1143J3086n618l0344
13643F111j2882M0485L4130M5015R0m9133k6113k9267K2389M6795J5809k7318
13631F6111o0737l4354L7522J6847m3039J252n2593O405J127k6296N3033M536
13619c0186O448L847P167J4967K7208K8242J4576j0164N271J0424O3660L9590
$$ plain form
13607 181050 141265 55815 9481 -21943 27701 30419 -10971 -42808 -23782 -36682 -16247 15692
13595 15692 5508 -16539 -30659 -106180 -117422 -132056 -65167 -15301 7506 1336 -13208 -8032
13583 -8032 37823 48809 36085 -6254 17235 79578 141202 197130 243647 263191 266147 222389
13571 222389 247445 233080 221545 147841 89354 45816 -3611 24802 7055 -7560 -66324
13560 -66324 -49770 -31127 -15811 -40398 -98451 -93661 -41862 -7129 13893 80425 82343 68825
13548 68825 81108 54264 -1266 -29133 -10100 -6979 -4668 11236 -36185 -39868 -90594 -64741
13536 -64741 -50214 -35950 -25575 37176 6721 -22378 -14477 -35035 -68574 -79093 -68210 -27601
13524 -27601 -1079 26463 33209 61772 42764 618 -22903 -14294 -42154 -81352 -95590 -56103
$$ packed form
13607A81050l9785q5450m6334l1424M9644K718m1390l1837J9026j2900K0435L1939
13595A5692j0184k2047j4120p5521j1242j4634O6889M9866K2807o170j4544N176
13583h032M5855J0986j2724m2339K3489O2343O1624N5928M6517J9544K956m3758
13571B22389K5056j4365j1535p3704n8487m3538m9427K8413j7747j4615n8764
13560f6324J6554J8643J5316k4587n8053M790N1799L4733K1022O6532J918j3518
13548F8825J2283k6844n5530k7867J9033L121K311J5904m7421l683n0726K5853
13536f4741J4527J4264J0375O2751l0455k9099P901k0558l3539j0519J0883M0609
13524b7601K6522K7542O746K8563j9008m2146k3521Q609k7860l9198j4238L9487
$$ plain form
13512 -56103 -16278 46548 -8050 -32612 -13578 -11546 -8835 -44232 -70321 -85178 -37962 30819
13500 30819 5373 4424 -11711 -25788 -21256 2373 -15160 8920 -12295 -10150 -4296 -20319 -61570
13487 -61570 -51933 -75204 -100370 -73735 -139812 -149033 -87560 -36969 63500 115382 50693 6179
13475 6179 8843 -21889 -28545 -2185 -15129 -6829 -37691 -55459 -27595 5087 -445 -12394 18180
13462 18180 103140 104762 31725 -1869 -2108 22740 74835 49203 44757 -12248 -100590 -88291
13450 -88291 -9870 15248 -23769 -27289 -34380 -32629 -47262 -36246 -31190 -48482 -78924 -49272
13438 -49272 -15879 13652 39801 52598 48486 21663 24026 -7197 -17375 -13750 59153 36154
13426 36154 -42749 16219 56514 63006 68585 105872 100826 45228 -51693 -50071 -37387 -88935
$$ packed form
13512e6103L9825O2826n4598k4562J9034K032K711l5397k6089j4857M7216O8781
13500C0819k5446r49j6135j4077M532K3629j7533K4080k1215K145N854j6023m1251
13487f1570R637k3271k5166K6635o6077r221O1473N0591J00469N1882o4689m4514
13475F179K664l0732o656K6360j2944Q300l0862j7768K7864L2682n532j1949L0574
13462A8180Q4960J622p3037l3594k39K4848N2095k5632m446n7005q8342J2299
13450h8291P8421K5118l9017l520p091J751j4633J1016N056j7292l0442K9652
13438d9272L3393K9531K6149J2797m112k6823K363l1223j0178L625P2903k2999
13426C6154p8903N8968M0295O492N579L7287n046n5598r6921J622J2684n1548
$$ plain form
13414 -88935 -51236 -37751 42188 43781 25231 58276 72775 38485 9859 -9354 -7821 -7715
13402 -7715 11459 -1751 -29483 -36894 -18028 -15687 -56356 -40862 -7376 -64876 -11077 6318
13390 6318 17633 8718 15520 27251 -13647 -82337 -69733 -74634 -82448 -59616 -16376 -12229 -35058
13377 -35058 -13513 22101 62582 67342 23452 20560 56233 78284 52489 55238 67500 11532
13365 11532 -12122 24302 29315 32117 29927 38679 5974 15797 84708 72127 38432 425 -58788
13352 -58788 -52291 -10189 -6055 -27506 214 -10556 -19278 9341 43882 32234 -4971 30949
13340 30949 63490 44109 -52331 -65881 -46561 -58461 -77044 -100053 -39186 6340 16234 2651
13328 2651 3636 -22143 1124 -28414 -75008 -51932 -60245 -72133 -84612 -87674 -114581 -46509 11399
$$ packed form
13414h8935L7699J3485P9939J593j8550L3045J4499l4290k8626j9213J533J06
13402g715J9174j3210k7732p411J8866K341m0669J5494L3486n7500N3799J7395
13390F318J1315q915O802J1731m0898o8690J2604m901p814K2832M3240M147k2829
13377c5058K1545L5614M0481M760m3890k892L5673K2051k5795K749J2262n5968
13365A1532k3654L6424N013K802k190Q752l2705R823O8911j2581l3695l8007n9213
13352e8788O497M2102M134k1451K7720j0770q722K8619L4541j1648l7205L5920
13340C0949L2541j9381r6440j3550J9320j1900j8583k3009O0867M5526R894j3583
13328B651R85k5779K3267k9538m6594K3076q313j1888j2479l062k6907O8072N7908
$$ plain form
13315 11399 17530 -49012 -157579 -105172 -62393 -69334 -38977 -8804 55066 79727 109759 118608
13303 118608 93615 5607 -8443 15321 13280 4798 -4982 50791 82402 113670 93497 38018
13291 38018 85755 109879 95157 119182 116938 125239 109750 69067 82265 78733 25041 18622
13279 18622 54785 109565 70721 -9267 1917 57443 107889 131428 113690 70517 84757 90025
13267 90025 66471 85428 87750 50767 -4369 -13672 65873 51888 57754 56089 68386 46446
13255 46446 62486 88782 -2993 -34900 -40628 41602 65769 59058 23628 -16893 -10440 -37063
13243 -37063 -54998 -24436 49549 13214 -15678 20860 -47768 -67326 -38695 3287 47485 12834
13231 12834 2985 5847 -4290 -6217 32702 59676 87453 59446 30272 25424 30249 60623 59262
$$ packed form
13315A1399O131o6542j08567N2407M2779o941L0357L0173O3870K4661L0032Q849
13303A18608k4993q8008j4050K3764k041q482r780N5773L1611L1268k0173n5479
13291C8018M7737K4124j4722K4025k244Q301j5489m0683J3198l532n3692o419
13279A8622L6163N4780l8844p9988J1184N5526N0446K3539j7738m3173J4240N268
13267I0025k3554J8957K322l6983n5136r303P9545j3985N866j665J2297k1940
13255D6446J6040K6296r1775l1907n728Q2230K4167o711l5430m0521O453k6623
13243c7063j7935L0562P3985l6335k8892L6538o8628j9558K8631M1982M4198l4651
13231A2834r849K862j0137j927L8919K6974K7777k8007k9174m848M825L0374j361
$$ plain form
13218 59262 50772 83847 160873 126760 92666 119932 143455 128327 156655 170053 145292 133386
13206 133386 167002 141418 136275 172783 164399 124863 168859 160853 118417 55936 17922 24801
13194 24801 28678 78373 69054 132062 138992 128356 139936 162190 84732 36617 -786 -54051
13182 -54051 -57364 -29626 -35299 -5464 70661 110721 42124 -4793 -17579 -24112 22858 15520
13170 15520 29599 21787 -1710 7509 -917 -43448 -63967 -84405 -86647 -73497 -12053 28033
13158 28033 40151 20588 18266 28914 -17616 2784 -6849 -26131 -56223 -82745 -52625 -34163
13146 -34163 31371 17669 14236 40208 60128 36254 37696 81157 96258 77731 70397 78346
13134 78346 17594 -2984 682 37329 55931 32438 -8916 -51000 -61639 -5688 55639 65791
$$ packed form
13218E9262q490L3075P7026l4113l4094K7266K3523j5128K8328J3398k4761j1906
13206A33386L3616k5584n143L6508q384l9536M3996q006m2436o2481l8014O879
13194B4801L877M9695r319O3008O930j0636J1580K2254p7458m8115l7403n3265
13182e4051l313K7738n673K9835P6125M0060o8597m6917j2786o533M6970p338
13170A5520J4079p812k3497R219q426m2531k0519k0438k242J3150O1444M0086
13158B8033J2118j9563k322J0648m6530K0400r633j9282l0092k6522L0120J8462
13146c4163O5534j3702l433K5972J9920k3874J442M3461J5101j8527p334P949
13134G8346o0752k0578L666L6647J8602k3493m1354m2084j0639N5951O1327J0152
$$ plain form
13122 65791 52538 35477 -28391 27418 46639 61562 51387 85516 60659 28721 -3895 -21039
13110 -21039 30424 -37186 -40524 -25341 43846 80730 95252 82137 20417 -19761 -12228 -57972
13098 -57972 -30415 -21146 -33258 -11083 32448 31978 84011 81842 28986 -8921 -17321 41858 96129
13085 96129 80751 52161 20178 43449 29082 -23085 -42363 -28051 -17357 -29316 1111 73604
13073 73604 73797 67344 31879 23201 -15316 -30770 -10564 -41875 -12666 55406 118697 128968
13061 128968 51246 42631 51679 -8302 -59296 -48104 3504 -27403 -75733 -66305 -73001 -87618
13049 -87618 -46076 -77285 -60375 -28094 75351 85643 48538 30217 -9968 -77550 -59185
13038 -59185 -32726 10326 62273 2181 -4284 9550 -302 -32332 -38676 -51057 -23873 -33869
$$ packed form
13122F5791j3253j7061o3868N5809J9221J4923j0175L4129k4857l1938l2616j7144
13110b1039N1463o7610l338J5183O9187L6884J4522j3115o1720m0178P533m5744
13098e7972K7557R269j2112K2175M3531m70N2033k169n2856l7907q400N9179N4271
13085I6129j5378k8590l1983K3271j4367n2167j9278J4312J0694j1959L0427P2493
13073G3604J93o453l5465q678l8517j5454K0206l1311K9209O8072O3291J0271
13061A28968p7722q615R048n9981n0994J1192N1608l0907m8330R428o696j4617
13049h7618M1542l1209J6910L2281J03445J0292l7105j8321m0185o7582J8365
13038e9185K6459M3052N1947o0092o465J3834r852l2030o344j2381K7184r996
$$ plain form
13026 -33869 5519 43122 105628 42991 14123 59811 79611 93944 62585 71546 71088 6322
13014 6322 42007 75262 19528 30321 54264 64410 32650 80572 118342 164558 139340 68091
13002 68091 56935 112361 106193 33043 40442 78669 99542 194104 190116 141404 116860 76403
12990 76403 105657 147963 126548 105605 109037 63948 33174 36719 9516 57260 97088 73432
12978 73432 42929 -20681 3558 36688 -9655 -46177 -46875 -7480 -8212 29613 56839 -13526
12966 -13526 -94097 -79701 -75003 -35792 14693 -8582 -45233 -39568 2589 49852 57720 38579
12954 38579 34277 27762 58885 133403 135742 103586 96339 15961 -2108 34188 51638 57031 10691
12941 10691 -25696 -39618 -7385 66046 134133 265332 265884 245320 195252 166440 171214 167179
$$ packed form
13026c3869L9388L7603O2506o2637k8868M5688J9800J4333l1359Q961m58o4766
13014F322L5685L3255n5734J0793K3943J0146l1760M7922L7770M6216k5218p1249
13002F8091j1156N5426o168p3150P399L8227K0873R4562l988m8712k4544m0457
12990G6403K9254M2306k1415k0943L432m5089l0774L545k7203M7744L9828k3656
12978G3432l0503o3610K4239L3130m6343l6522o98L9395p32L7825K7226p0365
12966a3526q0571J4396M698L9211N0485k3275l6651N665M2157M7263P868j9141
12954C8579m302o515L1123P4518K339l2156p247q0378j8069L6296J7450N393m6340
12941A0691l6387j3922L2233P3431O8087J31199N52k0564n0068k8812M774m035
$$ plain form
12929 167179 181307 145827 176026 227434 177825 153146 188851 214442 245904 307485 339888
12918 339888 351720 262363 166936 129893 125535 171962 165382 210923 260897 256714 172704 155612
12906 155612 101706 62455 49914 55864 104822 142538 167187 205102 169288 144559 155006 141444
12894 141444 62472 99982 166772 249654 248473 203304 161104 122520 118608 168486 237025 256256
12882 256256 230180 224115 257710 257393 242168 212010 199166 230524 196712 146618 134093 169747
12870 169747 197618 282405 363111 338125 314697 344736 372602 373172 440433 502600 550323 592208
12858 592208 635796 772098 839331 860960 919006 1000272 1138880 1356770 1597792 1950604
12848 1950604 2326511 2792507 3448028 4471542 5954895 8000415 10314995 12353852 13748624
$$ packed form
12929A67179J4128l5480L0199N1408m9609k4679L5705K5591L1462O1581L2403
12918C39888J1832q9357r5427l7043m358M6427o580M5541M9974m183q4010j7092
12906A55612n3906l9251j2541N950M8958L7716K4649L7915l5814k4729J0447j3562
12894A41444p8972L7510O6790Q2882j181m5169m2200l8584l912M9878O8539J9231
12882B56256k6076o065L3595l17j5225l0158j2844L1358l3812n0094j2525L5654
12870A69747K7871Q4787Q0706k4986k3428L0039K7866N70O7261O2167M7723M1885
12858E92208M3588J36302O7233K1629N8046Q1266J38608K17890K41022L52812
12848A950604L75907M65996O55521J023514J483353K045520K314580K038857J394772
$$ plain form
12839 13748624 14027370 13148048 11600220 9927868 8637643 7968988 8074266 9035336 10760528
12830 10760528 12877982 14954363 16363457 16539725 15457407 13672860 11953486 11165754
12822 11165754 11586774 13097309 15064550 16696865 17346168 16812559 15178192 12937640
12814 12937640 10757391 9251498 8709352 9011034 10051076 11760794 13673604 15103310
12806 15103310 15559748 14749121 12830080 10294518 7882740 6003368 4617427 3656736
12798 3656736 3073649 2650782 2305921 2100926 1894969 1800255 1746392 1703494 1615507 1541162
12788 1541162 1505193 1456992 1484434 1518686 1648771 1736883 1875495 2043155 2256274 2619321
12778 2619321 3112413 3743404 4533031 5521486 6879910 8864369 11602751 15023190 18344988
$$ packed form
12839A3748624K78746q79322j547828j672352j290225o68655J05278R61070J725192
12830A0760528K117454K076381J409094J76268j082318j784547j719374p87732
12822A1165754M21020J510535J967241J632315O49303n33609j634367k240552
12814A2937640k180249j505893n42146L01682J040042J709718J912810J429706
12806A5103310M56438q10627j919041k535562k411778j879372j385941r60691
12798C656736n83087m22867l44861k04995k05957r4714n3863m2898q7987p4345
12788A541162l5969m8201K7442L4252J30085Q8112J38612J67660K13119L63047
12778B619321M93092O30991P89627R88455J358424J984459K738382L420439L321798
$$ plain form
12769 18344988 20775238 21800696 21627544 20633048 19128064 17459379 16159336 15585268
12761 15585268 15817844 16913745 18985807 21752974 24508182 26062490 25751124 23841692
12753 23841692 21242122 19157605 18525698 19494088 21403357 23396605 24601018 24690659 23931818
12744 23931818 22612635 20732632 18717798 17070126 16021797 15756904 16564916 18299278
12736 18299278 20322690 21880060 21938901 20330759 17412731 13935386 10781730 8323528
12728 8323528 6520009 5218506 4300014 3654628 3152177 2662095 2351871 2122909 1911197
12719 1911197 1741536 1631511 1513424 1374361 1284874 1264330 1186928 1100404 1023533 962614
12709 962614 881398 833030 765576 694031 634243 591055 580363 591105 597389 635853 615639 601148
$$ packed form
12769A8344988K430250J025458j73152r94496j504984j668685j300043n74068
12761A5585268K32576J095901K072062K767167K755208J554308l11366j909432
12753B3841692k599570k084517o31907R68390J909269J993248J204413Q9641p58841
12744B3931818j319183j880003k014834j647672j048329k64893Q08012J734362
12736A8299278K023412J557370N8841j608142k918028l477345l153656k458202
12728H323528j803519j301503r18492o45386n02451m90082l10224k28962k11712
12719A911197j69661j10025j18087j39063q9487k0544p7402q6524p6871o0919
12709I62614q1216m8368o7454p1545n9788m3188j0692J0742O284L8464k0214j4491
$$ plain form
12697 601148 638344 643022 652880 666166 774177 762064 657233 561611 534613 535244 474294 441608
12685 441608 392630 379563 445101 459916 456286 459774 443371 414444 407755 396827 453725 501866
12673 501866 449826 424720 479336 517341 500187 468998 417269 386991 366118 393262 423798
12662 423798 520369 553051 560849 512748 508355 495392 404056 411339 426668 455725 497358 552716
12650 552716 553891 537523 557172 528755 579309 528293 505342 497476 465556 427934 415827 428041
12638 428041 367510 338582 369451 451817 495715 555462 573653 525698 545969 535307 453787
12627 453787 427887 461423 489344 500155 490495 462831 473629 538163 520964 479414 525979 591680
12615 591680 628119 733291 926093 961219 899935 813692 629897 481816 468713 442850 490669
$$ packed form
12697F01148L7196M678R858J3286J08011j2113j04831r5622k6998O31o0950l2686
12685D41608m8978j3067O5538J4815l630L488j6403k8927o689j0928N6898M8141
12673E01866n2040k5106N4616L8005j7154l1189n1729l0278k0873K7144L0536
12662D23798R6571L2682P798m8101m393j2963r1336P283J5329K9057M1633N5358
12650E52716J175j6368J9649k8417N0554n1016k2951p866l1920l7622j2107J2214
12638D28041o0531k8928L0869Q2366M3898N9747J8191m7955K0271j0662q1520
12627D53787k5900L3536K7921J0811r660k7664J0798O4534j7199m1550M6565O5701
12615E91680L6439J05172J92802L5126o1284q6243j83795j48081j3103k5863M7819
$$ plain form
12604 490669 529849 561685 616468 630824 671251 805603 1020638 1135519 1066440 963233 820276
12593 820276 778588 852174 892828 893059 971125 1172137 1257209 1307667 1297573 1087048 938028
12582 938028 949121 949895 1061556 1221453 1351087 1408209 1510029 1601283 1689704 1862132 1974623
12571 1974623 2157413 2434053 2778728 3315717 3929697 4821135 6219829 8304866 11546502
12562 11546502 16333491 22239653 26594890 26084933 21524380 16375204 12480386 10039788
12554 10039788 8797127 8319735 8210516 8260913 8505010 9412228 11435961 15180118 21162191
12545 21162191 27969398 30470810 25754881 18583045 13076046 9645047 7647564 6533607
12537 6533607 5891703 5336615 4705288 4033156 3378460 2861957 2465420 2159097 1976871
$$ packed form
12604D90669L9180L1836N4783J4356M0427J34352K15035J14881o9079j03207j42957
12593H20276m1688P3586M0654K31P8066K01012Q5072N0458j0094k10525j49020
12582I38028J1093P74J11661J59897J29634N7122J01820R1254Q8421J72428J12491
12571A974623J82790K76640L44675N36989O13980Q91438J398694K085037L241636
12562A1546502M786989N906162M355237n09957m560553n149176l894818k440598
12554A0039788j242661m77392j09219N0397K44097R07218K023733L744157N982073
12545B1162191O807207K501412m715929p171836n506999l430999j997483j113957
12537F533607o41904n55088o31327o72132o54696n16503l96537l06323j82226
$$ plain form
12528 1976871 1838993 1732021 1580483 1477273 1438709 1365303 1297027 1254329 1276336 1341715
$$ packed form
12528A976871j37878j06972j51538j03210l8564p3406o8276m2698K2007O5379
$$ [...]
##END NTUPLES=NMR SPECTRUM
##END=
