##TITLE=Analysis number 325647
Compound Code cc 18409
Book Reference 226791
Project Code adrs fraglib
Chemist Name jom
##JCAMPDX= 6.0         $$ Bruker NMR JCAMP-DX V2.0
##DATA TYPE= NMR SPECTRUM
##DATA CLASS= NTUPLES
##ORIGIN= Bruker BioSpin GmbH
##OWNER= nmr
$$ XWIN-NMR		Version 3.5
$$ Fri Jan  5 15:34:01 2007 GMT Standard Time (UT+0h)  MAYBRIDGE\nmr@NMR_250MHZ
##.OBSERVE FREQUENCY= 250.131544655141
##.OBSERVE NUCLEUS= ^1H
##.ACQUISITION MODE= SIMULTANEOUS (DQD)
##.ACQUISITION SCHEME= undefined
##.AVERAGES= 16
##.DIGITISER RES= 18
##SPECTROMETER/DATA SYSTEM= dpx250
##.PULSE SEQUENCE= zg30
##.SOLVENT NAME= CDCl3
##.SHIFT REFERENCE= (INTERNAL, CDCl3, 0, 16.5208)
##AUDIT TRAIL= $$ (NUMBER, WHEN, WHO, WHERE, WHAT)
$$ ##TITLE= Audit trail, XWIN-NMR		Version 3.5
$$ ##JCAMPDX= 5.01
$$ ##ORIGIN= Bruker BioSpin GmbH
$$ ##OWNER= nmr
$$ C:\u/data/dgb/nmr/ADRS/630/pdata/1/auditp.txt
$$ ##AUDIT TRAIL=  $$ (NUMBER, WHEN, WHO, WHERE, WHAT)
(   1,<2007-01-05 15:33:37.30 +000>,<MAYBRIDGE\nmr>,<NMR_250MHZ>,
      <created by zg, POWCHK disabled, PULCHK disabled
       configuration hash MD5:
       49 4B E0 1D 92 C2 6B 37 9F E6 65 BC 52 41 86 1D
       data hash MD5: 64K
       E3 4B 43 D4 11 55 70 D4 C9 94 92 59 4A A4 95 22>)
(   2,<2007-01-05 15:33:51.06 +000>,<MAYBRIDGE\nmr>,<NMR_250MHZ>,
      <Start of raw data processing
       ef LB = 0.3 FT_mod = 6 PKNL = 1 SI = 32K 
       data hash MD5: 32K
       25 B0 8F 6B FE AC BD 1B 0B 44 89 09 57 1F 8C F3>)
(   3,<2007-01-05 15:33:52.81 +000>,<MAYBRIDGE\nmr>,<NMR_250MHZ>,
      <apk 
       data hash MD5: 32K
       45 AD 63 E1 EE 25 D9 0F C6 5F 20 F1 CE F6 19 F2>)
(   4,<2007-01-05 15:33:53.50 +000>,<MAYBRIDGE\nmr>,<NMR_250MHZ>,
      <abs ABSG = 5 
       data hash MD5: 32K
       F5 B0 3C 53 13 13 11 88 37 BF 4B D0 EF F6 95 AF>)
$$ ##END=
$$ 
$$ hash MD5
$$ 1D BB 48 55 11 5E B9 09 57 C2 9A 39 FF 01 2B 34
##$RELAX= 
##$RELAX= 
##$RELAX= 
##$RELAX= 
##$RELAX= 
##$RELAX= 
##$RELAX= 
$$ Bruker specific parameters
$$ --------------------------
##$DU= <C:\u>
##$EXPNO= 630
##$NAME= <ADRS>
##$PROCNO= 1
##$TYPE= <nmr>
##$USER= <dgb>
##$AMP= (0..31)
100 100 100 100 100 100 100 100 100 100 100 100 100 100 100 100 100 100 
100 100 100 100 100 100 100 100 100 100 100 100 100 100 
##$AQSEQ= 0
##$AQ_mod= 3
##$AUNM= <au_zg>
##$AUTOPOS= <4 >
##$BF1= 250.13
##$BF2= 250.13
##$BF3= 250.13
##$BF4= 250.13
##$BF5= 500.13
##$BF6= 500.13
##$BF7= 500.13
##$BF8= 500.13
##$BYTORDA= 1
##$CFDGTYP= 0
##$CFRGTYP= 5
##$CHEMSTR= <none>
##$CNST= (0..31)
1 1 145 1 1 1 1 1 1 1 1 1 1 1 1 1 1 1 1 1 1 1 1 1 1 1 1 1 1 1 1 1 
##$CPDPRG= <>
##$CPDPRG1= <>
##$CPDPRG2= <>
##$CPDPRG3= <>
##$CPDPRG4= <mlev>
##$CPDPRG5= <mlev>
##$CPDPRG6= <mlev>
##$CPDPRG7= <mlev>
##$CPDPRG8= <mlev>
##$CPDPRGB= <>
##$CPDPRGT= <>
##$D= (0..31)
0 1 0 0 0 0 0 0 0 0.06 0 0 0 0 0 0 0.0002 0 0 0 0 0 0 0 0 0 0 0 0 0 0 
0 
##$DATE= 1168011215
##$DBL= (0..7)
120 120 120 120 120 120 120 120 
##$DBP= (0..7)
150 150 150 150 150 150 150 150 
##$DBP07= 0
##$DBPNAM0= <>
##$DBPNAM1= <>
$$ [...]
##$SUBNAM7= <"">
##$SUBNAM8= <"">
##$SUBNAM9= <"">
##$SW= 20.6930455092707
##$SWIBOX= (0..15)
0 0 3 0 0 0 0 0 0 0 0 0 0 0 0 0 
##$SW_h= 5175.983436853
##$TD= 65536
##$TD0= 1
##$TE= 294.16
##$TE2= 300
##$TE3= 300
##$TEG= 300
##$TL= (0..7)
0 120 120 120 120 120 120 120 
##$TP= (0..7)
150 150 150 150 150 150 150 150 
##$TP07= 0
##$TPNAME0= <>
##$TPNAME1= <>
##$TPNAME2= <>
##$TPNAME3= <>
##$TPNAME4= <>
##$TPNAME5= <>
##$TPNAME6= <>
##$TPNAME7= <>
##$TPOAL= (0..7)
0.5 0.5 0.5 0.5 0.5 0.5 0.5 0.5 
##$TPOFFS= (0..7)
0 0 0 0 0 0 0 0 
##$TUNHIN= 0
##$TUNHOUT= 0
##$TUNXOUT= 0
##$USERA1= <user>
##$USERA2= <user>
##$USERA3= <user>
##$USERA4= <user>
##$USERA5= <user>
##$V9= 5
##$VALIST= <valist>
##$VCLIST= <CCCCCCCCCCCCCCC>
##$VD= 0
##$VDLIST= <DDDDDDDDDDDDDDD>
##$VPLIST= <PPPPPPPPPPPPPPP>
##$VTLIST= <TTTTTTTTTTTTTTT>
##$WBST= 1024
##$WBSW= 4
##$XGAIN= (0..3)
0 0 0 0 
##$XL= 0
##$YL= 0
##$YMAX_a= 385416
##$YMIN_a= -529122
##$ZGOPTNS= <>
##$ZL1= 120
##$ZL2= 120
##$ZL3= 120
##$ZL4= 120
##$ABSF1= 16.52084
##$ABSF2= -4.172333
##$ABSG= 5
##$ABSL= 3
##$ALPHA= 0
##$AQORDER= 0
##$ASSFAC= 0
##$ASSFACI= 0
##$ASSFACX= 0
##$ASSWID= 0
##$AUNMP= <proc_1d>
##$AZFE= 0.1
##$AZFW= 0.1
##$BCFW= 0
##$BC_mod= 0
##$BYTORDP= 0
##$COROFFS= 0
##$CY= 12.5
##$DATMOD= 1
##$DC= 0
##$DFILT= <>
##$DTYPP= 0
##$F1P= 14.0000005364418
##$F2P= -0.99999901652339
##$FCOR= 0.5
##$FTSIZE= 32768
##$FT_mod= 6
##$GAMMA= 0
##$GB= 0
##$INTBC= 1
##$INTSCL= 1
##$ISEN= 128
##$LB= 0.3
##$LEV0= 0
##$LPBIN= 0
##$MAXI= 10000
##$MC2= 0
##$MEAN= 0
##$ME_mod= 0
##$MI= 0
##$NCOEF= 0
##$NC_proc= -5
##$NLEV= 6
##$NOISF1= 0
##$NOISF2= 0
##$NSP= 0
##$NTH_PI= 0
##$NZP= 0
##$OFFSET= 16.52084
##$PC= 1
##$PHC0= 223.755
##$PHC1= 7.290864
##$PH_mod= 1
##$PKNL= yes
##$PPARMOD= 0
##$PSCAL= 4
##$PSIGN= 0
##$REVERSE= no
##$SF= 250.130000290043
##$SI= 32768
##$SIGF1= 0
##$SIGF2= 0
##$SINO= 400
##$SIOLD= 32768
##$SREGLST= <1H.CDCl3>
##$SSB= 0
##$STSI= 32768
##$STSR= 0
##$SW_p= 5175.98343685301
##$SYMM= 0
##$S_DEV= 0
##$TDeff= 65536
##$TDoff= 0
##$TI= <Analysis number 999999
Compound Code 99
Book Reference 9
Project Code 9>
##$TILT= no
##$TM1= 0
##$TM2= 0
##$TOPLEV= 0
##$USERP1= <user>
##$USERP2= <user>
##$USERP3= <user>
##$USERP4= <user>
##$USERP5= <user>
##$WDW= 1
##$XDIM= 32768
##$YMAX_p= 540219710
##$YMIN_p= -297934
$$ End of Bruker specific parameters
$$ ---------------------------------
##NTUPLES= NMR SPECTRUM
##VAR_NAME=  FREQUENCY,     SPECTRUM/REAL,   SPECTRUM/IMAG
##SYMBOL=    X,             R,               I
##VAR_TYPE=  INDEPENDENT,   DEPENDENT,       DEPENDENT
##VAR_FORM=  AFFN,          ASDF,            ASDF
##VAR_DIM=   32768,         32768,           32768
##UNITS=     HZ,            ARBITRARY UNITS, ARBITRARY UNITS
##FACTOR=    0.157963299565203, 1,           1
##FIRST=     4132.35763674213, 0,            0
##LAST=      -1043.62580011088, 0,           0
##MIN=       -1043.62580011088, -297934,     0
##MAX=       4132.35763674213, 540219710,    0
$$ Real data points
##PAGE= N=1
##DATA TABLE= (X++(R..R)), XYDATA
$$ [...]
23798b7316N2135M2232P3403j7965j7254p8117o2613J3164Q6617k424k765m1943
23786A7154k5452P273Q0869N6775k1367q5434p346J13607L485j08022j03900L4908
23774c7450O188r4243K4089J32262N0447p7866k1328J6246l8228m856l3416J394
23762g6761J6447M0841K0867j9797k8479l6240P9p431K5123l2895R9700O1619
23750F3073n895M714l4080p3971M112J23862L8954p388p0983o3597J7524m0612
23738d4287n0419O5958L5060k812l3097O437P9254O398k8136r3315k7792K128
23726h4623J00761J9076k2595r560M1295k479m9572m2252R05P3698Q2123o699
23714A00078o4647o9116o2214j6826Q1502m8515m0603O5739N957k7903l1460p190
$$ plain form
23798 -27316 24819 67051 140454 122489 105235 27118 -35495 -22331 64286 61862 59097 17154
23786 17154 -8298 -1025 79844 136619 115252 29818 22472 136079 139564 31542 -72358 -37450
23774 -37450 -31262 -125505 -101416 30846 81293 3427 -17901 -1655 -39883 -44739 -78155 -76761
23762 -76761 -60314 -19473 1394 -18403 -46882 -83122 -83043 -90474 -65351 -98246 1454 63073
23750 63073 57178 61892 27812 -46159 -42047 81815 120769 113381 42398 -21199 -3675 -44287
23738 -44287 -94706 -28748 6312 3500 -29597 -23160 56094 62492 34356 -58959 -86751 -84623
23726 -84623 16138 35214 12619 3059 44354 41875 -7697 -49949 -49044 24654 106777 100078
23714 100078 35431 -33685 -95899 -112725 -31223 -79738 -120341 -54602 -48645 -76548 -108008 -115198
23702a15198P0995Q1421k47n9910m8549O771R5839m7972L3314K8239k138J1357
23690E3922L5972j00926m6927N0306J9909J1721P1975K6379m4770p2891k0918
23679a6248n7939l5599L1015j0631j22725L7197J05726N145k9472n3753m1439
23668a88723L7423M1499n2876o254R909O6460N7440k1229M9121J5326m1060n1930
23656h4894J6891K3792J3210J2395L5850N2118q26j16337l29L7762M6796l2468
23644C960l8341j0111L0221m4266J951K8806L3401k3140n9201N2350M4622q5833
23632f5581q422J1185j5368j6496M2287L197J0618M4156K4829M0500n0233p4438
23620e3766L7747R1649j2230K0808p9057p3404J8868r319J8971L4451N6K8352
$$ plain form
23702 -115198 -44203 37218 36971 -22939 -71488 -64717 31122 -16850 16464 44703 42565 53922
23690 53922 89894 -11032 -57959 -7653 12256 23977 95952 122331 77561 4670 -16248
23679 -16248 -74187 -109786 -78771 -89402 -212127 -174930 -69204 -64059 -93531 -147284 -188723
23668 -188723 -151300 -109801 -162677 -168931 -159022 -92562 -35122 -56351 -7230 8096 -32964 -84894
23656 -84894 -68003 -44211 -31001 -18606 17244 69362 68536 -47801 -48130 -10368 36428 3960
23644 3960 -34381 -44492 -14271 -58537 -56586 -27780 5621 -17519 -76720 -24370 20252 -65581
23632 -65581 -74003 -62818 -78186 -94682 -52395 -49198 -38580 5576 30405 70905 20672 -53766
23620 -53766 -16019 75630 63400 84208 5151 -68253 -49385 -58704 -39733 -5282 -5226 23126
23608B3126J4686r3815p3262M1262M0365O5243M5348J0834q7654J4587j1994k9861
23596d1135K4599L9986M3298k7835R711p0387l9895K9805O4547l3247p303m7505
23584e5361P044N1394N4624O3869O7068m4093m1118j5948k7466k9616L4374J8600
23572H3371k6456m7882n7581l4167n235N7572J2486l4178L032p835K2502k5521
23560e9892J4570J3876q196L0987M890l9629N2464k1703r8407l2237k4738N1558
23548a16457K3716K1971l9889q233O0898L7301j6866k1103p1692L924M4759L9104
23536d2567L1886O350p7541o8317P5477R5532P0072O0579j27364j08937L9825
23525d5005J03507j8150l7355n4520n2380Q638M9797M2577O1936P1751n596k3692
$$ plain form
23608 23126 37812 -56003 -129265 -88003 -47638 17605 62953 73787 -13867 720 -11274 -41135
23596 -41135 -16536 23450 66748 38913 48624 -21763 -61658 -31853 32694 -553 -7856 -55361
23584 -55361 -48317 3077 57701 121570 188638 144545 103427 87479 60013 30397 64771 83371
23572 83371 56915 9033 -48548 -82715 -87950 -30378 -17892 -52070 -49038 -56873 -34371 -59892
23560 -59892 -45322 -31446 -39642 -8655 -3765 -43394 9070 -12633 -111040 -143277 -168015 -116457
23548 -116457 -92741 -70770 -110659 -118892 -57994 -20693 -37559 -58662 -130354 -126430 -81671 -42567
23536 -42567 -10681 -4331 -81872 -150189 -74712 20820 90892 151471 24107 -84830 -45005
23525 -45005 58502 40352 2997 -51523 -103903 -95265 -45468 -2891 59045 130796 125200 101508
23513A01508j6743q5920n7386K4554K6878m5539K0843O4222p145m0154P491L1314
23501B3923N2639J6163J06119j5621j36376m4695j2515O751k4452m0266o9951
23490a38281r573K6893J068P8044J37670l3575j06158J5936J2381K6195j7033
23479f433L6864p7168l9852J125L2312M7997J5903L6243L0159j0106l4295P2866
23467A05615L0591o9510j15448k9076J0180L8290L3542P3994R3242l188l6324
23456A31908k9273j3719l81q3941M6304L9885M3682l9645K0194M9336n6492n2065
23444E5793k0702o9028j6612N556k1426l7854n0151L8041J953J06823N535l2403
23432c4475r924K7688l0157j9768J6365l9231J1241j6526J464o9736K65j4281
$$ plain form
23513 101508 84765 -1155 -58541 -33987 -7109 -52648 -31805 32417 25272 -14882 -7391 23923
23501 23923 76562 92725 198844 183223 46847 2152 -10363 -3612 -28064 -68330 -138281
23490 -138281 -147854 -120961 -119893 -41849 95821 62246 -43912 -27976 -15595 10600 -6433
23479 -6433 30431 -46737 -86589 -85464 -53152 -5155 10748 46991 77150 67044 32749 105615
23467 105615 136206 66696 -48752 -77828 -67648 -29358 4184 78178 171420 168232 131908
23456 131908 102635 88916 88535 4594 50898 90783 134465 94820 115014 164350 107858 55793
23444 55793 35091 -33937 -50549 -44993 -66419 -104273 -154424 -116383 -114430 -7607 -2072 -34475
23432 -34475 -44399 -16711 -46868 -66636 -50271 -89502 -78261 -94787 -93323 -163059 -162794 -177075
23420a77075P6363J15111J020l3412q9533n002L1060k4151K7030m36o384j1825
23408i7234o873J8930n735P775j00978M5835O1824M4828o2960k2009K1125l862
23396i9334K8904q507M2672K5707K848L6637N3381J2773k7520l0007r7602K1918
23384c8130k554M4189L7464m7264m8499m8632r9896o3363J4699Q3945K9624K0043
23372a18374k5755J8250M8553N4125q144L2004j4535o116M1129m4024o9154n1469
23360a43510L4607P2694j9995n7526L9255M4414m854R1725j0204K6359n6840n1236
23348c5111m6335O5731k4487J9376L8127n460k7662K2909k0230k0856M9111J3355
23336B8468J1612l565n7364j7717m0034N1318O5031j3031m0349J292P078k1558
$$ plain form
23420 -177075 -100712 14399 15419 -17993 -107526 -112528 -81468 -105619 -78589 -79025 -85409 -97234
23408 -97234 -104107 -85177 -90912 -83137 -184115 -138280 -76456 -31628 -94588 -116597 -95472 -99334
23396 -99334 -70430 -78937 -36265 -10558 -7710 28927 82308 95081 67561 37554 -60048 -38130
23384 -38130 -40684 3505 40969 -6295 -54794 -103426 -203322 -266685 -251986 -168041 -138417 -118374
23372 -118374 -144129 -125879 -77326 -23201 -31345 659 -13876 -19992 21137 -22887 -92041 -143510
23360 -143510 -108903 -36209 -56204 -113730 -74475 -30061 -34915 56810 46606 72965 16125 -35111
23348 -35111 -81446 -15715 -40202 -20826 17301 11841 -15821 7088 -13142 -33998 15113 28468
23336 28468 40080 36515 -20849 -38566 -78600 -27282 37749 24718 -15631 -14339 -7261 -28819
23324b8819L8308k9748m0275n4451Q3869R3078j7370n8318q3804P7828j5161n1360
23312h6223K3806p854R4192J8221J7468l418J6814k7013n701k0973j492j2923
23300D904k7773k2050L6942L4511p178r4285n9637N6241R9314L0289p5015L706
23288b0031P5395N9810k5350q7379J8234j9772l7686K2789M3864J7310q495n1197
23276a2508m0608O5139j8938l856O2992L0121j4464l6270q6573J1746L5842L6790
23264B9413j2261J0310J2508k4190j1012k8046j2150n5689k3561O1341R6416L9141
23252H2220J37r4068m4j700o2684q6791K8691M4938k3192M865L1786K4054o3660
23239a15448J8699M2750N0081M8023k6194m056M9988M1392j8099k0607N1068k7503
$$ plain form
23324 -28819 9489 -20259 -60534 -114985 -31116 61962 44592 -13726 -97530 -19702 -34863 -86223
23312 -86223 -62417 -70271 23921 42142 59610 56192 73006 45993 40292 19319 17827 4904
23300 4904 -22869 -44919 -7977 26534 19356 -74929 -134566 -78325 20989 51278 -23737 -20031
23288 -20031 55364 115174 89824 2445 20679 907 -36779 -13990 29874 47184 38689 -12508
23276 -12508 -53116 12023 -6915 -10771 52221 82342 67878 31608 -54965 -43219 -7377 29413
23264 29413 17152 27462 39970 15780 4768 -23278 -35428 -91117 -114678 -53337 43079 82220
23252 82220 82357 -11711 -11755 -13455 -76139 -162930 -134239 -89301 -112493 -107628 -75842 -51788 -115448
23239 -115448 -96749 -53999 -3918 44105 17911 13855 63843 105235 87136 66529 117597 90094
23227I0094j23563j6463O1607k9339L1193R695o55K6206k2950m4830L5316L2748
23215D9059r1890p7111l1038K5847K7528N9949P1702j6469o9468m586n2759m0778
23203a50014R2093N848J902l4487J5524L5014N5354L0486j04755M4589J9255N3946
23191F4755r243l2821l3680o7901k8312K1393N6023J1746q7491j7727K5462k6180
23179a23976k1789O5505M5858o786M9520O8897Q817p9602k210Q065k8148m2041
23167e7890j6681M58j2830n2332k9496k3929o72J06431l4459K4016O4242K0191
23155a2951n5350m063N0135m910K9576L835J00326J7300j7255n476K5706k0206
23143A06667n6614q8610P041L1783o1240j02251k4917Q472M5764N9537P3996l6861
$$ plain form
23227 90094 -33469 -49932 11675 -17664 13529 23224 22569 48775 25825 -19005 16311 49059
23215 49059 -42831 -119942 -150980 -125133 -97605 -37656 34046 17577 -51891 -56477 -109236 -150014
23203 -150014 -57921 -52073 -50171 -84658 -69134 -34120 21234 51720 -53035 -8446 10809 64755
23191 64755 55512 22691 -10989 -78890 -107202 -85809 -29786 -18040 -105531 -123258 -97796 -123976
23179 -123976 -145765 -80260 -34402 -41188 8332 77229 86046 6444 4234 12299 -15849 -57890
23167 -57890 -74571 -74113 -86943 -139275 -168771 -192700 -193372 -86941 -121400 -97384 -33142 -12951
23155 -12951 -68301 -72364 -22229 -27139 2437 6272 106598 123898 106643 101167 126873 106667
23143 106667 50053 -38557 -31516 267 -60973 -163224 -188141 -179669 -133905 -74368 -372 -37233
23131c7233M6124R5746l0619m9419j10108m6512k076O1226M3799o4982K9582n2059
23119a16531P433K2275K1656K6219j416q3124L6324M5375J47282J3651j33463
23108a4319n2346O066n1503m1114J519l3454n0939N5955K7951Q2477J21399M9596
23096A01288m4328l2532L8876o714K2783k4933p9477m6536K6297k5839J1235O644
23084e3236j9477r673Q7150K0663L178k857n8542j11850Q655N6014l3703k9137
23072a42815j0290J2784n9688K753L3955O0844L0646q1089L1830Q2471k6374l6333
23060a01306P3518l5219O8296L5385K2674l5116m7057n5757l6441L6501O1513
23049a3009Q5168l6362o0471m790q8951l370N7700o579O499L4442O400q909N8298
$$ plain form
23131 -37233 8891 104637 74018 24599 -85509 -132021 -134097 -72871 -29072 -94054 -64472 -116531
23119 -116531 -109098 -86823 -65167 -38948 -40364 -123488 -87164 -41789 105493 119144 -14319
23108 -14319 -66665 -60599 -112102 -153216 -151697 -185151 -236090 -180135 -152184 -69707 51692 101288
23096 101288 56960 24428 63304 56590 79373 54440 -25037 -71573 -45276 -71115 -59880 -53236
23084 -53236 -72713 -82386 4764 25427 28605 25748 -32794 -144644 -135989 -79975 -113678 -142815
23072 -142815 -153105 -140321 -200009 -197256 -163301 -102457 -71811 -152900 -121070 -38599 -64973 -101306
23060 -101306 -27788 -63007 5289 40674 63348 28232 -18825 -74582 -111023 -74522 -13009
23049 -13009 72159 35797 -24674 -29464 -118415 -121785 -64085 -70664 -64165 -29723 -23323 -32232 26066
23036B6066M0417L6087J0580k5918n6473r5843k0734K8595J16642j1919L7353
23025H4853n0698n6728q524J9209n8400j5159j0329N4739k0638K922l4494J2062
23013h1185N2625N6102n6718l8278q582P869l4203M8072N0985q7597J8331O8914
23001c665P2362N5336J5723l5412o2796L337k560k8716o8274r2754O8035J12992
22989C3608N4218l5748j6635P959n1396j0278m1002j3466R3767M3354p4173o0695
22977g0487J3192m6539k1991N8065R1249l1873o0091K2998k0822M5936J4408O4129
22965E8174r763l4910N6442m889J2994J1829Q589p78l6504q55l5138K1186N6404
22952A02781n1479q4810K967M197l5925n7590n9439n207N0401N25M4270Q813N7060
$$ plain form
23036 26066 66483 102570 113150 87232 30759 -65084 -85818 -57223 59419 47500 84853
23025 84853 34155 -22573 -31097 -11888 -70288 -85447 -95776 -41037 -61675 -58753 -93247 -81185
23013 -81185 -28560 27542 -29176 -67454 -76036 -68167 -102370 -54298 -3313 -90910 -72579 -3665
23001 -3665 68697 124033 139756 104344 41548 44885 42325 13609 -54665 -147419 -79384 33608
22989 33608 87826 52078 35443 43402 -7994 -18272 -59274 -72740 21027 64381 -9792 -70487
22977 -70487 -57295 -103834 -125825 -67760 23489 -8384 -68475 -45477 -66299 -20363 -5955 58174
22965 58174 48411 13501 69943 65054 78048 89877 98466 97688 61184 60329 25191 46377 102781
22952 102781 51302 -33508 -30541 -26344 -62269 -119859 -179298 -184505 -134104 -133579 -89309 -80496 -23436
22939b3436K6995o7759m3278J6152P7349r152j1659O6132O3171J12518j4739j15544
22927G6750j00550j7979P5193L1817o2331o7454m5386J8815J02219Q5091M6953
22916A43138l7522r5035l9662k694j9101o5414M2136N5332J8039q2045j5512J7272
22904h1068k9332P7475K3014j3630R379o8986K3468J7678l4814K382J8765M1688
22892a3981l3990n4968p454O5217n2696m2531M5175P9627N5479q145q739j14464
22880i1470m0930K5711L5937M8403p164L3451O022K5958O6078o8660o4538K2233
22868h969L2526R465l1004k1906J2472l8144M9848N6399N5899K4193M7925M5570
22856B34274r155q7351j20400j16438J7131O4362L149N9463L8433m3662o3551
$$ plain form
22939 -23436 3559 -64200 -107478 -91326 -13977 -23129 -34788 31344 94515 207033 192294 76750
22927 76750 -23800 -41779 33414 65231 2900 -64554 -109940 -91125 11094 96185 143138
22916 143138 105616 10581 -29081 -31775 -50876 -116290 -74154 -18822 -783 -82828 -98340 -81068
22904 -81068 -110400 -32925 -9911 -23541 -14162 -83148 -59680 -42002 -76816 -74434 -55669 -13981
22892 -13981 -47971 -102939 -110393 -45176 -97872 -140403 -95228 -15601 39878 31733 22994 -91470
22880 -91470 -132400 -106689 -70752 -22349 -29513 3938 9960 35918 101996 33336 -31202 -8969
22868 -8969 23557 33022 2018 -19888 -7416 -45560 4288 60687 116586 140779 188704 234274
22856 234274 225119 137768 17368 -99070 -81939 -17577 -14428 45035 83468 39806 -23745
22845b3745k6210l3126O4146M8483P022L9441l0673K9615J4509p9898o0546L0015
22833b0967N8194R261q4119K1584P250j7320j8878R114L6894J0753o7845K3399
22821c2680q484m6255n3528L4159K5646N2344K0984m7184K1934K7481n6840r3632
22809a56055m6517m712j871J3164Q5573K3889K6445L9862L5486j9553o6014l0649
22797a00952p5834N379J34442J18414J5547p1783m781J6447n0139l7203K6111
22786b4352N1845m4464m5619N2004l1146j0019M1539K8825l8860k0420K1129M1495
22774B1957k5782M432J075P8324J8606q2342q4506n2081Q6632P3564n1254n6181
22762f7556K0331M7025M4177l961o3302M9237O2088j0813q6260R060l9797J9965
$$ plain form
22845 -23745 -49955 -83081 -18935 29548 36570 76011 45338 74953 89462 9564 -50982 -20967
22833 -20967 37227 46488 -37631 -16047 -8797 -26117 -44995 -35881 1013 11766 -56079 -32680
22821 -32680 -41164 -87419 -140947 -106788 -81142 -28798 -7814 -54998 -33064 -5583 -62423 -156055
22809 -156055 -202572 -207284 -209155 -195991 -110418 -86529 -60084 -20222 15264 -4289 -70303 -100952
22797 -100952 -176786 -171407 -36965 81449 96996 25213 20432 36879 -13260 -50463 -24352
22786 -24352 27493 -16971 -62590 -10586 -41732 -51751 -10212 18613 -20247 -40667 -19538 21957
22774 21957 -3825 607 1682 80006 98612 16270 -68236 -120317 -33685 39879 -11375 -67556
22762 -67556 -47225 -200 43977 40016 -23286 25951 88039 77226 -9034 26 -39771 -19806
22750a9806n3827p8862N0377L2615P5449J7505l3388p248J00202j3286j32851
22739f3120N4809R1936M5214o4154j05035q395J2190J4462k1005O3533O3213j7846
22727F5802l7010N9088L6550p7975r3455m1744N581O4433K3375l7038M050L8548
22715A0205l4852n6701j0634l3060M0987J5659M5592J8071p494K5891l3804l2896
22703e3036k0015j3431L7903L9626J4697K9166M2787J7619j0668k7803j4545N7722
22691A00022n0982j07700M7029J03339L6117l3917j56341l3262j538L9335M4068
22680a3830N405L6625j4900m7237j3115L3409M2289j408O970k6256p2498N571
22668e8975m2063m5026J00482J5047l6708L0016O2268k5511l9236R580J371q0995
$$ plain form
22750 -19806 -73633 -152495 -102118 -69503 5946 23451 -9937 -17185 83017 69731 -63120
22739 -63120 -8311 83625 128839 64685 -40350 -48745 -36555 -22093 -43098 20435 83648 65802
22727 65802 28792 87880 124430 46455 -47000 -88744 -83163 -18730 4645 -32393 -28343 10205
22715 10205 -24647 -81348 -91982 -125042 -84055 -68396 -22804 -4733 -12227 13664 -20140 -53036
22703 -53036 -73051 -86482 -48579 -8953 5744 34910 77697 95316 84648 56845 42300 100022
22691 100022 49040 -58660 -11631 91708 127825 93908 -62433 -95695 -97233 -57898 -13830
22680 -13830 -8425 28200 13300 -33937 -47052 -13643 28646 27238 34208 7952 -64546 -58975
22668 -58975 -101038 -146064 -45582 -30535 -67243 -37227 25041 -470 -39706 -30126 -28755 -109750
22656a09750R4953M8524l3879M9685j1564l2232l718m2787o6997L7154r732l4289
22644a14632M5407N5405K4070J901K2733K4670r727K99n8504j870N8223p211o6789
22631b6025L5381p4373n6094K15K8493K802o5385L963J1232N8698l7741N4928
22619f3906J42320m0945m8053m8370J0299O686N0805J0536l5194R264k5610P1236
22607C9068n51L4285J1706J419n7598m1800Q742j383j2969N9285n7323q5630N357
22594i7392m626n3190L5330O9646J4977j9124O9198k7548n0185P461Q1229K5279
22582E1055l0188K294K6725N4076J7573J8608j07365m5922o3356m8589L7260J5987
22570g1842j7325j7914P1568P4566N0899p2037m9498Q456j1913J2408n3131J5246
$$ plain form
22656 -109750 -14797 33727 -152 49533 37969 5737 2019 -40768 -107765 -70611 -80343 -114632
22644 -114632 -69225 -13820 10250 12151 34884 59554 49827 50126 -8378 -10248 47975 40764 -26025
22631 -26025 9356 -65017 -121111 -120896 -92403 -89601 -154986 -151023 -139791 -81093 -118834 -63906
22619 -63906 78414 37469 -10584 -58954 -48655 -41969 8836 19372 -15822 -6558 -32168 39068
22607 39068 38517 72802 84508 85927 28329 -13471 -4729 -6112 -19081 40204 -17119 -102749 -97392
22594 -97392 -102018 -155208 -119878 -50232 -35255 -54379 14819 -12729 -62914 -55453 25776 51055
22582 51055 20867 23161 49886 103962 121535 140143 32778 -13144 -76500 -125089 -87829 -71842
22570 -71842 -89167 -107081 -35513 39053 89952 17915 -31583 -23127 -35040 -22632 -75763 -60517
22558f0517O5570K5334M1600J4037r4120p9221P3879m0632j01627K6476R8184
22547c1037M3491K2857M0472R0848M0134N417p4108p2766j03151n1382J9144M5349
22535b4732l4137M7030j5074J6974J2708Q445j3212j1190Q5778N7203o8149m5745
22523A5899M6330k0445n8020J3030J18212L0537J6771j17941n6652l2677L0859
22512a4097J5530k2177j08131m4770r251R1070P0178J5386M8771L8135j02733
22501b2089l0680K531q269J5607m2701l3556j703N5829O5143j3606l7136J7094
22489c3536Q971n1637n662K9587P4670k7680K5511J3465R631K2174J6363P3356
22477A55213j8424l7448o853K5453m4761o9380K0727o3594K8963K9962n180K1739
$$ plain form
22558 -60517 5053 30387 71987 86024 -8096 -87317 -13438 -54070 -155697 -129221 -31037
22547 -31037 12454 35311 75783 166631 206765 212182 138074 65308 -37843 -89225 -70081 -24732
22535 -24732 -58869 -11839 -26913 -9939 2769 11214 -1998 -13188 72590 129793 61644 15899
22523 15899 62229 41784 -16236 -3206 115006 145543 162314 44373 -12279 -44956 -14097
22512 -14097 1433 -20744 -128875 -173645 -182896 -91826 -21648 -6262 42509 80644 -22089
22501 -22089 -52769 -50238 -58507 -42900 -85601 -119157 -120860 -65031 112 -13494 -50630 -33536
22489 -33536 -24565 -76202 -81864 -52277 22393 -5287 20224 33689 43320 65494 81857 155213
22477 155213 136789 99341 92488 117941 73180 3800 24527 -39067 -10104 19858 14678 36417
22465C6417k0045p0236m5582K5362m9142l1622n93M4867l324j4031M9137O4123
22453a4669O9770P2616j5050r6188n9459M443l5192R9321M9576L269L381k6795
22441E5023M9359L7691l8146l2982o275m5365n3715M8884p5543n655Q5584L5454
22429E4314J4533p239l2130J6359l3359l1635J0326L339P730M6228p0677q2400
22417a04611l6144O0146j1395N5411j7338n0664O3713J8819m3565m8886N8691
22406e5823L5461k5998l0386m8324n8620j0903R7154O4108M7285n7852m5184o250
22394i5332M7289L7374J4787j4958M3034N2262j5933m0363l8480l6850K2845j792
22382b6117o9993N501L3293L4974J2039L0933M4659J7883o9922m9260j066p611
$$ plain form
22465 36417 16372 -53864 -99446 -74084 -123226 -154848 -155441 -110574 -113898 -127929 -78792 -14669
22453 -14669 55101 127717 112667 16479 -42980 -38537 -73729 25592 75168 78437 81818 55023
22441 55023 104382 142073 103927 70945 64670 19305 -34410 14474 -61069 -66724 18860 54314
22429 54314 68847 61608 29478 45837 12478 -19157 -8831 -5492 2238 48466 -22211 -104611
22417 -104611 -140755 -80609 -92004 -36593 -53931 -104595 -40882 -22063 -65628 -114514 -55823
22406 -55823 -20362 -46360 -76746 -125070 -183690 -194593 -97439 -33331 13954 -43898 -89082 -95332
22394 -95332 -48043 -10669 4118 -10840 32194 84456 68523 28160 -10320 -47170 -24325 -26117
22382 -26117 -96110 -90609 -57316 -22342 -10303 20630 65289 83172 13250 -36010 -37076 -44687
22370d4687J3039o4238k5364O6637L7414J0245M3180m7455j0938j5029l6299K4962
22358d8533P272N9712o318q8078k5618K7544M3032m559o878L4729K2339o691o998
22345I55L4168L0275m2013n884m5404j03356K4811J7010N5202L4303n3844m5469
22333i9246l8577R7344L7246l0124L1208n1885j4522m0542P440J12654M3716l3230
22321B1482j7818L1005j8008K1903J5578L2460j7813r1854J4271M9283J8392P2322
22309A31203o962m5925L48m0751m9861j5478p8215l1768l2785N149J9761N3634
22297i1650J05091K5441j17144m0340N6710N8655O9527J3861J9039m594k5638
22286F8958j3498o357Q403k57J9136j0943K0486n8637k4074q1423m0739J7012
$$ plain form
22370 -44687 -31648 -95886 -121250 -54613 -17199 -6954 36226 -11229 -22167 -37196 -73495 -48533
22358 -48533 -41261 18451 12133 -75945 -101563 -74019 -30987 -35546 -42424 -7695 14644 7953 955
22345 955 35123 65398 23385 17501 -27903 -131259 -106448 -89438 -34236 67 -53777 -99246
22333 -99246 -137823 -40479 -3233 -33357 -2149 -54034 -68556 -109098 -101658 10996 54712 21482
22321 21482 3664 34669 16661 38564 54142 86602 68789 -23065 -8794 40489 58881 131203
22309 131203 124241 78316 78664 37913 -11948 -27426 -105641 -137409 -170194 -165045 -145284 -91650
22297 -91650 13441 38882 -78262 -118602 -61892 -3237 66290 80151 99190 94596 68958
22286 68958 55460 49103 57506 57249 76385 65442 85928 27291 3217 -78206 -118945 -101933
22274a01933j0042O2398K9094L4718J3944m9566m2188M1318r973o559M1079m1621
22262c9331o4332L2910J1834l0475j8642J6411J3819L3573J24872J361j58405
22251g6405o380M1223L6503N2644l913k4344O397m3344k240M4380L5737Q213o999
22238F1472J0856Q907o0626m4886k755l2404m2579J5211M9102L5839r04o3748
22226f6515J4682L2552m3556j8017R0656K5347k0495n1451K6496P2882m658n9698
22214a775m0449P7881J5625j7484o2133L8980M236m3497K0452K3920J1640M8885
22202G6281m3320l0685k3953l4872O866N7968J12159L595j2890o5331p7278o7473
22190i8933O396L0015j9891P3498N8594K1265Q710L5637o7657j09603L8593P9687
$$ plain form
22274 -101933 -111975 -49577 -20483 14235 28179 -21387 -63575 -22257 -32230 -38789 2290 -39331
22262 -39331 -103663 -70753 -58919 -89394 -108036 -91625 -77806 -44233 80639 82000 -76405
22251 -76405 -82785 -41562 -5059 47585 43672 19328 25725 -17619 -19859 24521 60258 68471 61472
22238 61472 72328 81235 20609 -24277 -27032 -59436 -102015 -86804 -37702 -1863 -2767 -66515
22226 -66515 -51833 -19281 -62837 -80854 9802 35149 14654 -36797 -10301 62581 57923 -1775
22214 -1775 -42224 35657 51282 33798 -28335 10645 14881 -28616 -8164 15756 27396 76281
22202 76281 32961 2276 -21677 -56549 -49683 8285 120444 124039 111149 45818 -31460 -98933
22190 -98933 -92537 -62522 -82413 -8915 49679 70944 79654 115291 47634 -61969 -23376 56311
22178E6311J6077m6173j01967q392q390K1734M3811L5738m3805l1398J2694p62
22166e4522K4536m0432k4519K4312L1234j2958p5831p169P0282k3804k4620Q7924
22154b5567N5432J2693m4581j02549j6664O0576j3077K2843R122j2407M7726K5667
22142A9214L4317L3625r4753j2405N5337O698m1790j907n713n7954o0187L7407
22130h8111N0215K8429J34789L6392o1858q2788p8140L3302J3121l074J3833J04408
22118A00518M0741l7365o8742k9752P4190p1364j02174m9306L0735K8361l1950
22107a16108k1433O9389M6318N7879K4654m6545k1113L2910o942p2371j19052
22096a72414N139N9681L2039N2539Q597p7958J2773M0245K4348m1231m6014j8179
$$ plain form
22178 56311 72388 26215 -75752 -84144 -92534 -70800 -26989 8749 -35056 -66454 -53760 -54522
22166 -54522 -29986 -70418 -94937 -70625 -39391 -52349 -128180 -135349 -65067 -88871 -113491 -25567
22154 -25567 29865 42558 -2023 -104572 -121236 -60660 -73737 -50894 -41772 -54179 -6453 19214
22142 19214 53531 87156 -7597 -20002 35335 42033 243 -1664 -7377 -65331 -125518 -88111
22130 -88111 -37896 -9467 125322 161714 99856 17068 -61072 -27770 -14649 -17723 -3890 100518
22118 100518 141259 103894 35152 5400 79590 8226 -93948 -143254 -112519 -84158 -116108
22107 -116108 -137541 -68152 -21834 36045 60699 14154 -6959 25951 19009 -53362 -172414
22096 -172414 -167275 -107594 -75555 -23016 -14419 -92377 -79604 -39359 -15011 -56242 -102256 -120435
22084a20435N7979O308L443J0247L3088J529J6402l2411k2818j4135O7294P0901
22072G7392m898l8332m5122j0187n0303L9894K7806N548n4469J0598L8633j4390
22060a7830L1184m0190q291K385l5006k7669m254l56J1950O0745m8162l0857k5804
22047a32155M1610j1607m7250p2304N081J11023Q9798P658j9738K8574n501Q1719
22035G6908k7648J356O271M2560o579p7580k2352l8482o8889l8504L4601P2455
22023d5883M5226L4770J3811m0285K136J5934m2263r953N9089M3509J8850l7620
22011E7321k7239L0540O761k1273l0762l5733M5601K2409k5710q6713p535j6884
21999h9217m0852P7856O7699L6473l3402O3031j4509j4524k8736k6403p4148l1248
$$ plain form
22084 -120435 -62456 -56148 -52705 -42458 -9370 -7841 8561 -23850 -46668 -60803 6491 77392
22072 77392 72494 34162 -10960 -21147 -71450 -31556 -3750 1798 -52671 -42073 -3440 -17830
22060 -17830 13354 -26836 -35127 -32742 -67748 -95417 -99671 -100027 -88077 -27332 -75494 -106351 -132155
22047 -132155 -90545 -102152 -149402 -221706 -216625 -105602 -15804 -8146 -27884 690 -4811 76908
22035 76908 49260 50616 56887 99447 92868 15288 -7064 -45546 -114435 -152939 -118338 -45883
22023 -45883 -657 34113 47924 7639 9775 25709 -16554 -26507 32582 76091 94941 57321
22011 57321 30082 60622 67383 46110 15348 -20385 25216 47625 21915 -64798 -72333 -89217
21999 -89217 -130069 -52213 15486 51959 18557 81588 67079 52555 23819 -2584 -76732 -107980
21987a07980j0907J10556R6795o59k7985k0161k5073Q410o7205N4051J8924j6246
21975A2520L772k8086K6819K1660r4923l9501P9769O9994k3531q803J8616m2835
21963d529M5078J7537q0165k6766L2624K5962K9722k1766r4730r2996k915J1446
21951a61498J17015O3255l5519r8261M1589j0135J1414M0004m9822k9907K2896
21940h8969K9750J5899J0501L7252R686n1958o8137L3973Q0720q4247k8426P9807
21928b4149J26404l033l5830m3792r6737r5549J1894M3335N6411L3866k0798J4414
21916c3564M9775L3449J5329K4622m7649j4510j3874l2467J9213M8306m7819m8437
21904d7626p226l2828j913M8166P994n7900o6069m8173R6765L2248P3555M7105
$$ plain form
21987 -107980 -118887 -8331 88464 87805 59820 39659 14586 22996 -44209 9842 28766 12520
21975 12520 16292 -11794 15025 36685 -58238 -97739 -17970 52024 28493 19690 38306 -4529
21963 -4529 40549 58086 -22079 -48845 -16221 9741 39463 17697 -77033 -170029 -172944 -161498
21951 -161498 -44483 18772 -16747 -115008 -73419 -83554 -72140 -32136 -81958 -111865 -88969
21940 -88969 -59219 -43320 -32819 4433 14119 -37839 -105976 -72003 8717 -75530 -103956 -24149
21928 -24149 102255 99222 63392 19600 -77137 -172686 -160792 -117457 -61046 -27180 -47978 -33564
21916 -33564 16211 49660 64989 89611 41962 27452 13578 -18889 324 48630 811 -47626
21904 -47626 -54852 -87680 -89593 -41427 -33433 -91333 -157402 -205575 -108810 -76562 -3007 44098
21892D4098o1693j9091N5997M3205Q7018k0599n7634m6467n1012j9360M1026j4646
21880a9158j2468K8461n128j9914J5912j2960J4056j0259N42N7232Q756o6980
21868b1908q3045n1114k1157R5321J18343Q5287O682o8003j03103k6119P828J8744
21856d2244N1340K3076J647k056l9482o4962j7194J07082J4106r8040N7812Q3838
21844G4923k3942k5207o3977j4632K144R5002M0155q8223k7325m9562m7688N1533
21832g6799O501k8438j9681m5563L1020J5688P588N6884k0638K932L9508n7662
21820h8660l879J3355k5775m576M6531L5661K3663j9856k9282l4104o5971l0506
21808a83399J23311J1927L7410m996k3591Q78M9069Q073n1839m2768p1765k3475
$$ plain form
21892 44098 -17595 -36686 19311 62516 149534 128935 71301 24834 -26178 -45538 -4512 -19158
21880 -19158 -31626 -3165 -8293 -28207 -12295 -25255 -11199 -21458 -20916 36316 45072 -21908
21868 -21908 -104953 -156067 -177224 -81903 36440 121727 128409 60406 -42697 -68816 -60988 -42244
21856 -42244 9096 32172 33819 31763 -7719 -72681 -89875 17207 31313 -66727 -8915 74923
21844 74923 50981 25774 -38203 -52835 -50691 44311 84466 -3757 -31082 -80644 -128332 -76799
21832 -76799 -70298 -98736 -118417 -163980 -132960 -117272 -109684 -52800 -73438 -70506 -30998 -88660
21820 -88660 -92539 -79184 -104959 -109535 -63004 -27343 -3680 -23536 -52818 -86922 -152893 -183399
21808 -183399 -60088 -48161 -10751 -15747 -39338 -38460 10609 18682 -33157 -75925 -147690 -171165
21796a71165P7703l2560m328K5585j9741m5610J21757R0179K53m6241K1258R399
21784B6489O6373j7608j939J9347l8968m9893m3301P2492O6362q0247j84120m4894
21772b09907R5856Q3747l5723n3452M1286Q4475L3338L0950j0617m0314r058J7511
21760B8092k6074p6799k1378J1788m175k916J2145p725M2185L5374M2794J1665
21748D4976o2883J235K5062J1088k8122M0755J8913l4073K133m6924P632L4251
21736A4043N3029J4952j05210r1527q963P479Q1040N5070M7779n816l9355k4378
21724a857K4496J4300M313j9018l78K2688P442n0458O3357p5867o5811n119O4939
21711a6973K9785j4650M7377J5290m845l7699K2592l9850J1178O4439k1454q2364
$$ plain form
21796 -171165 -93462 -126022 -130350 -104765 -124506 -170116 -48359 41820 42073 -4168 17090 26489
21784 26489 92862 75254 73315 92662 53694 3801 -39500 32992 99354 19107 -165013 -209907
21772 -209907 -114051 -30304 -66027 -119479 -78193 6282 39620 70570 59953 19639 10581 28092
21760 28092 2018 -74781 -96159 -84371 -88546 -91462 -79317 -87042 -44857 -9483 33311 44976
21748 44976 -17907 -16672 8390 19478 -8644 32111 51024 16951 19084 -27840 -20208 14043
21736 14043 67072 82024 -23186 -114713 -123676 -116197 -35157 19913 67692 61876 22521 -1857
21724 -1857 22639 36939 41252 22234 21856 44544 51986 1528 64885 -10982 -76793 -81912 -16973
21711 -16973 12812 -1838 45539 60829 55984 18285 40877 1027 12205 76644 55190 -27174
21699b7174j08396j2671R5359K8622M2228q3949m5457P823J1763k4413j2989Q910
21687a20344L5588M5228l3068j5292O048m4648m7897L5333P1273j274l7474P9069
21675b7458l4121n2416p8949m5669O8566M0958M7499o4339j2041N8441L7820l5571
21663i7280L8892J8903K885N1186j4361n4543q405J5794k5859N2848P421o579
21651a9098n9349k2571P742L2525M7744j299J6278L5069p4968p9463K104L7936
21639g7350J854J02653P6367l9245n4477k5757M0700P8573k5331m3847k4287k6676
21627a6823M8596k9842m6691k2066P0695m567L8600j8535P727j2069n1019j1784
21615d7778L1469q682N5824r62j6235j2703k8192j7934J9410M7623l3430m4191
$$ plain form
21699 -27174 -135570 -148241 -52882 -24260 17968 -65981 -111438 -103615 -91852 -116265 -129254 -120344
21687 -120344 -84756 -39528 -72596 -87888 -81840 -126488 -174385 -139052 -67779 -69053 -106527 -27458
21675 -27458 -61579 -113995 -192944 -238613 -170047 -129089 -81590 -145929 -157970 -99529 -61709 -97280
21663 -97280 -58388 -39485 -36600 14586 225 -54318 -62723 -46929 -72788 -19940 -12519 -19098
21651 -19098 -78447 -101018 -93276 -60751 -13007 -14306 1972 37041 -37927 -117390 -115286 -77350
21639 -77350 -75496 27157 103524 64279 9802 -15955 24745 103318 77987 34140 9853 -16823
21627 -16823 31773 1931 -44760 -66826 3869 -698 37902 19367 27094 15025 -35994 -47778
21615 -47778 -16309 -24991 30833 29871 13636 933 -27259 -45193 -25783 21840 -11590 -55781
21603e5781Q1998O9031J4261n5593l4512N8130O3853N514q335n6316o9049J3389
21591B6590L2761m8624n966L2459q2975l721N7765o3801o5091o128o8326K9367
21579a65690J3642K9931O7817J4912J808K0807o762q140N3123k2553J9511m3745
21567b5339o2392o6779k8591L6215M6427O6805k435K3338J8771Q205k4764J7364
21555F825K6083K1985n8270N0066J0028q0687r0649K1496J10189K6946n213l1552
21543G247k4647J7548O0202Q7623p0221m8052k9104k3344n3573o3554L7185Q7241
21531a5449P978o3499j9012l258K9579Q4831O8209l3357n1311r511J9646R9251
21519A14097O3173j7533j45178j12324m552L6434P9142O3036L3457J6617j14051
$$ plain form
21603 -55781 26217 95248 109509 53916 19404 77534 141387 146901 138566 82250 13201 26590
21591 26590 59351 10727 4761 37220 -45755 -49476 8289 -55512 -120603 -126731 -195057 -165690
21579 -165690 -152048 -122117 -54300 -39388 -37580 -16773 -23535 -31675 21448 -1105 18406 -25339
21567 -25339 -87731 -154510 -183101 -146886 -100459 -33654 -36089 -12751 6020 14225 -10539 6825
21555 6825 32908 54893 -3377 46689 56717 -23970 -114619 -93123 17066 44012 38799 7247
21543 7247 -17400 148 60350 147973 77752 29700 596 -22748 -76321 -139875 -102690 -15449
21531 -15449 -7471 -70970 -89982 -93240 -63661 21170 89379 56022 4711 -4800 14846 114097
21519 114097 177270 159737 14559 -97765 -102317 -65883 13259 76295 109752 126369 12318
21508A2318l4975J9637k3973l769M6269m5764R2186N7806m1176o5530O710K8941
21496D8680L6406L8313k8280o1659J09754j103k7055l6028l1844n5471k7438K8285
21484g440q0956K158J10785O492o1626R934R5185K2941Q796j08064k7532N4692
21472B5365m1213l9436L4767j1996K2449N80J4520n8200J4767j9820L7033o6079
21460h7263N015R848M315N5563L8474n4451K2251O3707N4111K8178m2761j5291
21448H1696Q1216L634p3425k758j4122j7916k8976O8430L2205L4404l781m7267
21436A13340q5101o0839M1143K5855Q749J9310j3882j6810l8605J9261l0981k2263
21424d0823o1988M8013K530l3243K9187P6920M648j6284l2614m7494m0561L779
$$ plain form
21508 12318 -22657 -3020 -26993 -30762 15507 -30257 61929 119735 78559 13029 19739 48680
21496 48680 85086 123399 95119 33460 143214 142111 115056 79028 47184 -8287 -35725 -7440
21484 -7440 -88396 -86238 24547 31039 -30587 -20653 74532 97473 106269 -1795 -29327 25365
21472 25365 -15848 -55284 -20517 -32513 -10064 -9484 5036 -53164 -38397 -58217 -21184 -87263
21460 -87263 -82248 -72400 -68085 -12522 25952 -28499 -6248 57459 111570 139748 96987 81696
21448 81696 162912 166546 93121 90363 76241 58325 29349 97779 129984 164388 160607 113340
21436 113340 28239 -32600 8543 34398 43147 62457 48575 31765 -6840 12421 -18560 -40823
21424 -40823 -102811 -54798 -52268 -85511 -56324 20596 25244 8960 -23654 -71148 -111709 -107930
21412a07930K275l0020J0809j6952J8885N3683N4474J979O454J563L9379j12723
21400g8124o227O4316L3724K2510K8584J9264q1515l7477L1079o44j2619k5329
21388d2458k9811M3395n7039k832k7500P4428N8515M0454m4439o0899j5494K3997
21376c9683M450J1226l2267M3270J5667j5061k0489m0653O8945p458l8416M3661
21364f808K6524k3110N5113O436n3114K586n4666k9932N5340R0586r040M6058
21352A05973j1932j31592L3750k690k5900L9703O182j3178l4886j7239j4962J0926
21340e5845M0364k7500k5177J2483Q0331M672j23065n2926m2886K5420P5769K8984
21328e9376O4682J0543k9031l1014J439M4667j0855K0234l5979j7614M1066p7013
$$ plain form
21412 -107930 -105655 -135675 -124866 -141818 -122933 -69250 -14776 -12797 -6343 -4780 34599 -78124
21400 -78124 -84351 -20035 13689 36199 64783 84047 2532 -34945 -3866 -4510 -17129 -42458
21388 -42458 -72269 -28874 -85913 -88745 -116245 -41817 16698 57152 12713 -48186 -63680 -39683
21376 -39683 -35233 -24007 -56274 -13004 2663 -12398 -32887 -73540 -4595 -12053 -50469 -6808
21364 -6808 19716 -3394 51719 58155 5041 7627 -47039 -76971 -21631 68955 59915 105973
21352 105973 94041 -37551 -3801 -6491 -32391 7312 13494 316 -34570 -51809 -66771 -55845
21340 -55845 -15481 -42981 -68158 -55675 24656 29328 -93737 -146663 -189549 -164129 -88360 -59376
21328 -59376 5306 15849 -13182 -44196 -42757 1910 -8945 11289 -24690 -42304 -1238 -78251
21316g8251j3437N6338l0646k7583L4361q871K933M9345L725r295J8996m0063
21304d2448n7745M3456K1459R470L4106L6025N3469J6385m5349k4034J7908j434
21292F1268k7802K9808j6195n9051k0084L7551N4809J6398K3853k5129r7215M6668
21280B4879K7920p8629j9408K668j01672L0038N8584O0646Q4669l8823q6702k0024
21268e5854J163o663K3869j6116k7650J12347L0753j8954j5597l768j2299o0269
21256d9038n2200L1752J27615q325j06205N464k697J3224M830m887J9731J5463
21244e273l9521k2990J5127k4540j6588K651J2555J4308P2837K1210j8472m4953
21232c3649r2871m2640J7026J4J5837R0868m4269k2305L5904J0209K165J09232
$$ plain form
21316 -78251 -91688 -35350 -65996 -93579 -59218 -68089 -65156 -15811 -12086 -21381 -2385 -42448
21304 -42448 -100193 -56737 -35278 -25808 8298 44323 97792 114177 68828 44794 62702 61268
21292 61268 33466 63274 47079 -11972 -32056 5495 60304 76702 100555 75426 -21789 24879
21280 24879 52799 -25830 -45238 -42570 -144242 -114204 -55620 5026 89695 50872 -35830 -55854
21268 -55854 -54691 -61354 -37485 -53601 -81251 31096 61849 42895 27298 23530 11231 -49038
21256 -49038 -101238 -69486 58129 49804 -56401 -50937 -53634 -40410 -35580 -40467 -20736 -5273
21244 -5273 -44794 -67784 -52657 -77197 -93785 -91134 -78579 -64271 8566 29776 11304 -33649
21232 -33649 -126520 -169160 -152134 -152120 -136283 -45415 -89684 -111989 -76085 -65876 -63711 45521
21220D5521o120j02992m2350k859n1102o1369R2355J21035L2703m9464o6598P557
21208h3683R682o559P7139J1579J4378r695l1286n1097k038N4101m695p191J8432
21195a0933J6873L1481n8032o2727r666N2620j3664P0329J4476m811K5422P9765
21183A31133l4015j42160p7951M1332J9557L836M6215L3099J539m2259k8236j5927
21171f3837r929n0667l4888K8930j7224k490R022L4621K4268J9432K90R1878K0881
21158E0287m5785o6020n9709j2348L3188J00632N9237n0972j1177L5592J0943
21147D3868J1102J0153k8856n569k4984o9762M9318L7252J0766k0886K617n7283
21135d2264Q1723m4795k6237j03972K4449R6114M9942n5124p6092Q5077P7834
$$ plain form
21220 45521 39401 -63591 -105941 -108800 -159902 -221271 -128916 -7881 24822 -24642 -91240 -83683
21208 -83683 -74001 -80560 -3421 8158 22536 12841 -18445 -69542 -71580 -17479 -22174 -29365 -10933
21195 -10933 5940 37421 -20611 -83338 -93004 -40384 -54048 16281 30757 25946 51368 131133
21183 131133 97118 -45042 -122993 -81661 -62104 -58268 -12053 21046 22585 -19674 -47910 -63837
21171 -63837 -73766 -124433 -159321 -130391 -147615 -150105 -141083 -106462 -82194 -62762 -62472 29406 50287
21158 50287 4502 -61518 -121227 -133575 -100387 245 59482 8510 -2667 32925 43868
21147 43868 54970 65123 36267 30698 5714 -64048 -14730 22522 33288 12402 15019 -42264
21135 -42264 39459 -5336 -31573 -135545 -111096 -14982 34960 -20164 -96256 -11179 66655
21124F6655n7070k5258l7539P1641J1532j9279J1280m7887L3498N2249M5617p4158
21112C1281p3462j5231q5785j7928R7904R4413j3684q2128m9685R6099R8195Q812
21100H8801L742o571Q5807L565n4745j14968j7575K9057O7085j077j42170l7497
21088i6546j1652K7352J7330N8815P9878m4508m1309o0534M687k5877k2586k429
21076a17379J7949L0170K7699m2749m4964J267m0810n7414O4320P6637J9593J844
21064f3837M800M8240J9673n5033K2214M5869j38729j17307m357J12040R2062
21053c4365J14581O7806n0212r9072m7367K0790N4904P912J7611n3394L0423L9533
21041F9150o2775M621Q934m1610K9143k3688l7987J0011K49L2728P939l9241k0112
$$ plain form
21124 66655 9585 -15673 -53212 18429 29961 10682 21962 -25925 7573 59822 105439 31281
21112 31281 -42181 -57412 -143197 -161125 -63221 31192 17508 -64620 -114305 -18206 79989 88801
21100 88801 92543 85972 171779 175344 120599 5631 -11944 17113 84198 83121 -59049 -96546
21088 -96546 -108198 -80846 -63516 -4701 75177 30669 -10640 -71174 -66487 -92364 -114950 -117379
21076 -117379 -99430 -69260 -41561 -84310 -129274 -128007 -168817 -226231 -161911 -85274 -65681 -63837
21064 -63837 -59037 -10797 8876 -46157 -23943 21926 -116803 -234110 -238467 -126427 -34365
21053 -34365 80216 148022 97810 -1262 -48629 -27839 27065 34977 52588 -806 29617 69150
21041 69150 6375 10996 19930 -21680 7463 -16225 -54212 -44201 -43952 -11224 -3285 -42526 -62638
21028f2638k8843K1854K4903L5612m1115J6464j2854m1077M2688N3041k7777r871
21016b9613J0496N0020K3279J9846j8144K7590K1133l6535k5397M1331j329J5561
21004I8238k7714M1056K2882M0251j9874n2918l1455m521J0902J7492K1196j6637
20992I8898J6986m75o139L3638q8625l3304j3218p3290m0090k98M2037K1161K9620
20979a3099K3196N9986k4284j7392K5071K2615q4378k4938j2938J7619l6800n3066
20967a18408k8328J26346O0489m8179n677m2876n3783M9l7733j1124N9159L5089
20955f4976K7788O7475O2143P2562l611n6086O43n3990j03091J7216M544L7390
20943H007j8755K1363L9024K6798l5186J955J3942Q2341k9412m8687l9825j8541
$$ plain form
21028 -62638 -91481 -69627 -44724 -9112 -50227 -33763 -46617 -87694 -45006 8035 -19742 -29613
21016 -29613 -19117 30903 54182 74028 55884 83474 104607 68072 42675 84006 82677 98238
21004 98238 70524 111580 134462 174713 154839 101921 70466 65945 76847 94339 115535 98898
20992 98898 115884 115409 109270 142908 54283 20979 7761 -65529 -105619 -105917 -63880 -42719 -13099
20979 -13099 10097 70083 45799 28407 53478 76093 -8285 -33223 -46161 -28542 -65342 -118408
20967 -118408 -146736 -20390 40099 -8080 -13757 -56633 -110416 -110367 -148100 -159224 -100065 -64976
20955 -64976 -37188 30287 92430 164992 161381 105295 105938 51948 -51143 -33927 -29383 8007
20943 8007 -10748 10615 49639 76437 41251 43206 57148 139489 110077 61390 21565 3024
20931C024K0385m8310L8093N885j5965j8645l5454k1713j0680P2074L6848K3266
20919D8808q8848j9092m152O5897O2104J7061n4903K7336J00798n5034o4620j3356
20907B1999j0545j00764k487O0735j565j1076o012K8320N1671N8309q4028j44249
20895a39692k2113R1857R7234k5285p7634l0121M213J07055M4050l5372q9469
20884g5277m7181R386O5800M9626K8470l8015M0519Q711k4319o3339l9464O0781
20872b4302K5243k702k0317K997Q3397P8327k4236J4528k6499l9956o3860l9827
20860c7207J7710M9776K542l0768P517k8940o3547K4696n081J5449O3633Q966
20848B4746n1281k2824N4512N1333O4322j03427o7177M8825P5282m5354K0657
$$ plain form
20931 3024 23409 -24901 13192 19077 3112 -15533 -50987 -72700 -83380 -11306 25542 48808
20919 48808 -40040 -59132 -63284 2613 64717 81778 26875 54211 155009 99975 35355 21999
20907 21999 11454 -89310 -91797 -31062 -32627 -43703 -49715 -21395 30276 88585 4557 -139692
20895 -139692 -161805 -69948 27286 2001 -75633 -105754 -101541 5514 49564 14192 -75277
20884 -75277 -122458 -113072 -47272 2354 30824 -7191 33328 42039 17720 -45619 -85083 -24302
20872 -24302 941 -1761 -22078 -19081 64316 142643 118407 132935 106436 66480 2620 -37207
20860 -37207 -19497 30279 32821 2053 9570 -19370 -82917 -58221 -63302 -47853 15780 24746
20848 24746 -26535 -49359 5153 56486 120808 17381 -49796 -971 74311 28957 49614
20837D9614l6473o6271N1426M029Q639n3869l9568p0312M2674j4030J0329P8101
20825c5711J2493O852K1900k4604n3478N3394m7693q5904K185N8667n1010L402
20813a39507O0133J01659P799j01853j04329j8898L2617J15985K7282N753L8351
20802B4992N7220L366M4814o7255j49835q1796M3801K6316j1967j4890R5272J08
20790b9854L66J4785M1394P4279j8355j4845P441P322l5421K5334K0592p2043
20778B0995l7582N992o2633J0174N8187J4967p3139m6813K6707K4253P699k987
20766e4180P8796L2221q177l710q5059j7876J9664j0148O4441Q146j2637k9075
20754a7594p99o2141n3457j5268N8346O3487N975m7185J266j7523p5673j8896
$$ plain form
20837 49614 13141 -53130 -1704 2325 10964 -42905 -82473 -152785 -110111 -124141 -113812 -35711
20825 -35711 -23218 -16366 5534 -19070 -72548 -19154 -66847 -152751 -150566 -91899 -142909 -139507
20813 -139507 -79374 22285 30084 -71769 -176098 -194996 -162379 -46394 -19112 -13359 24992
20802 24992 82212 85578 130392 63137 -86698 -168494 -124693 -98377 -110344 -125234 -29962 -29854
20790 -29854 -29488 -14703 26691 100970 82615 67770 75211 82533 47112 72446 93038 20995
20778 20995 -16587 -10595 -73228 -63054 -4867 10100 -63039 -109852 -83145 -58892 -51193 -54180
20766 -54180 24616 56837 48660 44950 -40109 -57985 -38321 -48469 15972 24118 11481 -17594
20754 -17594 -18393 -80534 -133991 -149259 -90913 -27426 -21451 -68636 -67370 -84893 -160566 -179462
20742a79462M8700K836o567M3063N5695J4897m5229K2996O6963J4956M2791M1861
20730A23500O239r5993J2918N6304n1804J4970l3391K8743M4029L9756L9168O9592
20718B54031o6535q2066k394m9191k7837n7756L4151L0639j1198N9148q993j5538
20706E6461K2610m9128m0660l6457n282K9428O9588Q4320n6758n2720k9594O029
20694b163n5276j0957R231K7018J1o6118N3984M7754L5875M584m9353l5304l092
20681d3806k5890L9342J3821j9271k5706M6513M2165o2528o7888j7817Q40L6047
20669h4178M88l7618N6556J3312k1111m6377M9795P2748L3250m1678l0468k543
20657c7824j8511l2756J6710M813K1419K4508M0367n1196M453K3529k3265o9280
$$ plain form
20742 -179462 -130762 -127926 -134493 -91430 -35735 -20838 -66067 -43071 23892 38848 81639 123500
20730 123500 129739 33746 46664 102968 51164 66134 32743 61486 105515 145271 184439 254031
20718 254031 187496 105430 103036 53845 26008 -31748 2403 33042 21844 80992 71999 56461
20706 56461 79071 29943 -10717 -47174 -52456 -23028 46560 130880 74122 21402 -8192 -2163
20694 -2163 -57439 -68396 -59165 -32147 -32136 -98254 -44270 3484 39359 43943 -5410 -40714 -43806
20681 -43806 -69696 -30354 -16533 -35804 -61510 -14997 27168 -35360 -103248 -121065 -120225 -84178
20669 -84178 -83690 -121308 -64752 -51440 -72551 -118928 -69133 3615 36865 -4813 -35281 -37824
20657 -37824 -56335 -89091 -72381 -67568 -46149 -21641 18726 -32470 -28017 -4488 -27753 -97033
20645i7033M5252l6490p433J6329J6160r773O7602R215l8332J3053M8461M7842
20633G4853j6368k6339m7137l1538m6177J4719M7574l2165o2915L365O9821M9329
20621b978K3511o7597o1409k0593O2306j4696j1628q732J6920M8609K9723k2770
20609b9334o5434J9650n0341l4574N728P9341Q5064M9353n5878k3516n3173j3645
20597h6759k542k4740O5403Q1041P796l9677m0711k7044O642m2722K321N0458
20585e0534l4999J4129J05784J14756k2296l0244r1792n5948M6713k3831n6203
20574h4465j60222k6011J30125R1205L4302M3194O6468N5953n8528j15222n1242
20563g4443P9638L1056j659L084k7320N878P1175J01115K800k0213j44956r8628
$$ plain form
20645 -97033 -51781 -88271 -95704 -79375 -63215 -72988 -5386 3829 -34503 -21450 27011 74853
20633 74853 58485 32146 -14991 -46529 -92706 -77987 -30413 -62578 -125493 -122128 -52307 -2978
20621 -2978 20533 -47064 -108473 -129066 -66760 -81456 -93084 -101816 -84896 -36287 -6564 -29334
20609 -29334 -94768 -75118 -125459 -160033 -154305 -74964 10100 59453 3575 -19941 -73114 -86759
20597 -86759 -89301 -114041 -48638 32403 40199 522 -40189 -67233 -60591 -103313 -100992 -50534
20585 -50534 -85533 -71404 34380 149136 126840 96596 4804 -51144 -4431 -28262 -84465
20574 -84465 -244687 -270698 -140573 -49368 -15066 28128 94596 150549 92021 -23201 -74443
20563 -74443 5195 36251 34592 37676 10356 16234 87409 188524 191324 171111 26155 -72473
20551g2473J2472K328k1432R431J6731j8074o5835P5357O2058l1713k3965P3914
20539A8799M5307j05732M3228M5173L439K485j5403k7621K6880m4455l2660L3931
20527f629L7946Q2404L3519q2930k0562K9319j2361L103o9432q803N0804O703
20515D3081J6429l0592O3332N2980n7542m4405l6453p7840j5662K295l3951J9556
20503i8772L5096l0599K3509O3740N8770j3581K9709K978j4583m1348j1526n4650
20491e1257J4257l8997J1464Q4230o615r0503K2792N3167k6298l9293j087L6347
20479c1793O5825l0428m0126r739L0389n0725m1129M3365k396j0637j9587J18221
20467B1240L9603M1408k7695j18286o9483M3485j8607L7223L4244K5297J1583
$$ plain form
20551 -72473 -60001 -57673 -79105 -69674 -52943 -71017 -136852 -61495 563 -31150 -55115 18799
20539 18799 64106 -41626 1602 46775 50214 52699 37296 9675 36555 -7900 -40560 -6629
20527 -6629 31317 113721 147240 64310 43748 73067 60706 63809 -5623 -14426 36378 43081
20515 43081 59510 28918 92250 145230 87688 43283 6830 -71010 -86672 -84377 -118328 -98772
20503 -98772 -63676 -94275 -70766 -7026 51744 38163 67872 70850 56267 14919 3393 -51257
20491 -51257 -37000 -75997 -64533 19697 13082 -77421 -54629 -1462 -27760 -67053 -68140 -31793
20479 -31793 34032 3604 -36522 -46261 -15872 -66597 -107726 -64361 -66757 -77394 -96981 21240
20467 21240 60843 102251 74556 -43730 -113213 -69728 -88335 -51112 -16868 8429 20012
20456B0012l4272n636J4086m1335q1442K639L5093P6107K1835o697l9041k2294
20444f0945R5292P97J9871l6913j09821k3004j6122L9124L2987l5529M8705L5623
20432i935p24O2606o000P188K4986q4927q4281j14378l7943O9720J98130N6651
20420H1093O031n3661p0189K8270R789k529K1795K115J3680k8319m4583n5370
20408i1878j2897L2969K7811L8759r145m1003J9193L1911q7062k0738P0277L840
20396c7963J9129J1282k2325m6464k5760K8959O1832M8866r1404k9158P0876O3542
20384E1412q184L9401J1461o4350k4595L2791K1411m1493o5406o4425n5442k1154
20372a88573J03600P0664J026R205p4452K7010J01883K9926M7185J9648q1777
$$ plain form
20456 20012 -14260 -19896 -5810 -47145 -128587 -125948 -90855 -14748 7087 390 -38651 -60945
20444 -60945 34347 35144 55015 18102 -91719 -114723 -130845 -91721 -58734 -94263 -45558 -9935
20432 -9935 -10659 51947 45947 53135 78121 -6806 -91087 -205465 -243408 -173688 24442 81093
20420 81093 87124 33463 -36726 -8456 1333 -1196 20599 22714 36394 8075 -36508 -91878
20408 -91878 -104775 -71806 -43995 -5236 -14381 -55384 -36191 -4280 -91342 -112080 -41803 -37963
20396 -37963 -18834 -7552 -29877 -76341 -102101 -73142 -11310 37556 -53848 -83006 -12130 51412
20384 51412 43228 82629 94090 29740 5145 37936 59347 17854 -47552 -111977 -167419 -188573
20372 -188573 -84973 -14309 -13283 -4078 -78530 -51520 50363 80289 127474 147122 65345
20361F5345q9484p2705L4235k4581o8878L3619O7886j0757o473K7375p847N0444
20349a821L6497o3285L5353J3273k6193J67J0530j9075L347L4585p2450k7250
20337g6322M1976j5591Q855N8677M0453m986R971l1898O3235n7710K458P575l3261
20324A3432J81m9837K1854L4679N1074L0541J7208J0419r826o8754m568j0495
20312C5908L9562O858j0336o4338k4962L2740M0011n8121m7406J9044R690m0497
20300f1847q0884J301J9337j395K0869N7153N6481o3368m4791M1350M5339M0000
20288B9545m78M3234L6547l2726l2021k4103k2999O4268o3393L8141k813j2290
20276B0912j0475P5004L1435p4885o909K5870K6517J3362q02K4967p2588N911
$$ plain form
20361 65345 -24139 -96844 -62609 -87190 -156068 -122449 -54563 -65320 -71793 -44418 -52265 -1821
20349 -1821 34676 -28609 6744 20017 -6176 -6009 4521 -14554 -11207 23378 -49072 -76322
20337 -76322 -34346 -49937 -41082 17595 58048 53062 63033 31135 94370 36660 39118 46693 13432
20324 13432 13613 -36224 -14370 20309 71383 101924 119132 129551 119725 50971 46403 35908
20312 35908 75470 82328 71992 7654 -17308 15432 55443 -2678 -50084 -31040 -21350 -61847
20300 -61847 -142731 -141430 -122093 -123488 -102619 -45466 11015 -52353 -97144 -55794 -10455 29545
20288 29545 29067 72301 108848 76122 44101 19998 -3001 61267 -2126 36015 33202 20912
20276 20912 10437 85441 116876 41991 35082 60952 87469 100831 100029 124996 52408 58319
20264E8319q3026K9600l4506r454N2788L1915m4524Q2715J01296n1346j10343
20253B3434Q9M7644k7798m6933R399K1993K8067j6838o2713r1589m7949Q7527
20241g5667R1452K8550m1618j15086J10493Q7801l1853j58960k2327P9763M2464
20230d988l9233n9696m4552j8880M6247Q8569k966m6561L5727O287n9834q574
20218a08454N6681J2286k5984L2030k646m9676N8287N5797m871k5354l8736K9902
20206a0738j1020p175l8625j1168J2130L781N4033N1758K1995k2883k977J6192
20194E5303n5468r5544N818J4706R46J18086m693m4643N5481q0863r077P8123
20182C8175O6305L503m1228m2456p4569l6638n853M1479l6324O108j3391J17860
$$ plain form
20264 58319 -24707 4893 -29613 -39067 13721 45636 1112 83827 185123 133777 23434
20253 23434 23523 71167 43369 -3564 5835 27828 55895 39057 -23656 -115245 -163194 -75667
20241 -75667 15785 44335 2717 -112369 -1876 85925 54072 -104888 -127215 -47452 -4988
20230 -4988 -44221 -103917 -148469 -167349 -121102 -32533 -35499 -82060 -46333 -40046 -99880 -108454
20218 -108454 -51773 -39487 -65471 -33441 -36087 -85763 -27476 28321 23450 -1904 -40640 -10738
20206 -10738 -21758 -28933 -67558 -78726 -66596 -62815 -8782 42976 64971 42088 39111 55303
20194 55303 -165 -95709 -89891 -75185 -74239 43847 39154 -5489 49992 -30871 -39948 38175
20182 38175 104480 107983 66755 24299 -50270 -86908 -92761 -51282 -87606 -81498 -94889 22971
20170B2971Q5899K5283Q759j0696q2909N056P7853k2808p7870n8605n296O1278
20158B8915j8953l8842l0960Q8828k7663m8809K9174J1240K0130n8193J4782J31534
20146A01183M7947o1766l0349q4588k3304L3779L5965R1065L4879j36194K3K9627
20134C8267J1259K0269l9088m1545p9185k0419J08711L4028N6002J9703o5650
20123D2352j20088j16778M6752J00879Q2555k266j4427k948M1161Q8775K4403
20112A70370r1740q817k4253n8259Q565R266J1339O2201o1541m6513N4576Q8054
20100A13248m2871k9377M2483J46N684j5144r733n2897k9814j6217L7421l9831
20088c6902k4285n5239n7243L6318L4725R3291N9752O198K0034l1181n6147J7327
$$ plain form
20170 22971 108870 134153 142912 132216 49307 54363 132216 109408 31538 -27067 -32363 28915
20158 28915 9962 -28880 -59840 28988 1325 -47484 -18310 -7070 13060 -45133 -30351 101183
20146 101183 149130 87364 57015 -27573 -50877 -17098 18867 109932 144811 8617 8640 38267
20134 38267 49526 69795 30707 -10838 -90023 -110442 -1731 32297 88299 108002 42352
20123 42352 -77736 -194514 -147762 -46883 35672 33406 18979 16031 57192 145967 170370
20112 170370 78630 69813 45560 -12699 -4134 5132 16471 78672 17131 -29382 25194 113248
20100 113248 70377 41000 83483 83629 89313 74169 64436 11539 -18275 -34492 2929 -36902
20088 -36902 -61187 -116426 -173669 -137351 -102626 -9335 50417 56615 76649 45468 -10679 6648
20076F648k3857k9183j6435M6l4064l1301O7207P1793L4625l1751q2159l2427
20064a00858J9610j0682j660m7796K4971J5501J18392Q9764j5198j24346J247
20053c1055J4725j6031j2603K7802K3521L1456L2230M2919k7171r5439J3802P5182
20041G9338O787l4805L9892q5966K963L3707m7947r795N8503N324j993n074Q05
20028D1739M3778J8753k151q5058m5787M7826M4793Q9633n6632p4687m4991k0345
20016d3129N943K5625n983o7973P4030K2272N7468j4560j5750k2417q489L1364
20004C8401q299l3733j0369l1062R3332L4299q516M0741m303M305j4766n6708
19992D3322n9447K9378P28o1784j3444o4866Q2792O6479O960n552P5232N2814
$$ plain form
20076 6648 -17209 -46392 -62827 -62781 -96845 -128146 -60939 10854 45479 13728 -68431 -100858
20064 -100858 -81248 -91930 -93590 -141386 -116415 -100914 17478 107242 92044 -32302 -31055
20053 -31055 -16330 -32361 -44964 -17162 6359 37815 70045 112964 85793 -9646 4156 79338
20041 79338 86125 51320 91212 5246 8209 41916 -6031 -15826 42677 48001 46008 40934 41739
20028 41739 85517 104270 102119 17061 -28726 19100 63893 153526 96894 22207 -22784 -43129
20016 -43129 -37186 -11561 -17544 -85517 -11487 10785 68253 53693 37943 15526 7037 38401
20004 38401 30102 -3631 -14000 -45062 48270 82569 74053 114794 110491 114796 100030 43322
19992 43322 -16125 13253 13981 -47803 -61247 -126113 -43321 23158 30118 24566 99798 152612
19980A52612m5128m6261l5297o7897M0769N2735m3052n5673l787r913k111j0131
19968g3134K3542j3562P496M660K2179Q1271M674n4371l9431R5322M6200k2000
19956H2846O920l3758r7733k7495O9490j849N8862K0531k0499K728n5986k9640
19944b5583L5271J34243O0239o7492n9562j0627l0634O161j5233P916L7517M158
19932G6374r0414J9304O1579k4711p9527Q460K9815j3433q2426n6062l4180L2815
19920a52406M7266L0456o2923j948R0522R3098L7036N562P053l3089J30L1804
19908I2561m653j5323o3407J4465n5418n869P8179l2714j4257j9015J7295o649
19896a4805K1286K3172k5147j424L311J9504P0855L3298K8631n6223r4451n4850
$$ plain form
19980 152612 107484 61223 25926 -41971 -1202 51533 8481 -47192 -50979 -60892 -63003 -73134
19968 -73134 -49592 -63154 -55658 -50998 -28819 52452 57126 2755 -36676 58646 104846 82846
19956 82846 89766 56008 -41725 -69220 270 -1579 57283 77814 57315 60043 4057 -25583
19944 -25583 9688 143931 204170 136678 77116 66489 35855 42016 26783 34699 72216 76374
19932 76374 -14040 5264 66843 42132 -37395 -28935 880 -12553 -94979 -151041 -185221 -152406
19920 -152406 -105140 -74684 -137607 -139555 -49033 44065 81101 86663 93716 60627 60757 92561
19908 92561 87908 72585 9178 23643 -31775 -37644 40535 7821 -6436 -25451 -8156 -14805
19896 -14805 6481 29653 4506 3082 6393 25897 96752 130050 158681 102458 8007 -46843
19884d6843M4653R7518K630q5708j5727M2937J9007k9923o8149o040L4805l0998
19872d1838L8761N8496J7621j5647K1185n305j14325l625J17050L2848k3629J9502
19860A01094n0099O1534j2245p2668R239k0976j9551N3580M0161k8201o6446l0997
19848c5575j9233J780N165J7619K6695J6500J5408L3339j8109L9683R5305K4761
19836B03338j16444K888N4764k1096n6259k1704q396q949q350N5851K2204J04223
19824B02070M2712p3632k0641J3820o647k742l564n0291r7291N659O1113K68l8985
19811C1849l1821l7902K1670P810K4471M248J4498q5181l0690P6727O1298p1087
19799a4110m9087J267O4079J5873o990l9970l3048L0290M8281L9948r146p6885
$$ plain form
19884 -46843 -2190 95328 97958 12250 -3477 39460 58467 28544 -39605 -45645 -10840 -41838
19872 -41838 -3077 55419 73040 57393 78578 73273 -41052 -44677 72373 105221 81592 101094
19860 101094 50995 112529 100284 27616 36855 15879 -3672 49908 90069 61868 -4578 -35575
19848 -35575 -54808 -53028 -47863 -30244 -3549 12951 28359 61698 43589 83272 178577 203338
19836 203338 86894 89782 144546 123450 67191 45487 37091 28142 19792 75643 97847 202070
19824 202070 244782 171150 150509 164329 157682 154940 151376 101085 3794 9453 70566 70834 31849
19811 31849 28 -37874 -16204 -8394 16077 20325 34823 -50358 -81048 -4321 56977 -14110
19799 -14110 -63197 -61930 2149 18022 11032 -28938 -61986 -31696 16585 56533 47387 -29498
19787b9498N6057K7864n5425m8359J5193N6367k0271l2855l476R6600P4661j2132
19775A24726o4155n2476j29142k9453J06477J05751k9668k1864M6329M7780R0408
19764A94713L2823j7776K2081j8129k5159L0035l3891o1020l7391k2144O4351
19753A28493j1236m0088J5534P8893J9276N70n0391o531m0138m7810Q671M0916
19741I6159K339M0011K8469p2902k4586J4191M1383k4079r5371J21097K0100M6770
19729A93581K9241J611R9613R2660J25120J35816J98371J86324L09838Q9563m1080
19718A420658O1392J8660j49214k81544k70411j87321r9300Q754P8930l509O0286
19707F57381K54478L29357K05897k6714r1964J0410Q1682j67279l29161k53799
$$ plain form
19787 -29498 26559 54423 -1002 -49361 -34168 22199 1928 -30927 -34403 62197 136858 124726
19775 124726 60571 8095 -121047 -150500 -44023 61728 32060 10196 56525 104305 194713
19764 194713 227536 209760 231841 213712 188553 218588 184697 123677 86286 64142 128493
19753 128493 117257 77169 92703 171596 190872 191442 141051 134520 94382 46572 55243 96159
19741 96159 98498 138509 166978 94076 69490 83681 125064 100985 5614 126711 146811 193581
19729 193581 222822 224433 324046 416706 541826 677642 876013 1062337 1372175 1461738 1420658
19718 1420658 1482050 1500710 1351496 1069952 799541 612220 512920 521674 600604 597095 657381
19707 657381 911859 1241216 1447113 1420399 1328435 1338845 1420527 1253248 924087 670288
19697F70288j64966j37115j19896k4133J6219O5511K7913o868m8927k2863m1079
19686B14084m5528l3015n2192n4675N7752L8594R138L0938Q794r3044j6213O217
19674G0850J0774o1547r411N9445J7434J1314K008j3327k4382l1518L5412m0019
19662B7033k2593j3906O151P1134r977J4172r323k8079O9223R2880m5624m9131
19650A01960J4314o435m050m5134K9546j0593j0418j5225N236p650K3955m9325
19638B6181K4797R891L9204J2041r2997k4976K1830K6694R5529q177j1723K2143
19626A40437Q2672j0408K6617m799J3632J0887n4411j07410p0699j2581l3046
19615a9109l9719k1489m0715O8018N9419j6171R021J7948N2406M2672j9564n5818
$$ plain form
19697 670288 505322 368207 248311 224178 240397 305908 333821 326953 278026 255163 214084
19686 214084 168556 135541 83349 28674 86426 125020 134158 165096 173890 80846 64633 70850
19674 70850 81624 20077 10666 70111 87545 98859 100867 87540 63158 31640 67052 27033
19662 27033 4440 -9466 -3315 67819 57842 72014 62691 34612 103835 196715 151091 101960
19650 101960 116274 109839 105789 60655 90201 79608 69190 53965 59201 51551 75506 26181
19638 26181 50978 60869 100073 112114 19117 -5859 15971 42665 138194 130017 118294 140437
19626 140437 223109 212701 239318 234519 248151 259038 204627 97217 26518 13937 -19109
19615 -19109 -58828 -80317 -121032 -53014 6405 -9766 -745 17203 69609 112281 92717 36899
19603C6899k4628k5464j7226N1914n8485j9769J1472k737l709l8299M1244N5989
19591G201j4664J6594R0232K0114m7075n647M6118j8656k7467j4894N316J1870
19579F9042N4165N1599n8023q3850j2377L2868J23325j7054o2773K6364O1445
19568A84731m7783m1875J2452P3403j0972K2606O4063K1221n3460p7175j8594
19557A28617m0769O110N3429L9523L8650j28203m2948M4593K104K1715P6868J5089
19545B14778j4940K5327L3322L6594j7453p8913n7847q9267k001l5786j0783L4335
19533C7366L2204L4757O3588O0626j231j6778p8303P958O1713N900j9408j8048
19521A70344M8504o7132q8793m8159J09259L8423J5836j3630Q860m1996m8287
$$ plain form
19603 36899 12271 -13193 -30419 21495 -36990 -56759 -45287 -48024 -51733 -90032 -48788 7201
19591 7201 -7463 9131 99363 119477 72402 66755 112873 94217 66750 51856 57172 69042
19579 69042 123207 174806 116783 32933 20556 53424 176749 159695 96922 123286 184731
19568 184731 136948 95073 107525 180928 169956 192562 256625 277846 224386 147211 128617
19557 128617 87848 93958 147387 186910 225560 97357 54409 99002 101106 122821 199689 214778
19545 214778 199838 225165 258487 295081 277628 198715 140868 51601 49600 13814 3031 37366
19533 37366 69570 104327 167915 228541 227310 210532 132229 140187 201900 207800 188392 170344
19521 170344 218848 151716 62923 14764 124023 162446 178282 164652 173512 131516 83229
19510H3229o1570n2618L2337O4779M1909P645J023m4719k9650j928k104M6317
19498H4650P3810P4329m3800m1546o6305L5697p734l1283Q9400p241l0823K7019
19486A56173m2529m123l8221M5072Q893m3840j4936N5509J07126J9161n2858N1468
19474B46895K5483n9283r4152k7136J1776L1978K4064J8855q0360q5548P4724
19463H7296N1823J9104K6234O4836M004n1573p7999N9542M830J481P2212N3904
19451C15694m2683M8720k3172j11701o9309J8602L1130K2502j7142K2383o690
19440A88334l7120p342j1558J414K9315M8830o2699p520J2981M2739k9161j238
19428A66975j962K0296P6163R2220J13567j6524J5075K4902O463K1849L1720M4501
$$ plain form
19510 83229 21659 -30959 1378 66157 108066 115711 116734 72015 42365 40437 38333 84650
19498 84650 158460 232789 188989 147443 81138 116835 109101 77818 167218 159977 129154 156173
19486 156173 113644 109521 71300 116372 125265 81425 66489 121998 229124 248285 195427 246895
19474 246895 272378 213095 118943 91807 103583 135561 159625 178480 98120 12572 87296
19463 87296 139119 158223 184457 249293 253297 201724 123725 183267 188097 189578 261790 315694
19451 315694 273011 321731 298559 186858 117549 136151 167281 189783 172641 195024 188334
19440 188334 151214 143872 132314 133728 163043 211873 149174 141654 154635 197374 168213 166975
19428 166975 165013 185309 261472 353692 467259 450735 465810 490712 497175 519024 550744 595245
19416E95245L2601J47515J77350J55926K72989J66282n9291q7091N5658q4333
19406A372851j65940q6411J2873O0178R3597J41040O5206J9604j1055r9303p5085
19395A327555j54769j88559r4040r2690j50590n4295l3139l6144n4593N6479M149
19384E29364m8114P5665M9594o6634p0203j23220j01343o5243o274J08357N3254
19373C35203P5162O2218O8717L1504n7542m6555J5233n4437j00200n5989p8414
19362A94900L5286J8212N9486O7748m0794r2006L7369J16805K9329r2541p4274
19351B59520k5080M096l4674o5116K7708R0776O1688L7501N0082j6231M7756o1814
19339C76212j19453j9339N8304O7797K6118P507p7467Q817P8011K6270p2946j0342
$$ plain form
19416 595245 627846 775361 952711 1108637 1381626 1547908 1488617 1401526 1457184 1372851
19406 1372851 1206911 1120500 1133373 1193551 1287148 1428188 1493394 1512998 1501943 1402640 1327555
19395 1327555 1172786 984227 890187 797497 646907 592612 559473 523329 468736 525215 529364
19384 529364 481250 556915 606509 539875 469672 346452 245109 179866 173592 281949 335203
19373 335203 410365 472583 541300 572804 515262 468707 483940 429503 329303 273314 194900
19362 194900 230186 248398 307884 375632 334838 242832 280201 397006 426335 333794 259520
19351 259520 234440 238536 203862 138746 166454 257230 318918 356419 406501 390270 438026 376212
19339 376212 256759 237420 295724 363521 389639 397146 319679 328496 406507 432777 359831 349489
19327C49489P5723q3464m1531r7884j21810L4013k1864O9379P5340n870l2350
19316A99171N9753o119n7086M6860J33296O9080p514o6743j6430q321j31384q5124
19304A29439o924K2057j4124M6124J2029k3963L3273M398N4773J7116J1167P3178
19292C58543M4179j02866o6723J308L8453J9024K2313K1384oN0105N1907M2066
19280D79687O497j5804O0036j9029m1085p1351o2510j0940O3P9985m6207O1564
19268D20906P8082k9092K1132Q0050k2686m6065M7245Q1635l6482j22496q6390
19257C85839O9595N6928j00518M4992L0296Q818K0125M5910N6847O2053J08294
19246G89179L8693N8316m2609l5270J04351K49651J21405J54676L09677J70112
$$ plain form
19327 349489 425212 341748 300217 202333 80523 114536 92672 162051 237391 231521 199171
19316 199171 258924 252805 195719 242579 375875 444955 437441 370698 354268 345947 214563 129439
19304 129439 122515 144572 130448 176572 188601 164638 197911 202309 257082 274198 285365 358543
19292 358543 402722 299856 233133 234441 272894 291918 314231 335615 335609 385714 437621 479687
19280 479687 486184 470380 530416 511387 470302 398951 336441 325501 325564 405549 359342 420906
19268 420906 498988 469896 491028 571078 548392 502327 549572 631207 594725 472229 385839
19257 385839 455434 512362 411844 456836 487132 495950 516075 561985 618832 680885 789179
19246 789179 827872 886188 843579 808309 912660 1162311 1283716 1438392 1748069 1918181
19236A918181l1948j49016j42381j07767j45331j08160q667j7804o0641l795N7081
19225A199752J08844K78427K14343K60664M2388n7933q8233o6440p1082p2824
19215A747906n0556q9792j12180j97048j33477r4510L8013M7743N9257J1877j3875
19204A213358k4155j5326L9771m9186l8849Q9100J91586J29385O9023K2309L5578
19193A662594O5791K4260r3597m8157k7421P5329P7060O7045J15194K78991L73671
19182B570760K72225K93586K25378M0267m2924o4616M325J57723K88989N26592
19172D272305Q12876Q26054M60066K4661J22685L10745J9010m88926n12946l26893
19162E519637p4349K20832O02509Q64276Q54199P94826Q37556Q58972M95491j24364
$$ plain form
19236 1918181 1886233 1737217 1594836 1487069 1341738 1233578 1224911 1207107 1146466 1142671 1199752
19225 1199752 1308596 1587023 1801366 2062030 2104418 2046485 1958252 1891812 1820730 1747906
19215 1747906 1697350 1607558 1495378 1298330 1164853 1070343 1108356 1156099 1215356 1227233 1213358
19204 1213358 1189203 1173877 1213648 1164462 1125613 1214713 1406299 1535684 1604707 1627016 1662594
19193 1662594 1728385 1752645 1659048 1610891 1583470 1658799 1735859 1802904 1918098 2197089 2570760
19182 2570760 2842985 3136571 3361949 3402216 3359292 3294676 3299001 3456724 3745713 4272305
19172 4272305 5085181 5911235 6371301 6395962 6518647 6829392 6848402 6359476 5846530 5519637
19162 5519637 5445288 5666120 6268629 7132905 7987104 8781930 9619486 10478458 10973949 10849585
19152A0849585k52090n2569K9663p0790Q1795N58580J011210J373921J924169
19143A5453474K258894K647523L111831L730815N110810P389511J1206596J7779108
19135F8688562K9526782M8066405O7740665O0143446N526417j7943585J0691397
19128B72440089J9801062l2163305p1972762n6043819l1833588j5613788m752454
19121G9861435M178617J4547080K9745246N0550484O8056638M7842200j0257643
19114B84524057j8084795J3514103Q829556n0421860p5989662n4426776l2204843
19107G5739780j8963426j1608142p762251n864079m552261l221973k423158k340585
19099A9003905k375545k115497j643531j241057j078092r59564o91955m16660
$$ plain form
19152 10849585 10597495 10544926 10574589 10503799 10585594 11144174 12155384 13529305 15453474
19143 15453474 17712368 20359891 23471722 27202537 32313347 39702858 50909454 68688562
19135 68688562 98215344 146281749 214022414 274165860 279692277 261748692 272440089
19128 272440089 292241151 260077846 188105084 132061265 100227677 84613889 79861435
19121 79861435 84040052 98587132 128332378 178882862 246939500 294781700 284524057
19114 284524057 266439262 279953365 288782921 238361061 162371399 107944623 75739780
19107 75739780 56776354 45168212 37405961 31541882 26989621 23767648 21344490 19003905
19099 19003905 16628360 14512863 12869332 11628275 10550183 9590619 8898664 8482004
19091H482004j63739Q8152l3014m00871m70008k94188k08757m83815q65618p72288
19081D877858m98114l44834k47674k64069k39442k06086j58943j54240n8306m1580
19071B664570o9367j35423j10769n0606j47148j42368r1629m1561J4092n604o4203
19060A819984Q332m3134j11003n3150k5504m4821n5688k7635o6595j04884o2919
19049A232983j05860p7326p7563o0572O480Q6441j3164j00493m1897N2814J02817
19038A004660M5962O007m2637j05355j0303N5736M3187n7799j01793p0725M580
19027G71520k8765j4421L1375Q6758K6580N8277o2886q9565M275J0880p6221j05183
19015F12624o2397O0220P1818N9015O5849q691k6106j4741l7348L5117K3018p9871
$$ plain form
19091 8482004 8318265 8406417 8373403 7972532 7502524 7208336 6999579 6515764 5650146 4877858
19081 4877858 4379744 4034910 3787236 3523167 3283725 3077639 2918696 2764456 2706150 2664570
19071 2664570 2595203 2459780 2349011 2298405 2151257 2008889 1917260 1875699 1889791 1884187 1819984
19060 1819984 1828316 1785182 1674179 1621029 1595525 1550704 1495016 1467381 1400786 1295902 1232983
19049 1232983 1127123 1049797 972234 911662 918142 1004583 991419 890926 849029 901843 1004660
19038 1004660 1050622 1056629 1013992 908637 898334 954070 997257 939458 837665 766940 771520
19027 771520 742755 728334 759709 846467 873047 931324 868438 778873 783148 794028 717807 612624
19015 612624 550227 610447 682265 741280 807129 798438 772332 757591 720243 755360 778378 698507
19003F98507r359P1679N9191p535o4201k3420J9843L5950P088O3884O3086J12896
18991A027609P6477n7958q7372m5640j2891l7982J5243J6014q727L1951o980J1786
18979I21530M6868J7328n2036k0914P9775M4753k149j7594N1192j5799N404M302
18967A062660j15078r1752n0501m4991o8539M814N2663m4618M5754Q2114n740
18956H26786p3613m5347N0397Q6458j487K1617P098K2991r725P951O5507J8359
18944I76992L2085R7401N1876k1981Q4117j8569q7605l6931K3080Q5476O0351
18933A246292O483m2499N0037J02217o0940j02548M5067L6820O247L2599K1015
18922A340790N9431P6234R1194K5763o1288J5940m2866k3484n5270q2580j01133
$$ plain form
19003 698507 689148 760827 820018 812483 748282 724862 744705 780655 787743 851627 914713 1027609
18991 1027609 1104086 1046128 958756 913116 900225 862243 877486 893500 884773 916724 909744 921530
18979 921530 968398 985726 933690 912776 992551 1037304 1035155 1017561 1068753 1052954 1058358 1062660
18967 1062660 947582 855830 805329 760338 691799 696613 749276 704658 750412 832526 826786
18956 826786 753173 707826 758223 844681 843194 864811 871909 894900 885175 893126 958633 976992
18944 976992 1009077 1106478 1158354 1136373 1220490 1201921 1114316 1077385 1100465 1185941 1246292
18933 1246292 1252775 1210276 1260313 1362530 1301590 1199042 1244109 1280929 1287176 1319775 1340790
18922 1340790 1400221 1476455 1567649 1593412 1532124 1548064 1505198 1481714 1426444 1343864 1242731
18911A242731k5736l1121J1861r3746n8428P1193K3451N4305L0956R8944J32607
18900A457017p56P49L8552N6839M9316J484O8140J13003J25399M1887P0199J19023
18888B140852J01194L7977K1737N4504J43943J50387K06788J49907M6927P9836
18878C134052P3012J72605K28735K21746J87541J84062L33635M92742N83057Q13165
18868F424352R78210R10799M76066K9991k61971k99964l44545m22152j99715J33231
18858G424302K82296L18336M86740N48744M04778K03663J77577K45783K75916
18849A0368135M26891M41045N70006O76244J006790J256279J560598J816783J884866
18840B0007637J807991J969985K381416K991889L484123M424148O150132Q895064
$$ plain form
18911 1242731 1216995 1185874 1197735 1103989 1045561 1116754 1140205 1194510 1225466 1324410 1457017
18900 1457017 1456261 1457010 1495562 1552401 1601717 1603201 1671341 1784344 1909743 1951630 2021829 2140852
18888 2140852 2242046 2280023 2301760 2356264 2500207 2650594 2857382 3007289 3054216 3134052
18878 3134052 3207064 3379669 3608404 3830150 4017691 4201753 4535388 5028130 5611187 6424352
18868 6424352 7402562 8313361 8789427 8819418 8557447 8257483 7912938 7490786 7291071 7424302
18858 7424302 7706598 8024934 8511674 9060418 9465196 9668859 9846436 10092219 10368135
18849 10368135 10795026 11236071 11806077 12482321 13489111 14745390 16305988 18122771 20007637
18840 20007637 21815628 23785613 26167029 29158918 32643041 37067189 43217321 52112385
18832E2112385J2869479J8438833K6005025L4645211M0915041L7667156K2471815
18825B45124945P276732L204761Q58480j1267521k4521343k4354841j1336723
18818A84984490N947768K1240529K8073898K0082212L852445m727027n663323
18811B53790992j3669332l0790086m1691070l9045474l0036357k1328948j5042497
18804F2187228j0778588p912310n873865m560696l732025l043180k567750k075897
18796B1642917j735740j583562j415285j378864j146019r97654q08217o22955
18788A1954621n98904o99950o11070m58014l27155k71480k86299k47606l11264
18779H142879k82862l39557l42947k77282k57172j83618k57544j85346j11285
$$ plain form
18832 52112385 64981864 83420697 109425722 144070933 184985974 222653130 245124945
18825 245124945 252401677 255606438 256464918 245197397 220676054 196321213 184984490
18818 184984490 190932258 212172787 240246685 260328897 264181342 259454315 253790992
18811 253790992 240121660 209331574 167640504 128595030 98558673 77229725 62187228
18804 62187228 51408640 43496330 37622465 33061769 29329744 26286564 23718814 21642917
18796 21642917 19907177 18323615 16908330 15529466 14383447 13385793 12577576 11954621
18788 11954621 11355717 10655767 10044697 9586683 9259528 8988048 8701749 8454143 8142879
18779 8142879 7860017 7520460 7177513 6900231 6643059 6459441 6201897 6016551 5905266
18770E905266j13897N624J34822K22678R7660l52822m70307l40448j65317l6312
18760D886947O2592J23215R6777J03772Q9647N291J33463Q6231K02092K44648
18750F034675L23500M34655N14744N28906P01730R76686J104082J155087J239183
18741A3013248J361651J771644K860265M280128N977297P219723O759540M194852
18733D7438348j07953l097970l504165k150284M98151L508786O462350J0529229
18725E9576492J7041623K7661902M3850617O2525227P2825444O6826484L8717579
18718C89025368m051431l3812891m8690191n0288169m6000428m0003067l0512314
18711A35666877j9063160o464706M750153J1567864J1356919L581983r709131
$$ plain form
18770 5905266 5791369 5796993 5931815 6154493 6252153 5899331 5429024 5088576 4923259 4886947
18760 4886947 4949539 5072754 5169531 5273303 5362950 5368241 5501704 5587935 5790027 6034675
18750 6034675 6358175 6792830 7307574 7836480 8538210 9514896 10618978 11774065 13013248
18741 13013248 14374899 16146543 19006808 23286936 29264233 36483956 43243496 47438348
18733 47438348 47330395 44232425 40728260 38577976 39076127 42584913 49047263 59576492
18725 59576492 76618115 104280017 148130634 210655861 283481305 350307789 389025368
18718 389025368 384973937 351161046 302470855 252182686 206182258 166179191 135666877
18711 135666877 116603717 110139011 114889164 126457028 137813947 141395930 131686799
18704A31686799k0131675k2987885k0404340j5034186r864212o408399m090936
18697C2765166k697054k069317j604525j167502q20814n13149n7317N26795J082014
18688B5444297J459688J741929K244034L001286M531186P168590J1514674J7562102
18680G4667786K3793372K6415893K2134054J0101229n296690j4112559j3726652
18673A23976433o048735O007541J9901925L5002740N0327812O5433231P6670014
18666C71270961P8948969O4124916K5874864k9787023q1740913j00344365r1984358
18659B36363051o8634834m3667668k6433256j6336327r996187n191707p64562
18652F5338510L276633N526387M263819p52059p828685j1916872j2169694r907019
$$ plain form
18704 131686799 111555124 88567239 68162899 53128713 43264501 36856102 32765166
18697 32765166 30068112 27998795 26394270 25226768 24405954 23892805 23835488 24362283 25444297
18688 25444297 26903985 28645914 30889948 33891234 38422420 45591010 57105684 74667786
18680 74667786 98461158 124877051 147011105 157112334 151815644 137703085 123976433
18673 123976433 117927698 123935239 143837164 178839904 229167716 294600947 371270961
18666 371270961 450219930 514344846 540219710 510432687 428691774 328347409 236363051
18659 236363051 167728217 124060549 97627293 81290966 71294779 66103072 65338510
18652 65338510 68615143 74141530 78405349 77653290 69824605 57907733 45738039 35831020
18644C5831020o673388m220851k767369j978141j640894j609120j401146j112372
18636A4427739j208805j214042o64457m00399p66318j018583p70299m17150j10551
18627G857135M7327K73702p9892l94476l62927j03984k97601p08004p44662m87307
18617D999311j72542j14658N5323K81078L28986L35315L0721j87869k5329J4083
18607E544419j53735n97252n61310k75009K8205K82512M39464J39685k34437j41993
18597D470549O5995R183m35735n97100m84426l08995j78631j62270j61224j25847
18587B091499j17444p0522n5111l9145m812R9110j8711n3546N9145O1017k7402
18576A924078l9699j18970o7638P5558R9088R6893R8574P7780J0423L3434M748
$$ plain form
18644 35831020 29157632 24936781 22169412 20191271 18550377 16941257 15540111 14427739
18636 14427739 13218934 12004892 11340435 10940036 10173718 9155135 8384836 7967686 7857135
18627 7857135 7904462 8178164 8098272 7703796 7340869 7236885 6939284 6231280 5486618 4999311
18617 4999311 4826769 4712111 4767434 5048512 5377498 5712813 5743534 5555665 5530336 5544419
18607 5544419 5390684 4793432 4232122 3957113 3985318 4267830 4707294 4846979 4612542 4470549
18597 4470549 4536544 4545727 4109992 3512892 3028466 2719471 2540840 2378570 2217346 2091499
18587 2091499 1974055 1903533 1848422 1809277 1804465 1903575 1884864 1831318 1890463 1951480 1924078
18576 1924078 1884379 1765409 1697771 1773329 1872417 1969310 2067884 2145664 2156087 2189521 2194269
18565B194269P412M6107M9402P6096N4289J28310J48529J93303M78198O70319
18555D046234N88204K95346R3083J06915J78262l1587m68725n49158l66126m70402
18545C422046m82817k47519j8340J15732J29908J58137J66341J77538K89089K48235
18535C958350l1158l12303j51418k1637l5682k68421k94198j32533R7821J59623
18525B968444K99212N33093O43352M64514L25022J83626R8734j97948l04210l84285
18515D629554m54537n00736l18460q4863L0494P5227K88320N63465N40065K22682
18505D991211n0884m2157Q9497Q7847k3797l04888j09499O3097j19991l63797
18495D216639l56644k38768j67359m42948m98254k16768p9113k07120j22873K12228
$$ plain form
18565 2194269 2201681 2247788 2297190 2373286 2427575 2555885 2704414 2897717 3375915 4046234
18555 4046234 4634438 4929784 5022867 5129782 5308044 5276457 4807732 4258574 3892448 3422046
18545 3422046 2939229 2691710 2673370 2789102 2919010 3077147 3243488 3421026 3710115 3958350
18535 3958350 3927192 3614889 3463471 3441834 3406152 3137731 2843533 2711000 2808821 2968444
18525 2968444 3267656 3800749 4444101 4908615 5233637 5417263 5515997 5318049 5013839 4629554
18515 4629554 4175017 3674281 3355821 3270958 3301452 3376679 3664999 4228464 4768529 4991211
18505 4991211 4940327 4898170 4987667 5075514 5051717 4746829 4637330 4700427 4580436 4216639
18495 4216639 3859995 3621227 3453868 3010920 2512666 2295898 2216785 2009665 1886792 2099020
18485B099020K52520M74407N61734M99185K59870R7745J2946O6270j92264m27197
18475C704236n37723n17292k92480k02268o7472J04550K87474M87462N84584L54856
18465C905927K30106N2967j64189p7139j99045l80046n56442n51446l61897k16072
18455A682724r4465k2525K3762P2214o411K2641o1358m8688J6505K9146k5322
18444A588223l5262p3673o3908l1919J7009N4150l1694q340j794N9254R8958R4392
18432A665396n601Q924k4688J50383J53826J3437n5018J2441O1692J7421K9445
18421B027658M1508Q6719j112M0857Q4873O5476Q1827O2998J25608K13088L01841
18410C131341M03349M02472K59388P7590J46430K20862J50915O315o3577J9876
$$ plain form
18485 2099020 2351540 2825947 3387681 3886866 4146736 4244481 4257427 4323697 4131433 3704236
18475 3704236 3166513 2649221 2356741 2154473 2087001 2191551 2479025 2966487 3551071 3905927
18465 3905927 4136033 4189000 4024811 3947672 3748627 3368581 2812139 2260693 1898796 1682724
18455 1682724 1588259 1565734 1589496 1661710 1655299 1677940 1616582 1567894 1584399 1613545 1588223
18444 1588223 1552961 1479288 1415380 1383461 1400470 1454620 1422926 1414586 1412792 1472046 1571004 1665396
18432 1665396 1659795 1668719 1644031 1794414 1948240 1961677 1906659 1919100 1980792 1998213 2027658
18421 2027658 2069166 2155885 2154773 2195630 2280503 2345979 2427806 2490804 2616412 2829500 3131341
18410 3131341 3534690 3937162 4196550 4274140 4420570 4641432 4792347 4798662 4735085 4754961
18400D754961M0460R4059K64773L93040M75081O73133P79940P13302O02182P06770
18390I497701R35604O62949L59252L60138N83179P85173J093423J731792K889398
18381A8898609M494791O262369P214512N727082M692147P035599Q641598L851636
18373F6818343k526893j276486K943708N049422O513655J2748122K4711045M0473217
18365A55454133N2734328M6893500L4787665M5783341O4210411M0837819k0840406
18358D19860791l7145937j9938015j9811388m7913062n5346792l8666386k2512369
18351A78526842j6145400j4332041j0048367r42345M952831l051467j6517206
18344A22442847j6999570j1028205j0388170j4342628j4401766j0590913o858065
$$ plain form
18400 4754961 4795421 4889480 5154253 5547293 6022374 6695507 7475447 8188749 8790931 9497701
18390 9497701 10433305 11096254 11455506 11815644 12398823 13183996 14277419 16009211 18898609
18381 18898609 23393400 29655769 36870281 42597363 47289510 54325109 62966707 66818343
18373 66818343 64291450 63014964 65958672 71008094 77521749 90269871 114980916 155454133
18365 155454133 208188461 255081961 289869626 335652967 399863378 440701197 419860791
18358 419860791 382714854 362776839 342965451 295052389 239705597 201039211 178526842
18351 178526842 162381442 148049401 138001034 137058689 142011520 138960053 122442847
18344 122442847 105443277 94415072 84026902 69684274 55282508 44691595 37833530
18337C7833530m328081k655392j660321q99897l71680k09838k12591j91361L05852
18328B7610221R74750J908880L146928N448001Q809959J1977479J2077606Q802979
18320H0756803Q942597J3902298J4221682L077265m260133K417689J1309947J2906574
18312A43274722J1794551K0123056L3949908M0056121K3261326P520725J5676346
18305B95656755K3972757k185312m6907865m6591345k7790228k5248158l7460605
18298A33445999l6416731k3963031j3432199o730294l603728k977763j957525
18291D4364728L43935J062565k587225n804250m602757k896618l365312m523402
18283B1991664m139024k930399j857979j211827r87796q91509n84682l19150n24837
$$ plain form
18337 37833530 33505449 30850057 29189736 28289839 27918159 27708321 27495730 27304369 27610221
18328 27610221 28584971 30493851 33640779 39088780 47898739 59876218 71953824 80756803
18320 80756803 89699400 103601698 117823380 120900645 116640512 119058201 130368148 143274722
18312 143274722 155069273 175192329 209142237 249198358 272459684 279980409 295656755
18305 295656755 319629512 317444200 270536335 223944990 196154762 170906604 133445999
18298 133445999 97029268 73066237 59634038 52903744 49300016 46322253 44364728
18291 44364728 44708663 45771228 43184003 37379753 32776996 29880378 26515066 21991664
18283 21991664 17852640 14922241 13064262 11852435 10864639 9973130 9388448 9069298 8544461
18274H544461p97917p07046m66070l96664n67730n38435m35215l44774k94826
18265C995784k24029k35841k78774j82862j29161j14153j6331p20k9713j77423
18255B606777j30460o0766r1718p8119r7089k7048o9748n8849K0447o6205n2316
18244A894906j8857J4193m1403O3719J21798R1252P4745O5013R6168J15097K35479
18233B712110L09652J55248R6112J97622K75365J91450J28362J31337L41118M85680
18223E024056J13255o8996o6982j22379k89371m91283m55754k71459l18899l32609
18213B719579j34175P2921P0494J28981R703k6115J2203P3640K9206o1080j82778
18202B712579j44317j16639j4693J3982J8782J18311M2394n8630L8355J53050
$$ plain form
18274 8544461 7746544 7039498 6573428 6176764 5609034 5070599 4635384 4290610 3995784
18265 3995784 3771755 3535914 3257140 3074278 2945117 2830964 2814633 2813913 2784200 2606777
18255 2606777 2476317 2415551 2323833 2245714 2148625 2121577 2051829 1992980 2013427 1947222 1894906
18244 1894906 1876049 1890242 1848839 1912558 2034356 2125608 2200353 2265366 2361534 2476631 2712110
18233 2712110 3021762 3177010 3273122 3470744 3746109 3937559 4065921 4197258 4538376 5024056
18223 5024056 5137311 5068315 5001333 4878954 4589583 4098300 3642546 3371087 3052188 2719579
18213 2719579 2585404 2658325 2728819 2857800 2867503 2841388 2853591 2927231 2956437 2895357 2712579
18202 2712579 2568262 2451623 2436930 2450912 2469694 2588005 2630399 2571769 2610124 2763174
18192B763174J69684Q9971J2555r7871k23626k01952n8591K3641M1520K55617
18182B774122K34963l9738p7524k6836m1292L0549j7826J35676J59040L71691
18172C502825M24000K96085J94815K89879J44750l38891m90503m11693l80336
18163C230931m49503m00111m08760j51596L3402P3494O4565O7979l6958M4722
18153B068165N1377M6561L9869J18305J34942J28646L3425L0448q0141j59118
18143B412479j38298k09131j59958n2066K26415K58860K56692K62818L16171L60813
18133C534795M22110M03487K57504L25014M54570M52407K00331j8908j3832o36
18123F016842l1757Q897K63382M72962P67022J119287J734682K161572K821295
$$ plain form
18192 2763174 2932858 3022829 3035384 2937513 2713887 2511935 2453344 2476985 2518505 2774122
18182 2774122 3009085 2969347 2891823 2864987 2823695 2854244 2836418 2972094 3131134 3502825
18172 3502825 3926825 4222910 4417725 4707604 4852354 4513463 4022960 3611267 3230931
18163 3230931 2781428 2381317 1972557 1820961 1854363 1927857 1992422 2060401 2023443 2068165
18153 2068165 2119542 2166103 2205972 2324277 2459219 2587865 2621290 2651738 2571597 2412479
18143 2412479 2274181 2065050 1905092 1853026 2079441 2338301 2594993 2857811 3173982 3534795
18133 3534795 3956905 4360392 4617896 4942910 5397480 5849887 6050218 6031310 6017478 6016842
18123 6016842 5985085 5993982 6257364 6730326 7497348 8616635 10351317 12512889 15334184
18114A5334184L887775O043243R874312J7552064L2188436N3281193N4228736
18107A92389943j8047111o7008254m4669816k2686972j2038754o991297m427766
18100A6519973l073838k131547j509018j244445r35797p12732n77340o34196n20943
18091E180117k28476k82535k27851k17235j94443j57640j91745j86673r3054j13208
18081C287257m7321J4377J83358L06146M40377O38880N78924N19369M85712L72908
18071F779987r6713n05512o11411o19245n33979n25657l75931o4939P4664L20986
18061C842250N42511O37263M82737M37788N32726L56869l44565o79066o43318
18052E165195n24434o90086o84281n21612m51602l34818q8427o1930j64934j69704
$$ plain form
18114 15334184 19221959 25265202 35139514 52691578 84880014 138161207 192389943
18107 192389943 174342832 107334578 62664762 39977790 27939036 20947739 16519973
18100 16519973 13446135 11314588 9805570 8561125 7625328 6912596 6335256 5701060 5180117
18091 5180117 4951641 4669106 4441255 4224020 4029577 3871937 3680192 3493519 3400465 3287257
18081 3287257 3239936 3254313 3437671 3743817 4184194 4823074 5401998 5921367 6407079 6779987
18071 6779987 6683274 6177762 5566351 4947106 4413127 3887470 3511539 3446600 3521264 3842250
18061 3842250 4384761 5022024 5504761 5942549 6475275 6832144 6487579 5808513 5165195
18052 5165195 4640761 3950675 3266394 2744782 2293180 1958362 1869935 1808005 1643071 1473367
18042A473367j13514p1825l3790J00571R4941l2813p6689m8005N3735K5903M3990
18031A415871R5607J45650K95576L48993M11432M46322L69156L43060L15857K75487
18021D463011J41561o7681k08097j70881k39827m28202l66393l88416m05860l38446
18011A990769k63502k75961k61594j79520n4742Q481K6814l0938P8193J2555n0840
18000I99715L9470J11187J38331Q4325K2198J33666J27597K01893N0574O8105
17990A977061J64926P2168j8180m3819j8763l1766n2875j00985r2563k2653j49108
17979A683443k20961k27723j60997j84989j13375j9589J6226l0483l1383o3684
17969F46485l5000L4466r0922q7555M979N8403K1035n0106L2483N4925Q0956M9232
$$ plain form
18042 1473367 1359853 1288028 1254238 1354809 1449750 1416937 1340248 1292243 1345978 1371881 1415871
18031 1415871 1511478 1657128 1952704 2301697 2713129 3159451 3528607 3871667 4187524 4463011
18021 4463011 4604572 4536891 4328794 4157913 3918086 3489884 3123491 2735075 2329215 1990769
18011 1990769 1727267 1451306 1189712 1010192 955450 963931 990745 959807 1038000 1050555 999715
18000 999715 1039185 1150372 1288703 1373028 1395226 1528892 1656489 1858382 1908956 1977061
17990 1977061 2141987 2214155 2195975 2152156 2133393 2101627 2048752 1947767 1855204 1832551 1683443
17979 1683443 1462482 1234759 1073762 888773 775398 755809 772035 741552 710169 646485
17969 646485 611485 645951 555029 467474 472453 530856 551891 501785 534268 589193 670149 719381
17957G19381l4355Q457J39770K09936K73436L26103L85788L67328L74966L73254
17947C144064K97956L71507L04085K90410J87299J34389P4757r5944k04443k24576
17937D279504k22209k56372l63349m43908m73377l66175l06189k60954k68125
17928A318846k23695j61181j61245r7816p1346j7369N1288j7945K7122l2166p1282
17917E43211m218L4530K2865n9010q8821m7693m5605l0295M7454k0449q6790l1731
17905B33448M4995j1554N3710O7096O9001M0031L801J3363O8730K8913l9632l5886
17893E36016m1091m4828K9625J25462L5164M6169M0866O2230J79316L14597L26599
17882A610125N25960O14543M29407J05006k85937m94921m41200l54937k74595
$$ plain form
17957 719381 685026 693483 833253 1043189 1316625 1642728 2028516 2395844 2770810 3144064
17947 3144064 3442020 3813527 4117612 4408022 4595321 4729710 4804467 4708523 4504080 4279504
17937 4279504 4057295 3800923 3437574 2993666 2520289 2154114 1847925 1586971 1318846
17928 1318846 1095151 933970 772725 674909 603563 586194 637482 619537 646659 614493 543211
17917 543211 538993 573523 596388 537378 448557 400864 355259 324964 372418 351969 265179 233448
17905 233448 278443 266889 320599 387695 456696 496727 500528 513891 582621 611534 571902 536016
17893 536016 494925 450097 479722 605184 640348 686517 727383 789613 968929 1283526 1610125
17882 1610125 2136085 2750628 3180035 3285041 2999104 2504183 2062983 1708046 1433451
17873A433451j16111j5915k5995J16612O8468P1714R5599P6607L4731m9917j72058
17862A517186o524R6370M1679L9114n9323n1719k6597J9662J52593P7186O5463
17851A865090K892j7949l970J57178L5194j49816j82379j64794j44749j27330
17841A269367r4809p839J06960J75234J33141l2965n0901l6414l7223O7000J32663
17830A624214K39315M83795P81446Q28692N94942L20142O099l70835o27748p34282
17820C145780o99315m60543k79414q6967O1354J00116J16846J98687J52157k3465
17810B225236q3801k8823o4645p8019J7903O0534J1507j58260k17869j08605m1121
17799A534037j07096n6746J731K9200K7179M85o8948R2484J36859L517n7102r3615
$$ plain form
17873 1433451 1317340 1301425 1275430 1392042 1460510 1532224 1627823 1704430 1739161 1689244 1517186
17862 1517186 1510662 1607032 1648711 1687825 1628502 1576783 1550186 1569848 1722441 1799627 1865090
17851 1865090 1867982 1850033 1846063 2003241 2038435 1888619 1706240 1541446 1396697 1269367
17841 1269367 1174558 1166719 1273679 1448913 1582054 1549089 1498188 1461774 1424551 1491551 1624214
17830 1624214 1863529 2347324 3128770 3957462 4552404 4872546 4878645 4507810 3880062 3145780
17820 3145780 2446465 1985922 1706508 1619541 1680895 1781011 1897857 2096544 2248701 2225236
17810 2225236 2141435 2112612 2047967 1969948 1987851 2048385 2059892 1901632 1683763 1575158 1534037
17799 1534037 1426941 1370195 1371926 1401126 1428305 1428790 1359842 1452326 1589185 1592702 1535600 1441985
17787A441985j7678N0426n7657L3999R0591n9671k21968j56915m7206O652P1797
17776A134355P7106J94000K53110L74592L97156L79103L48485p36k65851n61969
17766B329351m62526k84786j81349o8942k6144K3028J12053J97037J82525M32420
17756B252667P36110Q79314R52381P89862K72250k73428n76153p72740p83827
17747C476436o68375n02792l53752k04968j02995o6268R5774J27154J06224Q0109
17737A986547j49824k41480j44463j14363j55689j59448k8671l3562K2493J6262
17727I97802K193J03522J84839K5960p7614L4338m576l9110j08284j40549J15340
17716A093861J94808K25899K00478M09134N50043O09325P23388Q23836Q59304
$$ plain form
17787 1441985 1424307 1474733 1417076 1451075 1541666 1481995 1260027 1103112 1055906 1062558 1134355
17776 1134355 1211461 1405461 1658571 2033163 2430319 2809422 3157907 3157171 2891320 2329351
17766 2329351 1866825 1582039 1400690 1331748 1305604 1328632 1440685 1637722 1820247 2252667
17756 2252667 2988777 3868091 4820472 5610334 5882584 5609156 5033003 4260263 3476436
17747 3476436 2808061 2305269 1951517 1746549 1643554 1577286 1673060 1800214 1906438 1986547
17737 1986547 1836723 1595243 1450780 1336417 1180728 1021280 992609 959047 981540 997802
17727 997802 999995 1103517 1288356 1314316 1236702 1271040 1266464 1227354 1119070 978521 1093861
17716 1093861 1288669 1514568 1715046 2124180 2674223 3283548 4006936 4830772 5690076
17707E690076N90896J87044l34069n65833m59313k45908n0226P3137K27099L24592
17697E437495K13006q0223l85300o18634n78822o32550o02579m75771l40701l06326
17687A629595j33490K5405O2045J15723K03192M30217O60218R28191P33989L31057
17677D986142j47715n44984p41117o21748m77493l77794k71489j04293J40190
17668A839699J94519L06397L44493K12303m1302k64252k34917k68034k47965q4625
17658A756316J51024J90629L29787M28042N18338N44983M32694J89131k25566
17649D315378n92306p84934p25425n31057k70691k20247j41170m8365j1096J10648
17639A100735J33166J69055J13288J20926Q302j14029j37890j4636o387P1009
$$ plain form
17707 5690076 6280972 6468016 6133947 5568114 5108801 4862893 4812667 4885804 5112903 5437495
17697 5437495 5650501 5570278 5184978 4566344 3987522 3354972 2752393 2276622 1935921 1629595
17687 1629595 1496105 1521510 1583555 1699278 1902470 2332687 2992905 3921096 4655085 4986142
17677 4986142 4838427 4293443 3552326 2930578 2453085 2075291 1803802 1699509 1839699
17668 1839699 2034218 2340615 2685108 2897411 2856109 2591857 2356940 2088906 1840941 1756316
17658 1756316 1907340 2097969 2427756 2855798 3374136 3919119 4351813 4540944 4315378
17649 4315378 3723072 2938138 2212713 1681656 1410965 1190718 1049548 1001183 990087 1100735
17639 1100735 1233901 1402956 1516244 1637170 1645472 1531443 1393553 1378917 1372530 1443539
17629A443539J87610K77027L09341M53985M92021L31962J22205k64297n73137
17620B780256o71322n20952m39235k69360j20640m2226p9117m0129l3497j0195
17610E53583P4315N7336M1313K1030K2407K1162r4795j23202k1812n8304k0430
17599D72603l3670J2158k9134o1448J9130n3723j4799L9219J2922q4771o5135
17588B13352k2511m2175j00632N2707r214J843j5217k9430J4527J5501J16249
17577A95000J9248k7499o8198k304O7402l3730k8723j3553L7737m1826m8840L3343
17565H8057O9411J9885o9472p3970Q3523P813j10190K3238j0774Q5569J9723L9757
17553A72570k1261m0369M8230N8281M3100n3712j03999q7081m3391O4732J09684
$$ plain form
17629 1443539 1631149 1908176 2217517 2671502 3163523 3495485 3617690 3353393 2780256
17620 2780256 2108934 1587982 1148747 879387 758747 716521 637404 597275 563778 553583
17610 553583 627898 685234 726547 747577 769984 791146 696351 573149 551337 493033 472603
17599 472603 438933 451091 421957 360509 379639 325916 311117 350336 363258 278487 213352
17588 213352 190841 148666 48034 100741 91527 93370 78153 48723 63250 78751 195000
17577 195000 214248 186749 118551 116247 183649 149919 121196 107643 145380 103554 54714 88057
17565 88057 157468 177353 107881 33911 117434 125247 15057 38295 27521 113090 132813 172570
17553 172570 151309 110940 159170 217451 260551 206839 102840 15759 -27632 37100 146784
17542A46784n128p6948o5105K7610o227J2790L8407l7426j3726O5081M4j1640
17530G4516J8339O2346M6775n8897M6907J3797r1023o5538j8550L4890N4438M620
17518A22620r1890n5358L3092L5498j2682o8087Q6402L6310Q718o4607k4596R1767
17506I7187J7115r6791m0546l793j61o1994P6976K8617j1906J9664M7023M1207
17494A12598l3693n4087j3815L6359j19655l7738K3972K2123J4366K3564M7047
17483B1041N0006K7234L0525l7482k7958k0344Q8583l7740n1672L6861l7914j3268
17471B7872L4032p0240n1854M9261O5568M7711O0964n8399q1783J0919k7162K3264
17459C0153P0256N4235k8069n8862j19681k6898N8421P8971L4960k8725q6789
$$ plain form
17542 146784 141656 64708 -397 27213 20986 33776 72183 34757 21031 86112 86156 74516
17530 74516 92855 155201 201976 143079 189986 203783 112760 47222 28672 63562 118000 122620
17518 122620 30730 -24628 8464 43962 31280 -36807 49595 85905 94623 30016 5420 97187
17506 97187 114302 17511 -23035 -26828 -26989 -88983 -12007 16610 4704 24368 71391 112598
17494 112598 78905 24818 11003 47362 -72293 -110031 -86059 -63936 -49570 -26006 21041
17483 21041 71047 98281 128806 91324 63366 43022 131605 93865 42193 79054 41140 27872
17471 27872 61904 -8336 -60190 -10929 54639 102350 163314 104915 23132 34051 6889 30153
17459 30153 100409 154644 126575 67713 -51968 -78866 -20445 58526 93486 64761 -22028
17448b2028K0258O244O3517Q2284J40485J93671L07405J63989l13596l19725j49790
17437A72714k8285N9767K444j24823j0162N7421N4810k06M9355N0653o3282J541
17425B21947L3637q8518n598Q894L1880M6084J16753Q5511R6210J92568L09388
17414A048756J92313j49111k17311j68786j52262k7160J4053J07033P9433Q7052
17404H14010J98321J68232J43625M9227K1744N9409M2841k02717l38863k68186
17394F87643j09547o7870k4290L751N7840J59424K41487R7234j9560k05017k75475
17383E45620k13810p7249p39Q111m0953p4469j8244J1914m6661k2408L7396K2391
17371A30899K1072j9443r5200L2033K3810N3317o959p9328N9564J6021n3928N1170
$$ plain form
17448 -22028 -1770 4474 67991 150275 290760 484431 791836 955825 642229 322504 172714
17437 172714 144429 204196 206640 81817 71655 129076 183886 183680 233035 283688 220406 221947
17425 221947 255584 167066 161468 170362 202242 248326 365079 450590 546800 739368 1048756
17414 1048756 1241069 1091958 874647 705861 553599 526439 540492 647525 726958 814010
17404 814010 1012331 1180563 1324188 1373415 1395159 1454568 1497409 1294692 955829 687643
17394 687643 578096 510226 485936 489687 547527 706951 948438 1045672 1026112 821095 545620
17383 545620 331810 254561 253822 261933 220980 146511 128267 140181 93520 71112 108508 130899
17371 130899 151971 132528 37328 69361 93171 146488 139529 60201 119765 135786 81858 133028
17359A33028L4937R2915l3792R665M522k3758l3133n9269j03584L8757k6515l7028
17347c255p2335J6308P5559R7870L8148J9354j00757l0792M4632J3396M754m7133
17335E5749m4874j1471o5746k9233l8878k3286R7412L9917M7429p238N9283L2513
17323A11577k9576j8900Q80J0527N215N9366j6346l4942M4370J2896K9920k8152
17311A46835o8122l0014J08882j2176p0090j0774N8554Q950Q3372O1137k2454
17300B54100l9704j9135m8693m0817k211O3567K4646o1291J8430R5051O2123q0078
17288B25988r3114j3813J04462n1354n3098j247k7575l7580M4633l9537r4281
17277c6516j6058O9459L8457K2223K7982N8424j4840q6831o6102m0418m456P9605
$$ plain form
17359 133028 167965 260880 227088 236753 241275 217517 184384 125115 21531 60288 33773 -3255
17347 -3255 -75590 -59282 16277 114147 152295 171649 70892 40100 84732 98128 102882 55749
17335 55749 10875 -596 -66342 -95575 -134453 -157739 -60327 -20410 27019 19781 79064 111577
17323 111577 82001 63101 63981 74508 79723 139089 122743 87801 132171 145067 174987 146835
17311 146835 78713 48699 157581 145405 75315 64541 123095 132045 215417 276554 254100
17300 254100 214396 195261 146568 105751 103540 167107 191753 130462 148892 243943 306066 225988
17288 225988 132874 119061 223523 172169 119071 117824 90249 52669 97302 57765 -36516
17277 -36516 -52574 16885 55342 77565 105547 163971 149131 62300 -3802 -44220 -48676 30929
17265C0929M9620L9284L7618L3632n0768k0468l9358j7704j7335K1029K0596l5635
17253E1440O1907L5117q1505o5728n528M9654J034j1550l0436l6844M5993N4876
17241F8430O8448K4309M1419Q7408J8747n0500l4456N9871l5456l2716M0141k4708
17229B30937l0642o8181k3459M2576K5793Q89o55J7673O8224O7951P4204Q6807
17217D92117Q363n699M6924L3249p2012p3274q4086m8877k415o8497l3080O5898
17205B58611J43676q752o3789K553m7550l1983K7246k7296J4371l5771J7564J2146
17193B61026n0661O9273M4306k5702m1946j40m181o2164q299O5769j2794p8913
17181A55574j6746M9026J03916L275k5165L2308O1290K0502j58258k9849K4703
$$ plain form
17265 30929 80549 119833 157451 191083 140315 119847 80489 62785 45450 66479 87075 51440
17253 51440 113347 148464 66959 1231 -4297 45357 46391 34841 4405 -32439 13554 68430
17241 68430 136878 161187 202606 290014 308761 258261 223805 283676 248220 215504 255645 230937
17229 230937 200295 132114 108655 151231 177024 177913 177258 194931 263155 331106 405310 492117
17217 492117 500480 494781 541705 574954 502942 429668 345582 296705 294290 225793 192713 258611
17205 258611 402287 393535 329746 332299 284749 252766 280012 252716 267087 231316 248880 261026
17193 261026 210365 279638 323944 298242 256296 256156 251975 189811 181512 247281 234487 155574
17181 155574 138828 187854 291770 295045 269880 302188 363478 383980 225722 195873 220576
17170B20576K9570Q5195n1611p1230P6011Q3869k024O3181P8944M7523K8693o0594
17158E28103k4125n6487O749m8156j05315p343n7537n1916L0345K0937n8574m783
17146A71898k8386k9124M6025J1250j5081l4887K9880m3755q3518P5720J23691
17135B23713k9608L6547l3398l2297l9893L1m1591o0169J7333P3520n9092L5152
17123I0248O3490j2123R969L549q1120k4435R496l7594J6253N9629L9310q3348
17111E3324L0932J07294M222Q9109L5259k0276q2151p3416k3457k1249L77l7474
17099F2494N630K8035L3047K5387L4222K9124j0388L7693k9539o7628l8393m5798
17087F3886J46013R7723q3025J1278O7136M6491j6986l0055q3217o060p0589r4003
$$ plain form
17170 220576 250146 335341 283730 212500 288511 372380 370356 433537 512481 560004 588697 528103
17158 528103 503978 447491 454240 406084 300769 293426 235889 183973 214318 235255 176681 171898
17146 171898 143512 114388 160413 171663 156582 121695 151575 107820 24302 100022 223713
17135 223713 194105 230652 197254 164957 125064 125095 83504 23335 40668 114188 55096 90248
17123 90248 153738 141615 151584 155133 74013 49578 59074 21480 37733 97362 136672 53324
17111 53324 84256 191550 195772 284881 320140 299864 217713 144297 120840 99591 99968 62494
17099 62494 68124 96159 129206 154593 188815 217939 207551 245244 215705 148077 109684 63886
17087 63886 209899 307622 224597 235875 303011 349502 332516 302461 219244 213184 142595 48592
17075D8592K9496J1418m5606o8955j7134N3413J19265L1722M2915n099k6325o1131
17063A12571p2951k6962N5044J6277L936k8800R705J0554k1343j2065k5932K0006
17051D0040J5754K7123Q810q333J1805N2539j8243m7691j14516l701M0126k4603
17039b0890m0171M579K5806N9936J9346o0073j6610l9844l7592p7661O5170N5932
17027f2072J0665O2586M9301n4017j8258P6821J2606k8301M2085n8128M1751K9431
17015A04470j2978M8103N6536k5722o018l3303L4949N8463J5221j6726M2313l1822
17003B33486o9563k4769r5465L3103O9935N4037l110k4354m3437k2487M2074M2421
16991A91871O9660O1019m9823m0983P5700j4722N877j679m2692o7856O2080M1673
$$ plain form
17075 48592 78088 89506 43900 -25055 -42189 11224 130489 162211 205126 200027 173702 112571
17063 112571 39620 12658 67702 83979 87915 59115 68820 79374 58031 45966 20034 40040
17051 40040 55794 82917 91727 83394 95199 147738 129495 81804 -32712 -36413 3713 -20890
17039 -20890 -61061 -56482 -30676 29260 48606 -11467 -28077 -67921 -105513 -183174 -118004 -62072
17027 -62072 -51407 11179 60480 6463 -11795 65026 77632 49331 91416 33288 75039 104470
17015 104470 91492 139595 196131 170409 164391 131088 166037 224500 239721 222995 265308 233486
17003 233486 163923 139154 43689 76792 146727 200764 197654 173300 129863 107376 149450 191871
16991 191871 261531 322550 272727 231744 307444 292722 298599 296920 254228 186372 248452 290125
16979B90125K516j3635m9061n1509k9628P6311P2244m0591l9141J4499J5590L4295
16967B82015O1549k7217L1310J33083Q6100m6004q4523j3310l589q522l2729k8523
16955C49640o221M7005j474k8626o2134J8978P5931l1450K6258J3199K9073K9617
16943D59796J7061k8037K861m479J5214j5235Q8842R9063N8802j17043m8938L824
16931E31731J6336R582n8676L0859O0976p2536k9683O7916J19324L1518M3818
16920G51165p4456J4775O6620L9623L0920k0652K4475O0797K2471M2641J7221
16909I75600R0393M7053K4865N0064j2816q479Q6142Q2904K9918k3146L6975R6391
16897A475864R0295N1370K5520J07100J04310R3647L8490J00834J71260K26327
$$ plain form
16979 290125 292641 279006 229945 178436 148808 225119 297363 256772 217631 232130 247720 282015
16967 282015 343564 316347 347657 480740 566840 520836 436313 423003 419414 410892 378163 349640
16955 349640 343419 390424 388950 360324 298190 317168 393099 361649 387907 401106 430179 459796
16943 459796 476857 448820 451681 447202 462416 447181 536023 635086 693888 576845 527907 531731
16931 531731 548067 557649 498973 529832 590808 518272 488589 556505 675829 707347 751165
16920 751165 676709 691484 758104 797727 828647 807995 832470 893267 915738 958379 975600
16909 975600 1065993 1113046 1137911 1187975 1175159 1166680 1252822 1335726 1365644 1342498 1379473 1475864
16897 1475864 1566159 1617529 1643049 1750149 1854459 1948106 1986596 2087430 2258690 2485017
16887B485017K29627J99352L60952M02188M50824K85216P3727j157J42180K29056
16877D856982M77742P03443J066034J343042J171213O57982L83519K96237K81992
16868A1238186O64309J072104J510297K045912K830686L959157N300123O817351
16860C5438125R926521J6012597K6129804M0544868N3298186M1620806r762431
16853B13208476m9716621m4996433k6428137j2038026j639754P587213J8425702
16846A04402420L3076555N0105120N7156044L0285679j1460451j1768447J2334521
16839B64131441N828304l8260664o0083291m6324664k7430270j4069515m421566
16832G9369775M575134J5318499K9849259M4640748M1601048j673691m8644055
$$ plain form
16887 2485017 2714644 2913996 3274948 3677136 4127960 4413176 4486903 4485746 4627926 4856982
16877 4856982 5334724 6038167 7104201 8447243 9618456 10276438 10659957 10956194 11238186
16868 11238186 11902495 12974599 14484896 16530808 19361494 23320651 28620774 35438125
16860 35438125 45364646 61377243 87507047 128051915 181350101 222970907 213208476
16853 213208476 163491855 118495422 92067285 80029259 78389505 85976718 104402420
16846 104402420 137478975 187584095 244740139 275025818 263565367 251796920 264131441
16839 264131441 269959745 231699081 171615790 125291126 97860856 83791341 79369775
16832 79369775 83944909 99263408 129112667 173753415 215354463 213680772 165036717
16825A65036717n1967595l4952534k1500987j3507558q804171o149789m626028
16818B3528055l577540k628388j893734j476288j170518r19871p59736o89912
16810A0412068n58479l82560o36614r07760r14963q02466p03076n72278m04256
16801D529616k39269j99972r4676k4642n3195j32531k92253l73287k85636j96515
16791B637640j94240j74879j95977j56036j72665r8542q6731q6459n5338m3618
16781A373155l227l2217o8494k3777j03183l0462l0942m1841m5985l5219j8391
16770I39417j09680o7484K8069j1416o1809k7846N1827J03990m1745k6777M4712
16759H21258q1793k8966m136m0334l5324N5009j7667k9920k4769p3986l5423n4585
$$ plain form
16825 165036717 113069122 78116588 56615601 43108043 34303872 28154083 23528055
16818 23528055 19950515 17322127 15428393 13952105 12781587 11861716 11101980 10412068
16810 10412068 9853589 9471029 8834415 7926655 7011692 6209226 5506150 4933872 4529616
16801 4529616 4290347 4090375 3995699 3971057 3917862 3785331 3493078 3119791 2834155 2637640
16791 2637640 2443400 2268521 2072544 1916508 1743843 1645301 1558570 1472111 1416773 1373155
16781 1373155 1369928 1337711 1269217 1245440 1142257 1111795 1080853 1039012 993027 957808 939417
16770 939417 829737 762253 790322 778906 717097 689251 741078 845068 803323 776546 821258
16759 821258 739465 710499 706363 666029 630705 685714 668047 638127 613358 539372 503949 449364
16747D49364M2021M7819J4618j1819J2118m8438m5764J667Q420p9924l2024m5911
16735C12147M0352j2502L1717l675N9638M4256K2803K3156p7426j6610m5311n7301
16723C21244j0922M8590P6672l201M0673J9542M5521m183N679m6713k578n9387
16711D30937o6313k7067n4518J3629L282J8966N5854K8895m004q1882R486J8439
16699C45704j6892J4334N8098q8690o5989L3174k8532m0301j1679m3367m6996
16688A08864p110P8216Q6095p6698l170P6161L9882k4733j09944k3062p034j2919
16676A24548k3874p3892K5986J17595P3406J4914J35576M1059k8965L289N3163
16665D62805M3748k4275l2273p4009n6014j0994R985Q7286N0032J3333m6847k4848
$$ plain form
16747 449364 491385 539204 553822 542003 554121 505683 459919 461586 470006 390082 358058 312147
16735 312147 352499 339997 371714 368039 427677 471933 494736 517892 440466 423856 378545 321244
16723 321244 310322 358912 435584 432383 473056 492598 538119 533936 539615 492902 490324 430937
16711 430937 364624 337557 283039 296668 299950 318916 374770 403665 399661 317779 327265 345704
16699 345704 328812 343146 401244 312554 246565 279739 251207 210906 199227 155860 108864
16688 108864 101754 179970 266065 189367 186197 262358 302240 277507 167563 144501 137467 124548
16676 124548 100674 26782 52768 170363 243769 258683 394259 435318 406353 409642 462805
16665 462805 506553 482278 450005 375996 319982 308988 318973 406259 456291 469624 422777 397929
16653C97929O764m1949l7322P4415J1852q4630k2840L4546N1311j4500p0809P2896
16641C77663J29082o663l5136L5160J56891K25633K68345L88251M16697J78240
16631B134163m7781j25946l00985l17224k27123Q990J73748J99463M41920M75561
16621B414786K83638J93799K86960K79442K38387J61184J36216j46819l95880
16612C451713l92046n21236l53109p2198J17600L86478N20038M14126M70968J18487
16602D140821k66520k44867k92289k69544k79022j60623k63328m83956m25605
16593A455067k44421j00478L264J02042L08658L84838J47257m0937j05938l24712
16583A584640m50188k85770p6769r2821j62562j54286m3746J2213M2514J0520
$$ plain form
16653 397929 404693 362744 325422 399837 411689 327059 304219 338765 390076 375576 304767 377663
16641 377663 506745 500082 464946 500106 656997 882630 1150975 1539226 1955923 2134163
16631 2134163 2086382 1960436 1659451 1342227 1115104 1124094 1297842 1497305 1939225 2414786
16621 2414786 2698424 2892223 3179183 3458625 3697012 3858196 3994412 3847593 3451713
16612 3451713 3059667 2538431 2185322 2113124 2230724 2617202 3137240 3551366 4022334 4140821
16602 4140821 3874301 3629434 3337145 3067601 2788579 2627956 2364628 1880672 1455067
16593 1455067 1210646 1110168 1113432 1215474 1524132 1908970 2056227 2015290 1909352 1584640
16583 1584640 1134452 848682 771913 679092 516530 362244 318498 330711 373225 383745
16573C83745j4623l827j18092K024k7246p9540K5899N9395K2046L9767O4774k9714
16561C24608p3414l9626K5526K1608L4007o2143n7649p1914q6644o9005n4334
16550a08980N067P030k7221R2735Q5421O873O7192J2986M941j680o8679N299L6558
16537A17542M3090j2271o2435N9384M8045k6319k2155l5715O126k9567L9033J9850
16525A44608o1883j1383k4725r501K6053n5666r4203l0508K2208J6535R280L5491
16513c3694L9577L2568P0894J8743l9541J7975j815n5389P561N9600N318n6544
16501F5253l9094O0554K2637p7333L7746M6878J713J0636k9126m1421J5526j3083
16489F0886j3528q1813n522m7227j0926Q2222L0501P4907l3753K18j4448l2877
$$ plain form
16573 383745 369122 365295 247203 249227 221981 142441 168340 227735 249781 289548 354322 324608
16561 324608 251194 211568 237094 258702 292709 230566 172917 101003 14359 -54646 -108980
16550 -108980 -103913 -96883 -124104 -31369 54052 60925 128117 141103 146044 144364 75685 80984 117542
16537 117542 160632 148361 85926 145310 193355 167036 144881 109166 115292 85725 124758 144608
16525 144608 82725 71342 46617 37116 63169 7503 -86700 -117208 -95000 -78465 -69185 -33694
16513 -33694 5883 38451 109345 128088 88547 106522 104707 49318 56879 116479 121797 65253
16501 65253 26159 86713 109350 32017 69763 116641 118354 128990 99864 58443 73969 60886
16489 60886 47358 -34455 -39977 -87204 -98130 -15908 14593 89500 55747 55965 41517 8640
16477H640q53L8473o6493j153L5063M6824K0771K0167J6828n3600o6445J38M4817
16464D3177j8773j5860k545o3810Q2991R6791J7880n5298o4152J6129J6187l5063
16452A7654j5768p1247j5814Q8929M2177Q4515P0153K570k8353n4140K3938o5706
16440G8908k2248j4469j10094o59M3498l564L1769L939m3940L7151L4195m0680
16428f194L318L4038J4898N8473L9372k1782q8444J1046l9988l0414L117K1434
16416a126L1368P1510Q1626o5247l3960M150O375o1013k2860J2085o1935j339
16404d0366P7255m6424j3755J8153l7412J8192L8320j2647j7037M4620J14736
16393A43635L3393l0178n4732K92n1358m8033J084m1321n5563o96r114n0912K3137
$$ plain form
16477 8640 7787 46260 -20233 -21386 13677 60501 81272 101439 118267 64667 -1778 -1640 43177
16464 43177 24404 8544 5999 -57811 25180 121971 139851 84553 20401 36530 52717 17654
16452 17654 1886 -69361 -85175 3754 45931 130446 200599 203169 174816 120676 144614 78908
16440 78908 56660 42191 -67903 -68562 -25064 -28628 3141 7080 -36860 291 34486 -6194
16428 -6194 -2876 31162 46060 104533 143905 122123 33679 44725 4737 -25677 -22560 -1126
16416 -1126 30242 101752 183378 118131 84171 88321 94696 33683 10823 22908 -39027 -40366
16404 -40366 36889 -9535 -23290 -5137 -42549 -24357 13963 1316 -15721 28899 143635
16393 143635 177028 146850 92118 92410 41052 -6981 -5897 -47218 -102781 -103477 -112591 -163503 -140366
16380a40366K9066O4339P9098p616p5038J530P0897K6495K3242j3580M3813L361
16368A05241K134l6146m3945l2392p9845J8576J01328P0422o238q0185L0073J9588
16356F8611m2844j9633n882L7347O7751r275r2563j10302K9455M9637j7589K1722
16344b3565K1904l708N600L2260k4162q4718J05612P5161n5439j26897J2765K096
16332f3091l4320l8504O9327L7835J6076m2445N9553n178L5411l2786l3757o2569
16320i4448L073J04145L3858k788l2990o4617J3018O9598N486k3825k1642o4128
16308g5260o710Q3409M9398O9014l2207k6396L8444M6704m0625n7379K0599P3961
16296A42952O4033P9906Q2786J22134R8153J64036K28862J27919j2756j77098
$$ plain form
16380 -140366 -111300 -46961 32137 24521 -50517 -48987 21910 48405 71647 58067 101880 105241
16368 105241 107375 71229 27284 -5108 -84953 -66377 34951 105373 99135 18950 49023 68611
16356 68611 25767 6134 252 37599 105350 96075 3512 -106790 -77335 -27698 -45287 -23565
16344 -23565 -1661 -5369 231 32491 8329 -76389 29223 104384 48945 -77952 -65187 -63091
16332 -63091 -97411 -135915 -66588 -28753 -12677 -55122 4431 -747 34664 1878 -31879 -94448
16320 -94448 -91375 12770 46628 43840 10850 -53767 -40749 28849 34335 10510 -11132 -75260
16308 -75260 -81970 1439 50837 119851 87644 61248 99692 146396 105771 48392 68991 142952
16296 142952 206985 286891 369677 491811 589964 754000 982862 1110781 1098025 920927
16286I20927k16687j57919m2223j8690J1616J27720J81621K19338K59527R0059
16276A375289o5149n1307p02m0888j14888j85851k32486j44320m4785m0482o4938
16265C89493J11272K49498J54630J80076k7768k33571k27695j35271j44940n7805
16255B57919j0096p1997l1888l9646j02892K0305j6873N8254j933n1577q0575
16244g0999K7354L2948Q0663Q2557k7626j02444l6728o6148j9428N0881J7963
16233c1007K9236K2070M3794L0858o0695p4550J5169O2209O0040q539p9697O2110
16221G0998P4009L5674o9712j2048r5577o4165M1041R1040p6421p1498p6625N2821
16209a00463O3060L0473K7894k7657l0500L4820j7242k8962L7228k3157L6625
$$ plain form
16286 920927 704240 546321 504098 485408 497024 624744 806365 1025703 1285230 1375289
16276 1375289 1310140 1258833 1258131 1217243 1102355 916504 684018 539698 494913 454431 389493
16265 389493 500765 750263 904893 1084969 1057201 823630 595935 460664 315724 257919
16255 257919 247823 175826 143938 104292 1400 21705 4832 63086 61153 9576 -70999
16244 -70999 -43645 -10697 69966 152523 124897 22453 -14275 -80423 -99851 -48970 -31007
16233 -31007 -1771 20299 64093 94951 34256 -40294 -25125 37084 97124 88585 8888 70998
16221 70998 145007 180681 110969 98921 3344 -60821 -19780 71260 -5161 -76659 -153284 -100463
16209 -100463 -37403 -6930 20964 -6693 -37193 -2373 -19615 -48577 -11349 -34506 2119
16198B119J2383j4012l7020j6372l90N5551M3794j4318j9929j1774Q496l8848
16186c0320J0039J0850K3585P803K6439L1444l4043j09754J0281k3145L5808P2436
16174C1423k1095K7811j6991n1945k3671j6380m7321K9725O2539l5453m4181N031
16162a00508L7013o4282M0217N7281j2908n9837l935J29690Q2517q2532k9498
16151f782P4855M3740k7550r2228o6839j5445J3894r999k6046L9257m830N6679
16139b1294J9118k0859L9635j5651R627j9089L88p9797n4187M3706K4070r847
16127h4180l8477j251M8055k0245n4641k7612K4207L397m71N1016k83m39L5532
16114f5392K5634k1942j2290l6270K8847N2072P947K1562k3293l0939L5829o0858
$$ plain form
16198 2119 14502 490 -36530 -52902 -53292 2259 46053 31735 11806 32 8528 -30320
16186 -30320 -20281 -9431 14154 21957 48396 79840 45797 -63957 -53676 -76821 -41013 31423
16174 31423 10328 38139 21148 -30797 -54468 -70848 -118169 -88444 -25905 -61358 -105539 -100508
16162 -100508 -63495 -127777 -87560 -30279 -43187 -103024 -106959 22731 105248 22716 -6782
16151 -6782 68073 111813 84263 -7965 -74804 -90249 -76355 -86354 -112400 -73143 -77973 -21294
16139 -21294 -2176 -23035 16600 949 10576 -8513 -8125 -87922 -142109 -98403 -74333 -84180
16127 -84180 -122657 -123908 -75853 -96098 -150739 -178351 -154144 -150747 -151218 -100202 -100485 -100924 -65392
16114 -65392 -39758 -61700 -73990 -110260 -81413 -29341 -21394 168 -23125 -54064 -18235 -79093
16102g9093j757Q8751J07184l2229j06831q5921L0958q784K9877l46M8329J5260
16090E398m6900l4441k5437m2384R3221O8124k1128j3267k8162l2709p0780P4518
16078g3947r198p0350K7065n9921Q5235K5933j1188M8145n4392L6667N7864m4677
16066d2764l2835k7880M5252l064j9622j6848L7770O5024P1196m4850j07757p2323
16054a48701Q010K6704L4300K7146J0407l6775j7900L858K9374P289L1368J5849
16042i071m6998L6560J5466p4443p6852J11066R0973N8525o8395k3778M945j8534
16030e36j1457m912n3920l789J642P1926L5894k4290k8483L2430k3043o5193j4563
16017h8294O1352J1005N2196P9549p9761j3311L557K9326n9606q2951j3914M7194
$$ plain form
16102 -79093 -80850 7901 115085 82856 -23975 -109896 -78938 -87722 -57845 -58191 -9862 5398
16090 5398 -41502 -75943 -101380 -143764 -50543 17581 -3547 -16814 -44976 -77685 -148465 -73947
16078 -73947 -83145 -153495 -126430 -186351 -101116 -75183 -86371 -38226 -92618 -55951 1913 -42764
16066 -42764 -75599 -103479 -58227 -61291 -80913 -97761 -59991 5033 76229 31379 -76378 -148701
16054 -148701 -140691 -113987 -79687 -52541 -42134 -78909 -96809 -92951 -63577 -56288 -24920 -9071
16042 -9071 -56069 -19509 -4043 -78486 -155338 -44272 46701 105226 36831 13053 17998 -536
16030 -536 -11993 -16905 -70825 -74614 -72972 -1046 34848 10558 -17925 14505 -8538 -73731 -88294
16017 -88294 -26942 -15937 36259 115808 36047 22736 26293 55619 -3987 -86938 -100852 -53658
16005e3658P2856M0369m020j8208j9009n9210l5142K3568K2068k8457M2820M8094
15993C2071m0219k8983J5169L2075q3310l7779O369K1684P7982n5011o6797o8958
15981a95707J8723M9843L4373J8317K565k7143N365M5948k9624l5912r946J1063
15969a12135R8310J567r4805k8067K4405j6821j8142J8182R1798K4356n1327J586
15957f1093J9069O2748Q8388k4439p3700n8566l848M1650O1042N3691k5738j8871
15945F0333q8224n0326o0461j8368Q8016J4243J128r75l0857N2877l8048N2583
15933a8079N0482N6173K9404j6022o45k7741m1631q5365J4627J10023k9270J3092
15921E5048J9540N022k6002q085k351k6846l6227O8331n935j06372P21j2949N9401
$$ plain form
16005 -53658 19198 59567 55547 37339 18330 -40880 -76022 -52454 -30386 -58843 -16023 32071
15993 32071 -8148 -37131 -21962 10113 -73197 -110976 -104607 -82923 -4941 -59952 -126749 -195707
15981 -195707 -176984 -127141 -92768 -74451 -71886 -99029 -93664 -47716 -77340 -113252 -123198 -112135
15969 -112135 -13825 -12258 -107063 -135130 -110725 -127546 -145688 -127506 -35708 -11352 -62679 -61093
15957 -61093 -42024 20724 109112 84673 10973 -47593 -51441 -9791 51251 104942 79204 60333
15945 60333 -27891 -78217 -138678 -157046 -69030 -54787 -53659 -54634 -85491 -32614 -70662 -18079
15933 -18079 32403 88576 117980 101958 101313 73572 31941 -53424 -38797 71226 41956 55048
15921 55048 74588 79610 53608 45523 43172 16326 -19901 48430 42495 -63877 -63156 -76105 -16704
15908a6704M4429p9919r3407P0173J990l9589J8574K2035J8889K0749M811j8133
15896d6102j1785L0900P5170k005Q030j18954L3440M0959p1952M889L2094J22288
15884I6972M8966n5902j3879L3681J0138j9456j09776p0917j5319M394J0293p0249
15872a51054O6347N0544p9325P7011J16468l1155q6285n1803L6408O3991M1046
15861E2193k1631p751J8480L670K2417j9222K230N4517l0512o0779K8962M7894
15849I0468M1822J478l400J0189o7530p3253o583q439o3771J0879L1392J6328
15837b0420J6032k3948m6217O5256J2407l7318J3824J9254m505q9061n1455l7912
15825a84063J7036M2563K8104Q6568l231j14947o3598N7427O9985N4339K2858
$$ plain form
15908 -16704 27725 -52194 -145601 -75428 -73438 -113027 -94453 -72418 -53529 -32780 -27969 -46102
15896 -46102 -57887 -26987 48183 46178 54208 -64746 -31306 9653 -62299 -57410 -25316 96972
15884 96972 145938 90036 76157 109838 119976 100520 -9256 -80173 -95492 -91098 -80805 -151054
15872 -151054 -84707 -34163 -113488 -36477 79991 48836 -37449 -89252 -52844 11147 52193
15861 52193 30562 22811 41291 44961 67378 48156 50386 104903 74391 13612 42574 90468
15849 90468 132290 133768 130368 140557 73027 -226 -6809 -15248 -79019 -68140 -36748 -20420
15837 -20420 -4388 -28336 -74553 -9297 3110 -34208 -20384 -1130 -5635 -94696 -146151 -184063
15825 -184063 -167027 -124464 -96360 -9792 -13023 -127970 -191568 -134141 -64156 -9817 13041
15814A3041J0072k4310q6685L2739L3215p7420k2514K1404L1886J12766P7675
15803A21869L4632n9142q8732l4702k346M84l245n3611O028J0482m3720p1289
15791a83292Q0920J29689K5376p1464l7720j0249k9517N3985K9874k556j7178
15780c2132K1747P978o678l8235k7827j7791J3005J0794n1063l8866R6461K8171
15768c4436N411k407J6465K5623o4833l0808m9526J2714J1432Q086k1193j5349
15756a38821J05344q654J6890M7290J3286k245r2657k6182J029O607K7902j0811
15744f1022R690m487j067j4957n7207o9016L8971Q4203O882J41064L3092m7492
15732E8654q2634l2294k8369j3368o1252j759M620P1309j4101j4993n5363M5380
$$ plain form
15814 13041 23113 -1197 -87882 -55143 -21928 -99348 -121862 -100458 -68572 44194 121869
15803 121869 156501 97359 8627 -26075 -28421 -27937 -31182 -84793 -78765 -68283 -112003 -183292
15791 -183292 -102372 27317 52693 -18771 -56491 -66740 -96257 -42272 -12398 -14954 -32132
15780 -32132 -10385 -2407 -9085 -47320 -75147 -92938 -79933 -69139 -120202 -159068 -62607 -34436
15768 -34436 -29025 -31432 -14967 10656 -54177 -84985 -134511 -121797 -110365 -102279 -123472 -138821
15756 -138821 -33477 -42131 -25241 22049 35335 33090 -59567 -85749 -84720 -78113 -50211 -61022
15744 -61022 -51332 -55819 -56886 -71843 -129050 -198066 -159095 -74892 -68010 73054 106146 58654
15732 58654 -23980 -56274 -84643 -98011 -159263 -161022 -156402 -85093 -99194 -114187 -169550 -124170
15720a24170Q4786k1770N010K911P4519J6699k6175p7635l679n7134l4550K4451
15708a36737l375J8981L5748j6098R169l1470K5219m970P987M3872P8011K0440
15696D6777M4065l6035K121O750J0430o7809q2002O892r368l1445L8176j0509
15684h1957n0400L0191O3339L9696L8171J8546j0513o5453P781p2578m2987K923
15672a23241Q9593m9682N5684O455k6582Q4382O0345j1558k9330J732M3359j08518
15660g361l148K5334m0692L8306L5551n703q064l5003O2716K3575k6574l2962
15648B5975l4679L7147J8111P6477P4418l3212j48827n3812K5123O1042r892j16866
15636g8995n8023m7927J01473L111J814N5125N0085K9887J9034n7797k4797k5181
$$ plain form
15720 -124170 -39384 -61154 -56144 -53233 21286 37985 11810 -65825 -69504 -126638 -161188 -136737
15708 -136737 -140112 -121131 -85383 -101481 -92312 -123782 -98563 -103533 -95546 -51674 26337 46777
15696 46777 90842 54807 56928 63678 74108 6299 -75703 -68811 -78179 -109624 -71448 -81957
15684 -81957 -132357 -102166 -38827 869 39040 57586 47073 -18380 -10599 -83177 -126164 -123241
15672 -123241 -33648 -83330 -27646 -21191 -47773 36609 96954 85396 56066 57798 101157 -7361
15660 -7361 -10509 14825 -25867 12439 47990 42287 34223 -780 61936 85511 58937 25975
15648 25975 -8704 28443 46554 123031 197449 164237 15410 -38402 -13279 47763 37871 -78995
15636 -78995 -137018 -184945 -83472 -80361 -78547 -23422 26663 56550 75584 17787 -7010 -32191
15624c2191J1010K8565l5817j9168N3260L7966K1028j756q1448r0429J938M74
15612a06568n850J2285K9740J2829l6359O3002l3545m4288J46167M3899N5645
15601A36957m2751m4601n485l564k0424k6615j7059J9296r4506q693M497O2267
15589d0681Q2124L1723j6329m0911p0005n1488K1015K2182J6664L432m80K7343
15577a5411M1830k7758j8991P1671M7824k5085p2521j07578J8070L7142L390L4727
15565a2690O4473j32278m5525J43562O8209l9732j38580M5167J6831k0963m8711
15554a00237K5382J3345j2224N002N0112q401O48K3863L026K5744k5027q6551
15542h5318N8349R2039O660K830m4734l304M5179O497m4430q2974K6411P067m4397
$$ plain form
15624 -32191 -21181 7384 -28433 -47601 5659 43625 64653 62897 -18551 -108980 -107042 -106568
15612 -106568 -112418 -100133 -70393 -57564 -93923 -30921 -64466 -108754 37413 81312 136957
15601 136957 94206 49605 44120 40556 20132 -6483 -23542 -4246 -98752 -107445 -102948 -40681
15589 -40681 41443 73166 56837 15926 -54079 -105567 -84552 -62370 -45706 -42274 -42754 -15411
15577 -15411 26419 -1339 -20330 51341 99165 74080 1559 -106019 -87949 -50807 -47417 -12690
15565 -12690 51783 -80495 -126020 17542 85751 46019 -92561 -47394 -30563 -51526 -100237
15554 -100237 -74855 -61510 -73734 -68732 -18620 -27021 -26373 -2510 516 26260 1233 -85318
15542 -85318 -26969 65070 71730 74560 29826 26522 71701 78198 33768 -49206 -22795 -15728 -60125
15529f0125q0124K9380K9358l4510L2686J24288M7133j9187J266m7353k9431L9185
15517C2566n0513j29532L967Q1254L5508j678k3897k9989J5127N2428R4194q1381
15505a946q9995J9894P570j1987m6555J0341J5614K2773P0405M7539l0653p5695
15493f2695l9687J11673J4428j0775K5502K0331M0606J2493j00350m4629n6852
15482h9955n4937j3537l8437R3746J80712J8232p1829k9151K6557K3258K3898
15471F8557k1976l6578n7313p8188M1507Q0541M400K9579R0630m0597j4741k849
15459F2972p2850j6960K9093j00393l4105P6110O0388k6687M5986j849r352O4167
15447G6520j3091p2990l9822k8487o5489L9728P5630M0302J863m0109J2573n3955
$$ plain form
15529 -60125 -140249 -110869 -81511 -116021 -83335 40953 88086 68899 70165 22812 -6619 32566
15517 32566 -17947 -147479 -143512 -62258 -26750 -28428 -52325 -82314 -67187 -14759 79435 -1946
15505 -1946 -91941 -72047 -64477 -76464 -123019 -112678 -97064 -74291 -3886 43653 13000 -62695
15493 -62695 -102382 9291 23719 12944 38446 58777 99383 111876 11526 -33103 -89955
15482 -89955 -144892 -158429 -196866 -103120 77592 95824 23995 -5156 21401 44659 68557
15471 68557 46581 10003 -47310 -125498 -83991 -3450 950 30529 121159 80562 65821 62972
15459 62972 -9878 -26838 2255 -98138 -132243 -56133 4255 -22432 23554 21705 12353 76520
15447 76520 63429 -9561 -49383 -77870 -143359 -103631 -28001 12301 14164 -25945 -13372 -67327
15435f7327J2053P3387m8631j8210N6346O4456j9654j39111q1886l8733N2857
15424a54453J34211j7502J9061m3488p396N2705J4313K3038k5380j2272R875M3464
15412C6176L135l1084l54K4740l4813l4621p3370q12N7517L5604R809K8037p22
15399A9242l0634K8265p7538n4046N229N6244L7030k8250k640o584M1838l2224
15387d4068n4447j2033l3069j5284J37262K2607k7617m5078O6212m3756M8066
15376a205P3466P027m1005o5628k7657M4952n6107M0385K3546j2294N4782K2737
15364F2999j11636m310J11191M0639k2766k1168J00028P338j25246j11850O7668
15353g113q209K8706l7011l2313p4336l5146J2952K0200k1207O0229J9202m526
$$ plain form
15435 -67327 -55274 18113 -30518 -48728 7618 72074 52420 -86691 -168577 -207310 -154453
15424 -154453 -20242 -37744 -18683 -62171 -69567 -16862 -2549 20489 -4891 -17163 -7288 36176
15412 36176 39311 8227 7873 32613 -2200 -36821 -110191 -111003 -53486 -17882 -8073 19964 19242
15399 19242 -11392 16873 -60665 -114711 -109482 -53238 -16208 -44458 -47098 -53682 -11844 -44068
15387 -44068 -98515 -110548 -143617 -158901 -21639 968 -26649 -71727 -5515 -49271 -1205
15376 -1205 72261 79288 38283 -27345 -55002 -10050 -66157 -25772 -2226 -14520 40262 62999
15364 62999 -48637 -52947 58244 98883 76117 54949 154977 162315 37069 -74781 -7113
15353 -7113 -15322 13384 -23627 -55940 -130276 -165422 -152470 -132270 -153477 -93248 -74046 -78572
15341g8572J7840M8473J8169p7348q487P3735L2472P3324j7592j8831m469k5309
15329C3405j1639M4916m9389l5151Q720L7262R281K7255k0063m6966O0101l0163
15317B7569p1981k5173M4920O9830M1699k2207j8013j5547o3690l2792J3416k8876
15305h0845n7573Q4913J07245K8489n6672r898k3849j6271L1020n7991K0839k3837
15293e4430o3077L1022M2927N5223O1838L1426j4028n8526J9340N590j12097k9025
15281h3817R455O1826J9851r1259n9588Q586p44n5418k1473N5719k0323K1734
15269a55451Q9390K0540k9650J721L48l1771R3721J480L6371J222J8919n4787
15257g947r9015j5695O7897p00J2885R9554P3548K988j4484O913n236j15091M4260
$$ plain form
15341 -78572 -60732 -12259 5910 -71438 -79925 -6190 26282 99606 82014 63183 58714 33405
15329 33405 21766 66682 17293 -17858 -9138 28124 37405 64660 44597 -2369 57732 27569
15317 27569 -44412 -69585 -24665 45165 86864 64657 46644 31097 -32593 -65385 -51969 -80845
15305 -80845 -138418 -53505 53740 82229 25557 15659 -8190 -24461 6559 -51432 -30593 -54430
15293 -54430 -117507 -86485 -43558 11665 73503 104929 90901 32375 51715 57305 -54792 -83817
15281 -83817 -74362 -12536 7315 -83944 -143532 -134946 -135690 -191108 -212581 -156862 -177185 -155451
15269 -155451 -66061 -45521 -75171 -73450 -73102 -104873 -11152 -9672 26699 27921 46840 -7947
15257 -7947 -106962 -122657 -54760 -55460 -42575 56979 130527 133515 119031 125944 120708 5617 49877
15244D9877L8124O747o4549n8870K4278k2149j3061J328n1849M388M1502J2243
15232c1991r641r395n1897L8815l092k4554l2926N1890l2234K5558Q1858L2355
15220C4746o7836j9523K1972K0049m5138q145N3784r086J4830J9379j0742K7150
15208C1440l7202J7366o262p1712L5275J8756j4939j25134k3764K626J00103n059
15196g8506l1943k0802Q3277J23433J1511O1746m3284k4772q163K4541o1125M250
15184D0163M5012k5880k8270J1940K9482m3534r1412m6339J6156M8609m7330k9159
15172a20562m0036M0136J1822p860N766Q3134M1821O9099n6192l5135M4787K9549
15160F6329l5741n0020N0238M2138o2699j9064m5755o0990K1271k1233N3314M1678
$$ plain form
15244 49877 88001 94748 30199 -28671 -4393 -26542 -39603 -38275 -90124 -85736 -44234 -31991
15232 -31991 -41632 -51027 -102924 -64109 -67201 -91755 -124681 -72791 -105025 -79467 2391 34746
15220 34746 -33090 -52613 -30641 -10592 -55730 -63875 -10091 -19177 -4347 15032 4290 31440
15208 31440 -5762 11604 5342 -66370 -31095 -12339 -27278 -152412 -176176 -173550 -73447 -78506
15196 -78506 -110449 -131251 -47974 75459 86970 148716 105432 80660 72497 97038 35913 40163
15184 40163 85175 59295 31025 42965 72447 28913 -62499 -108838 -92682 -44073 -91403 -120562
15172 -120562 -160598 -120462 -108640 -116500 -110734 -27600 14221 83320 27128 -8007 36780 66329
15160 66329 30588 -19432 30806 72944 10245 -8819 -54574 -115564 -94293 -115526 -62212 -20534
15148b0534N7403J6676o2313O056m4055k8805J4945L2499L4984l807q0366j1646
15136h8963J515Q1636J00531R9214q076r0504j09785p5653M5184J2157k1940q0713
15124a35397m8861q980P2037N5995n938J7663L0143P1103m0139j06834j9501J0163
15112a08546P6912N0985k3084N0962k5151K5340k4922k7127N8514J4888J676R436
15100G9883k9975m445q064j420L29j3813j3798o2258L9694P2218m1751j3799J6895
15087A9696k7660n3262J0492M9083K856l8076l1984N231K9068K8376l147K8819
15075A9492O7118j8783m1173L5268R070n365j190j0456L2584J2860l7911j05816
15063d4302o98L8677R756k0046P4239M6798j3389l867n7483l750K2088R8122j9256
$$ plain form
15148 -20534 36869 53545 -8768 -2712 -46767 -75572 -60627 -28128 6856 3049 -77317 -88963
15136 -88963 -87448 -5812 94719 193933 185857 95353 -14432 -90085 -44901 -32744 -54684 -135397
15124 -135397 -184258 -193238 -121201 -65206 -71144 -53481 -23338 47765 7626 -99208 -118709 -108546
15112 -108546 -31634 19351 -3733 47229 22078 47418 22496 -4631 53883 68771 70447 79883
15100 79883 49908 45463 37399 35979 36308 22495 8697 -53561 -13867 58351 16600 2801 19696
15087 19696 -7964 -61226 -50734 -1651 1205 -36871 -68855 -63624 -34556 -6180 -9327 19492
15075 19492 86610 67827 26654 61922 70992 65627 64437 53981 86565 99425 61514 -44302
15063 -44302 -45000 -6323 3433 -16613 57626 104424 91035 87168 29685 25935 48023 146145 126889
15050A26889o6210J3713k2944o5090n4238m7776N5114J10063j4989q074K1906
15039D8364N482o8850O928K5014r411m8691J6945N8562j01298k4768J22794L0373
15027F1444m7288o0787k9652O419P7744K9266n1811M4423m2957r7724m9935j1136
15015a71994K7830J927o1208K3723M7147P815m329J25597M3750L8014j9943L1729
15003I0058j6168j4711o850R2037J0454n8011l5743L0934l1274p5182k4781J8897
14991b0340Q698k4367l8028p084k2434m8236j3462l4891M7006K6850K810P782
14979a15696P741m7306K7988J51559L6865n7029L895L096o1393k2706l11q557
14967h1854L9501O2025L0373l0323r2647n51j7827M9418Q6863q31n0454O6627
$$ plain form
15050 126889 60679 74392 51448 -13642 -67880 -115656 -60542 49521 34532 26458 48364
15039 48364 53846 -15004 -8076 16938 7527 -41164 -24219 34343 -66955 -91723 31071 61444
15027 61444 14156 -46631 -76283 -69864 7880 37146 -14665 29758 -13199 -110923 -160858 -171994
15015 -171994 -144164 -142237 -203445 -179722 -132575 -124760 -129089 -3492 40258 78272 58329 90058
15003 90058 73890 59179 52329 144366 154820 96809 61066 92000 60726 -14456 -39237 -20340
14991 -20340 -11642 -36009 -74037 -81121 -103555 -151791 -165253 -200144 -153138 -126288 -123478 -115696
14979 -115696 -107955 -155261 -127273 24286 61151 4122 8017 11113 -50280 -72986 -73297 -81854
14967 -81854 -42353 19672 50045 19722 -72925 -73476 -91303 -41885 44978 44147 -6307 60320
14955F0320K6235l2408q5696m1425r043L4853P974j7816L5194N3774J691n2774
14943a9121k5576M2117o4180j2693O3098J7786J9067J0933k4968K226P4169l4979
14931D7879n6528m9519k0722p726k0900N0281l873P1471j458j3549k1811P8152
14919E1697O2890m9621p8697M985K457N332L7966N0283o1385m1869m6565O2751
14907B24M0377N9003p7780L540J5371n6221n3352l3081j5114P900K2793Q3131
14895c209J4743R599K0392m6010o3541J7833K5517k847M4764M2398L0132J4235
14883A04006p0468l3127j034J0374J4712m4718J2937j8610K0053M2845j4814n7304
14871c5148m4975j6765J0977K1780k7718J7998M2513K8809J8391r540j3027k00
$$ plain form
14955 60320 86555 54147 -31549 -72974 -82017 -47164 -39190 -57006 -21812 31962 33653 -19121
14943 -19121 -44697 -2580 -66760 -79453 -16355 1431 20498 31431 6463 8689 82858 47879
14931 47879 -8649 -58168 -78890 -86616 -107516 -57235 -61108 10363 8905 -4644 -26455 51697
14919 51697 114587 64966 -13731 -8746 -6289 -957 37009 87292 25907 -15962 -62527 224
14907 224 40601 99604 21824 25364 40735 -15486 -68838 -101919 -117033 -109133 -86340 -3209
14895 -3209 11534 21133 41525 -4485 -68026 -50193 -24676 -27523 17241 59639 89771 104006
14883 104006 33538 411 -623 9751 24463 -20255 -7318 -25928 -5875 36970 22156 -35148
14871 -35148 -80123 -96888 -85911 -64131 -91849 -73851 -31338 -2529 15862 6322 -6705 -6905
14859f905k9735K7865R4413k7063j1310m4396j5715K1164L1668L2534r195L757
14847F7082l6748P5048l0120o79o488k421n4436P184r677k163j4330M9684J676
14834D3612j8645K957j5741J3667M1106K7012j0175J9740J2770O1952O7134L8630
14822B84019J3602j3344m8058m3175j2774J4728k7562j17890n4399J0013K6674
14811C1834J6410m6138o8344L6015K3846j5436M2638l4508k212P258m5195M3733
14799a0099M6362O2674L5129n9127J4922o251k0512p8713m5715M6686L5132J3704
14787C4192L7209J0719R77M277m2758m9365K6680j0439N6102p800j13218l8896
14775i2320K6636Q190l0482Q512Q9767J1835o0043Q6446K4347l0549l5601q1274
$$ plain form
14859 -6905 -36640 -8775 85638 58575 47265 2869 -12846 8318 39986 72520 63325 67082
14847 67082 30334 105382 75262 74583 68095 65674 11238 18422 8745 6582 -7748 41936 43612
14834 43612 24967 27924 12183 25850 66956 93968 83793 103533 116303 178255 245389 284019
14822 284019 297621 284277 236219 193044 180270 194998 167436 49546 -4853 5160 31834
14811 31834 48244 2106 -66238 -30223 -6377 -21813 20825 -13683 -15895 -8637 -53832 -10099
14799 -10099 36263 98937 134066 74939 89861 83610 63098 -15615 -61330 -14644 20488 34192
14787 34192 71401 82120 83097 87374 44616 -4749 21931 11492 67594 59794 -53424 -92320
14775 -92320 -65684 -57494 -87976 -79464 10303 22138 -37905 48541 72888 42339 6738 -74536
14763g4536L3869N7410j5303j6009J6598N6488p559j0562m1466r0171j3559K8965
14751g5835j2288K3862K6806J9458L1241N0891R4876N80p9729m9303l4512o3674
14739f7627L2632J1097K2757M8191J6458k0044j8792N1534M772n9426m2041k1404
14727d1893o497J2673j8171O6828P3055m9642o0999K2138M8389K9621j9274j5025
14715D1203L011L9105k3671O363k091k9420l8053l105l677m0333M1306O457j8054
14702b0959N1313J6297L0400N47o3539q224m1528L1768n04j0085N841j3314R1899
14689F9912Q1832P463k2403J0480R112J0360p1194L0381l4501r9978L4220p418
14677A8266K368M4180j2665k6230l2804P3066N362L9931J5396K8416Q0517L5251
$$ plain form
14763 -74536 -40667 16743 1440 -14569 2029 58517 50958 40396 -1070 -91241 -104800 -75835
14751 -75835 -88123 -64261 -37455 -17997 13244 64135 159011 159591 79862 30559 -3953 -67627
14739 -67627 -34995 -23898 -1141 47050 63508 43464 24672 76206 80978 21552 -20489 -41893
14727 -41893 -48390 -35717 -53888 12940 85995 36353 -24646 -2508 45881 75502 56228 41203
14715 41203 44214 83319 59648 66011 63920 34500 -3553 -6658 -10335 -50668 -9362 -2905 -20959
14702 -20959 30354 46651 77051 77598 14059 5835 -35693 -3925 -4429 -14514 -8673 -21987 69912
14689 69912 151744 159207 136804 147284 156396 166756 95562 125943 91442 -8536 25684 18266
14677 18266 20634 64814 52149 25919 -6885 66181 71543 111474 126870 155286 235803 271054
14665B71054J3543O1814q2927k5915O8109J20312Q9461k846m3266o1068P6114
14654D84385m1763o7595m3672J8532j1919j9727r713r3111j07310k5365Q4233
14643A66975k1622L840j13196K311o6522M33L8378L2024J0852O7074R746m8863
14631H1430N897J0261n3693k8748M1181L6511O3889j4308l3456J5665n4716k6520
14619D3393k2811J6843L4959o5j2055m0768l9703O6998k0205l0863K8088L9358
14607F3169K3292p791n5624N987k4093m3792O555J2701J3887j6783l4630l3034
14595i0156M8455j7590j0245M7508M8653J4815M1237L5709k079n767q9355N1377
14583G2562N2637j6649m7832o703k1973J2641Q608r1137j76189K7912j2547J00195
$$ plain form
14665 271054 284597 346411 263484 237569 305678 425990 515451 512605 469339 408271 484385
14654 484385 442622 375027 331355 349887 337968 318241 308528 215417 108107 82742 166975
14643 166975 145353 149193 35997 38308 -28214 -27781 10597 42621 53473 120547 130293 81430
14631 81430 87327 97588 43895 15147 56328 92839 156728 142420 108964 124629 69913 43393
14619 43393 20582 37425 72384 72319 60264 19496 -20207 46791 26586 -4277 23811 63169
14607 63169 86461 78670 23046 29033 4940 -38852 -32297 -19596 -5709 -22492 -57122 -90156
14595 -90156 -41701 -59291 -69536 -22028 26625 41440 82677 118386 116307 110540 21185 72562
14583 72562 125199 108550 60718 54015 32042 44683 53291 -37846 -214035 -186123 -198670 -98475
14571i8475O8617N503M2660J600j0365K0443J5208J8843r13o734n0068R6793P1901
14558A75013j2856m317j03801J5119J9498k602O9287n60k3209K7485J4544m0319
14546A33282l1753j4797l9771L6722R7364j9139o7150o5395L6594J32491J09254
14535C07702o84O7998n1002M3264N407P0282R1746L2717K0231j8733l0780P6010
14523F14158Q1898O2645q2372R5424R6360R2035Q9687J12425R8821N6804M2334
14512A360219N7229R5887M5543O2209N2402L8212j40411j03267j24985j40456
14502A202582j90171p7755n4080J9180m0783m7220N6835N995k8628o0092m7813
14491G38050m1619J664l1152o796O1804L8603J0108K9997J28543Q1569L1364J40306
$$ plain form
14571 -98475 -29858 -24355 18305 19905 9540 29983 45191 64034 63121 56387 6319 103112 175013
14558 175013 162157 157840 54039 69158 88656 86054 155341 154781 131572 159057 173601 133282
14546 133282 101529 86732 46961 83683 181047 161908 94758 29363 65957 198448 307702
14535 307702 307018 375016 324014 367278 372685 442967 534713 567430 587661 568928 538148 614158
14523 614158 696056 758701 676329 771753 868113 960148 1049835 1162260 1261081 1317885 1360219
14512 1360219 1417448 1513335 1558878 1621087 1673489 1711701 1571290 1468023 1343038 1202582
14502 1202582 1012411 934656 880576 899756 858973 811753 868588 874583 845955 785863 738050
14491 738050 696431 698095 666943 660147 721951 760554 770662 800659 929202 1010771 1042135 1182441
14479A182441K13695J64840J18087J9374P6090P5105p041q2046j04402j47290
14469A508853k00786j12262j84174j93017k3844l7273p1965j19501n7206k3534
14459D85291p6741j10844n6017J7659q5378R614R3301K3690m3674q3510K3000
14448A96391k08o6635L9214L4792k1199k2853J4053k4931n3344k0545j29193o7466
14436a21924M5843K7890J6445L0546m209K0551M5943J3049J07362o224j3296l8102
14424A23874K3891N4717J2935M5403l1362p6758o376J7598m4340m0234P324N2712
14412A39384k4133o1505P408J4602N0511k2381m567n7524J0806R2199J1382o6010
14400I0172Q677o3044J7281J9018K9079Q608M4031J1803M681n0156Q5206R4414
$$ plain form
14479 1182441 1396136 1560976 1679063 1698437 1774527 1849632 1842591 1760545 1656143 1508853
14469 1508853 1308067 1195805 1011631 818614 794770 757497 685532 566031 508825 485291
14459 485291 408550 297706 241689 259348 173970 183584 276885 300575 256901 173391 196391
14448 196391 196183 129548 168762 203554 182355 159502 173555 148624 95280 74735 -54458 -121924
14436 -121924 -76081 -48191 -31746 -1200 -5409 15142 61085 74134 181496 175272 161976 123874
14424 123874 147765 202482 215417 260820 229458 152700 146324 163922 119582 79348 86672 139384
14412 139384 115251 53746 61154 75756 126267 103886 99319 41795 52601 144800 156182 90172
14400 90172 98849 35805 53086 72104 101183 109791 153822 165625 170306 120150 205356 299770
14388B99770N9354o2731j10683j0086L5305j0285Q1954N4548k6541J8143R68j4483
14376C15233j07J5540K2026n2736o724M0064j9950p7122K3806L5250j7543l5010
14364B42727j0681j6236K0903J272l446r661J8000m187p009j950l2220j8698L2630
14351B11444q5793m5743J28069p963m8609m0912p0115k4701N9563K1972M280K2221
14339A23713j3471Q2495j699j09246q3950J6685J14759R8089J2390j3785J5072
14328B41052m5339j2102j3815m6138P6792N4969J849j3581N7285J00484j9760
14317C81696j06381J0463M2840l327l0398o705L3571l2664j6459J4554M9812o2508
14305B74494r774j0019m4812J0258k3762j4002N7067k595q2704k5509N980L6825
$$ plain form
14388 299770 359124 296393 185710 175624 210929 200644 282598 337146 310605 328748 329716 315233
14376 315233 315126 330666 352692 299956 293232 333296 313346 236224 260030 295280 277737 242727
14364 242727 232046 215810 236713 237985 234539 224878 242878 238691 231682 229732 197512 178814 211444
14351 211444 125651 79908 207977 200014 151405 110493 40378 15677 75240 97212 101492 123713
14339 123713 110242 192737 191038 81792 -2158 14527 129286 227375 239765 225980 241052
14328 241052 195713 183611 169796 123658 200450 255419 257268 243687 300972 401456 381696
14317 381696 275315 285778 328618 325291 294893 288188 321759 289095 272636 287190 337002 274494
14305 274494 264720 254701 209889 220147 196385 182383 239450 236855 154151 128642 134622 171447
14293A71447Q7757p843p6839L0441J03370l6449J7505j2424O9606L8370N781K2116
14281D12838l1123q0261k6645K8812k6770O8906l771l2654o5113n5325R3605n132
14269B77367p5182K9695l2603N1703q0799m1863J1207P7845L1410l5849l4470
14258A78461j2458l5644O461J6384r325l7050k1351m5212j9642k4060M1858j7137
14246B1285L903k2437m3210K5425O3611N7239L529P9555O647n0545l1543k7556
14234H5903j7929J27733J9281k1924R156J032R0306p382q4542m6555k7893l7775
14222H9411N747N3176n090R3512N0941k5194j8034M0779N6484l4767k7830k0633
14210B58502k4577L8620K2426m552k3008K2396O0110k527k3948j0159K7648K4644
$$ plain form
14293 171447 259204 251361 174522 204963 308333 271884 289389 276965 346571 384941 390722 412838
14281 412838 381715 301454 274809 303621 276851 345757 341986 309332 244219 188894 282499 277367
14269 277367 202185 231880 199277 250980 170181 128318 139525 217370 248780 212931 178461
14258 178461 166003 130359 136820 153204 143879 106829 85478 40266 20624 -3436 38422 21285
14246 21285 25188 2751 -40459 -15034 48577 105816 109345 188900 195547 145002 113459 85903
14234 85903 67974 195707 214988 193064 202220 203252 293558 286176 201634 155079 127186 89411
14222 89411 95158 148334 143244 236756 287697 262503 244469 285248 341732 306965 279135 258502
14210 258502 233925 272545 294971 290419 267411 289807 349917 347390 323442 313283 340931 365575
14198C65575j1715n6873L3519L9926k8786L7190R1618L987k8384j559Q4927L5180
14186E64605p751n4374L1252P9622L4250O700n163K8996k238m3940K41O0505m4178
14173F48527o5916m7728m3871m7939P9277N2171l9403J2146O1919j0900O0772
14162F59055M5432J1698K249P1610J3865n5076m8222m862K0856M4293N237R8097
14150H64232Q572n0998J13771J02001N3178N614q856r165J903k3557L1574M9671
14138A137940k8198k2880P1314J75315J46166k4296r4237N440L6764K5603L9906
14127A468837Q1124L3532Q2326R5256Q2125k2310M4713R252l6167O2398J40277
14116B041363J54632R7885J31665J59247J72430J08434J34004J09916Q7462Q2156
$$ plain form
14198 365575 353860 296987 330506 370432 341646 378836 470454 474441 446057 444498 529425 564605
14186 564605 556854 502480 533732 613354 647604 654304 649141 678137 675899 631959 632200 692705 648527
14173 648527 582611 534883 491012 443073 522350 574521 535118 547264 609183 598283 659055
14162 659055 704487 716185 718434 790044 803909 748833 700611 695749 716605 760898 766135 864232
14150 864232 872804 821806 935577 1037578 1090756 1096370 1087514 1078349 1080252 1056695 1088269 1137940
14138 1137940 1109742 1086862 1158176 1333491 1479657 1455361 1361124 1366564 1403328 1428931 1468837
14127 1468837 1549961 1583493 1665819 1761075 1843200 1820890 1865603 1874855 1838688 1901086 2041363
14116 2041363 2195995 2293880 2425545 2584792 2757222 2865656 2999660 3109576 3197038 3279194
14106C279194J26385K34714J48714J95482K20075K71207K32428L29227M04485
14097E441911L93596L69418N08325M52794M91995O58154O59715Q50396Q37449
14088A0663753R79684J121647J284130J473062J728953K092415K417439K825609
14080B4586692L383016L895407M580522N516611O587820P897436R643981J1877601
14072G7969086J4519771J7341641K0302213K3162967K5315320K6375457K6068626
14065B31055081K4023341K0423766J5204152Q904284K110176m438073j0310463
14058B86972264j4997096j8133277j9684656j9890034j8869814j6993120j4796689
14051A63607578j2415723j0219977q249325o455915m870619l506113k233276j019130
$$ plain form
14106 3279194 3405579 3640293 3789007 3984489 4204564 4475771 4708199 5037426 5441911
14097 5441911 5835507 6204925 6713250 7166044 7658039 8316193 8975908 9826304 10663753
14088 10663753 11643437 12765084 14049214 15522276 17251229 19343644 21761083 24586692
14080 24586692 27969708 31865115 36445637 41962248 48550068 56447504 66091485 77969086
14072 77969086 92488857 109830498 130132711 153295678 178610998 204986455 231055081
14065 231055081 255078422 275502188 290706340 299610624 301720800 297282727 286972264
14058 286972264 271975168 253841891 234157235 214267201 195397387 178404267 163607578
14051 163607578 151191855 140971878 132722553 126266638 121396019 117889906 115656630 114637500
14043A14637500J06614J257369K504653L888513N340286P014072R001792J1190828
14035A54941627J3603243J6119311J8515434K0242428K0899378K0309242J8149602
14028B82780265J4431775R357164L141340l769016j0702285j6845484k1580410
14021B56813349k4842716k6304350k6169103k4863169k2521697j9588571j6519048
14014I6004695j3787919j1463683r449790p789864o439454n503036m769282m116978
14006C2684689l545380l103858k728760k293526j843867j697700j470653j199846
13998A4801099r92742q46125q20073p21229m77950m01449l07595l01060l60647
13989I572229l69116m37479l48860m24699m74497m03976m05272l69579k58796
$$ plain form
14043 114637500 114744114 116001483 118506136 122394649 127734935 134749007 143750799 154941627
14035 154941627 168544870 184664181 203179615 223422043 244321421 264630663 282780265
14028 282780265 297212040 306569204 309710544 305941528 295239243 278393759 256813349
14021 256813349 231970633 205666283 179497180 154634011 132112314 112523743 96004695
14014 96004695 82216776 70753093 61303303 53513439 47073985 41570949 36801667 32684689
14006 32684689 29139309 26035451 23306691 21013165 19169298 17471598 16000945 14801099
13998 14801099 13808357 12962232 12142159 11420930 10942980 10541531 10233936 9932876 9572229
13989 9572229 9203113 8765634 8416774 7992075 7517578 7113602 6708330 6338751 6079955
13980F079955k68872l31847k56763k87748k29378j12503j18866k10789k45533
13971D017656r8074r4181q6305r3230k7048k0347J2781k1403l7788P6781J32837
13960C761679J20394P7034M902J19556Q6725O5610m5290j01083j70314k31946
13950C687267k53260j51066k17819k09187j55987j46409j77735k01923j46800
13941B027081j11857n3842m1941q3569r8175m7624k3261m3869P596N5579l8250
13930A547868j1506Q249n1435M3151m154r6331Q166N1615l8457Q6046K0511l5668
13918A528055J0072r0765l4724P404M0726Q4212J08052K9505J03094R4960J82765
13907B063356K04298K57598L33639L32769K67329K03918L59569L19838L26924
$$ plain form
13980 6079955 5811083 5479236 5222473 4934725 4705347 4592844 4473978 4263189 4017656
13971 4017656 3919582 3825401 3739096 3645866 3618818 3598471 3611252 3589849 3552061 3628842 3761679
13960 3761679 3882073 3959107 3964009 4083565 4170290 4235900 4190610 4089527 3919213 3687267
13950 3687267 3434007 3282941 3065122 2855935 2699948 2553539 2375804 2173881 2027081
13941 2027081 1915224 1861382 1819441 1735872 1637697 1590073 1566812 1522943 1530539 1586118 1547868
13930 1547868 1536362 1544611 1493176 1536327 1532173 1435842 1444008 1495623 1457166 1543212 1563723 1528055
13918 1528055 1538127 1447362 1412638 1420042 1460768 1544980 1653032 1682537 1785631 1880591 2063356
13907 2063356 2267654 2525252 2858891 3191660 3458989 3662907 4022476 4342314 4669238
13898D669238J61774J68162J89532O3775Q1110J42784R8918N2833o8807m4197
13888E515122q2674j82612j56165k26987k84591k20604j60789k35854k04383j29226
13878C631237j41369n0283J3313l1773J0741R3137J82623K40656J52726J51415
13868D252423J11439J61685K00565J96422J05281J33965J05497j01752l5908O3946
13858E193563M1357P460j06709k56798j46136r3168k06856k73587k60027k43783
13848C655316l01423l27561l37792k71298k77672j67157k11418j08265q2704j12474
13838A457552j19984j16720q8465j09708o3271r537J8567m372q9284p3896J3262
13827H14144p7099n6815n8882N792o3943k8879P0849J6019K9237k9428P226k8910
$$ plain form
13898 4669238 4831012 4999174 5188706 5252481 5333591 5476375 5575293 5628126 5559319 5515122
13888 5515122 5432448 5249836 5093671 4866684 4582093 4361489 4200700 3964846 3760463 3631237
13878 3631237 3489868 3439585 3452898 3421125 3431866 3525003 3707626 3948282 4101008 4252423
13868 4252423 4363862 4525547 4726112 4922534 5027815 5161780 5267277 5165525 5129617 5193563
13858 5193563 5234920 5242380 5135671 4878873 4732737 4639569 4432713 4159126 3899099 3655316
13848 3655316 3353893 3026332 2688540 2417242 2139570 1972413 1760995 1652730 1570026 1457552
13838 1457552 1337568 1220848 1132383 1022675 959404 949867 968434 964062 874778 800882 814144
13827 814144 737045 680230 621348 627140 563197 534318 605167 621186 650423 620995 628221 599311
13815E99311m8877j8840r3696l8576k1079J7763K9698K9893J7369K1741o4682
13804D30025k9061n6356R992J7188K927K9256L5543j8773k053m4125o4985l1876
13792B77702l2654N9184l8394l4932P428O1715K92M780p152J8876m0507L6963
13780C13301J0093n9155l5051M1606R8835K3565l38m6398l7909n717k134o092
13768B94606l7373P7998K7433o4939M4173K082K3020L983m0323m3188m9870J2619
13756B50221K9013n0223K8842J3446l4602o8030K9958Q8102M2552n1424n9143
13745B18712l2805P403k3645J2533M4372O1133O564o072n3309q2376L9557L5774
13733B27841l0909j13821L6673L5275J5183k583J5551M1032J0077j1521K8518
$$ plain form
13815 599311 550434 531594 437898 399322 378243 396006 425704 455597 472966 494707 430025
13804 430025 400964 344608 354600 371788 374715 403971 439514 420741 418688 374563 309578 277702
13792 277702 245048 304232 265838 230906 238334 300049 300341 305121 297969 316845 276338 313301
13780 313301 323394 264239 229188 270794 369629 393194 392856 346458 308549 302832 300698 294606
13768 294606 257233 335231 362664 297725 341898 343980 367000 370983 330660 287472 237602 250221
13756 250221 279234 229011 257853 271299 236697 168667 198625 286727 329279 277855 218712
13745 218712 185907 193310 169665 182198 226570 287703 294267 288195 234886 152510 192067 227841
13733 227841 196932 83111 119784 155059 170242 167659 183210 224242 234319 222798 251316
13722B51316j5094r7968r0437p2379J7292J20003Q4407K6833o4746j07752K8466
13711G9941r750m937J583N9069k0881L7623j827R1295L9246l4817p4710J5400
13699A77235p0991l2044Q0797P3867L2703M9723o9665l7230L4403o1163p8927
13688I8708M095M3682k1010J4986N4260j937M604p5600l3083K1665l8299K4543
13676I6614O1484M2255O381o5452m950Q6937M8170K1824K1731O3340K2093j33647
13664B66780q6490k1413K8873M2350m1175j20148l9203j3081Q1536J02567n2880
13653A47716m3379l6299P7121j3937o4879m0116k5053J6680O6526M9232m2214
13642I1398n1335K1370J0370Q1247J5306n2754K673J7975J8358O5484k4313l4394
$$ plain form
13722 251316 236222 138254 47817 -24562 -7270 112733 197140 223973 159227 51475 79941
13711 79941 70191 65254 66837 125906 105025 142648 140821 232116 271362 236545 161835 177235
13699 177235 106244 74200 154997 228864 261567 311290 241625 204395 238798 177635 98708
13688 98708 102803 146485 125475 140461 194721 192784 197388 121788 88705 110370 72071 96614
13676 96614 158098 200353 206734 141282 136332 223269 271439 293263 314994 378334 400427 266780
13664 266780 180290 158877 187750 230100 188925 68777 29574 16493 98029 200596 147716
13653 147716 104337 68038 145159 131222 66343 26227 1174 17854 84380 133612 91398
13642 91398 40063 61433 71803 153050 168356 115602 118275 136250 154608 220092 195779 161385
13630A61385K5751K6205o1711l9816n610P2859O1620M0955l3077O9762J18780
13619D37103J06707R7724Q8976R6331N9424J09781J52279K05210J56964J02361
13609A612860Q1624Q4513N6950o2411p6521o4645n9308m6509l8712j07064q1262
13598A299515j34989m8007l7753p3751k1060r4584r2326N2798N7278r0108p0274
13587G46739j2943K4674O688J6911m116N0858J36542R7917N8578J56954J60344
13576A439146J90586J08710L4729M0434n8285J0819j1665n6298j15231j41417
13566A441528j50190j35040j18471j42113j84265j34080J8853K9597K5313m7588
13556F03544m5709m9728q2252p8712j01654j6908M3904M835L7433j3142k6926
$$ plain form
13630 161385 187136 213341 151630 111814 106204 179063 240683 281638 248561 318323 437103
13619 437103 543810 641534 730510 826841 886265 996046 1148325 1353535 1510499 1612860
13609 1612860 1694484 1778997 1835947 1773536 1697015 1632370 1573062 1526553 1487841 1380777 1299515
13598 1299515 1164526 1116519 1078766 1005015 983955 889371 797045 849843 907121 817013 746739
13587 746739 733796 758470 765158 782069 777953 828811 965353 1063270 1121848 1278802 1439146
13576 1439146 1629732 1738442 1773171 1813605 1755320 1766139 1754474 1698176 1582945 1441528
13566 1441528 1291338 1156298 1037827 895714 711449 577369 596222 625819 651132 603544
13556 603544 557835 508107 425855 347143 245489 228581 272485 277320 314753 301611 274685
13545B74685q1768P998n5870l7687j8949J17701L8210p0211q6375j4917m6347
13534B6470k8052P5763K2465m9713n0849l7082L7148N8099J3676O702J4197M5650
13522A34474p688m9544j0021M1129P3295n4210q1805N383L6663O4165K4075k1179
13510A54737m7895j1027j0011M7138k6393o5357k6772M4553L4068K1485m5156
13499F9370l7128K6831L651O890j2955J8311j4157l3103M0410J6036N3228j1560
13487A25824j5294n0548o2814J1488L1931J1365J9179R13P00K6954j3559k5663
13475F0476l2532M1232J17342Q3411n7417l1779q9013q0505p9879r209L4316k3428
13463f6985O4884j6862L160M9327m8810Q047L3208M240K805M7050j9214k882j3612
$$ plain form
13545 274685 192917 200915 145045 107358 88409 206110 244320 174109 87734 72817 26470
13534 26470 -1582 74181 96646 46933 -3916 -40998 -3850 54249 67925 74627 88824 134474
13522 134474 126786 77242 67221 108350 181645 127435 45630 51013 87676 151841 175916 154737
13510 154737 106842 95815 85804 132942 106549 41192 14420 58973 93041 114526 69370
13499 69370 32242 59073 62724 69614 56659 74970 60813 27710 68120 84156 137384 125824
13487 125824 110530 59982 -2832 8656 40587 51952 71131 72044 72744 99698 86139 60476
13475 60476 27944 69176 186518 269929 212512 180733 91720 11215 -68664 -77873 -43557 -66985
13463 -66985 -2101 -18963 -15803 33524 -15286 -7239 25969 30209 33014 80064 60850 57968 44356
13450D4356N472p264l67K651M8130p8592j04408J1809K816K5642J08663O4006
13438A22914L2251m8731L7335Q1063r897J8155n1012o1713k426K042l9671L5011
13426A15321L2287p764M916j23739j09690j3154k9247J9796M0218M4917K4294
13415a845Q0661J5351k5441j5438o5776l1179L2790K3553L6493J1322m9864l4537
13403b3910Q228L4556j9716q1675r9845L1559R0056M8728O7509M1919l7905o3110
13391c606R039m8205J6748k3459R975k1942P5625k2232m702K5615P465R153M9565
13378G9039J0866O446J3048n4577p1280l9079N528R8522L5220j09181r5531k749
13366a23728m914M5385N9342O1747k9194K6336J5373J271J1039J6357n0862l2889
$$ plain form
13450 44356 49828 42564 42197 44848 92978 14386 -90022 -78213 -75397 -49755 58908 122914
13438 122914 155165 106434 143769 224832 214935 233090 182078 120365 117939 119981 80310 115321
13426 115321 147608 139844 144760 21021 -88669 -101823 -131070 -111274 -71056 -26139 -1845
13415 -1845 78816 94167 68726 53288 -12488 -43667 -10877 12676 49169 60491 10627 -23910
13403 -23910 -15682 18874 -842 -82517 -182362 -150803 -60747 -12019 55490 97409 59504 -3606
13391 -3606 5433 -42772 -26024 -49483 -39508 -61450 14175 -8057 -12759 12856 20321 29474 79039
13378 79039 89905 96351 109399 54822 -16458 -55537 -50009 48513 83733 -25448 -120979 -123728
13366 -123728 -128642 -83257 -23915 37832 8638 34974 50347 51618 62657 79014 28152 -4737
13354d737l8595k2043P9678K8571M1439m3278j3681l5540J7661m7880n5048J9613
13342g3840Q9743Q5390R4911l3172m6827p2646m1213l8256N2741M968o6124O9619
13330B5294M8621p0842j6230K8667j6426o988M2285O777n2396l0074K8196p9457
13318i2573j1019J22691O1062l3796k4775l8049j6003q229L2480p358p2863P4608
13306a3824Q7577j00352K567L5809J5273n8006n2418R9956O3060o0960L2211q697
13294D2196P120Q1483O4869o6686q3258j9857j5300K252M2819o1581j00791j100
13282a07834N7170p345k2072L8873P520l8231J0551m9654J6904P3962N028q4363
13270i9491j6166R8997P5130j3646l0268l9020P921l4579j9339P4356n937n3573
$$ plain form
13354 -4737 -43332 -65375 14303 42874 84313 41035 27354 -8186 9475 -38405 -93453 -73840
13342 -73840 15903 101293 196204 163032 116205 43559 2346 -35910 16831 21799 -44325 25294
13330 25294 73915 3073 -13157 15510 -916 -7904 34381 41158 -11238 -41312 -13116 -92573
13318 -92573 -103592 19099 80161 46365 21590 -16459 -32462 -40691 -8211 -15569 -88432 -13824
13306 -13824 73753 -26599 -24032 11777 27050 -30956 -83374 16582 79642 18682 50893 42196
13294 42196 49316 130799 195668 128982 45724 25867 10567 12819 55638 -5943 -106734 -107834
13282 -107834 -50664 -58009 -80081 -41208 -33688 -71919 -61368 -111022 -94118 -20156 -15128 -99491
13270 -99491 -115657 -16660 58470 44824 14556 -24464 -16543 -51122 -70461 3895 -2042 -55615
13258e5615J5381J11446P7587o3128r0684K027O784N3980L5100p5607k2406R1684
13246H6549j6737l5929k4712K6283k9219j9812J5572N4550K7526q9486r5558N0811
13234e0162P3344k6598n4995N7733J4734r027n1843R7945M9458l7241Q0963K1669
13222A65980k9764j9386n1492L9326P7641m1364j37447m6877R7014M1536j02306
13211g139q1351J6504K9669J1179J8430q492J0313J8604L998J7764N460J5499
13199E0438l402N648K1979r82K7359O2801l982m7219r2397m0296J7308L5685J3319
13186D6259J2105q950m1069j9607L5350Q9881J104o4038K1371m548L6887M7261
13174A52006l8820q5307o8435k5699k1597N6896R8196K507k7386p521p075m5160
$$ plain form
13258 -55615 -40234 71212 148799 85671 -5013 -2986 3798 57778 92878 17271 -5135 86549
13246 86549 69812 33883 9171 35454 6235 -13577 1995 56545 84071 -5415 -100973 -50162
13234 -50162 23182 -3416 -58411 -678 14056 5029 -46814 51131 100589 63348 144311 165980
13222 165980 136216 116830 65338 104664 182305 140941 3494 -43383 53631 95167 -7139
13211 -7139 -88490 -71986 -42317 -31138 -12708 -21200 -10887 7717 11715 29479 34939 50438
13199 50438 47036 52684 74663 73681 101040 163841 159859 112640 20243 -20053 -2745 32940 46259
13186 46259 58364 49414 8345 -11262 24088 113969 115073 51035 72406 67858 104745 152006
13174 152006 113186 27879 -40556 -66255 -87852 -30956 67240 69747 42361 34840 27765 -17395
13162a7395L4802l1319m3904k3154K4300K3173J1898j6649n8265K770r760N403
13150i8100N9744J11567M1612p5083J4724o3797L8828J2453k6814k5280J294L0466
13138B1614l2001K7087J4558J5058o3422p4589L3484K5051O4350q070j9891K168
13126E397l2124q610n011m9405m860p839l7492L459N53K9009N9007K6462K9821
13113H367J4964M9306n3274o176N9038M901o6895n3358p9523r1928N7089R9227
13101e8262m4692l1107m8514J0070O6559m757N7993O0069N8955K3251k4904k1482
13089D3179o5863o8264o8336J1270Q5460J8862n8421L4510k9920k7401L5235R1646
13077A957R3858j3894L2329N8396J8262p1761m8910r292q2146l6323M1053P2520
$$ plain form
13162 -17395 17407 -13912 -57816 -80970 -56670 -33497 -21599 -38248 -96513 -93743 -103503 -98100
13150 -98100 -38356 73211 114823 39740 54464 -9333 29495 41948 15134 -10146 -8852 21614
13138 21614 -10387 16700 31258 46316 -17106 -91695 -58211 -33160 31190 23120 3229 5397
13126 5397 -26727 -35337 -40348 -89753 -94613 -102452 -139944 -136485 -135932 -106923 -47916 -21454 8367
13113 8367 23331 72637 19363 13187 72225 77126 10231 -43127 -122650 -214578 -157489 -58262
13101 -58262 -102954 -134061 -182575 -172505 -105946 -110703 -52710 7359 66314 89565 64661 43179
13089 43179 -22684 -90948 -159284 -148014 -62554 -43692 -102113 -67603 -97523 -124924 -89689 1957
13077 1957 95815 81921 114250 172646 190908 119147 70237 60945 -21201 -57524 -16471 56049
13065E6049k9920k7516J1683J1448n7878j2773j8520l2355j1837p005Q4183N1658
13053A7217M1565L2953j4978K5851m1702m2640k5224k6845m4917j0325N9196l0672
13041f0521K9278O925M755M0463L6963j6662R448j3171L0444L1307l2999l1914
13029C4316J3976l111J7851p4366k725J3257J01799O8869m2357o7230Q595l1610
$$ plain form
13065 56049 26129 -1387 10296 21744 -36134 -48907 -67427 -99782 -111619 -118624 -34441 17217
13053 17217 58782 91735 76757 102608 60906 18266 -6958 -33803 -78720 -89045 -29849 -60521
13041 -60521 -31243 -24318 -19563 20900 57863 41201 50649 37478 67922 99229 66230 34316
13029 34316 48292 45181 63032 -11334 -14059 -802 100997 169866 127509 60279 68874 37264
$$ [...]
##END NTUPLES=NMR SPECTRUM
##END=
