##TITLE=Analysis number 325591
Compound Code cc 20308
Project Code adrs
Chemist Name fudan
##JCAMPDX= 6.0         $$ Bruker NMR JCAMP-DX V2.0
##DATA TYPE= NMR SPECTRUM
##DATA CLASS= NTUPLES
##ORIGIN= Bruker BioSpin GmbH
##OWNER= nmr
$$ XWIN-NMR		Version 3.5
$$ Mon Jan  8 09:27:58 2007 GMT Standard Time (UT+0h)  MAYBRIDGE\nmr@NMR_250MHZ
##.OBSERVE FREQUENCY= 250.131544655141
##.OBSERVE NUCLEUS= ^1H
##.ACQUISITION MODE= SIMULTANEOUS (DQD)
##.ACQUISITION SCHEME= undefined
##.AVERAGES= 16
##.DIGITISER RES= 18
##SPECTROMETER/DATA SYSTEM= dpx250
##.PULSE SEQUENCE= zg30
##.SOLVENT NAME= CDCl3
##.SHIFT REFERENCE= (INTERNAL, CDCl3, 0, 16.5196)
##AUDIT TRAIL= $$ (NUMBER, WHEN, WHO, WHERE, WHAT)
$$ ##TITLE= Audit trail, XWIN-NMR		Version 3.5
$$ ##JCAMPDX= 5.01
$$ ##ORIGIN= Bruker BioSpin GmbH
$$ ##OWNER= nmr
$$ C:\u/data/dgb/nmr/ADRS/720/pdata/1/auditp.txt
$$ ##AUDIT TRAIL=  $$ (NUMBER, WHEN, WHO, WHERE, WHAT)
(   1,<2007-01-08 09:27:36.94 +000>,<MAYBRIDGE\nmr>,<NMR_250MHZ>,
      <created by zg, POWCHK disabled, PULCHK disabled
       configuration hash MD5:
       49 4B E0 1D 92 C2 6B 37 9F E6 65 BC 52 41 86 1D
       data hash MD5: 64K
       23 08 A2 E7 CD 3B 8F 5B F2 6E FB 59 11 D3 41 8E>)
(   2,<2007-01-08 09:27:49.38 +000>,<MAYBRIDGE\nmr>,<NMR_250MHZ>,
      <Start of raw data processing
       ef LB = 0.3 FT_mod = 6 PKNL = 1 SI = 32K 
       data hash MD5: 32K
       67 C8 5F C2 B9 34 B2 96 81 DB D9 EA 56 58 3A 5D>)
(   3,<2007-01-08 09:27:51.08 +000>,<MAYBRIDGE\nmr>,<NMR_250MHZ>,
      <apk 
       data hash MD5: 32K
       8D 9D 3A 00 47 13 82 77 CB 74 BE 21 63 2A CC EA>)
(   4,<2007-01-08 09:27:51.77 +000>,<MAYBRIDGE\nmr>,<NMR_250MHZ>,
      <abs ABSG = 5 
       data hash MD5: 32K
       1D D2 0E E3 29 4C B8 EE BA BA 02 54 AF 04 2F 8B>)
$$ ##END=
$$ 
$$ hash MD5
$$ 75 F8 76 8E 4A 7F E8 97 4D 71 A6 A1 37 7B A9 B4
##$RELAX= 
##$RELAX= 
##$RELAX= 
##$RELAX= 
##$RELAX= 
##$RELAX= 
##$RELAX= 
$$ Bruker specific parameters
$$ --------------------------
##$DU= <C:\u>
##$EXPNO= 720
##$NAME= <ADRS>
##$PROCNO= 1
##$TYPE= <nmr>
##$USER= <dgb>
##$AMP= (0..31)
100 100 100 100 100 100 100 100 100 100 100 100 100 100 100 100 100 100 
100 100 100 100 100 100 100 100 100 100 100 100 100 100 
##$AQSEQ= 0
##$AQ_mod= 3
##$AUNM= <au_zg>
##$AUTOPOS= <8 >
##$BF1= 250.13
##$BF2= 250.13
##$BF3= 250.13
##$BF4= 250.13
##$BF5= 500.13
##$BF6= 500.13
##$BF7= 500.13
##$BF8= 500.13
##$BYTORDA= 1
##$CFDGTYP= 0
##$CFRGTYP= 5
##$CHEMSTR= <none>
##$CNST= (0..31)
1 1 145 1 1 1 1 1 1 1 1 1 1 1 1 1 1 1 1 1 1 1 1 1 1 1 1 1 1 1 1 1 
##$CPDPRG= <>
##$CPDPRG1= <>
##$CPDPRG2= <>
##$CPDPRG3= <>
##$CPDPRG4= <mlev>
##$CPDPRG5= <mlev>
##$CPDPRG6= <mlev>
##$CPDPRG7= <mlev>
##$CPDPRG8= <mlev>
##$CPDPRGB= <>
##$CPDPRGT= <>
##$D= (0..31)
0 1 0 0 0 0 0 0 0 0.06 0 0 0 0 0 0 0.0002 0 0 0 0 0 0 0 0 0 0 0 0 0 0 
0 
##$DATE= 1168248455
##$DBL= (0..7)
120 120 120 120 120 120 120 120 
##$DBP= (0..7)
150 150 150 150 150 150 150 150 
##$DBP07= 0
##$DBPNAM0= <>
##$DBPNAM1= <>
##$DBPNAM2= <>
##$DBPNAM3= <>
$$ [...]
##$SUBNAM7= <"">
##$SUBNAM8= <"">
##$SUBNAM9= <"">
##$SW= 20.6930455092707
##$SWIBOX= (0..15)
0 0 3 0 0 0 0 0 0 0 0 0 0 0 0 0 
##$SW_h= 5175.983436853
##$TD= 65536
##$TD0= 1
##$TE= 294.16
##$TE2= 300
##$TE3= 300
##$TEG= 300
##$TL= (0..7)
0 120 120 120 120 120 120 120 
##$TP= (0..7)
150 150 150 150 150 150 150 150 
##$TP07= 0
##$TPNAME0= <>
##$TPNAME1= <>
##$TPNAME2= <>
##$TPNAME3= <>
##$TPNAME4= <>
##$TPNAME5= <>
##$TPNAME6= <>
##$TPNAME7= <>
##$TPOAL= (0..7)
0.5 0.5 0.5 0.5 0.5 0.5 0.5 0.5 
##$TPOFFS= (0..7)
0 0 0 0 0 0 0 0 
##$TUNHIN= 0
##$TUNHOUT= 0
##$TUNXOUT= 0
##$USERA1= <user>
##$USERA2= <user>
##$USERA3= <user>
##$USERA4= <user>
##$USERA5= <user>
##$V9= 5
##$VALIST= <valist>
##$VCLIST= <CCCCCCCCCCCCCCC>
##$VD= 0
##$VDLIST= <DDDDDDDDDDDDDDD>
##$VPLIST= <PPPPPPPPPPPPPPP>
##$VTLIST= <TTTTTTTTTTTTTTT>
##$WBST= 1024
##$WBSW= 4
##$XGAIN= (0..3)
0 0 0 0 
##$XL= 0
##$YL= 0
##$YMAX_a= 453963
##$YMIN_a= -443611
##$ZGOPTNS= <>
##$ZL1= 120
##$ZL2= 120
##$ZL3= 120
##$ZL4= 120
##$ABSF1= 16.51962
##$ABSF2= -4.173552
##$ABSG= 5
##$ABSL= 3
##$ALPHA= 0
##$AQORDER= 0
##$ASSFAC= 0
##$ASSFACI= 0
##$ASSFACX= 0
##$ASSWID= 0
##$AUNMP= <proc_1d>
##$AZFE= 0.1
##$AZFW= 0.1
##$BCFW= 0
##$BC_mod= 0
##$BYTORDP= 0
##$COROFFS= 0
##$CY= 12.5
##$DATMOD= 1
##$DC= 0
##$DFILT= <>
##$DTYPP= 0
##$F1P= 14.0000005364418
##$F2P= -0.99999901652339
##$FCOR= 0.5
##$FTSIZE= 32768
##$FT_mod= 6
##$GAMMA= 0
##$GB= 0
##$INTBC= 1
##$INTSCL= 1
##$ISEN= 128
##$LB= 0.3
##$LEV0= 0
##$LPBIN= 0
##$MAXI= 10000
##$MC2= 0
##$MEAN= 0
##$ME_mod= 0
##$MI= 0
##$NCOEF= 0
##$NC_proc= -2
##$NLEV= 6
##$NOISF1= 0
##$NOISF2= 0
##$NSP= 0
##$NTH_PI= 0
##$NZP= 0
##$OFFSET= 16.51962
##$PC= 1
##$PHC0= 225.3654
##$PHC1= 6.506285
##$PH_mod= 1
##$PKNL= yes
##$PPARMOD= 0
##$PSCAL= 4
##$PSIGN= 0
##$REVERSE= no
##$SF= 250.130000593311
##$SI= 32768
##$SIGF1= 0
##$SIGF2= 0
##$SINO= 400
##$SIOLD= 32768
##$SREGLST= <1H.CDCl3>
##$SSB= 0
##$STSI= 32768
##$STSR= 0
##$SW_p= 5175.98343685301
##$SYMM= 0
##$S_DEV= 0
##$TDeff= 65536
##$TDoff= 0
##$TI= <Analysis number 999999
Compound Code 99
Book Reference 9
Project Code 9>
##$TILT= no
##$TM1= 0
##$TM2= 0
##$TOPLEV= 0
##$USERP1= <user>
##$USERP2= <user>
##$USERP3= <user>
##$USERP4= <user>
##$USERP5= <user>
##$WDW= 1
##$XDIM= 32768
##$YMAX_p= 341814581
##$YMIN_p= -60832
$$ End of Bruker specific parameters
$$ ---------------------------------
##NTUPLES= NMR SPECTRUM
##VAR_NAME=  FREQUENCY,     SPECTRUM/REAL,   SPECTRUM/IMAG
##SYMBOL=    X,             R,               I
##VAR_TYPE=  INDEPENDENT,   DEPENDENT,       DEPENDENT
##VAR_FORM=  AFFN,          ASDF,            ASDF
##VAR_DIM=   32768,         32768,           32768
##UNITS=     HZ,            ARBITRARY UNITS, ARBITRARY UNITS
##FACTOR=    0.157963299565203, 1,           1
##FIRST=     4132.05278436411, 0,            0
##LAST=      -1043.9306524889, 0,            0
##MIN=       -1043.9306524889, -60832,       0
##MAX=       4132.05278436411, 341814581,    0
$$ Real data points
##PAGE= N=1
##DATA TABLE= (X++(R..R)), XYDATA
$$ [...]
16796h036J1870k644k407Q200M050q763L844J6363l449L863Q019k162r127R38
16782B0559j119j3612k2260j8971L363J8243J489j4346J186J7302m329P14J1701
16769h0n981j7180j2257K1926P386j0070j9243J844J2694J909P749m01J3j831
16755a3522n447q798J2043j173l14L277N385K859N913o581p203K2935j964j3262
16741e852Q222l541j4826l513O580M493n729m735Q479K106K068N077p266j1380
16727a9817r482M942O59O608J3364Q06M710k906p533P670J069k540o455M152P13
16712d040j489J60m272M833L981n737p476j0135R522N720M146K409j3776p375
16698b3529K063P075j0577J726M196j3867N832O48n361j751J3615R415R474J9677
$$ y = [-8036, 3834, 1190, -1217, 6983, 11033, 2270, 6114, 22477, 19028, 22891, 30910, 28748, 19621, 20559, 19440, 5828, -16432, -35403, -32040, -13797, -12308, -26654, -25468, -8166, -12495, -11781, -80, -6061, -23241, -35498, -13572, -6186, -16256, -35499, -33655, -20961, -19052, -11303, -11704, -11691, -13522, -18969, -27767, -15724, -16897, -17211, -13934, -8549, -5690, 223, -6358, -13561, 9374, 7410, -5852, 2370, -1171, -15997, -19510, -12930, -8437, -14166, -18901, -10422, -8316, -6248, -1171, -8437, -19817, -29299, -24357, -23698, -17090, -3726, -2920, 1790, -1116, -8649, -979, 90, -2450, -8905, -4753, -4040, -5529, -5369, -9641, -4808, -827, -6564, -14040, -24175, -14653, -8933, -4787, -2378, -16154, -23529, -21466, -14391, -24968, -23242, -19046, -32913, -27081, -26433, -31794, -33545, -19930, -10515, -1041, 18636]
16684A8636m210j7001P021r602k1665k059l478N308O18J4424p681P191K5889k071
16670A1320m91R239N019n60n202l637q751j1692j8356J1442J8189J476R466j0389
16656G073k6988J659J3392J9813K880k5109j2861Q116J5702o260r000j81J25r276
16642b0915l207J0215M565q288j4426P225N603J775J3462R295p745j414K905l410
16628d360k538N379P447K449R951n277q073k494q621l657n247L135p281l957Q737
16613a4407P865R345j3523Q194O391j410k039l035O855o228N100J0190J2467M30
16599B6195j5612j3864p162O174J3993J4099j1810j5451O08k45j1500r280O614
16586a7241J489m23K407R958r127m50M40J2639j5700j3434L227M08k32K023Q552
$$ y = [18636, 14426, -2575, 4446, -5156, -26821, -28880, -32358, -27050, -26432, -12008, -19689, -12498, 13391, 11320, 10829, 20068, 25087, 24527, 19325, 15688, 6937, -4755, -23111, -11669, 6520, 7996, 17462, 7073, -19915, -18256, -4864, 14949, 17829, -7280, -20141, -12025, 3677, -2583, -11583, -11764, -11639, -20915, -24122, -13907, -9342, -17630, -32056, -24831, -19228, -17453, -3991, 5304, -2441, -3855, -950, -4360, -6898, -1519, 5928, 8377, 18328, 13051, 4978, 2484, -6137, -9794, -15041, -11906, -19187, -23144, -14407, -6542, 2803, -10720, -2526, 3865, 2455, 416, -2619, 4236, -1992, 3108, 13298, 25765, 26195, 10583, -3281, -10443, -4269, 9724, 23823, 12013, -3438, -2830, -3075, -14575, -23855, -17241, -15752, -16175, -13768, -3810, -12937, -13387, -12947, -308, -16008, -29442, -26215, -25807, -26039, -24016, -15464]
16571a5464M593n115J0018J4192p878m401p337j3867m929J0235J7517J3872p958
16558C478r363q125M822r826J642j555j7969n954J2058M461P718J7108L999o72
16544A822N504j1552j4382l987M189n694L348J2609L485n09J445J067k113L54
16530d414o778N013o075k840L708Q600m78p11J788P8J726o392n819L386J5835
16515F627o20r62q403K070J5104j2148j1682o352N287J1514J7536p25j8322o524
16501g600j102J3119J0021k8824j2600m353J588J8039J0316l981Q361n96j0102
16488g714p297m824L236J4422P851K426p002L838P277j3708k2729K876L613n845
16474b3580K227Q814n906o270J1459J3450P382J0815r82j5215j7697K435K437
$$ y = [-15464, -10871, -15986, -5968, 8224, 346, -4055, -11392, -25259, -30188, -19953, -2436, 11436, 3478, -5885, -14010, -9188, -19014, -17372, -18927, -36896, -42850, -30792, -26331, -18613, -1505, 2494, 1822, 7326, -4226, -18608, -22595, -18406, -24100, -20752, -8143, -4658, -5167, -3722, -2655, -4768, -4414, -11192, -6179, -12254, -15094, -11386, -2786, -3264, -3975, -2187, -2109, -383, -6775, -12594, -9208, 6627, 6007, 5045, -3358, -1288, 13816, 1668, -10014, -16366, -11079, 435, 17971, 17246, -1076, -7600, -8702, 4417, 14438, -14386, -26986, -31339, -29751, -11712, -1396, -5377, 2984, 2388, -7714, -15011, -19835, -16599, -2177, 5674, 8100, 1098, 4936, 12213, -1495, -24224, -21348, -17735, -23580, -21353, -12539, -18445, -24715, -13256, 194, 7576, 18391, 17409, 2194, -15503, -13068, -10631]
16461a0631n804N132N761l549p72R730k831K004l068P006q792l507k039j0540
16447b1900m179J2727Q719R770N324k870n115J131J0441j0521r037k575J0583
16434B498J3824j092j5580o298k680J86j0396R545J5118k077l6995j555J3422
16421b2080J492p605m946P551O4J389J6615j372j2956J586M649J5598J7238l046
16407A4177Q52o968R748l662j0861m652K589K58j8079J4636P096P652J370Q098
16393B2254j0630j7761J091m966p746k190m144j855m290J3944J5588k458q775
16380a1938j4806P263J4428Q940j233M100J9552N154o842m68k2233j2565j0238
16367b0886K577J8j6091m164L318R525P545M370R236N932L195l620o088M114r722
$$ y = [-10631, -16435, -11303, -5542, -9091, -9863, -133, -2964, -960, -4028, 2978, -5814, -9321, -11360, -21900, -26079, -13352, -4633, 5137, 10461, 7591, 2476, 3607, 14048, 3527, -5510, -8085, 2498, 16322, 15230, -350, -6648, -9328, -9142, -19538, -9993, 5125, 3048, -33947, -35502, -22080, -20588, -28193, -33139, -25588, -25524, -24135, -7520, -8892, -21848, -20262, -15613, -15, 17223, 14177, 15029, 8061, 17809, 14147, 3286, -1366, 1223, 1481, -16598, -1962, 5134, 12786, 14156, 22254, 11624, -6137, -5046, -10012, -17758, -19948, -24092, -25947, -30237, -16293, -705, -3163, -11938, -26744, -19481, -5053, 3887, 2654, 6754, 26306, 31460, 24618, 24150, 1917, -10648, -20886, -18309, -18291, -34382, -38546, -35228, -25703, -18158, -13788, -4552, 1380, 4575, 955, -5133, -1019, -10741]
16352a0741J1174R72p014k566j440N376N277J3330k041M33N243k643j0384J471
16338F447J474n4p050p282j159K891k331n39M058l296q002L452n042P724l956
16323a2665r055n901J5442K538O22R025m353k228L813R698N827R293j1606p642
16309B808r668j164N235r309N62J8161K904l746J5393L930L846p63n618m753k591
16294A5227L568P423j3749j0658m884p202k125O717p658J163l368pP207N420P605
16279D679k516j5864K820o87n78Q392j2999M829M780j1239j5345O855J0714o980
16265b3139k1061J0789K3675k380n186R557M352O353p13K597N58o388R843J65
16251I022j0654q946O77K743M527J1842k956j2949L76J3045R544Q321L23k2802
$$ y = [-10741, 433, 1405, -5609, -8175, -9615, -4239, 1038, 14368, 12327, 12760, 18003, 15360, 4976, 6447, 7921, 7867, 817, -6465, -7624, -4733, -7064, -7603, -3545, -6841, -14843, -11391, -16433, -8709, -12665, -21720, -27621, -12179, -9641, -9019, 6, -4347, -6575, -2762, 6936, 12763, 22056, 10450, 2808, -6860, -8024, -2789, -12098, -11536, 6625, 9529, 5783, 21176, 25106, 28952, 28189, 22571, 17818, 15227, 18795, 26218, 12469, 1811, -3073, -10275, -12400, -5683, -13341, -12178, -15546, -15553, -8346, -2926, 4679, 2163, -13701, -10881, -11568, -12146, -3754, -16753, -11924, -7144, -18383, -33728, -26873, -16159, -23139, -44200, -33411, -9736, -12116, -17302, -7745, -3393, 2960, 2247, 4844, 5402, -986, 8857, 9022, -1632, -10578, -9901, -7158, -2631, 9211, 6255, -6694, -6318, 6727, 16271, 24592, 24915, 2113]
16237B113j4622P268R201K582m842k302p454k954L149L032L06q640n410l086R459
16222a2200K1534K777K015rk673j2632j6379n759J5295K2616q717j793J767R597
16208A5439o595j1354j0311Q81P201J940R38K137o596K1N069M57J003M157l026
16193A361j1417o874q33K776J758J1607J7442nJ2298n664k0193o867K051j405
16179c965n30J2836o178k163j303L733k87n546o44K30k757O006o446O930l256
16164c340j0314P456J3208J0703K228M785n672j4134o346J6998L664j1281K311
16151A0266n304L593N14N96l246j470l127o10k369j0487M779J7226M879L90O439
16136B2069p602k2350q414r317k366J1863J1755J1352j65l398J0674o831j9810
$$ y = [2113, -12509, -5241, 3960, 6542, 1700, -602, -8056, -11010, -7861, -4829, -4523, -13163, -18573, -21659, -12200, 9334, 12111, 14126, 14117, 11444, -1188, -17567, -23326, -8031, 14585, 5868, 4075, 5842, 15439, 8844, -2510, -12821, -11940, -4739, -2799, -1861, 276, -6320, -6299, -1230, -773, 230, 4387, 1361, -10056, -16930, -17763, -14987, -13229, -1622, 15820, 15815, 28113, 22449, 2256, -4611, -2560, -3965, -4495, 8341, 2163, 0, -1303, 2430, 2143, -3403, -4047, -3817, -6574, -568, -7014, -84, -3340, -13654, -6198, 7010, 17713, 19941, 24726, 19054, 4920, -1426, 15572, 19236, 7955, 10266, 4962, 8555, 9069, 9665, 6419, 4949, 1822, 1212, -1157, -11644, -6865, 10361, 15240, 15630, 22069, 14467, -7883, -16297, -25614, -27980, -16117, -4362, 6990, 6825, 3427, 14101, 7270, -12540]
16123a2540M62J707J6462l246O116j0896j2436N89J6419J6635J635j1550J4634
16110B3991J6808m649j9261k998j1104j7815j0740J3398k396J0037J7471M196
16098A6938j5672k1575M090J1001M572j0375m795P376K63k135k569K994l701L772
16084i816q932o669J3868J1189J4350j5043j6151k673O205L328Q40J891O751Q427
16070G565m020k362Q097j905k7840J0996J0702Q812L81j3199m974o05j4952K4
16056b3280N998k151L662L915O23k62p57J2160N743k230q127M884J0752M388j2716
16041B602o052j627K287m706m178Q533N991N485Q947j0292j5210p646m245P582
16027a2529J3142L456P547n450L629Q039j3100p599k589N356o216j5714J3833
$$ y = [-12540, -12078, -10371, 6091, 2845, 8961, -1935, -14371, -13782, 2637, 19272, 20907, 9357, 23991, 40799, 36150, 16889, 13891, 2787, -15028, -25768, -12370, -14766, -4729, 12742, 16938, 1266, -20309, -16219, -5218, -646, -11021, -15816, -8440, -8177, -10312, -12881, -9887, -13588, -9816, -18748, -25417, -11549, -360, 13990, -1053, -17204, -19877, -13672, -10344, -9504, -7613, -862, 7565, 3545, 1183, 9280, 7375, -20465, -9469, 1233, 10045, 10426, -2773, -7747, -8352, -23304, -23280, -17282, -19433, -15771, -11856, -11233, -11495, -12252, -92, 5651, 3421, -4706, 178, 10930, 15318, 2602, -3450, -5077, -2790, -7496, -11674, -3141, 2850, 8335, 17282, 6990, -8220, -15866, -20111, -12529, 613, 4069, 11616, 6166, 9795, 17834, 4734, -2865, -5454, -98, -6314, -22028, -8195]
16014h195n899J1209M032j6142n097L785K3576J2491K316q397m103R81q823m692
16000b958p804P931J4109N331j7907m42J7880j065j7228l923J5745P93j0302p269
15986g109P827J4814K057j3891n758O930j1018p319r103Q891J5569Q406M711r091
15972E916k282m073p271L832o764Q780L942m85K098p576j1003J382O742J1056
15958D294J1966K312o288r413r712N485K072k599l539k101J795J108o679j3717
15944b5016j1416J583J2528P480P013L554p010K021J3910j706j1006J0663q356
15931e758l119J991k860R295K719j2801j4313K0392J5551m689O537K032j0934
15918D043o444l221J728O557r10m307n237M380l725o268N761K0085N413k660j4375
$$ y = [-8195, -14094, -2885, 1147, -14995, -20092, -16307, 7269, 19760, 22076, 13679, 9576, 10557, 1734, -2958, -10762, -2831, 11278, 16609, -1298, -1740, 16140, 15075, -2153, -6076, 9669, 10462, 160, -7109, 718, 15532, 17589, 3698, -2060, 4870, -6148, -13467, -22570, -13679, 1890, 10296, 15007, 5916, 3634, -439, -7710, -3878, -10642, -1862, 2080, 1595, 3693, -3883, -14886, -13504, -6762, 4294, 16260, 18572, 12284, 2871, -6841, -1356, 716, -1883, -5422, -7523, -5728, -4620, -11299, -25016, -36432, -34849, -22321, -14841, -7828, -4274, -11284, -9263, 4647, 2941, -8065, 2598, -5758, -8877, -6886, -9746, -451, 2268, -10533, -24846, -4454, 11097, 6408, 12945, 14977, 4043, -2401, -5622, -3894, 2663, 1753, -2554, -7791, -3411, -7136, -13404, -7643, 12442, 17855, 15195, 820]
15903H20q534J552j914r522O515J5309R89o451l81J1894j2557j0213K700k605
15889a2398R964N816n290j2591o355n281K750M366J3642K575k0112j2057M554
15876c0417L685K267M115Q480J6957k618l052n227p857j1487J2159R546J4747
15863A1298J2006j3277r380J3685J2631O052k4965j8280n006O048L414N012J912
15850A150k904r718j5413M127Q708M717q80r250k16O731J2361k387L327R09R876
15835A1138J1k070O203L113j8087m093J004R73p044L548K986j1364M122M570J492
15820c498j350N231K903L730j6121o757N166l538J544j200P469K776M974K402
15806C731M233R371j3878k342r582j3216j3182L447J3148P405m183L68J1105J3821
$$ y = [820, -7714, -6162, -8076, -17598, -11083, 4226, 5215, -1236, -1617, 10277, -2280, -12493, -9793, -12398, -2434, 3382, -1908, -14499, -20854, -26135, -23385, -19019, -5377, -2802, -22914, -34971, -30417, -26732, -24465, -20350, -11870, 5087, 2469, -583, -5810, -13667, -25154, -12995, -3449, 11298, 23304, 10027, 647, 14332, 26963, 33015, 8050, -10230, -15236, -9188, -5774, -762, 1150, -1754, -11472, -26885, -22758, -14050, -9333, -10213, -19463, -19679, -12948, -587, -2974, 353, 1262, 11138, 11149, 9079, 15282, 18395, 308, -3785, -2781, -1808, -8852, -5304, -2318, -13682, -9560, -4990, -3498, -4848, 383, 3286, 7016, -9105, -15862, -10696, -14234, -12690, -13890, -6421, -3645, 1329, 3731, 7964, 17335, 3457, 1115, -8467, -21683, -34865, -31418, -18270, -10865, -15048, -14680, -3575, 10246]
15792A0246J0517K41k1790N285J766j4805q548M438k980k4192o696J2539m015
15779c7994J1226Q984J2308j888j1796n613J154R915J606p678O075R017L616q22
15765a890l540q53m930n579r528k694K2000J7403Q5o092j7305r35K81J6404J5212
15750A8039p071k928l965j4545K73L093J597J2624k496n207q668j7416Q96J707
15736b4067J3271J1707O853O221j0646o79J0165o772r309j0322M1K3251R78J73
15722A0865O082N908q962j0111L476J1560J691j7357j4022o537o374N011J4526
15709d244L097j7272o915R746J0492J955m561m895j1564L933J3353J8315l574
15696G866q690L858k645P289m175n595n485j4893K6p654j084n708R127J0087K9287
$$ y = [10246, 20763, 21004, -786, 4499, 6265, -8540, -17088, -12650, -15630, -39822, -46518, -33979, -37994, -26768, -17784, -5476, -7364, -19160, -24773, -23619, -13704, -12098, -19776, -13701, -4684, -1068, -1890, -5430, -6283, -11213, -16792, -26320, -29014, -7014, 10389, 10474, 4382, -12923, -13858, -13577, 2827, 18039, 10968, 8040, 4075, -10470, -10197, -7104, -5507, 7117, 4621, -586, -9254, -26670, -25774, -24067, -10796, 911, 7764, 13985, 3339, 2660, 12825, 6053, -3256, -13578, -13537, 9714, 10692, 10865, 16947, 22855, 13893, 3782, 7258, 18818, 20509, 3152, -10870, -17407, -23781, -18770, -4244, -1147, -18419, -25334, -15588, -5096, -3141, -7702, -12597, -24161, -20228, -6875, 11440, 7866, -824, 3034, 389, 7678, 3503, -2092, -7577, -22470, -22444, -30098, -31182, -36890, -27763, -17676, 11611]
15681A1611M526k454k588L321K145j6966j8972L162Q805o414R747j683p281M155
15667h886j0244r314J7585J7316K69p162j569l4K5084O789l610m529J384q06q719
15652A3554q101M007j16L317q33n142p142N582j5771o939J5377K365j7400j3014
15638c0256j768L432J9758J5940M183N144k0356n946n774L838N329L367k947R854
15624C798K095P182L520J221k108o144j942k787p33L101N179K463j8605p135L13
15609a0582r871q133K1581m83J3497J5072n966j2421m257n530J0165P138j7114
15596f904j2935J4511n411M868J2113q815k9430j5461J3463J6447M103N707j0864
15583a8608J0200R635J0168M614m867l939j21J042J942o525J9l80O654k28P41
$$ y = [11611, 16137, 13683, 11095, 14416, 16561, -405, -19377, -16215, -7410, -13824, -4077, -5760, -13041, -8886, -19130, -28444, -10859, 6457, 6726, -436, -2005, -2039, 23045, 29834, 26224, 21695, 23079, 22273, 13554, 5453, 9460, 9344, 12661, 11828, 6686, -456, 5126, -10645, -17584, -2207, 158, -17242, -30256, -32024, -28592, -8834, 7106, 11289, 16433, -3923, -9869, -15643, -11805, -6476, -3109, -6056, 3798, 5893, 13075, 16595, 17816, 15708, 9564, 7622, 4835, 4102, 7203, 12382, 14845, -3760, -10895, -10582, -20453, -28586, -7005, -7488, 6009, 21081, 15115, 2694, -1563, -7093, 3072, 10210, -6904, -19839, -5328, -10739, -5871, 6242, -2573, -32003, -47464, -34001, -17554, -13451, -7744, -18608, -8408, 1227, 11395, 16009, 11142, 7203, 7082, 8124, 10066, 3541, 3560, 3180, 9834, 9606, 10347]
15568A0347j8840j3982O105J5175J2646j0615m012J2964J099j87r329J4261O501
15555B2133M059j3169j8273O09O302Q951J0081p523p040n069j400j2435O940Q754
15541B920L019N139L299r784j297o28Q73J1056L112o237r099k02j082J1266K201
15526A4556j791p368j0064m573J1189K559p094Q045N636k947j3834q768J9920
15513E466M670j5529j0676o549J1343P980M771O533k733k954o623p059J89O164
15499e007Q307j783r888K018P419k973o933P873r042j0168J3553J3861O665Q820
15485B2722p770j1841r022r484Q131R558p054j5445l70j202j73L251J7106J6532
15471A4939m889K101p449j7647J3164P174n20o580j2857k699M776J0159M633K925
$$ y = [10347, -8493, -22475, -16370, -1195, 11451, 836, -3176, 9788, 10887, 10700, 1371, 15632, 22133, 26192, 13023, -5250, -4641, 1661, 10612, 20693, 13170, 6130, 1061, -339, -12774, -5834, 2920, 5939, 11078, 14377, 4593, 3296, 2668, 3541, 14597, 17709, 11472, 2373, 2171, 1089, 12355, 14556, 12765, 5397, -4667, -9240, 1949, 4508, -2586, 5459, 11095, 8148, -5686, -14454, 5466, 10136, -5393, -16069, -22618, -11275, -3295, 1476, 8009, 5276, 2322, -4301, -11360, -11171, -5007, 3300, 1517, -8371, -6353, 1066, -1907, -8840, -967, -10009, -20177, -6624, 7237, 13902, 22722, 14952, 3111, -5911, -15395, -7264, 2294, -4760, -20205, -20575, -21777, -21950, -18699, -1593, 14939, 10050, 12151, 4702, -12945, 219, 7393, 6873, 293, -12564, -15263, -10487, -328, 4305, 7230]
15457G230K052k38j2060P420O746n754M785j13o201k6018o99J9681J0778j2793
15443e184j2257o179P358R426R729k777r774o62n667q420l471L96J4297L081M108
15428e996o327o02M510J1077n93P19J06J5044N309j2210j5983L13J3437k419j0461
15413d076j7231Q653R911L4j617n769J6178j0336j3551o626J1708J5380O366j0645
15399a621l323L32J3934P384j524r820M19J0494p742j3569l694j4654J793J3467
15385h124K915J3660L094p65j2764j9595m646O543Q403J6963m782L045j0905q948
15371a5906L968M234j292M179j3490K981J4314K934J4364m317M589k303j3693
15358E62j0979l153O204j203N524m145o836L446k522P302L359j0984Q870O074
$$ y = [7230, 9282, 9044, -3016, 4404, 11150, 5396, 10181, 10068, 3867, -22151, -22850, -3169, 7609, -5184, -17441, -23620, -16262, -6836, 2893, 116, -9658, -10320, -15987, -24407, -27878, -27482, -13185, -10104, -5996, -12323, -12925, -8415, 2662, 2069, 2788, 2894, 17938, 23247, 11037, -4946, -4633, 8804, 6385, -4076, -21307, -12654, -2743, -2709, -4326, -10095, 6083, -4253, -17804, -24430, -12722, 2658, 9024, -1621, -4944, -4612, 9322, 16706, 15182, 5362, 5781, 16275, 8533, -5036, -8730, -23384, -21591, -8124, -5209, 8451, 11545, 10780, -1984, -21579, -26225, -19682, -11279, 5684, 902, 3947, -6958, -15906, -11938, -7704, -8996, -4817, -18307, -15326, -1012, 1922, 16286, 11969, 16558, 14255, 562, -10417, -13570, -7366, -8569, -3045, -7190, -14026, -10580, -13102, -5800, -2441, -13425, -4555, 1519]
15344A519n122J223q443r971J5447j396k260J7707L843p884M227P854j3023K39
15330C960Q166N067j206K603j3064L219j3542j7085j2522r12J4620J3444n931
15317a3183M187n078l658n114O979M656Q551J6958K661j3457n102J3880J6497
15304B8777J5392j645k2052k0673m203N586O329q910j2032j302M740K929J830
15291e234k878N520O04j6016m090n997O343J5178l582J5215J5795j5677J1929
15278A7110P614j1919J0j1144q550J485j2160m857J0591K1591J531j5490n276
15265i464Q656N064J452K04L496k734O887j2481l725J952Q365L10r30o675L230
15250C607j2265o812R974J1551n472n201j386n871j4436j0941L822P771J3105
$$ y = [1519, -3603, -2380, -10823, -20794, -5347, -6743, -9003, 8704, 12547, 4663, 8890, 16744, 3721, 3960, 12126, 17193, 15987, 18590, 5526, 8745, -4797, -21882, -34404, -35316, -20696, -7252, -13183, -8996, -14074, -17732, -22846, -15867, -11211, -2660, 14298, 16959, 3502, -1600, 12280, 28777, 44169, 42524, 20472, -201, -4404, 1182, 7511, -1399, -13431, -14733, -9993, -7064, -5234, -8112, -2592, -1988, -18004, -22094, -28091, -21748, -6570, -10152, 5063, 20858, 5181, 17110, 24724, 12805, 12815, 1671, -6879, -5394, -17554, -22411, -11820, 9771, 11302, -4188, -9464, -808, 4256, 5708, 5912, 9408, 6674, 13561, 1080, -2645, -693, 7672, 7982, 7052, 377, 3607, -8658, -15470, -5496, 6055, 583, -4618, -6004, -11875, -26311, -37252, -33430, -25659, -12554]
15237a2554j6639l475J4598J9098P582P027N692j7063r215j776N719M574k495
15224A073J0202J1270r438j8804o776K430O268L547m253j0343M026J253L755J7609
15210A1819n8k284l845j0681q61J813O256k211P44P547p088j606J0867K0646P69
15195C1827j6114j3644j8856q793R17J664J5239O832o957N531L780J7348J3728
15182C2502k865j0646j5107n849o681l155K541M677n45O525O233q937N091M930
15168H714o937j5483q53N249Q840J416M264j336r193J2484K277P58j525r135r9
15153e59N346N722P740r328j0337o336O155K5137J70j0899j2886J945Q895J488
15139A2253q338q675j0804q966j5064J6811K2289J2157J594q257j1778j472o85
$$ y = [-12554, -29193, -32668, -18070, 1028, 8610, 15637, 21329, 4266, -4949, -6725, -1006, 3568, 1073, 11275, 22545, 13107, -5697, -12473, -10043, -3775, -228, -4481, -14824, -10798, -9545, -5790, 11819, 11761, 9477, 5632, -5049, -5910, -4097, 2159, -52, 692, 8239, 1151, -455, 10412, 31058, 31827, 15713, 2069, -16787, -25580, -24663, -22999, -7760, -928, -7885, -2354, 1426, 18774, 32502, 29637, 18991, 3884, -1965, -8646, -11801, -9260, -4583, -5128, 1397, 7630, -1307, 3784, 8714, 1777, -13706, -14559, -9310, -470, 946, 5210, 3874, -5319, 7165, 9442, 10200, 8675, -460, -559, 4787, 10509, 18249, 8921, -1416, -7752, -1597, 23540, 23710, 12811, -75, 1870, 10765, 12253, 3915, -4760, -15564, -24530, -39594, -22783, -494, 11663, 13257, 5000, -6778, -8250, -8935]
15126h935R346N336J3072N305r773q940Q382Q225K410O683j856o436N199j5627
15112A2391J4130q704p964M362m994Q510j3324k223j2250M393J453J222M286P46
15098B034K977p163n528p890r107P987J3130J836j0259R366J3812m535r929j54
15084c423J1596J8287j745j2340p77o764l328J6695J59o074O164P711r119J2089
15070B9131R098j6624r850N567p530K417k781m362j0496j2706j434R358J001k1586
15056c0797M68J4331J658j3080j2965K244J591j167J7536J4716J616M998j8O431
15042G562M791J5548R906nj0251j3870M630J1163l649o365k119r904j139K700
15028H998o837j0548j3321J1849J1050L193O158n715J2720l556j0109Q749K793
$$ y = [-8935, 411, 5747, 18819, 24124, 14351, 5411, 13793, 22018, 24428, 31111, 29255, 22819, 28018, 12391, 26521, 17817, 9853, 14215, 9221, 17731, 4407, 2184, -10066, -5673, -4220, -2998, 1288, 2034, 5011, -2152, -7680, -15570, -24677, -16690, -3560, -1724, -11983, -2617, 11195, 6660, -3269, -3423, 8173, 26460, 24715, 12375, 11598, 4834, 1506, 18201, 18360, 12286, 18450, 26161, 17042, 29131, 38229, 21605, 11755, 17322, 9792, 12209, 9428, 5066, -5430, -18136, -19570, -10212, -9211, -30797, -30329, -15998, -14340, -27420, -40385, -38141, -36550, -37717, -20181, -5465, -3849, 1149, 1131, 7562, 12353, 27901, 37807, 37802, 27551, 13681, 18311, 29474, 25825, 19460, 17341, 7437, 6298, 8998, 2161, -8387, -21708, -9859, 1191, 4384, 10542, 4827, 17547, 13991, 3882, 12631, 15424]
15015A5424J363J6381k362O629J0043k752j6145k4730q011j3170j133m810P291
15002a5982K0498J2327K807j4611o884J379o451m740k460J043j5350L270J9671
14989e483J6005p713N356r99j6760j0458M690J5795P467N00k703O263q36p690
14975C434J510j377r467q575J65l470J6589O656j5350Q54R107m837r57J6166k171
14960H277l413L448L822j1502o948Q859J0409L163j0048p408J1548m45p882l131
14946a251K016R441p237m326J5586N855N551p299j4034J726J2496J0325j2615
14933A6234r185R952P562l328m617p483l762j0838p228K2723J3624j2300N626
14920A6980K971j0595k485J1919o502q732r085P249P375M255j4089j1812L96M220
$$ y = [15424, 16787, 33168, 30806, 37435, 47478, 44726, 28581, 3851, -4160, -17330, -18463, -23273, -15982, 4516, 16843, 19650, 5039, -1845, -466, -6917, -11657, -14117, -13074, -28424, -25154, -5483, 10522, 2809, 8165, 7166, -9594, -20052, -15362, 433, 7900, 8400, 5697, 11960, 11124, 3434, 4944, 3567, -5900, -14475, -14310, -17780, -1191, 5465, -9885, -9031, 76, -4761, -5718, 10448, 8277, 4864, 8312, 12134, 632, -6316, 2543, 12952, 16115, 6067, -1341, 10207, 9762, 1880, -1251, 765, 10206, 2969, -1357, 14229, 20084, 25635, 18336, 4302, 6028, 18524, 28849, 16234, 7049, 17001, 24563, 21235, 16618, 9135, 5373, -5465, -12693, 10030, 23654, 11354, 16980, 19951, 9356, 6871, 18790, 12288, 3556, -5529, 1720, 9095, 13350, -739, -12551, -12155, -7935]
14906g935l799m85K468R775N605q761j5320J090Q7J2582J0435O021O821l021j042
14891A4521j2578j8760J1362Q851o734O883O946Q925j311j151J246L51j2459j3208
14877g116J2719J4928m52l567r184n923O437o699J015k371o991n220m807P380
14863i851J4440R259j0777M062Q703j0453N669K65M14j2152k1199N766J6353O111
14849F610L248K983m312j7406j058J9930k319r321N69j097P357J1649J638P580
14835B6051O272j8182l0148O611M294J1657q844R317n63j0645o125m573o939j038
14821b2855m212J2516r755q789J9416J1535P785Q731n246r571p435K486m949L105
14807g238R18k168N353J0379n838n199J2681K0208n105j4088j4617N210M764J6795
$$ y = [-7935, -11734, -12219, -9751, 24, 5629, -3132, -18452, -17362, -17275, -4693, 5742, 11763, 18584, 15563, 14521, 1943, -16817, -5455, 3396, -3338, 3545, 10491, 19416, 18105, 16954, 18200, 18551, 6092, -7116, 5603, 20531, 20079, 16512, 7328, 1405, 7842, 1143, 2158, -213, -7204, -12424, -17231, -9851, 4589, 13848, 3071, 7133, 15836, 5383, 11052, 11317, 11731, -421, -21620, -15854, 499, 6610, 9858, 12841, 8529, -8877, -9935, 9995, 7676, -1645, -1076, -2173, 5184, 16833, 18471, 26051, 32323, 14141, -16007, -9396, -5102, 6555, -2289, 7028, 6465, -4180, -10305, -14878, -21817, -22855, -27067, -14551, -24306, -33095, -13679, -2144, 5641, 14372, 9126, -445, -7880, -5394, -10343, -7238, -6320, -8488, -3135, 7244, 1406, -3793, 8888, 29096, 23991, 9903, -4714, 496, 5260, 22055]
14793B2055p351j5107j6984M652J2985n292m050J2016J3350k2j4041j0526P840
14780d75J3678O084J440q319j1452j7346j0667J4809N542K94O28J3239Q928k6528
14766a0145k0554L019R673P755j5174N227J7166K1687o981k019n670j1763j3927
14753b1706p738J0683P376J1156k73N808J0701J2944m240m618m623k0203j1946
14740a6679L851J6661R976J8386J818j0483r148l477l968o663p897k883Q343j188
14726c351J2444j686k0179N528J0050J106O661n829Q10j5159R879J725j103J3500
14712A4396J6373J000j6104n757M239j9n439o752m569k733J084j2620l130l129
14698b3160J3737J19n003J2661n186r060R619l179j2130k886R502Q216N602k034
$$ y = [22055, 14704, -403, -17387, -12735, 250, -5042, -9092, 2924, 16274, 16252, 2211, -8315, -475, 13203, 19287, 20727, 12408, 956, -16390, -27057, -12248, -6706, -6412, -5784, 7455, 16383, -10145, -30699, -27680, -18007, -10252, -25426, -20199, -3033, 18654, 11673, 9654, 3984, -7779, -21706, -29444, -18761, -11385, -229, -502, 5306, 16007, 28951, 24711, 20093, 15470, -4733, -16679, -12828, 3833, 13809, 32195, 34013, 23530, 14382, 10905, 6937, 274, -7623, -10506, -2163, -3351, 9093, 7407, -12772, -7244, 2806, 3912, 10573, 4744, 5554, -9605, 274, 1999, 896, 14396, 30769, 31769, 15665, 9908, 14147, 14128, 8689, 1937, -2632, -5365, -4281, -16901, -20031, -23160, -9423, -9304, -14307, -1646, -6832, -15892, -6273, -9452, -21582, -24468, -14966, -6750, -1148, -3182]
14684c182O042J584j1595l890O58l219K5616J2809K37N55j2857j8255K8070R727
14670C2300r652j3206j0287j2419K4616J5565m488q561o488P636K1501L311k1081
14657A8747j2814j7200o985o217J1191R462R74M529K272Q181k246j0532J822J5804
14643A6988N704J387o946k455j9280K267n000N355J439l439J0681P911J026K423
14629A8061K271l080O453R625j4923k1695l6n393k164j3265k028N742J3210J413
14615e809M22J6323N536l947r846L313j0637L22O142J363J542J941P14L010P648
14600A8037l204k3129j0721N465K645R079J3655N400q849J525m944j9713L891
14587a0863N298J473P216L28l469R234l349n520L587n35o505J0105J1916J214
$$ y = [-3182, 2860, 4444, -7151, -11041, -10383, -13602, 12014, 24823, 25060, 25615, 12758, -5497, 22573, 32300, 22648, 9442, -845, -13264, 11352, 26917, 22429, 13868, 7380, 15016, 36517, 39828, 18747, 5933, -11267, -18252, -24469, -13278, -3816, -2842, 1687, 3959, 12140, 9894, -638, 1184, 16988, 22692, 24079, 17133, 14678, -4602, -2335, -7335, -1980, -541, -3980, 6701, 14612, 15638, 18061, 20332, 17252, 23705, 33330, 18407, -3288, -3324, -8717, -10881, -24146, -26174, -20432, -7222, -5809, -5387, 10936, 16472, 12525, 2679, 5992, -4645, -4323, 1819, 3182, 4724, 6665, 7379, 10389, 18037, 14833, -8296, -19017, -13552, -10907, -1828, 11827, 17227, 8378, 9903, 4959, -14754, -10863, -5565, -4092, 3124, 3452, -17, 9217, 5868, 348, 3935, 3400, -3105, 7000, 18916, 20130]
14573B0130k666r717Q141n903l726J9384J973k700j3631N744N562j077p032n312
14559I170o595O852J3471l428j5048r022l432O414Q85J396j563m318N974J6464
14545A7220N921j4908j3322p460k991j924J5218J1359L853p366r175q49m712K751
14531f385N274J3112O328L53l180j266R982O697k480j1423r746p077o382m894
14517a1087P910K1453r926k698K471r318o527L924L46j863J77P994o005q68K6229
14502B2212J0840r870l690m178j1619j840l703Q6o212N787J1633J0997P251Q271
14488C5965j0924m099j4175q964K935k532J224J0567j0554j1256L127p410K051
14475a4045P830J9369j192l419J3242l165j917r572n394q696J4890K0189J1312
$$ y = [20130, 17464, 7747, 15888, 9985, 6259, 25643, 27616, 24916, 11285, 17029, 22591, 21514, 14482, 9170, 2575, 9427, 22898, 19470, 4422, -4600, -8032, -1618, -733, 663, -900, -5218, 756, 17220, 23141, 8233, -5089, -12549, -15540, -17464, -2246, 9113, 12966, 5600, -3575, -4424, -9136, -6385, -1111, 12001, 18329, 18682, 15502, 14236, 24218, 30915, 28435, 17012, 7266, 189, -6193, -11087, -3177, 18276, 8350, 5652, 8123, -1195, -7722, -3798, -3452, -5315, -5138, 2856, -3149, -4017, 22212, 33052, 23182, 19492, 15314, 3695, 1855, -1848, -1762, -7974, -2187, 9446, 20443, 27694, 35965, 25041, 20942, 6767, -2197, 738, -1794, -570, 9997, -557, -11813, -8686, -16096, -14045, -6215, 13154, 11962, 8543, 21785, 18620, 16703, 7131, 1737, -6959, 7931, 28120, 39432]
14462C9432o255r169j267j6347j0188J3670N90L368L394l042k468K888J046l566
14448A2086K052M589q440M733j0555j1113p042o694m055P406R749J8693j099j9317
14434i007J7532J4689l235r974r403K426Q69N279k267J102J2952j0177p597L544
14420F733m558N650J1041J0501p062l088M520l583L109J6272q850p044k494q520
14406A2627j0720J1141Q069r822j4279K587o48K3616n507k6938p07K2043P630
14393A9092J129L258q290J073q417N050J793J23m291m509n757Q986J1218m275
14379A6183O89M684k82J752m336q669n448m747j3786j3983k208J5623J7055l08
14365B219r843J5312J4078O799k6396q928R622M711R016O437l088P511l542j307
$$ y = [39432, 33177, 24008, 22741, 6394, -3794, 9876, 10466, 13834, 17228, 14186, 11718, 14606, 15652, 12086, 14138, 18727, 10287, 15020, 4465, -6648, -13690, -20384, -24439, -17033, -7284, 11409, 10310, -9007, 8525, 23214, 19979, 10005, 602, 3028, 3897, 9176, 6909, 8011, 20963, 10786, 3189, 6733, 2175, 7825, 18866, 29367, 22305, 19217, 23737, 20154, 23263, 39535, 30685, 23641, 21147, 12627, 1907, 13048, 21117, 11295, -2984, -397, -1045, 22571, 17064, -9874, -10581, 11462, 19092, 20221, 23479, 15189, 16262, 7845, 12895, 14688, 14811, 10520, 6011, 254, 9240, 20458, 16183, 16872, 21556, 21274, 23026, 18690, 10021, 4573, -174, -13960, -27943, -30151, -14528, 2527, 2219, -7624, 7688, 21766, 28565, 2169, -6759, 2863, 7574, 16590, 23027, 19939, 27450, 23908, 22601]
14351B2601j0223l779k297N457J225L194K68J521j408o408L508L457M15J000M581
14336B3112l330j5019J3022j7288p136m1K193J9044J5997r237j3788K328q869
14323I88K463J0722m650l675O92n516p031J33P770o017M549n361j0973Q730R143
14308A967K833o698j0234j7295J8341J8806m20j917N892j2074j0279q207j1275
14295c0560J8204O029L921J1675J591j5274k252l504R740K9416J8306k4265q573
14282A4454J1577l824j6178K935q968j017j01k3835l949M032r5J2087J5146l506
14268a242j811k41J0125O041n174m039M222l35m977R90M500J5815P11k205p536
14253A4844j5903J235J1963O068j438j0265K806l360l562k799O444O212P594n286
$$ y = [22601, 12378, 8599, 6302, 11759, 12984, 16178, 16446, 17967, 16559, 10151, 13659, 17116, 17531, 18531, 23112, 19782, 4763, 17785, 497, -6639, -6680, -4487, 14557, 30554, 21317, 7529, 9857, 988, 3451, 14173, 9523, 5848, 6540, 1024, -6007, -5874, 1896, -4121, 428, -4933, -15906, -7176, 1967, 4800, -1898, -12132, -29427, -11086, 7720, 7300, 5383, 11275, -799, -11078, -19285, -30560, -12356, -6327, -2406, 9269, 10860, -4414, -6666, -10170, -430, 28986, 47292, 23027, 14454, 26031, 22207, 6029, 8964, -4, -1021, -1122, -24957, -28906, -24874, -24969, -12882, 2264, -1242, -3053, -3294, 6831, 12872, 7698, 3659, 7881, 7546, 2569, 3559, 8059, 23874, 24585, 22380, 14844, -1059, 176, 12139, 18207, 16769, 6504, 9310, 5950, 2388, -411, 6033, 12245, 19839, 14553]
14239A4553j3080l094j920K726k745k880r18M388K279o1J43P43M187m21j3451
14224i551Q180J7662K71l247R042j3011j327K1672K889o476j1368n144m385l372
14210A835p6P033J2282P894m847r865O76O95L794J0514j9049k0588J0555M154
14196E007j681R5m033N618Q365J0484R740j3642J309J4748j534p041L262K049
14182C2746p264k1000o082Q208R064M258J0409J5218q62j6605j6189j5980J0451
14169F372R383J565o878k128J0892J0953K861q50M531o88M611m770l873M506J5911
14154E2398Q205q324n740j6281N345J6114Q476J8792K2499L6065O3861J14517
14142C15927J49223J99747K21566J22903r2239k34843k03651j41182r2583n6493
$$ y = [14553, 1473, -1621, -3541, -815, -3560, -6440, -7358, -2970, -691, -752, -609, 134, 4321, 3900, -9551, -1371, 16291, 16562, 13315, 22357, 9346, 8019, 29691, 32580, 26104, 14736, 9592, 5207, 1835, 1759, 8792, 21074, 28968, 24121, 14256, 14932, 15627, 19421, 29935, 10886, -9702, 853, 5007, 3326, 3421, -612, 5006, 13371, 23855, 33595, 19953, 21262, 36010, 34476, 27435, 30697, 32746, 25482, 4482, -1600, 6608, 15672, 19930, 30339, 45557, 44695, 28090, 11901, -4079, 6372, 15755, 17320, 10442, 8314, 19206, 30159, 33020, 32170, 36701, 36013, 40624, 35854, 31981, 36487, 52398, 60603, 52279, 46539, 30258, 35603, 51717, 60193, 78985, 101484, 137549, 201410, 315927, 465150, 664897, 886463, 1009366, 917127, 682284, 478633, 337451, 244868, 188375]
14132A88375l7936m0619k9034j0071j4215k943N134J7173k527j1445j6730r734
14120C5428j863J0189O060k4886n814m760k4499l881M264K6138K1108m993K520
14107C5011l73J746L79n534r159m965n50J9204K752k383l402k172O229m909l84
14092C1490j8721O740K13K464M14J4902l179o902r207p689k891Q332M788p236
14078A3518J964Q932J221r83k4352k038J2079j230J3245J3207J0991J535j5207
14065C2882p901k0693j1780J1853l726o782j712k291j1708Q682R231J1845k3286
14052a5386k2104J5905J5399M53N818K2009K0674Q600L998J3k3857l319k135k917
14038B3151j3201P487P254j361M42M718l578l810j1804l475n49K698J1689K796
$$ y = [188375, 150439, 109820, 80786, 70715, 56500, 53557, 58691, 75864, 73337, 61892, 45162, 35428, 33565, 43754, 49814, 24928, 19114, 14354, -10145, -14026, -9762, 16376, 37484, 32491, 35011, 34638, 36384, 36763, 31229, 22070, 17105, 16555, 35759, 38511, 36128, 32726, 30554, 36783, 31874, 31490, 12769, 19509, 19722, 22186, 22600, 37502, 34323, 27421, 18214, 10525, 7634, 15966, 20754, 13518, 15482, 24414, 25635, 24652, 300, -1738, 10341, 9111, 22356, 35563, 46554, 48089, 32882, 24981, 4288, -7492, 4361, 635, -6147, -7859, -10150, -21858, -13176, -3945, 7900, -15386, -37490, -21585, -6186, -5733, 85, 22094, 42768, 51368, 55366, 55379, 31522, 28203, 26068, 23151, 9950, 17437, 24691, 23330, 23772, 28490, 24912, 21102, 9298, 5823, 5274, 7972, 19661, 22457]
14024B2457l34j2232L095J2317O303l734j3305R945K304K904L529N12p019k426
14010B4316l776M143l468j3198P326M390j5179j4714j441K7209O481j1063J538
13997A2564P703m482M132r98n525k211R245O290j0868n792o456k896N297l754
13983B249J1381J2340Kk71o130p846J973J3265N145m622K421j1648r049P98p465
13968B543J0303j929J93Q4O843O382K686k2946m282m368r308N717L3970J5345
13954D1233O369j29l703M651J6275O80j4622j5776J1649l211o666j0479L74J124
13940B7769P566L972k0358j1976o883Q23J9092J1989J20J2683M265m092J234o66
13926D5538p67P309L966m293K246J1397j4272M213Q271K587o717M410o339M557
$$ y = [22457, 22123, 9891, 12986, 25303, 31606, 27872, 14567, 24512, 26816, 29720, 33249, 33761, 26742, 24316, 20540, 24683, 21215, 8017, 15343, 19733, 4554, -10160, -11601, 15608, 22089, 11026, 12564, 20267, 15785, 19917, 18919, 13394, 11183, 20428, 26718, 15850, 10058, 3602, 706, 6003, 2249, 13630, 25970, 25972, 25701, 19571, 11725, 13698, 26963, 32108, 27486, 29907, 18259, 9210, 10008, 2543, 12846, 10917, 11110, 11194, 18037, 24419, 27105, 4159, -123, -4491, -13799, -8082, 25888, 41233, 47602, 47473, 43770, 48421, 64696, 65376, 50754, 34978, 46627, 43416, 36750, 26271, 26645, 27769, 35335, 39307, 18949, 6973, 90, 913, 20005, 31994, 32114, 44797, 49062, 44970, 46204, 45538, 44771, 52080, 56046, 51753, 53999, 65396, 51124, 55337, 63608, 66195, 59478, 63888, 57549, 62106]
13912F2106O972j6207R367P612L3309L2780J1900r284k4453j4415j0939j5264
13900G3484j9148L435l742J291J356j922j2244L208j800n711n646j2964j4291
13887E306L0099J4589p762j112k967M74J7758J1953m13o879j374J4790l441j6396
13873E4625j5981j643l402P74J3161K3718J623P145K7185P751J4922L230O737
13860A39845J57k831K2452Q540J7416L9515L6793O4461J29496K41644L89277N70369
13848A657134O18954J61905n56126o72710m17636k18599j29945r6719o8692n1495
13838B26071l2113k0200j1170J495j7678j575j0714k2936k5324M31N426Q846m684
13825I5875j1635j8676J642P062J583m675q517J8244J381j724j9452o948Q653
$$ y = [62106, 69078, 52871, 62238, 69850, 103159, 135939, 147839, 138555, 114102, 99687, 88748, 73484, 54336, 57771, 54029, 55320, 56676, 54754, 42510, 45718, 43918, 38207, 32561, 19597, 5306, 35405, 49994, 42232, 41120, 38153, 38627, 56385, 68338, 67925, 61046, 59672, 74462, 71021, 54625, 38644, 37001, 33599, 34373, 47534, 71252, 72875, 80020, 107205, 114956, 129878, 133108, 139845, 140002, 137171, 159623, 168163, 185579, 225094, 261887, 326348, 455844, 697488, 1086765, 1657134, 2276088, 2437993, 1881867, 1209157, 791521, 572922, 442977, 346258, 277566, 226071, 193958, 173758, 162588, 164083, 146405, 144830, 134116, 111180, 85856, 86287, 91713, 100559, 95875, 84240, 65564, 67206, 74268, 75851, 71176, 62659, 80903, 82284, 80560, 61108, 54160, 62813]
13812F2813M610r297J538j2411j8260j8003J2626M941R041J9103k159j8756p547
13799B8239K4427J9523J068q284n017P026N299J2436J2424j2819j1377P193j715
13786G8423m543n052j222J4252R456R879O621k4887p411M8046M7592J3559j5247
13773A69466k0015J209M240r562j1497r310q890J8713J0839r284q461O167N754
13760A39369K844O713M761l67M513j2037n13M725J4981l922j6525P151j768m855
13746A45070N196n070j115o982k387O751Q222J0462p464J3059K2337J5198R342
13733B12619J696o33j9673k9492K837J442P01K5083J3774J4526K7343j3239k2573
13720B14411O394J1938P512J6600J9901K5038O114l359P317L748k031N474K3430
$$ y = [62813, 67423, 58126, 59664, 47253, 28993, 10990, 23616, 28557, 37598, 56701, 54542, 35786, 28239, 52666, 72189, 73257, 64973, 59956, 66982, 72281, 84717, 97141, 84322, 72945, 80138, 78423, 73880, 68828, 67606, 81858, 91314, 101193, 107814, 82927, 75516, 123562, 171154, 184713, 169466, 149451, 150660, 154900, 145338, 133841, 124531, 115641, 134354, 145193, 135909, 127448, 133615, 139369, 142213, 148926, 153687, 153320, 157833, 145796, 145283, 150008, 164989, 161067, 144542, 151693, 149925, 145070, 150266, 145196, 144081, 137099, 134712, 141463, 149685, 160147, 152683, 165742, 188079, 203277, 212619, 214315, 213682, 194009, 164517, 167354, 168796, 169497, 194580, 208354, 222880, 250223, 236984, 214411, 220805, 232743, 240255, 256855, 276756, 301794, 307908, 304549, 311866, 315614, 313583, 319057, 342487]
13707C42487J5413J6122K962K0242K454q4r34K3899M1854L4186L6466L1959N1089
13694F18115M7385L0741P50l530J5753L7822K5336L9609N3585M4598N2787Q2191
13682A045142J05434J16132J23602J17047J13351J37607J96044K39844K59508
13673B453711L04037L96219N37669P40268R64626J062140P07180K95966M82338
13664G944154P12931Q23529J196220J892390K885438M329952O646569J0630826
13656C7062009J7601863K9099433M3946590N2813549L0048530l2633157n9908729
13649A18030088m3146818k5070494j4793418r208348o029935m118421k897626
13642A2765028k050320j387310q12885m21343l11827l87504o38380j096077j145590
$$ y = [342487, 357900, 374022, 376984, 397226, 399680, 399596, 398662, 422561, 464415, 498601, 535067, 567026, 618115, 665500, 696241, 696991, 693461, 709214, 747036, 772372, 811981, 865566, 910164, 962951, 1045142, 1150576, 1266708, 1390310, 1507357, 1620708, 1758315, 1954359, 2194203, 2453711, 2757748, 3153967, 3691636, 4431904, 5396530, 6458670, 7165850, 7461816, 7944154, 8657085, 9480614, 10676834, 12569224, 15454662, 19784614, 26431183, 37062009, 54663872, 83763305, 127709895, 180523444, 210571974, 177938817, 118030088, 74883270, 49812776, 35019358, 25811010, 19781075, 15662654, 12765028, 10714708, 9327398, 8514513, 8093170, 7781343, 7393839, 6755459, 5659382, 4513792]
13633D513792q35039n67039l98053k91417k20892j64736j41853j45661j37236
13624A611866j24122q8035o5090r0608q2745q1412p1807n5637n0904n3828n7098
13613G90580o2104n3906n5722l3472j7664j8470j8662j7666k0054j9426j8021
13602D55413k1229j9699k1174o866j4266q702j1830k5075j5412J3066m868k8697
13590B90661k7619k5247r274P060L580L83p537n726o019j4426L996j5233l889
13577A90710P450r983k4449j4115k318j7856j054J1388J2443J601q226j0381j4071
13564A21139l210N063K755r662o297j6679P406J3418J0388L784j3279j4176p943
13551I2707j1928n916j5061p922J0152M505j6605j8156J0019J3292J8437m438
$$ y = [4513792, 3678753, 3111714, 2713661, 2422244, 2201352, 2036616, 1894763, 1749102, 1611866, 1487744, 1399709, 1334619, 1244011, 1161266, 1079854, 1008047, 952410, 901506, 847678, 790580, 728476, 674570, 618848, 585376, 567712, 549242, 530580, 512914, 492860, 473434, 455413, 434184, 414485, 393311, 386445, 372179, 363477, 351647, 326572, 311160, 324226, 319358, 290661, 263042, 237795, 228521, 235581, 239161, 239544, 232007, 226281, 220262, 205836, 209832, 194599, 190710, 198160, 188177, 163728, 149613, 147295, 129439, 128385, 139773, 152216, 153817, 145591, 135210, 121139, 117929, 122992, 125747, 116085, 109788, 93109, 100515, 113933, 124321, 128105, 114826, 100650, 92707, 80779, 74863, 59802, 51880, 62032, 66537, 49932, 31776, 41795, 55087, 73524, 69086]
13539F9086j7309j3004P646j880K063P709R500m536j2093M186J4166L8618O5422
13526A69574M5758p479l0263k1966p384j3923k0439j9300j1986j2408p779p696
13514E4709j6211K740M487j4266j0346K0686J9590r621m683O320p192J646j115
13501D6744l090P646J0348Q165l478k2346p068J6105J180o919J4884p519j4192
13488D0460M306J0886M280j3325L368O280j3044j1545j2079j3137k694o151J3010
13475A0615Q634J808j2318m529q355m447Q723J2604K370r23J1254K0592n283J4293
13461E5038K3647J2503P781J818k6682k7180m083J2284l527Q460j6512k6869n945
13448A0733j892N937p421q09J5730m517j0506J9081K2098n819k843l473k127j2070
$$ y = [69086, 51777, 38773, 46419, 44539, 46602, 54311, 63811, 59275, 47182, 51368, 65534, 104152, 169574, 215332, 207853, 177590, 155624, 148240, 134317, 113878, 94578, 82592, 70184, 62405, 54709, 38498, 41238, 45725, 31459, 21113, 41799, 61389, 51768, 47085, 53405, 46213, 47859, 46744, 43654, 51300, 61648, 69813, 66335, 43989, 36921, 53026, 54206, 47287, 62171, 54652, 40460, 44766, 55652, 59932, 46607, 49975, 56255, 43211, 31666, 19587, 6450, 3756, -2395, 10615, 19249, 21057, 8739, 4210, -4145, -8592, 131, 12735, 15105, 14182, 25436, 46028, 40745, 55038, 78685, 91188, 98969, 100787, 74105, 46925, 42842, 55126, 51599, 60059, 43547, 16678, 10733, 8841, 14778, 7357, 6548, 22278, 17761, 7255, 26336, 48434, 42615, 39772, 36299, 34172, 22102]
13434B2102k0990O437O824j075J682j248q783l874j098m797l967L576n364j0763
13420b1338O077L383J1773L039L556K539N076J573J5480J9181O736j2354j1751
13407C2970j2250n811k62j174p914L687M908P013J759o382j6213j3673j095J3084
13393a353J6337K415o17m497O62L192J0196o435n919j1513P045l055p166J717
13379A009J0537J6943j1704k926K356J2815k968J247q124o047r505M704J482o596
13365C223n208j1892L039j0932O107J1939N083R932p247p262J5526Q408j1658
13352I058j5467j1997K507k093J7053K4982o521n919J8094J2772m489K944L661
13339D4585j024j4176O66P214j1698j284l195J245k321j4287L042J5785l64J907
$$ y = [22102, 1112, 7549, 14373, 13298, 14980, 13732, 4949, 1075, -23, -4820, -8787, -5211, -10575, -21338, -15261, -11878, -105, 2934, 6490, 9029, 14105, 15678, 31158, 50339, 57075, 44721, 32970, 20720, 14909, 14647, 13473, 5559, 9246, 14154, 21167, 22926, 16544, 331, -13342, -14437, -1353, 14984, 17399, 16782, 12285, 12947, 16139, 26335, 19900, 13981, 2468, 9513, 6458, -708, 1009, 11546, 28489, 16785, 13859, 16215, 29030, 26062, 27309, 19185, 13138, 3633, 8337, 9819, 3223, -1985, -13877, -10838, -21770, -15663, -3724, 1359, 11291, 4044, -3218, 12308, 20716, 9058, -6409, -18406, -15899, -17992, -939, 24043, 17522, 11603, 29697, 42469, 37980, 40924, 44585, 43561, 29385, 30051, 37265, 25567, 24283, 21088, 22333, 20012, 5725, 8767, 24552, 24188, 26095]
13325B6095N705n565j3673M692R864J962L125p238J700n474q629o749q416J307
13311a294N399L909l852j9275J766K4516M437j6167J121M255q912p117k007N971
13297g250J1195K512j6321J183J4343Q739J677q654J377N772J0128k563j5125
13284G013q36L401k048r575j6477p452n793J6087J1484M611J2196o910n376r237
13270h912J4764J0815l145j4438p258J7101J684L21q139m258Q918L134j4845l931
13256h189n819q037N403R148Q001N822M628j587j1286M540J0004j468P378m720
13242A3818R39p442m531m339P372j6744j3572J7553J6244L122Q142N781r115q270
13228H958j3386P039P718R616L183P69p163j1799k67L953N35l651r298r929O236
$$ y = [26095, 31800, 26235, 12562, 17254, 27118, 29080, 32205, 24967, 26667, 21193, 12564, 5815, -2601, -1294, 4105, 8014, 4162, -15113, -13347, 11169, 15606, -561, 560, 4815, -4097, -11214, -13221, -7250, 3945, 6457, -9864, -8681, 5662, 14401, 16078, 7424, 8801, 14573, 24701, 22138, 7013, 6177, 9578, 7530, -2045, -18522, -25974, -31767, -15680, -4196, 415, 12611, 5701, 325, -8912, 5852, 16667, 13522, -916, -8174, 8927, 10611, 10932, 2793, -1465, 7453, 10587, -4258, -8189, -14008, -22045, -16642, -7494, 507, 6329, 10957, 9370, -1916, 2624, 12628, 11160, 18538, 13818, 14757, 7315, 2784, -1555, 5817, -10927, -24499, -6946, 9298, 12420, 20562, 26343, 17228, 8958, -4428, 2611, 10329, 19945, 23128, 23897, 16734, 4935, 4668, 8621, 9156, 5505, -3793, -13722, -7486]
13213g486Q236J6865j201m310r324k4026N003m266p367j0289J7033J5179O235
13200B82O390o993j601j916p623j142J4312J2508k293L259m007q635O971P94R311
13185A9617j4527r187j6675M898J0804L253R364m425j4896J8669J6552j823J3901
13172C5525N796J2835J4274J479k790m066J9454L6791L8709N2806Q6602J26601
13160D24016J80243K24913J65968k9897k23767k24552j47673j10104p7789l2195
13150A49163j3244k4545l0722j7611n240q299j1785Q459m532j4623j3465j1543
13138B013K10R087m4J966m515M196j0223j1292m12N850j82J3664m009o994R083
13123H398k022J897o886j8896j3296J0905J9609J453J3391j1326r510j3735k766
$$ y = [-7486, 750, 17615, 16414, 12104, 2780, -21246, -16243, -20509, -27876, -38165, -21132, -5953, 282, 6672, -321, -1922, -3838, -11461, -12603, 1709, 14217, 11924, 15183, 11176, 2541, 9512, 10306, 19617, 5090, -4097, -20772, -15874, -5070, -1817, 7547, 3122, -11774, 6895, 23447, 21624, 35525, 41321, 54156, 68430, 69909, 67119, 63053, 82507, 119298, 158007, 210813, 297415, 424016, 604259, 829172, 995140, 965243, 741476, 516924, 369251, 259147, 181358, 149163, 135919, 111374, 80652, 63041, 57801, 49502, 37717, 46176, 41644, 27021, 13556, 2013, 2223, 11310, 11266, 13232, 8717, 12913, 2690, -8602, -9014, -3164, -3346, 10318, 6309, -685, 8398, 6376, 8273, 1387, -17509, -30805, -19900, -291, 1162, 14553, 3227, -6283, -20018, -22784]
13110b2784J0448P456L973r816K804L732q801K05q424l068Q520o02j3691m545
13096c4593J1971R742j802J3237K0372l67j2929j0258j454j1605J1716P121j8611
13083a7460k695J295P065M187L039r224n288Q807j132J390J2982M742J8943M584
13069C1235o102j6485k77J3734O901j4673p609k813k281J1523N68M430N758j2292
13055A1617K299o327p345O548J61n777o346J0039J1850J060M330n989j5616n528
13041e024l838p353q52J094J2325K3775J2870R529J062j1029k3117p80J0788r666
13027I784j25n614K753L008k565K237Q290k096J136p889p471K396J1945O255k479
13012A9565j16L546q96j0327J0161j5597j8710R299J578j061K2259J3631j4330
$$ y = [-22784, -12336, -4880, -907, -10723, -7919, -4187, -12988, -12783, -21207, -24275, -15755, -16357, -30048, -34593, -22622, -12880, -14682, -1445, 18927, 18560, 5631, -4627, -6081, -17686, -5970, 1151, -17460, -20155, -18860, -11795, -7608, -4569, -13793, -19081, -10274, -11406, -10016, 2966, 7708, 26651, 31235, 25133, 8648, 8371, 22105, 29006, 14333, 6724, 3911, 1630, 13153, 13721, 18151, 23909, 11617, 13916, 7589, 244, 6792, 6953, 1176, -5170, 4869, 16719, 17779, 22109, 16120, 504, -5024, -8862, -16215, -17067, -15973, -3648, 20127, 32997, 42526, 43588, 32559, 9442, 8662, 19450, 9784, 9659, 4045, 6798, 9806, 7241, 9478, 17768, 15672, 16808, 8919, 1448, 3844, 15789, 22044, 19565, 19449, 22995, 22099, 11772, 21933, 6336, -12374, -3075, -1497, -2558, 19701, 33332, 19002]
12999A9002p353j4306K093P20j0340m582k679P772J7756J7173Q644j8363j3198
12986B339m185k260J0166l405M138j2845q935J2021J2604j9658O019K0080J266
12973A7345J463k9997k850M638j3864m333J3356l435J6910J2759o955q599L827
12960B65j819o906J3262k772q508j7633M314J4323p234K507J0338k872Q24k910
12946d821K666j4192J730M121pK171p688m381k736O645L960J8532l303N031K766
12931A0494k061r363J121P405P865p166j5705k1257M641O772J6142J2261J0336
12918B1485k410k932k833O576l10m059j5222l369j341P912K1387p578K421N475
12904B5202o537l0730N081J6011O512r835j533O809j759j2129O615j1154m493
$$ y = [19002, 11649, -2657, -564, 156, -10184, -14766, -17445, -9673, 8083, 25256, 33900, 15537, 2339, -1846, -4106, 6060, 2655, 6793, -6052, -14987, -2966, 9638, -10020, -4001, 16079, 17345, 18808, -11189, -14039, -9401, -23265, -27598, -14242, -17677, -767, 11992, 5037, -3562, 265, -1554, -8460, 4802, 2030, -6478, -24111, -19797, -5474, -12708, -10201, 137, -2735, -1911, -4821, -2155, -16347, -14617, -10496, -10503, -8332, -16020, -20401, -23137, -16492, -12532, 6000, 2697, 7728, 10494, 8433, -930, 191, 7596, 15461, 8295, -7410, -28667, -24026, -17254, -1112, 11149, 21485, 19075, 16143, 13310, 19886, 19576, 15517, 295, -3074, -4415, 3497, 24884, 17306, 19727, 25202, 18665, -12065, -6984, 9027, 15539, 5704, 4171, 10980, 9221, -2908, 3707, -7447, -11940]
12891a1940L053M647P334k184n85R178n581j055P250J811m387K191J531p597j6081
12876a2415p035R501l633p611R010N48j704O141m171o532j158J2487R557J0926
12862A3911J0048j4946j4986m157M308O501k0749L76J5902K23N115n82N374P817
12848A4155l936K42q315q035J1090N513j2947n977m261L062M814n404N046r093
12834a4046N85P139P587j225N775j696r082j6232k574J7947J0386p819j901K008
12820c148j006J4967L968n793k876K844j3339l722Q237m344j878M544m469q170
12806a4185P179N341o62J4035J516k175k646R629J7961j5337q121j1346n730k163
12792f704L110p907Q010l062j2855J2342J1312o313o665j54P338k073O908k141
$$ y = [-11940, -8887, -4240, 3094, 910, 325, 9503, 3922, 2867, 10117, 11928, 7541, 9732, 11263, 3666, -12415, -19450, -9949, -13582, -21193, -12183, -11635, -13339, -7198, -11369, -17901, -19059, -6572, 2985, 13911, 23959, 9013, -5973, -10130, -5822, 679, -20070, -19694, -3792, -3569, 1546, 964, 6338, 14155, 10219, 10461, 2146, -5889, 5201, 10714, -2233, -8210, -12471, -9409, -4595, -9999, -4953, -14046, -13461, -6322, 1265, 40, 5815, 4119, -4963, -21195, -23769, -5822, 4564, -3255, -5156, -3148, -4154, 10813, 14781, 8988, 6112, 8956, -4383, -8105, 132, -4212, -6090, -1546, -6015, -14185, -7006, -1665, -2327, 11708, 13224, 11049, 8403, 18032, 35993, 20656, 12535, 1189, -4541, -6704, -3594, -11501, -3491, -6553, -19408, -7066, 4246, -2067, -8732, -8886, -1548, -3621, 3287, 1146]
12778A146o994p757j025N294P445M82l723j5456l211k258l16L063J9181K162J2264
12763A0297L551J878M256n803k695q925j525o660j255Q286Q537J0237p947r51
12749A1281j1758j1053k661m063K738R64L605m471J8953J0481j4888n391J6306
12736A0043L196p8p760p313j2062J1042O233j0707q125J3108J1853j3227j9215
12723b3012k264j432J1717P620M866m874o69m597J074K503n488R577l71k296K0571
12708A2925l932j9467k006P094R478J3245j1917o112q189j0045j1082o671K7620
12695i059J8690J4252L749n518j1550N620Q231r376p82J710q662j8627o29K3830
12681A1879K705j8440n648L769J2914J2851n124j3843n950j2079J452M317Q909
$$ y = [1146, -5848, -13605, -14630, -9336, -1891, -1409, -5132, -20588, -23799, -26057, -26373, -23310, -4129, -1967, 10297, 13848, 15726, 19982, 14179, 11484, 2559, 1034, -5626, -6881, 1405, 9942, 20179, 12232, 11281, -477, -11530, -14191, -18254, -15516, -14552, -10947, -15418, 3535, 14016, -872, -6263, 10043, 13239, 13161, 5401, -1912, -13974, -2932, 3301, -7406, -15531, -2423, 9430, -3797, -23012, -25276, -26708, -14991, -7371, -2505, -7379, -8048, -12645, -11571, -9068, -14556, -4979, -5350, -7646, 12925, 8993, -10474, -12480, -5386, 4092, 17337, 5420, -692, -8881, -18926, -30008, -36679, -9059, 9631, 23883, 27632, 22114, 10564, 16184, 24415, 15039, 14257, 15967, 7305, -11322, -11951, 11879, 14584, -3856, -9504, -5735, 7179, 20030, 14906, 1063, -4887, -16966, -15514, -11197, -2288]
12668b288J1977K317k454j2346k519J7190l52p504j2333K131M375M980N234O083
12654A4491o003r931k1589j1959k216N321O380P068N115K47P605J7880n604K325
12640I130P252j1176P483p717p496K926P688j0092k314J1807R681J92j3115j0218
12626e969N9K0802J3916q727j7287J386m714j1296q895P905K8137J1741j926r619
12612A5513J84J479J983p836j707j6390q74l367j5704n207M943R056P642J0659
12598C74n241j4977j2260Q536J1724K049k48n316q667j4176J0054M718j2697R211
12584b6916M667j208K358M454n634Q376O729K2N467K674O740J0165m873n573j3759
12569f311j3490Q01R421J0817P030J0296p152k141J6029r099n610J941j6945j6649
$$ y = [-2288, 9689, 12006, 9552, -2794, -5313, 11877, 11525, 4021, -8312, -6181, -1806, 3174, 8408, 14491, 8488, -1443, -23032, -34991, -37207, -31886, -25506, -18438, -13323, -13076, -5471, 12409, 6805, 9130, 16382, 5206, 12689, 4972, -2524, 402, 8090, -2002, -4316, 7491, 17172, 17364, 4249, -5969, -5910, 14892, 28808, 20081, 2794, 4180, -534, -11830, -20725, -12820, 15317, 27058, 25132, 15513, 15697, 17176, 19159, 11323, 9616, -6774, -7648, -11015, -26719, -31926, -26983, -17927, -10285, 374, -4867, -19844, -32104, -23568, -11844, -9795, -10043, -15359, -24026, -38202, -28148, -23430, -36127, -26916, -22249, -23457, -21099, -16645, -22279, -13903, -7174, -7152, -1685, 989, 7729, 17894, 13021, 7448, -6311, -19801, -19000, -9579, 1238, 8268, 18564, 11412, 9271, 25300, 16201, 10591, 12532, -4413, -21062]
12555b1062O310N729r591P005l279L292N129l783k298M895L267O205Q849J995
12541A2663j2120P707k391k821L445J0503P327M19k1779q035m135n324M452L752
12527f337J1957M651K196k222N44q61J790q327N317k074l181l556N77r400r82
12512i908O083j0166M628p526J743M716P803r664K673L069M110n338o943o888
12498b1608P50M732L332J0408Q075m032r611P617P801o03J1824m44o709p320r320
12483e108J259M518q761P214J4515O530P877j7406j7985O192J1308J421n62j0657
12469C55N160M997P983p712o680j934k410O143r773k364k802n630J129N821R499
12454A782J1187k331m234n336L538R41O018J111j1876Q844Q930p678r709j903
$$ y = [-21062, -14752, -9023, -18614, -11609, -14888, -11596, -6467, -10250, -12548, -7653, -4386, 1819, 10668, 12663, 543, 8250, 5859, 3038, 6483, 16986, 24313, 24732, 2953, -5082, -9217, -14541, -10089, -6337, 5620, 10271, 12467, 10245, 10789, 9928, 11718, 3391, 8708, 6634, 3453, -103, 474, -8926, -9908, -3825, -13991, -9363, -16889, -15146, -10430, -2627, -12291, -9618, -6549, -2439, -7777, -14720, -21608, -20858, -16126, -12794, -2386, 5689, 1657, -7954, -337, 7464, 6861, 18685, 18241, 11532, 4212, -5108, -3849, 669, -8092, -878, 13637, 20167, 28044, 10638, -7347, -1155, 10153, 11574, 11012, 355, 5515, 10512, 18495, 10783, 4103, 2169, -241, 5902, -3871, -6235, -9037, -14667, -13538, -7717, 1782, 12969, 10638, 6404, 1068, 4606, 5547, 11565, 12676, 800, 9644, 18574, 10896, 1187, -716]
12440g16k038J0981j090J0710K987o673k830j1865k056N801K832j5828J820J8372
12426A0407J936p158M754r121j1719m748J6645Q369m40r336r641p958O456P73
12412a0781n887M147r106R888J247q218O943k978p799K524M721k518L642L815
12398a0360j429J2099k277j1473n536n846L846K354L118O331m558q715J0115J1011
12384a320m958N78o36j1831M739J0654k248q601l158K447m742Q412J8115j6164
12370h713j0401Q185J2100r122j0259J7913O765n983j2881l273J4166J4449m25
12357A2521n143l808j3432j2652J6827J7179n449o657k788J4838J6302o584p716
12344A3438N884q963l74q853O499n493n149O659p464j5562L484M878K476j927
$$ y = [-716, -2754, 8227, 7137, 17847, 20834, 14161, 11331, -534, -2590, 3211, 6043, -9785, -7965, 10407, 12343, 5185, 9939, 818, -10901, -15649, 996, 9365, 8925, -411, -10052, -18010, -11554, -10781, -16668, -12521, -21627, -11739, -10492, -18710, -11767, -14745, -22544, -20020, -15299, -17817, -14175, -10360, -11789, 310, -1967, -13440, -18976, -24822, -20976, -18622, -15504, -9173, -13731, -22446, -12331, -1320, -6278, -5700, -6336, -18167, -13428, -2774, -5022, -13623, -16781, -14334, -19076, -10664, 7451, -8713, -19114, -10929, 1171, -7951, -18210, -297, 6468, 485, -12396, -15669, -1503, 12946, 12521, 7378, 3570, -9862, -22514, -5687, 11492, 6043, -614, -3402, 11436, 27738, 21154, 13438, 19322, 10359, 9985, 1132, 7631, 2138, -3011, 3648, -3816, -19378, -15894, -11016, -8540, -10467]
12330a0467j1087M667R72q950n279M951P010n6J2300L21j0296P325J1344R096
12316A1851K0q921m291n025J665K452n055J301N603m772j0490p402l735j156J961
12301b5994K274K1994R127J742j0979j669o121l12M355p018k449J1212J3515q031
12287A646M548k303R64j477P578Q852n714n263o888j1443j6515o42M134L391n14
12272a9646j747j341J1003k523o717l166K592J8070M468k457k0350j0378R211
12259b2981Q017R59n850j7139o13K8199P447r326J6364j0908J971K202k0149N954
12245a5853R014J0443j2004j5252j081J6550J689p497K884O125p360q065l93J7771
12231c029L752k669K151j3944L359J7128m668j2080j8138J94Q220O849k114O549
$$ y = [-10467, -21554, -16887, -15915, -24865, -30144, -25193, -18183, -18239, -5939, -5618, -15914, -8589, 2755, 11851, 11871, 2950, -1341, -6366, -4701, -2249, -7304, -6003, -400, -5172, -15662, -23064, -26799, -27955, -25994, -23720, -1726, 7401, 9143, -1836, -3505, -9626, -9938, -5583, -12601, -15050, -3838, 9677, 1646, 6194, 3891, 4855, 3378, 10956, 19808, 14094, 8831, 1943, -9500, -26015, -26657, -22523, -19132, -19646, -21393, -22734, -11731, -14254, -20971, -24137, -21545, -3475, 993, -1464, -21814, -32192, -22981, -14964, -14005, -19855, -36994, -37607, -9408, -1961, -11287, 5077, -5831, -3860, -1658, -21807, -15853, -6839, 3604, -8400, -23652, -24733, -8183, -6494, -13991, -11107, -4982, -12342, -20407, -20800, -3029, 723, -1946, 205, -13739, -10380, 6748, 2080, -10000, -28138, -27944, -19724, -12875, -14989, -8440]
12217h440P702J2833L75j9898r493j2968L931J6893K636P497j99l336q197p778
12203a8442p339O279J2315N155J1009l780M254m124l304k390R846k50m541p75
12189C913o420O172Q443L893j1676r025J2328Q288j8009n620K168N662J4773M551
12175A9441j3183q773o7M99j821J16p755n053k680J9202P625r861j3101R99m656
12160a9068Q81J1571j151j1893m556K601o027J0417M738l70N306j2200Q59J9180
12146B88P60K146L196n410Q479l315j4491N494Q870m327k755p909M729N983n737
12131c999k723O112J2776j624j16j3974k749J8536O556j964j2517k2567j1305
12118b9558P277J6606J870P313J0712q445q314Q773K579p91j4822q310r8j1642
$$ y = [-8440, -738, 12095, 12470, -7428, -16921, -29889, -25958, -9065, -6429, 1068, 869, -2467, -10664, -18442, -25781, -19502, -7187, -2032, 8977, 5197, 9451, 5327, 2023, -367, 9479, 9229, 4688, 3913, -2507, 3665, 12108, 16001, 4325, -4700, 7628, 15916, -2093, -7713, -5545, 117, 14890, 19441, 6258, -2515, -2582, -2083, -3904, -3788, -11543, -16596, -19276, -74, 7551, -2310, -15411, -14412, -19068, -18187, -6616, -7767, -19660, -24216, -21615, -27642, -17225, -12487, -12857, -7551, -19751, -18892, 288, 1048, 3194, 6390, 980, 9459, 6144, -8347, -2853, 6017, 1690, -1065, -8974, -4245, 1738, -3999, -6722, -610, 12166, 10542, 10426, -3548, -6297, 12239, 18795, 16831, 4314, -18253, -29558, -22281, -5675, -3805, 3508, 14220, 5775, -2539, 6234, 8813, 8022, -6800, -15110, -15208, -26850]
12104b6850j826L856M796p122J6391J3379j430p153m926J4722K5115J393p376
12091B2969q10R841j3279k216l230P556q808p559J984L139l480l368m149m742
12077f152j5774k1610Q668R93j417l909J0957O85R001n052J121J5929J2339k169
12063C610j3827o342j3285p646M773L0378J5400q567j4935K76J916K0638J6561
12050B8950l141j3973n758N401n841l471P012J4091n217l969p333j5912j0062
12037a9223n716N565J9975Q953j9572r397n817J1848J1994J8069P366r315j1724
12024C006k767J2403n518J907N783J079j982j1469r757k344O181k618j0169J3075
12010c190M577m711q475l501K4541J8892r521p030k785l275l63M53j3571o472
$$ y = [-26850, -28676, -24820, -20024, -27146, -10755, 2624, 1194, -5959, -10885, 3837, 28952, 30345, 22969, 22159, 32000, 18721, 16505, 13275, 20831, 12023, 4464, 6448, 9587, 6107, 2739, -1410, -6152, -21926, -43536, -34868, -33875, -35292, -39201, -28244, -27559, -18558, -23610, -22489, -6560, 5779, 3610, -10217, -16559, -29844, -37490, -32717, -2339, 13061, 4494, -10441, -10165, -8249, 12389, 28950, 25809, 11836, 6078, 11479, 5638, 2167, 9179, 23270, 18053, 14084, 6751, -9161, -19223, -24939, -19374, 601, 9554, -10018, -19415, -25232, -13384, -1390, 16679, 24045, 14730, 3006, 239, 12642, 7124, 9031, 14814, 15893, 13911, 2442, -7315, -9659, -3478, -6096, -16265, -3190, 1387, -3324, -11799, -15300, 9241, 28133, 18612, 11582, 8797, 5522, 5159, 5612, -7959, -14431]
11996a4431J987O315N231N390l382K872J7947R139q7j0119l413p574j9101j8014
11982b7240j620J8148J5571J3354k73o960K666Q778q251j8887l254N323J9882
11969A7237J6250r878q198k663o258q135n224J1365J1798k517l30L023n857m717
11955E896j883j258O357J1740M551n384l852j3640o421m349L750M01J0745P410
11941A4063j615K864j4947M850L669J4003K131k5743J069O142p939M978M023p325
11927B23q945j5037J1635J6458P613J503p79j045O353J462m278j4879j3174M068
11913h822J7548J5362j5227k6832O028L407L027r29m504k992J8156j5020N805
11900d993j000Q310M165n376j7285J269K2474q987n562j2672j2224O166J4857
$$ y = [-14431, -12444, -6129, -898, 4492, 1110, 3982, 21929, 31068, 30981, 20862, 17449, 9875, -9226, -27240, -28860, -10712, 4859, 18213, 17940, 10980, 13646, 22424, 14173, -4714, -7968, -2645, 17237, 33487, 23609, 15411, 12748, 6490, -1645, -6869, 4496, 16294, 13777, 13447, 16470, 10613, 5896, 4013, 2755, 9112, 20852, 25403, 20019, 16167, 2527, -3894, -8243, -4493, -4092, 6653, 14063, 12448, 15312, 365, 5215, 8884, 22887, 25018, -725, 344, 6486, -1453, 3525, 7548, 223, -8722, -23759, -12124, 4334, 11947, 13450, 12671, 11626, 17979, 19441, 15163, 284, -12890, -8822, 8726, 24088, 8861, -17971, -11943, -8536, -5509, -6438, -10942, -13934, 4222, -10798, -4993, -5993, 2317, 6482, 1106, -16179, -14910, 7564, -1423, -6985, -19657, -31881, -25715, -10858]
11887a0858K2533J2282k061o215m054K342M692K336o761R323j511J948R697j1089
11873B2604k4490k3210j1261J5810J876M261J6836J406j2100Q010m166N130L068
11860C774p473K63L237J3449J0747N709J687o672L58k860o62o671p841q140j0138
11845a1233l619m003P051J967n600N3O854R972j3479j2148L161J0059J0926k11
11831b50J1024l123l643j3625j5798r68P290K332L535O838J1704l183P001j4979
11817e845n181J6200M923j0082m761J699O782K574p297O793J969q711q80P965
11803F148p178N104J060J0768r247j2695L325K278n262q731n038J510K027J1694
11789d237N581r525j4152n611J6904O190l59m947O295J593j096j5204j2378P037
$$ y = [-10858, 11675, 23957, 21896, 15681, 11627, 13969, 18661, 20997, 14236, 23559, 22048, 23996, 33693, 22604, -1886, -25096, -36357, -20547, -18671, -14410, 2426, 3832, -8268, -258, -4424, 706, 3774, -3699, -3436, -199, 13250, 23997, 29706, 31393, 24721, 25079, 22219, 21557, 14886, 7045, -1095, -11233, -14852, -18855, -11804, -9837, -15437, -15384, -8530, 1442, -12037, -24185, -21024, -10965, -39, -250, 10774, 7651, 4008, -9617, -25415, -26383, -19093, -16761, -13226, -6388, 5316, 2133, 9134, -5845, -11026, 5174, 10097, 15, -4746, -3047, 3735, 6309, -988, 5805, 7774, -937, -1817, 6148, -1030, 4074, 5134, 15902, 6655, -6040, -2715, -437, -5699, -14430, -19468, -17958, -15931, -4237, 1344, -8181, -22333, -27944, -11040, -4850, -5209, -10156, -3861, -2268, -3364, -18568, -30946, -23909]
11775b3909J2823l765n142Q498J0522J0528J894j373O907Q840Q797L856O275j8861
11761B5890p067j0529L289j7288k824Q904m00M210R874j939J2049O645j67k4256
11747F391m184m200m642j6208K1568J4540k4019r485Q826m75O198N746Q658J022
11733I736R014m561j0710j769Q139L618q256o697m915n598M564J2482J311m105
11719B253J529o564Q23M071j0689k575M941k049q735j874J64J4459K578J8050
11705A6382Q438r185O279J053j7585j1007j4147q46k131P556L015k643j4919M427
11691b5313J4928R640j672j551j9556N394K3432J9138L076j4336j346J220j1890
11678A164J7740j0686k2553j9J4481K730N792n204j0332k994j287O597Q744J5316
$$ y = [-23909, -11086, -14851, -19993, -11495, -973, 9555, 11449, 10076, 16983, 25823, 34620, 38476, 44751, 25890, 18823, 8294, 11583, -5705, -8529, 375, -25, 4185, 14059, 12120, 24169, 30814, 30647, 6391, 2207, -1993, -6635, -22843, -1275, 13265, -10754, -20239, -11413, -11888, -5690, 56, 8714, 9736, 18750, 14189, 3479, 1710, 9849, 13467, 5211, -1486, -6401, -11999, -7435, 5047, 6358, 2253, 3782, -2782, -1959, 2112, -8577, -11152, -6211, -8260, -16995, -18869, -18705, -4246, -1668, 16382, 24820, 15635, 21914, 22967, 5382, -5625, -19772, -20618, -22749, -15193, -12178, -14821, -29740, -25313, -10385, -745, -2417, -3968, -23524, -18130, 5302, 24440, 27516, 13180, 11834, 13054, 1164, 18904, 8218, -14335, -14354, 127, 2857, 8649, 3445, -6887, -9881, -11168, -4571, 4173, 19489]
11664A9489p073j4184j3945L896L883R120O502J050j0928j3521K965J6459J6177
11651A9890r768L144M145k53N13R923n08q648j0813k634J1647P722K571q970n162
11636A2799r2L308k1954k1915L940J6193P755j657k1754l843Q827J5622J0580
11623G809o194j0999o868n372J0403J2385R047o059O73n493R704J1203J2700r220
11609B3719j2615n969O432O526k800o088l546j1881p465J1096R675j0622r872
11596a3410o907N775L497k02k147K309K839M308j1965p802N695J4839J6845J7486
11582C1160k5404j9029J118J5292K768k940q380J541O318j2788m39J646m991R226
11568d902o998J697j692j3560J2081K3527O207j3712p448J4841j568j1843J64
$$ y = [19489, 12416, -1768, -15713, -11817, -7934, 1186, 7688, 8738, -2190, -15711, -12746, 3713, 19890, 10122, 13266, 17411, 17158, 17671, 27594, 27086, 18438, 7625, 4991, 16638, 24360, 26931, 17961, 12799, 12707, 16015, -5939, -27854, -23914, -7721, 34, -1623, -23377, -27220, -18393, -2771, 7809, 1615, -9384, -16252, -21624, -11221, 1164, 10211, 4152, 4825, -668, 9036, 20239, 32939, 23719, 11104, 5135, 11567, 18093, 15293, 9205, 5659, -6222, -13687, -2591, 7084, -3538, -13410, -20317, -14542, -11045, -11247, -13394, -11085, -8246, -3938, -15903, -23705, -18010, -3171, 13674, 31160, 5756, -13273, -12155, 3137, 5905, 2965, -5415, -3874, 2444, -10344, -10783, -9137, -14128, -4902, -11900, -10203, -11895, -25455, -13374, 10153, 16360, 2648, -4800, 10041, 8473, -3370, -3206]
11555c206j197M933o074k637N878K364j3038O714K3256Q711q449K608q524j2450
11541a111k814Q913O070m44o739k0430j2454P168R942M919k530j3610N038N910
11527a2172N358J992Q559L42K866r063r652R200N731q111O922p397j888N098m267
11512f482p031r42l549R798K3867R156j0861q614K076k731j4034q111R014J8747
11498A0303n910N731j6407l456Q443r952m498R760O087m111j014L553J086o45
11484a030o396p27L362J0024M819n180j118j0694J240N219J430J0639n56k298
11470H734J24r379k493o109o008k530L713O872L250k629r34L200r907j383J3393
11455b086J3502j0357q638m879k0695J2497J6081j231P284L057P02M489L068k0508
$$ y = [-3206, -4403, 530, -5544, -8181, -2303, 61, -12977, -6263, 16993, 25704, 17255, 19863, 11339, -1111, -3925, 4988, 11058, 10614, 3875, -16555, -29009, -21841, -11899, -6980, -9510, -23120, -18082, -12172, -6814, -4822, 3737, 4079, 6945, -2118, -11770, -2570, 3161, -4950, 1972, -5425, -7313, -2215, -6482, -13513, -14455, -18004, -8206, 15661, 24817, 13956, 5342, 7418, 4687, -9347, -17458, -8444, 10303, 4393, 10124, -6283, -9739, -1296, -11248, -15746, -5986, 101, -4010, -5024, -1471, -385, -1030, -7426, -8153, -4791, 5233, 10052, 4872, 3754, -6940, -5700, -481, 949, 11588, 11032, 8734, 8858, -521, -3014, -9123, -15131, -17661, -13948, -7076, -3826, -6455, -7389, -4189, -14096, -15479, -2086, 11416, 1059, -7579, -12458, -33153, -20656, -4575, -5806, 1478, 4535, 5237, 9726, 12794, -7714]
11441g714r150l71r903J0428J551k1117p138L843J5709J4511J3877N850j2586
11428b210q454J0078J8799j4695q587m906n822k180j567O280p79j057k021Q142
11414h979J765l458J7938O296m675m9p799q499K652M955R198P193J710j7948j7189
11399a6889K217L056L1857q35p340r501k043L867L698J578J1365j2725j3982K511
11385c166N406M795J632K572j2546o387k49R843Q856J2683q68m532l481o87k0149
11370f278M52l712k740m117P626J3079p170j0282P410K195J607q725N987J7960
11356A3292Q799j1608j2536k222k934K3223J1350j0195P271K374l207j5888p125
11343E94o982M011P913P539q628q006m6j3935k086J3105J8118o039n293l650L665
$$ y = [-7714, -16864, -17235, -27138, -16710, -15159, -36276, -43414, -39571, -23862, -9351, 4526, 10376, -2210, -10664, -586, 18213, 3518, -5069, -9975, -15797, -17977, -19544, -13264, -14043, -15100, -17121, -8979, -7214, -10672, 7266, 13562, 8887, 8838, 1039, -7460, -4808, 147, 9345, 16538, 18248, 300, -16889, -14672, -11616, 20241, 19406, 12066, 2565, 522, 4389, 8087, 9665, 21030, 8305, -5677, -3166, 2240, 7035, 8667, 11239, -1307, -7694, -7943, 1900, 10756, 23439, 22571, 18039, 14558, 13871, -6278, -5826, -9538, -12278, -16395, -8769, 4310, -2860, -13142, -5732, -3537, -1930, -10655, -4668, 13292, 22091, 10483, -2053, -4275, -7209, 16014, 27364, 17169, 24440, 26814, 23607, 7719, 594, -6388, -2377, 5536, 13075, 4447, -3559, -3605, -17540, -19626, -6521, 11597, 5558, 265, -3385, 280]
11328B80L296k785n354J858R654J1786j2185l823N308M070k278j25r830o906J222
11313e812q792l994r651J4185J7636K136J0406J1694l468k0966o485J702n846
11300g255K747J2649J3705j2456q694j3705L434Q864R222o535q909j5991J53N832
11286a6939J254J073p14j1984k349L386r385K035O468Q807Q683O552J1198Q050
11272A6135p106n311M974j1408N947J6708J7821L526k4457r336J0582M783p292
11259A5566j650J0032K242L01l282j1349r586P03n00N190J0466O802O58j06q603
11244A6884j2442R19l796K31J7554K894j2826L355J2953O009K462q696j2165m54
11230A2882m890q450m67j2205p327K1252K244P231J5496j5839n637o415o206J1942
$$ y = [280, 3576, 791, -4563, -2705, 6949, 18735, 6550, 2727, 8035, 12105, 9827, 9702, -128, -7034, -5812, -14604, -18598, -28249, -14064, 3572, 5708, 16114, 27808, 24340, 3374, -3111, -1409, -7255, -4508, 8141, 21846, 9390, 696, -13009, -9575, -711, 8511, 1976, -6933, -22924, -22771, -16939, -15685, -14612, -15326, -27310, -29659, -26273, -35658, -33623, -27155, -18348, -9665, -3113, 8085, 16135, 9029, 3718, 8692, -2716, 3231, 19939, 37760, 41286, 16829, 7493, 18075, 22858, 15566, 13916, 23948, 26190, 26491, 23209, 11860, 2274, 2977, 2477, 7667, 18133, 24935, 25593, 25487, 16884, 4442, 5361, 1565, 1796, 19350, 22244, 9418, 12773, 25726, 31735, 34197, 25501, 13336, 12882, 7992, -458, -925, -13130, -20457, 795, 3039, 10270, 25766, 9927, 4290, -2125, -8331, 3611]
11216C611J7854l839k788q820j6993K2501R354j8793n177J2610Q440R162j749
11203B5373n384j3574k3182p931J5271l132j1820P970P388J8803J3038N255p330
11190B0745j7130P904R218m895m166J029j1410L35L781J4346k8530q474J7379
11177A32k540k33p90p19K0642K476r38O614m59j1324o238J2480m193p491n670
11162A749j8600k415Q271J2921J2659K455n269j6791N79K277M274r904O5o917
11148a4646j1294J768J0422J0589k885Q764P06n406J6609J976O905J0058o143
11135B7423j3964O012J0441j0340M378n861Q711Q094j6372l541j2678n285l807
11122f789l628R599j4512k750O535J2619j0707J0029L1892N283m907r936j2282
$$ y = [3611, 21465, 17626, 14838, 6018, -10975, 11526, 20880, 2087, -3090, 9520, 17960, 27122, 25373, 19989, 6415, -16767, -24698, -9427, -12559, -24379, -16409, -9021, 9782, 22820, 28075, 20745, 3615, 11519, 20737, 15842, 11676, 12705, 1295, 1630, 5411, 19757, -8773, -17247, 132, -2408, -2641, -3431, -4150, 16492, 18968, 18030, 24644, 24185, 12861, 6623, 19103, 14910, 7419, 1749, -16851, -19266, -10995, 1926, 14585, 17040, 11771, -5020, -4441, -2164, 2110, -7794, -7729, -14646, -25940, -24172, -13750, -3161, -6046, 2718, 3424, -1982, 14627, 16603, 23508, 33566, 27423, 13459, 19471, 29912, 19572, 23950, 18089, 26800, 34894, 18522, 14981, 2303, -2982, -6789, -10417, -818, -15330, -18080, -11545, 1074, -9633, 396, 32288, 37571, 32664, 22728, 10446]
11109A0446n261r364j2606k513M09O414R147K1401q010M990O319L61p936q019
11095E778J4533r037j4833K0139J6229j3745k761l213o092j4480m464J1863K543
11082B460J0268O729j894j3617q605O530J405j6455Q068J5761j2645k018R064
11069E051n813J2156J0058K16j221j615L95k548J0055Q101M74j5813L292J0669
11055C3457k757p113L849l088j0868r378K478Q838L438K772j1773n051j2901o022
11041a4119J3832O478J0038m378M350R819j0710j2909j8707p252J4267J1866N688
11028H263l838M072m88L658n754J2265J0613j5017j2130L441J0827r226j6010
11015i324J460K636r878n226n723R734J3598J3303k966k339O656J0240P224N66
$$ y = [10446, 5185, -4179, -16785, -19298, -18889, -12475, -3328, 18073, 10063, 15053, 21372, 21733, 13797, 5778, 20311, 11274, -3559, 16580, 32809, 19064, 16303, 13090, 6998, -7482, -11946, -83, 2460, 12728, 19457, 17563, 3946, -4659, 1871, 3276, -13179, -5111, 10650, -1995, -4013, 5051, -762, 11394, 21452, 21668, 20447, 18832, 19227, 16679, 26734, 34835, 35309, 19496, 22788, 33457, 30700, 23587, 27436, 24348, 13480, 4102, 6580, 15418, 18856, 21628, 9855, 4804, -8097, -14119, -287, 6191, 16229, 11851, 16201, 26020, 15310, 2401, -16306, -23558, -9291, 2575, 8263, 4425, 8497, 8009, 11667, 5913, 18178, 28791, 13774, 1644, 5085, 15912, 6686, -9324, -7864, -5228, -15106, -20332, -26055, -16321, -2723, 10580, 7614, 5275, 11931, 22171, 29395, 29961]
11001B9961j9926N47J3011j2162K655J699L911j4155j9229Q400J3212J0494l602
10988A4816j1624q322j0349M497k867M60J1635N092J9250L490J38m845j235O941
10974B7077l039o587K960J3326r326l0222J0499K8033k081k1925q372n327Q08
10961d176K1325N872M825J1005O655j3287q225n022N42o539m508Q043K691j3540
10947E661N939J2504j1589r902J8977n042Q921M063j6434k286p8P010J219M199
10933B3162l683J9209M050J394j6724j6223J7551j732k2842J774L980N926N910
10920B1752n46r98j4892m315o976N26M710O07M900M394M230j0964j6559K1687
10906G556M275q154l667J3496R183o105j8838j792J5582O911o744P881J832K863
$$ y = [29961, 10035, 10582, 23593, 11431, 14086, 15785, 19696, 5541, -13688, -5288, 7924, 18418, 14816, 3192, -5130, -15479, -10982, -13849, -13389, -1754, 3338, 22588, 26078, 26216, 21371, 20136, 27077, 24038, 17451, 20411, 33737, 24411, -5811, 4688, 32721, 30640, 8715, 343, -4984, -4176, 17149, 23021, 27846, 38851, 45506, 32219, 23994, 18972, 19514, 12975, 8467, 16510, 19201, 5661, 11600, 24104, 12515, 2613, 21590, 16548, 25469, 29532, 13098, 10812, 10734, 17744, 18963, 23162, 19479, 38688, 42738, 44132, 27408, 11185, 28736, 27004, 4162, 5936, 9916, 15842, 21752, 21206, 20208, 5316, 1001, -5975, -5449, -739, -132, 4768, 9162, 13392, 2428, -14131, 7556, 11831, 3677, 10, 13506, 22689, 16584, -2254, -4046, 11536, 18447, 11703, 19584, 21416, 24279]
10892B4279p1j5804j0513J2572J3622j3075j4529Q416J3818K310M747J2131j0777
10879B7126j4064o807l053j5275M11j227K285r080p604K882l920L105R561O222
10865i438N835J5542J537j1534Q98J0733n966O116P654p694M292J188q311O798
10851A7650J8839p900o491O393N846q674j6791N890j3936J025P250J0494K17L032
10837B2844Q139J0087N691M9J4159N022M325o905l019m199K598K935J5548J6198
10823I3472J1621J8991K9979L7651N2073Q1708J33797K24874L90395M62268K60629
10812A797458l19326n20425l50994k08207j28492p8693m0417k8022r12n753k0258
10801I5959j829j2201j7305o766L259j1667j8275P796N479q930n664L494k448
$$ y = [24279, 24208, 8404, -2109, 10463, 24085, 11010, -3519, 4897, 18715, 21025, 25772, 37903, 27126, 13062, 6255, 3202, -12073, -11662, -12889, -10604, -19684, -27288, -24406, -28326, -25221, -15660, -9438, -3603, 11939, 13476, 1942, 2840, 13573, 7607, 13723, 21377, 13683, 17975, 19163, 10852, 17650, 36489, 28589, 22098, 28491, 34337, 25663, 8872, 14762, 826, 1851, 9101, 19595, 19812, 22844, 30983, 41070, 46761, 46810, 60969, 65991, 70316, 63411, 60392, 56193, 58791, 61726, 77274, 93472, 105093, 124084, 154063, 191714, 243787, 325495, 459292, 684166, 1074561, 1536829, 1797458, 1478132, 957707, 606713, 398506, 270014, 191321, 150904, 122882, 121970, 116217, 95959, 94130, 81929, 64624, 57858, 61117, 49450, 31175, 38971, 44450, 35520, 29856, 33350, 30902]
10788C0902J0110j99L295n009m381L156N083r289m735J5414L670k559j6626p905
10774B0927Q522O384r707K035o285q39j070l59n943q675J290J7121K5023j1958
10760C6466m821l937R597k227N389r149j0799l541R915J705j0998K200j442R006
10746B7364Q949j6086K258O141n815j4726j2313k470K993l357Q910P874r42M037
10732A2817J1650J2545J319q22o746J910M358j928j4987j3810o825J9303M775
10719B3559M020j8092K827R794o769P126J011l443j0646J6936K2213K963j1028
10706D0471L917K591k6541P775M520O796N731N355m92J1354P530j1845k1269n630
10692C0263J0822K714P22J2188o411r888J0878l09M949J5676N786K2640L3437
$$ y = [30902, 41012, 40813, 44108, 39099, 34718, 37874, 42957, 33668, 28933, 44347, 48017, 45458, 28832, 20927, 29449, 35833, 26126, 28161, 21876, 21037, 19967, 19608, 13665, 4990, 6280, 23401, 48424, 36466, 31645, 27708, 37305, 35078, 40467, 31318, 20519, 16978, 26893, 28598, 17600, 19800, 18358, 27364, 36313, 20227, 22485, 28626, 22811, 8085, -4228, -6698, -3705, -7062, 1848, 9722, 8780, 12817, 24467, 37012, 38331, 37509, 30763, 32673, 37031, 35103, 20116, 6306, -519, 18784, 23559, 27579, 9487, 12314, 22108, 15339, 22465, 23476, 20033, 9387, 26323, 48536, 51499, 40471, 44388, 46979, 20438, 28213, 32733, 39529, 45260, 50615, 50123, 61477, 69007, 57162, 35893, 30263, 41085, 43799, 44521, 56709, 50298, 40410, 51288, 50979, 55928, 71604, 77390, 100030, 133467]
10679A33467N1590P573m3448l9551l4771k8728j7094J2060J6300K3439k24l904
10667G6709k8744j4807P473J3221K9304L8661M6721M2178K7827o210k5163l2088
10655A75082l1382k5788k5794r917n644j3184q329J670M099j6362n300K125O450
10642D7726N309n897N078k526j3253j4882Q450q94J2851O712j1404j1122p980
10629A8168J5380L716L967K93m908j521j1080K25P793j1526j2200j378P835Q151
10615B2915J8465p71m412N483j875K3358J5228l3993k7331j8901R477J4305l075
10602A8873N439K16j3786K021M446J7116J5756o493J9361J2916N524J0376J1007
10589A02772J1834M286j0241j0782j3976q437j1429j545Q431Q201o647j0442K686
$$ y = [133467, 185057, 192630, 149182, 109631, 74860, 46132, 29038, 41098, 57398, 80837, 80613, 76709, 47965, 33158, 40631, 53852, 83156, 121817, 168538, 210716, 238543, 232333, 207170, 175082, 143700, 117912, 92118, 82201, 76557, 63373, 55044, 56714, 60813, 44451, 39151, 41276, 47726, 53035, 47138, 52216, 49690, 36437, 21555, 30005, 29111, 41962, 48674, 37270, 26148, 18168, 33548, 37264, 41231, 41524, 36616, 35095, 24015, 24240, 32033, 20507, 8307, 6929, 14764, 22915, 41380, 40609, 36197, 41680, 39805, 63163, 78391, 44398, 17067, -1834, 7643, 21948, 18873, 24312, 24528, 10742, 12763, 17209, 34325, 50081, 43588, 62949, 75865, 81389, 91765, 102772, 114606, 118892, 108651, 97869, 83893, 75456, 64027, 62482, 70913, 79114, 72467, 62025, 64711]
10576F4711j705R427L025O207l371m88J6767J3362q98j2952q664k0309j6528j9355
10562B9229j6473j3054Q587L2397J6631M140m013J1041N120j0609j634J6413J1896
10549H9671K746r082j0059M297J2581Q53L73j1293j966R176P324N43J4398Q329
10535A17891P613J2216l0027l2422O1672Q6964J5990m3170j8206K072J2222p053
10523A85762j997p992n867J4922q41O029j826j8334M935O777J834N657O447j2805
10509A82701j0887J574J5886J1134j4276j409R791q281M739j014L737R149o137
10496A96707j7674j7769K2248K1770J1148L152K1189R569N66j901P991j420l244
10483B52332k1158R85K7109K8641J3908K9541k271l696Q499j4923j7080J2875
$$ y = [64711, 63006, 72433, 75458, 81665, 78294, 77806, 94573, 107935, 107037, 94085, 85421, 65112, 48584, 29229, 12756, -298, 8289, 40686, 57317, 61457, 57444, 68485, 73605, 62996, 61362, 77775, 89671, 92417, 83335, 73276, 77573, 90154, 91007, 91380, 80087, 78121, 87297, 94621, 95164, 109562, 117891, 125504, 137720, 107693, 75271, 136943, 223907, 239897, 196727, 178521, 180593, 192815, 185762, 183765, 175773, 169906, 184828, 183987, 190016, 188190, 169856, 174791, 181568, 183402, 189059, 195506, 182701, 171814, 173388, 189274, 200408, 186132, 184723, 194514, 186233, 190972, 189958, 193695, 202844, 196707, 179033, 161264, 183512, 205282, 216430, 219582, 240771, 250340, 250906, 249005, 256996, 255576, 252332, 231174, 232159, 259268, 287909, 301817, 331358, 329087, 325391, 333890, 318967, 301887, 314762]
10471C14762K7405K4241M8600P403n530L890R069J1838K2511J0424J2021J0773
10459D97407K3074J3304J1101J8331M1342L4558K3157K9302M1038N0249O2858
10448H45721N7017L9318K1627J3284L1926M3104N2326O4434P4229Q8847R8264
10437A430097R8348J26365J87770K03855K08738K37377L04956M98171P59049J078318
10427E133044J391215J396901R54400K78332q89291p07743n07N63095J000554
10418I120000J517462K135766K729223L261452L758479N163738Q509867J4319823
10410E0515810K4509044M2354620O7949612Q9398841O7086654m7718103j06500878
10403A87595600p2638557m0058662k2793329j3762220q653410n607498l922890
$$ y = [314762, 342167, 366408, 415008, 422411, 416881, 420771, 429840, 441678, 464189, 474613, 486634, 497407, 520481, 533785, 544886, 563217, 604559, 639117, 662274, 691576, 732614, 782863, 845721, 902738, 942056, 963683, 976967, 1008893, 1051997, 1104323, 1168757, 1242986, 1331833, 1430097, 1528445, 1654810, 1842580, 2046435, 2255173, 2492550, 2797506, 3295677, 4054726, 5133044, 6524259, 7921160, 8875560, 9153892, 8264601, 7556858, 7556351, 8119446, 9120000, 10637462, 12773228, 15502451, 18763903, 22522382, 27686120, 36195987, 50515810, 75024854, 117379474, 185329086, 274727927, 341814581, 294096478, 187595600, 114957043, 74898381, 52105052, 38342832, 29689422, 24081924, 20159034]
10396B0159034l432725l096570k451852j818030j369574j041474q26562o38408
10388E483839m57238k62749q9621Q8550J45181l54194p55302o16386m38591l32065
10378B411424k39574j59288j23551j04668j15868j40459j17779p0655q9853q6464
10368A163265o7531q5526q2499o6103n1379k0019j5731k3488j0708q136j5600
10357G16545m3069l8630k2775l8749o0819l8195j4689j3342m264k0275j4794O821
10345D13765o671k4200n455j3964m863r022K906J83k4029l0266k0343k2215R535
10332B65361N699q04P040K548k2493l1651l5170n048L026r633k0732o001r467
10319A42675j9740K0024K2911J3078n139j6412L653J0755j4259K65K74j0069r827
$$ y = [20159034, 16726309, 13629739, 11177887, 9359857, 7990283, 6948809, 6122247, 5483839, 5026601, 4763852, 4674231, 4762781, 4907962, 4553768, 3798466, 3182080, 2743489, 2411424, 2171850, 2012562, 1889011, 1784343, 1668475, 1528016, 1410237, 1339582, 1249729, 1163265, 1095734, 1010208, 927709, 861606, 810227, 790208, 774477, 750989, 740281, 732145, 716545, 673476, 634846, 612071, 573322, 512503, 474308, 459619, 446277, 442013, 421738, 406944, 413765, 407094, 382894, 377439, 363475, 358612, 349590, 352496, 352679, 328650, 298384, 278041, 255826, 265361, 271060, 270256, 277296, 279844, 257351, 225700, 190530, 185482, 188508, 178875, 158143, 152142, 142675, 122935, 142959, 165870, 178948, 173809, 157397, 161050, 171805, 157546, 157811, 158085, 148016, 138189]
10306A38189j0281j4329n986R129j2826p766J4767K329k1452P949N769P371r483
10293A03380k7344p696J5805K0146j1497j8423p824J7679J0030l589J1052L2961
10281A34680R2844R5176L175o8452l6504k2872j8352l5955k1663J849m401K051
10269A21576N590p575j217o649j4943k1424p715K892m583L2228J3417n927M189
10256A09859j3460j5161K983L9342J7994j6161j0810k6697j8176k5217p579O05
10244C7522j0319L395p49j508Q502L982R973k388K3141k36j4263k2640j5877j0460
10230H075P40R102J5839N014k0022k7537o924N490J353N730Q144K23J7197J8968
10216D1392M612J8580J8206J7982q07n257n359j2704j054M146J3706o432r001
$$ y = [138189, 127908, 113579, 107593, 116722, 103896, 96130, 110897, 113226, 91774, 99723, 105492, 112863, 103380, 76036, 68340, 84145, 104291, 92794, 74371, 66547, 84226, 94256, 90667, 101719, 134680, 227524, 322700, 325875, 257423, 220919, 198047, 179695, 143740, 122077, 123926, 119525, 121576, 127166, 119591, 118374, 111725, 96782, 75358, 67643, 70535, 65952, 98180, 111597, 105670, 109859, 96399, 81238, 84221, 123563, 141557, 125396, 114586, 87889, 69713, 44496, 36917, 37522, 27203, 30598, 29849, 28341, 36843, 40825, 50798, 48410, 71551, 71315, 57052, 34412, 18535, 8075, 8815, 17917, 33756, 38770, 18748, -8789, -15713, -10223, -8870, -3140, 5004, 5227, 22424, 41392, 46004, 64584, 82790, 100772, 99965, 94708, 89349, 76645, 75591, 79737, 93443, 87011, 78010]
10203G8010j7654k5484j2184q374R377P351k090q296j2929J834L395L253M674
10190B0883P063J4413M644j0647j2093J157P542q557n687J0305k0588j1040N364
10177B759P447J1555J239J144j2910m957j913J0649J3069J425k694J019K61R870
10163C7963l139j1535N290o96M281R917m433n90N646j2312o444j7199l959L701
10149F491k805J0235m948N579m3m91p09n089p816J0434L002k956n685L186p001
10134A384k3278k686Q105K0074K2703J3217k0090k0723l220J4272M579k1043p457
10121a4163J0206N372P531r678P220K728m264J2713l391q919p840R340J4688k997
10107A8546k0742m689j897j3789Q988K9827K7204j517j1380p122J5323J0735L400
$$ y = [78010, 60356, 34872, 22688, 14314, 23691, 31042, 28952, 20656, 7727, 9561, 12956, 16209, 20883, 27946, 42359, 47003, 36356, 24263, 25420, 32962, 24405, 18718, 29023, 8435, -2605, 2759, 10206, 21761, 23000, 24144, 11234, 6277, 4364, 15013, 28082, 29507, 26813, 27832, 28093, 37963, 34824, 23289, 28579, 27883, 32164, 42081, 37648, 37058, 42704, 30392, 23948, 6749, 2790, 6491, 3686, 13921, 8973, 14552, 14509, 14018, 13309, 8220, 404, 10838, 13840, 10884, 5199, 8385, 1384, -21894, -24580, -16475, 3599, 26302, 39519, 19429, -1294, -4514, 9758, 14337, -6706, -14163, -3957, 1415, 8946, -732, 6488, 9216, 4952, 17665, 14274, 5355, -2485, 6855, 21543, 18546, -2196, -6885, -8782, -22571, -13583, 16244, 43448, 41931, 30551, 23429, 38752, 49487, 52887]
10094E2887j0485j1160q990p630J1457J0288l71j8280j8901O688j758P007J0670
10081B1422J8334J4533K5129K2229j0163k0684j4856J1879N0587L7593J5372j8981
10069A52394m4749l5583k3744j4116R575j788k659j605j243P150J9261K243l969
10056F1167m180Q63K0700K0592N7920J19304J42355Q5567j70275j60967p6592
10045I6454k3295j9298j7938r520p372q113q191J667J0250J207P911m662j8706
10032C94p190k070Q140R590o79R139K094j101J299L683R545n457j41O788J4245
10017D8279L350J1503O169Q72L020j2312r641n13p009n5J530J8503Q310J0526
10003H2532L9504J8802J7953J0663N0761P4062J57101K61340L83189M60750K48210
$$ y = [52887, 42402, 31242, 22252, 14622, 26079, 36367, 35996, 17716, -1185, 5503, 3745, 10752, 21422, 39756, 54289, 79418, 101647, 91484, 70800, 55944, 67823, 118410, 156003, 171375, 152394, 107645, 72062, 48318, 34202, 43777, 41989, 39330, 37725, 36482, 43632, 62893, 65136, 61167, 56987, 57850, 78550, 99142, 157062, 276366, 418721, 504288, 334013, 173046, 96454, 73159, 53861, 35923, 26403, 19031, 10918, 2727, 4394, 14644, 15851, 23762, 19100, 394, -6796, -8866, -726, 8864, 8185, 17324, 19418, 18317, 19616, 23299, 32844, 27387, 27246, 34034, 48279, 51629, 63132, 69301, 70173, 73193, 60881, 51240, 50727, 43718, 43663, 45193, 63696, 72006, 82532, 122036, 140838, 158791, 169454, 220215, 294277, 451378, 712718, 1095907, 1556657, 1804867]
9992A804867l48492n35188l34211j80839j18709p5702m5769k5871l1058l4465
9982G4563k1561j1343o689L027j4331m059L209o183l381J99K408m717Q088J4606
9968C3836k264l2768j2202R861K405K088p080j2063O988j604j0099m311J618P021
9954a8574M015J3494r7k91j3856M900K0085O009P446J1706N141O751o254j0665
9940B9810j3733m735N513q092q949o099k895r592L449J765l065r146k083O83N877
9925b1292P365J2012O844l087J1367K060j0258N173K073o608L453k98j175J639
9911I268L423o144j1171N848O40M922J0242R680m99j738j2011L797j0887j1725
9897f355J8312J6420q018O76j1870r211N004j81q13j4362m051N818n224l03M062
$$ y = [1804867, 1456375, 921187, 586976, 406137, 287428, 211726, 165957, 140086, 109028, 74563, 53002, 41659, 34970, 37997, 23666, 19607, 22816, 16633, 13252, 13451, 15859, 11142, 19230, 33836, 31572, -1196, -13398, -3537, -1132, 956, -6124, -18187, -11199, -12803, -22902, -27213, -25595, -18574, -14559, -1065, -1162, -1453, -15309, -10409, 9676, 15685, 23131, 34837, 39978, 46729, 40475, 29810, 16077, 11342, 16855, 8763, -186, -6285, -9180, -18772, -15323, -13558, -16623, -25769, -27852, -27169, -21292, -13927, -1915, 4929, 1842, 13209, 15269, 5011, 10184, 12257, 5649, 9102, 8804, 7629, 9268, 12691, 6547, -4624, 1224, 1864, 6786, 17028, 26708, 26209, 24471, 12460, 16257, 5370, -6355, 11957, 28377, 20359, 21035, 9165, -46, 4958, 4777, 3964, -10398, -14449, -8631, -13855, -14158, -10096]
9882a0096O638J4253m8k848J6452j844P305n823j200k459P77j0012j943m018R143
9867A4277n545l224N316n578m747l061J405J929P440j6131j6760r606M69J3407
9853b0409J2586n358J2096J3439p854K402k872n11Q830J852p797o607k682j1905
9839a4790j2953K021J0245o895k426J2346K309l979K559P501N808M069r316l192
9825f693J0047j691j262o273L59M851O380K451p32K203j3411M384L459J407p740
9810b261j2161n786l718p175O829Q105R073J2375R271J1610N970p149j8355k0207
9796a3579J878L772Q377K917j1479q822K71k01q367Q076L144n992q584O399Q40
9781b1350P871P333k275j1348j083L402R646L900q49q622j2916k925Q098K071
$$ y = [-10096, -3458, 10795, 10747, 7899, 24351, 22507, 29812, 23989, 22789, 20330, 21107, 11095, 9152, 5134, 14277, 8732, 5508, 10824, 5246, 499, -2562, -1157, 772, 8212, -7919, -24679, -34285, -33816, -20409, -7823, -13181, -1085, 12354, 4500, 6902, 4030, 3519, 12349, 14201, 6404, -203, -2885, -14790, -27743, -25722, -15477, -22372, -24798, -12452, -10143, -14122, -11563, -4062, 1746, 5815, -3501, -6693, 3354, 1663, 401, -5872, -5513, -662, 5718, 8169, 7437, 9640, -3771, 613, 4072, 5479, -2261, -14422, -20208, -23926, -31101, -24272, -16167, -7094, 5281, 14552, 26162, 32132, 24983, 6628, -13579, -11701, -7929, 448, 3365, -8114, -16936, -16665, -16866, -25233, -17157, -14013, -20005, -28589, -22190, -21350, -13479, -6146, -8421, -19769, -20852, -17450, -7804, -3904, -4753, -13375, -26291, -29216, -21118, -19047]
9767a9047o585m276Q68J1000J3219Q594m04l410O886O999m797j1966L85J555J853
9752H74K80L758r059p439n68o761L361J2721J2164L666K09j8323j0600K805M028
9737h884K625M598p1K685P963N236j8501j2424j817J1176J0580J0886L362m674
9723A2740j3357J4058q220j9450K0806K4124l061k8967j4201j1634L520J723J3478
9710h441M854J102J754o123l295l865Q788m706k25J4409J2j4484l840l211J1942
9695e329M875L03J413R947m239r054k068k532j1577J2116O173j0668m06R755J2896
9680A1605K542q596j4171k0208j0747J7120L705K059Q319J324o910l305L521J844
9666a1898J583K96k5023k01N563J0275K1659j0342j1181J7186j517L425J6969
$$ y = [-19047, -25632, -29908, -29040, -18040, -4821, 3773, 3369, -41, 6845, 13844, 9047, -2919, -2534, -979, 874, 1154, 4912, -4147, -11586, -12154, -18915, -15554, -2833, 9331, 12997, 13206, -5117, -15717, -12912, -8884, -6259, -1661, -1732, 953, 8916, 14152, -4349, -16773, -18590, -7414, 3166, 14052, 17414, 12740, -617, 13441, 5221, -14229, 6577, 30701, 27640, -1327, -15528, -27162, -23642, -21919, -8441, -3587, -2485, -731, -6854, -10149, -14014, -5226, -9932, -10157, 4252, 4264, -10220, -14060, -17271, -5329, -454, -151, 1262, 11209, 6970, -2084, -4152, -6684, -18261, -6145, 28, -10640, -11046, -1291, 11605, 14147, 5551, -8620, -28828, -39575, -22455, -18750, -16691, -8372, -7048, -13958, -17263, -13742, -11898, -10315, -10019, -35042, -35243, -29680, -19405, 2254, -8088, -19269, -2083, -3600, -175, 16794]
9653A6794R434k979m829j1960j9540l430J4629Q26j4537O42l158J3776N164p575
9639f743J0249j314m22n524J9663J3901n925k4017j9022P929R618m757J104l666
9625h926l003j2987M632J1768o294K924L304N479R336J3042l208j8917j0767N542
9611h075N625J7193N305J535L3o001j7298j369K517J5010o971j6769k5106O227
9597b8144K1474K0502N3j0787l526M618l886m208j1075q360n610P909J1261O790
9583b989J1264Q940K836p298N264l119j0304j2606J2446o908q346K670N466q645
9569a1329N051P670k262L859m331j2144m326r185Q926O42r228M040L0529J081
9555H993q946K223j0433p132j092K773J6067n591k5859j0237J6763O220n849R695
$$ y = [16794, 26228, 23249, 18420, 6460, -13080, -16510, -1881, -1055, -15592, -14950, -18108, -4332, 832, -6743, 3506, 2192, 1770, -3754, 15909, 29810, 23885, -132, -19154, -11225, -1607, -6364, -5260, -8926, -11929, -24916, -20284, -8516, -14810, -11886, -8582, -3103, 6233, 19275, 16067, -2850, -13617, -8075, -2450, 14743, 20048, 21583, 21616, 15615, -1683, -3052, -535, 14475, 7504, -9265, -34371, -28144, -6670, 13832, 13885, 3098, -428, 4190, 304, -3904, -14979, -23339, -28949, -21040, -9779, -2989, 8275, 17215, 20051, 12753, 18017, 14898, 4594, -8012, 4434, -2474, -10820, -8150, -2684, -11329, -6278, 1392, -870, 2989, -1342, -13486, -17812, -26997, -18071, -17429, -26657, -22617, 7912, 8993, 47, 2270, -8163, -15295, -16387, -13614, 2453, -3138, -28997, -39234, -22471, -16251, -22100, -12405]
9541a2405O719J2692m086j39M251q809k063q855j3063Q84J4928J2510q378P365
9527A551J1279L063M933j451j1384M063m648l496J295L506j1792k926P63R060
9513C816N16p863k0142O30j974J488P770l714K709Q546L877o504j4534m601O83
9498b9297P814m340R652J7881q934K28N111j0200N650J7164J1645j2946k4616
9485a5188O385K2300J221k024p887j4333Q573L976q35j3224q826J0576Q493k485
9471c278N132J4695k921l430j0973L100R471R175o426k2112j0383N014J126L116
9457h694M679O004J473L944j7618J328L597J2150j369K021q935p934k841m795
9443a6990J2822J1478j6565l05j546N232O220R015N835j8879j0985R355o806N181
$$ y = [-12405, -5686, 7006, 2920, 2781, 7032, -1777, -3840, -12695, -25758, -24874, -9946, 2564, -5814, 1551, 12830, 15893, 20826, 19375, 7991, 12054, 7406, 3910, 5205, 8711, -3081, -6007, -5244, 3816, 4332, -3531, -23673, -23043, -25017, -23529, -15759, -19473, -16764, -8218, -4341, -10845, -25379, -29980, -29297, -21483, -25823, -16171, 1710, -7224, -6996, -1885, -12085, -6435, 10729, 22374, 9428, -15188, -8803, 13497, 14718, 12694, 4807, -9526, -953, 3023, 2188, -11036, -19862, -9286, -793, -3278, 1854, 16549, 13628, 10198, -775, 2325, 11796, 20971, 14545, -7567, -17950, -12936, -11810, -8694, -4015, 1989, 3462, 7406, -10212, -8884, -5287, 6863, 5494, 7515, -1420, -9354, -12195, -16990, -4168, 7310, -9255, -9560, -11106, -5874, 346, 9361, 15196, -3683, -14668, -5313, -12119, -6938]
9429f938J515J1754N883k100K706J880p275j9338o043J3099j794j544J7817m146
9415E476j3465j6426m615j782J9610O237J1951M093J10j129k795r484k426P245
9401B600j628r273j027n08K31j25l504q977m812J1376K6321o912k6252K712K1250
9386A472J2001l195k565j864l581j2326K476k874L302M099n7r859j2513j041J2986
9371a3539p757l42J7565K5320m14k2147k385p928k3727J6291Q869p574j824R374
9357a0218J1400P923n180K552l283q690O277L184P28R930j329m360j5879j6424
9343b3369j020m745J1400K6894j5238k451J1509l398j188l9k0143j5534J4806
9330b2516O627J4610J317K514j1923k2464J1191K918O455l195L333J5992Q371
$$ y = [-6938, -5423, 6331, 12214, 10114, 12820, 14700, 7425, -11913, -17956, -4857, -6651, -8195, 9622, 5476, -7989, -24415, -29030, -30812, -11202, -4965, 6986, 11079, 11189, 10060, 7265, -2219, -4645, 2600, 972, -8301, -9328, -9836, -9605, -9730, -13234, -22211, -27023, -15647, 10674, 3762, -22490, -19778, 1472, 13473, 10278, 7713, 5849, 2268, -10058, -7582, -10456, -7154, -3055, -3112, -12971, -25484, -26525, -13539, -21296, -21638, -4073, 21247, 20833, -1314, -3699, -11627, -35354, -19063, -10194, -17768, -19592, -10218, 1182, 9105, 3925, 6477, 3194, -5496, 781, 3965, 4693, 14623, 13294, 8934, -6945, -23369, -24389, -29134, -17734, 9160, -6078, -8529, 2980, -418, -1606, -1645, -21788, -37322, -22516, -15889, -1279, 38, 2552, -9371, -31835, -20644, -17726, -11271, -14466, -11133, 4859, 13230]
9317A3230n833q269j8151O614Q151q62J3199Q585j1495M56J478o711J196J1793
9303A3381K199j4641p292M74l928J0518J1780O19j3683M823J0318k176n795j6270
9289i673J0917N004l841j3042k851o66O111p03J867J6454J853j5216p272n406
9275a6464O285j1322j274l161j666o020l324K014J6306J136K64K2589J0812m078
9261A2097q680k660L094j541j9774l57J858K527M888Q17o41L182j5504J2170J8601
9246A0077N335o453j0612K704j381j4629J1633J2126N354k490n174R16J2447J6194
9232C6047m654j5381r716R160l756r965O125N004j506J3157k712M927K444m8r109
9217B0017q583k91O904J711j0420O750p34p912o022J382J2980J5708q718j0234
$$ y = [13230, 7397, -872, -19023, -12409, -4258, -5120, 8079, 16664, 5169, 5625, 7103, 392, 1588, 13381, 15580, 939, -6353, -5879, -9807, 711, 12491, 13110, -573, 4250, 14568, 12392, 6597, -9673, 1244, 6248, 2407, -10635, -13486, -14152, -8041, -8744, -6877, 9577, 11430, -3786, -11058, -16464, -10179, -21501, -22775, -25936, -27602, -33622, -36946, -34932, -18626, -17490, -17226, 5363, 16175, 12097, 3417, 757, 3851, 2310, -17464, -17821, -15963, -13436, -8548, -7731, -8372, -5190, -20694, -8524, 10077, 15412, 8959, -1653, 1051, -330, -14959, -3326, 8800, 14154, 11664, 6490, 7406, 19853, 36047, 31393, 16012, 6296, 15456, 11700, 1735, 7860, 12864, 11358, 24515, 21803, 26730, 29174, 29126, 20017, 11434, 11143, 18047, 19758, 9338, 16088, 15354, 7442, 1420, 2802, 15782, 31490, 22772, 12538]
9203A2538Q500j0336m948O816l058m633J307N212j0420j7162J477L105q936J7036
9189c502Q385J308l659J41O282J4275M272M532L19k510j6447J3007J4099j462
9175C9040p993p400O655n733o843q855O767K3726j535j0482K0223M234K80N328
9161E7412M95J0996J4723J3216J5690L3399J7791J5034J601k141L7950K6420L0736
9148B73322M2831M2283P2669R8167J07268J39502K52152L80738O19835J079903
9138C108670J981920L420532M952902M396147k706608o216925l745430j880220
9130C310988j035689o39681m00012k64709k08341j41300j04795p5351n4973n7373
9120C28764m2940m8200k0809k0076l7233l0128j0311n529j0L158j0731r497m351
$$ y = [12538, 21038, 10702, 5754, 12570, 9512, 4879, 6186, 11398, 978, -16184, -14707, -11602, -20538, -3502, 4883, 6191, 2532, 2673, 8955, 23230, 27502, 32034, 32353, 29843, 13396, 26403, 40502, 39040, 31047, 23647, 30302, 24569, 17726, 8871, 15638, 39364, 37829, 27347, 47570, 51804, 52084, 57412, 57907, 68903, 83626, 96842, 112532, 145931, 163722, 178756, 180357, 178216, 216166, 242586, 273322, 316153, 358436, 431105, 529272, 636540, 776042, 1028194, 1408932, 2028767, 3108670, 5090590, 8511122, 13464024, 17860171, 15153563, 8936638, 5191208, 3310988, 2275299, 1635618, 1235606, 970897, 762556, 621256, 516461, 441110, 386137, 328764, 285824, 237624, 216815, 196739, 159506, 129378, 119067, 113538, 113528, 116686, 105955, 96458, 92107]
9107I2107r117j6306o465K688k901j644L595J5729j5547j6464n70J2467j833j8049
9093C7690K661K5J19L981J0919o406k654M327M819j9284N170J7339J613k4183
9079C6136k6653o617o939J0267l42j1766k971O15m458Q041J1831M881P904J6823
9065C6752L791k748K364L4Q236p271k9852j2842R722J1702R99j2560r548k026
9051c247J0482K2669j745n556k269k813J7177j604k3576K631J837j1948p833K111
9037c684J2808o369n246L500M442l979P066L263o615l016l961J1680p321j7008
9023a4440j389j721n97l28K349J3002K5036J579j4826n916R310k999L639O907
9009A9606r070j993J2105R731o245j137n42k27j8805n676r499m912J2880J4920
$$ y = [92107, 82990, 66684, 60219, 62907, 60006, 58362, 61957, 77686, 62139, 45675, 45105, 57572, 55739, 37690, 40351, 40376, 40495, 44476, 55395, 48989, 46335, 50662, 55481, 36197, 41367, 58706, 60319, 36136, 9483, 2866, -4073, 6194, 5852, -5914, -8885, -8270, -12728, -4687, 7144, 12025, 19929, 36752, 40543, 37795, 40159, 40193, 48429, 41158, 11306, -1536, 8186, 19888, 20887, 8327, -1221, -3247, 7235, 29904, 28159, 22603, 20334, 17521, 34698, 33094, 9518, 12149, 13986, 2038, -5795, -3684, 9124, 2755, -2491, 1009, 5451, 1472, 8538, 11801, 5186, 2170, -1791, 9889, 2568, -14440, -15829, -17550, -18147, -18475, -16126, -3124, 21912, 23491, 8665, 2749, 12059, 9060, 12699, 19606, 10536, 8543, 20648, 30379, 24134, 22997, 22455, 22228, 3423, -2253, -11752, -16664, -3784, 11136]
8995A1136J1721k4590p463J8838K4412J979j617R905J076J2996l634k9168j1602
8982A3989R880o662Q980P184j1488o345j0569k806O629N646j687o139l052n290
8968a730M401Q36J5623J9635k063n43r6r907j4011j813K2531M516j0356n570j3891
8953G562j3055k4353J8367N626K875N763r498p271m206P718m792l585O075L394
8939i380P660o524q427j2712N773J2784J7188L324m362O444q84n793l986j970
8925h65m660M766J2719K96j0214N070J6432O27P876j031j6723j2143p265k329
8911g444j820o538R797J4116K936j8752P861J2753r664j2101J927l776l747J8187
8897C735J672n782m756J3745J628k2131j4469J4823J7633L011q090j2567j018
$$ y = [11136, 22857, -1733, -9196, 9642, 34054, 36033, 34416, 44321, 45397, 58393, 54759, 25591, 13989, 23869, 17207, 26187, 33371, 21883, 15538, 4969, 2163, 8792, 14438, 12751, 6612, 3560, -1730, 2671, 3507, 19130, 38765, 36702, 36159, 36063, 26156, 12145, 10332, 32863, 37379, 27023, 21453, 7562, -5493, -29846, -11479, -5853, -2978, 2785, -6713, -13984, -18190, -10472, -15264, -18849, -12774, -9380, -1720, -8244, -16671, -29383, -23610, -10826, 6362, 9686, 5324, 11768, 10884, 5091, 1105, -865, -5525, -759, 11960, 12256, 2042, 7112, 23544, 24171, 32047, 31016, 14293, 2150, -5115, -7444, -9264, -15802, -6005, 8111, 11047, -7705, 156, 12909, 3245, -8856, -6929, -10705, -14452, 3735, 5407, -375, -5131, 8614, 10242, -11889, -26358, -11535, 6098, 9109, 1019, -11548, -12566]
8884a2566K052J857j470N565J2865P360J876q130o239m085O257K2878K129J33
8870C0482l963p229j695L645M376j1990k5754q31j2696k564K85L247N847n01J0678
8855h663O412j1298n242J079Q3L340m538j769k649P822N104O669j298L856J2333
8840A1241Q735m866K030j3781j76M738J522R299k84j6835m220N823r710p013K34
8825a3263p60k903o98M564j6229q591J2827J2860O457K833j0999j015p420r922
8811c2259P825J2030K3337j0410j4355o489R557J0573Q065O785Q855m918N907
8798B4503N457P664j693p525j3863j5654k527j701j410j3280p530n344K635J0296
8784a9972J0460J3465j0221R570L304P46N709k258K847R07o585r350j3434m551
$$ y = [-12566, -10514, -8657, -10127, -4562, 8303, 15663, 17539, 9409, 3170, -915, 5342, 28220, 30349, 30482, 26519, 19290, 17595, 21240, 25616, 13626, -12128, -12959, -25655, -28219, -27934, -24687, -18840, -19341, -8663, -2251, -13549, -18791, -17712, -17629, -14289, -18827, -20596, -23245, -15423, -10319, -3650, -4948, -1092, 11241, 19976, 15110, 17140, 3359, 3183, 7921, 9443, 18742, 18458, 1623, -2597, 3226, -6484, -13497, -13263, -14023, -16926, -17624, -13060, -29289, -37880, -25053, -12193, -5736, -2903, -13902, -14917, -22337, -32259, -24434, -12404, 10933, 523, -13832, -20321, -10764, -191, 7874, 14659, 23514, 18596, 24503, 29960, 37624, 35931, 28406, 14543, -1111, -3638, -5339, -6749, -20029, -27559, -32903, -30268, -19972, -9512, 3953, -6268, 3302, 6606, 7352, 13061, 10803, 13650, 14557, 7972, -1378, -14812, -19363]
8770a9363j2299j557Q897P980l567J6685k68k4480m365K0745J1637M753n599N243
8756D442J491J3961o391k819O289K14J3168M101J384q860j0956p301k343L380
8742I760l071N12j2415m687J814J5697N414p495n902R566J1515O717j5763k5469
8728a3807p02l918K891K9397J6798j0915j1540m174o939n097P246L488m312k610
8714d194J4382J5142N591n640q123j0228J864R588P445j674j4215J7887j0130
8701A7695k870J4991J1925J1554q212j7918l106o303J0486j3668r199P139J6801
8688B9315j402l678n739J975R570n702j112O585M772q749j456o833K911R609O03
8673C0669k444j4110j2697M179j0049j1844q374J9317L55Q593j239L921J6174
$$ y = [-19363, -31662, -33219, -24322, -16342, -19909, -3224, -3492, -27972, -32337, -11592, 45, 4798, -801, 4442, 5933, 19894, 13503, 10684, 16973, 17187, 30355, 34456, 35840, 26980, 16024, 8723, 6380, 9760, 6689, 7201, -5214, -9901, -8087, 7610, 13024, 5529, -373, 9193, 20708, 27425, 11662, -13807, -14509, -18427, -15536, 13861, 30659, 19744, 8204, 4030, -2909, -8006, -760, 2728, -1584, -4194, 10188, 25330, 30921, 25281, 17158, 6930, 8794, 18382, 25827, 24153, 9938, 27825, 17695, 14825, 29816, 41741, 53295, 45083, 27165, 24059, 17756, 28242, 14574, 5375, 12514, 29315, 27913, 24235, 18496, 20471, 30041, 24339, 23227, 29812, 34584, 25835, 24379, 17546, 20457, 30066, 30669, 28225, 14115, 1418, 5597, -4452, -16296, -24670, -5353, -4998, 3595, 2356, 6277, 22451]
8660B2451J2556j186l501k176l747O472m540J830Q167J8997K889k567l586j750
8646E0309j4303J7379J0169n959J0356m189K009R363p367j6636q930m579K320
8633C9942J4455J1893p241J435N163k448O796J8944k49P611J7458o421o765l194
8619I7379K0244n61q833R178J1300m354j1239J046k995J9341M623j2907j7193
8606A05029j1522j235n993K618j3111n479Q420l75r895n498o536J534J5899l279
8592G0577q783j6242j1291p641l123N808R507R494r933k2443L654O938J3559J0264
8578E0345N979r647j4936k2793o272R573j5828m985L830k025m96k790j919K204
8564i760n951l785K3144J772r858L63j85J0406j3189m68J5869Q121P106n299P540
$$ y = [22451, 35007, 33821, 30320, 28144, 24397, 30869, 26329, 28159, 36326, 55323, 58212, 55645, 52059, 50309, 36006, 53385, 63554, 57595, 67951, 63762, 65771, 75134, 67767, 51131, 42201, 37622, 39942, 54397, 66290, 59049, 60484, 65647, 63199, 69995, 88939, 88690, 96301, 113759, 107338, 100573, 97379, 117623, 117062, 108229, 117407, 128707, 124353, 113114, 114160, 111165, 130506, 135129, 122222, 105029, 93507, 92272, 86279, 88897, 75786, 70307, 78727, 78352, 68457, 62959, 56423, 57957, 73856, 70577, 61794, 45552, 34261, 26620, 23497, 29305, 38812, 48306, 38373, 15930, 19584, 26522, 40081, 50345, 56324, 46677, 31741, 8948, 2676, 12249, -3579, -8564, -4734, -6759, -7255, -10045, -11964, -9760, -15711, -19496, 3648, 5420, -4438, -4075, -4260, 6146, -7043, -7511, 8358, 16479, 23585, 18286, 25826]
8549B5826K3933n145r109j2934o575p709j647J924j2934K291J171O382O309p567
8535D216o835k790J5337J3847J032r366m626j5528K581l51j4001R43M174n98Q462
8520c503L345R218J2490m104j1555j5604k7550J521J1712N882J2480M242J7027
8507A5601N203R548n253K182r482j4540o923k656R741O268j0703n424K053J2577
8493H192j1540p728M661l423m228J2329J6843M97n920O01m276m133M268j443L61
8478E061J6654J0362j264m395j1552j0957j322J630R728L496j785q527m388m782
8464b041j2117l779K5481J1270r466j420J6515J3047j1014n708q398j2296Q944
8451I018J7174l06n229k5260j940L602o982P158J1796l134L091m634J8355N397
$$ y = [25826, 49759, 44614, 35505, 22571, 15996, 8287, 6640, 8564, -4370, -2079, -908, 5474, 11783, 4216, -2619, -5409, 9928, 23775, 24807, 15441, 10815, -4713, -2132, -2483, -16484, -15541, -11367, -11965, -3503, -158, 9060, 21550, 17446, 5891, -9713, -37263, -35742, -24030, -18148, -5668, -1426, 15601, 20804, 30352, 25099, 27281, 17799, 3259, -3664, -6320, 3421, 9689, -1014, -6438, -4385, 8192, -3348, -11076, -6415, -9838, -14066, -1737, 15106, 15603, 9683, 10284, 6008, 1875, 6143, 4700, 5061, 21715, 32077, 30813, 26418, 14866, 3909, 2587, 4217, 13945, 17441, 15656, 7129, 2741, -2041, -14158, -17937, 7544, 18814, 9348, 7928, 24443, 37490, 26476, 20768, 12370, 74, 9018, 26192, 25886, 20657, -4603, -6543, -2941, -9923, -2765, 9031, 5897, 8988, 4354, 22709, 28106]
8437B8106j007Q403l65j9185p261p07r26J1012k800r575k337j2885L269J2030
8423E772N087K424p047j125J6054k85K887k164n566l646K919L320j7674j7790
8409a6834J549o390m066M962J613N988K1616k373j8086L65J8398P251Q793J997
8395B4783p800O217n238r943p462L977N614K31N72M572O934M241l395l500O52
8380B0455p490j0443k151n828Q201J7374r362k0200J7693K031r246n128N554Q818
8366A0278o12Q31J813N21j3913k3433j284P837K491K0202J8461p854j4788N380
8352E930K2540L12j6109j3447j0673K510J6030K1215r050J178k018p292K329O766
8338B0221l328j744r518l097J5584M226n438r002M695k203m866r689l870j041
$$ y = [28106, 27099, 35502, 35137, 15952, 8691, 7984, 7058, 18070, 15270, 5695, 3358, -9527, -6258, 5772, 10859, 13283, 6236, 5111, 21165, 20880, 23767, 21603, 16037, 12391, 15310, 18630, 956, -16834, -15285, -21675, -25741, -20779, -19166, -13178, 8438, 6065, -12021, -11656, 6742, 13993, 22786, 24783, 16983, 23200, 17962, 8019, 557, 4534, 10148, 10379, 10951, 15523, 22457, 26698, 23303, 19803, 20455, 12965, 2522, 371, -5457, 2744, 20118, 10756, -9444, 8249, 10280, 1034, -4094, 1460, 10278, 9666, 10497, 12310, 12831, -1082, -24515, -25799, -17962, -15471, 4731, 23192, 15338, 550, 5930, 28470, 28782, 12673, -774, -11447, -8937, 7093, 28308, 19258, 20436, 18418, 11126, 13455, 20221, 16893, 15149, 5631, 2534, 18118, 22344, 16906, 7904, 12599, 10396, 5530, -4159, -8029, -9070]
8324i070q198k944j832L70p56J6378Q151K99L702j965n58o070O268o26j2052J4047
8308E144K2088o313q981m452N460N394l931P437j2694j4229j705k819J4930J8975
8294B4304Q777M965j0524J339k0892n146J4866r608N923p353j016J044J0330j5363
8280A646j4418M893K150l040J192j483j258J1147J6306M913j0687j364q710M573
8266E860L924M11N792P298p993k3568p384J0773M857q497m411j1037M417K014
8252a7544n12q938N104K1660o767p35J0508Q567K328k0399n510M09j048j2030
8238b4907Q405J4313O586n102p250L977P838q020k3111J3153K3142j1142j432
8225c550J2397R839J0853o66n839O321j2767R13n217J3779k739J0357j1019k7623
$$ y = [-9070, -17268, -20212, -22044, -21674, -22430, -6052, 2099, 2398, 6100, 4135, 3577, -2493, 3775, 3149, -8903, 5144, 27232, 20919, 11938, 7486, 12946, 18340, 14409, 21846, 9152, -5077, -6782, -9601, 5329, 24304, 33081, 38046, 27522, 28861, 7969, 2823, 17689, 8081, 14004, 6651, 5635, 6679, 17009, 1646, -12772, -7879, -5729, -8769, -7577, -9060, -10318, 829, 17135, 22048, 11361, 9997, 1287, 5860, 9784, 10195, 15987, 23285, 15292, -8276, -15660, -4887, -30, -8527, -12938, -23975, -19558, -17544, -18056, -26994, -21890, -230, -6997, -7732, 2776, 11343, 13671, -6728, -12238, -11829, -12877, -24907, -16502, -2189, 4397, -705, -7955, -3978, 3860, -4160, -27271, -14118, 9024, -2118, -3550, 8847, 18686, 29539, 28873, 23034, 29355, 16588, 17501, 12284, 26063, 23324, 33681, 22662, -4961]
8211d961l640M606n52k396o234J1522j0507J136N487P399R528j3120l917l269
8197h918m596q526m37J586P33M079J9524n907j2317K4730l427l60J3532j5626
8183D070j7021q244J2215j402M283k790J5725K030o605k582k862j464J6603K731
8169A4687j8243L826O21J4399J3385q002Q221J449j8390o406l316P90J1689o875
8155G835J3901K754j7354j595r401N01J4815O382L12P286p463j8040j0695M02
8141a0360r122L475J1949j4426l162L028J4541J110N851k97Q123J968k0323j0284
8127a7929q218J7800J0566j676J747Q091o169j1299J439Q389J2945n368j5722
8114e404J477j885K635k493j0562q007J9661L622q970K0608K0631j3797j0015
$$ y = [-4961, -8601, -3995, -4547, -6943, -13177, -1655, -12162, -11026, -5539, 1860, 11388, -1732, -5649, -8918, -13514, -22040, -22477, -20891, -20158, -16079, 3445, -2462, -14779, 9951, 6524, 6164, 19696, 4070, -12951, -21195, -8980, -10382, -6099, -8889, 6836, 8866, 2261, -321, -3183, -4647, 11956, 14687, -3556, 270, 891, 15290, 28675, 20673, 28894, 30343, 11953, 5547, 2231, 3021, 14710, 7835, 21736, 24490, 7136, 5541, -3860, -3359, 11456, 17838, 18150, 25436, 17973, -67, -10762, -10360, -19482, -16007, -4058, -18484, -21646, -18618, -4077, -2967, 2884, 2587, 10710, 12678, -7645, -17929, -26147, -8347, 2219, 543, 2290, 10381, 4212, -7087, -5648, 2741, 15686, 10318, -5404, -3927, -5812, -3177, -5670, -16232, -24239, -4578, -956, -9926, 10682, 31313, 17516, 7501]
8101G501J781k1048J862R534m351M376J8920k536k3453j2245J1084m4p006J147
8087a4478O879N105J8603R814J924J471q849k2725L660J405n689R008J3178p9
8073A9227j829N054K051K394L932r893p642j182K551J1144L210K026o470q115
8059A6458J5665o32j0846r438k469P699L09M500J1165K01n989R477J0116J314
8045D7530n336K415J0075L309P716N694j0671K112p914l00L243n094n483P340
8031E4636M715j1540m206l210j221K5783K981p892j0125l859J2081p614Q603N015
8017F4147N36J4100O346k523J7651K6250R344J2793L2178K1753J2921r415l2943
8004A73138l2909l0887j4378J8508J6306L3361K8379K6536N1670N2972R575m9822
$$ y = [7501, 9282, -11766, -9904, -370, -4721, -345, 18575, 16039, -7414, -19659, -8575, -8619, -15625, -14478, -7599, -2494, 16109, 25923, 27847, 29318, 20469, -2256, 1404, 2809, -2880, 6128, 19306, 19227, 17398, 22452, 24503, 26897, 30829, 20936, 13294, 12112, 14663, 25807, 29017, 31043, 24573, 16458, 32123, 31491, 20645, 11207, 8738, 16437, 16746, 21246, 32411, 32612, 26623, 36100, 46216, 47530, 42194, 44609, 54684, 57993, 65709, 71403, 60732, 62844, 54930, 54630, 57873, 52779, 47296, 54636, 59351, 47811, 43605, 40395, 39174, 64957, 67938, 60046, 49921, 46062, 58143, 50529, 59132, 64147, 64683, 78783, 85129, 82606, 100257, 126507, 135851, 148644, 180822, 202575, 215496, 206081, 173138, 140229, 109342, 94964, 113472, 129778, 163139, 191518, 218054, 269724, 322696, 332271, 282449]
7992B82449q2242o2465l4311j6917j8695j3403M852m593n110J2038P132m594p506
7979E6635l011O366K1146J0184l338m33n245j0455q572L128J5322K4878K2738
7966A29343L3522L0151K4193K5523J3434R988K344o465j8709k7375Q825K8886
7954B53660L8571L7013k7061m8736n3478l6732l3449l5560k6744m607k878j400
7942E8599J715k681o225r064k181P945j4929j2432L981O444P80L16k522K370J826
7927C3942L944N223O202J8000O754J9399K2125q051j2707J386j2037j2829j3710
7914E7641j080p141L410Q029o921j1490o368R788j982j774j9317q150J5698N307
7900C5650M381q706K878j623k6705j5694o995m473O449p014J0627J1245J0149
$$ y = [282449, 200207, 137742, 103431, 86514, 67819, 54416, 59268, 54675, 49565, 61603, 68735, 64141, 56635, 53624, 59990, 81136, 91320, 87982, 87549, 82304, 71849, 63277, 66405, 81727, 106605, 129343, 162865, 193016, 217209, 242732, 256166, 266154, 268498, 262033, 243324, 215949, 224774, 253660, 292231, 329244, 302183, 253447, 199969, 163237, 129788, 94228, 67484, 62877, 59999, 58599, 60314, 57633, 51408, 42344, 40163, 48108, 33179, 20747, 24728, 31172, 31952, 32268, 29746, 32116, 33942, 37886, 43109, 49311, 67311, 74065, 93464, 115589, 107538, 94831, 96217, 84180, 71351, 57641, 56561, 49420, 52830, 60859, 53938, 42448, 36080, 45868, 43886, 42112, 22795, 14645, 30343, 35650, 40031, 31325, 34203, 32580, 5875, -9819, -16814, -21287, -14838, -21852, -11225, 20, 10169]
7887A0169j1133n801p679o907M965L36P732m383j3336M339J0018K3942K444J380
7873A6086p538j6211r641o090j3938M763J9521K042l2O246Q528M360J2677Q184
7859B8957j1449j6423j571L33J7930R65j7709r583q682J803O91J6159m894K730
7845g43O201K10Q934m89r298P200j680k945o309j0772J1542M984r839L143M726
7830D865j1460L04M100o79n136k65J5851J412p032n608J6635J1813j0912l747
7816A0141j7655k3611j2519J0240K1587m994j6091q681R96m436K1211P5j3208
7803c6945n404n787J4052k143J1442P891J0098M194m59q920j669K854n290o834
7789b2920K152P545j244O35R675K887J3886O558q388n929m990n575o203J5119
$$ y = [10169, -964, -6765, -14444, -21351, -16386, -16050, -8318, -12701, -26037, -21698, -11680, 12262, 14706, 16086, 8548, -7663, -17304, -23394, -37332, -32569, -13048, -11006, -11038, -4792, 3736, 8096, 20773, 28957, 17508, 1085, -486, -153, 17777, 18742, 1033, -8550, -17232, -15429, -14738, 1421, -3473, -743, 5458, 5668, 14602, 14113, 4815, 12015, 10335, 7390, 1081, -9691, 1851, 6835, -3004, 139, 4865, -6595, -6291, -2191, -2870, -8006, -8271, 7580, 8992, 1960, -3648, 12987, 24800, 13888, 10141, -7514, -31125, -43644, -33404, -11817, -16811, -32902, -41583, -40587, -45023, -23812, -23737, -36945, -42349, -48136, -34084, -36227, -24785, -16894, -6796, -2602, -3061, -11981, -13650, -10796, -16086, -22920, -20768, -13223, -14467, -13832, -4157, -1270, 12616, 19174, 10786, 4857, -133, -5708, -11911, 3208]
7775C208Q168l158Q50K746N133n080j320n049P163q827j6757r596J9512K560j1738
7760a2185J1075J5465O90r721p842r315j71k527j0518L075P881J4058l279k0236
7746b3550o353k326j0502o104m09M346J4568J2895J9983m650k5530O491k56N658
7732a5739J837o351l014N913N470j724J2109l819qK1675M657q195j5116j0556
7718a2861o16J3789n413n47N659Q851J4722k8698k0400p558J341R307K3257k180
7704a347j3520j2850L172M024M585n327P958N972J0059o112j1621J773R308L480
7690d46l62j5407o354J607K881j3123q05K0863l03k664q299P038K410n00Q968
7675d496L573m196n043r533Q680j0761J4512J0464j9803r508l910R57n090J0684
$$ y = [3208, 11376, 8218, 9068, 11814, 16947, 11867, 10547, 5498, 12661, 3834, -12923, -22519, -3007, -447, -12185, -1110, 14355, 15045, 5324, -2518, -11833, -12004, -14531, -25049, -21974, -14093, -35, -3314, -23550, -29903, -32229, -42731, -48835, -49244, -44898, -30330, -17435, 2548, -2102, -27632, -21141, -21397, -15739, -13902, -20253, -23267, -17354, -11884, -13608, -1499, -5318, -5326, 16349, 21006, 12811, -2305, -12861, -13477, 312, -5101, -5648, 11, 8862, 23584, -5114, -25514, -33072, -31731, -22424, 833, -1347, -14867, -27717, -24545, -20521, -15936, -21263, -13305, -7333, 2726, -3386, -15007, -13234, -3926, -446, -808, -16215, -22569, -20962, -18081, -31204, -32009, -11146, -11449, -14113, -22412, -15374, -12964, -13464, -4496, -923, -5119, -10162, -19695, -11015, -21776, -7264, 3200, -16603, -26111, -30021, -29064, -34154, -23470]
7661b3470R486j5817J3462M274j1406L438j117j154O380L154L351J0537j765n595
7647f242r727n361n560O279K882m68N84p03j9484l49K0360Q176j129k104p442
7632b0288n454J3989J5132j0603k0248N742O09l216m435J982j5056J7193J0476
7619a4177q595M142k568J15K779M846J0576r813R542K9129l483n988j0924q252
7605b671j0609k646R145J1052M547k645J971k615J4M269K667j3885N512k098J417
7590C425n86K603o192n010j1870L76K0022N206l040q279j3918k0768l214o12Q013
7575c3844J3455j2918P55J1335Q39R478M532r341p567l794Q800K209J0481Q749
7561C169O429n893J41j0495p869J0351N892j3514R36p909j8414m288M221K0553
$$ y = [-23470, -13984, -29801, -16339, -12065, -23471, -20033, -21150, -22304, -15924, -12770, -9419, 1118, -647, -6242, -15969, -21330, -26890, -20611, -17729, -18197, -17613, -18316, -37800, -38149, -17789, -9613, -10742, -12846, -20288, -25742, -11753, 3379, -7224, -27472, -21730, -21121, -24337, -28772, -26790, -41846, -24653, -14177, -22772, -18630, -21198, -21083, -18304, -13458, -2882, -12695, -3153, 25976, 22493, 16505, 5581, -2671, -13280, -15926, -6781, 4271, 8818, 6173, 8144, 5529, 5543, 9812, 12479, -1406, 4106, 2008, 3425, 2839, 5442, -750, -5760, -17630, -17254, 2768, 7974, 4934, -3345, -17263, -38031, -41245, -41857, -33844, -20389, -33307, -32552, -21217, -20378, -10900, -6368, -15709, -23276, -27070, -18270, -16061, -5580, 3169, 9598, 3705, 3846, -6649, -14518, -4167, 1725, -11789, -10853, -18762, -37176, -41464, -37243, -16690]
7547a6690j460p897O064M233M252N570k117R329r168m609M658J5121J3885J313
7533B2484p047j0581k1832p979K830l931k438J3005J0823P244R48q263o866L277
7519h326n17j2835m063o322R029j16K56N04k946k500k321P082J6225J188J463
7504d199O407J1510q037j604N842j3873j0839n198J1621N420j6670p700K1470
7491e850O998r499L348J6207L701q105j640m499M957M120j2953L526Q602n806
7477C107R143q101j9748n295Q911M724k134J4459J794j2676j173J516n870j4288
7463b5631R720J7692J6851M73k2440r701k048J1117r084o305R144O017J4661q059
7449B407m297J608L576J0358J1345J009M902P73j9074p99l65p1m727j9634o774
$$ y = [-16690, -18150, -26047, -19983, -15750, -11498, -5928, -8045, 1284, -7884, -12493, -7835, 7286, 21171, 22484, 15437, 4856, -16976, -24955, -22125, -26056, -28494, -15489, -4666, 2578, 3526, -4737, -11603, -8326, -8843, -21678, -25741, -32063, -23034, -23150, -22894, -22390, -25336, -27836, -30157, -23075, -6850, -5662, -4199, 2208, 13718, 5681, 4077, 9919, -3954, -14793, -19991, -8370, -2950, -19620, -27320, -5850, 1148, -8351, -5003, 11204, 14905, 6800, 5160, 661, 5618, 9738, -3215, 311, 8913, 3107, 12250, 4149, -15599, -20894, -11983, -7259, -9393, 5066, 6860, -5816, -6989, -5473, -11343, -25631, -15911, 1781, 18632, 19105, -3335, -13036, -15084, -3967, -13051, -19356, -10212, -4195, 10466, 2407, -1890, -282, 3294, 13652, 24997, 26006, 30908, 31681, 12607, 11808, 11443, 11372, 6645, -12989, -19763]
7434a9763R851m629j1682Q333J5165P807j1034j8669K737J8064o972N520J0074
7421D802m680j985N613m627m159l271M789J7220p060r846p852k080P913p359M967
7406g615K252J3809K145m471j880p600Q819o4l949o684j630J2269l374j0620m637
7391a3230m66J377J828J0951l732q954K93J6969J7525J0894r238m431l688o531
7377I567k0638q924J1056J3415k159J347J275L377Q026j0337o342o893n759l883
7363a6872J0490J0126j5219q180J6645J2588j2795q845J0457l253o61p195L5m136
7349a6815l91R240l265o517q120k563N042j1083J3883J6175J2841L824l501L730
7335A2480j935j0674k692P630O362J0466j437q693k3752k0189k982J7788J1044
$$ y = [-19763, -9912, -14541, -26223, -17890, -2725, 5082, -5952, -24621, -21884, -3820, -10792, -5272, 4802, 122, -1863, 3750, -877, -5036, -8307, -3518, 13702, 6642, -3204, -11056, -13136, -5223, -12582, -7615, -5363, 8446, 10591, 6120, 4240, -3360, 5459, 5395, 1446, -5238, -6868, 5401, 2027, -8593, -13230, -13696, -12319, -10491, 460, -3272, -12226, -11933, 5036, 22561, 33455, 24217, 19786, 16098, 9567, -11071, -19995, -8939, 4476, 2317, 3664, 4939, 8316, 16342, 6005, -337, -7230, -12989, -16872, -6382, 3744, -11475, -19655, -3010, 9578, -3217, -12062, -1605, -4858, -5519, -12714, -12679, -16815, -17206, -7966, -11231, -17748, -25868, -28431, -23389, -34472, -20589, -4414, 8427, 12251, 8750, 12480, 10545, -129, -2821, 4809, 11171, 21637, 20200, 11507, -12245, -32434, -35416, -17628, -6584]
7322f584J5500Q7o351J660r701j3157k079N081J2024K88q49L680Q885L15j0736
7307a937q453J4304j0818L25j631j5713l907N823N082M074J5138K54K28n401p596
7292a0228p459j0051J0429J5358Q26j9887l12K7324J1677q342j3376N426J0770
7279A2155q414N600J1938o763q056J001l492O741J4248R8q609j2963p243j509
7265e268M275q97R995J598p323m781r393p943Q902L755q212r109k704Q216O74
7250a8215J3067J352Q579l803r15l109P249K243j769R052l165j0270J723L737
7236E756L409r93p43k245r808k872m807M950p054K429L815J3168J7127l555j320
7221A7257p210N037n356j0402j6130Q363J6634K806o406j3681J35n095K169J2868
$$ y = [-6584, 8916, 9003, 2652, 4312, -5389, -18546, -20625, -15544, -3520, -3232, -4081, -401, 8484, 8799, -1937, -10390, 3914, -6904, -6579, -8210, -23923, -27830, -22007, -16925, -12851, 2287, 2541, 2769, -2632, -10228, -17687, -27738, -17309, -1951, -1125, -21012, -21324, 6000, 17677, 9335, -4041, 1385, 12155, 3741, 9341, 21279, 14516, 6460, 7461, 3969, 10710, 24958, 25056, 16447, 3484, -3759, -5268, -993, -1890, 8105, 9703, 2380, -2401, -11794, -19737, -10835, -7080, -15292, -24401, -27105, -18889, -18215, -5148, -3796, 4783, 980, 65, -3044, 4205, 6448, 4679, 13731, 10566, 296, 2019, 5756, 9165, 8172, 7429, 5184, -4624, -7496, -12303, -7353, -14407, -11978, -8163, 5005, 22132, 18577, 17257, 10047, 15084, 9728, -674, -16804, -8441, 8193, 10999, 4593, -9088, -8953, -14048, -11879, 989]
7207I89o450P198L013m01J3051m039n305L258J086l313k0322o662o756j4749N300
7192c4102Q826J0783J4898k029l092p502q045n152j1428q11M371J6430n757q588
7178c1198j3587o220J2941P30O711K326q920R676J3453J1313J263m704P8j0473
7164a6611J6304K54K0741L5219J4313l1837l3124j5791N052J2734N3j9793j7793
7151c0279l939O613J1656P979J6791Q316r574P462m923m830p032j3164j398J8575
7137B253O034l87j1347j5219M549J5776J614L886q32K342O96j7031m579o132O854
7122a1523q39J227j0514l85Q908J7387J7160Q654p124m11k803j2456k1315j0060
7108b4094J154J5488M651m376n247k108j8126n142p546J160K154J681J7894J7639
$$ y = [989, -5461, 1737, 4750, 4349, 17400, 13361, 8056, 11314, 12400, 9087, -11235, -17897, -24653, -39402, -34102, -25276, -14493, 405, -1624, -4716, -12218, -20263, -25415, -36843, -37654, -33283, -16853, -22610, -31198, -44785, -51005, -38064, -37334, -30623, -28297, -37217, -27541, -14088, -2775, -1512, -6216, -6138, -16611, -307, -53, 20688, 55907, 70220, 38383, 5259, -10532, -5480, 7254, 7307, -12486, -30279, -34218, -27605, -15949, -7970, 8821, 17137, 7563, 15025, 10102, 5272, -1760, -14924, -16322, 2253, 8287, 7900, -3447, -18666, -14117, 1659, 3273, 7159, 6327, 8669, 9365, -7666, -12245, -18377, -11523, -12362, -11135, -21649, -22034, -13126, 4261, 21421, 30075, 22951, 22540, 19737, 7281, -14034, -24094, -22940, -7452, -2801, -7177, -12424, -14532, -32658, -37800, -45346, -44186, -42032, -40351, -22457, -4818]
7094d818J217l223R13N720j146J961L089K429r327p411K350R025Q20j1954o275
7079a6630l489N687O696l480O959O195K0869K030m435j467l182l915j393j115
7065I330p234j0028N301R02o266L049j2910k81l147o277o437J1086J2255j9616
7051c0273M683R576O00j843J0032J2242l022p943K425o396n657o33j2439n345
7037c3993J6355J5003P613r083m981J5442n434r636j704O93J1972K3366L815k8249
7023A179j2157J99K706N32j3853p813n569J0469J1310N282J268J0777m967j089
7009a726J3288j825p303l795Q181o302j5233p103Q651J3074l910o363Q889N519
6995D042m305M484j0240r134K0568p44l043k5361j5928J2274M857J020k078r047
$$ y = [-4818, -3601, -6824, -5911, -191, -1337, 624, 3713, 6142, -3185, -10596, -8246, 779, 1599, -10355, -16630, -20119, -14432, -7736, -11216, -4257, 1938, 22807, 24837, 20402, 18935, 15753, 11838, 10445, 9330, 2096, -7932, -2631, -1729, -7995, -4946, -17856, -18137, -21284, -27561, -33998, -22912, -10657, -30273, -25590, -16014, -15414, -17257, -7225, 5017, 1995, -5948, -3523, -9919, -15576, -16209, -28648, -33993, -17638, -2635, 4978, -4105, -9086, 6356, 922, -8714, -10418, -9725, 2247, 25613, 29428, 1179, -10978, -10779, -8073, -7541, -21394, -29207, -34776, -24307, -12997, -7715, -6447, 4330, -637, -1726, 11562, 9737, 2434, -1361, 6820, 518, -14715, -21818, -13167, -93, -4003, -10366, -1477, 4042, -263, 4221, -6019, -15153, 5415, 4671, 1628, -23733, -39661, -27387, -22530, -21510, -23588, -32635]
6981c2635L16J4554K8138N551N123k602n981o167j1899m623p96K238N874j3422
6967a6331j1658k264J3181Q747k337n58K386k953k267J1075p813j4567o17O536
6953a9440K186R503J398p945o176K465P328Q869R063R02j1994Q469O994q015o569
6938b962m831n784N692M047K3335q739q979J059k696L331k316M003k970R933j0225
6923A898j2956p093q797j586J1047k011r281n771L628j097J5879O643R732J3468
6909A3703r966j7972O38J4139P11j5728P911K4357r474q384p549Q997q312m689
6895a1618J0983J303P89J1815J2184r29k3095j5488n285O641R360o91q88M579
6881c40N202n529j4357p43l11j309O735N384l823j4345j5676J5495J5444m311
$$ y = [-32635, -32319, -17765, 10373, 15924, 21047, 18445, 12464, 6297, -5602, -10225, -11021, -8783, -2909, -16331, -27989, -30253, -17072, -8325, -10662, -11220, -8834, -11787, -14054, -2979, -10792, -25359, -25976, -19440, -17254, -7751, -6353, -14298, -20474, -18009, -10681, -1812, 7251, 8153, -3841, 4628, 11622, 3607, -2962, -7793, -13577, -7885, -3838, 19497, 10758, 1779, 2838, 142, 3473, 1157, 5160, 2190, 12123, 1898, -11058, -18151, -26948, -28534, -17487, -19498, -28779, -34550, -30922, -32019, -16140, -9497, 235, 13703, 3737, -14235, -13597, 542, 1253, -14475, -6564, 17793, 8319, -65, -7614, 1383, -6929, -11618, -635, 668, 1457, 13272, 25456, 24527, 1432, -14056, -19341, -12700, -3340, -4031, -4919, -340, 4862, -667, -15024, -15767, -16078, -17387, -10652, -5268, -9091, -23436, -39112, -23617, -8173, -12484]
6867a2484k165P929L063R123N903J3968o270k1612K482M982k619L00N669J1031
6853A9300j1536o972j0305j2248P319J2427J754L854r64K765j6412p006J4545
6840c479J2321o60j088j0647q647k111O695R987J4562l703k704r680k7903n999
6826c3056K8903J9518q423n323m408K543j5038l16k245j543J3264n892j0847K246
6812b0617N132J230N886p673m8j0695L460K1914P976k140N498P003q751l575j6119
6797a1519j7419m830J0164O710k348R049J1393K104j560P202r208q392j0715l287
6783b2656R598N56J4246p211r133P855J1094P246J757r10m985j2758l479J0215
6769A435K499J5475J0211k584j5199j3090P9N282M916k114p418P539K727j7721
$$ y = [-12484, -14649, -6720, -3657, 5466, 11369, 25337, 19067, -2545, -63, 4919, 2300, 2600, 8269, 19300, 7764, 792, -9513, -21761, -14442, -2015, -261, 3593, 2629, 5394, -11018, -18024, -3479, 8842, 8182, 7094, -3553, -12200, -14311, -7616, 2371, 16933, 13230, 10526, 846, -27057, -33056, -4153, 15365, 6942, 1619, -2789, -246, -15284, -15600, -17845, -19388, -6124, -12016, -22863, -20617, -15485, -14255, -8369, -16042, -16090, -26785, -23325, -1411, 6565, 4425, 9923, 16926, 8175, 4600, -11519, -28938, -33768, -23604, -16894, -19242, -10193, 1200, 3304, 1744, 8946, -262, -8654, -19369, -22656, -13058, -12502, 1744, -5467, -14600, -6745, 4349, 11595, 13352, 12442, 7457, -5301, -8780, 1435, 3934, 19409, 29620, 27036, 11837, -1253, -1174, 4108, 9024, 6910, -508, 7031, 9758, -7963]
6755g963j0986L671J0211J009J0651k233j0006O742L397n123K680n766M364Q086
6741H734q972k558kQ909q56M377m006j0512j5714J3849R36J0815P773K234Q41
6726A5848p086q296k81N225q842j209l850N372J754K597L939j5036r792k487J0409
6711a1735m322r363R619J7582M63L946P471O677j0965k196J2397J2517q183m265
6697A9643Q166L098M80l989k1878n385K501q211l142J0840k710j651o461J177
6683g522J2356p60j3468n76m958j0609J3152k581O33J2279o477q244Q691J0176
6669B092O757m241o063L804J1465L681n048j2498l894J3300M288k231r639M626
6655F399M984J23k948j4178J0737o611K328J2735O562j3697L351O377j2079k657
$$ y = [-7963, -18949, -15278, -5067, -4058, 6593, 4360, -5646, 1096, 4493, -630, 2050, -3716, 648, 8734, -238, -2796, -2798, 6111, 5255, 9632, 5626, -4886, -20600, -6751, -5815, 5000, 12773, 15007, 15848, 8762, 466, 185, 5410, -3432, -4641, -8491, -3119, -1365, 1232, 5171, -9865, -19657, -22144, -11735, -16057, -25420, -15801, 1781, 2244, 6190, 13661, 20338, 9373, 7177, 19574, 32091, 23908, 19643, 27809, 30907, 31387, 27398, 5520, 135, 2636, -5575, -8717, 2123, -587, -2238, -8699, -7522, 4834, 4074, -9394, -9970, -14928, -25537, -12385, -14966, -14333, -2054, -8531, -16775, -8084, 2092, 8849, 4608, -1455, 2349, 13814, 17495, 12447, -51, -3945, 9355, 13643, 11412, 1773, 6399, 11383, 11506, 8558, -5620, 5117, -1494, 834, 13569, 20131, 6434, 9785, 16162, 4083, 1426]
6641A426M919j4235j4990j881O475O801P365m889k74K0832J5074N146j547p800
6627B2422r180j770J2456L714j018M103j3875Q885K896J5491J5003K5254J9451
6614A03832L7543O6950J05215J88731L06240K86429j82197l85806k12480j03516
6604B10941n9996l1418k7685j3147r514q132j8948k0697o784J4820M304N77j1357
6591B2964j5959r615J4861J0705n309q758p145r41J4420Q244q487p872P842K668
6577A7618q279r852j3125Q894J1453j900j4863l826k196J616R614O801P716m314
6563E357J1292M919m684j6894k867K2274N327j1087j048j3679n392n056R996K057
6549E15J4l024N970q677n756P603J1401l358j1979o8o875l658P16O033q69J2759
$$ y = [1426, 6345, -7890, -22880, -24761, -18286, -11485, -4120, -9009, -9283, 11549, 26623, 31769, 30222, 22422, 13242, 11472, 23928, 27642, 26624, 30727, 16852, 25737, 28633, 44124, 59127, 84381, 103832, 141375, 208325, 313540, 502271, 808511, 1094940, 912743, 526937, 314457, 210941, 150945, 119527, 91842, 78695, 69181, 61049, 42101, 21404, 14620, 29440, 33744, 34321, 22964, 7005, -2610, 12251, 22956, 17647, 8889, 1744, 803, 15223, 23467, 14980, 7108, 14950, 17618, 9339, -513, -13638, -4744, 6709, 4809, -10054, -13880, -16076, -14460, -4846, 1955, 9671, 5357, 16649, 21568, 16884, -10, -2877, 19397, 24724, 13637, 12589, -1090, -6482, -11538, -1542, 515, 529, -2495, 3475, -5202, -10958, -3355, 8046, 4688, -7291, -7359, -14234, -17892, -17176, -11143, -12012, 747]
6533G47j2090j4343m134J3145r24J9385J8054j6848j3365j3153L459J1080M531
6520d456p02M643J0598j098n438P947J621q814o35K407n660J3461n018q514q239
6505g897k0232j099K778O031J6673r521j294O859k692M804J8233M348j7208j1620
6491a1837J7814J5382m135j1706L380j2651o122Q541Q580K854j610q64j080p502
6477i56l360J925J5637Q972M656q366q218p515P802k635l369J5767J3169q500
6463B5009k4169j7600j0470J4016P664O385P919J1896K934j5496j2551j2670j3351
6450c0484Q815J3322L434m97N420j04O680K607n739o50N597k059o487L63o185
6435e967n859j8703O499K357K0O246l781K521J3903J8327M19o675P629j0129K940
$$ y = [747, -11343, -25686, -29820, -16675, -17599, 1786, 19840, 2992, -10373, -23526, -20067, -8987, -4456, -5158, -515, 10083, 8985, 3547, 11494, 13115, 4301, 3666, 6073, 413, 13874, 8856, 342, -7897, -28129, -29228, -26450, -20419, -3746, -13267, -14561, -7702, -10394, -5590, 12643, 16991, -217, -11837, 5977, 21359, 17224, 5518, 8898, -3753, -9875, -1334, 7246, 10100, 8490, 7626, 6546, -956, -4316, -2391, 13246, 22218, 26874, 18508, 10290, 2775, 10577, 7942, 4573, 20340, 33509, 25009, 840, -16760, -27230, -13214, -5550, 835, 8754, 20650, 23584, 8088, -4463, -17133, -30484, -21669, -8347, -4913, -5410, 10, -94, 6586, 9193, 3454, 2804, 8401, 6342, -145, 218, -5967, -11826, -30529, -24030, -21673, -21653, -15407, -19188, -16667, -2764, 15563, 15982, 9307, 16936, 6807, 9747]
6420I747J7794P177m082k5135k1941O584N123m331J955Q1J2057L336l305l484
6406A576j2258J1662J8041L760o638k7663o683J3915J0207J0388j2742o386J171
6393a650p117Q85R305r802K761m833n420J8295O348N356M186j1920K812n675j0004
6378f473j3497m176J1830K2743j6114j1966O249r921q113J855J6041J7072k848
6365B682R93m396J0130N179J198m182r184p427R683n707j4673m302J2375M331
6351c300O36Q447K943M561J1911k523m209n161n474q192n640N217j1096k924l800
6336a8604N416J4533P930J527q268n075m601q961p67N709j2527q23Q617l112L486
6321a5520P804J6312m829j0516O795J6923M113P274p255o993m318j1559k428m931
$$ y = [9747, 27541, 34718, 30636, 5501, -16440, -9856, -4733, -9064, -7109, -7028, 5029, 8365, 5060, 1576, -10682, 980, 19021, 22781, 16143, -11520, -18203, -4288, 5919, 16307, 3565, -2821, -1650, -8767, -7882, 1423, -8379, -5618, -10451, -15871, 2424, 8772, 14128, 18314, 6394, 9206, 3531, -6473, -19970, -24146, -12316, 10427, -5687, -17653, -11404, -21325, -29438, -27583, -11542, 5530, 2682, 3675, -721, 9409, 14588, 15786, 11604, 2420, -5007, 4676, -1031, -15704, -20006, -7631, -3300, -2664, 5783, 8726, 13287, 25198, 22675, 18466, 13305, 7831, -361, -6001, -784, -11880, -14804, -18604, -13188, 1345, 9275, 10802, 2534, -2541, -7142, -16103, -16870, -11161, -23688, -24511, -15894, -19006, -15520, -7716, 8596, 3767, -6749, 46, 16969, 21082, 28356, 21101, 14108, 9790, -1769, -4197, -9128]
6307i128o465P365J3276J85p035q45J433J8148K487p402M651Q5o339J844m696
6292G564J117j0409J4287N160J1878p039m978q182p726n160O75l362j0777n571
6278b2523l578M284J3298Q492j1627O105J8514r442J621L538J2496K001o207P41
6264A7713l226j4032l397j3731l412J7283l427n189m128j2902L779J0588N513
6251h568K449N431J0422n001r561L331n244M539l459j7480O62R589N913Q000j6785
6236a5762M272Q689Q530M578k047j878p13j1587n548j1543R019R425J0579Q573
6222A4587Q302N155L279j9875J427q89r779m262L951J381M629J5926n098q477
6208A0257j2880K131k904L206J0586J1719r429L537r763k1922p150J5736R871
$$ y = [-9128, -15593, -8228, 5048, 5233, -1802, -2647, -1214, 16934, 19421, 12019, 16670, 16755, 10416, 12260, 7564, 8681, -1728, 12559, 17719, 29597, 22558, 17580, 9398, 1672, -3488, -2813, -6175, -16952, -22523, -26101, -21817, -8519, -27, -11654, -5549, 12965, 3523, 5144, 8682, 21178, 23179, 16972, 17713, 14487, 455, -2942, -16673, -20085, -2802, -6229, -11418, -15546, -28448, -24669, -14081, -8568, -6119, -688, 9734, 4733, -4828, -1497, -6741, -2202, -5661, -23141, -22479, -12890, -6977, 1023, -15762, -11490, -2801, 5729, 10307, 8260, 6382, 5669, -5918, -11466, -23009, -13990, -4565, 6014, 14587, 22889, 28044, 31323, 11448, 12875, 11986, 2207, -2055, 1896, 3277, 7906, 23832, 18734, 10257, -2623, -492, -3396, -190, 10396, 22115, 12686, 16223, 6460, -15462, -22612, -6876, 2995]
6195B995p14J4521N130J658q883r129r632q68p171J9535L789Q462J3420R746q060
6180C4799j5507j1537K112q924n737r602j189J6012K0462j4429j3352m65Q080
6167G23J1489L783j029j6917r993L450Q017q680j194L206j0L369k283k1020j1390
6152c8479Q2R690O467N460O63q988J7059J061K993j1700l705J4438P487J6827
6138A9355Q00o64j6277q750n928R138R879j0811l20J7581R327k3107j8828J3805
6124d800L762M672J4534m034q970n759P769Q001J3635k5139q445o174m723P947
6110g724P714l709j0154p927N344J7270q00r291L077J5856j86j1040O899l539
6096A790R916J684r923m126p550l908J942N992M162k731R356N773j0464j5937
$$ y = [2995, 2281, 16802, 21932, 23590, 14707, 5578, -4054, -4922, -12093, 7442, 11231, 19693, 33113, 42859, 34799, 19292, 7755, 9867, 943, -4794, -14396, -15585, 427, 20889, 6460, -6892, -7357, 723, 12212, 15995, 14966, -1951, -11944, -8494, -477, -9157, -10351, -7145, -7155, -3786, -6069, -27089, -38479, -38397, -28707, -22240, -16780, -16117, -25105, -8046, -6985, -3992, -15692, -19397, -4959, 2528, 19355, 20155, 19491, 3214, -5536, -11464, -2326, 7553, -3258, -3578, 14003, 23330, 223, -18605, -4800, -1038, 3634, 18168, 14134, 5164, -595, 7174, 15175, 28810, 3671, -4774, -10948, -15671, -7724, -10, -3719, -13873, -21800, -16456, 814, 14, -9277, -6200, 9656, 9470, -1570, 5329, 1790, 11706, 13390, 3467, -659, -8209, -12117, -10175, -4183, -21, -2752, 6604, 12377, 1913, -14024]
6082a4024q738J5337P567k399l167M378R588O586l685K184P009J94K170j1554
6068A1446j2911j166P864R966m583q183O165L088P69n486p390K032o168O615J1254
6053A3312p555k405Q313J2090o861j1818K305M501Q925R9p069o056J2681K965
6039B3427P670m90p197j1949j6937j4427K729K8857O424l586J3299J164n273l204
6025B0507j9544n763j8511O20R954k826j1058j1343m738l524J469J7144J0633
6012a6980J2062k056j852K081J1656K285m574O289j5916N768L733k167m796N928
5998A461p44j3406j2205P782M071K612N053m593K620M293J0798P511j36Q026M450
5983B7593mo42j2780j2786j098O694p635m370K373J830l086K971l125l318j6979
$$ y = [-14024, -22762, -7425, 142, -2257, -5424, -1046, 8542, 15128, 11443, 13627, 20636, 20830, 23000, 11446, -1465, -2631, 5233, 15199, 10616, 2433, 8598, 11686, 12455, 6969, -421, 1611, -4557, 2058, 13312, 5757, 3352, 11665, 23755, 16894, 5076, 7381, 11882, 20807, 20906, 13837, 7781, 20462, 23427, 31097, 30607, 23410, 11461, -5476, -19903, -17174, 11683, 18107, 14521, 27820, 28984, 23711, 20507, 963, -4800, -23311, -22691, -12737, -15563, -26621, -37964, -42702, -46226, -44757, -27613, -16980, -4918, -6974, -8826, -6745, 4911, 7196, 2622, 8911, -7005, -1237, 2496, 329, -4467, 1461, 717, -12689, -24894, -17112, -13041, -10429, -5376, -9969, -7349, -3056, 7742, 15253, 15117, 23143, 27593, 27589, 26947, 14167, 1381, 283, 6977, -658, -5028, -2655, -825, -3911, -940, -4065, -7383, -24362]
5968b4362j2170k21J3588o608L961m033J448N03l103J5897n361p258l788J9500
5954a2007N358p0J0841k975p688j1124q970Q048L570J1998J108M48J7038j2764
5940B811K03J424k6312K338P792j083J0279J9855q09k4567k093J0662M375p413
5926b538n486M732L243Q080j6979j5695K90M553L804Q159J2891k025j2663j009
5912a0643J3403j0317j9469k232j1729l438R034K7482J3401L530j2693J342p54
5899c083l176L292Q893n697j6062j321J1701K1350J164r247J2392j73k1423q070
5885i460P06l353J388K492N932j94K686N480R941N646j227l054q995j8047r129
5870a9188J2858m072O0K461J1752m748n485L141N122N710l311j0706M159Q99J0185
$$ y = [-24362, -36532, -36753, -23165, -29773, -25812, -29845, -28397, -27894, -30997, -15100, -20461, -27719, -31507, -12007, -6649, -6719, 4122, 1147, -6541, -17665, -26635, -18587, -15017, -3019, -1911, -1463, 15575, 2811, 3014, 4438, -21874, -19536, -11744, -12827, -2548, 17307, 16498, -8069, -10162, 500, 4875, -2538, -8024, -3292, -49, 8031, -8948, -24643, -24353, -19800, -15996, -7837, 5054, 3029, -9634, -10643, 2760, -7557, -27026, -29258, -40987, -44425, -35391, -7909, 5492, 9022, -3671, -2329, -3083, -6259, -2967, 5926, 229, -15833, -17154, -5453, 15897, 17061, 7814, 20206, 20033, -1390, -9460, -8754, -12107, -10719, -8227, -2295, -2489, 197, 5677, 15618, 21264, 20037, 16983, 7988, -10059, -19188, -6330, -10402, -10342, -7881, 3871, -877, -6362, -3221, 1901, 7611, 4300, -6406, -2247, -1348, 8837]
5855H837j895P880j2051j5619o75m054J1551J2373P316p255m60K690j1813j4271
5841a7446L162R091p554o720L262J2155N625j6736q267j1430k570J4705M038m753
5827b3438J1577K613N25K519m6q885N875K03r113J351N527K942J4345J55o767
5812f17k2721m57J1784J5867M668j5188r462J250J017Q889N036k473j195K664
5798i38l471j3874q446J545J0042N444M794L174J368K995J466j1076J0422O082
5784I527j3224L367l94Q540J806n470m057k142M67q15J5967M012j2611n729J0220
5769I464K231j573q929m193j0379j3094p425J8166K4826J5960j4770j4299l828
5756g843J903P454J384J2234J9880p207l3348q244J5231M878O468k230o823N751
$$ y = [8837, 6942, 14822, 2771, -12848, -13523, -17577, -6026, 6347, 13663, 6408, 5948, 8638, -3175, -17446, -14284, -5193, -12747, -19467, -16205, -4050, 1575, -15161, -23428, -34858, -37428, -22723, -18685, -23438, -11861, -9248, -8723, -6204, -6250, -15135, -9260, -9057, -18170, -16819, -11292, -8350, 5995, 6150, -617, -23338, -23795, -12011, 3856, 8524, -6664, -16126, -14876, -13859, -4970, 66, -2407, -3602, -938, -4409, -18283, -26729, -25184, -15142, -9698, -4904, -1730, -362, 2633, 4099, -6977, 3445, 9527, -3697, -330, -724, 7816, 9622, 4152, 95, -2047, -1580, -2395, 13572, 17584, 4973, -756, 9464, 11695, 10122, 1193, -3000, -13379, -26473, -33898, -15732, 9094, 25054, 10284, -4015, -7843, -5940, 1514, 2898, 15132, 35012, 27805, -5543, -13787, 1444, 6322, 12790, 10560, 3737, 9488]
5742I488k213j0269j853l604n184R796l270j3367PJ5889M105j189l737j823Q916
5727A692N774o221R721P804L45q140j8564L735J545N480k944j498l985Q560N255
5712H559P684J0991o040j8348j7762q234J2881J865j7243l153K4868J4198n816
5699D450j3159Q780j10j974J604J0177J1923M432j5019q965J1755R046j2271r614
5685A055q413O510K160j30O183J1532p573n309P608J822Q98J6439j8564k0649
5671f431q69j3022Q504k461k200Q697J3577J0119J1512n252q412N161m831j0237
5657C855p135k454J7837P686n739j4689j5331P18l809N269K420N836J16J0350
5643D930k64K654l800r107q224J0023K300K162N784N228K81l899o63J571J1836
$$ y = [9488, 7275, -2994, -4847, -8451, -13635, -3839, -7109, -20476, -20469, -4580, -475, -1664, -5401, -7224, 1692, 7466, 1245, 10966, 18770, 19115, 10975, -7589, -3854, -2309, 3171, 227, -1271, -5256, 3304, 8559, 16243, 27234, 21194, 2846, -14916, -23150, -10269, -8404, -25647, -28800, -3932, 10266, 4450, -8709, 71, -39, -2013, -409, 9768, 21691, 26123, 11104, 2139, 13894, 22940, 10669, 1055, -7358, -848, 1312, 1182, 7365, 18897, 11324, 6015, 13623, 15445, 16343, 32782, 14218, -6431, -7300, -20322, -11818, -14279, -16479, -7782, 5795, 15914, 27426, 22174, 13762, 18923, 14092, 3855, -3280, -5734, 12103, 19789, 14050, -639, -15970, -15252, -19061, -13792, -11372, -5536, -5420, 4930, 4666, 7320, 3520, -5587, -13811, -3788, -1488, 674, 6458, 11686, 11967, 8068, 7405, 8976, 20812]
5628B0812L729j4335k0652N476l042m373J0763J0401L169j2408k0399L721o503
5615b3641L196K0639l204n103J2316n603J45J293R429L014j7200j6871j3367Q333
5601b6624J4547J0648J6468j0011o185M014k356j1746K3146k109j2553M245k806
5588a322O842Q797J1318j5790m498m321n610jR707m88K480N100o658j774J2812
5573A6594o739k1413M777J0114j1123J405J1939k608K062o525l028K857N095j9242
5559a5835R711J1259M376Q48j2253j034P938J092M10l503J2616L375n444j1865
5545A691K2881J2304j5082l752l538q826j481O344J060O92q597k697j4474L226
5531a0249l037O400J7712O388J434j0213j7281q639K333K1163J0617j0533l294
$$ y = [20812, 24541, 10206, -10446, -4970, -8012, -12385, -1622, 8779, 11948, -460, -20859, -17138, -23641, -20445, 194, -3010, -8113, 4203, -1400, -1255, 38, 9467, 12481, -4719, -21590, -34957, -26624, -12077, -1429, 15039, 5028, -1157, 2857, 501, -11245, 11901, 9792, -2761, 1484, -1322, 5520, 14317, 25635, 9845, 5347, 1026, -4584, -4585, 5122, 4634, 7114, 12214, 5556, 3782, 16594, 9855, -11558, -6781, 3333, -7790, -6385, 5554, 2946, 5008, -1517, -4545, -1688, 3407, -15835, -6124, 5135, 9511, 10359, -1894, -2928, 5010, 6102, 6512, 3009, 15625, 19000, 13556, 1691, 24572, 36876, 21794, 18042, 14504, 5678, 4197, 10541, 11601, 12293, 3696, 999, -13475, -10249, -13286, -6886, 10826, 17214, 18648, 8435, -8846, -17485, -15152, 6011, 16628, 6095, 2801]
5518B801j6747q79P036R579m17j1004J0188J5233j8580k6721j2340K300O441J4396
5504a8714L227l912J8137R617l05L769n090N858J7179j5240j5666k508J1932k1311
5490a3027n787j686O944J8445k158j1346K692r240J6502L846J2622L683j923j417
5476A8150j6485r905L979J2615M91k270m134m0N560r727K4k321P943L641K446
5461I967j213j4439j648j2080j0631J2967j1748q984R897O203M054L583n4K204
5447a1922J0433P252J160k788M980M775l702j86q054j6425n000M870m191L054
5433a5744j540r35Q455L771J096L379P59N404P597p963J1463m251j1265m071Q064
5418D219N56m528p156m552m112M723K902m011R232J0033j718J823O780k971j0121
$$ y = [2801, -13946, -14825, -7789, 1790, 1373, -9631, 557, 15790, -2790, -29511, -41851, -39551, -33110, -18714, -15487, -19399, -1262, 8355, 8050, 11819, 6729, 12587, 29766, 14526, -1140, -3648, 8284, -13027, -18814, -20500, -13556, 4889, 2731, -8615, -5923, -15163, 1339, 5185, 17807, 21490, 19567, 18150, 1665, -8240, -4261, 8354, 8845, 6575, 2441, 2401, 7961, -1766, -1742, -4063, 3880, 7521, 9967, 8754, -5685, -7333, -19413, -30044, -17077, -28825, -37809, -27912, -21709, -17655, -14072, -14126, -11922, -1489, 5763, 6923, 4135, 9115, 13890, 10188, 10002, 1948, -14477, -19477, -14607, -18798, -15744, -17284, -18219, -9764, -5993, -4897, -1518, -759, 4645, 12242, 4279, 15742, 11491, 226, -3845, 4219, 4775, 247, -6909, -11461, -15573, -10850, -7948, -11959, -2727, 7306, 5588, 7411, 14191, 11220, 1099]
5403A099j1974j596j4515p098N914J3579J9464K0786j1386n106j2119M181P388
5390H617P88O51j1645j3728R115J9033j022j7283o087K556k802J2881o15M433
5376D892j020j1488k001J2699M539j8249J723J2017m634k524m679k346O215M14
5362d442l834q303q730K760K2012J4364L690o544m860j549j3753k0382Q15P213
5348b1543J7359J7462P130j3555p344K930k602O549N02j3242p554m178k518p847
5334b8451J913R962L369J1736J3755J7646K402j6039q509o880P626l308K651O898
5320A4771N409n647j2487P2J815m76o844k59r956r863J5527N685m558n464n713
5305a7988K974Q366l622r386M72R763o636o62J1080J898L259J1428k945O726k6253
$$ y = [1099, -10875, -12471, -26986, -34084, -28170, -14591, 4873, 25659, 14273, 9167, -2952, 1229, 8617, 9405, 10056, -1589, -15317, -6202, 12831, 11809, -5474, -11561, -9005, -11807, 1074, 459, 4892, 3872, -7616, -9617, 3082, 7621, -10628, -8905, 3112, -1522, -4046, -8725, -11071, -4856, -4442, -8276, -16579, -25309, -22549, -537, 13827, 17517, 10973, 6113, 4564, -9189, -29571, -28756, -21543, -4184, 13278, 20408, 6853, -491, 2439, -163, 6386, 6888, -6354, -13908, -18086, -20604, -28451, -26538, -16576, -13207, -1471, 12284, 29930, 32332, 16293, 7784, 904, 8530, 5222, 7873, 14771, 20180, 14533, 2046, 2118, 3933, 3457, -3387, -3646, -13602, -23465, -7938, -2253, -6811, -12275, -17988, -15014, -6648, -10270, -19656, -19184, -9421, -16057, -16719, -5639, -3741, -482, 10946, 8001, 14727, -11526]
5290a1526j0577Q826J420J0072l309j4055J0347R860j6888j5554M549J1316J6056
5277E37O895j2890j0373n107r903M595J8209J8087L645o034p599L53l867N099
5263A647M839n087j1101L589p834M917p01J0469J472r706k349O073N805J1092
5249A3125l487q797J420r474k170m93O753J2020l17l669j0599J1373m197o083
5235d595Q849N016M398n149Q926m781J08J6549J1363r486j6223o826P152J1017
5221B6318j388n400J647Q41j3589j2990R093k192j4077P212J4019N628j6199k212
5207c289Q892n392L370J968j2442M64r275K304J0584M931J1595j1839q763J1146
5193D254o039j6092P845O03J367N919J4065j0748K400J2695J5674O85o693p515
$$ y = [-11526, -22103, -13277, -11857, -1785, -5094, -19149, -8802, 1058, -15830, -31384, -26835, -15519, 537, 7432, -5458, -15831, -20938, -30841, -26246, -8037, 10050, 13695, 7661, 62, 415, -3452, 1647, 6486, 1399, -9702, -6113, -13947, -9030, -9731, 738, 2210, -7496, -9845, -3772, 2033, 13125, 9638, 841, 2261, -7213, -9383, -9876, -3123, 8897, 8580, 4911, -5688, 5685, 1488, -4595, 4254, 9270, 13668, 8519, 17445, 12664, 12772, 29321, 40684, 31198, 14975, 8149, 15301, 26318, 24930, 19530, 21177, 22018, 8429, -4561, 4532, 2340, -11737, -4525, 9494, 15122, -1077, -3289, 5603, 211, 3581, 5549, -6893, -6429, -15704, -13400, -2816, 2115, 13710, 1871, -6892, 4254, -1785, -17877, -10032, -9429, -8062, -2143, 11922, 1174, 3574, 16269, 31943, 32628, 25935, 18420]
5179A8420J973K751q174j682q338M833k717L614l805q965j1956P980P524N430
5165F888k055O878K0262o753k2293o440J0460j3624K836J3817q209K336J1690
5152A5793j4379j4404N918k564M648L468K038j4360J6148j775R637L922j5951
5139a861n348k201k103N930M391j2684j1832j3112J583J3959J4272J3897j462
5126C429j3841k4180M458J5386J7915n444j9468p639L968Q772N969q84J1206K313
5112A960o512k281J441K2026J731j0649k0636j609J4714J2727J150q746j2486
5099g170Q540j059J0441j764j7913l246R496J452k093J2051p521p096N511L458
5085C087p55j2918R65P733j168q342k451J3396J4621J150J7211j7611j3598K740
$$ y = [18420, 20393, 23144, 14970, 13288, 4950, 9783, 7066, 10680, 6875, -2090, -14046, -6066, 1458, 6888, 4833, 11711, 31973, 25220, 2927, -3513, 6947, -6677, -3841, 9976, 1767, 4103, 15793, 1414, -12990, -7072, -9636, -4988, -1520, 518, -13842, 2306, 531, 10168, 14090, -1861, -7209, -9410, -11513, -5583, -1192, -13876, -25708, -38820, -37237, -23278, -9006, 4891, 3429, -10412, -34592, -30134, -14748, 3167, -2277, -21745, -29384, -25416, -16644, -10675, -11559, -353, 1960, -4552, -6833, -5392, 16634, 18365, 7716, -12920, -14529, 185, 12912, 14062, 5316, -7170, 1370, 311, 10752, 8988, -8925, -12171, -2675, -1223, -3316, 8735, 1214, -5882, -371, 3087, 2332, -10586, -9621, -1888, -3056, -11398, -13849, -453, 14168, 15318, 32529, 14918, 1320, 4060]
5071D060L036J5842N023l40o887q466n032K2188k355k9476k518O660N811N372
5057A2918J254P781j1441M83N407q965r422p116j1157O59R774K375q364J026R086
5042e702M01J3283P652k0451q207J0057M978m589j728n901j590M422K2157P088
5028B1870j4082j4494J713N015Q064Q975l236J0784J924K645l83j3600j157j760
5014A2278j806j1924L721L230p739j968j2387J6192K0191J3002J0667k589j5578
5001B5290j7250r55m683p831n733N800J253j035n172l972J156J2698R694J909
4987A1169N99K008k062M276j0270j3872L759L349l920J89Q424k769j4366l589
4973a7075J3144n352k283L278O19J5886l214p223J2379J486q883q723P509P860
$$ y = [4060, 7096, 22938, 27961, 27621, 20734, 12268, 7236, 29424, 27069, -2407, -4925, 1735, 7546, 12918, 14172, 21953, 10512, 10995, 16402, 7437, -1985, -9101, -20258, -19599, -9825, -7450, -15814, -14788, -5702, -5301, 7982, 15634, -4817, -13024, -2967, 2011, -2578, -4306, -10207, -11797, -7375, 14782, 21870, 7788, -6706, -4993, 22, 8086, 17061, 13825, 24609, 26533, 29178, 28795, 15195, 14038, 12278, 10472, -1452, 2269, 5499, -2240, -4208, -16595, -403, 19788, 32790, 43457, 40868, 25290, 8040, 7085, 2402, -5429, -11162, -5362, -4109, -5144, -10316, -14288, -13132, -434, 9260, 11169, 11768, 13776, 11714, 15990, 5720, -8152, -4393, -1044, -4964, -4775, 3649, 880, -13486, -17075, -3931, -9283, -11566, -8288, -7669, 8217, 5003, -2220, 10159, 11645, 2762, -5961, 1548, 9408]
4959I408p962O93M297K753L400N879J1824L970j6932k1155k3473Q22M893J0355
4945a1228K704J8404R157m640q522k981m480L611Q222j0203R46P375j0810j3083
4931a5528r08n382j794J0196J3493J472N620o880n710m391j1238J3204l12n810
4917a3968J3458n981k682p538L853n186Q15j94j7090n330L180J0836L617L416
4903a8794p492O923J4912J259j316j8297m406J6343L198M184j79J0462k221j3103
4889h527R490J7296p799q138j0197n003J0174J3745j685r27l279R074Q440n298
4875A7366p258P429J1517p100j6163r378j1190j450M146m62r205J1797J8102k421
4861E730m365K266K358r057j4288R907J5572J3071r383j9517p649n743J1315m21
$$ y = [9408, 1446, 2139, 6436, 9189, 12589, 18468, 30292, 34262, 17330, -3825, -27298, -26476, -21583, -11228, -8524, 9880, 19037, 14397, 5875, 2894, -1586, 2025, 10247, 44, 990, 8365, -2445, -15528, -16436, -21818, -23612, -13416, 77, 1549, 7169, 289, -5421, -9812, -21050, -7846, -8158, -13968, -510, -6491, -9173, -16711, -12858, -18044, -17229, -17423, -34513, -39843, -36663, -25827, -22210, -18794, -26286, -19363, -4451, -3192, -4508, -22805, -27211, -10868, -7670, -3486, -3665, 6797, 4576, -8527, 963, 18259, 10460, 2322, -7875, -12878, -2704, 11041, 9356, 8429, 5150, 14224, 22664, 17366, 10108, 17537, 29054, 21954, 5791, -3587, -14777, -16227, -12081, -12543, -21748, -9951, 8151, 5730, 1365, 3631, 5989, -3068, -17356, -7449, 8123, 21194, 11811, -7706, -15355, -21098, -9783, -10204]
4847a0204m896N188O054j829Q631J0615J4602R76k0543n554j9500N737J2308q230
4833f645j6843j3896j77J6115J0736j074M147j7737m225o945J8814J1304k404
4820h830K747l379K622N969m249q394M703j162K824M497N341l867L003q589p812
4805a4576J2005k764J3153J4524j062j8729L636J0759J017P492q550j1546j7775
4792a2416K202L247q66l817j837k958j561k341j977J839K568J5640J0559L327
4778A1609o023n868o13m113r425Q826N293q638m175n476k81O906M874O67K524
4763c913N823P484j0057J6j379j0609P18P614N530M491k591j2284r819l870K426
4748b0420K2463R702j6223J231k072l974n261q58J385J2758O026k148k3036p988
$$ y = [-10204, -15100, -9912, -3858, -5687, 2944, 13559, 28161, 29137, 8594, 3040, -16460, -10723, 1585, -6645, -23488, -37384, -37561, -21446, -10710, -11784, -7637, -25374, -29599, -36544, -17730, -6426, -8830, -6083, -9462, -6840, -871, -5120, -13514, -8811, -9973, -7149, -2652, 2689, -1178, 1825, -6764, -14576, -2571, -5335, 7818, 22342, 21280, 2551, 6187, 16946, 17963, 25455, 16905, 5359, -12416, -10214, -6967, -7833, -11650, -13487, -16445, -18006, -20347, -22324, -20485, -17917, -2277, 8282, 11609, 5586, -282, -895, -5008, -14433, -5607, -314, -8952, -13127, -18603, -18884, -11978, -7104, -6437, -3913, 1910, 9394, -663, -647, -2026, -12635, -11917, -4303, 1227, 5718, 3127, -9157, -18976, -22846, -20420, 2043, 11745, -4478, -3247, -5319, -9293, -14554, -15412, -14027, -1269, 4757, 2609, -20427, -28415]
4734b8415R137J6246l180j6738M707K3374P097r659j3113M198q218j758k716n31
4720a9569J7492R049p869J0922M417o370j0131j268j657K547O245Q716l767N150
4706A3907p141k256M335j5388k0054l615m733N598J5581K9589M111j3567J73j636
4692D904k426J0723N248m189j352k702q861K961L440L508o31j0405k259J3663
4678A1622L468q387m776r023J5268O632l283n710o564J1345N353M9j0286j494
4664D214L794q339j491P42o623o338m376L115O151J6170k997J2590q296r891J628
4649E3l01L270K775M40m006l910q602j9547J939O849K276J4742n664K818J2930
4634F062l79M695M571k4588j8767J873J3793J1843j3292n336j203k50J1102J2676
$$ y = [-28415, -19278, -3032, -6212, -22950, -18243, 5131, 12228, 2569, -10544, -6346, -14564, -16322, -19038, -19569, -2077, 6972, -897, 10025, 14442, 8072, -2059, -3327, -4984, -2437, 3808, 12524, 8757, 13907, 6766, 4510, 8845, -6543, -26597, -30212, -34945, -29347, -13766, 15823, 19934, 6367, 6540, 4904, 2478, 13201, 18449, 14260, 12908, 10206, 1345, 4306, 7746, 11254, 10623, 218, -2041, 11622, 15090, 6703, 1927, -7096, 8172, 14804, 11521, 5811, -753, 10592, 15945, 15994, 5708, 4214, 8008, -331, -1822, -1080, -7703, -14041, -18417, -15302, -9151, 7019, 4022, 16612, 8316, -1575, 53, -248, 3022, 5797, 6237, 2231, -1679, -10281, -29828, -27889, -21040, -18764, -4022, -9686, -6868, 6062, 5683, 10378, 14949, -9639, -28406, -26533, -12740, -897, -14189, -19525, -20728, -20978, -9876, 2800]
4620B800L782m240j2307K443j2518J1372J4370l218J0496p335j0305j0565P748
4607g477O029L18k426l926r036N053J0852O875L743j1878k864Q314J1026j5262
4593f59j1190k890J282k234J684O769L086J655J772l414n728M866q942q13J1576
4578c180N317l2P38O290R825P559j0708p025R495L658j630o772J1969j999k797
4563B0708o428k959r036j6005m33J2356J3347p02n606L172k236J507O780R995
4549B4460l108j6695l545J3198P163q358j2480j718J0065J7807J1232j595j2309
4536B4117M484K067n037p36j587m135K813k695k7946M328L107N639L560j6287
4522h308j7321Q502J9844J3040O310j2044j5082j3840k5803L370J0029N855L591
$$ y = [2800, 6582, 2342, -9965, -7522, -20040, -8668, 5702, 2484, 12980, 5645, -4660, -15225, -7477, -1448, -1130, -3556, -7482, -16518, -11465, -613, 6262, 10005, -1873, -4737, 3577, 14603, -659, -11849, -14739, -13457, -15691, -14007, -7238, -4152, -2497, -725, -4139, -9867, -5001, -13943, -14756, -3180, 2137, 2105, 2843, 9133, 18958, 26517, 15809, 8784, 18279, 21937, 20307, 13535, 25504, 23505, 20708, 14280, 11321, 2285, -13720, -14153, -1797, 11550, 10848, 5242, 8414, 6178, 7685, 14465, 24460, 21352, 4657, 1112, 14310, 21473, 13115, 635, -1083, 8982, 26789, 38021, 36426, 24117, 28601, 30668, 25631, 24895, 23308, 19173, 21986, 19291, -8655, -4327, -1220, 4419, 7979, -8308, -25629, -17127, 2717, 15757, 22067, 10023, -5059, -18899, -44702, -41332, -31303, -25448, -21857]
4509b1857n35R97K817O851O700N343P846P562J054k108K23q70j3714m11L545J870
4493E313K139m7r288m211n636n35N121k642L821k266p477q360J2445P916j121
4478d828q797j5658K3992J3327k5533o612P324L141n595j396J617l295M697R643
4464g973j1019n057P421K2667J5055n042j0028p853n571L164K5302P146p676j9574
4450I62j825M313r836m030J0406k704j8319Q880O006m005k349K046M460m319m177
4435a4491j7340o027Q504J5218J5365N17j7095M502L281L010j6440j1742K2615
4422a0123J5149j0145Q587l271j3207l389L235k341J5417J9129L782k574k1900
4409a651l026O839J866J0479k417P365j23L872l54q45j0276j2455K790M797m25
$$ y = [-21857, -22392, -21395, -18578, -11727, -5027, 316, 8162, 15724, 16778, 14670, 14893, 14023, 309, -102, 3443, 5313, 7452, 7405, -1883, -6094, -11730, -12265, -7144, -9786, -5965, -8231, -15708, -24068, -11623, -3707, -4828, -13625, -29283, -5291, 8036, -17497, -24109, -16785, -13644, -19239, -20635, -19018, -22313, -17616, -7973, -18992, -24049, -16628, 6039, 21094, 16052, 6024, -1829, -7400, -4236, 21066, 28212, 20536, 962, -863, 3450, -6386, -10416, -10, -2714, -21033, -12153, -6147, -10152, -12501, -10455, -5995, -10314, -14491, -31831, -37858, -29354, -14136, 1229, 1746, -15349, -10847, -7566, -4556, -20996, -32738, -10123, 5026, -5119, 3468, 197, -13010, -16399, -13164, -15505, -88, 19041, 22823, 20249, -1651, -4677, 2162, 4028, 14507, 12090, 19455, 19332, 23204, 22850, 22005, 11729, -726, 2064, 6861, 6436]
4394F436P62k717j836k996K95m932n726R602O152N174N449j0300p74j217q538
4379e166j490L445J846J0798k527J5025r619o006k981j0898m127q291J3742K6951
4365B0702J3825j617n103j5776k0202K515n120m870K923R839R082Q846K964j4856
4351C152o080L473J3573r062j5615m437K2177Q532j5243k8461N104Q229l699Q928
4337i429Q617M536M873m284k5731p974J9286K7941Q737o654o318j0390j2309M969
4323d130O180Q972r60j4208j5644j455J0853J0510J8602m09j2576j6718m524k606
4309a8113J365Q409J9455L921l299n506n744K081R91k529O004J743o996o811J0810
4294E781O1p425K385J1780O6m993j0781n297L584P551P7o189J0050K365n360j2785
$$ y = [6436, 7198, 4481, 2645, -351, -56, -4988, -10714, -1112, 5040, 10214, 15663, 5363, 4589, 3372, -5166, -6656, -3211, -1365, 9433, 6906, 21931, 12312, 6306, 3325, -7573, -11700, -19991, -6249, 20702, 34527, 32910, 27807, 12031, -8171, -5656, -10776, -15646, -12723, -2884, 6198, 15044, 18008, 3152, -2928, 545, 14118, 5056, -10559, -14996, 7181, 15713, 470, -27991, -22887, -14658, -18357, -9429, -812, 3724, 8597, 4313, -21418, -29392, -10106, 17835, 26572, 19918, 13600, 3210, -9099, -4130, 2050, 11022, 10062, -4146, -19790, -21245, -10392, 118, 18720, 18311, 5735, -10983, -15507, -18113, -16748, -8339, 11116, 15037, 11738, 6232, 488, 2569, 3560, 1031, 7035, 8778, 1782, -5029, 5781, 5842, -1583, 802, 12582, 12648, 7655, -3126, -8423, -4839, 2712, 2789, -3400, 6650, 9015, 3655, -9130]
4278i130o259J2968J8608J5127J70k152m891p423n052p050k048r725o39M846N569
4263B919k729l394K993M647O335m056K60j4258k551O119J2316J7221p965l853
4249A4004l415m681J0623K378p305j426J120P996j617k917j1611m336j2583R598
4235d172J1646n570j0516m096J6208R417m455m948Q65R813J539j2852j0911R392
4221A360J737J1067Q235O473j7275j2742n055N026K2279q569m974k405r392q906
4207a3141P15n261J1722N351j7L642r811J0987J322l230ql319J1274J2091l787
4192A8530K894J3840p069j7696k174K3397J4884m910j2668j955o348k2644m397
4179f316j654L0M797l401m630q630k990j27o716J2629J7234L711l366j1678P108
$$ y = [-9130, -15389, -2421, 16187, 31314, 31484, 29332, 24441, 17018, 11966, 4916, 2868, -6857, -7496, -2650, 2919, 190, -3204, -211, 4436, 10771, 6715, 6975, -7283, -9834, -3715, 8601, 25822, 17857, 14004, 10589, 5908, 16531, 18909, 11604, 10178, 11298, 19294, 17677, 14760, 3149, -1187, -13770, -4172, 7474, 1904, -8612, -12708, 3500, 12917, 8462, 3514, 4379, 14192, 15731, 2879, -8032, 1360, 3097, 14164, 22399, 28872, 11597, -1145, -6200, -1174, 21105, 12536, 7562, 5157, -4235, -13141, -12426, -17687, -5965, -614, -631, 3011, -6800, 4187, 5509, 2279, 2271, -1048, 10226, 22317, 18530, 21424, 35264, 28195, 10499, 8325, 31722, 46606, 41696, 29028, 27073, 20725, -1919, -6316, -7970, -7940, -3143, -6544, -11174, -19804, -22794, -22921, -29637, -17008, 226, 3937, 571, -11107, -3999]
4164c999M516q625q15n838n721J321O458j1071j1661Q274K8436L264j0007r022
4150a4490l955r645M677K0284R091J974m677n068J1255R371P497k89m963p836
4136A3226k1946p172K147Q619J672P992k71p704K043j635L676L358q827O369j3662
4121a2115O511k270l270m548P952L459P537K544j4047J1535L088j080J311N051
4107A1658J5915l959p607j4957j4349p402J0718J6402R107l342k599Q79k955q871
4093a362J750r161l81J0630R689J2086j1082n912q346K968J2248k13q764O076
4079A0226L893n561j9688p662O553J7266Q862k2342n35J1361k969m656N135Q565
4065H448R34L87O598J0902r278k0380p45K789M78q939o276k334Q557l020O672
$$ y = [-3999, 517, -8108, -8923, -14761, -20482, -19161, -12703, -23774, -35435, -27161, 1275, 4539, -5468, -14490, -18445, -28090, -23413, -3129, 5962, 7936, 3259, -1809, 9446, 18817, 26314, 26025, 21062, 13226, -8720, -15892, -13745, -5126, -3454, 4538, 4267, -3437, -1394, -3029, 647, 4005, -4822, 1547, -12115, -5604, -7874, -11144, -15692, -7740, -4281, 3256, 5800, -8247, 3288, 6376, 5296, 6607, 11658, 27573, 23614, 16007, 1050, -13299, -20701, -9983, 6419, 15526, 12184, 9585, 10464, 7509, -1362, 388, -8773, -9154, 1476, 11165, 23251, 12169, 6257, -2089, 879, 13127, 12914, 4150, 10226, 14119, 8558, -11130, -18792, -12239, 5027, 13889, -8453, -8988, 2373, -596, -5252, -117, 8448, 9382, 9769, 16367, 27269, 17991, -2389, -3134, -345, 133, -8806, -15082, -17416, -8859, -11879, -5207]
4050e207P374j594M654L756M25k964j4804j368j937K275J520M872r110M97R778
4035a833N233m830L809J3357k740L565m611n266m811m970j7790N794L736R833
4021a524O143j6389J42K087n65O820O04o679n346L126K712k439Q170J2083J0189
4006A9134M94j3579o430O899J564j6412R67Q755O99j0590k816Q469m331m472j1723
3991b3372j138Q994R174R466j1254L2R997l965n46m424n890L715k268J3623J6420
3976A8564o195q596l608r569P83j492J5674O476j2253r730l665R647r369r143
3962b2476n646J8686K0790j476N408J2734o808k7587j304P982J2431k294O07M846
3948A5893n048j2000j97J0907J237j206J228r31n222n291O472q473k1205L483
$$ y = [-5207, 2167, 573, 5227, 8983, 9408, 6444, -8360, -9728, -11665, -9390, -7870, -2998, -12108, -11611, -1833, 3400, -1430, 2379, 15736, 12996, 16561, 11950, 6684, 1873, -3097, -20887, -15093, -11357, -1524, 4619, -11770, -11628, -9541, -10106, -3286, -2682, -9361, -14707, -11581, -8869, -11308, -3138, 8945, 19134, 19628, 6049, -381, 6518, 8082, -8330, -7363, 1392, 2091, -8499, -11315, -2846, -7177, -11649, -23372, -24510, -15516, -6342, 3124, -8130, -8098, 1899, -2066, -2612, -7036, -12926, -9211, -11479, 2144, 18564, 12369, 3773, 165, -9404, -8621, -10113, 5561, 12037, -216, -9946, -13611, -3964, -13333, -22476, -28122, -9436, 11354, 9878, 15286, 28020, 21212, -6375, -7679, 303, 12734, 10440, 11047, 15893, 10845, -1155, -1352, 9555, 10792, 9586, 10814, 9883, 4661, -630, 5842, -2631, -23836, -20353]
3934b0353N225j7921K585J590N177R051J5093Q737q131k598J58p186j260j083
3920a0916Q072M988l018m633N56M467q902m948J5571J5575j6201j7623N069J245
3906a0698J021Q96r294k274K463R597M502O760k542j5101j017l704r42P882N458
3891f993o982K46N276l239j5431p259r070J1318K2750J84L64j1267M112q61r3
3876a6945O228J1364J1635J4339l685m58l347r467q8j3111j8743n253J2594N676
3862i261J7978o88j4671O724Q662o700Q744j0309m746j0360K006J7803Q947r532
3848D597M853J8264J3426r565r816q655o428k518J186J8078N851L115j2213j922
3834A8253o137j1912m993P596O376j3782P310J4450N604n102p20j2532J407K85
$$ y = [-20353, -15128, -33049, -30464, -28874, -23697, -14646, 447, 9184, 1053, -1545, -1387, -8573, -9833, -10916, -2844, 2144, -874, -5507, -4951, -484, -9386, -14334, 1237, 16812, 611, -17012, -11943, -10698, -9677, -8781, -18075, -20349, -17886, -8289, -3787, 2973, 431, -14670, -15687, -19391, -20333, -12451, -6993, -13975, -13729, -8453, -11692, -27123, -34382, -43452, -32134, -9384, -9200, -8836, -20103, -15991, -16852, -16945, -10717, 647, 12282, 26621, 22936, 22478, 19131, 9664, 9576, -3535, -22278, -27531, -14937, -9261, 8717, 8029, -6642, 82, 8744, 2044, 10788, 479, -4267, -14627, -12621, 5182, 14129, 4597, 9450, 27714, 41140, 31575, 21759, 13104, 6676, 4158, 5344, 23422, 29273, 32388, 20175, 18253, 12116, 204, -4789, 2807, 9183, -4599, 2711, 17161, 22765, 17663, 16943, 4411, 5818, 6103]
$$ [...]
##END NTUPLES=NMR SPECTRUM
##END=
