##TITLE=Analysis number 325833
Compound Code cc 21146
Book Reference 483/100/1
Project Code adrs
Chemist Name mattw
##JCAMPDX= 6.0         $$ Bruker NMR JCAMP-DX V2.0
##DATA TYPE= NMR SPECTRUM
##DATA CLASS= NTUPLES
##ORIGIN= Bruker BioSpin GmbH
##OWNER= nmr
$$ XWIN-NMR		Version 3.5
$$ Tue Jan 16 12:16:05 2007 GMT Standard Time (UT+0h)  MAYBRIDGE\nmr@NMR_250MHZ
##.OBSERVE FREQUENCY= 250.131544655141
##.OBSERVE NUCLEUS= ^1H
##.ACQUISITION MODE= SIMULTANEOUS (DQD)
##.ACQUISITION SCHEME= undefined
##.AVERAGES= 16
##.DIGITISER RES= 18
##SPECTROMETER/DATA SYSTEM= dpx250
##.PULSE SEQUENCE= zg30
##.SOLVENT NAME= CDCl3
##.SHIFT REFERENCE= (INTERNAL, CDCl3, 0, 16.4458)
##AUDIT TRAIL= $$ (NUMBER, WHEN, WHO, WHERE, WHAT)
$$ ##TITLE= Audit trail, XWIN-NMR		Version 3.5
$$ ##JCAMPDX= 5.01
$$ ##ORIGIN= Bruker BioSpin GmbH
$$ ##OWNER= nmr
$$ C:\u/data/dgb/nmr/ADRS/1190/pdata/1/auditp.txt
$$ ##AUDIT TRAIL=  $$ (NUMBER, WHEN, WHO, WHERE, WHAT)
(   1,<2007-01-16 12:15:46.85 +000>,<MAYBRIDGE\nmr>,<NMR_250MHZ>,
      <created by zg, POWCHK disabled, PULCHK disabled
       configuration hash MD5:
       49 4B E0 1D 92 C2 6B 37 9F E6 65 BC 52 41 86 1D
       data hash MD5: 64K
       E7 12 18 B4 55 A9 0E 76 A5 D5 65 3A FB CD D4 FA>)
(   2,<2007-01-16 12:15:57.46 +000>,<MAYBRIDGE\nmr>,<NMR_250MHZ>,
      <Start of raw data processing
       ef LB = 0.3 FT_mod = 6 PKNL = 1 SI = 32K 
       data hash MD5: 32K
       DA DC FF F8 14 0C D4 25 12 33 08 50 39 D2 7C 38>)
(   3,<2007-01-16 12:15:59.18 +000>,<MAYBRIDGE\nmr>,<NMR_250MHZ>,
      <apk 
       data hash MD5: 32K
       16 E1 66 ED 9A 6C E3 3C A2 23 B0 53 43 38 7C 0C>)
(   4,<2007-01-16 12:15:59.85 +000>,<MAYBRIDGE\nmr>,<NMR_250MHZ>,
      <abs ABSG = 5 
       data hash MD5: 32K
       95 CD C1 C8 BB 42 0C 4E 59 85 81 63 21 49 6F 8A>)
$$ ##END=
$$ 
$$ hash MD5
$$ D9 A6 EB C8 4E F9 D6 89 8A 5F 64 22 BC C2 5A 4A
##$RELAX= 
##$RELAX= 
##$RELAX= 
##$RELAX= 
##$RELAX= 
##$RELAX= 
##$RELAX= 
$$ Bruker specific parameters
$$ --------------------------
##$DU= <C:\u>
##$EXPNO= 1190
##$NAME= <ADRS>
##$PROCNO= 1
##$TYPE= <nmr>
##$USER= <dgb>
##$AMP= (0..31)
100 100 100 100 100 100 100 100 100 100 100 100 100 100 100 100 100 100 
100 100 100 100 100 100 100 100 100 100 100 100 100 100 
##$AQSEQ= 0
##$AQ_mod= 3
##$AUNM= <au_zg>
##$AUTOPOS= <38 >
##$BF1= 250.13
##$BF2= 250.13
##$BF3= 250.13
##$BF4= 250.13
##$BF5= 500.13
##$BF6= 500.13
##$BF7= 500.13
##$BF8= 500.13
##$BYTORDA= 1
##$CFDGTYP= 0
##$CFRGTYP= 5
##$CHEMSTR= <none>
##$CNST= (0..31)
1 1 145 1 1 1 1 1 1 1 1 1 1 1 1 1 1 1 1 1 1 1 1 1 1 1 1 1 1 1 1 1 
##$CPDPRG= <>
##$CPDPRG1= <>
##$CPDPRG2= <>
##$CPDPRG3= <>
##$CPDPRG4= <mlev>
##$CPDPRG5= <mlev>
##$CPDPRG6= <mlev>
##$CPDPRG7= <mlev>
##$CPDPRG8= <mlev>
##$CPDPRGB= <>
##$CPDPRGT= <>
##$D= (0..31)
0 1 0 0 0 0 0 0 0 0.06 0 0 0 0 0 0 0.0002 0 0 0 0 0 0 0 0 0 0 0 0 0 0 
0 
##$DATE= 1168949745
##$DBL= (0..7)
120 120 120 120 120 120 120 120 
##$DBP= (0..7)
150 150 150 150 150 150 150 150 
##$DBP07= 0
##$DBPNAM0= <>
##$DBPNAM1= <>
$$ [...]
##$SUBNAM7= <"">
##$SUBNAM8= <"">
##$SUBNAM9= <"">
##$SW= 20.6930455092707
##$SWIBOX= (0..15)
0 0 3 0 0 0 0 0 0 0 0 0 0 0 0 0 
##$SW_h= 5175.983436853
##$TD= 65536
##$TD0= 1
##$TE= 294.16
##$TE2= 300
##$TE3= 300
##$TEG= 300
##$TL= (0..7)
0 120 120 120 120 120 120 120 
##$TP= (0..7)
150 150 150 150 150 150 150 150 
##$TP07= 0
##$TPNAME0= <>
##$TPNAME1= <>
##$TPNAME2= <>
##$TPNAME3= <>
##$TPNAME4= <>
##$TPNAME5= <>
##$TPNAME6= <>
##$TPNAME7= <>
##$TPOAL= (0..7)
0.5 0.5 0.5 0.5 0.5 0.5 0.5 0.5 
##$TPOFFS= (0..7)
0 0 0 0 0 0 0 0 
##$TUNHIN= 0
##$TUNHOUT= 0
##$TUNXOUT= 0
##$USERA1= <user>
##$USERA2= <user>
##$USERA3= <user>
##$USERA4= <user>
##$USERA5= <user>
##$V9= 5
##$VALIST= <valist>
##$VCLIST= <CCCCCCCCCCCCCCC>
##$VD= 0
##$VDLIST= <DDDDDDDDDDDDDDD>
##$VPLIST= <PPPPPPPPPPPPPPP>
##$VTLIST= <TTTTTTTTTTTTTTT>
##$WBST= 1024
##$WBSW= 4
##$XGAIN= (0..3)
0 0 0 0 
##$XL= 0
##$YL= 0
##$YMAX_a= 474054
##$YMIN_a= -548779
##$ZGOPTNS= <>
##$ZL1= 120
##$ZL2= 120
##$ZL3= 120
##$ZL4= 120
##$ABSF1= 16.4458
##$ABSF2= -4.247372
##$ABSG= 5
##$ABSL= 3
##$ALPHA= 0
##$AQORDER= 0
##$ASSFAC= 0
##$ASSFACI= 0
##$ASSFACX= 0
##$ASSWID= 0
##$AUNMP= <proc_1d>
##$AZFE= 0.1
##$AZFW= 0.1
##$BCFW= 0
##$BC_mod= 0
##$BYTORDP= 0
##$COROFFS= 0
##$CY= 12.5
##$DATMOD= 1
##$DC= 0
##$DFILT= <>
##$DTYPP= 0
##$F1P= 14.0000005364418
##$F2P= -0.99999901652339
##$FCOR= 0.5
##$FTSIZE= 32768
##$FT_mod= 6
##$GAMMA= 0
##$GB= 0
##$INTBC= 1
##$INTSCL= 1
##$ISEN= 128
##$LB= 0.3
##$LEV0= 0
##$LPBIN= 0
##$MAXI= 10000
##$MC2= 0
##$MEAN= 0
##$ME_mod= 0
##$MI= 0
##$NCOEF= 0
##$NC_proc= -3
##$NLEV= 6
##$NOISF1= 0
##$NOISF2= 0
##$NSP= 0
##$NTH_PI= 0
##$NZP= 0
##$OFFSET= 16.4458
##$PC= 1
##$PHC0= 228.4611
##$PHC1= 4.970908
##$PH_mod= 1
##$PKNL= yes
##$PPARMOD= 0
##$PSCAL= 4
##$PSIGN= 0
##$REVERSE= no
##$SF= 250.130019059644
##$SI= 32768
##$SIGF1= 0
##$SIGF2= 0
##$SINO= 400
##$SIOLD= 32768
##$SREGLST= <1H.CDCl3>
##$SSB= 0
##$STSI= 32768
##$STSR= 0
##$SW_p= 5175.98343685301
##$SYMM= 0
##$S_DEV= 0
##$TDeff= 65536
##$TDoff= 0
##$TI= <Analysis number 999999
Compound Code 99
Book Reference 9
Project Code 9>
##$TILT= no
##$TM1= 0
##$TM2= 0
##$TOPLEV= 0
##$USERP1= <user>
##$USERP2= <user>
##$USERP3= <user>
##$USERP4= <user>
##$USERP5= <user>
##$WDW= 1
##$XDIM= 32768
##$YMAX_p= 369492594
##$YMIN_p= -57810
$$ End of Bruker specific parameters
$$ ---------------------------------
##NTUPLES= NMR SPECTRUM
##VAR_NAME=  FREQUENCY,     SPECTRUM/REAL,   SPECTRUM/IMAG
##SYMBOL=    X,             R,               I
##VAR_TYPE=  INDEPENDENT,   DEPENDENT,       DEPENDENT
##VAR_FORM=  AFFN,          ASDF,            ASDF
##VAR_DIM=   32768,         32768,           32768
##UNITS=     HZ,            ARBITRARY UNITS, ARBITRARY UNITS
##FACTOR=    0.157963299565203, 1,           1
##FIRST=     4113.58846286517, 0,            0
##LAST=      -1062.39497398784, 0,           0
##MIN=       -1062.39497398784, -57810,      0
##MAX=       4113.58846286517, 369492594,    0
$$ Real data points
##PAGE= N=1
##DATA TABLE= (X++(R..R)), XYDATA
$$ [...]
16748F237N585Q23m355o559M781J7911j944k0001j1431j601J3838K833L690R892
16734A9699O424P7k523m796j0991J4741R837o774j1372q514m469N465O670M60
16720A3934j0883K307J0172L140j15o768j2822j839R202J055n164k935o445P158
16706co88j3280k474l057J3320J5681m618k859n531n629N953o686j8206j6726
16692d4803L810J2752P371M512j736O568O955m872m621l776O619q749r863n635
16678c5468Q924O874R25l31j23Q378L483N698O958O283N251N503N044n38n87q629
16662A7645O561J4082j0800j304R60j1796K163J292j9692p562Q814J0734J4284
16649B5381j6692l738K893j1494o653p579P473J7883J875j0160o12R605N842L729
$$ y = [6237, 11822, 12645, 8290, 1731, 6512, 24423, 22479, 2478, -8953, -10554, 3284, 6117, 9807, 19699, 26123, 26200, 23677, 18881, 7890, 22631, 32468, 25694, 14322, 5808, 1339, 6804, 13474, 13934, 3051, 5358, 15530, 18670, 18555, 11787, -1035, -2874, 6328, 7383, 2219, -716, -7161, -3, -691, -13971, -16445, -19502, -6182, 9499, 4881, 2022, -3509, -9138, -3185, -9871, -28077, -44803, -40993, -28241, -20870, -16358, -18094, -11526, -4571, -9443, -14064, -17840, -11221, -19970, -29833, -35468, -26544, -19670, -18745, -19076, -19199, -10821, -7338, -1640, 5318, 11601, 16852, 22355, 27399, 26861, 26274, 17645, 24206, 38288, 27488, 26184, 27144, 15348, 17511, 18803, -889, -8451, 363, 11097, 25381, 8689, 4951, 7844, -3650, -10303, -17882, -10409, 7474, 9349, -811, -1423, 8182, 14024, 17753]
16635A7753q089l70l389p965o256L332r010O061R945P191L627m452O711l124m74
16620A1491m135P63o687j7856j4512K2016J6043m413j6105J547R181o44j8679
16607b1990p899K6821J1377j058j9529k695M124J0332J6634J804J4088L0j8530
16594A3509r748N458n941o582l810Q053r662m380J923R089K469j496P680N342
16580A1904o4j0335j531N999j0742j6801K199O246J2054J1415j2747j7466J6827
16567c042J4659o145j0927J1059J130q528L497L414p817K0813n97p349j08j4010
16553c951K084O977l047P141Q677R482o858Q804j1352l643J2088p874k3937l468
16539h877p305j4404P794J4131l43L518K823P081k476O82M856P342R054j2427
$$ y = [17753, 9664, 9294, 5905, -2060, -8316, -4984, -13994, -7933, 2012, 9203, 12830, 8378, 15089, 11965, 11491, 7356, 8119, 1432, -16424, -30936, -8920, 7123, 2710, -13395, -11848, -2667, -3311, -21990, -29889, -3068, 8309, 7251, -12278, -14973, -10849, -517, 16117, 17921, 32009, 32039, 13509, 3761, 9219, 3278, -3304, -7114, 939, -8723, -13103, -11180, -2091, 378, -1118, 6562, 11904, 11840, 1505, -26, 5973, -4769, -21570, -19371, -13125, -1071, 10344, -2403, -19869, -3042, 11617, 5472, -5455, 5604, 6734, -1794, 1703, 5117, -2700, 18113, 17516, 10167, 10059, -3951, -1867, 5110, 2063, 9204, 17881, 27363, 20505, 29309, 17957, 14314, 26402, 18528, -5409, -8877, -16182, -30586, -22792, -8661, -9004, -5486, -2663, 4418, 1942, 2624, 7480, 14822, 23876, 11449]
16525A1449r189L376Q059L428j7679k3330K568R408k659Q146l803Q294P576L183
16511H827K517r421M694m991k0721J0242N63N401n142J5225j298k1910q421L37
16497b4098Q399L071L040J1820Q743K63N718P501j1543j2635J469j0917j6532
16484b5701L000N163k122M792J4759J6227k195J256j317l389R37J955j9437O108
16470C6K2949L250j1258k782Q275n761p456Q213j3001j2879j178p901l356N565
16456a7284O782J750Q095N761m197L996j4819J60J5013Q431m978k608O865k513
16442A0454m023M217P0J987o470O72J348j094O598J2617m091m155j3895j2359
16428h124J1953l637K72O825P529j2991o217r926n495P294J5963L616P242O55
$$ y = [11449, 2260, 5636, 13695, 17123, -556, -23886, -21318, -11910, -14569, -6423, -10226, -1932, 5644, 8827, 11344, 1923, 6617, 1626, -19095, -8853, -8290, -2889, -8031, 7194, 5896, -16014, -24435, -24098, -15699, -12628, -9588, 2232, 10975, 11238, 16956, 24457, 12914, 279, 1748, -9169, -25701, -22701, -17538, -19660, -14868, -109, 16118, 13923, 15179, 13862, 10473, 11410, 13365, -6072, 36, 22985, 26235, 14977, 12195, 20470, 14709, 7253, 15466, 2465, -10414, -11592, -19493, -22849, -17284, -10502, -8752, -657, 5104, 907, 4903, -9916, -9756, 5257, 13688, 8710, 6102, 12967, 10454, 6431, 10648, 10718, 12705, 6235, 6907, 8255, 7161, 13759, 26376, 22285, 18130, 4235, -8124, 3829, 192, 464, 7289, 14818, 1827, -4390, -14316, -19811, -12517, 3446, 7062, 14304, 14959]
16414A4959J2130j1531j4746K350K653Q060Q962k135L174r958o995J1000j4354
16401C569o087M814m515P967k946R104L670n341j1501M529K734J378r062P579
16387E892m736K835J120j0379m373j4267o119O501K0736N353m107j2341m625J313
16373a7197J971K481K2678J2017K708j0069j3510l882M394P065p97p487q214n096
16359a2938J0827K1185Q115j1585j1428o7j7546j211Q526P702Q689j5358q412
16346a3501N89L139K075r081p48J1988m218J730M619r774O368Q159K476p136M011
16331F96O534j60J1947J52j7443j6914P256k359o002J1195J2646j3151P930J0292
16317A2619j5076k600J0580n559P116O499l605L729Q503J2953j82p110J277O127
$$ y = [14959, 27089, 15558, 812, 3162, 5815, 13875, 22837, 20702, 23876, 13918, 6923, 17923, 3569, -2518, 2296, -2219, 5748, 2802, 11906, 15576, 10235, -1266, 3263, 5997, 7375, -1687, 5892, 1156, 3991, 5111, -5268, -9641, -23908, -30027, -23526, -2790, 2563, -1544, -13885, -18510, -17197, -15226, -12745, 9933, 21950, 24658, 14589, 1079, -2803, 1591, 8656, 7859, 372, -7842, -12938, -2111, 19074, 27189, 15604, 4176, 4109, -13437, -14648, -6122, 1580, 10269, -5089, -13501, -12912, -9773, -7698, -16779, -17527, -5539, -9757, -8027, -3408, -13182, -6814, 1345, 3821, -3315, 696, 7230, 7070, 19017, 19169, 1726, -15188, -7932, -10291, -16293, -5098, 7548, -5603, 2327, 12619, -2457, -5057, 5523, -36, 7080, 13579, 9974, 13703, 22206, 35159, 34977, 27867, 29144, 35271]
16303C5271K09j2170q412N778n592q798j2454O179J1522P009n639q721R900L935
16289A8017k38l876O752L305j218l444n996p217l07o124q230Q800J1061L347r725
16274D907j666J370p740J1393J3859n386j4906j6844Q201J2430j347p257q94M281
16260D01J3078J0570o837j7215j203J9766l799r381p090j3495L690J3904J2148
16247A4537J0945J237p711j3727N84j0875n995J3343J0699j0559L116J4908L361
16234B3863l507j0624k478k3463j6605M28N208M010K3215O188j0517m585J0746
16221A879K423O016O699J1726K608p666j0048M150n221o031M986K952l103q211
16207C159P984N758n848j0297N25K414k066j1106L496j355r712J947k436k333
$$ y = [35271, 35480, 23310, 14898, 20676, 15084, 6286, -6168, 11, 11533, 18542, 12903, 4182, 14082, 18017, 17779, 13903, 20655, 23960, 22742, 19298, 13302, 6085, 5778, -346, -8576, 224, 11285, 14632, 4907, 3241, 4611, -3129, 8264, 22123, 16737, 1831, -15013, -6812, 5618, 4271, -2986, -3880, 401, 13479, 24049, 17212, -3, -1206, 18560, 14761, 5380, -1710, -15205, -11515, 2389, 14537, 25482, 26719, 19008, 5281, 5865, -5010, -11005, 2338, 13037, 2478, 5594, 20502, 23863, 20356, 9732, 7254, -16209, -32814, -32386, -27178, -23168, 47, 6235, -4282, -8867, 1879, 4302, 10318, 17017, 28743, 31351, 23685, 13637, 17787, 12566, 6535, 11521, 14473, 11370, 3159, 11143, 16901, 11053, 756, 1281, 3695, 1629, -9477, -5981, -7336, -17048, -15101, -17537, -19870]
16193a9870O065j71j1461l203J5367L601o71J741O761J3285j4688j2598K0827
16180D985N174K578P578O164j2864l673J595n104m475K697k904j4652j950J2284
16166b567M308j1231J070J4958L592o173j4169p121P119N805J271j3647j0980
16153b7765L560J3551p094N299j039J2206J0991N521o19N355m951n003r530n393
16139d911m079M79l479O24M090M326K058p924J4854k172p872p192j598L424m362
16124a3734K643J3653M429r43k069N010N087N479n452k3199j1158Q178L015K733
16110f328J4911Q873J21r733j6508J29P851k551J2216J7087J5797q147j8652j6911
16096a845R465J4805j6058j5095j1404J3136J9136M30M41o196k2439n493J8827
$$ y = [-19870, -13805, -13976, -25437, -28640, -13273, -9672, -10343, -8602, -1841, 11444, -3244, -15842, 4985, 10159, 12737, 20315, 26479, 13615, 9942, 11537, 6433, 1958, 4655, 1751, -12901, -14851, -2567, 1741, -9490, -8420, 6538, 10130, 3957, -10212, -17333, -10214, -4409, -3138, -16785, -27765, -24205, -10654, -17748, -12449, -13488, -1282, 9709, 15230, 14611, 19966, 15015, 10012, 482, -4911, -8990, -8511, -11990, -11366, -7276, -2950, -892, -8816, 6038, 3866, -4006, -11198, -12796, -9372, -13734, -11091, 2562, 6991, 6048, 3979, 8989, 14076, 19555, 14103, -9096, -20254, -12076, -9061, -6328, 8583, 17456, 17577, 7844, -8664, -8535, -684, -3235, 8981, 26068, 41865, 33718, 15066, -1845, 7620, 22425, 6367, -8728, -20132, -6996, 12140, 12570, 13011, 6815, -15624, -21117, -2290]
16083b290J5979n006q559l592N756P101O272O659j0069m661j0007l967J5428o749
16069B295r766O429J1125N3J2723l294j0631p313q31k106K143K483m827j2499
16055a4016j479J2550n000n890J2734j424L659n805P118J0421J1891L895J531
16042C0185j0608P818r073j2123q928L18N830M612L957M548j8746j627N393J479
16028C035j575k453j0762j50L916J9982m024j903J2008j5M065k826r285p800l338
16013a125M963j1131p500P03K908N856N24j5674j20J0979J109j6120O179R989
15999h460l279J0778J2888k898j4035J2705J5268J810j4930n168j0374j330K61
15986f764J5254J4623l626j4950l796K642j167l843J618n856o087K769R227K667
$$ y = [-2290, 13689, 8683, 124, -3468, 2288, 9389, 15661, 22320, 12251, 7590, -2417, -6384, 9044, 2295, -7471, -1042, 10083, 10136, 22859, 19565, 8934, 1621, 790, -1316, 827, 3310, -1517, -14016, -15495, -2945, -7945, -13835, -1101, -2525, 1134, -4671, 2447, 12868, 24759, 28654, 30185, 19577, 27395, 18322, 6199, -2729, -2411, 3419, 8031, 11988, 16536, -2210, -3837, 1556, 3035, 1460, -993, -11755, -11905, -7989, 11993, 7969, 6066, 18074, 18059, 22124, 19298, 10013, 2213, -1125, 3838, -7293, -14793, -14090, -11182, -5326, -4802, -20476, -20596, -9617, -8508, -24628, -18449, -8460, -11739, -961, 11927, 9029, -5006, 7699, 22967, 24777, 9847, 4679, -5695, -7025, -6764, 8490, 23113, 19487, 4537, 741, 3383, 2216, -1627, -9, -5865, -11952, -9183, 44, 2711]
15972B711N586O721j0311j4145M521L817p006k692M222o474N81J0151J1869K984
15958A2535o832j3563l535m654M183J4739K588J297J2043n08n869N446m488k742
15944A0640l105j2359P001k422Q594R606k17L87j765M544p896J7225M351k408
15930C2176M039J780l656m64j4028o882M84O856l686o18j0696J4255L057r303
15916A3314J4168k792j3898j0250n189o189p738q179J1975K357M573J4450L905
15903A0507P168j0316m452R888j801O04j0851n740K919J6646m573n315O165N413
15889A6262o45j789j3950m351L956O387l77J019P11m427o874M101J4295m780j3637
15874d099j1518Q209k562Q020M779n139k584j950k214J1537P458m358O074j798
$$ y = [2711, 8297, 15018, 4707, -9438, -4917, -1100, -8106, -10798, -6576, -13050, -12469, -2318, 9551, 12535, 5703, -7860, -11395, -16049, -11866, 2873, 5461, 6758, 18801, 18293, 12424, 17870, 13382, 10640, 7535, -4824, 2177, -245, 8349, 17955, 17738, 18125, 16360, 20904, 13008, 30233, 34584, 32176, 36215, 37995, 34339, 33875, 19847, 12965, 13449, 20305, 16619, 16001, 5305, 19560, 22617, 13314, 27482, 24690, 10792, 542, -4647, -10836, -18574, -26753, -14778, -12421, -7848, 6602, 10507, 17675, 7359, 2907, 12795, 10994, 11598, 747, -4993, -2074, 14572, 9999, 4684, 10849, 16262, 15617, 13828, -122, -4473, -517, 5870, 5493, 6512, 7223, 2796, -4078, 23, 14318, 9538, -4099, -15617, -7408, -9970, -1950, 2829, -2310, -4894, -6844, -9058, 2479, 9937, 5579, 11653, 9855]
15860I855p398j3866m542L335J3404J4229q193o495j0985o758Q679N561N31J8578
15846A5935n488k578J787k844P283J707P856j1610r183o807Q764O100j6542N046
15832e74N082J022j1077l355O041L091J1511J42P527j0444K952R44J001P67j9560
15817d930m015M348p710N204Q916o232m256J04P412n317L447M985p598j2331L842
15802a4131R693J1878n18m280j6033J4723m990j1349R775K1059M294n977n730
15789H414J352M465n029m818P497r845M806P216n905n088k589k451L445n657J189
15774b998J2412K525r830M959N995j54j567j270N765k919m676n61q452M48J2750
15759A2427P466j1791r186k1929R712J2172k00j2636J350R962m382M84j0550J058
$$ y = [9855, 2457, -11409, -15951, -12616, 788, 15017, 6824, 329, -10656, -17414, -8735, -3174, -2643, 15935, 10447, 7869, 9656, 6812, 14095, 15802, 23658, 12048, 2865, -3942, 4822, 10922, -5620, -574, 4508, 5530, -5547, -8902, -2861, 230, 11741, 11883, 19410, 8966, 11918, 12862, 13863, 14630, -4930, -8945, -4597, -12307, -7103, 1813, -4419, -8675, -8571, -1159, -6476, -3029, 1956, -5642, -17973, -14131, -4438, 7440, 6922, 2642, -13391, 1332, -3658, -15007, -5232, 15827, 20121, 14144, 8414, 9766, 14231, 9202, 4384, 11881, 2036, 6842, 14058, 8153, 3065, 476, -1975, 1470, -4187, -2998, 9414, 11939, 2109, 7068, 13063, 12909, 11342, 10072, 15837, 12918, 8242, 7681, -771, -323, 12427, 19893, 8102, -1084, -23013, -13301, -1129, -1329, -13965, -12615, -2653, -7035, -6551, -17101, -16043]
15745a6043J8852l310o914J771p81R621r516l09P046o968p880K087J765M968n094
15730a0705M333K402Q726M959q978j0126M081R085N300n058j0476P148O165j0823
15716c967l969J1760N828j1511r954O423j224Q991l93r75p151J447O605J3363
15702A5273n202o507L601K308O458q907j8894R38L595o750m760J4339L478o391
15688g421K510o963L421O817J4991l634j1391n454l828o399J0062J8730J675m695
15674H421L131Q302m521K1520m483k1563q207J0653p340K953J1513j0122q301
15661A956L832P843K52n003o380o766p058k417n986n405L968J6948N673j629L304
15646C132l157r11o113o066J2081J6914q338N511J1371l732j0854n375m556R941
$$ y = [-16043, 2809, -501, -7415, -5644, -6425, 3196, -6320, -6629, 417, -6551, -14431, -12344, -10579, -5611, -10705, -6372, -3970, 4756, 9715, 737, -9389, -5308, 3777, 9077, 4019, -6457, 691, 6856, -3967, -7936, 3824, 9652, -1859, -11813, -5390, -6614, 2377, 1984, 1009, -6142, -4695, 1910, 15273, 10071, 3564, 7165, 9473, 15931, 7024, -11870, -10932, -7337, -14087, -18847, -4508, -1030, -7421, -4911, -11874, -8453, -1636, 13355, 9721, -1670, -7124, -10952, -17351, -7289, 11441, 13116, 8421, 11552, 19854, 15333, 36853, 32370, 10807, 2600, 13253, 5913, 8866, 20379, 10257, 1956, 5788, 13631, 13883, 8880, 2500, -4266, -11324, -13741, -19727, -25132, -21164, -4216, 1457, -172, 3132, -25, -936, -7049, -13115, -1034, 15880, 7542, 13053, 24424, 20692, 9838, 4463, -93, 9848]
15632I848j73N61k745q581N686N626P029n628p390r020r946K877O094l270J621
15617g411R151k466q655j3505K23O502O751k023r226L688J4823J412N149n827
15603a414j2647j3568j190J830J0205r55J91J0725N157k353M645N484J674j8187
15589a0403l214q19K531J0815n286K058J314J8441J1590j7615J368j574r409R256
15575I053J0328k3312m275R067j0919n227Q010O706O066L892r774j0919l194K304
15561a2194L617R018J213J44o881J5092R581k023q666j0805j6052M824N227n650
15547a3555L968N417j0580j0957P886r61n81L112j373k993O182j252J2096P880
15533D289o043q893l991n15L083J4512P636N663Q511j7159j5951L620p3j4993
$$ y = [9848, 9675, 10236, 7491, -1090, 4596, 10222, 17251, 11623, 4233, -4787, -14733, -11856, -5762, -9032, -7411, 1740, -726, -9381, -22886, -22663, -16161, -9410, -11433, -20659, -16971, -2148, -736, 4413, -1414, -14061, -27629, -28819, -26989, -16784, -17739, -17548, -6823, -1666, -4019, 626, 6110, 7784, -10403, -13617, -14436, -11905, -1090, -6376, -4318, -3004, 15437, 27027, 9412, 10780, 9206, -203, 9053, 19381, -3931, -8206, 861, -10058, -15285, -7275, -569, 5497, 9389, -385, -11304, -14498, -12194, -8577, 441, 1654, 1798, -5083, 10009, 19590, 17567, 8901, -1904, -17956, -13132, -7905, -13555, -9587, -4170, -14750, -25707, -17821, -18782, -19363, -16251, -17624, -20617, -14435, -15687, -3591, 4289, -1754, -10647, -14638, -15153, -12070, 2442, 10078, 15741, 24252, 7093, -8858, -5238, -5311, -20304]
15519b0304K946N682Q539r713j0124p644q448J876J5843L454o250n150J1158J5228
15505b907J449n188m027k897k525K535M042k38O629p069Q448O205l065j708J3623
15490A3307m703k0912j6874j386M25K434j195R182Q214N330r827N943M389j0257
15476a5930m867L016n412Q25N340M176Q140J0879Q935n71r344j8117m82R601m727
15461h538j2601n448N959l526m78n23m279q211n248N878J0059R791k049N379M454
15446i381M003J1571J5051j0803Q782R161J19J580r139j3288M177P931j750n147
15432A2867R24N908m535j1683l260K5220M855j8443j0698k928k772L600J522O335
15418F912J827P95J0359j1124j2159k96j5751j391L829P433j3359J906R575M955
$$ y = [-20304, -17358, -11676, -3137, -12850, -22974, -30618, -39066, -37190, -21347, -17893, -24143, -29293, -18135, -2907, -1458, -6646, -10673, -13570, -16095, -13560, -9518, -9756, -3127, -10196, -1748, 4457, 1392, -316, 13307, 8604, -12308, -29182, -30568, -30143, -27709, -28904, -19722, -11508, -6178, -16005, -10062, -5673, -15930, -20797, -17781, -23193, -22368, -17028, -12852, -4712, 6167, 15102, 14531, 5187, -12930, -13412, -3811, -8538, -21139, -26587, -20628, -24154, -24632, -25155, -29434, -37645, -42893, -37015, -26956, -17165, -19214, -13835, -9381, -5378, 6193, 21244, 10441, 19223, 28384, 28503, 30083, 20944, 7656, 11833, 19764, 18014, 12867, 13791, 19699, 15164, 3481, 221, 25441, 30296, 11853, 1155, -1773, -4545, -945, 577, 6912, 8739, 9534, 19893, 8769, -3390, -3686, -19437, -20828, -16999, -9566, -22925, -21019, -11444, -6489]
15404f489n191p783L923M288j162L272J3355J8689M92m693p81m111j6518p694
15390a0403m610j1900Q532Q923p198K088J4251j0587O894L852n388n838p896P004
15376a2276P775j396R997M934p116l466o482J3798J3285J206j260O04k849l499
15362A3255L962j5348O53L821J350j513M224q069j721L424m313p045j3580r414
15348c0314m225J7825Q004K743J556J1227n218o389R794m993j4015o212J7030
15335c187J6668r954l270J513q647q319N33o429O256j323n079P81p879k11J4491
15320a4056m409Q227Q217j6645m764r10Q157l23q420J3719K354n139J5289J222
15306B519J2050L639q045O380KN01j1797o439O884j2629L272K165J641K799O755
$$ y = [-6489, -11680, -19463, -15540, -11252, -12414, -9142, 4213, 22902, 23394, 18701, 17920, 13809, -2709, -10403, -15013, -26913, -18381, -9458, -16656, -14568, -317, -10904, -4010, -158, -5546, -11384, -19280, -12276, -4501, -5897, 4100, 9034, 1918, -1548, -8030, 5768, 19053, 20259, 18999, 19603, 16754, 13255, 17217, 1869, 2522, 6343, 7693, 6180, 10404, 2335, 614, 4038, -275, -7320, -20900, -30314, -34539, -16714, -8710, -5967, -4411, 6816, 1598, -4791, 5003, 10, -14005, -20217, -3187, 13481, 3527, 257, 1770, -6877, -15196, -14663, -21092, -14836, -16159, -21238, -20457, -28336, -28547, -14056, -18465, -10238, -2021, -18666, -23430, -24340, -16183, -16506, -24926, -11207, -8853, -13992, 1297, 2519, 14569, 18208, 10163, 16543, 16545, 17046, 5249, -1190, 5694, -6935, -3663, -1498, 143, 2942, 9697]
15291I697L577O17p093j0309q865l039J1482k065r869Q325M934N133J292p259
15277c442K15j2159K243J3933m396r820R154K1195K07r739N780j1485P333J2290
15263B1309n520j516o48j0014j3639K068K3818J1660k0553j5674P811j602r878
15250a2378n791P837J5726J1743m577n159M679R719p95o909k4428q187m432K644
15236b0308J444O900j7750j0853o70R247O525L184j1519P592J1075J2070p553
15223a0616L159K5185j691j5048r135N236J0515Q111m81k0275j1378p999J3878
15210a0539j549N385N709Q232K415J861M600m808k3169o423R929R475J641m748
15196a989p294l374L266O54l659J1912P149q526k686p198m406J4345N520L981
$$ y = [9697, 13274, 13891, 6798, -3511, -12376, -15415, -3933, -5998, -15867, -7542, -2608, 2525, 3817, -3442, -3227, -15386, -13143, 790, -3606, -13426, -4272, 16923, 17130, 7391, 13171, 1686, 9019, 21309, 15789, 14273, 13625, 3611, -10028, -7960, 15858, 27518, 6965, -8709, -898, -2500, -12378, -18169, -10332, 5394, 17137, 12560, 7401, 12080, 21799, 21004, 14095, -10333, -18520, -22952, -20308, -18864, -11964, -29714, -40567, -41237, -31990, -25465, -22281, -33800, -26208, -15133, -3063, -10616, -7457, 17728, 16037, 989, -8146, -2910, 7605, 15716, 15235, -5040, -16418, -24417, -10539, -12088, -6703, -994, 7238, 9653, 11514, 16114, 11306, -11863, -18286, -8357, 1118, 2759, -1989, -9283, -12657, -9391, -8737, -12396, -484, 6665, -1861, -4547, -11745, -16151, -1806, 3714, 7695]
15182G695K208m371q986r406k626P403K779m854m686J2579O966j686M389K039
15168I443j0952r559P47j048P028P869P982m382p236o267q52j7956l010J3175
15154a5018p09l447j0323J217q94K770p42L437J2089l191N345Q370K642J1474
15140A3020o014j7393J22M56j3280O131l60J0250n739O330J2888N347j0678j6778
15126a5698L167N153o600J867l383j386o699J3611J206N727K0264O336m036j5696
15112C833N97l626j2094j180J514n012O964k93o954m793J1305L822r328j131k80
15097a6656O222J771J3991R46j76j499k538n380k697o03J084J0664R836J4939
15083B9904m232n838K132k5513k6204n091K3590K6355J0499K858j4001K785r585
$$ y = [7695, 9903, 5532, -3454, -12860, -15486, -8083, -5304, -10158, -14844, -2265, 4701, 3015, 7404, 9443, -1509, -11068, -10321, -11369, -4341, 3528, 11510, 7128, -108, -6375, -7227, -25183, -28193, -15018, -15727, -19174, -29497, -28280, -29174, -26404, -27146, -23709, -11620, -14811, -9466, -1096, 1546, 13020, 7006, -10387, -10265, -9809, -23089, -16958, -17318, -7068, -12807, -6477, 6411, 11758, 1080, -15698, -12531, -7378, -13978, -12111, -15494, -16880, -23579, -9968, -8762, -3035, 17229, 23565, 19529, 3833, 4430, 804, -11290, -12470, -10956, -15968, -9004, -9297, -16251, -21044, -9739, -5917, -15245, -16376, -16656, -10434, -8663, 5328, 6274, 6098, 4599, 2061, -3319, -6016, -6619, -5535, 5129, 14965, 29904, 25672, 19834, 21966, -3547, -29751, -34842, -11252, 15103, 25602, 28460, 14459, 17244, 7659]
15070G659j2805Q20k845j1314P084J0207P650M868j2597L42K685j5141P691J0257
15056D561k985J6201L823r034l723l667R647R39k441J164j0462q808n494p06O777
15041d208Q035O796p629m598l467k499J2542J3845l549j2892m409p650q53n452
15027a5988l826O663M419l772j2526J2290O467o019j6077N919r77M977L728K267
15013a2455L752j732K063N315j6190j1752L269J633K919P676Q859r283n93O298
14999a0221j414L314n238l339L162q853M175j987L176P430N488N697l691m296
14985f597r45j2433L365J2414N146m916n540J623P213p754j579J1150Q756p028
14971B875J960j33m193J2821q562k083j497r291j818M004J5696L331j487j7676
$$ y = [7659, -5146, -4326, -7171, -18485, -11401, -1194, 6456, 11324, -1273, -931, 1754, -13387, -5696, 4561, 1576, 17777, 21600, 12566, 8843, 5176, 14823, 15762, 13321, 14485, 4023, -4785, -10279, -10985, -4208, 3827, 10623, 2994, -1604, -5071, -7570, 4972, 18817, 15268, 2376, -2033, -9683, -10536, -15988, -19814, -13151, -8732, -12504, -25030, -12740, -6273, -12292, -28369, -22450, -23427, -18450, -14722, -12455, -8703, -10435, -8372, -3057, -19247, -30999, -27730, -26097, -23178, -15502, -6643, -15926, -16519, -10221, -11635, -8321, -13559, -16898, -13736, -22589, -18414, -20401, -17225, -9795, -4307, 1390, -2301, -6597, -7542, -19975, -16610, -4196, 950, -3966, -9506, -7883, -670, -8424, -10003, 1147, 9903, 2875, 4835, 4702, 509, 13330, 4768, 2685, 1188, -8103, -9921, -5917, 9779, 13110, 11623, -6053]
14957f053L852N960q552j5300J583J4135K361K760K59k964j168J0579K459j3062
14943c151l824R756o418o961j5698j5427L410R93J4296K3099P493J087n838p101
14929d284K529N244K447K409j6741M253Q55M045M920m535j4179J1474q15J617
14915g61J0851n453r75l452o175q980n396R363J4498m278J747j403q83k130J805
14900a622j5389j915J1953J4137j0197k89J4517p331p407j5963j793J1229j1103
14887b1173l731L618j0007j2749Q959J6611l186K215K401K354M413p501Q438j546
14873a0884q022k884L690Q551J4282P94p079P651m078K792J0483j314j0845l748
14859f11J459p829j1800p576L044P744M331o032P052J8026L821l244j172j2726
$$ y = [-6053, -2201, 3759, -4793, -20093, -18510, -4375, -2014, 746, 1005, -1959, -3127, 7452, 9911, -3151, -6975, 2781, -3637, -10598, -26296, -41723, -38313, -37320, -23024, 75, 7568, 8655, 2817, -4284, -1755, 3489, 5936, 8345, -8396, -4143, -3288, 757, 5677, 1142, -13037, -1563, -2378, -761, 10090, 4637, 3662, 210, -5965, -14945, -20341, -10978, 3520, -758, 989, -414, -1297, -3427, -1622, -17011, -18926, -6973, 7164, -3033, -3322, 11195, 3864, -3543, -19506, -21299, -10070, -21173, -24904, -21286, -31293, -44042, -35083, -18472, -21658, -19443, -17042, -14688, -10275, -17776, -9338, -10884, -18906, -21790, -18100, -9549, 4733, 5527, -1552, 6099, 2021, 4813, 15296, 13982, 3137, -611, 848, -6981, -18781, -26357, -23313, -15569, -11238, -17270, -10218, 7808, 11629, 8385, 7213, -5513]
14845e513m51n796j3459l041J3005o710j213K1473J4202m852o612p783q732R821
14831e661J8499j1324m864O066m032K90N810o620p760j5637q473J2582R355n044
14817a6813O676R717R688k350J396Q52p606j3666n257J4155P20N881j0405j3793
14803b0805J1087K954j2455K93R136Q586k767j458n072p521K991p25j5279M60
14789c0575K7702J2012j5386j5139J601J4932Q774K684q211q476N396m396m362
14776a3444J521n586m776O129N319J0782j1440j2961J4304J3785j2527J042o308
14763a4160N936J2935L784O888o453n108J2864M570q789j7361j397j2877J63R404
14749i601k087P567J0968N538p861r570M758J3990j1806j1485q321k908K30R236
$$ y = [-5513, -5964, -11760, -25219, -28260, -15255, -21965, -23178, -1705, 12497, 7645, 1033, -6750, -15482, -5661, 12838, 1514, -3350, 2716, -1316, -1026, 4784, -1836, -9596, -25233, -33706, -21124, -11769, -16813, -10137, -420, 9268, 6918, 8314, 9166, 1560, -12106, -17363, -3208, -2488, 3393, -7012, -20805, -9718, -6764, -19219, -18926, -9790, -1204, -3971, -5429, -10501, -18022, -15031, -15756, -31035, -30575, -2873, 9139, -6247, -21386, -19785, -4853, 3921, 6605, -1606, -10082, -4686, -9082, -13444, -11923, -17509, -22285, -16156, -10837, -55, -11495, -24456, -10152, 3633, -8894, -7852, -14160, -8224, 4711, 8495, 15383, 8930, 3822, 16686, 21256, 12467, -4894, -6291, -19168, -19005, -9601, -11688, -4121, 6847, 12385, 4524, -5046, -288, 13702, 1896, -9589, -17910, -20818, -20588, -11352]
14735a1352O965o219j2843j1090Q77J0859P700J6612r950k408R227m505j6886
14722b3013P817K0495J0605o118l697o393k626j2433k245j959r11J604J597N099
14708a2178l793O050R262J0093J369o376N093J44m489K160m654q987l43j802L558
14693d893K052p481o490n101J430j467R261J796M232k75J061q327j2067j339k59
14678b7867o718L707Q827P598J5147j2251n64l59q527K378r307q881k820N859
14664c3778R525j1240Q315K0653j314O580Q238j0095j3369J3670M620O325N375
14651A3505K264k553P412l911j1329j5193J333j430j5162Q844J7126O212j4309
14638g191r536K0698M549n571L392p433R972j191o576J979q723l327m096j2365
$$ y = [-11352, -4387, -10606, -23449, -34539, -33662, -22803, -15103, 1509, -8441, -10849, -1622, -6127, -23013, -15196, 5299, 15904, 9786, 6089, -304, -2930, -15363, -17608, -19567, -20478, -18874, -17277, -12178, -15971, -9921, -659, 9434, 10803, 4427, 9520, 9664, 5175, 7335, 2681, -6306, -6649, -8451, -4893, -2841, -10322, -16812, -21913, -20483, -21950, -12689, -10893, -6661, -6936, -5875, -14202, -26269, -27608, -27867, -34585, -30878, -22051, -14453, 694, -11557, -12121, -12480, -21007, -18629, -27936, -36817, -39637, -33778, -24253, -35493, -27178, -6525, -7839, -1259, 6979, -3116, -16485, -2815, 1805, 8130, 13505, 15769, 13216, 20628, 16717, 5388, -9805, -8472, -9902, -25064, -16220, 906, 7118, -7191, -16727, 3971, 8520, 2949, 6341, -1092, 8880, 7689, 1113, 3092, -5631, -8958, -13054, -25419]
14624b5419M732J0877J3614q92J251j0455O320r47P804r08r94q348j0081m845
14610a8291J779J0193k665q078l606L798J7999M639m042L613M955o774l961j655
14596b096j2123P616J4251J1214p723L032j2942m881J780p199K636N690l870L966
14582f49L848l432p082Q217K814j190O650k839o652l321L552j0428j0996k717
14568b4225J0826j1419p969P214j340J6948J4887J367j0471k893k356O315M412
14555A296M34J302k567j340q14j804Q696J1241N191k236j547n174n880q647J971
14540A22r8k277l89J675j4313K991K1384J3787n240j0773j723J5650m639j6262
14526a05L46J5209n350j0899p592P240L194j7145r479Q298P546Q030N258p33m280
$$ y = [-25419, -20687, -9810, 3804, 2912, 4163, -6292, 28, -919, 6885, 5977, 4983, -3365, -13446, -18291, -16512, -6319, -8984, -17062, -20668, -16870, 1129, 5768, 1726, 5339, 10294, 3520, -441, -2096, -14219, -6603, 7648, 18862, 11139, 14171, 1229, -3652, -1872, -9071, -6435, -745, -4615, -649, 3199, -233, -7315, 902, 3716, 2526, 9176, 6337, -315, -3636, -84, -10512, -21508, -24225, -13399, -24818, -32787, -25573, -26913, -9965, 4922, 6289, -4182, -7075, -9431, -3116, 1296, 1730, 3032, 465, -875, -1689, -3493, 5203, 16444, 21635, 19399, 17852, 12678, 6798, -1849, 122, 24, -2253, -2642, -967, -15280, -12289, 9095, 22882, 17642, 6869, 5146, 20796, 16157, -105, 241, 15450, 10100, -799, -8391, -1151, 2043, -15102, -24581, -16283, -8737, -707, 4551, 3818, -462]
14511d62o021O691J0979J9924j4011j0637r035n602p196m118J2872O102M057J251
14497D794p105Q960M685p702L694K04j8541p491J773k238Q904J1685Q408o148
14483C882j72l771m66L781j0841q927O403P647o22j2317l750Q876J0871K820j575
14468A839Q692k169m865Q81L711L070o650k280o239j0412K287J5333Q280j0584
14454H94j1994Q608n764m969l313N790J1166J174R80n093L192j077q305P057r38
14439b592j1604J6658n866l46q16o270L946j220n125J2638N767J212K479k654
14425F207q501l999k148p693r606J0674O277O699L758P037n440j0368J0777J6101
14411A9775o106j2660p784r85P490K305Q501R935j0212j0948Q075Q362p768L023
$$ y = [-462, -6483, 208, 11187, 31111, 17100, 6463, -2572, -8174, -15370, -19488, -6616, -514, 3543, 4794, -2311, 6649, 11334, 3632, 7326, 7530, -11011, -18502, -16729, -18967, -10063, 1622, 10030, 3882, 3710, -61, -527, 3254, -7587, -16514, -10111, -2464, -3086, -15403, -19153, -10277, 594, 3414, 1839, 10531, 8362, 3497, 4378, 8089, 11159, 4509, 2229, -4010, -14422, -12135, 3198, 11478, 894, -11100, -2492, -8256, -13225, -16538, -10748, 418, 1592, 2572, -2521, 671, -406, -8711, -1654, -2592, -14196, 2462, -3404, -3750, -4566, -10836, -6890, -8110, -13235, -597, 5170, 6382, 8861, 6207, -2294, -6293, -8441, -16134, -25740, -15066, -8789, -2090, 1668, 8705, 3265, -7103, 3674, 19775, 13669, 1009, -6775, -7760, -270, 2035, 10536, 20471, 10259, -689, 7386, 15748, 7980, 11003]
14397A1003k609O04m527j218L486J053O816J3897l113N83m823n232M185J0632
14383C0737J653j2072m685m789P616o103j2906j6482J068N299J6493R673l408
14370A2094l023l364p451j5422k852K507K234p057N903L587k783j2052R680J0022
14356g977J4451K953q844P701L436r051j2947M956j0011j0037J1532R011N679
14343H52J2066N430J1214m374j5417j5199j855o786j5328J709K1449K9760q029
14330A5492r448L02L085r33J1253j0686j7617P000N612M254j2469l253R069q266
14316f605j3549O649l491p212J3478J5105j479m968q951p41R558o95J285Q869
14302G253j644j903P353q491j9470r5K459L305R251k038j9986k2491P323L767
$$ y = [11003, 8394, 8998, 4471, 3253, 6739, 7792, 14608, 28505, 25392, 25975, 21152, 15920, 20105, 30737, 32390, 20318, 15633, 10844, 18460, 12357, -549, -17031, -15963, -10664, 5829, 15502, 12094, 9071, 5707, -1744, -17166, -20018, -17511, -15277, -22334, -16431, -12844, -15627, -27679, -17999, -7977, 6474, 9427, 583, 8284, 11720, 2669, -10278, -5322, -15333, -25370, -13838, -4827, 852, 12918, 18348, 29562, 25188, 9771, -5428, -7283, -14069, -29397, -27688, -6239, 23521, 15492, 6044, 6346, 9431, 8498, 19751, 9065, -8552, -1552, 4060, 8314, -4155, -7408, 1661, -6605, -20154, -13505, -16996, -24208, -10730, 4375, 2896, -2072, -11023, -11764, -2206, -2901, -1616, 7253, 5609, 3706, 11059, 2568, -16902, -16997, -14538, -11233, -1982, -4020, -24006, -46497, -39174, -35407]
14288c5407J7423P853n913Q915J1756L543J2052K289n942L813p077o22j217M377
14274A5843J63o130o159M567p2O400p546j5467k2453o951m428P162P307J746Q425
14259a7593p396j63O71O959M020O583j0102L966m002N030m933J88J1606m377l76
14244i919j6828j109Q960J257J894J1563R925P237M388j1470j4595r650P196K397
14230h754j021R000P526l930l402j0609k387J986j510j0190j1171j923J4381n489
14216b7493K4R34K0432R117Q154j2871M912n080J993J892k34P085M718l719n100
14201D764j7331j4928r782P093K925j613Q529J5317P003J4381J3431n598m052
14188B0139j1421j6913k984l809p202K667N981Q54K221R749N173o082k1521J1048
$$ y = [-35407, -17984, -10131, -16044, -7129, 4627, 8170, 20222, 22511, 16569, 20382, 13305, 12683, 11466, 15843, 16006, 9876, 3717, 8284, 8212, 14612, 7066, -8401, -30854, -37805, -42233, -35071, -27764, -26018, -17593, -24989, -25152, -24481, -17522, -13502, -6919, -17021, -13055, -17057, -12027, -16960, -16772, -5166, -9543, -9919, -26747, -27856, -18896, -17639, -15745, -4182, 5743, 12980, 17368, 5898, -8697, -18347, -11151, -8754, -9775, -775, 6751, 2821, -581, -11190, -13577, -11591, -13101, -23291, -34462, -36385, -22004, -27493, -27469, -26535, -6103, 3014, 11168, -1703, 3209, -1871, 122, 2014, 1780, 8865, 13583, 9864, 4764, -12567, -27495, -37277, -30184, -27259, -28872, -20343, -5026, 1977, 16358, 29789, 24191, 20139, 8718, -8195, -11179, -14988, -22190, -19523, -13542, -12688, -10467, -718, 4455, -1627, -23148, -12100]
14174a2100O593n979J907p37j728R266M444p794m647Q750P45l44n769q551n08
14159a6452O726K50n81m433n16J1943J0150K807M861j4256m947L555L555m399
14145a737j804K579l066K562P49j0232L227k847M345L839l499J891K1225J3119
14131C0351q977j4694n894K908N162m961q733K672l156O68q476K868m357r347
14117b3966j817J4429l794N962J2457N095q906n152J7254k727n501J853J50q480
14103c143m380O656O578K754p74q109o949P105p26J555O905J601o616N741o7k336
14087E795P873J0562M216J007q961J0912P868L959J1577J0946Q250R652Q462l814
14073H8304L0619Q794K08J5589M9537N4382P3994J07838J22794J21162J10907
$$ y = [-12100, -5507, -11486, -9579, -10316, -12044, -2778, 1666, -6128, -10775, -2025, -1280, -1624, -7393, -15944, -16452, -9726, -9476, -10057, -14490, -15006, -3063, 7087, 9894, 14755, 499, -4448, -893, 2662, -1737, -3541, -962, -4028, -1466, -717, -10949, -7722, -10569, -6224, -2385, -5884, -3993, 17232, 30351, 21374, 6680, 786, 3694, 8856, 3895, -4838, -2166, -5322, -4654, -13130, -10262, -14619, -23966, -25783, -11354, -15148, -9186, 3271, 8366, -540, -5692, 11562, 8835, 3334, 5187, 5337, -3143, -7523, -867, 5711, 8465, 7691, -418, -7367, -262, -988, 567, 7472, 9073, 2457, 8198, 8131, 5795, 13668, 24230, 28446, 29453, 20492, 31404, 39272, 43231, 54808, 65754, 74004, 83656, 92118, 88304, 118923, 127717, 127925, 143514, 193051, 247433, 321427, 429265, 552059, 673221, 784128]
14062G84128J04834Q6230M5358J5155m3494p9263r5790j07969j14190j16283r5471
14051C83245o7005n9723l2748j0610j1125k2028j7728o261j9203j5110j1129k0152
14039I0423p150K842J0027q340o834L313P94k1885j0483O660q744Q292N929J668
14025F6512L152L943l963p961o826p063k900j2560o628L318N739L506r135O72
14011B9806o338n667r16l80J972K791j166m678L04K446q873o629j2730N833J3711
13996I486k865P203q41r611j1895O420q532q509P840J2012K689O438j403n299
13982C133l366M737m87O954m771m147j1594j1480m457J7488J4003l746M151R776
13968A6194L742p878q778j3294p544M035J3009J426m810j1439j2645Q681P523
$$ y = [784128, 888962, 975192, 1020550, 1035705, 992211, 912948, 817158, 709189, 594999, 478716, 383245, 316240, 256517, 223769, 213159, 202034, 180006, 162278, 156017, 136814, 121704, 110575, 90423, 83273, 86115, 96142, 87802, 80968, 84281, 85075, 63190, 52707, 59367, 50623, 58915, 64844, 66512, 69664, 73607, 69644, 61683, 54857, 47794, 44894, 32334, 25706, 29024, 34763, 38269, 29134, 29806, 23468, 17801, 16885, 16505, 18477, 21268, 20102, 15424, 15728, 18174, 9301, 2672, -10058, -4225, 9486, 6621, 13824, 12983, 3372, -8523, -2103, -10635, -19144, -11304, 708, 3397, 9835, 8432, 3133, -233, 4504, 4017, 10971, 6200, 2053, -9541, -21021, -25478, -7990, 6013, 2267, 6418, 16194, 19936, 12058, 3280, -10014, -17558, -13523, -514, 912, -3898, -15337, -27982, -19301, -11778]
13955a1778K0303Q164m829L076o718j8198l78J7492J1116n598o284J927L103J004
13941A2402r705O819M089p27r258m831m940p37l913j068Q563q396o662J3535N569
13926G40Q16k898P977J8243j035j893o416j874O275j3459j5058j1617P443Q436
13912d320p467P17k753K9N15R74J528N50L272l703p674m241O903J9806M831j4914
13896e947K921P718P570J83K49M007j147o033p4j5324O9R172M298n332n012k496
13880e178n153j232K829J687j2239k290N952l874j608J1260k413O745O339K849
13866C674J6428n61k438q383r912M315j683O467J7201n380j0076j9881K739Q692
13852A202J173O916j6946k1867O661J6811m230m675q232m753K285N660M344K0791
$$ y = [-11778, 8525, 16689, 11860, 14936, 8218, -9980, -10358, 7134, 18250, 12652, 6368, 8295, 11398, 12402, 2697, 9516, 13605, 12878, 3620, -1211, -6151, -6888, -10801, -11869, -3306, -11702, -18364, -4829, 740, 1556, -1342, 6635, 24878, 23843, 21950, 15534, 13660, 19935, 6476, -8582, -20199, -12756, -4320, -11787, -11070, -13823, -13794, -13279, -12305, -10777, -10227, -6955, -10658, -18332, -22573, -15670, 4136, 8967, -5947, -3026, 4692, 12262, 12445, 12694, 16701, 15554, 9521, 9447, -5877, -5808, 3364, 7662, 2330, -2682, -5178, -10331, -11563, -8734, -7047, -19286, -21576, -15624, -19498, -21106, -9846, -12259, -5514, 825, 3674, 20102, 19541, 17103, 8720, -1192, 3123, 1440, 7907, 25108, 19728, 9652, -10229, -7490, 1202, 2375, 9291, -7655, -29522, -22861, -6050, -10280, -14955, -23187, -27940, -25655, -19995, -15651, 5140]
13838E140l497J332j4791k503J0905p493o059K8215J3929j3241o230L677k438
13825F946k0083o369K621J5537J1801o450M313N210R843p039j1124n079o775m977
13811a1625o355J4354j380j3491M20J0582L501p259n805m531J6236J1744J0783
13798A7174P111n58j3842o166J237Q641o292j0890l364N004P02L922N167P90N27
13783I163o029O478l870j5831M16k494L102J8501J8963J675l988n317o459J28
13769A4438j892q698P679K622Q848J0590P915J2311j789j7727j0314o705p403
13756I875J2524O646P568l096Q96J2414K1284K172r428k531p06o858m743k897
13742D3120m620j8328l887P504J40o973N643m796M64l03N352M825M748p408j4902
$$ y = [5140, 1643, 2975, -11816, -14319, -3414, -10907, -16966, 11249, 25178, 11937, 5707, 9384, 6946, -13137, -19506, -16885, -1348, 10453, 4003, 8316, 13526, 23369, 16330, 5206, 127, -6648, -11625, -17980, -3626, -5006, -18497, -18077, -7495, -3994, -11253, -17058, -21589, -5353, 6391, 17174, 24285, 23727, 9885, 3719, 4956, 13597, 7305, -3585, -6949, -1945, -1243, 2679, 7846, 8636, 9163, 3134, 9612, 5742, -10089, -9673, -12167, -9065, 9436, 28399, 30074, 26086, 20769, 14310, 14438, 12546, 3848, 11527, 14149, 22997, 33587, 41502, 53813, 52024, 34297, 23983, 17278, 9875, 22399, 29045, 36613, 33517, 34413, 46827, 68111, 70283, 60855, 58324, 57618, 50760, 46017, 43120, 38500, 20172, 16285, 23789, 23929, 16956, 22599, 17803, 18267, 17964, 23316, 28141, 32889, 25481, 10579]
13727A0579m975l963p166J161m003M889J7139J0563N437k492j1863k401O517k653
13713A6769j577q580j0842P456J862P55p577O654N2j0372j2111N472J2515K694
13699C170j691M368m884R103J1898j1552P334O144K749k304M8J3613j2346r632
13685A6018L288n085j1813o157N634J0929q634j2898Q135P6o876j19J3555R178
13671A5231l612l733o932q063K242J7485K254m547p05o935j3915J3440P420r17
13657H713M134N506r917k916N381m225j0342N175P338J698L541r256N621J0159
13643B0610N375m419j7783k505K056l584r5k507R715J0558m193J415J079p947
13629G775l573N725Ql202j834j2855O187O545o928l305R074R929L323L117P773
$$ y = [10579, 5604, 1641, -5525, -4364, -8367, -3478, 13661, 24224, 29661, 27169, 15306, 12905, 19422, 16769, 15192, 6612, -4230, 3226, 5088, 5843, -1734, 4920, 4972, -5400, -17511, -12039, 476, 3170, 1479, 5847, 963, 10066, 21964, 10412, 17746, 23890, 26639, 24335, 24383, 37996, 25650, 16018, 19306, 14221, 2408, -3749, 1885, 12814, 4180, -8718, -583, -507, -7383, -7502, 6053, 15231, 11619, 7886, 954, -7109, -4867, 12618, 14872, 10325, 9620, 2685, -11230, 2210, 9630, 8713, 12847, 18353, 8436, 5520, 10901, 6676, -3666, 1509, 8847, 10545, 14086, 4830, 10451, 20610, 25985, 21566, 3783, 1278, 3334, -250, -345, -2852, 6863, 17421, 13228, 14643, 15722, 7775, 4202, 9927, 9935, 6733, 4899, -7956, -1769, 4776, -2152, -5457, 3617, 13546, 16869, 19986, 27759]
13614B7759L573R961J6141k784n436r076k108O337l338j1872o982k914R642Q157
13600C7060m51n947l418o921k581j0157N16M292Q344J569J1535M758j7529j3248
13586G822R279K252K953K508P693K313l777l83O309P793j4781K86P550m693K340
13571C5464J3691P258n630o404n496P130J9526P731q048k1050q698J5782O355
13558E7611J638k51Q332J7896r250p305L790J8479J1143j5364q10j954k58O860
13544I0557O684q775k3475j632J4539J1447L804L92M495N013m7p515j7065J1638
13530I0060J2304J5394k987j3072K232J2935J804K816P64K01m821l25K349N468
13516A25122J12Q186L00P970m246p561n881N685R85J7042Q120L92N654o896r597
$$ y = [27759, 31332, 41293, 57434, 54650, 49214, 40138, 38030, 44367, 41029, 29157, 22175, 19261, 28903, 37060, 36609, 30662, 27244, 20323, 17742, 7585, 8101, 12393, 20737, 22306, 33841, 38599, 21070, 7822, 17101, 19353, 22306, 24814, 32507, 34820, 31043, 30660, 36969, 44762, 29981, 30267, 37817, 33124, 35464, 49155, 56413, 50783, 44379, 38883, 46013, 65539, 73270, 65222, 44172, 35474, 51256, 57611, 59249, 58998, 67330, 85226, 75976, 68671, 72461, 90940, 102083, 86719, 85909, 83955, 83697, 90557, 97241, 88466, 64991, 63359, 77898, 89345, 93149, 93541, 98036, 103049, 103002, 95487, 78422, 90060, 102364, 117758, 114771, 101699, 103931, 116866, 118670, 121486, 122250, 122451, 117630, 117305, 119654, 125122, 125234, 133420, 133720, 141690, 137444, 129883, 124002, 129687, 130672, 147714, 155834, 156226, 161880, 154984, 145387]
13501A45387N050N699R640O181j127o27R478O818l095j0193n868J676k774l324
13487A62921j560P180m564N251n786J0909O922j4q453K328K551q898j1191N752
13473A63348J9335P681P914m946p948J755J977R158O852k033j994l568m282q816
13459A84433P85j1027K614J0691M69q811q341M561J9254K916K206j5152r070N429
13445A80957O812J956p864K64J2684o099j1809l053l333n896J3766o582k1668
13432A50135l092J1481O441J3078L454q346K075K557j2492q069j1067q874L725
13419A41006l91R136J761L2o401j1553N418m153j3427m47n147n091M399M220R649
13404A29011p884j0324K607n276r386R305J407M597P730j964k3937j3935J794
$$ y = [145387, 150437, 156136, 165776, 171957, 170830, 170203, 179681, 186499, 183404, 173211, 167343, 169019, 166245, 162921, 161361, 168541, 163977, 169228, 163442, 174351, 181273, 181259, 172806, 175134, 177685, 168787, 157596, 163348, 182683, 190364, 198278, 193332, 185384, 187139, 189116, 198274, 205126, 203093, 201099, 197531, 193249, 184433, 185218, 174191, 176805, 187496, 187965, 179154, 170813, 175374, 194628, 197544, 199750, 184598, 175528, 180957, 187769, 189725, 181861, 182125, 194809, 188710, 176901, 173848, 170515, 164619, 178385, 171803, 150135, 147043, 158524, 164965, 178043, 181497, 173151, 175226, 177783, 165291, 157222, 146155, 137281, 141006, 140615, 149751, 151512, 151544, 145143, 133590, 139008, 134855, 121428, 120981, 115834, 110743, 115142, 119362, 129011, 121127, 110803, 113410, 108134, 98748, 108053, 109460, 114057, 121787, 119823, 95886, 81951, 83745]
13391H3745M772M593O668r78p016j3881q896J5002J2210q933j2964K252L537j2175
13377F7936N696Q885O78o449n229Q623J7330j5323l2405p845O899L435r8N51j0035
13362D2649J043Q668O149J0569j4802o118j878k706j0089p15M437j962p277j857
13348B6111r211j297j181K548J2399j513J0096J4588j9718l521O732k045L450
13335C7438N837P459J1257M28M885O12m100K0010J0065J663Q348K5099L2257L4740
13321A95998M7981N1606M6136M6253M4013K5876J2571O394K594k8966m3509m0488
13309C66459m2870k1665k6555k5139j2529o567K477O2j5565J4038J1910J6014
13297B60070J9035K1630L3136K7696K5049O938l804j2843l3248l6525l2937k5475
$$ y = [83745, 88517, 93110, 99778, 98800, 91784, 77903, 69007, 84009, 96219, 87286, 74322, 76574, 80111, 67936, 73632, 82517, 83195, 76746, 71517, 80140, 97470, 82147, 49742, 41897, 48796, 52231, 52133, 52684, 42649, 43692, 52360, 58509, 69078, 54276, 48158, 46280, 43574, 33485, 32770, 37207, 35245, 27968, 26111, 16900, 15603, 14422, 16970, 29369, 27856, 37952, 52540, 32822, 29301, 36033, 33988, 37438, 43275, 50734, 61991, 62419, 67304, 67916, 63816, 83826, 93891, 95554, 103902, 129001, 161258, 195998, 243979, 295585, 341721, 387974, 431987, 457863, 470434, 476828, 479422, 450456, 406947, 366459, 323589, 301924, 275369, 250230, 237701, 231134, 233611, 233673, 218108, 232146, 244056, 260070, 279105, 300735, 333871, 361567, 386616, 393554, 389750, 376907, 343659, 307134, 274197, 248722]
13285B48722k8069l4872k7775j8091j6688J065R921l043k1629j9896j3593q948
13273F7104j3708q75N304j3525p643L222j3306J0737Q512j1995l385O574K606
13260C9622n467n194n422P858J5985p27k279o395p749P455K099N458J3185N427
13246F3856j1017p271J4454K0176P439Q645N621J0475J960M354L0799M4295N3472
13233B47258N6706O7436N4341M2117L5398J9088K6023O068l2869n3988m5588m5569
13221C76421m7314m1452l1784k6281k4684J615J2714P568J2391Q082K4448M5625
13209C17349L7695K1547K0553L8708K8072J1409q726j8896k6509n3544m5515l8036
13197B84107k9034l3759j9687j5017j2879k0012j0589p181l410r963n046j2497
$$ y = [248722, 220653, 185781, 158006, 139915, 123227, 124292, 134213, 131170, 109541, 89645, 76052, 67104, 53396, 52521, 57825, 44300, 36657, 39879, 26573, 37310, 45822, 33827, 30442, 37016, 39622, 34155, 28961, 23539, 31397, 47382, 46655, 44376, 37981, 30232, 37687, 39786, 45244, 58429, 63856, 52839, 45568, 60022, 80198, 87637, 96282, 101903, 112378, 114338, 118692, 149491, 193786, 247258, 303964, 371400, 425741, 467858, 503256, 522344, 548367, 554435, 521566, 467578, 421990, 376421, 329107, 287655, 255871, 229590, 204906, 206521, 219235, 226803, 239194, 247276, 271724, 317349, 355044, 376591, 397144, 435852, 463924, 475333, 466607, 447711, 421202, 367658, 322143, 284107, 255073, 221314, 201627, 186610, 173731, 153719, 143130, 135949, 132539, 122576, 117530, 105033]
13185A05033j0474q286k687j1216m501J1891n212J10j951n349o674N297L092J770
13171G0843k544j2132n691J347l852J230o46J0985p568j8564j5412P301K776k565
13157B5508j047n501M328J9892O157K557n523n678j1804p974m325K47L538L374
13143B3749r12p024K759J5698J5666l635r886l673K782o369k709N807j8982r819
13129C452j587P627R672N576p366j1263l691K6704N541n996l531J4031L360j5799
13115B6730j4809j357L809m314M808J6372n83j5528P865p346m123J1049j9572
13102C001p880J3922J5373J5451k720j0031O08K360n031O469L372q914J1830K908
13088D0718j2453m808r526j73l184j0303k625P229L989o095p783J199J4520O421
$$ y = [105033, 94559, 86273, 83586, 72370, 67869, 79760, 74548, 74658, 72707, 67358, 60684, 65981, 69073, 70843, 68299, 56167, 50476, 51823, 47971, 49201, 48555, 59540, 51972, 33408, 17996, 25297, 28073, 25508, 24461, 18960, 23288, 43180, 49337, 51894, 46371, 40693, 28889, 20915, 16590, 16837, 20375, 23749, 22837, 15813, 18572, 34270, 49936, 46301, 36415, 32742, 35524, 29155, 26446, 32253, 13271, 3452, 1865, 9492, 19164, 24740, 17374, 6111, 2420, 29124, 34665, 28669, 25138, 39169, 42529, 26730, 11921, 10564, 14373, 10059, 14867, 31239, 30656, 15128, 22993, 15647, 11524, 22573, 3001, -4879, 9043, 24416, 39867, 37147, 27116, 27724, 30084, 25053, 31522, 34894, 25980, 37810, 40718, 28265, 23457, 13931, 13758, 10574, 271, -2354, 4875, 8864, 2769, -5014, -3815, 10705, 17126]
13074A7126q142l983O405k44Q117P531q786K598K337J3247J772O826l904o892
13060C4008k296P708M598J7409J772p050j2968l287P770R719J6085J7318J9276
13047A10062K5119K3376L0988M7622N4916N7405Q8135J09292J11646R9025N7487
13036H15073L2246J4414l7354o6686p1586r3384r4056q5079p2891n2081k2629
13025B65987k1866j9955j0182r673j3679n352k0848j8059p410j7643j6641j4477
13013I0202k620J3531m71n196R968r971k4687K598K664K378l430M677R64l407
12999G7200M883L69j6626m976j235J0654p225L191J8508K820q564m388R15l554
12985G1972j3341j337K936P537n524j4506j8078l246n13j594M480J3967R688P827
$$ y = [17126, 8984, 5001, 11406, 11162, 19279, 26810, 18024, 20622, 22959, 36206, 37978, 44804, 40900, 34008, 31712, 39420, 44018, 61427, 63199, 56149, 43181, 39894, 47664, 57383, 73468, 90786, 110062, 135181, 158557, 189545, 237167, 292083, 349488, 437623, 546915, 658561, 757586, 815073, 847319, 861733, 824379, 757693, 686107, 592723, 498667, 413588, 340697, 288616, 265987, 244121, 224166, 213984, 204311, 190632, 185280, 164432, 146373, 138963, 121320, 104679, 90202, 87582, 101113, 100642, 95446, 105414, 95443, 70756, 73354, 76018, 78396, 74966, 79643, 80607, 77200, 82083, 82452, 65826, 60850, 59615, 70269, 63044, 66235, 84743, 87563, 78999, 74611, 75526, 71972, 58631, 57294, 60230, 67767, 62243, 47737, 29659, 26413, 25900, 24306, 28786, 42753, 52441, 60268]
12971F0268j2269M193p251m056J172M440R639N059N217j0203N606j398j4070P17
12957D7064P347O116M771Q737l993k943J2369J4475j478n16j5490j3157O765J2581
12943H2648N428j3017k0648q305M532J208K771P98J4137j333o994L066O352j0721
12929E9922j6662L861j0324n06N335L430O795P958k604q555r333L893K214k879
12915D2545J2288R018j9485j1447n763n446q274o554K826J6861J7576n723o192
12902C2230O229K25J1898r487j0761q296j5567m484J1047J7846J8827O294n901
12889E0100m335k0872l960J6379J8368J390J265j39J4606n947n081J8960K6925
12876A07659J0146R829N450M934K234O283j3814O94J6212j0512o998j6929r401
$$ y = [60268, 47999, 52192, 44941, 40885, 42057, 46497, 56136, 61195, 66412, 56209, 61815, 60417, 46347, 47064, 54411, 60527, 65298, 74035, 70042, 67099, 79468, 93943, 92465, 91949, 76459, 63302, 70067, 82648, 88076, 75059, 54411, 46106, 50638, 51846, 54617, 55415, 69552, 68219, 61225, 64291, 70643, 59922, 43260, 47121, 36797, 36291, 41626, 45056, 51851, 59809, 57205, 48650, 39317, 43210, 45424, 42545, 54833, 63851, 44366, 32919, 27156, 21710, 13436, 6882, 9708, 26569, 44145, 38422, 32230, 38459, 38684, 50582, 41095, 30334, 22038, 6471, 1987, 13034, 30880, 49707, 56001, 50100, 45765, 24893, 20933, 37312, 55680, 57070, 58335, 58196, 72802, 66855, 61774, 80734, 107659, 117805, 127634, 133084, 138018, 140252, 146535, 132721, 133415, 149627, 139115, 132117, 115188, 105787]
12863A05787r104q460j2819j6576K393k954J792J3763m245j6489n680R105N827
12850F2340m966Q221N925K529J3177J326j3198r016j790o676q799L622P702m856
12836E5541l645Q508j3008r736p679M202Q509p771J957o870P452N063O906l627
12822D5802p003m39P446R867J2738K1519l547j1240O409O939J5782J0482j5858
12809I8897k8105o033J639M483m711q181p943P90Q144L104Q905r69P00l902j6441
12794E0377P74R538N501O973m073k917k497Q618J7902k125J17J1146O036q9l56
12779A04925n395p227J0080K1724J7182P63m284P184J5646J2498O355m022k2946
12766A52483j9454j0309l420n155n830j9980r343M886M551O536J7341J9980R761
$$ y = [105787, 96683, 88223, 75404, 58828, 61221, 58267, 60059, 73822, 69577, 53088, 47408, 56513, 62340, 57374, 65595, 71520, 74049, 87226, 88552, 75354, 66338, 64548, 57872, 49073, 52695, 60397, 55541, 51896, 60404, 47396, 37660, 29981, 34183, 42692, 34921, 36878, 30008, 37460, 42523, 49429, 45802, 38799, 38360, 45806, 55673, 68411, 89930, 86383, 75143, 81552, 88491, 104273, 114755, 98897, 70792, 64759, 66398, 70881, 66170, 57989, 50046, 50836, 58980, 62084, 70989, 70020, 70720, 66818, 50377, 51151, 60689, 66190, 73163, 69090, 66173, 63676, 72294, 90196, 88071, 88188, 99334, 105370, 105281, 104925, 99530, 92303, 102383, 124107, 141289, 142052, 137768, 144952, 160598, 173096, 179451, 175429, 152483, 133029, 122720, 119300, 114145, 108315, 88335, 78992, 83878, 88429, 94965, 112306, 132286, 142047]
12753A42047J9804K2644J2098R238N560K1170J8868J3078L2081J5731J2200j4059
12741C10460j263J800k7531k3528j8383k8388k2789j0649j4799l442P361j081
12729A67768q337j143J8758R852J0282J297k084l40p458J785J5266J0509N159
12716B21314L010R993K4443O618p593j963K0787J5652l274o694R651l597J2865
12703C01212J9555J0966j1317J2084J1282Q098Q79J5367J6996J5104K6162N509
12691D31897J1569J0750K5706J4064L234O976P04R301O09N521J3247K688K130
12678E38396P128J1029R134J6054K8809J7646M096K8408L0229N1270L7197L3643
12666H13039K5661L7215M7916M0714L8508K2335K4263K7416K0241L0153L2463
$$ y = [142047, 161851, 184495, 196593, 205831, 211391, 232561, 251429, 264507, 296588, 312319, 324519, 310460, 309197, 310997, 283466, 259938, 241555, 213167, 190378, 179729, 164930, 161488, 168849, 167768, 159431, 158288, 177046, 186898, 197180, 198477, 196393, 196053, 188595, 190380, 205646, 216155, 221314, 224324, 234317, 258760, 265378, 257785, 255822, 276609, 292261, 288987, 282293, 291944, 288347, 301212, 320767, 331733, 320416, 332500, 343782, 351880, 352759, 368126, 385122, 400226, 426388, 431897, 443466, 454216, 479922, 493986, 497220, 504196, 504900, 514201, 514810, 520331, 533578, 536266, 538396, 545524, 556553, 565687, 581741, 610550, 628196, 632292, 660700, 690929, 742199, 779396, 813039, 838700, 875915, 923831, 964545, 1003053, 1025388, 1049651, 1077067, 1097308, 1127461, 1159924]
12655A159924L0841L4318N6240P1778P5757P0026P2211Q0888J13071J39773J51355
12644B056182J54389J68196K04072K48167K93398L48013M12326N10220O38386
12635E033349P53204Q78686J000104J126205J246068J383229J541830J733633
12627A4696308K070051K612549L468732M722683O543939R152208J2683305J6838728
12619G2788503K0494174K2098163K0702659J6734493J0899895K995217n944052
12612A60769052j2844667j6668666j8942133k0014619j8644476j4944868j0726665
12605D7982958p367945n048866l535738k588999j996488j639335j448395j362142
12597B2995050j325077j287049j277072j242280j172925j112098j040875r68662
$$ y = [1159924, 1190765, 1225083, 1281323, 1353101, 1428858, 1498884, 1571095, 1651983, 1765054, 1904827, 2056182, 2210571, 2378767, 2582839, 2831006, 3124404, 3472417, 3884743, 4394963, 5033349, 5786553, 6665239, 7665343, 8791548, 10037616, 11420845, 12962675, 14696308, 16766359, 19378908, 22847640, 27570323, 34114262, 43266470, 55949775, 72788503, 93282677, 115380840, 136083499, 152817992, 163717887, 166713104, 160769052, 147924385, 131255719, 112313586, 92298967, 73654491, 58709623, 47982958, 40615013, 35566147, 32030409, 29441410, 27444922, 25805587, 24357192, 22995050, 21669973, 20382924, 19105852, 17863572, 16690647, 15578549, 14537674, 13569012]
12589A3569012r31600q98424q41141p86371p17524o53457o09630n70405n34521
12580G025939m71482m11421l90609l62996l25134l04209k93277k77782k50380
12571C938649k50223k21783k05633k01407j87528j58244j28842j21260j24322
12562B339407j01201q6418q8607r1544p7114p8368p6630p1904o3721n6944o0508
12551A486448o8438m9803n7140o0531n6396l4713n0503m9564m8699n5500m1046
12540I14115k4365j7136k6179l2647k9693j1010k9056k3271k8859k8515k6402
12529F36982l1444m520o265k6470k2793l4484j8108j3172R39R12j7990o703l101
12516D53783k4932j0490o401k3646j0969r56p89J0976r410j8807j2667O208p030
$$ y = [13569012, 12637412, 11738988, 10897847, 10111476, 9393952, 8740495, 8130865, 7560460, 7025939, 6554457, 6143036, 5752427, 5389431, 5064297, 4760088, 4466811, 4189029, 3938649, 3688426, 3466643, 3261010, 3059603, 2872075, 2713831, 2584989, 2463729, 2339407, 2238206, 2151788, 2063181, 1971637, 1894523, 1816155, 1739525, 1667621, 1603900, 1546956, 1486448, 1418010, 1368207, 1311067, 1250536, 1194140, 1159427, 1108924, 1059360, 1010661, 955161, 914115, 889750, 872614, 846435, 813788, 784095, 773085, 744029, 720758, 691899, 663384, 636982, 605538, 601018, 594753, 568283, 545490, 511006, 492898, 479726, 480665, 481577, 463587, 456884, 453783, 428851, 418361, 411960, 388314, 377345, 376389, 375600, 386576, 377166, 358359, 345692, 351900, 344870]
12503C44870l167p218N759k084P270J5601J6274J8407R006J2364J448j0513n790
12490D02227j9383k7084k5701k6980j245j377n616k9129j9351l790J3071J3518
12478B69160r56p819J9758N107K512q393N189k654N55Q904J6149m821j3012q709
12464B80970K774J0841n177M494K9843J5416J6617L4968L6711O5156O4392M1822
12452E98827L7631K3208K5720N408N45k5734l4028n6145m5443m2289l7599k3318
12440D26783j7582j0014j2907j760j5912m97R626J0954K6705J7391m792K9153
12428D57148M3126N0596P7215Q1091N5216L7134O248k9483o7349q4901p9816p1897
12416D74328n6578n0309l3900l0539j6133n177r045q207R929J0801k395j9563
$$ y = [344870, 341703, 334485, 340244, 338160, 345430, 361031, 377305, 395712, 404718, 417082, 418530, 408017, 402227, 382844, 355760, 330059, 303079, 301834, 300457, 294841, 265712, 246361, 242571, 255642, 269160, 268204, 260385, 280143, 285250, 287762, 279369, 284558, 281904, 282459, 291363, 307512, 302691, 289679, 280970, 283744, 294585, 289408, 293902, 323745, 339161, 355778, 390746, 427457, 492613, 557005, 598827, 636458, 659666, 685386, 690794, 691339, 665605, 631577, 575432, 529989, 487700, 450101, 426783, 409201, 399187, 386280, 384520, 368608, 368111, 377737, 388691, 415396, 432787, 427995, 457148, 500274, 550870, 628085, 709176, 764392, 801526, 807774, 778291, 710942, 626041, 546225, 474328, 417750, 367441, 333541, 303002, 286869, 281692, 272647, 264440, 274369, 285170, 282775, 263212]
12404B63212p019j4133L0j444m657j1234k2938j4359Q39M883O403k268j8844j8877
12390A59594m254k913N114M537j314J114j0731q296J5281J2121Q918o00J2491
12377A91062K4404K2997L718R481L6835M3501M1807N9790O0361O2761N0161L4294
12365F41172N220k6434o3345p3168q0445n3992l6701m1436k9067l0375j3540r68
12353A96921p682j4655l05J2963o586J2760J6364m255O133J5865K5362K6720L2960
12340C12565N3814N7550N4175N8943M5446K2407M771l6522n6569n6024o9363n5376
12328C35817l5785k5334j9753j1988o583m026p435j3120N316O507q816j0479j5686
12315A88635J924P830o774k146m204j1610j2167m131K020p326j3036j9430p164
$$ y = [263212, 256193, 242060, 242090, 240646, 235989, 224755, 201817, 187458, 188297, 193180, 199583, 197315, 178471, 159594, 155340, 152427, 157541, 162078, 160764, 161878, 151147, 142851, 158132, 170253, 179171, 178571, 191062, 215466, 238463, 242181, 251662, 288497, 331998, 373805, 433595, 493956, 556717, 606878, 641172, 646392, 619958, 556613, 483445, 403000, 349008, 312307, 270871, 241804, 211429, 197889, 196921, 189239, 174584, 174279, 187242, 180656, 193416, 209780, 205525, 211658, 227523, 252885, 279605, 312565, 366379, 423929, 478104, 537047, 582493, 604900, 609671, 573149, 516580, 460556, 391193, 335817, 300032, 274698, 254945, 242957, 236374, 232348, 224913, 211793, 217109, 223616, 214800, 204321, 188635, 190559, 198389, 191615, 189469, 185265, 173655, 161488, 157357, 159377, 152051, 139015, 119585, 112421]
12302A12421l286J185J6237K555p885o91J2953j2125o681L091j244k526J8265
12289A32269K9072K1479k546J4071L4067M2441M5409M5979O1071L1336Q217R44
12277D63809k1857n0568n2711n2103m7633k5710l2877k6419K078m677j7707M381
12265A38006q113j5662r499J552J0228o189m847J1203m780J0374P907O30P548
12252A38358j0743j5093k2582l892J3794P174J1101r066K359L914j4690k0386
12240H0248p118P767l388K424J862o507Q669J8530N024l692K508J6333R79J0666
12226A34305K6412J6327r52o660j5674m1P655m434j4339J359o797j4941j0682
12213A11538j8506r65K978L688m703J905Q524L842L338n14J0051l154M451P019
$$ y = [112421, 109135, 110320, 126557, 129112, 121227, 120536, 133489, 121364, 114683, 117774, 116530, 114004, 132269, 161341, 182820, 180274, 194345, 228412, 270853, 316262, 362241, 423312, 454648, 462865, 463809, 441952, 391384, 338673, 286570, 238937, 213227, 180350, 153931, 156009, 151332, 133625, 138006, 129893, 114231, 104732, 106284, 116512, 110323, 105476, 116679, 111899, 122273, 130180, 130810, 138358, 127615, 112522, 89940, 86048, 99842, 107016, 118117, 109051, 111410, 115324, 100634, 80248, 73130, 80897, 77509, 79933, 81795, 75288, 83957, 102487, 107511, 103819, 106327, 122660, 123639, 134305, 160717, 177044, 176092, 169432, 153758, 153717, 161372, 156938, 142599, 143958, 137161, 122220, 111538, 93032, 92067, 95045, 98733, 94030, 95935, 104459, 108301, 111639, 111125, 121176, 118022, 122473, 129492]
12199A29492M688J7550M0577M3756M0667M7696P4760R4643J12770J09069Q7842
12188H03510P5508M6388m810n1654o3622r3904j13626j03027p3848o7943n0107
12177C02865k2966k2171j9523k2549j6668j0654j9402k168k2453j7769j4608p185
12165A04749k494O098Q006l242j570q991j7398O002R828K875M928L190p470j5737
12151H8774o586O921j1172j9988Q161Q295j1435N660L997N63r339M747j2655q451
12137D7492Q205Q544P06j61j2095l721J1309o132o624o916K923k646L05R911n976
12122D5124n607L054R082L06j6253j954J4164r258q264J3485O165N843p37j2964
12108D2186j4963j967J1897N284J445L432j844k033K1645J6076Q423J7172K730
$$ y = [129492, 134180, 151730, 192307, 236063, 276730, 324426, 399186, 493829, 606599, 715668, 803510, 879018, 925406, 920596, 868942, 805320, 711416, 597790, 494763, 420915, 352972, 302865, 279899, 257728, 238205, 215656, 198988, 188334, 168932, 166764, 144311, 126542, 111934, 104749, 102255, 108353, 116359, 113117, 111547, 102556, 85158, 91160, 100988, 103863, 108791, 111981, 104511, 88774, 82188, 89109, 77937, 57949, 66110, 74405, 62970, 68630, 72627, 73190, 63851, 68598, 55943, 47492, 55697, 64241, 64947, 64786, 52691, 48970, 60279, 54147, 47523, 40607, 43530, 40884, 41189, 51100, 45124, 39517, 42571, 51653, 51959, 35706, 33752, 47916, 38658, 30394, 43879, 50044, 55887, 55150, 42186, 27223, 25256, 37153, 42437, 43882, 47314, 45470, 43437, 65082, 81158, 89581, 106753, 109483]
12095A09483J7688n19l13r801j1171J238R540l591j5552r079l955j4076q677M403
12081F5618j914m809J304R38O661O491P427Q275N435J3783J7370J9356J4531L1836
12067A92302M9250O6073J18710J56437K12806K60776J78804j9082k53950k88662
12057F73464j86774j14233q2604o2787n0805l0876o769p862j1706o062L302K359
12045A18647m880o072l49M800J6326l065j2370n423M158p502j7165j8141o861
12032F2103j1906O5J2886j680L063P161j6440k0733l574K575K637j298M957L74
12018D0190N606j364k479o149o091o898n22N378j5118j1577K0918K3860o818j1135
12004B7801K697J1730m880j162p91j5776J1966N424P223r485l804J942L964Q372
$$ y = [109483, 127171, 126652, 126339, 116538, 105367, 106605, 116145, 112554, 97002, 87923, 83968, 69892, 61215, 65618, 63704, 58895, 60199, 61137, 67798, 74289, 81716, 89991, 95426, 109209, 126579, 145935, 160466, 192302, 241552, 307625, 426335, 582772, 795578, 1056354, 1235158, 1216076, 962126, 673464, 486690, 372457, 289853, 227066, 176261, 145385, 138616, 130754, 119048, 112986, 116288, 118647, 113767, 107695, 107346, 112146, 128472, 125407, 113037, 107614, 111772, 104270, 87105, 68964, 62103, 50197, 50262, 63148, 61468, 64531, 71692, 55252, 34519, 30945, 33520, 36157, 34859, 39816, 40190, 45796, 44432, 41953, 35804, 29713, 22815, 22293, 27671, 12553, 976, 21894, 45754, 38936, 27801, 30498, 42228, 37348, 36186, 35395, 19619, 31585, 37009, 44232, 34747, 30943, 32885, 36849, 45221]
11990D5221o241j924p031r763Q527Q436j060j2007q124J1871J5681Q801M46Q130
11976F0963J7212J9002L785J4401P695k0864k6868j4127j0410j4273O451j270
11964D1697N095J3469Q214m066M48L309L821j107o274j8135j7072J1906Q325l521
11950D6109Q365k205R373L414o99J091k1524j8846N346P506J8058j06j3043J540
11936D4379J284j0014j0578Q735K432P591P933j240o590n690m480J483k536J1324
11922D4033N990j0361l763J4387K39r960q536M913k492K920n083j3015j7773r70
11908E29J2590P385l612P478K2732K6158j1494j7608k782k98j752j9917J993J3013
11894C4415o767r120l070J5331J2264J636J239j237j0627M045J2587p743l222
$$ y = [45221, 38980, 37056, 30025, 20262, 28789, 37225, 36165, 24158, 16034, 27905, 43586, 52387, 52833, 60963, 78175, 97177, 100962, 115363, 123058, 102194, 75326, 61199, 50789, 36516, 42967, 41697, 46792, 60261, 68475, 64409, 64857, 68166, 71987, 70880, 64606, 46471, 29399, 41305, 49630, 46109, 54474, 52269, 61642, 65056, 64357, 65448, 43924, 25078, 30424, 37930, 55988, 55882, 42839, 44379, 45663, 35649, 25071, 33806, 36238, 43829, 51762, 50522, 43932, 38242, 33762, 35245, 32709, 44033, 50023, 39662, 35899, 50286, 50525, 40565, 32029, 36942, 34450, 37370, 32287, 19272, 1499, 529, 13119, 20504, 16892, 24370, 47102, 73260, 61766, 44158, 41376, 41078, 39326, 19409, 21402, 34415, 27648, 18528, 15458, 30789, 43053, 44689, 45928, 44691, 34064, 38109, 50696, 42953, 39731]
11881C9731k628r875j26l049M902O816L228n126J2350K822r768j311r459k832
11867B5675O980M401l323q438P094k1099j4775J0598J1329Q011P233N663j914
11854C7435L051R026J185j4400p485l997J4281n266K00m293p339q956O597K010
11840B2049q629n184M262J356N830N937m635r248j1519k266K895P042J5964M102
11826B7956K669k767j1472p553p044J008O765J4851P283m784j396K31J0920l25
11812C6342q151l477J30J53J997j884l376O09M147R050Q787n26j7600j5515P011
11797A7697J229n838O484J0705J3618n454j6530n49Q874j198j2861j2385m672
11784h80J0165R190j3465m037k428o116n115J0901k760p702J7813J5653r670J225
$$ y = [39731, 37103, 27228, 27102, 24053, 28955, 35771, 38999, 33873, 46223, 49045, 39277, 37966, 28507, 25675, 32655, 37056, 33733, 25295, 32389, 11290, -3485, 7113, 18442, 26453, 33686, 39349, 37435, 40486, 49512, 50697, 36297, 28812, 24815, 39096, 33830, 34030, 29737, 22398, 13442, 20039, 22049, 13420, 8236, 12498, 13854, 19684, 25621, 20986, 11738, 219, -2047, 848, 7890, 23854, 27956, 30625, 27858, 16386, 8833, 1789, 2797, 9562, 24413, 31696, 26912, 25516, 25747, 36667, 36342, 28191, 24714, 24844, 24997, 26994, 25110, 21734, 22343, 26490, 35540, 44327, 43801, 26201, 10686, 17697, 18926, 13088, 19572, 30277, 43895, 38441, 21911, 21362, 30236, 29038, 16177, 3792, -880, 9285, 18475, 5010, 973, -1455, -7571, -12686, -1785, -4545, -12247, 5566, 21219, 11549, 12774]
11770A2774Q060K241j2568j3667O576M635J1265J1938M894J761j1260J517J270
11757B9436L088q224j1366M718j436J127L90J786J964P235P491j6077j4815N613
11743A0930J5829M922p496j1890m555n306O10O761o12J614J3602n603p666O388
11729A7528L79q66n783O058J2005J990N99n886J710j0697p428p869P554N472l294
11714A1472K045J4273l100l180l926J1064K678p872L344N856j726j1359j4876
11701D693l924k42O050l999j522M055J2055P301n564j6842k0954N399J0378K211
11687i05j725Q034K701n559P388r259L536m669j181K151j5747j740R388P317R698
11672I428K184r195N662N8P360J1419r124l566n71J768K796j283r510J59j3839
$$ y = [12774, 20834, 23075, 10507, -3160, 3416, 8051, 19316, 31254, 36148, 37909, 26649, 28166, 29436, 32524, 24300, 12934, 17652, 16216, 17343, 17733, 19519, 21483, 28718, 36209, 20132, 5317, 10930, 26759, 31681, 24185, 12295, 7740, 2434, 3044, 9805, 9193, 10807, 24409, 18806, 11140, 17528, 17907, 17041, 11258, 17316, 29321, 31311, 31910, 26024, 27734, 17037, 9609, 1740, 9294, 14766, 11472, 13517, 27790, 24690, 21510, 17584, 28648, 31326, 23454, 26798, 32654, 30928, 19569, 4693, 769, 527, 6577, 2578, 1056, 5111, 17166, 24467, 18903, 2061, -18893, -13494, -3116, -905, -2630, 5404, 8105, 2546, 9934, 675, 4211, -458, -1639, 512, -15235, -16975, -7587, -270, 9428, 11612, 2417, 8079, 8137, 15497, 26916, 17792, 14226, 13655, 15423, 18219, 16936, 7426, 7585, -6254]
11657f254K571P771M550k319n021O598P997M23p680j654k607n631N156R362R969
11642B3231n421p58j2052jQ769n148j358L711l36Q906n287j3393j4237j0355Q078
11627a5651J3101J5308R895J0746m882q890j6259r594Q847N599N821Q803o25J340
11613B3559P307J819j1845n736J555L728m002j610q156N344j6o638p024K5405
11599B3690R601q974n828k016m739r297n126P690K758J3757L800L85M622j1367
11585A8956J909K346K561M258N812o317j0498n943o627j0075Q430K0005o480r952
11571H385o326J0729K507O124P764m25n424k42j866P335L297m723m843M289M731
11556C1312o5j1211j1581J0519N348O465N418j136K372p799L869J857j429r893
$$ y = [-6254, -3683, 4088, 8638, 6319, 1298, 7896, 15893, 16316, 8636, 6982, 4375, -1256, 3900, 13262, 23231, 17810, 17052, 5000, 4999, 13768, 8620, 7262, 10973, 10637, 19543, 14256, 863, -13374, -23729, -15651, -2550, 12758, 22653, 33399, 28517, 19627, 3368, -6226, 2621, 8220, 14041, 22844, 22219, 23559, 30866, 32685, 20840, 15104, 16659, 20387, 16385, 14775, 6619, 11963, 11947, 5309, -1715, 23690, 33291, 24317, 18489, 16473, 11734, 2437, -2689, 5001, 7759, 21516, 25316, 25701, 30323, 18956, 20865, 23211, 25772, 30030, 35842, 29525, 19027, 13084, 6457, -3618, 4812, 24817, 18337, 8385, 2059, 12788, 15295, 21419, 29183, 28758, 23334, 23092, 21226, 28561, 31858, 27135, 22292, 26581, 31312, 31247, 20036, 8455, 18974, 24322, 30787, 36205, 35069, 37441, 29642, 33511, 35368, 33939, 24046]
11542B4046J960J1164j506k2085k556j948m23J4589p173n618j4588J1561K5693
11529C3116J243K191P137P2M675j3250p444l841q332Q002j575j025J0365L983
11515C5317Q041j5548j3182K1628J9062r05m149j0718j0299N924r390j091R222
11502C3912O458j074j2281o851O990Q234J4045K9465J6877J8750J2492J8654K3048
11489A68719M5322L9077K9794J8487J2166j9989l5692k9878l6961m0769j9321
11478A30955j0222m691p132j5505j1145q258r455J609L579j326l776o506n356
11465E2771m678Q834J525p062j3904L375M299l997M488L413m525q902L819N62
11451D0018k935r216o510p49N506L844n736M731N286M705J2192j3331q73J967
$$ y = [24046, 26006, 37170, 35664, 13579, 11023, 9075, 8652, 23241, 16068, 10450, -4138, 7423, 33116, 34359, 36550, 43687, 43759, 48434, 35184, 27740, 23899, 15567, 23569, 21994, 20969, 31334, 35317, 43358, 27810, 14628, 36256, 55318, 54413, 50264, 39546, 29247, 35171, 25781, 24690, 33912, 40370, 39296, 27015, 20164, 27154, 35388, 49433, 78898, 95775, 114525, 127017, 145671, 168719, 214041, 253118, 282912, 301399, 313565, 293576, 257884, 228006, 191045, 150276, 130955, 120733, 116042, 108910, 93405, 82260, 74002, 64547, 66156, 69735, 68409, 64633, 58127, 52771, 48093, 56927, 58452, 51390, 37486, 40861, 45160, 41163, 45651, 49064, 44539, 35637, 39456, 40018, 37083, 27867, 21357, 20608, 26114, 29958, 24222, 28953, 34239, 38944, 51136, 37805, 36932, 38899]
11437C8899o000l260N409n478o496J0318J6566Q483j7029p695N028Q568J0249
11424E7562R65j4152k873P522M61j0641J3021P939j6950K515l228K444J1505l502
11410E2588k921r968O193J1318R329J5194K437j0585J2706J8573K8498L3105K3577
11397A90044o645k5137k2027j634j2006k6494j0208O505j3535r344L923K017r377
11384F6082m924k0696o131J118J2248J5389k312j0863j2255K4375J6206J770N493
11371H5500J2590M0255L2264J1961Q402p385j2838N325m965j4727J2140m41j778
11358A66303j3327j9797k0189k5177k0812r349K697N947M470lR850N270Q789O759
11344A01431L455J5786K1212K1218q905q231r828M04j102j1866j1043j8742j2218
$$ y = [38899, 32899, 29639, 35048, 29570, 23074, 33392, 49958, 58441, 41412, 33717, 38745, 47313, 57562, 58527, 44375, 41502, 49024, 49485, 38844, 51865, 59804, 42854, 45369, 42141, 44585, 56090, 52588, 49667, 39699, 45892, 57210, 66539, 81733, 84170, 73585, 86291, 104864, 133362, 166467, 190044, 183399, 158262, 136235, 134601, 122595, 96101, 85893, 92398, 78863, 69519, 73442, 75459, 66082, 61158, 40462, 34331, 35449, 47697, 63086, 60774, 49911, 37656, 62031, 78237, 80007, 85500, 98090, 138345, 170609, 182570, 190972, 183587, 170749, 176074, 171109, 156382, 168522, 168081, 166303, 152976, 133179, 112990, 87813, 67001, 57652, 60349, 66296, 70766, 70763, 80613, 85883, 94672, 101431, 104886, 120672, 141884, 163102, 154197, 145966, 136138, 136542, 135440, 123574, 112531, 93789, 81571]
11331H1571k890p703J583O690j0963r574r497K060j14J002r780m746P732N768
11317E1139n41J3229M994l838M287L58q936J64k602r372N028Q582j1191j3353
11303C7948n943J114J2540J6966r118r920k087l607L476J4782M65p954j3627M557
11289C9592J260P71O436N212n087k81l215L349N955J379J137j1276j8444O46M491
11274C1925j1018o867K4435P192j480m332k527K224j415r368m861J7593J2702
11261E4203q750m86J06q431M451N896l883j4660L872q238n915R81K1345L959q184
11246C6266k611k387O627L791l187j4368r267m918J0899M135R515J1831R273p77
11232E4822J3085k931n448R015j1360j3416P59K2675R374M841p128j3704q849
$$ y = [81571, 78681, 70978, 72561, 79251, 68288, 58714, 49217, 51277, 51163, 52165, 42385, 37639, 45371, 51139, 50598, 63827, 68821, 64983, 69270, 69628, 60692, 60856, 58254, 48882, 53910, 62492, 51301, 37948, 32005, 33119, 45659, 62625, 53507, 43587, 41500, 37893, 41369, 56151, 56616, 48662, 35035, 39592, 40852, 41623, 48059, 53271, 48184, 47903, 44688, 48037, 53992, 55371, 56508, 45232, 26788, 27434, 31925, 20907, 14040, 38475, 45667, 44187, 39855, 37328, 39552, 38137, 28769, 23908, 41501, 54203, 45453, 44967, 45073, 36642, 41093, 46989, 43106, 28446, 32318, 24080, 18165, 19146, 40491, 44450, 36266, 33655, 31268, 37895, 41686, 38499, 24131, 14864, 9946, 20845, 24980, 34495, 46326, 55599, 54822, 67907, 64976, 59528, 68543, 57183, 43767, 44526, 67201, 76575, 81416, 74288, 60584, 51735]
11219E1735j0967o659j974P226K891M895q69j229n598L672J2008J0814P443L048
11205G6436K0743m06l244m56l849m790l644M482P251m418J4870J6550q937j5393
11191I5195l510J1O166q124j2806Q014M347N473m057j7300j4082J347p403l825
11177D9446J0237M078k983j39r889P088m03p156M68J0255j2896p214J657R559
11163E2108K797l05J1029M342N361l117k304r905j793m147o18N54N411J382N388
11148F6183J270j4329k0745j364J1785n917j0016J1270J2772J3333l028l359k695
11135E5160j2813l035K352k139m72O36L158r3p88M369p708j8312R518R4m106n4
11119B5767P287Q487K161r856k751L156J638J0873m452Q459P23j3969j3815L143
$$ y = [51735, 40768, 34109, 32135, 39361, 42252, 47147, 46278, 45049, 39451, 43123, 55131, 65945, 73388, 76436, 97179, 96773, 93529, 93073, 89224, 84434, 80790, 85272, 92523, 88105, 102975, 119525, 110588, 95195, 91685, 91696, 97862, 89738, 76932, 84946, 89293, 94766, 90709, 73409, 59327, 60674, 53271, 49446, 59683, 63761, 60778, 60639, 50750, 57838, 57435, 50279, 50747, 61002, 48106, 40892, 42549, 52108, 54905, 54600, 65629, 69971, 75332, 72215, 69911, 60006, 58213, 54066, 53448, 54002, 59413, 60795, 66183, 67453, 53124, 32379, 31015, 42800, 36883, 26867, 38137, 50909, 64242, 61214, 57855, 55160, 42347, 39312, 41664, 39525, 39053, 39689, 42847, 42754, 41966, 46335, 38627, 20315, 29833, 29927, 25821, 25767, 33054, 41541, 43702, 33846, 31095, 34251, 35889, 46762, 42310, 50769, 51492, 37523, 23708, 26851]
11105B6851Q472P678M485P367M656Q175m762j1418l279J5238P140k064o764o784
11091E4991n927L610J1864P577o572j0902k72J3285J632j4386l324P691n620J2372
11077F6019m143j1274o21R765J0852J5136l483l987k52j3990j8397m899n142Q381
11063D3965p222M250J2258k581Q406N563k63L506N45R006j307p003j1166p080
11049E0877m554q788R162K1112R057r929j5840K328Q026N583O000j726k3774j0819
11035C6715k695l522l823Q100J8628j504p971P439r924m874J2697J271R455J762
11021F1754j1282n241j1650R794R074q369p687R846J3595n036r175J3171L806
11008F2600O026j388R551j544k3079k820M016o575J036J2747M043j2604j3433
$$ y = [26851, 35323, 43001, 47486, 54853, 59509, 67684, 62922, 51504, 48225, 63463, 70603, 68539, 61775, 54991, 49064, 52674, 64538, 72115, 65543, 54641, 54369, 67654, 69286, 54900, 51576, 59267, 53647, 66019, 61876, 50602, 49981, 59746, 70598, 85734, 82251, 78264, 78012, 64022, 45625, 40726, 35584, 43965, 36743, 40993, 53251, 50670, 59076, 64639, 64376, 67882, 68427, 77433, 76126, 69123, 57957, 50877, 46323, 37535, 46697, 67809, 76866, 66937, 51097, 53425, 61451, 67034, 73034, 71308, 47534, 36715, 34020, 30498, 26675, 34775, 53403, 51899, 43928, 51367, 41443, 36569, 49266, 50537, 59992, 61754, 50472, 45231, 33581, 43375, 52449, 44080, 36393, 46239, 59834, 54798, 45623, 58794, 62600, 68626, 67238, 76789, 75245, 52166, 49346, 53362, 46787, 47823, 60570, 64613, 52009, 38576]
10995C8576J1240qo253m810r74n248Q673J2971K1780J1510r91J998L773j2326
10981G9911m803M491J0860N0j2331n05q53n923N359P536J0697N204J2281J820
10967A13794O519J3383K6219K7623J2880L8297M3407J6354J9857J3299K2358M4790
10955C98780P7798J03638J32454J94033K89822L53532L11506J20009k03464l73024
10945A405084l53621k74993j70395r2723p3655m8781k9251k8950k7697k2827j4913
10934B67278j9481j6891k4291j5629j0499k965J6132R818j5701j2258j0038k764
10922A62711j5372j4837j0383o636m720n20K408q332l960q121j0041n535l816
10909G2846P527J5373J5046j0231j4661K909j804j498p884O388J1310j1160j7683
$$ y = [38576, 49816, 49808, 43555, 38745, 37771, 32523, 41196, 54167, 75947, 87457, 86466, 88464, 92237, 79911, 75108, 79599, 90459, 90509, 78178, 77673, 76820, 70897, 76256, 83792, 94489, 99693, 111974, 113794, 120313, 133696, 159915, 187538, 200418, 238715, 282122, 298476, 318333, 331632, 353990, 398780, 476578, 580216, 712670, 906703, 1196525, 1550057, 1861563, 1981572, 1778108, 1405084, 1051463, 776470, 606075, 513352, 439697, 390916, 361665, 332715, 305018, 282191, 267278, 247797, 230906, 206615, 190986, 180487, 177522, 193654, 203472, 187771, 175513, 165475, 162711, 147339, 132502, 122119, 115483, 110763, 110243, 112651, 104319, 100359, 92238, 82197, 76662, 72846, 80373, 95746, 110792, 100561, 85900, 88809, 87005, 85507, 77623, 84011, 95321, 84161, 66478]
10896F6478j0815K37r245M675N609J0724Q957J1590m457n158q087k873N524N7
10882G3216k238N125J418J230k673N336l260R857j6485l389J5128J1701j4474
10869H0492j062K065j0248L504M318J2173o685n453Q008K391p382j928J3011J3789
10855A06993o812j643l269k889p614Q824O593J7609n053J117J775n67m584j5438
10841I5042q527J839j972j5486j31J3287K4768J7389O746r225r891j4227j7604
10828H2008j2677j2909m137J0997j458J1489r815j4800J6017K5088O480j1374
10816H4909q599m803o345N568K616P15l746j0716p902k007q415J094J6203m945
10802E3627N563j056K0951K6614J1884J6928j243Q489K1036K269M116P677Q594
$$ y = [66478, 55663, 55900, 46655, 51330, 56939, 67663, 76620, 88210, 83753, 78595, 70508, 67635, 73159, 73216, 70978, 76103, 77521, 78751, 76078, 81414, 78154, 88011, 71526, 68137, 83265, 94966, 80492, 79430, 81495, 71247, 74751, 79069, 91242, 84557, 79104, 87112, 89503, 82121, 80193, 93204, 106993, 100181, 98538, 95269, 92380, 84766, 93590, 100183, 117792, 112739, 113856, 115631, 115064, 110480, 95042, 86515, 88354, 86382, 70896, 70765, 84052, 108820, 126209, 132955, 123730, 113839, 99612, 82008, 69331, 56422, 52285, 63282, 61824, 73313, 63498, 48698, 64715, 89803, 96283, 84909, 76310, 71507, 65162, 70730, 73346, 74061, 70315, 59599, 51697, 49690, 41275, 42369, 58572, 53627, 59190, 58134, 79085, 105699, 117583, 134511, 133268, 141757, 162793, 165062, 169178, 176855, 185449]
10789A85449K0580J0414M553R487Q064J3287J2954J1959J226k7125l3954j1328
10777B05566k8708j5160j9567k304J0192m813O41j3928k1346K523J0378m659k228
10764A16587l983J787M745k240r568m737N751O613N673Q28m070N829L472j1605
10750A15082k5353j1578m963r491m464M869o216M641Q217m094J308N502R428K6053
10736A08941L747J4780J0731J2555J5738J8607P655Q95l337o429q222m817P518
10723A78362j6236j6537j2166m64K28q670k731J0828j6067j7672k024R167L825
10710A09843j4383j2589k152J1712K0142J3724J2627J752J3293K0794L987q266
10698A70484N175m630q280J2428J3962O567O109J1491J3458M303J4560O816J9748
$$ y = [185449, 206029, 216443, 220996, 230483, 238547, 251834, 264788, 276747, 277973, 250848, 216894, 205566, 176858, 161698, 142131, 139827, 150019, 145206, 145847, 131919, 110573, 113096, 123474, 118815, 116587, 112604, 114391, 119136, 116896, 107328, 102591, 108342, 114955, 120628, 121456, 117386, 123215, 126687, 115082, 89729, 78151, 73188, 63697, 59233, 64102, 57886, 62527, 70744, 66650, 67958, 73460, 82888, 108941, 112688, 127468, 138199, 150754, 166492, 185099, 192754, 193649, 190312, 183883, 175661, 170844, 178362, 162126, 145589, 133423, 132959, 133187, 124517, 121786, 132614, 116547, 98875, 96851, 106018, 109843, 95460, 82871, 80719, 92431, 112573, 126297, 138924, 140676, 153969, 174763, 178750, 170484, 175659, 171029, 162749, 175177, 189139, 195706, 201815, 213306, 226764, 231067, 245627, 252443, 272191]
10685B72191K2140K1999K5951k339j6720k7260p9606p3401l4650j244J2941J4649
10673A34651J1316K4638J6681N607K5446J8384J780J1238L5474L2461M9958N5794
10661D23428M9175N9674K8148J6211J1315O485j6357o7388r1125q2293l3004j2991
10649B91278k1440k5696j599J3386J1568P399J6011M994L722J6895M513j733J0242
10636C29540n646j0079K332J8082J4260K43M733J7771J4488J7246J90J6023J7129
10623D36312J0843Q939K1228J3393Q605J0539r321N434P769K7576J9024J6000
10611E76341K9037J0798J2481J3362N251N492J8998K6322J9135R981K0698L765
10599G51661J5858L501J5461K8781K2256L691M885o874K621J0815J6376K9250
$$ y = [272191, 294331, 316330, 342281, 339942, 323222, 295962, 216356, 142955, 108305, 107061, 120002, 134651, 145967, 170605, 187286, 192893, 218339, 236723, 238503, 249741, 285215, 317676, 367634, 423428, 472603, 532277, 560425, 576636, 587951, 594436, 578079, 510691, 419566, 337273, 304269, 291278, 269838, 244142, 242543, 255929, 267497, 274896, 290907, 295901, 299623, 316518, 321031, 319298, 329540, 323894, 313815, 316147, 334229, 348489, 348732, 353465, 371236, 385724, 402970, 403160, 419183, 436312, 447155, 456094, 477322, 490715, 499320, 509859, 500538, 505972, 513741, 541317, 560341, 576341, 605378, 616176, 628657, 642019, 647270, 652762, 671760, 698082, 717217, 727198, 747896, 751661, 767519, 771020, 786481, 815262, 837518, 841209, 846094, 839220, 841841, 852656, 869032, 898282]
10587H98282M4146L9353M2286N5044O8423Q8230Q0893Q5293Q5913N8818M9005
10576A595686L3836J9218J6507L6246M0459P4445P5471M3793N9843P7097R8458
10565B171059J12766R3042J01065J26287J48118J86382J99290K21017K51707K95233
10555C905966L54538M26429N13296N89480P17042Q92481J070982J160580J148407
10546A0779201J052180R88563J231835J794988K524533L414645M445946N743004
10538C1974895P470414R944212J3540271J8896393K6861065L8564405N4435103
10531B01686758O8941397O6266124L2598315k7319416p4645471p4104577n1674018
10524A41749112l3064561k1551015j4613553j0421642p758237n883893m520271
$$ y = [898282, 942428, 981781, 1024067, 1079111, 1147534, 1235764, 1316657, 1401950, 1487863, 1546681, 1595686, 1629522, 1648740, 1665247, 1701493, 1741952, 1816397, 1891868, 1935661, 1995504, 2072601, 2171059, 2283825, 2376867, 2477932, 2604219, 2752337, 2938719, 3138009, 3359026, 3610733, 3905966, 4260504, 4686933, 5200229, 5789709, 6506751, 7399232, 8470214, 9630794, 10779201, 11831381, 12819944, 14051779, 15846767, 18371300, 21785945, 26231891, 31974895, 39445309, 49389521, 62929792, 81826185, 108687250, 147251655, 201686758, 270628155, 336894279, 369492594, 342173178, 267527707, 193423130, 141749112, 108684551, 87133536, 72519983, 62098341, 54340104, 48456211, 43935940]
10517D3935940l586224k924031k438953k065748j672272j335617j092559j036142
10509B7784394j128451j268160j444807j616111j634590j535592j415208j299217
10501A6442258j170586j041403r41154q31627p46707o56524n90707n02797l88362
10492I572391l00891k35013j63734j18296j19105j66846k48926l52025m82815
10483G384740n76752n93741n45488m48198l70345l15365k61093k19675j93361
10474C860722j70974j54337j58174j55724j65297j30993j26524j39631j19108
10465B539960j16997j15088j01582j16341j02698q7914o8015q6621q3314p2179
10455A589211n9606m6409m4984l5291n5295o0207m3678m8945m3513l9406m5364
$$ y = [43935940, 40349716, 37425685, 34986732, 32920984, 31248712, 29913095, 28820536, 27784394, 26655943, 25387783, 23942976, 22326865, 20692275, 19156683, 17741475, 16442258, 15271672, 14230269, 13289115, 12457488, 11710781, 11054257, 10463550, 9960753, 9572391, 9271500, 9036487, 8872753, 8754457, 8635352, 8468506, 8219580, 7867555, 7384740, 6807988, 6214247, 5668759, 5220561, 4850216, 4534851, 4273758, 4054083, 3860722, 3689748, 3535411, 3377237, 3221513, 3056216, 2925223, 2798699, 2659068, 2539960, 2422963, 2307875, 2206293, 2089952, 1987254, 1899340, 1831325, 1744704, 1661390, 1589211, 1529605, 1483196, 1438212, 1402921, 1347626, 1287419, 1243741, 1194796, 1151283, 1111877, 1066513]
10444A066513l9668j2789j8411k8279l2823l9905l9182k5354j2283j5373k2739
10433G79707j9748j0065k7483k9019k8199l396L329j005j0455j1193j6489l0260
10421E95724k2340k5798j7839K042Q149O855J7940J4073J7522K5039K7228K8843
10409F77438K4526M365J1603K036j8605o9639r4062l9146K528j6115j9550j0173
10397D55206m397n157r193L372J1540P558p850m092j0508J444j83J720K0071J1821
10383D71352o153K642j1821k9860n3769n1223n6586k5554J1696K3204L3060L5499
10371C42487O835q4J4419K0463K695p889o462J114J858K235j0134K296j382L879
10357C72330O738K965J2976K258K2709J0471L339J1328J5268J830k1305j7840
$$ y = [1066513, 1026845, 1014056, 995645, 967366, 934543, 894638, 855456, 830102, 817819, 802446, 779707, 759959, 749894, 722411, 693392, 665193, 661797, 665126, 664121, 653666, 642473, 625984, 595724, 573384, 547586, 529747, 531789, 539938, 546793, 564733, 578806, 596328, 621367, 648595, 677438, 701964, 706329, 717932, 719968, 701363, 631724, 537662, 498516, 501044, 484929, 465379, 455206, 450809, 445652, 436459, 439831, 451371, 458929, 451079, 446987, 436479, 437923, 437740, 439460, 459531, 471352, 465199, 467841, 456020, 426160, 372391, 321168, 264582, 239028, 250724, 273928, 306988, 342487, 349322, 349238, 363657, 384120, 386815, 378926, 372464, 373578, 375436, 377671, 367537, 369833, 368451, 372330, 379068, 382033, 395009, 397267, 419976, 430447, 433786, 445114, 460382, 462212, 440907, 423067]
10345D23067k876m381l494j859j5691j335L696l154k3360l0930k7394j1974j1733
10332B88582j9465p025j4746j4212j804P023Q049K8717J4665J0001J4946J4631
10320C29362K079J5150Q457o271o77p729j4850j2031k4080k0783o178r152O301
10307B59598j377O673j0486L789J3287N67j1425q663n26M184r430j2983l785n185
10293B24238o816N963N221l822r818L413R283k285p041J1889J6321J3539K2646
10280B82731R174J8183L0618k734k7058l1556k5872k7028m0164j0964j2326k817
10268A60187j597L152J0294l07r243O334M487o251j870M70J1662J3939J4004J4570
10254B19831O122N148J0088Q912L707j3259L15K316m998J862l899n129j5787R78
$$ y = [423067, 420191, 415810, 412316, 410457, 394766, 393431, 397127, 393973, 370613, 339683, 312289, 300315, 288582, 269117, 262092, 247346, 233134, 231330, 238353, 246402, 275119, 289784, 299785, 314731, 329362, 331441, 346591, 355048, 348777, 348100, 340371, 325521, 313490, 289410, 268627, 262449, 253297, 259598, 258221, 264894, 254408, 258197, 271484, 272051, 260626, 251963, 251437, 255621, 246191, 233208, 229423, 224238, 217422, 223385, 228606, 224784, 214966, 218379, 227662, 225377, 218336, 230225, 246546, 260085, 282731, 291905, 310088, 340706, 337972, 310914, 279358, 253486, 226458, 186294, 175330, 163004, 160187, 158590, 161742, 172036, 171729, 162486, 168820, 173307, 167056, 165186, 165656, 177318, 191257, 205261, 219831, 225953, 231101, 241189, 250101, 253808, 240549, 240864, 243180, 238182, 240044, 236145, 231016, 215229, 216207]
10240B16207P864J6317O156j6803j680j636l605J6003J4976k291j2066r629j5024
10227B14789l4525j8825N878L0455K3943J8698K1474J5346P144Q686N55J2688
10215C06306J9723K8872L2172M8288P2222R9837J13290J24009J36258J12003P6433
10204A169413K6071m3634o1774m9736l8373p1863r0100r3375j12608j13743p2416
10193D47862m6416l4727k9240j2493m771q58q796p987P84J528m442K494k255j5166
10179B85517J0386M136J387O945P094K6782J9047P314r133k6361k9368j4414j3400
10166B75932k7152j455J478k1947j7457j3600N329L673N273m901j6635K237q022
10153A82753J013o27l498L709J120r084o166J889n566p783j0863m761Q163P920
$$ y = [216207, 224071, 240388, 246544, 229741, 228061, 226425, 222820, 238823, 253799, 251508, 239442, 229813, 214789, 180264, 161439, 167317, 197772, 221715, 240413, 261887, 277233, 284377, 293063, 293618, 306306, 326029, 354901, 387073, 435361, 507583, 607420, 720710, 844719, 980977, 1092980, 1169413, 1195484, 1151850, 1090076, 1040340, 1001967, 930104, 840004, 746629, 634021, 520278, 447862, 401446, 366719, 337479, 324986, 320215, 319357, 310561, 302574, 303358, 304886, 300444, 302938, 300683, 285517, 295903, 300039, 301426, 308371, 315465, 342247, 361294, 368608, 359475, 333114, 303746, 289332, 275932, 248780, 247325, 248803, 226856, 209399, 195799, 201128, 204801, 210074, 205173, 188538, 190775, 182753, 183766, 183139, 179641, 183350, 184470, 175386, 169220, 171109, 165543, 157760, 146897, 142136, 150299, 158219]
10139A58219j495J202K11o320l32P662J6799R089J794n100r581M570J1434p656
10125A80496N016J2533n65l330k558l341j0781K1209K7680K3008R744L5887M5127
10112C40125M2746N8901Q6146J21191J62470K32105L20174L60094K73874J7582
10102B015408k72059l68472l14136k20939j51659q7579o5004p2568l2174k7020
10092D03798k4786j1843K942l361j8084p158j6774k4032r958p556j1270J410j3707
10079B59621j0025j5146k7407n810J5511j124m504P76l942Q327q984j831N961
10066B11423k967j7839j5190j558j2489J4127J3453q379j341P810o249j1399m756
10053A64646l349j2326L009J7386K3195N144J8903K6775M3735M1077M3378M3641
$$ y = [158219, 156724, 157926, 158137, 151817, 151485, 159147, 175946, 185035, 186829, 181729, 172148, 176718, 188152, 180496, 185512, 198045, 197480, 194150, 191592, 188251, 177470, 198679, 226359, 249367, 259111, 294998, 340125, 382871, 441772, 527918, 649109, 811579, 1043684, 1363858, 1723952, 1997826, 2015408, 1743349, 1374877, 1060741, 839802, 688143, 600564, 535560, 462992, 430818, 403798, 379012, 367169, 370111, 366750, 348666, 341508, 324734, 300702, 290744, 283188, 271918, 273328, 259621, 249596, 234450, 207043, 201233, 216744, 215620, 211116, 211892, 207950, 216277, 207293, 205462, 211423, 208456, 190617, 175427, 173869, 161380, 175507, 188960, 180581, 179240, 187050, 180801, 169402, 164646, 161297, 148971, 151980, 169366, 192561, 197705, 216608, 243383, 287118, 328195, 371573, 415214]
10041D15214J4230j7022k4071l6859l8877k8595k3733k8335k6660n829R0p703
10029A91850k902j0813p333L63P233l432j2616q166j556j0073N265N925J941j0577
10015A45109J2658o454j9892j3248O964J711j3217j1241o912O834J1722J675O15
10002A16324k022O381p48m462o990K300j234p617O013L622M036K833N445m023
9988A19858q805j1018P418J7109j1279j9396j192J9056Q267j550J0166J0338j0939
9975A28033j054Q160K350J2881J1572O529J1371J3178k636k605j2266j4671o352
9962A54490j0237j3152K534N883k007K01P290K811K77J439j0973K172q011j2769
9948A19948k2880j0260J4649J1213k414j625O102N385j536J3808J094j6385o263
$$ y = [415214, 429444, 412422, 388351, 351492, 312615, 284020, 260287, 231952, 205292, 199463, 199553, 191850, 188948, 178135, 170802, 171165, 178398, 174966, 162350, 154184, 152628, 142555, 147820, 153745, 155686, 145109, 157767, 151313, 131421, 118173, 125137, 126848, 113631, 102390, 95478, 102312, 114034, 115709, 116324, 114302, 120683, 119935, 115473, 108483, 110783, 109549, 101932, 107945, 111567, 115603, 118436, 123881, 119858, 111053, 100035, 107453, 124562, 113283, 93887, 92695, 111751, 120018, 118468, 128634, 138972, 128033, 126979, 135139, 137489, 150370, 161942, 168471, 179842, 193020, 190384, 187779, 175513, 160842, 154490, 144253, 131101, 133635, 139518, 137511, 137712, 145002, 147813, 148090, 149529, 138556, 140728, 132717, 119948, 97068, 86808, 101457, 112670, 110256, 108631, 114733, 120118, 118582, 132390, 133484, 117099, 110836]
9935A10836Q430L486l642k111j343j427mL55L601K26n580o307o489j6564N549
9920H9016L927l750j6290R690L521L73j471R124K740Q588J28K999R623m939n315
9905A07964O568Q36L882o680m752q25M274l734L932R30j6796L990P202J852J2071
9890A20714J3701m313l639M131j0094j4846K62J3285j059O79P443r624j5383J0314
9876A11571J1236J883r193o750M890q124r415L249l26L937p790p351J6581J2410
9862A16808M347K613j0245m478J7945M717J2460Q303p706j4410p669q75R749n18
9848A31041m737j799l898k198o675J381J7210K4q446J3819O706m663j0655k961
9834A24149l914p098k108O244m503L148l936O167j772j1861m976R408l798J395
$$ y = [110836, 119266, 122752, 119110, 116999, 115656, 114229, 114225, 114580, 118181, 118407, 112827, 106520, 100031, 83467, 89016, 92943, 89193, 72903, 82593, 86114, 86487, 85016, 94140, 96880, 105468, 105596, 108595, 118218, 113279, 107964, 114532, 115368, 119250, 112570, 107818, 106993, 111267, 107533, 111465, 112395, 95599, 99589, 106791, 108643, 120714, 134415, 130102, 126463, 130594, 120500, 105654, 105916, 119201, 118142, 118821, 126264, 116640, 101257, 111571, 122807, 124690, 115497, 108747, 113637, 105513, 96098, 99347, 99021, 102958, 95168, 87817, 104398, 116808, 121155, 123768, 113523, 109045, 126990, 131707, 144167, 152470, 144764, 130354, 122685, 121810, 131559, 131041, 126304, 124505, 120607, 118409, 111734, 113115, 130325, 130349, 121903, 135722, 142428, 137765, 127110, 124149, 120235, 113137, 111029, 117273, 112770, 115918, 111982, 118149, 116377, 104516, 99540, 108948, 105150, 106545]
9820A06545l517o50J828J7621J4363M863L453k651j0586j8478j1257k218N290
9807A04606Q492J838l64n594J2553K3321j362m37N460O13n187j1563r244O31k681
9792A21082J558Q234j209l029j326m054j1477O059R742J5521J0262q042r755r018
9778A24548j763J4945M339o249j1725n708j373P998k454p654J6834j3817j283
9765A16638O113m7j3475j0218J483M167k889r974n372R001R287j832K492K971
9751A08345n642r347Q908J1106Q733m0j1993l367J0362K32K327j0612L77k96K226
9736A11319j653R207k626j4703M15M397O385Q443R827j2189L464P938L197j660
9722A31761R681k063n181r723j0123q169l803N352L655j917j2743J853k66L531
$$ y = [106545, 103028, 102378, 104206, 121827, 136190, 141053, 144506, 141855, 131269, 112791, 101534, 99316, 104606, 113098, 114936, 114572, 108978, 121531, 144852, 143490, 143053, 148513, 149126, 143939, 132376, 123132, 123763, 121082, 122640, 130874, 129665, 126636, 125310, 121256, 109779, 115838, 125580, 141101, 151363, 143321, 133566, 124548, 122785, 137730, 142069, 135820, 124095, 118387, 117014, 125012, 122558, 114904, 131738, 117921, 116638, 122751, 122704, 109229, 99011, 100494, 104661, 101772, 91798, 86426, 95427, 104714, 102882, 105374, 108345, 102703, 93356, 102264, 113370, 122103, 122063, 110070, 106703, 117065, 117297, 119624, 109012, 109389, 109093, 111319, 109666, 118873, 116247, 101544, 101959, 106356, 112741, 121184, 131011, 118822, 122286, 130224, 133421, 131761, 141442, 139379, 134198, 124475, 114352, 106183, 102380, 107732, 111387, 109470, 96727, 98580, 98314, 101845]
9708A01845O492J2500J0666rk533J168N523m252j5133N74L666K133M249J7025
9694A43914J425j852j4145K088M359r207o955j945j590o241k521N549q278P706
9680A12307K2855j688j0999l005J5134J3468R104m970r72q359M369M237l871r72
9666A46638r41n862m347L428O896J341k067j3299j3210P338q68L862J445j2010
9652A18344m822m473Q688L165J0723p550j4085o12N417M774j1756q411J6361Q097
9638A23860p884r75P302j96q375j133Q499J1372n454l040l45J551K0284j4109
9624A31357r840K06K398j755O632n014M226K443J9579l200j2012k546q640k99
9610A23535O135j2993m688L314R974j3830o951J0396J2051M28m291N13j2168p817
$$ y = [101845, 108337, 120837, 131503, 131494, 128961, 130129, 135652, 131400, 116267, 116841, 120507, 122640, 126889, 143914, 145339, 143487, 129342, 131430, 135789, 126582, 119627, 117682, 116092, 109851, 107330, 112879, 104601, 112307, 135162, 133474, 122475, 119470, 134604, 148072, 157176, 152206, 151234, 142875, 147244, 151481, 147610, 146638, 145697, 139835, 135488, 138916, 145812, 147153, 145086, 131787, 118577, 125915, 125047, 128909, 130354, 118344, 113522, 109049, 117737, 120902, 131625, 124075, 109990, 109378, 114795, 119569, 107813, 99402, 115763, 123860, 115976, 115001, 122303, 122107, 113732, 112599, 121098, 132470, 127016, 123976, 123631, 125182, 145466, 131357, 121517, 121723, 124121, 122366, 128998, 123984, 128210, 130653, 150232, 147032, 135020, 132474, 123834, 123535, 129670, 116677, 111989, 115303, 125277, 111447, 104496, 114892, 126943, 127371, 123080, 123593, 111425, 103608]
9596A03608J435J5762O586K151k909q173J450N977n763j1432J2510P57O3M961
9582A26983m220J37P793L819k744l029o869m578J3808p143L400N412j7459n657
9568A09653M882R056J3282o377j5098P740J2076o215J3137P010O719j4915n488
9555A35462l793p450m143N942J6401p797l464r988p76j675O792q647J157j587
9541A16434J5293J0635q646j82J0260L696O49n951R004J0299k793o181j5073q129
9527A29315j232j1266k954J0282K2730K538j571m18p906k248J3024J3295j8432
9514A45157J722k614K388n445q160j9625O040J5348o049l351J1641Q503p344L197
9500A41408m813j0778L458Q165J1326k545n431q157K267k946M852Q539q065k723
$$ y = [103608, 105043, 120805, 127391, 129542, 126633, 118460, 119910, 125887, 120124, 108692, 121202, 121959, 122022, 126983, 122763, 122900, 130693, 134512, 131768, 128739, 121870, 117292, 131100, 123957, 127357, 132769, 115310, 109653, 114535, 123591, 136873, 130496, 115398, 123138, 135214, 128999, 142136, 149146, 155865, 140950, 135462, 131669, 124219, 120076, 126018, 142419, 134622, 131158, 121170, 120394, 118719, 125511, 116864, 118021, 116434, 131727, 142362, 133716, 133534, 143794, 147490, 148139, 142188, 151192, 161491, 158698, 152517, 137444, 129315, 128083, 116817, 113863, 124145, 146875, 149413, 147842, 147424, 139518, 137270, 150294, 163589, 145157, 146879, 144265, 146653, 141208, 133048, 113423, 119463, 134811, 128762, 125411, 137052, 145555, 138211, 141408, 136595, 125817, 129275, 137440, 148766, 146221, 140790, 132633, 134900, 131954, 136806, 145345, 137280, 134557]
9486A34557j611R204k538q724j059P897R034M320L209j5088p863k816o902k520
9472A19100J380O1M078N491j681j550Q565j420m053j0890J795P95j466j00Q644
9457A28749q192m778N64O068J5539K391Q912j0841l144k494K645n484j3385J425
9443A17975J5477m652j173j185J3603P574K891J0127r112j8476n166K252n42M486
9429A34079j0840J3508Q647m749j9212m560J3478m827J862J493n391P080j988
9416A28580R024J9211J2873k004j7102k569K767l763O92J762j0929q848J5445
9403A45139J6182n685o137K978M435o140N577O298q254k5585m556J2903m365m530
9389A28260J048K023L772J9276J9580n185o902j4297K722O148r888j648O908R589
$$ y = [134557, 132946, 142150, 139612, 130888, 129829, 137726, 146760, 151080, 154289, 139201, 131338, 128522, 121620, 119100, 120480, 120541, 124619, 130110, 128429, 126879, 135444, 134024, 129971, 119081, 120876, 121671, 120205, 120105, 128749, 120557, 115779, 116343, 122411, 137950, 140341, 149253, 138412, 135268, 132774, 135419, 129935, 116550, 117975, 133452, 128800, 127627, 126442, 140045, 147619, 150510, 160637, 151525, 133049, 127883, 130135, 129593, 134079, 123239, 136747, 145394, 140645, 121433, 116873, 130351, 125524, 127386, 128879, 123488, 130568, 128580, 137604, 156815, 169688, 167684, 150582, 148013, 150780, 147017, 147709, 149471, 138542, 129694, 145139, 161321, 155636, 149499, 152477, 156912, 150772, 156349, 162647, 154393, 128808, 124252, 137155, 132790, 128260, 129308, 131331, 135103, 154379, 173959, 168774, 161872, 147575, 150297, 156445, 146557, 144909, 151817, 161406]
9375A61406J417M781j2303j1740l830J2771M743k956l131m049L956m403m448O027
9361A48241j014J4062J6038p682L18m263k743j1446m287P99K217r99l5m636j2288
9346A32282J3347j072r77J2664O033k396p126k205K289m087N376p75q772J052
9332A45633L836o79J5977J3547J6107k038m866j0091j8568j0584J5374J8136n064
9319A76720L800k868q235j1146J0959N07M053q448r588k186p824K7472J3680j4065
9305A72831j7064P647J9311p635N711J08J2856N678j3511m557n909l384J187O687
9291A79956p534l333J664L385j1860l559q561J2051M997p73J1130J1011O448o569
9277A88453j6013j1909J082K978J2141Q314k077P688J1133j0535l099M92J1477
$$ y = [161406, 162823, 167604, 155301, 143561, 139731, 152502, 157245, 154289, 151158, 147109, 151065, 146662, 142214, 148241, 147227, 161289, 177327, 169645, 169963, 165700, 162957, 151511, 147224, 148023, 150240, 149241, 149206, 144570, 132282, 145629, 144557, 143580, 156244, 162277, 159881, 152755, 150550, 152839, 148752, 154128, 153353, 144581, 145633, 149469, 148790, 164767, 178314, 194421, 192383, 187517, 177426, 158858, 148274, 163648, 181784, 176720, 180520, 177652, 169417, 158271, 169230, 169737, 173790, 165342, 155754, 153568, 145744, 173216, 186896, 172831, 155767, 163414, 182725, 175090, 180801, 180909, 193765, 199443, 185932, 181375, 175466, 172082, 173269, 179956, 172422, 169089, 170753, 174138, 162278, 158719, 150158, 162209, 167206, 166433, 177563, 188574, 195022, 188453, 172440, 160531, 161613, 164591, 176732, 185046, 182969, 190657, 201790, 191255, 188156, 188648, 200125]
9264B00125M366j8035Q30j66p954R800P993p566j6321M506J2846K6406m32j2978
9250B03420j2473o002M977k421J1030O668J4493p061M012O259o812q870k727K583
9236B07076k466k05q104P275N312L555j2325N079N400J101J7702J0047j2463p044
9222B19940J0098q37j4140k718J1852M74k1521J193L581J269J3612M375k676M126
9208B28628n945k80L647p371k723J3151J2319k096N98l33l914J680N666o287P669
9193B44409K1294J2046j0437k4000k86Q771P856k066j2635O654O734O592M774
9180B69706J2616j743q337q260K555J635j3405m058M049N151l598O749J5267R663
9166B87990M040L004n704n368j0366k605O004M95J2795J4k390K737n632K562J3900
$$ y = [200125, 204491, 186456, 187286, 187120, 179166, 188966, 196959, 189393, 173072, 177578, 190424, 216830, 216398, 203420, 190947, 184945, 189922, 187501, 198531, 205199, 219692, 212631, 216643, 222902, 216090, 207220, 204493, 207076, 204610, 204405, 196301, 203576, 208888, 212443, 200118, 205197, 210597, 211698, 229400, 239447, 226984, 219940, 230038, 229201, 215061, 212343, 224195, 224669, 203148, 204341, 207922, 209191, 222803, 227178, 224502, 228628, 222683, 222403, 226050, 218679, 215956, 229107, 241426, 239330, 239928, 239595, 235681, 237361, 243027, 236740, 244409, 265703, 277749, 267312, 243312, 243026, 251797, 259653, 257587, 244952, 251606, 258340, 264932, 269706, 282322, 280579, 272242, 263982, 266537, 268172, 254767, 250709, 254758, 259909, 256311, 263060, 278327, 287990, 292030, 295034, 289330, 283962, 273596, 270991, 276995, 277490, 290285, 290299, 287909, 290646, 285014, 287576, 301476]
9151C01476R636j506j0047K321R47n51K364J314P893O419K770j4239j0412P662
9137C06047q308l544R247O241K6970O259k411q989o733J1973o70M265J980Q964
9123C51291k31p556j0633m261O864K670Q774M107Q748p913k763K570L599J9148
9109C74414K790l783J0702J3951j4320k270p820K278P168L305r324j3182R720
9096C73629J7651O536K177Q190J0895P920L776M351J5013R429n655j0185L93Q91
9082D45011j380P55M110J5098j6334j3632o70J2746J7674K6939J4103O938k540
9069E08818o70o988j2208J0592k673j373K5692Q020L562j558J0707J3651R425
9056E64997o327p153K323J3089J3624K1247L807j3867P454Q166l619J0807J1515
$$ y = [301476, 311112, 309606, 299559, 301880, 302827, 302276, 304640, 305954, 313847, 320266, 323036, 308797, 298385, 306047, 297739, 294195, 303442, 309683, 336653, 342912, 340501, 331512, 324779, 336752, 336082, 340347, 342327, 351291, 351060, 343504, 332871, 328610, 335474, 338144, 346918, 351025, 359773, 351860, 349097, 351667, 355266, 374414, 377204, 373421, 384123, 398074, 383754, 381484, 373664, 375942, 383110, 386415, 377091, 363909, 373629, 391280, 397816, 399993, 408183, 419078, 426998, 430774, 435125, 450138, 459567, 453912, 443727, 444120, 445011, 443631, 444386, 448496, 463594, 447260, 433628, 432958, 445704, 463378, 490317, 504420, 511358, 508818, 508148, 501160, 488952, 499544, 496871, 495498, 521190, 529210, 532772, 531214, 541921, 555572, 564997, 558670, 551517, 553840, 566929, 580553, 601800, 605607, 591740, 599194, 607360, 603741, 614548, 626063]
9043F26063P082J2376K2795J4705O722J4005J972k687M90j76J2058J4312M341
9030G34058J1274K9677J8889P810J0477j297M331K770J2225J1589J3300R200M5
9017H64348J2219J7462R147O57l49J2477K5832J5044K0536K5071J4600J7505J8218
9004A052767J5819J1769L41P503J7307K3034J1017K0461J6287N552J1376J5695
8992A208928K7311L3193J6217J5240K1133L0750M0001K3648Q677L1918M3644K7079
8980A527739J8840J9771L6845M3427L4370L4406M2888M0050L3942K4617L5628
8969A892523M6534M7417N6208N4661L7826M9687M7456M2296O0249N0402O0254
8958B445513P6319N4764O1645O4331O5512O8253P9011O4772N8445Q1411R7435
$$ y = [626063, 633145, 645521, 668316, 683021, 689743, 703748, 705720, 703033, 703523, 703347, 715405, 729717, 734058, 745332, 775009, 793898, 801708, 812185, 810888, 815219, 817989, 830214, 841803, 855103, 864303, 864348, 876567, 894029, 903176, 903833, 903484, 915961, 941793, 956837, 977373, 1002444, 1017044, 1034549, 1052767, 1068586, 1080355, 1080696, 1088199, 1105506, 1128540, 1139557, 1160018, 1176305, 1181857, 1193233, 1208928, 1236239, 1269432, 1285649, 1300889, 1322022, 1352772, 1392773, 1416421, 1425098, 1457016, 1500660, 1527739, 1546579, 1566350, 1603195, 1646622, 1680992, 1715398, 1758286, 1798336, 1832278, 1856895, 1892523, 1939057, 1986474, 2042682, 2097343, 2135169, 2184856, 2232312, 2274608, 2334857, 2385259, 2445513, 2521832, 2576596, 2638241, 2702572, 2768084, 2836337, 2915348, 2980120, 3038565, 3119976, 3217411]
8947C217411R9840J01496J12440R6848J00672J24205J15398J25453J21397J39627
8937D354787J56534J56828J53928J63986J84215J99491K05530J93756K02111J99538
8927F170704K09196K09894K23495K46270K56530K71704L04701L05901L15317L21687
8917H835399L31043L42035L54572L93607M06971L98314M24979M28593M41591M56513
8907A2813617M50634M56309M67334M52748M25715M21119M05199L81705L72580
8898A6646960L37200L08119K70133K37688J95192J32085P5888L1421n050n3062
8888A8176574j08993j55462j94269k25566k51379k99179l03061l20123l68399
8879A5950143l78494l88717l81945l88867m08520m14936l93091l86289l82698
$$ y = [3217411, 3317251, 3418747, 3531187, 3628035, 3728707, 3852912, 3968310, 4093763, 4215160, 4354787, 4511321, 4668149, 4822077, 4986063, 5170278, 5369769, 5575299, 5769055, 5971166, 6170704, 6379900, 6589794, 6813289, 7059559, 7316089, 7587793, 7892494, 8198395, 8513712, 8835399, 9166442, 9508477, 9863049, 10256656, 10663627, 11061941, 11486920, 11915513, 12357104, 12813617, 13264251, 13720560, 14187894, 14640642, 15066357, 15487476, 15892675, 16274380, 16646960, 16984160, 17292279, 17562412, 17800100, 17995292, 18127377, 18203265, 18234686, 18229636, 18176574, 18067581, 17912119, 17717850, 17492284, 17240905, 16941726, 16638665, 16318542, 15950143, 15571649, 15182932, 14800987, 14412120, 14003600, 13588664, 13195573, 12809284, 12426586]
8870A2426586l77064l71265l68702l58329l38355l34108l30474l25376l10489
8861I312424k90699k82026k88162k78748k79160k37863k41796k53303k31239k10975
8851F718453k10451k13459j99601j95449j78679j77635j70906j65312j48421j52235
8841D906305j51723j45489j17883j33034j33158j25771j22665j20742j01769r3290
8831C660781r4555r0610r0494r9773j01986q1680o2751p4594o5081n6758p7022
8820B765477p7078p5027o4240n6559p3500o5401m5684n0181n6392n2791m0189
8809B108435m1413n3330m7232m7651n0221m0676l6641m6188k4627k6453l0317
8798A663686l5567k5521k4879k2401k8255k4739j6365l2031k9764k8892k5717
$$ y = [12426586, 12049522, 11678257, 11309555, 10951226, 10612871, 10278763, 9948289, 9622913, 9312424, 9021725, 8739699, 8451537, 8172789, 7893629, 7655766, 7413970, 7160667, 6929428, 6718453, 6508002, 6294543, 6094942, 5899493, 5720814, 5543179, 5372273, 5206961, 5058540, 4906305, 4754582, 4609093, 4491210, 4358176, 4225018, 4099247, 3976582, 3855840, 3754071, 3660781, 3566226, 3475616, 3385122, 3285349, 3183363, 3101683, 3038932, 2964338, 2899257, 2842499, 2765477, 2688399, 2613372, 2549132, 2492573, 2419073, 2353672, 2307988, 2257807, 2201415, 2148624, 2108435, 2067022, 2013692, 1966460, 1918809, 1868588, 1827912, 1791271, 1745083, 1720456, 1694003, 1663686, 1628119, 1602598, 1577719, 1555318, 1527063, 1502324, 1485959, 1453928, 1424164, 1395272, 1369555]
8787A369555k7978k5594j6163j0328k0744l2649k8950k1123p432k0868k2416k6585
8775A108725j0679j0077q008j4084k0265m0082k8762j3197L791r168k0417j614
8763I36163P59j7624o610r842j9794k8087j1307j1426j0733r867o702j5151k9940
8750G59839r621Q927J5241j5153k2033n674j2274q409J289o360j2763k2878j6819
8737F53312o54R278j1610l687J275l789j5204p635R289p726p892j2829l734j3144
8723E85250N870j542N686j4891j0223j0676k68j265j1433j0732q685L594R453
8710E40138j6144j7654q190k33k40J683q944j3242j1063R413P527p13j1947l362
8696D67029K305j1671q488j1470j3259j067J1110k035j5856J736L219o301k007
$$ y = [1369555, 1341577, 1315983, 1299820, 1289492, 1268748, 1236099, 1207149, 1186026, 1178594, 1157726, 1135310, 1108725, 1098046, 1087969, 1079961, 1065877, 1045612, 1005530, 976768, 963571, 967362, 958194, 937777, 936163, 936922, 919298, 912688, 902846, 883052, 854965, 843658, 832232, 821499, 811632, 804930, 789779, 759839, 750218, 759145, 774386, 759233, 737200, 731526, 719252, 710843, 712132, 705772, 693009, 670131, 653312, 652658, 661936, 650326, 646639, 647914, 644125, 628921, 621286, 630575, 622849, 614957, 602128, 598394, 585250, 591120, 589578, 595264, 580373, 570150, 559474, 559206, 557941, 546508, 535776, 527091, 530685, 540138, 523994, 506340, 498150, 497917, 497677, 499360, 490416, 477174, 466111, 475524, 483051, 482338, 470391, 467029, 469334, 457663, 449175, 437705, 424446, 423379, 434489, 432454, 416598, 418334, 421553, 415252, 413245]
8683D13245K008q621j7888M537J1182l061j3765l923l266J1997K415j2710j3005
8670C69145o283k99K331j588r02J678O47M731l754j5814k14K939r456n584l202
8655C34375q770M583J1296j0285M340O900j5477K917J8864l227k1212p213n05
8642C16586j3000O481j0227j0297J1439j903j0266K926j19J8341J1404j1841j0895
8629B98629m333L317P957q985k86M800K475N046J481K043L930r223r684j3371
8615B83796r567R45K1228j2264j1200O14p399j0069N166M066J043k603N142P675
8601B76573o347o545J6206J1018J0098J7516j2135j8893p059j905P189Q444j5984
8588B78176r517p871j3867k631j1907j2148J1119J1165j0781o775K857m994j2920
$$ y = [413245, 415253, 406632, 388744, 393281, 404463, 401402, 387637, 383714, 380448, 392445, 394860, 382150, 369145, 362862, 362563, 364894, 363306, 362404, 364082, 364729, 369460, 365706, 349892, 349678, 352617, 343161, 337577, 334375, 325605, 330188, 341484, 331199, 335539, 342439, 326962, 329879, 348743, 345516, 324304, 317091, 316586, 303586, 310067, 299840, 289543, 300982, 299079, 288813, 291739, 291620, 309961, 321365, 309524, 298629, 294296, 297613, 305570, 296585, 296299, 301099, 303574, 308620, 310101, 312144, 316074, 306851, 297167, 283796, 274229, 275174, 296402, 284138, 272938, 273552, 266153, 256084, 261250, 265316, 266359, 263756, 268898, 276573, 270226, 263681, 279887, 290905, 301003, 318519, 306384, 287491, 280432, 278527, 285716, 294160, 278176, 268659, 260788, 246921, 244290, 232383, 220235, 231354, 242519, 231738, 224963, 227820, 222826, 209906]
8575B09906N24N096p912j2358l393K4055L244k0824l819m447n845N691L604q537
8561A84985P522O09q457j04J920O646P441j1778q280k050Q264J048K190J776j8862
8546A72870k1025R327J1379o093l08l567L7L880J1342j0337o052m521Q46J1136
8532A68914m2r341O165L714L545L304j27j4794j5248j164j580M7m17L638O830
8517A53444o317j6426L576P573J0638Q220j6183O43mn258P810Q214j3685j1968
8503A30277p59J7368J448K06p96J0623m328m775o008j004n185q39P677j3901q463
8488A21541p863K365k447l886N10J2256J5693Q601q246r443J5719J8779Q57j6504
8474A47932j6974J7348K0103j5453p032n176j4152R447R60N254l321n026o50O366
$$ y = [209906, 210430, 215526, 207614, 195256, 191863, 215918, 219162, 198338, 194519, 190072, 184227, 189918, 193522, 184985, 192507, 193116, 184659, 184555, 186475, 193121, 200562, 188784, 180504, 178454, 186718, 187766, 189956, 191732, 172870, 151845, 161172, 172551, 166458, 166150, 162583, 162620, 166500, 177842, 167505, 161453, 156932, 157778, 168914, 168872, 159531, 165696, 169410, 172955, 176259, 176132, 161338, 146090, 144926, 143346, 143393, 142976, 146614, 153444, 147127, 130701, 134277, 141850, 152488, 160708, 144525, 145168, 145164, 139906, 147716, 155930, 142245, 130277, 129518, 146886, 148334, 148540, 147744, 158367, 154039, 149264, 143256, 142252, 137067, 136228, 143905, 130004, 121541, 113678, 116043, 113596, 109710, 110220, 122476, 138169, 146770, 138524, 129081, 144800, 163579, 164436, 147932, 130958, 148306, 168409, 152956, 145924, 140748, 126596, 136043, 137003, 142257, 138936, 133910, 133260, 139626]
8460A39626l913p650J0366P339o139j7407P814Q856J5432l895n343o250Q97J2963
8446A52696J0943K3759J7515q581j4904k2837j6193j3284j3778r474J2890P304
8434A26056mJ303q570r54J237P013m83n110l351n297p333q91o48J1532J0091M365
8418A28956j0093j4467J4219R424k17r860J0006M448k1087k0386j1155J5074J4913
8405A09775M977N241j0221k583J9244q323j2286r682J820J64O745N360n88j2196
8391I7447j0494P412p482R727N439j342j0682j198O187n281P905l370n343J5222
8377A04147L089L214N060L626O88j0168p053m775K757P655k253l59j65J150K58
8362A06871j0855J0880J4594Q991J5579k526l043J660J0289J8420J466J8369L5813
$$ y = [139626, 135713, 128063, 138429, 145768, 139629, 122222, 130036, 138892, 154324, 150429, 145086, 138836, 139733, 152696, 163639, 187398, 204913, 196332, 181428, 158591, 142398, 129114, 115336, 105862, 118752, 126056, 126052, 127355, 118785, 117831, 119068, 126081, 125598, 120488, 117137, 111840, 104507, 103616, 102968, 114500, 124591, 128956, 118863, 104396, 118615, 128039, 127822, 117962, 127968, 132416, 111329, 90943, 79788, 94862, 109775, 114752, 119993, 109772, 107189, 126433, 118110, 105824, 96142, 97962, 98126, 104871, 110231, 109643, 97447, 86953, 94365, 86883, 96610, 102049, 100707, 90025, 88827, 95014, 89733, 97638, 94268, 88925, 104147, 107236, 110450, 115510, 119136, 119824, 109656, 102603, 97828, 100585, 108240, 105987, 105628, 105463, 106613, 106871, 96016, 106896, 121490, 130481, 146060, 143534, 140491, 142151, 152440, 170860, 172326, 190695, 226508]
8349B26508M6814O9930N8182K9657q168o5369p9537m2108r439l1021l1929j3637
8337A49883l914j335o604P339O06J244j0575q590P308M99r998K085O252l83j0336
8322A23481p437j657m386M979p96j2450k591K926J7038Q775L975J4277J4414K6894
8308A87442M9238M2352M7184O2956K3089l0332p1154o4274l6530k3233k6888k5290
8296A34560j2238J3307J2284n329j6241m19q507J346R044n473j6395j0737J7168
8283A12370J5526j1749m210k530j0007J400l930J3629r852j3217k441J1783J701
8270I8473P113M085j289j820l261j4483n752j303m201m216j180k980J947J3127
8256H4260l06M141L960p566n808m752r176K648J592O982M764k995j1382J1645
$$ y = [226508, 273322, 343252, 401434, 431091, 422923, 357554, 278017, 235909, 226470, 195449, 163520, 149883, 145969, 144634, 138030, 145369, 145975, 147219, 136644, 128054, 135362, 135861, 125863, 127948, 134200, 133817, 123481, 116044, 114387, 110001, 114980, 114184, 101734, 99143, 102069, 119107, 127882, 131857, 146134, 160548, 187442, 236680, 279032, 326216, 389172, 412261, 381929, 310775, 246501, 209971, 186738, 159850, 134560, 122322, 135629, 147913, 142584, 126343, 125924, 117417, 118763, 127807, 122334, 105939, 95202, 112370, 127896, 116147, 111937, 109407, 99400, 100800, 96870, 110499, 100647, 87430, 84989, 96772, 98473, 105586, 109671, 108382, 106562, 103301, 88818, 83066, 81763, 77562, 73346, 72166, 69186, 71133, 84260, 83954, 88095, 92055, 84489, 78681, 73929, 64753, 67401, 68993, 75975, 80739, 77744, 66362, 78007]
8242G8007M325K852j4738q29o907j6766J723J6627K0902p819o724q974j3075P445
8228E6049j62J4784N086r199p310J2645N577j2722P791R012j0694o77J768P760
8214G9708j1562r687P524j804o618L500P537L632j0016n551j0692k380J1617R573
8200F4781J2120k402k885o46j1396j4596M253N803L96q641j0971j1904J2574J0328
8186D6814J3849L4494J7795j5138k3036j931o630R110M337j583k808j0670q24
8173F3779k773m579k14R479J3880N629q922j2362m636P558n337L621L931M937
8159G3991m118n546P429k185j1785n573q792Q197o403J0607J8664N351k8672p311
8145D3854N880j529j034J3754R115q491N790J3585o44r74j4915j3269J0094J4547
$$ y = [78007, 82332, 85184, 70446, 69617, 62710, 45944, 47667, 64294, 85196, 77377, 70653, 61679, 48604, 56049, 55887, 70671, 75757, 66558, 59248, 71893, 77470, 64748, 72539, 81551, 70857, 70180, 71948, 79708, 68146, 58459, 65983, 64179, 57561, 61061, 68598, 72230, 62214, 56663, 45971, 43591, 55208, 64781, 76901, 74499, 71614, 70968, 59572, 44976, 49229, 55032, 55428, 46787, 35816, 23912, 36486, 46814, 60663, 95157, 112952, 97814, 74778, 72847, 66217, 75327, 79664, 78081, 75273, 64603, 63779, 61006, 56427, 56213, 65692, 79572, 85201, 76279, 63917, 59281, 66839, 61502, 65123, 69054, 73991, 69873, 64327, 71756, 69571, 57786, 52213, 43421, 51618, 45215, 55822, 74486, 79837, 51165, 43854, 49734, 48205, 47171, 60925, 70040, 61549, 67339, 80924, 80280, 79306, 64391, 51122, 61216, 75763]
8131G5763J21j4176o421J5118M109j4722K012J1983L112n706N89J2040o5m694
8117G9063r590j8162J0388K145q719q622k284j714p15M170O355r3r410J006K0830
8102F4648J9198k0864l537k267j339Q307j416O150O868N905j1886J0898Q02p369
8088G4098R937K5366l93j5586J0545N99q047K447j2101k2302j73P12R871M721
8074G9694j1998n537r765R502J0214R474n618k492J407q046j0304k079K204m610
8060E2046l790J2645M314O274J762j2430l300O550K107P92J8544P993m418M378
8046I3467K925l532o135j740R990P16l497N166k212q911n982J46J10M780m514
8031H0777L581J8632q062k1075j5410r044j47J537r432L264J4586p443O045j2163
$$ y = [75763, 75884, 61708, 55287, 70405, 74514, 59792, 61804, 73787, 76899, 71193, 71782, 83822, 83757, 79063, 69473, 51311, 61699, 63844, 55125, 46503, 44219, 42505, 41790, 45960, 52315, 52222, 42812, 43818, 64648, 83846, 62982, 59445, 57178, 55839, 64146, 62730, 68880, 75748, 81653, 69767, 80665, 81467, 74098, 84035, 109401, 109008, 93422, 103967, 104566, 96519, 98966, 86865, 64563, 64390, 65102, 74973, 79694, 67696, 62159, 52394, 61896, 72110, 81584, 75966, 73474, 74881, 66835, 56531, 54452, 56656, 52046, 48256, 60901, 65215, 71489, 73251, 60821, 57521, 64071, 66178, 66970, 85514, 93507, 89089, 93467, 96392, 92860, 86725, 84985, 94975, 95691, 92194, 97360, 95148, 86237, 80255, 80401, 80511, 85291, 80777, 84358, 102990, 94928, 73853, 58443, 49399, 49252, 50789, 41357, 44621, 59207, 51764, 57809, 45646]
8017D5646o082k02M696O533N502m752l754J2297M113R89j158J5601p343K520L587
8002G8193M265J4960n31q146j6109q367K870R115O708m740r509j087j3810o947
7988D6865N375L266K37J1977l395L7q586p077J843j048L789o465p892n744j148
7973C2034J1364O191Q153L009l009J0199M880R37m752L238J870j2053j1276l942
7959D6843L574O475j060j0357O989R500J217L105l230q291j79L25J2988Q679L687
7944H0265O976o492p354q225j2433Q230J3189k951j2684j6078n099j582r252p319
7930A9191N832O108R477m824J8475J1361J2200j7533m508J3867k058q510o5J535
7916F0548l385P584N366l857l210q010j4239L313J6595O14j2729o863N278j781
$$ y = [45646, 39564, 39362, 44058, 50591, 56093, 51341, 47587, 59884, 63997, 64986, 63828, 79429, 72086, 74606, 78193, 82458, 97418, 96887, 88741, 72632, 64265, 67135, 76250, 82958, 78218, 68709, 67622, 53812, 46865, 52240, 55506, 55743, 67720, 64325, 64362, 55776, 48699, 50542, 49494, 53283, 46818, 38926, 33182, 32034, 43398, 49589, 57742, 60751, 57742, 67941, 72821, 73758, 69006, 72244, 74114, 62061, 50785, 46843, 50417, 56892, 55832, 45475, 52464, 61964, 63181, 66286, 63056, 54765, 54586, 54911, 67899, 76578, 80265, 87241, 80749, 73395, 65170, 52737, 60967, 74156, 71205, 58521, 42443, 37344, 35762, 26510, 19191, 25023, 31131, 40608, 35784, 54259, 65620, 77820, 60287, 55779, 69646, 67588, 59078, 59013, 60548, 57163, 64747, 70113, 66256, 63046, 55036, 40797, 44110, 60705, 61319, 48590, 41727, 47005, 45224]
7902D5224M270J1524L087j8541j8186Q322K947J329P658o146m577P1k320J0760
7888D5422J445j138L226P580q630k8118j2997J3765J5443N264q151o132J63K57
7874B7399k168K148Q740Q917N981j470p768N581n140N664k3j4311q553r595O865
7859B2267M627N693R299R262j831m060R0j877o072P071l600l114k683p622j3850
7844A3600l755m115N018J853N698L291j2404l894L444J8578O015q536O787o88
7830C0892K686j31j1896q710O331J5590K838k35K400q158q424N327L076o359j0292
7815A4935j1540K141J0868m289O605J7223m456j7280j2530j1834l218L771K7502
7802A7898J3745j1250j2601k489J026K249P682o68l640q063j789J3233K333R316
$$ y = [45224, 49494, 61018, 64105, 45564, 27378, 35700, 38647, 39976, 47634, 41488, 36911, 36982, 34662, 45422, 46867, 45729, 48955, 56535, 47905, 19787, 6790, 20555, 35998, 41262, 33111, 26979, 27142, 27399, 25231, 27379, 36119, 45036, 51017, 49547, 41779, 47360, 42220, 47884, 47861, 33550, 24997, 15402, 22267, 26894, 32587, 41886, 51148, 49317, 45257, 45347, 43470, 37398, 44469, 40869, 37755, 35072, 27450, 13600, 9845, 5730, 10748, 12601, 18299, 21590, 9186, 5292, 8736, 27314, 33329, 24793, 31580, 30892, 33578, 33447, 21551, 12841, 19172, 34762, 37600, 37365, 39765, 31607, 23183, 28510, 31586, 25227, 14935, 3395, 5536, 16404, 12115, 18720, 35943, 31487, 14207, 1677, -10157, -13375, -9604, 17898, 31643, 20393, 7792, 5303, 6329, 8578, 16260, 15592, 11952, 3889, 2100, 15333, 17666, 26982]
7788B6982L539q426L573N035J0106j6329r063O662J3408N29j1712q720n434o160
7774C990J0128R008K610p649o158Q838J9358P565j2618j4100j0083m243k81R546
7760A5911J2729j0746k2753J915k983J788M198L348L772%J3113R846o20p985j2175
7745I358p108R180N839N339J853J413l11k691L886O486M217q025p745J0375K334
7730C4400L78k362k1586p092J379p910N280M250o356M136r686n30J2753j110n978
7715c4n133N195J0003P69N28n23j087k799n478J1103O686J193n784j2802j2449
7700a0612J0883J3148J4677j7697j6340J3321J3467l419N809j129q170j0577j0386
7687g025J5231K4821k245j0724K766l400p141j320r111m830R397p985m355k116
$$ y = [26982, 30521, 22095, 25668, 30703, 40809, 24480, 15417, 22079, 35487, 36016, 24304, 15584, 10150, 3990, 14118, 23126, 25736, 18087, 11929, 20767, 40125, 47690, 35072, 20972, 10889, 6646, 6365, 15911, 28640, 17894, -4859, -2944, -5927, -4139, 59, 3407, 7179, 7179, 20292, 30138, 29518, 21533, 9358, 2250, 11430, 17269, 22608, 24461, 25874, 25563, 22872, 26758, 33244, 37461, 29436, 21691, 32066, 34400, 34778, 32416, 10830, 3738, 5117, -2793, 2487, 6737, 381, 4517, -5169, -5699, 7054, 5944, -34, -5167, 28, 10031, 10800, 11328, 10805, 9718, 6919, 1441, 12544, 19230, 20423, 14639, 1837, -10612, 271, 13419, 28096, 10399, -5941, 7380, 20847, 17428, 23237, 22108, 13938, 3361, -7025, 8206, 33027, 30782, 20058, 22824, 19424, 12283, 10963, 1852, -2978, 6419, -1566, -5921, -8037]
7673h037Q661p590J08M603j652p975J0452L957J0975Q659j6539n427L070m316
7659a051k849K424M245P213K203m844L269n643q472N27n473k181P85o507J2234
7644d120M835j771Q048L002j0308K555Q522J0439j1189Q537J676j0402L206J5638
7630B8668J4321J767k72l279j3803j8274q899n320L696J0585J342L869j165R51
7616A4187R21l208M456l094j5976j882j456l618J7431O289n624j1126J055k992
7602d637M869N681j5167N304J2850K965m727m271O77J5986j0429l411P237n05
7588A2422L811j0876J968j461l922j2182j843J1061J7084K277n462j5414j0341
7575a2878Q235P667j0648j0685m502J0270N457J778J365J0854J3256n996r079
$$ y = [-8037, 624, -6966, -6858, -2255, -3907, -11882, -1430, 2527, 13502, 22161, 5622, 195, 3265, -1051, -3900, -1476, 2769, 9982, 12185, 7341, 10610, 4967, -3505, -2978, -8451, -10632, -9847, -16354, -4120, 715, -1056, 6992, 9994, -314, 2241, 10763, 21202, 10013, 18550, 20226, 9824, 13030, 28668, 42989, 44756, 44484, 41205, 27402, 9128, 229, -5091, -1395, 9190, 10532, 14401, 13236, 14187, 15108, 11900, 16356, 13262, -2714, -4596, -6052, -9670, 7761, 14050, 8426, -2700, -1645, -4637, 232, 5913, -9254, -3950, 8900, 11865, 7138, 2867, 3544, 19530, 9101, 5690, 12927, 12422, 16233, 5357, 7325, 5864, 1942, -10240, -12083, -1022, 16062, 18339, 12877, -2537, -12878, -4643, 3024, -7624, -18309, -22811, -12541, -7084, -5306, -3941, 6913, 20169, 14173, 5094]
7562E094r433m311J1802M20m116M843L821q639M541J4377N044j2978k080J868
7548A0253P343P903L233L01n353q458N09q827P837K436j6752K954K0414P802r163
7533B2432m531N611p806P26o02j1936j0043J6854J9935p467q627K614R423q716
7519A7867p639j7538j717R756n436R275K996O829j597l787O211k783o824J4880
7505B0493J3427q157m969p482J3375r538L841m372j1778j2134n298n708K363J2605
7491c332m38o627j972J5703L663k1025k221J506Q636K0956j5422j3849P804N832
7477g86j2469j768P777Q730K611j0870m474J1306l321M966J6264o675j3863K090
7463d82q988l159J0091l252j5569j40J7192r71j1775o82O630l12k796J541O337
$$ y = [5094, -4339, -8650, 3152, 3572, -544, 4299, 8120, -519, 4022, 18399, 23443, 10465, 8385, 10253, 17596, 25499, 28732, 29033, 23680, 15222, 15731, 6904, 14741, 17177, 425, 3379, 23793, 31595, 22432, 17901, 23512, 15706, 16432, 15830, 3894, -6149, 10705, 30640, 23173, 14546, 17160, 26583, 17867, 10228, -7310, -9027, 729, -4707, 4568, 7564, 14393, 12796, 9009, 15220, 12437, 5613, 20493, 33920, 25763, 20794, 13312, 26687, 17149, 20990, 16618, 4840, -7294, -12592, -18300, -15937, -3332, -3770, -10397, -12369, 3334, 6997, -14028, -16249, -14743, -6107, 14849, -573, -14422, -6618, -786, -13255, -15023, -7246, 1484, 4095, -6775, -11249, 57, -3264, 1702, 17966, 11291, -2572, -482, -9470, -12629, -2538, -5790, -21359, -21499, -4307, -5278, -17053, -17735, -11105, -11417, -14213, -12672, -6335]
7448f335J633Q620R201m225m6j2374J723J328k772l769Q47O367R76J3416q440
7433F150j8449m558M991k385K245J2833N081K559o589j912L829j500j024L459
7419D730J7702l523j0378J613M273K232l955o070N549K744k983j2757n106J0841
7405D912J767j3261N691Q212R791j0592K863P800K718q680J3612j80q063r69N305
7390B0926p214j801j5663j0591O805O211p766n40J7814O120j3844m543n364m227
7376a3677N226J0531q426p825J2349K1398K1192r393r935j6436p855J1647J500
7363A0296l825K017N55p720p547L369n243K098Q372J1478N26j2572K243l87p184
7348c524l575M503K835J649J520r696n971R690J2662Q691Q360J043r056n093n372
$$ y = [-6335, -4702, 3918, 13119, 8894, 8848, -3526, -1803, -475, -3247, -7016, -6169, 198, 1174, 14590, 6150, -12299, -16857, -11866, -14251, -12006, 827, 5908, 8467, 1878, -34, 3795, 2295, 1271, 4730, 22432, 18909, 8531, 10144, 14417, 16649, 12694, 6624, 12173, 14917, 11934, -823, -5929, 4912, 6679, -6582, -891, 7321, 17112, 6520, 9383, 17183, 19901, 11221, 24833, 24653, 16590, 15621, 20926, 13712, 11911, -3752, -14343, -7538, -1327, -9093, -9633, 8181, 14301, 457, -4086, -9450, -13677, -8451, 2080, -6346, -14171, -1822, 19576, 40768, 31375, 21440, 5004, -2851, 8796, 10296, 6471, 8488, 9043, 1323, -6224, -2855, -8098, -6000, 2372, 13850, 14376, 1804, 4047, 3660, -3524, -7099, -2596, 239, 1888, 3408, -6288, -12259, -2569, 10093, 18784, 27144, 28187, 19131, 14038, 8666]
7333H666l844m926N653O171R54q923m06M462j3207j3313m802N035m485L32j862
7318b4495O74J6644M998k896Q441j073j4395m215R56J2666J3018n864J103n069
7304D93J3942k730j5768r762M040P279k485M025L500l341m906r423n551n2J3122
7289g617J4335K1285j0905l250O032j6852p833k393k165P13R704l494K250M182
7275C992N616o884r597j314n176L334l555P05J0828Q57J119O68l657K38J1176
7260H350O988j1005q695M3O807R100l848r207j1993m460N396N315O401N771m65
7245D498k574J390L163j0812r000o114P174J2267P443N538k934P666J74o445P961
7230A9395j1431j0091K527j8267j6356J2154J5188J2584R98p594o351O210J49
$$ y = [8666, 4822, -104, 5549, 11720, 12674, 3751, 3345, 7807, -5400, -18713, -23515, -18480, -22965, -22633, -24495, -23821, -7177, -2179, -5075, 3366, 2293, -12102, -16317, -15361, -2695, 10323, 4459, 5562, 493, 14435, 11705, -4063, -13825, -9785, -2506, -4991, -966, 2534, -807, -5713, -15136, -20687, -20739, -7617, 6718, 28003, 17098, 13848, 19880, 3028, -4805, -7198, -9363, -8650, 1054, -2440, -190, 3992, 9608, 2724, -6873, -8187, -13363, -10029, -13584, -12879, -2051, -1194, -75, 593, -3064, -2826, 8350, 15338, 4333, -4362, -4319, 2488, 11588, 7740, -1467, -13460, -17920, -12524, -7209, -808, 4963, 4498, 1924, 3314, 6477, -4335, -13335, -19449, -12275, -8, 7435, 12973, 10039, 17705, 17879, 11434, 19395, 7964, -2127, 400, -17867, -34223, -22069, -6881, 5703, 6701, -893, -7244, -1034, -885]
7217h85R233K558n091P662j073L965m630J793N920j962p43o722j7645p390J5729
7202G19K074r313K287n052L699K330k769N847R393q242j668n967K402J3945J373
7187A1058j0912K849Q564O339R0N96o395j7295q365o503m077J8608J2730K543
7173I830p290m690n333j8111o814J5018q19P816l105m575l720J7447Q935m43J302
7158E448l2r671k42O403r495P110R981j563R40r02q536k004K174P593N371n941
7142F634o741m808o198P351J7885j111r124q575j650J0501J9634l535J976M079
7128B6318j2643n048L04r894o854R704J1159L480j6928m519r60p844Q5J849J4931
7113C140K061j922J3555J3699q301j9254k7065Q72P626J9693J138o515r282J7231
$$ y = [-885, 8348, 10906, 5815, 13477, 12404, 16369, 11739, 13532, 19452, 17490, 16747, 10025, -7620, -15010, 719, 2793, -6520, -4233, -9285, -5586, -3256, -6025, -178, 9215, 973, -695, -6662, -4260, 9685, 11058, 146, 2995, 11559, 17898, 17988, 18584, 12189, -5106, -13471, -19974, -24051, -5443, 7287, 9830, 2540, -2150, -7483, -25594, -32408, -17390, -18209, -10393, -13498, -18073, -21793, -4346, 4589, 4146, 5448, 5416, -4255, -4497, 1906, -7589, -479, 9502, 7939, 8879, 7977, -559, -2563, -389, 7204, 12575, 6634, -107, -4915, -11113, -3762, 14123, 13012, 3888, -4687, -6337, 4164, 23798, 20263, 22239, 26318, 13675, 8627, 8931, -963, -7817, 1887, 13046, 16526, -402, -4921, -5881, -13725, -13640, -11791, 3140, 5201, 3279, 16834, 30533, 22232, 2978, -24087, -23215, -15589, 4104, 5242, -1273, -10555, 6676]
7099F676O625o705n388N002o729k247J053Q924L358R084P559j2135j4391Q067
7085H753j0031N71J259M809m812j3510Q540r17p792Q852K151n764M48o160o468
7070b0071J7609O136j8200q193m79J9051J1154j3136N454R394j3649o511M46j1695
7056b2690N144R340k213m65M053O523l050J067J4520J4268j5513j1345p51R245
7042H133j4129l541j514O830M010k227K454K089n860q780J1325J2672j0772l039
7028b349l20O860K125J942J582q879m490J328J431M997L449N766m934M482J2335
7013B5325O218j6716o64N23p925o99j5828n040N815O618O925n979M058L772P29
6998G132n061j1242j5775R023N248O029J151j8047Q562P327o293j39Q953O063
$$ y = [6676, 13301, 6596, 1208, 6210, -519, -2766, -1713, 7211, 10569, 19653, 27212, 15077, 686, 8753, -1278, -707, 552, 5361, 549, -12961, -4421, -5338, -13130, -4278, -2127, -7891, -7443, -13603, -20071, -2462, 3674, -14526, -22719, -23198, -4147, 7007, -6129, -675, 8719, -4930, -11441, -10995, -22690, -17546, -8206, -10419, -10884, -6831, -308, -3358, -2291, 12229, 26497, 10984, -361, -1112, 8133, -5996, -9537, -11051, -4221, -211, -2438, 16, 2105, -3755, -12535, -1210, 11462, 690, -2349, -2669, 4191, 6316, 8258, 9840, 961, -3529, -2201, -770, 4227, 7676, 13442, 8508, 12990, 25325, 31543, 14827, 14163, 14686, 6761, 6062, -9766, -14806, -8991, -2373, 4552, -1427, 2631, 6403, 7132, 2071, -9171, -24946, -15923, -10675, -4646, -3495, -21542, -12980, -5653, -11946, -12085, -3132, 2931]
6984B931m443J207o845J2798J4310j7478k1626j021N281J6896K415o952l120Q166
6970B519P110M209l676j4036j8554k754N767M63Q256P997J09O508Q059r072n225
6955b320N185n869l204M639j0975p168K620J5406o102j6684K760J7325J0293J82
6941F088q869r930m758l143R268J2217k926j135j501m810Q138j1306q325L907
6927a7085Q593j923o088Q504J0775K507Q536J3826J713k4331l0432n53R589J2285
6913d084M344q087K010M014q132k125p709M222R298Q710j939m352p982j0531K863
6898a9480l644J2986J6483M500n233j3418O422J8575q850j1334k992P153R932
6885A1100O208M658o380r74l452L032L965L06n407j9206l085k229m187O323Q159
$$ y = [2931, -1512, -305, -7150, 5648, 19958, 2480, -19146, -20167, -14886, 2010, 4425, -2527, -5647, 2519, 9629, 13838, 10162, -3874, -22428, -25182, -19415, -18952, -10696, -2699, -2590, 3918, 11977, 2905, -2320, 2865, -3004, -6208, -1569, -12544, -19712, -17092, -1686, -7788, -24472, -21712, -4387, 5906, 6088, -2781, -12711, -17469, -20612, -11344, 873, -2053, -3188, -4689, -9499, -1361, -12667, -20992, -17085, -8492, -10415, -16503, -7999, 2776, 5283, 13819, 27645, 29358, 5027, -25405, -25958, -16369, -4084, 260, -7827, -5817, -1803, -9935, -12060, -19769, -15547, -6249, 2461, 522, -3830, -11812, -22343, -19480, -23124, -10138, 6345, 10845, 5612, -7806, -1384, 17191, 8341, -2993, -5985, 1168, 11100, 17308, 21966, 15586, 14612, 11160, 14192, 18157, 18463, 13056, -6150, -9235, -11464, -15651, -9328, -1169]
6870a169l000L703n842L319J6175n633m087L7n768n565o730l322M451N34J834
6855a1063J3368N71l142l063N485l748j0803J693l36j0401O11Q120K288O599l432
6840g253q221Q603m830O971k330p359L062R121J216r605J629q332j0882J3605
6826a4605O03J616J768j464j52R345o258p39J9676J405q576R261J1785p754n647
6811A0264k266p696p667J0463J4634N83r558l984K522k970k775n883k41M670J3039
6796A3135j2643k825N586K328p381Q075J2872l047j2555j2620J1993k83j0215
6783g580L947O024r403q535R418n810N698J2235L554q392k697k829j74k066N181
6768a429N21j0284q025K345J2830j803o880O227M005K386P61k578K947L814N945
$$ y = [-1169, -4169, -466, -6308, -2989, 13186, 7553, 3466, 3503, -2265, -7830, -14560, -17882, -13431, -12897, -11063, 2305, 2876, -266, -3329, 2156, -1592, -12395, -10702, -11038, -21439, -20828, -12708, -10420, -3821, -7253, -15474, -6871, -11701, -4730, -7060, -14419, -11357, -2236, -1020, -10625, -8996, -17328, -28210, -14605, -14002, -12386, -10618, -12082, -12234, -2889, -9147, -9886, 9790, 11195, 2619, 11880, 23665, 15911, 10264, 7998, 302, -7365, 3098, 17732, 18315, 8757, 4773, 7295, 4325, 1550, -4333, -4574, 96, 13135, 492, -2333, 3253, 5581, -1800, 6275, 19147, 16100, 3545, -9075, 2918, 2635, -7580, -3633, 2391, -7012, -15547, -6129, -11939, -6241, 5994, 9548, 1156, -1541, -4370, -4544, -6610, -1429, -908, -11192, -19217, -16872, -4042, -5845, -12725, -6498, -2493, -107, 654, -1924, 1023, 4837, 10782]
6753A0782K1378O811K097l22j4679k7330l701J9988P953j814k172M579N068J562
6739C0200N874q102k924M946k783N720J4650J6212L2777M1857M9766N9497P1600
6726C19290M3330j8124p0612p2175n9281n8808j9641k0670j1351r759K746R301
6714C4246o747j1645J3890N564l388P201o70m861O726N151p808j5750J0793O417
6700C9119j7875l203J1010L472j0788j2802j6789j5415r6P473J0718J158K588
6687a430r615O44L590l834j3596J2303K0878J4206o406j506n059o739L130q847
6673b281j9028l80J3811N536Q980J6063j3354P68r7j4008m683j1576j0706K2701
6659h254J5311q152K32O108J027j952o09p73k74o652L837R93J442R165p30j6638
$$ y = [10782, 32160, 38971, 41068, 40746, 26067, -1263, -4964, 15024, 22977, 21163, 18991, 23570, 28638, 30200, 36074, 27972, 25048, 29994, 27211, 32931, 47581, 63793, 96570, 138427, 188193, 247690, 319290, 362620, 344496, 273884, 201709, 142428, 83620, 63979, 43309, 31958, 22199, 24945, 34246, 27499, 15854, 29744, 35308, 31920, 39121, 38451, 33590, 40316, 45467, 37659, 21909, 32702, 39119, 21244, 18041, 29051, 32523, 21735, 8933, -7856, -23271, -23367, -15894, -5176, -4018, -1430, -11045, -10401, -6811, -10645, -24241, -11938, 8940, 23146, 16740, 15234, 10175, 3436, 6566, -2281, -21309, -21689, -7878, -2342, 6638, 22701, 9347, 10115, 10018, -3990, -8673, -20249, -30955, -8254, 7057, -1095, -863, 5245, 6272, 4320, 3711, 2938, 2664, -3988, -151, 842, 2284, 11449, 10719, -5919]
6643e919m987k831k222r77K932J2690Q572m273j389N455J1280n124k1461J1006
6629B752J4179N80J1063q772k6700j0126J4797M138L363p503j0659k947K576M710
6615h549k310N206Q710Q894k412o343K484R52J118J413N501K255r186r338o561
6600h166K313N074J9942Q711j1936m206M316J438j4481j2783q381J0327L876j7
6586c973n791M710J9811k040q079l085l212J0266m64j6029r65o15R22m927N141
6571h330N027O051J3659o920l973N337j3559k2576J051J6941O969R802K169j4713
6557c065j2507k740r326m226L2914J7219j9543L097q330o393J1338l097l838O446
6543b051K069P678o731m612n010P385J0254j7625K45m353R10m346j5426Q244J3121
$$ y = [-5919, -10906, -13737, -15959, -16936, -14004, -1314, 7258, 2985, 1596, 7051, 18331, 13207, -8254, 2752, 16931, 17511, 28574, 19802, -6898, -17024, -2227, 1911, 5274, -2229, -12888, -15835, -13259, -8549, -10859, -5653, 3057, 11951, 9539, 3196, 5680, 6632, 7750, 9163, 14664, 16919, 7733, -1605, -8166, -5853, -779, 19163, 27874, 15938, 11732, 16048, 17486, 3005, -9778, -18159, -7832, -3956, -3973, -9764, -5054, 14757, 12717, 4638, 1553, -1659, 8607, 8143, -7886, -8851, -9466, -8544, -13471, -8330, -3303, 2748, 16407, 9487, 5514, 10851, -2708, -25284, -24233, -7292, -323, 9479, 11648, -3065, -15572, -18312, -27638, -31864, 1050, 18269, -1274, 1823, -6507, -12900, -1562, -4659, -8497, -2051, 18, 7696, 965, -3647, -8657, -1272, 8982, -8643, -8398, -12751, -11841, -16187, -31613, -23369, -10248]
6528a0248j286j570J1305l985O123m27o668n104Q4p373P801N539J0427L683m487
6513C814j8391P755K994R132J601r708o083L566l196O964J2931k747j0176j4867
6499a6411K041J4212N976K737j141p776j3510J076J747q402j753P57l563j883
6485b5893j4316P32K112J5647J167m016O825j338J3926J2919j1297o287r802J1045
6471h576J8273o041j2624j3716Q027L750j272M129P766J0642j853p510J335k58
6457B072J7013j6871j6228l899N741r193l780N77M988n541j450L073J585P858
6443a4055R821J0729J1802j0675k1173O380J24K521m118J5398O944j1584n743
6430c629r422j0970N836K968K205Q567O835n011O488O593K085l628k940o651n892
$$ y = [-10248, -11534, -13104, -1799, -5784, 339, -88, -6756, -11860, -11776, -19149, -11348, -5809, 4618, 8301, 3814, -14577, -6822, -3828, 5304, 6905, -2803, -8886, -5320, -8516, -1552, 11379, 8632, -1544, -16411, -14370, -158, 5818, 8555, 7414, -362, -13872, -12796, -11049, -19451, -21204, -20447, -24010, -25893, -40209, -39477, -37365, -21718, -20551, -24567, -17742, -19080, -5154, 7765, -3532, -9819, -19621, -8576, 9697, 3656, -8968, -22684, -14657, -10907, -12179, -8050, -284, 10358, 8505, 995, 2330, 2072, 19085, 2214, -14014, -17913, -12172, -21365, -25145, -24568, -19580, -25121, -26571, -23498, -21913, -14055, -4234, 6495, 18297, 7622, -13551, -7171, -7047, -4526, -8644, 6754, 13698, 2114, -3629, -13051, -24021, -18185, -15217, -13012, -4445, 2390, -2621, 3867, 10460, 12545, 8917, 5977, -674, -6566]
6415f566n100j1614M134J3204M074J6591M138p327K249j1407n119N420L303o70
6401E310J34j2203p581K486j712j282o171J714R015l119J3420P869n997K0137
6387B2020J2124j3696n685r891Q360j162j1017K010J1430r094n194R02J1204K04
6373A2515o726q730r387P54M113L452J884P294j1522q607J323k110M226o749M675
6358a3595n542k676J3545M895Q958j1824o104N053p762J0849p175j2574P9P934
6344a5939J2656L035J277j5117j8199o840M799M581J4269J6759Q144q92j0212
6331a679j186k2976j4153J6282K4824L01j8870O048J8423j5273j5739p429P153
6318b4274J6384j063N144J8983L624q434j0048o682R584k374j4616l322p751L892
$$ y = [-6566, -11666, -23280, -19146, -5942, -1868, 14723, 18861, 11534, 13783, 2376, -2743, 2677, 5980, 5310, 5444, -6759, -14340, -11854, -13566, -14848, -21019, -19305, -10290, -13409, 11, 7880, 1883, 22020, 34144, 20448, 14763, 4872, 13232, 12070, 1053, 3063, 14493, 5399, 205, 1107, 12311, 12515, 5789, -2941, -12328, -11574, -7461, -4009, -2125, 5169, -6353, -14960, -13637, -15747, -11521, -18270, -13595, -19137, -21813, -8268, -3373, 5585, -6239, -12343, -7290, -15052, -4203, -11378, -23952, -23873, -15939, -3283, -248, 1029, -14088, -32287, -39127, -34328, -29747, -15478, 1281, 9425, 8533, -1679, -2865, -25841, -39994, -23712, 1112, 1413, -17457, -11409, 7014, -8259, -23998, -31427, -24274, -7890, -8953, -3809, 15174, 18798, 10364, 316, -6366, 3218, 844, -13772, -17094, -24845, -20953]
6304b0953M918O614k868M726J4308P039j690m855j9027j1905N177n24J3894M806
6290c40P80Q516N461J611m895j5019l672n709j013L948j2057J2983m59M275J61
6275e429m968J7121K620n449m038N323P019q607M432j407p802R01k544l014j986
6260g828l886M722R67K186n8j8748J140J0953j0113j4043J1854J5712L587m306
6246g861J144q823j650J9811O773m587k1084l998J3386Q130L044j3750m110p489
6232b1064P266P907J290N126Q564q251j8125N071K771L842J176M447J652k693
6218a021k635J7667j779q262p466J6345Q804p838k193K317p362j221m872K031
6204B515l584K220o519J3289J4731j6746j2505j3765m397l234L25P089j7505j0967
$$ y = [-20953, -16035, -9421, -12289, -7563, 6745, 13784, 12094, 7239, -11788, -23693, -18516, -19040, -5146, -340, 440, 8956, 14417, 16028, 11133, -3886, -7558, -13267, -14280, -10332, -22389, -9406, -9865, -5590, -5429, -10397, 6724, 9344, 3895, -143, 5180, 12199, 3592, 8024, 6617, -1185, -284, -2828, -5842, -7828, -11714, -6992, -6025, -3839, -3897, -22645, -21505, -10552, -20665, -34708, -22854, -7142, -3555, -7861, -6717, -15540, -17190, 2621, 9394, 4807, -16277, -20275, -6889, 1241, 4285, -9465, -13575, -21064, -13798, -5891, -4601, 525, 9089, 838, -17287, -12216, -9445, -5603, -4427, 20, 1672, -1021, -3656, 14011, 12232, 3970, -3496, 12849, 21653, 13815, 11622, 13939, 6577, 5356, 484, 2515, -1069, 1151, -5368, 7921, 22652, 5906, -6599, -20364, -24761, -27995, -27670, -20581, -38086, -49053]
6190d9053R886K2889J4374O696k176j853j0723j3067q782J2970P651P273k279
6177f194J218j9362R613J0697l942j4086P17M259N833M679p525P429O784K124
6163B244J2149R143k1270j6150j894J03K868O860k557j2150K501M637K933K1267
6149A0684J1990j1692j252j0867j2769J1865J3411J969p597o027N506J793j2270
6136e256o317j1278p509N926J0231N280J0763O974K894m875n561j2499l450J173
6122a3504N571J0114R065J4261o807n944j4664j2673K92k537j2741j2184N542
6109c6209J0349j470N814J5187M347j096J1705q326j1604P05m899N81J5951J0772
6095A1807j37r200n956O06k905r12J689j1085q0J0843J6497R045j0203n612j1168
$$ y = [-49053, -39167, -16278, -1904, 4792, 2616, 763, -9960, -23027, -31809, -18839, -11188, -3915, -6194, -4976, -24338, -14725, -4028, -7970, -22056, -21339, -17080, -11247, -6568, -14093, -6664, 120, 2244, 14393, 23536, 2266, -13884, -15778, -15675, -12807, -5947, -8504, -20654, -18153, -13516, -10583, 10684, 22674, 10982, 9730, -1137, -13906, -2041, 11370, 13339, 5742, -285, 5221, 7014, -5256, -11573, -22851, -30360, -24434, -14203, -8923, 1840, 8814, 11708, 6833, 1272, -11227, -14677, -13504, -7933, 2181, 11246, 25507, 18700, 12756, -1908, -14581, -14289, -16826, -29567, -41751, -36209, -25860, -27330, -21516, -6329, -1982, -3078, 8627, 301, -11303, -10598, -15497, -14916, 1035, 11807, 11670, 2470, -3486, -2880, -5785, -6697, -5008, -16093, -16173, -5330, 11167, 20212, 10009, 4397, -6771]
6080f771j6148q857K052M521J2819j475l254m931L704J2006L802Q809K2070m766
6066B3581k4995q074j4611q307M554J2829J8860j212l26m123l473j337l601k566
6052a2801J1070m60j5474O204P16r482l866m260j1390Q583L594m423R864N07r784
6037c1402o551J0323K2703J2019l332q443k370l274l084J674n388j3095Q58q868
6023c8230O457m802R733O596L01J4850l135m595J9534Q833j2258n135M361O006
6009H516o748j445O349k608K53j3872r454j4447n026J2573J2594Q512J0218k87
5995E128j1324j7001j2622K0078K3346J1270k493p414j5922Q633j362o813P370
5982H74Q922k708p586P234P025j2016p311m837p21J0228Q035K049q587R585J5838
$$ y = [-6771, -22919, -31776, -29724, -25203, -12384, -13859, -17113, -22044, -18340, -6334, -2532, 6277, 28347, 23581, -1414, -9488, -24099, -32406, -27852, -15023, 3837, 2625, 2299, -1824, -5297, -6634, -10235, -12801, -1731, -2191, -17665, -11461, -10745, -20227, -24093, -28353, -39743, -31160, -27566, -31989, -22125, -21618, -31402, -37953, -27630, -4927, 7092, 3760, -4683, -7053, -10327, -13411, -11737, -17125, -30220, -29362, -38230, -31773, -36575, -26842, -20246, -19945, -5095, -8230, -12825, 6709, 15542, 3284, -1851, 2510, 8516, 1768, 323, 6672, 4064, 4317, -9555, -19009, -33456, -38482, -25909, -13315, -4803, 5415, 5128, -6196, -23197, -35819, -15741, 7605, 18875, 16382, 8968, -6954, 1679, 317, -6496, 874, 9796, 7088, -498, 6736, 13761, 1745, -5566, -10403, -11124, -896, 7139, 9188, 601, 10186, 26024]
5967B6024m5j2755j3187j8067J1670J6981N394o844p062P331L787j2229m734K405
5953a331L726L614Q535K292o757j153j3101j427n80K881q272K614L150j2085J300
5938a6594k001P128J2245K216k851J1659J4184m615j4126o234J1833M568k285
5925A5127n95m167j1506L83P147o563k918j051L033r22q340J496K109O521J205
5910I59j4680l316R327N028k893m391m785R224L536p618o921n864l176J2213J0583
5895b774n459o514M114j586j068N226j6679N234J9526j893M110j734j5366q312
5881b3175N395r426n953R453M955l714N03L960l802J350m640Q450J8187P411j025
5866G929q20j148j7157j6586J0779L865J222k1258M986K2544Q005k824r56j865
$$ y = [26024, 25979, 13224, 37, -18030, -6360, 10621, 16015, 9171, 2109, 9440, 13227, 998, -3736, -1331, 2395, 6009, 14544, 16836, 10079, 8926, -4175, -5602, -6182, -3301, -11573, -8959, -5809, -17894, -16594, -18595, -11467, 778, 2994, 143, 11802, 25986, 21371, 7245, 1011, 12844, 17412, 15127, 14532, 10365, -1141, -758, 6389, -174, -3092, -4143, -1110, -2032, -10372, -8876, -6767, -246, 959, -13721, -17037, -7710, -2682, -5575, -9966, -14751, -5527, -1991, -9609, -16530, -22394, -25570, -13357, -2774, -8233, -14747, -10633, -12219, -13287, -8061, -24740, -19506, 20, -1873, 2237, 503, -14863, -23175, -17780, -27206, -33159, -23706, -18751, -22465, -21962, -18002, -21804, -20454, -25094, -16644, 1543, 8954, 7929, 7109, 5961, -11196, -27782, -17003, -13138, -11916, -33174, -28188, -5644, 2361, -463, -1419, -3284]
5852c284J1457p85r23j8336L810l850o8J383J122j0422k1643o93q01M137Q843
5837c0053J2655J2216m317k858o53K115N879M689O284K302j429L064j379J270
5823I785n125j8791R51q894l161N930J4056J2379J783j636Q277J83o607O622K85
5808A6037p214k656q390m589k4Q189N626J579N555N26l595j5322j6214p918O418
5793b1992J1728j372p451n826J7298J5116p65k705o220L78l856O728L523j860
5779B724K145L524m257J2139N184J31j5891o580l552k817M58k141k166j0808j2364
5764c4271M756J4054L491k022J785N110N313n565N785Q677J98j55n703l59m907
5749c813L721Q21j7014k419j820K827L260J7705J6480j1960j6596m846K692l353
$$ y = [-3284, 8173, 7388, 6465, -11871, -8061, -11911, -11979, -10596, -9474, -19896, -41539, -42232, -43033, -38896, -30053, -17398, -5182, -9499, -12357, -13010, -10895, -5016, -327, 5957, 8259, 6830, 9894, 8515, 9785, 4660, -14131, -13180, -22074, -25235, -19305, -5249, 7130, 8913, 7277, 15554, 15737, 9130, 15752, 16037, 8823, 6167, -2223, -6812, -6836, 1353, 6979, 8558, 14113, 14639, 11044, -4278, -20492, -28410, -21992, -10264, -11636, -19087, -24913, -7615, 7501, 6736, 4031, -2189, -1811, -5667, 1061, 4584, 2724, 4869, 8393, 4136, 16275, 21459, 21590, 5699, -881, -4433, -7250, -6792, -8933, -11099, -21907, -34271, -29515, -15461, -11970, -13992, -12207, -7097, -1784, -7349, -1564, 7113, 7311, 7156, 1453, 1094, -3813, -92, 729, -16285, -18704, -20524, -17697, -14437, 3268, 19748, 7788, -8808, -13654, -10962, -14315]
5735a4315N552n747j0050m100p303L107J2420R518L133o005R405R184j1840m61
5721g502J1627K867p779q413O391P993L333l491N401J197j1339K766r77k97r909
5706h132O51R532P188m877j799n911p109m61J1045M144n769N365L685J4222k142
5691A9632l816Q9J3724L334n134j1682m537m543j1973N248m26O785o2O436Q636
5676B1711L522j4664j7286O905J2370j7352j0476O10m685Q195j302p290p334M767
5662b2309N291P394M462r198K253l292q230J821J0790j991P419o70J7571K57l886
5647G682j636j3494L432K5178J0086j5034l267J285l108j0558j3178r288N188
5634a6712J6842J279j9160J904p50j27J8656P621j0021k1287j829P814J4740J939
$$ y = [-14315, -8763, -14510, -24560, -28660, -35963, -32856, -20436, -10918, -7785, -13790, -4385, 4799, -7041, -7502, 4125, 6992, -787, -9200, -2809, 5184, 8517, 5026, 10427, 11624, 285, 3051, 2074, 1777, -8132, -7481, 2051, 9239, 4362, 2563, -3348, -10457, -10918, 127, 4271, -1498, 3867, 7552, 21774, 19632, 15816, 15905, 29629, 32963, 27829, 16147, 11610, 7067, -4906, 342, -84, 6701, 6639, 13075, 21711, 25233, 10569, -6717, 188, 12558, -4794, -15270, -14660, -19345, -11150, -12452, -19742, -27076, -22309, -17018, -9624, -5162, -14360, -12107, -15399, -23629, -21808, -11018, -13009, -5590, -6260, 11311, 11568, 7682, 6046, -7448, -4016, 21162, 31248, 16214, 12947, 14232, 11124, 566, -12612, -21900, -16712, 130, 1409, -17751, -15847, -16597, -16724, 1932, 9553, -468, -21755, -23584, -15770, -1030, 909]
5620I09j914n576L926j9789M232K578K776J0001J8076q05k4086j36J362j2508
5606b0954M068R924O99j102J4344j44q018J3237J333k847j1431q466M117j85n777
5591a1202o719K1426P493j3606j4173k011k250J926Q551J1889k440j0606n489
5578a7211j959m163j596Q476l209M664R156N913j029J81o28L071J935j1240j7429
5563b5068j307L603o68N619J094Q212j0568r139j0258n050L666K0994J0215q560
5549a7215n434J5796K606K563o024l061O051m269l90r964Q351J0557M266N517
5535I350J3472Q448p884k7761o527M515k927K0957M710p424j4334o056q16J419
5521a0858O745n93p53J5718j181j0399r000q695r16l478P985q230n619R846P996
$$ y = [909, -1005, -6581, -2655, -22444, -18212, -15634, -12858, -2857, 15219, 14414, -9672, -9808, -8446, -20954, -16886, -6962, -6263, -7365, 6979, 6835, -1183, 12054, 13387, 10540, -891, -9357, -5240, -5425, -11202, -17921, 3505, 10998, -2608, -16781, -18792, -21042, -19116, -10565, 1324, -1116, -11722, -17211, -19170, -23333, -24929, -16453, -19662, -14998, -5842, 71, -958, -777, -1405, 1666, 3601, -7639, -25068, -26375, -22772, -23440, -17821, -16727, -8515, -19083, -28222, -38480, -43530, -39864, -18870, -8655, -17215, -22649, -6853, -4247, -1684, -7708, -10769, -4718, -8987, -9377, -19341, -10990, -433, 3833, 9350, 22822, 31270, 23386, -4375, -10902, -6387, -9314, 11643, 16353, 8929, -5405, -11461, -12277, -10858, -4113, -4706, -5459, 10259, 9078, -1321, -10321, -19016, -19932, -23410, -15425, -23655, -29274, -19428, -11432]
5506a1432J0866O790K35j2844r286k410N098N395J6091N241q312q352j3449k961
5492a9330Q366J1701J0606J417j4084j4075J374R096l783O263R804j152m236J033
5478C000J0205M826m12o51k1641K095J9442N321q419j2939j1872q464m91P057
5464a2943J7285J3760J1596l414j870K02j0676k513l191p637J304o231N912O210
5450G794M215J893N324O940j4382j4221m858j2905L794N997J671J6264l376p848
5436c698M950n891j1972j603Q40j594J3535J4896j1161j074j024J429k523R133
5422D243Q988K524O42k936j9743j3001J1903R113R159j002j0165n179o960J150
5408a1264Q413J0089l854R6P783J562j2162n870n077j309p583m872k002J3932
$$ y = [-11432, -566, 6224, 6459, -6385, -15671, -18081, -12983, -7588, 8503, 13744, 5432, -2920, -16369, -19330, -10964, 737, 11343, 12760, -1324, -15399, -14025, -4929, -8712, -2449, 7355, 6203, 1967, 3000, 13205, 18031, 17619, 16968, -4673, -2578, 16864, 22185, 13766, 827, -11045, -19509, -20000, -12943, 4342, 18102, 29698, 26284, 24414, 24616, 13940, 11427, 8236, 599, 1903, -4328, 1584, 7794, 12009, 13902, 19226, 26166, 11784, -2437, -7295, -20200, -16406, -10409, -8738, 7526, 4150, -3698, 1252, -4639, -16611, -18214, -17374, -18968, -5433, 9463, -1698, -2772, -3796, -2367, -4890, 4243, 13231, 15755, 16397, 13461, -6282, -19283, -7380, 1733, 10892, 9890, -275, -5454, -12414, -11264, -2851, 7238, 3384, 3480, 11263, 12825, 663, -5207, -10284, -11593, -19176, -24048, -26050, -12118]
5394a2118K0474Q054j3519k897m042M223n662m837J0860Q071K224n411m961j6655
5380a6196O759J1239r649o219Q230j2624o565M271J5143J387K58L89L420m381
5366d538j940J355J935O148n658q514p133l060n053N561J832j571N869J1223k271
5351e815m991L026L330J0744j3474n97J5945M868k434l828l092J7213M948K604
5337B8447q743j4417q292l722k467m145R124J8141m171j2900p782j8670o16J6797
5323a3416J5233K0970k574j8946j4008l601j703N042j9o47O74Q675J0033K153
5309G866j4973P958P643R75L996n396j0106O748Q440j1395L099L318K967N330
5295A6470m768j3651n932j1807k10R232q010J348K069M110o840m290k208R236
$$ y = [-12118, 8356, 16410, 2891, -6, -4048, 175, -5487, -10324, 536, 8607, 10831, 5420, 459, -16196, -9437, 1802, -7847, -14066, -5836, -18460, -25025, -20754, -5611, -4224, -3966, -3577, -157, -4538, -6478, -5123, -3188, 2960, -2698, -11212, -18345, -21405, -26458, -20897, -19065, -20636, -14767, -3544, -5815, -10806, -7780, -4450, 6294, -7180, -7777, 8168, 13036, 10602, 6774, 3682, 20895, 25843, 28447, 19704, 5287, -3005, -6727, -9194, -13339, -4215, 13926, 9755, -3145, -10927, -29597, -30213, -13416, 1817, 22787, 20213, 1267, -12741, -16342, -18045, -13003, -13022, -13669, -12995, -4320, 5713, 7866, -7107, 851, 8494, 9469, 13465, 8069, -2037, 4711, 13151, 1756, 4855, 8173, 11140, 16470, 11702, -1949, -7881, -19688, -19898, -10666, -18676, -17328, -15259, -11149, -17989, -22279, -24487, -15251]
5281a5251J5171R570o929o538r057l775J1165q12l297J222O781M485J700J1254
5267A5689M927k460N465l761o421j5015L292J0366Q315n548j2792j1861j0935
5254b0739N900r22J89o219r878l247k302Q831N34R300R062O458l564m842N225
5239f214R162P991p241j2856K434R582N089P73K706l627l033p664N214J1395j964
5224A1747r149l454O584N330p973o294m442K990j2771m65P710Q482j1827j396
5210a4928o95Q544K091L991N201p681j8517j619J2197J2136j1645q352o439k036
5196b7752J0437M436J0372p144n244q955q506M451J326J523J4275J5666R228q420
5182E693Ln228j6862P522m872j4027o07P804M96K12L390n351l024J4988J4402
$$ y = [-15251, -80, 9490, 2561, -3977, -13034, -16809, -5644, -6456, -9753, -8531, -1750, 2735, 4435, 15689, 20616, 18156, 23621, 19860, 13439, -1576, 1716, 12082, 20397, 14849, 2057, -9804, -20739, -14839, -15761, -15572, -21791, -31669, -34916, -37218, -28387, -27853, -18553, -9491, -3033, -6597, -11439, -6214, 2948, 10939, 3698, -9158, -6724, 2858, 7947, 8720, 11426, 7799, 4766, -2898, 2316, 13711, 11747, 2598, -856, 5728, 11058, 3085, -3209, -7651, -4661, -17432, -17897, -10187, -1705, -13532, -14928, -15623, -7079, -4988, -997, 4204, -3477, -21994, -23613, -11416, 720, -10925, -19277, -25716, -27752, -17315, -12879, -2507, -9651, -14895, -23850, -32356, -27905, -26579, -25056, -10781, 4885, 14113, 5693, 5696, 468, -16394, -8872, -13744, -27771, -28378, -20574, -20078, -19866, -16476, -21827, -24851, -9863, 4539]
5167D539j1877k026O207J0550j0880k2340o359O807J9775J3856R393K595j9471
5154G69q519l707m817M224n671j4016m52Q383L827p154L250n206k797j56J0902
5139b1140J2714J4358J1264M900m146k687Q435p664r420j1134j5K082N495J2956
5125A5998o38n138n021j883n415o38L855L167n739l257n366M185P393L023p516
5110b990j085R976J626m291N643M20j2166J807l67N431m093l991J2250K590j0663
5095I7k154L931O519p196k023j0108N913l928r550K408M513O628k027L801K2283
5080A9107J6811j2537k2584k2082J640J3126J624j065p076m67J2280j302q712
5067a1237J751m265j9940j553P094J9974J0735n66R707j678m384r890q407j010
$$ y = [4539, -7338, -9364, -3157, 7393, -3487, -25827, -32186, -25379, -5604, 8252, 17645, 20240, 769, -7750, -11457, -16274, -12050, -17721, -31737, -32189, -23806, -19979, -27133, -23883, -29089, -31886, -32042, -21140, -8426, 5932, 17196, 22096, 17950, 15263, 23698, 16034, 6614, -4520, -4535, -2453, 3042, 15998, 15360, 10222, 5201, 3318, -2097, -2735, 1120, 4287, -1452, -4709, -10075, -5890, 1503, 4526, -2990, -4075, 5901, 7527, 3236, 8879, 9299, -2867, -1060, -1427, 4004, -89, -4080, 8170, 10760, 97, -2057, 1874, 8393, 1197, -826, -10934, -5021, -8949, -18499, -16091, -11578, -4950, -6977, -3176, 19107, 35918, 23381, 797, -21285, -19645, -6519, -4895, -5960, -13036, -13503, -1223, -2525, -11237, -9486, -13751, -33691, -35244, -28150, -8176, 2559, 1993, 11700, 10022, 5638, -4252, -12659, -13669]
5053a3669K430O012J349j844Q288k629j029o58l18r1j1090k965o027r981J1489
5038b0733Q044N520J2572O622P248m121k0995j1612N885O245j3798j3208J4793
5025a7538K1362J1075O946r041p815l66l029L173Q249L168m057J572O100J3520
5011C3319J345j4534p659k098J7868j3853k879o438o723k421o288n326L769j232
4997a3150N833j0092m829J0912m371q264o499l215L354J6939K551l326o266J5144
4983e279K804j398o741N940J1622J1415m744j4559j5568n500n707J2150K0050
4970D485J1934M104j822j2008p437P720j1157m397J6553N628l275j665n634J1506
4956A4535l174r264L523P039j4085n600o696m396M506m677o02K826m899O089R920
$$ y = [-13669, -11239, -5227, -3878, -5722, 2566, -63, -1092, -1750, -2068, -2159, -13249, -16214, -22241, -32222, -20733, -12689, -7169, 5403, 12025, 19273, 15152, -5843, -17455, -11570, -5325, -19123, -32331, -17538, 3824, 14899, 21845, 12804, 4989, 4623, 1594, 4767, 13016, 16184, 12127, 13699, 19799, 33319, 34664, 20130, 12471, 10373, 28241, 14388, 11509, 5071, -1652, -4073, -10361, -15687, -11918, -13150, -7317, -17409, -22238, -11326, -15697, -23961, -30460, -33675, -30321, -13382, -10831, -14157, -20423, -5279, -2475, -3873, -10614, -4674, 6948, 18363, 13619, -940, -16508, -22008, -27715, -15565, 4485, 16419, 20523, 18701, 6693, -744, 6976, -4181, -8578, 7975, 13603, 10328, 8663, 3029, 14535, 11361, 2097, 5620, 12659, -1426, -7026, -13722, -18118, -13612, -18289, -18891, -16065, -20964, -14875, -4955]
4941d955m466P696O120m922o374n541M339M453r766J1221J1647P081r69n103L125
4926A3586R276L612K46l050j4946N84r08m441O507k545n094j0574n006L934N778
4911c041M379J185j2268L062R506N89j1486R669Q187o699q84L05m828j1046q122
4896b1492M744J0367Q490n92M284Q123k543R873R002J23j4875n464L544L608n581
4881A1611J003m268j2513O183J7293J411q664r171j9990j1629P15J1895O985j1782
4867b0921j792j105M068J2500M465N660p713j2490Q384R222Q459K208j381o640
4853B924r072M730M700L130m233j6171r478Q600K189m86J9152J0937r682O144
4839A3384P458n775J957m301j5797j2908q20l420k204L938J3341N279r694O788
$$ y = [-4955, -9421, -1725, 4395, -527, -6901, -12442, -8103, -3650, -13416, -2195, 9452, 16533, 15564, 10461, 13586, 22862, 26474, 26720, 23670, 8724, 9308, 8400, 3959, 10466, 7921, 2827, -7747, -12753, -8819, -3041, 1338, 2523, -9745, -6683, 2823, 3412, -8074, 1595, 9782, 3083, 2199, 2504, -2324, -13370, -21492, -16748, -6381, 2109, 1517, 5801, 13924, 11381, 21254, 30256, 30379, 15504, 10040, 13584, 17192, 11611, 12614, 8346, -4167, 2016, 19309, 20720, 12056, 2885, -17105, -28734, -28019, -16124, -9139, -20921, -22713, -23818, -19750, -7250, -2785, 2875, -4838, -17328, -8944, 278, 8737, 10945, 9564, 2924, -6148, -1418, 3282, 6412, 2179, -13992, -23470, -14870, -12681, -13167, 5985, 16922, 7240, 13384, 20842, 15067, 17024, 12723, -3074, -15982, -16802, -20222, -22426, -18488, -5147, 132, -9562, -2774]
4825b774P44r038k375L119j955l673r475o052M812K577M9N037p208p155R867J0455
4809a3045M525j5609J018M218P340J0197R652J5339j708j1941k3536j4437K1676
4796f311P921j837p481j535P986l755j386M558Q827K025K094K887l168j868p058
4781A899q561N947M913P764o7j0129Q55R363p219K479r50P084L568j9316r606
4766a1976K155N543m946j0040J5587J2638L743j4020N057N057o647j526j720K688
4752A593J982N491m948j869K754O264l086q621L847J6121k917K688l628j1872
4738C799o143j258J4366l6j3733J2165n784l567j1171l751p403J0505J9743p626
4724A06j2091O448n241j233P721L13K964n317K04N15Q731j6992l200J1456J3703
$$ y = [-2774, -2030, -11068, -13443, -10324, -12279, -15952, -25427, -31479, -26667, -24090, -24041, -19004, -26212, -33367, -23500, -13045, -8520, -24129, -23111, -18893, -11553, -1356, 8296, 23635, 21927, 9986, -13550, -27987, -6311, 1610, -227, -7708, -9243, -1257, -5012, -6398, -1840, 6987, 9012, 11106, 13993, 10825, 8957, 1899, -6662, -715, 4198, 11962, 11895, 1766, 2621, 11984, 4765, 7244, 6294, 13378, 16946, -2370, -11976, -9821, -4278, -9224, -19264, -3677, 8961, 12704, -1316, 3741, 8798, 2151, 625, -1095, 1593, 3575, 9066, 4118, 2249, 5003, 11267, 8181, -440, 3407, 19528, 16611, 19299, 15671, 3799, -2344, -3602, 10764, 10728, -3005, 9160, 3376, -191, -11362, -15113, -22516, -12011, 7732, 106, -11985, -5537, -10778, -12011, -4290, -3977, -1013, -6330, -6126, -5611, 3120, -13872, -17072, -5616, 8087]
4709H087J2301k579L943M261j7590j7493j8163j0999O396P601P601Q117q03k819
4695a2139L669Q150J6817J460o255j7706p663K809R509J0869k907j8615j0057
4682b2059R833J049N543O312J4847l551j0002m345K111j940Q00M299K344Q197
4668A3438l475M50J7412M723r148j4992n609n208j5297l58J3727M502p63Q804
4654H206N599n008r405j100M174M331L93q084o412k345n11O651J2717j168M106
4639A2144K933N631l361R77j1320j3947n001L623l574N55j3680o135K4904P238
4625I87L648N40L463N509j145K440r493q816m203p939j1690P041K157N708J6863
4610E070N039K223k577R383J2015j0548j8985P072Q00n274N88P930o419j0062
$$ y = [8087, 20388, 17809, 21752, 26013, 8423, -9070, -27233, -38232, -31836, -24235, -16634, -8517, -9320, -12139, -8470, -320, 16497, 17957, 11702, -6004, -13667, -10858, -1349, 9520, 6613, -12002, -22059, -12226, -11177, -5634, 678, 15525, 11974, 1972, -2373, -262, -2202, -1402, 2897, 5241, 13438, 9963, 10413, 27825, 32548, 23400, 8408, 2799, -2409, -17706, -18064, -4337, 165, -598, 8206, 13805, 8797, -608, -1708, 2466, 6797, 7190, -894, -7306, -9651, -10162, -3511, 9206, 8038, 12144, 15077, 20708, 17347, 18324, 7004, -6943, -11944, -8321, -11895, -11340, -25020, -31155, -6251, 987, 4635, 5175, 8638, 14147, 13002, 15442, 5949, -2867, -7070, -15009, -26699, -19658, -17501, -11793, 5070, 10109, 12332, 9755, 19138, 31153, 20605, 1620, 8692, 9492, 4218, 4806, 12736, 6317, -3745]
4596c745r962J2783Q797K820L362p058j0368k476p22m700j0981J7861J0406j1742
4582e725l889R10J1129j701l659J548M781J872j2718j084j0759Q18O01N362N8
4567a2456J3247J0552l217N632L123l058J1177j0522k4441j0696L182j1516J2847
4554a6146J6760j443k935J5296K721n571j830k538j1083o384J1236R170J1911
4541A9164j3394j6265J5335K873o898j3578Q22L722p213q514N97J7572M885n60
4527a452q7J991q399j9442N23J8264R207o315r148m518K490O795Q801R893p566
4512A037k674N557m275p440O332o953p191J5238N487j2636q9o727p896L69J3599
4497h262O756K73l588l267j3822Q139J0208l399n008N202L602l935n714L58J940
$$ y = [-3745, -13707, -924, 7873, 10693, 14055, 6997, -3371, -5847, -6569, -11269, -22250, -4389, 6017, -5725, -9614, -8704, 2425, 724, -2935, -1387, 3394, 5266, -7452, -8536, -19295, -18477, -17876, -12514, -12456, 791, 11343, 8126, 13758, 16881, 13823, 25000, 14478, -9963, -20659, -17477, -28993, -16146, 614, -829, -3764, 11532, 14253, 8682, 6852, 4314, -6769, -13153, -1917, 7253, 19164, 5770, -10495, 4840, 7713, 815, -12763, -11941, -8219, -15432, -23946, -23349, -5777, -892, -1452, -1539, 452, -7947, -27389, -26866, -8602, 605, -5710, -14858, -19376, -16886, -10091, -1290, 8603, 1037, -1637, 3920, -355, -7795, -1463, -8416, -15607, -369, 5118, -7518, -7607, -14334, -22230, -21861, -8262, -1506, -1233, -4821, -8088, -21910, -13771, -3563, -6962, -11970, -6768, -3166, -7101, -12815, -12457, -10517]
4482a0517J443J0521m476j0230M832r71J120p211j0145N715P087K646K0394J1126
4468B1334N307k1186j5096J7006N433j5776j685p11K849J7923o577j5290R408
4455B939k761Q90M867N171K190l556j2038k27l631l688j50J356P302N9m154m486
4439i917n259P616j0181K341O394O440j1706l100J1577O165p204k969N56j722
4425a0969j4100n892K880J3880N386M77l70J7593M347j5746j8044J484J5474R454
4411E854O779l437l196o144k710p391q508J089M818P197m60n124J6023J6136r449
4396A1477k2258m529J328J788q980P300M81p660J2070J0843m601j0298Q71K465
4382i703O785o147P842P535L829j880j2777p201q184J33Q229Q679l800m268J3943
$$ y = [-10517, -9074, 1447, -3029, -13259, -8427, -9398, -8278, -15489, -25634, -19919, -12832, -10186, 10208, 21334, 26641, 5455, -9641, 7365, 12798, -2978, -4663, -5374, -2525, 15398, 8821, -6469, 2939, 178, 1068, 5935, 11106, 13296, 9740, -2298, -2525, -6156, -9844, -9994, -8638, -1336, -1277, -5431, -9917, -15176, -7560, -17741, -15400, -9006, -2566, -14272, -17372, -5795, 370, -6834, -9803, -9247, -10969, -25069, -30961, -28081, -14201, -8815, -8338, -8708, 8885, 13232, -2514, -20558, -19074, -3600, 5854, 12633, 9196, 6000, -144, -2854, -10245, -18753, -17664, -12846, -5649, -6109, -11233, 4790, 20926, 11477, -10781, -15310, -13982, -12194, -21174, -13874, -13393, -21053, -8983, 1860, -2741, -13039, -12168, -9703, -2918, -9065, -1223, 6312, 10141, 8261, -4516, -11717, -19901, -19768, -11539, -2860, -6660, -10928, 3015]
4367C015R369k1773l013J4754L532k983j0396J3315R812M391L434j576j8193j1162
4353g474l608q608M535R218M260p674J352n486K74K928n320M507J057n885P850
4338h074J1125J011LJ6701L400M030j423M471l411j7862j1981l415N23M199k377
4323c080O63O675j5690j257M546J067Q466o570O201Q211L140N535N698j8538p467
4308b400n558p657J837N88R723J7360O92Q86j409P731p165p672O088p069j473
4293D502j2500n047J742M676J0299l025o787j7425j7310J5593J3229L18N862M830
4279a043Q842R779q118O49K320n205j2315n482l052k971O677R208L141J624j2301
4264h247k611l59j0301j2462o669P737K4349O791j1275p348M186j179N65J0346
$$ y = [3015, 12384, -9389, -12402, 2352, 5884, 2901, -7495, 5820, 15632, 20023, 23457, 21881, 3688, -7474, -11082, -19690, -15155, -5937, -1677, -9351, -7999, -13485, -13211, -10283, -15603, -11096, -10039, -15924, -8074, 3051, 4062, 4065, 20766, 24166, 28196, 26773, 31244, 27833, 9971, -2010, -5425, -4902, -703, -3080, -2417, 4258, -11432, -12689, -8143, -7076, 1390, -5180, 1021, 9232, 12372, 17907, 23605, 5067, -2400, -7958, -15615, -13778, -13190, -3467, 13893, 14585, 15471, 14062, 21793, 14628, 6956, 13044, 5975, 4502, -7998, -13045, -11303, -6627, 3672, 647, -6140, -23565, -40875, -25282, -12053, -11735, -5873, -1043, 7799, 17578, 9460, 10109, 12429, 7224, -5091, -10573, -13625, -16596, -9919, -711, 2430, 4054, -8247, -10858, -11217, -21518, -33980, -40649, -32912, -8563, -1772, -13047, -20395, -16209, -17388, -16823, -6477]
4250f477n78q290P57J5655j151J546J5508o910j2185p012n716l731Q602J3533
4236C551L163M511o763R059O627J610L919j1368j5736r82l755p57J3086J1249
4222A7414r649o437J403k544o853p843k192J0171J517m453n29J6562J1006j4275
4208C298k0138J1134J2560R224Q048K572j6376j84O45j0768n331N233l24K415
4194B008J714j931J2339j457k4098p972J2294N575l861J1363M177O613K692l849
4180A5607M810K069p450j9356r685P090L35R704j483m401K355K076n903L729L855
$$ y = [-6477, -7055, -15345, -14588, 1067, -84, 1462, 16970, 10060, -2125, -9137, -14853, -18584, -9982, 3551, 6714, 11225, 4462, 13521, 20148, 21758, 25677, 14309, -1427, -2409, -6164, -6921, 6165, 17414, 7765, 1328, 2731, 187, -6666, -14509, -16701, -6530, -5013, -9466, -9995, 6567, 17573, 3298, -16840, -5706, 6854, 16078, 24126, 26698, 10322, 10138, 10783, 15, -5316, -83, -407, 2008, 3722, 1791, 14130, 12673, -11425, -19397, -7103, -1528, -5389, 5974, 10151, 16764, 19456, 15607, 20417, 22486, 15036, -4320, -14005, -6915, -6580, 3124, 1641, -2760, -405, 1671, -4232, -503, 3352]
$$ [...]
##END NTUPLES=NMR SPECTRUM
##END=
