##TITLE=Analysis number 325990
Compound Code cc 28501
Project Code adrs
Chemist Name fudan
##JCAMPDX= 6.0         $$ Bruker NMR JCAMP-DX V2.0
##DATA TYPE= NMR SPECTRUM
##DATA CLASS= NTUPLES
##ORIGIN= Bruker BioSpin GmbH
##OWNER= nmr
$$ XWIN-NMR		Version 3.5
$$ Tue Jan 23 10:19:13 2007 GMT Standard Time (UT+0h)  MAYBRIDGE\nmr@NMR_250MHZ
##.OBSERVE FREQUENCY= 250.131544655141
##.OBSERVE NUCLEUS= ^1H
##.ACQUISITION MODE= SIMULTANEOUS (DQD)
##.ACQUISITION SCHEME= undefined
##.AVERAGES= 16
##.DIGITISER RES= 18
##SPECTROMETER/DATA SYSTEM= dpx250
##.PULSE SEQUENCE= zg30
##.SOLVENT NAME= DMSO
##.SHIFT REFERENCE= (INTERNAL, DMSO, 0, 16.522)
##AUDIT TRAIL= $$ (NUMBER, WHEN, WHO, WHERE, WHAT)
$$ ##TITLE= Audit trail, XWIN-NMR		Version 3.5
$$ ##JCAMPDX= 5.01
$$ ##ORIGIN= Bruker BioSpin GmbH
$$ ##OWNER= nmr
$$ C:\u/data/dgb/nmr/ADRS/1620/pdata/1/auditp.txt
$$ ##AUDIT TRAIL=  $$ (NUMBER, WHEN, WHO, WHERE, WHAT)
(   1,<2007-01-23 10:18:47.80 +000>,<MAYBRIDGE\nmr>,<NMR_250MHZ>,
      <created by zg, POWCHK disabled, PULCHK disabled
       configuration hash MD5:
       49 4B E0 1D 92 C2 6B 37 9F E6 65 BC 52 41 86 1D
       data hash MD5: 64K
       33 67 D8 FD 04 48 C1 13 CA 5E 0C D4 7B 89 70 3C>)
(   2,<2007-01-23 10:19:02.13 +000>,<MAYBRIDGE\nmr>,<NMR_250MHZ>,
      <Start of raw data processing
       ef LB = 0.3 FT_mod = 6 PKNL = 1 SI = 32K 
       data hash MD5: 32K
       91 74 7D FE 87 6F 7E D1 8D DE F0 EF 22 50 81 A5>)
(   3,<2007-01-23 10:19:05.83 +000>,<MAYBRIDGE\nmr>,<NMR_250MHZ>,
      <apk 
       data hash MD5: 32K
       CE 08 AD 05 FC 8B 26 3F 57 72 A8 BD 3C 4E B8 9E>)
(   4,<2007-01-23 10:19:06.55 +000>,<MAYBRIDGE\nmr>,<NMR_250MHZ>,
      <abs ABSG = 5 
       data hash MD5: 32K
       EB 48 C3 CA 9C 3A DE 76 6A C4 42 15 18 2F 3F 2C>)
$$ ##END=
$$ 
$$ hash MD5
$$ 5D 5A A3 42 7F C1 8D F0 C4 CB 1C 9A A5 14 5C 87
##$RELAX= 
##$RELAX= 
##$RELAX= 
##$RELAX= 
##$RELAX= 
##$RELAX= 
##$RELAX= 
$$ Bruker specific parameters
$$ --------------------------
##$DU= <C:\u>
##$EXPNO= 1620
##$NAME= <ADRS>
##$PROCNO= 1
##$TYPE= <nmr>
##$USER= <dgb>
##$AMP= (0..31)
100 100 100 100 100 100 100 100 100 100 100 100 100 100 100 100 100 100 
100 100 100 100 100 100 100 100 100 100 100 100 100 100 
##$AQSEQ= 0
##$AQ_mod= 3
##$AUNM= <au_zg>
##$AUTOPOS= <30 >
##$BF1= 250.13
##$BF2= 250.13
##$BF3= 250.13
##$BF4= 250.13
##$BF5= 500.13
##$BF6= 500.13
##$BF7= 500.13
##$BF8= 500.13
##$BYTORDA= 1
##$CFDGTYP= 0
##$CFRGTYP= 5
##$CHEMSTR= <none>
##$CNST= (0..31)
1 1 145 1 1 1 1 1 1 1 1 1 1 1 1 1 1 1 1 1 1 1 1 1 1 1 1 1 1 1 1 1 
##$CPDPRG= <>
##$CPDPRG1= <>
##$CPDPRG2= <>
##$CPDPRG3= <>
##$CPDPRG4= <mlev>
##$CPDPRG5= <mlev>
##$CPDPRG6= <mlev>
##$CPDPRG7= <mlev>
##$CPDPRG8= <mlev>
##$CPDPRGB= <>
##$CPDPRGT= <>
##$D= (0..31)
0 1 0 0 0 0 0 0 0 0.06 0 0 0 0 0 0 0.0002 0 0 0 0 0 0 0 0 0 0 0 0 0 0 
0 
##$DATE= 1169547526
##$DBL= (0..7)
120 120 120 120 120 120 120 120 
##$DBP= (0..7)
150 150 150 150 150 150 150 150 
##$DBP07= 0
##$DBPNAM0= <>
##$DBPNAM1= <>
##$DBPNAM2= <>
##$DBPNAM3= <>
$$ [...]
##$SUBNAM7= <"">
##$SUBNAM8= <"">
##$SUBNAM9= <"">
##$SW= 20.6930455092707
##$SWIBOX= (0..15)
0 0 3 0 0 0 0 0 0 0 0 0 0 0 0 0 
##$SW_h= 5175.983436853
##$TD= 65536
##$TD0= 1
##$TE= 294.16
##$TE2= 300
##$TE3= 300
##$TEG= 300
##$TL= (0..7)
0 120 120 120 120 120 120 120 
##$TP= (0..7)
150 150 150 150 150 150 150 150 
##$TP07= 0
##$TPNAME0= <>
##$TPNAME1= <>
##$TPNAME2= <>
##$TPNAME3= <>
##$TPNAME4= <>
##$TPNAME5= <>
##$TPNAME6= <>
##$TPNAME7= <>
##$TPOAL= (0..7)
0.5 0.5 0.5 0.5 0.5 0.5 0.5 0.5 
##$TPOFFS= (0..7)
0 0 0 0 0 0 0 0 
##$TUNHIN= 0
##$TUNHOUT= 0
##$TUNXOUT= 0
##$USERA1= <user>
##$USERA2= <user>
##$USERA3= <user>
##$USERA4= <user>
##$USERA5= <user>
##$V9= 5
##$VALIST= <valist>
##$VCLIST= <CCCCCCCCCCCCCCC>
##$VD= 0
##$VDLIST= <DDDDDDDDDDDDDDD>
##$VPLIST= <PPPPPPPPPPPPPPP>
##$VTLIST= <TTTTTTTTTTTTTTT>
##$WBST= 1024
##$WBSW= 4
##$XGAIN= (0..3)
0 0 0 0 
##$XL= 0
##$YL= 0
##$YMAX_a= 226186
##$YMIN_a= -408823
##$ZGOPTNS= <>
##$ZL1= 120
##$ZL2= 120
##$ZL3= 120
##$ZL4= 120
##$ABSF1= 16.522
##$ABSF2= -4.171173
##$ABSG= 5
##$ABSL= 3
##$ALPHA= 0
##$AQORDER= 0
##$ASSFAC= 0
##$ASSFACI= 0
##$ASSFACX= 0
##$ASSWID= 0
##$AUNMP= <proc_1d>
##$AZFE= 0.1
##$AZFW= 0.1
##$BCFW= 0
##$BC_mod= 0
##$BYTORDP= 0
##$COROFFS= 0
##$CY= 12.5
##$DATMOD= 1
##$DC= 0
##$DFILT= <>
##$DTYPP= 0
##$F1P= 14.0000005364418
##$F2P= -0.99999901652339
##$FCOR= 0.5
##$FTSIZE= 32768
##$FT_mod= 6
##$GAMMA= 0
##$GB= 0
##$INTBC= 1
##$INTSCL= 1
##$ISEN= 128
##$LB= 0.3
##$LEV0= 0
##$LPBIN= 0
##$MAXI= 10000
##$MC2= 0
##$MEAN= 0
##$ME_mod= 0
##$MI= 0
##$NCOEF= 0
##$NC_proc= -4
##$NLEV= 6
##$NOISF1= 0
##$NOISF2= 0
##$NSP= 0
##$NTH_PI= 0
##$NZP= 0
##$OFFSET= 16.522
##$PC= 1
##$PHC0= 136.8287
##$PHC1= 199.7316
##$PH_mod= 1
##$PKNL= yes
##$PPARMOD= 0
##$PSCAL= 4
##$PSIGN= 0
##$REVERSE= no
##$SF= 250.13
##$SI= 32768
##$SIGF1= 0
##$SIGF2= 0
##$SINO= 400
##$SIOLD= 32768
##$SREGLST= <1H.DMSO>
##$SSB= 0
##$STSI= 32768
##$STSR= 0
##$SW_p= 5175.98343685301
##$SYMM= 0
##$S_DEV= 0
##$TDeff= 65536
##$TDoff= 0
##$TI= <Analysis number 999999
Compound Code 99
Book Reference 9
Project Code 9>
##$TILT= no
##$TM1= 0
##$TM2= 0
##$TOPLEV= 0
##$USERP1= <user>
##$USERP2= <user>
##$USERP3= <user>
##$USERP4= <user>
##$USERP5= <user>
##$WDW= 1
##$XDIM= 32768
##$YMAX_p= 361795955
##$YMIN_p= -39563740
$$ End of Bruker specific parameters
$$ ---------------------------------
##NTUPLES= NMR SPECTRUM
##VAR_NAME=  FREQUENCY,     SPECTRUM/REAL,   SPECTRUM/IMAG
##SYMBOL=    X,             R,               I
##VAR_TYPE=  INDEPENDENT,   DEPENDENT,       DEPENDENT
##VAR_FORM=  AFFN,          ASDF,            ASDF
##VAR_DIM=   32768,         32768,           32768
##UNITS=     HZ,            ARBITRARY UNITS, ARBITRARY UNITS
##FACTOR=    0.157963299565203, 1,           1
##FIRST=     4132.6476996994, 0,             0
##LAST=      -1043.33573715361, 0,           0
##MIN=       -1043.33573715361, -39563740,   0
##MAX=       4132.6476996994, 361795955,     0
$$ Real data points
##PAGE= N=1
##DATA TABLE= (X++(R..R)), XYDATA
$$ [...]
$$ plain form
25046 33568 12655 40929 117652 80420 46135 36759 14301 -31261 -43643 16934 49514 79865
25034 79865 100847 69082 72842 82798 43703 -19944 -96573 -73670 -19275 -61031 -61033 -39243 -8096
25021 -8096 -2227 -20259 24020 47386 20236 -22900 -83016 -93905 -63429 -62921 5073 34136
25009 34136 14820 34512 54798 34215 62126 131395 129208 85985 50091 30788 66753 24553
24997 24553 -32126 -63284 -62492 -49987 2800 37753 47806 28529 49585 44711 59688 92481
24985 92481 61819 6954 -2943 -24150 -29818 384 29041 31480 -28086 -48019 -63751 -59454
24973 -59454 17342 76710 72512 51354 36888 18569 58082 63177 66548 101307 144358 103897
24961 103897 46832 50519 36830 43855 2083 -26475 -1073 89942 57906 49317 26680 26987
$$ packed form
25046C3568k0913K8274P6723l7232l4285r376k2458m5562j2382O0577L2580L0351
25034G9865K0982l1765L760R956l9095o3647p6629K2903N4395m1756kK1790L1147
25021h096N869j8032M4279K3366k7150m3136o0116j0889L0476N08O7994K9063
25009C4136j9316J9692K0286k0583K7911O9269k187m3223l5894j9303L5965m2200
24997B4553n6679l1158P92J2505N2787L4953J0053j9277K1056m874J4977L2793
24985I2481l0662n4865r897k1207n668L0202K8657K439n9566j9933j5732M297
24973e9454P6796N9368m198k1158j4466j8319L9513N095L371L4759M3051m0461
24961A03897n7065L687j3689P025m1772k8558K5402R1015l2036q589k2637L07
$$ plain form
24949 26987 40034 40127 41144 27757 -7782 -13140 -1808 20583 72549 54482 59823 61057 64926
24936 64926 70491 79729 81249 35683 10758 -2368 39008 49871 68743 50683 5004 35215
24924 35215 32399 27243 21475 34598 41922 6606 15935 42774 66437 82664 60523 57503 26513
24911 26513 28822 79073 61648 55269 45695 13077 -39873 -18385 -5683 -5968 58885 79918 60541
24898 60541 51597 63029 90184 84784 63977 62715 47803 24730 23985 38625 114188 100031 26971
24885 26971 22900 18501 24494 40659 5805 -12857 19642 24906 -56873 -92551 -79556 -59551
24873 -59551 -26539 -42851 -77318 -41320 14667 10631 26881 74490 86659 63414 34042 8902
24861 8902 54646 58761 68616 116517 139348 70417 75671 65230 73377 59810 105590 66967 34854
$$ packed form
24949B6987J3047R3J017j3387l5539n358J1332K2391N1966j8067N341J234L869
24936F4926N565R238J520m5566k4925j3126M1376J0863J8872j8060m5679L0211
24924C5215k816n156n768J3123P324l5316R329K6839K3663J6227k2141l020l0990
24911B6513K309N0251j7425o379r574l2618n2950K1488J2702k85O4853K1033j9377
24898F0541q944J1432K7155n400k0807j262j4912k3073p45J4640P5563j4157p3060
24885B6971m071m399N993J6165l4854j8662L2499N264q1779l5678J2995K0005
24873e9551L3012j6312l4467L5998N5987m036J6250M7609J2169k3245k9372k5140
24861H902M5744M115R855M7901K2831o8931N254j0441Q147j3567M5780l8623l2113
$$ plain form
24848 34854 36790 73919 53844 25979 27379 86679 79514 64930 45982 46720 71109 49356 525
24835 525 19803 67498 26329 -34247 -14275 -3347 -5420 -11349 8018 91909 77463 65316
24823 65316 30840 51506 44652 21312 5140 60301 6434 -16364 10129 32217 -12491 -34266
24811 -34266 5378 17062 3504 -5877 -27858 -50571 -70747 -48803 -26636 -33785 -28824 9647
24799 9647 -7771 -20850 -43667 -25602 -18859 -60016 -87978 -91894 -107194 -105776 -14402 3672
24787 3672 84435 104915 51358 48625 23306 10285 -12916 -14227 -50208 -66529 -12633 -2851
24775 -2851 -17526 -14000 -13385 -32659 -31517 -37708 -19604 -8284 62438 82285 123888 96871 35784
24762 35784 41065 83938 83942 59886 62275 66011 34054 52054 8071 -13663 46280 93519 91165
$$ packed form
24848C4854J936L7129k0075k7865J400N9300p165j4584j8948P38K4389k1753m8831
24835E25J9278M7695m1169o0576J9972J0928k073n929J9367Q3891j4446j2147
24823F5316l4476K0666o854k3340j6172N5161n3867k2798K6493K2088m4708k1775
24811c4266L9644J1684j3558r381k1981k2713k0176K1944K2167p149M961L8471
24799I647j7418j3079k2817J8065O743m1157k7962l916j5300J418R1374J8074
24787C672Q0763K0480n3557k733k5319j3021k3201j311l5981j6321N3896R782
24775b851j4675L526O15j9274J142o191J8104J1320P0722J9847M1603k7017o1087
24762C5784N281M2873Mk4056K389L736l1957J8000m3983k1734N9943M7239k354
$$ plain form
24749 91165 68819 63765 53977 28268 46162 81015 88836 94639 38391 -42179 -72316 -50887
24737 -50887 -31041 -9030 34353 60712 6528 -16732 -11794 28951 36359 17669 -7026 -40789
24725 -40789 -29613 -5402 3882 9685 -30199 -12811 2525 63000 48253 16968 2943 -16178
24713 -16178 9234 83999 93208 92737 112140 99163 79500 80343 81372 64511 64198 44085 -4774
24700 -4774 -25035 -33106 -26639 -38539 -45430 -77349 -22335 69082 102999 55690 30340 94843
24688 94843 96765 56816 3863 2018 -49218 -43765 -68292 -14550 24535 53876 83940 53866
24676 53866 76795 35456 -7344 -27864 -21317 -19554 8111 24205 46636 99082 66714 30224
24664 30224 34039 8969 -4645 -36568 -15901 7650 -7906 4272 -1819 -42878 -75840 -102367
$$ packed form
24749I1165k2346n054r788k5709J7894L4853P821N803n6248q0570l0137K1429
24737e0887J9846K2011M3383K6359n4184k3260M938M0745P408j8690k4695l3763
24725d0789J1176K4211R284N803l9884J7388J5336O0475j4747l1285j4025j9121
24713a6178K5412P4765R209m71J9403j2977j9663Q43J029j6861l13k0113m8859
24700d774k0261q071O467j1900o891l1919N5014R1417L3917m7309k5350O4503
24688I4843J922l9949n2953j845n1236N453k4527N3742L9085K9341L0064l0074
24676E3866K2929m1339m2800k0520O547J763K7665J6094K2431N2446l2368l6490
24664C0224L815k5070j3614l1923K0667K3551j5556J2178o091m1059l2962k6527
$$ plain form
24652 -102367 -27034 -2292 -4339 -10374 27612 81251 43080 -14109 1659 70980 109336 62897
24640 62897 44951 58755 64776 55320 88376 71398 26074 -2586 -11600 -79717 -66615 9107
24628 9107 6444 -23362 -48438 -4755 -18923 -1167 20920 21832 -8155 24320 56203 40465
24616 40465 23763 33623 3543 41304 109744 88757 40521 50069 78302 68862 25314 16466
24604 16466 61536 100698 50535 40948 47555 -8852 -43957 -50551 -16922 -15342 3397 4581 42535
24591 42535 70134 30034 -19354 -16749 -41438 -89899 -85705 -69535 -26573 46707 40668 38746
24579 38746 14185 -7307 8790 68936 59352 -4632 9816 -3681 -27512 -30873 -23459 15020
24567 15020 27188 74798 95561 52085 -6354 -27620 537 56670 100859 82227 46669 14501
$$ packed form
24652a02367P5333K4742k047o035L7986N3639l8171n7189J5768O9321L8356m6439
24640F2897j7946J3804O021r456L3056j6978m5324k8660r014o8117J3102P5722
24628I107k663k9806k5076M3683j4168J7756K2087R12k9987L2475L1883j5738
24616D0465j6702R860l0080L7761O8440k0987m8236R548K8233r440m3548q848
24604A6466M5070L9162n0163r587O607n6407l5105o594L3629J580J8739J184L7954
24591D2535K7599m0100m9388K605k4689m8461M194J6170M2962P3280o039j922
24579C8746k4561k1492J6097O0146r584o3984J4448j3497k3831l361P414L8479
24567A5020J2168M7610K0763m3476n8439k1266K8157N6133M4189j8632l5558l2168
$$ plain form
24555 14501 -30402 -4343 56540 133241 138696 85822 2880 -10745 -12139 5986 5546 -53087
24543 -53087 -71812 -97213 -104563 -1882 44755 49016 41079 24700 52598 73529 32512 4313
24531 4313 20181 -7956 -16106 -32653 16090 31183 -20937 17089 26444 21454 27218 45228 11520
24518 11520 -14362 7553 31477 -26982 -27526 33868 66843 97770 90115 45708 40429 43541 -32473
24505 -32473 -36881 -10931 48366 43065 19550 -34774 -34695 -9000 18191 31802 15027 -1907 25644
24492 25644 46646 25429 31728 20523 4015 6689 -42429 -57130 -26685 -3894 -50094 -49153
24480 -49153 -18986 28891 52187 -34249 -54763 1265 12402 29830 37856 59090 62289 28920
24468 28920 -3196 25449 28624 -67309 -109237 -42364 -9881 41110 69389 27320 35518 66295
$$ packed form
24555A4501m4903K6059O0883P6701N455n2874q2942j3625j394J8125m40n8633
24543e3087j8725k5401p350J02681M6637M261p937j6379K7898K0931m1017k8199
24531D313J5868k8137q150j6547M8743J5093n2120L8026R355m990N764J8010l3708
24518A1520k5882K1915K3924n8459n44O1394L2975L0927p655m4407n279L112p6014
24505c2473m408K5950N9297n301k3515n4324P9K5695K7191J3611j6775j6934K7551
24492B5644K1002k1217O299j1205j6508K674m9118j4701L0445K2791m6200R41
24480d9153L0167M7877K3296q6436k0514N6028J1137J7428Q026K1234L199l3369
24468B8920l2116K8645L175r5933m1928O6873L2483N0991K8279m2069Q198L0777
$$ plain form
24456 66295 99385 47795 -9669 -612 -11964 -48178 -52906 -31981 23136 69445 45656 4368
24444 4368 23038 40848 19564 21482 17389 14340 -41328 -43953 711 -4847 -54110 -40482 14228
24431 14228 43412 39054 19013 60465 80752 -28107 -58891 -37027 1240 58381 25250 51495
24419 51495 71860 31731 -14633 21607 77807 38548 57640 106166 92128 64273 33020 37034
24407 37034 19303 30968 39988 42811 58282 77840 56434 28455 30621 -33757 -45818 -17569
24395 -17569 -40840 -58928 -62204 -65933 -81889 -73591 -26402 -2486 -24612 -11295 -9765 -44541
24383 -44541 -35258 -37138 -38708 -2582 5777 2640 -42039 -71065 -77320 -102229 -69118 -7993 60589
24370 60589 30791 8524 17394 -21296 -61671 -66523 -44041 24851 63509 16490 -46132 3369
$$ packed form
24456F6295L3090n1590n7464R057j1352l6214m728K0925N5117M6309k3789m1288
24444D368J8670J7810k1284J918m093l049n5668k625M4664n558m9263J3628N4710
24431A4228K9184m358k0041M1452K0287j08859l0784K1864L8267N7141l3131K6245
24419E1495K0365m0129m6364L6240N6200l9259J9092M8526j4038k7855l1253M014
24407C7034j7731J1665R020K823J5471J9558k1406k7979K166o4378j2061K8249
24395a7569k3271j8088l276l729j5956Q298M7189K3916k2126J3317J530l4776
24383d4541R283j880j570L6126Q359l137m4679k9026o255k4909L3111O1125O8582
24370F0589k9798k2267Q870l8690m0375m852K2482O8892L8658m7019o2622M9501
$$ plain form
24358 3369 52809 65546 40788 11086 14039 19441 27696 45154 19261 -5320 -11707 -54042 -17001
24345 -17001 61521 81118 25739 -4456 7847 6522 -21401 -21390 -33620 -14731 -13568 -10765 24892
24332 24892 25013 16190 -22065 -6223 23356 26782 -3104 -30516 10470 35533 27799 -14377 -51460
24319 -51460 -66808 -65955 -47352 -38691 -39086 21418 43977 28236 -16991 -25700 -61829 -24014 10673
24306 10673 -25093 -1738 13977 48301 39780 17991 6864 13669 75627 95811 106629 66374
24294 66374 22139 -17998 -32574 -7217 4318 -16794 23368 56853 60650 41355 10063 25089
24282 25089 69061 24732 32613 43041 67448 39655 51293 69499 68691 107206 115446 55534
24270 55534 -3704 6808 19831 70770 85661 37458 -6328 -50547 -45846 25452 10837 20291
$$ packed form
24358C369M9440J2737k4758k9702K953N402Q255J7458k5893k4581o387m2335L7041
24345a7001P8522J9597n5379l0195J2303j325k7923J1j2230J8889J163K803L5657
24332B4892J21q823l8255J5842K9579L426k9886k7412M0986K5063p734m2176l7083
24319e1460j5348Q53J8603Q661l95O0504K2559j5741m5227q709l6129L7815L4687
24306A0673l5766K3355J5715L4324q521k1789j1127O805O1958K0184J0818m0255
24294F6374m4235m0137j4576K5357J1535k1112M0162L3485L797j9295l1292J5026
24282B5089M3972m4329P881J0428K4407k7793J1638J8206q08L8515Q240n9912
24270E5534n9238J0512J3023N0939J4891m8203m3786m4219M701P1298j4615R454
$$ plain form
24258 20291 -7194 -31404 -68409 -43866 -23080 -5609 4455 9945 24033 -41848 -73429 -12062
24246 -12062 6261 13053 14227 -42316 -23471 -54782 -81256 -87124 -18726 36222 85425 68299
24234 68299 37353 27290 38464 81204 78205 104917 89383 104682 99938 52210 67999 101950
24222 101950 87768 68913 43755 16209 37155 58127 59516 12771 23042 52578 92013 115443
24210 115443 64819 27798 -28536 -31902 28642 -11842 -34633 -46545 -587 18553 -13944 -45103
24198 -45103 -40394 -26551 -50350 15279 46164 86577 78331 39287 40636 40529 33014 25134 -3802
24185 -3802 593 -2477 -14718 7617 23370 -22550 -73480 -89046 -43014 24044 74946 88129
24173 88129 82831 15253 -22592 2341 34496 35743 66097 77400 50816 26230 11023 15699
$$ packed form
24258B0291k7485k4210l7005K4543K0786J7471J0064N490J4088o5881l1581O1367
24246a2062J8323O792J174n6543J8845l1311k6474n868O8398N4948M9203j7126
24234F8299l0946j0063J1174M2740k999K6712j5534J5299m744m7728J5789L3951
24222A01950j4182j8855k5158k7546K0946K0972J389m6745J0271K9536L9435K3430
24210A15443n0624l7021n6334l366O0544m0484k2791j1912M5958J9140l2497l1159
24198d5103M709J3843k3799O5629L0885M0413q246l9044J349j07p515p880k8936
24185c802M395l070j2241K2335J5753m5920n0930j5566M6032O7058N0902J3183
24173H8129n298o7578l7845K4933L2155J247L0354J1303k6584k4586j5207M676
$$ plain form
24161 15699 15811 -16208 11473 42526 6370 22645 48910 23164 -13173 -57023 -75244 -99458
24149 -99458 -124391 -85448 -38505 -8899 13986 -2811 -27337 -23350 -35873 -47946 -60991 -3151
24137 -3151 -612 15687 19691 1915 9590 26696 -29737 -54818 -46730 -38752 1762 21201 -1243
24124 -1243 -11060 -616 -30232 -21776 -2496 -17650 -25256 -55161 -38573 -31508 -13954 21316 60015
24111 60015 89992 90683 84421 69249 13521 -52665 -78759 -52953 -24061 20520 -2236 25951
24099 25951 38001 -18626 -22824 8165 33864 -33331 -68233 -37615 -14430 12552 15344 43015
24087 43015 11368 -25968 -38878 -7212 19913 63750 86046 82320 9869 23446 -13377 -18512
24075 -18512 64649 69421 -20399 -56705 -100400 -149964 -118383 -50008 7920 55771 38216 -11937
$$ packed form
24161A5699J12l2019K7681L1053l6156J6275K6265k5746l6337m3850j8221k4214
24149i9458k4933L8943M6943K9606K2885j6797k4526L987j2523j2073j3045N7840
24137c151K539J6299M004j7776P675J7106n6433k5081Q088P978M0514J9439k2444
24124a243r817J0444k9616Q456J9280j5154p606k9905J6588P065J7554L5270L8699
24111F0015K9977O91o262j5172n5728o6186k6094K5806K8892M4581k2756K8187
24099B5951J2050n6627m198L0989K5699o7195l4902L0618K3185K6982K792K7671
24087D3015l1647l7336j2910L1666K7125M3837K2296l726p2451J3577l6823n135
24075a8512Q3161M772q9820l6306m3695m9564L1581O8375N7928M7851j7555n0153
$$ plain form
24063 -11937 11416 3891 -14989 -18995 -57439 -48934 -60107 -22461 -34795 -3341 -28190 -57066
24051 -57066 -8453 -11909 -47468 -50757 40346 104382 83287 55600 -10308 -90194 -69069 -30728
24039 -30728 42342 44035 44506 70741 51255 65186 37372 -23446 -20808 -16992 -24910 -59107 -48864
24026 -48864 -44553 4059 -20283 -58173 -19330 -590 -11044 -462 14648 15344 -23011 -96855
24014 -96855 -80015 -42503 4446 56171 97426 87225 23030 -141 -26460 -24919 -16650 2139
24002 2139 17077 -34201 1595 38578 11213 -10836 52683 53408 54158 65821 63029 9931 -30938
23989 -30938 -43481 -61401 -13550 28923 29873 61670 15785 -15190 4941 -62603 -42676 7169
23977 7169 10729 12429 18696 28886 31195 -7750 -47790 -34762 -6510 181 -22211 -56684 -33577
$$ packed form
24063a1937K3353p525j8880m006l8444Q505j1173L7646j2334L1454k4849k8876
24051e7066M8613l456l5559l289R1103O4036k1095k7687o5908p9886K1125L8341
24039c0728P3070J693M71K6235j9486J3931k7814o0818K638L816p918l4197J0243
24026d8864M311M8612k4342l7890L8843J8740j0454J0582J5110O96l8355p3844
24014i6855J6840L7512M6949N1725M1255j0201o4195k3171k6319J541Q269J8789
24002B139J4938n1278L5796L6983k7365k2049O3519P25P50J1663k792n3098m0869
23989c0938j2543j7920M7851M2473R50L1797m5885l0975K0131o7544J9927M9845
23977G169L560J700O267J0190K309l8945m0040J3028K8252O691k2392l4473K3107
$$ plain form
23964 -33577 -4988 -7214 3552 -8991 22034 52798 45070 -13097 16209 2066 2000 -1629 26509
23951 26509 33923 57723 72564 109712 62310 27729 -8127 -92988 -122590 -110241 -69963 -35940
23939 -35940 -59165 -78428 -76556 -67743 -33568 -55002 -23507 7844 39140 60627 106317 52614
23927 52614 -22769 -39752 21090 -23104 -53682 -49720 -17282 -17456 -41236 -48149 -10423 -2285 -52320
23914 -52320 -72441 -10514 3333 -23677 -12340 32010 45514 10576 -42594 -10811 -7703 -64428
23902 -64428 -53965 -13687 13158 6808 34318 57843 47203 -1512 31933 50684 53605 61431
23890 61431 68711 32605 5486 53331 60371 58299 62084 48600 33356 47986 55930 22040 25440
23877 25440 24334 -7614 -6798 -22234 -11255 -3856 24276 29222 22014 -54593 -34791 -5858 -40682
$$ packed form
23964c3577K8589k226J0766j2543L1025L0764p728n8167K9306j4143o6l629K8138
23951B6509P414K3800J4841L7148m7402l4581l5856q4861k9602J2349M0278L4023
23939c5940k3225j9263J872Q813L4175k1434L1495L1351L1296K1487M5690n3703
23927E2614p5383j6983O0842m4194l0578L962L2438j74k3780o913L7726Q138n0035
23914e2320k0121O1927J3847k7010J1337M4350J3504l4938n3170L1783L108n6725
23902f4428J0463M0278K6845o350K7510K3525j0640m8715L3445J8751K921P826
23890F1431P280l6106k7119M7845P040k072L785j3484j5244J4630P944l3890L400
23877B5440j106l1948Q16j5436J0979P399K8132M946p208p6607J9802K8933l4824
$$ plain form
23864 -40682 -26713 -47773 -33118 -25598 -24690 -36628 -9241 -48626 -37364 10773 -23765 -74020
23852 -74020 -72391 -29849 -40533 -50047 -18807 18049 55121 18685 63614 106392 84950 43551
23840 43551 16205 -29818 -34654 -54777 -94917 -64272 3997 -17337 -47132 -41419 -84260 -60460
23828 -60460 -37450 -65233 -71484 -61186 -42311 -11787 48942 10501 -22415 -84389 -114351 -70818
23816 -70818 -44986 -52364 -55978 -21328 -31395 -48380 -20034 -44812 -53754 -16801 -12931 -51867
23804 -51867 -95392 -50453 -2794 -14668 19781 -26773 -35387 -46070 -48907 -6652 16700 -33325
23792 -33325 1280 55758 92892 58632 -1053 -38396 -43851 -26690 12459 6174 24328 88895
23780 88895 79770 32202 -25954 -7121 -5235 -14141 -24075 -35033 -57611 -99739 -92694 9745
$$ packed form
23864d0682J3969k1060J4655P520R08j1938K7387l9385J1262M8137l4538n0255
23852g4020J629M2542j0684r514L1240L6856L7072l6436M4929M2778k1442m1399
23840D3551k7346m6023m836k0123m0140L0645O8269k1334k9795N713m2841K3800
23828f0460K3010k7783o251J0298J8875L0524O0729l8441l2916o1974k9962M3533
23816g0818K5832p378l614L4650j0067j6985K8346k4778q942L6953L870l8936
23804e1867m3525M4939M7659j1874L4449m6554q614j0683k837M2255K3352n0025
23792c3325L4605N4478L7134l4260n9685l7343n455J7161L9149o285J8154O4567
23780H8895r125m7568n8156J8833J886q906r934j0958k2578m2128P045J02439
$$ plain form
23768 9745 75507 57655 42835 63156 50716 -7747 -45053 -65836 -7930 10744 33922 57245
23756 57245 59222 35423 26812 31971 45703 45133 33552 -14348 -76816 -39591 17504 21188 18114
23743 18114 12643 73404 131443 88787 -18415 -16767 15085 -1909 7241 -3459 -28259 -19187
23731 -19187 20871 49779 34470 18562 72391 72678 49471 23311 14928 24701 51829 46996 42018
23718 42018 25894 4475 -28187 -5265 -7815 -3126 24892 45222 36299 17275 -38912 -140067
23706 -140067 -121114 -85418 -94101 -41754 -7001 -19495 -5116 13510 10896 25650 40335 45377
23694 45377 64199 15387 -43214 -14988 -12673 11595 15474 51563 128038 68261 26776 10860
23682 10860 51416 64705 62630 13274 -1996 23386 13170 10872 -32495 -23596 48526 64822
$$ packed form
23768I745O5762j7852j4820K0321j2440n8463l7306k0783N7906J8674K3178K3323
23756E7245J977k3799q611N159J3732n70j1581m7900o2468L7225N7095L684l074
23743A8114n471O0761N8039m2656j07202J648L1852j6994R150j0700k4800R072
23731a9187M0058K8908j5309j5908N3829K87k3207k6160q383R773K7128m833m978
23718D2018j6124k1419l2662K2922k550M689K8018K0330q923j9024n6187j01155
23706a40067J8953L5696q683N2347L4753j2494J4379J8626k614J4754J4685N042
23694D5377J8822m8812n8601K8226K315K4268L879L6089P6475n9777m1485j5916
23682A0860M0556J3289k075m9356j5270K5382j0216k298m3367Q899P2122J6296
$$ plain form
23670 64822 69156 60613 93977 80721 23160 32785 30812 37309 40925 9263 71657 106080 24589
23657 24589 -11229 -10333 -20675 -5877 21100 19590 40140 79419 75076 41774 32576 7242 -37197
23644 -37197 -61754 -96846 -35186 -4858 15443 -23548 -66229 -55182 -62819 -86369 -57084 -25504
23632 -25504 3799 10294 8175 13976 -20850 -4619 63861 107061 42670 -36269 -61150 -34749
23620 -34749 12862 56757 64731 7523 -24640 -45859 -77539 -93283 -138416 -147040 -144517 -97413
23608 -97413 -53382 -24611 -6071 91760 140684 55805 32311 20793 -19384 -12889 -5260 33926
23596 33926 45532 48607 102571 98053 -15615 -47323 -557 35898 55817 59466 15864 -29381
23584 -29381 -56936 -49611 -5575 33851 32038 23172 7671 -522 20167 35254 -19508 -34920
$$ packed form
23670F4822M334q543L3364j3256n7561R625j973O497L616l1662O2394L4423q1491
23657B4589l5818Q96j0342J4798K6977j510K0550L9279m343l3302r198k5334m4439
23644c7197k4557l5092O1660L0328K0301l8991m2681J1047p637k3550K9285L1580
23632b5504K9303O495k119N801l4826J6231O8480M3200o4391p8939k4881K6401
23620c4749M7611M3895P974n7208l2163k1219l1680j5744m5133q624K523M7104
23608i7413M4031K8771J8540R7831M8924q4879k3494j1518m0177O495P629L9186
23596C3926J1606L075N3964m518j13668l1708M6766L6455J9919L649m3602m5245
23584b9381k7555P325M4036L9426j813q866j5501q193K0689J5087n4762j5412
$$ plain form
23572 -34920 -31150 -34733 -47938 -25895 -2264 -4176 -21334 -31555 -38099 -3875 -6282 16130 16609
23559 16609 27609 -3443 23478 66585 75594 76010 28270 19681 4171 -29435 9309 26486
23547 26486 -27072 -43607 -49723 -94644 -70941 -18253 -34047 -17088 25118 53836 74602 70322
23535 70322 66283 85968 22506 -23990 15312 31977 14795 -28910 -56127 -112276 -73480 -17426
23523 -17426 74176 69046 37798 46560 33071 35321 -16015 -26775 -10087 16858 44884 42645
23511 42645 23960 22934 -3616 -39246 -35560 -24060 7696 10193 -23989 -10245 11831 34920
23499 34920 31845 28345 -63879 -73243 -52620 -35885 -43992 -42862 -50584 -27272 26047 62444 62070
23486 62070 54244 27419 -109 -20759 26092 71935 122677 87006 48837 -7568 -37233 -23427
$$ packed form
23572c4920L770l583j3205K2043K3631j912j7158j0221o544L4224k407K2412M79
23559A6609J1000l1052K6921M3107R009M16m7740q589j5510l3606L8744J7177
23547B6486n3558j6535o116m4921K3703N2688j5794J6959M2206K8718K0766m280
23535G0322m039J9685o3462m6496L9302J6665j7182m3705k7217n6149L8796N6054
23523a7426R1602n130l1248Q762j3489K250n1336j0760J6688K6945K8026k239
23511D2645j8685j026k6550l5630L686J1500L1756K497l4182J3744K2076K3089
23499C4920l075l500r2224r364K0623J6735q107J130p722K3312N3319L6397l74
23486F2070p826k6825k7528k0650M6851M5843N0742l5671l8169n6405k9665J3806
$$ plain form
23474 -23427 -37973 -5371 14849 -16930 -57561 -83051 -107417 -92307 -113329 -75119 -13117 42058
23462 42058 73650 80820 20613 10348 18487 45710 41304 44447 92901 125859 83817 35170
23450 35170 -14880 -40824 -21769 22012 31119 -5473 18811 43221 76198 84873 -2240 -51117
23438 -51117 -7023 22524 -3590 8169 26658 927 -11583 5337 -70787 -118093 -120709 -134545
23426 -134545 -123126 -81900 -77263 -94042 -88319 -72380 -73043 -32502 -5499 46203 65257 52207
23414 52207 -1464 -48303 -51088 42771 48565 27651 35618 23379 41850 73518 119684 99020
23402 99020 45674 24083 -3428 5980 -13447 -5461 -13208 -21120 -32708 -68360 -84764 -81050 -44704
23389 -44704 12491 42598 69033 68308 2159 -13440 -12754 -61251 -82450 -17180 -38688 -54847
$$ packed form
23474b3427j4546L2602K0220l1779m0631k5490k4366J5110k1022L8210O2002N5175
23462D2058L1592P170o0207j0265Q139K7223m406L143M8454L2958m2042m8647
23450C5170n0050k5944J9055M3781R107l6592K4284K4410L2977Q675q7113m8877
23438e1117M4094K9547k6114J1759J8489k5731j2510J6920p6124m7306k616j3836
23426a34545J1419M1226M637j6779N723J5939o63M0541K7003N1702J9054j3050
23414E2207n3671m6839k785R3859N794k0914P967j2239J8471L1668M6166k0664
23402I9020n3346k1591k7511R408j9427P986p747p912j1588l5652j6404L714L6346
23389d4704N7195L0107K6435p25o6149j5599O86m8497k1199O5270k1508j6159
$$ plain form
23377 -54847 -45233 -155048 -130823 -53176 -37412 -51436 -50180 -42109 -80379 -42099 13025 53215
23365 53215 53959 19339 -882 -8464 -39356 -93150 -72152 -35174 -35148 -54188 -72376 -27951 -873
23352 -873 -28318 -71524 -48588 -77360 -94278 -61980 -1417 -31890 -17889 -25616 -32051 -33833 -46744
23339 -46744 -23258 -16033 -31711 -35252 -49084 -81905 -108001 -96168 -66436 -8995 25023 78738
23327 78738 58591 91179 133006 111703 68355 27630 -11670 -45003 -16083 -2005 -33894 -26785
23315 -26785 -21586 20490 55027 24673 57488 43983 42876 50984 65263 39457 55536 51995
23303 51995 45951 -12066 -51454 -50088 -69922 -75354 -78994 -85374 -109387 -66229 -27716 5345 -7136
23290 -7136 -13625 28340 22958 -54639 -131706 -128979 -53478 7475 39521 38684 53519 22561 -2337
$$ packed form
23377e4847R614j09815K4225P7647J5764j4024J256Q071l8270L8280N5124M0190
23365E3215P44l4620k0221p582l0892n3794K0998L6978K6j9040j8188M4425K7078
23352h73k7445m3206K2936k8772j6918L2298O0563l0473J4001p727o435j782j2911
23339d6744K3486P225j5678l541j3832l2821k6096J1833K9732N7441L4018N3715
23327G8738k0147L2588M1827k1303m3348m0725l9300l3333K8920J4078l1889P109
23315b6785N199M2076L4537l0354L2815j3505j107Q108J4279k5806J6079l541
23303E1995o044n8017l9388J366j9834n432l640o380k4013M3158L8513L3061j2481
23290g136o489M1965n382p7597p7067K727P5501O0953L2046q37J4835l0958k4898
$$ plain form
23277 -2337 48564 98205 13931 -39021 -61658 -58627 -29324 -6261 -22023 -30976 -28427 -17391
23265 -17391 -636 35702 26766 -13315 9621 29524 44504 71367 48434 12899 27962 41377
23253 41377 99340 81487 73480 80265 8539 5173 33288 59316 12735 -26214 -25800 -54292 -96277
23240 -96277 -135769 -113993 -56545 -55172 28920 47560 27071 12842 10092 -24317 -46085 46394
23228 46394 115543 116714 38320 56441 39422 -35954 -26816 -2490 11084 -43620 -64450 -26872
23216 -26872 -6152 37842 45261 45717 33451 6579 26076 20671 -17993 -56858 -60145 -24733 12982
23203 12982 -7964 -2154 -14278 -71171 -35405 -4098 -26003 -44384 -37194 -57658 -23606 -11572
23191 -11572 -34699 -76595 -71099 -34149 -37266 -82154 -83770 -56330 -17467 27769 46084 2023
$$ packed form
23277b337N0901M9641q4274n2952k2637L031K9303K3063j5762q953K549J1036
23265a7391J6755L6338q936m0081K2936J9903J4980K6863k2933l5535J5063J3415
23253D1377N7963j7853q007O785p1726l366K8115K6028m6581l8949M14k8492m1985
23240i6277l9492K1776N7448J373Q4092J8640k0489j4229k750l4409k1768R2479
23228D6394O9149J171p8394J8121j7019p5376R138K4326J3574n4704k0830L7578
23216b6872K0720M3994P419M56j2266k6872J9497n405l8664l8865l287L5412L7715
23203A2982k0946N810j2124n6893L5766L1307k1905j8381P190k0464L4052J2034
23191a1572k3127m1896N496L6950l117m4888j616K7440L8863M5236J8315m4061
$$ plain form
23179 2023 -67389 -15012 21723 18405 -4557 -13690 -25217 -13719 -38816 -20062 1187 -16255
23167 -16255 -52465 -69507 -80005 -97469 -76899 -110910 -92696 -52229 -56069 -36925 -43797 -41340
23155 -41340 -50576 -49099 -44475 -80585 -67838 -49594 -27935 -45690 -57653 -19548 14836 -21354
23143 -21354 -34453 -2147 972 -14021 -92241 -82677 -73549 -95198 -24582 -2996 -35734 -17081
23131 -17081 35688 9497 -20460 -25022 -488 7274 12475 23797 -11651 -45119 -3916 36956
23119 36956 33743 23573 24697 56024 33362 16901 -31069 -90592 -104918 -48080 -76298 -95245
23107 -95245 -108875 -69610 -34956 -31740 17003 38093 -865 -53578 10632 -31883 -75198 -21573
23095 -21573 15690 -38439 -63032 -78526 -91131 -76818 -43575 -28696 -36713 -53677 -68126 -15971
$$ packed form
23179B023o9412N2377L6735l318k2962r133j1527J1498k5097J8754K1249j7442
23167a6255l6210j7042j0498j7464K0570l4011J8214M0467l840J9144o872K457
23155d1340r236J477M624l6110J2747J8244K1659j7755j1963L8105L4384l6190
23143b1354j3099L2306L119j4993p8220R564R128k1649P0616K1586l2738J8653
23131a7081N2769k6191k9957m562K4534P762N201J1322l5448l3468M1203M0872
23119C6956l213j0170J124L1327k2662j6461m7970n9523j4326N6838k8218j8947
23107i5245j3630L9265L4654L216M8743K1090l8958n2713O4210m2515m3315N3625
23095b1573L7263n4129k4593j5494j2605J4313L3243J4879q017j6964j4449N2155
$$ plain form
23083 -15971 -4775 16148 -19639 -10052 -36530 -26912 -44635 -47954 -27322 -19270 -36551 -23032
23071 -23032 529 -2897 -57497 -55789 -41852 -23641 24605 44967 31141 51615 92628 107970
23059 107970 26084 -17918 15252 42868 16915 -19773 -31779 -49658 -82847 -51704 -45450 -19851
23047 -19851 20678 3929 -20265 -12678 19570 47099 1065 8972 -6155 -5627 -6385 -744 42083
23034 42083 19885 16962 -24338 -36877 -39461 -8856 2594 -28083 -24477 3388 -20077 -28463
23022 -28463 -8217 -17733 -36724 -1336 -3096 2328 29157 44798 74637 21401 -46749 -43423
23010 -43423 -36560 -18757 -17806 -48725 -23904 -6690 -36796 -34208 8414 33110 30601 29456 25231
22997 25231 29886 22186 38432 42522 14462 -13871 -42734 -10020 -28606 -286 46302 48448
$$ packed form
23083a5971J1196K0923l5787R587k6478R618j7723l319K0632Q052j7281J3519
23071b3032K3561l426n4600J708J3937J8211M8246K0362j3826K0474M1013J5342
23059A07970q1886m4002L3170K7616k5953l6688j2006j7879l3189L1143O254K5599
23047a9851M0529j6749k4194P587L2248K7529m6034P907j5127N28p58N641M2827
23034D2083k2198k923m1300j2539k584L0605J1450l0677L606K7865k3465q386
23022b8463K0246r516j8991L5388j760N424K6829J5641K9839n3236o8150L326
23010d3423O863J7803R51l0919K4821J7214l0106K588M2622K4696k509j145m225
22997B5231M655p700J6246M090k8060k8333k8863L2714j8586K8320M6588K146
$$ plain form
22985 48448 23581 -10845 -863 27583 45033 52965 9356 -12251 4927 11935 62536 23705
22973 23705 -9577 -561 57380 80929 78289 39101 -52261 -90113 -78308 -136472 -149670 -119289
22961 -119289 -104017 -89773 -87608 -98480 -41409 -40453 -48444 -75434 -70736 -64266 -92848 -46381 37213
22948 37213 83774 20629 -2317 19517 53287 37013 27567 29534 46655 75089 26892 -8304
22936 -8304 7739 66640 44954 20422 7580 -19003 -24897 -34294 16365 -1219 -2287 54313
22924 54313 81556 37432 -4673 -1425 -4341 -37015 -31846 -8427 5295 -21658 -87707 -129528
22912 -129528 -128881 -79862 -36180 -13588 19698 -26233 3984 35338 38749 40090 35577 -47732
22900 -47732 -50930 -45392 -64747 -92135 -27507 -3510 -28683 -64397 -80900 -79846 -85837 -133267
$$ packed form
22985D8448k4867l4426R982K8446J7450P932m3609k1607J7178P008N0601l8831
22973B3705l3282R016N7941K3549k640l9188r1362l7852J1805n8164j3198L0381
22961a19289J5272J4244K165j0872N7071R56p991k6990M698O470k8582M6467Q3594
22948C7213M6561o3145k2946K1834L3770j6274r446J967J7121K8434m8197l5196
22936h304J6043N8901k1686k4532j2842k6583n894r397N0659j7584j068N6600
22924E4313K7243m4124m2105L248k916l2674N169K3419J3722k6953o6049m1821
22912a29528O47M9019M3682K2592L3286m5931L0217L1354L411J341m513q3309
22900d7732l198N538j9355k7388O4628K3997k5173l5714j6503J054n991m7430
$$ plain form
22888 -133267 -138836 -120174 -129944 -119464 -433 60865 36435 23387 -2696 20704 33763 -25976
22876 -25976 -104171 -99198 -31943 19904 29099 69053 84728 -18205 -28855 29585 -11606 -35551
22864 -35551 -6316 42010 37548 26687 -5497 -16551 27615 34552 38007 47033 29836 -53568
22852 -53568 -21742 15215 17362 29567 55482 73337 52498 55931 8304 -8414 -50546 9946
22840 9946 -5824 -79053 -114762 -110795 -102893 -97421 -55453 15606 85099 69423 36679 32679 10987
22827 10987 14029 3272 52260 25251 -14817 -55479 -85939 -50178 -39676 -5371 7277 -5763
22815 -5763 45618 19797 -12800 -43056 -19174 28081 66812 26449 18830 26512 -12420 -4733
22803 -4733 10244 -652 -48709 -71867 -77576 -59832 -70961 -9858 45377 34444 13865 -28060
$$ packed form
22888a33267n569J8662r770J0480J19031O1298k4430j3048k6083K3400J3059n9739
22876b5976p8195M973O7255N1847R195L9954J5675j02933j0650N8440m1191k3945
22864c5551K9235M8326m462j0861l2184j1054M4166O937L455R026j7197q3404
22852e3568L1826L6957K147J2205K5915J7855k0839L433m7627j6718m2132O0492
22840I946j5770p3229l5709L967P902N472M1968P1059O9493j5676l2744m000k1692
22827A0987L042j0757M8988k7009m0068m0662l0460L5761J0502L4305J2648j3040
22815e763N1381k5821l2597l0256K3882M7255L8731m0363p619P682l8932P687
22803d733J4977j0896m8057k3158n709J7744j1129O1103N5235j0933k0579m1925
$$ plain form
22791 -28060 -16911 23660 -26607 -49673 -22853 2477 19403 76139 87585 86601 57669 9508
22779 9508 31233 9013 -21260 -24079 -20180 -58497 -100089 -75556 -88858 -86722 -81882 -72453 3036
22766 3036 62984 87429 78510 39305 -21647 -73340 -64346 -62733 -86037 -67438 -51397 -54511 -33792
22753 -33792 -20931 -71703 -46507 -54882 -30313 -50541 -36237 1689 -6422 -47978 -80634 -83436
22741 -83436 -106047 -114265 -146790 -165870 -76715 42711 73903 12464 -17989 -54237 -46461 18694
22729 18694 30020 -9458 -34184 -19090 2674 -45154 -29416 -57709 -65304 -53308 -51159 -30922
22717 -30922 -49264 -65113 -774 -3726 -64451 -40116 -453 -9913 11738 -51182 -55786 -49347
22705 -49347 -36453 -56355 -81955 -31015 -65445 -112136 -36414 23591 24071 31 -91657 -121011
$$ packed form
22791b8060J1149M0571n0267k3066K6820K5330J6926N6736J1446r84k8932m8161
22779I508K1725k2220l0273k819L899l8317m1592K4533j3302K136M840R429P5489
22766C036N9948K4445q919l9205o0952n1693Q994J613k3304J8599J6041l114K0719
22753c3792J2861n0772K5196q375K4569k0228J4304L7926q111m1556l2656k802
22741h3436k2611q218l2525j9080Q9155J19426L1192o1439l0453l6248P776O5155
22729A8694J1326l9478k4726J5094K1764m7828J5738k8293p595J1996K149K0237
22717c0922j8342j5849O4339k952o0725K4335L9663r460K1651o2920m604O439
22705d9347J2894j9902k5600N0940l4430m6691P5722O0005M80k4040r1688k9354
$$ plain form
22693 -121011 -99351 -45358 15962 -860 -62830 -61674 -89574 -59431 -16319 3331 2697 -11118
22681 -11118 2034 16700 -18336 -44256 -38426 6071 -4959 -55123 14793 -6907 -49115 5411
22669 5411 53833 71776 -1528 -31745 -17290 -25600 39487 97903 96625 79452 42829 -1810
22657 -1810 -15027 1786 25364 25432 16135 24855 10269 17205 -22604 -34019 -7804 22768 53232
22644 53232 83497 74216 7360 -26451 -454 -14835 -82341 -123083 -103781 -74028 -106743 -150077
22632 -150077 -102965 -92714 -94404 -58563 -76936 -38321 -11005 -7809 -36200 -24519 -32329 -32790
22620 -32790 -53733 -51832 -51520 -29373 -71647 -93431 -86833 -81765 -57065 -17922 -47142 -91366 -69285
22607 -69285 -42212 -28325 -33260 -20399 -26167 2046 40338 15567 7300 -3365 -26938 -10769
$$ packed form
22693a21011K1660N3993O1320j6822o1970J156k7900L0143M3112J9650o34j3815
22681a1118J3152J4666l5036k5920N830M4497j1030n0164O9916k1700m2208N4526
22669E411M8422J7943p3304l0217J4455q310O5087N8416j278j7173l6623m4639
22657a810j3217J6813K3578O8r297Q720j4586O936l9809j1415K6215L0572L0464
22644E3232L0265r281o6856l3811K5997j4381o7506m0742J9302K9753l2715m3334
22632a50077M7112J0251j690L5841j8373L8615K7316L196k8391J1681p810m61
22620c2790k0943J901L12K2147m2274k1784O598N068K4700L9143k9220m4224K2081
22607f9285K7073J3887m935J2861n768K8213L8292k4771q267j0665k3573J6169
$$ plain form
22595 -10769 10380 12869 14656 5941 20785 -24529 -97177 -85935 -29218 10289 6286 19136
22583 19136 24716 84011 116830 83656 66237 34274 -8513 -54656 -54835 -29621 -66213 -85113
22571 -85113 -63265 -77027 -45357 -9748 -23307 -29311 -3231 20570 844 -26606 -46320 -21520
22559 -21520 -12361 14710 31692 5673 -4006 18258 -30325 -49184 -42282 -67049 -62240 -42471
22547 -42471 -20500 19378 9288 -16941 -86877 -86497 -37770 -68290 -85517 -77595 -78392 -91218 -71936
22534 -71936 -81671 -51754 44719 70214 49614 7466 6888 -16425 -44833 -68278 -61913 -58839 -9111
22521 -9111 -81490 -101912 -53782 -7301 28002 14402 -39135 -53326 -21979 -15080 -2045 -31934
22509 -31934 -50386 -41933 -45861 -48403 -32138 -12201 -16069 -20158 -6727 -7332 -22270 26865 -26037
$$ packed form
22595a0769K1149K489J787q715J4844m5314p2648J1242N6717L9507m003J2850
22583A9136N580N9295L2819l3174j7419l1963m2787m6143j79K5214l6592j8900
22571h5113K1848j3762L1670L5609j3559o004K6080K3801j9726k7450j9714K4800
22559b1520R159K7071J6982k6019r679K2264m8583j8859O902k4767M809J9769
22547d2471K1971L9878j0090k6229o9936L80M8727l0520j7227P922p97j2826J9282
22534g1936r735K9917R6473K5495k0600m2148n78k3313k8408k3445O365L074M9728
22521i111p2379k0422M8130M6481L5303j3600n3537j4191L1347O899J3035k9889
22509c1934j8452Q453l928k542J6265J9937l868m089J3431o05j4938M9135n2902
$$ plain form
22496 -26037 -69 -267 24791 76758 106793 108290 19691 -44281 -5915 17808 -45917 -67554
22484 -67554 -17755 7735 -5991 -21578 21375 -15235 -45472 -17514 -32979 -45407 -53927 -24259
22472 -24259 6842 -26438 -22477 -44537 -111609 -149971 -138676 -80762 -16967 4562 -26338 -22549
22460 -22549 47742 41116 20079 -9151 -7327 -18156 -13848 -27636 61 -17074 -20454 5873
22448 5873 33308 18135 21165 42478 47689 -18920 -41085 -7324 -27090 -39954 -40972 7584
22436 7584 53956 -18662 -31456 -639 -4206 9024 50320 63897 43230 -12258 -11484 -39036
22424 -39036 -7530 4929 4989 14812 -346 -37916 -25236 7816 6809 -72082 -92871 -83692 -24432
22411 -24432 9378 60977 86781 78830 64317 93230 83131 49482 25590 -14737 -49022 -71486
$$ packed form
22496b6037K5968j98K5058N1967L0035J497q8599o3972L8366K3723o3725k1637
22484f7554M9799K5490j3726j5587M2953l6610l0237K7958j5465j2428q520K9668
22472b4259L1101l3280L961k2060o7072l8362J1295N7914O3795K1529l0900L789
22460b2549P0291o626k1037k9230J824j0829M308j3788K7697j7135l380K6327
22448E873K7435j5173L030K1313N211o6609k2165L3761j9766j2864j018M8556
22436G584M6372p2618j2794L0817l567J3230M1296J3577k0667n5488P74k7552
22424c9036L1506J2459O0R823j5158l7570J2680L3052j007p8891k0789R179N9260
22411b4432L3810N1599K5804p951j4513K8913j0099l3649k3892m0327l4285k2464
$$ plain form
22399 -71486 -22295 24076 11944 -24588 -45181 -85843 -68018 -14752 12129 6012 1206 -11825
22387 -11825 -13564 52136 73973 11632 31526 33684 12477 26111 -18731 -77320 -73544 -24392
22375 -24392 -33552 -35680 -9388 -12891 -48761 -108863 -61475 -34837 -25432 -31404 -8512 -11714 -21386
22362 -21386 -22624 -29518 -66829 -100801 -120580 -113842 -116233 -94057 -52005 -53465 -72190 -2168 61075
22349 61075 26058 -3026 16505 23434 41581 -20133 -75915 -42698 -36069 -59654 -55935 -35147
22337 -35147 -25613 -57120 -42429 30662 49165 11808 33992 31463 21617 9522 -11799 2215
22325 2215 65629 70378 27252 -18895 -16210 21479 61926 55456 -474 12266 95933 122787
22313 122787 138689 68291 2759 30428 47717 -14967 -90245 -99471 -107540 -86895 -62873 -44134
$$ packed form
22399g1486M9191M6371j2132l6532k0593m0662J7825N3266K6881o117m806j3031
22387a1825j739O5700K1837o2341J9894K158k1207J3634m4842n8589L776M9152
22375b4392r160k128K6292l503l5870o0102M7388K6638R405n972K2892l202r672
22362b1386j238o894l7311l3972j9779O738k391K2176M2052j460j8725P0022O3243
22349F1075l5017k9084J9531O929J8147o1714n5782L3217O629k3585L719K0788
22337c5147R534l1507J4691P3091J8503l7357K2184k529r846j2095k1321J4014
22325B215O3414M749m3126m6147K685L7689M0447o470n5930J2740Q3667K6854
22313A22787J5902p0398o5532K7669J7289o2684p5278r226q069K0645K4022J8739
$$ plain form
22301 -44134 -40168 -40480 -26942 2835 -22232 -45743 -80189 -31333 -5310 -4917 -11023 -46010 8305
22288 8305 23676 15114 -4012 -21306 -1011 39296 17642 -4239 -6090 47060 -8470 -8522 67182
22275 67182 50103 -16433 -18021 30737 42295 -5643 -2781 58796 42849 -50784 -53970 -72914
22263 -72914 -93314 -89782 -77922 -37135 5178 28797 89963 63894 49568 77998 43941 -6366
22251 -6366 -22400 -21782 9529 30071 3009 -8335 -7391 -12276 -65904 -46931 -98875 -70907 -53889
22238 -53889 -63045 -82121 -63824 -51059 -15019 -33021 17366 26770 53157 42169 667 -86889
22226 -86889 -106772 -44198 5693 52563 40016 -51677 -84025 -120318 -88946 -91733 -109350 -93520
22214 -93520 -81378 -101523 -93176 -95350 -76437 -35202 -68309 -108859 -66240 -82636 -59399 -14951
$$ packed form
22301d4134L966l12J3538K9777k5067k3511l4446M8856K6023L93o106l4987N4315
22288H305J5371q562j9126j7294K0295M0307k1654k1881j851N3150n5530n2P5704
22275F7182j7079o6536j588M8758J1558m7938K862O1577j5947r3633l186j8944
22263g2914k0400L532J1860M0787M2313K3619O1166k6069j4326K8430l4057n0307
22251f366j6034O18L1311K0542k7062j1344R44m885n3628J8973n1944K7968J7018
22238e3889r156j9076J8297J2765L6040j8002N0387R404K6387j0988m1502q7556
22226h6889j9883O2574M9891M6870j2547r1693l2348l6293L1372k787j7617J5830
22214i3520J2142k0145Q347k174J8913M1235l3107m0550M2619j6396K3237M4448
$$ plain form
22202 -14951 35931 120051 77978 3492 -29362 -39160 -71317 -83494 -30020 -54922 -30445 -11489
22190 -11489 -4024 639 -10275 -62527 -49584 -60865 -49595 -104255 -89385 -103840 -71902 -73479
22178 -73479 -80400 -63353 -26132 -60117 -92945 -71718 -72306 -115890 -124350 -114876 -53959 -50359 -54774
22165 -54774 -18547 -21144 -18681 -3485 1571 -28718 -26964 -27466 -30084 -92129 -123332 -139749 -64942
22152 -64942 -57602 -94326 -77810 -20971 28135 45616 67695 30575 1057 2256 9998 -13698
22140 -13698 -14287 -16937 -20733 -10521 -40329 -45122 -9298 23968 -419 11412 -11184 -10225 -10624
22127 -10624 -8415 -32158 -37153 -74340 -45350 -61569 -51647 -95145 -64052 -81745 -117307 -66668
22115 -66668 -53439 -32549 -48079 -88517 -94638 -119572 -107702 -64039 -33149 -6228 -27677 -30691
$$ packed form
22202a4951N0882Q4120m2073p4486l2854r798l2157j2177N3474k4902K4477J8956
22190a1489P465M663j0914n2252J2943j1281J1270n4660J4870j4455L1938j577
22178g3479o921J7047L7221l3985l2828K1227n88m3584q460R474O0917L600m415
22165e4774L6227k597K463J5196N056l0289J754n02k618o2045l1203j6417P4807
22152f4942P340l6724J6516N6839M9106J7481K2079l7120k9518J199P742k3696
22140a3698n89k650l796J0212k9808m793L5824L3266k4387J1831k2596R59l99
22127a0624K209k3743m995l7187K8990j6219R922m3498L1093j7693l5562N0639
22115f6668J3229K0890j5530m0438o121k4934J1870M3663L0890K6921k1449l014
$$ plain form
22103 -30691 -13595 -11742 10366 24241 63503 72497 43123 30475 4651 -4035 2851 -68469
22091 -68469 -52917 -71191 -79993 -60652 29142 64042 20030 3881 11076 -1404 3918 2825
22079 2825 -32794 35904 42136 3298 -19735 -49082 -17136 12546 -7691 -100798 -118073 -103298
22067 -103298 -44721 30163 20848 -65017 -118052 -111146 -69230 -38574 -90472 -84795 -84442 -29389
22055 -29389 10409 4881 24737 13719 -6171 -14250 -20426 -23631 53489 40275 39754 68706 36795
22042 36795 21765 -10143 -84280 -102269 -60716 -76582 -91841 -52005 39600 48744 -29853 -109141
22030 -109141 -78407 -38081 -28418 18749 15215 25425 3696 -1010 9930 7229 13736 -2400
22018 -2400 -44507 -65652 -63593 -106640 -98994 -34953 -15361 -15386 2279 -47367 -87925 -48902 -5899
$$ packed form
22103c0691J7096J853K2108J3875L9262Q994k9374j2648k5824q686O886p1320
22091f8469J5552j8274q802J9341Q9794L4900m4012j6149P195j2480N322j093
22079B825l5619O8698O232l8838k3033k9347L1946K9682k0237r3107j7275J4775
22067a03298N8577P4884r315q5865n3035O906M1916L0656n1898N677L53N5053
22055b9389L9798n528J9856j1018j9890q079o176l205P7120j3214n21K8952l1911
22042C6795j5030l1908p4137j7989M1553j5866j5259L9836R1605R144p8597p9288
22030a09141L0734M0326R663M7167l534J0210k1729m706J0940k701O507j6136
22018b400m2107k1145K059m3047P646O4041J9592k5J7665m9646m0558L9023M3003
$$ plain form
22005 -5899 16812 78278 140842 123872 50963 35957 27145 11586 15715 49266 51546 55061 77117
21992 77117 69659 58117 55386 44613 56622 25807 24902 47479 29950 9000 6531 -15427 9765
21979 9765 31310 53246 -42897 -13075 -45320 -35602 -10696 -54708 -122144 -105133 -87867 -58390
21967 -58390 -27823 -6999 36891 88726 129463 110285 96293 77824 -1110 -56161 -61262 -50309
21955 -50309 -36431 -14367 -637 -20863 -51484 1603 -1763 11742 12183 -1985 2973 653 -41153
21942 -41153 -42572 -41449 -31588 12594 34265 30697 -30747 -48313 42456 58571 32294 -4561
21930 -4561 -42061 -39309 6998 59146 42882 6407 30829 37739 70792 38245 26751 -6377
21918 -6377 -55313 -28460 20292 -8704 -124734 -103272 -48102 -105537 -101144 -58437 -70161 -44215
$$ packed form
22005e899K2711O1466O2564j6970p2909j5006q812j5559M129L3551K280L515K2056
21992G7117p458j1542k731j0773J2009l0815r05K2577j7529k0950k469k1958K5192
21979I765K1545K1936r6143K9822l2245R718K4906m4012o7436J7011J7266K9477
21967e8390L0567K0824M3890N1835M0737j9178j3992j8469p8934n5051n101J0953
21955e0309J3878K2064J3730k0226l0621N3087l366J3505M41j4168M958k320m1806
21942d1153j419J123R861M4182K1671l568o1444j7566R0769J6115k6277l6855
21930d561l7500K752M6307N2148j6264l6475K4422O910L3053l2547j1494l3128
21918f377m8936K6853M8752k8996j16030K1462N5170n7435M393M2707j1724K5946
$$ plain form
21906 -44215 2613 9592 9510 -13114 14007 43880 -23800 -101627 -133229 -137511 -124221 -101231 -84398
21893 -84398 -134385 -157876 -95847 -92267 -95825 -71864 -56141 -82461 -67366 -46406 -85181 -105799
21881 -105799 -102940 -100230 -50493 -74121 -48564 -57728 -60763 -46167 -90517 -79845 -115717 -104876
21869 -104876 -63020 -13992 -26855 -85424 -76309 -36407 -33250 -49185 -28476 -35333 -49800 -62069
21857 -62069 -57102 18160 12413 -46904 -74798 -42179 -591 -6506 -10995 -64517 -81499 -80998 -55133
21844 -55133 -12732 -12981 -8147 -41372 -14920 19041 71848 42469 14445 -28141 -55158 -32982
21832 -32982 -24101 -12599 -12188 24274 -4714 -14990 13033 21798 -13959 -28207 -21936 -27827 -55160
21819 -55160 39256 83926 55754 9575 12598 31555 82909 78608 82895 84786 43346 4871
$$ packed form
21906d4215M6828O979q2k2624K7121K9873o7680p7827l1602m282J3290K2990J6833
21893h4398m9987k3491O2029L580l558K3961J5723k6320J5095K0960l8775k0618
21881a05799K859K710M9737k3628K5557r164l035J4596m4350J0672l5872J0841
21869a04876M1856M9028j2863n8569R115L9902L157j5935K0709o857j4467j2269
21857f2069M967P5262n747n9317k7894L2619M1588n915m489n3522j6982N01K5865
21844e5133M2401k49M834l3225K6452L3961N2807k9379k8024m2586k7017K2176
21832c2982Q881J1502M11L6462k8988j0276K8023Q765l5757j4248O271n891k7333
21819e5160R4416M4670k8172m6179L023J8957N1354m301M287J891m1440l8475
$$ plain form
21807 4871 -22277 -24956 -40889 -17777 5539 -14550 -37167 -14504 35020 43829 55851 41647
21795 41647 41507 28959 39098 -20931 -34399 -11035 -5308 27299 -35411 -48379 -26551 -25304
21783 -25304 -23250 -15662 9439 57878 103270 136990 199577 352700 492153 537595 496751 345710
21771 345710 190860 86278 21230 16478 173 -35354 -65579 -43892 -53348 -60200 -16779 -59860
21759 -59860 -80981 -22099 -16631 -105696 -111774 -32818 22991 -14195 -84526 -117683 -77549 -42262
21747 -42262 -42052 -62249 -91876 -144255 -169066 -155486 -200316 -201384 -139540 -142239 -129857 -53046
21735 -53046 -940 77138 35908 -14797 -45362 -66124 -510 -3856 -58297 -82634 -63070 11003
21723 11003 32081 -12526 -64693 -47505 -32156 -27279 -17014 6675 14855 -37334 -91075 -20851
$$ packed form
21807D871k7148k679j5933K3112K3316k0089k2617K2663M9524Q809J2022j4204
21795D1647j40j2548J0139o0029j3468K3364N727L2607o2710j2968K1828J247
21783b5304K054P588K5101M8439M5392L3720O2587J53123J39453M5442m0844j51041
21771C45710j54850j04582o5048m752j6305l5527l0225K1687r456o852M3421m3081
21759e9860k1121N8882N468q9065o078P8956N5809l7186p0331l3157M0134L5287
21747d2262K10k0197k9627n2379k4811J3580m4830j068O1844k699J2382P6811
21735e3046N2106P8078m1230n0705l0565k0762O5614l346n4441k4337J9564P4073
21723A1003K1078m4607n2167J7188J5349M877J0265K3689Q180n2189n3741P0224
$$ plain form
21711 -20851 3682 -23338 -84256 -163718 -80819 -18921 -10887 -95422 -115275 -124106 -113180 -77223
21699 -77223 -10240 9127 9424 -23868 -27656 -55965 -59017 -13949 -29861 -40686 7805 1119 -23351
21686 -23351 -47933 -61842 -26323 -84906 -70303 -71540 -105282 -131634 -75629 -33665 -768 8711
21674 8711 12321 -6162 -15105 -11304 31153 23118 7696 -35859 -55137 -58694 -84855 -33846 -12598
21661 -12598 -28373 -94752 -126811 -146361 -167499 -168387 -162963 -153124 -146896 -135520 -147131 -142818 -113523
21648 -113523 -117053 -114118 -94607 -67539 -65905 -97616 -85906 -55003 -67880 -41239 -31288 -5300
21636 -5300 -39101 -72429 -47884 12733 10522 -67474 -48708 18323 40988 16520 16894 13418 1066
21623 1066 4538 35322 72007 86972 68421 18043 -15772 -91864 -97589 -82103 -74883 -67058 -604
$$ packed form
21711b0851K4533k7020o0918p9462Q2899O1898Q034q4535j9853q831J0926L5957
21699g7223O6983J9367K97l3292l788k8309l052M5068j5912j0825M8491o686k4470
21686b3351k4582j3909L5519n8583J4603j237l3742k6352N6005M1964L2897R479
21674H711L610j8483q943L801M2457q035j5422m3555j9278l557k6161N1009K1248
21661a2598j5775o6379l2059j9550k1138q88N424R839O228J1376j1611M313K9295
21648a13523l530K935J9511K7068J634l1711J1710L0903j2877K6641R951K5988
21636e300l3801l3328K4545O0617k211p7996J8766O7031K2665k4468L74l476j2352
21623A066L472L0784L6685J4965j8551n0378l3815p6092n725J5486P220P825O6454
$$ plain form
21610 -604 84031 54485 -15323 -72859 -31134 -23644 -43277 14644 24928 5009 -2397 23977
21598 23977 -1259 -46397 -92604 -145757 -200297 -186998 -165972 -60070 22966 59644 -11619
21587 -11619 -26926 14339 18804 -32610 -81226 -68012 -54710 -38305 -60735 -54082 6007 44743
21575 44743 49376 46386 1295 -29601 -13451 -2180 -40954 -76842 -116846 -50588 -40839 -47755
21563 -47755 -9108 10136 -12080 -63777 -51455 -49355 -36716 -58815 -45797 -496 -52368 -97902
21551 -97902 -114369 -68007 -30342 674 13358 -13212 -61573 -62901 -67079 -47218 -6919 -20357
21539 -20357 10005 99402 69061 13663 26497 34844 30357 36317 32677 96929 126347 52778
21527 52778 -13933 -26827 -43636 -55383 -80927 -93705 -74283 -71258 -91920 -23920 15763 -7959
$$ packed form
21610f04Q4635k9546o9808n7536M1725P490j9633N7921J0284j9919p406K6374
21598B3977k5236m5138m6207n3153n4540J3299K1026J05902Q3036L6678p1263
21587a1619j5307M1265M465n1414m8616J3214J3302J6405k2430O653O0089L8736
21575D4743M633k990m5091l0896J6150J1271l8774l5888m0004O6258R749o916
21563d7755L8647J9244k2216n1697J2322K100J2639k2099J3018M5301n1872m5534
21551i7902j6467M6362L7665L1016J2684k6570m8361j328m178J9861M0299j3438
21539b0357L0362Q9397l0341n5398J2834Q347m487N960l640O4252K9418p3569
21527E2778o6711j2894j6809j1747k5544j2778J9422L025k0662O8000L9683k3722
$$ plain form
21515 -7959 -35770 -74345 -67502 -27831 34666 59564 -132 -46360 -22976 -21453 -81041 -137267
21503 -137267 -162511 -148968 -107381 -71234 -51716 -35676 -5052 10001 -35455 -92677 -93245 -56514
21491 -56514 -34585 -63598 -60931 -40513 -75677 -75901 -55396 -36759 -25246 31270 87343 119908
21479 119908 43288 -2582 3920 -35860 -67065 -30969 1684 -10781 21818 37490 35451 26973
21467 26973 -9044 -38807 -67153 -53604 -63672 -64046 -32984 -33699 -34673 -54527 -80348 -37132 -32912
21454 -32912 12884 47973 37479 -4192 -69333 -49245 -59014 -82454 -75102 -108402 -31360 37922
21442 37922 19988 -30342 -13361 9435 -3866 -36819 -28968 9435 5715 -33813 -27231 -21325
21430 -21325 -42601 -69836 -77627 -71572 -53171 -78091 -76834 -67388 -80728 -56336 -36904 -44677 -79955
$$ packed form
21515g959k7811l8575O843L9671O2497K4898n9696m6228K3384J523n9588n6226
21503a37267k5244J3543M1587L6147J9518J6040L0624J5053m5456n7222n68L6731
21491e6514K1929k9013K667K0418l5164k24K0505J8637J1513N6516N6073L2565
21479A19908p6620m5870O502l9780l1205L6096L2653j2465L2599J5672k039q478
21467B6973l6017k9763k8346J3549j0068l74L1062p15r74j9854k5821M3216M220
21454c2912M5796L5089j0494m1671o5141K0088r769k3440P352l3300P7042O9282
21442C7922j7934n0330J6981K2796j3301l2953P851L8403l720l9528O582N906
21430b1325k1276k7235p791O055J8401k4920J257R446j3340K4392J9432p773l5278
$$ plain form
21417 -79955 -66130 -25860 -17015 -17706 -37192 -24267 -59956 -49948 -22171 -33928 -75641 -49013
21405 -49013 -12791 -31633 -43637 -49738 -87204 -74035 -79331 -78505 -86262 -102853 -71097 -29038 -29112
21392 -29112 -75368 -85711 -40527 -50213 -54861 -25253 -67288 -93285 -86757 -85330 -90180 -65600 -105173
21379 -105173 -95304 -77318 -16779 -3323 -48466 -94575 -61337 -32964 -28455 -30293 -66189 -146361
21367 -146361 -116546 -94355 -122121 -125890 -166904 -99628 -55244 -65951 -34504 -34902 -8501 -12675
21355 -12675 -29172 -22602 -33255 -62933 -78817 -76297 -73385 -51782 -51919 -40950 -12083 4853 -3181
21342 -3181 -40539 -58232 -77501 -2833 21876 5323 44752 51802 14400 -24099 -48752 -64404
21330 -64404 -20569 17630 12612 7445 12687 -24396 -60166 -12157 5037 24814 2032 -34470
$$ packed form
21417g9955J3825M0270Q845o91j9486J2925l5689J0008K7777j1757m1713K6628
21405d9013L6222j8842j2004o101l7466J3169n296Q26p757j6591L1756M2059p4
21392b9112m6256j0343M5184r686m648K9608m2035k5997O528J427m850K4580l9573
21379a05173R869J7986O0539J3456m5143m6109L3238K8373M509j838l5896q0172
21367a46361K9815K2191k7766l769m1014O7276M4384j0707L1447l98K6401m174
21355a2675j6497O570j0653k9678j5884K520K912K1603j37J0969K8867J6936q034
21342c181l7358j7693j9269P4668K4709j6553L9429P050l7402l8499k4653j5652
21330f4404M3835L8199n018n167N242l7083l5770M8009J7194J9777k2782l6502
$$ plain form
21318 -34470 -37490 -60952 -33873 -35626 -29992 -61960 -79456 -64834 -32651 -41154 -51478 -31026
21306 -31026 -4463 3391 23623 -28700 -55476 -56456 -68737 -64214 -79459 -81608 -32634 -18852 -64729
21293 -64729 -115375 -89279 -70023 -95542 -54559 -37294 -71683 -120046 -113047 -116578 -107305 -132825
21281 -132825 -96290 -37668 -94371 -103746 -90237 -54486 503 2813 -57633 -60034 5094 -60142
21269 -60142 -101886 -89249 -79113 -62709 -64632 -72706 -3235 -37322 -54940 43391 68949 10883
21257 10883 -3662 18989 17841 -10256 -32996 -11900 33290 82493 59285 82293 111188 64251
21245 64251 24830 15540 44236 82128 65701 36308 28885 4355 -21188 1733 54932 63710
21233 63710 -3883 -629 5466 -18225 -64824 -87739 -103054 -73796 -104756 -112455 -42630 16560
$$ packed form
21318c4470l020k3462K7079j753N634l1968j7496J4622L2183q503j0324K0452
21306c1026K6563P854K0232n2323k6776r80j2281M523j5245k149M8974J3782m5877
21293f4729n0646K6096J9256k5519M0983J7265l4389m8363O999l531R273k5520
21281a32825L6535N8622n6703r375J3509L5751N4989K310o0446k401O5128o5236
21269f0142m1744J2637J0136J6404j923q074O9471l4087j7618R8331K5558n8066
21257A0883j4545K2651j148k8097k2740K1096M5190M9203k3208K3008K8895m6937
21245F4251l9421r290K8696L7892j6427k9393p423k4530k5543K2921N3199Q778
21233F3710o7593L254O095k3691m6599k2915j5315K9258l0960p699O9825N9190
$$ plain form
21221 16560 -68958 -100381 -87788 -50318 -21634 -48037 -46121 2213 -55061 -53631 -11014 19382
21209 19382 38254 31070 9110 -29926 -91300 -101523 -102901 -24257 22064 -37249 -54445 -57461
21197 -57461 -58769 -46030 -66434 -108109 -117597 -125673 -153810 -130281 -64141 -84567 -59018 -72303
21185 -72303 -113040 -97638 -35653 -6489 -13830 -8751 -79100 -86777 -64690 -72979 -108281 -117704 -93083
21172 -93083 -126982 -136486 -139634 -138780 -90046 -82638 -54118 -32135 -13209 -44985 -7564 -1690 -972
21159 -972 -33061 -42522 -30574 24398 51832 83569 62897 61876 84230 63307 18769 40171
21147 40171 14794 -18534 -13723 -2160 -33074 -126774 -129408 -114809 -83550 -20612 -5478 -19864
21135 -19864 -5124 -2507 -24128 -53478 -95512 -102449 -88601 -102388 -109258 -114036 -110401 -68075 -7957
$$ packed form
21221A6560q5518l1423J2593L7470K8684k6403J916M8334n7274J430M2617L0396
21209A9382J8872p184k1960l9036o1374j0223j378P8644M6321n9313j7196l016
21197e7461j308J2739k0404m1675r488q076k8137K3529O6140k0426K5549j3285
21185g2303m0737J5402O1985K9164p341N079p0349p677K2087q289l5302r423K4621
21172i3083l3899r504l148Q54M8734P408K8520K1983J8926l1776L7421N874P18
21159i72l2089r461J1948N4972K7434L1737k0672j021K2354k0923m4538K1402
21147D0171k5377l3328M811J1563l0914r3700k634J4599L1259O2938J5134j4386
21135a9864J4740K617k1621k9350m2034o937J3848j3787o870m778L635M2326O0118
$$ plain form
21122 -7957 8807 68245 85156 69897 39912 7073 24811 32451 37187 2747 18894 22175
21110 22175 43557 117193 212279 236367 281129 343437 275079 184756 103592 20241 29932 23712
21098 23712 17806 4670 -46841 -69500 -37207 -13430 -31768 -99826 -139289 -55609 -59513 -55079
21086 -55079 -73038 -79909 -81099 -90469 -60694 -35520 -19348 -9285 -23983 -62952 -57433 -96547
21074 -96547 -145417 -135766 -105949 -78485 -85050 -119405 -118258 -86420 -96601 -117276 -138708 -120975
21062 -120975 -84447 -102801 -111364 -68472 -26601 -542 -28900 -31250 -14544 -30698 -24775 -5705
21050 -5705 14177 9848 -20000 -25469 -101251 -108134 -83277 -61695 -123356 -107256 -89636 -141567
21038 -141567 -86591 -10929 -11001 -44839 -50217 -40607 -57931 -88506 -145570 -89756 8648 26810
$$ packed form
21122g957J6764N9438J6911j5259k9985l2839J7738P640M736l4440J6147L281
21110B2175K1382P3636R5086K4088M4762O2308o8358r0323q1164q3351R691o220
21098B3712n906j3136n1511k2659L2293K3777j8338o8058l9463Q3680l904M434
21086e5079j7959o871j190r370K9775K5174J6172J0063j4698l8969N519l9114
21074i6547m8870R651K9817K7464o565l4355J147L1838j0181k0675k1432J7733
21062a20975L6528j8354q563M2892M1871K6059k8358k350J6706j6154N923J9070
21050e705J9882m329k9848n469p5782o883K4857K1582o1661J6100J7620n1931
21038a41567N4976P5662p2l3838n378R610j7324l0575n7064N5814R8404J8162
$$ plain form
21026 26810 26137 57261 23294 8448 -38026 -92903 -29201 28016 2244 -62128 -67268 -57469
21014 -57469 -98661 -93533 -23036 -38395 -66915 -72622 -108992 -116708 -54615 -11526 -52998 -158474
21002 -158474 -173253 -156796 -148429 -138290 -108654 -125583 -123097 -126297 -106475 -66151 -36907 -73174
20990 -73174 -133042 -162968 -108262 -76505 -76098 -68529 -34621 -29101 -16560 28958 43843 15787
20978 15787 -7715 3955 -6505 -10460 -39594 -62119 -44409 13950 13907 18171 6850 29607 -27538
20965 -27538 -48970 -39302 -30116 -67002 -69177 2941 39813 9465 29790 35316 26336 4513 -57551
20952 -57551 -122741 -110328 -79884 -70534 -72105 -50114 -39742 -57372 -80275 -103775 -45596 -41399
20940 -41399 -38737 -46608 -66500 -99944 -76061 -22853 -51908 -123752 -129426 -121742 -85134 -58204
$$ packed form
21026B6810o73L1124l3967j4846m6474n4877O3702N7217k5772o4372n140R799
21014e7469m1192N128P0497j5359k8520n707l6370p716O2093M3089m1472j05476
21002a58474j4779J6457Q367J0139K9636j6929K486l200J9822M0324K9244l6267
20990g3174n9868k9926N4706L1757M07P569L3908N520J2541M5518J4885k8056
20978A5787k3502J1670j0460l955k9134k2525J7710N8359m3M264j1321K2757n7145
20965b7538k1432R668R186l6886k175P2118L6872l0348K0325N526q980k1823o2064
20952e7551o5190J2413L0444R350j571K1991J0372j7630k2903k3500N8179M197
20940d1399K662p871j9892l3444K3883N3208k9055p1844n674P684L6608K6930
$$ plain form
20928 -58204 -52039 -58501 -64486 -97204 -74786 -49697 -66863 -114275 -141858 -125918 -84530 -63137
20916 -63137 -65705 -95394 -82310 -60526 -75655 -62862 -70397 -90451 -80324 1164 4219 -7891
20904 -7891 -18062 -15317 -61397 -74990 -20337 -5464 -21191 -9172 -24643 -16911 -11553 14665
20892 14665 -10926 -37699 -31646 -35005 -71779 -92381 -88548 -55612 1130 -18793 -75220 -62586
20880 -62586 -54851 -63009 -40594 6658 17769 24352 31596 39351 -2947 6336 32669 19143 -2137
20867 -2137 -21641 -58304 -87583 -32689 -4466 1354 -16249 -76873 -66667 -29210 -57590 -61001
20855 -61001 27396 46584 57241 18901 -32552 -41835 -58873 -19086 -41202 -85416 -96946 -99737
20843 -99737 -35099 -11781 -43887 -81018 -75572 -56888 -50005 -54412 -70514 -66414 -41407 -34722 -36909
$$ packed form
20928e8204O165o462n985l2718K2418K5089j7166m7412k7583J5940M1388K1393
20916f3137k568k9689J3084K1784j5129J2793p535k0054J0127Q1488L055j2110
20904g891j0171K745m6080j3593N4653J4873j5727J2019j5471P732N358K6218
20892A4665k5591k6773O053l359l6774k0602L833L2936N6742j9923n6427J2634
20880f2586P735q158K2415M7252J1111O583P244P755m2298R283K6333j3526k1280
20867b137j9504l6663k9279N4894K8223N820j7603o0624J0206L7457k8380l411
20855f1001Q8397J9188J0657l8340n1453r283j7038L9787k2116m4214j1530k791
20843i9737O4638K3318l2106l7131N446J8684O883m407j6102M100K5007O685k187
$$ plain form
20830 -36909 7982 14912 10993 -27619 -38001 -60155 -57029 -96638 -60923 -19468 -45027 -57262
20818 -57262 -122296 -161872 -152867 -110893 -89561 -97441 -75998 -59376 -43473 -3853 8050 10352
20806 10352 28821 -11774 -16975 -14989 -37204 -74105 -72129 -37111 -31689 -42190 -25220 -22999 -45518
20793 -45518 -41085 -45217 -40076 -81912 -77582 -53992 -38617 -51862 -55829 -93742 -164464 -167419 -99022
20780 -99022 -50764 -16009 4934 -3869 -50548 -88483 -73853 -26540 26960 36569 51058 -5430
20768 -5430 -55477 -10817 18266 38330 37827 1370 -20304 3974 2296 6220 -9431 -65676 -138806
20755 -138806 -106964 -31021 -32936 -106863 -39183 -7773 14000 -2337 -46746 -15775 -9640 21941
20743 21941 3809 -7111 47302 3345 -14163 -9225 -109418 -163824 -159715 -180056 -222145 -162924
$$ packed form
20830c6909M4891O930l919l8612j0382k2154L126l9609L5715M1455k5559j2235
20818e7262o5034l9576R005M1974K1332p880K1443J6622J5903L9620J1903K302
20806A0352J8469m0595n201J986k2215l6901J976L5018N422j0501J6970K221k2519
20793d5518M433m132N141m1836M330K3590J5375j3245l967l7913p0722k955O8397
20780i9022M8258L4755K0943q803m6679l7935J4630M7313N3500R609J4489n6488
20768e430n0047M4660K9083K0064n03l6457k1674K4278j678L924j5651n6245p3130
20755a38806L1842P5943j915p3927O7680L1410K1773j6337m4409L0971O135L1581
20743B1941j8132j0920N4413m3957j7508M938j00193n4406M109k0341m2089N9221
$$ plain form
20731 -162924 -117014 -124259 -71432 -57022 -55916 -88774 -50690 -16434 -40369 -35637 -19072 -51458
20719 -51458 -45149 -11553 -56140 -50098 -67104 -46359 -44306 -98059 -113268 -25797 -3459 -1149
20707 -1149 -45024 -780 27527 -30378 -50021 -4606 7973 -6379 -49324 -41914 -33321 -117432
20695 -117432 -119329 -80540 -43856 -16987 -7109 26415 93412 82933 28740 27807 16683 -33559
20683 -33559 -19181 26585 99247 100016 43011 -1993 -71294 -41955 -47034 -105886 -108763 -51487
20671 -51487 -59991 -64500 -61269 -23726 -2269 -4808 -35919 -6058 8742 -21694 -14148 -12038 -10631
20658 -10631 -15211 -53617 -75715 -34148 852 -17443 18274 -14785 -13798 21084 31722 16076
20646 16076 -63153 -43306 -15293 -6524 -31268 -95577 -114347 -94924 -44949 -11624 22255 6845
$$ packed form
20731a62924M5910p245N2827J4410J106l2858L8084L4256k3935M732J6565l2386
20719e1458O309L3596m4587O042j7006K0745K053n3753j5209Q7471K2338K310
20707a149m3875M4244K8307n7905j9643M5415J2579j4352m2945P410Q593q4111
20695a17432j897L8789L6684K6869R878L3524O6997j0479n4193r33j1124n0242
20683c3559J4378M5766P2662P69n7005m5004o9301K9339n079n8852k877N7276
20671e1487q504m509L231L7543K1457k539l1111K9861J4800l0436P546K110J407
20658a0631m580l8406k2098M1567L5000j8295L5717l3059R87L4882J0638j5646
20646A6076p9229J9847K8013Q769k4744o4309j8770J9423M9975L3325L3879j5410
$$ plain form
20634 6845 -67138 -133503 -139242 -101763 -41187 -52475 -91543 -63135 -94213 -62210 -21828 -34967
20622 -34967 15877 50120 14112 -10588 -28326 56952 138219 151148 149704 95502 36718 25497
20610 25497 28344 33456 8368 -2772 23987 24953 -10407 -9734 13167 35644 -15493 -18228 -19898
20597 -19898 9272 -19851 -50994 -69355 -106351 -90846 -102093 -104156 -81109 -64495 -98676 -78749
20585 -78749 -42483 2109 -18775 -28576 -31164 -16493 -22477 -4709 -5448 36675 67753 109280 90585
20572 90585 17184 -44191 -92696 -99835 -93066 -82872 -74683 -57755 -65123 -71804 -50323 -43709 -33459
20559 -33459 -20994 -33192 -67552 -73665 -53640 -29395 -70258 -76063 -96455 -64145 -24023 -31114
20547 -31114 -17670 -27846 -25950 4056 16359 -22084 -15996 -22600 -36942 -66544 -74668 -73568 -69751
$$ packed form
20634F845p3983o6365n739L7479O0576j1288l9068K8408l1078L2003M0382j3139
20622c4967N0844L4243l6008k4700j7738Q5278Q1267J2929j444n4202n8784j1221
20610B5497K847N112k5088j1140K6759R66l5360O73K2901K2477n1137k735j670
20597a9898K9170k9123l1143j8361l6996J5505j1247k063K3047J6614l4181J9927
20585g8749L6266M4592k0884r801k588J4671n984J7768p39M2123L1078M1527j8695
20572I0585p3401o1375m8505p139O769J0194Q189J6928p368o681K1481O614J0250
20559c3459J2465j2198l4360o113K0025K4245m0863n805k0392L2310M0122p091
20547c1114J3444j0176J896L0006J2303l8443O088o604j4342k9602q124J100L817
$$ plain form
20534 -69751 -70699 -50131 -41559 -29618 -82353 -116707 -112429 -108578 -109868 -85279 -74061 -47138 -20117
20521 -20117 -52823 -35206 -37285 -55145 -72587 -94824 -55442 -78458 -83696 -30296 -10132 -36593
20509 -36593 -33429 -86486 -67959 -64627 -73452 -25359 -18358 -40375 -34020 15109 16909 -13103 -35430
20496 -35430 -31325 -4842 -24338 -6891 -18195 -11513 -25693 -55374 -45736 -62982 -124457 -96978
20484 -96978 -21544 -11258 -58022 -46050 -32880 -6011 15392 -23380 -29821 -25336 -57620 -92383
20472 -92383 -105474 -91026 -65329 -16837 -11546 -26683 -72508 -77328 -83323 -77844 -55182 -55968 -49807
20459 -49807 -14140 17783 17009 11942 5830 5632 -58081 -85628 -14292 59252 74924 32783 -19668
20446 -19668 -12977 49236 90428 117570 98201 72694 65351 57484 -7845 17982 50213 -32638
$$ packed form
20534f9751r48K0568Q572J1941n2735l4354M278L851j290K4589J1218K6923K7021
20521b0117l2706J7617k079j7860j7442k2237L9382k3016n238N3400K0164k6461
20509c6593L164n3057J8527L332q825M8093P001k2017O355M9129J800l0012k2327
20496c5430M105K6483j9496J7447j1304O682j4180k9681R638j7246o1475K7479
20484i6978P5434J0286m6764J1972J3170K6869K1403l8772o441M485l2284l4763
20472i2383j3091J4448K5697M8492N291j5137m5825m820n995N479K2662p86O161
20459d9807L5667L1923p74n067o112j98o3713k7547P1336P3544J5672m2141n2451
20446a9668O691O2213M1192K7142j9369k5507p343p867o5329K5827L2231q2851
$$ plain form
20434 -32638 -86613 -86782 -98129 -101233 -84879 -61788 -79494 -31732 -19350 -68088 -86367 -58665
20422 -58665 -39024 -62315 -72102 22311 37968 -18426 -35698 -65391 -12059 43018 15015 21867
20410 21867 41380 69474 38975 -11087 -10553 1975 11133 3396 -38581 -75618 -55017 -39748
20398 -39748 -9545 -66770 -53402 8849 -35228 -19837 38357 -4507 -46961 -55861 -55315 -44999
20386 -44999 -40347 -22226 11267 27438 -3545 14554 40727 48364 64466 13648 -29626 -37297
20374 -37297 -59750 -59225 -69410 -30454 -11627 3162 -26874 -81130 -113214 -54909 -54032 -95957
20362 -95957 -109951 -127532 -142235 -93927 -70237 -67143 -28101 7890 44833 -4522 20316 -27468
20350 -27468 -56388 -77359 -80125 -57743 -63036 -69930 -36903 -569 -8972 -10129 -5596 -16945 -66500
$$ packed form
20434c2638n3975j69j1347l104J6354K3091j7706M7762J2382m8738j8279K7702
20422e8665J9641k3291r787R4413J5657n6394j7272k9693N3332N5077k8003O852
20410B1867J9513K8094l0499n0062N34J2528R158p737m1977l7037K0601J5269
20398c9748L0203n7225J3368O2251m4077J5391N8194m2864m2454q900N46J0316
20386d4999M652J8121L3493J6171l0983J8099K6173P637J6102n0818m3274p671
20374c7297k2453N25j0185L8956J8827J4789l0036n4256l2084N8305Q77m1925
20362i5957j3994j7581j4703M8308K3690L094L9042L5991L6943m9355K4838m7784
20350b7468k8920k0971k766K2382n293o894L3027L6334q403j157M533j1349m9555
$$ plain form
20337 -66500 -86894 -49010 -32584 -51795 -8501 -45918 -98724 -69704 4067 41202 57319 62937
20325 62937 36672 12979 -39385 -97410 -76180 -78348 -57612 -26216 -17998 -84950 -87753 -111675
20313 -111675 -69346 19906 53347 57144 71266 90359 46755 -14281 -42390 -16388 44843 75194
20301 75194 36489 -58995 -16884 -17206 7261 -78106 -150975 -90143 -60166 -38025 -41453 -91669
20289 -91669 -119480 -65744 -39857 -43646 -79302 -131493 -123690 -99774 -77934 -39218 -54498 -64922
20277 -64922 -53794 -16673 -21584 -31164 -41221 -67324 -75277 -67528 -85624 -75472 18476 47252
20265 47252 12792 -42587 -74044 -94368 -57061 -10412 1734 -47324 -72162 -92297 -151616 -143348
20253 -143348 -87153 -58328 -14944 3700 -25321 -31337 -28645 -9734 -14185 -11536 -35718 3165
$$ packed form
20337f6500k0394L7884J6426j9211M3294l7417n2806K9020P3771L7135J6117N618
20325F2937k6265k3693n2364n8025K1230k168K0736L1396Q218o6952k803k3922
20313a11675M2329Q9252L3441L797J4122J9093m3604o1036k8109K6002O1231L0351
20301G5194l8705r5484M2111l22K4467q5367p2869O0832K9977K2141l428n0216
20289i1669k7811N3736K5887l789l5656n2191P803K3916K1840L8716j5280j0424
20277f4922J1128L7121m911r580j0057k6103p953P749j8096J0152R3948K8776
20265D7252l4460n5379l1457k0324L7307M6649J2146m9058k4838k0135n9319Q268
20253a43348N6195K8825M3384J8644k9021o016K692J8911m451K649k4182L8883
$$ plain form
20241 3165 -28930 -71878 -51699 -28196 -17458 -30006 -47969 -89010 -83420 -87472 -76151 -46221
20229 -46221 -26879 -18848 -9966 -24418 -9542 24300 13971 -3557 -20254 -40001 -80523 -97366
20217 -97366 -114090 -55089 -66605 -88631 -63422 -38460 -9417 -5088 5074 41546 -14612 -77268
20205 -77268 -55984 -54624 -104107 -87615 -27870 -18376 608 24056 28438 39981 16154 35070
20193 35070 21516 12713 15083 21989 35165 33673 31946 64367 62154 23825 -13141 -46389 -37368
20180 -37368 -6145 -12402 -4666 -35646 -24962 -31739 -31265 -22254 -35382 -22331 15618 24452 -35960
20167 -35960 -58519 -43367 -25536 -8860 9651 23207 45988 -1299 -64107 -125733 -119109 -86511
20155 -86511 -67928 -20529 849 -23921 -35456 -74425 -126775 -106853 -33191 52446 62723 -9803
$$ packed form
20241C165l2095m2948K0179K3503J0738j2548j7963m1041N590m052J1321K9930
20229d6221J9342Q031Q882j4452J4876L3842j0329j7528j6697j9747m0522j6843
20217i7366j6724N9001j1516k2026K5209K4962K9043M329J0162L6472n6158o2656
20205g7268K1284J360m9483J6492N9745R494J8984K3448M382J1543k3827J8916
20193C5070j3554q803K370O906J3176j492j727L2421k213l8329l6966l3248R021
20180c7368L1223o257P736l0980J0684o777M74R011j3128J3051L7949Q834o0412
20167c5960k2559J5152J7831J6676J8511J3556K2781m7287o2808o1626O624L2598
20155h6511J8583M7399K1378k4770j1535l8969n2350J9922P3662Q5637J0277p2526
$$ plain form
20143 -9803 -19730 5790 -7405 38644 80048 57259 22570 10803 48384 40903 45061 74250
20131 74250 56124 -34447 -11355 -48813 -91002 -107091 -120232 -59629 231 -17315 -17718 -38355
20119 -38355 -64295 -107504 -103090 -48884 -35911 -7462 -551 21350 6792 -64497 -37039 -6159
20107 -6159 60124 33675 -18902 -56764 -20465 11567 -15444 -8116 -8436 9034 -57002 -118066
20095 -118066 -101126 -81114 -5365 24693 26973 29557 1161 -32647 -21740 -17872 -4995 541
20083 541 -17270 5361 32906 18804 -13755 -37707 -21645 -3283 39716 -24792 -79040 -54551
20071 -54551 -42023 -58619 -33373 26099 47185 61067 73865 53256 37026 19790 -51347 -80762
20059 -80762 -57805 -15789 381 -28410 -90979 -84343 2955 49787 61034 71220 64839 41171
$$ packed form
20143i803r927K5520j3195M6049M1404k2789l4689j1767L7581p481M158K9189
20131G4250j8126r0571K3092l7458m2189j6089j3141O0603N9860j7546m03k0637
20119c8355k5940m3209M414N4206J2973K8449O911K1901j4558p1289K7458L0880
20107f159O6283k6449n2577l7862L6299L2032k7011P328l20J7470o6036o1064
20095a18066J6940K0012P5749L0058K280K584k8396l3808J0907L868J2877N536
20083E41j7811K2631K7545j4102l2559k3952J6062J8362M2999o4508n4248K4489
20071e4551J2528j6596K5246N9472K1086J3882J2798k0609j6230j7236p1137k9415
20059h0762K2957M2016J6170k8791o2569O636Q7298M6832J1247J0186o381k3668
$$ plain form
20047 41171 -9582 -7759 53723 1827 -11541 -68867 -63323 -82469 -93796 -34116 22129 52882
20035 52882 68103 65355 26120 -7917 -25157 13349 31183 24342 16946 -29987 -22640 -16238 -47534
20022 -47534 -81226 -50262 -4548 7825 -44119 -148401 -101776 -38602 -60682 -76543 -79339 -33923
20010 -33923 29627 15687 -24824 4196 32958 51276 36794 -64920 -65640 -51473 -50044 -4268
19998 -4268 -4279 -25246 4386 38601 52130 20427 -7421 -21267 -35353 -21151 22836 52295
19986 52295 21178 10539 -12211 21952 54118 40373 610 -28402 -12167 15558 57432 69519
19974 69519 30498 -117 35893 31715 41730 82647 82334 68420 110476 117880 98697 84875
19962 84875 51444 -22646 13648 74495 62282 49314 40971 31872 57982 75020 57194 68200
$$ packed form
20047D1171n0753J823O1482n1896j3368n7326N544j9146j1327N9680N6245L0753
20035E2882J5221k748l9235l4037j7240L8506J7834o841p396m6933P347O402l1296
20022d7534l3692L0964M5714J2373n1944j04282M6625O3174k2080j5861k796M5416
20010c3923O3550j3940m0511K9020K8762J8318j4482j01714p20J4167J429M5776
19998d268j1k0967K9632L4215J3529l1703k7848j3846j4086J4202M3987K9459
19986E2295l1117j0639k2750L4163L2166j3745l9763k9012J6235K7725M1874J2087
19974F9519l9021l0615L6010m178J0015M0917l13j3914M2056P404j9183j3822
19962H4875l3431p4090L6294O0847j2213j2968q343r099K6110J7038j7826J1006
$$ plain form
19950 68200 94751 169289 216466 201428 202239 205811 186506 144867 178833 285680 336192 369731
19938 369731 461350 536774 590399 653902 761179 900910 1124410 1307341 1482171 1476837 1367217
19927 1367217 1208982 1029087 940081 891301 1016150 1238444 1442128 1553890 1465129 1226547
19917 1226547 991258 795786 617448 480795 365076 302292 250773 207815 173372 113137
19907 113137 67647 35573 52628 43438 73771 50972 -24921 -18366 24337 3454 -55576 -60286
19895 -60286 37125 59036 1170 -25175 -19774 -5093 1615 -41851 -89441 -104824 -77875 32335
19883 32335 33163 -18389 -3908 24945 -12986 -36770 3050 16309 32206 15058 61645 40779
19871 40779 43411 76621 31124 -2207 -30292 -38306 -12747 -17351 -74058 -70194 -79273 -26028 47839
$$ packed form
19950F8200K6551P4538M7177j5038Q11L572j9305m1639L3966J06847N0512L3539
19938C69731R1619P5424N3625O3503J07277J39731K23500J82931J74830n334j09620
19927A367217j58235j79895q9006m8780J24849K22294K03684J11762q8761k38582
19917A226547k35289j95472j78338j36653j15719o2784n1519m2958l4443o0235
19907A13137m5490l2074J7055r190L0333k2799p5893O555M2703k0883n9030m710
19895f0286R7411K1911n7866k6345N401J4681O708m3466m7590j5383K6949J10210
19883C2335Q28n1552J4481K8853l7931k3784L9820J3259J5897j7148M6587k0866
19871D0779K632L3210m5497l3331k8085q014K5559m604n6707L864r079N3245P3867
$$ plain form
19858 47839 63894 63655 84899 70096 32110 29594 41296 58360 131399 168642 119148 46739
19846 46739 36778 36488 67667 161447 177079 149640 44732 53150 106235 77006 45914 22447
19834 22447 43740 41405 -2502 -25378 11870 11996 35842 100064 78736 79712 57677 -57971
19822 -57971 -63462 -19623 45171 95808 145825 164475 220898 187715 92230 50603 46901 90129
19810 90129 103089 78234 109710 122452 82625 67538 71989 43124 28276 67844 70089 93149
19798 93149 64326 37341 31667 46788 43339 66607 65478 87481 134093 89851 58456 89073
19786 89073 130392 131440 104672 102107 128436 76319 42793 55524 42883 19578 28362 11208
19774 11208 -30245 -31375 -25455 -13506 39358 46320 55365 43555 24128 33381 95906 80858 40186
$$ packed form
19858D7839J6055k39K1244j4803l7986k516J1702J7064P3039L7243m9494p2409
19846D6739r961k90L1179R3780J5632k7439j04908Q418N3085k9229l1092k3467
19834B2447K1293k335m3907k2876L7248J26K3846O4222k1328R76k2035j15648
19822e7971n491M3839O4794N0637N0017J8650N6423l3183r5485m1627l702M3228
19810I0129J2960k4855L1476J2742l9827j5087M451k8865j4848L9568K245K3060
19798I3149k8823k6985n674J5121l449K3268j129K2003M6612m4242l1395L0617
19786H9073M1319J048k6768k565K6329n2117l3526J2731j2641k3305Q784j7154
19774A1208m1453j130N920J1949N2864O962R045j1810j9427R253O2525j5048m0672
$$ plain form
19761 40186 48006 84693 52740 69830 91670 82082 68930 82576 71106 79634 93394 94145 125313
19748 125313 196433 178149 115181 93231 59822 68060 100900 43256 36926 24045 76590 93302
19736 93302 115998 95527 31895 30309 163711 196936 111434 62454 58054 -5838 17410 -12458
19724 -12458 30242 84482 75602 42418 51023 59753 88706 62573 35052 -17049 12136 114883
19712 114883 64224 37554 74643 114635 127774 129284 93293 89455 97759 90228 138889 147241
19700 147241 151012 107830 81404 37256 58746 92389 52707 34346 -3097 16387 28166 2351
19688 2351 224 42848 56595 38509 87295 117938 129883 121209 124177 163639 178166 108808
19676 108808 9652 43481 62686 91120 34317 -2038 14465 26412 63541 133075 178036
$$ packed form
19761D0186P820L6687l1953J7090K1840r588j3152J3646j1470Q528J3760P51L1168
19748A25313P1120j8284o2968k1950l3409Q238L2840n7644o330j2881N2545J6712
19736I3302K2696k0471o3632j586J33402L3225q5502m8980m400o3892K3248k9868
19724a2458M2700N4240q880l3184Q605Q730K8953k6133k7521n2101K9185J02747
19712A14883n0659k6670L7089L9992J3139J510l5991l838Q304p531M8661Q352
19700A47241L771m3182k6426m4148K1490L3643l9682j8361l7443J9484J1779k5815
19688B351k127M2624J3747j8086M8786L0643J1945q674K968L9462J4527o9358
19676A08808r9156L3829J9205K8434n6803l6355J6503J1947L7129O9534M4961
$$ plain form
19665 178036 215069 265017 211862 175005 130399 102997 91925 66066 85258 120650 109853
19654 109853 106531 82737 74591 53888 87231 105290 143166 191203 179144 89734 16764 43743
19642 43743 57354 40271 54114 56474 31554 59954 110436 71578 84011 98662 89862 136726
19630 136726 150365 84527 101928 161761 218671 218766 198299 171310 112820 129889 159629 162234
19618 162234 147360 184512 181202 175394 182569 188917 205811 166994 128448 60821 102238 171063
19606 171063 116698 45607 74054 131682 180034 201505 159809 182993 221796 234283 263581
19595 263581 215403 137383 47556 22390 31081 38079 103034 190279 244898 214738 196376 216552
19583 216552 224288 199922 192607 189987 211204 279517 283352 277343 251285 274056 328745 368605
$$ packed form
19665A78036L7033M9948n3155l6857m4606k7402j1072k5859J9192L5392j0797
19654A09853l322k3794q146k0703L3343J8059L7876M8037j2059q9410p2970K6979
19642D3743J3611j7083J3843K360k4920K8400N0482l8858J2433J4651q800M6864
19630A36726J3639o5838J7401N9833N6910R5k0467k6989n8490J7069K9740K605
19618A62234j4874L7152l310n808P175O348J6894l8817l8546o7627M1417O8825
19606A71063n4365p1091K8447N7628M8352K1471m1696K3184L8803J2487K9298
19595B63581m8178p8020q9827k5166Q691O998O4955Q7245N4619l0160j8362K0176
19583B16552P736k4366p315k620K1217O8313L835o009k6058K2771N4689L9860
$$ plain form
19571 368605 342690 332635 340151 383972 404877 381071 364868 381242 413731 423825 399152 335610
19559 335610 327749 335825 336994 348835 315180 281271 288966 291166 257005 263292 196046 131651 155724
19546 155724 159667 126691 134803 155740 184510 196182 250573 261647 276160 246514 265872 234017
19534 234017 180592 168626 208748 242220 228659 212703 248019 261667 258321 296703 290737 329685
19522 329685 336638 353632 337746 316539 302134 340019 353601 391493 391788 378865 363763 360218
19510 360218 403953 484293 548494 673818 821636 862445 777159 699055 600015 505543 423642
19499 423642 335478 287093 269355 296668 390694 426564 451415 432061 392660 357197 337744
19488 337744 420141 393630 405253 436712 441909 435907 424730 444417 413419 392320 443863 448574
$$ packed form
19571C68605k5915j0055P516M3821K0905k3806j6203J6374L2489J0094k4673o3542
19559C35610p861Q076J169J1841l3655l3909P695K200l4161O287o7246o4395K4073
19546A55724L943l2976Q112K0937K8770J1672N4391J1074J4513k9646J9358l1855
19534B34017n3425j1966M0122L3472j3561j5956L5316J3648l346L8382n966L8948
19522C29685O953J6994j5886k1207j4405L7885J3582L7892K95j2923j5102l545
19510C60218M3735Q0340O4201J25324J47818M0809q5286p8104r9040r4472q1901
19499D23642q8164m8385j7738K7313R4026L5870K4851j9354l9401l5463j9453
19488C37744Q2397k6511J1623L1459N197o002j1177J9687l0998k1099N1543M711
$$ plain form
19476 448574 418991 466497 551742 542459 542151 568742 567976 526268 511524 519541 543831 520279 516205
19463 516205 496415 497353 487889 488790 465060 395859 379946 385834 443074 465480 486382 500380 501300
19450 501300 438314 403284 335758 223001 158153 110204 182977 253099 322766 376472 371356
19439 371356 392906 437986 369776 279770 168052 283971 409638 510908 554862 563543 584567
19428 584567 605696 650750 703349 708671 710285 690717 702781 713796 773656 820245 826243 765315
19416 765315 787469 805448 791231 820519 879966 929306 944862 948775 910136 915481 914212 887160
19404 887160 874870 869127 933831 1013153 1050531 1064905 1085553 1081497 1113450 1194572 1256308 1270893
19392 1270893 1338961 1381978 1410711 1431852 1434392 1433826 1536176 1637118 1700507 1730275 1759237
$$ packed form
19476D48574k9583M7506Q5245r283l08K6591p66m1708j4744Q017K4290k3552m074
19463E16205j9790R38r464R01k3730o9201j5913N888N7240K2406K0902J3998R20
19450E01300o2986l5030o7526j12757o4848m7949P2773P0122O9667N3706n116
19439C71356K1550M5080o8210r0006j11718J15919J25667J01270M3954Q681K1024
19428E84567K1129M5054N2599N322J614j9568J2064J1015N9860M6589N998o0928
19416G65315K2154J7979j4217K9288N9447M9340J5556L913l8639N345j269k7052
19404H87160j2290n743O4704P9322L7378J4374K0648m056L1953Q1122O1736J4585
19392A270893O8068M3017K8733K1141K540n66J02350J00942O3389K9768K8962
$$ plain form
19381 1759237 1714490 1752194 1842794 1887169 1961587 2046233 2094900 2199065 2410141 2663222 2910284
19370 2910284 3145293 3308828 3269036 3170184 3160794 3266645 3451210 3686900 4086227 4585306
19360 4585306 4991430 5117580 4887605 4661409 4477657 4442423 4447640 4504917 4571609 4686717
19350 4686717 4861172 5084049 5378919 5787348 6228903 6728051 7375952 8167184 8996512
19341 8996512 9937123 10833658 11614943 12355284 12820191 13114191 13680625 14639056 15964280
19332 15964280 17726681 19866649 22497373 25763093 29848051 34803389 41436008 50978028
19324 50978028 65020828 86884144 123237317 182848147 264980511 339324031 345155773
19317 345155773 280469892 215615609 173333284 152411711 151285695 172128265 220425546
$$ packed form
19381A759237m4747L7704R0600M4375P4418Q4646M8667J04165K11076K53081K47062
19370B910284K35009J63535l9792r8852r390J05851J84565K35690L99327M99079
19360D585306M06124J26150k29975k26196j83752l5234N217N7277O6692J15108
19350D686717J74455K22877K94870M08429M41555M99148O47901P91232Q29328
19341H996512R40611Q96535P81285P40341M64907K94000N66434R58431J325224
19332A5964280J762401K139968K630724L265720M084958M955338O632619R542020
19324E0978028J4042800K1863316L6353173N9610830Q2132364P4343520N831742
19317C45155773o4685881o4854283m2282325k0921573j126016K0842570M8297281
$$ plain form
19310 220425546 292975908 356565096 348728041 268901044 189916948 133274655 95253464
19303 95253464 70208677 53186894 41207611 32832825 26936757 22455256 18838579 15909421
19295 15909421 13398616 11340301 9787219 8678041 8013165 7688953 7464032 6977018 6296448
19286 6296448 5543361 4781689 4020650 3329948 2797570 2374535 2070336 1746093 1499257
19277 1499257 1337999 1234172 1138520 994298 872733 759006 664783 585939 547465 505177
19267 505177 462442 404552 400842 370938 295625 222021 205080 143706 95300 91945 85128 55690
19255 55690 43265 46307 60577 10236 8534 -26909 -36567 -105594 -160052 -122476 -173754 -196440
19243 -196440 -203922 -203850 -182952 -195189 -190063 -206237 -255050 -225214 -166395 -164008 -147996 -207681 -297576
$$ packed form
19310B20425546P2550362O3589188p837055p9826997p8984096n6642293l8021191
19303I5253464k5044787j7021783j1979283q374786n896068m481501l616677k929158
19295A5909421k510805k058315j553082j109178o64876l24212k24921m87014o80570
19286F296448p53087p61672p61039o90702n32378m23035l04199l24243k46836
19277A499257j61258j03827r5652j44222j21565j13727r4223p8844l8474m2288
19267E05177m2735n7890l710k9904p5313p3604j6941o1374m8406l355o817k9438
19255E5690j2425L042J4270n0341j702l5443r658o9027n4458L7576n1278k2686
19243a96440p482P2K0898j2237N126j6174m8813K9836N8819K387J6012n9685q9895
$$ plain form
19230 -297576 -313014 -272614 -251400 -231803 -205225 -214813 -199109 -188039 -165160 -152443 -174578 -183770
19218 -183770 -154295 -176335 -231860 -237198 -257178 -214314 -212494 -184483 -132976 -167864 -229932 -264295
19206 -264295 -259368 -267220 -304899 -315316 -326361 -347532 -331000 -305909 -329122 -316861 -266032 -170779
19194 -170779 57572 247766 347180 260656 116227 22225 -31619 24514 88713 212403 351665
19183 351665 495789 596147 479728 302363 182721 132207 66967 12483 -23994 -42796
19173 -42796 -63470 -127990 -156402 -171110 -266124 -267549 -329104 -291867 -294228 -342882 -350916 -338521
19161 -338521 -324363 -360955 -352388 -361862 -399411 -397971 -426481 -459938 -457918 -448824 -450329 -396946 -360814
19148 -360814 -343716 -323742 -311113 -308430 -306865 -311491 -293197 -296921 -291824 -334465 -385523 -420417
$$ packed form
19230b97576j5438M0400K1214J9597K6578r588J5704J1070K2879J2717k2135r192
19218a83770K9475k2040n5525n338j9980M2864J820K8011N1507l4888o2068l4363
19206b64295M927p852l7679j0417j1045k1171J6532K5091k3213J2261N0829R5253
19194a70779K28351J90194R9414q6524j44429r4002n3844N6133O4199J23690J39262
19183C51665J44124J00358j16419j77365j19642n0514o5240n4484l6477j8802
19173d2796k0674o4520k8412j4708r5014j425o1555L7237k361m8654q034J2395
19161c38521J4158l6592Q567r474l7549J440k8510l3457K020R094j505N3383L6132
19148c60814J7098J9974J2629K683J565m626J8294l724N097m2641n1058l4894
$$ plain form
19136 -420417 -416104 -375837 -392464 -364702 -350756 -337504 -352884 -298892 -316247 -295935 -352528 -393042
19124 -393042 -434913 -413366 -402944 -336757 -287108 -248536 -272687 -292612 -325114 -395101 -451375
19113 -451375 -388552 -360493 -304726 -283366 -315150 -315382 -228097 -174309 -205605 -256443 -293547 -335639
19101 -335639 -338555 -339666 -309958 -259119 -234272 -272601 -279104 -315043 -350922 -318887 -283395 -248669
19089 -248669 -248912 -327899 -378960 -362688 -325764 -239857 -209607 -237930 -254502 -276425 -253371 -276203
19077 -276203 -257941 -212335 -167939 -215736 -188799 -190400 -166240 -162158 -168924 -148411 -176944 -148855
19065 -148855 -96263 -37322 -95397 -154725 -152506 -164610 -165864 -188390 -126515 -44944 19365 -30855
19053 -30855 -136677 -196916 -251778 -235282 -202113 -153356 -163753 -204256 -236215 -293401 -304143
$$ packed form
19136d20417M313M0267j6627K7762J3946J3252j5380N3992j7355K0312n6593m0514
19124c93042m1871K1547J0422O6187M9649L8572k4151j9925l2502o9987n6274
19113d51375O2823K8059N5767K1360l1784k32Q7285N3788l1296n0838l7104m2092
19101c35639k916j111K9708N0839K4847l8329o503l5939l5879L2035L5492L4726
19089b48669k43p8987n1061J6272L6924Q5907L0250k8323j6572k1923K3054k2832
19077b76203J8262M5606M4396m7797K6937j601K4160M082o766K0513k8533K8089
19065a48855N2592N8941n8075n9328K219j2104j254k2526O1875Q1571O4309n0220
19053c0855j05822o0239n4862J6496L3169M8757j0397m0503l1959n7186j0742
$$ plain form
19042 -304143 -319254 -369497 -398216 -345816 -305800 -295038 -296016 -305384 -329850 -385195 -351043 -340584
19030 -340584 -323716 -339330 -304354 -283184 -321359 -258702 -231437 -217085 -220587 -260920 -270074 -304623
19018 -304623 -288772 -265473 -303945 -288255 -234950 -250128 -301956 -291192 -267306 -237228 -305063
19007 -305063 -286560 -235709 -246871 -280545 -327481 -296477 -326758 -381400 -365798 -319326 -264011
18996 -264011 -234539 -173156 -207647 -245526 -271852 -331360 -352231 -340892 -328905 -270801 -219949
18985 -219949 -264184 -294267 -297041 -309342 -347443 -337610 -370592 -375585 -348745 -316657 -306258 -271727
18973 -271727 -229739 -213052 -171287 -111269 -48023 -87772 -92826 -100900 -105317 -148786 -169051 -127287
18961 -127287 -107421 -117908 -143340 -208593 -224987 -239348 -234498 -241140 -205526 -203776 -191980 -246396
$$ packed form
19042c04143j5111n0243k8719N2400M0016J0762r78r368k4466n5345L4152J0459
19030c40584J6868j5614L4976K1170l8175O2657K7265J4352l502m0333r154l4549
19018c04623J5851K3299l8472J5690N3305j5178n1828J0764K3886L0078o7835
19007c05063J8503N0851j1162l3674m6936L1004l0281n4642J5602M6472N5315
18996b64011K9472O1383l4491l7879k6326n9508k0871J1339J1987N8104N0852
18985b19949m4235l0083k774j2301l8101R833l2982m993K6840L2088J0399L4531
18973b71727M1988J6687M1765O0018O3246l9749n054q074m417m3469k0265M1764
18961a27287J9866j0487k5432o5253j6394j4361M850o642L5614J750J1796n4416
$$ plain form
18949 -246396 -256747 -300359 -341574 -322394 -355180 -376220 -356369 -388424 -449469 -506666 -597859
18938 -597859 -737844 -758512 -688357 -598716 -496274 -472531 -460083 -445910 -499885 -650156 -788779
18927 -788779 -770114 -635134 -477421 -390445 -362992 -284498 -205716 -200283 -244644 -246463 -206060
18916 -206060 -176544 -239090 -269710 -260641 -240929 -161446 -146040 -105161 -168389 -155487 -117950 -137407
18904 -137407 -164632 -189884 -215662 -160196 -135979 -85831 -92105 -154589 -226918 -213648 -155235 -150387
18892 -150387 -87419 -84242 -95707 -133492 -165402 -145269 -100306 -46884 -53646 -66474 -54794 -10587
18880 -10587 71976 98252 92750 135861 177287 164482 136284 114640 119713 130025 125351 123104
18868 123104 152494 163342 180835 230596 343406 389010 349880 408951 531415 554568 527983
$$ packed form
18949b46396j0351m3612m1215J9180l2786k1040J9851l2055o1045n7197r1193
18938e97859j39985k0668P0155Q9641J02442K3743J2448J4173n3975j50271j38623
18927g88779J8665J34980J57713Q6976K7453P8494P8782N433m4361j819M0403
18916b06060K9516o2546l0620R069J9712P9483J5406M0879o3228J2902L7537j9457
18904a37407k7225k5252k5778N5466K4217N0148o274o2484p2329J3270N8413M848
18892a50387O2968L177j1465l7785l1910K0133M4963N3422o762j2828J1680M4207
18880a0587Q2563K6276n502M3111M1426j2805k8198k1644N073J0312m674k247
18868A23104K9390J0848J7493M9761J12810M5604l9130N9071J22464K3153k6585
$$ plain form
18857 527983 625698 689286 734716 838661 902627 971212 1063740 1142508 1292073 1436291 1534774
18846 1534774 1675981 1805371 1939459 2187030 2487796 2772182 3138559 3629828 4127366
18837 4127366 4481507 4701082 4825782 4988490 5227350 5675028 6376036 7205221 8232264
18828 8232264 9448946 10760377 12092743 13409540 14523365 15882010 17987352 21107171
18820 21107171 25508282 31413493 39344480 50774906 68290144 95979041 141499234
18813 141499234 213088167 301739707 361795955 334900727 261523971 201872326 165105418
18806 165105418 149515133 154158509 182850510 240158111 313482578 357588814 317891408
18799 317891408 235317706 167479717 120578463 89869823 69794925 55971159 45445294
$$ packed form
18857E27983R7715O3588M5430J03945O3966O8585R2528P8768J49565J44218R8483
18846A534774J41207J29390J34088K47571L00766K84386L66377M91269M97538
18837D127366L54141K19575J24700J62708K38860M47678P01008Q29185J027043
18828H232264J216682J311431J332366J316797J113825J358645K105342L119819
18820B1107171M401111N905211P930987J1430426J7515238K7688897M5520193
18813A41499234P1588933Q8651540O0056248k6895228p3376756n9651645l6766908
18806A65105418j5590285M643376K8692001N7307601P3324467M4106236l9697406
18799C17891408q2573702o7837989m6901254l0708640k0074898j3823766j0525865
$$ plain form
18792 45445294 37007275 30387479 25408358 21641019 18899258 17082667 16003532 15209022
18784 15209022 13937657 12300666 10801180 9634238 8766576 8072043 7548325 7193262 6925216
18775 6925216 6684766 6355971 5874687 5347021 4864706 4411876 4131256 3844762 3579130
18766 3579130 3289247 3061658 2981550 2856443 2687695 2518736 2363427 2277427 2199982 2166921
18756 2166921 2114573 2012946 1951787 1901073 1840703 1741988 1701246 1592023 1534659 1528849 1458805
18745 1458805 1449369 1433296 1372547 1246220 1145399 1139042 1112871 1061741 1004986 986511 948366
18734 948366 926981 908490 903751 909344 844449 798342 792779 792416 744656 762435 787166 832261
18722 832261 782721 674179 629519 642500 645206 655528 687675 704293 716651 741099 722905
$$ packed form
18792D5445294q438019o619796m979121l767339k741761j816591j079135p94510
18784A5209022j271365j636991j499486j166942q67662o94533n23718l55063k68046
18775F925216k40450l28795m81284n27666m82315m52830k80620k86494k65632
18766C579130k89883k27589q0108j25107j68748j68959j55309q6000p7445l3061
18756B166921n2348j01627o1159n0714o0370r8715m0742j09223n7364n810p0044
18745A458805r436j6073o0749j26327j00821o357k6171n1130n6755j8475l8145
18734I48366k1385j8491m739N593o4895m6107n563l63m7760J7779K4731M5095
18722H32261m9540j08542m4660J2981K706J0322L2147J6618J2358K4448j8194
$$ plain form
18711 722905 768266 770123 766522 821451 820193 853490 963834 1126814 1297168 1533259 1824130
18700 1824130 2084098 2157887 2067417 1846414 1616745 1485133 1440578 1447152 1542854 1660695
18690 1660695 1813711 1814490 1680088 1555948 1578313 1665487 1641614 1421616 1112139 937338
18680 937338 911783 884990 845365 905367 1066473 1247314 1350529 1225499 1016710 893305
18670 893305 810931 729853 716524 680036 605363 550001 546247 477481 414021 353594 320351 278553
18658 278553 310758 281079 234365 241868 220582 216691 213028 184454 138179 149078 170175 180282
18646 180282 203786 210216 139179 167416 167823 148000 202206 223126 166661 174138 181660 249193
18634 249193 267573 237200 194524 173156 219813 229298 129692 102478 106846 144885 190193 191639
$$ packed form
18711G22905M5361J857l601N4929j258L3297J10344J62980J70354K36091K90871
18700A824130K59968P3789r0470k21003k29669j31612m4555O574R5702J17841
18690A660695J53016P79j34402j24140K2365Q7174k3873k19998l09477j74801
18680I37338k5555k6793l9625O0002J61106J80841J03215j25030k08789j23405
18670H93305q2374q1078j3329l6488p4673n5362l754o8766o3460o0427l3243m1798
18658B78553L2205k9679m6714P503k1286l891l663k8574m6275J0899K1097J0107
18646A80282K3504O430p1037K8237M07j9823N4206K0920n6465P477P522O7533
18634B49193J8380l0373m2676k1368M6657R485r9606k7214M368L8039M5308J446
$$ plain form
18622 191639 154656 177860 195080 155814 98895 57550 27545 39317 75485 113715 93797
18611 93797 111759 100470 98116 71634 57210 92569 112425 115366 63853 74765 82393 121894
18599 121894 137492 118443 96236 87084 74705 73120 91433 71117 59821 79089 74841 74583
18587 74583 77938 65514 18164 14168 -2143 20737 115766 150843 154972 146036 195509 185140
18575 185140 142016 148508 193305 133405 63536 23079 -44934 -14235 44716 37247 70352 95979
18563 95979 79807 65540 76341 77241 122528 175355 155697 174334 145487 65465 35155 77542
18551 77542 30428 28571 -8979 -31679 -35466 -58214 5151 36925 -11747 12245 689 -30648
18539 -30648 7324 42845 59469 15462 -12829 -93700 -147471 -131985 -100173 -77614 -53087 -48331
$$ packed form
18622A91639l6983K3204J7220l9266n6919m1345l0005J1772L6168L8230j9918
18611I3797J7962j1289k354k6482j4424L5359J9856K941n1513J0912P628L9501
18599A21894J5598j9049k2207r152j2379j585J8313k0316j1296J9268m248k58
18587G4583L355j2424m7350l996j6311K2880R5029L5077M129q936M9473j0369
18575A85140m3124O492M4797n9900o9869m0457o8013L0699N8951p469L3105K5627
18563I5979j6172j4267J0801R00M5287N2827j9658J8637k8847q0022l0310M2387
18551G7542m7114j857l7550k2700l787k2748O3365L1774m8672K3992j1556l1337
18539c0648L7972L5521J6624m4007k8291q0871n3771J5486L1812K2559K4527M756
$$ plain form
18527 -48331 -60577 -36571 -3517 -48680 -104329 -128408 -122253 -11782 15774 -23495 -14266 9605
18515 9605 49148 1534 -8036 22376 33476 -16898 -53568 -92365 -99320 -39547 973 93162
18503 93162 114481 77745 62549 82442 95830 77227 47657 1641 -811 -12642 9126 463
18491 463 -68370 -83678 -37271 4197 -2365 -11416 -17275 -21543 33323 57270 52111 12887 -23797
18478 -23797 -27179 -49598 -19297 -56322 -89921 -74229 -55985 -56901 -90666 -86400 -56390 -90990
18466 -90990 -141900 -167879 -152612 -121226 -122749 -73225 -24503 69281 46671 82077 76068 42861
18454 42861 -25404 -58910 -12803 8453 6333 -9112 -20630 -45638 -101620 -146417 -99332 -4287
18442 -4287 39998 9480 -42647 -54524 -84733 -89948 -98751 -97021 -58135 4180 2427 -10584 7582
$$ packed form
18527d8331j2246K4006L3054m5163n5649k4079O155J10471K7556l9269R229K3871
18515I605L9543m7614r570L0412J1100n0374l6670l8797o955N9773M0520R2189
18503I3162K1319l6736j5196J9893J3388j8603k9570m6016k452j1831K1768q663
18491D63o8833j5308M6407M1468o562r051n859m268N4866K3947n159l9224l6684
18478b3797l382k2419L0301l7025l3599J5692J8244r16l3765M266L0010l4600
18466i0990n0910k5979J5267L1386j523M9524M8722R3784k2610L5406o009l3207
18454D2861o8265l3506M6107K1256k120j5445j1518k5008n5982m4797M7085R5045
18442d287M4285l0518n2127j1877l0209n215q803J730L8886O2315j753j3011J8166
$$ plain form
18429 7582 30124 44328 33129 -14829 -60048 -51195 -11925 -49346 -53337 -15234 -28629 -70416
18417 -70416 -59188 -67267 -26634 -20208 33769 64829 -6946 -41144 -37124 -64477 -135454 -133535
18405 -133535 -68892 -66674 -101904 -136698 -115495 -43133 -86266 -133548 -137497 -154496 -167946 -176287
18393 -176287 -106518 -28024 21778 -27999 -97915 -81571 -34868 -5209 -8804 -73946 -85259 -30263
18381 -30263 -23537 -65357 -98854 -109111 -53720 -22700 -38366 -109603 -158595 -125700 -120530 -156541
18369 -156541 -149316 -83672 -62205 -76471 -49020 -52457 -72667 -82702 -54717 -55185 -47391 -52806 -34840
18356 -34840 -36411 -73867 -59942 -53361 -99570 -96889 -90803 -81213 -87713 -72929 -60307 -80216 -90433
18343 -90433 -96380 -88970 -69260 -112988 -104233 -98488 -89797 -138445 -136991 -107108 -60063 -42508 -27451
$$ packed form
18429G582K2542J4204j1199m7958m5219Q853L9270l7421l991L8103j3395m1787
18417g0416J1228q079M0633O426N3977L1060p1775l4198M020k7353p0977J919
18405a33535O4643K218l5230l4794K1203P2362m3133m7282l949j6999j3450q341
18393a76287O9769P8494M9802m9777o9916J6344M6703K9659l595o5142j1313N4996
18381c0263O726m1820l3497j0257N5391L1020j5666p1237m8992L2895N170l6011
18369a56541P225O5644K1467j4266K7451l437k0210j0035K7985m68P794n415J7966
18356c4840j571l7456J3925O581m6209K681O086R590o500J4784J2622j9909j0217
18343i0433n947P410J9710m3728Q755N745Q691m8648J454K9883M7045J7555J5057
$$ plain form
18330 -27451 -5392 -77536 -100122 -116573 -147933 -145656 -154310 -146404 -116165 -65378 -104099 -89928
18318 -89928 -109596 -140212 -129505 -122761 -103349 -107417 -83289 -81401 -76785 -51312 -114000 -126346
18306 -126346 -101892 -5139 45457 58495 54979 41408 10355 -71182 -84574 -68162 -35050 -2720
18294 -2720 -8980 -37787 -105206 -163500 -154849 -204770 -213328 -213420 -202051 -239772 -131682 -15081 -37008
18281 -37008 -137322 -142345 -99775 -44723 -43625 -97610 -111165 -74482 -66266 -98590 -102254 -125956
18269 -125956 -147734 -134025 -118555 -131472 -118695 -106490 -40855 -53669 -93693 -137003 -141190 -74940
18257 -74940 -69530 -27194 24866 38756 121802 238385 386368 564661 833285 1140187 1360126
18246 1360126 1395129 1218645 1054012 899323 857237 829409 917834 1138680 1355174 1503091
$$ packed form
18330b7451K2059p2144k2586j6451l1360K277q654P906L0239N0787l8721J4171
18318h9928j9668l0616J0707O744J9412m068K4128J888M616K5473o2688j2346
18306a26346K4454R6753N0596J3038l516j3571l1053q1537j3392J6412L3112L2330
18294b720o260k8807o7419n8294Q651m9921q558r2J1369l7721J08090J16601k1927
18281c7008j00314n023M2570N5052J098n3985j3555L6683Q216l2324l664k3702
18269a25956k1778J3709J5470j2917J2777J2205O5635j2814m0024m3310m187O6250
18257g4940N410M2336N2060J3890Q3046J16583J47983J78293K68624L06902K19939
18246A360126L5003j76484j64633j54689m2086k7828Q8425K20846K16494J47917
$$ plain form
18236 1503091 1475784 1239011 922372 654312 519155 399168 214751 150535 124070 64753
18226 64753 25919 24368 2526 19249 -11105 627 9948 5498 -15958 -23830 -9226 1764
18214 1764 -66296 -40165 -2875 -4184 17474 9401 3997 -27628 -28573 -36951 -11054 3794 -3078
18201 -3078 -4641 -27757 -85638 -69070 -65750 -67733 -82644 -116142 -95379 -99183 -110156 -65927 -50155
18188 -50155 19464 1948 -31347 -44528 -77319 -112924 -136718 -132104 -136775 -113453 -77912 -37189
18176 -37189 -60472 -64026 -82113 -82383 -79872 -74423 -12094 -746 16418 2543 -10665 -95288 -124692
18163 -124692 -142502 -117389 -113538 -83216 -64993 -47669 -62710 -95264 -109708 -117990 -57918 -11745
18151 -11745 -57123 -98819 -115899 -63332 -68976 -66832 -72333 -103942 -68815 -46646 -63206 -51905
$$ packed form
18236A503091k7307k36773l16639k68060j35157j19987j84417o4216k6465n9317
18226F4753l8834j551k1842J6723l0354J1732R321m450k1456p872J4604J0990
18214A764o8060K6131L7290j309K1658q073n404l1625r45q378K5897J4848o872
18201c078j563k3116n7881J6568L320j983j4911l3498K0763l804j0973M4229J5772
18188e0155O9619j7516l3295j3181l2791l5605k3794M614m671K3322L5541M0723
18176c7189k3283l554j8087k70K511N449O2329J1348J7164j3875j3208q4623k9404
18163a24692j7810K5113L851L0322J8223J7324j5041l2554j4444q282O0072M6173
18151a1745m5378m1696j7080N2567n644K144n501l1609L5127K2169j6560J1301
$$ plain form
18139 -51905 -54426 -106182 -127677 -152776 -128959 -104815 -98621 -125731 -175574 -149240 -86700 -106110
18127 -106110 -136973 -121152 -68797 -70143 -58357 -8785 -3286 -67955 -104934 -47627 -13310 -31897
18115 -31897 -67285 -19450 52938 39832 11884 -14044 -90551 -99442 -95260 -119235 -101265 -75852
18103 -75852 -71138 -59376 -58257 -62769 -88720 -95541 -62385 -70766 -91444 -128236 -135537 -168358 -161290
18090 -161290 -123359 -126715 -141615 -111039 -89724 -33241 -41443 -32143 -78026 -128868 -153154 -154445
18078 -154445 -150182 -74083 -76691 -76457 -78294 -121348 -107933 -116668 -122326 -71116 -82635 -84602 -76574
18065 -76574 -73666 -69295 -73400 -50720 -45829 -88159 -103000 -79436 -78653 -124745 -157824 -88540 -63959
18052 -63959 -44479 -86822 -74847 -92741 -65661 -47624 -63039 -79504 -87576 -162696 -192148 -176146
$$ packed form
18139e1905k521n1756k1495k5099K3817K4144O194k7110m9843K6334O2540j9410
18127a06110l0863J5821N2355j346J1786M9572N499o4669l6979N7307L4317j8587
18115c1897l5388M7835P2388j3106k7948k5928p6507q891M182k3975J7970K5413
18103g5852M714J1762J119m512k5951o821L3156q381k0678l6792p301l2821P068
18090a61290L7931l356j4900L0576K1315N6483q202R300m5883n0842k4286j291
18078a54445M263P6099k608K34j837m3054J3415q735n658N1210j1519j967Q028
18065g6574K908M371m105K2680M891m2330j4841K3564P83m6092l3079O9284K4581
18052f3959J9480m2343J1975j7894K7080J8037j5415j6465q072p5120k9452J6002
$$ plain form
18040 -176146 -126125 -84524 -79013 -124744 -118924 -100930 -37040 -5074 -27347 -16722 52179 60002
18028 60002 55223 36116 -34940 -59314 -45693 -62675 -94934 -70921 -101022 -133756 -86048 -45979
18016 -45979 -62665 -99020 -85845 -53029 -61805 -89049 -72022 -53284 -103142 -124132 -120548 -29798
18004 -29798 38181 -7308 -43312 -103243 -123920 -106994 -51652 -20558 -75613 -107377 -127106 -140591
17992 -140591 -115006 -83365 -48628 -42496 -49269 -21570 16082 -31175 -67910 -98984 -109124 -110116
17980 -110116 -110108 -124351 -101281 -60622 8729 -27060 -129791 -208011 -185711 -141935 -93670 -95296
17968 -95296 -157937 -155341 -144929 -167653 -146151 -142697 -149318 -144174 -127451 -129874 -125668 -168380 -145642
17955 -145642 -99535 -95421 -105856 -68852 -101003 -106779 -49008 36476 37059 -42582 -58660 -52780
$$ packed form
18040a76146N0021M1601N511m5731N820J7994O3890L1966k2273J0625O8901P823
18028F0002m779j9107p1056k4374J3621j6982l2259K4013l0101l2734M7708M0069
18016d5979j6686l6355J3175L2816q776k7244J7027J8738m9858k0990L584R0750
18004b9798O7979m5489l6004n9931k0677J6926N5342L1094n5055l1764j9729j3485
17992a40591K5585L1641L4737O132o773K7699L7652m7257l6735l1074j0140r92
17980a10116Qj4243K3070M0659O9351l5789j02731p8220K2300M3776M8265j626
17968i5296o2641K596J0412k2724K1502L454o621N144J6723k423M206m2712K2738
17955a45642M6107M114j0435L7004l2151n776N7771Q5484N83p9641j6078N880
$$ plain form
17943 -52780 -65660 -95615 -87143 -92525 -98073 -79893 -93470 -99231 -71930 -53181 -90898 -120033
17931 -120033 -121193 -72366 -47664 -56970 -42314 -86084 -114359 -59384 -30268 -84425 -102376 -80720
17919 -80720 -20787 4204 -7541 -55188 -73330 -86237 -82546 -79849 -78749 -128983 -146237 -121949
17907 -121949 -108460 -93600 -113369 -125784 -127075 -165196 -139179 -81821 -72821 -73043 -79433 -54321
17895 -54321 -31153 -46087 -92919 -131048 -162143 -149864 -198192 -223078 -197299 -148312 -146799 -144380
17883 -144380 -138039 -143791 -158946 -181563 -188233 -222146 -200777 -196360 -166290 -111990 -108502 -100689 -125090
17870 -125090 -65780 -45489 -38505 -82172 -76206 -111917 -112742 -114230 -138410 -192227 -214806 -200654
17858 -200654 -126344 -65810 -43593 -27124 -13759 -25584 11984 27106 17305 -59036 -76232 -61909
$$ packed form
17943e2780j2880k9955Q472n382n548J8180j3577n761K7301J8749l7717k9135
17931a20033j160M8827K4702r306J4656m3770k8275N4975K9116n4157j7951K1656
17919h0720N9933K4991j1745m7647j8142j2907L691K697J100n0234j7254K4288
17907a21949J3489J4860j9769j2415j291l8121K6017N7358R000k22o390K5112
17895e4321K3168j4934m6832l8129l1095J2279m8328k4886K5779M8987J513K419
17883a44380O341n752j5155k2617o670l3913K1369M417L0070N4300L488P813k4401
17870a25090N9310K0291O984m3667N966l5711q25j488k4180n3817k2579J4152
17858b00654P4310O0534K2217J6469J3365j1825L7568J5122r801p6341j7196J4323
$$ plain form
17846 -61909 -125326 -117815 -57572 -38088 -80593 -103916 -165160 -189377 -182644 -153436 -122683 -137512
17834 -137512 -109055 -53852 -14936 15219 2518 -40430 -88869 -71610 -75280 -83014 -88719 -106010
17822 -106010 -104170 -112882 -124704 -97547 -71666 -89902 -121341 -107684 -79057 -62012 -118036 -132272
17810 -132272 -171264 -204478 -204740 -175246 -160737 -173742 -168656 -165478 -170156 -184622 -214165 -165004
17798 -165004 -166935 -129329 -85474 -102832 -158438 -156831 -117669 -83405 -87432 -88403 -124091 -110548
17786 -110548 -82388 -66509 -82354 -87627 -101449 -111025 -76913 -73139 -48249 -63399 -52394 -14447
17774 -14447 -88428 -111168 -136829 -102256 -120410 -200803 -181748 -170564 -175638 -173578 -181620 -180037
17762 -180037 -148351 -121154 -88321 -71352 -77416 -90395 -150353 -205099 -238653 -177030 -174506 -159229
$$ packed form
17846f1909o3417P511O0243J9484m2505k3323o1244k4217O733K9208L0753j4829
17834a37512K8457N5203L8916L0155j2701m2948m8439J7259l670p734n705j7291
17822a06010J840q712j1822K7157K5881j8236l1439J3657K8627J7045n6024j4236
17810a32272l8992l3214k62K9494J4509j3005N086L178m678j4466k9543M9161
17798a65004j931L7606M3855j7358n5606J607L9162L4264m027r71l5688J3543
17786a10548K8160J5879j5845n273j3822r576L4112L774K4890j5150J1005L7947
17774a4447p3981k2740k5661L4573j8154q0393J9055J1184n074K060q042J583
17762a80037L1686K7197L2833J6969o064j2979n9958n4746l3554O1623K524J5277
$$ plain form
17750 -159229 -116429 -149922 -202341 -199186 -158023 -156315 -136138 -179465 -201941 -152031 -161884 -181793
17738 -181793 -128967 -152307 -205398 -203881 -155786 -69639 -70782 -96529 -91372 -56265 -54207 -99889
17726 -99889 -122368 -90075 -58973 -44233 -59763 -21397 -26078 -14710 -9186 -30578 -100540 -122468
17714 -122468 -100088 -95973 -116853 -94552 -72880 -39131 -79842 -118392 -77919 -59870 -110791 -133632
17702 -133632 -133366 -126764 -99706 -84016 -140665 -180424 -171009 -218405 -237150 -190412 -144364 -148308
17690 -148308 -183415 -213621 -211436 -168850 -167582 -179283 -133464 -132483 -141883 -127678 -173936 -224101
17678 -224101 -131652 -28290 -5800 -36267 -54510 -66506 -28674 -69649 -85351 -82810 -134138
17667 -134138 -148520 -182909 -193497 -150053 -138376 -108842 -106102 -133504 -117556 -83311 -93758 -133489
$$ packed form
17750a59229M2800l3493n2419L155M1163J708K0177m3327k2476M9910r853j9909
17738a81793N2826k3340n3091J517M8095Q6147j143k5747N157L5107K058m5682
17726i9889k2479L2293L1102J4740j5530L8366m681J1368N524k1392o9962k1928
17714a22468K2380M115k0880K2301K1672L3749m0711l8550M0473J8049n0921k2841
17702a33632K66O602K7058J5690n6649l9759R415m7396j8745M6738M6048l944
17690a48308l5107l0206K185M2586J268j1701M5819R81r400J4205m6258n0165
17678b24101R2449J03362K2490l0467j8243j1996L7832m0975j5702K541n1328
17667a34138j4382l4389j0588M3444J1677K9534K740k7402J5948L4245j0447l9731
$$ plain form
17655 -133489 -183883 -185645 -130166 -51778 789 -68574 -81563 -106964 -113350 -108782 -87369 -124847
17643 -124847 -75477 -68182 -90864 -98568 -123839 -153684 -166415 -166487 -135002 -107732 -153352 -143298
17631 -143298 -127197 -88564 -85328 -93402 -68098 -43446 -42134 -68475 -71608 -51400 -49723 -50603 -80844
17618 -80844 -73638 -83343 -65477 -74986 -68173 -79339 -126180 -160411 -173067 -164093 -155174 -118107 -76619
17605 -76619 -12935 -25461 -44109 -79458 -92613 -91900 -27890 41937 -6008 -79065 -101813 -97001
17593 -97001 -59974 -31182 1015 6500 17412 -50190 -83421 -124707 -168527 -137666 -8420 16648
17581 16648 -10466 -71340 -143454 -87527 -115706 -147331 -165854 -208083 -143583 -75836 -71259 -40859
17569 -40859 -70913 -95872 -89329 -124250 -87177 -13208 -35340 -87161 -68638 -83813 -112336 -104128
$$ packed form
17655a33489n0394j762N5479P8388N2567o9363j2989k5401o386M568K1413l7478
17643a24847M9370P295k2682p704k5271k9845j2731p2L1485K7270m5620J0054
17631a43298J6101L8633L236q074K5304K4652J312k6341l133K0208J677q80l0241
17618h0844P206r705J7866r509O813j1166m6841l4231j2656Q974Q919L7067M1488
17605g6619O3684j2526j8648l5349j3155P13O4010O9827m7945p3057k2748M812
17593i7001L7027K8792L2197N485J0912o7602l3231m1286m3820L0861J29246K5068
17581A6648k7114o0874p2114N5927k8179l1625j8523m2229O4500O7747M577L0400
17569d0859l0054k4959O543l4921L7073P3969k2132n1821J8523j5175k8523Q208
$$ plain form
17557 -104128 -114490 -96100 -99146 -42044 -4270 -12526 -38728 -60271 -37924 -85919 -50464 -30159
17545 -30159 -40619 -13678 15579 -60777 -120689 -122534 -153426 -144456 -93523 -48730 -59945 -112451
17533 -112451 -169794 -162477 -112526 -77112 -71573 -8406 20843 -15069 -53154 -98911 -89452 -58694
17521 -58694 -48321 -39825 -96143 -148119 -168179 -179504 -180753 -164060 -174872 -183148 -114115 -39529
17509 -39529 15955 9542 -27356 -96105 -87795 -76337 -67105 -69218 -88327 -88711 -74501 -42313 -33027
17496 -33027 -27012 -68326 -78507 -29486 -21039 -17433 -31665 -84927 -76216 -89169 -164583 -141723
17484 -141723 -116151 -109442 -80071 -54286 -74254 -138580 -145279 -157659 -116946 -96339 -96705 -73091
17472 -73091 -102922 -121588 -115543 -107271 -84095 -74460 -65553 -65212 -78776 -142750 -169867 -144692 -144329
$$ packed form
17557a04128j0362J8390l046N7102L7774q256k6202k1543K2347m7995L5455K0305
17545c0159j0460K6941K9257p6356n9912j845l0892Q970N0933M4793j1215n2506
17533a12451n7343P317M9951L5414N539O3167K9249l5912l8085m5757R459L0758
17521e8694J0373Q496n6318n1976k0060j1325j249J6693j0812q276O9033P4586
17509c9529N5484o413l6898o8749Q310J1458R232k113j9109l84J4210L2188R286
17496c3027O015m1314j0181M9021Q447L606j4232n3262Q711j2953p5414K2860
17484a41723K5572O709K9371K5785j9968o4326o699j2380M0713K0607l66K3614
17472g3091k9831j8666O045Q272K3176R635Q907L41j3564o3974k7117K5175L63
$$ plain form
17459 -144329 -133926 -150937 -146821 -98992 -52770 -72138 -68460 -42455 -27285 -25132 -21699 -69956
17447 -69956 -101218 -104360 -96004 -87443 -127026 -154865 -117968 -107960 -94858 -93920 -97720 -58188 -54212
17434 -54212 -35032 -41272 -92318 -58399 -31670 -17500 -29409 -94838 -132170 -90767 -87994 -48148
17422 -48148 -75127 -94587 -69957 -40039 -69624 -110678 -70021 -67034 -47201 -65427 -117248 -93473
17410 -93473 -74948 -84426 -95309 -29970 -24290 -63458 -27813 -57576 -106540 -131294 -120912 -85679
17398 -85679 -82754 -42672 -32249 -48731 -68908 -10983 69628 87179 35744 39971 21526 -6602
17386 -6602 1666 34408 22356 -23032 -44960 -29933 -52039 -65494 -59511 1863 45467 22068
17374 22068 -81576 -112908 -72168 -114194 -125164 -81584 -59106 -78184 -50463 -43160 -29892 -31075
$$ packed form
17459a44329J0403j7011M116M7829M6222j9368L678K6005J5170K153L433m8257
17447f9956l1262l142Q356Q561l9583k7839L6897J0008J3102R38l800L9532L976
17434e4212J9180o240n1046L3919K6729J4170j1909o5429l7332M1403K773L9846
17422d8148k6979j9460K4630K9918k9585m1054M0657K987J9833j8226n1821K3775
17410i3473J8525r478j0883O5339N680l9168L5645k9763m8964k4754J0382L5233
17398h5679K925M0082J0423j6482k0177N7925Q0611J7551n1435M227j8445k8128
17386f602Q268L2742j2052m5388k1928J5027k2106j3455N983O1374M3604k3399
17374B2068j03644l1332M0740m2026j0970M3580K2478j9078K7721P303J3268j183
$$ plain form
17362 -31075 -70249 -19410 -28650 -49367 -50667 -103896 -102203 -19677 12794 -441 -85793 -175026
17350 -175026 -198959 -168218 -104464 -58194 -61283 -57417 -26430 -47302 -74995 -108652 -118539 -123947
17338 -123947 -131598 -74687 -44699 -32378 -52480 -124968 -113522 -27644 -69534 -73171 -47383 -33829
17326 -33829 -34285 -39161 -36297 -92272 -69893 -87272 -85689 -56982 -16246 -78455 -115241 -105519 -130900
17313 -130900 -116076 -123128 -126270 -119726 -108494 -111303 -170888 -165353 -112509 -104383 -69756 -97171 -145426
17300 -145426 -174545 -163582 -149959 -178967 -191060 -197049 -196258 -202116 -203582 -169620 -106904 -43768
17288 -43768 -40118 -35293 -56231 -72734 -79424 -48334 3052 39740 -3140 -41482 -94983 -148179
17276 -148179 -92445 -60192 -68731 -61536 -48549 -40494 -57599 -70407 -91651 -63919 -14697 -46497
$$ packed form
17362c1075l9174N0839r240k0717j300n3229J693Q2526L2471j3235q5352q9233
17350a75026k3933L0741O3754M6270l089L866L0987k0872k7693l3657r887n408
17338a23947p651N6911K9988J2321k0102p2488J1446Q5878m1890l637K5788J3554
17326c3829m56m876K864n5975K2379j7379J583K8707M0736o2209l6786R722k5381
17313a30900J4824p052l142O544J1232k809n9585N535N2844Q126L4627k7415m8255
17300a45426k9119J0963J3623k9008j2093n989P91n858j466L3962O2716O3136
17288d3768L650M825k0938j6503o690L1090N1386L6688m2880l8342n3501n3196
17276a48179N5734L2253q539P195J2987Q055j7105j2808k1244K7732M9222l1800
$$ plain form
17264 -46497 -110446 -95916 -90416 -113058 -117016 -77660 -29036 -19830 -23510 -57561 -75244 -62173
17252 -62173 -95729 -84592 -128780 -102988 -37133 -44444 -50128 -62426 -23760 -31184 -119613 -142125
17240 -142125 -83932 -55222 -53126 -11307 -30606 -44153 -8505 11402 11535 19880 -17140 -58422
17228 -58422 -54104 -20330 17164 -20034 -92501 -92452 -67355 -78672 -58300 -50413 -58201 -93091 -107322
17215 -107322 -108043 -94209 -106427 -101057 -72506 -91000 -176137 -185156 -104482 -98785 -119083 -65816
17203 -65816 -33277 -64869 -89851 -102901 -121196 -76514 -34697 -45580 -62159 -80971 -57038 -94513
17191 -94513 -92373 -92628 -27646 -53808 -92130 -104649 -124179 -81260 -18286 -22780 -64732 -71411 -67346
17178 -67346 -62259 -48435 -85606 -110349 -84268 -106549 -122800 -51836 7396 -48366 -112900 -131509
$$ packed form
17264d6497o3949J4530N500k2642l958L9356M8624R206l680l4051j7683J3071
17252f2173l3556J1137m4188K5792O5855p311n684j2298L8666p424q8429k2512
17240a42125N8193K8710K096M1819j9299j3547L5648J9907J33Q345l7020m1282
17228e8422M318L3774L7494l7198p2467M9K5097j1317K0372P887p788l4890j4231
17215a07322p21J3834j2218N370K8551j8494q5137r019Q0674N697k0298N3267
17203f5816L2539l1592k4982j3050j8295M4682M1817j0883j6579j8812K3933l7475
17191i4513K140k55O4982k6162l8322j2519j9530M2919O2974m494m1952o679M065
17178f7346N087J3824l7171k4743K6081k2281j6251P0964N9232n5762o4534j8609
$$ plain form
17166 -131509 -88206 -3495 38078 2747 15464 -45425 -159905 -137792 -82280 -17600 -88262
17155 -88262 -112214 -118090 -75872 -46322 -88099 -107623 -57154 -12214 -45290 -64261 -47761 -44541
17143 -44541 -68014 -61317 -74178 -117410 -143958 -143867 -106139 -91012 -66347 37859 167420 250572
17131 250572 260534 218571 214690 229010 133627 45846 40510 48388 -38180 -73134 -32115 -26591
17119 -26591 -26464 4783 23344 44021 16020 -8549 -28158 -469 1444 10015 -13761 -27733
17107 -27733 -15181 -22953 -45891 -64085 -39086 -12766 19380 45704 16194 -8529 -2972 -2783
17095 -2783 -32169 -41915 -71558 -111249 -113424 -106632 -114968 -138934 -92932 -42929 -84732 -104248 -104134
17082 -104134 -110551 -71145 -50798 -76464 -95224 -132292 -120525 -106234 -135370 -146710 -150029 -86933
$$ packed form
17166a31509M3303Q4711M1573l5331J2717o0889j14480K2113N5512O4680p0662
17155h8262k3952n876M2218K9550m1777j9524N0469M4940l3076j8971J6500L220
17143d4541k3473O697j2861m3232k6548R1L7728J5127K4665J04206J29561Q3152
17131B50572R962m1963l881J4320r5383q7781n336P878q6568l4954M1019N524
17119b6591J27L1247J8561K0677k8001k4569j9609K7689J913Q571k3776j3972
17107b7733J2552p772k2938j8194K4999K6320L2146K6324k9510k4723N557J89
17095b783k9386r746k9643l9691k175O792q336k3966M6002N0003m1803j9516J14
17082a04134o417L9406K0347k5666j8760l7068J1767J4291k9136j1340l319O3096
$$ plain form
17070 -86933 -44535 -72464 -133075 -141486 -116955 -123371 -105238 -100866 -76535 -44306 -31817 -87022
17058 -87022 -83209 -26188 32212 24727 -27361 -23490 -51979 -36246 -28324 -57654 -57016 -69326 -72397
17045 -72397 -54159 -85495 -87532 -95211 -73723 -59734 -59810 -61925 -23196 -45850 -58199 -41632 -60154
17032 -60154 -157303 -177105 -158684 -173159 -200979 -146440 -114447 -93954 -32462 -2217 -16430 -44565
17020 -44565 -91216 -88832 -127317 -134523 -124996 -145094 -116299 -64390 -40024 -39988 -27477 -28309 47177
17007 47177 10912 -14685 -36771 -73390 -107448 -58377 -38200 -95355 -98556 -70798 -78183 -67376
16995 -67376 -60128 -84270 -111513 -113817 -62006 -57330 -44503 -21728 -20711 -1464 10563 -39834
16983 -39834 -95192 -70773 -75659 -112544 -120706 -140238 -137061 -52624 -25297 -40592 -71649 -88516
$$ packed form
17070h6933M2398k7929o0611q411K4531o416J8133M372K4331L2229J2489n5205
17058h7022L813N7021N8400p485n2088L871k8489J5733P922k9330O38j2310l071
17045g2397J8238l1336k037p679K1488J3989p6k115L8729k2654j2349J6567j8522
17032f0154r7149j9802J8421j4475k7820N4539L1993K0493O1492L0245j4213k8135
17020d4565m6651K384l8485p206R527k0098K8795N1909K4366L6J2511q32P5486
17007D7177l6265k5597k2086l6619l4058M9071K0177n7155l201K7758p385J0807
16995f7376P248k4142k7243k304N1811M676J2827K2775J017J9247J2027n0397
16983c9834n5358K4419m886l6885q162j9532L177Q4437K7327j5295l1057j6867
$$ plain form
16971 -88516 -77123 -40672 -27198 -26375 -17051 -48378 -143915 -168931 -163355 -143406 -105136 -135328
16959 -135328 -94767 -85360 -43904 -25002 -46203 -75223 -106405 -60841 24119 54401 37846 15022
16947 15022 19266 -15193 -781 -20361 -24672 -56671 -97380 -74885 -59543 -49696 13356 51824
16935 51824 -2414 -60504 -54490 -42330 -40940 -10353 -402 -9147 -11539 -21528 -32114 -84058 -29027
16922 -29027 58688 66579 21348 19139 20500 80895 122092 147893 155569 122517 66878 21040
16910 21040 -21583 -78924 -65864 -25252 -23627 -43297 -55786 -55096 -57766 -44090 -7475 13139
16898 13139 27382 1945 -29095 -7488 17456 56914 68120 68318 50201 -556 -56585 -68874
16886 -68874 -68165 -44773 -52017 -64729 -43244 -43259 -14016 -32356 -53953 -30575 -25301 -49566 -74673
$$ packed form
16971h8516J1393L6451J3474Q23R324l1327r5537k5016N576J9949L8270l0192
16959a35328M0561R407M1456J8902k1201k9020l1182M5564Q4960L0282j6555k2824
16947A5022M244l4459J4412j9580m311l1999m0709K2495J5342R847O3052L8468
16935E1824n4238n8090O014J2160J390L0587R951q745k392r989j0586n1944N5031
16922b9027Q7715P891m5231k209J361O0395M1197K5801P676l3052n5639m5838
16910B1040m2623n7341J3060M0612J625j9670j2489O90k670J3676L6615K0614
16898A3139J4243k5437l1040K1607K4944L9458J1206J98j8117n0757n6029j2289
16886f8874P09K3392p244j2712K1485j5K9243j8340k1597K3378N274k4265k5107
$$ plain form
16873 -74673 -79469 -36921 -37550 -58952 -65446 -82956 -125565 -76464 -57843 -51742 -72738 -67307 -88731
16860 -88731 -62137 -27126 -40422 -49558 -71120 -107001 -92777 -26902 -25756 -56629 -92811 -143586
16848 -143586 -201851 -221100 -190196 -137215 -89986 -51072 -27759 -47041 -70912 -129472 -144568
16837 -144568 -55005 -19232 7118 7660 22650 -24582 -43068 -57613 -57849 -43703 -25075 8877
16825 8877 9552 -47362 -57721 -66647 -42693 -623 -332 -99000 -119750 -117117 -78576 -87429 -49494
16812 -49494 -85633 -87432 -101580 -41657 -19804 -48929 -64383 -68457 -14960 20795 38526 -30736
16800 -30736 -76938 -61806 -50088 -9620 43110 22549 -59307 -59323 -70692 -70016 -87137 -62782 -54644
16787 -54644 -3183 59977 32214 -22570 -22848 -7382 3826 10246 23726 19284 -15508 -30219
$$ packed form
16873g4673m796M2548o29k1402o494j7510m2609M9101J8621O101k0996N431k1424
16860h8731K6594L5011j3296r136k1562l5881J4224O5875J146l0873l6182n0775
16848a43586n8265j9249L0904N2981M7229L8914K3313j9282k3871n8560j5096
16837a44568Q9563L5773K6350N42J4990m7232j8486j4545k36J4146J8628L3952
16825H877O75n6914j0359q926K3954M2070K91r8668k0750K633L8541q853L7935
16812d9494l6139j799j4148N9923K1853k9125j5454m074N3497L5755J7731o9262
16800c0736m6202J5132J1718M0468N2730k0561q1856j6j1369O76j7121K4355Q138
16787e4644N1461O3160k7763n4784k78J5466J1208O420J3480m442l4792j4711
$$ plain form
16775 -30219 -64815 -123262 -64068 30648 58770 92978 75974 70270 58091 51191 -955 6723
16763 6723 -11426 -42149 -47372 -39762 -25293 -51189 -42097 -44684 -5609 4361 -28239 -16643 -85372
16750 -85372 -73611 -18952 -39680 -62766 -81736 -121425 -108025 -81291 -105240 -162277 -138935 -97778
16738 -97778 -76140 -62267 -74328 -27558 16847 30672 26099 -26311 -33747 -11054 -20021 -42285
16726 -42285 -52427 -66964 -60099 -48793 -105808 -161760 -150683 -135566 -115009 -74378 -46630 -31239
16714 -31239 -11469 -37339 -74222 -67990 -67092 -120735 -143671 -117648 -81543 -87437 -113809 -94666
16702 -94666 -128028 -104415 -26842 -10170 -38782 -45967 -4628 60658 20762 -6533 2522 26284
16690 26284 -15708 -59003 -77781 -86606 -5658 21547 44991 21864 -27360 -58355 -69791 -58212
$$ packed form
16775c0219l4596n8447N9194R4716K8122L4208j7004n704j2179o900n2146P678
16763F723j8149l0723n223P610J4469k5896R092k587L9075R970l2600J1596o8729
16750h5372J1761N4659k0728k3086j8970l9689J3400K6734k3949n7037K3342M1157
16738i7778K1638J3873j2061M6770M4405J3825m573n2410p436K2693q967k2264
16726d2285j0142j4537O865J1306n7015n5952J1077J5117K0557M0631K7748J5391
16714c1239J9770k5870l6883O232Q98n3643k2936K6023L6105n894k6372J9143
16702i4666l3362K3613P7573J6672k8612p185M1339O5286l9896k7295R055K3762
16690B6284m1992m3295j8778q825Q0948K7205K3444k3127m9224l0995j1436J1579
$$ plain form
16678 -58212 -66505 -79614 -56975 -7632 721 8687 6400 10423 -10916 4874 2387 11903 -14484
16665 -14484 -27155 -28256 28439 14073 9892 -17408 -11007 -7392 4645 -19137 -25124 -33146 -17793
16652 -17793 -22314 -32449 -8357 13558 -31846 -63198 -48525 -42287 -9670 1290 17346 33739
16640 33739 53089 52359 -13927 -66643 -31674 13407 -6242 -103564 -88251 -18311 -7892 -23603
16628 -23603 -48047 -113628 -108577 -136076 -104166 -82300 -86228 -44445 -34906 -29838 -52460 -30419
16616 -30419 -23909 -52122 -80547 -24396 19844 -23228 -33289 -47669 -64430 -71998 -55212 -38623
16604 -38623 -92814 -76644 -56935 -33795 -20602 3083 22321 44189 32624 1953 -5572 -33295
16592 -33295 -59190 -60242 -17331 22793 -11441 -40143 -50399 -29328 -56616 -74435 -94189 -82703
$$ packed form
16678e8212q293j3109K2639M9343Q353P966k287M023k1339J5790k487R516k6387
16665a4484j2671j101N6695j4366m181k7300O401L615J2037k3782n987q022J5353
16652a7793m521j0135K4092K1915m5404l1352J4673O238L2617J0960J6056J6393
16640C3739J9350p30o6286n2716L4969M5081j9649r7322J5313O9940J0419j5711
16628b3603k4444o5581N051k7499L1910K1866l928M1783R539N068k2622K2041
16616c0419O510k8213k8425N6151M4240m3072j0061j4380j6761p568J6786J6589
16604c8623n4191J6170J9709K3140J3193K3685J9238K1868j1565l0671p525k7723
16592c3295k5895j052M2911M0124l4234k8702j0256K1071k7288j7819j9754J1486
$$ plain form
16580 -82703 -37877 8170 30674 6492 -7355 -19566 6594 41150 17569 -6078 12630 86594
16568 86594 70218 46565 12835 8099 -17476 -38308 -87193 -126674 -105496 -98905 -133410 -130516
16556 -130516 -71895 -25233 1968 -4943 1668 22438 -9391 -62789 -45612 -50686 -56728 -7841
16544 -7841 19323 -36570 -89437 -80892 -67476 -106996 -91845 -91680 -141096 -151732 -162622 -124104
16532 -124104 -16389 26845 7143 -9139 608 878 22236 -6749 -48438 -90321 -38177 3983
16520 3983 -8904 -69760 -73162 -113316 -97690 -31073 -5701 -33422 -44686 -34531 24205 15432
16508 15432 -10790 25741 35707 -25551 -40143 -11142 1435 30124 15717 49191 44646 8185
16496 8185 1348 23993 14053 -6853 -2746 7610 -21346 -27536 8725 6216 -17768 -46917 -56410
$$ packed form
16580h2703M4826M6047K2504k4182j3847j2211K6160L4556k3581k3647J8708P3964
16568H6594j6376k3653l3730m736k5575k0832m8885l9481K1178O591l4505K894
16556a30516N8621M6662K7201o911O611K0770l1829n3398J7177n074o042M8887
16544g841K7164n5893n2867Q545J3416l9520J5151J65m9416j0636j0890L8518
16532a24104J07715M3234j9702j6282R747K70K1358k8985m1689m1883N2144M2160
16520C983j2887o0856l402m0154J5626O6617K5372k7721j1264J0155N8736q773
16508A5432k6222L6531R966o1258j4592K9001J2577K8689j4407L3474m545l6461
16496H185o837K2645r940k0906M107J0356k8956o190L6261k509k3984k9149r493
$$ plain form
16483 -56410 -39554 6554 8412 27489 10934 2153 -19503 5994 -6197 -22921 15196 37799
16471 37799 25781 8385 20295 21669 10780 -6652 -9591 28420 31508 40908 35434 36303 39637
16458 39637 -27017 -97571 -119138 -67057 -60813 -92141 -139645 -102734 -66558 -52655 -61322 -39014
16446 -39014 -15334 -19014 -34483 -36087 -28591 19831 -25376 -24347 974 18471 -41604 -120139
16434 -120139 -133861 -108820 -84786 -76029 -101261 -43205 13645 45881 27997 -12503 30314 29831
16422 29831 -2243 -33246 3960 -20980 -42320 -23430 2642 7842 -49478 -58969 -46284 -27545
16410 -27545 -71327 -55968 -47750 -15856 19658 45141 30126 -8688 -8743 38135 63597 65682 51578
16397 51578 1499 -36678 -62852 -51939 -51691 -13994 5136 26824 -11134 -71411 24081 68746
$$ packed form
16483e6410J6856M6108J858J9077j6555q781k1656K5497j2191j6724L8117K2603
16471C7799j2018j7396J1910J374j0889j7432k939L8011L088R400n474Q69L334
16458C9637o6654p0554k1567N2081O244l1328m7504L6911L6176J3903q667K2308
16446c9014K3680l680j5469j604P496M8422m5207J029K5321J7497o0075p8535
16434a20139j3722K5041K4034Q757k5232N8056N6850L2236j7884m0500M2817m83
16422B9831l2074l1003L7206k4940k1340J8890K6072N200n7320r491J2685J8739
16410b7545m3782J5359Q218L1894L5514K5483j5015l8814n5M6878K5462K085j4104
16397E1578n0079l8177k6174J0913K48L7697J9130K1688l7958o0277R5492M4665
$$ plain form
16385 68746 65694 44920 13402 47109 6162 -24911 5676 -10695 -73268 -22882 11388 24606
16373 24606 13520 -68107 -93208 -122872 -131240 -119274 -120163 -149143 -130869 -78595 -13762 -40423
16361 -40423 -71654 -82107 -69228 -89170 -59164 -10437 9553 16259 -52287 -72754 -21339 40383
16349 40383 38732 7836 -22119 -24097 13778 31842 59698 87842 87043 44583 22994 103014
16337 103014 180800 161057 132070 106739 82029 64791 80232 94506 97496 106029 83366 67863
16325 67863 76144 120132 150426 124302 97265 65868 88484 86741 57471 24874 85733 65726
16313 65726 -18750 -58563 -15805 -18992 -10045 -4554 21993 99638 87060 22879 -16748 -14812
16301 -14812 12169 13733 -26150 -62080 -19924 13585 39976 60205 10586 30408 23122 30209
$$ packed form
16385F8746l052k0774l1518L3707m0947l1073L0587j6371o2573N0386L4270J3218
16373B4606j1086q1627k5101k9664q368J1966q89k8980J8274N2274O4833k6661
16361d0423l1231j0453J2879j9942L0006M8727J9990O706o8546k0467N1415O1722
16349D0383j651l0896k9955j978L7875J8064K7856K8144p99m2460k1589Q0020
16337A03014P7786j9743k8987k5331k4710j7238J5441J4274K990Q533k2663j5503
16325F7863Q281M3988L0294k6124k7037l1397K2616j743k9270l2597O0859k0007
16313F5726q4476l9813M2758l187Q947N491K6547P7645j2578o4181l9627J936
16301a4812K6981J564l9883l5930M2156L3509K6391K0229m9619J9822p286P087
$$ plain form
16289 30209 59845 76878 62250 15748 -32864 -64100 -90952 -67615 -10680 68193 92157 113887
16277 113887 61246 24301 72846 72490 57191 48643 29547 -22404 -54469 -50656 6628 25419
16265 25419 56537 17572 -7927 25806 41929 44760 30270 -31654 -71535 -68018 -41898 -20920
16253 -20920 -80533 -123171 -82158 -16173 -8288 -16791 -22354 19707 74779 6485 -68131 -66186
16241 -66186 -56579 -50879 -80785 -86202 -66638 -92223 -74473 -55919 -18114 13288 4489 50153
16229 50153 121328 105283 108047 39860 -32298 -86971 -6061 68996 8266 -26768 -4790 -17705
16217 -17705 -9572 12434 37286 64976 73324 46066 62459 78497 88383 48257 59249 1704
16205 1704 -22657 -48892 -87488 -10546 3635 -22553 -36598 28938 52673 10963 6858 21419
$$ packed form
16289C0209K9636J7033j4628m6502m8612l1236k6852K3337N6935P8873K3964K1730
16277A13887n2641l6945M8545l56j5299q548j9096n1951l2065L813N7284J8791
16265B5419L1118l8965k5499L3733J6123K831j4490o1924l9881L517K6120K0978
16253b0920n9613m2638M1013O5985P885q503n563M2061N5072o8294p4616J945
16241f6186R607N700k9906n417J9564k5585J7750J8554L7805L1402q799M5664
16229E0153P1175j6045K764o8187p2158n4673Q0910P5057o0730l5034K1978j2915
16217a7705Q133K2006K4852K7690Q348k7258J6393J6038R886m0126J0992n7545
16205A704k4361k6235l8596P6942J4181k6188j4045O5536K3735m1710m105J4561
$$ plain form
16193 21419 43971 69707 58395 75670 46217 42580 -10075 -7852 -95 43248 46443 68449
16181 68449 60673 59969 35920 -10471 41779 82479 49171 69533 74637 -9184 -11237 -786 -15062
16168 -15062 -27641 -17770 18548 12776 21712 46416 38513 -3640 2796 -13120 30247 50161 31285
16155 31285 37157 64388 36655 24698 -3018 9464 3986 -15998 5705 32538 37482 82851
16143 82851 104024 121750 38547 -3631 -47846 -80043 -11853 17142 69847 68530 -11470 -40035
16131 -40035 -36183 -35404 -80718 -65401 7472 51284 81659 19666 12326 -335 32479 18724
16119 18724 10882 40795 86603 113432 62481 34536 -22658 -8342 9472 -23288 -35381 157
16107 157 35924 15578 64723 77795 17818 -353 -36818 -45391 672 4939 -26735 -19205 37270
$$ packed form
16193B1419K2552K5736j1312J7275k9453l637n2655K223P757M3343L195K2006
16181F8449p776p04k4049m6391N2250M0700l3308K0362N104q3821k053J0451j4276
16168a5062j2579R871L6318n772Q936K4704p903m2153O436j5916M3367J9914j8876
16155C1285N872K7231k7733j1957k7716J2482n478j9984K1703K6833M944M5369
16143H2851K1173J7726q3203m2178m4215l2197O8190K8995N2705j317q0000k8565
16131d0035L852P79m5314J5317P2873M3812L0375o1993p340j2661L2814j3755
16119A8724p842K9913M5808K6829n0951k7945n7194J4316J7814l2760j2093L5538
16107A57L5767k0346M9145J3072n9977j8171l6465q573M6063M267l1674P530N6475
$$ plain form
16094 37270 24515 30059 95211 61543 23077 25655 72228 38272 9866 62676 60975 50360
16082 50360 36490 60618 19496 -9648 22640 86146 111155 90981 97019 56575 10360 13898
16070 13898 25384 15157 20165 32951 68470 78315 35859 37499 45964 31732 -19696 -17522 37209
16057 37209 45711 10097 26862 44728 -9387 -22146 40969 96402 103264 52261 62065 41450
16045 41450 26781 43104 77725 58586 89450 68574 69403 28283 55390 47244 18994 -6348
16033 -6348 43016 101733 64467 61861 80424 71804 64425 44679 45184 42296 29136 50365 81445
16020 81445 55939 21845 5575 -22577 -19606 -7928 -20294 -2035 14238 -9298 -26883 -36323
16008 -36323 -42722 -57123 -27347 -3845 33578 5850 -9013 -6886 -41281 -48091 -32327 -19443
$$ packed form
16094C7270j2755N544O5152l3668l8466K578M6573l3956k8406N2810j701j0615
16082E0360j3870K4128m1122k9144L2288O3506K5009k0174O038m0444m6215L538
16070A3898J1486j0227N008J2786L5519R845m2456J640Q465j4232n1428K174N4731
16057C7209Q502l5614J6765J7866n4115j2759O3115N5433O862n1003R804k0615
16045D1450j4669J6323L4621j9139L0864k0876Q29m1120K7107q146k8250k5342
16033f348M9364N8717l7266k606J8563q620p379j9746N05k888j3160K1229L1080
16020H1445k5506l4094j6270k8152K971J1678j2366J8259J6273k3536j7585r440
16008c6323o399j4401K9776K3502L7423k7728j4863K127l4395o810J5764J2884
$$ plain form
15996 -19443 35644 17577 25062 18074 33981 51846 52806 74761 67482 66560 92471 64701 44176
15983 44176 33213 49032 29788 37339 36206 -1667 13054 56297 53879 76200 92698 67641
15971 67641 47406 83071 69122 79988 81178 64021 56010 62177 69950 89729 50173 38283
15959 38283 49356 69527 81641 52445 59807 88350 92334 95722 12110 13209 77887 36553
15947 36553 8848 1577 60842 52439 12708 27130 52879 40131 16397 -12084 -16067 -449
15935 -449 10727 32329 39547 77436 62919 87003 61070 42441 103664 69659 40240 90512
15923 90512 82605 39507 58128 77210 114900 100897 131332 188474 148792 73496 7895 -21167
15911 -21167 -17627 33144 -8203 -90499 -51069 33637 81502 58489 110168 163108 163293 94803
$$ packed form
15996a9443N5087j8067P485o988J5907J7865R60K1955p279r22K5911k7770k0525
15983D4176j0963J5819j9244P551j133l7873J4721M3243k418K2321J6498k5057
15971F7641k0235L5665j3949J0866J190j7157q011O167P773J9779l9556j1890
15959C8283J1073K0171J2114k9196P362K8543L984L388q3612J099O4678m1334
15947C6553k7705p271N9265q403l9731J4422K5749j2748k3734k8481l983J5618
15935d49J1176K1602P218L7889j4517K4084k5933j8629O1223l4005k9419N0272
15923I0512p907m3098J8621J9082L7690j4003L0435N7142l9682p5296o5601k9062
15911b1167L540N0771m1347q2296L9430Q4706M7865k3013N1679N2940J85o8490
$$ plain form
15899 94803 28157 47928 52159 49080 69057 34072 65595 101925 62182 39516 34804 28677
15887 28677 40167 44360 51620 67269 66541 65043 78760 98416 102242 131527 131672 111130 106481
15874 106481 111680 153436 142164 110937 114616 138083 134388 102114 100997 98199 33562 9731
15862 9731 -377 15438 -9195 -55763 -20424 61116 77677 54358 -13541 -38860 26403 -499
15850 -499 -7889 2018 -6462 -18525 -22203 16884 19811 -11045 -40228 13581 70989 79048 115709
15837 115709 112688 120681 95872 80818 52557 101733 99844 74426 72372 91535 102246 112869
15825 112869 113095 85465 76685 38336 57328 79040 45548 28496 68201 65882 51197 18134
15813 18134 -746 -27305 -52189 -5434 82721 80422 22229 45283 66104 51639 52587 36051
$$ packed form
15899I4803o6646J9771M231l079J9977l4985L1523L6330l9743k2666m712o127
15887B8677J1490M193P260J5649p28j498J3717J9656L826K9285J45k0542m649
15874A06481N199M1756j1272l1227L679K3467l695l2274j117k798o4637k3831
15862I731j0108J5815k4633m6568L5339Q1540J6561k3319o7899k5319O5263k6902
15850d99p390R907q480j2063l678L9087K927l0856k9183N3809N7408Q059L6661
15837A15709l021P993k4809j5054k8261M9176j889k5418k054J9163J0711J0623
15825A12869K26k7630q780l8349J8992K1712l3492j7052L9705k319j4685l3063
15813A8134j8880k6559k4884M6755Q8155k299n8193K3054K0821j4465R48j6536
$$ plain form
15801 36051 29358 2812 1247 -13458 57917 67152 -7147 13767 73891 123403 94236 48298
15789 48298 57026 109194 141297 139791 148352 168075 146635 135135 110971 75716 19273 16787
15777 16787 116033 137528 137410 130518 122205 119322 91187 66033 37155 73748 85121 114307 149711
15764 149711 129310 110688 81655 73948 128757 114055 117727 133386 75573 23758 43876 57876
15752 57876 64342 13828 56066 102745 75737 60334 70963 76345 53274 82737 77074 86623
15740 86623 76879 101679 126858 126794 124953 142696 174595 220136 159611 103062 102031 110453 146375
15727 146375 201598 197019 197661 172544 82951 19651 -748 35037 42615 34597 2645 20279
15715 20279 61126 40195 116879 189074 199316 160908 131220 99241 78087 59432 98862 105683
$$ packed form
15801C6051o693k6546j565j4705P1375R235p4299K0914O0124M9512k9167m5938
15789D8298Q728N2168L2103j506Q561J9723k1440j1500k4164l5255n6443k486
15777A6787R9246K1495j18o892q313k883k8135k5154k8878L6593J1373K9186L5404
15764A49711k0401j8622k9033p707N4809j4702L672J5659n7813n1815K0118J4000
15752E7876O466n0514M2238M6679k7008j5403J0629N382k3071K9463n663R549
15740H6623r744K4800K5179o4j841J7743L1899M5541o0525n6549j031Q422L5922
15727A46375N5223m579O42k5117q9593o3300k0399L5785P578q018l1952J7634
15715B0279M0847k0931P6684P2195J0242l8408k9688l1979k1154j8655L9430O821
$$ plain form
15703 105683 73182 80015 95874 76206 97561 99559 99516 73964 125836 165843 183642 163430
15691 163430 146175 67298 43699 63357 49282 54895 56166 107752 73666 25876 6198 86499
15679 86499 100710 14964 12071 -36 32707 78075 100010 77075 35127 14953 34107 19843
15667 19843 -8875 -7301 104640 97984 33660 87664 140397 159062 100610 64149 55648 28054
15655 28054 35300 60466 100297 97516 114233 141292 107935 45015 43832 54913 77016 88852
15643 88852 128084 95771 60012 82655 107598 109191 114968 125237 143335 173456 190572 128324
15631 128324 40834 43803 93632 69227 100585 128625 113313 89493 81064 81748 116540 162371
15619 162371 180627 181142 158922 215801 240595 232276 200020 136390 33728 -23352 3855 60093
$$ packed form
15703A05683l2501O833J5859j9668K1355J998m3k5552N1872M0007J7799k0212
15691A63430j7255p8877k3599J9658j4075N613J271N1586l4086m7790j9678Q0301
15679H6499J4211q5746k893j2107L2743M5368K1935k2935m1948k0174J9154j4264
15667A9843k8718J574J11941o656o4324N4004N2733J8665n8452l6461q501k7594
15655B8054P246K5166L9831k781J6717K7059l3357o2920j183J1081K2103J1836
15643H8852L9232l2313l5759K2643K4943J593N777J0269J8098L0121J7116o2248
15631A28324q7490K969M9829k4405L1358K8040j5312k3820q429O84L4792M5831
15619A62371J8256N15k2220N6879K4794q319l2256o3630j02662n7080K7207N6238
$$ plain form
15607 60093 77047 149919 153545 143224 169344 181225 179439 152508 89265 88998 131316 134932 105410
15594 105410 100846 120451 132714 182941 176717 129797 128466 85505 77499 54494 118532 125351
15582 125351 104905 86745 -3905 -46788 -22363 13197 108624 123065 50047 99883 88737
15571 88737 75387 85534 87438 101264 59564 84592 144086 230000 236053 156574 115789 63714
15559 63714 70734 68405 59901 72928 68419 40588 49814 91912 88037 99386 106826 148616 154772
15546 154772 121449 92341 82116 134843 159830 192146 146159 126507 90413 94091 90136 76588
15534 76588 78526 60343 73985 83598 101585 64341 54787 83244 66597 111276 117744 123768 106001
15521 106001 131955 141437 138412 154958 158933 161469 165166 174131 135424 78561 73494 74325 78642
$$ packed form
15607F0093J6954P2872L626j0321K6120J1881j786k6931o3243k67M2318L616k9522
15594A05410m564J9605J2263N0227o224m6920j331m2961q006k3005O4038O819
15582A25351k0446j8160r0650m2883K4425L5560R5427J4441p3018M9836j1146
15571H8737j3350J0147J904J3826m1700K5028N9494Q5914O053p9479m0785n2075
15559F3714P020k329q504J3027m509k7831R226M2098l875J1349P440M1790O156
15546A54772l3323k9108j0225N2727K4987L2316m5987j9652l6094L678l955j3548
15534G6588J938j8183J3642R613J7987l7244r554K8457j6647M4679O468O024j7767
15521A06001K5954R482l025J6546L975K536L697Q965l8707n6863n067Q31M317
$$ plain form
15508 78642 58045 57598 70602 54780 65704 103556 170653 147393 142017 91794 38176 93035
15496 93035 111140 102360 82403 117285 146839 154050 198931 157996 135507 162667 151509 85120
15484 85120 110724 118040 102993 57710 103101 115025 142060 175218 163591 139964 191097 127646
15472 127646 86697 74225 73708 77223 52904 80503 122138 131144 131322 98531 97506 144465 171850
15459 171850 149562 92052 61749 45549 81712 108533 72246 33269 19170 44591 87633
15448 87633 126889 180232 198047 214658 209453 173915 155645 158559 96915 76825 130054 187087
15436 187087 128403 100073 94371 133553 127382 92806 138164 188172 146766 163689 207238 257464
15424 257464 231621 164957 185392 220080 238687 230554 215807 172266 104469 130578 134995 108529
$$ packed form
15508G8642k0597m47J3004j5822J0924L7852O7097k3260n376n0223n3618N4859
15496I3035J8105q780j9957L4882K9554P211M4881m0935k2489K7160j1158o6389
15484H5120K5604P316j5047m5283M5391J1924K7035L3158j1627k3627N1133o3451
15472A27646m0949j2472n17L515k4319K7599M1635R006J78l2791j025M6959K7385
15459A71850k2288n7510l0303j6200L6163K6821l6287l8977j4099K5421M3042
15448H7633L9256N3343J7815J6611n205l5538j8270K914o1644k0090N3229N7033
15436A87087n8684k8330n702L9182o171l4576M5358N0008m1406J6923M3549N0226
15424B57464k5843o6664K0435L4688J8607q133j4747m3541o7797K6109M417k6466
$$ plain form
15412 108529 145512 181874 174066 132575 105654 115480 122601 111017 74665 127409 153922 108368
15400 108368 102561 128509 163929 181012 151164 114568 93517 125144 193239 166138 152783 162823
15388 162823 142935 126526 120842 145616 157263 113890 93645 100083 153556 204831 194888 155691
15376 155691 125856 109991 139550 190746 214088 175232 114417 116597 107054 89687 173531 213649
15364 213649 184910 191843 149981 119708 163848 185171 131783 71922 122559 133529 148897 102629
15352 102629 43476 17728 63347 119700 98449 122085 175108 174749 158238 157828 143210 166258
15340 166258 193940 163969 159087 183680 203383 165044 189726 231028 191388 151252 189358 209865
15328 209865 167180 126642 130173 173677 198855 145696 122120 99088 168619 203581 157147 190317
$$ packed form
15412A08529L6983L6362p808m1491k6921R826P121j1584l6352N2744K6513m5554
15400A08368n807K5948L5420J7083k9848l6596k1051L1627O8095k7101j3355J0040
15388A62823j9888j6409n684K4774J1647m3373k0245O438N3473N1275r943l9197
15376A55691k9835j5865K9559N1196K3342l8856o0815K180r543j7367Q3844M0118
15364B13649k8739O933m1862l0273M4140K1323n3388n9861N0637J0970J5368m6268
15352A02629n9153k5748M5619N6353k1251K3636N3023l59j6511m10j4618K3048
15340A66258K7682k9971m882K4593J9703l8339K4682M1302l9640m0136L8106K0507
15328B09865m2685m0538L531M3504K5178n3159k3576k3032O9531L4962m6434L3170
$$ plain form
15316 190317 201770 154765 154927 236402 145949 143618 184527 189950 223223 199809 192062 174478
15304 174478 189398 207663 151571 140520 188679 207008 197372 185958 194699 165039 169922 194137
15292 194137 157932 105097 118989 130390 185877 208533 119260 40553 -15062 16021 84157
15281 84157 122115 115567 127658 113260 137853 136354 101713 96494 99947 117366 125943 118056 105088
15268 105088 107763 133330 113670 139434 143876 136094 142816 168320 150900 160001 191444 220709
15256 220709 195120 138650 166341 140190 169876 205173 204083 178253 165773 204152 201731 219239
15244 219239 181709 139259 141988 151893 140037 117427 140430 130782 116142 133849 161638 174091
15232 174091 177653 183710 172728 150292 87738 101331 100820 149548 215170 186493 153634 115979
$$ packed form
15316A90317J1453m7005J62Q1475r0453k331M0909N423L3273k3414p747j7584
15304A74478J4920J8265n6092j1051M8159J8329r636j1414Q741k9660M883K4215
15292A94137l6205n2835J3892J1401N5487K2656q9273p8707n5615L1083O8136
15281H4157L7958o548J2091j4398K4593j499l4641n219L453J7419Q577p887j2968
15268A05088K675K5567j9660K5764M442p782O722K5504j7420R101L1443K9265
15256B20709k5589n6470K7691k6151K9686L5297j090k5830j2480L8379k421J7508
15244B19239l7530m2450K729R905j1856k2610K3003r648j4640J7707K7789J2453
15232A74091L562O057j0982k2436o2554J3593n11M8728O5622k8677l2859l7655
$$ plain form
15220 115979 159801 168731 141256 182346 187038 140600 145801 149091 147724 153730 176224 200036 226955
15207 226955 218419 202209 194232 209087 227734 205979 169186 111045 115164 141370 148481 143182
15195 143182 197767 172775 161322 191766 230667 301096 314312 213861 185128 207236 203727
15184 203727 162244 127602 168127 154373 166017 166508 153637 124700 160831 175326 154722 152136
15172 152136 125945 111880 112701 142191 189917 193968 166534 155463 165406 167378 177020 149176 183454
15159 183454 174362 121734 73566 126343 175401 215089 201338 176781 187630 180653 191226 157863
15147 157863 130485 115934 156683 117572 115338 73194 54915 116917 166582 181423 193520 166300
15135 166300 154301 185368 187689 185816 206803 198009 195727 209452 197713 129866 156591 156660 197071
$$ packed form
15220A15979M3822Q930k7475M1090M692m6438N201L290j367O006K2494K3812K6919
15207B26955q536j6210p977J4855J8647k1755l6793n8141M119K6206P111n299
15195A43182N4585k4992j1453L0444L8901P0429J3216j00451k8733K2108l509
15184B03727m1483l4642M0525j3754J1644M91j2871k8937L6131J4495k0604k586
15172A52136k6191j4065Q21K9490M7726M051k7434j1071R943J972R642k7844L4278
15159A83454r092n2628m8168N2777M9058L9688j3751k4557J0849o977J0573l3363
15147A57863k7378j4551M0749l9111k234m2144j8279O2002M9665J4841J2097k7220
15135A66300j1999L1067K321j873K0987q794k282J3725j1739o7847K6725O9M0411
$$ plain form
15122 197071 188441 148359 130489 121882 196270 180934 138822 102848 185332 166366 148294 183895
15110 183895 225721 241336 192835 213170 160862 139422 167861 143633 132223 163826 144191
15099 144191 138939 172465 187862 188838 149119 155139 183233 219754 232267 177889 115922 146589
15087 146589 133730 134897 159554 151917 179694 189018 225289 236715 186592 148969 115781 122963
15075 122963 125194 101246 102669 176747 194148 190715 192099 174681 193829 199732 181356 144402
15063 144402 155994 122588 125857 97602 125309 184381 211143 205230 174646 137967 154264 177580
15051 177580 241207 259222 213506 180664 208316 200965 164140 142477 172180 188385 228941 259145
15039 259145 239488 182938 170343 170647 217020 221982 242805 222240 208503 247889 276477 305498
$$ packed form
15122A97071q630m0082j7870q607P4388j5336m2112l5974Q2484j8966j8072L5601
15110A83895M1826J5615m8501K0335n2308k1440K8439k4228j1410L1603j9635
15099A44191n252L3526J5397R76l9719O020K8094L6521J2513n4378o1967L0667
15087A46589j2859J167K4657p637K7777R324L6271J1426n0123l7623l3188P182
15075A22963K231k3948J423P4078J7401l433J384j7418J9148N903j8376l6954
15063A44402J1592l3406L269k8255K7707N9072K6762n913l0584l6679J6297K3316
15051A77580O3627J8015m5716l2842K7652p351l6825k1663K9703J6205M0556L0204
15039B59145j9657n6550j2595L04M6373M962K0823k0565j3737L9386K8588K9021
$$ plain form
15027 305498 311868 286147 266707 231828 213517 219102 244435 241715 239007 195794 170548 183743
15015 183743 154491 231940 229752 204533 182999 184550 211933 177766 133134 143072 203900 217487
15003 217487 212286 229096 228840 203544 208431 188182 146002 162278 154625 107677 54710 95980
14991 95980 153385 216040 171637 145652 138366 179096 199748 172636 166755 195293 167845 126786
14979 126786 113497 145611 175476 247549 305916 231548 147092 120177 104376 130496 173326
14968 173326 208923 260256 273966 272845 250400 254911 259881 241859 271475 309510 269052 223483
14956 223483 246413 225811 186620 145419 177136 215548 245909 266803 265538 228787 251436 276473
14944 276473 280082 264780 239325 199209 177228 139356 140119 172231 207628 211963 214545 221099 184939
$$ packed form
15027C05498O370k5721j9440l4879j8311N585K5333k720k708m3213k5246J3195
15015A83743k9252P7449k188k5219k1534J551K7383l4167m4632R938O0828J3587
15003B17487n201J6810k56k5296M887k0249m2180J6276p653m6948n2967M1270
14991I5980N7405O2655m4403k5985p286M0730K0652k7112n881K8538k7448m1059
14979A26786j3289L2114K9865P2073N8367p4368q4456k6915j5801K6120M2830
14968A73326L5597N1333J3710j121k2445M511M970j8022K9616L8035m0458m5569
14956B23483K2930k0602l9191m1201L1717L8412L0361K0894j265l6751K2649K5037
14944B76473L609j5302k5455m0116k1981l7872P63L2112L5397M335K582O554l6160
$$ plain form
14931 184939 180319 225296 295420 388861 326751 267617 238479 276972 280528 241357 156454 106885
14919 106885 189645 231403 157008 94920 110422 134889 140018 129154 183177 206059 162585 135534
14907 135534 124975 127373 130658 211744 231387 226283 248846 262089 286624 274523 216485 208440
14895 208440 190564 161066 164033 227012 241153 218725 193424 172418 186743 212049 175149 163956
14883 163956 158658 121896 142633 135447 114666 84526 152342 236293 249951 278464 272204 257219
14871 257219 236068 224061 209940 217811 191774 173605 108442 150416 192571 181794 213238 221083
14859 221083 243684 241531 223433 215272 208423 192562 168975 180499 221298 206999 177126 204450
14847 204450 228369 203619 192928 239446 259485 257080 301732 322600 318110 324070 299754 262079
$$ packed form
14931A84939m620M4977P0124R3441o2110n9134k9138L8493L556l9171q4903m9569
14919A06885Q2760M1758p4395o2088J5502K4467N129j0864N4023K2882m3474k7051
14907A35534j0559K398L285Q1086J9643n104K2563J3243K4535j2101n8038q045
14895B08440j7876k9498K967O2979J4141k2428k5301k1006J4325K5306l6900j1193
14883A63956n298l6762K0737p186k0781l0140O7816Q3951J3658K8513o260j4985
14871B57219k1151j2007j4121P871k6037j8169o5163M1974M2155j0777L1444P845
14859B21083K2601k153j8098q161o849j5861k3587J1524M0799j4299k9873K7324
14847B04450K3919k4750j0691M6518K0039k405M4652K0868m490N960k4316l7675
$$ plain form
14835 262079 264829 284019 269452 272100 280774 246775 238985 249712 213715 238096 251507 237447
14823 237447 302895 307541 310479 319330 337545 294828 222307 256662 295796 289048 230895 148311
14811 148311 164543 193589 195245 249170 296361 252105 211169 212568 206730 247748 292165 308550
14799 308550 275413 271877 269613 294505 311482 323817 252804 225986 270790 281210 256499 294474
14787 294474 330148 320333 275426 226046 225543 268262 310458 317526 281381 252231 268985 293040
14775 293040 343963 338433 288330 291176 270919 255661 255935 293285 311171 282515 240556 276791
14763 276791 257447 272679 328296 321651 323993 308661 286459 257087 258369 236037 191462 174095
14751 174095 205218 200177 160023 149088 117992 102115 130588 221950 252415 205527 235924 252142
$$ packed form
14835B62079K750J9190j4567K648Q674l3999p790J0727l5997K4381J3411j4060
14823B37447O5448M646K938Q851J8215m2717p2521L4355L9134o748n8153q2584
14811A48311J6232K9046J656N3925M7191m4256m0936J399n838M1018M4417J6385
14799C08550l3137l536k264K4892J6977J2335p1013k6818M4804J0420k4711L7975
14787B94474L5674r815m4907m9380n03M2719M2196P068l6145k9150J6754K4055
14775B93040N0923n530n0103K846k0257j5258K74L7350J7886k8656m1959L6235
14763B76791j9344J5232N5617o645K342j5332k2202k9372J282k2332m4575j7367
14751A74095L1123n041m0154j0935l1096j5877K8473R1362L0465m6888L0397J6218
$$ plain form
14739 252142 264249 189750 186887 214955 271311 284702 256388 270099 253536 263755 239581 227455
14727 227455 266992 245167 227412 295412 291442 269098 284623 297278 287883 286814 299716 309283
14715 309283 309064 317066 284081 270724 248070 226317 241099 277049 248690 224048 177482 210309
14703 210309 244743 267479 250019 252311 239173 245240 209530 233600 252523 228483 203603 239825
14691 239825 279804 288079 272069 267894 254366 223714 220151 270607 251529 288512 234655 122230
14679 122230 141492 188913 224572 293323 318069 310897 259495 301329 292869 212869 208898 211185
14667 211185 222027 209242 218449 271128 318417 326627 291105 287091 348035 380303 301713 321467
14655 321467 328819 350311 359297 340060 361853 329991 255375 208758 189925 226187 246372 280260
$$ packed form
14739B52142J2107p4499k863K8068N6356J3391k8314J3711j6563J0219k4174j2126
14727B27455L9537k1825j7755O8000l970k2344J5525J2655r395j069J2902R567
14715C09283k19Q002l2985j3357k2654k1753J4782L5950k8359k4642m6566L2827
14703B10309L4434K2736j7460K292j3138O067l5710K4070J8923k4040k4880L6222
14691B39825L9979Q275j6010m175j3528l0652l563N0456j9078L6983n3857j12425
14679A22230J9262M7421L5659O8751K4746p172n1402M1834q460q0000l971K287
14667B11185J0842j2785R207N2679M7289Q210l5522m014O0944L2268p8590J9754
14655C21467P352K1492Q986j9237K1793l1862p4616m6617j8833L6262K0185L3888
$$ plain form
14643 280260 277154 282057 304975 295739 263726 263501 233903 247017 253040 236896 230905 239350 238857
14630 238857 247241 294340 285990 297258 324044 326464 306486 286938 251823 275541 298741 256944
14618 256944 311287 319100 300649 293995 302213 278585 232556 173820 215046 223613 194548 148115
14606 148115 147274 179066 189601 176694 246306 260082 260801 282007 283818 275931 239251 248717 277245
14593 277245 248614 224199 219814 250516 275950 260116 300043 291101 270752 247474 237275 254681
14581 254681 251231 298213 329273 377981 393093 383441 367670 339915 291239 262619 295083 302006
14569 302006 276868 262827 213087 203547 235496 258404 286447 316831 269153 295188 358364 348711
14557 348711 296696 271252 227151 182391 188268 228536 258755 227112 214712 225863 279570 326000
$$ packed form
14643B80260l106M903K2918r236l2013k25k9598J3114O023j6144n991Q445m93
14630B38857Q384M7099q350J1268K6786K420j9978j9548l5115K3718K3200m1797
14618B56944N4343P813j8451o654Q218k3628m6029n8736M1226Q567k9065m6433
14606A48115q41L1792J0535j2907O9612J3776P19K1206J811p887l6680R466K8528
14593B77245k8631k4415m385L0702K5434j5834L9927q942k0349k3278j0199J7406
14581B54681l450M6982L1060M8708J5112r652j5771k7755m8676k8620L2464O923
14569C02006k5138j4041m9740r540L1949K2908K8043L0384m7678K6035O3176r653
14557C48711n2015k5444m4101m4760N877M0268L0219l1643j2400J1151N3707M6430
$$ plain form
14545 326000 327104 332710 321161 353152 353889 299722 283643 222576 229913 280555 271330 238083 213401
14532 213401 172491 158208 176183 186611 249180 311339 338038 325047 243118 222221 253528
14521 253528 297768 255612 258225 288952 294614 265699 278620 292852 239603 237391 259771 274258
14509 274258 281978 284176 286331 278711 259467 280969 285509 297793 244994 226762 237033 263459
14497 263459 280216 255493 192474 197122 209203 210439 201542 217710 243987 244456 227425 230728 219663
14484 219663 215777 253919 299212 308116 326191 344591 327925 234863 210954 217858 289676 326377
14472 326377 317499 299930 284276 275892 301541 264168 296342 292976 284397 281936 311303 353189
14460 353189 357846 377215 333222 332519 299750 294190 264527 214379 287557 338629 367612 346050
$$ packed form
14545C26000J104N606j1549L1991P37n4167j6079o1067P337N0642r225l3247k4682
14532B13401m0910j4283J7975J0428O2569O2159K6699j2991q1929k0897L1307
14521B53528M4240m2156K613L0727N662k8915J2921J4232n3249k212K2380J4487
14509B74258P720K198K155p620j9244K1502M540J2284n2799j8232J0271K6426
14497B63459J6757k4723o3019M648J2081J236q897J6168K6277M69j7031L303j1065
14484B19663l886L8142M5293Q904J8075J8400j6666r3062k3909O904P1818L6701
14472C26377q878j7569j5654q384K5649l7373L2174l366q579k461K9367M1886
14460C53189M657J9369m3993p03l2769n560k9663n0148P3178N1072K8983k1562
$$ plain form
14448 346050 291001 289138 255036 210889 218178 248401 296793 282780 238493 274834 335543 293720
14436 293720 295912 389031 384769 349162 352540 354957 340587 338823 305958 314891 311134 342834 329777
14423 329777 313160 323586 313344 315320 276353 252403 266494 264462 253436 258735 258247 323601
14411 323601 341052 325854 302037 293678 266974 341233 367180 272028 205432 194990 248270 301688
14399 301688 303028 303588 300497 295348 292083 339705 347500 300617 265916 310618 388609 404075 405888
14386 405888 376653 325798 344570 275427 261771 258402 240132 211595 219947 245862 270048 218890
14374 218890 194054 216924 294276 363332 317154 310794 296479 311537 315395 358071 366999 319597
14362 319597 323266 338760 370225 401603 405401 369336 313997 289944 301370 319129 291693 300145
$$ packed form
14448C46050n5049j863l4102m4147P289L0223M8392j4013m4287L6341O0709m1823
14436B93720K192R3119m262l5607L378K417j4370j764l2865Q933l757L1700j3057
14423C29777j6617J0426j0242J976l8967k3950J4091k032j1026N299m88O5354
14411C23601J7451j5198k3817q359k6704P4259K5947r5152o6596j0442N3280N3418
14399C01688J340N60l091n149l265M7622P795m6883l4701M4702P7991J5466J813
14386D05888k9235n0855J8772o9143j3656l369j8270k8537Q352K5915K4186n1158
14374B18890k4836K2870P7352O9056m6178o360j4315J5058L858M2676Q928m7402
14362C19597L669J5494L1465L1378L798l6065n5339k4053J1426J7759k7436Q452
$$ plain form
14350 300145 289787 287370 301470 305611 318328 287587 281621 280708 289049 273473 278735 270988 294573
14337 294573 307613 316531 282673 224147 260072 294979 335081 364076 400509 421855 388718 278645
14325 278645 262815 333788 341482 302296 281654 324350 353688 351760 365005 397745 436242 419397
14313 419397 413649 431000 416569 416729 416842 380846 305249 242077 267485 336616 293338 233780
14301 233780 259116 287472 309682 348510 304342 325534 333892 309610 291722 230667 174383 215820
14289 215820 211484 241120 270228 263002 250370 271124 270050 316502 281603 290063 283465 252997
14277 252997 224767 259481 258628 242383 241660 261849 316539 325797 297030 265098 273228 299516 361627
14264 361627 365006 329294 332826 323091 265673 277063 293339 313765 318408 332501 333698 312955
$$ packed form
14350C00145j0358k417J4100M141J2717l0741n966r13Q341j5576N262p747K3585
14337B94573J3040Q918l3858n8526L5925L4907M0102K8995L6433K1346l3137j10073
14325B78645j5830P0973P694l9186k0642M2696K9338j928J3245L2740L8497j6845
14313D19397n748J7351j4431J60J13l5996p5597o3172K5408O9131m3278n9558
14301B33780K5336K8356K2210L8828m4168K1192Q358k4282j7888o1055n6284M1437
14289B15820m336K9636K9108p226j2632K0754j074M6452l4899Q460o598l0468
14277B52997k8230L4714q53j6245p23K0189N4690R258k8767l1932Q130K6288O2111
14264C61627L379l5712L532r735n7418J1390J6276K0426M643J4093J197k0743
$$ plain form
14252 312955 286371 286196 315164 357228 358627 328613 274551 281628 333706 351503 282228 280084
14240 280084 284580 324954 356976 349344 318862 297783 287416 317368 338502 305601 274329 274664
14228 274664 265030 278471 345061 389144 359703 319455 306139 322173 346523 297510 260498 286510
14216 286510 320100 314704 307001 294748 276514 266125 299619 294703 298448 287608 304237 336702
14204 336702 346396 368751 401397 366530 334307 327306 348953 375175 401700 388404 368479 379636
14192 379636 361446 291855 254014 274578 314631 264586 207802 176866 187684 185853 253185 270349
14180 270349 250188 232663 248658 265489 249424 195559 159863 243757 297152 336327 365484
14169 365484 375804 362181 329620 332416 358636 371523 329203 305302 294720 323889 379100 369075
$$ packed form
14252C12955k6584j75K8968M2064J399l0014n4062P077N2078J7797o9275k144
14240B80084M496M0374L2022p632l0482k1079j0367K9952K1134l2901l1272L35
14228B74664r634J3441O6590M4083k9441m0248j3316J6034K4350m9013l7012K6012
14216B86510L3590n396p703j2253j8234j0389L3494m916L745j0840J6629L2465
14204C36702R694K2355L2646l4867l2223p001K1647K6222K6525j3296j9925J1157
14192C79636j8190o9591l7841K0564M0053n0045n6784l0936J0818j831O7332J7164
14180B70349k0161j7525J5995J6831j6065n3865l5696Q3894N3395L9175K9157
14169C65484J0320j3623l2561K796K6220J2887m2320k3901j0582K9169N5211j0025
$$ plain form
14157 369075 331704 308773 294451 270449 281976 258888 242486 251012 286268 285600 252638 273906
14145 273906 319988 403835 443740 440249 385136 378605 364884 367281 374030 334760 299503 273138
14133 273138 291655 285813 342108 315445 326500 317516 330315 320095 286774 288903 274772 298910
14121 298910 271542 198307 238056 271533 285656 243338 252377 269850 331024 321100 322965 315880
14109 315880 308331 334221 311420 288277 307830 294742 259928 264501 317176 337651 323469 296196
14097 296196 303395 330075 291133 252760 262539 295658 320551 339173 345462 353134 328152 322613
14085 322613 248837 191472 217524 234521 214987 236171 220865 214434 201068 198853 183060 219479
14073 219479 277609 316947 303200 286823 283450 283735 227771 179377 243824 301666 326581 272968
$$ packed form
14157C69075l7371k2931j4322k4002J1527k3088j6402Q526L5256o68l2962K1268
14145B73906M6082Q3847L9905l491n5113o531j3721K397O749l9270l5257k6365
14133B73138J8517n842N6295k6663J1055q984J2799j0220l3321K129j4131K4138
14121B98910k7368p3235L9749L3477J4123m2318R039J7473O1174r924J865p085
14109C15880p549K5890k2801k3143J9553j3088l4814M573N2675K0475j4182k7273
14097B96196P199K6680l8942l8373R779L3119K4893J8622O289P672k4982n539
14085C22613p3776n7365K6052J6997j9534K1184j5306o431j3366k215j5793L6419
14073B19479N8130L9338j3747j6377l373K85n5964m8394O4447N7842K4915n3613
$$ plain form
14061 272968 201671 175023 196371 199880 177937 233174 249889 232714 229796 229379 249984 303571
14049 303571 348128 286096 245439 230831 212398 216317 260412 279803 296277 358632 429413 445466
14037 445466 489266 477516 486732 472000 432369 460914 474768 403956 329256 376094 403158 400587
14025 400587 398113 357671 321324 349659 313789 322602 345703 325764 292477 257455 298807 308788
14013 308788 289948 267273 250329 244888 184894 180825 229444 288874 275232 268027 273717 314134
14001 314134 305276 270893 236957 218422 237388 329682 330418 321353 317951 270697 278814 306724 308251
13988 308251 278770 216637 223700 247094 257162 300892 307222 312961 303563 235548 237382 248937
13976 248937 236431 278652 230343 186933 228407 236858 261882 272920 257036 314216 365498 268194
$$ packed form
14061B72968p1297k6648K1348L509k1943N5237J6715j7175k918m17K0605N3587
14049C03571M4557o2032m0657j4608j8433L919M4095J9391J6474O2355P0781J6053
14037D45466M3800j1750R216j4732l9631K8545J3854p0812p4700M6838K7064k571
14025D00587k474m0442l6347K8335l5870Q813K3101j9939l3287l5022M1352R981
14013C08788j8840k2675j6944n441n9994m069M8619N9430j3642p205N690M0417
14001C14134q858l4383l3936j8535J8966R2294P36r065l402m7254Q117K7910J527
13988C08251k9481o2133P063K3394J0068M3730O330N739r398o8015J834J1555
13976B48937j2506M2221m8309m3410M1474Q451K5024J1038j5884N7180N1282r7304
$$ plain form
13964 268194 213000 245674 271143 226177 207739 202839 192698 202487 226474 240954 255032 244256
13952 244256 150915 144020 163553 150218 130368 116932 101610 147669 181272 174569 156729 146366
13940 146366 165511 119701 105888 85777 94178 96938 79146 65735 53344 66175 87081 39980
13928 39980 72066 101265 107175 94423 62557 1100 -5035 41996 17531 -32906 -65908 -27028
13916 -27028 -35668 19578 50219 24980 66153 131014 348980 946046 2028806 3641314 5348795
13905 5348795 6015068 5502491 4590696 3727467 3068428 2620076 2268165 1966850 1729166
13896 1729166 1566551 1412011 1293133 1191938 1126658 1032815 983603 963068 928107 901728
13886 901728 909791 848420 797142 806048 758844 757233 761034 819502 823341 781321 743125 747725 767515
$$ packed form
13964B68194n5194L2674K5469m4966j8438m900j0141R789K3987J4480J4078j0776
13952B44256r3341o895J9533j3335j9850j3436j5322M6059L3603o703j7840j0363
13940A46366J9145m5810j3813k0111Q401K760j7792j3411j2391J2831K0906m7101
13928C9980L2086K9199N910j2752l1866o1457o135M7031k4465n0437l3002L8880
13916b7028q640N5246L0641k5239M1173O4861K17966N97066J082760J612508J707481
13905E348795O66273n12577r11795q63229o59039m48352l51911l01315k37684
13896A729166j62615j54540j18878j01195o5280r3843m9212k0535l4961k6379
13886I01728Q063o1371n1278Q906m7204j611L801N8468L839m2020l8196M600J9790
$$ plain form
13873 767515 778366 740949 685050 662947 611274 575363 599889 553181 540681 567672 556608
13862 556608 540041 529264 521992 513133 512543 564444 569349 559358 565858 536107 475404 442875 475244
13849 475244 530677 521556 536725 533105 542619 489661 453830 406884 389816 379396 387506 398322
13837 398322 413500 469142 485314 515706 479634 493066 534692 543403 524323 520043 452596 404816
13825 404816 453112 437806 417532 404623 356758 358817 336881 325030 347150 345645 342646 363568
13813 363568 462089 486652 464597 394166 388494 394041 425371 399717 389205 391967 384352 361071
13801 361071 381262 490856 655470 801481 843434 809794 729075 680422 660021 611289 623516
13790 623516 585903 502997 494018 473494 523966 520987 476100 470034 463469 457678 436022 402749
$$ packed form
13873G67515J0851l7417n5899k2103n1673l5911K4526m6708j2500K6991j1064
13862E56608j6567j0777p272q859n90N1901M905r991O500k9751o0703l2529L2369
13849D75244N5433r121J5169l620R514n2958l5831m6946j7068j0420Q110J0816
13837C98322J5178N5642J6172L0392l6072J3432M1626Q711j9080m280o7447m7780
13825D04816M8296j5306k0274j2909m7865K059k1936j1851K2120j505k999K0922
13813C63568R8521K4563k2055p0431n672N547L1330k5654j0512K762p615k3281
13801C61071K0191J09594J64614J46011M1953l3640q0719m8653k0401m8732J2227
13790F23516l7613q2906q979k0524N0472k979m4887o066o565n791k1656l3273
$$ plain form
13778 402749 421252 460544 432948 432911 440353 447929 476809 418664 427522 440340 418795 384383 429344
13765 429344 561163 617531 657573 683320 686576 679690 681489 657467 570913 488373 436000 460697
13753 460697 447072 426841 428858 388554 326992 384323 430590 458339 431517 392592 368637 364597
13741 364597 414484 461426 433389 466902 513493 508974 470832 486771 494070 473282 422026 336342
13729 336342 367547 368651 417317 364789 349460 338518 401184 391879 306923 295353 297678 278498
13717 278498 258074 274834 284357 306068 331668 324284 375195 356688 313842 326347 359943 365632
13705 365632 350594 361624 344514 344614 357929 391184 420378 442236 479097 459061 432579 449805
$$ packed form
13778D02749J8503L9292k7596l7P442P576K8880n8145Q858J2818k1545l4412M4961
13765D29344J31819N6368M0042K5747L256o886J799k4022q6554q2540n2373K4697
13753D60697j3625k0231K017m0304o1562N7331M6267K7749k6822l8925k3955m040
13741C64597M9887M6942k8037L3513M6591m519l8142J5939P299k0788n1256q5684
13729C36342L1205J104M8666n2528j5329j0942O2666r305q4956j1570K325j9180
13717B78498k0424J6760R523K1711K5600p384N0911j8507m2846J2505L3596N689
13705C65632j5038J1030j7110J00J3315L3255K9194K1858L6861k0036k6482J7226
$$ [...]
##END NTUPLES=NMR SPECTRUM
##END=
